%TF.GenerationSoftware,KiCad,Pcbnew,7.0.10*%
%TF.CreationDate,2024-05-27T17:30:17+03:00*%
%TF.ProjectId,hall-hat,68616c6c-2d68-4617-942e-6b696361645f,rev?*%
%TF.SameCoordinates,Original*%
%TF.FileFunction,Legend,Top*%
%TF.FilePolarity,Positive*%
%FSLAX46Y46*%
G04 Gerber Fmt 4.6, Leading zero omitted, Abs format (unit mm)*
G04 Created by KiCad (PCBNEW 7.0.10) date 2024-05-27 17:30:17*
%MOMM*%
%LPD*%
G01*
G04 APERTURE LIST*
%ADD10C,0.125000*%
%ADD11C,0.300000*%
G04 APERTURE END LIST*
D10*
X135424521Y-110627357D02*
X135424521Y-109727357D01*
X135424521Y-110155928D02*
X135938807Y-110155928D01*
X135938807Y-110627357D02*
X135938807Y-109727357D01*
X136753093Y-110627357D02*
X136753093Y-110155928D01*
X136753093Y-110155928D02*
X136710235Y-110070214D01*
X136710235Y-110070214D02*
X136624521Y-110027357D01*
X136624521Y-110027357D02*
X136453093Y-110027357D01*
X136453093Y-110027357D02*
X136367378Y-110070214D01*
X136753093Y-110584500D02*
X136667378Y-110627357D01*
X136667378Y-110627357D02*
X136453093Y-110627357D01*
X136453093Y-110627357D02*
X136367378Y-110584500D01*
X136367378Y-110584500D02*
X136324521Y-110498785D01*
X136324521Y-110498785D02*
X136324521Y-110413071D01*
X136324521Y-110413071D02*
X136367378Y-110327357D01*
X136367378Y-110327357D02*
X136453093Y-110284500D01*
X136453093Y-110284500D02*
X136667378Y-110284500D01*
X136667378Y-110284500D02*
X136753093Y-110241642D01*
X137310236Y-110627357D02*
X137224521Y-110584500D01*
X137224521Y-110584500D02*
X137181664Y-110498785D01*
X137181664Y-110498785D02*
X137181664Y-109727357D01*
X137781665Y-110627357D02*
X137695950Y-110584500D01*
X137695950Y-110584500D02*
X137653093Y-110498785D01*
X137653093Y-110498785D02*
X137653093Y-109727357D01*
X138810236Y-110627357D02*
X138810236Y-109727357D01*
X138810236Y-110155928D02*
X139324522Y-110155928D01*
X139324522Y-110627357D02*
X139324522Y-109727357D01*
X139710236Y-110370214D02*
X140138808Y-110370214D01*
X139624522Y-110627357D02*
X139924522Y-109727357D01*
X139924522Y-109727357D02*
X140224522Y-110627357D01*
X140395951Y-109727357D02*
X140910237Y-109727357D01*
X140653094Y-110627357D02*
X140653094Y-109727357D01*
X141895950Y-110627357D02*
X141895950Y-109727357D01*
X141895950Y-109727357D02*
X142238807Y-109727357D01*
X142238807Y-109727357D02*
X142324522Y-109770214D01*
X142324522Y-109770214D02*
X142367379Y-109813071D01*
X142367379Y-109813071D02*
X142410236Y-109898785D01*
X142410236Y-109898785D02*
X142410236Y-110027357D01*
X142410236Y-110027357D02*
X142367379Y-110113071D01*
X142367379Y-110113071D02*
X142324522Y-110155928D01*
X142324522Y-110155928D02*
X142238807Y-110198785D01*
X142238807Y-110198785D02*
X141895950Y-110198785D01*
X143310236Y-110541642D02*
X143267379Y-110584500D01*
X143267379Y-110584500D02*
X143138807Y-110627357D01*
X143138807Y-110627357D02*
X143053093Y-110627357D01*
X143053093Y-110627357D02*
X142924522Y-110584500D01*
X142924522Y-110584500D02*
X142838807Y-110498785D01*
X142838807Y-110498785D02*
X142795950Y-110413071D01*
X142795950Y-110413071D02*
X142753093Y-110241642D01*
X142753093Y-110241642D02*
X142753093Y-110113071D01*
X142753093Y-110113071D02*
X142795950Y-109941642D01*
X142795950Y-109941642D02*
X142838807Y-109855928D01*
X142838807Y-109855928D02*
X142924522Y-109770214D01*
X142924522Y-109770214D02*
X143053093Y-109727357D01*
X143053093Y-109727357D02*
X143138807Y-109727357D01*
X143138807Y-109727357D02*
X143267379Y-109770214D01*
X143267379Y-109770214D02*
X143310236Y-109813071D01*
X143995950Y-110155928D02*
X144124522Y-110198785D01*
X144124522Y-110198785D02*
X144167379Y-110241642D01*
X144167379Y-110241642D02*
X144210236Y-110327357D01*
X144210236Y-110327357D02*
X144210236Y-110455928D01*
X144210236Y-110455928D02*
X144167379Y-110541642D01*
X144167379Y-110541642D02*
X144124522Y-110584500D01*
X144124522Y-110584500D02*
X144038807Y-110627357D01*
X144038807Y-110627357D02*
X143695950Y-110627357D01*
X143695950Y-110627357D02*
X143695950Y-109727357D01*
X143695950Y-109727357D02*
X143995950Y-109727357D01*
X143995950Y-109727357D02*
X144081665Y-109770214D01*
X144081665Y-109770214D02*
X144124522Y-109813071D01*
X144124522Y-109813071D02*
X144167379Y-109898785D01*
X144167379Y-109898785D02*
X144167379Y-109984500D01*
X144167379Y-109984500D02*
X144124522Y-110070214D01*
X144124522Y-110070214D02*
X144081665Y-110113071D01*
X144081665Y-110113071D02*
X143995950Y-110155928D01*
X143995950Y-110155928D02*
X143695950Y-110155928D01*
X145281664Y-110627357D02*
X145281664Y-109727357D01*
X145281664Y-109727357D02*
X145795950Y-110627357D01*
X145795950Y-110627357D02*
X145795950Y-109727357D01*
X146095950Y-109727357D02*
X146610236Y-109727357D01*
X146353093Y-110627357D02*
X146353093Y-109727357D01*
X146910235Y-109727357D02*
X146910235Y-110455928D01*
X146910235Y-110455928D02*
X146953092Y-110541642D01*
X146953092Y-110541642D02*
X146995950Y-110584500D01*
X146995950Y-110584500D02*
X147081664Y-110627357D01*
X147081664Y-110627357D02*
X147253092Y-110627357D01*
X147253092Y-110627357D02*
X147338807Y-110584500D01*
X147338807Y-110584500D02*
X147381664Y-110541642D01*
X147381664Y-110541642D02*
X147424521Y-110455928D01*
X147424521Y-110455928D02*
X147424521Y-109727357D01*
X147810235Y-110370214D02*
X148238807Y-110370214D01*
X147724521Y-110627357D02*
X148024521Y-109727357D01*
X148024521Y-109727357D02*
X148324521Y-110627357D01*
D11*
X134706225Y-88978828D02*
X135563368Y-88978828D01*
X135134796Y-90478828D02*
X135134796Y-88978828D01*
X136063367Y-90478828D02*
X136063367Y-88978828D01*
X136063367Y-89693114D02*
X136920510Y-89693114D01*
X136920510Y-90478828D02*
X136920510Y-88978828D01*
X137634796Y-90478828D02*
X137634796Y-88978828D01*
X138277654Y-90407400D02*
X138491940Y-90478828D01*
X138491940Y-90478828D02*
X138849082Y-90478828D01*
X138849082Y-90478828D02*
X138991940Y-90407400D01*
X138991940Y-90407400D02*
X139063368Y-90335971D01*
X139063368Y-90335971D02*
X139134797Y-90193114D01*
X139134797Y-90193114D02*
X139134797Y-90050257D01*
X139134797Y-90050257D02*
X139063368Y-89907400D01*
X139063368Y-89907400D02*
X138991940Y-89835971D01*
X138991940Y-89835971D02*
X138849082Y-89764542D01*
X138849082Y-89764542D02*
X138563368Y-89693114D01*
X138563368Y-89693114D02*
X138420511Y-89621685D01*
X138420511Y-89621685D02*
X138349082Y-89550257D01*
X138349082Y-89550257D02*
X138277654Y-89407400D01*
X138277654Y-89407400D02*
X138277654Y-89264542D01*
X138277654Y-89264542D02*
X138349082Y-89121685D01*
X138349082Y-89121685D02*
X138420511Y-89050257D01*
X138420511Y-89050257D02*
X138563368Y-88978828D01*
X138563368Y-88978828D02*
X138920511Y-88978828D01*
X138920511Y-88978828D02*
X139134797Y-89050257D01*
X140849082Y-90407400D02*
X141063368Y-90478828D01*
X141063368Y-90478828D02*
X141420510Y-90478828D01*
X141420510Y-90478828D02*
X141563368Y-90407400D01*
X141563368Y-90407400D02*
X141634796Y-90335971D01*
X141634796Y-90335971D02*
X141706225Y-90193114D01*
X141706225Y-90193114D02*
X141706225Y-90050257D01*
X141706225Y-90050257D02*
X141634796Y-89907400D01*
X141634796Y-89907400D02*
X141563368Y-89835971D01*
X141563368Y-89835971D02*
X141420510Y-89764542D01*
X141420510Y-89764542D02*
X141134796Y-89693114D01*
X141134796Y-89693114D02*
X140991939Y-89621685D01*
X140991939Y-89621685D02*
X140920510Y-89550257D01*
X140920510Y-89550257D02*
X140849082Y-89407400D01*
X140849082Y-89407400D02*
X140849082Y-89264542D01*
X140849082Y-89264542D02*
X140920510Y-89121685D01*
X140920510Y-89121685D02*
X140991939Y-89050257D01*
X140991939Y-89050257D02*
X141134796Y-88978828D01*
X141134796Y-88978828D02*
X141491939Y-88978828D01*
X141491939Y-88978828D02*
X141706225Y-89050257D01*
X142349081Y-90478828D02*
X142349081Y-88978828D01*
X143063367Y-90478828D02*
X143063367Y-88978828D01*
X143063367Y-88978828D02*
X143420510Y-88978828D01*
X143420510Y-88978828D02*
X143634796Y-89050257D01*
X143634796Y-89050257D02*
X143777653Y-89193114D01*
X143777653Y-89193114D02*
X143849082Y-89335971D01*
X143849082Y-89335971D02*
X143920510Y-89621685D01*
X143920510Y-89621685D02*
X143920510Y-89835971D01*
X143920510Y-89835971D02*
X143849082Y-90121685D01*
X143849082Y-90121685D02*
X143777653Y-90264542D01*
X143777653Y-90264542D02*
X143634796Y-90407400D01*
X143634796Y-90407400D02*
X143420510Y-90478828D01*
X143420510Y-90478828D02*
X143063367Y-90478828D01*
X144563367Y-89693114D02*
X145063367Y-89693114D01*
X145277653Y-90478828D02*
X144563367Y-90478828D01*
X144563367Y-90478828D02*
X144563367Y-88978828D01*
X144563367Y-88978828D02*
X145277653Y-88978828D01*
X147063367Y-88978828D02*
X147063367Y-90193114D01*
X147063367Y-90193114D02*
X147134796Y-90335971D01*
X147134796Y-90335971D02*
X147206225Y-90407400D01*
X147206225Y-90407400D02*
X147349082Y-90478828D01*
X147349082Y-90478828D02*
X147634796Y-90478828D01*
X147634796Y-90478828D02*
X147777653Y-90407400D01*
X147777653Y-90407400D02*
X147849082Y-90335971D01*
X147849082Y-90335971D02*
X147920510Y-90193114D01*
X147920510Y-90193114D02*
X147920510Y-88978828D01*
X148634796Y-90478828D02*
X148634796Y-88978828D01*
X148634796Y-88978828D02*
X149206225Y-88978828D01*
X149206225Y-88978828D02*
X149349082Y-89050257D01*
X149349082Y-89050257D02*
X149420511Y-89121685D01*
X149420511Y-89121685D02*
X149491939Y-89264542D01*
X149491939Y-89264542D02*
X149491939Y-89478828D01*
X149491939Y-89478828D02*
X149420511Y-89621685D01*
X149420511Y-89621685D02*
X149349082Y-89693114D01*
X149349082Y-89693114D02*
X149206225Y-89764542D01*
X149206225Y-89764542D02*
X148634796Y-89764542D01*
M02*
