M48
; DRILL file {KiCad 8.0.6} date 2024-11-28T15:46:47+0100
; FORMAT={-:-/ absolute / inch / decimal}
; #@! TF.CreationDate,2024-11-28T15:46:47+01:00
; #@! TF.GenerationSoftware,Kicad,Pcbnew,8.0.6
; #@! TF.FileFunction,Plated,1,2,PTH
FMAT,2
INCH
; #@! TA.AperFunction,Plated,PTH,ComponentDrill
T1C0.0276
; #@! TA.AperFunction,Plated,PTH,ComponentDrill
T2C0.0374
%
G90
G05
T1
X5.6309Y-3.685
X5.6309Y-3.735
X5.6309Y-3.785
X5.6309Y-3.835
X5.8146Y-3.937
X5.8252Y-3.5827
X5.8646Y-3.937
X5.8752Y-3.5827
X5.9146Y-3.937
X5.9252Y-3.5827
X5.9646Y-3.937
X5.9752Y-3.5827
T2
X5.6331Y-3.33
X5.7316Y-3.33
X5.83Y-3.33
X5.9284Y-3.33
X6.0269Y-3.33
M30
