%TF.GenerationSoftware,KiCad,Pcbnew,8.0.7*%
%TF.CreationDate,2025-02-12T15:07:09+01:00*%
%TF.ProjectId,bme280adafruit,626d6532-3830-4616-9461-66727569742e,rev?*%
%TF.SameCoordinates,Original*%
%TF.FileFunction,Profile,NP*%
%FSLAX46Y46*%
G04 Gerber Fmt 4.6, Leading zero omitted, Abs format (unit mm)*
G04 Created by KiCad (PCBNEW 8.0.7) date 2025-02-12 15:07:09*
%MOMM*%
%LPD*%
G01*
G04 APERTURE LIST*
%TA.AperFunction,Profile*%
%ADD10C,0.100000*%
%TD*%
G04 APERTURE END LIST*
D10*
X198629370Y-70484030D02*
G75*
G02*
X201629370Y-73484030I30J-2999970D01*
G01*
X137000029Y-73500030D02*
X136952029Y-92844030D01*
X201629370Y-73484030D02*
X201581370Y-92828030D01*
X139952029Y-95844030D02*
X198581370Y-95828030D01*
X139952029Y-95844030D02*
G75*
G02*
X136952070Y-92844030I71J3000030D01*
G01*
X201581370Y-92828030D02*
G75*
G02*
X198581370Y-95827970I-2999970J30D01*
G01*
X137000029Y-73500030D02*
G75*
G02*
X140000029Y-70500029I2999971J30D01*
G01*
X198629370Y-70484030D02*
X140000029Y-70500030D01*
M02*
