
(footprint MODULE_2717 (layer F.Cu) (tedit 65DDC535)
  (descr "")
  (fp_text reference REF** (at -5.715 -16.51 0) (layer F.SilkS)
    (effects (font (size 1.0 1.0) (thickness 0.15)))
  )
  (fp_text value MODULE_2717 (at -1.905 16.51 0) (layer F.Fab)
    (effects (font (size 1.0 1.0) (thickness 0.15)))
  )
  (pad 1 thru_hole rect (at -7.62 -13.97) (size 1.508 1.508) (drill 1.0) (layers *.Cu *.Mask) (solder_mask_margin 0.102))
  (pad 2 thru_hole circle (at -7.62 -11.43) (size 1.508 1.508) (drill 1.0) (layers *.Cu *.Mask) (solder_mask_margin 0.102))
  (pad 3 thru_hole circle (at -7.62 -8.89) (size 1.508 1.508) (drill 1.0) (layers *.Cu *.Mask) (solder_mask_margin 0.102))
  (pad 4 thru_hole circle (at -7.62 -6.35) (size 1.508 1.508) (drill 1.0) (layers *.Cu *.Mask) (solder_mask_margin 0.102))
  (pad 5 thru_hole circle (at -7.62 -3.81) (size 1.508 1.508) (drill 1.0) (layers *.Cu *.Mask) (solder_mask_margin 0.102))
  (pad 6 thru_hole circle (at -7.62 -1.27) (size 1.508 1.508) (drill 1.0) (layers *.Cu *.Mask) (solder_mask_margin 0.102))
  (pad 7 thru_hole circle (at -7.62 1.27) (size 1.508 1.508) (drill 1.0) (layers *.Cu *.Mask) (solder_mask_margin 0.102))
  (pad 8 thru_hole circle (at -7.62 3.81) (size 1.508 1.508) (drill 1.0) (layers *.Cu *.Mask) (solder_mask_margin 0.102))
  (pad 9 thru_hole circle (at -7.62 6.35) (size 1.508 1.508) (drill 1.0) (layers *.Cu *.Mask) (solder_mask_margin 0.102))
  (pad 10 thru_hole circle (at -7.62 8.89) (size 1.508 1.508) (drill 1.0) (layers *.Cu *.Mask) (solder_mask_margin 0.102))
  (pad 11 thru_hole circle (at -7.62 11.43) (size 1.508 1.508) (drill 1.0) (layers *.Cu *.Mask) (solder_mask_margin 0.102))
  (pad 12 thru_hole circle (at -7.62 13.97) (size 1.508 1.508) (drill 1.0) (layers *.Cu *.Mask) (solder_mask_margin 0.102))
  (pad 13 thru_hole circle (at 7.62 13.97) (size 1.508 1.508) (drill 1.0) (layers *.Cu *.Mask) (solder_mask_margin 0.102))
  (pad 14 thru_hole circle (at 7.62 11.43) (size 1.508 1.508) (drill 1.0) (layers *.Cu *.Mask) (solder_mask_margin 0.102))
  (pad 15 thru_hole circle (at 7.62 8.89) (size 1.508 1.508) (drill 1.0) (layers *.Cu *.Mask) (solder_mask_margin 0.102))
  (pad 16 thru_hole circle (at 7.62 6.35) (size 1.508 1.508) (drill 1.0) (layers *.Cu *.Mask) (solder_mask_margin 0.102))
  (pad 17 thru_hole circle (at 7.62 3.81) (size 1.508 1.508) (drill 1.0) (layers *.Cu *.Mask) (solder_mask_margin 0.102))
  (pad 18 thru_hole circle (at 7.62 1.27) (size 1.508 1.508) (drill 1.0) (layers *.Cu *.Mask) (solder_mask_margin 0.102))
  (pad 19 thru_hole circle (at 7.62 -1.27) (size 1.508 1.508) (drill 1.0) (layers *.Cu *.Mask) (solder_mask_margin 0.102))
  (pad 20 thru_hole circle (at 7.62 -3.81) (size 1.508 1.508) (drill 1.0) (layers *.Cu *.Mask) (solder_mask_margin 0.102))
  (pad 21 thru_hole circle (at 7.62 -6.35) (size 1.508 1.508) (drill 1.0) (layers *.Cu *.Mask) (solder_mask_margin 0.102))
  (pad 22 thru_hole circle (at 7.62 -8.89) (size 1.508 1.508) (drill 1.0) (layers *.Cu *.Mask) (solder_mask_margin 0.102))
  (pad 23 thru_hole circle (at 7.62 -11.43) (size 1.508 1.508) (drill 1.0) (layers *.Cu *.Mask) (solder_mask_margin 0.102))
  (pad 24 thru_hole circle (at 7.62 -13.97) (size 1.508 1.508) (drill 1.0) (layers *.Cu *.Mask) (solder_mask_margin 0.102))
  (pad P1 thru_hole circle (at 0.0 -12.7) (size 3.516 3.516) (drill 2.5) (layers *.Cu *.Mask) (solder_mask_margin 0.102))
  (pad P2 thru_hole circle (at 0.0 12.7) (size 3.516 3.516) (drill 2.5) (layers *.Cu *.Mask) (solder_mask_margin 0.102))
  (fp_line (start -8.89 15.24) (end 8.89 15.24) (layer F.Fab) (width 0.127))
  (fp_line (start -8.89 15.24) (end -8.89 -15.24) (layer F.Fab) (width 0.127))
  (fp_line (start -8.89 -15.24) (end 8.89 -15.24) (layer F.Fab) (width 0.127))
  (fp_line (start 8.89 -15.24) (end 8.89 15.24) (layer F.Fab) (width 0.127))
  (fp_line (start -9.14 15.49) (end 9.14 15.49) (layer F.CrtYd) (width 0.05))
  (fp_line (start 9.14 15.49) (end 9.14 -15.49) (layer F.CrtYd) (width 0.05))
  (fp_line (start 9.14 -15.49) (end -9.14 -15.49) (layer F.CrtYd) (width 0.05))
  (fp_line (start -9.14 -15.49) (end -9.14 15.49) (layer F.CrtYd) (width 0.05))
  (fp_line (start -8.89 -15.24) (end 8.89 -15.24) (layer F.SilkS) (width 0.127))
  (fp_line (start 8.89 -15.24) (end 8.89 15.24) (layer F.SilkS) (width 0.127))
  (fp_line (start 8.89 15.24) (end -8.89 15.24) (layer F.SilkS) (width 0.127))
  (fp_line (start -8.89 15.24) (end -8.89 -15.24) (layer F.SilkS) (width 0.127))
  (zone (net 0) (net_name "") (layer F.Cu) (hatch full 0.508)
    (connect_pads (clearance 0))
    (min_thickness 2.032)
    (keepout (tracks not_allowed) (vias not_allowed) (pads not_allowed ) (copperpour not_allowed) (footprints allowed))
    (fill (thermal_gap 0.508) (thermal_bridge_width 0.508))
    (polygon
      (pts
        (xy 2.016 12.7)
        (xy 2.00629240897 12.8976025549)
        (xy 1.97726312529 13.0933020892)
        (xy 1.92919171684 13.2852139093)
        (xy 1.86254113754 13.4714897996)
        (xy 1.77795326893 13.6503358214)
        (xy 1.6762427384 13.8200295898)
        (xy 1.55838907398 13.9789368609)
        (xy 1.42552727087 14.1255272709)
        (xy 1.27893686087 14.258389074)
        (xy 1.12002958977 14.3762427384)
        (xy 0.950335821441 14.4779532689)
        (xy 0.771489799648 14.5625411375)
        (xy 0.585213909345 14.6291917168)
        (xy 0.393302089185 14.6772631253)
        (xy 0.197602554904 14.706292409)
        (xy 3.25693786206e-15 14.716)
        (xy -0.197602554904 14.706292409)
        (xy -0.393302089185 14.6772631253)
        (xy -0.585213909345 14.6291917168)
        (xy -0.771489799648 14.5625411375)
        (xy -0.950335821441 14.4779532689)
        (xy -1.12002958977 14.3762427384)
        (xy -1.27893686087 14.258389074)
        (xy -1.42552727087 14.1255272709)
        (xy -1.55838907398 13.9789368609)
        (xy -1.6762427384 13.8200295898)
        (xy -1.77795326893 13.6503358214)
        (xy -1.86254113754 13.4714897996)
        (xy -1.92919171684 13.2852139093)
        (xy -1.97726312529 13.0933020892)
        (xy -2.00629240897 12.8976025549)
        (xy -2.016 12.7)
        (xy -2.00629240897 12.5023974451)
        (xy -1.97726312529 12.3066979108)
        (xy -1.92919171684 12.1147860907)
        (xy -1.86254113754 11.9285102004)
        (xy -1.77795326893 11.7496641786)
        (xy -1.6762427384 11.5799704102)
        (xy -1.55838907398 11.4210631391)
        (xy -1.42552727087 11.2744727291)
        (xy -1.27893686087 11.141610926)
        (xy -1.12002958977 11.0237572616)
        (xy -0.950335821441 10.9220467311)
        (xy -0.771489799648 10.8374588625)
        (xy -0.585213909345 10.7708082832)
        (xy -0.393302089185 10.7227368747)
        (xy -0.197602554904 10.693707591)
        (xy -5.74203627441e-15 10.684)
        (xy 0.197602554904 10.693707591)
        (xy 0.393302089185 10.7227368747)
        (xy 0.585213909345 10.7708082832)
        (xy 0.771489799648 10.8374588625)
        (xy 0.950335821441 10.9220467311)
        (xy 1.12002958977 11.0237572616)
        (xy 1.27893686087 11.141610926)
        (xy 1.42552727087 11.2744727291)
        (xy 1.55838907398 11.4210631391)
        (xy 1.6762427384 11.5799704102)
        (xy 1.77795326893 11.7496641786)
        (xy 1.86254113754 11.9285102004)
        (xy 1.92919171684 12.1147860907)
        (xy 1.97726312529 12.3066979108)
        (xy 2.00629240897 12.5023974451)
        (xy 2.016 12.7)
        (xy 2.016 12.7)
      )
    )
  )
  (zone (net 0) (net_name "") (layer B.Cu) (hatch full 0.508)
    (connect_pads (clearance 0))
    (min_thickness 2.032)
    (keepout (tracks not_allowed) (vias not_allowed) (pads not_allowed ) (copperpour not_allowed) (footprints allowed))
    (fill (thermal_gap 0.508) (thermal_bridge_width 0.508))
    (polygon
      (pts
        (xy 2.016 12.7)
        (xy 2.00629240897 12.8976025549)
        (xy 1.97726312529 13.0933020892)
        (xy 1.92919171684 13.2852139093)
        (xy 1.86254113754 13.4714897996)
        (xy 1.77795326893 13.6503358214)
        (xy 1.6762427384 13.8200295898)
        (xy 1.55838907398 13.9789368609)
        (xy 1.42552727087 14.1255272709)
        (xy 1.27893686087 14.258389074)
        (xy 1.12002958977 14.3762427384)
        (xy 0.950335821441 14.4779532689)
        (xy 0.771489799648 14.5625411375)
        (xy 0.585213909345 14.6291917168)
        (xy 0.393302089185 14.6772631253)
        (xy 0.197602554904 14.706292409)
        (xy 3.25693786206e-15 14.716)
        (xy -0.197602554904 14.706292409)
        (xy -0.393302089185 14.6772631253)
        (xy -0.585213909345 14.6291917168)
        (xy -0.771489799648 14.5625411375)
        (xy -0.950335821441 14.4779532689)
        (xy -1.12002958977 14.3762427384)
        (xy -1.27893686087 14.258389074)
        (xy -1.42552727087 14.1255272709)
        (xy -1.55838907398 13.9789368609)
        (xy -1.6762427384 13.8200295898)
        (xy -1.77795326893 13.6503358214)
        (xy -1.86254113754 13.4714897996)
        (xy -1.92919171684 13.2852139093)
        (xy -1.97726312529 13.0933020892)
        (xy -2.00629240897 12.8976025549)
        (xy -2.016 12.7)
        (xy -2.00629240897 12.5023974451)
        (xy -1.97726312529 12.3066979108)
        (xy -1.92919171684 12.1147860907)
        (xy -1.86254113754 11.9285102004)
        (xy -1.77795326893 11.7496641786)
        (xy -1.6762427384 11.5799704102)
        (xy -1.55838907398 11.4210631391)
        (xy -1.42552727087 11.2744727291)
        (xy -1.27893686087 11.141610926)
        (xy -1.12002958977 11.0237572616)
        (xy -0.950335821441 10.9220467311)
        (xy -0.771489799648 10.8374588625)
        (xy -0.585213909345 10.7708082832)
        (xy -0.393302089185 10.7227368747)
        (xy -0.197602554904 10.693707591)
        (xy -5.74203627441e-15 10.684)
        (xy 0.197602554904 10.693707591)
        (xy 0.393302089185 10.7227368747)
        (xy 0.585213909345 10.7708082832)
        (xy 0.771489799648 10.8374588625)
        (xy 0.950335821441 10.9220467311)
        (xy 1.12002958977 11.0237572616)
        (xy 1.27893686087 11.141610926)
        (xy 1.42552727087 11.2744727291)
        (xy 1.55838907398 11.4210631391)
        (xy 1.6762427384 11.5799704102)
        (xy 1.77795326893 11.7496641786)
        (xy 1.86254113754 11.9285102004)
        (xy 1.92919171684 12.1147860907)
        (xy 1.97726312529 12.3066979108)
        (xy 2.00629240897 12.5023974451)
        (xy 2.016 12.7)
        (xy 2.016 12.7)
      )
    )
  )
  (zone (net 0) (net_name "") (layer F.Cu) (hatch full 0.508)
    (connect_pads (clearance 0))
    (min_thickness 2.032)
    (keepout (tracks not_allowed) (vias not_allowed) (pads not_allowed ) (copperpour not_allowed) (footprints allowed))
    (fill (thermal_gap 0.508) (thermal_bridge_width 0.508))
    (polygon
      (pts
        (xy 2.016 -12.7)
        (xy 2.00629240897 -12.5023974451)
        (xy 1.97726312529 -12.3066979108)
        (xy 1.92919171684 -12.1147860907)
        (xy 1.86254113754 -11.9285102004)
        (xy 1.77795326893 -11.7496641786)
        (xy 1.6762427384 -11.5799704102)
        (xy 1.55838907398 -11.4210631391)
        (xy 1.42552727087 -11.2744727291)
        (xy 1.27893686087 -11.141610926)
        (xy 1.12002958977 -11.0237572616)
        (xy 0.950335821441 -10.9220467311)
        (xy 0.771489799648 -10.8374588625)
        (xy 0.585213909345 -10.7708082832)
        (xy 0.393302089185 -10.7227368747)
        (xy 0.197602554904 -10.693707591)
        (xy 3.25693786206e-15 -10.684)
        (xy -0.197602554904 -10.693707591)
        (xy -0.393302089185 -10.7227368747)
        (xy -0.585213909345 -10.7708082832)
        (xy -0.771489799648 -10.8374588625)
        (xy -0.950335821441 -10.9220467311)
        (xy -1.12002958977 -11.0237572616)
        (xy -1.27893686087 -11.141610926)
        (xy -1.42552727087 -11.2744727291)
        (xy -1.55838907398 -11.4210631391)
        (xy -1.6762427384 -11.5799704102)
        (xy -1.77795326893 -11.7496641786)
        (xy -1.86254113754 -11.9285102004)
        (xy -1.92919171684 -12.1147860907)
        (xy -1.97726312529 -12.3066979108)
        (xy -2.00629240897 -12.5023974451)
        (xy -2.016 -12.7)
        (xy -2.00629240897 -12.8976025549)
        (xy -1.97726312529 -13.0933020892)
        (xy -1.92919171684 -13.2852139093)
        (xy -1.86254113754 -13.4714897996)
        (xy -1.77795326893 -13.6503358214)
        (xy -1.6762427384 -13.8200295898)
        (xy -1.55838907398 -13.9789368609)
        (xy -1.42552727087 -14.1255272709)
        (xy -1.27893686087 -14.258389074)
        (xy -1.12002958977 -14.3762427384)
        (xy -0.950335821441 -14.4779532689)
        (xy -0.771489799648 -14.5625411375)
        (xy -0.585213909345 -14.6291917168)
        (xy -0.393302089185 -14.6772631253)
        (xy -0.197602554904 -14.706292409)
        (xy -5.74203627441e-15 -14.716)
        (xy 0.197602554904 -14.706292409)
        (xy 0.393302089185 -14.6772631253)
        (xy 0.585213909345 -14.6291917168)
        (xy 0.771489799648 -14.5625411375)
        (xy 0.950335821441 -14.4779532689)
        (xy 1.12002958977 -14.3762427384)
        (xy 1.27893686087 -14.258389074)
        (xy 1.42552727087 -14.1255272709)
        (xy 1.55838907398 -13.9789368609)
        (xy 1.6762427384 -13.8200295898)
        (xy 1.77795326893 -13.6503358214)
        (xy 1.86254113754 -13.4714897996)
        (xy 1.92919171684 -13.2852139093)
        (xy 1.97726312529 -13.0933020892)
        (xy 2.00629240897 -12.8976025549)
        (xy 2.016 -12.7)
        (xy 2.016 -12.7)
      )
    )
  )
  (zone (net 0) (net_name "") (layer B.Cu) (hatch full 0.508)
    (connect_pads (clearance 0))
    (min_thickness 2.032)
    (keepout (tracks not_allowed) (vias not_allowed) (pads not_allowed ) (copperpour not_allowed) (footprints allowed))
    (fill (thermal_gap 0.508) (thermal_bridge_width 0.508))
    (polygon
      (pts
        (xy 2.016 -12.7)
        (xy 2.00629240897 -12.5023974451)
        (xy 1.97726312529 -12.3066979108)
        (xy 1.92919171684 -12.1147860907)
        (xy 1.86254113754 -11.9285102004)
        (xy 1.77795326893 -11.7496641786)
        (xy 1.6762427384 -11.5799704102)
        (xy 1.55838907398 -11.4210631391)
        (xy 1.42552727087 -11.2744727291)
        (xy 1.27893686087 -11.141610926)
        (xy 1.12002958977 -11.0237572616)
        (xy 0.950335821441 -10.9220467311)
        (xy 0.771489799648 -10.8374588625)
        (xy 0.585213909345 -10.7708082832)
        (xy 0.393302089185 -10.7227368747)
        (xy 0.197602554904 -10.693707591)
        (xy 3.25693786206e-15 -10.684)
        (xy -0.197602554904 -10.693707591)
        (xy -0.393302089185 -10.7227368747)
        (xy -0.585213909345 -10.7708082832)
        (xy -0.771489799648 -10.8374588625)
        (xy -0.950335821441 -10.9220467311)
        (xy -1.12002958977 -11.0237572616)
        (xy -1.27893686087 -11.141610926)
        (xy -1.42552727087 -11.2744727291)
        (xy -1.55838907398 -11.4210631391)
        (xy -1.6762427384 -11.5799704102)
        (xy -1.77795326893 -11.7496641786)
        (xy -1.86254113754 -11.9285102004)
        (xy -1.92919171684 -12.1147860907)
        (xy -1.97726312529 -12.3066979108)
        (xy -2.00629240897 -12.5023974451)
        (xy -2.016 -12.7)
        (xy -2.00629240897 -12.8976025549)
        (xy -1.97726312529 -13.0933020892)
        (xy -1.92919171684 -13.2852139093)
        (xy -1.86254113754 -13.4714897996)
        (xy -1.77795326893 -13.6503358214)
        (xy -1.6762427384 -13.8200295898)
        (xy -1.55838907398 -13.9789368609)
        (xy -1.42552727087 -14.1255272709)
        (xy -1.27893686087 -14.258389074)
        (xy -1.12002958977 -14.3762427384)
        (xy -0.950335821441 -14.4779532689)
        (xy -0.771489799648 -14.5625411375)
        (xy -0.585213909345 -14.6291917168)
        (xy -0.393302089185 -14.6772631253)
        (xy -0.197602554904 -14.706292409)
        (xy -5.74203627441e-15 -14.716)
        (xy 0.197602554904 -14.706292409)
        (xy 0.393302089185 -14.6772631253)
        (xy 0.585213909345 -14.6291917168)
        (xy 0.771489799648 -14.5625411375)
        (xy 0.950335821441 -14.4779532689)
        (xy 1.12002958977 -14.3762427384)
        (xy 1.27893686087 -14.258389074)
        (xy 1.42552727087 -14.1255272709)
        (xy 1.55838907398 -13.9789368609)
        (xy 1.6762427384 -13.8200295898)
        (xy 1.77795326893 -13.6503358214)
        (xy 1.86254113754 -13.4714897996)
        (xy 1.92919171684 -13.2852139093)
        (xy 1.97726312529 -13.0933020892)
        (xy 2.00629240897 -12.8976025549)
        (xy 2.016 -12.7)
        (xy 2.016 -12.7)
      )
    )
  )
  (fp_circle (center -9.5 -13.97) (end -9.4 -13.97) (layer F.SilkS) (width 0.2))
  (fp_circle (center -9.5 -13.97) (end -9.4 -13.97) (layer F.Fab) (width 0.2))
)