%TF.GenerationSoftware,KiCad,Pcbnew,7.0.10*%
%TF.CreationDate,2024-05-27T17:30:16+03:00*%
%TF.ProjectId,hall-hat,68616c6c-2d68-4617-942e-6b696361645f,rev?*%
%TF.SameCoordinates,Original*%
%TF.FileFunction,Copper,L1,Top*%
%TF.FilePolarity,Positive*%
%FSLAX46Y46*%
G04 Gerber Fmt 4.6, Leading zero omitted, Abs format (unit mm)*
G04 Created by KiCad (PCBNEW 7.0.10) date 2024-05-27 17:30:16*
%MOMM*%
%LPD*%
G01*
G04 APERTURE LIST*
G04 APERTURE END LIST*
%TA.AperFunction,NonConductor*%
G36*
X153352708Y-86353078D02*
G01*
X153354852Y-86353266D01*
X153447919Y-86361466D01*
X153634607Y-86378845D01*
X153647874Y-86380810D01*
X153771192Y-86405964D01*
X153772589Y-86406259D01*
X153927682Y-86440190D01*
X153939536Y-86443407D01*
X154066238Y-86484631D01*
X154068968Y-86485555D01*
X154211451Y-86535663D01*
X154221744Y-86539810D01*
X154318866Y-86584106D01*
X154345714Y-86596351D01*
X154349413Y-86598113D01*
X154394814Y-86620660D01*
X154482003Y-86663962D01*
X154490697Y-86668724D01*
X154608737Y-86739680D01*
X154613174Y-86742478D01*
X154735538Y-86823303D01*
X154742675Y-86828390D01*
X154852494Y-86912672D01*
X154857485Y-86916713D01*
X154948592Y-86994474D01*
X154968564Y-87011521D01*
X154974199Y-87016637D01*
X155073923Y-87112936D01*
X155079233Y-87118389D01*
X155177862Y-87226085D01*
X155182087Y-87230946D01*
X155225715Y-87283858D01*
X155270139Y-87337734D01*
X155275464Y-87344678D01*
X155360524Y-87464155D01*
X155363477Y-87468496D01*
X155438508Y-87583977D01*
X155443591Y-87592534D01*
X155514024Y-87722726D01*
X155515914Y-87726362D01*
X155576737Y-87848252D01*
X155581252Y-87858418D01*
X155636301Y-87999046D01*
X155637336Y-88001785D01*
X155682952Y-88126944D01*
X155686584Y-88138688D01*
X155725872Y-88292342D01*
X155726295Y-88294047D01*
X155755685Y-88416177D01*
X155758120Y-88429417D01*
X155783220Y-88625145D01*
X155783293Y-88625726D01*
X155793355Y-88707240D01*
X155794288Y-88723030D01*
X155692391Y-109801711D01*
X155691885Y-109812310D01*
X155683265Y-109907377D01*
X155683208Y-109907987D01*
X155664182Y-110106874D01*
X155662052Y-110120775D01*
X155634335Y-110251553D01*
X155633940Y-110253348D01*
X155597735Y-110412510D01*
X155594242Y-110424868D01*
X155549005Y-110558119D01*
X155547986Y-110561003D01*
X155494142Y-110707622D01*
X155489629Y-110718332D01*
X155427743Y-110847861D01*
X155425830Y-110851693D01*
X155354969Y-110987721D01*
X155349782Y-110996735D01*
X155272306Y-111119181D01*
X155269260Y-111123766D01*
X155182314Y-111248554D01*
X155176793Y-111255884D01*
X155084962Y-111368850D01*
X155080577Y-111373955D01*
X154978769Y-111486163D01*
X154973239Y-111491878D01*
X154868565Y-111593339D01*
X154862680Y-111598688D01*
X154747342Y-111696958D01*
X154742102Y-111701183D01*
X154626319Y-111789454D01*
X154618821Y-111794743D01*
X154491426Y-111877729D01*
X154486747Y-111880631D01*
X154361907Y-111954273D01*
X154352737Y-111959176D01*
X154214575Y-112025758D01*
X154210686Y-112027551D01*
X154079300Y-112085365D01*
X154068454Y-112089542D01*
X153920177Y-112138807D01*
X153917264Y-112139735D01*
X153782723Y-112180781D01*
X153770259Y-112183888D01*
X153610021Y-112215117D01*
X153608217Y-112215455D01*
X153476642Y-112239082D01*
X153462680Y-112240779D01*
X153263429Y-112253586D01*
X153262819Y-112253623D01*
X153165755Y-112259382D01*
X153158411Y-112259600D01*
X130495473Y-112259600D01*
X130484271Y-112259093D01*
X130390430Y-112250581D01*
X130389815Y-112250524D01*
X130186066Y-112231019D01*
X130172170Y-112228888D01*
X130041414Y-112201172D01*
X130039621Y-112200778D01*
X129876672Y-112163709D01*
X129864313Y-112160215D01*
X129730445Y-112114765D01*
X129727561Y-112113746D01*
X129577969Y-112058806D01*
X129567260Y-112054293D01*
X129507537Y-112025758D01*
X129436860Y-111991988D01*
X129433094Y-111990109D01*
X129294435Y-111917874D01*
X129285434Y-111912693D01*
X129162060Y-111834627D01*
X129157474Y-111831581D01*
X129049999Y-111756695D01*
X129030433Y-111743062D01*
X129023110Y-111737546D01*
X128973182Y-111696958D01*
X128909255Y-111644989D01*
X128904150Y-111640603D01*
X128789920Y-111536957D01*
X128784205Y-111531427D01*
X128681941Y-111425920D01*
X128676593Y-111420036D01*
X128576561Y-111302627D01*
X128572336Y-111297387D01*
X128483380Y-111180702D01*
X128478091Y-111173204D01*
X128393578Y-111043462D01*
X128390676Y-111038783D01*
X128365873Y-110996735D01*
X128316487Y-110913013D01*
X128311602Y-110903874D01*
X128243756Y-110763085D01*
X128241969Y-110759206D01*
X128183764Y-110626927D01*
X128179593Y-110616099D01*
X128129318Y-110464774D01*
X128128435Y-110462005D01*
X128087157Y-110326693D01*
X128084060Y-110314268D01*
X128052096Y-110150248D01*
X128051758Y-110148444D01*
X128028133Y-110016875D01*
X128026436Y-110002912D01*
X128013151Y-109796189D01*
X128007594Y-109702505D01*
X128007378Y-109694763D01*
X128008130Y-109466100D01*
X129445207Y-109466100D01*
X129465802Y-109701503D01*
X129465804Y-109701513D01*
X129526960Y-109929755D01*
X129526962Y-109929759D01*
X129526963Y-109929763D01*
X129539718Y-109957116D01*
X129626830Y-110143928D01*
X129626831Y-110143930D01*
X129762371Y-110337502D01*
X129929463Y-110504594D01*
X130123035Y-110640134D01*
X130123037Y-110640135D01*
X130337203Y-110740003D01*
X130565458Y-110801163D01*
X130741898Y-110816599D01*
X130741899Y-110816600D01*
X130741900Y-110816600D01*
X130859833Y-110816600D01*
X130859833Y-110816599D01*
X131036274Y-110801163D01*
X131264529Y-110740003D01*
X131478695Y-110640135D01*
X131672267Y-110504595D01*
X131839361Y-110337501D01*
X131974901Y-110143930D01*
X132074769Y-109929763D01*
X132135929Y-109701508D01*
X132156525Y-109466100D01*
X151543207Y-109466100D01*
X151563802Y-109701503D01*
X151563804Y-109701513D01*
X151624960Y-109929755D01*
X151624962Y-109929759D01*
X151624963Y-109929763D01*
X151637718Y-109957116D01*
X151724830Y-110143928D01*
X151724831Y-110143930D01*
X151860371Y-110337502D01*
X152027463Y-110504594D01*
X152221035Y-110640134D01*
X152221037Y-110640135D01*
X152435203Y-110740003D01*
X152663458Y-110801163D01*
X152839898Y-110816599D01*
X152839899Y-110816600D01*
X152839900Y-110816600D01*
X152957833Y-110816600D01*
X152957833Y-110816599D01*
X153134274Y-110801163D01*
X153362529Y-110740003D01*
X153576695Y-110640135D01*
X153770267Y-110504595D01*
X153937361Y-110337501D01*
X154072901Y-110143930D01*
X154172769Y-109929763D01*
X154233929Y-109701508D01*
X154254525Y-109466100D01*
X154233929Y-109230692D01*
X154172769Y-109002437D01*
X154072901Y-108788271D01*
X154072900Y-108788269D01*
X153937360Y-108594697D01*
X153770268Y-108427605D01*
X153576696Y-108292065D01*
X153576694Y-108292064D01*
X153469612Y-108242131D01*
X153362529Y-108192197D01*
X153362525Y-108192196D01*
X153362521Y-108192194D01*
X153134279Y-108131038D01*
X153134269Y-108131036D01*
X152957833Y-108115600D01*
X152957832Y-108115600D01*
X152839900Y-108115600D01*
X152839899Y-108115600D01*
X152663462Y-108131036D01*
X152663452Y-108131038D01*
X152435210Y-108192194D01*
X152435201Y-108192198D01*
X152221037Y-108292064D01*
X152221035Y-108292065D01*
X152027463Y-108427605D01*
X151860372Y-108594697D01*
X151860367Y-108594704D01*
X151724833Y-108788265D01*
X151724831Y-108788269D01*
X151624964Y-109002435D01*
X151624960Y-109002444D01*
X151563804Y-109230686D01*
X151563802Y-109230696D01*
X151543207Y-109466099D01*
X151543207Y-109466100D01*
X132156525Y-109466100D01*
X132135929Y-109230692D01*
X132074769Y-109002437D01*
X131974901Y-108788271D01*
X131974900Y-108788269D01*
X131839360Y-108594697D01*
X131672268Y-108427605D01*
X131478696Y-108292065D01*
X131478694Y-108292064D01*
X131371612Y-108242131D01*
X131264529Y-108192197D01*
X131264525Y-108192196D01*
X131264521Y-108192194D01*
X131036279Y-108131038D01*
X131036269Y-108131036D01*
X130859833Y-108115600D01*
X130859832Y-108115600D01*
X130741900Y-108115600D01*
X130741899Y-108115600D01*
X130565462Y-108131036D01*
X130565452Y-108131038D01*
X130337210Y-108192194D01*
X130337201Y-108192198D01*
X130123037Y-108292064D01*
X130123035Y-108292065D01*
X129929463Y-108427605D01*
X129762372Y-108594697D01*
X129762367Y-108594704D01*
X129626833Y-108788265D01*
X129626831Y-108788269D01*
X129526964Y-109002435D01*
X129526960Y-109002444D01*
X129465804Y-109230686D01*
X129465802Y-109230696D01*
X129445207Y-109466099D01*
X129445207Y-109466100D01*
X128008130Y-109466100D01*
X128009656Y-109002444D01*
X128037919Y-100410325D01*
X137074298Y-100410325D01*
X137093821Y-100869929D01*
X137152255Y-101326254D01*
X137249176Y-101775965D01*
X137249178Y-101775973D01*
X137383885Y-102215839D01*
X137383887Y-102215844D01*
X137555408Y-102642690D01*
X137555412Y-102642701D01*
X137762514Y-103053462D01*
X137762524Y-103053480D01*
X138003725Y-103445215D01*
X138277278Y-103815084D01*
X138581212Y-104160419D01*
X138581212Y-104160420D01*
X138913348Y-104478747D01*
X138913350Y-104478748D01*
X139271262Y-104767742D01*
X139271263Y-104767743D01*
X139417454Y-104866550D01*
X139652411Y-105025353D01*
X139830908Y-105125067D01*
X140054020Y-105249706D01*
X140054042Y-105249717D01*
X140473223Y-105439199D01*
X140473229Y-105439201D01*
X140550314Y-105466437D01*
X140553890Y-105467844D01*
X140553909Y-105467796D01*
X140556387Y-105468745D01*
X140556410Y-105468755D01*
X140564187Y-105471356D01*
X140566058Y-105471999D01*
X140906988Y-105592458D01*
X140906993Y-105592459D01*
X140906998Y-105592461D01*
X140906996Y-105592461D01*
X140965988Y-105607820D01*
X140989940Y-105614057D01*
X140998039Y-105616463D01*
X140998430Y-105616594D01*
X141014519Y-105620475D01*
X141016429Y-105620954D01*
X141352181Y-105708377D01*
X141440652Y-105723547D01*
X141448720Y-105725210D01*
X141451523Y-105725887D01*
X141474727Y-105729408D01*
X141476689Y-105729726D01*
X141805601Y-105786124D01*
X141899018Y-105794075D01*
X141907095Y-105795030D01*
X141912334Y-105795826D01*
X141912331Y-105795826D01*
X141916507Y-105796095D01*
X141941376Y-105797703D01*
X141943633Y-105797872D01*
X142194920Y-105819260D01*
X142263965Y-105825137D01*
X142263978Y-105825137D01*
X142263981Y-105825138D01*
X142263982Y-105825138D01*
X142361765Y-105825138D01*
X142369762Y-105825395D01*
X142377451Y-105825893D01*
X142411188Y-105825166D01*
X142413855Y-105825138D01*
X142724018Y-105825138D01*
X142724019Y-105825138D01*
X142724024Y-105825137D01*
X142724032Y-105825137D01*
X142732573Y-105824409D01*
X142825542Y-105816497D01*
X142833318Y-105816082D01*
X142843431Y-105815865D01*
X142881011Y-105811805D01*
X142883684Y-105811548D01*
X143182399Y-105786124D01*
X143286867Y-105768210D01*
X143294475Y-105767148D01*
X143306824Y-105765815D01*
X143347056Y-105757924D01*
X143349869Y-105757408D01*
X143635819Y-105708377D01*
X143742440Y-105680614D01*
X143749729Y-105678953D01*
X143764200Y-105676116D01*
X143806186Y-105664054D01*
X143809020Y-105663279D01*
X144081012Y-105592458D01*
X144188811Y-105554369D01*
X144195814Y-105552129D01*
X144212171Y-105547431D01*
X144255025Y-105531015D01*
X144257810Y-105529991D01*
X144514771Y-105439201D01*
X144622806Y-105390365D01*
X144629433Y-105387601D01*
X144647421Y-105380712D01*
X144690215Y-105359941D01*
X144692985Y-105358642D01*
X144933970Y-105249711D01*
X145041159Y-105189831D01*
X145047472Y-105186540D01*
X145066728Y-105177194D01*
X145108584Y-105152221D01*
X145111517Y-105150527D01*
X145335589Y-105025353D01*
X145440881Y-104954187D01*
X145446733Y-104950468D01*
X145466988Y-104938384D01*
X145507309Y-104909353D01*
X145510143Y-104907375D01*
X145716735Y-104767744D01*
X145819020Y-104685153D01*
X145824381Y-104681065D01*
X145845237Y-104666049D01*
X145883347Y-104633286D01*
X145886177Y-104630928D01*
X146074660Y-104478739D01*
X146172739Y-104384737D01*
X146177620Y-104380306D01*
X146198674Y-104362207D01*
X146234048Y-104326062D01*
X146236779Y-104323360D01*
X146406787Y-104160421D01*
X146499481Y-104055099D01*
X146503863Y-104050378D01*
X146524683Y-104029106D01*
X146556876Y-103989985D01*
X146559400Y-103987017D01*
X146710722Y-103815084D01*
X146796823Y-103698666D01*
X146800724Y-103693669D01*
X146820850Y-103669213D01*
X146849509Y-103627545D01*
X146851845Y-103624272D01*
X146984275Y-103445215D01*
X147062579Y-103318040D01*
X147065954Y-103312857D01*
X147084983Y-103285192D01*
X147109751Y-103241572D01*
X147111923Y-103237901D01*
X147225476Y-103053480D01*
X147294795Y-102915993D01*
X147297639Y-102910682D01*
X147315126Y-102879887D01*
X147335825Y-102834794D01*
X147337742Y-102830812D01*
X147432587Y-102642701D01*
X147491743Y-102495484D01*
X147494089Y-102490033D01*
X147509571Y-102456306D01*
X147509575Y-102456298D01*
X147526075Y-102410279D01*
X147527713Y-102405968D01*
X147604115Y-102215837D01*
X147651973Y-102059562D01*
X147653771Y-102054150D01*
X147666891Y-102017561D01*
X147679164Y-101971089D01*
X147680462Y-101966534D01*
X147738824Y-101775965D01*
X147774269Y-101611497D01*
X147775580Y-101606027D01*
X147785908Y-101566925D01*
X147793964Y-101520586D01*
X147794907Y-101515738D01*
X147835745Y-101326253D01*
X147857744Y-101154456D01*
X147858558Y-101149057D01*
X147865745Y-101107726D01*
X147865746Y-101107718D01*
X147865747Y-101107710D01*
X147867051Y-101092583D01*
X147869695Y-101061942D01*
X147870225Y-101056986D01*
X147894177Y-100869942D01*
X147894199Y-100869443D01*
X147896079Y-100825147D01*
X147901739Y-100691926D01*
X147902078Y-100686641D01*
X147905813Y-100643363D01*
X147906473Y-100581903D01*
X147906576Y-100578043D01*
X147913702Y-100410319D01*
X147906577Y-100242598D01*
X147906473Y-100238731D01*
X147905813Y-100177275D01*
X147902079Y-100134004D01*
X147901738Y-100128705D01*
X147896674Y-100009486D01*
X147894178Y-99950708D01*
X147894177Y-99950702D01*
X147894177Y-99950696D01*
X147870231Y-99763698D01*
X147869693Y-99758667D01*
X147865745Y-99712912D01*
X147858555Y-99671560D01*
X147857744Y-99666187D01*
X147835745Y-99494385D01*
X147794911Y-99304918D01*
X147793964Y-99300048D01*
X147792355Y-99290797D01*
X147785908Y-99253713D01*
X147775583Y-99214622D01*
X147774269Y-99209138D01*
X147738824Y-99044673D01*
X147680465Y-98854110D01*
X147679161Y-98849535D01*
X147666891Y-98803077D01*
X147653784Y-98766524D01*
X147651965Y-98761050D01*
X147604115Y-98604801D01*
X147527715Y-98414673D01*
X147526074Y-98410354D01*
X147509575Y-98364340D01*
X147494090Y-98330607D01*
X147491743Y-98325153D01*
X147432587Y-98177937D01*
X147337746Y-97989832D01*
X147335811Y-97985812D01*
X147315126Y-97940751D01*
X147297638Y-97909954D01*
X147294797Y-97904647D01*
X147225476Y-97767158D01*
X147111937Y-97582759D01*
X147109708Y-97578990D01*
X147084983Y-97535446D01*
X147084979Y-97535440D01*
X147065981Y-97507819D01*
X147062568Y-97502580D01*
X146984275Y-97375423D01*
X146851879Y-97196411D01*
X146849438Y-97192989D01*
X146820850Y-97151425D01*
X146800741Y-97126989D01*
X146796795Y-97121933D01*
X146710722Y-97005554D01*
X146710720Y-97005552D01*
X146710718Y-97005549D01*
X146559490Y-96833721D01*
X146556825Y-96830590D01*
X146524688Y-96791538D01*
X146524681Y-96791530D01*
X146503899Y-96770295D01*
X146499438Y-96765489D01*
X146406787Y-96660217D01*
X146236840Y-96497336D01*
X146234021Y-96494546D01*
X146198682Y-96458439D01*
X146198676Y-96458433D01*
X146177656Y-96440362D01*
X146172694Y-96435857D01*
X146074660Y-96341899D01*
X145987258Y-96271326D01*
X145886220Y-96189743D01*
X145883286Y-96187298D01*
X145845246Y-96154597D01*
X145845237Y-96154589D01*
X145824419Y-96139600D01*
X145818974Y-96135446D01*
X145716737Y-96052895D01*
X145716736Y-96052894D01*
X145510255Y-95913338D01*
X145507239Y-95911234D01*
X145466992Y-95882257D01*
X145466989Y-95882255D01*
X145466988Y-95882254D01*
X145461294Y-95878857D01*
X145446758Y-95870183D01*
X145440861Y-95866435D01*
X145335591Y-95795286D01*
X145335589Y-95795285D01*
X145111572Y-95670141D01*
X145108512Y-95668374D01*
X145066728Y-95643444D01*
X145066724Y-95643442D01*
X145066725Y-95643442D01*
X145047468Y-95634095D01*
X145041141Y-95630796D01*
X144933979Y-95570931D01*
X144933957Y-95570920D01*
X144693124Y-95462057D01*
X144690076Y-95460629D01*
X144647421Y-95439926D01*
X144647412Y-95439922D01*
X144647409Y-95439921D01*
X144647406Y-95439919D01*
X144629473Y-95433050D01*
X144622755Y-95430248D01*
X144514781Y-95381440D01*
X144257938Y-95290692D01*
X144254895Y-95289572D01*
X144245556Y-95285994D01*
X144212171Y-95273207D01*
X144212167Y-95273206D01*
X144212165Y-95273205D01*
X144195842Y-95268516D01*
X144188773Y-95266254D01*
X144081007Y-95228178D01*
X143809085Y-95157375D01*
X143806095Y-95156556D01*
X143764219Y-95144527D01*
X143764188Y-95144519D01*
X143749746Y-95141686D01*
X143742376Y-95140005D01*
X143635821Y-95112261D01*
X143635817Y-95112260D01*
X143349900Y-95063234D01*
X143346997Y-95062701D01*
X143316846Y-95056788D01*
X143306824Y-95054823D01*
X143306821Y-95054822D01*
X143306817Y-95054822D01*
X143294502Y-95053492D01*
X143286867Y-95052426D01*
X143182394Y-95034513D01*
X143182383Y-95034512D01*
X142883726Y-95009092D01*
X142880928Y-95008822D01*
X142843439Y-95004773D01*
X142843425Y-95004772D01*
X142833348Y-95004555D01*
X142825507Y-95004137D01*
X142724036Y-94995500D01*
X142724019Y-94995500D01*
X142413855Y-94995500D01*
X142411188Y-94995471D01*
X142410133Y-94995448D01*
X142377457Y-94994744D01*
X142369763Y-94995242D01*
X142361765Y-94995500D01*
X142263962Y-94995500D01*
X141943799Y-95022751D01*
X141941284Y-95022940D01*
X141912333Y-95024811D01*
X141907079Y-95025609D01*
X141898999Y-95026564D01*
X141805616Y-95034512D01*
X141805590Y-95034515D01*
X141476901Y-95090875D01*
X141474554Y-95091255D01*
X141451527Y-95094750D01*
X141451513Y-95094752D01*
X141448709Y-95095429D01*
X141440607Y-95097098D01*
X141352180Y-95112261D01*
X141016555Y-95199650D01*
X141014396Y-95200192D01*
X140998420Y-95204046D01*
X140998010Y-95204184D01*
X140989950Y-95206577D01*
X140906986Y-95228180D01*
X140906982Y-95228182D01*
X140566108Y-95348619D01*
X140564152Y-95349292D01*
X140556417Y-95351880D01*
X140553931Y-95352833D01*
X140553913Y-95352788D01*
X140550327Y-95354195D01*
X140473235Y-95381434D01*
X140473223Y-95381438D01*
X140054042Y-95570920D01*
X140054020Y-95570931D01*
X139652419Y-95795280D01*
X139652400Y-95795292D01*
X139271263Y-96052894D01*
X139271262Y-96052895D01*
X138913350Y-96341889D01*
X138913348Y-96341890D01*
X138581212Y-96660217D01*
X138581212Y-96660218D01*
X138277281Y-97005550D01*
X138277278Y-97005553D01*
X138003728Y-97375418D01*
X137762525Y-97767155D01*
X137762514Y-97767175D01*
X137555412Y-98177936D01*
X137555408Y-98177947D01*
X137383887Y-98604793D01*
X137383885Y-98604798D01*
X137249178Y-99044664D01*
X137249176Y-99044672D01*
X137152255Y-99494383D01*
X137093821Y-99950708D01*
X137074298Y-100410312D01*
X137074298Y-100410325D01*
X128037919Y-100410325D01*
X128074971Y-89146100D01*
X129699207Y-89146100D01*
X129719802Y-89381503D01*
X129719804Y-89381513D01*
X129780960Y-89609755D01*
X129780962Y-89609759D01*
X129780963Y-89609763D01*
X129830897Y-89716846D01*
X129880830Y-89823928D01*
X129880831Y-89823930D01*
X130016371Y-90017502D01*
X130183463Y-90184594D01*
X130377035Y-90320134D01*
X130377037Y-90320135D01*
X130591203Y-90420003D01*
X130819458Y-90481163D01*
X130995898Y-90496599D01*
X130995899Y-90496600D01*
X130995900Y-90496600D01*
X131113833Y-90496600D01*
X131113833Y-90496599D01*
X131290274Y-90481163D01*
X131518529Y-90420003D01*
X131732695Y-90320135D01*
X131926267Y-90184595D01*
X132093361Y-90017501D01*
X132228901Y-89823930D01*
X132328769Y-89609763D01*
X132389929Y-89381508D01*
X132410525Y-89146100D01*
X151543207Y-89146100D01*
X151563802Y-89381503D01*
X151563804Y-89381513D01*
X151624960Y-89609755D01*
X151624962Y-89609759D01*
X151624963Y-89609763D01*
X151674897Y-89716846D01*
X151724830Y-89823928D01*
X151724831Y-89823930D01*
X151860371Y-90017502D01*
X152027463Y-90184594D01*
X152221035Y-90320134D01*
X152221037Y-90320135D01*
X152435203Y-90420003D01*
X152663458Y-90481163D01*
X152839898Y-90496599D01*
X152839899Y-90496600D01*
X152839900Y-90496600D01*
X152957833Y-90496600D01*
X152957833Y-90496599D01*
X153134274Y-90481163D01*
X153362529Y-90420003D01*
X153576695Y-90320135D01*
X153770267Y-90184595D01*
X153937361Y-90017501D01*
X154072901Y-89823930D01*
X154172769Y-89609763D01*
X154233929Y-89381508D01*
X154254525Y-89146100D01*
X154233929Y-88910692D01*
X154172769Y-88682437D01*
X154072901Y-88468271D01*
X154072900Y-88468269D01*
X153937360Y-88274697D01*
X153770268Y-88107605D01*
X153576696Y-87972065D01*
X153576694Y-87972064D01*
X153469612Y-87922131D01*
X153362529Y-87872197D01*
X153362525Y-87872196D01*
X153362521Y-87872194D01*
X153134279Y-87811038D01*
X153134269Y-87811036D01*
X152957833Y-87795600D01*
X152957832Y-87795600D01*
X152839900Y-87795600D01*
X152839899Y-87795600D01*
X152663462Y-87811036D01*
X152663452Y-87811038D01*
X152435210Y-87872194D01*
X152435201Y-87872198D01*
X152221037Y-87972064D01*
X152221035Y-87972065D01*
X152027463Y-88107605D01*
X151860372Y-88274697D01*
X151860367Y-88274704D01*
X151724833Y-88468265D01*
X151724831Y-88468269D01*
X151624964Y-88682435D01*
X151624960Y-88682444D01*
X151563804Y-88910686D01*
X151563802Y-88910696D01*
X151543207Y-89146099D01*
X151543207Y-89146100D01*
X132410525Y-89146100D01*
X132389929Y-88910692D01*
X132328769Y-88682437D01*
X132228901Y-88468271D01*
X132228900Y-88468269D01*
X132093360Y-88274697D01*
X131926268Y-88107605D01*
X131732696Y-87972065D01*
X131732694Y-87972064D01*
X131625612Y-87922131D01*
X131518529Y-87872197D01*
X131518525Y-87872196D01*
X131518521Y-87872194D01*
X131290279Y-87811038D01*
X131290269Y-87811036D01*
X131113833Y-87795600D01*
X131113832Y-87795600D01*
X130995900Y-87795600D01*
X130995899Y-87795600D01*
X130819462Y-87811036D01*
X130819452Y-87811038D01*
X130591210Y-87872194D01*
X130591201Y-87872198D01*
X130377037Y-87972064D01*
X130377035Y-87972065D01*
X130183463Y-88107605D01*
X130016372Y-88274697D01*
X130016367Y-88274704D01*
X129880833Y-88468265D01*
X129880831Y-88468269D01*
X129780964Y-88682435D01*
X129780960Y-88682444D01*
X129719804Y-88910686D01*
X129719802Y-88910696D01*
X129699207Y-89146099D01*
X129699207Y-89146100D01*
X128074971Y-89146100D01*
X128076075Y-88810598D01*
X128076581Y-88799809D01*
X128085016Y-88706821D01*
X128104363Y-88504926D01*
X128106486Y-88491092D01*
X128133530Y-88363515D01*
X128133888Y-88361885D01*
X128170886Y-88199252D01*
X128174372Y-88186924D01*
X128218936Y-88055668D01*
X128219881Y-88052993D01*
X128274558Y-87904120D01*
X128279056Y-87893447D01*
X128340233Y-87765408D01*
X128342071Y-87761726D01*
X128413818Y-87624005D01*
X128418978Y-87615037D01*
X128495700Y-87493786D01*
X128498690Y-87489284D01*
X128586590Y-87363133D01*
X128592056Y-87355877D01*
X128683060Y-87243930D01*
X128687374Y-87238908D01*
X128790257Y-87125516D01*
X128795737Y-87119852D01*
X128899485Y-87019291D01*
X128905305Y-87014000D01*
X129021863Y-86914691D01*
X129027008Y-86910545D01*
X129141762Y-86823057D01*
X129149147Y-86817847D01*
X129278001Y-86733909D01*
X129282597Y-86731059D01*
X129406186Y-86658154D01*
X129415299Y-86653282D01*
X129555143Y-86585888D01*
X129558969Y-86584125D01*
X129688832Y-86526980D01*
X129699608Y-86522830D01*
X129850103Y-86472825D01*
X129852812Y-86471962D01*
X129985424Y-86431504D01*
X129997834Y-86428409D01*
X130161655Y-86396479D01*
X130163108Y-86396207D01*
X130291528Y-86373144D01*
X130305433Y-86371454D01*
X130514137Y-86358033D01*
X130602025Y-86352818D01*
X130609369Y-86352600D01*
X153341827Y-86352600D01*
X153352708Y-86353078D01*
G37*
%TD.AperFunction*%
M02*
