<?xml version='1.0' encoding='UTF-8'?>
<!-- Created with Inkscape (http://www.inkscape.org/) and export_objects.py -->
<svg xmlns:cc="http://creativecommons.org/ns#" xmlns:dc="http://purl.org/dc/elements/1.1/" xmlns:inkscape="http://www.inkscape.org/namespaces/inkscape" xmlns:rdf="http://www.w3.org/1999/02/22-rdf-syntax-ns#" xmlns:sodipodi="http://sodipodi.sourceforge.net/DTD/sodipodi-0.dtd" xmlns:xlink="http://www.w3.org/1999/xlink" xmlns="http://www.w3.org/2000/svg" version="1.1" id="svg1" width="16" height="16" viewBox="0 0 16 16">
<sodipodi:namedview 
    objecttolerance="10" 
    gridtolerance="10" 
    guidetolerance="10" 
    id="namedview" 
    showgrid="true" 
    inkscape:zoom="27.166187"
    inkscape:cx="7.4837792"
    inkscape:cy="8.9906751"
    inkscape:window-x="0" 
    inkscape:window-y="27"> 
    <inkscape:grid type="xygrid" id="grid"/>
  </sodipodi:namedview>
  <metadata
     id="metadata1906">
    <rdf:RDF>
      <cc:Work
         rdf:about="">
        <dc:format>image/svg+xml</dc:format>
        <dc:type
           rdf:resource="http://purl.org/dc/dcmitype/StillImage" />
        <cc:license
           rdf:resource="http://creativecommons.org/publicdomain/zero/1.0/" />
        <dc:title>fe Editor new Icons proposal</dc:title>
        <dc:date>13 Nov 2018</dc:date>
        <dc:creator>
          <cc:Agent>
            <dc:title>Ramón Miranda</dc:title>
          </cc:Agent>
        </dc:creator>
        <dc:rights>
          <cc:Agent>
            <dc:title>see the license tab</dc:title>
          </cc:Agent>
        </dc:rights>
        <dc:subject>
          <rdf:Bag>
            <rdf:li>icon ui</rdf:li>
          </rdf:Bag>
        </dc:subject>
        <dc:description>This is a little contribution with Inkscape Project
Ramon Miranda  www.ramonmiranda.com (design and SVG file)
Jabiertxo (SVG stuff to integrate them in UI)</dc:description>
        <dc:publisher>
          <cc:Agent>
            <dc:title></dc:title>
          </cc:Agent>
        </dc:publisher>
        <dc:identifier></dc:identifier>
        <dc:source />
        <dc:relation />
        <dc:language>-</dc:language>
        <dc:coverage />
        <dc:contributor>
          <cc:Agent>
            <dc:title>Ramon Miranda
Jabier Arraiza</dc:title>
          </cc:Agent>
        </dc:contributor>
      </cc:Work>
      <cc:License
         rdf:about="http://creativecommons.org/publicdomain/zero/1.0/">
        <cc:permits
           rdf:resource="http://creativecommons.org/ns#Reproduction" />
        <cc:permits
           rdf:resource="http://creativecommons.org/ns#Distribution" />
        <cc:permits
           rdf:resource="http://creativecommons.org/ns#DerivativeWorks" />
      </cc:License>
    </rdf:RDF>
  </metadata>
  <g inkscape:groupmode="layer"
     id="layercompo"
     inkscape:label="feCovolveMatrix">
        <path 
            id="rect22048" 
            d="M 0,0 H 16 V 16 H 0 Z" 
            style="opacity:0;fill:none" />
        <path
           id="path7910"
           d="M 0.54623226,14.375744 C 0.46912301,14.259225 0.45491884,14.121791 0.50774811,14.003401 0.53099434,13.951309 0.98548049,13.192518 1.5177138,12.317199 2.0499535,11.441879 3.0205354,9.8450128 3.6745645,8.7686077 4.3285936,7.6921995 5.0856029,6.4466967 5.3567976,6.0008162 5.6279923,5.5549358 5.8798947,5.1607771 5.9165866,5.1249042 6.0043288,5.039122 6.1030128,5.0088208 6.2580973,5.0200377 c 0.096442,0.00698 0.1481166,0.02432 0.2154386,0.072316 0.091629,0.065322 0.1776461,0.2046178 3.0036429,4.8640574 0.410578,0.6769499 0.7535992,1.2285939 0.7622792,1.2258769 0.0087,-0.0027 0.337731,-0.522712 0.731225,-1.155544 l 0.715444,-1.150605 0.116768,-0.059146 c 0.147479,-0.074693 0.274135,-0.076988 0.423037,-0.00766 0.06032,0.028086 0.129107,0.078801 0.152863,0.1127002 0.02375,0.033899 0.554123,0.8842603 1.178609,1.8896948 0.624487,1.005434 1.308676,2.106356 1.520429,2.446491 0.211748,0.340135 0.398999,0.65194 0.41611,0.692897 0.03906,0.09348 0.03976,0.207361 0.0018,0.296984 -0.02979,0.07038 -0.113157,0.159742 -0.131717,0.141185 -0.0056,-0.0056 -0.674188,-1.078999 -1.485724,-2.38531 -0.811532,-1.306304 -1.496439,-2.398154 -1.522009,-2.4263273 -0.16183,-0.1783374 -0.52934,-0.1718126 -0.681819,0.012103 -0.02908,0.035074 -0.362576,0.5633933 -0.741087,1.1740333 -0.512685,0.827087 -0.694198,1.10369 -0.711678,1.08451 -0.0129,-0.01416 -0.0963,-0.146722 -0.185332,-0.29458 C 9.1177987,10.028119 6.5849071,5.8752544 6.5492087,5.8362333 6.4685887,5.7481151 6.3424495,5.6971922 6.2076711,5.6983402 6.0365567,5.699817 5.9119212,5.7751473 5.8076522,5.9401532 5.7642745,6.0088044 4.5819459,7.9530096 3.1802516,10.260619 c -1.4016942,2.307607 -2.55566151,4.195838 -2.56436122,4.19607 -0.008707,2.01e-4 -0.040055,-0.0362 -0.0696715,-0.08095 z M 12.196524,5.3167946 c 0,-0.041404 0.0044,-0.058341 0.0098,-0.037638 0.0055,0.020703 0.0055,0.054574 0,0.075277 -0.0054,0.020695 -0.0098,0.00376 -0.0098,-0.037638 z m 0.449478,-0.77849 C 12.640632,4.4283365 12.507861,4.1066484 12.403303,3.9503155 12.099599,3.4962388 11.627048,3.2847807 11.152136,3.390446 c -0.09028,0.020078 -0.168759,0.044009 -0.174425,0.053165 -0.0056,0.00916 -0.07602,0.00282 -0.15634,-0.01411 -0.09227,-0.019427 -0.215358,-0.027059 -0.334233,-0.020722 -0.103504,0.0055 -0.188186,0.00316 -0.188186,-0.00524 0,-0.026462 0.173014,-0.2661736 0.254843,-0.3530835 0.175578,-0.1864799 0.475672,-0.3367916 0.734461,-0.3678783 0.257118,-0.030885 0.599287,0.0786 0.832266,0.2663011 0.386896,0.3116995 0.618895,0.9457112 0.547739,1.4968675 -0.01068,0.082801 -0.02071,0.1244341 -0.02226,0.092529 z m -1.036306,-0.6785843 -0.07412,-0.080647 0.08065,0.074115 c 0.07507,0.06898 0.09054,0.087178 0.07412,0.087178 -0.0037,0 -0.03989,-0.036289 -0.08066,-0.080647 z"
           style="opacity:0.3;fill:#000000" />
        <path
           id="path7902"
           d="M 13.435313,12.655848 C 13.084392,12.091075 12.717466,11.50003 12.619936,11.342415 l -0.17733,-0.286571 0.04773,-0.09825 c 0.02689,-0.05534 0.05566,-0.08986 0.06586,-0.07904 0.01328,0.01408 1.620731,2.59559 1.729451,2.777437 0.01205,0.02015 -0.01251,0.02686 -0.09811,0.0268 l -0.114177,-6.7e-5 -0.638053,-1.026861 z M 8.2263198,10.250903 6.9397627,8.1338241 7.0039966,8.0606614 c 0.03533,-0.040236 0.081956,-0.103161 0.1036182,-0.1398259 0.021662,-0.036672 0.047217,-0.06406 0.056783,-0.060871 0.00957,0.00315 0.5874721,0.9438785 1.2842143,2.0904238 1.0639025,1.7507167 1.263291,2.0912057 1.2448175,2.1257237 -0.012096,0.02261 -0.057676,0.09752 -0.1012751,0.166484 l -0.079278,0.125384 z"
           style="opacity:0.6;fill:#000000" />
        <path
           id="path7898"
           d="M 0.69193231,15.189102 C 0.57044512,15.115223 0.50529126,15.004707 0.49659154,14.857774 l -0.0078,-0.131833 0.24729068,-0.408627 C 0.87208886,14.09257 2.0861017,12.094067 3.4338926,9.8761976 5.7922397,5.9953924 5.888279,5.8412947 5.9871441,5.7795441 c 0.082977,-0.051822 0.1259177,-0.064006 0.223286,-0.063348 0.1343622,9.398e-4 0.2729736,0.060213 0.3389599,0.1450422 0.021823,0.028046 0.8574585,1.3976203 1.856979,3.0435039 0.9995204,1.6458778 1.824973,2.9900818 1.83433,2.9871188 0.0094,-0.003 0.338477,-0.522654 0.731374,-1.154866 0.660654,-1.0630664 0.721901,-1.1541449 0.814833,-1.2115992 0.142706,-0.088232 0.322238,-0.088272 0.4653,0 0.09496,0.058515 0.188769,0.2037183 1.665249,2.5775652 0.860547,1.383558 1.575219,2.553888 1.588161,2.600736 0.06416,0.232158 -0.164314,0.499153 -0.411316,0.48067 l -0.08921,-0.0067 -0.461044,-0.741977 -0.461044,-0.74198 0.108095,-0.0065 c 0.05945,-0.0036 0.108088,-0.01187 0.108088,-0.01844 0,-0.02273 -1.746434,-2.824684 -1.760336,-2.824255 -0.0077,2.69e-4 -0.03355,0.04556 -0.05751,0.10072 l -0.04355,0.100319 -0.158777,-0.256642 c -0.08733,-0.141154 -0.174195,-0.274951 -0.193024,-0.297328 -0.0557,-0.06618 -0.240149,-0.141701 -0.346089,-0.141701 -0.126892,0 -0.302228,0.08271 -0.370363,0.174695 -0.02942,0.03972 -0.370804,0.585144 -0.758647,1.212062 -0.387842,0.626917 -0.716417,1.152132 -0.7301716,1.167143 -0.019548,0.02134 -0.061623,-0.03351 -0.1928437,-0.251393 l -0.1678426,-0.278694 0.101396,-0.162683 c 0.05577,-0.08948 0.09663,-0.1751 0.09081,-0.190277 C 9.706392,12.00556 9.3313713,11.383784 8.8788117,10.639011 8.4262521,9.8942374 7.8574882,8.9582494 7.614883,8.5590292 7.3722779,8.1598157 7.1680362,7.8334892 7.1610079,7.8338652 7.1539779,7.8345364 7.1060379,7.8971462 7.0544633,7.973658 7.0028963,8.05017 6.9533225,8.1127662 6.9443006,8.1127662 6.9352806,8.1127662 6.8057428,7.9109006 6.656438,7.6641738 6.5071265,7.417447 6.3583051,7.1886559 6.3257147,7.1557568 6.1497805,6.9781377 5.7911053,6.999115 5.6450293,7.1955634 5.6060216,7.2480241 1.5066176,13.984796 0.88988434,15.009953 l -0.1319792,0.219381 z M 12.050226,6.1501748 C 12.160852,5.8997895 12.201498,5.6753624 12.201148,5.3167946 12.200478,4.9092842 12.15612,4.7026795 11.998625,4.3791858 11.795108,3.9611632 11.484591,3.6564048 11.104737,3.501864 L 10.983202,3.452418 11.087337,3.422184 c 0.16408,-0.047634 0.50647,-0.037464 0.663313,0.019702 0.303174,0.1105051 0.578598,0.3713556 0.740194,0.7010183 0.117137,0.2389736 0.153325,0.3884797 0.167335,0.6914056 0.01957,0.4230974 -0.07401,0.7664004 -0.294488,1.0803486 -0.09363,0.1333285 -0.308491,0.3484248 -0.348036,0.3484248 -0.0084,0 0.0071,-0.050809 0.03457,-0.1129082 z"
           style="opacity:1;fill:#000000" />
    </g>
</svg>
