<svg width="24" height="24" viewBox="0 0 24 24" fill="none" xmlns="http://www.w3.org/2000/svg">
<path d="M4.99202 4.5H13.008L14.738 3.116C15.327 2.646 15.547 1.883 15.298 1.171C15.049 0.459 14.402 0 13.65 0H4.35002C3.59802 0 2.95102 0.46 2.70202 1.171C2.45302 1.882 2.67302 2.646 3.26102 3.115L4.99202 4.5Z" fill="#CD6969"/>
<path d="M22.25 17H22V15.5C22 14.122 20.879 13 19.5 13C18.121 13 17 14.122 17 15.5V17H16.75C15.785 17 15 17.785 15 18.75V22.25C15 23.215 15.785 24 16.75 24H22.25C23.215 24 24 23.215 24 22.25V18.75C24 17.785 23.215 17 22.25 17ZM18.5 15.5C18.5 14.949 18.948 14.5 19.5 14.5C20.052 14.5 20.5 14.949 20.5 15.5V17H18.5V15.5Z" fill="#CD6969"/>
<path d="M12.5 22.25V18.75C12.5 17.22 13.32 15.888 14.536 15.139C14.649 13.586 15.475 12.236 16.68 11.397C15.802 9.321 14.559 7.388 13.145 6H4.855C2.124 8.681 0 13.385 0 17.25C0 20.609 1.778 24 5.75 24H12.5C12.629 24 12.752 23.989 12.877 23.982C12.639 23.451 12.5 22.868 12.5 22.25ZM8.62 14.25H9.38C10.549 14.25 11.5 15.201 11.5 16.37C11.5 17.421 10.742 18.286 9.75 18.462V19.249C9.75 19.664 9.414 20 9 20C8.586 20 8.25 19.664 8.25 19.25V18.5H7.25C6.836 18.5 6.5 18.164 6.5 17.75C6.5 17.336 6.836 17 7.25 17H9.38C9.722 17 10 16.722 10 16.38C10 16.028 9.722 15.75 9.38 15.75H8.62C7.451 15.75 6.5 14.799 6.5 13.63C6.5 12.579 7.258 11.714 8.25 11.538V10.75C8.25 10.336 8.586 10 9 10C9.414 10 9.75 10.336 9.75 10.75V11.5H10.75C11.164 11.5 11.5 11.836 11.5 12.25C11.5 12.664 11.164 13 10.75 13H8.62C8.278 13 8 13.278 8 13.62C8 13.972 8.278 14.25 8.62 14.25Z" fill="#CD6969"/>
</svg>
