<svg width="24" height="24" viewBox="0 0 24 24" fill="none" xmlns="http://www.w3.org/2000/svg">
<path d="M12 0C5.40891 0 0 5.40891 0 12C0 18.5911 5.40891 24 12 24C18.5911 24 24 18.5911 24 12C24 5.40891 18.5911 0 12 0ZM22.5469 12C22.5469 14.6553 21.5531 17.0776 19.9278 18.9336L5.06644 4.07217C6.92241 2.44688 9.34472 1.45312 12 1.45312C17.8159 1.45312 22.5469 6.18412 22.5469 12ZM1.45312 12C1.45312 9.34472 2.44688 6.92241 4.07217 5.06644L7.13855 8.13281C6.95569 8.31567 3.2062 12.0652 3.41691 11.8545L4.41117 12.8487L5.67188 11.588V19.0312H9.89062V13.4062H12.412L14.1094 15.1036V19.0312H18.037L18.9336 19.9278C17.0776 21.5531 14.6553 22.5469 12 22.5469C6.18412 22.5469 1.45312 17.8159 1.45312 12Z" fill="#CD6969"/>
<path d="M11.2969 14.8125H12.7031V19.0312H11.2969V14.8125Z" fill="#CD6969"/>
<path d="M18.3281 11.5879L19.5888 12.8486L20.5831 11.8543C20.0102 11.2815 16.6618 7.93305 16.9219 8.19316V4.96863H15.5157V6.78687L12 3.27124L9.13226 6.13901L18.3281 15.335V11.5879Z" fill="#CD6969"/>
</svg>
