<svg width="24" height="24" viewBox="0 0 24 24" fill="none" xmlns="http://www.w3.org/2000/svg">
<path d="M5.29341 9.68491C5.66873 10.0583 6.16021 10.2455 6.65169 10.2455C7.14316 10.2455 7.63558 10.0583 8.00996 9.68299L14.3578 3.33701C15.1065 2.5873 15.1065 1.36824 14.2993 0.561911C13.5496 -0.186811 12.3314 -0.187796 11.5818 0.561911L5.23487 6.90883C4.48614 7.65755 4.48614 8.87666 5.23585 9.6273L5.29341 9.68491Z" fill="#CDAC69"/>
<path d="M8.64736 12.917C5.13887 15.7977 1.16196 19.3675 0.72233 19.8072C-0.235639 20.7642 -0.235639 22.3231 0.72233 23.2811C1.20134 23.7601 1.83006 24 2.45879 24C3.0885 24 3.71722 23.76 4.19623 23.2811C4.63586 22.8405 8.20576 18.8626 11.0865 15.357C10.6593 14.9779 10.237 14.5872 9.82611 14.1773C9.41526 13.7655 9.02554 13.3432 8.64736 12.917Z" fill="#CDAC69"/>
<path d="M23.3838 9.64542C22.636 8.89862 21.4179 8.89571 20.6663 9.64542L14.3194 15.9923C13.5697 16.7411 13.5697 17.9611 14.3194 18.7098L14.377 18.7674C14.7524 19.1418 15.2448 19.3299 15.7363 19.3299C16.2277 19.3299 16.7201 19.1418 17.0945 18.7674L23.4424 12.4205C24.1902 11.6718 24.1902 10.4527 23.3838 9.64542Z" fill="#CDAC69"/>
<path d="M20.5483 8.5416C19.8332 7.60857 19.0403 6.70052 18.1716 5.8318C17.3048 4.96406 16.3967 4.17114 15.4618 3.4541C15.3418 3.65472 15.2064 3.84574 15.0365 4.01566L8.6896 10.3616C8.51968 10.5315 8.32867 10.6678 8.12903 10.7878C8.84414 11.7208 9.63707 12.6289 10.5048 13.4986C11.3716 14.3644 12.2806 15.1582 13.2146 15.8743C13.3346 15.6746 13.4709 15.4827 13.6408 15.3138L19.9877 8.96684C20.1576 8.79791 20.3486 8.6616 20.5483 8.5416Z" fill="#CDAC69"/>
</svg>
