<svg width="62" height="62" viewBox="0 0 62 62" fill="none" xmlns="http://www.w3.org/2000/svg">
<path d="M24.437 54.187L18 52.256V51.737C19.001 51.037 19.807 50.082 20.331 48.967C22.38 48.795 24 47.093 24 45.001V45V40C24 34.486 19.514 30 14 30C8.486 30 4 34.486 4 40V45H4.001C4.006 47.093 5.623 48.795 7.669 48.966C8.193 50.081 8.999 51.036 10 51.736V52.255L3.563 54.186C1.432 54.826 0 56.751 0 58.976V62H28V58.976C28 56.751 26.568 54.826 24.437 54.187ZM20.959 46.744C20.985 46.499 21 46.251 21 46V43.279C21.595 43.626 22 44.264 22 45.001C22 45.754 21.576 46.403 20.959 46.744ZM14 32C18.411 32 22 35.589 22 40V41.557C21.409 41.212 20.732 41 20 41H18.605C16.444 41 14.352 40.367 12.554 39.168L11.872 38.713L10.706 39.879C9.984 40.602 9.022 41 7.92 41C7.919 41 7.917 41 7.915 41C7.231 41 6.58 41.191 6 41.519V40C6 35.589 9.589 32 14 32ZM6 44.916C6 44.404 6.2 43.923 6.562 43.561C6.691 43.431 6.841 43.331 7 43.245V46C7 46.25 7.014 46.497 7.04 46.74C6.423 46.392 6 45.724 6 44.916ZM9 46V42.91C10.176 42.707 11.26 42.154 12.121 41.293L12.146 41.268C14.108 42.403 16.325 43 18.605 43H19V46C19 48.757 16.757 51 14 51C11.243 51 9 48.757 9 46ZM15.964 52.714L14 55.333L12.036 52.714C12.66 52.897 13.318 53 14 53C14.682 53 15.34 52.897 15.964 52.714ZM26 60H2V58.976C2 57.641 2.859 56.486 4.138 56.103L10.619 54.158L14 58.667L17.381 54.159L23.862 56.104C25.141 56.486 26 57.641 26 58.976V60Z" fill="#CDAC69"/>
<path d="M58.437 54.187L58 54.056V40C58 34.486 53.514 30 48 30C42.486 30 38 34.486 38 40V54.056L37.563 54.187C35.432 54.826 34 56.751 34 58.976V62H62V58.976C62 56.751 60.568 54.826 58.437 54.187ZM52 52.256V51.737C53.001 51.037 53.807 50.082 54.331 48.967C54.936 48.916 55.501 48.734 56 48.44V53.456L52 52.256ZM50 53C50 54.103 49.103 55 48 55C46.897 55 46 54.103 46 53V52.705C46.634 52.895 47.305 53 48 53C48.695 53 49.366 52.895 50 52.705V53ZM41.041 46.744C40.424 46.404 40 45.754 40 45.001C40 44.264 40.405 43.626 41 43.279V46C41 46.252 41.015 46.5 41.041 46.744ZM43 43H43.395C45.676 43 47.893 42.403 49.854 41.268L49.879 41.293C50.731 42.145 51.801 42.696 53 42.904V46C53 48.757 50.757 51 48 51C45.243 51 43 48.757 43 46V43ZM55 46V43.242C55.157 43.328 55.307 43.43 55.438 43.56C55.8 43.922 56 44.403 56 44.991C56 45.748 55.576 46.4 54.96 46.743C54.985 46.498 55 46.251 55 46ZM48 32C52.411 32 56 35.589 56 40V41.521C55.412 41.191 54.744 41 54.005 41C54.003 41 54.002 41 54 41C52.978 41 52.016 40.602 51.293 39.879L50.127 38.713L49.445 39.168C47.647 40.367 45.555 41 43.395 41H42C41.268 41 40.591 41.212 40 41.557V40C40 35.589 43.589 32 48 32ZM40 48.444C40.499 48.735 41.063 48.916 41.669 48.967C42.194 50.082 42.999 51.037 44 51.737V52.256L40 53.456V48.444ZM36 58.976C36 57.641 36.859 56.486 38.138 56.103L44.228 54.276C44.658 55.542 45.695 56.519 47 56.858V60H36V58.976ZM60 60H49V56.858C50.305 56.519 51.342 55.542 51.772 54.276L57.862 56.103C59.141 56.486 60 57.641 60 58.976V60Z" fill="#CDAC69"/>
<path d="M15.311 23.971L17.709 29.965L22.48 24H38.585L44.364 29.779L46.688 23.97C50.779 23.62 54 20.179 54 16C54 12.698 51.928 9.722 48.886 8.542C48.173 3.701 43.954 0 39 0C36.673 0 34.535 0.806 32.834 2.143C30.836 0.76 28.442 0 26 0C20.864 0 16.294 3.311 14.65 8.123C10.881 8.768 8 12.05 8 16C8 20.179 11.221 23.62 15.311 23.971ZM16 10C19.309 10 22 12.691 22 16H24C24 11.866 20.848 8.455 16.822 8.042C18.384 4.43 21.983 2 26 2C27.931 2 29.761 2.541 31.359 3.563C29.89 5.304 29 7.549 29 10H31C31 5.589 34.589 2 39 2C43.142 2 46.641 5.234 46.967 9.363L47.021 10.051L47.684 10.244C50.225 10.986 52 13.353 52 16C52 19.309 49.309 22 46 22H45.323L43.635 26.221L39.414 22H21.52L18.291 26.035L16.677 22H16C12.691 22 10 19.309 10 16C10 12.691 12.691 10 16 10Z" fill="#CDAC69"/>
<path d="M24 18H22V20H24V18Z" fill="#CDAC69"/>
<path d="M40 18H26V20H40V18Z" fill="#CDAC69"/>
<path d="M40 14H26V16H40V14Z" fill="#CDAC69"/>
</svg>
