<svg width="60" height="60" viewBox="0 0 60 60" fill="none" xmlns="http://www.w3.org/2000/svg">
<path d="M28 45H27C26.448 45 26 44.552 26 44V35.934C26 35.638 26.132 35.354 26.36 35.166L32.294 30.232C32.474 30.082 32.7 30 32.934 30H47.076C47.628 30 48.076 30.448 48.076 31C48.076 31.552 47.628 32 47.076 32H33.294L28 36.404V43C29.654 43 31 41.654 31 40V39C31 38.622 31.214 38.276 31.552 38.106L35.552 36.106C36.046 35.86 36.646 36.06 36.894 36.554C37.142 37.048 36.94 37.648 36.446 37.896L33 39.618V40C33 42.756 30.756 45 28 45Z" fill="#CDAC69"/>
<path d="M30.728 59.8339C29.832 59.8339 28.936 59.4939 28.254 58.8099L27.478 58.0259C27.09 57.6339 27.094 56.9999 27.486 56.6119C27.88 56.2219 28.512 56.2259 28.9 56.6199L29.672 57.3999C30.254 57.9819 31.204 57.9819 31.79 57.3959C32.376 56.8099 32.374 55.8579 31.79 55.2739L31.436 54.9199C31.046 54.5299 31.046 53.8959 31.438 53.5059C31.826 53.1179 32.46 53.1159 32.852 53.5059L34.62 55.2739C35.202 55.8579 36.156 55.8579 36.742 55.2739C37.326 54.6899 37.326 53.7359 36.742 53.1519L34.974 51.3839C34.778 51.1879 34.682 50.9319 34.682 50.6759C34.682 50.4199 34.78 50.1639 34.974 49.9679C35.364 49.5779 35.998 49.5779 36.388 49.9679L39.57 53.1499C40.154 53.7319 41.104 53.7339 41.692 53.1499C42.272 52.5699 42.276 51.6319 41.708 51.0459L38.508 47.8479C38.118 47.4579 38.118 46.8239 38.508 46.4339C38.898 46.0439 39.532 46.0439 39.922 46.4339L43.104 49.6159L43.13 49.6419L44.518 51.0299C45.102 51.6139 46.056 51.6139 46.64 51.0299C47.224 50.4459 47.224 49.4939 46.64 48.9079L35.37 37.6379C34.98 37.2479 34.98 36.6139 35.37 36.2239C35.76 35.8339 36.394 35.8339 36.784 36.2239L48.054 47.4939C49.418 48.8579 49.418 51.0779 48.054 52.4439C46.954 53.5439 45.302 53.7579 43.984 53.0839C43.824 53.6259 43.53 54.1379 43.104 54.5639C42.004 55.6639 40.35 55.8759 39.034 55.2059C38.874 55.7479 38.58 56.2599 38.154 56.6859C37.054 57.7839 35.402 57.9999 34.084 57.3259C33.924 57.8679 33.63 58.3799 33.204 58.8059C32.52 59.4919 31.624 59.8339 30.728 59.8339Z" fill="#CDAC69"/>
<path d="M23 32H9C8.448 32 8 31.552 8 31C8 30.448 8.448 30 9 30H23C23.552 30 24 30.448 24 31C24 31.552 23.552 32 23 32Z" fill="#CDAC69"/>
<path d="M9 50H1C0.448 50 0 49.552 0 49C0 48.448 0.448 48 1 48H8V30H1C0.448 30 0 29.552 0 29C0 28.448 0.448 28 1 28H9C9.552 28 10 28.448 10 29V49C10 49.552 9.552 50 9 50Z" fill="#CDAC69"/>
<path d="M59 50H51C50.448 50 50 49.552 50 49V29C50 28.448 50.448 28 51 28H59C59.552 28 60 28.448 60 29C60 29.552 59.552 30 59 30H52V48H59C59.552 48 60 48.448 60 49C60 49.552 59.552 50 59 50Z" fill="#CDAC69"/>
<path d="M24.242 58.8641C23.986 58.8641 23.73 58.7661 23.534 58.5721C22.17 57.2061 22.17 54.9881 23.534 53.6221C24.9 52.2581 27.118 52.2581 28.484 53.6221C29.59 54.7281 29.826 56.4541 29.06 57.8161C28.788 58.2941 28.178 58.4661 27.698 58.1961C27.218 57.9241 27.046 57.3161 27.318 56.8341C27.648 56.2501 27.546 55.5121 27.07 55.0381C26.486 54.4541 25.53 54.4541 24.948 55.0381C24.364 55.6221 24.364 56.5761 24.948 57.1601C25.338 57.5501 25.338 58.1841 24.948 58.5741C24.754 58.7661 24.498 58.8641 24.242 58.8641Z" fill="#CDAC69"/>
<path d="M20 56.036C19.744 56.036 19.488 55.938 19.292 55.744C18.63 55.084 18.266 54.204 18.266 53.27C18.266 52.336 18.63 51.456 19.292 50.796L20 50.086C21.324 48.764 23.63 48.766 24.95 50.086C25.612 50.748 25.976 51.626 25.976 52.56C25.976 53.496 25.612 54.374 24.95 55.034C24.56 55.424 23.926 55.424 23.536 55.034C23.146 54.644 23.146 54.01 23.536 53.62C23.82 53.336 23.976 52.96 23.976 52.56C23.976 52.16 23.82 51.782 23.536 51.5C22.97 50.934 21.982 50.934 21.414 51.5L20.706 52.208C20.422 52.492 20.266 52.868 20.266 53.268C20.266 53.668 20.422 54.046 20.706 54.328C21.096 54.718 21.096 55.352 20.706 55.742C20.512 55.938 20.256 56.036 20 56.036Z" fill="#CDAC69"/>
<path d="M15.758 53.208C15.502 53.208 15.246 53.11 15.05 52.916C14.388 52.254 14.024 51.376 14.024 50.442C14.024 49.506 14.388 48.628 15.05 47.968L16.464 46.554C17.784 45.234 20.09 45.232 21.414 46.554C22.076 47.214 22.44 48.094 22.44 49.028C22.44 49.962 22.076 50.842 21.414 51.502C21.024 51.892 20.39 51.892 20 51.502C19.61 51.112 19.61 50.478 20 50.088C20.284 49.804 20.44 49.428 20.44 49.028C20.44 48.628 20.284 48.25 20 47.968C19.434 47.402 18.446 47.402 17.878 47.968L16.464 49.382C16.18 49.666 16.024 50.042 16.024 50.442C16.024 50.842 16.18 51.22 16.464 51.502C16.854 51.892 16.854 52.526 16.464 52.916C16.27 53.11 16.014 53.208 15.758 53.208Z" fill="#CDAC69"/>
<path d="M17.172 48.2579C16.916 48.2579 16.66 48.1599 16.464 47.9659C16.074 47.5759 16.074 46.9419 16.464 46.5519C17.048 45.9679 17.048 45.0139 16.464 44.4299C15.878 43.8439 14.926 43.8459 14.342 44.4299C13.898 44.8739 13.778 45.5539 14.042 46.1219C14.274 46.6219 14.056 47.2159 13.556 47.4499C13.058 47.6859 12.462 47.4639 12.228 46.9639C11.612 45.6379 11.894 44.0499 12.928 43.0159C14.296 41.6499 16.514 41.6519 17.878 43.0159C19.242 44.3819 19.242 46.5999 17.878 47.9659C17.684 48.1599 17.428 48.2579 17.172 48.2579Z" fill="#CDAC69"/>
<path d="M27 32C27.5523 32 28 31.5523 28 31C28 30.4477 27.5523 30 27 30C26.4477 30 26 30.4477 26 31C26 31.5523 26.4477 32 27 32Z" fill="#CDAC69"/>
<path d="M29.97 24C23.352 24 17.97 18.618 17.97 12C17.97 5.382 23.352 0 29.97 0C32.306 0 34.572 0.672 36.522 1.944C36.984 2.246 37.114 2.866 36.812 3.328C36.512 3.792 35.892 3.922 35.428 3.618C33.806 2.56 31.918 2 29.97 2C24.456 2 19.97 6.486 19.97 12C19.97 17.514 24.456 22 29.97 22C35.484 22 39.97 17.514 39.97 12C39.97 11.474 39.928 10.95 39.848 10.442C39.764 9.898 40.136 9.384 40.682 9.298C41.226 9.212 41.738 9.584 41.826 10.132C41.922 10.744 41.97 11.372 41.97 12.002C41.97 18.618 36.588 24 29.97 24Z" fill="#CDAC69"/>
<path d="M30 16C29.744 16 29.488 15.902 29.292 15.708L24.292 10.708C23.902 10.318 23.902 9.68396 24.292 9.29396C24.682 8.90396 25.316 8.90396 25.706 9.29396L30 13.586L41.292 2.29396C41.682 1.90396 42.316 1.90396 42.706 2.29396C43.096 2.68396 43.096 3.31796 42.706 3.70796L30.706 15.708C30.512 15.902 30.256 16 30 16Z" fill="#CDAC69"/>
<path d="M55 24C55.5523 24 56 23.5523 56 23C56 22.4477 55.5523 22 55 22C54.4477 22 54 22.4477 54 23C54 23.5523 54.4477 24 55 24Z" fill="#CDAC69"/>
<path d="M51 24C51.5523 24 52 23.5523 52 23C52 22.4477 51.5523 22 51 22C50.4477 22 50 22.4477 50 23C50 23.5523 50.4477 24 51 24Z" fill="#CDAC69"/>
<path d="M47 24C47.5523 24 48 23.5523 48 23C48 22.4477 47.5523 22 47 22C46.4477 22 46 22.4477 46 23C46 23.5523 46.4477 24 47 24Z" fill="#CDAC69"/>
<path d="M13 24C13.5523 24 14 23.5523 14 23C14 22.4477 13.5523 22 13 22C12.4477 22 12 22.4477 12 23C12 23.5523 12.4477 24 13 24Z" fill="#CDAC69"/>
<path d="M9 24C9.55228 24 10 23.5523 10 23C10 22.4477 9.55228 22 9 22C8.44772 22 8 22.4477 8 23C8 23.5523 8.44772 24 9 24Z" fill="#CDAC69"/>
<path d="M5 24C5.55228 24 6 23.5523 6 23C6 22.4477 5.55228 22 5 22C4.44772 22 4 22.4477 4 23C4 23.5523 4.44772 24 5 24Z" fill="#CDAC69"/>
</svg>
