<svg width="65" height="64" viewBox="0 0 65 64" fill="none" xmlns="http://www.w3.org/2000/svg">
<g clip-path="url(#clip0_20_144)">
<path d="M9.5 36C9.23478 36 8.98043 35.8946 8.79289 35.7071C8.60536 35.5196 8.5 35.2652 8.5 35V15C8.5 14.7348 8.60536 14.4804 8.79289 14.2929C8.98043 14.1054 9.23478 14 9.5 14C9.76522 14 10.0196 14.1054 10.2071 14.2929C10.3946 14.4804 10.5 14.7348 10.5 15V35C10.5 35.2652 10.3946 35.5196 10.2071 35.7071C10.0196 35.8946 9.76522 36 9.5 36Z" fill="#CDAC69"/>
<path d="M59.5 51H39.5C39.2348 51 38.9804 50.8946 38.7929 50.7071C38.6054 50.5196 38.5 50.2652 38.5 50C38.5 49.7348 38.6054 49.4804 38.7929 49.2929C38.9804 49.1054 39.2348 49 39.5 49H59.5C60.2956 49 61.0587 48.6839 61.6213 48.1213C62.1839 47.5587 62.5 46.7956 62.5 46V18C62.5 17.7348 62.6054 17.4804 62.7929 17.2929C62.9804 17.1054 63.2348 17 63.5 17C63.7652 17 64.0196 17.1054 64.2071 17.2929C64.3946 17.4804 64.5 17.7348 64.5 18V46C64.4984 47.3256 63.9711 48.5964 63.0338 49.5338C62.0964 50.4711 60.8256 50.9984 59.5 51Z" fill="#CDAC69"/>
<path d="M63.5 19H12.5C11.4391 19 10.4217 18.5786 9.67157 17.8284C8.92143 17.0783 8.5 16.0609 8.5 15C8.5 13.9391 8.92143 12.9217 9.67157 12.1716C10.4217 11.4214 11.4391 11 12.5 11H63.5C63.7652 11 64.0196 11.1054 64.2071 11.2929C64.3946 11.4804 64.5 11.7348 64.5 12C64.5 12.2652 64.3946 12.5196 64.2071 12.7071C64.0196 12.8946 63.7652 13 63.5 13H12.5C11.9696 13 11.4609 13.2107 11.0858 13.5858C10.7107 13.9609 10.5 14.4696 10.5 15C10.5 15.5304 10.7107 16.0391 11.0858 16.4142C11.4609 16.7893 11.9696 17 12.5 17H63.5C63.7652 17 64.0196 17.1054 64.2071 17.2929C64.3946 17.4804 64.5 17.7348 64.5 18C64.5 18.2652 64.3946 18.5196 64.2071 18.7071C64.0196 18.8946 63.7652 19 63.5 19Z" fill="#CDAC69"/>
<path d="M63.5 16H14.5C14.2348 16 13.9804 15.8946 13.7929 15.7071C13.6054 15.5196 13.5 15.2652 13.5 15C13.5 14.7348 13.6054 14.4804 13.7929 14.2929C13.9804 14.1054 14.2348 14 14.5 14H63.5C63.7652 14 64.0196 14.1054 64.2071 14.2929C64.3946 14.4804 64.5 14.7348 64.5 15C64.5 15.2652 64.3946 15.5196 64.2071 15.7071C64.0196 15.8946 63.7652 16 63.5 16Z" fill="#CDAC69"/>
<path d="M63.5 37H43.5C43.2348 37 42.9804 36.8946 42.7929 36.7071C42.6054 36.5196 42.5 36.2652 42.5 36V28C42.5 27.7348 42.6054 27.4804 42.7929 27.2929C42.9804 27.1054 43.2348 27 43.5 27H63.5C63.7652 27 64.0196 27.1054 64.2071 27.2929C64.3946 27.4804 64.5 27.7348 64.5 28V36C64.5 36.2652 64.3946 36.5196 64.2071 36.7071C64.0196 36.8946 63.7652 37 63.5 37ZM44.5 35H62.5V29H44.5V35Z" fill="#CDAC69"/>
<path d="M49.5 33C50.0523 33 50.5 32.5523 50.5 32C50.5 31.4477 50.0523 31 49.5 31C48.9477 31 48.5 31.4477 48.5 32C48.5 32.5523 48.9477 33 49.5 33Z" fill="#CDAC69"/>
<path d="M28.5 37C24.027 37 19.5 35.626 19.5 33C19.5 30.374 24.027 29 28.5 29C32.973 29 37.5 30.374 37.5 33C37.5 35.626 32.973 37 28.5 37ZM28.5 31C23.953 31 21.5 32.419 21.5 33C21.5 33.581 23.953 35 28.5 35C33.047 35 35.5 33.581 35.5 33C35.5 32.419 33.047 31 28.5 31Z" fill="#CDAC69"/>
<path d="M28.5 41C24.027 41 19.5 39.626 19.5 37V33H21.5V37C21.5 37.581 23.953 39 28.5 39C33.047 39 35.5 37.581 35.5 37V33H37.5V37C37.5 39.626 32.973 41 28.5 41Z" fill="#CDAC69"/>
<path d="M28.5 45C24.027 45 19.5 43.626 19.5 41V37H21.5V41C21.5 41.581 23.953 43 28.5 43C33.047 43 35.5 41.581 35.5 41V37H37.5V41C37.5 43.626 32.973 45 28.5 45Z" fill="#CDAC69"/>
<path d="M28.5 49C24.027 49 19.5 47.626 19.5 45V41H21.5V45C21.5 45.581 23.953 47 28.5 47C33.047 47 35.5 45.581 35.5 45V41H37.5V45C37.5 47.626 32.973 49 28.5 49Z" fill="#CDAC69"/>
<path d="M28.5 53C24.027 53 19.5 51.626 19.5 49V45H21.5V49C21.5 49.581 23.953 51 28.5 51C33.047 51 35.5 49.581 35.5 49V45H37.5V49C37.5 51.626 32.973 53 28.5 53Z" fill="#CDAC69"/>
<path d="M9.5 45C5.027 45 0.5 43.626 0.5 41C0.5 38.374 5.027 37 9.5 37C13.973 37 18.5 38.374 18.5 41C18.5 43.626 13.973 45 9.5 45ZM9.5 39C4.953 39 2.5 40.419 2.5 41C2.5 41.581 4.953 43 9.5 43C14.047 43 16.5 41.581 16.5 41C16.5 40.419 14.047 39 9.5 39Z" fill="#CDAC69"/>
<path d="M9.5 49C5.027 49 0.5 47.626 0.5 45V41H2.5V45C2.5 45.581 4.953 47 9.5 47C14.047 47 16.5 45.581 16.5 45V41H18.5V45C18.5 47.626 13.973 49 9.5 49Z" fill="#CDAC69"/>
<path d="M9.5 53C5.027 53 0.5 51.626 0.5 49V45H2.5V49C2.5 49.581 4.953 51 9.5 51C14.047 51 16.5 49.581 16.5 49V45H18.5V49C18.5 51.626 13.973 53 9.5 53Z" fill="#CDAC69"/>
</g>
<defs>
<clipPath id="clip0_20_144">
<rect width="64" height="64" fill="white" transform="translate(0.5)"/>
</clipPath>
</defs>
</svg>
