<svg width="65" height="64" viewBox="0 0 65 64" fill="none" xmlns="http://www.w3.org/2000/svg">
<path d="M32.4999 12.1221C28.0106 12.1221 23.7741 13.5826 20.2483 16.3454C19.8408 16.6648 19.7693 17.2542 20.0887 17.6616C20.4082 18.0691 20.9976 18.1404 21.4048 17.8212C24.5973 15.3193 28.4339 13.9969 32.4999 13.9969C42.4269 13.9969 50.5029 22.0731 50.5029 31.9999C50.5029 37.0486 48.4132 41.6176 45.0543 44.8898V40.3338C45.0543 37.0318 42.368 34.3456 39.066 34.3456H35.9628V31.4948C35.9628 31.4403 35.9572 31.3872 35.9483 31.3353C37.4833 30.2501 38.4883 28.4628 38.4883 26.4441V21.3933C38.4883 18.7876 36.3684 16.6677 33.7627 16.6677H31.2373C28.6316 16.6677 26.5117 18.7876 26.5117 21.3933V26.4441C26.5117 28.4628 27.5168 30.2501 29.0517 31.3353C29.0428 31.3873 29.0372 31.4403 29.0372 31.4948V34.3456H25.9341C22.6321 34.3456 19.9457 37.0318 19.9457 40.3338V44.8898C16.5868 41.6176 14.4971 37.0486 14.4971 31.9999C14.4971 27.8757 15.8538 23.9958 18.4204 20.7794C18.7433 20.3748 18.6772 19.7849 18.2724 19.4619C17.8677 19.1391 17.2778 19.2052 16.9548 19.6101C14.1201 23.1621 12.6219 27.4463 12.6219 32.0001C12.6219 42.9609 21.5392 51.8781 32.4999 51.8781C43.4607 51.8781 52.3779 42.9609 52.3779 32.0001C52.3779 21.0392 43.4608 12.1221 32.4999 12.1221ZM28.3866 21.3933C28.3866 19.8216 29.6653 18.5427 31.2372 18.5427H33.7626C35.3344 18.5427 36.6132 19.8214 36.6132 21.3933V22.8909C36.0619 22.7904 35.3594 22.5787 34.7871 22.1328C34.5418 21.9417 34.2176 21.8847 33.9218 21.9807C32.1606 22.5518 30.3026 22.8807 28.3866 22.9616V21.3933ZM28.3866 24.8376C30.3391 24.7618 32.2396 24.4492 34.0531 23.9041C34.9404 24.4587 35.9137 24.6911 36.6133 24.7881V26.4442C36.6133 28.7123 34.7681 30.5574 32.4999 30.5574C30.2318 30.5574 28.3866 28.7122 28.3866 26.4442V24.8376ZM30.9121 32.2171C31.4182 32.3564 31.9502 32.4324 32.4999 32.4324C33.0497 32.4324 33.5818 32.3564 34.0878 32.2171V34.3456H30.9121V32.2171ZM26.8714 49.1009V42.8593C26.8714 42.3414 26.4517 41.9218 25.9339 41.9218C25.4162 41.9218 24.9964 42.3414 24.9964 42.8593V48.3628C23.8691 47.8438 22.8042 47.2117 21.8162 46.4809C21.8188 46.4526 21.8206 46.4239 21.8206 46.3948V40.3339C21.8206 38.0658 23.6658 36.2207 25.9339 36.2207H39.0661C41.3342 36.2207 43.1794 38.0659 43.1794 40.3339V46.3948C43.1794 46.4239 43.1812 46.4526 43.1838 46.4809C42.1959 47.2117 41.1311 47.8438 40.0036 48.3628V42.8593C40.0036 42.3414 39.5838 41.9218 39.0661 41.9218C38.5483 41.9218 38.1286 42.3414 38.1286 42.8593V49.1009C36.3569 49.6856 34.4649 50.0031 32.5001 50.0031C30.5352 50.0031 28.6431 49.6856 26.8714 49.1009Z" fill="#CDAC69"/>
<path d="M55.5599 15.2297C55.7873 14.6769 55.9136 14.0721 55.9136 13.4382C55.9136 10.8325 53.7938 8.71262 51.188 8.71262C50.5461 8.71262 49.934 8.84175 49.3755 9.07463C47.2658 6.35 44.831 4.18412 42.1278 2.632C39.0858 0.885625 35.8465 0 32.5 0C29.1535 0 25.9142 0.885625 22.8722 2.63212C20.169 4.18425 17.7343 6.35 15.6245 9.07475C15.066 8.84188 14.4539 8.71275 13.812 8.71275C11.2063 8.71275 9.08638 10.8326 9.08638 13.4384C9.08638 14.0723 9.21275 14.677 9.44013 15.2299C3.66825 19.752 0.5 25.6801 0.5 32C0.5 35.3465 1.3855 38.5858 3.13212 41.6276C4.68425 44.3309 6.85 46.7656 9.57463 48.8754C9.34175 49.4339 9.21262 50.046 9.21262 50.6879C9.21262 53.2936 11.3325 55.4136 13.9382 55.4136C14.5721 55.4136 15.1769 55.2873 15.7297 55.0599C20.252 60.8316 26.18 64 32.5 64C38.8199 64 44.748 60.8316 49.2702 55.06C49.8231 55.2874 50.4279 55.4137 51.0617 55.4137C53.6675 55.4137 55.7874 53.2938 55.7874 50.688C55.7874 50.0461 55.6583 49.434 55.4254 48.8755C58.15 46.7658 60.3159 44.331 61.8679 41.6278C63.6145 38.5858 64.5 35.3465 64.5 32C64.5 25.6801 61.3317 19.752 55.5599 15.2297ZM51.0617 45.9624C48.456 45.9624 46.3361 48.0822 46.3361 50.688C46.3361 51.0554 46.3796 51.4125 46.4594 51.756C42.1726 53.4195 37.3666 54.2962 32.5 54.2962C27.6334 54.2962 22.8274 53.4195 18.5406 51.756C18.6204 51.4125 18.6639 51.0554 18.6639 50.688C18.6639 48.0822 16.544 45.9624 13.9382 45.9624C13.546 45.9624 13.1651 46.0112 12.8004 46.1017C11.0999 41.7817 10.2037 36.9269 10.2037 32C10.2037 27.1333 11.0805 22.3273 12.7441 18.0408C13.0876 18.1204 13.4447 18.164 13.812 18.164C16.4178 18.164 18.5376 16.044 18.5376 13.4382C18.5376 13.046 18.4888 12.665 18.3983 12.3004C22.7185 10.6 27.5734 9.70375 32.5 9.70375C37.4266 9.70375 42.2815 10.6 46.6017 12.3004C46.5112 12.665 46.4624 13.046 46.4624 13.4382C46.4624 16.044 48.5822 18.164 51.188 18.164C51.5554 18.164 51.9125 18.1205 52.2559 18.0408C53.9195 22.3273 54.7962 27.1333 54.7962 32C54.7962 36.9269 53.9001 41.7817 52.1996 46.1017C51.8349 46.0112 51.454 45.9624 51.0617 45.9624ZM54.0386 13.4382C54.0386 15.0101 52.7599 16.289 51.188 16.289C49.6161 16.289 48.3374 15.0103 48.3374 13.4382C48.3374 11.8665 49.6161 10.5876 51.188 10.5876C52.7599 10.5876 54.0386 11.8665 54.0386 13.4382ZM32.5 1.875C38.2465 1.875 43.6569 4.79938 47.8191 10.1286C47.6723 10.2781 47.5348 10.4369 47.4086 10.6047C42.8405 8.78775 37.7054 7.82875 32.5 7.82875C27.2946 7.82875 22.1595 8.78787 17.5914 10.6047C17.4653 10.4369 17.3278 10.2781 17.1809 10.1286C21.3431 4.79938 26.7535 1.875 32.5 1.875ZM13.812 10.5876C15.3839 10.5876 16.6626 11.8664 16.6626 13.4382C16.6626 15.0101 15.3839 16.289 13.812 16.289C12.2401 16.289 10.9614 15.0103 10.9614 13.4382C10.9614 11.8665 12.2401 10.5876 13.812 10.5876ZM2.375 32C2.375 26.3111 5.24925 20.9409 10.4874 16.7929C10.6582 16.9622 10.8422 17.1181 11.0372 17.2601C9.26437 21.7878 8.32875 26.8645 8.32875 32C8.32875 37.2056 9.28787 42.3407 11.1046 46.9087C10.9369 47.0349 10.7781 47.1724 10.6286 47.3191C5.29938 43.1567 2.375 37.7464 2.375 32ZM11.0876 50.688C11.0876 49.1162 12.3664 47.8374 13.9382 47.8374C15.5101 47.8374 16.7889 49.1161 16.7889 50.688C16.7889 52.2599 15.5101 53.5387 13.9382 53.5387C12.3664 53.5387 11.0876 52.2599 11.0876 50.688ZM32.5 62.125C26.811 62.125 21.4409 59.2508 17.2929 54.0126C17.4622 53.8418 17.6181 53.6577 17.76 53.4629C22.2878 55.2356 27.3645 56.1714 32.5 56.1714C37.6355 56.1714 42.7122 55.2358 47.24 53.4629C47.3819 53.6577 47.5378 53.8417 47.7071 54.0127C43.5591 59.2507 38.1889 62.125 32.5 62.125ZM51.0617 53.5387C49.4899 53.5387 48.2111 52.26 48.2111 50.688C48.2111 49.1162 49.4899 47.8374 51.0617 47.8374C52.6336 47.8374 53.9124 49.1161 53.9124 50.688C53.9124 52.2599 52.6335 53.5387 51.0617 53.5387ZM54.3714 47.3191C54.2219 47.1723 54.0631 47.0348 53.8954 46.9086C55.7122 42.3406 56.6714 37.2055 56.6714 31.9999C56.6714 26.8644 55.7358 21.7876 53.9629 17.26C54.1579 17.1181 54.3419 16.9621 54.5127 16.7927C59.7507 20.9409 62.625 26.3111 62.625 32C62.625 37.7464 59.7006 43.1567 54.3714 47.3191Z" fill="#CDAC69"/>
</svg>
