<svg width="65" height="64" viewBox="0 0 65 64" fill="none" xmlns="http://www.w3.org/2000/svg">
<path d="M53.7441 8.79963C48.0696 3.125 40.525 0 32.5 0C24.475 0 16.9304 3.125 11.2559 8.79963C5.58148 14.474 2.45636 22.0186 2.45636 30.0436V48.8409H4.33611V30.0436C4.33611 14.5139 16.9704 1.87975 32.5 1.87975C48.0296 1.87975 60.6639 14.514 60.6639 30.0436C60.6639 45.5732 48.0296 58.2076 32.5 58.2076C25.8177 58.2224 19.5231 55.8921 14.3987 51.6362L4.33611 61.6989V50.7206H2.45636V64H4.69336L14.5536 54.1399C19.7656 58.0337 25.9524 60.0874 32.5 60.0874C40.525 60.0874 48.0696 56.9624 53.7441 51.2878C59.4185 45.6134 62.5436 38.0686 62.5436 30.0436C62.5436 22.0186 59.4185 14.474 53.7441 8.79963V8.79963Z" fill="#CDAC69"/>
<path d="M16.5222 9.36658H18.402V11.2463H16.5222V9.36658Z" fill="#CDAC69"/>
<path d="M20.2817 9.36658H22.1615V11.2463H20.2817V9.36658Z" fill="#CDAC69"/>
<path d="M14.6495 34.7566V35.6964C14.6495 38.8008 17.175 41.3263 20.2794 41.3263C23.3837 41.3263 25.9092 38.8008 25.9092 35.6964V34.7566H24.7576L21.6041 23.1333C22.2206 22.8037 22.7009 22.2517 22.9372 21.5851H31.5599V40.3917H28.7402C26.149 40.3917 24.0408 42.4998 24.0408 45.0911V46.0309H40.9583V45.0911C40.9583 42.4998 38.8502 40.3917 36.259 40.3917H33.4394V21.5852H42.0622C42.2986 22.2518 42.7788 22.8038 43.3953 23.1334L40.2418 34.7567H39.0902V35.6966C39.0902 38.8009 41.6157 41.3264 44.7201 41.3264C47.8245 41.3264 50.35 38.8009 50.35 35.6966V34.7567H49.1983L46.0449 23.1334C46.9335 22.6583 47.5397 21.7214 47.5397 20.6453C47.5397 19.0906 46.2748 17.8257 44.7201 17.8257C43.4948 17.8257 42.4502 18.6116 42.0622 19.7054H33.4394V17.8204H31.56V19.7054H22.9373C22.5493 18.6116 21.5046 17.8257 20.2795 17.8257C18.7247 17.8257 17.4599 19.0906 17.4599 20.6453C17.4599 21.7214 18.0661 22.6583 18.9547 23.1334L15.8012 34.7567H14.6495V34.7566ZM38.9178 44.1512H26.0819C26.4699 43.0571 27.515 42.2714 28.7404 42.2714H36.2592C37.4847 42.2714 38.53 43.0571 38.9178 44.1512ZM44.7205 39.4466C42.9771 39.4466 41.5079 38.2507 41.0895 36.6363H48.3513C47.9332 38.2507 46.464 39.4466 44.7205 39.4466V39.4466ZM42.19 34.7566L44.7206 25.4292L47.2512 34.7566H42.19ZM44.7205 19.7054C45.2387 19.7054 45.6603 20.1271 45.6603 20.6453C45.6603 21.1636 45.2387 21.5852 44.7205 21.5852C44.2022 21.5852 43.7806 21.1636 43.7806 20.6453C43.7806 20.1271 44.2022 19.7054 44.7205 19.7054ZM20.2794 39.4466C18.536 39.4466 17.0667 38.2507 16.6483 36.6363H23.9102C23.4921 38.2507 22.0229 39.4466 20.2794 39.4466ZM20.2794 19.7054C20.7976 19.7054 21.2192 20.1271 21.2192 20.6453C21.2192 21.1636 20.7976 21.5852 20.2794 21.5852C19.7611 21.5852 19.3395 21.1636 19.3395 20.6453C19.3395 20.1271 19.7611 19.7054 20.2794 19.7054ZM20.2794 25.4292L22.81 34.7566H17.7487L20.2794 25.4292Z" fill="#CDAC69"/>
</svg>
