<svg width="22" height="22" viewBox="0 0 22 22" fill="none" xmlns="http://www.w3.org/2000/svg">
<path d="M21.0448 16.52C20.3892 15.9703 16.5448 13.5358 15.9058 13.6475C15.6058 13.7008 15.3763 13.9565 14.762 14.6893C14.4779 15.0499 14.166 15.3877 13.829 15.6995C13.2116 15.5504 12.614 15.3288 12.0485 15.0395C9.83096 13.9599 8.03947 12.1679 6.9605 9.95C6.67118 9.38455 6.44964 8.78691 6.3005 8.1695C6.6123 7.83252 6.95009 7.52056 7.31075 7.2365C8.04275 6.62225 8.29925 6.39425 8.3525 6.09275C8.46425 5.45225 6.0275 1.60925 5.48 0.95375C5.2505 0.68225 5.042 0.5 4.775 0.5C4.001 0.5 0.5 4.829 0.5 5.39C0.5 5.43575 0.575 9.9425 6.26675 15.7333C12.0575 21.425 16.5642 21.5 16.61 21.5C17.171 21.5 21.5 17.999 21.5 17.225C21.5 16.958 21.3177 16.7495 21.0448 16.52Z" fill="#CD6969"/>
<path d="M16.25 10.25H17.75C17.7482 8.65925 17.1155 7.13416 15.9907 6.00933C14.8658 4.8845 13.3408 4.25179 11.75 4.25V5.75C12.9431 5.75119 14.087 6.22568 14.9307 7.06933C15.7743 7.91299 16.2488 9.05689 16.25 10.25Z" fill="#CD6969"/>
<path d="M20 10.25H21.5C21.497 7.66505 20.4688 5.18683 18.641 3.359C16.8132 1.53116 14.3349 0.502977 11.75 0.5V2C13.9372 2.00258 16.0342 2.8726 17.5808 4.41922C19.1274 5.96584 19.9974 8.06276 20 10.25Z" fill="#CD6969"/>
</svg>
