<svg width="58" height="64" viewBox="0 0 58 64" fill="none" xmlns="http://www.w3.org/2000/svg">
<path d="M22.3213 35.1822C22.3209 34.6645 21.9008 34.245 21.3832 34.2454L15.8374 34.2492C14.5962 34.2932 14.5983 36.0825 15.8388 36.1242L21.3846 36.1204C21.9023 36.12 22.3217 35.7 22.3213 35.1822Z" fill="#CDAC69"/>
<path d="M17.8846 26.4614V24.0625C17.8846 23.5447 17.4648 23.125 16.9471 23.125H10.4601C9.94233 23.125 9.52258 23.5447 9.52258 24.0625V26.4614C9.75271 32.0017 17.6563 31.9975 17.8846 26.4614ZM16.0096 26.4614C15.8826 29.5137 11.5233 29.5114 11.3976 26.4614V25H16.0096V26.4614Z" fill="#CDAC69"/>
<path d="M23.5185 30.6366C25.8238 30.6366 27.6994 28.7636 27.6994 26.4614V24.0625C27.6994 23.5447 27.2797 23.125 26.7619 23.125H20.275C19.7572 23.125 19.3375 23.5447 19.3375 24.0625V26.4614C19.3375 28.7636 21.2131 30.6366 23.5185 30.6366ZM21.2125 25H25.8245V26.4614C25.6975 29.5137 21.3383 29.5114 21.2125 26.4614V25Z" fill="#CDAC69"/>
<path d="M13.7034 27.3989C14.9099 27.3989 14.9119 25.5239 13.7034 25.5239C12.4971 25.5239 12.4951 27.3989 13.7034 27.3989Z" fill="#CDAC69"/>
<path d="M23.5184 27.3989C24.7249 27.3989 24.7269 25.5239 23.5184 25.5239C22.3119 25.5239 22.3099 27.3989 23.5184 27.3989Z" fill="#CDAC69"/>
<path d="M18.611 51.1587C17.4045 51.1587 17.4025 53.0337 18.611 53.0337C19.8175 53.0337 19.8195 51.1587 18.611 51.1587Z" fill="#CDAC69"/>
<path d="M18.611 54.7651C17.4045 54.7651 17.4025 56.6401 18.611 56.6401C19.8175 56.6401 19.8195 54.7651 18.611 54.7651Z" fill="#CDAC69"/>
<path d="M18.611 60.2466C19.8175 60.2466 19.8195 58.3716 18.611 58.3716C17.4045 58.3716 17.4025 60.2466 18.611 60.2466Z" fill="#CDAC69"/>
<path d="M33.8061 52.3995C33.2882 52.3995 32.8686 52.8193 32.8686 53.337V61.7038C32.8686 62.9699 33.8999 64 35.1678 64H50.5545C50.8002 64 51.043 63.8999 51.2168 63.7261L57.2081 57.7478C57.3826 57.5733 57.4834 57.331 57.4834 57.0841V35.3444C57.4834 34.0783 56.452 33.0482 55.1841 33.0482H50.8578V32.2109C50.8675 30.1039 48.3698 28.9258 46.7574 30.2531C45.8939 29.5129 44.458 29.5131 43.5945 30.2531C41.9813 28.9256 39.4847 30.1044 39.4943 32.2109V33.0482H35.1678C33.8999 33.0482 32.8686 34.0783 32.8686 35.3444V43.309H25.3888C24.7352 42.3157 23.4935 42.4532 22.7375 43.1743V42.2357C27.7669 40.4675 31.1447 35.3741 30.7864 29.8281C33.6204 30.0177 35.6894 27.0839 34.1924 24.5618V20.911C35.8138 20.9773 37.2223 19.676 37.2223 18.0391C37.2223 16.4556 35.9339 15.1673 34.3504 15.1673H32.3272V3.78787C32.3272 1.69925 30.6276 0 28.5384 0H8.68361C6.59449 0 4.89487 1.69925 4.89487 3.78787V15.1673H2.87174C1.28825 15.1673 0 16.4556 0 18.0391C0 19.676 1.40837 20.9773 3.02974 20.911V24.562C1.53175 27.0884 3.60374 30.0106 6.43586 29.8282C6.07749 35.3744 9.45536 40.4675 14.4848 42.2358V43.1742C13.7286 42.4535 12.4871 42.3157 11.8335 43.3092C10.9847 43.3092 10.1249 43.3092 9.28673 43.3092C4.60612 43.3092 0.798248 47.1159 0.798248 51.7952V63.0624C0.798248 64.2355 2.67324 64.289 2.67324 63.0624V51.795C2.67324 49.017 4.39712 46.6354 6.83099 45.6585L5.11561 49.8762C5.01299 50.1284 5.02512 50.4127 5.14887 50.6553L11.6931 63.4883C12.2287 64.5386 13.9193 63.7265 13.3633 62.6365L7.01399 50.1855L8.60248 46.2793C8.87311 45.614 9.51198 45.1842 10.2301 45.1842H11.568V50.854C11.568 51.7682 12.3942 52.5324 13.3033 52.462L14.8672 63.1976C15.0432 64.4054 16.8991 64.1395 16.7227 62.9274L15.0521 51.459L18.613 48.778L22.242 51.5126L20.4936 62.9204C20.3191 64.0591 22.1518 64.478 22.347 63.2044L23.9926 52.4668C24.8853 52.4933 25.6538 51.7338 25.6538 50.8539V45.184H26.9852C27.7034 45.184 28.3423 45.6139 28.6128 46.2793L30.2014 50.1855L23.852 62.6365C23.3208 63.6779 24.9596 64.5921 25.5222 63.4883L32.0664 50.6553C32.1901 50.4128 32.2022 50.1284 32.0997 49.8762C32.0997 49.8762 30.2304 45.3092 30.1616 45.184H32.8683V47.7015C32.8683 48.2193 33.2879 48.639 33.8058 48.639C34.3237 48.639 34.7433 48.2193 34.7433 47.7015V35.3444C34.7433 35.1122 34.9336 34.9232 35.1676 34.9232H39.494V35.7863C39.4843 37.8933 41.9819 39.0714 43.5943 37.7442C44.4578 38.4843 45.8937 38.4842 46.7572 37.7442C48.3704 39.0717 50.867 37.8928 50.8575 35.7863V34.9232H55.1839C55.4178 34.9232 55.6081 35.1122 55.6081 35.3444V56.1465H51.916C50.6482 56.1465 49.6168 57.1766 49.6168 58.4428V62.1249H35.1677C34.9338 62.1249 34.7434 61.9359 34.7434 61.7036V53.3369C34.7436 52.8193 34.3238 52.3995 33.8061 52.3995ZM31.2019 27.9531H30.7863V24.7371C31.7793 24.6307 32.8099 25.2458 32.8099 26.3451C32.8099 27.2317 32.0886 27.9531 31.2019 27.9531ZM32.3172 23.0463C31.8299 22.8812 31.2988 22.833 30.7862 22.8621V20.9108H32.3172V23.0463ZM6.76986 12.7993H9.27536C10.5167 12.7564 10.5157 10.967 9.27536 10.9244H6.76986V3.78787C6.76986 2.73312 7.62836 1.875 8.68361 1.875H28.5383C29.5936 1.875 30.4521 2.73312 30.4521 3.78787V10.9244H14.963C13.7216 10.9674 13.7226 12.7567 14.963 12.7993H30.4522V15.1672H6.76986V12.7993ZM1.87487 18.039C1.87487 17.4893 2.322 17.0422 2.87162 17.0422H34.3503C34.8999 17.0422 35.3472 17.4893 35.3472 18.039C35.3472 18.5886 34.9001 19.0358 34.3503 19.0358H2.87174C2.32212 19.0358 1.87487 18.5886 1.87487 18.039ZM6.43574 20.9108V22.8621C5.92311 22.833 5.39186 22.8811 4.90462 23.0463V20.9108H6.43574ZM6.02011 27.9531C5.13349 27.9531 4.41212 27.2317 4.41212 26.3451C4.41212 25.257 5.44561 24.6417 6.43574 24.7371V27.9531H6.02011ZM8.31073 30.7901V20.9108H28.9112V30.7901C28.9117 36.4687 24.2836 41.0877 18.603 41.0784C12.9279 41.0784 8.31073 36.4632 8.31073 30.7901ZM13.4431 50.3233V44.7399L17.075 47.5889L13.4431 50.3233ZM16.3597 44.6449V42.7454C17.0871 42.8815 17.8367 42.9534 18.603 42.9534H18.619C19.3852 42.9534 20.1348 42.8814 20.8622 42.7454V44.6465L18.613 46.4125L16.3597 44.6449ZM23.779 44.7403V50.323L20.1508 47.5889L23.779 44.7403ZM42.013 36.4302C41.658 36.4302 41.3693 36.1413 41.3693 35.7863V32.2109C41.3964 31.3597 42.6302 31.3604 42.657 32.2109V35.7863C42.6569 36.1413 42.3682 36.4302 42.013 36.4302ZM45.1759 36.4302C44.8208 36.4302 44.532 36.1413 44.532 35.7863V32.2109C44.5592 31.3597 45.793 31.3603 45.8199 32.2109V35.7863C45.8198 36.1413 45.5309 36.4302 45.1759 36.4302ZM48.9827 35.7863C48.9555 36.6376 47.7217 36.6369 47.6948 35.7863V32.2109C47.7219 31.3597 48.9558 31.3603 48.9827 32.2109V35.7863ZM51.916 58.0215H54.2789L51.4919 60.8025V58.4426C51.4919 58.2105 51.6822 58.0215 51.916 58.0215Z" fill="#CDAC69"/>
<path d="M40.3912 59.5311C40.9939 59.528 41.3887 59.0069 41.3287 58.4253C42.2195 58.0946 42.8974 57.3105 43.063 56.3261C43.2704 55.094 42.6045 53.9812 41.406 53.5569C40.8648 53.3653 40.1999 53.1113 39.8602 52.8444C39.6764 52.6607 39.978 52.2662 40.1344 52.219C40.4612 52.1205 40.8705 52.208 41.0679 52.3423C42.1822 53.0267 43.1908 51.9593 42.3399 50.9647C42.1377 50.7779 41.785 50.5535 41.3287 50.4165C41.3288 49.0659 39.3874 49.1197 39.4537 50.4714C38.7028 50.7529 38.1493 51.4202 37.9934 52.2458C37.8398 53.0608 38.1112 53.8552 38.7017 54.3187C39.2515 54.7507 40.0258 55.0574 40.7804 55.3244C41.1248 55.4463 41.2707 55.6785 41.214 56.0148C41.1702 56.2751 40.9462 56.7168 40.3849 56.7205C39.789 56.7251 39.6484 56.7025 39.2145 56.4183C38.7814 56.1345 38.2003 56.2555 37.9165 56.6889C37.6328 57.122 37.7541 57.7031 38.1872 57.9868C38.6635 58.2988 39.0425 58.4561 39.4537 58.5319C39.4228 59.0703 39.8492 59.533 40.3912 59.5311Z" fill="#CDAC69"/>
<path d="M38.4259 42.8525H51.9259C53.1672 42.8095 53.1662 41.02 51.9259 40.9775H38.4259C37.1845 41.0205 37.1854 42.8099 38.4259 42.8525Z" fill="#CDAC69"/>
<path d="M38.4259 46.8782H51.9259C53.1672 46.8352 53.1662 45.0457 51.9259 45.0032H38.4259C37.1845 45.0462 37.1854 46.8357 38.4259 46.8782Z" fill="#CDAC69"/>
</svg>
