<svg width="15" height="10" viewBox="0 0 15 10" fill="none" xmlns="http://www.w3.org/2000/svg">
<path d="M5.75 6.66667L2.25 3.33333L0.5 5L5.75 10L14.5 1.66667L12.75 0L5.75 6.66667Z" fill="white"/>
</svg>
