<svg width="24" height="24" viewBox="0 0 24 24" fill="none" xmlns="http://www.w3.org/2000/svg">
<path d="M21.7031 9.79688H23.9892C23.9963 9.64205 24 9.50077 24 9.375C24 7.95661 23.5062 6.93642 22.5324 6.3427C21.9878 6.01064 21.3019 5.81034 20.3829 5.72325L22.0248 2.98678C22.2246 2.65378 22.1167 2.22188 21.7837 2.02209C21.4507 1.82222 21.0188 1.93022 20.819 2.26327L19.875 3.83648V1.875C19.875 1.48669 19.5602 1.17188 19.1719 1.17188C18.7836 1.17188 18.4688 1.48669 18.4688 1.875V3.83648L17.5248 2.26322C17.325 1.93022 16.893 1.82236 16.5601 2.02205C16.2271 2.22183 16.1191 2.65373 16.3189 2.98673L17.9608 5.7232C17.0418 5.81025 16.356 6.01059 15.8114 6.34266C14.8375 6.93642 14.3438 7.95661 14.3438 9.375C14.3438 11.4228 15.3079 17.7287 16.8506 20.7981C17.5373 22.1641 18.2965 22.8281 19.1719 22.8281C20.0472 22.8281 20.8065 22.1641 21.4931 20.7981C21.8655 20.0571 22.2205 19.1027 22.5525 17.9531H20.9531C20.5648 17.9531 20.25 17.6383 20.25 17.25C20.25 16.8617 20.5648 16.5469 20.9531 16.5469H22.9236C23.08 15.8988 23.2222 15.2338 23.3483 14.5781H21.3281C20.9398 14.5781 20.625 14.2633 20.625 13.875C20.625 13.4867 20.9398 13.1719 21.3281 13.1719H23.5973C23.7113 12.4672 23.8033 11.7986 23.8703 11.2031H21.7031C21.3148 11.2031 21 10.8883 21 10.5C21 10.1117 21.3148 9.79688 21.7031 9.79688Z" fill="#0C7DFF"/>
<path d="M12.9375 9.37493C12.9375 8.33393 13.1535 7.51582 13.477 6.87354C12.1469 6.32173 10.6318 6.26609 9.22903 6.75828C9.08822 5.6689 8.5718 3.68721 6.68944 2.74606C6.34209 2.57229 5.91975 2.7132 5.74613 3.06049C5.5725 3.40779 5.71327 3.83018 6.06061 4.00381C7.2428 4.5949 7.65478 5.88017 7.79831 6.71445C3.93417 5.45726 0 8.35718 0 12.3749C0 13.9694 0.714609 16.2277 1.82058 18.1284C2.59744 19.4634 4.21603 21.7031 6.32812 21.7031C7.29567 21.7031 7.917 21.4637 8.57812 21.1045C9.23925 21.4637 9.86058 21.7031 10.8281 21.7031C12.4623 21.7031 13.8009 20.3623 14.6829 19.1371C13.6381 15.9029 12.9375 11.2999 12.9375 9.37493Z" fill="#0C7DFF"/>
</svg>
