<svg width="24" height="24" viewBox="0 0 24 24" fill="none" xmlns="http://www.w3.org/2000/svg">
<path fill-rule="evenodd" clip-rule="evenodd" d="M13.1956 8.29929C13.5826 7.90527 14.2158 7.89956 14.6098 8.28655L18.7007 12.2866C18.8922 12.4746 19 12.7317 19 13C19 13.2683 18.8922 13.5254 18.7007 13.7134L14.6098 17.7134C14.2158 18.1004 13.5826 18.0947 13.1956 17.7007C12.8087 17.3067 12.8144 16.6735 13.2084 16.2866L15.5547 14L6 14C5.44772 14 5 13.5523 5 13C5 12.4477 5.44772 12 6 12L15.5547 12L13.2084 9.71345C12.8144 9.32646 12.8087 8.69332 13.1956 8.29929Z" fill="#78909C"/>
</svg>
