<svg width="20" height="21" viewBox="0 0 20 21" fill="none" xmlns="http://www.w3.org/2000/svg">
<path d="M19.1578 0.687887C18.442 0.565796 17.7171 0.502951 16.9907 0.500004C14.5124 0.497992 12.0857 1.20167 10 2.52716C7.90892 1.21907 5.48264 0.532667 3.00928 0.549447C2.28289 0.552394 1.55801 0.615239 0.842151 0.73733C0.607668 0.777357 0.395324 0.898967 0.243359 1.08026C0.0913926 1.26155 0.00979153 1.49061 0.0132507 1.72619V13.5925C0.0111118 13.7378 0.0413396 13.8817 0.101783 14.0141C0.162227 14.1466 0.251401 14.2642 0.36296 14.3586C0.474519 14.453 0.605722 14.5219 0.747233 14.5604C0.888743 14.5989 1.03708 14.606 1.1817 14.5813C2.61282 14.336 4.07906 14.3767 5.49404 14.701C6.90903 15.0254 8.24415 15.6269 9.42077 16.47L9.54061 16.5393H9.65046C9.76122 16.5849 9.88002 16.6085 10 16.6085C10.12 16.6085 10.2388 16.5849 10.3495 16.5393H10.4594L10.5792 16.47C11.7476 15.608 13.0789 14.9871 14.4942 14.644C15.9094 14.3008 17.3799 14.2426 18.8183 14.4725C18.9629 14.4973 19.1113 14.4901 19.2528 14.4516C19.3943 14.4131 19.5255 14.3442 19.637 14.2498C19.7486 14.1554 19.8378 14.0378 19.8982 13.9054C19.9587 13.773 19.9889 13.629 19.9867 13.4837V1.61741C19.9764 1.3921 19.8885 1.17708 19.7377 1.00802C19.587 0.83895 19.3824 0.725994 19.1578 0.687887ZM9.00133 13.8298C7.15366 12.8673 5.09702 12.365 3.00928 12.3663C2.67971 12.3663 2.35015 12.3663 2.0106 12.3663V2.47772C2.34322 2.45874 2.67666 2.45874 3.00928 2.47772C5.13983 2.47539 7.2239 3.09446 9.00133 4.25766V13.8298ZM17.9894 12.4058C17.6498 12.4058 17.3203 12.4058 16.9907 12.4058C14.903 12.4046 12.8463 12.9069 10.9987 13.8693V4.25766C12.7761 3.09446 14.8602 2.47539 16.9907 2.47772C17.3233 2.45874 17.6568 2.45874 17.9894 2.47772V12.4058ZM19.1578 16.5096C18.442 16.3875 17.7171 16.3247 16.9907 16.3217C14.5124 16.3197 12.0857 17.0234 10 18.3489C7.91428 17.0234 5.48762 16.3197 3.00928 16.3217C2.28289 16.3247 1.55801 16.3875 0.842151 16.5096C0.712151 16.53 0.587511 16.5757 0.4754 16.644C0.363288 16.7123 0.265917 16.8018 0.188884 16.9075C0.111852 17.0132 0.0566785 17.1329 0.0265368 17.2598C-0.00360488 17.3866 -0.00812012 17.5182 0.0132507 17.6468C0.064002 17.9036 0.215473 18.13 0.434482 18.2764C0.653492 18.4228 0.922184 18.4773 1.1817 18.428C2.61282 18.1826 4.07906 18.2233 5.49404 18.5477C6.90903 18.8721 8.24415 19.4735 9.42077 20.3167C9.58991 20.4359 9.79237 20.5 10 20.5C10.2076 20.5 10.4101 20.4359 10.5792 20.3167C11.7558 19.4735 13.091 18.8721 14.506 18.5477C15.9209 18.2233 17.3872 18.1826 18.8183 18.428C19.0778 18.4773 19.3465 18.4228 19.5655 18.2764C19.7845 18.13 19.936 17.9036 19.9867 17.6468C20.0081 17.5182 20.0036 17.3866 19.9735 17.2598C19.9433 17.1329 19.8881 17.0132 19.8111 16.9075C19.7341 16.8018 19.6367 16.7123 19.5246 16.644C19.4125 16.5757 19.2878 16.53 19.1578 16.5096V16.5096Z" fill="#78909C"/>
</svg>
