<svg width="0" height="0" class="hidden">
  <symbol xmlns="http://www.w3.org/2000/svg" xmlns:xlink="http://www.w3.org/1999/xlink" version="1.1" x="0" y="0" xml:space="preserve" viewBox="0 0 512 512" id="logo">
    <g>
      <path d="M195 362h-20c-19.3 0-35 15.7-35 35v80c0 19.3 15.7 35 35 35h20c19.3 0 35-15.7 35-35v-80c0-19.3-15.7-35-35-35zm5 115c0 2.758-2.242 5-5 5h-20c-2.758 0-5-2.242-5-5v-80c0-2.758 2.242-5 5-5h20c2.758 0 5 2.242 5 5zM75 482H60V377c0-8.285-6.715-15-15-15H15c-8.285 0-15 6.715-15 15s6.715 15 15 15h15v90H15c-8.285 0-15 6.715-15 15s6.715 15 15 15h60c8.285 0 15-6.715 15-15s-6.715-15-15-15zM475 362h-20c-19.3 0-35 15.7-35 35v80c0 19.3 15.7 35 35 35h20c19.3 0 35-15.7 35-35v-80c0-19.3-15.7-35-35-35zm5 115c0 2.758-2.242 5-5 5h-20c-2.758 0-5-2.242-5-5v-80c0-2.758 2.242-5 5-5h20c2.758 0 5 2.242 5 5zM355 482h-15V377c0-8.285-6.715-15-15-15h-30c-8.285 0-15 6.715-15 15s6.715 15 15 15h15v90h-15c-8.285 0-15 6.715-15 15s6.715 15 15 15h60c8.285 0 15-6.715 15-15s-6.715-15-15-15zM195 181h-20c-19.3 0-35 15.7-35 35v80c0 19.3 15.7 35 35 35h20c19.3 0 35-15.7 35-35v-80c0-19.3-15.7-35-35-35zm5 115c0 2.758-2.242 5-5 5h-20c-2.758 0-5-2.242-5-5v-80c0-2.758 2.242-5 5-5h20c2.758 0 5 2.242 5 5zM75 301H60V196c0-8.285-6.715-15-15-15H15c-8.285 0-15 6.715-15 15s6.715 15 15 15h15v90H15c-8.285 0-15 6.715-15 15s6.715 15 15 15h60c8.285 0 15-6.715 15-15s-6.715-15-15-15zM335 181h-20c-19.3 0-35 15.7-35 35v80c0 19.3 15.7 35 35 35h20c19.3 0 35-15.7 35-35v-80c0-19.3-15.7-35-35-35zm5 115c0 2.758-2.242 5-5 5h-20c-2.758 0-5-2.242-5-5v-80c0-2.758 2.242-5 5-5h20c2.758 0 5 2.242 5 5zM495 301h-15V196c0-8.285-6.715-15-15-15h-30c-8.285 0-15 6.715-15 15s6.715 15 15 15h15v90h-15c-8.285 0-15 6.715-15 15s6.715 15 15 15h60c8.285 0 15-6.715 15-15s-6.715-15-15-15zM55 0H35C15.7 0 0 15.7 0 35v80c0 19.3 15.7 35 35 35h20c19.3 0 35-15.7 35-35V35C90 15.7 74.3 0 55 0zm5 115c0 2.758-2.242 5-5 5H35c-2.758 0-5-2.242-5-5V35c0-2.758 2.242-5 5-5h20c2.758 0 5 2.242 5 5zM215 120h-15V15c0-8.285-6.715-15-15-15h-30c-8.285 0-15 6.715-15 15s6.715 15 15 15h15v90h-15c-8.285 0-15 6.715-15 15s6.715 15 15 15h60c8.285 0 15-6.715 15-15s-6.715-15-15-15zM475 0h-20c-19.3 0-35 15.7-35 35v80c0 19.3 15.7 35 35 35h20c19.3 0 35-15.7 35-35V35c0-19.3-15.7-35-35-35zm5 115c0 2.758-2.242 5-5 5h-20c-2.758 0-5-2.242-5-5V35c0-2.758 2.242-5 5-5h20c2.758 0 5 2.242 5 5zM355 120h-15V15c0-8.285-6.715-15-15-15h-30c-8.285 0-15 6.715-15 15s6.715 15 15 15h15v90h-15c-8.285 0-15 6.715-15 15s6.715 15 15 15h60c8.285 0 15-6.715 15-15s-6.715-15-15-15zm0 0" fill="#f86f03" opacity="1" data-original="#000000"></path>
    </g>
  </symbol>
  <symbol fill="none" xmlns="http://www.w3.org/2000/svg" viewBox="0 0 50 50" id="gitlab">
    <g clip-path="url(#clip0_603_7)">
      <path d="M2.89599 19.6922L0.0936502 28.3023C-0.160158 29.0842 0.113963 29.9472 0.78408 30.4346L25.0001 48.0306L17.2495 32.81L2.89599 19.6922ZM47.1044 19.6922L49.9067 28.3023C50.1605 29.0842 49.8864 29.9472 49.2163 30.4346L25.0003 48.0305L33.5171 29.9783L47.1044 19.6922Z" fill="#FFA100"></path>
      <path d="M25 48.0305L24.9999 30.5891L15.7907 19.6921L9.34835 16.4868L2.89581 19.6921L25 48.0305ZM25 48.0305L25.0001 29.5342L34.2093 19.6921L41.1787 16.4868L47.1042 19.6921L25 48.0305Z" fill="#FF6D18"></path>
      <path d="M25 48.0305L34.2092 19.6921H15.7908L25 48.0305Z" fill="#FC3819"></path>
      <path d="M2.8959 19.6924H15.801L10.247 2.62441C9.9627 1.75117 8.72393 1.75117 8.4295 2.62441L2.8959 19.6924ZM47.1041 19.6924H34.199L39.7429 2.62441C40.0272 1.75117 41.2659 1.75117 41.5604 2.62441L47.1041 19.6924Z" fill="#FC3819"></path>
    </g>
    <defs>
      <clipPath id="clip0_603_7">
        <rect width="50" height="50" fill="white"></rect>
      </clipPath>
    </defs>
  </symbol>
  <symbol fill="none" xmlns="http://www.w3.org/2000/svg" viewBox="0 0 50 50" id="telegram">
    <path d="M25 50C38.8071 50 50 38.8071 50 25C50 11.1929 38.8071 0 25 0C11.1929 0 0 11.1929 0 25C0 38.8071 11.1929 50 25 50Z" fill="#039BE5"></path>
    <path d="M11.4396 24.4583L35.5437 15.1646C36.6625 14.7604 37.6396 15.4375 37.2771 17.1292L37.2792 17.1271L33.175 36.4625C32.8708 37.8333 32.0562 38.1667 30.9167 37.5208L24.6667 32.9146L21.6521 35.8188C21.3187 36.1521 21.0375 36.4333 20.3917 36.4333L20.8354 30.0729L32.4187 19.6083C32.9229 19.1646 32.3062 18.9146 31.6417 19.3563L17.3271 28.3688L11.1562 26.4438C9.81666 26.0188 9.7875 25.1042 11.4396 24.4583Z" fill="white"></path>
  </symbol>
  <symbol fill="none" xmlns="http://www.w3.org/2000/svg" viewBox="0 0 50 50" id="whatsapp">
    <g clip-path="url(#clip0_603_17)">
      <path d="M25.0062 0H24.9938C11.2094 0 0 11.2125 0 25C0 30.4688 1.7625 35.5375 4.75938 39.6531L1.64375 48.9406L11.2531 45.8688C15.2063 48.4875 19.9219 50 25.0062 50C38.7906 50 50 38.7844 50 25C50 11.2156 38.7906 0 25.0062 0Z" fill="#4CAF50"></path>
      <path d="M39.5531 35.3031C38.95 37.0062 36.5563 38.4187 34.6469 38.8312C33.3406 39.1094 31.6344 39.3312 25.8906 36.95C18.5438 33.9062 13.8125 26.4406 13.4438 25.9562C13.0906 25.4719 10.475 22.0031 10.475 18.4156C10.475 14.8281 12.2969 13.0812 13.0313 12.3312C13.6344 11.7156 14.6313 11.4344 15.5875 11.4344C15.8969 11.4344 16.175 11.45 16.425 11.4625C17.1594 11.4937 17.5281 11.5375 18.0125 12.6969C18.6156 14.15 20.0844 17.7375 20.2594 18.1062C20.4375 18.475 20.6156 18.975 20.3656 19.4594C20.1313 19.9594 19.925 20.1812 19.5563 20.6062C19.1875 21.0312 18.8375 21.3562 18.4688 21.8125C18.1313 22.2094 17.75 22.6344 18.175 23.3687C18.6 24.0875 20.0688 26.4844 22.2313 28.4094C25.0219 30.8937 27.2844 31.6875 28.0938 32.025C28.6969 32.275 29.4156 32.2156 29.8563 31.7469C30.4156 31.1437 31.1063 30.1437 31.8094 29.1594C32.3094 28.4531 32.9406 28.3656 33.6031 28.6156C34.2781 28.85 37.85 30.6156 38.5844 30.9812C39.3188 31.35 39.8031 31.525 39.9813 31.8344C40.1563 32.1437 40.1563 33.5969 39.5531 35.3031Z" fill="#FAFAFA"></path>
    </g>
    <defs>
      <clipPath id="clip0_603_17">
        <rect width="50" height="50" fill="white"></rect>
      </clipPath>
    </defs>
  </symbol>
  <symbol xmlns="http://www.w3.org/2000/svg" xmlns:xlink="http://www.w3.org/1999/xlink" version="1.1" x="0" y="0" xml:space="preserve" viewBox="0 0 480.026 480.026" id="arrow">
    <g>
      <path d="m475.922 229.325-144-160c-3.072-3.392-7.36-5.312-11.904-5.312h-96a16.052 16.052 0 0 0-14.624 9.472c-2.56 5.792-1.504 12.544 2.72 17.216l134.368 149.312-134.368 149.28c-4.224 4.704-5.312 11.456-2.72 17.216 2.592 5.792 8.32 9.504 14.624 9.504h96c4.544 0 8.832-1.952 11.904-5.28l144-160c5.472-6.08 5.472-15.36 0-21.408z" fill="#170550" opacity="1" data-original="#000000"></path>
      <path d="m267.922 229.325-144-160c-3.072-3.392-7.36-5.312-11.904-5.312h-96a16.052 16.052 0 0 0-14.624 9.472c-2.56 5.792-1.504 12.544 2.72 17.216l134.368 149.312L4.114 389.293c-4.224 4.704-5.312 11.456-2.72 17.216 2.592 5.792 8.32 9.504 14.624 9.504h96c4.544 0 8.832-1.952 11.904-5.28l144-160c5.472-6.08 5.472-15.36 0-21.408z" fill="#170550" opacity="1" data-original="#000000"></path>
    </g>
  </symbol>
   <symbol xmlns="http://www.w3.org/2000/svg" xmlns:xlink="http://www.w3.org/1999/xlink" version="1.1" x="0" y="0" xml:space="preserve" viewBox="0 0 24 24" id="star">
    <g>
      <path fill="#ffc107" d="m23.363 8.584-7.378-1.127L12.678.413c-.247-.526-1.11-.526-1.357 0L8.015 7.457.637 8.584a.75.75 0 0 0-.423 1.265l5.36 5.494-1.267 7.767a.75.75 0 0 0 1.103.777L12 20.245l6.59 3.643a.75.75 0 0 0 1.103-.777l-1.267-7.767 5.36-5.494a.75.75 0 0 0-.423-1.266z" opacity="1" data-original="#ffc107"></path>
    </g>
  </symbol>
  <symbol xmlns="http://www.w3.org/2000/svg" xmlns:xlink="http://www.w3.org/1999/xlink" version="1.1" x="0" y="0" xml:space="preserve" viewBox="0 0 512 512" id="html">
    <g>
      <path d="m32 0 40.8 460.8L256 512l183.136-51.168L480 0z" fill="#ff5722" data-original="#ff5722"></path>
      <path d="M391.52 150.688H176.8l5.12 57.888H386.4l-15.392 173.568L256 414.24l-.096.032-114.944-32.128-8.032-90.784h56.32l4.192 47.104 62.496 16.992.064-.032 62.56-16.992 6.528-73.312H130.624L115.456 94.208H396.512z" fill="#fafafa" data-original="#fafafa"></path>
    </g>
  </symbol>
  <symbol xmlns="http://www.w3.org/2000/svg" xmlns:xlink="http://www.w3.org/1999/xlink" version="1.1" x="0" y="0" xml:space="preserve" viewBox="0 0 512 512" id="css">
    <g>
      <path d="m32 0 40.8 460.8L256 512l183.136-51.168L480 0z" fill="#2196f3" data-original="#2196f3"></path>
      <path d="m392.768 150.688-5.152 57.888-15.552 173.536L256 414.208l-.096.032-116-32.128-8.096-90.752h56.832l4.224 47.072 63.072 17.024.032-.032 63.168-17.024 8.608-78.432-198.656.544-5.632-53.632 209.056-2.464 4.224-57.408-218.88.608-3.68-53.408h283.648z" fill="#fafafa" data-original="#fafafa"></path>
    </g>
  </symbol>
  <symbol xmlns="http://www.w3.org/2000/svg" xmlns:xlink="http://www.w3.org/1999/xlink" version="1.1" x="0" y="0" xml:space="preserve" viewBox="0 0 512 512" id="sass">
    <g>
      <path fill="#cc6699" fill-rule="evenodd" d="M256.001 0C397.385 0 512 114.616 512 256c0 141.385-114.615 256-255.999 256C114.616 512 0 397.385 0 256 0 114.616 114.616 0 256.001 0z" clip-rule="evenodd" opacity="1" data-original="#cc6699"></path>
      <path fill="#ffffff" d="M416.581 109.572C404.988 64.105 329.6 49.158 258.249 74.507c-42.462 15.086-88.431 38.762-121.483 69.678-39.299 36.758-45.566 68.752-42.983 82.12 9.112 47.171 73.746 78.004 100.315 100.88v.139c-7.835 3.856-65.177 32.876-78.597 62.545-14.16 31.299 2.254 53.759 13.121 56.782 33.669 9.368 68.219-7.482 86.787-35.176 17.917-26.727 16.426-61.241 8.639-78.408 10.741-2.834 23.264-4.104 39.178-2.245 44.907 5.245 53.718 33.285 52.033 45.019-1.684 11.736-11.103 18.188-14.253 20.135-3.149 1.949-4.111 2.624-3.846 4.072.382 2.105 1.84 2.027 4.525 1.572 3.697-.623 23.582-9.546 24.431-31.207 1.083-27.503-25.273-58.266-71.939-57.463-19.219.332-31.304 2.16-40.034 5.408a93.264 93.264 0 0 0-1.981-2.191c-28.85-30.781-82.184-52.554-79.922-93.934.823-15.044 6.052-54.657 102.48-102.707 78.992-39.361 142.229-28.53 153.157-4.525 15.611 34.295-33.797 98.037-115.829 107.232-31.254 3.504-47.711-8.61-51.805-13.121-4.31-4.75-4.952-4.964-6.561-4.073-2.621 1.452-.96 5.645 0 8.144 2.45 6.374 12.5 17.678 29.636 23.301 15.074 4.947 51.769 7.664 96.148-9.501 49.702-19.225 88.515-72.707 77.115-117.411zM205.125 341.275c3.724 13.777 3.316 26.625-.532 38.26-3.06 9.254-8.322 17.645-14.89 24.811-14.874 16.227-35.656 22.362-44.567 17.193-9.623-5.578-4.803-28.457 12.443-46.686 18.552-19.612 45.245-32.222 45.245-32.222l-.04-.08c.768-.414 1.549-.84 2.341-1.276z" opacity="1" data-original="#ffffff"></path>
    </g>
  </symbol>
  <symbol xmlns="http://www.w3.org/2000/svg" xmlns:xlink="http://www.w3.org/1999/xlink" version="1.1" x="0" y="0" xml:space="preserve" viewBox="0 0 512 512" id="js">
    <g>
      <path fill="#ffdf00" d="M0 0h512v512H0z" opacity="1" data-original="#ffdf00"></path>
      <path d="M343.934 400.002c10.313 16.839 23.731 29.216 47.462 29.216 19.935 0 32.67-9.964 32.67-23.731 0-16.498-13.084-22.341-35.027-31.939l-12.028-5.161c-34.719-14.791-57.783-33.321-57.783-72.493 0-36.084 27.494-63.553 70.461-63.553 30.59 0 52.582 10.646 68.429 38.522l-37.465 24.056c-8.249-14.791-17.148-20.618-30.964-20.618-14.092 0-23.024 8.94-23.024 20.618 0 14.434 8.94 20.277 29.582 29.217l12.028 5.152c40.879 17.53 63.959 35.401 63.959 75.581 0 43.317-34.028 67.048-79.726 67.048-44.682 0-73.549-21.293-87.674-49.201zm-169.96 4.169c7.558 13.41 14.434 24.747 30.964 24.747 15.807 0 25.779-6.185 25.779-30.232V235.089h48.112v164.246c0 49.818-29.208 72.493-71.843 72.493-38.522 0-60.83-19.936-72.176-43.947z" fill="#000000" opacity="1" data-original="#000000"></path>
    </g>
  </symbol>
   <symbol xmlns="http://www.w3.org/2000/svg" xmlns:xlink="http://www.w3.org/1999/xlink" version="1.1" x="0" y="0" xml:space="preserve" viewBox="0 0 512 512" id="bootstrap">
    <g>
      <g fill="#5e3b7f">
        <path d="M320.837 285.783c-8.868-8.031-21.082-11.88-36.978-11.88h-92.444v93.365h92.444c15.895 0 28.277-4.099 36.978-12.382 8.784-8.199 13.218-19.911 13.218-34.97 0-14.808-4.35-26.102-13.218-34.133zM308.12 225.631c8.366-7.195 12.549-17.401 12.549-30.787 0-15.059-3.765-25.684-11.294-31.791s-18.405-9.202-32.628-9.202h-85.333v82.489h85.333c12.55 0 23.007-3.514 31.373-10.709z" fill="#ffffff" opacity="1" data-original="#5e3b7f"></path>
        <path d="M426.667 0H85.333C38.4 0 0 38.4 0 85.333v341.333C0 473.6 38.4 512 85.333 512h341.333C473.6 512 512 473.6 512 426.667V85.333C512 38.4 473.6 0 426.667 0zm-46.599 359.488c-4.183 10.206-10.708 18.991-19.66 26.353-8.951 7.362-20.329 13.218-34.3 17.569-13.971 4.35-30.536 6.525-49.778 6.525H139.127V111.268h145.15c26.771 0 48.272 6.107 64.418 18.405s24.261 30.787 24.261 55.634c0 15.059-3.681 27.942-11.043 38.651s-17.903 19.075-31.624 24.931v.837c18.405 3.932 32.377 12.633 41.83 26.102 9.453 13.553 14.222 30.452 14.222 50.865.001 11.712-2.09 22.672-6.273 32.795z" fill="#ffffff" opacity="1" data-original="#5e3b7f"></path>
      </g>
    </g>
  </symbol>
  <symbol xmlns="http://www.w3.org/2000/svg" xmlns:xlink="http://www.w3.org/1999/xlink" version="1.1" x="0" y="0" xml:space="preserve" viewBox="0 0 152 152" id="git">
    <g>
      <g>
        <g>
          <circle cx="76" cy="76" r="76" fill="#f15233" opacity="1" data-original="#f15233"></circle>
          <g fill="#fff">
            <path d="M72 56.44a24.58 24.58 0 0 1-9.12 2c-9-5.26-21.24.22-21.24 11.74 0 4.3 2.71 10.18 6.94 11.62v.2c-3.14 1.4-4 8.58.17 11.16v.17c-4.57 1.52-7.58 4.46-7.58 9.53 0 8.73 8.17 11.16 15.32 11.16 8.71 0 15.19-3.17 15.19-12.89 0-12-16.91-7.55-16.91-14 0-2.29 1.2-3.17 3.29-3.62 7-1.3 11.31-6.78 11.31-13.94a10.27 10.27 0 0 0-.67-3.56A30.91 30.91 0 0 0 72 65zM56.32 98c2.85 0 6.9.51 6.9 4.24s-3.26 4.46-6.31 4.46c-2.9 0-7.25-.46-7.25-4.27S53.36 98 56.32 98zm-.53-22c-3.69 0-5.24-2.2-5.24-5.73 0-8.36 10.21-8.28 10.21-.08 0 3.44-1.34 5.82-5 5.82zM110.83 92.71V84.4a9.06 9.06 0 0 1-4.9 1.41c-3.1 0-3.65-3.06-3.65-5.57V64.79c5.31 0 8.54.17 8.54.17V56.9h-8.54a48.11 48.11 0 0 1 .25-7H93a41.64 41.64 0 0 1 .25 7h-4V65a13.27 13.27 0 0 1 4-.17V65h-.05v14.83c0 7.38 1 14.54 10 14.54a16.13 16.13 0 0 0 7.62-1.66zM80.72 38a6.2 6.2 0 0 0 0 12.37c3.23 0 5.66-3 5.66-6.14S84 38 80.72 38zM76.05 56.86c.3 2.51.27 33.88 0 37h9.3c-.27-3-.3-34.47 0-36.95z" fill="#ffffff" opacity="1" data-original="#ffffff"></path>
          </g>
        </g>
      </g>
    </g>
  </symbol>
  <symbol xmlns="http://www.w3.org/2000/svg" xmlns:xlink="http://www.w3.org/1999/xlink" version="1.1" x="0" y="0" xml:space="preserve" viewBox="0 0 512 512" id="node">
    <g>
      <path d="M512 256c0 141.385-114.615 256-256 256-130.445 0-238.101-97.562-253.973-223.702A257.45 257.45 0 0 1 0 256c0-20.041 2.299-39.549 6.656-58.264C33.029 84.428 134.656 0 256 0c121.041 0 222.469 84.01 249.135 196.901a254.539 254.539 0 0 1 6.51 45.641A250.4 250.4 0 0 1 512 256z" fill="#f2f2f2" data-original="#f2f2f2"></path>
      <path d="M243.195 276.559V210l-57.642-33.279L127.912 210v66.559l57.641 33.279z" fill="#3b8739" data-original="#3b8739"></path>
      <path d="m470.204 266.459 37.564 21.692-37.564 21.692-57.637-33.28v-66.56l57.637-33.28 34.931 20.177a254.539 254.539 0 0 1 6.51 45.641l-21.358 12.33v-23.186l-20.083-11.588-20.083 11.588v23.186l20.083 11.588z" fill="#333333" data-original="#333333"></path>
      <path d="M481.392 249.74v-12.92l-11.189-6.46-11.19 6.46v12.92l11.19 6.461z" fill="#66a060" data-original="#66a060"></path>
      <path d="M100.686 210.004v87.771l-38.442-21.932V230.85L43.05 219.763l-19.195 11.086v44.993L2.027 288.298A257.45 257.45 0 0 1 0 256c0-20.041 2.299-39.549 6.656-58.264l36.394-21.013 57.636 33.281z" fill="#333333" data-original="#333333"></path>
      <path d="M127.906 210.001h115.281v66.557H127.906z" transform="rotate(60 185.553 243.28)" fill="#6da75d" data-original="#6da75d"></path>
      <path d="m127.912 276.559 19.792-32.276L127.912 210z" fill="#55a344" data-original="#55a344"></path>
      <path d="M223.979 243.277 243.195 210l-57.642-33.279z" fill="#639d57" data-original="#639d57"></path>
      <path d="M346.551 99.579v88.304l-19.32-11.16-57.647 33.28v66.56l57.647 33.28 57.637-33.28V120.09l-38.317-20.511zm-.105 154.791-19.216 11.097-19.216-11.097v-22.183l19.216-11.097 19.216 11.097v22.183z" fill="#333333" data-original="#333333"></path>
      <path d="M282.149 358.717s-1.132-9.729-11.539-9.729c-10.408 0-17.534 1.357-17.534 7.127s20.25 5.77 27.943 8.032c7.693 2.262 14.48 8.145 11.086 18.553-3.394 10.408-13.802 11.539-29.866 11.539s-19.685-13.35-19.685-18.553h9.05s-1.132 8.145 9.502 9.502c10.634 1.357 20.802 2.121 22.173-6.108 1.81-10.861-34.391-5.43-37.559-16.064-2.676-8.985-1.132-20.815 16.969-22.626 18.101-1.811 28.056 6.181 28.056 18.101l-8.596.226z" fill="#66a060" data-original="#66a060"></path>
      <path d="m194.723 401.131 20.008 11.551c10.053 5.804 22.619-1.451 22.619-13.059V342.128h-8.155v55.227c0 6.339-6.862 10.302-12.353 7.131l-13.965-8.062v-58.94l51.043-29.467 51.043 29.467v58.94l-51.043 29.467-14.704-8.489-9.602 3.872 24.305 14.033 59.198-34.179v-68.351L253.92 298.6l-59.198 34.179v68.352h.001z" fill="#66a060" data-original="#66a060"></path>
    </g>
  </symbol>
  <symbol xmlns="http://www.w3.org/2000/svg" viewBox="0 0 128 128" id="jquery">
    <path fill="#ffffff" d="M47.961 79.02l.193.094.344.166c.439.209.882.416 1.329.615l.281.125c.513.225 1.029.439 1.551.645l.378.148c.482.188.972.37 1.463.543l.184.063c.539.188 1.083.363 1.632.534l.395.117c.558.169 1.109.37 1.685.477 36.554 6.665 47.171-21.967 47.171-21.967-8.918 11.618-24.747 14.683-39.745 11.271-.568-.128-1.12-.306-1.674-.47l-.417-.126c-.541-.166-1.079-.341-1.612-.524l-.221-.08c-.478-.168-.951-.346-1.421-.527l-.398-.156c-.516-.203-1.028-.416-1.534-.638l-.307-.136c-.435-.197-.866-.396-1.294-.602l-.375-.18c-.336-.164-.669-.339-1.001-.51l-.668-.35c-.405-.217-.803-.442-1.199-.673l-.405-.226c-.527-.311-1.048-.632-1.563-.958l-.421-.28c-.374-.241-.746-.486-1.112-.739l-.358-.252c-.354-.25-.704-.503-1.051-.76l-.466-.353c-.318-.243-.635-.488-.948-.74l-.423-.34c-.398-.328-.792-.657-1.182-.995l-.129-.109c-.423-.368-.836-.747-1.244-1.127l-.35-.337c-.303-.287-.6-.577-.893-.874l-.35-.35c-.372-.381-.737-.767-1.095-1.158l-.054-.058c-.379-.414-.749-.837-1.111-1.264l-.291-.346c-.27-.325-.538-.655-.799-.988l-.293-.364c-.315-.408-.622-.815-.923-1.229-8.326-11.358-11.318-27.023-4.663-39.888l-5.899 7.482c-7.559 10.863-6.617 24.997-.844 36.541l.423.821.271.52.168.299.301.539c.179.316.362.63.55.944l.315.519c.208.336.421.668.64 1l.272.422c.301.448.609.896.926 1.336l.027.035.156.211c.275.379.558.753.844 1.123l.318.404c.255.321.516.641.78.959l.298.355c.355.419.717.835 1.087 1.242l.022.023.042.046c.36.394.73.778 1.104 1.164l.354.357c.29.292.584.579.882.865l.361.343c.397.374.798.741 1.208 1.101l.02.015.21.18c.361.312.729.623 1.099.928l.455.362c.302.242.608.481.916.716l.489.372c.34.25.682.496 1.027.737l.375.266.103.073c.328.226.663.442.998.659l.432.288c.513.325 1.035.646 1.562.956l.432.244c.388.223.777.442 1.172.656l.648.336.84.437zM51.654 42.225c.819 1.174 1.726 2.57 2.813 3.514.394.434.806.856 1.226 1.273l.324.318c.409.396.824.785 1.252 1.164l.052.044.012.013c.475.416.965.816 1.463 1.21l.333.26c.5.383 1.009.759 1.531 1.118l.045.033.698.46.332.22c.373.238.75.472 1.135.694l.16.093c.331.191.667.379 1.003.561l.356.187.702.363.106.048c.482.237.968.465 1.464.682l.323.133c.396.168.797.333 1.199.487l.514.188c.366.136.732.26 1.102.383l.499.16c.526.163 1.045.369 1.593.46 28.222 4.677 34.738-17.054 34.738-17.054-5.874 8.459-17.248 12.494-29.386 9.344-.539-.142-1.071-.295-1.598-.462l-.481-.155c-.375-.121-.748-.25-1.118-.385l-.504-.188c-.405-.156-.807-.317-1.204-.485l-.324-.138c-.498-.217-.989-.445-1.472-.685l-.739-.376-.426-.219c-.314-.17-.626-.348-.934-.527l-.223-.127c-.383-.223-.759-.453-1.132-.689l-.341-.229-.732-.484c-.521-.359-1.027-.734-1.525-1.115l-.343-.271c-5.313-4.193-9.524-9.927-11.527-16.428-2.098-6.74-1.646-14.308 1.989-20.449l-4.466 6.306c-5.466 7.865-5.169 18.396-.905 26.715.714 1.393 1.517 2.747 2.416 4.035zM81.401 32.494l.701.243.309.098c.333.104.662.226 1.005.29 15.583 3.011 19.811-7.997 20.936-9.617-3.703 5.331-9.925 6.61-17.56 4.757-.603-.146-1.266-.363-1.848-.57-.745-.266-1.479-.568-2.193-.91-1.356-.652-2.648-1.441-3.846-2.347-6.832-5.185-11.076-15.072-6.618-23.126l-2.412 3.324c-3.222 4.743-3.539 10.633-1.303 15.869 2.358 5.56 7.19 9.92 12.829 11.989zM66.359 96.295h-4.226c-.234 0-.467.188-.517.417l-1.5 6.94-1.5 6.94c-.049.229-.282.417-.516.417h-2.991c-2.959 0-2.617-2.047-2.011-4.851l.018-.085.066-.354.012-.066.135-.72.145-.771.154-.785.682-3.332.683-3.332c.047-.23-.107-.419-.341-.419h-4.337c-.234 0-.466.188-.514.418l-.933 4.424-.932 4.425-.002.006-.086.412c-1.074 4.903-.79 9.58 5.048 9.727l.17.003h9.163c.234 0 .467-.188.516-.417l1.976-9.289 1.976-9.29c.049-.23-.103-.417-.338-.418zM21.103 96.246h-4.64c-.235 0-.469.188-.521.416l-.44 1.942-.44 1.942c-.051.229.098.416.333.416h4.676c.235 0 .468-.188.518-.417l.425-1.941.425-1.941c.049-.229-.101-.417-.336-.417zM19.757 102.29h-4.677c-.234 0-.469.188-.521.416l-.657 2.91-.656 2.909-.183.834-.631 2.97-.63 2.971c-.049.229-.15.599-.225.821 0 0-.874 2.6-2.343 2.57l-.184-.004-1.271-.023h-.001c-.234-.003-.469.18-.524.407l-.485 2.039-.484 2.038c-.055.228.093.416.326.42.833.01 2.699.031 3.828.031 3.669 0 5.604-2.033 6.843-7.883l1.451-6.714 1.361-6.297c.049-.227-.103-.415-.337-.415zM105.874 100.716l-.194-.801-.191-.82-.097-.414c-.38-1.477-1.495-2.328-3.917-2.328l-3.77-.004-3.472-.005h-3.907c-.234 0-.466.188-.515.417l-.173.816-.204.964-.057.271-1.759 8.24-1.67 7.822c-.05.23-.066.512-.038.626.028.115.479.209.713.209h3.524c.235 0 .532-.042.66-.094s.317-.513.364-.742l.626-3.099.627-3.1.001-.005.084-.413.76-3.56.671-3.144c.05-.229.281-.416.515-.417l11.089-.005c.235.002.383-.185.33-.414zM120.149 93.476l-.854.003h-3.549c-.235 0-.536.159-.667.353l-7.849 11.498c-.132.194-.283.166-.335-.062l-.578-2.533c-.052-.229-.287-.416-.522-.416h-5.045c-.235 0-.374.184-.31.409l2.261 7.921c.064.226.069.596.011.824l-.985 3.833c-.059.228.085.413.32.413h4.987c.234 0 .474-.186.532-.413l.986-3.833c.058-.229.221-.567.363-.755l12.742-16.911c.142-.188.065-.341-.169-.339l-1.339.008zM80.063 103.395v-.004c-.029.254-.264.441-.499.441h-6.397c-.222 0-.334-.15-.301-.336l.006-.015-.004.002.003-.021.029-.109c.611-1.624 1.855-2.69 4.194-2.69 2.634-.001 3.148 1.285 2.969 2.732zm-1.877-7.384c-8.211 0-10.157 4.984-11.249 10.015-1.091 5.128-.998 9.921 7.5 9.921h1.03l.256-.001h.06l1.02-.003h.018c2.244-.009 4.495-.026 5.406-.033.233-.004.461-.191.509-.42l.344-1.681.067-.327.41-2.006c.047-.229-.106-.418-.341-.418h-7.639c-3.039 0-3.941-.807-3.608-3.181h12.211l-.001.001.008-.001c.194-.003.374-.137.445-.315l.029-.106-.001.001c1.813-6.839 1.293-11.445-6.474-11.446zM39.376 103.369l-.116.409v.001l-.922 3.268-.922 3.267c-.063.227-.308.411-.543.411h-4.88c-3.702 0-4.604-2.896-3.702-7.166.901-4.368 2.668-7.083 6.312-7.358 4.98-.376 5.976 3.126 4.773 7.168zm3.348 7.105s2.301-5.588 2.823-8.814c.713-4.319-1.45-10.585-9.804-10.585-8.306 0-11.914 5.981-13.29 12.484-1.376 6.55.427 12.293 8.686 12.246l6.516-.024 6.089-.022c.234-.002.474-.188.534-.414l1.061-4.046c.059-.228-.084-.414-.319-.416l-1.017-.006-1.017-.006c-.199-.001-.313-.131-.289-.302l.027-.095zM83.844 106.733c0 .155-.125.281-.28.281-.154 0-.28-.126-.28-.281 0-.154.125-.279.28-.279.155 0 .28.125.28.279z"></path>
  </symbol>
  <symbol xmlns="http://www.w3.org/2000/svg" enable-background="new 0 0 32 32" viewBox="0 0 32 32" id="npm">
    <path fill="#efefef" d="M26,32H6c-3.314,0-6-2.686-6-6V6c0-3.314,2.686-6,6-6h20c3.314,0,6,2.686,6,6v20C32,29.314,29.314,32,26,32z"></path>
    <rect width=".889" height="1.81" x="15.111" y="14.643" fill="#ff7777"></rect>
    <path fill="#ff0000" d="M24,12.833H8v5.429h4.445v0.905H16v-0.905h8V12.833z M12.444,17.357h-0.889v-2.714h-0.889v2.714H8.889v-3.619h3.556V17.357z M16.889,17.357h-1.778v0.905h-1.778v-4.524h3.556V17.357z M23.111,17.357h-0.889v-2.714h-0.889v2.714h-0.889v-2.714h-0.889v2.714h-1.778v-3.619h5.334V17.357z"></path>
  </symbol>
  <symbol xmlns="http://www.w3.org/2000/svg" viewBox="0 0 5105.4 5105.4" id="gulp">
    <path fill="#cf4547" d="M0 0h5105.4v5105.4H0z"></path>
    <path fill="#ffffff" stroke="#fff" stroke-miterlimit="10" stroke-width="13.386" d="M1766.5 2586.7c-2.4 3.5-6.6 14.4-12.8 32.9-6.2 18.5-13.7 41.6-22.5 69.4-8.8 27.8-18.4 59-28.6 93.4-10.3 34.4-20.9 69.6-31.7 105.4-10.9 35.9-21.3 71-31.3 105.5-10 34.4-19 65.6-26.9 93.4-7.9 27.8-14.5 51.1-19.8 70-5.3 18.8-8.5 29.9-9.7 33.4-2.9 11.1-7.6 23.5-14.1 37.1-6.5 13.6-14.1 26.4-22.9 38.6-8.8 12.2-18.5 22.3-29.1 30.3-10.6 8-21.5 12-32.6 12-18.8 0-32.5-6.3-41-18.8s-12.8-35.5-12.8-68.9v-14.6c0-4.9.3-10.1.9-15.6.6-11.1 5-32 13.2-62.7 8.2-30.6 18.1-65.2 29.5-103.9s23.8-78.6 37-120.1c13.2-41.4 25.1-78.5 35.7-111.2-31.2 34.8-64.9 69.4-101.4 103.9-36.4 34.5-73.8 65.4-111.9 92.9-38.2 27.5-76.7 50-115.5 67.3-38.8 17.4-76.1 26.1-111.9 26.1-41.1 0-76.5-9.1-106.2-27.1-29.7-18.1-54.2-41.8-73.6-71s-33.8-62.3-43.2-99.2c-9.4-36.9-14.1-73.8-14.1-110.7v-13.6c0-4.2.3-8.3.9-12.5 3.5-66.8 13.1-135.4 28.6-205.7 15.6-70.3 36-140.3 61.3-209.8 25.3-69.6 54.5-137.6 87.7-204.1s69.3-129.3 108.4-188.4c39.1-59.1 80.6-113.6 124.7-163.4 44.1-49.8 89.3-92.6 135.7-128.4 46.4-35.8 93.3-63.8 140.6-84 47.3-20.2 94.2-30.3 140.6-30.3 53.5 0 105.2 14.6 155.1 43.8 49.9 29.2 96.6 76.6 140.1 142 10 14.6 16.3 29.4 18.9 44.4 2.6 15 4 29.1 4 42.3 0 31.3-7.5 56-22.5 74.1-15 18.1-32.8 27.1-53.3 27.1-18.8 0-36.3-9.9-52.4-29.8-16.2-19.8-34.2-48.2-54.2-85.1-18.8-33.4-39.5-57.6-62.1-72.6-22.6-15-47.2-22.4-73.6-22.4-41.1 0-85.1 17.1-131.8 51.2-46.7 34.1-93 79.2-138.8 135.2-45.8 56-89.8 120-131.8 192.1-42 72-79.2 145.8-111.5 221.3s-58 150-77.1 223.4c-19.1 73.4-28.6 139.4-28.6 197.9 0 19.5 1.3 39.5 4 60s7.6 39.2 15 55.9c7.3 16.7 17.3 30.5 30 41.2 12.6 10.8 28.6 16.2 48 16.2 21.7 0 46.4-7.3 74-21.9 27.6-14.6 56.3-33.7 85.9-57.4 29.7-23.7 59.5-50.5 89.5-80.4 30-29.9 57.9-60.2 83.7-90.8 25.8-30.6 48.8-60 68.7-88.2 20-28.2 35-52.7 44.9-73.6l82-245.3c10-26.4 23.1-45.2 39.2-56.4 16.2-11.1 32.8-16.7 49.8-16.7 8.2 0 16.4 1.4 24.7 4.2 8.2 2.8 15.6 7.1 22 13.1 6.5 5.9 11.6 13.6 15.4 23 3.8 9.4 5.7 20.4 5.7 32.9 0 33.4-2.9 64.7-8.8 94-5.9 29.3-13.4 57.8-22.5 85.6-9.1 27.8-19.2 55.9-30.4 84-11 28-21.9 57.4-32.4 88.1zM2877.9 2791.3c-25.9 34.8-56 68.7-90.3 101.8-34.4 33.1-69.8 62.5-106.2 88.2-36.4 25.7-72.3 46.4-107.5 62.1-35.3 15.7-67 23.5-95.2 23.5s-51.1-9.4-68.8-28.2c-17.6-18.8-26.4-50.8-26.4-96.1 0-32 4.7-69.3 14.1-111.7-15.3 27.2-34.4 54.7-57.3 82.5-22.9 27.8-49.1 53.2-78.5 76.2s-62.3 41.6-98.7 55.8c-36.4 14.3-76.1 21.4-119 21.4-19.4 0-38.1-2.4-56-7.3s-33.6-13.2-47.1-25-24.4-27.6-32.6-47.5c-8.2-19.8-12.3-44.7-12.3-74.6 0-.7 1.2-11.3 3.5-31.8s9.8-52.9 22.5-97.1c12.6-44.2 32.2-101.4 58.6-171.7 26.5-70.3 63.8-155.5 111.9-255.8 12.3-26.4 26.6-45.4 42.7-56.9 16.2-11.5 33.6-17.2 52.4-17.2 8.2 0 16.7 1.2 25.6 3.6 8.8 2.5 17 6.3 24.7 11.5 7.6 5.2 13.8 11.8 18.5 19.8 4.7 8 7.1 17.2 7.1 27.7 0 7-.9 13.6-2.7 19.8-2.9 11.9-9.2 27.3-19 46.5-9.7 19.2-21 41.1-33.9 65.8-12.9 24.7-26.6 51.3-41 79.9-14.4 28.5-27.8 58.1-40.1 88.7s-22.9 61.8-31.7 93.4c-8.8 31.7-13.8 62.5-15 92.4 0 12.5 2.9 24 8.8 34.5 5.9 10.4 15.6 15.7 29.1 15.7 38.2 0 74.6-12.5 109.3-37.6 34.7-25 66.7-56.2 96.1-93.4 29.4-37.2 56-77.2 79.8-120.1 23.8-42.8 43.7-81.9 59.5-117.4 11.2-23.7 21-49.1 29.5-76.2s17.8-52.2 27.8-75.2 21.4-42.1 34.4-57.4c12.9-15.3 29.1-23 48.5-23 21.1 0 37.9 8 50.2 24 12.3 16 18.5 35.2 18.5 57.4 0 12.5-3.9 29.8-11.9 51.7-8 21.9-17.9 47-30 75.2-12 28.2-25.1 58.3-39.2 90.3-14.1 32-27.2 64.6-39.2 97.6-12.1 33.1-22 65.4-30 97.1-7.9 31.7-11.9 61.1-11.9 88.2 0 25.1 12.9 37.6 38.8 37.6 18.2 0 40.8-6.3 67.9-18.8 27.1-12.5 55.4-30.1 85.1-52.7 29.7-22.6 59.3-49.2 89-79.9 29.7-30.6 56-63.7 78.9-99.2l8.7 141.9z"></path>
    <path fill="#ffffff" stroke="#fff" stroke-miterlimit="10" stroke-width="13.386" d="M2905.3 2739.1c-6.5 16-12.8 34.6-19 55.9-6.2 21.2-9.2 40.2-9.2 56.9 0 10.4 1.8 18.8 5.3 25.1 3.5 6.3 10.3 9.4 20.3 9.4 12.3 0 27.7-4.3 46.3-13.1 18.5-8.7 38.5-20.2 59.9-34.5 21.5-14.2 43.8-30.6 67-49.1 23.2-18.4 46.3-37.6 69.2-57.4 22.9-19.9 44.8-39.7 65.7-59.5 20.9-19.9 39.5-38.1 56-54.8 4.7-4.9 10.3-8.4 16.7-10.4 6.4-2.1 12-3.1 16.7-3.1 11.7 0 21.5 4.9 29.1 14.6 7.6 9.7 11.4 22.6 11.4 38.6 0 14.6-4.1 31-12.3 49.1-8.2 18.1-22.6 35.9-43.2 53.2-37.6 41.1-75.5 80-113.7 116.9-38.2 36.9-76.2 69.4-114.1 97.6-37.9 28.2-75.5 50.6-112.8 67.4-37.3 16.7-73.6 25-108.9 25-24.1 0-44.2-3.8-60.4-11.5-16.2-7.7-29.1-18.1-38.8-31.3-9.7-13.2-16.6-28.9-20.7-47-4.1-18.1-6.2-37.2-6.2-57.4 0-34.1 4.3-69.1 12.8-104.9 8.5-35.8 18.6-68.7 30.4-98.6 20.6-54.3 41.4-108.2 62.6-161.8 21.1-53.6 40.5-102.7 58.2-147.2l267-673.4c10.6-27.1 24.8-46.3 42.8-57.4 17.9-11.1 36-16.7 54.2-16.7 18.2 0 34.8 5.9 49.8 17.7 15 11.8 22.5 31 22.5 57.4 0 12.5-2.5 25.8-7.5 39.7-5 13.9-11.3 28.9-18.9 44.9-14.7 32.7-32.2 72.7-52.4 120-20.3 47.3-42 98.8-65.2 154.5-23.2 55.7-47 113.6-71.4 173.8-24.4 60.2-48.2 118.8-71.4 175.9-23.2 57.1-44.9 111.2-65.2 162.3-20.5 51.2-38 95.6-52.6 133.2z"></path>
    <path fill="#ffffff" stroke="#fff" stroke-miterlimit="10" stroke-width="13.386" d="M4154.2 2550.1c8.2-5.6 15.9-10.1 22.9-13.6 7-3.5 13.8-5.2 20.3-5.2 12.9 0 22.6 5.8 29.1 17.2 6.5 11.5 9.7 25.6 9.7 42.3 0 18.1-3.9 36.5-11.9 55.3-7.9 18.8-19.8 34.4-35.7 47-62.9 55.7-119 106.5-168.3 152.4-49.4 45.9-95.9 85.4-139.7 118.5-43.8 33.1-86.5 58.6-128.2 76.7-41.7 18.1-86.4 27.1-134 27.1-44.7 0-79.2-9.8-103.6-29.2-24.4-19.5-36.6-46.3-36.6-80.4v-7.8c0-2.4.3-5.4.9-8.9 2.3-20.9 11.5-44.9 27.3-72 15.9-27.1 35-55.3 57.3-84.6s46.1-58.8 71.4-88.7c25.3-29.9 48.6-58.3 70.1-85.1 21.4-26.8 39.2-51.3 53.3-73.6 14.1-22.3 21.2-40.3 21.2-54.3 0-8.4-3-15-8.8-19.8-5.9-4.9-15.6-7.3-29.1-7.3-23.5 0-47.7 6.1-72.7 18.3-25 12.2-49.7 28.5-74 49-24.4 20.5-48.2 44-71.4 70.5-23.2 26.5-44.9 53.9-65.2 82.5-20.3 28.6-38.8 57.2-55.5 86.1-16.7 28.9-31 55.5-42.7 79.9-3.5 7.7-8.5 18.5-15 32.4-6.5 13.9-13.5 29.6-21.1 47-7.7 17.4-15.7 35.3-24.3 53.7-8.5 18.5-16.3 35.9-23.3 52.2-7.1 16.4-13.4 30.9-19 43.9-5.6 12.9-9.6 21.7-11.9 26.6-3 6.3-7.8 18.1-14.6 35.5s-14.5 37.7-23.4 61.1c-8.8 23.3-18.1 47.8-27.7 73.6-9.7 25.8-18.8 50.1-27.3 73.1-8.5 23-16 43.1-22.5 60.5s-10.6 29.2-12.4 35.5c-5.9 18.1-12.8 35.1-20.7 51.2-7.9 16-17 30.1-27.3 42.3-10.3 12.2-22 21.9-35.3 29.2-13.2 7.3-28.1 10.9-44.5 10.9-21.2 0-38.6-5.1-52.5-15.1-13.8-10.1-20.7-29.4-20.7-57.9 0-13.9 1.8-28.2 5.3-42.8 3.5-14.6 8-29.1 13.2-43.3 5.3-14.3 10.7-28.2 16.3-41.7 5.6-13.6 10.7-26.6 15.4-39.2 31.7-69.6 64.1-139.4 97-209.3 32.9-70 64.5-139.2 94.7-207.8 30.3-68.5 58.3-135.9 84.2-202 25.8-66.1 47.3-129.5 64.3-190 4.7-12.5 11.2-30.3 19.4-53.3 8.2-23 17.6-45.6 28.2-67.9 10.6-22.3 22.5-41.6 35.7-57.9 13.2-16.4 27.5-24.5 42.7-24.5 23.5 0 40.5 5.4 51.1 16.2 10.6 10.8 15.9 26.6 15.9 47.5 0 4.2-.6 10.8-1.8 19.8-1.2 9-2.7 18.6-4.4 28.7-1.8 10.1-3.7 19.7-5.7 28.7-2.1 9-4 15.6-5.7 19.8 21.7-23.7 45.2-47.1 70.5-70.5 25.3-23.3 51.4-44.4 78.5-63.2 27-18.8 54.6-34.1 82.8-46 28.2-11.8 56.4-17.7 84.6-17.7 19.4 0 38.6 2.8 57.7 8.4 19.1 5.6 36.1 13.7 51.1 24.5s27.2 24.4 36.6 40.7c9.4 16.4 14.1 35.3 14.1 56.9 0 28.6-7.2 59-21.6 91.4-14.4 32.4-32.5 64.9-54.2 97.6-21.8 32.7-45.3 64.6-70.5 95.5-25.3 31-48.9 59.2-71 84.6-22 25.4-40.5 47-55.5 64.7-15 17.8-22.8 29.8-23.4 36 0 8.4 2.7 15.1 7.9 20.4s14.1 7.8 26.5 7.8c10 0 24.7-5.6 44.1-16.7 19.4-11.1 46.6-30.4 81.5-57.9s79.3-64.4 133.1-110.7c53.8-46.2 120.1-104.5 198.8-174.8z"></path>
  </symbol>
  <symbol xmlns="http://www.w3.org/2000/svg" viewBox="0 0 128 128" id="webpack">
    <path fill="#8ed6fb" d="M117.29,98.1,66.24,127V104.49L98,87,117.29,98.1Zm3.5-3.16V34.55L102.11,45.35V84.16l18.67,10.77ZM10.71,98.1l51,28.88V104.49L29.94,87Zm-3.5-3.16V34.55L25.89,45.35V84.16Zm2.19-64.3L61.76,1V22.76L28.21,41.21l-.27.15Zm109.18,0L66.24,1V22.76L99.79,41.2l.27.15,18.54-10.71Z"></path>
    <path fill="#1c78c0" d="M61.76,99.37,30.37,82.1V47.92L61.76,66Zm4.48,0L97.63,82.12V47.92L66.24,66ZM32.5,44,64,26.66,95.5,44,64,62.16,32.5,44Z"></path>
  </symbol>
  <symbol xmlns="http://www.w3.org/2000/svg" enable-background="new 0 0 32 32" viewBox="0 0 32 32" id="react">
    <path fill="#e3f8fa" d="M26,32H6c-3.314,0-6-2.686-6-6V6c0-3.314,2.686-6,6-6h20c3.314,0,6,2.686,6,6v20C32,29.314,29.314,32,26,32z"></path>
    <path fill="#8ce1eb" d="M16,14.568c-0.791,0-1.431,0.641-1.431,1.431c0,0.791,0.641,1.431,1.431,1.431s1.431-0.641,1.431-1.431C17.431,15.209,16.791,14.568,16,14.568z"></path>
    <path fill="#26c6da" d="M11.009,18.534c0.141,0.047,0.281,0.094,0.425,0.135c-0.047,0.187-0.087,0.372-0.125,0.563c-0.328,1.735-0.072,3.109,0.747,3.581c0.844,0.487,2.263-0.013,3.644-1.222c0.109-0.097,0.219-0.197,0.328-0.303c0.137,0.135,0.281,0.263,0.425,0.387c1.337,1.15,2.659,1.615,3.476,1.144c0.844-0.487,1.119-1.965,0.763-3.765c-0.028-0.137-0.059-0.278-0.094-0.422c0.1-0.028,0.197-0.059,0.294-0.091c1.803-0.597,3.11-1.563,3.11-2.553c0-0.947-1.231-1.865-2.931-2.45v-0.001c-0.169-0.056-0.337-0.109-0.506-0.159c0.028-0.115,0.053-0.231,0.078-0.347c0.385-1.862,0.131-3.359-0.722-3.853c-0.822-0.472-2.163,0.019-3.519,1.2c-0.135,0.115-0.265,0.237-0.391,0.359c-0.085-0.081-0.172-0.163-0.259-0.241c-1.422-1.263-2.847-1.794-3.7-1.297c-0.819,0.475-1.063,1.885-0.719,3.646c0.035,0.175,0.072,0.347,0.115,0.522c-0.2,0.056-0.397,0.119-0.581,0.185C9.196,14.131,8,15.043,8,15.987C8,16.962,9.274,17.94,11.009,18.534z M15.259,21.08c-0.515,0.472-1.113,0.847-1.763,1.103c-0.347,0.165-0.747,0.181-1.103,0.041c-0.497-0.287-0.703-1.391-0.422-2.875c0.035-0.175,0.072-0.35,0.115-0.522c0.7,0.15,1.406,0.253,2.122,0.306c0.413,0.585,0.865,1.144,1.35,1.668C15.459,20.898,15.359,20.992,15.259,21.08L15.259,21.08z M19.228,15.212c-0.147-0.275-0.297-0.55-0.453-0.819c-0.153-0.265-0.313-0.528-0.478-0.787c0.503,0.063,0.985,0.147,1.435,0.25C19.587,14.319,19.419,14.769,19.228,15.212z M19.234,16.768c0.2,0.453,0.375,0.913,0.528,1.385c-0.485,0.109-0.975,0.194-1.469,0.25c0.169-0.263,0.328-0.531,0.485-0.8C18.937,17.327,19.087,17.049,19.234,16.768z M18.873,15.991c-0.209,0.431-0.435,0.856-0.675,1.275c-0.237,0.415-0.491,0.819-0.756,1.219c-0.465,0.035-0.95,0.05-1.441,0.05c-0.491,0-0.965-0.015-1.425-0.044c-0.272-0.397-0.528-0.803-0.769-1.218c-0.241-0.415-0.463-0.837-0.672-1.269h-0.001c0.206-0.431,0.431-0.853,0.669-1.269c0.237-0.415,0.494-0.819,0.763-1.215c0.469-0.035,0.947-0.053,1.435-0.053s0.969,0.019,1.435,0.053c0.265,0.394,0.519,0.797,0.759,1.209C18.436,15.141,18.66,15.563,18.873,15.991z M13.221,14.399c-0.153,0.265-0.303,0.537-0.444,0.812c-0.197-0.465-0.362-0.921-0.5-1.362c0.45-0.1,0.928-0.181,1.425-0.244C13.537,13.865,13.375,14.13,13.221,14.399z M12.778,16.792L12.778,16.792c0.144,0.275,0.291,0.547,0.447,0.816c0.159,0.272,0.322,0.544,0.494,0.809c-0.487-0.053-0.972-0.131-1.45-0.235C12.406,17.733,12.578,17.268,12.778,16.792z M16.025,20.32L16.025,20.32c-0.319-0.343-0.637-0.724-0.947-1.134c0.3,0.013,0.609,0.019,0.922,0.019c0.322,0,0.637-0.006,0.95-0.022C16.663,19.579,16.354,19.958,16.025,20.32z M20.11,21.259L20.11,21.259c-0.029,0.381-0.216,0.737-0.516,0.977c-0.497,0.287-1.556-0.087-2.7-1.069c-0.131-0.113-0.263-0.235-0.397-0.359c0.478-0.528,0.919-1.087,1.319-1.674c0.715-0.059,1.428-0.169,2.131-0.328c0.031,0.128,0.059,0.256,0.085,0.381C20.186,19.862,20.21,20.565,20.11,21.259z M20.382,14.021c0.163,0.047,0.319,0.097,0.469,0.147c1.456,0.5,2.478,1.244,2.478,1.813c0,0.613-1.091,1.403-2.65,1.918c-0.087,0.028-0.175,0.056-0.265,0.081c-0.219-0.681-0.487-1.347-0.797-1.994C19.916,15.349,20.17,14.693,20.382,14.021z M16.84,10.884L16.84,10.884c1.163-1.012,2.247-1.409,2.742-1.125c0.528,0.303,0.731,1.528,0.4,3.137c-0.022,0.106-0.044,0.209-0.072,0.313c-0.694-0.156-1.397-0.269-2.103-0.331c-0.406-0.581-0.85-1.137-1.331-1.659C16.597,11.103,16.715,10.993,16.84,10.884z M16.006,11.697c0.328,0.356,0.637,0.731,0.925,1.118c-0.619-0.028-1.241-0.028-1.859,0C15.378,12.412,15.694,12.037,16.006,11.697z M12.381,9.781C12.907,9.475,14.072,9.912,15.3,11c0.078,0.069,0.156,0.144,0.237,0.219c-0.485,0.522-0.931,1.078-1.341,1.659c-0.706,0.063-1.406,0.172-2.1,0.325c-0.041-0.159-0.075-0.322-0.109-0.485C11.693,11.206,11.887,10.065,12.381,9.781z M11.084,14.187c0.178-0.063,0.359-0.119,0.541-0.172c0.213,0.678,0.469,1.344,0.765,1.987c-0.3,0.653-0.559,1.328-0.775,2.015l-0.001,0.001c-0.131-0.037-0.259-0.078-0.387-0.122c-0.665-0.209-1.422-0.541-1.969-0.975c-0.315-0.219-0.528-0.556-0.587-0.935C8.672,15.415,9.659,14.683,11.084,14.187z"></path>
  </symbol>
  <symbol xmlns="http://www.w3.org/2000/svg" preserveAspectRatio="xMinYMin meet" viewBox="0 0 256 221" id="vue">
    <path fill="#41b883" d="M204.8 0H256L128 220.8 0 0h97.92L128 51.2 157.44 0h47.36z"></path>
    <path fill="#41b883" d="M0 0l128 220.8L256 0h-51.2L128 132.48 50.56 0H0z"></path>
    <path fill="#35495e" d="M50.56 0L128 133.12 204.8 0h-47.36L128 51.2 97.92 0H50.56z"></path>
  </symbol>
  <symbol xmlns="http://www.w3.org/2000/svg" fill="none" viewBox="0 0 48 48" id="figma">
    <path fill="#333333" d="M0 24C0 10.745 10.745 0 24 0s24 10.745 24 24-10.745 24-24 24S0 37.255 0 24Z"></path>
    <path fill="#0acf83" d="M19.2 38.4a4.8 4.8 0 0 0 4.8-4.8v-4.8h-4.8a4.8 4.8 0 0 0 0 9.6Z"></path>
    <path fill="#a259ff" d="M14.4 24a4.8 4.8 0 0 1 4.8-4.8H24v9.6h-4.8a4.8 4.8 0 0 1-4.8-4.8Z"></path>
    <path fill="#f24e1e" d="M14.4 14.4a4.8 4.8 0 0 1 4.8-4.8H24v9.6h-4.8a4.8 4.8 0 0 1-4.8-4.8Z"></path>
    <path fill="#ff7262" d="M24 9.6h4.8a4.8 4.8 0 1 1 0 9.6H24V9.6Z"></path>
    <path fill="#1abcfe" d="M33.6 24a4.8 4.8 0 1 1-9.6 0 4.8 4.8 0 0 1 9.6 0Z"></path>
  </symbol>
  <symbol xmlns="http://www.w3.org/2000/svg" xmlns:xlink="http://www.w3.org/1999/xlink" version="1.1" x="0" y="0" xml:space="preserve" viewBox="0 0 492.004 492.004" id="arrow-down">
    <g transform="matrix(6.123233995736766e-17,1,-1,6.123233995736766e-17,492.00401306152344,-0.00004577636721592171)">
      <path d="M382.678 226.804 163.73 7.86C158.666 2.792 151.906 0 144.698 0s-13.968 2.792-19.032 7.86l-16.124 16.12c-10.492 10.504-10.492 27.576 0 38.064L293.398 245.9l-184.06 184.06c-5.064 5.068-7.86 11.824-7.86 19.028 0 7.212 2.796 13.968 7.86 19.04l16.124 16.116c5.068 5.068 11.824 7.86 19.032 7.86s13.968-2.792 19.032-7.86L382.678 265c5.076-5.084 7.864-11.872 7.848-19.088.016-7.244-2.772-14.028-7.848-19.108z" fill="currentColor" opacity="1" data-original="#000000"></path>
    </g>
  </symbol>
  <symbol xmlns="http://www.w3.org/2000/svg" viewBox="0 0 205.035 236.177" id="element-ui">
    <path d="M181.518 103.129l-79 45.463v28.844l79-45.463zm-7-55.514l-72 41.434v28.844l93.498-53.805h-21.498zM103.018 0L.5 58.611 0 176.7l102.018 59.477 102.517-58.61.5-118.087zm.707 28l76.968 44.875-.377 89.096-77.347 44.218L26 161.316l.377-89.095z" fill="#409eff"></path>
  </symbol>
  <symbol xmlns="http://www.w3.org/2000/svg" viewBox="0 0 24 24" id="tailwind">
    <path d="M18.5 9.51a4.22 4.22 0 0 1-1.91-1.34A5.77 5.77 0 0 0 12 6a4.72 4.72 0 0 0-5 4 3.23 3.23 0 0 1 3.5-1.49 4.32 4.32 0 0 1 1.91 1.35A5.77 5.77 0 0 0 17 12a4.72 4.72 0 0 0 5-4 3.2 3.2 0 0 1-3.5 1.51zm-13 4.98a4.22 4.22 0 0 1 1.91 1.34A5.77 5.77 0 0 0 12 18a4.72 4.72 0 0 0 5-4 3.23 3.23 0 0 1-3.5 1.49 4.32 4.32 0 0 1-1.91-1.35A5.8 5.8 0 0 0 7 12a4.72 4.72 0 0 0-5 4 3.2 3.2 0 0 1 3.5-1.51z" fill="#3b95ff"></path>
  </symbol>
  <symbol xmlns="http://www.w3.org/2000/svg" viewBox="-2.138 -2.29 314.9 359.304" id="gsap">
    <path d="m48.173 155.568c-10.389 4.887-37.886 26.886-43.182 33.404-5.5 6.518-7.129-3.666-1.426-20.572 4.48-13.647 15.888-32.183 35.034-48.07 11.202-9.166 35.849-22.405 50.921-30.146 3.056-1.63 42.571-18.332 77.809-26.683 3.056-.815-3.666 5.092-4.685 8.351-5.296 15.48-111.01 81.882-111.01 81.882zm148.894 186.78c1.833 10.999.204 11.814-11.202 13.24-11.407 1.426-19.758-2.852-22.813-5.703-3.056-2.853-3.666-9.166-.611-14.869 1.834-3.667 3.667-4.889 4.686-9.37 1.018-4.277 1.833-5.296 2.647-6.925.814-1.427 1.019-2.853 1.222-12.833.204-9.98 0-28.72 1.019-36.663 1.019-8.147 36.257 3.666 36.257 3.666s-8.352 20.776-10.592 25.868c-2.241 5.093-2.037 14.869-2.037 16.906s-.814 6.11-1.426 6.314c-.611.203 2.037 5.499.814 8.555-.815 2.852 1.833 10.185 2.036 11.814zm13.444-311.437c-1.223-7.74 0-23.018 1.629-25.461 5.093-6.926 31.979-7.74 37.683.407 2.444 3.666 2.24 12.221 1.833 17.721-.407 5.499-1.833 17.313-2.037 21.184-.203 2.852-29.738 7.332-36.256-.408-1.834-2.036-2.852-13.443-2.852-13.443zm59.884 291.679c12.425 8.963 21.998 10.592 28.312 13.851 6.314 3.26 4.685 9.574-5.907 11.407-8.555 1.629-21.998-1.63-30.96-1.63s-28.924 1.019-34.22-2.647c-6.11-4.277-3.463-12.222-3.463-12.222 1.63-4.48 5.703-14.462 4.481-22.609s-2.852-12.628-5.907-20.165c-3.055-7.536-5.295-26.071-2.443-27.09s2.036 0 5.703.814c3.666.814 7.74 2.037 15.684 2.037s16.702-1.223 19.758-1.833c3.055-.611 5.499-1.223 4.48 5.092-1.018 6.314-4.073 18.128-4.277 27.294-.203 9.166-.203 19.758.408 21.591.61 1.833 5.092 3.87 8.351 6.11z" fill="#010101"></path>
    <path d="m226.806 51.28c-22.405 19.351-65.791 24.646-130.155 49.496-16.499 6.314-60.495 25.257-71.087 45.015 35.645-20.572 48.885 7.74 51.736 36.867 2.647 27.294 16.295 41.553 51.329 40.737 36.053-.814 47.052 20.165 57.032 44.812 19.35-94.308 50.311-112.639 70.271-128.73 42.368-34.424-9.776-95.123-29.126-88.197z" fill="#8ac640"></path>
    <path d="m226.806 51.28c-53.773 18.739-106.936 23.424-169.467 61.921-14.869 9.166-46.237 29.941-52.348 69.661 22.812-25.258 75.567-57.032 140.136-77.197 32.59-10.185 56.422-16.906 85.345-28.109-2.036-13.037-2.036-18.129-3.666-26.276z" fill="#8ac640"></path>
    <path d="m295.448 162.9s-3.87 13.24-11.61 17.518c0 0-5.703 2.037-17.109-4.277-3.259-1.833-5.703-8.147-5.5-10.185.204-4.889 3.259-7.129 3.259-7.129s3.26-5.5 7.129-5.296c3.871.203 10.389.814 12.426-1.019 1.832-2.037 11.813 3.666 11.405 10.388zm-83.104-128.119s-.814 10.389-2.24 16.906c-.204 1.223-6.314 1.833-10.796 3.667 8.555 24.442 60.088 24.238 66.81 12.221-3.259-2.24-9.777-5.703-12.832-6.925-3.056-1.223-2.852-1.019-3.056-6.722-.203-5.704-.611-16.295-1.019-19.147-.407-2.852-31.979-2.852-36.867 0z" fill="#010101"></path>
    <path d="m214.381 34.781s0 5.907-.611 11.61c-.203 2.648-.407 4.277-.814 6.314-.204 1.223 6.925 6.11 8.962 16.906 9.777 21.794 32.387 10.999 41.756.611-3.259-2.241-8.555-5.296-14.665-7.74-3.056-1.223-1.63-3.87-1.833-9.573-.204-5.703-1.019-14.055-1.426-17.11-.409-3.055-26.48-3.87-31.369-1.018z" fill="#f0efef"></path>
    <g fill="#010101">
      <path d="m212.344 34.781s-.204 3.667-.814 7.944c2.647 2.647 6.11 6.314 8.759 8.555 1.833 1.63 6.313 1.426 10.388 1.426 3.666 0 6.925.407 8.351-.407 3.26-1.63 7.944-5.703 10.592-8.759-.203-3.666-.407-7.129-.61-8.759-.206-2.852-31.778-2.852-36.666 0z"></path>
      <path d="m230.88 50.261c-2.445 0-5.297-.203-7.537-.611-1.019-.203-2.037-.814-2.852-1.222-1.426-1.019-2.852-2.24-4.48-3.463-3.26-2.444-3.463-3.87-3.463-4.48 1.426-12.833-.408-23.628-.408-23.628s-1.426-5.5 6.314-6.926 12.425-1.629 12.425-1.629 4.889 0 12.425 1.629c7.74 1.426 6.314 6.926 6.314 6.926s-1.833 10.795-.407 23.628c0 .61-.203 2.036-3.463 4.48-2.852 2.037-5.092 4.277-7.332 4.685-2.241.408-5.093.611-7.536.611z"></path>
      <path d="m230.88 3.006c-13.443 0-16.092 3.666-19.962 7.74-.814 1.018-.204 7.129 1.223 20.165h1.833s-1.223-3.667-1.019-7.944 1.019-4.073.407-5.092c-.814-1.223-2.444-3.26 1.223-5.296 3.666-2.037 9.369 1.629 16.295 1.833 6.925-.204 12.832-3.87 16.498-1.833 3.666 2.036 2.037 4.073 1.223 5.296-.815 1.222.203.814.407 5.092.203 4.277-1.019 7.944-1.019 7.944h1.833c1.222-13.036 2.037-18.739 1.426-19.758-3.463-4.481-6.925-7.944-20.368-8.147zm64.568 160.505s-3.87 12.425-11.406 16.702c-1.63-.814-1.426-2.036-2.852-3.87-.408-.61-1.834-1.019-2.444-1.629-.611-.611-.407-1.63-1.426-2.444-.815-.815-1.426-.204-2.241-.815-.814-.814-1.019-1.833-1.629-2.443-.408-.408-2.037-.611-2.444-1.019-1.019-1.019-9.98-2.852-9.573-4.889.814-3.056 2.444-5.296 2.444-5.296s3.87-5.703 7.739-5.5c3.87.204 7.537 1.019 9.574-.814 2.241-2.038 14.87 5.499 14.258 12.017z"></path>
      <path d="m268.969 73.482s12.832-3.056 21.591 5.296c8.759 8.555 8.147 19.146 5.5 25.664 2.24 2.648 6.314 9.98 3.259 18.739 13.443 11.406 7.536 28.924-4.481 40.534 0 0-2.852-10.592-14.258-11.203.407-4.073-10.592-7.333-5.5-17.925-7.74-1.833-7.536-7.129-8.758-13.646-1.019-6.519 2.647-47.459 2.647-47.459z"></path>
    </g>
    <path d="m264.284 79.185s14.869-7.536 23.628 1.019c8.758 8.555 6.313 17.924 3.666 24.442 2.24 2.647 7.536 10.185 4.277 19.146-.611 2.037-5.092 2.037-8.352 7.333 8.147-4.686 13.24-3.463 15.073 2.443 2.852 9.166-3.463 20.165-8.962 26.276 0-.204-.204-.408-.204-.611-.814 3.056-1.833 8.962-7.943 15.48-3.056 3.259-5.5 2.852-8.963 2.037-4.073-1.019-5.499-2.853-11.202-5.907-3.259-1.833-1.426-4.074-1.426-5.907 0-.407.407-1.019 1.019-1.833.407-1.019 1.629-2.647 3.462-4.481 0 0 2.648-3.666 6.519-3.463 3.87.204 7.943-.61 8.962-1.629 0-7.129-8.147-7.333-5.296-19.554.204-.611 1.223-1.63 4.481-2.037-4.889-1.019-7.129-1.223-10.592-4.481-2.444-2.24-4.277-5.092-4.889-8.758-1.221-6.314-3.258-39.515-3.258-39.515z" fill="#f0efef"></path>
    <path d="m221.306 66.353c-1.222-1.63-7.536-9.777-19.554-13.036-3.463-1.019-5.703 1.833-9.165 3.87-1.019-.611-5.5-2.648-7.944-1.223s-4.073 2.852-6.518 3.87c-1.223-.611-4.481-.611-7.129.407-2.648.815-6.722 2.648-10.592 7.944-2.444 8.759 43.181 2.24 43.181 2.24z" fill="#010101"></path>
    <path d="m221.714 66.353c-6.519-2.241-5.5-9.777-19.962-10.999-2.852-.204-4.685 2.036-6.722 3.462 1.019 1.019 2.037 2.648 2.648 4.277-1.833-2.036-5.092-4.685-8.352-5.296-3.055-.61-5.092 1.63-8.351 3.26.61.61 1.222 1.629 2.036 2.852-2.852-1.833-4.888-2.444-8.758-1.019-2.648.814-7.74 3.055-11.61 8.555-2.444 8.759 41.145-1.019 41.145-1.019z" fill="#8ac640"></path>
    <path d="m260.007 69.612s0-2.241-.204-4.277c0-.407-1.629-1.426-1.629-1.833l-.407-.408s3.259-1.833 5.703-.814c2.647.814 4.073 4.277 4.073 4.277 4.685-1.629 5.092.204 7.333 2.648 4.889-1.019 5.499.814 8.555 5.296 0 0-3.666-.611-10.795.61-6.926 1.018-12.629-5.703-12.629-5.499z" fill="#010101"></path>
    <path d="m259.192 68.593s1.222-1.019.814-1.223c2.24-1.222 5.296-2.647 6.722 1.223 4.685-1.63 5.296.611 7.536 3.056 5.703-2.648 6.11.61 6.518 2.036-1.833 0-4.48.204-8.147.611-6.925 1.019-13.647-5.907-13.443-5.703z" fill="#8ac640"></path>
    <path d="m189.939 63.501s11.61 4.073 21.387 3.462c9.777-.814 26.479-1.629 35.441 3.667 0 0 9.166-3.26 17.721-1.019 8.556 2.24 24.239 16.906 19.555 32.386-.408 1.019-3.056 2.648-6.111 3.667 0 0 1.63 6.925-1.222 12.628-2.852 5.5-9.166 16.092-9.37 30.757-.203 2.444-.61 7.536-1.018 9.98-15.888-.61-40.33-6.518-64.365-6.11.203-2.647.407-4.277.611-6.925h.61c-1.222-6.722-1.629-10.185-2.852-15.277-7.74-4.888-15.888-10.591-22.812-21.387-6.722-10.796 12.425-45.829 12.425-45.829zm78.623 109.991s12.629 45.219-2.24 64.162c0 0 2.24 8.758-2.852 18.128-.815 4.073-1.834 7.74-2.444 11.813-2.648 16.906-7.13 24.035-8.352 51.125l-12.222-.203s-1.426-19.554-5.703-29.942c-2.443-5.906-12.018-13.851-11.609-21.794.407-6.111 1.629-11.203 12.018-19.351.814-11.813-11-23.017-9.166-67.013z" fill="#010101"></path>
    <path d="m264.896 171.658c3.259 20.776 10.795 51.533-2.852 66.605a30.712 30.712 0 0 1 .203 11.61c-.407 2.444-1.222 5.092-2.24 7.943-2.037 4.889-2.852 12.018-3.463 16.295-2.648 16.906-2.648 17.722-3.87 44.812l-12.222-.204s-1.426-19.554-5.703-29.941c-2.443-5.907-7.536-10.999-7.943-18.943-.407-6.11 3.87-18.331 14.055-17.924-.611-24.646-12.018-19.758-15.073-71.087zm-74.957-108.157s4.481 1.426 9.369 1.833c4.889.407 10.185 0 14.869-.204 9.777-.814 23.628-1.833 32.794 3.463 0 0 5.092-1.63 10.592-1.223 2.444.204 4.889 2.241 7.74 3.056 8.962 2.24 17.517 17.109 13.646 30.553-.407 1.019-3.259 0-6.518 1.019.61 2.852 1.019 9.37-2.241 16.295-3.462 6.926-7.943 15.888-7.129 32.998-21.387-1.019-30.96-2.444-52.144-3.463-1.833-7.537-3.056-15.073-3.259-18.943 2.852-1.426 4.48-2.647 6.722-5.092-6.11 1.019-8.555.611-12.222-1.426-3.666-2.037-10.184-8.555-13.443-12.832-.407-.408-2.647 6.313-7.739 6.518-1.834-2.648 5.906-10.185 4.48-13.036-5.091-10.389 4.483-39.516 4.483-39.516z" fill="#f0efef"></path>
    <path d="m266.524 154.752s.407 7.333.407 9.166c0 2.037 1.63 8.147 1.833 10.999-2.24 3.87-12.017 12.629-29.738 15.888-17.517 3.666-40.737-23.831-40.737-23.831.611-2.648 2.648-10.389 4.074-14.462.204-.407.611-1.426.611-1.833 1.834-2.648 63.55 4.073 63.55 4.073z" fill="#010101"></path>
    <path d="m262.044 155.364c0 5.092.814 8.759 1.426 12.018 1.018 5.907 2.647 9.777 2.647 13.647 0 11.813-15.48 9.776-28.517 10.184-17.517 3.667-32.386-23.831-32.386-23.831 1.222-4.685 2.037-9.98 3.87-14.462.203-2.444.611-5.499.814-6.925 24.85 0 42.367 1.426 52.552 2.443.408 2.241.001 6.111-.406 6.926z" fill="#f0efef"></path>
    <path d="m242.489 181.639s-10.795-24.035-43.182-16.905c-7.739 21.794-18.128 46.848-11.406 73.938-6.722 9.166-14.462 14.259-14.462 31.164 0 16.906.815 19.758.815 19.758l23.831 1.223s7.74-9.98 10.795-20.776c.815-3.056 1.63-8.555 1.019-14.869.814-1.222 4.277-4.073 4.685-9.573 0 0 11.61-6.11 18.332-20.979 6.315-13.446 4.685-25.056 9.573-42.981z" fill="#010101"></path>
    <path d="m242.489 181.639c-.61-2.24-8.758-24.238-38.904-17.721-17.72 47.256-11.202 66.81-8.555 75.364-12.018 15.276-17.517 18.535-15.072 49.496h15.888c7.332-11.61 8.962-15.888 9.369-31.164 0-.611-2.24 1.222-3.87 3.259 1.223-6.314 4.685-7.536 7.333-11.406 1.222-1.63 2.24-4.074 2.24-7.333 14.258-9.573 19.554-21.591 22.609-34.016 2.445-8.554 5.296-22.609 8.962-26.479z" fill="#f0efef"></path>
    <g fill="#010101">
      <path d="m192.179 148.846s5.5.203 10.389 1.833c4.685 1.629 4.685 2.647 6.518 4.685s6.314 5.092 5.5 8.147c-.408 1.63-1.426 2.037-2.852 3.463-.611.611-5.093 5.499-6.111 6.11-.611.407-1.426 1.019-2.037 1.426l-3.055 2.037c-2.037 1.019-3.463 1.63-5.703 1.426 0 0-5.092-.204-8.352-3.666 0 0-.407-1.63.408-2.444 0 0-4.278-3.667-5.5-6.111-1.223-2.443-1.223-5.906-.407-7.739.407-1.835 8.35-6.927 11.202-9.167zm5.093 198.187-.611 5.093s-1.833 2.24-15.48 2.037c-13.851-.204-17.517-4.481-18.739-6.722l-.814-5.296s2.648-3.87 3.259-3.87c4.481.407 19.758 6.518 30.35 8.147 1.016 0 1.219.407 2.035.611zm29.534-10.388c0 2.24-.204 2.24-.204 4.481 2.444 1.833 8.556 2.852 20.165 2.647 16.906-.407 32.59 5.093 51.736 1.833l.204-3.666-1.833-.203-67.828-5.5z"></path>
      <path d="m241.675 343.774h5.092c11-.407 21.388 2.037 32.59 2.648 5.907-.204 13.24-1.63 12.629-5.907l-57.847-4.889c-3.463 3.87-.816 7.129 7.536 8.148zm-66.402-85.752c1.833 1.222 14.258 8.555 34.423 7.536-.408 3.87-.204 11.407-9.166 24.646-4.481 6.518-8.352 17.925-9.166 32.387.204 3.259 2.037 6.11-.407 10.388.814 2.647 4.073 7.943 5.703 11.202 1.629 3.26 2.444 6.926-8.352 7.13-10.999.203-28.72-1.019-26.275-9.573 1.223-4.481 4.685-9.166 5.093-11 .407-1.833.407-7.332 3.869-10.999 3.056-10.184 2.037-19.961 1.427-29.127-1.019-9.574-1.223-24.85 2.851-32.59zm18.943-166.005c14.462-19.351 2.24-34.83-20.979-30.146-9.37 1.833-18.739 8.352-19.351 20.165-3.055.407-9.98.814-13.443 13.443-2.647 9.777-4.073 11.61-8.759 16.498-3.055 3.463.204 10.592 2.444 15.685 7.537 17.517 30.757 19.146 46.441 32.386 5.296-1.426 10.795-7.332 12.425-11.202-13.24-15.685-10.389-21.795-15.685-29.942 5.704-2.038 18.74-9.981 16.907-26.887z"></path>
    </g>
    <path d="m191.364 90.795c.814-1.223 2.24-3.87 2.852-4.889.204-.204 2.444 3.666 2.648 3.463 5.499-8.963 6.925-21.999.61-23.221-1.426-.204-4.073-.814-6.314-1.63-4.073-1.426-7.739-1.426-14.258-.203-8.962 1.629-17.924 8.147-17.924 17.517 0 .611 6.313 2.444 8.147 9.981-3.056-4.278-8.352-8.963-14.666-4.889-6.722 4.277-3.259 14.054-12.221 24.238-3.056 3.463-2.648 7.537.61 15.684 5.296 12.833 30.35 19.758 43.997 31.979 3.259-1.426 5.499-4.685 7.129-7.129-9.166-9.573-12.833-18.536-15.48-25.054-3.259-7.536-6.926-11.813-14.055-17.518 3.667 1.426 6.519 2.852 8.147 4.074 1.833 1.222 4.481 1.426 6.926.611 8.76-3.053 13.445-15.275 13.852-23.014z" fill="#f0efef"></path>
    <path d="m279.968 94.054c-.611 7.74-6.314 3.87-9.369 2.444-6.111-2.648-12.222-4.481-19.351-4.481s-16.295.611-24.238 2.648c-10.999 3.055-14.259 2.852-19.147.407-4.888-2.648-13.442-9.166-13.442-9.166s-.204 2.037 1.833 4.685c2.647 3.259 8.555 7.333 16.498 9.98 3.87 1.223 6.926.407 10.389-.407 18.128-4.481 37.274-5.296 53.365 4.481.815.407 3.667-.815 4.889-2.648 1.628-2.647-1.427-7.943-1.427-7.943z" fill="#010101"></path>
    <path d="m187.291 171.658c1.629 1.019 3.666 1.63 5.906 3.463 0 0-1.833 0-2.647-.814-1.019-.611-3.056-2.444-3.259-2.649z" fill="#0a1825"></path>
    <path d="m246.156 10.135c-.611-1.833-5.093-5.093-15.48-5.093-11.203 0-14.462 3.463-14.665 5.296 0 .611-.815 7.13-1.019 9.777 0 0 0 3.259.203 8.147.204 3.259 1.019 5.092 1.426 9.37.407 4.48 1.63 7.332 3.87 10.999 1.019.61 1.833 1.222 2.852 1.426 4.074.814 11.203 1.018 15.073 0 2.24-.611 5.092-4.481 5.703-7.944.814-4.277 1.629-7.333 1.833-9.98.407-2.647.611-8.555.814-10.185.612-4.48-.407-11.406-.61-11.813z" fill="#f0efef"></path>
    <path d="m224.769 261.892s10.796 4.685 37.479.611c0 0-7.536 37.886-4.073 56.828 0 0 3.462 4.889 29.127 14.258 0 0 11.406 2.852 10.999 8.556 0 0 .407 1.222-13.443.814s-26.887-2.852-36.053-2.852-18.943.407-20.572-2.24c-1.833-2.444.407-8.759 3.055-12.426 2.853-3.869 2.037-6.722 1.834-13.646-.613-18.128-14.464-36.867-8.353-49.903z" fill="#010101"></path>
    <path d="m222.528 265.355c-1.426 2.037.203 9.776 2.24 17.313 2.037 7.536 6.519 12.018 7.537 24.442 1.018 12.221 1.222 13.851-2.241 20.979s-4.481 13.647 7.536 13.851 18.536-.204 30.757 1.63c12.222 1.833 16.499 2.444 23.221 1.426s8.147-3.26 5.296-5.296c-2.852-2.037-14.666-4.277-19.758-8.352-4.889-3.666-18.739-9.777-18.942-11.406-.611-5.5-.815-25.461.203-31.979 1.019-6.519 2.444-15.888 2.852-18.332s2.444-4.889-1.019-4.074c-3.462.814-16.498 2.648-26.275 2.037-9.777-.61-10.795-2.851-11.407-2.239z" fill="#8ac640"></path>
    <path d="m229.454 328.294c3.462 1.629 8.555 2.852 12.425 2.852 0 0-1.427 6.722.814 10.795 2.24 4.074-16.295 1.63-16.295 1.63l-.814-14.462zm53.977 17.517c3.259-1.019 5.5-4.685 2.852-8.147-2.852-3.463-5.296-4.074-1.63-4.277 3.667-.204 17.11 7.943 17.11 7.943l-6.926 6.314zm-61.514-72.513c4.685 1.63 11.814 2.037 17.925 1.833 6.11-.203 15.276-1.019 21.184-3.055 5.906-2.037 3.462 2.24 3.462 2.24l-3.259 3.056s-7.74 3.055-20.368 2.852c-14.869-.204-19.351-1.833-19.351-1.833zm.407 10.185c4.686 1.63 11.814 2.037 17.925 1.833 6.11-.203 14.258-.203 20.165-2.444 2.444-.814 1.019 2.648 1.019 2.648l-1.019 1.833s-7.944 2.852-20.369 2.647c-14.869-.203-17.517-1.426-17.517-1.426z" fill="#010101" opacity=".3"></path>
    <path d="m224.769 261.892s17.721 6.314 37.683 2.037c0 0-7.74 36.46-4.277 55.199 0 0 3.462 4.888 29.127 14.258 0 0 11.406 2.852 10.999 8.555 0 0 .407 1.223-13.443.814-13.851-.407-26.887-2.852-36.053-2.852s-18.943.408-20.572-2.24c-1.833-2.444.407-8.759 3.055-12.425 2.853-3.87 2.037-6.722 1.834-13.647-.613-17.924-14.464-36.663-8.353-49.699z" fill="none"></path>
    <path d="m224.769 261.892s17.721 6.11 37.683 1.833c0 0-7.74 36.664-4.277 55.403 0 0 3.462 4.888 29.127 14.258 0 0 11.406 2.852 10.999 8.555 0 0 .407 1.223-13.443.814-13.851-.407-27.091-4.277-36.053-2.852-9.573 1.63-18.943 1.019-20.572-2.24-1.426-2.647.407-8.759 3.055-12.425 2.853-3.87 2.037-6.722 1.834-13.647-.613-17.924-14.464-36.663-8.353-49.699z" fill="none"></path>
    <path d="m208.881 140.699c0 1.426 15.888 9.369 24.646 10.999 8.759 1.629 27.091 0 29.942-.611l-.408 2.852s-21.794 3.259-38.496-1.222c-16.703-4.481-14.869-5.5-14.869-5.5z" fill="#010101"></path>
    <path d="m174.865 314.443c2.444 1.223 11.203 3.463 16.906 2.241.814-.204 0-14.055 2.241-20.369 3.259-8.759 8.555-15.888 10.998-31.367-8.555-.815-18.331-3.056-23.424-4.686-6.517 19.962-4.276 37.071-6.721 54.181zm13.648 12.833c1.426.407 2.444 2.036 2.852 1.019.814-1.834-1.426-5.296-1.63-7.74v-.204c-1.833-1.629-14.258-1.833-13.443-1.019-1.426 2.648-3.666 2.241-4.48 7.537-.407 2.647 2.852.407 5.906.203-5.499 3.666-11.813 8.352-12.832 12.425-1.222 5.703.815 7.333 6.926 10.389 5.296 1.222 11.61 1.426 16.498 1.222 5.5-1.019 6.519-3.666 4.889-7.333-2.446-5.5-4.075-12.629-4.686-16.499z" fill="#f0efef"></path>
    <path d="m190.753 62.686c6.722 3.87 16.092 2.852 19.554 2.648.815 0 8.963-1.426 9.37-1.223.814.204.814.815.814.815s-3.055 1.629-9.98 2.036c-6.518.407-14.258 0-18.535-2.036-5.093-2.24-1.223-2.24-1.223-2.24zm69.254 3.87c1.222.814 9.166 3.87 12.629 7.536 3.055 3.26 1.426 3.056.814 2.241-.814-1.019-7.129-5.296-9.573-6.314s-5.5-2.852-5.5-3.259 1.63-.204 1.63-.204z" fill="#010101"></path>
    <path d="m189.734 151.086c5.907-.407 12.018 1.019 15.888 5.092 2.037 2.037 5.296 4.277 4.889 6.314 0 .611-1.223 2.241-2.24 3.463-.611.814-2.444 2.647-3.056 3.259-.814.611-3.666 2.852-4.277 3.259-.611.408-1.426 1.427-2.037 1.63-2.036 1.019-4.277.204-6.314-.814-2.036-1.019.408-1.223-1.833-2.852-5.499-3.87-8.555-6.519-6.314-14.055.203-1.426 2.443-3.056 5.294-5.296z" fill="#f0efef"></path>
    <path d="m137.795 104.442c-18.332 7.333-64.977 30.554-78.216 37.683 10.999 6.925 16.091 23.627 17.721 40.533.203 1.63.407 3.056.611 4.685.203 1.426.407 2.444.61 3.056 0 .204 0 .611.204.814 12.018-32.793 54.995-67.42 56.625-70.068.814-1.222-1.019-6.518 1.833-11.609 3.667-6.52 10.797-9.372.612-5.094zm43.589 153.784c9.369-18.739 9.573-36.664 9.369-57.644 0-8.759 6.314-21.184 3.056-17.721-12.222 13.646-42.978 39.312-65.18 40.737 31.164-1.018 43.385 14.666 52.755 34.628z" fill="#010101" opacity=".4"></path>
    <path d="m41.654 159.437c11.61-8.351 71.698-40.329 86.16-44.811 14.461-4.685 9.98-10.185 9.98-10.185s-58.662 25.257-93.696 47.052" fill="#010101"></path>
    <path d="m212.751 100.572c-4.685-1.833-8.351 3.667-7.129 8.963 1.223 5.296 12.222 11.202 11.61 30.553-.407 15.888-3.87 22.405-3.87 22.405l-7.74-9.776s-1.222-21.999-3.87-25.258c-2.647-3.259-10.999-9.166-14.258-12.221-3.259-3.056 3.666-7.129 3.259-12.833-.407-5.499 3.463-16.498 3.463-16.498zm28.313 86.77c-.407 15.276 3.056 37.886 4.481 48.682 1.426 10.795 3.259 11.61 0 16.499-3.259 4.685-7.536 12.425-7.536 12.425l-14.055-1.223s11.203-14.258 11.813-16.906c.611-2.647-5.703-22.812-5.703-22.812zm-27.09-142.58c2.852 6.313 6.314 9.165 11.813 10.999 3.259 1.222 16.091 2.852 21.184-2.852 2.24-2.648.814-9.777.814-9.777l-11.61 9.369-15.684-2.851-1.833-4.685z" fill="#010101" opacity=".4"></path>
    <path d="m215.195 58.816c5.296 3.463 18.536 6.722 22.202 7.333 3.666.814 9.573-3.87 12.425-5.092 3.056-1.426 8.352-2.241 14.462 3.259.611.611-1.426 3.259-1.426 3.259-.204-.204-1.426-.204-3.056-1.019-1.629-.814-3.055-1.426-5.499-1.222-10.185 1.222-11.814 4.685-20.776 2.647s-11.203-3.666-19.961-3.259" fill="#8ac640" stroke="#010101" stroke-linejoin="round" stroke-miterlimit="10" stroke-width="1.586"></path>
    <path d="m213.362 59.427c6.722 2.852 19.758 5.907 23.424 6.722s9.573-2.852 12.425-4.685c5.093-3.259 11.61-.611 14.666 2.852 2.036 2.24 2.852 3.666 2.852 4.277 0 .814-2.444 0-2.444 0-1.426-.611-3.056-.814-4.277-1.63-1.63-.814-3.26-2.036-5.703-1.833-10.185 1.223-12.222 4.685-20.98 2.648s-10.999-3.87-20.368-3.26" fill="#8ac640"></path>
    <path d="m181.791 249.67c-.407-.407.407-.814 0-.814-2.647 0-6.314-2.037-8.352-4.889-8.758-12.628-21.591-20.979-44.811-20.368-34.831.814-48.682-13.443-51.329-40.737-1.426-14.869-5.5-29.331-13.851-37.479l-4.889 3.056c9.369 8.147 12.425 21.387 14.462 39.515 3.259 27.294 25.257 39.923 50.922 40.33 26.683.407 36.256 5.907 46.236 19.351 3.259 4.277 6.926 5.703 9.777 6.314z" fill="#010101"></path>
    <path d="m276.302 118.7c.611 3.055 2.24 8.962 5.499 11.813 1.427 1.426 1.63 1.833.408 1.833-1.223 0-10.185-.407-10.185-.407l-2.444-4.277z" fill="#010101" opacity=".4"></path>
  </symbol>
  <symbol xmlns="http://www.w3.org/2000/svg" xmlns:xlink="http://www.w3.org/1999/xlink" version="1.1" x="0" y="0" xml:space="preserve" viewBox="0 0 492.004 492.004" id="arrow-up">
    <g transform="matrix(-1.8369701987210297e-16,-1,1,-1.8369701987210297e-16,0.00004577636732960855,492.00401306152344)">
      <path d="M382.678 226.804 163.73 7.86C158.666 2.792 151.906 0 144.698 0s-13.968 2.792-19.032 7.86l-16.124 16.12c-10.492 10.504-10.492 27.576 0 38.064L293.398 245.9l-184.06 184.06c-5.064 5.068-7.86 11.824-7.86 19.028 0 7.212 2.796 13.968 7.86 19.04l16.124 16.116c5.068 5.068 11.824 7.86 19.032 7.86s13.968-2.792 19.032-7.86L382.678 265c5.076-5.084 7.864-11.872 7.848-19.088.016-7.244-2.772-14.028-7.848-19.108z" fill="currentColor" opacity="1" data-original="#000000"></path>
    </g>
  </symbol>
  <symbol xmlns="http://www.w3.org/2000/svg" xmlns:xlink="http://www.w3.org/1999/xlink" version="1.1" x="0" y="0" xml:space="preserve" viewBox="0 0 512 512" id="social-mail">
    <g>
      <path d="M256 0C114.841 0 0 114.841 0 256s114.841 256 256 256 256-114.841 256-256S397.159 0 256 0zm0 488C128.075 488 24 383.925 24 256S128.075 24 256 24s232 104.075 232 232-104.075 232-232 232zm120.312-337.5H135.687c-16.094 0-29.188 13.094-29.188 29.188v152.625c0 16.094 13.093 29.188 29.188 29.188h240.625c16.094 0 29.188-13.094 29.188-29.188V179.688c0-16.094-13.094-29.188-29.188-29.188zm-18.089 24L256 255.677 153.776 174.5zm18.089 163H135.687a5.194 5.194 0 0 1-5.188-5.188v-145.65l118.038 93.735c2.185 1.735 4.824 2.603 7.462 2.603s5.278-.867 7.462-2.603L381.5 186.662v145.65a5.194 5.194 0 0 1-5.188 5.188z" fill="currentColor" opacity="1" data-original="#000000"></path>
    </g>
  </symbol>
  <symbol xmlns="http://www.w3.org/2000/svg" xmlns:xlink="http://www.w3.org/1999/xlink" version="1.1" x="0" y="0" xml:space="preserve" viewBox="0 0 512 512" id="social-phone">
    <g>
      <path d="M256 0C114.841 0 0 114.841 0 256s114.841 256 256 256 256-114.841 256-256S397.159 0 256 0zm0 488C128.075 488 24 383.925 24 256S128.075 24 256 24s232 104.075 232 232-104.075 232-232 232zm133.886-185.435c-.001 0-.001 0 0 0l-47.029-27.152c-7.201-4.157-15.604-5.259-23.659-3.101s-14.782 7.313-18.939 14.515c-2.412 4.179-6.637 9.436-13.064 10.75-5.862 1.199-11.037.036-15.821-3.554-17.674-13.264-40.13-35.72-53.396-53.396-3.59-4.784-4.753-9.96-3.554-15.82 1.314-6.429 6.571-10.653 10.75-13.065 14.891-8.599 20.011-27.708 11.414-42.599l-27.152-47.03c-7.777-13.468-23.929-19.117-38.402-13.434l-.563.221c-22.474 8.823-38.908 15.594-45.704 22.39-12.345 12.346-24.849 35.319-14.308 74.658 20.473 76.409 119.184 175.12 195.593 195.594 10.375 2.78 19.611 3.957 27.815 3.957 22.903 0 37.755-9.175 46.845-18.265 6.795-6.795 13.564-23.226 22.386-45.694l.225-.572c5.681-14.475.031-30.626-13.437-38.403zm-8.906 29.631-.225.573c-4.256 10.84-13.111 33.396-17.017 37.494-11.455 11.456-28.774 14.179-51.477 8.097-68.463-18.345-160.279-110.161-178.623-178.624-6.083-22.701-3.359-40.021 8.085-51.464 4.111-3.918 26.673-12.775 37.515-17.031l.564-.222a7.383 7.383 0 0 1 2.711-.522c2.479 0 4.798 1.302 6.135 3.617l27.152 47.029c1.98 3.431.801 7.833-2.629 9.813-11.936 6.891-19.842 17.205-22.263 29.042-2.58 12.618.142 24.732 7.872 35.034 14.689 19.573 38.616 43.5 58.187 58.186 10.3 7.73 22.415 10.452 35.034 7.872 11.837-2.421 22.151-10.328 29.042-22.264a7.127 7.127 0 0 1 4.366-3.332 7.136 7.136 0 0 1 5.448.703l47.028 27.152c3.153 1.822 4.426 5.46 3.095 8.847z" fill="currentColor" opacity="1" data-original="#000000"></path>
    </g>
  </symbol>
</svg>