<?xml version="1.0" encoding="utf-8"?>
<!-- Generator: Adobe Illustrator 22.0.1, SVG Export Plug-In . SVG Version: 6.00 Build 0)  -->
<svg version="1.1" id="Слой_1" xmlns="http://www.w3.org/2000/svg" xmlns:xlink="http://www.w3.org/1999/xlink" x="0px" y="0px"
	 viewBox="0 0 46.4 44" style="enable-background:new 0 0 46.4 44;" xml:space="preserve">
<style type="text/css">
	.st0{display:none;fill:#172e85;}
	.st1{fill:#0454b3;}
	.st2{fill:#0065de;}
	.st3{fill:#045dc7;}
</style>
<g>
	<path class="st0" d="M0,18.4L19.2,1.5c2.3-2,5.8-2,8,0l19.2,16.9H0z M0,18.4"/>
	<path class="st1" d="M0,44h46.4L29.6,31.2H16.8L0,44z M0,44"/>
	<path class="st2" d="M0,44V18.4l16.8,12.8L0,44z M0,44"/>
	<path class="st3" d="M46.4,44V18.4L29.6,31.2L46.4,44z M46.4,44"/>
</g>
</svg>
