<svg width="140" height="141" viewBox="0 0 140 141" fill="none" xmlns="http://www.w3.org/2000/svg">
<path d="M0 70.5C0 31.8401 31.3401 0.5 70 0.5C108.66 0.5 140 31.8401 140 70.5C140 109.16 108.66 140.5 70 140.5C31.3401 140.5 0 109.16 0 70.5Z" fill="#F4F6F8"/>
<path d="M102.007 56H104V38H86V39.9926H102.007V56Z" fill="#5B32F5"/>
<path d="M38.9926 39.9926H55V38H37V56H38.9926V39.9926Z" fill="#5B32F5"/>
<path d="M38.9926 87H37V105H55V103.007H38.9926V87Z" fill="#5B32F5"/>
<path d="M102.007 103.007H86V105H104V87H102.007V103.007Z" fill="#5B32F5"/>
<path d="M37 70H104V71.9629H37V70Z" fill="#5B32F5"/>
<path d="M62.0158 87.5968H51.8972V74H50V88.9815L60.6743 100H66V98.0416H62.0158V87.5968ZM60.1186 96.6569L53.2387 89.5552H60.1186V96.6569Z" fill="#5B32F5"/>
<path d="M85 49H77.1663V51.0769H83.0462V55.9231H57.9538V51.0769H75.2125V49H56V58H85V49Z" fill="#5B32F5"/>
<path d="M68 100H91V74H89.0115V98.0416H68V100Z" fill="#5B32F5"/>
<path d="M89 51H91V68H89V51Z" fill="#5B32F5"/>
<path d="M91 43H50V60H51.9524V44.9673H89.0476L89 49H91V43Z" fill="#5B32F5"/>
<path d="M49.8896 61.8164H51.8525V68.0977H49.8896V61.8164Z" fill="#5B32F5"/>
<path d="M71.0859 61H83.1719V62.9629H71.0859V61Z" fill="#5B32F5"/>
<path d="M67.1602 61H69.123V62.9629H67.1602V61Z" fill="#5B32F5"/>
<path d="M58 61H65.1973V62.9629H58V61Z" fill="#5B32F5"/>
<path d="M58 65H71.0859V66.9629H58V65Z" fill="#5B32F5"/>
<path d="M73 65H74.9629V66.9629H73V65Z" fill="#5B32F5"/>
<path d="M77 65H78.9629V66.9629H77V65Z" fill="#5B32F5"/>
<path d="M69 82H83V84H69V82Z" fill="#5B32F5"/>
<path d="M72 86H81V88H72V86Z" fill="#5B32F5"/>
</svg>
