<svg width="74" height="74" viewBox="0 0 74 74" fill="none" xmlns="http://www.w3.org/2000/svg">
<circle cx="37" cy="37" r="37" fill="#E6EAF0"/>
<path d="M34.1721 19.4418L24.8884 23.0143C22.7488 23.8314 21 26.4157 21 28.734V42.8527C21 45.095 22.4512 48.0404 24.2186 49.3895L32.2186 55.4893C34.8419 57.5036 39.1581 57.5036 41.7814 55.4893L49.7814 49.3895C51.5488 48.0404 53 45.095 53 42.8527V28.734C53 26.3967 51.2512 23.8124 49.1116 22.9952L39.8279 19.4418C38.2465 18.8527 35.7163 18.8527 34.1721 19.4418Z" stroke="#5B32F5" stroke-width="2" stroke-linecap="round" stroke-linejoin="round"/>
<path d="M32 38.0047L34.9966 41L43 33" stroke="#5B32F5" stroke-width="2" stroke-linecap="round" stroke-linejoin="round"/>
</svg>
