<svg width="24" height="24" viewBox="0 0 24 24" fill="none" xmlns="http://www.w3.org/2000/svg">
<path d="M-0.000976562 12C-0.000976562 5.37258 5.37161 0 11.999 0C18.6264 0 23.999 5.37258 23.999 12C23.999 18.6274 18.6264 24 11.999 24C5.37161 24 -0.000976562 18.6274 -0.000976562 12Z" fill="#F4F6F8"/>
<path d="M10.249 13.6667L6.74902 10.3333L4.99902 12L10.249 17L18.999 8.66667L17.249 7L10.249 13.6667Z" fill="#55E18D"/>
</svg>
