<svg width="40" height="40" viewBox="0 0 40 40" fill="none" xmlns="http://www.w3.org/2000/svg">
<path d="M20 40C31.0457 40 40 31.0457 40 20C40 8.9543 31.0457 0 20 0C8.9543 0 0 8.9543 0 20C0 31.0457 8.9543 40 20 40Z" fill="#039BE5"/>
<path d="M9.02438 18.4311L28.5348 11.0898C29.4403 10.7706 30.2312 11.3054 29.9378 12.6417L29.9395 12.64L26.6175 27.9133C26.3713 28.9961 25.7119 29.2594 24.7895 28.7493L19.7307 25.1107L17.2906 27.4048C17.0208 27.6681 16.7931 27.8902 16.2704 27.8902L16.6296 22.8661L26.0054 14.6C26.4134 14.2495 25.9143 14.052 25.3764 14.4009L13.7898 21.5199L8.79504 19.9994C7.71076 19.6637 7.68715 18.9412 9.02438 18.4311V18.4311Z" fill="white"/>
</svg>
