<svg width="74" height="74" viewBox="0 0 74 74" fill="none" xmlns="http://www.w3.org/2000/svg">
<circle cx="37" cy="37" r="37" fill="#F4F6F8"/>
<path d="M19 31H43" stroke="#5B32F5" stroke-width="2" stroke-miterlimit="10" stroke-linecap="round" stroke-linejoin="round"/>
<path d="M26 45H28.365" stroke="#5B32F5" stroke-width="2" stroke-miterlimit="10" stroke-linecap="round" stroke-linejoin="round"/>
<path d="M35.1667 45H41.5834" stroke="#5B32F5" stroke-width="2" stroke-miterlimit="10" stroke-linecap="round" stroke-linejoin="round"/>
<path d="M29 53H46.0827C52.4308 53 54 51.3835 54 44.9361V28" stroke="#5B32F5" stroke-width="2" stroke-linecap="round" stroke-linejoin="round"/>
<path d="M51 22C50 21.5 47.4742 21 45.6776 21H25.8977C19.5831 21 18 22.6933 18 29.4474V45.2453C18 49.748 18.6937 51.9994 21.0417 53" stroke="#5B32F5" stroke-width="2" stroke-linecap="round" stroke-linejoin="round"/>
<path d="M55 19L19 55" stroke="#5B32F5" stroke-width="2" stroke-linecap="round" stroke-linejoin="round"/>
</svg>
