<svg width="74" height="74" viewBox="0 0 74 74" fill="none" xmlns="http://www.w3.org/2000/svg">
<g clip-path="url(#clip0_249_4776)">
<circle cx="37" cy="36.999" r="37" fill="#E6EAF0"/>
<g clip-path="url(#clip1_249_4776)">
<path d="M52.44 30.299C52.1674 29.9025 51.8033 29.5775 51.3787 29.3512C50.954 29.1249 50.4812 29.0042 50 28.999H41V21.999C41.0045 21.4063 40.8292 20.8261 40.4971 20.3352C40.165 19.8442 39.6918 19.4655 39.14 19.249C38.5889 19.014 37.9801 18.9494 37.3919 19.0634C36.8038 19.1775 36.2633 19.465 35.84 19.889C35.8109 19.9131 35.7841 19.9399 35.76 19.969L28.65 28.969V29.029H24C23.7348 29.029 23.4804 29.1344 23.2929 29.3219C23.1054 29.5095 23 29.7638 23 30.029V49.999C23 50.2642 23.1054 50.5186 23.2929 50.7061C23.4804 50.8937 23.7348 50.999 24 50.999H47.15C47.884 51.0049 48.5947 50.7415 49.1475 50.2587C49.7004 49.7759 50.057 49.1071 50.15 48.379L50.71 43.919C50.8491 42.8395 51.1107 39.7793 51.49 38.759L52.85 33.139C53.0156 32.6676 53.0648 32.1632 52.9934 31.6687C52.922 31.1742 52.7321 30.7043 52.44 30.299ZM25 30.999H28V48.999H25V30.999ZM50.94 32.439L49.58 38.059C49.1396 39.2223 48.8407 42.4343 48.69 43.669L48.13 48.139C48.096 48.3793 47.9759 48.599 47.7919 48.7573C47.6079 48.9155 47.3727 49.0014 47.13 48.999H30V30.799C30.0007 30.5781 30.0745 30.3636 30.21 30.189L37.29 21.259C37.435 21.1269 37.6156 21.0404 37.8094 21.0101C38.0032 20.9799 38.2017 21.0073 38.38 21.089C38.5611 21.1634 38.7163 21.2892 38.8265 21.451C38.9367 21.6128 38.9971 21.8033 39 21.999V29.999C39 30.2642 39.1054 30.5186 39.2929 30.7061C39.4804 30.8937 39.7348 30.999 40 30.999H50C50.1553 31.0067 50.3066 31.0505 50.442 31.1268C50.5774 31.2032 50.6931 31.3101 50.78 31.439C50.8848 31.5807 50.9541 31.7455 50.9819 31.9195C51.0098 32.0935 50.9954 32.2717 50.94 32.439Z" fill="#5B32F5"/>
</g>
</g>
<defs>
<clipPath id="clip0_249_4776">
<rect width="74" height="74" fill="white" transform="translate(0 -0.000976562)"/>
</clipPath>
<clipPath id="clip1_249_4776">
<rect width="32" height="32" fill="white" transform="translate(21 18.999)"/>
</clipPath>
</defs>
</svg>
