<svg width="74" height="74" viewBox="0 0 74 74" fill="none" xmlns="http://www.w3.org/2000/svg">
<g clip-path="url(#clip0_249_4791)">
<circle cx="37" cy="36.999" r="37" fill="#E6EAF0"/>
<path d="M49.0083 22.0283H24.9918C21.1365 22.0283 18 25.1648 18 29.0201C18 32.8754 21.1365 36.0119 24.9918 36.0119H32.0827V42.6606L31.8341 42.4521C30.6054 41.421 28.6827 41.5048 27.5484 42.6392C26.3597 43.8279 26.4376 45.7171 27.7302 46.8016L32.0826 50.4538V53.9736C32.0826 54.5237 32.5286 54.9697 33.0787 54.9697H45.0318C45.5819 54.9697 46.0279 54.5237 46.0279 53.9736V42.7805C46.0279 41.276 44.9021 40.0011 43.4091 39.8151L38.0592 39.1486V36.0118H49.0083C52.8636 36.0118 56 32.8752 56 29.02C56 25.1647 52.8636 22.0283 49.0083 22.0283ZM34.0748 52.9775V50.9854H44.0357V52.9775H34.0748ZM43.1628 41.792C43.6605 41.854 44.0358 42.279 44.0358 42.7805V48.9932H33.4413L29.0107 45.2755C28.6174 44.9455 28.5936 44.4114 28.9571 44.0478C29.3653 43.6396 30.1113 43.6071 30.5536 43.9782L32.4385 45.5598C33.085 46.1022 34.0749 45.642 34.0749 44.7967V31.0596C34.0749 30.5103 34.5217 30.0635 35.071 30.0635C35.6202 30.0635 36.0671 30.5103 36.0671 31.0596V40.0283C36.0671 40.5308 36.4414 40.9546 36.94 41.0168L43.1628 41.792ZM49.0083 34.0196H38.0592V31.0596C38.0592 29.4118 36.7186 28.0713 35.0709 28.0713C33.4232 28.0713 32.0826 29.4118 32.0826 31.0596V34.0196H24.9917C22.235 34.0196 19.9922 31.7768 19.9922 29.0201C19.9922 26.2634 22.235 24.0205 24.9918 24.0205H49.0083C51.765 24.0205 54.0078 26.2633 54.0078 29.0201C54.0078 31.7769 51.765 34.0196 49.0083 34.0196Z" fill="#5B32F5"/>
<path d="M46.2498 26.3045L42.9698 29.5845L41.6819 28.2967C41.2929 27.9077 40.6622 27.9077 40.2732 28.2967C39.8842 28.6857 39.8842 29.3164 40.2732 29.7054L42.2654 31.6976C42.6543 32.0866 43.2851 32.0866 43.6741 31.6976L47.6584 27.7132C48.0474 27.3242 48.0474 26.6935 47.6584 26.3045C47.2695 25.9154 46.6388 25.9154 46.2498 26.3045Z" fill="#5B32F5"/>
</g>
<defs>
<clipPath id="clip0_249_4791">
<rect width="74" height="74" fill="white" transform="translate(0 -0.000976562)"/>
</clipPath>
</defs>
</svg>
