<svg width="74" height="74" viewBox="0 0 74 74" fill="none" xmlns="http://www.w3.org/2000/svg">
<circle cx="37" cy="37" r="37" fill="#E6EAF0"/>
<path d="M43.5813 20H30.4187C25.75 20 24.7188 22.2766 24.1188 25.0673L22 35H52L49.8813 25.0673C49.2813 22.2766 48.25 20 43.5813 20Z" stroke="#5B32F5" stroke-width="2" stroke-linecap="round" stroke-linejoin="round"/>
<path d="M54.9842 51.0364C55.1823 53.1636 53.49 55 51.3298 55H47.9454C46.0011 55 45.7311 54.1636 45.389 53.1273L45.029 52.0364C44.5249 50.5455 43.5923 49 41 49H37H33C30.4077 49 29.4211 50.6727 28.971 52.0364L28.611 53.1273C28.2689 54.1636 27.9989 55 26.0546 55H22.6702C20.51 55 18.8177 53.1636 19.0158 51.0364L20.0239 39.9636C20.2759 37.2364 20.798 35 25.5146 35H48.4854C53.202 35 53.7241 37.2364 53.9761 39.9636L54.9842 51.0364Z" stroke="#5B32F5" stroke-width="2" stroke-linecap="round" stroke-linejoin="round"/>
<path d="M22.8333 29H21" stroke="#5B32F5" stroke-width="2" stroke-linecap="round" stroke-linejoin="round"/>
<path d="M52.8333 29H51" stroke="#5B32F5" stroke-width="2" stroke-linecap="round" stroke-linejoin="round"/>
<path d="M37 21V24" stroke="#5B32F5" stroke-width="2" stroke-linecap="round" stroke-linejoin="round"/>
<path d="M34 24H40" stroke="#5B32F5" stroke-width="2" stroke-linecap="round" stroke-linejoin="round"/>
<path d="M26 42H31.5" stroke="#5B32F5" stroke-width="2" stroke-linecap="round" stroke-linejoin="round"/>
<path d="M42 42H47.5" stroke="#5B32F5" stroke-width="2" stroke-linecap="round" stroke-linejoin="round"/>
</svg>
