<svg width="24" height="24" viewBox="0 0 24 24" fill="none" xmlns="http://www.w3.org/2000/svg">
<path d="M10.249 13.6667L6.74902 10.3333L4.99902 12L10.249 17L18.999 8.66667L17.249 7L10.249 13.6667Z" fill="#24222D"/>
</svg>
