<svg width="176" height="113" viewBox="0 0 176 113" fill="none" xmlns="http://www.w3.org/2000/svg">
<g opacity="0.5">
<path d="M84 56.5C84 55.9477 84.4477 55.5 85 55.5H101C101.552 55.5 102 55.9477 102 56.5V56.5C102 57.0523 101.552 57.5 101 57.5H85C84.4477 57.5 84 57.0523 84 56.5V56.5Z" fill="#D9D9D9"/>
<path d="M93 47.5C93.5523 47.5 94 47.9477 94 48.5L94 64.5C94 65.0523 93.5523 65.5 93 65.5V65.5C92.4477 65.5 92 65.0523 92 64.5L92 48.5C92 47.9477 92.4477 47.5 93 47.5V47.5Z" fill="#D9D9D9"/>
<rect x="1" y="1" width="174" height="111" rx="15" stroke="#E6EAF0" stroke-width="2" stroke-dasharray="10 10"/>
</g>
</svg>
