<svg width="94" height="114" viewBox="0 0 94 114" fill="none" xmlns="http://www.w3.org/2000/svg">
<g filter="url(#filter0_d_141_2329)">
<path d="M10 37C10 16.5655 26.5655 0 47 0C67.4345 0 84 16.5655 84 37C84 57.4345 67.4345 74 47 74C26.5655 74 10 57.4345 10 37Z" fill="#FFC945"/>
<g clip-path="url(#clip0_141_2329)">
<path d="M45 23H50V28H45V23Z" fill="#A68535"/>
<path d="M40 28H45V33H40V28Z" fill="#A68535"/>
<path d="M50 28H55V33H50V28Z" fill="#A68535"/>
<path d="M35 33H40V38H35V33Z" fill="#A68535"/>
<path d="M55 33H60V38H55V33Z" fill="#A68535"/>
<path d="M45 33H50V52H45V33Z" fill="#A68535"/>
</g>
</g>
<defs>
<filter id="filter0_d_141_2329" x="0" y="0" width="94" height="114" filterUnits="userSpaceOnUse" color-interpolation-filters="sRGB">
<feFlood flood-opacity="0" result="BackgroundImageFix"/>
<feColorMatrix in="SourceAlpha" type="matrix" values="0 0 0 0 0 0 0 0 0 0 0 0 0 0 0 0 0 0 127 0" result="hardAlpha"/>
<feMorphology radius="20" operator="erode" in="SourceAlpha" result="effect1_dropShadow_141_2329"/>
<feOffset dy="30"/>
<feGaussianBlur stdDeviation="15"/>
<feComposite in2="hardAlpha" operator="out"/>
<feColorMatrix type="matrix" values="0 0 0 0 0.520833 0 0 0 0 0.395378 0 0 0 0 0.0889757 0 0 0 0.35 0"/>
<feBlend mode="normal" in2="BackgroundImageFix" result="effect1_dropShadow_141_2329"/>
<feBlend mode="normal" in="SourceGraphic" in2="effect1_dropShadow_141_2329" result="shape"/>
</filter>
<clipPath id="clip0_141_2329">
<rect width="25" height="29" fill="white" transform="translate(35 23)"/>
</clipPath>
</defs>
</svg>
