<svg width="789" height="206" viewBox="0 0 789 206" fill="none" xmlns="http://www.w3.org/2000/svg">
<path d="M567.9 205C630.9 211.1 687.7 173.4 727.7 130.3C747.8 108.7 763.7 85.7997 774.1 66.1997C779.3 56.3997 783.2 47.3997 785.6 39.8997C787.9 32.3997 788.8 26.0997 787.9 21.8997L785.9 22.2997C786.7 25.9997 786 31.8997 783.7 39.2997C781.4 46.6997 777.6 55.5997 772.4 65.2997C762 84.6997 746.2 107.6 726.2 129C686.3 171.9 630.1 209.2 568 203.1C470.8 193.6 412.3 148.4 363.5 103.2C339.2 80.5997 317.2 57.9997 294 39.9997C270.8 21.9997 246.4 8.39967 217.1 4.09967C119.8 -10.4003 64.2 18.6997 33.7 54.5997C18.5 72.4997 9.5 91.9997 4.8 108.5C2.4 116.7 1.10001 124.2 0.500013 130.4C1.32918e-05 136.5 0.200013 141.4 1.00001 144.4L2.90004 143.9C2.20004 141.2 1.90001 136.6 2.50001 130.6C3.00001 124.6 4.30003 117.2 6.70003 109.1C11.4 92.8997 20.2 73.5997 35.2 55.9997C65.2 20.7997 120.1 -8.20033 216.8 6.19967C245.6 10.4997 269.7 23.7997 292.8 41.6997C315.9 59.6997 337.8 82.0997 362.2 104.8C411.2 149.9 470.1 195.5 567.9 205Z" fill="white"/>
<path d="M276.4 27.4002C273.6 25.6002 270.8 23.9002 268 22.3002C267.5 22.0002 266.9 22.2002 266.6 22.7002C266.3 23.2002 266.5 23.8002 267 24.1002C269.8 25.7002 272.6 27.4002 275.3 29.2002C275.8 29.5002 276.4 29.4002 276.7 28.9002C277 28.3002 276.9 27.7002 276.4 27.4002Z" fill="#E6EAF0"/>
<path d="M182.8 0.500195C179.4 0.300195 176.1 0.200195 172.8 0.200195C172.2 0.200195 171.8 0.600195 171.8 1.2002C171.8 1.8002 172.2 2.2002 172.8 2.2002C176 2.2002 179.3 2.4002 182.7 2.5002C183.3 2.5002 183.7 2.1002 183.7 1.6002C183.8 1.0002 183.4 0.600195 182.8 0.500195Z" fill="#E6EAF0"/>
<path d="M284.6 32.9002C284.1 32.6002 283.5 32.7002 283.2 33.1002C282.9 33.6002 283 34.2002 283.4 34.5002C286 36.4002 288.7 38.3002 291.3 40.3002C291.7 40.6002 292.4 40.6002 292.7 40.1002C293 39.6002 293 39.0002 292.5 38.7002C289.9 36.8002 287.2 34.8002 284.6 32.9002Z" fill="#E6EAF0"/>
<path d="M202.4 2.1002C199.1 1.7002 195.8 1.4002 192.5 1.2002C191.9 1.2002 191.5 1.6002 191.4 2.1002C191.4 2.7002 191.8 3.1002 192.3 3.2002C195.5 3.5002 198.8 3.8002 202.1 4.1002C202.6 4.2002 203.1 3.8002 203.2 3.2002C203.4 2.7002 203 2.2002 202.4 2.1002Z" fill="#E6EAF0"/>
<path d="M222.1 4.8002C220.5 4.5002 218.8 4.2002 217.2 4.0002C215.5 3.7002 213.9 3.5002 212.2 3.3002C211.7 3.2002 211.1 3.6002 211.1 4.2002C211 4.7002 211.4 5.3002 212 5.3002C213.6 5.5002 215.3 5.8002 217 6.0002C218.6 6.2002 220.2 6.5002 221.8 6.8002C222.3 6.9002 222.9 6.5002 223 6.0002C223 5.5002 222.6 4.9002 222.1 4.8002Z" fill="#E6EAF0"/>
<path d="M241.1 9.9002C238 8.8002 234.9 7.9002 231.7 7.0002C231.2 6.9002 230.6 7.2002 230.5 7.7002C230.4 8.2002 230.7 8.8002 231.2 8.9002C234.4 9.7002 237.5 10.7002 240.5 11.7002C241 11.9002 241.6 11.6002 241.8 11.1002C241.9 10.6002 241.7 10.1002 241.1 9.9002Z" fill="#E6EAF0"/>
<path d="M259.3 17.6002C256.4 16.1002 253.4 14.7002 250.3 13.5002C249.8 13.3002 249.2 13.5002 249 14.0002C248.8 14.5002 249 15.1002 249.5 15.3002C252.5 16.6002 255.4 17.9002 258.3 19.4002C258.8 19.6002 259.4 19.4002 259.6 19.0002C260 18.4002 259.8 17.8002 259.3 17.6002Z" fill="#E6EAF0"/>
<path d="M358.1 98.0002C357.7 97.6002 357.1 97.6002 356.7 98.0002C356.3 98.4002 356.3 99.0002 356.7 99.4002C359.1 101.6 361.5 103.9 363.9 106.1C364.3 106.5 364.9 106.4 365.3 106C365.7 105.6 365.6 105 365.2 104.6C362.8 102.5 360.5 100.2 358.1 98.0002Z" fill="#E6EAF0"/>
<path d="M343.8 84.5002C343.4 84.1002 342.8 84.1002 342.4 84.5002C342 84.9002 342 85.5002 342.4 85.9002C344.8 88.1002 347.1 90.4002 349.5 92.7002C349.9 93.1002 350.5 93.1002 350.9 92.7002C351.3 92.3002 351.3 91.7002 350.9 91.3002C348.6 89.0002 346.2 86.8002 343.8 84.5002Z" fill="#E6EAF0"/>
<path d="M300.2 44.9002C299.8 44.6002 299.1 44.6002 298.8 45.0002C298.4 45.4002 298.5 46.1002 298.9 46.4002C301.4 48.4002 303.9 50.5002 306.4 52.7002C306.8 53.1002 307.4 53.0002 307.8 52.6002C308.2 52.2002 308.1 51.6002 307.7 51.2002C305.2 49.1002 302.7 46.9002 300.2 44.9002Z" fill="#E6EAF0"/>
<path d="M315.1 57.7002C314.7 57.3002 314.1 57.4002 313.7 57.8002C313.3 58.2002 313.4 58.8002 313.8 59.2002C316.2 61.4002 318.6 63.6002 321.1 65.8002C321.5 66.2002 322.1 66.1002 322.5 65.7002C322.9 65.3002 322.8 64.7002 322.4 64.3002C320 62.1002 317.5 59.9002 315.1 57.7002Z" fill="#E6EAF0"/>
<path d="M329.6 71.0002C329.2 70.6002 328.6 70.6002 328.2 71.0002C327.8 71.4002 327.8 72.0002 328.2 72.4002C330.6 74.6002 332.9 76.9002 335.3 79.1002C335.7 79.5002 336.3 79.5002 336.7 79.1002C337.1 78.7002 337.1 78.1002 336.7 77.7002C334.3 75.5002 332 73.2002 329.6 71.0002Z" fill="#E6EAF0"/>
<path d="M123.8 4.2002C120.5 4.8002 117.3 5.6002 114.1 6.3002C113.6 6.4002 113.2 7.0002 113.4 7.5002C113.5 8.0002 114.1 8.4002 114.6 8.2002C117.7 7.4002 120.9 6.7002 124.2 6.1002C124.7 6.0002 125.1 5.5002 125 4.9002C124.9 4.5002 124.4 4.1002 123.8 4.2002Z" fill="#E6EAF0"/>
<path d="M8.70001 99.7002C8.20001 99.5002 7.60002 99.8002 7.40002 100.3C6.30002 103.5 5.30002 106.7 4.40002 109.7C4.30002 110.2 4.59997 110.8 5.09997 110.9C5.59997 111 6.19998 110.7 6.29998 110.2C7.09998 107.2 8.10001 104.1 9.20001 100.9C9.50001 100.5 9.20001 99.9002 8.70001 99.7002Z" fill="#E6EAF0"/>
<path d="M16.6 81.7002C16.1 81.4002 15.5 81.6002 15.3 82.1002C13.7 85.1002 12.3 88.1002 11.1 91.1002C10.9 91.6002 11.1 92.2002 11.6 92.4002C12.1 92.6002 12.7 92.4002 12.9 91.9002C14.2 89.0002 15.5 86.0002 17.1 83.0002C17.3 82.6002 17.1 82.0002 16.6 81.7002Z" fill="#E6EAF0"/>
<path d="M37.9 49.8002C35.6 52.3002 33.5 54.8002 31.4 57.3002C31.1 57.7002 31.1 58.4002 31.5 58.7002C31.9 59.0002 32.6 59.0002 32.9 58.6002C34.9 56.1002 37 53.6002 39.3 51.2002C39.7 50.8002 39.7 50.2002 39.2 49.8002C38.9 49.4002 38.2 49.4002 37.9 49.8002Z" fill="#E6EAF0"/>
<path d="M25.4 65.2002C23.5 68.0002 21.7 70.7002 20 73.5002C19.7 74.0002 19.9 74.6002 20.3 74.9002C20.7 75.2002 21.4 75.0002 21.7 74.6002C23.3 71.9002 25.1 69.1002 27 66.4002C27.3 65.9002 27.2 65.3002 26.8 65.0002C26.4 64.7002 25.7 64.8002 25.4 65.2002Z" fill="#E6EAF0"/>
<path d="M3.29998 118.6C2.79998 118.5 2.19997 118.8 2.09997 119.4C1.39997 122.9 0.899969 126.2 0.599969 129.2C0.499969 129.7 0.899994 130.2 1.49999 130.3C1.99999 130.4 2.49997 130 2.59997 129.4C2.89997 126.5 3.39997 123.2 4.09997 119.8C4.19997 119.3 3.79998 118.7 3.29998 118.6Z" fill="#E6EAF0"/>
<path d="M1.29998 138.2C0.699983 138.2 0.30002 138.7 0.40002 139.3C0.50002 141.3 0.699971 143 1.09997 144.3L3 143.8C2.7 142.6 2.50002 141.1 2.40002 139.2C2.30002 138.6 1.79998 138.2 1.29998 138.2Z" fill="#E6EAF0"/>
<path d="M104.6 9.0002C101.4 10.0002 98.3 11.0002 95.2 12.2002C94.7 12.4002 94.4 13.0002 94.6 13.5002C94.8 14.0002 95.4 14.3002 95.9 14.1002C98.9 13.0002 102 12.0002 105.2 11.0002C105.7 10.8002 106 10.3002 105.9 9.8002C105.7 9.1002 105.1 8.8002 104.6 9.0002Z" fill="#E6EAF0"/>
<path d="M52.3 36.3002C49.7 38.4002 47.2 40.6002 44.8 42.8002C44.4 43.2002 44.4 43.8002 44.8 44.2002C45.2 44.6002 45.8 44.6002 46.2 44.2002C48.5 42.0002 51 39.9002 53.6 37.8002C54 37.5002 54.1 36.8002 53.7 36.4002C53.4 36.0002 52.8 36.0002 52.3 36.3002Z" fill="#E6EAF0"/>
<path d="M372.5 111.3C372.1 110.9 371.5 111 371.1 111.4C370.7 111.8 370.8 112.4 371.2 112.8C373.6 115 376.1 117.1 378.5 119.3C378.9 119.7 379.5 119.6 379.9 119.2C380.3 118.8 380.2 118.2 379.8 117.8C377.4 115.6 374.9 113.5 372.5 111.3Z" fill="#E6EAF0"/>
<path d="M143.3 1.4002C140 1.7002 136.7 2.1002 133.5 2.6002C133 2.7002 132.6 3.2002 132.7 3.7002C132.8 4.2002 133.3 4.6002 133.8 4.5002C137 4.0002 140.2 3.6002 143.5 3.3002C144 3.2002 144.4 2.8002 144.4 2.2002C144.3 1.8002 143.8 1.4002 143.3 1.4002Z" fill="#E6EAF0"/>
<path d="M163 0.200195C159.7 0.300195 156.4 0.400195 153.2 0.600195C152.6 0.600195 152.2 1.1002 152.3 1.7002C152.3 2.3002 152.8 2.7002 153.4 2.6002C156.6 2.4002 159.8 2.3002 163.1 2.2002C163.7 2.2002 164.1 1.7002 164.1 1.2002C164 0.700195 163.6 0.200195 163 0.200195Z" fill="#E6EAF0"/>
<path d="M86.1 15.9002C83 17.3002 80.1 18.7002 77.2 20.2002C76.7 20.5002 76.5 21.1002 76.8 21.5002C77.1 22.0002 77.7 22.2002 78.1 21.9002C80.9 20.4002 83.9 19.0002 86.9 17.7002C87.4 17.5002 87.6 16.9002 87.4 16.4002C87.2 15.9002 86.6 15.6002 86.1 15.9002Z" fill="#E6EAF0"/>
<path d="M68.5 25.0002C65.6 26.7002 62.9 28.5002 60.2 30.4002C59.7 30.7002 59.6 31.3002 60 31.8002C60.4 32.3002 60.9 32.4002 61.4 32.0002C64 30.2002 66.7 28.4002 69.6 26.7002C70.1 26.4002 70.2 25.8002 69.9 25.3002C69.6 24.8002 69 24.7002 68.5 25.0002Z" fill="#E6EAF0"/>
<path d="M460.3 173C457.3 171.5 454.4 170.1 451.6 168.5C451.1 168.2 450.5 168.4 450.2 168.9C449.9 169.4 450.1 170 450.6 170.3C453.5 171.8 456.4 173.3 459.4 174.8C459.9 175 460.5 174.8 460.7 174.3C461 173.9 460.8 173.3 460.3 173Z" fill="#E6EAF0"/>
<path d="M717.4 138.1C715 140.5 712.5 142.9 710 145.2C709.6 145.6 709.6 146.2 709.9 146.6C710.3 147 710.9 147 711.3 146.7C713.8 144.4 716.3 142 718.7 139.6C719.1 139.2 719.1 138.6 718.7 138.2C718.4 137.7 717.8 137.7 717.4 138.1Z" fill="#E6EAF0"/>
<path d="M731.4 123.2C729.2 125.7 726.9 128.2 724.5 130.7C724.1 131.1 724.1 131.7 724.5 132.1C724.9 132.5 725.5 132.5 725.9 132.1C728.3 129.6 730.6 127.1 732.8 124.5C733.2 124.1 733.1 123.5 732.7 123.1C732.4 122.8 731.8 122.8 731.4 123.2Z" fill="#E6EAF0"/>
<path d="M702.4 152C699.8 154.2 697.2 156.4 694.6 158.5C694.2 158.8 694.1 159.5 694.4 159.9C694.8 160.3 695.4 160.4 695.8 160.1C698.5 157.9 701.1 155.7 703.7 153.5C704.1 153.1 704.2 152.5 703.8 152.1C703.4 151.7 702.8 151.6 702.4 152Z" fill="#E6EAF0"/>
<path d="M686.5 164.8C683.8 166.8 681 168.8 678.2 170.7C677.7 171 677.6 171.6 677.9 172.1C678.2 172.6 678.8 172.7 679.3 172.4C682.1 170.5 684.9 168.5 687.7 166.4C688.2 166.1 688.2 165.4 687.9 165C687.6 164.5 687 164.4 686.5 164.8Z" fill="#E6EAF0"/>
<path d="M744.5 107.5C742.4 110.2 740.3 112.8 738.1 115.5C737.8 115.9 737.8 116.6 738.2 116.9C738.6 117.3 739.3 117.2 739.6 116.8C741.8 114.1 744 111.5 746.1 108.8C746.4 108.4 746.4 107.7 745.9 107.4C745.5 107 744.9 107.1 744.5 107.5Z" fill="#E6EAF0"/>
<path d="M669.7 176.2C666.8 178 663.9 179.7 660.9 181.4C660.4 181.7 660.2 182.3 660.5 182.8C660.8 183.3 661.4 183.5 661.9 183.2C664.9 181.5 667.9 179.8 670.8 178C671.3 177.7 671.4 177.1 671.1 176.6C670.8 176.1 670.1 176 669.7 176.2Z" fill="#E6EAF0"/>
<path d="M768.9 73.5002C768.4 73.2002 767.8 73.4002 767.5 73.9002C765.8 76.8002 764 79.7002 762.2 82.6002C761.9 83.1002 762 83.7002 762.5 84.0002C763 84.3002 763.6 84.2002 763.9 83.7002C765.8 80.7002 767.6 77.8002 769.3 74.9002C769.6 74.4002 769.4 73.7002 768.9 73.5002Z" fill="#E6EAF0"/>
<path d="M788 21.8002L786 22.2002C786.3 23.5002 786.4 25.1002 786.3 26.9002C786.3 27.5002 786.7 27.9002 787.2 28.0002C787.8 28.0002 788.2 27.6002 788.3 27.1002C788.4 25.1002 788.3 23.3002 788 21.8002Z" fill="#E6EAF0"/>
<path d="M785.7 36.1002C785.2 36.0002 784.6 36.3002 784.5 36.8002C783.7 39.8002 782.6 43.0002 781.2 46.4002C781 46.9002 781.3 47.5002 781.8 47.7002C782.3 47.9002 782.9 47.6002 783.1 47.1002C784.5 43.6002 785.6 40.3002 786.4 37.3002C786.6 36.8002 786.2 36.3002 785.7 36.1002Z" fill="#E6EAF0"/>
<path d="M778.5 55.3002C778 55.1002 777.4 55.3002 777.2 55.8002C775.8 58.7002 774.3 61.8002 772.6 65.0002C772.3 65.5002 772.5 66.1002 773 66.4002C773.5 66.7002 774.1 66.5002 774.3 66.0002C776 62.8002 777.5 59.7002 779 56.8002C779.2 56.1002 779 55.5002 778.5 55.3002Z" fill="#E6EAF0"/>
<path d="M756.6 91.0002C754.7 93.8002 752.7 96.5002 750.7 99.3002C750.4 99.7002 750.5 100.4 750.9 100.7C751.3 101 752 100.9 752.3 100.5C754.4 97.7002 756.3 94.9002 758.3 92.1002C758.6 91.6002 758.5 91.0002 758 90.7002C757.5 90.4002 756.9 90.6002 756.6 91.0002Z" fill="#E6EAF0"/>
<path d="M651.8 186.2C648.8 187.7 645.7 189.1 642.6 190.5C642.1 190.7 641.9 191.3 642.1 191.8C642.3 192.3 642.9 192.5 643.4 192.3C646.6 190.9 649.7 189.5 652.7 188C653.2 187.8 653.4 187.2 653.2 186.7C652.9 186.1 652.3 185.9 651.8 186.2Z" fill="#E6EAF0"/>
<path d="M478.1 181.1C475.1 179.8 472.1 178.6 469.1 177.2C468.6 177 468 177.2 467.8 177.7C467.6 178.2 467.8 178.8 468.3 179C471.3 180.3 474.3 181.6 477.3 182.9C477.8 183.1 478.4 182.9 478.6 182.4C478.8 181.9 478.6 181.3 478.1 181.1Z" fill="#E6EAF0"/>
<path d="M443 163.8C440.2 162.2 437.4 160.5 434.6 158.8C434.1 158.5 433.5 158.7 433.2 159.1C432.9 159.6 433.1 160.2 433.5 160.5C436.3 162.2 439.1 163.9 441.9 165.5C442.4 165.8 443 165.6 443.3 165.1C443.6 164.6 443.5 164.1 443 163.8Z" fill="#E6EAF0"/>
<path d="M387.3 124.2C386.9 123.8 386.2 123.9 385.9 124.3C385.5 124.7 385.6 125.4 386 125.7C388.5 127.8 391 129.9 393.6 132C394 132.3 394.7 132.3 395 131.9C395.3 131.5 395.3 130.8 394.9 130.5C392.3 128.3 389.8 126.2 387.3 124.2Z" fill="#E6EAF0"/>
<path d="M496.4 187.9C493.3 186.9 490.2 185.8 487.2 184.6C486.7 184.4 486.1 184.7 485.9 185.2C485.7 185.7 486 186.3 486.5 186.5C489.5 187.6 492.6 188.7 495.7 189.8C496.2 190 496.8 189.7 497 189.2C497.2 188.7 496.9 188.1 496.4 187.9Z" fill="#E6EAF0"/>
<path d="M402.5 136.5C402.1 136.2 401.4 136.2 401.1 136.7C400.8 137.1 400.8 137.8 401.3 138.1C403.9 140.1 406.5 142.1 409.1 144C409.5 144.3 410.2 144.2 410.5 143.8C410.8 143.4 410.7 142.7 410.3 142.4C407.7 140.4 405.1 138.5 402.5 136.5Z" fill="#E6EAF0"/>
<path d="M426.4 153.6C423.7 151.8 421 150 418.3 148.1C417.8 147.8 417.2 147.9 416.9 148.3C416.6 148.8 416.7 149.4 417.1 149.7C419.8 151.6 422.5 153.4 425.3 155.2C425.8 155.5 426.4 155.4 426.7 154.9C427 154.5 426.8 153.9 426.4 153.6Z" fill="#E6EAF0"/>
<path d="M633.1 194.2C629.9 195.4 626.7 196.4 623.4 197.4C622.9 197.6 622.6 198.1 622.7 198.6C622.9 199.1 623.4 199.4 623.9 199.3C627.2 198.3 630.5 197.2 633.7 196.1C634.2 195.9 634.5 195.3 634.3 194.8C634.2 194.3 633.6 194 633.1 194.2Z" fill="#E6EAF0"/>
<path d="M515.1 193.6C511.9 192.8 508.8 191.9 505.7 190.9C505.2 190.7 504.6 191 504.5 191.6C504.3 192.1 504.6 192.7 505.2 192.8C508.3 193.7 511.5 194.6 514.7 195.5C515.2 195.6 515.8 195.3 515.9 194.8C516 194.3 515.7 193.7 515.1 193.6Z" fill="#E6EAF0"/>
<path d="M613.6 200C610.3 200.8 607 201.4 603.6 201.9C603.1 202 602.7 202.5 602.8 203C602.9 203.5 603.4 203.9 604 203.8C607.4 203.3 610.8 202.6 614.1 201.8C614.6 201.7 615 201.1 614.9 200.6C614.7 200.2 614.1 199.8 613.6 200Z" fill="#E6EAF0"/>
<path d="M593.5 203.1C590.1 203.4 586.7 203.6 583.3 203.6C582.8 203.6 582.3 204.1 582.3 204.6C582.3 205.2 582.8 205.6 583.3 205.6C586.8 205.6 590.2 205.4 593.6 205.1C594.1 205.1 594.6 204.6 594.5 204C594.5 203.5 594.1 203.1 593.5 203.1Z" fill="#E6EAF0"/>
<path d="M573.2 203.4C571.5 203.3 569.8 203.2 568.1 203C566.4 202.8 564.8 202.7 563.2 202.5C562.6 202.4 562.2 202.8 562.1 203.4C562 203.9 562.4 204.4 563 204.5C564.6 204.7 566.3 204.9 568 205C569.7 205.2 571.4 205.3 573.2 205.4C573.8 205.4 574.2 205 574.3 204.5C574.2 203.9 573.7 203.4 573.2 203.4Z" fill="#E6EAF0"/>
<path d="M534.2 198C531 197.3 527.7 196.7 524.6 195.9C524.1 195.8 523.5 196.1 523.4 196.6C523.3 197.1 523.6 197.7 524.2 197.8C527.4 198.5 530.6 199.2 533.9 199.9C534.4 200 535 199.7 535.1 199.1C535.1 198.6 534.8 198.1 534.2 198Z" fill="#E6EAF0"/>
<path d="M553.5 201.3C550.2 200.8 547 200.3 543.8 199.8C543.2 199.7 542.7 200.1 542.6 200.6C542.5 201.1 542.9 201.7 543.4 201.8C546.6 202.3 549.9 202.8 553.2 203.3C553.7 203.4 554.3 203 554.3 202.4C554.4 201.9 554 201.3 553.5 201.3Z" fill="#E6EAF0"/>
</svg>
