<svg width="140" height="141" viewBox="0 0 140 141" fill="none" xmlns="http://www.w3.org/2000/svg">
<path d="M0 70.5378C0 31.8779 31.3401 0.537842 70 0.537842C108.66 0.537842 140 31.8779 140 70.5378C140 109.198 108.66 140.538 70 140.538C31.3401 140.538 0 109.198 0 70.5378Z" fill="#F4F6F8"/>
<path d="M87 47H57C55.9391 47 54.9217 47.4214 54.1716 48.1716C53.4214 48.9217 53 49.9391 53 51V78H49V80H61C61.2652 80 61.5196 79.8946 61.7071 79.7071C61.8946 79.5196 62 79.2652 62 79V76.921L69.256 82L62 87.079V85C62 84.7348 61.8946 84.4804 61.7071 84.2929C61.5196 84.1054 61.2652 84 61 84H49V86H53V91C53 92.0609 53.4214 93.0783 54.1716 93.8284C54.9217 94.5786 55.9391 95 57 95H87C88.0609 95 89.0783 94.5786 89.8284 93.8284C90.5786 93.0783 91 92.0609 91 91V51C91 49.9391 90.5786 48.9217 89.8284 48.1716C89.0783 47.4214 88.0609 47 87 47ZM57 49H87C87.5304 49 88.0391 49.2107 88.4142 49.5858C88.7893 49.9609 89 50.4696 89 51V52.649L86.469 55.813C86.1735 56.1841 85.7979 56.4836 85.3704 56.6892C84.9429 56.8947 84.4744 57.001 84 57H76.9C76.6705 55.8697 76.0573 54.8535 75.1643 54.1236C74.2712 53.3937 73.1534 52.995 72 52.995C70.8466 52.995 69.7288 53.3937 68.8357 54.1236C67.9427 54.8535 67.3295 55.8697 67.1 57H60C59.5256 57.001 59.0571 56.8947 58.6296 56.6892C58.2021 56.4836 57.8265 56.1841 57.531 55.813L55 52.649V51C55 50.4696 55.2107 49.9609 55.5858 49.5858C55.9609 49.2107 56.4696 49 57 49ZM75 58C75 58.5933 74.8241 59.1734 74.4944 59.6667C74.1648 60.1601 73.6962 60.5446 73.148 60.7716C72.5999 60.9987 71.9967 61.0581 71.4147 60.9424C70.8328 60.8266 70.2982 60.5409 69.8787 60.1213C69.4591 59.7018 69.1734 59.1672 69.0576 58.5853C68.9419 58.0033 69.0013 57.4001 69.2284 56.8519C69.4554 56.3038 69.8399 55.8352 70.3333 55.5056C70.8266 55.1759 71.4067 55 72 55C72.7956 55 73.5587 55.3161 74.1213 55.8787C74.6839 56.4413 75 57.2044 75 58ZM87 93H57C56.4696 93 55.9609 92.7893 55.5858 92.4142C55.2107 92.0391 55 91.5304 55 91V86H60V89C60.0001 89.1828 60.0503 89.3621 60.1452 89.5184C60.2401 89.6747 60.376 89.802 60.5382 89.8864C60.7004 89.9709 60.8826 90.0092 61.065 89.9973C61.2475 89.9854 61.4232 89.9238 61.573 89.819L71.573 82.819C71.7046 82.7268 71.8121 82.6042 71.8863 82.4616C71.9605 82.3191 71.9992 82.1607 71.9992 82C71.9992 81.8393 71.9605 81.6809 71.8863 81.5384C71.8121 81.3958 71.7046 81.2732 71.573 81.181L61.573 74.181C61.4232 74.0762 61.2475 74.0146 61.065 74.0027C60.8826 73.9908 60.7004 74.0291 60.5382 74.1136C60.376 74.198 60.2401 74.3253 60.1452 74.4816C60.0503 74.6379 60.0001 74.8172 60 75V78H55V55.851L55.97 57.063C56.4523 57.6688 57.0653 58.1576 57.7631 58.4931C58.461 58.8285 59.2257 59.0018 60 59H67.1C67.3295 60.1303 67.9427 61.1465 68.8357 61.8764C69.7288 62.6063 70.8466 63.005 72 63.005C73.1534 63.005 74.2712 62.6063 75.1643 61.8764C76.0573 61.1465 76.6705 60.1303 76.9 59H84C84.7743 59.0018 85.539 58.8285 86.2369 58.4931C86.9347 58.1576 87.5477 57.6688 88.03 57.063L89 55.851V91C89 91.5304 88.7893 92.0391 88.4142 92.4142C88.0391 92.7893 87.5304 93 87 93Z" fill="#5B32F5"/>
<path d="M71 57H73V59H71V57Z" fill="#5B32F5"/>
<path d="M37 52H49V54H37V52Z" fill="#5B32F5"/>
<path d="M33 52H35V54H33V52Z" fill="#5B32F5"/>
<path d="M29 59H41V61H29V59Z" fill="#5B32F5"/>
<path d="M40 93H49V95H40V93Z" fill="#5B32F5"/>
<path d="M36 93H38V95H36V93Z" fill="#5B32F5"/>
<path d="M29 88H46V90H29V88Z" fill="#5B32F5"/>
<path d="M45 71H51V73H45V71Z" fill="#5B32F5"/>
<path d="M41 71H43V73H41V71Z" fill="#5B32F5"/>
<path d="M81 85H87V87H81V85Z" fill="#5B32F5"/>
<path d="M73 89H87V91H73V89Z" fill="#5B32F5"/>
</svg>
