<?xml version="1.0" standalone="no"?>
<!DOCTYPE svg PUBLIC "-//W3C//DTD SVG 20010904//EN"
 "http://www.w3.org/TR/2001/REC-SVG-20010904/DTD/svg10.dtd">
<svg version="1.0" xmlns="http://www.w3.org/2000/svg"
 width="864.000000pt" height="864.000000pt" viewBox="0 0 864.000000 864.000000"
 preserveAspectRatio="xMidYMid meet">
<metadata>
Created by potrace 1.14, written by Peter Selinger 2001-2017
</metadata>
<g transform="translate(0.000000,864.000000) scale(0.100000,-0.100000)"
fill="#000000" stroke="none">
<path d="M4088 8635 c-2 -2 -32 -6 -68 -9 -36 -3 -83 -8 -105 -11 -22 -3 -58
-7 -80 -10 -38 -5 -59 -8 -130 -20 -33 -6 -37 -7 -140 -30 -38 -9 -80 -18 -92
-21 -59 -12 -296 -89 -401 -130 -130 -51 -462 -213 -462 -226 0 -4 -5 -8 -11
-8 -13 0 -133 -72 -137 -82 -2 -5 -10 -8 -17 -8 -7 0 -15 -4 -17 -8 -1 -4 -34
-29 -73 -54 -195 -130 -516 -422 -657 -599 -14 -19 -35 -44 -45 -56 -11 -12
-28 -34 -39 -48 -10 -15 -27 -36 -38 -48 -67 -78 -246 -372 -327 -535 -50
-103 -96 -195 -100 -204 -5 -10 -9 -25 -9 -33 0 -8 -4 -15 -10 -15 -5 0 -9 -3
-8 -7 2 -7 -25 -89 -52 -158 -4 -11 -7 -22 -8 -25 0 -3 -7 -23 -16 -45 -17
-45 -86 -303 -93 -350 -2 -16 -8 -46 -13 -65 -5 -19 -11 -57 -15 -85 -6 -53
-12 -90 -15 -90 -1 0 -3 -16 -4 -35 -2 -19 -7 -75 -12 -125 -5 -49 -9 -202 -9
-340 0 -256 7 -376 29 -490 3 -16 13 -73 22 -125 9 -52 20 -105 25 -118 5 -13
11 -37 14 -55 8 -42 69 -248 95 -317 12 -30 23 -62 25 -70 5 -21 21 -62 45
-114 11 -25 20 -49 20 -55 0 -5 6 -22 14 -38 8 -15 28 -57 44 -93 85 -186 245
-494 269 -518 7 -7 13 -18 13 -24 0 -5 16 -33 35 -62 19 -29 35 -56 35 -60 0
-9 43 -70 53 -74 4 -2 7 -8 7 -14 0 -5 14 -29 30 -53 17 -24 30 -48 30 -53 0
-6 3 -12 8 -14 10 -4 72 -97 72 -107 0 -5 4 -11 8 -13 5 -1 28 -32 52 -68 24
-36 47 -66 52 -68 4 -2 8 -8 8 -13 0 -7 37 -61 83 -119 7 -8 37 -49 67 -90 30
-41 57 -77 60 -80 3 -3 39 -48 80 -100 92 -118 91 -116 115 -143 11 -12 33
-39 48 -60 16 -21 38 -48 50 -60 12 -12 39 -42 59 -67 20 -25 49 -58 63 -75
51 -58 124 -140 143 -162 190 -220 678 -714 956 -968 48 -44 109 -100 136
-125 27 -25 59 -54 72 -64 13 -11 41 -35 63 -55 101 -90 180 -157 199 -170 12
-8 23 -18 26 -21 3 -3 41 -35 85 -70 44 -36 89 -73 99 -82 26 -24 28 -23 66
12 18 17 47 40 64 52 17 13 36 27 42 33 6 5 32 28 59 50 26 22 54 46 61 53 7
6 15 12 18 12 3 0 16 10 28 23 13 12 51 45 83 74 33 28 71 61 85 73 276 239
734 688 1035 1015 50 53 101 109 115 124 14 14 54 60 90 101 36 41 72 81 80
90 8 9 26 30 40 46 51 61 125 149 140 168 8 10 20 23 25 30 6 6 28 34 50 61
22 28 42 52 45 55 3 3 21 25 40 50 19 25 38 50 43 55 4 6 30 39 57 75 28 36
57 72 65 81 8 9 15 20 15 24 0 5 9 19 20 30 12 12 68 89 125 171 57 82 109
155 114 161 6 7 16 24 21 38 5 14 14 25 20 25 5 0 10 6 10 14 0 8 6 21 13 28
18 18 203 324 259 428 204 379 320 654 417 990 16 58 32 116 34 130 3 14 12
54 20 90 8 36 20 99 27 140 6 41 14 86 16 100 20 113 27 608 10 765 -13 130
-22 200 -31 245 -3 14 -7 39 -9 55 -4 30 -9 58 -27 130 -5 22 -11 49 -13 60
-17 90 -83 301 -144 460 -79 208 -295 611 -374 701 -10 11 -18 25 -18 31 0 6
-3 13 -7 15 -5 2 -21 21 -37 43 -28 38 -136 175 -146 185 -3 3 -22 25 -44 50
-317 367 -774 700 -1227 893 -95 41 -240 96 -264 101 -14 3 -155 46 -185 57
-22 8 -118 30 -190 44 -14 3 -45 9 -70 15 -65 13 -174 30 -233 36 -29 3 -68 8
-87 10 -41 7 -546 14 -552 9z m455 -679 c131 -12 158 -15 242 -30 44 -9 91
-17 105 -20 14 -2 45 -9 70 -15 25 -7 52 -13 60 -15 8 -2 42 -12 75 -22 33
-10 62 -18 65 -19 88 -18 436 -176 562 -256 35 -21 70 -42 78 -46 8 -3 25 -14
36 -22 12 -9 32 -23 44 -31 24 -16 179 -133 219 -165 34 -28 280 -272 316
-315 154 -180 284 -379 387 -590 36 -74 72 -153 81 -175 8 -22 24 -62 35 -90
17 -43 61 -180 68 -210 1 -5 12 -46 23 -90 11 -44 25 -107 30 -140 6 -33 13
-71 16 -85 3 -14 7 -45 10 -70 3 -25 8 -70 12 -100 9 -80 9 -515 0 -585 -8
-61 -11 -83 -21 -145 -31 -194 -127 -503 -226 -726 -49 -108 -166 -343 -207
-412 -24 -41 -43 -76 -43 -78 0 -6 -192 -317 -199 -324 -9 -7 -144 -208 -156
-231 -5 -10 -13 -19 -17 -19 -5 0 -8 -6 -8 -14 0 -8 -4 -16 -9 -18 -4 -1 -50
-59 -102 -128 -104 -139 -332 -427 -358 -450 -9 -8 -28 -31 -42 -50 -15 -19
-41 -51 -59 -70 -17 -19 -53 -59 -78 -89 -26 -30 -60 -68 -76 -85 -16 -17 -67
-74 -115 -126 -112 -123 -658 -669 -785 -785 -55 -49 -111 -101 -126 -115 -55
-52 -125 -110 -131 -110 -3 0 -17 10 -31 22 -13 13 -47 43 -74 66 -49 44 -223
205 -318 295 -213 202 -579 579 -752 776 -22 24 -50 56 -64 70 -14 15 -43 49
-65 76 -22 28 -47 57 -55 65 -9 8 -38 42 -65 75 -28 33 -52 62 -55 65 -6 5
-67 81 -125 155 -16 21 -34 43 -40 49 -5 6 -37 47 -70 91 -32 44 -63 85 -67
90 -52 63 -308 430 -308 440 0 2 -22 36 -48 77 -27 40 -51 80 -55 88 -4 8 -13
24 -19 35 -24 36 -61 100 -95 160 -34 60 -187 366 -188 375 -1 3 -11 28 -24
55 -12 28 -24 55 -25 60 -2 6 -9 24 -16 40 -38 90 -95 264 -125 380 -40 156
-41 161 -71 355 -9 59 -10 515 0 605 3 39 11 99 17 135 6 36 12 74 13 85 2 11
6 29 9 40 4 11 9 36 11 55 3 19 23 98 45 176 35 123 55 184 86 259 5 11 9 22
10 25 22 64 135 290 194 387 61 101 174 261 246 349 69 83 306 316 395 388 69
55 258 184 355 243 95 58 394 196 449 208 6 1 24 7 39 14 30 12 190 59 223 65
11 2 37 9 59 15 22 5 56 13 75 15 19 3 64 10 100 16 93 17 105 18 210 25 52 4
96 8 97 9 5 4 276 -2 346 -8z"/>
<path d="M3229 6162 l-65 -3 0 -375 c1 -207 -2 -381 -6 -387 -5 -9 -110 -12
-385 -12 l-378 0 -3 -388 -2 -387 387 2 387 3 0 385 0 385 385 0 386 0 0 385
0 385 -42 6 c-24 3 -50 4 -60 1 -27 -5 -122 -4 -132 3 -6 3 -12 1 -15 -4 -3
-4 -23 -5 -43 -2 -21 4 -68 5 -105 1 -37 -3 -74 -3 -83 0 -8 3 -46 3 -85 0
-38 -3 -71 -3 -72 0 -2 3 -33 4 -69 2z"/>
<path d="M4785 6161 c-2 -2 -21 -3 -42 -3 l-38 1 0 -385 c0 -211 2 -385 5
-385 3 -1 174 -3 380 -4 206 -2 378 -3 382 -4 3 -1 7 -128 7 -283 1 -330 2
-302 0 -403 l-2 -80 387 -3 386 -2 -2 387 -3 388 -384 0 -385 0 0 385 -1 385
-45 2 c-79 5 -192 3 -201 -3 -5 -3 -9 0 -9 6 0 6 -4 9 -9 5 -8 -5 -77 -6 -166
-3 -11 0 -49 0 -85 -1 -36 -1 -89 0 -118 1 -30 2 -55 1 -57 -1z"/>
<path d="M3942 5375 c-4 -5 -7 -180 -7 -388 l0 -377 385 2 385 3 0 383 c1 210
-2 383 -5 383 -3 1 -173 2 -378 3 -242 1 -376 -2 -380 -9z"/>
</g>
</svg>
