<svg width="74" height="74" viewBox="0 0 74 74" fill="none" xmlns="http://www.w3.org/2000/svg">
<circle cx="37" cy="37" r="37" fill="#E6EAF0"/>
<path d="M18.7949 23.4334C20.2616 17.0901 29.8133 17.0901 31.2616 23.4334C32.1233 27.1551 29.7583 30.3084 27.7049 32.2701C26.2016 33.7001 23.8366 33.6817 22.3333 32.2701C20.2983 30.3084 17.9333 27.1551 18.7949 23.4334Z" stroke="#5B32F5" stroke-width="2"/>
<path d="M42.6283 45.4334C44.095 39.0901 53.7017 39.0901 55.1683 45.4334C56.03 49.1551 53.665 52.3084 51.5933 54.2701C50.09 55.7001 47.7067 55.6817 46.2033 54.2701C44.1317 52.3084 41.7667 49.1551 42.6283 45.4334Z" stroke="#5B32F5" stroke-width="2"/>
<path d="M37.0001 24.1667H41.9134C45.3051 24.1667 46.8818 28.3651 44.3334 30.6017L29.6851 43.4167C27.1368 45.6351 28.7134 49.8334 32.0868 49.8334H37.0001" stroke="#5B32F5" stroke-width="2" stroke-linecap="round" stroke-linejoin="round"/>
<path d="M24.991 25H25.009" stroke="#5B32F5" stroke-width="2" stroke-linecap="round" stroke-linejoin="round"/>
<path d="M48.991 47H49.009" stroke="#5B32F5" stroke-width="2" stroke-linecap="round" stroke-linejoin="round"/>
</svg>
