<svg width="24" height="24" viewBox="0 0 24 24" fill="none" xmlns="http://www.w3.org/2000/svg">
<path fill-rule="evenodd" clip-rule="evenodd" d="M16.129 4.12993L16 4.25348L15.4506 4.77972C15.0679 5.14618 14.4666 5.15042 14.0788 4.78938L12.3271 3.15822C12.1407 2.98474 11.8542 2.97903 11.6611 3.14495L9.71343 4.81905C9.31247 5.16368 8.71314 5.13638 8.34505 4.75672L8 4.40083L7.84757 4.2436L7.19708 3.57267L6.85864 3.22359C6.54581 2.90094 6 3.12284 6 3.57267V4.05934V4.99472V5.21392V16.3692V16.8536V17.9288V18.2782C6 18.7684 6.63021 18.9669 6.91011 18.5648L7.10959 18.2782L7.72346 17.3963L8 16.999L8.07396 16.8928C8.43412 16.3753 9.17616 16.3161 9.61352 16.7699L11.6116 18.8431C11.8188 19.058 12.1664 19.0447 12.3565 18.8145L13.9923 16.8344C14.3944 16.3477 15.1403 16.3508 15.5383 16.8409L16 17.4095L16.2155 17.6748L16.8554 18.4628L17.1122 18.779C17.4092 19.1447 18 18.9343 18 18.4628V18.0552V17.0393V16.6972V5.11013V4.93133V4.03399V3.50989C18 3.06899 17.4726 2.84309 17.1545 3.14774L16.7764 3.50989L16.129 4.12993ZM20 3.50989V18.4628C20 20.8202 17.0458 21.8724 15.5608 20.0437L14.756 19.0527L13.8972 20.0923C12.9466 21.243 11.2086 21.3096 10.173 20.2351L9.01912 19.0379L8.55055 19.7111C7.15102 21.7217 4 20.7295 4 18.2782V3.57267C4 1.3235 6.72907 0.214005 8.2932 1.82729L9.12465 2.68488L10.3589 1.62399C11.3241 0.794396 12.757 0.822937 13.6885 1.69031L14.7499 2.6786L15.7725 1.69916C17.363 0.175903 20 1.30539 20 3.50989ZM8 8.85071C8 8.29734 8.44772 7.84875 9 7.84875H15C15.5523 7.84875 16 8.29734 16 8.85071C16 9.40408 15.5523 9.85267 15 9.85267H9C8.44772 9.85267 8 9.40408 8 8.85071ZM9 11.8566C8.44772 11.8566 8 12.3052 8 12.8585C8 13.4119 8.44772 13.8605 9 13.8605H15C15.5523 13.8605 16 13.4119 16 12.8585C16 12.3052 15.5523 11.8566 15 11.8566H9Z" fill="#5B32F5"/>
</svg>
