<svg width="74" height="74" viewBox="0 0 74 74" fill="none" xmlns="http://www.w3.org/2000/svg">
<g clip-path="url(#clip0_249_4771)">
<circle cx="37" cy="36.999" r="37" fill="#E6EAF0"/>
<path d="M52 23.999H22C20.3457 23.999 19 25.3447 19 26.999V42.999C19 44.6533 20.3457 45.999 22 45.999H52C53.6543 45.999 55 44.6533 55 42.999V26.999C55 25.3447 53.6543 23.999 52 23.999ZM48.0903 43.999H25.9097C25.4863 41.4917 23.5073 39.5127 21 39.0894V30.9087C23.5073 30.4854 25.4863 28.5063 25.9097 25.999H48.0903C48.5137 28.5063 50.4927 30.4854 53 30.9087V39.0894C50.4927 39.5127 48.5137 41.4917 48.0903 43.999ZM53 26.999V28.8569C51.6011 28.4932 50.5059 27.3979 50.1421 25.999H52C52.5513 25.999 53 26.4478 53 26.999ZM22 25.999H23.8579C23.4941 27.3979 22.3989 28.4932 21 28.8569V26.999C21 26.4478 21.4487 25.999 22 25.999ZM21 42.999V41.1411C22.3989 41.5049 23.4941 42.6001 23.8579 43.999H22C21.4487 43.999 21 43.5503 21 42.999ZM52 43.999H50.1421C50.5059 42.6001 51.6011 41.5049 53 41.1411V42.999C53 43.5503 52.5513 43.999 52 43.999Z" fill="#5B32F5"/>
<path d="M37 29.999C34.2432 29.999 32 32.2422 32 34.999C32 37.7559 34.2432 39.999 37 39.999C39.7568 39.999 42 37.7559 42 34.999C42 32.2422 39.7568 29.999 37 29.999ZM37 37.999C35.3457 37.999 34 36.6533 34 34.999C34 33.3447 35.3457 31.999 37 31.999C38.6543 31.999 40 33.3447 40 34.999C40 36.6533 38.6543 37.999 37 37.999Z" fill="#5B32F5"/>
<path d="M43 50.999H41V49.999C41 49.4468 40.5522 48.999 40 48.999H34C33.4478 48.999 33 49.4468 33 49.999V50.999H31C30.5957 50.999 30.231 51.2427 30.0762 51.6162C29.9214 51.9902 30.0068 52.4199 30.293 52.7061L36.293 58.7061C36.4883 58.9014 36.7441 58.999 37 58.999C37.2559 58.999 37.5117 58.9014 37.707 58.7061L43.707 52.7061C43.9932 52.4199 44.0786 51.9902 43.9238 51.6162C43.769 51.2427 43.4043 50.999 43 50.999ZM37 56.585L33.4141 52.999H34C34.5522 52.999 35 52.5513 35 51.999V50.999H39V51.999C39 52.5513 39.4478 52.999 40 52.999H40.5859L37 56.585Z" fill="#5B32F5"/>
</g>
<defs>
<clipPath id="clip0_249_4771">
<rect width="74" height="74" fill="white" transform="translate(0 -0.000976562)"/>
</clipPath>
</defs>
</svg>
