<svg width="46" height="46" viewBox="0 0 46 46" fill="none" xmlns="http://www.w3.org/2000/svg">
<rect width="46" height="46" fill="#FD9500"/>
<path fill-rule="evenodd" clip-rule="evenodd" d="M24.1956 27.7007C24.5826 28.0947 25.2158 28.1004 25.6098 27.7134L29.7007 23.7134C29.8922 23.5254 30 23.2683 30 23C30 22.7317 29.8922 22.4746 29.7007 22.2866L25.6098 18.2866C25.2158 17.8996 24.5826 17.9053 24.1956 18.2993C23.8087 18.6933 23.8144 19.3265 24.2084 19.7134L26.5547 22L17 22C16.4477 22 16 22.4477 16 23C16 23.5523 16.4477 24 17 24L26.5547 24L24.2084 26.2866C23.8144 26.6735 23.8087 27.3067 24.1956 27.7007Z" fill="white"/>
</svg>
