<svg width="66" height="66" viewBox="0 0 66 66" fill="none" xmlns="http://www.w3.org/2000/svg">
<circle cx="33" cy="33" r="33" fill="white"/>
<path d="M18.1118 35.5446C18.1118 35.5446 22.1614 40.2692 28.4046 34.5322C28.4046 34.5322 24.6925 48.5373 15.9182 38.9193" stroke="#FE5000" stroke-width="2" stroke-miterlimit="10" stroke-linecap="round" stroke-linejoin="round"/>
<path d="M49.159 29.3122C49.8339 29.8184 50.5089 30.3246 51.0151 30.6621C53.5461 32.012 55.2335 34.7118 55.2335 37.9177C55.2335 42.4736 51.5213 46.1858 46.9654 46.1858C42.4096 46.1858 23.5112 46.1858 18.6179 46.1858C13.2184 46.1858 9 41.7986 9 36.5678C9 33.0244 11.0248 29.8184 13.8933 28.1311C17.268 26.6125 25.1986 19.3569 28.742 18.1757C30.2606 17.6695 31.7793 17.5008 33.1291 17.332C33.1291 17.332 33.1291 17.332 33.2979 17.332H33.4666C36.3351 17.332 38.8661 18.3444 40.3848 20.0318C41.0597 20.7067 41.7346 21.3817 42.2408 22.2254C42.4096 22.5628 42.7471 23.069 43.422 23.5752" stroke="#FE5000" stroke-width="2" stroke-miterlimit="10" stroke-linecap="round" stroke-linejoin="round"/>
<path d="M50.0028 26.4347C49.1591 30.1469 47.303 36.5588 44.0971 39.0898C39.3725 42.802 34.9854 41.7896 32.1169 38.4149C29.2484 35.0402 29.2484 30.3156 33.8042 26.6034C37.0102 24.0724 43.5909 23.5662 47.4718 23.3975" stroke="#FE5000" stroke-width="2" stroke-miterlimit="10" stroke-linecap="round" stroke-linejoin="round"/>
<path d="M56.5835 21.3747C56.2461 20.8685 55.5711 20.5311 55.0649 20.5311C54.7274 20.5311 54.39 20.1936 54.39 19.6874C54.39 19.1812 54.2212 18.5062 53.8838 18C53.2088 17.1564 51.8589 16.9876 50.8465 17.6626C50.0029 18.3375 49.8341 19.6874 50.5091 20.6998L50.6778 20.8685L47.4718 23.3996L49.8341 26.4368L53.0401 23.9058C53.0401 23.9058 53.0401 24.0745 53.2088 24.0745C53.8838 24.9182 55.2336 25.0869 56.2461 24.412C57.0897 23.5683 57.2585 22.2184 56.5835 21.3747Z" stroke="#FE5000" stroke-width="2" stroke-miterlimit="10" stroke-linecap="round" stroke-linejoin="round"/>
</svg>
