<svg width="102" height="46" viewBox="0 0 102 46" fill="none" xmlns="http://www.w3.org/2000/svg">
<circle cx="9" cy="37" r="9" fill="#FE5000"/>
<circle cx="9" cy="9" r="9" fill="#FE6A26"/>
<circle cx="93" cy="37" r="7" stroke="#FFA780" stroke-width="4"/>
<circle cx="65" cy="37" r="7" stroke="#FE8D59" stroke-width="4"/>
<circle cx="65" cy="9" r="7" stroke="#FFA780" stroke-width="4"/>
<circle cx="37" cy="9" r="7" stroke="#FE8D59" stroke-width="4"/>
<circle cx="37" cy="37" r="4.57846" stroke="#FE6A26" stroke-width="8.84308"/>
</svg>
