<svg width="74" height="52" viewBox="0 0 74 52" fill="none" xmlns="http://www.w3.org/2000/svg">
<path d="M16.7632 43.9189H25.5065L35.1961 51.2239C36.7101 52.3594 38.8301 51.2996 38.8301 49.4071V15.645C38.8301 13.7903 36.6723 12.6927 35.1961 13.8282L25.5065 21.1332H16.7632C15.5141 21.1332 14.4922 22.1552 14.4922 23.4042V41.6861C14.4922 42.8969 15.5141 43.9189 16.7632 43.9189Z" fill="#FE5000"/>
<path d="M60.8181 24.3133C59.7961 23.2914 58.0929 23.2914 57.0709 24.3133L52.6046 28.7796L48.1383 24.3133C47.1164 23.2914 45.4131 23.2914 44.3912 24.3133C43.3696 25.3353 43.3696 27.0385 44.3912 28.0605L48.8579 32.5268L44.3912 36.9931C43.3696 38.015 43.3696 39.7183 44.3912 40.7402C44.9211 41.2697 45.6024 41.5351 46.2837 41.5351C46.9654 41.5351 47.6463 41.2701 48.1762 40.7402L52.6428 36.2735L57.1088 40.7402C57.6387 41.2697 58.3203 41.5351 59.0013 41.5351C59.6829 41.5351 60.3642 41.2701 60.8938 40.7402C61.9161 39.7183 61.9161 38.015 60.8938 36.9931L56.3518 32.5268L60.8184 28.0605C61.84 27.0385 61.84 25.3353 60.8181 24.3133Z" fill="#FE5000"/>
</svg>
