<svg width="74" height="52" viewBox="0 0 74 52" fill="none" xmlns="http://www.w3.org/2000/svg">
<path fill-rule="evenodd" clip-rule="evenodd" d="M55.1832 50.0592C63.1004 48.2387 69.0045 41.148 69.0045 32.6782C69.0045 24.2049 63.0953 17.1117 55.1731 15.2949C59.8822 19.6021 62.8357 25.797 62.8357 32.6817C62.8357 39.5615 59.8864 45.7524 55.1832 50.0592Z" fill="#FE5000"/>
<path d="M43.7872 32.6729C43.7872 42.9943 35.4201 51.3614 25.0987 51.3614C14.7773 51.3614 6.41016 42.9943 6.41016 32.6729C6.41016 22.3515 14.7773 13.9844 25.0987 13.9844C35.4201 13.9844 43.7872 22.3515 43.7872 32.6729Z" fill="#FE5000"/>
<path fill-rule="evenodd" clip-rule="evenodd" d="M41.9763 50.3121C50.5409 49.0076 57.1027 41.6111 57.1027 32.6821C57.1027 23.7579 50.548 16.3647 41.9902 15.0542C46.624 19.4972 49.5089 25.7499 49.5089 32.6765C49.5089 39.61 46.6183 45.8684 41.9763 50.3121Z" fill="#FE5000"/>
<path d="M26.2965 31.3277C27.5178 31.5268 28.4538 31.9848 29.1043 32.7017C29.7548 33.4053 30.08 34.2815 30.08 35.3302C30.08 36.14 29.8676 36.8901 29.4428 37.5804C29.018 38.2575 28.3675 38.8018 27.4913 39.2133C26.6284 39.6249 25.5663 39.8307 24.3051 39.8307C23.3228 39.8307 22.3536 39.7045 21.3978 39.4523C20.4552 39.1868 19.6521 38.8151 18.9883 38.3372L20.2428 35.8679C20.7738 36.2662 21.3845 36.5781 22.0749 36.8038C22.7785 37.0162 23.4953 37.1224 24.2255 37.1224C25.0353 37.1224 25.6725 36.9698 26.1372 36.6644C26.6018 36.3458 26.8341 35.9011 26.8341 35.3302C26.8341 34.1885 25.9646 33.6177 24.2255 33.6177H22.7519V31.487L25.6194 28.2411H19.6852V25.6523H29.4428V27.7432L26.2965 31.3277Z" fill="white"/>
</svg>
