<svg width="98" height="107" viewBox="0 0 98 107" fill="none" xmlns="http://www.w3.org/2000/svg">
<g filter="url(#filter0_d)">
<path d="M44.2603 47.2969L42.2891 64.4295H53.2327L54.6407 47.2969H44.2603Z" fill="#FE5000"/>
<path d="M49.5212 79.6847L55.4827 69.3594H43.5508C44.1807 73.5171 46.379 77.1663 49.5212 79.6847Z" fill="#FE5000"/>
<path d="M55.0465 42.3666L56.3014 27.0977H46.5851L44.8281 42.3666H55.0465Z" fill="#FE5000"/>
<path d="M41.6208 27.0977H11L12.2118 42.3666H39.8638L41.6208 27.0977Z" fill="#FE5000"/>
<path d="M59.7505 83.2808C61.8542 83.2808 63.8664 82.8819 65.7159 82.1565L59.7505 71.8242L53.7852 82.1565C55.6347 82.882 57.6469 83.2808 59.7505 83.2808Z" fill="#FE5000"/>
<path d="M80.9224 69.3594C79.6965 79.956 70.6697 88.2104 59.7497 88.2104C48.8298 88.2104 39.8031 79.956 38.5773 69.3594H33.2734C34.5215 82.8694 45.9195 93.4843 59.7499 93.4843C73.5802 93.4843 84.9782 82.8694 86.2264 69.3594H80.9224Z" fill="#FE5000"/>
<path d="M28.2301 66.8944V64.4295H37.3237L39.2951 47.2969H12.6016L16.2671 93.4841H42.8417C34.0636 87.8827 28.2301 78.0572 28.2301 66.8944Z" fill="#FE5000"/>
<path d="M75.9513 69.3594H64.0195L69.9808 79.6847C73.1229 77.1663 75.3214 73.5171 75.9513 69.3594Z" fill="#FE5000"/>
<path d="M47.9936 14.8436H59.3423V9.91406H43.5986L41.6211 27.0999H46.5833L47.9936 14.8436Z" fill="#FE5000"/>
</g>
<defs>
<filter id="filter0_d" x="0" y="0.914062" width="97.2264" height="105.57" filterUnits="userSpaceOnUse" color-interpolation-filters="sRGB">
<feFlood flood-opacity="0" result="BackgroundImageFix"/>
<feColorMatrix in="SourceAlpha" type="matrix" values="0 0 0 0 0 0 0 0 0 0 0 0 0 0 0 0 0 0 127 0" result="hardAlpha"/>
<feOffset dy="2"/>
<feGaussianBlur stdDeviation="5.5"/>
<feComposite in2="hardAlpha" operator="out"/>
<feColorMatrix type="matrix" values="0 0 0 0 1 0 0 0 0 1 0 0 0 0 1 0 0 0 1 0"/>
<feBlend mode="normal" in2="BackgroundImageFix" result="effect1_dropShadow"/>
<feBlend mode="normal" in="SourceGraphic" in2="effect1_dropShadow" result="shape"/>
</filter>
</defs>
</svg>
