<svg width="40" height="40" viewBox="0 0 40 40" fill="none" xmlns="http://www.w3.org/2000/svg">
<path d="M21.2775 12.9506C13.6502 11.9691 6.62514 17.2112 5.61697 24.6364C4.60879 32.0616 9.99354 38.9005 17.6208 39.882C25.2481 40.8635 32.2732 35.6214 33.2813 28.1962C34.2895 20.771 28.9048 13.9321 21.2775 12.9506ZM18.0071 37.0371C11.9913 36.263 7.74408 30.8689 8.53926 25.0124C9.33443 19.156 14.8754 15.0214 20.8912 15.7955C23.3733 16.1149 25.5541 17.2213 27.204 18.8221L24.2087 21.0571C23.7582 21.3933 23.6717 22.0307 24.0171 22.4693L24.5792 23.1832C24.9137 23.6079 25.5295 23.6871 25.9659 23.3615L28.9974 21.0994C30.1563 23.0663 30.6871 25.4039 30.359 27.8202C29.5639 33.6766 24.0229 37.8113 18.0071 37.0371Z" fill="#FE5000"/>
<path d="M19.5 4.23251C23.8277 4.23251 27.9064 5.99125 31.0434 9.19718C31.2479 9.40622 31.5881 9.40687 31.7862 9.1918L32.6896 8.21122C32.8652 8.02067 32.8656 7.72738 32.6858 7.54078C29.1179 3.83729 24.4528 1.80359 19.5 1.80359C14.5472 1.80359 9.8821 3.83729 6.31419 7.54078C6.13442 7.72738 6.13484 8.02067 6.31039 8.21122L7.21379 9.1918C7.41193 9.40687 7.75208 9.40622 7.95662 9.19718C11.0936 5.99125 15.1723 4.23251 19.5 4.23251Z" fill="#FE5000"/>
<path d="M0 12.7119C0 12.6018 0.089543 12.5126 0.2 12.5126H6.8C6.91046 12.5126 7 12.6018 7 12.7119V15.2338C7 15.3439 6.91046 15.4331 6.8 15.4331H0.2C0.089543 15.4331 0 15.3439 0 15.2338V12.7119Z" fill="#FE5000"/>
<path d="M36.8667 12.8369C36.7562 12.8369 36.6667 12.7477 36.6667 12.6376V10.7647C36.6667 10.6546 36.5771 10.5654 36.4667 10.5654H34.5333C34.4229 10.5654 34.3333 10.6546 34.3333 10.7647V12.6376C34.3333 12.7477 34.2438 12.8369 34.1333 12.8369H32.2C32.0895 12.8369 32 12.9262 32 13.0362V14.9092C32 15.0192 32.0895 15.1084 32.2 15.1084H34.1333C34.2438 15.1084 34.3333 15.1977 34.3333 15.3077V17.1807C34.3333 17.2907 34.4229 17.38 34.5333 17.38H36.4667C36.5771 17.38 36.6667 17.2907 36.6667 17.1807V15.3077C36.6667 15.1977 36.7562 15.1084 36.8667 15.1084H38.8C38.9105 15.1084 39 15.0192 39 14.9092V13.0362C39 12.9262 38.9105 12.8369 38.8 12.8369H36.8667Z" fill="#FE5000"/>
</svg>
