<svg width="106" height="115" viewBox="0 0 106 115" fill="none" xmlns="http://www.w3.org/2000/svg">
<g filter="url(#filter0_d_420_361)">
<path d="M93.1735 19.6224L80.4143 10.1352C79.0255 9.10068 77.0443 9.5246 76.1945 11.0236L67.5898 26.1816C69.0429 27.5963 70.347 29.3023 71.3511 31.2149L79.5929 16.698C80.111 17.0833 89.2549 23.8822 89.7384 24.2433C91.0146 25.1912 92.8164 24.9265 93.7662 23.6503C94.7145 22.3742 94.4496 20.5723 93.1735 19.6224Z" fill="#FE5000"/>
<path d="M41.9973 24.1328C46.5627 20.9063 52.115 19.8247 57.2952 20.8111C56.0958 14.1045 50.2219 9 43.1794 9C36.2405 9 30.4394 13.9509 29.1211 20.506C33.4626 20.1984 38.0885 21.3703 41.9973 24.1328ZM40.251 14.7032C40.251 13.1142 41.5406 11.8247 43.1296 11.8247C44.7204 11.8247 46.0081 13.1142 46.0081 14.7032V15.8105C46.0081 17.3994 44.7204 18.689 43.1296 18.689C41.5406 18.689 40.251 17.3994 40.251 15.8105V14.7032Z" fill="#FE5000"/>
<path d="M33.5649 42.519C33.0749 37.5636 34.4373 32.413 37.7213 28.2112C27.4129 22.1077 14.6021 30.6926 16.2308 42.519H33.5649ZM21.0015 35.5552C21.0015 33.9663 22.2891 32.6767 23.88 32.6767C25.4817 32.6767 26.7585 33.981 26.7585 35.5552V36.6625C26.7585 38.2515 25.4689 39.541 23.88 39.541C22.2891 39.541 21.0015 38.2515 21.0015 36.6625V35.5552Z" fill="#FE5000"/>
<path d="M53.5633 26.2188C44.9276 26.2188 38.1668 33.8592 39.3592 42.5183H67.7693C68.9629 33.8514 62.1963 26.2188 53.5633 26.2188ZM48.148 40.0929C46.5554 40.0929 45.2695 38.8031 45.2695 37.2144V36.1091C45.2695 34.5196 46.5583 33.2306 48.148 33.2306C49.7118 33.2306 51.0265 34.4921 51.0265 36.1091V37.2144C51.0265 38.8062 49.7363 40.0929 48.148 40.0929ZM57.1825 30.2429C58.7766 30.2429 60.061 31.5369 60.061 33.1214V34.2343C60.0564 35.8157 58.7778 37.1051 57.1825 37.1051C55.6014 37.1051 54.304 35.8238 54.304 34.2266V33.1214C54.304 31.5338 55.5919 30.2429 57.1825 30.2429Z" fill="#FE5000"/>
<path d="M73.4026 48.2734C71.6431 48.2734 16.1631 48.2734 12.1227 48.2734C11.505 48.2734 11 48.7757 11 49.3961C11 54.4967 12.992 58.0832 16.918 60.0598C19.1554 61.1863 20.5468 63.4601 20.5468 65.9931C20.5468 73.6499 26.7758 79.8806 34.4343 79.8806H51.0928C58.7494 79.8806 64.9785 73.6499 64.9785 65.9931C64.9785 63.4735 66.3851 61.1899 68.6513 60.0387C72.2767 58.1928 74.5252 54.8587 74.5252 49.3961C74.5252 48.7761 74.0206 48.2734 73.4026 48.2734Z" fill="#FE5000"/>
<path d="M51.4585 94.5153H47.3171C46.7696 94.5153 46.333 94.0578 46.3587 93.5107L46.9562 84.2148H38.6356L39.2331 93.5107C39.2588 94.0576 38.8223 94.5153 38.2747 94.5153H34.1339C30.433 94.5153 27.364 97.241 26.8347 100.8C26.7488 101.377 27.2021 101.895 27.7858 101.895H57.8066C58.3903 101.895 58.8438 101.377 58.7577 100.8C58.2288 97.2454 55.1644 94.5153 51.4585 94.5153Z" fill="#FE5000"/>
</g>
<defs>
<filter id="filter0_d_420_361" x="0" y="0" width="105.335" height="114.895" filterUnits="userSpaceOnUse" color-interpolation-filters="sRGB">
<feFlood flood-opacity="0" result="BackgroundImageFix"/>
<feColorMatrix in="SourceAlpha" type="matrix" values="0 0 0 0 0 0 0 0 0 0 0 0 0 0 0 0 0 0 127 0" result="hardAlpha"/>
<feOffset dy="2"/>
<feGaussianBlur stdDeviation="5.5"/>
<feComposite in2="hardAlpha" operator="out"/>
<feColorMatrix type="matrix" values="0 0 0 0 1 0 0 0 0 1 0 0 0 0 1 0 0 0 0.54 0"/>
<feBlend mode="normal" in2="BackgroundImageFix" result="effect1_dropShadow_420_361"/>
<feBlend mode="normal" in="SourceGraphic" in2="effect1_dropShadow_420_361" result="shape"/>
</filter>
</defs>
</svg>
