<svg width="105" height="106" viewBox="0 0 105 106" fill="none" xmlns="http://www.w3.org/2000/svg">
<g filter="url(#filter0_d)">
<path d="M88.9462 49.2562C88.9462 42.8469 85.1972 36.9968 79.5309 34.0749C77.5815 27.8617 71.8694 23.6104 65.2951 23.6104C61.1439 23.6104 57.3429 25.3127 54.6094 28.1257V49.2562H60.1359L55.2356 44.3557L58.2576 41.3336L63.158 46.2341V36.4333H67.4322V46.2341L72.3327 41.3336L75.3548 44.3557L70.4543 49.2562H88.9462Z" fill="#FE5000"/>
<path d="M33.2396 32.1602C23.8124 32.1602 16 39.8301 16 49.2573H24.6911C24.6911 44.5426 28.525 40.7087 33.2396 40.7087C37.9543 40.7087 41.7882 44.5426 41.7882 49.2573H50.3368C50.3368 39.8301 42.6669 32.1602 33.2396 32.1602Z" fill="#FE5000"/>
<path d="M33.2391 44.9844C30.8829 44.9844 28.9648 46.9024 28.9648 49.2587H37.5134C37.5134 46.9024 35.5954 44.9844 33.2391 44.9844Z" fill="#FE5000"/>
<path d="M16.1328 53.5273C16.2194 54.9703 16.3867 56.3939 16.6429 57.8016H88.2933C88.5495 56.3939 88.7165 54.9703 88.8031 53.5273H16.1328Z" fill="#FE5000"/>
<path d="M17.6953 62.0742C20.2535 70.2891 25.7771 77.6466 33.2405 82.3193V87.8625H71.7091V82.3193C79.1724 77.6466 84.696 70.2891 87.2542 62.0742H17.6953Z" fill="#FE5000"/>
<path d="M48.2004 14.9141C39.8637 14.9141 32.622 20.4129 30.0195 28.205C31.0778 28.043 32.1373 27.8794 33.2404 27.8794C40.2557 27.8794 46.4384 31.3233 50.3375 36.5602V14.9141H48.2004Z" fill="#FE5000"/>
</g>
<defs>
<filter id="filter0_d" x="0" y="0.914062" width="104.946" height="104.948" filterUnits="userSpaceOnUse" color-interpolation-filters="sRGB">
<feFlood flood-opacity="0" result="BackgroundImageFix"/>
<feColorMatrix in="SourceAlpha" type="matrix" values="0 0 0 0 0 0 0 0 0 0 0 0 0 0 0 0 0 0 127 0" result="hardAlpha"/>
<feOffset dy="2"/>
<feGaussianBlur stdDeviation="8"/>
<feComposite in2="hardAlpha" operator="out"/>
<feColorMatrix type="matrix" values="0 0 0 0 1 0 0 0 0 1 0 0 0 0 1 0 0 0 1 0"/>
<feBlend mode="normal" in2="BackgroundImageFix" result="effect1_dropShadow"/>
<feBlend mode="normal" in="SourceGraphic" in2="effect1_dropShadow" result="shape"/>
</filter>
</defs>
</svg>
