<svg width="40" height="40" viewBox="0 0 40 40" fill="none" xmlns="http://www.w3.org/2000/svg">
<g clip-path="url(#clip0_620:1089)">
<path d="M29.0206 6.24539L32.6268 9.25273C32.8751 9.45985 33.1768 9.56092 33.4767 9.56092C33.8572 9.56092 34.2347 9.39836 34.4974 9.08339C34.9672 8.52007 34.8914 7.68255 34.328 7.2128L30.7217 4.20539C30.1585 3.73563 29.3209 3.8114 28.8511 4.37479C28.3814 4.93812 28.4572 5.77556 29.0206 6.24539Z" fill="#FE5000"/>
<path d="M6.52423 9.56069C6.82412 9.56069 7.12581 9.45962 7.3741 9.2525L10.9803 6.24522C11.5436 5.77547 11.6195 4.93795 11.1498 4.37463C10.6801 3.81137 9.84249 3.73547 9.27916 4.20522L5.6729 7.21256C5.10958 7.68232 5.03368 8.51984 5.50344 9.08316C5.76621 9.39813 6.14379 9.56069 6.52423 9.56069Z" fill="#FE5000"/>
<path d="M31.0817 10.2466C28.437 7.60188 25.0133 6.01988 21.3281 5.71262V4.32825C21.3281 3.59472 20.7335 3.00012 20 3.00012C19.2665 3.00012 18.6719 3.59472 18.6719 4.32825V5.71262C14.9867 6.01988 11.563 7.60181 8.91832 10.2465C5.95827 13.2066 4.32812 17.1421 4.32812 21.3282C4.32812 25.5144 5.95827 29.4499 8.91832 32.4099C11.8783 35.37 15.8139 37.0001 20 37.0001C23.3704 37.0001 26.5821 35.9463 29.2878 33.9525C29.8784 33.5174 30.0043 32.686 29.5692 32.0954C29.134 31.5048 28.3026 31.379 27.7121 31.8141C25.4661 33.4691 22.7993 34.3439 20 34.3439C12.8231 34.3439 6.98438 28.5051 6.98438 21.3282C6.98438 14.1514 12.8231 8.31262 20 8.31262C27.1769 8.31262 33.0156 14.1514 33.0156 21.3282C33.0156 23.5203 32.4609 25.687 31.4112 27.5941C31.0575 28.2367 31.2917 29.0443 31.9343 29.398C32.5767 29.7515 33.3845 29.5175 33.7383 28.8749C35.0032 26.5765 35.6719 23.9669 35.6719 21.3282C35.6719 17.1421 34.0417 13.2066 31.0817 10.2466Z" fill="#FE5000"/>
<path d="M26.4702 13.333C25.9002 12.8716 25.0639 12.9596 24.6023 13.5299L20.4147 18.7046C20.2795 18.6833 20.141 18.672 20 18.672C18.5353 18.672 17.3438 19.8636 17.3438 21.3282C17.3438 22.7929 18.5353 23.9845 20 23.9845C21.4647 23.9845 22.6562 22.7929 22.6562 21.3282C22.6562 20.9927 22.5931 20.6719 22.4791 20.3761L26.6671 15.2008C27.1286 14.6306 27.0404 13.7943 26.4702 13.333Z" fill="#FE5000"/>
</g>
<defs>
<clipPath id="clip0_620:1089">
<rect width="34" height="34" fill="white" transform="translate(3 3.00012)"/>
</clipPath>
</defs>
</svg>
