<svg width="98" height="106" viewBox="0 0 98 106" fill="none" xmlns="http://www.w3.org/2000/svg">
<g filter="url(#filter0_d_420_326)">
<path d="M44.2603 46.3828L42.2891 63.5154H53.2327L54.6407 46.3828H44.2603Z" fill="#FE5000"/>
<path d="M49.5212 78.7706L55.4827 68.4453H43.5508C44.1807 72.603 46.379 76.2522 49.5212 78.7706Z" fill="#FE5000"/>
<path d="M55.0465 41.4525L56.3014 26.1836H46.5851L44.8281 41.4525H55.0465Z" fill="#FE5000"/>
<path d="M41.6208 26.1836H11L12.2118 41.4525H39.8638L41.6208 26.1836Z" fill="#FE5000"/>
<path d="M59.7506 82.3668C61.8542 82.3668 63.8664 81.9679 65.716 81.2425L59.7506 70.9102L53.7852 81.2425C55.6347 81.968 57.6469 82.3668 59.7506 82.3668Z" fill="#FE5000"/>
<path d="M80.9224 68.4453C79.6965 79.0419 70.6697 87.2964 59.7497 87.2964C48.8298 87.2964 39.8031 79.0419 38.5773 68.4453H33.2734C34.5215 81.9553 45.9195 92.5702 59.7499 92.5702C73.5802 92.5702 84.9782 81.9553 86.2264 68.4453H80.9224Z" fill="#FE5000"/>
<path d="M28.2301 65.9803V63.5154H37.3237L39.2951 46.3828H12.6016L16.2671 92.57H42.8417C34.0636 86.9686 28.2301 77.1431 28.2301 65.9803Z" fill="#FE5000"/>
<path d="M75.9513 68.4453H64.0195L69.9808 78.7706C73.1229 76.2522 75.3214 72.603 75.9513 68.4453Z" fill="#FE5000"/>
<path d="M47.9936 13.9296H59.3423V9H43.5986L41.6211 26.1858H46.5833L47.9936 13.9296Z" fill="#FE5000"/>
</g>
<defs>
<filter id="filter0_d_420_326" x="0" y="0" width="97.2263" height="105.57" filterUnits="userSpaceOnUse" color-interpolation-filters="sRGB">
<feFlood flood-opacity="0" result="BackgroundImageFix"/>
<feColorMatrix in="SourceAlpha" type="matrix" values="0 0 0 0 0 0 0 0 0 0 0 0 0 0 0 0 0 0 127 0" result="hardAlpha"/>
<feOffset dy="2"/>
<feGaussianBlur stdDeviation="5.5"/>
<feComposite in2="hardAlpha" operator="out"/>
<feColorMatrix type="matrix" values="0 0 0 0 1 0 0 0 0 1 0 0 0 0 1 0 0 0 1 0"/>
<feBlend mode="normal" in2="BackgroundImageFix" result="effect1_dropShadow_420_326"/>
<feBlend mode="normal" in="SourceGraphic" in2="effect1_dropShadow_420_326" result="shape"/>
</filter>
</defs>
</svg>
