<svg width="105" height="105" viewBox="0 0 105 105" fill="none" xmlns="http://www.w3.org/2000/svg">
<g filter="url(#filter0_d)">
<path d="M88.9466 48.3415C88.9466 41.9322 85.1977 36.0822 79.5314 33.1603C77.582 26.9472 71.8699 22.6958 65.2956 22.6958C61.1444 22.6958 57.3434 24.3981 54.6099 27.2112V48.3415H60.1364L55.236 43.4411L58.2581 40.419L63.1584 45.3195V35.5187H67.4327V45.3195L72.3332 40.419L75.3553 43.4411L70.4548 48.3415H88.9466Z" fill="#FE5000"/>
<path d="M33.2396 31.2461C23.8124 31.2461 16 38.916 16 48.3432H24.6911C24.6911 43.6286 28.5249 39.7947 33.2396 39.7947C37.9543 39.7947 41.7882 43.6286 41.7882 48.3432H50.3368C50.3368 38.916 42.6669 31.2461 33.2396 31.2461Z" fill="#FE5000"/>
<path d="M33.2391 44.0703C30.8829 44.0703 28.9648 45.9883 28.9648 48.3446H37.5134C37.5134 45.9883 35.5954 44.0703 33.2391 44.0703Z" fill="#FE5000"/>
<path d="M16.1328 52.6133C16.2194 54.0563 16.3867 55.4799 16.6429 56.8876H88.2933C88.5495 55.4799 88.7165 54.0563 88.8031 52.6133H16.1328Z" fill="#FE5000"/>
<path d="M17.6953 61.1602C20.2535 69.3751 25.7771 76.7325 33.2405 81.4052V86.9484H71.7091V81.4052C79.1724 76.7325 84.696 69.3751 87.2542 61.1602H17.6953Z" fill="#FE5000"/>
<path d="M48.2004 14C39.8636 14 32.622 19.4989 30.0195 27.2909C31.0778 27.1289 32.1373 26.9653 33.2403 26.9653C40.2557 26.9653 46.4384 30.4093 50.3375 35.6461V14H48.2004Z" fill="#FE5000"/>
</g>
<defs>
<filter id="filter0_d" x="0" y="0" width="104.947" height="104.948" filterUnits="userSpaceOnUse" color-interpolation-filters="sRGB">
<feFlood flood-opacity="0" result="BackgroundImageFix"/>
<feColorMatrix in="SourceAlpha" type="matrix" values="0 0 0 0 0 0 0 0 0 0 0 0 0 0 0 0 0 0 127 0" result="hardAlpha"/>
<feOffset dy="2"/>
<feGaussianBlur stdDeviation="8"/>
<feComposite in2="hardAlpha" operator="out"/>
<feColorMatrix type="matrix" values="0 0 0 0 1 0 0 0 0 1 0 0 0 0 1 0 0 0 1 0"/>
<feBlend mode="normal" in2="BackgroundImageFix" result="effect1_dropShadow"/>
<feBlend mode="normal" in="SourceGraphic" in2="effect1_dropShadow" result="shape"/>
</filter>
</defs>
</svg>
