<svg width="188" height="6" viewBox="0 0 188 6" fill="none" xmlns="http://www.w3.org/2000/svg">
<circle cx="81" cy="3" r="3" fill="#C4C4C4"/>
<circle cx="132.989" cy="3" r="3" fill="#C4C4C4"/>
<circle cx="185" cy="3" r="3" fill="#C4C4C4"/>
<circle cx="107" cy="3" r="3" fill="#C4C4C4"/>
<circle cx="55" cy="3" r="3" fill="#C4C4C4"/>
<circle cx="29" cy="3" r="3" fill="#C4C4C4"/>
<circle cx="3" cy="3" r="3" fill="#C4C4C4"/>
</svg>
