<svg width="44" height="15" viewBox="0 0 44 15" fill="none" xmlns="http://www.w3.org/2000/svg">
<path d="M13.6836 13L19.5253 7.5L13.6836 2" stroke="#38D3E8" stroke-opacity="0.5" stroke-width="2.2" stroke-linecap="round" stroke-linejoin="round"/>
<path d="M2 13L7.84173 7.5L2 2" stroke="#38D3E8" stroke-opacity="0.2" stroke-width="2.2" stroke-linecap="round" stroke-linejoin="round"/>
<path d="M37.0508 13L42.8925 7.5L37.0508 2" stroke="#38D3E8" stroke-width="2.2" stroke-linecap="round" stroke-linejoin="round"/>
<path d="M25.3672 13L31.2089 7.5L25.3672 2" stroke="#38D3E8" stroke-opacity="0.8" stroke-width="2.2" stroke-linecap="round" stroke-linejoin="round"/>
</svg>
