<svg width="12" height="4" viewBox="0 0 12 4" fill="none" xmlns="http://www.w3.org/2000/svg">
<path fill-rule="evenodd" clip-rule="evenodd" d="M6 0C4.5 0 3 4 0 4L12 4C9 4 7.5 0 6 0Z" fill="#725597"/>
</svg>
