%YAML 1.1
%TAG !u! tag:unity3d.com,2011:
--- !u!1 &2858398895851310073
GameObject:
  m_ObjectHideFlags: 0
  m_CorrespondingSourceObject: {fileID: 0}
  m_PrefabInstance: {fileID: 0}
  m_PrefabAsset: {fileID: 0}
  serializedVersion: 6
  m_Component:
  - component: {fileID: 2858398895851310074}
  - component: {fileID: 2858398895851310076}
  - component: {fileID: 2858398895851310075}
  m_Layer: 5
  m_Name: Image
  m_TagString: Untagged
  m_Icon: {fileID: 0}
  m_NavMeshLayer: 0
  m_StaticEditorFlags: 0
  m_IsActive: 1
--- !u!224 &2858398895851310074
RectTransform:
  m_ObjectHideFlags: 0
  m_CorrespondingSourceObject: {fileID: 0}
  m_PrefabInstance: {fileID: 0}
  m_PrefabAsset: {fileID: 0}
  m_GameObject: {fileID: 2858398895851310073}
  m_LocalRotation: {x: 0, y: 0, z: 0, w: 1}
  m_LocalPosition: {x: 0, y: 0, z: 0}
  m_LocalScale: {x: 1, y: 1, z: 1}
  m_Children:
  - {fileID: 5575964585237541580}
  m_Father: {fileID: 0}
  m_RootOrder: 0
  m_LocalEulerAnglesHint: {x: 0, y: 0, z: 0}
  m_AnchorMin: {x: 0.13685288, y: 1}
  m_AnchorMax: {x: 1, y: 1}
  m_AnchoredPosition: {x: -58.9, y: -66.29999}
  m_SizeDelta: {x: -146.04, y: 43.536987}
  m_Pivot: {x: 0.5, y: 0.5}
--- !u!222 &2858398895851310076
CanvasRenderer:
  m_ObjectHideFlags: 0
  m_CorrespondingSourceObject: {fileID: 0}
  m_PrefabInstance: {fileID: 0}
  m_PrefabAsset: {fileID: 0}
  m_GameObject: {fileID: 2858398895851310073}
  m_CullTransparentMesh: 1
--- !u!114 &2858398895851310075
MonoBehaviour:
  m_ObjectHideFlags: 0
  m_CorrespondingSourceObject: {fileID: 0}
  m_PrefabInstance: {fileID: 0}
  m_PrefabAsset: {fileID: 0}
  m_GameObject: {fileID: 2858398895851310073}
  m_Enabled: 1
  m_EditorHideFlags: 0
  m_Script: {fileID: 11500000, guid: fe87c0e1cc204ed48ad3b37840f39efc, type: 3}
  m_Name: 
  m_EditorClassIdentifier: 
  m_Material: {fileID: 0}
  m_Color: {r: 1, g: 1, b: 1, a: 0.19607843}
  m_RaycastTarget: 1
  m_RaycastPadding: {x: 0, y: 0, z: 0, w: 0}
  m_Maskable: 1
  m_OnCullStateChanged:
    m_PersistentCalls:
      m_Calls: []
  m_Sprite: {fileID: 0}
  m_Type: 0
  m_PreserveAspect: 0
  m_FillCenter: 1
  m_FillMethod: 4
  m_FillAmount: 1
  m_FillClockwise: 1
  m_FillOrigin: 0
  m_UseSpriteMesh: 0
  m_PixelsPerUnitMultiplier: 1
--- !u!1001 &2858398895857174494
PrefabInstance:
  m_ObjectHideFlags: 0
  serializedVersion: 2
  m_Modification:
    m_TransformParent: {fileID: 2858398895851310074}
    m_Modifications:
    - target: {fileID: 7695205466809464082, guid: 273b2f3e54ea348088a78f08c93081fe, type: 3}
      propertyPath: m_Pivot.x
      value: 0.5
      objectReference: {fileID: 0}
    - target: {fileID: 7695205466809464082, guid: 273b2f3e54ea348088a78f08c93081fe, type: 3}
      propertyPath: m_Pivot.y
      value: 0.5
      objectReference: {fileID: 0}
    - target: {fileID: 7695205466809464082, guid: 273b2f3e54ea348088a78f08c93081fe, type: 3}
      propertyPath: m_RootOrder
      value: 0
      objectReference: {fileID: 0}
    - target: {fileID: 7695205466809464082, guid: 273b2f3e54ea348088a78f08c93081fe, type: 3}
      propertyPath: m_AnchorMax.x
      value: 1
      objectReference: {fileID: 0}
    - target: {fileID: 7695205466809464082, guid: 273b2f3e54ea348088a78f08c93081fe, type: 3}
      propertyPath: m_AnchorMax.y
      value: 1
      objectReference: {fileID: 0}
    - target: {fileID: 7695205466809464082, guid: 273b2f3e54ea348088a78f08c93081fe, type: 3}
      propertyPath: m_AnchorMin.x
      value: 0
      objectReference: {fileID: 0}
    - target: {fileID: 7695205466809464082, guid: 273b2f3e54ea348088a78f08c93081fe, type: 3}
      propertyPath: m_AnchorMin.y
      value: 1
      objectReference: {fileID: 0}
    - target: {fileID: 7695205466809464082, guid: 273b2f3e54ea348088a78f08c93081fe, type: 3}
      propertyPath: m_SizeDelta.x
      value: 0.0078
      objectReference: {fileID: 0}
    - target: {fileID: 7695205466809464082, guid: 273b2f3e54ea348088a78f08c93081fe, type: 3}
      propertyPath: m_SizeDelta.y
      value: 43.306
      objectReference: {fileID: 0}
    - target: {fileID: 7695205466809464082, guid: 273b2f3e54ea348088a78f08c93081fe, type: 3}
      propertyPath: m_LocalPosition.x
      value: 0
      objectReference: {fileID: 0}
    - target: {fileID: 7695205466809464082, guid: 273b2f3e54ea348088a78f08c93081fe, type: 3}
      propertyPath: m_LocalPosition.y
      value: 0
      objectReference: {fileID: 0}
    - target: {fileID: 7695205466809464082, guid: 273b2f3e54ea348088a78f08c93081fe, type: 3}
      propertyPath: m_LocalPosition.z
      value: 0
      objectReference: {fileID: 0}
    - target: {fileID: 7695205466809464082, guid: 273b2f3e54ea348088a78f08c93081fe, type: 3}
      propertyPath: m_LocalRotation.w
      value: 1
      objectReference: {fileID: 0}
    - target: {fileID: 7695205466809464082, guid: 273b2f3e54ea348088a78f08c93081fe, type: 3}
      propertyPath: m_LocalRotation.x
      value: -0
      objectReference: {fileID: 0}
    - target: {fileID: 7695205466809464082, guid: 273b2f3e54ea348088a78f08c93081fe, type: 3}
      propertyPath: m_LocalRotation.y
      value: -0
      objectReference: {fileID: 0}
    - target: {fileID: 7695205466809464082, guid: 273b2f3e54ea348088a78f08c93081fe, type: 3}
      propertyPath: m_LocalRotation.z
      value: -0
      objectReference: {fileID: 0}
    - target: {fileID: 7695205466809464082, guid: 273b2f3e54ea348088a78f08c93081fe, type: 3}
      propertyPath: m_AnchoredPosition.x
      value: -0.0039978027
      objectReference: {fileID: 0}
    - target: {fileID: 7695205466809464082, guid: 273b2f3e54ea348088a78f08c93081fe, type: 3}
      propertyPath: m_AnchoredPosition.y
      value: -21.884
      objectReference: {fileID: 0}
    - target: {fileID: 7695205466809464082, guid: 273b2f3e54ea348088a78f08c93081fe, type: 3}
      propertyPath: m_LocalEulerAnglesHint.x
      value: 0
      objectReference: {fileID: 0}
    - target: {fileID: 7695205466809464082, guid: 273b2f3e54ea348088a78f08c93081fe, type: 3}
      propertyPath: m_LocalEulerAnglesHint.y
      value: 0
      objectReference: {fileID: 0}
    - target: {fileID: 7695205466809464082, guid: 273b2f3e54ea348088a78f08c93081fe, type: 3}
      propertyPath: m_LocalEulerAnglesHint.z
      value: 0
      objectReference: {fileID: 0}
    - target: {fileID: 7695205466809464083, guid: 273b2f3e54ea348088a78f08c93081fe, type: 3}
      propertyPath: m_Name
      value: Title3D
      objectReference: {fileID: 0}
    - target: {fileID: 7695205466809464085, guid: 273b2f3e54ea348088a78f08c93081fe, type: 3}
      propertyPath: m_text
      value: Title
      objectReference: {fileID: 0}
    - target: {fileID: 7695205466809464085, guid: 273b2f3e54ea348088a78f08c93081fe, type: 3}
      propertyPath: m_fontColor.a
      value: 1
      objectReference: {fileID: 0}
    - target: {fileID: 7695205466809464085, guid: 273b2f3e54ea348088a78f08c93081fe, type: 3}
      propertyPath: m_fontColor.b
      value: 0
      objectReference: {fileID: 0}
    - target: {fileID: 7695205466809464085, guid: 273b2f3e54ea348088a78f08c93081fe, type: 3}
      propertyPath: m_fontColor.g
      value: 0
      objectReference: {fileID: 0}
    - target: {fileID: 7695205466809464085, guid: 273b2f3e54ea348088a78f08c93081fe, type: 3}
      propertyPath: m_fontColor.r
      value: 0
      objectReference: {fileID: 0}
    - target: {fileID: 7695205466809464085, guid: 273b2f3e54ea348088a78f08c93081fe, type: 3}
      propertyPath: m_fontColor32.rgba
      value: 4278190080
      objectReference: {fileID: 0}
    m_RemovedComponents: []
  m_SourcePrefab: {fileID: 100100000, guid: 273b2f3e54ea348088a78f08c93081fe, type: 3}
--- !u!224 &5575964585237541580 stripped
RectTransform:
  m_CorrespondingSourceObject: {fileID: 7695205466809464082, guid: 273b2f3e54ea348088a78f08c93081fe, type: 3}
  m_PrefabInstance: {fileID: 2858398895857174494}
  m_PrefabAsset: {fileID: 0}
