{
    "os": "Windows-10-10.0.22631-SP0",
    "python": "3.10.11",
    "heartbeatAt": "2024-01-26T13:14:04.163388",
    "startedAt": "2024-01-26T13:14:02.176571",
    "docker": null,
    "cuda": null,
    "args": [],
    "state": "running",
    "program": "C:\\Users\\maxim\\PycharmProjects\\MHSL_paper\\main_HSL.py",
    "codePath": "main_HSL.py",
    "host": "MSI",
    "username": "maxim",
    "executable": "C:\\Users\\maxim\\anaconda3\\envs\\torch113cuda117\\python.exe",
    "cpu_count": 8,
    "cpu_count_logical": 16,
    "cpu_freq": {
        "current": 2300.0,
        "min": 0.0,
        "max": 2301.0
    },
    "cpu_freq_per_core": [
        {
            "current": 2300.0,
            "min": 0.0,
            "max": 2301.0
        }
    ],
    "disk": {
        "total": 930.3339805603027,
        "used": 578.0019912719727
    },
    "gpu": "NVIDIA GeForce RTX 3060 Laptop GPU",
    "gpu_count": 1,
    "gpu_devices": [
        {
            "name": "NVIDIA GeForce RTX 3060 Laptop GPU",
            "memory_total": 6442450944
        }
    ],
    "memory": {
        "total": 15.708480834960938
    }
}
