8.509107812823364370e-01,1.536465708578290013e+00,2.844635889496135439e-01,-1.033383744125792481e+00,-9.290444143858461734e-03,-5.418657261995168950e-02,4.540174334726870820e-02,-6.269220188672870731e-02,1.398280431383290168e+00,-1.037949334914092803e-02,-4.151772169882636532e-01,1.604365765227622198e-01,-5.243883574673721126e-01,-1.314380995619363057e-01,-2.766382048787152659e-01,1.007392081256042404e+00,-5.308305653798580659e-01,2.570576017441066896e-01,-3.076775313816616508e-01,8.531874913050088716e-02,-8.176572015373506641e-01,2.295297470828600583e-01,-6.233783436669932954e-01,4.515773668902159366e-02,1.854006081354435231e+00,6.518758817498336855e-01,1.633090062442573431e-01,-6.595680101967069664e-01,-1.769701660474744642e+00,-1.443478330333362480e+00,1.158547488773947476e-01,2.598629861556981613e+00,-5.622979259601590396e-01,1.508434550791969420e-01,-8.200887558004624767e-01,-2.453889096706381445e-01,2.015382168172753286e+00,6.790193222917633165e-01,1.759323544124546279e+00,7.414734160587680423e-01,4.494275189303534312e-01,5.997255230906332057e-01,1.555905707505690350e-01,-8.220545750528814033e-02,8.482017025462286197e-01,9.145193066244603486e-01,2.675266942324202368e+00,2.231753851063605909e-01,-2.352085271521796306e-02,7.740641284574398817e-01,3.397180568954943691e+00,1.902053890348604837e+00,2.581451866177166266e-01,-6.828548432797842960e-03,-1.022566260480601286e-01,1.350888283294753522e+00,-4.891131584689678569e-03,-1.832445162962073049e-01,-1.003825189128351614e+00,1.158323329419379544e+00,-3.430198979500304057e-01,4.050894797819806215e-01,4.616189100570554649e-01,7.458577618544356413e-01,1.802612550505047651e+00,1.036260058680223528e+00,-3.446175374429077398e-01,7.554878596844916139e-01,3.995333087743765388e-01,2.135815455302813859e-01,1.686486347955171272e+00,-5.929126146064427338e-01,-1.680444186690843167e-01,-5.324574665212873370e-01,-1.507199163272282538e-02,3.063103160195259078e-01,-3.074793889098449973e-01,1.253734326404159494e-01,-1.776086704046424991e+00,-2.329118151598186248e-02,7.742388067611546409e-01,-1.180468796877804927e-01,-4.298262919291804263e-01,1.959123279392573469e+00,7.908052762558932525e-01,-1.185178393273003339e+00,4.796276585918720636e-01,5.415627161594551708e-01,8.481904892263225637e-01,-5.565094117958331310e-01,1.460054932166472419e+00,-8.294053982033513517e-01,1.171855881675436084e+00,3.133481360714220343e-01,-6.545219845021543748e-01,-2.703266948001479264e-01
6.814829573769362048e-01,1.454039663885672518e+00,8.511562848562607975e-02,-1.209757565695500414e+00,1.649208754436100044e-01,-6.482345348890788950e-02,6.871649281061849024e-01,-3.786004174401858546e-01,1.221469222873486915e-01,-2.303338599382517560e-01,-1.143481748021458189e-01,5.602161552214802304e-02,-4.027967631088198441e-01,2.176106640430723604e-02,-5.723614852750166238e-01,8.445084012086526704e-01,-4.120178577342299420e-01,-8.994161850495852040e-02,-3.614620810141238039e-01,-2.080796713883843463e-01,-4.245651822176418899e-01,8.684425947715890270e-02,-7.944960825688746064e-01,1.340624502699221676e-01,2.137763553473069678e+00,1.102916817874394884e+00,2.034270311286060229e-01,-6.566268586855993350e-01,-2.272308020662828554e+00,-1.934542191690941770e+00,-2.557159598919112042e-03,2.343806062197425266e+00,-5.101434465511458516e-01,5.638294735002407077e-01,-9.058280536570231245e-01,-3.088282608749126634e-01,1.999671388137546302e+00,4.908541730583511620e-01,2.370059249728705186e+00,2.397516926220076838e-01,7.112034780116460730e-02,5.468346564374838570e-01,-1.999511149674594312e-01,-2.171225211099075958e-01,7.447110839722457243e-01,1.054949333441393966e+00,2.051838550023773244e+00,1.825916167756249930e-01,-7.532854432031123315e-02,4.778234694764155188e-01,3.329281625719751059e+00,2.206801436757783286e+00,-1.398648204818927487e-01,-2.285730120282231104e-02,9.797788596229894953e-02,1.388908958076869649e+00,-1.666274122195038343e-02,1.151887650416744124e-01,-1.188278617387346525e+00,1.178011809168006740e+00,-8.095710486407705631e-01,1.445957407824256524e-01,7.337827740295094214e-01,4.991778152871446661e-01,1.920031872833448450e+00,1.138577165661666335e+00,-7.706329602159951442e-01,1.653080118734525650e-01,3.804083779533188880e-01,1.181377277271138837e+00,1.130720293506053631e+00,-4.068279990941844892e-01,-2.218948249669631667e-01,-5.393743986162776727e-01,-1.399165226453591981e-01,1.327471108703665026e-01,-9.481147299500212178e-01,9.437715673765711966e-02,-1.871339650060417359e+00,-2.220242059597051787e-01,1.127398670086501742e+00,-2.562555014054547220e-01,-4.461789585688173965e-01,2.261996361176272341e+00,9.737458644263290442e-01,-1.443506613299520236e+00,6.827871295231739968e-01,-3.759074505925033005e-01,8.700080418189517495e-01,-3.008084151283978436e-01,8.188481500250595069e-01,-8.282457697244668404e-01,6.651154958964914377e-01,2.224837289952839858e-01,-4.581672917139968937e-01,-4.758076875221324831e-01
7.129558759144201119e-01,8.249678923162693245e-01,3.198808672977689893e-01,-8.960048856883244817e-01,-1.579423202580255148e-01,1.621405317506416366e-01,1.482383828845642015e-01,-1.382841041856934239e-01,1.421145848133203771e+00,3.068544939823913964e-01,-8.947217349010089249e-02,1.044104209764808444e-01,-5.303398186408875281e-01,-3.681903350402951358e-01,-3.020160163442627832e-01,1.131615410143122613e+00,-7.718047287197589146e-01,4.242189892884353775e-01,-1.892905207134221168e-01,1.934668974214811821e-01,-9.121310045055281979e-01,4.760939681443333571e-01,-3.974084516072620143e-01,4.032582656714306379e-02,1.832394960429904796e+00,2.378960200117522517e-01,2.577562528578653533e-01,-7.373597544399346226e-01,-1.659750111957649432e+00,-1.345100708691183922e+00,1.609423037732318762e-01,2.897806711902307875e+00,-5.374360540299571998e-01,1.575119388574630630e-01,-6.408943547076225711e-01,-2.496644161724564381e-01,1.776244353201800630e+00,8.760738267238735721e-01,2.003919990984790012e+00,1.367242165530566878e+00,5.703689707539407738e-01,6.617540581487033613e-01,2.336006348580436653e-01,-2.421722594898191860e-01,7.936049606685997571e-01,7.535962126379529558e-01,2.673390270042377725e+00,-2.393113659989402897e-02,-7.797725421910678412e-03,5.310078016163968240e-01,3.455769518575552368e+00,2.038462885829193105e+00,2.744245121812484700e-01,-1.210703208138053100e-01,-5.348897535784463697e-01,1.693215573433174415e+00,4.633030229305346581e-01,-2.164000497291140579e-01,-7.117610479781536492e-01,1.854244919520154689e+00,2.971741245233147644e-02,8.021419405603835706e-02,1.843421309749913306e-01,1.003595442770284230e+00,1.698469054389666777e+00,9.085012086082717708e-01,-3.979470944058429716e-01,1.096084017636883123e+00,4.590493701254315662e-01,-1.919638796907335854e-02,1.825065271248244247e+00,-4.455160363745066521e-01,1.883791985766726795e-01,-4.424485018096278033e-01,-6.510195423739234544e-02,4.362244331471200609e-01,-3.162133878201291437e-01,3.406943075086513173e-01,-1.704305873410292271e+00,-6.617503964719373410e-02,4.991280005468298753e-01,1.359586644593727134e-01,-4.513349280261316210e-01,2.048897243213323005e+00,8.606557860826614670e-01,-1.353923928351113526e+00,3.460299334158143947e-01,1.123411460493369596e+00,8.348322049599876671e-01,-5.311466994015887622e-01,1.721075300980333900e+00,-4.218904732290803539e-01,9.372544189112367308e-01,3.723061985319410794e-01,-2.656670035031964971e-01,-3.588972967301519157e-01
9.997619559182122639e-01,1.527654278777931474e+00,-4.130398152483913399e-01,-6.254565254094777149e-01,-1.675364986145116974e-01,4.588767000066144019e-01,6.669654805988305402e-01,2.091340488715528467e-01,9.071246895890364703e-01,-1.803367200147606708e-01,5.548479315016030533e-02,5.674970162611959329e-02,-3.862951125445724943e-01,2.553204156091450350e-01,-5.113560401218892881e-01,1.390910704191718805e+00,-4.135794008671145328e-04,-6.863212325623968546e-01,-1.937065793817493720e-01,-1.618785347309762701e-01,-4.397775658517715791e-01,3.269837108548273585e-01,-7.981858061791841097e-01,1.413245735253344793e-01,1.763041937512133117e+00,4.740252625185845115e-01,-2.205164391906978827e-01,-5.963977500271572252e-01,-1.527474196252567307e+00,-1.420204465597101340e+00,4.146200028023924733e-01,2.136861894805715867e+00,-9.201744758076868536e-02,3.703977104707728008e-01,-9.965440395916269622e-01,-6.144799537272592760e-01,2.234825649641882794e+00,3.237151720013364820e-01,1.716485610051028621e+00,6.204564780533983193e-02,7.115877871783855557e-01,4.008931411300753478e-01,-1.216045419550959433e-01,3.715119168655337534e-01,4.415141605256616142e-01,9.724014245779171173e-01,2.264685102280825202e+00,6.040881871846038864e-01,3.563300794332066590e-01,2.297027704160283790e-01,4.499152277817103140e+00,2.268623323680667880e+00,6.952045354537818023e-01,-1.715872409754250760e-01,2.471683477090673708e-01,1.003777254032295119e+00,-3.843054362518196765e-01,-2.938994041317723460e-01,-1.277231693767779452e+00,1.357090917163519705e+00,-6.399706293138792690e-01,-1.549080144329655906e-01,2.022976542081598439e-01,-2.377921383206438311e-01,1.125767195615111849e+00,4.351892100115739570e-01,-5.572716044675626312e-01,3.525345725479753778e-01,-3.324454585919100480e-01,7.277697698137909343e-01,2.179048197890878669e+00,-1.831379790386798712e-01,-4.390898258143098309e-01,-3.958902705334041427e-02,2.984121944785122493e-01,3.022390362184825818e-01,-6.391108479382601182e-01,-1.822181669242295410e-02,-1.357330906152892425e+00,-6.044808368403165044e-01,1.308443280313618118e+00,-4.038694274153309394e-02,-5.179485232194538380e-01,1.698193173932971645e+00,7.386574638635694523e-01,-1.207517083970645055e+00,2.317652516802913287e-01,2.240272251785545565e-01,1.133121294391474798e+00,-1.262823509198176319e+00,1.389386041204191180e+00,-6.564776700865975201e-01,1.309456217937582823e+00,3.293322838628595650e-01,-9.615100653204589065e-01,-6.579689487089117605e-01
7.658390931767331544e-01,1.375197480709099418e+00,6.857579480648019754e-02,-8.932245509289296059e-01,1.895006757845125733e-01,-8.727372772002084389e-03,5.257436530283734477e-01,-2.914216103502585420e-01,2.385072723891870083e-01,-1.154601622072144729e-01,7.723296593390532871e-02,3.731713523025146501e-02,-4.110456485461402854e-01,1.655885299163005753e-01,-4.020821523810474973e-01,1.092155391040353418e+00,-3.551659284714249187e-01,-1.792395473112667892e-01,-1.595484268249639515e-01,-7.367393056235252424e-02,-5.523064512319499908e-01,-1.001790422562326421e-02,-7.524641437807215727e-01,2.287725581815565068e-01,1.827876795760238871e+00,6.603196422006962774e-01,2.258305680602574472e-01,-6.225991957764656082e-01,-1.520549983581719999e+00,-1.427819304443808335e+00,1.591150901440610832e-01,2.245534838085582852e+00,-3.613637497130498533e-01,2.603227335844074397e-01,-8.344190116717926653e-01,-4.885541613879376133e-01,1.717994277788641000e+00,6.988900869029337493e-01,1.957485641343022165e+00,4.121354308062359362e-01,2.648702750906760661e-01,4.254974745249788803e-01,-1.708448231324336541e-01,-1.471873817865797240e-02,6.529612834142846101e-01,1.035187493997618002e+00,2.214045240573593532e+00,1.058921844786649691e-01,7.770573243086886794e-03,7.938080793426347537e-01,3.512156845277361938e+00,1.788365540081488625e+00,-1.375236876192675872e-04,-2.002961509407477914e-01,-3.017951835331450505e-02,1.292859127015318244e+00,-3.472569534433805893e-02,6.346235445014514198e-02,-9.564709328934293264e-01,8.688764007868581274e-01,-1.849048018944513816e-01,1.444797234433450872e-02,3.924924277343819767e-01,5.181759064474370513e-01,1.441378461889601503e+00,6.709443600195789115e-01,-6.921329817970141018e-01,3.403243340484047863e-01,1.001416198814632924e-01,8.953118908791892760e-01,1.607063353331539934e+00,-4.708121444048920523e-01,-1.532959295752170936e-01,-1.390938845538591817e-02,-1.627110309439083191e-01,6.388364178164049889e-01,-5.872024716569921310e-01,2.226948845274545064e-01,-1.319112597478306448e+00,-3.360980934405143894e-01,8.254810088442315896e-01,-2.456356033622663637e-01,-2.759574647547983206e-01,1.884891225339733190e+00,7.811905552973645861e-01,-1.141977315048317676e+00,5.829877231140091487e-01,1.871629526013461886e-01,7.675879009048133250e-01,-1.230811227252007756e-01,1.029591893936815605e+00,-8.519867122748135957e-01,7.940537182487175105e-01,2.459796222092027473e-01,-1.390996296164686008e-01,-3.119521362067928516e-01
1.106220927268386944e+00,1.519247901779371412e+00,-5.296029854647718027e-01,-7.170806942996930111e-01,-5.492142148661759427e-01,5.653342630736466479e-01,1.340559826147554034e-01,6.278354135193997543e-01,1.965913294355889018e+00,1.241318370730500886e-01,2.081848628668712953e-01,3.410847131015932732e-01,-3.792453663432370781e-01,1.970770479643045581e-02,-6.494378165176040163e-01,1.910766149287673965e+00,2.250040771512119009e-01,-3.697526655007628560e-01,-3.322210886855876399e-01,-1.214872984216198160e-01,-4.760046434045099861e-01,9.594579860885730227e-01,-5.655659466959255255e-01,-6.300731823485861138e-02,1.805881134411873479e+00,4.517272970516181263e-02,-3.504728047052313444e-01,-5.881882499887285398e-01,-1.423226534035661128e+00,-1.423439924753829633e+00,3.672715618503513135e-01,2.349650345382873873e+00,-2.544317428774237055e-01,2.742146321977110279e-01,-9.317500024975138295e-01,-5.571796868677419967e-01,2.452227910403992794e+00,3.700775697849129631e-01,1.783677146391656088e+00,7.216812468166406980e-01,9.826146233411718889e-01,3.624561116934514327e-01,2.395264573669222408e-01,3.790891875100851904e-01,2.287400720118819841e-01,7.072061907328965891e-01,2.751820439541672325e+00,6.303045716355025752e-01,3.152816177776627260e-01,1.962017013586727088e-01,4.737351381538656980e+00,2.444537689018049686e+00,1.223745569277119749e+00,-1.602913350800941328e-01,-5.398619319733244382e-02,1.264409032599215443e+00,1.233990799391402327e-01,-4.629783925174507653e-01,-1.504787763605319517e+00,2.329514553463410742e+00,-7.056160715713838405e-01,8.089954502358853716e-02,1.277858778088797609e-01,9.471985681703032345e-02,1.154904522436898784e+00,3.597060473250882073e-01,-3.592030498849456688e-01,4.975575381439642508e-01,4.075663234189207118e-02,1.314330216691672604e-02,2.643110120733623170e+00,-9.093706090336661774e-02,-3.553159684050212763e-01,-4.350819841007389499e-01,3.924900740469789429e-01,8.122208392623753159e-02,-4.156453103164651219e-01,4.151172441931666457e-01,-1.654569423161536657e+00,-3.322002090818495512e-01,1.520659273287408242e+00,5.312794409050298761e-01,-6.138451870762740015e-01,1.553781961204098172e+00,1.119272346851525768e+00,-1.396226231374706472e+00,-2.987482056939305686e-02,7.594916937610296515e-01,1.128096865016040340e+00,-1.787845919715064458e+00,2.113676393796988684e+00,-3.404921327854550928e-01,1.507065324671367890e+00,2.337531351666106150e-01,-8.341828047274690849e-01,-7.263252982490741028e-01
9.398110566844206648e-01,1.507281952864015562e+00,1.094119550688616577e-01,-7.328961152579174243e-01,-7.643731972473244429e-02,2.705931905231548917e-01,4.507252430760007589e-01,3.672114478176412289e-02,1.480735842023362281e+00,-1.833848173979884810e-01,-6.605565182949062475e-01,-4.539989818726763993e-02,-5.611690408123710672e-01,-3.630799275271390236e-02,-1.814220558137022432e-01,7.996679928143313187e-01,-5.961098345797787301e-01,-1.979275568720237632e-01,-2.210528651410644807e-01,8.990146732226594883e-02,-8.466821538760171961e-01,9.832658692954948654e-02,-7.406146680474853250e-01,8.771908917271092898e-02,1.745187501096063798e+00,7.238898317436954777e-01,-6.760315689575904785e-02,-6.830252587823167909e-01,-1.881329689187851040e+00,-1.372068811157215240e+00,3.675252394629686670e-01,2.555137724567809077e+00,-2.701791379007411065e-01,2.563595974744268258e-01,-9.392165325751229421e-01,-3.089540671686844542e-01,2.257810937469447499e+00,4.101923646933346435e-01,1.469767988395115133e+00,2.194954265344088995e-01,6.883931909966156670e-01,6.974584729529180738e-01,3.462679616360546386e-02,1.533853470292922683e-01,9.298804800726425679e-01,1.000605251989899580e+00,2.484994853680094096e+00,5.595878207204794119e-01,2.857864764446362837e-01,3.010973170474413596e-01,3.945486426597163643e+00,2.180489683249835053e+00,4.574210344550142526e-01,3.811486536916741663e-02,2.125389664440645587e-01,1.012257746053780938e+00,-5.792048126149795806e-01,-4.311624110428445844e-01,-9.655189782948729871e-01,9.848992703191439269e-01,-5.467256344306284932e-01,1.150255700019851557e-01,2.961085152068878568e-01,2.924707063808074103e-02,1.610721843569043354e+00,9.960820347096586147e-01,-2.800795304257668872e-01,9.274799173001911923e-01,-1.524780749837479077e-01,3.411479014193116166e-01,1.834619468914939322e+00,-4.596063749918956054e-01,-3.595617770392910972e-01,-3.486337094439002637e-01,3.088270930269449988e-01,1.780484646031254004e-01,-4.058011868426136259e-01,-4.165550017369047398e-01,-1.667681252144276538e+00,-3.688129751374723542e-01,8.358846185361854531e-01,-3.350748584422886811e-01,-5.927531280187297025e-01,1.970864142484380910e+00,4.278109033077192591e-01,-1.114884158149570537e+00,3.448535690745251348e-01,4.623569124158390387e-01,1.162412766567995082e+00,-1.145227379319927019e+00,1.372824292254410716e+00,-8.251394478633443663e-01,1.497471447527659372e+00,5.125605860759210319e-01,-1.488328224038791170e+00,-4.789149321827118611e-01
8.001574175412912160e-01,5.509040753708502880e-01,-2.716129483413210477e-01,-5.435737085682245118e-01,-4.158754351963209750e-01,6.676165600612342654e-01,5.686612756046189876e-01,1.380099439625890045e-01,1.199240228969161493e+00,3.613271914622231407e-01,5.044455789165017690e-01,7.474429691361328398e-02,-4.068442770647655582e-01,-1.781441689244636084e-01,-5.520953920356809208e-01,1.640916177482074412e+00,-3.499890470774007500e-01,-2.118623471320038587e-01,-8.160752044884717060e-02,2.858421868142853664e-02,-6.247752503293363402e-01,7.914072646457427362e-01,-4.033825970058835808e-01,7.797013710928676899e-02,1.764217250055667208e+00,-1.692189172572934053e-01,-3.452749487890441338e-02,-7.068618237549122441e-01,-1.365322357287317212e+00,-1.292015662655853880e+00,3.971183386729206233e-01,2.655657391326643690e+00,-1.877787368197952889e-01,3.147193164738273929e-01,-6.977514563552557059e-01,-5.540116909804618794e-01,1.884061543713515530e+00,6.881885439039028274e-01,2.104483473638209645e+00,1.210433870881275409e+00,8.668791031043091566e-01,4.912986758213264693e-01,1.083685878638249028e-01,6.434570871663440605e-02,3.677902559471349919e-01,6.806509907335427378e-01,2.437268352554086803e+00,1.741167512839096876e-01,2.805172088496714067e-01,2.577916852222605915e-02,4.410501157759204816e+00,2.400901481021478823e+00,7.374639716017390434e-01,-3.125120384407470420e-01,-4.949972500499234540e-01,1.614060766083647902e+00,4.825433068458728769e-01,-3.260718887913671704e-01,-8.852063985559800452e-01,2.495187604218377153e+00,-6.681757404833302272e-02,-4.459614703455511142e-01,-1.416941845377720777e-01,4.047484607309554949e-01,1.097478196017813934e+00,3.246451167419631689e-01,-5.715306855526995911e-01,8.826955359718128280e-01,-1.295379743543009082e-02,1.811918717342412555e-01,2.380183555882776858e+00,-3.492242085845181920e-02,1.291719001787763055e-01,-7.550255409328560097e-02,1.639717688920104277e-01,4.611403073380700435e-01,-5.470423526066559017e-01,4.523487056658410110e-01,-1.379444447585846056e+00,-4.902468992413925308e-01,8.883905061497359146e-01,4.374526883451296255e-01,-5.314025657338551367e-01,1.822765803370742788e+00,9.599472510855648899e-01,-1.478901066153442301e+00,4.658545705550465321e-02,1.187105425592539065e+00,1.034142948985390165e+00,-1.157414597140459023e+00,1.911627040909379183e+00,-5.841296984437688300e-02,9.659139966712340097e-01,3.644298212499713641e-01,-2.496905708945825197e-01,-7.127179206739983064e-01
6.092102888543924344e-01,8.552651924023317864e-01,-6.577531514812257063e-02,-8.691455644848481432e-01,2.054095860770733806e-01,-1.999905129257384395e-02,5.356064790679091470e-01,-4.373171066737447932e-01,-5.165009164259097840e-01,2.044881353504095500e-01,1.007228347695051429e+00,1.411187559663811542e-01,-2.723081188067409952e-01,2.091106212873304893e-01,-6.354343350314922700e-01,1.645867297296969900e+00,-1.483334598618336886e-01,-1.102114086244312258e-01,-3.126528541353718743e-02,-1.429992686540030311e-01,-3.484421250784766610e-01,2.103655011111762729e-01,-5.841336564422204836e-01,3.142879387209208675e-01,1.827907469009315333e+00,1.517724906046946098e-01,4.433667005759527324e-01,-5.987639469958385696e-01,-9.589664925769350035e-01,-1.322771655140828173e+00,6.284268495456996062e-02,2.139722925773029694e+00,-3.861037660495620361e-01,2.086838989233752439e-01,-6.374957856926867228e-01,-7.019982741748809207e-01,1.172195047640252286e+00,1.057957541332862794e+00,2.434821305268725311e+00,1.057778863447708328e+00,1.242162016017537840e-01,1.754407232050484711e-01,-2.230071738870235132e-01,-1.483278037809064864e-01,2.653105900684225027e-01,9.024844632826941604e-01,2.108708724607751606e+00,-3.695311467122446292e-01,-1.659715355496376166e-01,1.055471789012849992e+00,3.417771316019822425e+00,1.552160375909189538e+00,-1.421277499375777076e-01,-5.116434194517428535e-01,-5.393863811210437564e-01,1.730312411422793684e+00,7.735984458732344526e-01,3.857773346954661564e-01,-8.424638256321954621e-01,1.399843969131873589e+00,3.850965423544743804e-01,-2.718015139540677638e-01,2.035259096085927089e-01,1.048976285126435704e+00,1.080364490840708180e+00,1.482325418774558257e-01,-1.018474722194541382e+00,6.515833448001928652e-02,3.103045779187950659e-01,1.031156804166081020e+00,1.775542778015014367e+00,-3.357129345667098086e-01,2.193256003858231606e-01,3.587920408188801646e-01,-5.229436565199210296e-01,1.125648403781716045e+00,-6.505351677194205484e-01,1.005183785489097037e+00,-9.205042511989611764e-01,-3.451410493272957236e-01,7.331826627397510787e-01,1.440482808938540193e-01,-2.984816292495878765e-02,1.719006996299267342e+00,1.180774347307674388e+00,-1.257428832848559219e+00,5.843427314548680362e-01,5.000725316174621238e-01,4.445802100968541670e-01,5.408722250577948643e-01,1.126521082311372490e+00,-5.432000573217063977e-01,1.763980471058745891e-01,3.524432416850914462e-02,1.258954704764800425e+00,-2.566111651522327008e-01
7.398533992288950367e-01,1.207929504619182470e+00,6.352888736835432537e-02,-1.098759011519885975e+00,-4.067411276743582160e-02,-7.591971291190496851e-02,1.494476843665754062e-02,-1.132073406325961318e-01,7.447019056853321217e-01,2.506027279718918699e-01,4.776146986506527581e-01,3.301326044098722434e-01,-3.659932734884099315e-01,-6.659495749553957789e-02,-5.908418157306652985e-01,1.615320418735977759e+00,-1.821670653282581043e-01,2.854088683615128019e-01,-2.677583183046595705e-01,-5.660879451451641259e-02,-5.312960546088015823e-01,5.344242273777437546e-01,-4.915006823538141112e-01,8.410002518977087449e-02,1.927871312785331526e+00,2.437872005090987171e-01,3.025228145501348553e-01,-6.149939476839194619e-01,-1.346763331523056717e+00,-1.470858312445524785e+00,-1.539322901342915495e-02,2.432858277054852802e+00,-6.191176253118230166e-01,1.618189494415822050e-01,-6.834307449602012863e-01,-4.435919892585252766e-01,1.636722678969370737e+00,9.303630422169443248e-01,2.283218041065355752e+00,1.266445433145261257e+00,3.004588640347472528e-01,3.293411175322350504e-01,1.186204988806324745e-01,-1.831837753217619991e-01,4.127900028754245554e-01,7.816906574083682946e-01,2.588572947114303080e+00,-1.476641292166896990e-01,-2.018719532740738121e-01,9.904931654786747197e-01,3.375731885688919576e+00,1.774710869376301181e+00,2.087275969299902389e-01,-2.688269312444079295e-01,-5.091242286768132841e-01,1.749784652905995719e+00,7.673372078794271633e-01,1.287890806584353343e-01,-1.078918339351781164e+00,1.778250143959362539e+00,-2.843116454435418161e-02,2.249338332079304781e-01,3.818190868429514051e-01,1.201047455656047980e+00,1.514873318721843276e+00,5.730168614277836303e-01,-6.637555147162470526e-01,3.371735206743108337e-01,6.707582810765672088e-01,3.883708756626519931e-01,1.842950658037296519e+00,-4.302155157266879248e-01,9.824116838214982939e-02,-3.207185428247747438e-01,-3.251094569128175071e-01,6.213180656172032634e-01,-4.342967551573081453e-01,9.123668026262830022e-01,-1.526534244473650492e+00,7.349445151129341269e-03,9.002891476559421458e-01,3.229360554644676862e-01,-2.324311762677417348e-01,1.799187455912483857e+00,1.290454225616231021e+00,-1.360440554895659071e+00,4.711104995885129765e-01,6.571173005508845755e-01,5.635062268992836465e-01,-7.114922921707628189e-02,1.570559683239944881e+00,-5.446681179926483596e-01,6.185935469340250181e-01,5.936384780801773342e-02,6.085857855236611602e-01,-2.685390819030558651e-01
7.716801178816768969e-01,1.024743860249631044e+00,1.385216270623966239e-01,-8.116968215547825105e-01,-6.753079235356458654e-02,1.605737742478203778e-01,2.730590326010813862e-01,-1.182566558033514986e-01,1.021056215225901287e+00,1.771150342689498669e-01,8.172574893485529124e-02,9.566929586758025905e-02,-4.686634991043363008e-01,-1.167315943451874977e-01,-3.511971535891492135e-01,1.255148898421675874e+00,-5.195945175554020912e-01,1.136076228618228545e-01,-1.444224092560080774e-01,9.021154922295314404e-02,-7.563432329254888842e-01,3.407672083197809121e-01,-5.226495458934603544e-01,1.213803935556849872e-01,1.772513198257664069e+00,2.633537805505213325e-01,2.031906920099774139e-01,-6.782380641614966788e-01,-1.431968760884561709e+00,-1.286588341626428100e+00,2.094599323637539590e-01,2.596574636253480506e+00,-4.149913781817438085e-01,1.550229344368200257e-01,-7.131612923379444524e-01,-4.076722710234199631e-01,1.739088098051912779e+00,8.182391868021916537e-01,1.922111200378042728e+00,1.027739924972979502e+00,5.314075288806940911e-01,5.200216419927237155e-01,8.751012403538482864e-02,-7.475861277350347167e-02,6.568141035924296434e-01,8.395635761407302944e-01,2.528856314947187212e+00,4.623449036656901434e-02,4.100011657451589631e-02,6.427693903915179252e-01,3.634150961932841817e+00,1.912938103524383759e+00,2.811970514161539203e-01,-2.018097979440018064e-01,-3.600314143096352004e-01,1.516231087512537101e+00,2.881576231989019243e-01,-1.362120193917374933e-01,-8.169277203837284063e-01,1.529039243034511442e+00,2.604396360753954975e-02,1.087512077232982710e-03,1.747944584490667697e-01,7.634168020583281811e-01,1.448036570919638333e+00,6.617779615025324302e-01,-5.055704070991832166e-01,7.971085388118271942e-01,2.404674000101162390e-01,2.732093746778426757e-01,1.915848954386657477e+00,-4.184201886810612891e-01,5.151450695818915460e-02,-1.694611467644895064e-01,-7.476911966151014721e-02,5.893065549462292996e-01,-3.698195987354069847e-01,3.577207190564890560e-01,-1.440246975938039409e+00,-2.194034480146116739e-01,6.472620093562234667e-01,5.560710912649444171e-02,-3.656839369401296835e-01,1.875870656126267022e+00,8.349488048584891020e-01,-1.238833826008834960e+00,3.743213394568969399e-01,8.755908661892560785e-01,8.110000788070712563e-01,-4.459161758524350372e-01,1.549590203708137048e+00,-5.468876436691336718e-01,9.273698116955936266e-01,3.142869892929475717e-01,-1.555661028139707081e-01,-3.528585117611043875e-01
6.508745523048845572e-01,7.633488639176785329e-01,1.425037471423295510e-01,-8.503720683386845058e-01,2.846475107097376500e-02,5.466199697329576779e-02,2.694603289699938342e-01,-2.948919123829460975e-01,4.336478213065030896e-01,3.308048182419789374e-01,5.824779206336059278e-01,1.447614290589671060e-01,-3.931837411946090821e-01,-7.704327971108644590e-02,-4.591997703800692054e-01,1.489943784020597350e+00,-4.486017085944241645e-01,2.089919688137938936e-01,-7.024336678577008941e-02,5.386528137009016781e-02,-6.484247892846033423e-01,3.645576521450952789e-01,-4.478657324723420707e-01,1.932753370149903061e-01,1.783949999537860487e+00,5.716832633190457175e-02,3.980035434270531858e-01,-6.627449922685253458e-01,-1.125315531032201610e+00,-1.237218947366016897e+00,1.103450904014063039e-01,2.519938842321038486e+00,-4.689469250564718417e-01,1.116614510776293978e-01,-5.920886696656399995e-01,-5.106410854722027715e-01,1.354331315942144842e+00,1.065810485071417846e+00,2.211932252248213882e+00,1.373255133387541793e+00,3.558423415693648950e-01,3.777642663369512599e-01,2.790779960082309663e-02,-2.016556821093948293e-01,4.835723496445845093e-01,7.987127733679389996e-01,2.439817617993946364e+00,-2.871025823433049906e-01,-1.152224349694313948e-01,9.059266473318465795e-01,3.403218879958338050e+00,1.681409552467892254e+00,6.241025738707584036e-02,-3.748468658547803867e-01,-6.470382522159865424e-01,1.774024835007233403e+00,7.467123216261726260e-01,1.165315803933345273e-01,-7.150338501749164966e-01,1.653911450286272400e+00,3.960496414141917443e-01,-1.168042199238325390e-01,1.253390017611838991e-01,1.154919764706254348e+00,1.302139297727298306e+00,4.167056322080058273e-01,-7.181268618528859893e-01,6.025211758988511246e-01,4.115430045872719433e-01,4.284774653354593288e-01,1.886244500050892725e+00,-4.044745553729082177e-01,2.774854571754512556e-01,5.536020263504524974e-02,-3.558322580159847814e-01,9.196759210949999597e-01,-4.069716479548363686e-01,8.078580079243151690e-01,-1.201179649405340166e+00,-1.880530788547697951e-01,5.305867682373401895e-01,1.993906824022183000e-01,-1.799720906392225928e-01,1.810965502684473538e+00,1.049017752676035364e+00,-1.272681252115896333e+00,4.550731408149800705e-01,9.754762218026896692e-01,5.680898838700494391e-01,1.395655883692997201e-01,1.493280584339302886e+00,-4.500077841425637049e-01,5.012122079811704989e-01,1.791121760123611795e-01,7.392643817350603719e-01,-2.546088351358758994e-01
5.865770648884476302e-01,3.987175726842701051e-01,2.648588795421043529e-01,-7.757088553576654277e-01,-8.437334489918919822e-02,2.300316467836728829e-01,4.012126168277882488e-01,-3.341206999994227878e-01,7.528924284793316879e-01,4.217516872545130080e-01,3.651549268049897878e-01,2.598436133887528643e-02,-4.703576963562657309e-01,-3.163045106059884648e-01,-3.690758394164062595e-01,1.250563404461943584e+00,-8.001397197574909859e-01,3.280398126750102561e-01,-4.336034607421369869e-02,1.720796433297771266e-01,-8.254805264357480965e-01,4.370647581440655904e-01,-3.489039986987582664e-01,1.485609697355089187e-01,1.797451021711766073e+00,2.625261979994249900e-02,3.871382763485990974e-01,-7.497055390040091583e-01,-1.404328260440619314e+00,-1.258310627381834745e+00,1.789838038999814751e-01,2.844245871506457135e+00,-4.477284004549985652e-01,1.799632974669108654e-01,-5.403089726215775102e-01,-3.846777125835338373e-01,1.426256683211213794e+00,1.041658258301197515e+00,2.232043865119147874e+00,1.553469559931825117e+00,4.885735584412260746e-01,5.786441776446301644e-01,9.953776471356456934e-02,-3.087127129851387486e-01,6.626657586342820094e-01,7.420088805375276708e-01,2.445478257567812008e+00,-2.694326618542412510e-01,-2.717360639415340728e-02,5.351116090479060006e-01,3.444997847430612659e+00,1.948513387758527227e+00,8.641590351389910607e-02,-2.986101558352473040e-01,-7.480634173652047636e-01,1.858116590054021522e+00,7.309738125387212904e-01,-5.496045849090874791e-02,-5.155513080297322581e-01,1.968558160054762585e+00,3.838203315472081822e-01,-2.553897850191761965e-01,2.059952823032412672e-02,1.110511887973139267e+00,1.453838706914265977e+00,6.334997499078700578e-01,-6.208798146302695331e-01,1.022516626167188969e+00,3.766356362278299730e-01,2.262069325330705594e-01,1.829953864073917913e+00,-3.479635039158962551e-01,3.999467016150761722e-01,-9.003435889467240050e-02,-2.296751434603607200e-01,7.513287449976846499e-01,-4.328426863190993901e-01,5.641452244986981945e-01,-1.384560936755123040e+00,-2.181245927694817066e-01,3.393421965926804451e-01,1.864001209525284197e-01,-3.330188336960527296e-01,2.031418226391571658e+00,9.053202325438518550e-01,-1.384571249457791309e+00,3.696933480683211037e-01,1.242736684623685139e+00,7.247975808765132477e-01,-1.397671683134074083e-01,1.603210246314527021e+00,-2.647437493753336257e-01,5.708894170195388806e-01,3.416479992417957856e-01,3.454240886601854799e-01,-3.674285877858182170e-01
7.288703080896929976e-01,8.768866639638264182e-01,-2.568925417807541578e-01,-7.681643801923241366e-01,-1.354267966560728231e-01,4.336554479478720858e-01,8.653430876831458285e-01,-1.315746002006822901e-01,3.394291652047133345e-01,4.666696399890971070e-02,4.038801436020940105e-01,1.083941192808771103e-02,-3.591461809691497975e-01,1.249447943294633434e-02,-6.383021605749931160e-01,1.324990477581872605e+00,-2.899636763367076098e-01,-3.875085805613226464e-01,-1.643315989874846172e-01,-1.573796576140224779e-01,-4.119234582808701806e-01,4.421494126260827606e-01,-6.304534112552675484e-01,1.553988053301007533e-01,1.940466609410473220e+00,4.073766849091873810e-01,3.614394363834483315e-02,-6.759977085798399843e-01,-1.753550930993714951e+00,-1.617590499062750542e+00,2.617552865554577668e-01,2.391878559367834001e+00,-2.237702510123161237e-01,5.189041389245647729e-01,-8.181461237288021326e-01,-5.375740086128244499e-01,1.908556951025099924e+00,5.405827001825225242e-01,2.316876946644127244e+00,6.017883886949999539e-01,4.890743636231298930e-01,4.662376660785202964e-01,-1.541995909638320672e-01,-9.924661494616696111e-03,4.455915871009711871e-01,8.840324001696016065e-01,2.066376701245770775e+00,2.001696842132886789e-01,1.803378939241912504e-01,1.007001346678825238e-01,4.096442971871690375e+00,2.391350989799991389e+00,3.222035189294483182e-01,-2.403568977350210578e-01,-1.663606585887064671e-01,1.471646306677575344e+00,2.100635060876780980e-01,-8.253932849537319594e-02,-1.046860388878929626e+00,1.916971003305629973e+00,-4.456803097773902600e-01,-3.707715115925457883e-01,2.137475840554435014e-01,2.505681328616626846e-01,1.324319517583073091e+00,5.595499340788891995e-01,-7.880203526728946084e-01,4.104072403360534693e-01,4.782698289456828455e-03,8.957792386637378756e-01,1.822219548598862371e+00,-9.869734470275984273e-02,-5.129722513125763161e-02,-1.276029737452385182e-01,3.911153352243779135e-02,3.513693218568371135e-01,-8.842552734045423524e-01,2.767034094976065228e-01,-1.476595532758947726e+00,-5.287882068650313627e-01,1.091672766214178303e+00,1.061333048552856040e-01,-4.886907368874070512e-01,2.013916741126477117e+00,9.661794595297200638e-01,-1.492772214906751049e+00,3.266452504893062048e-01,3.248406058001758190e-01,9.965756473747318100e-01,-7.844372985541332444e-01,1.287369047739270744e+00,-3.622517054365770317e-01,7.329714065649260979e-01,2.941490858628018623e-01,-2.883119842040590686e-01,-6.955253127146437953e-01
7.204318949533428107e-01,5.928994723669769318e-01,1.291061226402057671e-01,-6.402996810204413247e-01,-2.047011444604988628e-01,4.344648766843918763e-01,5.193563975541733990e-01,-1.246253509062436454e-01,1.186746936053143520e+00,2.730624573832514668e-01,3.533264757997928163e-02,-4.113730858729069961e-02,-5.117157385618752441e-01,-2.803838262301418527e-01,-3.098326546856320918e-01,1.133773305933949871e+00,-7.699126989844534696e-01,6.585440008618290153e-02,-7.113600485841480026e-02,1.692325519762042374e-01,-8.602526442688593900e-01,4.397560283727432462e-01,-4.364431954198713104e-01,1.081869548813743503e-01,1.752247091581840444e+00,1.333191196820694979e-01,1.466285090601212593e-01,-7.530616875265780941e-01,-1.584906365737291489e+00,-1.265966802551681258e+00,3.346871396602625892e-01,2.832075707617663252e+00,-3.008775435764676764e-01,2.443461634598599053e-01,-6.695879383860157130e-01,-3.736303980875591568e-01,1.783431810442327015e+00,7.742015454594881607e-01,1.955352781358027814e+00,1.153972843468938247e+00,7.099554634637628148e-01,6.632297850827193475e-01,1.042781780320562596e-01,-1.058402606276946517e-01,7.316443158030843108e-01,7.812807667938965750e-01,2.454377768969100426e+00,8.378053234468688104e-02,1.891138101265597282e-01,2.039634615858056943e-01,3.872327642140270143e+00,2.207259050486543916e+00,3.716661204551479081e-01,-1.911738525438569369e-01,-4.527326051142487873e-01,1.573063512792915786e+00,2.712170488346584141e-01,-3.044463563883684776e-01,-6.323291320696030615e-01,1.909227269640514146e+00,4.927179334054052062e-02,-2.793562049569305872e-01,-1.570388501771022988e-02,5.877609088193144204e-01,1.423733375634748333e+00,7.054846036392907749e-01,-4.711690394689906358e-01,1.142872587000975049e+00,7.243992921253572526e-02,1.613367141772142355e-01,1.981593596684281922e+00,-2.791267001490710942e-01,1.673097472586928536e-01,-1.628115225462040405e-01,7.595453180149659700e-02,4.906968081803428916e-01,-4.442764514674945597e-01,1.534724268813496550e-01,-1.483580451278176060e+00,-3.651093438389503287e-01,5.159692737776726545e-01,8.502362049600084570e-02,-5.063145852777390932e-01,2.023081931442489712e+00,6.978100012269914387e-01,-1.349921682550735635e+00,2.396581918846761028e-01,1.149422690982950801e+00,9.885712340353788319e-01,-7.827861932965498593e-01,1.662051181447534276e+00,-3.010697854250221628e-01,9.715422524268865212e-01,4.686391287097850800e-01,-4.726707976953355428e-01,-5.236084086045889041e-01
7.541064188488240116e-01,8.807226620594047484e-01,-8.555730924674875837e-02,-5.656093685459872011e-01,4.255721668927915646e-02,3.208884963421368419e-01,7.288159303133174838e-01,-2.255070654494560345e-01,2.570463867602208463e-01,6.663265731341946885e-02,3.841209585526775272e-01,-6.032724172902662052e-02,-4.002866355560827927e-01,1.408711605757807794e-01,-3.918114984853282579e-01,1.291901557150271884e+00,-4.031054927944627275e-01,-3.636227431262663012e-01,1.573134631344654671e-02,-4.420991024683643134e-03,-5.920787887691975060e-01,1.307239920414659806e-01,-6.430760953929018919e-01,2.750287224898504967e-01,1.677341762911722434e+00,2.220195791401505803e-01,1.663937477544133459e-01,-6.558903709605029553e-01,-1.192036389732244794e+00,-1.185601966440020361e+00,3.490925435487787776e-01,2.322111458921304994e+00,-1.520808523475037088e-01,2.307437760714847741e-01,-7.530586624742194868e-01,-6.273960611492954698e-01,1.578450525133358928e+00,7.669052353486206508e-01,1.916088498232268567e+00,6.523576834236315403e-01,5.160581728475810426e-01,4.122858915205790398e-01,-1.763417152049502334e-01,8.174944541401432674e-02,5.252459930869046723e-01,9.452096210403820864e-01,2.162635710698787683e+00,6.911410574593077061e-02,1.824180975106526881e-01,5.260860877295927551e-01,3.942664171680787533e+00,1.883315412615226059e+00,1.987610855220898476e-01,-3.492524929587815241e-01,-2.259433318787328060e-01,1.353667239082823270e+00,8.145337089873322389e-02,-5.706622099378205054e-02,-7.445041188963670287e-01,1.256140875639378152e+00,1.483798897548975204e-01,-3.968409397826528906e-01,1.834902629516540692e-02,3.599274229244717738e-01,1.057915531807749110e+00,3.202155242505786426e-01,-7.192745390925349147e-01,5.863496081913354141e-01,-1.948734412797897275e-01,7.523528839375002164e-01,1.986407333588791957e+00,-2.863824047276291029e-01,8.976186321561607784e-03,3.260571554523554183e-01,-6.762619687494242360e-02,8.428779830358760217e-01,-5.553140905738029875e-01,2.684407679803151314e-01,-1.009784672424581586e+00,-5.747154787996395786e-01,6.726338416238462070e-01,-9.193872084364027031e-02,-2.935654761806217872e-01,1.775077120861721758e+00,6.881238263282851708e-01,-1.152334070625947948e+00,3.795787608683337533e-01,6.833462946338825228e-01,8.505632713846508208e-01,-3.338649218704345945e-01,1.258190107722861661e+00,-5.509652708923502562e-01,7.887235728059293072e-01,3.363309682991019178e-01,-2.892488234563966865e-02,-4.393084677046020237e-01
4.943365262692605566e-01,5.096518326713816993e-02,8.486897407606401877e-01,-3.136267143037417826e-01,3.347716621583896046e-01,1.694751511874373617e-01,6.844980382806824526e-01,-8.166569923055401192e-01,4.652122184740344335e-01,3.012304036371757920e-01,-2.679720261577158147e-01,-4.567720060347066902e-01,-6.770282166411734082e-01,-2.782913620136625021e-01,3.053693308283308427e-01,3.913839853425620241e-01,-1.664084982295232829e+00,3.357441867062164187e-01,3.490867789859355419e-01,5.720839835062614398e-01,-1.382696014910110627e+00,-4.718300790503529019e-01,-4.306803197260835048e-01,4.068803351050610528e-01,1.361035716373507620e+00,9.926227886311211890e-02,6.538018577647046747e-01,-8.423137519037602328e-01,-1.047453656943322375e+00,-6.018990389089224902e-01,4.451975322436714233e-01,3.043397242907225131e+00,-2.110719404239591590e-01,-1.364291614797974450e-01,-4.437701982134407142e-01,-3.459986368923447797e-01,9.267789389477669726e-01,1.293680149597607354e+00,1.462752764415363949e+00,1.309851000025886947e+00,5.260783067420249370e-01,8.367041419154728210e-01,-7.223803524741116699e-02,-2.997428141298197901e-01,1.272556345159670643e+00,9.790806403137646274e-01,2.312104139137830305e+00,-4.031898423058721259e-01,1.317866951309879242e-01,7.545736816701629213e-01,3.038305623676141654e+00,1.366564843174752797e+00,-4.504521303024148215e-01,-3.137982498412112964e-01,-6.787786623947922315e-01,1.520811115939087355e+00,1.510856770522928105e-03,-1.736100371410650989e-01,3.839542835645040064e-01,4.925392003195177004e-01,1.282594960004507456e+00,-5.509447167825631819e-01,-3.264072995808208200e-01,9.453972834318833396e-01,1.304783403057546032e+00,7.139325493578762005e-01,-4.451167748786390987e-01,1.823148632925768897e+00,-2.570956239651182584e-01,1.789257276773600913e-01,1.637902225548233393e+00,-6.966351611238785768e-01,5.352088802169603365e-01,6.371945921066565210e-01,-2.523902297776026149e-01,1.392965195879436680e+00,-5.537302140560734776e-02,-2.165399401967430526e-01,-7.545773693784316727e-01,-4.881475190624566252e-01,-7.479801656691977829e-01,-6.378725881774311990e-01,-1.887627165632084214e-01,2.073975468841048997e+00,-7.710664334476924342e-02,-8.157959320297383243e-01,5.439506789350607718e-01,1.746853253695627384e+00,7.407287508974451651e-01,5.097702474417420415e-01,1.172152309530342773e+00,-6.296214358998709626e-01,7.303119780955076301e-01,7.273697274363222220e-01,-9.272104005386558323e-02,-3.589277954012082272e-02
7.093394231537266670e-01,1.490009967908461963e+00,2.038884316031203681e-01,-1.216747094845469945e+00,2.325645643728532219e-01,-3.615770632293535125e-01,7.493456033307144271e-03,-3.223673756408892976e-01,2.380661656918676705e-01,8.030788842393180027e-02,3.909418793848881690e-01,3.092995962748357197e-01,-3.573041205771451123e-01,9.601863414787138729e-02,-5.289205527081305425e-01,1.428545971413323956e+00,-1.796530939144598826e-01,2.939700239221604838e-01,-2.667983317654957776e-01,-9.421923283944844130e-02,-4.945146430502952994e-01,1.855585846751015011e-01,-6.253525472007761543e-01,1.704641176387668433e-01,1.930361957128038375e+00,5.278231299372461161e-01,4.431669319451514433e-01,-5.771323197755582335e-01,-1.311333395745653885e+00,-1.479881475082626352e+00,-1.113816623353153790e-01,2.242719333024823403e+00,-6.789326803653490394e-01,1.151444162066116439e-01,-7.165886291588963175e-01,-4.484138981829400850e-01,1.482079589765084693e+00,9.859789522431015030e-01,2.235674557551586616e+00,9.873413378474881208e-01,3.714870135825643072e-02,2.746283084957800158e-01,-1.421424259322918299e-02,-2.198720237616701989e-01,5.026161432757338954e-01,9.260510342585871468e-01,2.478065641978827838e+00,-2.326104648737905567e-01,-3.264774801005663196e-01,1.360691748772699494e+00,2.985866088985972056e+00,1.457626822317245496e+00,-1.302141124626042812e-01,-2.638591763485091946e-01,-3.651738498799648736e-01,1.643643678008200437e+00,6.090260703093033356e-01,3.253480225547786819e-01,-1.064558828521509959e+00,1.086982282265336330e+00,3.002114967427593761e-02,3.708624695789056736e-01,5.647789336798940685e-01,1.293954217768333415e+00,1.593688458164732813e+00,6.429286963451574799e-01,-7.463070293080706907e-01,9.957672584529175808e-02,7.059801800503001656e-01,7.042733232146720646e-01,1.546073295643042078e+00,-6.103282311457347564e-01,2.223883574710362049e-02,-2.072081885327848594e-01,-5.035615431917885854e-01,7.886964610949918075e-01,-4.384525375078022758e-01,8.805745876291719565e-01,-1.413506108986110288e+00,5.401300131841541008e-02,8.255761163992783036e-01,4.979028210526478815e-02,-8.610529799590413425e-02,1.792799448488751723e+00,1.221570856226814605e+00,-1.201540740664215789e+00,7.004832504084299583e-01,2.942806916225347846e-01,4.131391992050875706e-01,4.647846129697560946e-01,1.196466816898995367e+00,-8.604787750506583954e-01,4.865385436140438613e-01,-2.357565029642627596e-03,8.066988109394543915e-01,-7.904730095060868988e-02
9.606300918668295719e-01,1.750646155583869046e+00,-4.671180892887780156e-01,-8.313646954560418578e-01,-3.686259887445718364e-02,2.718699580131707094e-01,7.082259756025806041e-01,1.028117924380087533e-01,3.841760101187522980e-01,-2.927519341146628262e-01,2.068176314502299662e-01,1.270026812919931580e-01,-3.144978691530518899e-01,3.790604612645747662e-01,-6.623347162654731335e-01,1.427300845073987245e+00,1.960292236645289621e-01,-7.270222096468607065e-01,-2.774198948659022945e-01,-3.171513049985018595e-01,-2.327974900687263538e-01,2.595616081490746963e-01,-8.915566270089855250e-01,1.645052317328446478e-01,1.902251005328623457e+00,7.086740121855158447e-01,-1.598605834720928376e-01,-5.520188802176128062e-01,-1.643203948053036711e+00,-1.638588194072451598e+00,2.692983007921865291e-01,1.928293233084271918e+00,-1.773481686013658742e-01,4.690486806170549028e-01,-1.042731757695985140e+00,-6.399398431612558502e-01,2.204974778972225380e+00,2.965005013972243919e-01,1.963539202091661329e+00,-1.273485286022664198e-01,4.546017518137092095e-01,2.964356475363743582e-01,-2.353820947929164409e-01,3.108786391371113900e-01,3.513903045672662206e-01,1.039283518142222418e+00,2.111532362875405688e+00,5.437397386272446731e-01,2.208373131690174462e-01,3.984570679283605532e-01,4.291310230201819564e+00,2.212628997655881946e+00,4.972044180154336357e-01,-1.780583767629551062e-01,3.391543469000318778e-01,1.028904641459946978e+00,-3.089811940366654630e-01,-7.372644837655004113e-02,-1.471656856554806048e+00,1.214176574492287664e+00,-8.353669502693588100e-01,-4.739555855838875620e-02,4.365322095061958674e-01,-1.517943670164225711e-01,1.223014030331859958e+00,4.706062633643485205e-01,-7.309349509354819974e-01,-7.336530592251322425e-02,-1.675708400675934850e-01,1.113096882306980007e+00,1.924213216898675638e+00,-2.011492391500556143e-01,-5.079433657831814442e-01,-1.027083886925779233e-01,1.444250911088734157e-01,2.743320637237401938e-01,-8.261461370931386661e-01,1.441991755977706791e-01,-1.414544027085918643e+00,-5.463805853567000881e-01,1.526863518314840462e+00,-6.668480282726693686e-02,-4.414560015058933695e-01,1.734543510927215149e+00,9.374987797456388883e-01,-1.264455742140935035e+00,3.878823578728164967e-01,-2.603613305708645242e-01,1.017214099133953109e+00,-9.568243717762625611e-01,1.120817043782625255e+00,-7.835884259018023323e-01,1.076210400456961702e+00,1.868293184206041568e-01,-6.491868516826770907e-01,-6.264502942964094157e-01
1.078048703457495261e+00,1.855302702802145820e+00,-4.470767338655663448e-01,-6.295477111934911774e-01,-9.896864515185642419e-02,4.157256386040275586e-01,7.100181704269983296e-01,2.488045482033099942e-01,9.024867921654678993e-01,-3.731226196010830609e-01,-1.735810472237989122e-01,3.022818661309466248e-02,-3.964422889410135209e-01,3.831759001116605279e-01,-4.667927090779538934e-01,1.258129766689528584e+00,7.548703729272815410e-02,-8.519942995494667048e-01,-2.290577099193277510e-01,-2.055457291686871302e-01,-4.122964602294700853e-01,1.611413036151108091e-01,-9.328226945330173603e-01,1.558968911356510001e-01,1.749805699629512379e+00,7.027274558230619528e-01,-3.044795780042016675e-01,-5.675890515398221980e-01,-1.616947216163290957e+00,-1.451258775501771847e+00,4.447615548862590140e-01,1.994609010675083116e+00,-4.491795170419388139e-02,3.887806776841976064e-01,-1.105303416852811083e+00,-6.175791939230474981e-01,2.392567916808567396e+00,1.768041499034924691e-01,1.533901602206747983e+00,-3.520092758070136885e-01,6.958334741884216745e-01,4.019990188736906056e-01,-1.879769944149593530e-01,4.879523638050854428e-01,5.042401925526731610e-01,1.073455972413787984e+00,2.219849152817346294e+00,7.874638415923074231e-01,4.114272293100019184e-01,2.486883339350137723e-01,4.561450628448847411e+00,2.255632979411016592e+00,7.073928089289226451e-01,-1.023963617685252625e-01,5.221195681493253637e-01,7.670675519387436525e-01,-7.412827861465679513e-01,-3.289310217416051563e-01,-1.391681519799321975e+00,9.589999912647192426e-01,-8.536945920139966670e-01,-6.003388292304365215e-02,3.038194131992689728e-01,-5.070702007273754086e-01,1.149837963696520804e+00,5.065472842592992908e-01,-5.160670095963129089e-01,2.410442938918149758e-01,-4.778183777440038194e-01,8.710814316638150201e-01,2.121095689010238150e+00,-2.353519529946616617e-01,-6.457478796708251423e-01,-4.397753648220786848e-02,3.864738869718302716e-01,2.158486325412871665e-01,-6.549504454541414944e-01,-2.542966585096034793e-01,-1.371360337106498184e+00,-6.553572917820336130e-01,1.431287167962649320e+00,-2.280000052837177771e-01,-5.414891239569599168e-01,1.671195641023025980e+00,6.123674698136725159e-01,-1.106830362385832878e+00,2.771324441623629342e-01,-7.346036918626897005e-02,1.205309943999979927e+00,-1.379093800124318259e+00,1.229046959698653518e+00,-8.600538990437833764e-01,1.486723924733381663e+00,3.505786890857052751e-01,-1.335344783956288417e+00,-6.525978901545441691e-01
6.943466372532680619e-01,2.621404299585844422e-01,-1.383975918169862707e-01,-3.428032547315271739e-01,-1.013347316068354681e-01,4.386448528467267183e-01,4.602726616620918532e-01,-1.640482852962101834e-01,3.148101175639085314e-01,5.465317456672739160e-01,1.142696616968643220e+00,5.318454764979162197e-02,-3.438655852859600071e-01,6.089853678465115272e-02,-4.361874826142405626e-01,1.929045402343158244e+00,-3.254636962638803865e-01,-1.534578199763928785e-01,2.146880052247626680e-01,1.237840550258410832e-01,-6.483625246803871311e-01,4.714975151113227625e-01,-3.499391961489782821e-01,3.103566163201091355e-01,1.481905330262053067e+00,-6.277220093605775375e-01,3.200776475106753005e-01,-6.550124083432004030e-01,-3.399590031511369181e-01,-7.558944964205365213e-01,3.896579269748502994e-01,2.424169110387262016e+00,-1.390973370072709214e-01,-4.048611175666144701e-02,-4.967391405010599392e-01,-8.156346930095944581e-01,1.060810888749941672e+00,1.212526510640208333e+00,2.014171442241942778e+00,1.613029725225424427e+00,6.874779420642208594e-01,2.297070401842939424e-01,-2.038640888206927348e-02,5.122929118438587087e-02,2.034431976302843448e-01,7.104652230743917496e-01,2.394924679823002389e+00,-3.495204201212056550e-01,1.146013023218063615e-01,7.994632932107710310e-01,4.035573527367281699e+00,1.567454536037817148e+00,3.575703392191784680e-01,-6.609243011869818663e-01,-8.722366182562328873e-01,1.763484645662758199e+00,8.663291465878365516e-01,1.740739618669448485e-02,-4.613714740695875616e-01,1.900809117921562041e+00,1.014530024898849137e+00,-6.538342927941098726e-01,-4.262566307700329515e-01,9.268709216901531711e-01,5.659301611671709864e-01,-2.957911990597856811e-01,-7.820243531146533478e-01,7.744453956862772381e-01,-8.054687681272323929e-02,2.786082527788719121e-01,2.556933060844921446e+00,-1.982783567195640084e-01,4.404529846005409977e-01,7.489985557005165440e-01,-2.833154265989533682e-01,1.417705986524370187e+00,-2.590533616527262994e-01,9.929686008391472862e-01,-5.275056180227978286e-01,-5.477503024606206194e-01,3.379661170224485534e-01,3.937966534725876877e-01,-8.505061392946849930e-02,1.449036815072043405e+00,9.176064021328399489e-01,-1.138258447961097097e+00,1.950942544422784586e-01,1.649265903422770130e+00,5.877207295565368694e-01,2.654722742135640079e-02,1.785889661711199672e+00,-1.523546289475048443e-01,5.085623648795059015e-01,2.363847026883541258e-01,1.130379191222602442e+00,-3.320408167117899212e-01
5.620702367799221832e-01,7.778733309260232875e-01,2.981237995613946756e-01,-9.969537957293267416e-01,1.003569742694798844e-01,6.922297331836343992e-02,6.587705657578812879e-01,-4.994161789973319276e-01,3.064085822050799379e-01,8.829223047306536398e-02,2.138991524285910328e-02,-4.593874278159776336e-02,-4.682768526368161766e-01,-2.154915716124355396e-01,-4.099436913015342410e-01,8.379020448672053201e-01,-8.137605082730228201e-01,1.828165908945253992e-01,-1.745986595335839997e-01,2.532951167528658259e-02,-6.934397213608402000e-01,1.554493855873808061e-01,-5.656810215692638089e-01,1.633112512241526593e-01,1.985143968280607130e+00,6.551861298628000041e-01,3.667587920381639721e-01,-7.404195209513264597e-01,-1.979449823066099290e+00,-1.622016444404774660e+00,8.199127285162621792e-02,2.697226564416548289e+00,-4.865042173846030327e-01,4.074670576696062252e-01,-6.955055058687160674e-01,-2.876401404470247392e-01,1.650254919430286016e+00,7.915015577002816327e-01,2.344011551489012746e+00,9.035872108590787821e-01,2.242470865306270267e-01,6.483149547460462792e-01,-8.509739732154401881e-02,-3.591125936512373773e-01,8.296616792170805610e-01,9.256697207591977339e-01,2.166248337221694076e+00,-1.021230178775082986e-01,-6.054790621801585393e-02,4.377684294218974204e-01,3.235338901508965748e+00,2.101817156591637925e+00,-1.896323202837800759e-01,-1.326848999398052564e-01,-3.485434818465913409e-01,1.656045438705292749e+00,3.223339963398614838e-01,4.053711301509566045e-02,-7.129635227374284678e-01,1.492942109225884995e+00,-1.707157730066014845e-01,-1.151206985123559845e-01,3.859053908823433243e-01,8.354114026515861990e-01,1.793779369169287374e+00,1.021273309595905676e+00,-7.101564324631738367e-01,7.168163116643466726e-01,3.754098453521004797e-01,7.677420480960297500e-01,1.302261869630001900e+00,-4.045994309363389885e-01,1.554789861949669727e-01,-3.232627768799587464e-01,-2.111769409994518898e-01,4.395403434103230533e-01,-7.390693857868617656e-01,2.038075547338162319e-01,-1.664170849384740247e+00,-2.333939005247558929e-01,5.815886752993724151e-01,-1.502220528453389603e-01,-4.057908648823570497e-01,2.284673555646876242e+00,8.436166838251096811e-01,-1.429014468177684627e+00,5.820512203620347158e-01,4.272578961220800942e-01,8.117534589192418881e-01,-1.044756227446929642e-01,1.090723528910053641e+00,-5.495955823620189973e-01,5.432148723881525809e-01,3.435361105383921698e-01,-1.228978222400736176e-01,-4.141732336626972044e-01
5.950042232080121618e-01,9.941470460961531197e-01,1.867292922811065736e-01,-8.866399653058663066e-01,3.543654502102090431e-01,-1.071753689589985403e-01,6.571897632510534937e-01,-5.963144852829328491e-01,-4.592873811095252723e-01,3.631111722751545479e-03,4.320916577055257113e-01,-2.434855304550705146e-02,-3.751372530657972049e-01,1.683502460149586266e-01,-4.149293104631028850e-01,1.094912058505132846e+00,-4.945533368492425197e-01,-7.531124943729514132e-02,-3.669545284794724360e-02,-5.514310759615979191e-02,-5.302866124507447099e-01,-1.383386037176010941e-01,-6.928542761784968196e-01,3.362781081280600826e-01,1.818591445505932214e+00,5.440000187523376107e-01,4.700613690397830169e-01,-6.412829298225262153e-01,-1.313279765297869606e+00,-1.355813263658017132e+00,9.046543408652138463e-02,2.249513048288814598e+00,-3.839910263589829675e-01,2.339433732937529209e-01,-7.005513052316463263e-01,-5.486768507291103214e-01,1.281467474481654545e+00,9.539394854452609707e-01,2.204921847802995050e+00,6.909664338845669107e-01,6.564601518461632423e-02,3.709445620345498407e-01,-2.788974453908533158e-01,-1.918727087736766812e-01,6.208177220901860416e-01,1.040094734798688858e+00,2.038711007972440648e+00,-2.467782603546959108e-01,-1.212480985557349983e-01,9.842773285525487914e-01,3.183928981309799511e+00,1.560588494075933585e+00,-3.596631974312711755e-01,-3.460317506696796719e-01,-2.949209707928530100e-01,1.519687621522107568e+00,2.955069677916647430e-01,2.974267764069933317e-01,-6.985747460675730824e-01,8.138684150798020100e-01,2.447872833651345004e-01,-1.823243135542133575e-01,3.224243243597858521e-01,8.586347307365316261e-01,1.355913220065720903e+00,5.347106371754163368e-01,-8.984176197420261634e-01,2.938058736789535552e-01,1.849348474764833661e-01,1.112329138832693687e+00,1.438134458445063490e+00,-4.911736522677798700e-01,1.073812647594294678e-01,2.597347267697646123e-01,-4.374769500704144831e-01,9.912597423852641532e-01,-6.469140321851659658e-01,4.805021887921246959e-01,-1.063908571044537066e+00,-3.579264812641258509e-01,5.395124232697579014e-01,-2.630363831318665024e-01,-1.071373294561037415e-01,1.927368058134271145e+00,8.319868371242917782e-01,-1.143860239574874482e+00,7.090219517695401930e-01,2.919069796407257611e-01,5.628071699567334107e-01,5.405149775506290499e-01,8.422927359479598364e-01,-7.885930665347333779e-01,3.526294083678894742e-01,1.958279441268269139e-01,6.003936559811238194e-01,-2.032689867627270330e-01
4.709301915494003010e-01,-1.107053672633303565e-01,1.644229217691056122e-01,-7.787893967263990191e-01,-2.561260251887251260e-01,4.097576870533096161e-01,5.156251898852302062e-01,-3.488338339205770966e-01,6.624884205534776749e-01,6.642244142446844801e-01,7.678100734233850311e-01,5.514750709008178070e-02,-4.230730485010313902e-01,-4.952347800899942754e-01,-5.501029394615650769e-01,1.475612728081291625e+00,-8.236902055814405710e-01,4.180574250495213695e-01,-3.130943512310500887e-02,1.468246039010777937e-01,-7.492861105011496825e-01,7.791995912088628407e-01,-1.776691566159602775e-01,1.072189647875973761e-01,1.900876458201505637e+00,-2.476832640213687264e-01,4.184221063200762591e-01,-7.953049060318246877e-01,-1.462065942467591029e+00,-1.370771135822033804e+00,1.487991422238683081e-01,3.016684539594244541e+00,-4.672951368427765151e-01,3.003537348075524527e-01,-4.281712568730696722e-01,-3.982631207692293174e-01,1.331581219347796052e+00,1.123934519950795075e+00,2.648241615436402796e+00,2.025634855559493630e+00,5.264493915178078964e-01,5.784137443301624604e-01,1.473282910228623788e-01,-4.584322466987096334e-01,5.003301087522115109e-01,5.901851645402254043e-01,2.386743371389695945e+00,-4.438396163159558094e-01,-5.120626339799126681e-02,2.584645172085923148e-01,3.551591562789559564e+00,2.208824942360045895e+00,1.428145138554694493e-01,-3.837431119049758976e-01,-1.074674864791854034e+00,2.196043196539771092e+00,1.230125413588060823e+00,-2.231170653176822727e-02,-4.733594835420353863e-01,2.792974888961376578e+00,4.450117174479720772e-01,-4.889387394313365331e-01,-9.503588133813742345e-02,1.312340523593231278e+00,1.424392090947246947e+00,5.424546242688144115e-01,-7.487858333173957881e-01,1.072475187969567090e+00,5.409539000284706578e-01,1.768340226191930098e-01,1.893612387357082261e+00,-1.443774082498939237e-01,6.493978873040600064e-01,-1.625468618648941155e-01,-2.796185966770758924e-01,7.053025689817383759e-01,-5.952217826868395623e-01,8.661756375853337797e-01,-1.465792507732014638e+00,-2.258510743656478303e-01,3.667410758157299000e-01,5.170366000273718399e-01,-3.823307843789295890e-01,2.141779507234208069e+00,1.162881140968947236e+00,-1.659026333444371559e+00,2.602016140146530265e-01,1.486154829620095708e+00,7.170499458655846814e-01,-2.093615641416554651e-01,1.802428141643709347e+00,1.237470866471559461e-01,2.914813132903927295e-01,3.079690200329431859e-01,7.464816665665869877e-01,-5.264051153552745665e-01
7.637944358584018989e-01,7.316172664969540218e-01,-4.487958365390208315e-01,-4.839811602349483044e-01,-6.036509539259789225e-02,4.572348337420313324e-01,7.935221953391488059e-01,-1.041404456970711073e-01,-1.388705868808304267e-01,2.026625991879146826e-01,1.087025050859247166e+00,5.832441512624437358e-02,-2.602079359252474355e-01,2.970126068404679853e-01,-6.581023554951384025e-01,1.866614899802865324e+00,2.894237097065349706e-02,-6.019808172706312410e-01,6.184832654568572091e-02,-1.577943024552916906e-01,-3.104063960033411340e-01,4.056970740738728431e-01,-5.970288509723341575e-01,3.080463792448695504e-01,1.676822683352547694e+00,-1.454884892189459988e-01,1.158675132555601339e-01,-5.980646659318148428e-01,-7.851991359376744306e-01,-1.159847923144657011e+00,3.584953389110657751e-01,2.076098918100719892e+00,-6.127661872278183930e-02,2.605297434198486917e-01,-7.208404401463253119e-01,-8.670217737172272177e-01,1.433787992180590942e+00,8.263581487558934180e-01,2.179609682202931165e+00,8.295255638060315961e-01,5.437836401516381590e-01,1.632250135573557193e-01,-2.350341139340893504e-01,1.859882707202847318e-01,1.016608110333868664e-01,8.556845861070075943e-01,2.070879062443585550e+00,-3.074795055353109902e-02,1.827346346259145771e-01,5.482613689845716731e-01,4.296294130621370222e+00,1.885224081822427289e+00,3.806360904764749531e-01,-5.647005233814347269e-01,-3.903257046824252785e-01,1.496363876693395323e+00,4.772377212334044105e-01,8.010144806704042053e-02,-9.096283923005298311e-01,1.743388342603440444e+00,2.698875953321830945e-01,-6.217444025033678212e-01,-1.225584445995452076e-01,3.795707796231821973e-01,6.507511154102033624e-01,-1.856045217990692775e-01,-9.410348044347410790e-01,2.113292862099023783e-01,-2.190043101976417161e-01,9.085953926302305916e-01,2.322903278423951612e+00,-7.157731563920732842e-02,8.012384117443241416e-02,5.864449323192796326e-01,-1.534838051067939912e-01,1.040905167572186096e+00,-6.671201943020614866e-01,7.690919631904143960e-01,-7.297155692565088225e-01,-6.942310574887835539e-01,9.359106529224711091e-01,2.626712210726491192e-01,-1.922093318456276623e-01,1.536311959061893440e+00,1.013657198280531802e+00,-1.251480798296870978e+00,2.687511965753168197e-01,7.331635757026623290e-01,7.477408795440818601e-01,-2.974237848946633678e-01,1.401791379042885755e+00,-3.190211263136565334e-01,5.449936517381039902e-01,1.658321424514862530e-01,6.792307840278046793e-01,-5.381967413338129003e-01
6.566107306126862664e-01,8.822499764684441637e-01,-1.060555236848480243e-02,-6.912930156736408760e-01,2.496816026344720330e-01,6.564310985923360597e-02,6.681528774168628004e-01,-4.457280909237595345e-01,-4.022600804788696305e-01,9.567329276907449165e-02,7.147945259433410303e-01,-3.305312437810598025e-03,-3.353362544044472537e-01,2.528396867191949338e-01,-4.557023035723115623e-01,1.400410487236113166e+00,-3.146402100950474456e-01,-2.579406462091458074e-01,4.872967128408892817e-02,-6.003792980674466789e-02,-4.818953901540397045e-01,-6.498205494534781135e-03,-6.541267613115588908e-01,3.599014474218720228e-01,1.701881354113777389e+00,2.222995107381065816e-01,3.842491670270226645e-01,-6.176450181400364725e-01,-9.492031340266906536e-01,-1.172158563903367368e+00,2.029362063961921703e-01,2.158460662225479609e+00,-2.516362084826508361e-01,1.677734506437321971e-01,-6.829906433611313554e-01,-6.990124153759280645e-01,1.227757049301578807e+00,9.819737491793353312e-01,2.119405265674694228e+00,7.842010424682119840e-01,2.371842742786660629e-01,2.658405347057792856e-01,-2.709341217000268420e-01,-3.646901800091177648e-02,4.290186562277061855e-01,9.820253321846148520e-01,2.071134059268177730e+00,-2.243372835224788919e-01,-2.102912350658138474e-02,9.520246880405989209e-01,3.544416132456104762e+00,1.535993241563587741e+00,-1.271344824369927684e-01,-4.689071439321809143e-01,-3.682061815396548976e-01,1.502611278678835038e+00,3.712369063932352553e-01,2.434601909883318538e-01,-6.996480750272700000e-01,1.010275233198711486e+00,4.288417103020850663e-01,-3.579969500392088944e-01,1.054105137976047296e-01,7.403188914016515243e-01,1.013816223391743820e+00,1.841833661402179634e-01,-9.137993816177346629e-01,2.861395420264526424e-01,1.620084997177133335e-03,1.010604334223101919e+00,1.810789456750770965e+00,-3.799003134871099530e-01,1.283721954994287429e-01,5.099878953964744888e-01,-3.807384491831211637e-01,1.157289521725013870e+00,-5.742224937549516017e-01,6.279341787085991333e-01,-8.052102158293504841e-01,-4.897934291179569244e-01,5.796190242011689531e-01,-1.000031444513288237e-01,-7.487464413904051930e-02,1.713204739683056754e+00,8.528852088876579529e-01,-1.102538437524070325e+00,5.633217282731638464e-01,5.526858503277031209e-01,5.746567732778035120e-01,3.843735804906652231e-01,1.043365045724963913e+00,-6.527242292061108397e-01,4.055907719049472449e-01,1.814100586380659186e-01,7.698566786064280354e-01,-2.563558494983929070e-01
5.944635112718354986e-01,7.849896305691114184e-01,2.311483776150035085e-01,-1.032526319529978531e+00,1.519819452345333444e-02,2.116792845031051362e-02,3.560559588637970396e-01,-3.662577384778369360e-01,4.886930878473455531e-01,2.601402288498702031e-01,3.302054560365541569e-01,1.232818108956101194e-01,-4.226482987992953855e-01,-2.176095328210932989e-01,-4.970630014544314967e-01,1.229041703985337630e+00,-5.983026971947305039e-01,3.219600265778007064e-01,-1.878946276104367930e-01,2.225676745382156041e-02,-6.501833155239278295e-01,3.865110028426175792e-01,-4.629085436967210199e-01,1.273493945656029858e-01,1.957797080673997270e+00,3.560842171568127656e-01,3.939164723917738531e-01,-7.026231445027132372e-01,-1.644435082954977645e+00,-1.524134420588898253e+00,2.602056465326302304e-02,2.661483657600091313e+00,-5.678797822000091200e-01,2.807782066879953020e-01,-6.285652312579618206e-01,-3.525522283758159015e-01,1.543692452623248279e+00,9.406033426497654171e-01,2.399254420709242108e+00,1.281763734790629217e+00,2.620142590678480876e-01,5.128685045184531166e-01,3.572526552917615339e-02,-3.472507179150920997e-01,6.283796151555371967e-01,8.145595614436604848e-01,2.373163853845788651e+00,-2.280213800799244517e-01,-1.526222503300110889e-01,6.834119118762276290e-01,3.243905385908328665e+00,1.945567696012111103e+00,-4.000954007140533619e-02,-2.301057898245313649e-01,-5.667054893128304904e-01,1.818541425461865035e+00,6.956264952380224464e-01,9.947621576962595302e-02,-7.902580885398701183e-01,1.791088129638370052e+00,3.066428359247400093e-02,-1.964237583866576542e-02,3.247786663117887551e-01,1.144588595271612386e+00,1.658140907068814229e+00,7.899895342599740911e-01,-7.089871943493769590e-01,6.259630135545857232e-01,5.737176075423512378e-01,5.249250162182099722e-01,1.561031275376432159e+00,-3.994436215378394106e-01,2.458908160497637607e-01,-3.033210761353740681e-01,-3.139245310922053611e-01,5.838011874782309540e-01,-5.868554324576262804e-01,6.271566765108481656e-01,-1.581443771078035132e+00,-1.029637092601224935e-01,6.274524617284060746e-01,1.373775648741656918e-01,-3.107263300308389375e-01,2.087516727438318398e+00,1.086398119825348729e+00,-1.438496850572790642e+00,5.169320745651551086e-01,6.972843810587399105e-01,6.599970976162159442e-01,-6.155884743688777583e-04,1.373952816665834797e+00,-4.500908197741855798e-01,4.804322271843394776e-01,2.144078953938153842e-01,3.977821464753134584e-01,-3.412221592599167797e-01
4.894933817671903720e-01,-1.675163612455943252e-02,1.118780186983449471e-01,-7.830999330040676609e-01,-2.302003468408749809e-01,3.979325120853497988e-01,5.523636048821871647e-01,-3.407281655145820709e-01,5.550256810367149019e-01,6.080084794703952689e-01,7.868250371849869751e-01,5.867701718118539106e-02,-4.053674971795999116e-01,-4.265586754038658834e-01,-5.749643906045742714e-01,1.491368419489192298e+00,-7.446225318542027960e-01,3.318221930400834241e-01,-3.933361141129404492e-02,1.046038014629935009e-01,-6.937912962502117420e-01,7.428368153139224273e-01,-2.238495407175646323e-01,1.213759293885995627e-01,1.906364440587584363e+00,-1.951353886379896541e-01,3.948943204826174669e-01,-7.776707558969179201e-01,-1.455052770575543830e+00,-1.393401964743055332e+00,1.497663811034028458e-01,2.928264846246264597e+00,-4.451702687189192376e-01,3.194300259732014702e-01,-4.613243075581081598e-01,-4.290482635945950252e-01,1.355324591907671739e+00,1.083712060622199935e+00,2.641359257130549754e+00,1.895167764527777354e+00,5.008638919624263108e-01,5.447662687593731734e-01,1.046726953039623931e-01,-4.172516491112404080e-01,4.696693247946019389e-01,6.204574538132673345e-01,2.340287449478323456e+00,-4.056502840941163535e-01,-4.308815224065405680e-02,2.766965441219582100e-01,3.590669584433658468e+00,2.199385793544636591e+00,1.409837070473302922e-01,-3.881459235551198983e-01,-9.989234871018349837e-01,2.138664893015784330e+00,1.163431030887681850e+00,1.838953284053090886e-03,-5.341331637617344752e-01,2.700755468371037082e+00,3.822096400337816613e-01,-4.853391799623166802e-01,-6.291367514620196943e-02,1.232717576783155966e+00,1.392279926691120107e+00,5.113757252243287255e-01,-7.787707062229660693e-01,9.645099821821544461e-01,4.982359035028640637e-01,2.808338686433412557e-01,1.885315762531056816e+00,-1.379782323192415561e-01,5.900719722617349117e-01,-1.306395148917432192e-01,-2.757755000523898770e-01,7.039554321365372180e-01,-6.321451345899856689e-01,8.538380634892395182e-01,-1.436618561667665661e+00,-2.570403343389082718e-01,4.436081352199807704e-01,4.870947921262765434e-01,-3.710931309773320419e-01,2.114004803034488678e+00,1.167787196384427517e+00,-1.641424008642815568e+00,2.776917264415541542e-01,1.357361186468005521e+00,7.195550112158768385e-01,-2.075914463818362699e-01,1.735756544355307796e+00,7.492292390440513650e-02,2.948666173749795449e-01,2.875697340901067212e-01,7.338963138246361595e-01,-5.333770120186698271e-01
7.760584944787457529e-01,9.829098744278270683e-01,-4.066563011074764700e-01,-6.709327220692549165e-01,-6.944900821379035305e-02,4.194914441077088885e-01,8.784465239352385879e-01,-1.003869394053711200e-01,2.179965501334624189e-02,1.774037129432076698e-02,6.776343443445985715e-01,3.913590105750044956e-02,-2.967378497323905906e-01,2.243711568302474979e-01,-6.800185135414359427e-01,1.554401093166337233e+00,-4.532151730491074115e-02,-5.941309013245834603e-01,-9.534120704512677458e-02,-2.198627990183484870e-01,-2.931604240213574464e-01,3.742974332342631216e-01,-6.890635714908209808e-01,2.312060767396626471e-01,1.847688552965654152e+00,2.812215177603328287e-01,2.717289276678808152e-02,-6.182843980531805839e-01,-1.376407061104160112e+00,-1.477017123000988752e+00,2.988661882144329485e-01,2.138016167720834915e+00,-1.327732225824992951e-01,4.447672116147989296e-01,-8.343829462116829632e-01,-7.056528701616995303e-01,1.774091603411191098e+00,5.851733822591612677e-01,2.242510815793000489e+00,4.870031791168613067e-01,4.742079268185662722e-01,3.009017066505557114e-01,-2.432525895604200628e-01,1.306023109848783725e-01,2.717597773106348868e-01,9.191641936520631440e-01,2.009931583026247637e+00,1.775396213051378125e-01,1.927732999716756934e-01,3.060162150726092323e-01,4.230014309821604535e+00,2.181393857792012003e+00,3.493463804592792377e-01,-3.651999842733092416e-01,-1.305589673122884986e-01,1.388048171369803407e+00,2.028611590884512872e-01,1.099892741297449350e-02,-1.093830965527687216e+00,1.703034878939423624e+00,-2.762754882882384466e-01,-4.454519597548571852e-01,1.397135540437195456e-01,1.794541195044354609e-01,1.025877498033164636e+00,2.355969169794274731e-01,-8.823898856666736457e-01,1.729612563388998048e-01,-1.405812469605086934e-01,1.045376338442673303e+00,2.003516970074576520e+00,-8.453954928729290330e-02,-9.874200663214920126e-02,1.819564510988125328e-01,-2.426875707973442237e-02,6.047012173368593313e-01,-8.485891629926702873e-01,4.415204012304755343e-01,-1.156435910294677516e+00,-6.313327386067606461e-01,1.153094336450899871e+00,1.195929991359142019e-01,-3.605455583856285173e-01,1.786396883803199387e+00,9.908285707979754831e-01,-1.370123895964147298e+00,3.304939220878435613e-01,2.845701601356501742e-01,9.066896869861523767e-01,-6.061720998869692956e-01,1.236748047028272346e+00,-4.275183215848072926e-01,6.807907021432876293e-01,2.140010530856855664e-01,4.493997785222203500e-02,-6.424837902091333763e-01
5.245500101888572742e-01,3.155474191662277494e-02,1.089329906932447051e-01,-3.745286492944521761e-01,6.208522157742311920e-02,5.246686459927085711e-01,1.145911121520383880e+00,-5.596507130660488549e-01,-1.169364017210778872e-01,2.569800563683419803e-01,4.815895861463849736e-01,-3.188093364129309659e-01,-4.541985794555614131e-01,-9.492638075117514063e-02,-2.867840453105057197e-01,9.911433314854908305e-01,-9.536840274055675692e-01,-2.650842224338241238e-01,2.087731674911810775e-01,1.460711816749032943e-01,-7.671192358021450275e-01,5.377725943110256424e-02,-4.963756388936691466e-01,3.536762233019438151e-01,1.647819042108199517e+00,5.756813608565747309e-02,3.433440257334242629e-01,-7.800957955104358410e-01,-1.296753466325597515e+00,-1.105735086556232538e+00,4.324589652217410984e-01,2.674331135555988226e+00,-5.770923209343592486e-02,3.124207966056855579e-01,-5.827788314083450771e-01,-5.802907885297725610e-01,1.256212126079572222e+00,9.368141117548968166e-01,2.129677397354560409e+00,1.015905215650008575e+00,5.316479366935822348e-01,6.004443023739458596e-01,-2.482014012141721127e-01,-1.537351321153644923e-01,6.972344317763421451e-01,9.049053524535743964e-01,1.920714752074680121e+00,-1.938303270796488675e-01,2.397075775144320575e-01,1.623080126077918739e-01,3.826274469524339583e+00,2.029211382343351744e+00,-8.657909574867106439e-02,-4.175985323880294642e-01,-5.432738267280113886e-01,1.600409732724308309e+00,2.682259102417979268e-01,-7.214029328413240627e-02,-2.333185493684418743e-01,1.536751391423952784e+00,5.457836914916729398e-01,-8.693607729096219927e-01,-2.389631439872235419e-01,4.599178418665359480e-01,1.056898347451005860e+00,3.800073450783911788e-01,-8.203115839282657529e-01,1.054726557680256693e+00,-3.134686206987854495e-01,7.946993667260662253e-01,1.808647515873090583e+00,-1.906032799725875249e-01,3.776332100859087770e-01,5.250747925798521232e-01,-1.237391304699723832e-01,1.002447934099998994e+00,-6.820757758745235044e-01,1.302970661390305818e-01,-8.957218931662060957e-01,-7.442859547248736884e-01,1.760297848105735197e-01,-1.694071344338096696e-01,-3.317269359838418419e-01,2.062460825608355197e+00,4.848288922325506567e-01,-1.266429956359401476e+00,3.676586761119472468e-01,1.089805927503773475e+00,9.002054956488112492e-01,-1.201317222017290187e-01,1.169615752392989538e+00,-2.533268910015846753e-01,4.812190933130521819e-01,5.209362563358735931e-01,1.008852424929697900e-01,-5.206858143109560633e-01
8.043855950734730698e-01,8.066782702281136697e-01,-5.074694867729853121e-01,-4.562746281622771516e-01,-1.723813704571021677e-01,7.135078597456437910e-01,1.211621009721669529e+00,-4.282615681005355612e-02,1.623901158256548793e-01,-5.135376603730171241e-02,4.875127562582493579e-01,-1.295017085201358997e-01,-3.375163100449034559e-01,1.954929270474861647e-01,-6.190988121669683819e-01,1.365262729846468348e+00,-1.897551204955473525e-01,-8.608243509802028237e-01,-3.653167169272328318e-02,-1.927259616890824034e-01,-3.477186810943104223e-01,3.537431483561596646e-01,-7.230162769407567636e-01,2.374584687053863941e-01,1.801631396336298208e+00,3.056470274779708451e-01,-1.354621479112125548e-01,-6.651417952264355726e-01,-1.568982806779374739e+00,-1.468336861061697585e+00,4.819336850784287085e-01,2.223145793325106201e+00,6.607400897129422912e-02,5.632753172793508734e-01,-8.925635726860474684e-01,-7.086175978632537342e-01,1.966322429040785247e+00,3.922347572225678425e-01,2.113595326242468264e+00,2.272785444790260678e-01,6.759468998725274291e-01,4.288140300229188462e-01,-2.997459391301423026e-01,2.392597935407699272e-01,3.604031602937844969e-01,9.439060865293089631e-01,1.870192727415621592e+00,4.000898172751619630e-01,4.255396823847512056e-01,-1.715257570499600925e-01,4.630621094923409231e+00,2.499104886249321034e+00,5.010015047457889725e-01,-3.150979713542224059e-01,2.538392310860659862e-02,1.221544061609779463e+00,-1.370982775595952496e-01,-2.044422568103178572e-01,-1.020241207044473297e+00,1.788586958044149133e+00,-4.424508599000369635e-01,-7.045608895161152851e-01,-3.686554699020641590e-03,-3.057764390493853401e-01,9.514207022475851261e-01,2.758663415108486006e-01,-8.270461090119092251e-01,4.074532305311059366e-01,-4.993612190148829511e-01,1.077960191975304571e+00,2.083008156378368447e+00,5.140520619099037125e-02,-1.716707275326593840e-01,2.345899861740383674e-01,2.321523820075142575e-01,4.393815289169380467e-01,-9.565158175565060539e-01,3.154842126715512451e-02,-1.167878316687275486e+00,-8.733364839519398570e-01,1.162447793704306509e+00,9.142036033733091926e-03,-5.301919796237355431e-01,1.882682695424945152e+00,7.411723228218515258e-01,-1.399022426836423527e+00,2.019486263208558341e-01,3.120934135476577387e-01,1.172059134444852768e+00,-1.114452684584365194e+00,1.227926831677911057e+00,-3.240256171651977324e-01,8.906394069286349691e-01,3.912959986354082043e-01,-6.095906460253193160e-01,-8.451895913576132902e-01
5.337135496572098514e-01,4.449764250521447972e-01,-9.841734076655700436e-03,-6.878212373148629988e-01,2.006844065137937672e-01,1.206612832343667008e-01,7.159407226236425004e-01,-5.476616730019594481e-01,-6.383274041785809150e-01,3.115318813447142121e-01,1.093744997770805139e+00,1.153422948692843508e-02,-2.978094145521849034e-01,1.392472328113074087e-01,-5.539031164463307233e-01,1.572325987234239442e+00,-3.748032698265295615e-01,-1.240577581460214074e-01,1.050344347025669034e-01,-4.881789872391621016e-02,-4.508815181346458312e-01,1.669564506377243795e-01,-5.117556094487681895e-01,3.696998597750081328e-01,1.739907811004610005e+00,-3.193629850043432777e-02,5.029702413495559243e-01,-6.483579302397605160e-01,-8.429913393556474066e-01,-1.171720310389571251e+00,1.569513459274040346e-01,2.273809999690617367e+00,-2.867434897340294664e-01,1.893263925679254944e-01,-5.530423966171453820e-01,-7.297326973992293020e-01,9.892277801415169103e-01,1.157982099840950907e+00,2.427350183152816143e+00,1.234585324449522847e+00,2.018741895155679589e-01,2.361760138794760377e-01,-2.528135026190397872e-01,-1.880670810007644689e-01,3.141060909110964250e-01,8.783760266759627067e-01,2.025807522600632904e+00,-4.771538647514090847e-01,-9.528717811583826969e-02,9.139098929331288534e-01,3.469382303885160557e+00,1.559535399873289707e+00,-2.055191845348042223e-01,-5.821197424824187117e-01,-6.949151144721263940e-01,1.802292593875961302e+00,8.269898378021676155e-01,3.449667530347756417e-01,-5.676283575097182954e-01,1.485026725965542971e+00,6.818773851120225604e-01,-5.410067099842270633e-01,-6.931302444686544828e-03,1.042751784948864557e+00,9.501963897492763378e-01,5.634810042971150068e-02,-1.043066144960569375e+00,3.242823266714950359e-01,1.557782547492557179e-01,9.871811619903679835e-01,1.830638041727672860e+00,-2.852113316455278103e-01,3.885008123171542205e-01,5.747009790021917475e-01,-5.239691516012804362e-01,1.293974211516817352e+00,-6.378756454478089477e-01,9.457316475046696480e-01,-7.413203538137882465e-01,-4.741655598757978374e-01,4.615137311340338777e-01,1.161176233707729433e-01,-2.545941662615985868e-02,1.760361189789303005e+00,1.033461536430849925e+00,-1.246629542735223639e+00,5.356472232644844400e-01,8.126826248919707396e-01,4.708693193799489141e-01,6.100296367890065685e-01,1.145794677943332118e+00,-3.977047481158169084e-01,9.156116516343570932e-02,1.350388533002839231e-01,1.333454950835011310e+00,-2.822969764651549474e-01
6.194437674355788293e-01,3.191457957462702222e-01,2.149123312925335094e-01,-5.704480487933998312e-01,-5.563965752600445736e-02,3.127978139375209299e-01,4.653170937430343712e-01,-3.219959336123624505e-01,6.627570152064465869e-01,4.341254685679170056e-01,4.643300081380111188e-01,-3.872709689129807953e-02,-4.689051322400166200e-01,-2.098896981701368625e-01,-2.890057914269304473e-01,1.318638741309444029e+00,-7.854125450640508932e-01,1.701490896621508653e-01,8.117819563337094757e-02,2.174420812862614683e-01,-8.609253977600139773e-01,3.365482472112183987e-01,-3.622666563472729528e-01,2.215767332891437902e-01,1.641961748812361233e+00,-1.515017828149464729e-01,3.754212184300993460e-01,-7.380995542205192050e-01,-1.072689007563020214e+00,-1.023468641174724691e+00,2.953635739502034063e-01,2.763033414773690133e+00,-3.115175352837891709e-01,8.000800389090260978e-02,-5.253825266290399476e-01,-4.983427637368700314e-01,1.296299158324463185e+00,1.097033350416510178e+00,2.034999253684258047e+00,1.512247837617569868e+00,5.851834247338438821e-01,5.278990551951876498e-01,5.046551124322314064e-02,-1.842411946380902443e-01,6.224539820349191954e-01,7.628622396308436526e-01,2.422231939129007916e+00,-2.717881362591276773e-01,6.177377794416430423e-02,5.926589577437295642e-01,3.613393336019200763e+00,1.798238981984161322e+00,1.329536137827573850e-01,-3.917902970157356446e-01,-7.517074012418762941e-01,1.761015376452159220e+00,6.290733887863637630e-01,-8.621890415923109952e-02,-3.860177496885182080e-01,1.768394791029195279e+00,6.531142879429848724e-01,-4.154279288902562595e-01,-1.662282832751586226e-01,9.820378567721699259e-01,1.177166638811603550e+00,3.877391454236508439e-01,-6.206020168644470481e-01,1.090463804628960975e+00,1.288809865379216546e-01,2.081595083500245857e-01,2.038208286731869379e+00,-3.410322938877358157e-01,4.109444103664081083e-01,2.342598690004308870e-01,-2.091947868317739490e-01,9.954800138866654047e-01,-3.286279360786755754e-01,5.366890698783178815e-01,-1.070797010131003146e+00,-3.634173492262520733e-01,2.059563338642060870e-01,1.325357361037424464e-01,-2.668373512685304760e-01,1.871825759699184299e+00,7.533752965499638243e-01,-1.238338092953669811e+00,3.209394116026718646e-01,1.439235386027552188e+00,7.210502566660248469e-01,-9.104977346179410347e-02,1.620458366430822750e+00,-2.737642693952314632e-01,6.239200644442430832e-01,3.816698470965760870e-01,4.139098386504477811e-01,-3.337834350243519266e-01
8.893582029468768413e-01,9.521617528722210455e-01,-4.394465101804939100e-01,-2.266144931058329814e-01,-5.737054675536203130e-02,7.388219956787602793e-01,1.280157157739556517e+00,-4.941590536501275222e-02,2.249867615528949871e-01,-1.957478278927315685e-01,1.956733365245204581e-01,-2.733136466060577807e-01,-4.001023271176852858e-01,3.382814704424382257e-01,-3.785409169796158935e-01,1.147398675625719067e+00,-3.049905990165807101e-01,-1.053209859646193847e+00,8.509606020364585133e-02,-9.225653771105365997e-02,-4.982420774028134547e-01,2.186219143934353681e-02,-8.319530600377162965e-01,3.244407063055414486e-01,1.590629558306861480e+00,3.488156427709857565e-01,-1.772876088694980978e-01,-6.573658413787911714e-01,-1.350729783588215493e+00,-1.187350052757921270e+00,6.454950380581238045e-01,2.142481908331267171e+00,2.287455301408389263e-01,4.262571152500410632e-01,-9.462681842153171097e-01,-7.576829046904109966e-01,1.946932679003270161e+00,3.600009998239201425e-01,1.641527807403726946e+00,-1.221066738413698616e-01,7.848965644862215818e-01,4.659319152439939105e-01,-3.703351915786132209e-01,4.239059979398763223e-01,5.177162868997653433e-01,1.061706021884731177e+00,1.862947394540820145e+00,5.408538829907313383e-01,5.704244356078722600e-01,-8.931234981829538899e-02,4.737380096801856233e+00,2.292099542601709672e+00,4.993624133927917486e-01,-3.079161835316646112e-01,2.388121561858432829e-01,9.055453895960852151e-01,-6.284777329680740765e-01,-3.239395222385602069e-01,-8.489288901531458764e-01,1.108554678028872420e+00,-2.589406348939178315e-01,-7.595864395953420001e-01,-1.324689421173629589e-01,-6.244786856772742700e-01,7.741611218104766934e-01,2.047986461255851820e-01,-7.066995031964065088e-01,5.926172327002605655e-01,-8.874884244907365050e-01,1.056527124702748122e+00,2.189141319165215371e+00,-6.003197557636003046e-02,-3.019228111050282770e-01,5.420131859518779738e-01,3.439398699044106666e-01,6.266894780382435970e-01,-7.756562938055904244e-01,-3.381877081414653707e-01,-8.857195731333248334e-01,-1.035587862109984547e+00,9.479851254202187327e-01,-3.072711074568711953e-01,-4.988448789457798904e-01,1.754613374241812851e+00,3.408386071288539432e-01,-1.110130670961104293e+00,2.073591423648144250e-01,3.905557401120819394e-01,1.248334204196362984e+00,-1.134381585914276735e+00,1.111506110858554663e+00,-5.451892474068702477e-01,1.164984112288891316e+00,5.246385805385285206e-01,-1.021001800551834426e+00,-7.546840516810504607e-01
7.775793261999209838e-01,1.169586808354735608e+00,-3.511884700080672439e-01,-8.193721831763587371e-01,5.043563129970764225e-02,8.436998833234055084e-02,3.923126607063045501e-01,-1.117170713856670550e-01,-1.695274526485823774e-01,1.705261068512416711e-01,1.112500668477477417e+00,2.755275517951040198e-01,-2.222254000185810985e-01,3.440878440028253271e-01,-7.445024514291673778e-01,1.996483520326084005e+00,2.473181352052405413e-01,-3.266214217596157821e-01,-9.298813593040988756e-02,-2.343303922516319360e-01,-2.184089831582334273e-01,4.185491583919483949e-01,-6.233147309120639079e-01,2.608356672416956012e-01,1.793466523312134298e+00,2.361444323388979874e-02,2.305398341986445165e-01,-5.333755588730091368e-01,-7.803023593666562618e-01,-1.298888367520050213e+00,1.237403209119395942e-01,1.945116226197948439e+00,-3.197325395084032462e-01,1.844608171116780548e-01,-7.308437678032040363e-01,-8.099759173001956913e-01,1.407032798956477482e+00,9.160101233871672521e-01,2.297941230253244704e+00,9.112521765897012571e-01,2.936648525661602060e-01,4.557879379193940927e-02,-1.665434801390300867e-01,8.853200543524525346e-02,4.639505832717999434e-02,8.636153679436168185e-01,2.240474873385122745e+00,-1.476489580797586409e-01,-7.588509497344923804e-02,1.043834447977319835e+00,3.849733396016337572e+00,1.619748263097346763e+00,2.472526306755228886e-01,-5.305470624738559682e-01,-4.018737367620701662e-01,1.587735802344233393e+00,6.999575757389520092e-01,2.905906362897601181e-01,-1.142662051412982827e+00,1.565880950919550818e+00,1.791691951690129736e-01,-1.901172126799576811e-01,1.776631424931698067e-01,8.112867248750582627e-01,8.748071625445598132e-01,-7.723627877844824186e-02,-9.595165105940344219e-01,-1.356537083061650772e-01,2.162122085261146964e-01,9.197910136483886667e-01,2.141868428377987410e+00,-2.459642447590006387e-01,2.577591196000685037e-02,3.464139778896081490e-01,-3.739891887647555091e-01,1.032126406769798832e+00,-5.931991491419028595e-01,1.105836697455321538e+00,-8.944295107536059941e-01,-3.791709182317677951e-01,1.086633783052845192e+00,3.318055655878959787e-01,-6.322206242843639301e-02,1.476683616140804123e+00,1.302494659533905308e+00,-1.238636269351459873e+00,4.374918223278556062e-01,4.610758120694968820e-01,5.106096461342662929e-01,1.082825777948763224e-01,1.357161389737919777e+00,-5.318883575747757053e-01,4.245574119629007548e-01,-3.798291407674064812e-02,1.121155770602316082e+00,-3.389041455304694361e-01
5.002274252876515170e-01,1.182704640893414982e-01,-4.789944729718775829e-02,-7.253100271611591099e-01,-1.335424080050999773e-01,4.830687470038422804e-01,9.740307537207646416e-01,-4.139900198809623455e-01,4.842795379817488310e-02,3.538952661319267889e-01,7.099498618381286930e-01,-7.661666336772821051e-02,-3.748503710013812440e-01,-2.418887349278631138e-01,-6.204879749920610976e-01,1.290026540885861994e+00,-6.748941074335396140e-01,-7.337826421177608138e-02,-3.136193040293083073e-02,-2.752411267262869915e-02,-5.379357989104525117e-01,5.249539096444900688e-01,-4.109684217775122494e-01,1.927832831386517010e-01,1.949757066136239780e+00,1.130529358289035780e-01,2.892939123576163674e-01,-7.653822152419856861e-01,-1.685750850591231753e+00,-1.542988351356310517e+00,2.195422922661381948e-01,2.715995517902305867e+00,-2.811184593413237898e-01,5.101286078872204754e-01,-5.937001072741033836e-01,-4.952768180674802512e-01,1.492257138411553274e+00,8.489582264451680516e-01,2.651309366348912455e+00,1.279370306119945733e+00,4.306590375698821083e-01,5.473709688521637418e-01,-1.241160060119137903e-01,-3.084096812718850611e-01,4.869662453358628573e-01,7.679557229369370353e-01,1.999629860903039402e+00,-2.106032758425542828e-01,8.076913756867624972e-02,3.280090103676525093e-02,3.797011545348407235e+00,2.371882851132676606e+00,5.520485118847306971e-02,-3.558725662857167293e-01,-6.590985564555305043e-01,1.890941504102464865e+00,7.486475164649064595e-01,1.799045776524824114e-02,-6.365052590438662339e-01,2.378195785475913482e+00,5.668132809879630751e-02,-6.533147788916473520e-01,2.084592123724868240e-02,7.295382749504586428e-01,1.345925511546400610e+00,5.405121707662065011e-01,-9.045337071259391681e-01,7.314566980210668312e-01,1.875757793716797406e-01,7.901699718765091696e-01,1.708503664998065608e+00,-5.325662009460213620e-02,3.899533502717884015e-01,-1.948184763145588416e-02,-1.700106301720900048e-01,5.887385963946781819e-01,-9.094750038711854057e-01,5.249177486601392939e-01,-1.392408751831331948e+00,-5.005310245120757617e-01,6.480583142435231148e-01,2.399335264555415015e-01,-4.300989820604819158e-01,2.196464403816003053e+00,1.022677257538578299e+00,-1.635986510839687380e+00,3.367181366946624954e-01,8.255684111996816066e-01,8.679667543360645166e-01,-3.444596154616226813e-01,1.357307699493906838e+00,-4.660288269771079017e-02,3.068165412755180510e-01,3.345174012282606246e-01,3.427426300306214979e-01,-6.700381831219838213e-01
9.359548852065121549e-01,1.481285309941765771e+00,-9.920562099224783381e-02,-7.862903138715899853e-01,-1.170923819209207933e-01,2.235869474062044393e-01,2.967318073726710193e-01,1.131579991371039762e-01,1.185139513126424182e+00,-3.042118211793562454e-02,-5.348191087673215272e-02,1.387230000241259642e-01,-4.414273632899178290e-01,7.388846670038293207e-02,-4.060097376481022757e-01,1.332178486510011028e+00,-2.095344098079343353e-01,-2.093875755042851339e-01,-2.224540718710656950e-01,-2.694388062825226610e-02,-6.249889264325313443e-01,3.375109093675571215e-01,-6.748476418165186841e-01,9.803956899907216582e-02,1.767716989490328183e+00,4.205443747915958430e-01,-2.385176231252900125e-02,-6.186423557554099339e-01,-1.481905651472484875e+00,-1.352505896946470720e+00,2.791255549681768144e-01,2.352902054805683818e+00,-3.158473799092728629e-01,2.084159242895035069e-01,-8.796651754815311142e-01,-4.745822066191420219e-01,2.061397573495216129e+00,5.592126508299128940e-01,1.725291206401530442e+00,5.235799582891960124e-01,6.209371386887440059e-01,4.541472447288940062e-01,4.254382174133973515e-02,1.700628965323062181e-01,5.737693552900926530e-01,9.086232227030344166e-01,2.519123255268661321e+00,3.709304477253247412e-01,1.644230577462783283e-01,5.611525597042246183e-01,4.001359493721111882e+00,2.024743565161025938e+00,5.352079766456535603e-01,-1.420636597498625697e-01,-7.089122506156342318e-03,1.216594297660755553e+00,-9.191707177151914321e-02,-2.328606635567781191e-01,-1.124538641591894983e+00,1.340901474923449577e+00,-3.671234825461425766e-01,9.679524587868526542e-02,2.600391711239297132e-01,3.154509858058531235e-01,1.358648559983360871e+00,6.096779819798484601e-01,-4.546103826632998945e-01,5.569266775919262669e-01,3.374165861005236355e-02,3.913616751974060559e-01,2.060105797475888956e+00,-3.725524792649159700e-01,-2.612611054855386583e-01,-2.069026730251212476e-01,1.195542290962794546e-01,3.981351125937182545e-01,-4.139996455915452844e-01,1.741797611697963322e-01,-1.473987501573797765e+00,-3.153523497748569882e-01,1.019803226242989913e+00,4.593451627832007000e-03,-4.374086313424684902e-01,1.743893041668386656e+00,8.046064090871579699e-01,-1.179192975075431526e+00,3.171437040495516668e-01,5.247375704224712667e-01,9.513965179411651985e-01,-8.812879059498399670e-01,1.521292752312871199e+00,-6.933354772297252167e-01,1.225075086914966027e+00,2.972374123215671404e-01,-6.363096130816219276e-01,-4.468993625509625200e-01
7.320424803970793093e-01,3.127732310472367550e-01,-3.105273059976807470e-01,-7.940044032869497670e-02,-4.436997289382097615e-02,8.110683720043385669e-01,1.355276976141304823e+00,-2.506918941162725734e-01,-4.566494716097813100e-02,7.808893775819819583e-02,5.457134182031500025e-01,-3.543187876257742897e-01,-4.038807821209243198e-01,2.048455482396653315e-01,-3.291492295130267198e-01,1.218702846204741341e+00,-5.659165101952026156e-01,-8.757710898156791934e-01,2.627651670719374777e-01,3.598711474313600472e-02,-6.108976893293757149e-01,5.472297927813407625e-02,-6.532398094104628905e-01,3.944706779859129542e-01,1.500825571754945909e+00,-3.093316218911528609e-02,2.504903905763833372e-02,-7.139665802735897238e-01,-1.043179057823661715e+00,-9.723926548487321631e-01,6.695013964000693374e-01,2.339180224966557642e+00,2.496378377880381083e-01,3.376852417759003688e-01,-7.495161989262092428e-01,-8.029040490255040519e-01,1.517182767247128528e+00,6.634936569563425479e-01,1.796850438451913057e+00,4.436118132744850673e-01,7.944229113538020526e-01,4.760824935669623059e-01,-3.602382090890920985e-01,2.624615522914973131e-01,4.961566248232900378e-01,9.683726935370727817e-01,1.826311299570037239e+00,1.906617376512278750e-01,5.258461107716718708e-01,-5.767384735829184095e-02,4.590400597091571555e+00,2.151995186799098292e+00,3.296464512355866683e-01,-4.709887668635398539e-01,-1.852378738402057634e-01,1.203324315170574366e+00,-2.061013202672978828e-01,-2.472349874152594273e-01,-4.585438850127644406e-01,1.382682690975359563e+00,3.346630734880297053e-01,-1.059406695553395616e+00,-4.014315410379869498e-01,-2.683819869900118116e-01,6.061352228543321896e-01,7.105567046285787836e-03,-8.014336193928217611e-01,8.654010603049316908e-01,-8.571957383641202188e-01,9.323245213228934514e-01,2.256618681812793348e+00,-2.428462884273202560e-02,6.692415015641361986e-02,8.282192573580894335e-01,1.681915109415125786e-01,9.892918030644536342e-01,-7.089694587923571767e-01,-8.953225576761203452e-02,-6.145765560983236231e-01,-1.077426666818728673e+00,5.220931185088133475e-01,-1.945839606765429330e-01,-3.929240377629431569e-01,1.771657827898096116e+00,3.325840268942096278e-01,-1.133214191208693489e+00,1.825194644018043599e-01,9.377242213111933733e-01,1.114837128204678285e+00,-7.233335850042732496e-01,1.212034815709075009e+00,-2.935100757567889462e-01,8.443364615985503585e-01,5.575325108168329713e-01,-3.885845396945438179e-01,-6.969025861513969966e-01
6.209636767354768105e-01,2.022845393047322249e-01,-2.297996387206209246e-01,-4.442462520609504195e-01,-1.240167647249962590e-01,5.816925187316561718e-01,9.456059100585889610e-01,-2.693738528838605095e-01,9.044607796806714006e-03,3.534648849466743292e-01,9.344104705756626217e-01,-8.178035868518979123e-02,-3.406318647642984643e-01,-1.037834946906859845e-03,-5.602331938098633612e-01,1.574717654987065840e+00,-4.393436154158613105e-01,-3.652903351727759262e-01,1.139010718513026044e-01,-1.252200843329293739e-02,-5.147260372992419342e-01,4.495419728613326837e-01,-4.550345993955200452e-01,2.820326775494552685e-01,1.711886910133751938e+00,-1.912620442372341689e-01,2.103721376358127226e-01,-7.059195048377909787e-01,-1.074407466658694021e+00,-1.187247861367324742e+00,3.813994218462473107e-01,2.471860619272326698e+00,-8.631792224419743143e-02,3.276996345018293733e-01,-6.088570831820125928e-01,-7.154943347017064248e-01,1.365140395407712814e+00,9.007772578641921601e-01,2.314751540685166198e+00,1.168912548100930815e+00,5.969671043199765714e-01,3.835752199729608458e-01,-1.725536551548896846e-01,-3.336033163457020889e-02,3.146915372334472827e-01,7.883656553755421514e-01,2.040382148941901175e+00,-1.541613461164972332e-01,2.051493774591893748e-01,2.238187531790181706e-01,4.151383429234908107e+00,2.101720480414821068e+00,2.541705035994100692e-01,-5.115411967750045363e-01,-6.137247689331523093e-01,1.699447196475175392e+00,6.083805945079611144e-01,-1.933054846119620918e-02,-5.991711453440303758e-01,2.089614041777917208e+00,3.901476477768285323e-01,-7.966770952400664685e-01,-2.281857791143903358e-01,5.161930905274080272e-01,8.571620255823702017e-01,6.756198799185786363e-02,-8.941106875759785577e-01,6.747805185774425896e-01,-1.601908670659306089e-01,7.342941181969624420e-01,2.151826108872514354e+00,-3.752526426842711649e-02,3.205923032415360363e-01,4.561345870678500392e-01,-1.280446063340217600e-01,9.481274508491644992e-01,-7.118634957136527053e-01,6.002003483521756166e-01,-9.034849082957494559e-01,-6.876597023672778031e-01,6.118227847385295792e-01,2.457376620328483308e-01,-3.066573914085015118e-01,1.828470981922720284e+00,8.933241821342816635e-01,-1.393251343490633731e+00,2.360773774574852490e-01,1.061002606549108496e+00,8.358851692183992821e-01,-3.456079706312477628e-01,1.461261861060682898e+00,-9.790109552402648241e-02,4.544252168321697427e-01,3.231370950789111407e-01,5.089114713069482487e-01,-6.097606901504377674e-01
4.446189724794067377e-01,-1.696665177393695823e-01,1.924242837767654590e-01,-8.760741363405566418e-01,-3.017401277746519783e-01,3.359431237911173485e-01,3.097583024622777015e-01,-3.250603770112078239e-01,7.581200695873822060e-01,8.021998718476879286e-01,9.449621859093790821e-01,1.681580394938939071e-01,-4.018022632472359468e-01,-5.688607580623380455e-01,-6.167736659338070027e-01,1.666339214015556625e+00,-7.643735590439308947e-01,6.202238498566011726e-01,-6.494148276954135601e-02,1.530837824047688311e-01,-7.378313230906528020e-01,9.453953275517958943e-01,-8.292793781037383072e-02,6.758476419237208210e-02,1.938100101531623709e+00,-3.934270865733657252e-01,4.875864963158480503e-01,-7.884346853127837118e-01,-1.363814596281143654e+00,-1.378398397446105594e+00,6.048016316438051265e-02,3.069765623561826473e+00,-5.827284339768694643e-01,2.472291532552505777e-01,-3.596216889664810568e-01,-3.850370942802509022e-01,1.242899337651912850e+00,1.248136154557129673e+00,2.787672655968096436e+00,2.363508273666511172e+00,4.935351879162624966e-01,5.276089874032647842e-01,2.424940826481057909e-01,-5.443770457184931022e-01,4.125995250799814884e-01,5.052649316790724932e-01,2.517245802151186762e+00,-5.862684621508665872e-01,-1.632595618609286592e-01,4.075234808280851495e-01,3.418246005555824141e+00,2.138636969710264069e+00,1.580614332489752583e-01,-4.226583143535602716e-01,-1.273551405324070185e+00,2.385452424579697084e+00,1.562205068099578931e+00,4.651572006285292771e-02,-4.992541434201163142e-01,3.065463054282914435e+00,5.559638249279199584e-01,-3.961930242747311315e-01,-8.315588266208227830e-02,1.632924159272110209e+00,1.456390878749795004e+00,4.993688861176165950e-01,-7.603966750660074991e-01,1.040953397689922344e+00,7.851878197272809112e-01,2.000494585195988773e-02,1.942632260604404859e+00,-1.557346487342268770e-01,7.627683771103563881e-01,-2.500312020698607363e-01,-3.905818540612671086e-01,7.510284102559943165e-01,-5.312640347197584711e-01,1.164428121588347409e+00,-1.513272223543054462e+00,-7.921140958954647759e-02,3.610633989474857919e-01,7.122298054053217697e-01,-3.309552871105780891e-01,2.105551985390811343e+00,1.363572341921882369e+00,-1.723815865237759315e+00,2.534208739188208992e-01,1.646612039296044827e+00,5.967884773383480557e-01,-6.551310339099125635e-02,1.964413503463639632e+00,2.112289998971185190e-01,1.723766592561329913e-01,2.202382165265573954e-01,1.135538634918266343e+00,-4.721602360978787716e-01
8.785370108201956407e-01,1.268334275025633229e+00,-3.299399850523840882e-01,-6.852765968805201169e-01,-6.267277662940752558e-02,2.824394144080887847e-01,5.040104398456125567e-01,3.437444647741741410e-02,4.418878121395445890e-01,3.691158971171526471e-02,5.630346597314446200e-01,1.475272688267534327e-01,-3.232768681755026630e-01,2.624912741555605611e-01,-5.798841770860493350e-01,1.671796374856617806e+00,4.633145240907243778e-02,-4.535049007326130144e-01,-1.134158002201592907e-01,-1.487158702314007597e-01,-3.920056014466579142e-01,3.644613390193099378e-01,-6.790294285494109516e-01,2.049504320641578892e-01,1.742066667659684098e+00,1.876597018742969247e-01,2.990634741119552187e-02,-5.778191432136297045e-01,-1.102207082315976194e+00,-1.292959120139689499e+00,2.871549060575560031e-01,2.101879161420504794e+00,-2.040740202272831871e-01,2.364742864623525509e-01,-8.338621311872571606e-01,-7.010429005551097603e-01,1.773027832608888854e+00,6.671629162330156015e-01,1.962809189421009126e+00,5.786084526910895143e-01,5.340703677135365535e-01,2.470238648736642340e-01,-1.182899662862236106e-01,2.149766240594632727e-01,2.779301553266523284e-01,9.031909549482866062e-01,2.290101659795052758e+00,1.941257906065111116e-01,1.453995972278726290e-01,6.486866816305483230e-01,4.148221127497226490e+00,1.908486904142660645e+00,4.656815245558567629e-01,-3.592587752516247512e-01,-1.345931209423263386e-01,1.318445757857318545e+00,1.793503442356607636e-01,-2.581530623648943534e-02,-1.126739282987695212e+00,1.461727664814139960e+00,-1.223882415065162543e-01,-1.927182898874777728e-01,1.359307851761260288e-01,3.358634419448489616e-01,9.880174550180453874e-01,1.739707483616188544e-01,-7.274150685039970643e-01,2.182289556653117524e-01,-6.639086780267361432e-02,7.332837596053563001e-01,2.190209702344582787e+00,-2.328874962991216435e-01,-1.579622366163966896e-01,1.859152544147776587e-01,-4.154515964436920894e-02,7.179798550680056568e-01,-5.574949720667835562e-01,5.353189765974020187e-01,-1.092972783620988819e+00,-4.863874472219444911e-01,1.093603673144397437e+00,1.418384294716478478e-01,-2.840803937420381398e-01,1.584759851315448165e+00,9.749605230858371385e-01,-1.199544485155755069e+00,3.211834655730684829e-01,4.810066667342756674e-01,8.152640751581077261e-01,-5.499826371985194751e-01,1.419206232988826866e+00,-5.727374540406243719e-01,8.783161979671484376e-01,1.733252869879189362e-01,9.257489985974903801e-02,-4.742989877621676120e-01
7.271678443484623777e-01,8.524983398189212025e-01,3.032886452238244268e-01,-5.592572410501772673e-01,1.521310927137075053e-01,1.530824411950799380e-01,4.885004138648113559e-01,-3.519229470039162422e-01,6.187842664725754505e-01,1.101338626749661653e-01,-1.646273850833174235e-02,-1.248605349380622065e-01,-5.195129272541190169e-01,-1.065055422506913652e-03,-1.024308544506046248e-01,9.734588553162452085e-01,-7.948434183601318370e-01,-1.444284387580205276e-02,6.871674369932992410e-02,2.169290236350560619e-01,-9.151906201588591028e-01,-9.003539731921861300e-02,-5.879515307766508547e-01,2.812482215213766290e-01,1.559279317880008842e+00,2.477725168967232217e-01,3.224424079116808839e-01,-6.985613799706142935e-01,-1.138899040052891998e+00,-9.687617158580215104e-01,3.434553881983958834e-01,2.562129239701938843e+00,-2.518764103605946603e-01,2.484448763991950471e-02,-6.749562277402426647e-01,-4.790963182405384435e-01,1.439232082939975177e+00,9.412608330316578620e-01,1.621031291060353929e+00,8.538165583474344178e-01,5.196076789731771672e-01,5.578263270954939568e-01,-6.314993500361520962e-02,-2.453254757916166484e-02,8.306019225855543198e-01,9.638413996148672558e-01,2.375175412801265651e+00,-3.944947486421901406e-02,1.216386976090218508e-01,7.744168860477215199e-01,3.531135378924273205e+00,1.605557468129260368e+00,2.383112318325669721e-02,-2.780206630323309169e-01,-3.202891542599733410e-01,1.350988332717659279e+00,-1.465458667283076055e-02,-1.236254767820562928e-01,-4.348256048771969029e-01,8.312786809622918494e-01,4.828254601057071493e-01,-2.264628127489460852e-01,-1.431416615522880520e-02,6.342114794772876207e-01,1.237845760463587297e+00,5.413940872790695691e-01,-5.184055105883271786e-01,1.011813630355827609e+00,-1.205184317321632004e-01,4.045175781938945003e-01,1.877311314622703176e+00,-5.309369584451466562e-01,1.081654247984829148e-01,3.110660202042113132e-01,-1.229711529786490787e-01,9.834370949993623823e-01,-2.538182990497310221e-01,9.181023809010624426e-02,-1.010070453167408067e+00,-4.204368136958152591e-01,2.101631287741659859e-01,-3.003387080884820648e-01,-2.488061212099894060e-01,1.824598313209772948e+00,4.272080074555537621e-01,-9.674809106042293605e-01,4.585761688564350402e-01,1.033967902032173702e+00,7.847979582418906919e-01,-6.226868161778270627e-02,1.290415269015432020e+00,-7.044815628398168883e-01,9.110736535081729315e-01,4.477298677896632828e-01,-1.603926653106140798e-01,-2.149211107896622508e-01
7.037189946906975413e-01,6.492947813214289265e-01,2.737213086276030216e-02,-8.314580377534701583e-01,-2.979060236811541529e-01,4.156098558947330934e-01,4.711025169973249715e-01,-5.953844602516145113e-02,1.203571086290774472e+00,3.018067929258193560e-01,1.642365721946564550e-01,7.882679500944325679e-02,-4.627477388172371309e-01,-3.411092825403865825e-01,-5.020449830316446871e-01,1.279520360014711144e+00,-6.084292110879702120e-01,1.320286864537849603e-01,-2.018788095904658630e-01,5.758858547409948653e-02,-7.136876301136472200e-01,6.750150799424174952e-01,-4.082690846690064657e-01,2.901400038624762923e-02,1.925873574808033561e+00,1.963004939047651443e-01,1.119466573909058960e-01,-7.434495803745413411e-01,-1.821344447620040441e+00,-1.525277450841790561e+00,2.203447660041554235e-01,2.830538598380506699e+00,-4.094542221577964769e-01,3.744778984614668405e-01,-6.869337921209818232e-01,-3.350656652991458317e-01,1.918370752282410940e+00,7.065414913940302188e-01,2.254658086507768999e+00,1.240309008551085723e+00,6.388767931548513523e-01,6.313904315738856354e-01,1.455510731106115507e-01,-1.851223068048110654e-01,6.147268116789355030e-01,7.214934867435053301e-01,2.456985954708017061e+00,8.594254554258343171e-02,1.090913163446239759e-01,1.133262153131665562e-01,3.867518822315850091e+00,2.409426462133644087e+00,4.309173344630614633e-01,-1.570030443579622237e-01,-4.866366628264620631e-01,1.714099821347859987e+00,5.033893496261634404e-01,-2.446277612607391516e-01,-8.634465974689907730e-01,2.339850292791222142e+00,-2.486751525900892379e-01,-1.799400067555563809e-01,1.385443556972476009e-01,6.940559559435717230e-01,1.578523992011718224e+00,7.947984152473419606e-01,-5.378554348853092915e-01,9.326978680271401645e-01,3.223509306013868647e-01,2.214168255962862264e-01,1.900766350641806657e+00,-1.947656064429779676e-01,1.584099706502157812e-01,-4.480851150779077141e-01,5.304711739623839406e-02,2.568080944744193239e-01,-6.029454578015033261e-01,3.464604503879610276e-01,-1.749546982887476565e+00,-2.548186359206363050e-01,7.955625311804034316e-01,2.859839833223006278e-01,-5.622007080839748205e-01,2.107309766512441840e+00,9.850680221774029688e-01,-1.555235683098279198e+00,2.334011901392135657e-01,9.438719122428922415e-01,9.799161532147969700e-01,-9.025946510954172552e-01,1.719426390524388948e+00,-1.990814786190643337e-01,8.630204525770284185e-01,3.670276204961122613e-01,-3.580945942008930127e-01,-6.178133639475068550e-01
1.059443864315642525e+00,2.052109068451797302e+00,-4.177020425898581024e-02,-1.369301902293737161e+00,-3.964251081330777415e-01,-1.599230609906289735e-01,-8.135592857805913347e-01,5.455971809505395509e-01,2.399546166074782327e+00,2.450949795397476816e-01,2.014485263558030148e-02,7.216228411073047910e-01,-4.072521197523099601e-01,-1.816075070139350767e-01,-6.495807756400637789e-01,1.966409794547585355e+00,2.419174687316311689e-01,5.588312563012894918e-01,-6.072289348132980935e-01,-6.690096075944940157e-02,-5.823976414683496028e-01,1.042405090857495775e+00,-4.519254241305762365e-01,-2.111390411470856210e-01,2.002220348978691611e+00,2.551313958614480071e-01,-1.524313243204772350e-02,-5.416803393575249093e-01,-1.510783381355227384e+00,-1.596237356938341012e+00,-9.619722422687049246e-02,2.485825347717299127e+00,-8.648307723764103727e-01,3.200104541649327616e-02,-8.283222835179677723e-01,-2.750039459647752316e-01,2.324575443022849797e+00,6.979231224754698371e-01,1.963897433253199543e+00,1.342540729572818670e+00,5.818586020652416479e-01,3.166547720139883948e-01,5.485978917659444232e-01,7.960100371826747678e-03,3.419068217790062203e-01,6.314810483396670060e-01,3.286240229590860817e+00,2.696075431700311054e-01,-2.245324112870508704e-01,1.114646302042334947e+00,3.616994242014361927e+00,1.934254006943170623e+00,9.161652216043104646e-01,-3.122720374536469556e-02,-3.317016631238871027e-01,1.625607483071834114e+00,7.178877335385698277e-01,-1.713222270737314312e-01,-1.674567097896730417e+00,2.186477902026218612e+00,-6.423202377397255747e-01,9.647988369604190151e-01,6.187352210752677939e-01,1.249383395505580197e+00,1.801919469933412454e+00,8.000536623971612471e-01,-2.270962855356353227e-01,3.256762354921324820e-01,1.055605725165859710e+00,-4.031301908274661505e-01,2.244395148856349387e+00,-5.175256790382020133e-01,-2.472543671613491867e-01,-1.067233364454357680e+00,-4.193562967853353696e-02,4.717443834898749078e-02,-8.901807454317117729e-02,1.005428710402472614e+00,-2.132823050235216122e+00,4.314034613389429174e-01,1.438551704796253716e+00,6.872870733394658149e-01,-4.174617713909035133e-01,1.589803023909283297e+00,1.577608596184344236e+00,-1.399381955799678057e+00,2.647432104635866756e-01,7.219585117079752035e-01,6.692151187333592599e-01,-9.802518149643018042e-01,2.242787904328753079e+00,-6.351781129464231235e-01,1.313998869288375726e+00,-4.619913225497201958e-02,-6.929899095605843162e-02,-2.724780197552805205e-01
7.410468369912170949e-01,1.290723492674434869e+00,5.831413431175382078e-02,-1.232267047862450893e+00,-1.654310683882617150e-01,6.839575280048049155e-02,2.744401812213957403e-01,-6.930210472826985046e-02,1.075623377432212813e+00,7.122076276863339994e-02,-3.896167965496616370e-02,2.411574914134646530e-01,-4.269322764975723161e-01,-2.455812909305495895e-01,-6.264877573405084332e-01,1.197759211657811296e+00,-3.690065459879665610e-01,2.288392778959089102e-01,-4.368807746625207322e-01,-1.107543112377821215e-01,-5.397785416310740825e-01,6.005419238678711968e-01,-5.595581531396963682e-01,-3.202456094643238438e-02,2.143204848351527136e+00,6.942506746194494482e-01,1.218617174644743978e-01,-6.791700867066303715e-01,-2.194087960794224301e+00,-1.882587579848991055e+00,-1.039459094833633523e-02,2.630151938392645494e+00,-6.310679961708571817e-01,4.672742122506026163e-01,-8.150014304151546041e-01,-2.323353517244035604e-01,2.137149957495217301e+00,5.679448205838928398e-01,2.398142783576523218e+00,8.884154056158068968e-01,3.396863674553174950e-01,5.744700210767113013e-01,1.212904328985124486e-01,-2.475051415002043065e-01,6.349352764248045178e-01,8.179221141890615776e-01,2.467174539728556937e+00,1.708538845791875982e-01,-8.604145598870684142e-02,3.843189044672287724e-01,3.507404595477459530e+00,2.370125837963755089e+00,2.782891114602822347e-01,-1.098151393388208108e-02,-2.190297412296195179e-01,1.639301581852249168e+00,4.135857285721593057e-01,-7.075938159886446810e-02,-1.253432191536473228e+00,2.026339176413076704e+00,-7.624898244051556695e-01,2.765602206519158224e-01,6.014210783209765765e-01,8.004860481246922621e-01,1.955635951669579820e+00,1.108904467993648169e+00,-5.733065120532045977e-01,4.575654713128923246e-01,6.620236964880118480e-01,4.993371206116319350e-01,1.516742891428142892e+00,-3.331446856795342581e-01,-8.188529995171543729e-02,-8.469406140196366062e-01,-4.681817843865355294e-02,-2.598271240664939974e-02,-7.291027670134262451e-01,3.916180364533993208e-01,-2.108768050587413789e+00,-1.091271742626215291e-02,1.165948697527855238e+00,1.977545560102959565e-01,-5.452674949420174277e-01,2.188547209534558835e+00,1.212292554899934593e+00,-1.599019911737473265e+00,4.447382707285151282e-01,2.283962042193742326e-01,8.893289648496868205e-01,-7.439726444399348271e-01,1.456730724704682567e+00,-5.134866883637452251e-01,8.354678002780178137e-01,2.015940850956637886e-01,-4.066659755023459000e-01,-5.341453752385831866e-01
5.821230219973123621e-01,5.492757027271594206e-01,-4.882999019152012982e-02,-8.180334823568278235e-01,9.914524512305636361e-03,1.995124308183492401e-01,6.203309691274889737e-01,-3.665677854618277220e-01,-7.359726540262512273e-02,3.132280809270555078e-01,8.640997695140348878e-01,8.670108959804422033e-02,-3.250884825271926903e-01,-2.618266671415390989e-02,-6.249027682774432879e-01,1.548318931322711922e+00,-3.645749356686177611e-01,-2.555565130548320685e-02,-4.895915313399902546e-02,-7.031758585465744393e-02,-4.608627844985055400e-01,4.216989206874252605e-01,-4.738631160749944837e-01,2.312875913682338747e-01,1.874027633975710483e+00,7.396225354993810064e-02,3.642264705859521445e-01,-6.707007197857188796e-01,-1.246848879088460871e+00,-1.397179146085061330e+00,1.255940363516377944e-01,2.432658263862330639e+00,-3.707343453186508486e-01,3.046144232548299580e-01,-6.066432969102604211e-01,-5.945383134256173596e-01,1.338824793058919882e+00,9.840617794953130382e-01,2.502638246714397496e+00,1.256920276485097521e+00,3.016332790280584208e-01,3.392946653411297309e-01,-1.163910877751890144e-01,-2.162533170362944679e-01,3.519418727234183142e-01,8.078988491137076844e-01,2.156258611421999483e+00,-2.971729707005902332e-01,-6.734795314114187803e-02,6.331897317424410865e-01,3.593025939013680947e+00,1.906831815013965148e+00,1.682077883386512429e-02,-4.359329673895745438e-01,-6.348737619733773041e-01,1.828719533603947678e+00,8.197745904116516824e-01,1.926948058385768714e-01,-7.695252395695442171e-01,1.922498632614781267e+00,2.555509478525069822e-01,-3.819294591176250475e-01,1.113244571449223674e-01,9.732025676600333242e-01,1.208945904807139149e+00,3.201240089255277810e-01,-9.191365774007094203e-01,4.048272002413822457e-01,3.130357787523664337e-01,7.891106063217458999e-01,1.815741526220506108e+00,-2.212417360842525160e-01,3.047078233892883681e-01,1.367738735056906740e-01,-3.559970310182997144e-01,8.711713335921114076e-01,-6.995138404336858073e-01,8.446085400910882113e-01,-1.166046929115529984e+00,-3.601121537826155738e-01,6.976835674119137298e-01,2.525025463108447332e-01,-2.134600807123696042e-01,1.899557575263852494e+00,1.145639949093691934e+00,-1.428358456458972414e+00,4.426317935452849239e-01,7.455571714371580505e-01,6.234156593516217981e-01,9.216069795725284619e-02,1.339792184994561541e+00,-3.003051255456289370e-01,2.839075260707211168e-01,1.586081736083072569e-01,8.602499857874756906e-01,-4.263293189130362704e-01
5.565803840188929819e-01,5.802190804954967529e-01,3.275274515183856372e-01,-7.630006289238048245e-01,1.620792290882860365e-01,1.447573614763257022e-01,7.487278156977561494e-01,-5.626298324756242586e-01,1.651961470900489282e-01,1.314458865843049773e-01,1.035210369631495708e-01,-1.544897852106545122e-01,-4.857301488026353753e-01,-1.453780764983030882e-01,-2.771312108321509760e-01,8.308785073211241157e-01,-9.180597865654900325e-01,8.033787599385366907e-02,-9.187466767057464456e-03,1.180612198799197154e-01,-7.892202650607695880e-01,-1.159660068444257064e-03,-5.554959494838810352e-01,2.571742305885675872e-01,1.804100095071037746e+00,4.539151887433462984e-01,4.117079993288740303e-01,-7.479059958427167754e-01,-1.625398857139924047e+00,-1.336371386108436532e+00,2.057599584326674225e-01,2.678728424141029407e+00,-3.494276617191248158e-01,2.833429099474617519e-01,-6.437316332688560738e-01,-3.855627795315367812e-01,1.431880672197012760e+00,9.068372940254707526e-01,2.138160715251877786e+00,9.376126730787172070e-01,3.097846318151298850e-01,6.305831359881941545e-01,-1.389179401500360567e-01,-2.804462565100699911e-01,8.459866623231513394e-01,9.486363346191102330e-01,2.129687595918601239e+00,-1.704925910858950955e-01,2.045183696476857160e-02,5.083499275983208721e-01,3.317454160128810337e+00,1.905485024093688695e+00,-2.237449100159943916e-01,-2.368560104109440068e-01,-4.124474860164479284e-01,1.593154644428246058e+00,2.408628649697590607e-01,1.577857760082447547e-02,-4.657524570744609460e-01,1.243147877477721597e+00,2.239161714699542949e-01,-3.212276132771325621e-01,1.580145159614856909e-01,7.700064630945477884e-01,1.524864538084545362e+00,7.934190493502687458e-01,-7.093132009071420052e-01,8.865270946484226089e-01,1.192770046935850148e-01,7.285045367409010986e-01,1.469381070283045876e+00,-4.231109178329632847e-01,2.345452041877516547e-01,5.368344843579149483e-02,-2.232593517808361128e-01,7.543410664793952503e-01,-6.094288646271618370e-01,1.518756185287839511e-01,-1.306854022869787357e+00,-3.842155947121335680e-01,3.094321037590136436e-01,-2.484721425089133073e-01,-3.221644137689205767e-01,2.158938894768295480e+00,6.307323193765224101e-01,-1.262282856584584723e+00,5.523406268017496679e-01,7.209131409900606524e-01,7.895696722492941966e-01,5.564471647074081817e-02,1.084037130539263094e+00,-5.484882750960395903e-01,5.510134151372023670e-01,4.157747185974425830e-01,-5.755790542926270126e-03,-3.488885117327658048e-01
8.784181812176036219e-01,1.297220963881397182e+00,-2.548118344940862867e-01,-8.870433082510447154e-01,-2.746502062770575514e-01,3.892665566559950774e-01,5.171589091013022443e-01,1.468828035999668602e-01,1.140783567357694706e+00,-3.779976479243524201e-03,5.049033871097513559e-02,1.498612907247227621e-01,-4.038253019422469725e-01,-5.140482917621372327e-02,-6.122337773446475673e-01,1.358950599376509416e+00,-1.745539779856593587e-01,-2.643924773618543389e-01,-3.214652751130312458e-01,-1.402191426829677567e-01,-4.805142941876948681e-01,6.016601993572621154e-01,-6.376460239902279614e-01,2.199658021580433442e-02,1.969099902811394909e+00,4.992570342875725653e-01,-1.156359299365885274e-01,-6.530610279753599201e-01,-1.915146180751379212e+00,-1.680357196462844538e+00,2.399567664716693860e-01,2.445121896221141178e+00,-3.284252287333465636e-01,4.671474255007606602e-01,-9.030890645268561112e-01,-4.248703450743252508e-01,2.265272973639809173e+00,3.993871486546946570e-01,2.105348213891316433e+00,5.434756762774405336e-01,6.198986859709579855e-01,5.097530451206842006e-01,3.349606672664405538e-02,7.716758064667277039e-02,4.959298215889084704e-01,8.452260420853787704e-01,2.373983406660559403e+00,4.351271707983275228e-01,1.917439230505822989e-01,1.218303896890342575e-01,4.178603412981916065e+00,2.481375954674645001e+00,6.154193511852132925e-01,-8.969615307237105428e-02,-2.079572654980049728e-02,1.356796417789969400e+00,6.223583236218366288e-02,-2.549876871349990859e-01,-1.290317590049896879e+00,1.979814494264055647e+00,-7.709018957361747360e-01,-1.520174673788948772e-02,3.429335732917438984e-01,2.067386200652209793e-01,1.514898422660617472e+00,7.525155876232980656e-01,-5.517221683902251428e-01,4.691860292444557379e-01,1.385719689723656500e-01,5.403036506879901335e-01,1.942782347691767830e+00,-1.686142634880974378e-01,-2.426364896466440269e-01,-4.959940121205419494e-01,2.044392349688031740e-01,4.547856441005015959e-02,-7.234351692144087576e-01,1.831550700199233717e-01,-1.791788793957040715e+00,-3.442879209138090535e-01,1.300466707597373039e+00,1.810265972938055745e-01,-6.006079997427087314e-01,1.964249502804522374e+00,1.009549832625292298e+00,-1.484983176204912825e+00,2.503408139830041179e-01,3.137079870391366043e-01,1.085456288283295656e+00,-1.237297913521856918e+00,1.541527617483236856e+00,-4.552512222083219262e-01,1.111945313345476860e+00,2.893888848139251069e-01,-7.865089109590750471e-01,-6.942686138742621971e-01
7.811806247169218453e-01,7.733074043307148759e-01,-6.592465406665772854e-01,-4.297705442964817601e-01,-7.262753077806496926e-02,6.008934386594934063e-01,1.120904101776027284e+00,-8.680939367477918944e-02,-4.467736609627175337e-01,5.888163188895592648e-02,1.132190530179121524e+00,-1.220494053488684061e-02,-2.175029605081887918e-01,4.132318464152325843e-01,-7.613138981548894790e-01,1.832763715429366780e+00,1.535418411978689002e-01,-9.378967049211333062e-01,5.285012590605048938e-02,-2.840065072258034506e-01,-1.478986634615719886e-01,3.772191629321101081e-01,-7.053551416383290196e-01,3.352375642189164839e-01,1.733329194106656423e+00,2.393084541893165940e-03,-1.243591828215662165e-02,-5.890058395665229707e-01,-9.643806984510040481e-01,-1.307475327344654659e+00,4.211550949067053851e-01,1.926384940074369556e+00,7.527909239597857516e-02,4.402722274098146427e-01,-8.179862200541242467e-01,-9.368955645797718557e-01,1.585818168196808653e+00,6.236942566066985272e-01,2.261216524745937040e+00,4.375020882239899489e-01,5.450734909356103053e-01,1.473961172774075346e-01,-3.821184826878653018e-01,2.829864058794193671e-01,3.461379434332428895e-02,9.206603163331080752e-01,1.824503286259729684e+00,1.364215279886158150e-01,2.986156415522477348e-01,2.630158129313653337e-01,4.587233758963284558e+00,2.121429921086502635e+00,4.238374142058105032e-01,-5.563967051069289571e-01,-1.748492931967030040e-01,1.356864019458138948e+00,2.567347377697876132e-01,6.712712657276170836e-02,-1.046296275790178365e+00,1.756850648711580476e+00,-3.159810344856445186e-02,-7.916479711448798362e-01,-9.112791236220287028e-02,-2.286505051485110407e-02,5.757851691808208994e-01,-2.182407786594051657e-01,-1.049141986858575626e+00,1.523520709615056035e-02,-4.393133230157726388e-01,1.255093353184796534e+00,2.280084856484505984e+00,6.902504689819227712e-02,-5.745511280387853581e-02,6.321311609612916271e-01,-3.843919296305783884e-02,8.971812030555599282e-01,-9.138613505419816985e-01,5.948558337869518375e-01,-7.309056938008187121e-01,-8.916033845078591424e-01,1.182939665623745862e+00,1.963991600327056053e-01,-2.704799616839037579e-01,1.586507187506535521e+00,9.884865556404778264e-01,-1.320519074637654944e+00,2.484941774835128792e-01,3.758465433159496882e-01,8.883785632325090775e-01,-5.481305733193526653e-01,1.217343258956652630e+00,-3.062223971455321214e-01,5.517534379841583236e-01,1.850926380536190852e-01,4.077743133611914095e-01,-7.118822729558913487e-01
6.379639281609459367e-01,4.366095838367364812e-01,-1.112157707869409068e-01,-6.044730215186283617e-01,-6.184745519059566682e-02,3.621537248248224428e-01,6.523519449447163776e-01,-2.670995014679348745e-01,1.333421531056634413e-01,3.589419507467222492e-01,8.743985815738171130e-01,3.177021111305449591e-02,-3.454074027059687024e-01,-3.645235127132204211e-03,-5.432210456768372664e-01,1.614994566646577701e+00,-3.840846274369377755e-01,-1.487858176836478474e-01,4.557039090728191161e-02,-4.999447893143174615e-04,-5.393621815789151341e-01,4.343264760252930623e-01,-4.492166119306872374e-01,2.530245769556977997e-01,1.733169765331999290e+00,-1.355228632213453521e-01,2.898940280837957184e-01,-6.769961372327203408e-01,-1.018310155899637026e+00,-1.189584724070314126e+00,2.667138440485291584e-01,2.451048951312347679e+00,-2.385557118448819458e-01,2.257284015296193158e-01,-5.967261760980823171e-01,-6.631891323809963046e-01,1.329235750775321412e+00,9.881155316932637156e-01,2.287840173860350657e+00,1.276457300818449436e+00,4.939479260510151737e-01,3.428400633701063072e-01,-9.553195208588517728e-02,-8.684142123158979099e-02,3.330777153812913283e-01,7.852593542328667464e-01,2.205514691488445145e+00,-2.288910490469059922e-01,6.447920198888447418e-02,5.465599506928408013e-01,3.865614774101823414e+00,1.895092933085808395e+00,1.894496947167715328e-01,-4.850123441986351480e-01,-6.479436861609629839e-01,1.742873243337060618e+00,7.131597547847102758e-01,6.161689625924712810e-02,-6.646059691438802597e-01,1.930200634426228579e+00,4.290866312885924794e-01,-5.275267166262682661e-01,-9.705499468333318724e-02,7.998432155217519712e-01,9.854360481989349330e-01,1.413593993791434911e-01,-8.453490263894481993e-01,5.922187387599562314e-01,7.792898067965170483e-02,6.210123931007631715e-01,2.086683083695513030e+00,-1.777102522898056092e-01,3.094972358295070558e-01,3.349018622840574944e-01,-2.440976030960684273e-01,9.821600064492310711e-01,-5.811550434457715131e-01,7.584332171435422820e-01,-9.761288351643551131e-01,-4.871253965023974453e-01,5.998124318095976459e-01,2.633459570178930953e-01,-2.283891064877623944e-01,1.776603036647844025e+00,9.950977208503282156e-01,-1.338288863558835251e+00,3.208994003119639560e-01,1.036254099380710780e+00,6.980595082688569875e-01,-1.085681511453465697e-01,1.489617752419746921e+00,-2.329476773284889224e-01,4.450871846817741617e-01,2.368457722168586521e-01,7.157286822698603057e-01,-4.563716257365993956e-01
6.183056419080538157e-01,7.836550407245098659e-01,-3.387202347795351121e-02,-6.311696411109890548e-01,2.882805928927654748e-01,1.602166025523436566e-01,9.673564108806431694e-01,-5.425617793988877224e-01,-6.552911603717188616e-01,-2.965057342828869569e-03,6.246478000452621027e-01,-1.326844970982155592e-01,-3.441605661723087795e-01,2.702417949478795323e-01,-4.436812297841896680e-01,1.190245626677884028e+00,-4.274077926059765553e-01,-4.264312835464784124e-01,7.882918093207966215e-02,-8.595449506989930044e-02,-4.611780587691178823e-01,-1.277962384209756497e-01,-7.180588934175311522e-01,3.981522014070616455e-01,1.727879193886036724e+00,3.763876730923167435e-01,3.535102765556697446e-01,-6.449995570899730302e-01,-1.156179177955492188e+00,-1.252054300209467952e+00,2.586924733839826018e-01,2.158856679418247548e+00,-1.554675195611468774e-01,2.935330290215930615e-01,-7.225685091792328762e-01,-6.951447755256412453e-01,1.275947073160899947e+00,8.735574085544770551e-01,2.154846884872345214e+00,5.326345316439159427e-01,2.194463170371041549e-01,3.364472750688046188e-01,-3.872419212193453086e-01,-3.670262852558801858e-02,5.074963462178598839e-01,1.047997948466828921e+00,1.861309990771167211e+00,-1.513548667520339674e-01,6.407089568580182082e-02,7.092022013081635823e-01,3.626365117823590278e+00,1.695709020329887906e+00,-2.168091278498708308e-01,-4.385202974138600052e-01,-2.428363934384284162e-01,1.417423359210036038e+00,1.640970441910095390e-01,2.184320897735949341e-01,-6.482574666964573407e-01,9.183071432437542869e-01,2.971699582769500303e-01,-5.227742313950001218e-01,1.077501121215006796e-01,4.836561264404079519e-01,1.036722628217899622e+00,2.686823483915252719e-01,-9.712091258228146007e-01,3.070795400535279995e-01,-1.767605512820479841e-01,1.249241952862659044e+00,1.664397623102060075e+00,-3.202346301576688981e-01,9.085767994700402750e-02,5.539987631805266544e-01,-3.098113419226236065e-01,1.076719977337306622e+00,-7.426743058305125267e-01,3.779021183975077580e-01,-8.151353453641395630e-01,-6.387935890191389632e-01,5.823994683764562863e-01,-2.549751194792240216e-01,-1.418733219690218594e-01,1.846361870134282324e+00,7.174736508998182938e-01,-1.134824522405938119e+00,5.846959715721726791e-01,3.627012912572785686e-01,6.893607773199088573e-01,2.939982914312614937e-01,8.421950284826996702e-01,-6.534834790371019109e-01,3.868900099152403071e-01,2.632029880628377616e-01,4.898971684170593810e-01,-3.560158006287030830e-01
5.580309094467160724e-01,-2.001655951743253059e-02,-1.761126361815376629e-02,-5.330198170633503318e-01,-2.270022928133493823e-01,5.871692490219881932e-01,8.044327108790706449e-01,-2.894532386964748238e-01,4.861230468544332495e-01,4.958275672198185768e-01,7.160889438062121304e-01,-7.794592106352843386e-02,-4.157670030086231261e-01,-2.885934492217291925e-01,-4.929765279702577607e-01,1.419025621391024394e+00,-7.374229624343089373e-01,-1.427001581483090809e-02,6.470158713791238081e-02,1.112528412098826303e-01,-7.025075040833322904e-01,5.946819682486190750e-01,-3.150694275208506534e-01,1.896634269417769858e-01,1.773986742849134934e+00,-2.151229023294490561e-01,2.681102198625100463e-01,-7.746414996888735249e-01,-1.337781924907638142e+00,-1.246747558004371426e+00,3.329898753082726204e-01,2.820048892343865798e+00,-2.212304264575865598e-01,3.272892560287699593e-01,-5.293657417619412886e-01,-5.319848209288773333e-01,1.415411665366243632e+00,9.614379520950625535e-01,2.388078845347155088e+00,1.543311087159181083e+00,6.495462902874100664e-01,5.522306028862608018e-01,-4.699973835800123206e-03,-2.186231506982432848e-01,4.821426716415058156e-01,6.935620228187988623e-01,2.208784245710533334e+00,-2.238456533255115677e-01,1.570354096421439916e-01,9.055128363485198673e-02,3.953564457866360904e+00,2.245699227271874321e+00,2.506481921605106522e-01,-4.142401827974890316e-01,-8.033148539348605732e-01,1.888672561849846110e+00,7.852271435611598571e-01,-1.216221046450006588e-01,-4.732389484800517687e-01,2.441621951107456390e+00,3.929049573826959296e-01,-7.053482207384371705e-01,-2.207867093551795501e-01,7.750776288669026792e-01,1.144232063184316361e+00,3.561128961928542447e-01,-7.612289595065182546e-01,1.031835425563847775e+00,7.594278455904637792e-02,3.920421849730005848e-01,2.050649114272974582e+00,-7.253122972814979308e-02,4.703880886618278523e-01,1.458007088348953761e-01,-1.070681759163756158e-01,7.701132468903590933e-01,-6.434598855249771265e-01,5.582571484323003430e-01,-1.204804076050345341e+00,-5.167866761362738259e-01,4.351841584415853670e-01,3.251198528175073266e-01,-4.089294625871099931e-01,2.026439789092755017e+00,9.049318025682622224e-01,-1.516506256434579258e+00,2.016615615761444269e-01,1.348804454407628306e+00,8.714542001631131463e-01,-4.575229754504855362e-01,1.656947745500180424e+00,3.801479418698661128e-02,4.836111895402432914e-01,3.979432698755407394e-01,3.485982060598383780e-01,-6.162151418674111092e-01
8.616761921620303966e-01,1.244140194430965796e+00,-3.842925806520504084e-01,-8.980310759230907269e-01,-1.511518032589041494e-01,4.551573184107990389e-02,-1.290480316814973105e-01,1.642101265163167234e-01,5.221652977465458534e-01,4.081997932761416981e-01,1.291952370457378096e+00,5.219560388986912436e-01,-2.085969856195709071e-01,2.335342234077315005e-01,-8.116025459848389412e-01,2.444745359903706561e+00,4.588543409153858499e-01,-3.447986459682704508e-02,-1.684162917112271285e-01,-1.866579948076141360e-01,-2.563939366591195812e-01,8.078459744623306404e-01,-4.563594782096846991e-01,1.424059173553186008e-01,1.771163797017673680e+00,-3.417977481211409985e-01,2.075495956303277101e-01,-5.018470842096858231e-01,-4.897085130548997078e-01,-1.196274919660386793e+00,5.786932968013425160e-02,2.030232627267027024e+00,-4.730011705609509232e-01,7.494690009295465472e-03,-6.579885559788285487e-01,-8.024770559736009723e-01,1.431677627841836831e+00,1.055556438255083496e+00,2.281019315157693406e+00,1.456418005512648994e+00,4.367395755195300766e-01,-4.874417710527884084e-02,1.007291091732068766e-01,1.007014644743728232e-01,-1.327192187401505796e-01,6.822926436551343121e-01,2.656486035550069680e+00,-2.174041654120408007e-01,-1.721121892297293177e-01,1.278132234519614219e+00,3.885953645168925163e+00,1.520435191163540090e+00,5.675285033610021346e-01,-5.696026031074508111e-01,-6.673125284955205849e-01,1.784425075947348782e+00,1.130124156572340333e+00,2.433302900154276915e-01,-1.275903581366205408e+00,2.070977747454883389e+00,3.179032188459967045e-01,5.454637543785501030e-02,1.207995085959082809e-01,1.207515782520981240e+00,8.331053590069422699e-01,-2.248047408282102255e-01,-8.212322231062035849e-01,-8.791990559557039120e-02,5.349552655916290922e-01,3.712855820910159754e-01,2.511048233413391895e+00,-2.621047461018094493e-01,1.081190095310171351e-01,1.678079923969667542e-01,-4.071021081616727488e-01,1.047295225012783604e+00,-3.197509378825316162e-01,1.551166798118005508e+00,-9.776695042997154417e-01,-1.272215797394031511e-01,1.159259561205422173e+00,7.350049202689583616e-01,-2.868237574690940539e-02,1.265253495798666306e+00,1.592999110793612560e+00,-1.276966096546077845e+00,2.975291437684431939e-01,9.091626804683212715e-01,3.895639337114171208e-01,-1.508542168069709755e-02,1.875476331688623821e+00,-3.882587893209301644e-01,5.238094457273365645e-01,-1.591117984722857925e-01,1.482458329158574895e+00,-2.658926062405486679e-01
9.128184507568168904e-01,1.662320084709490331e+00,-2.270430172777376798e-01,-1.118536773798786133e+00,-1.086298513277746680e-01,-1.321302585515098382e-01,-2.886276547930812231e-01,1.898175940148166818e-01,8.790530842621099294e-01,2.330832357492372831e-01,7.826009392694018851e-01,5.580788541054289009e-01,-2.707638916446663546e-01,1.739987856015099421e-01,-7.431895734214530869e-01,2.144855425635806334e+00,3.828417074337875925e-01,1.174755333614772579e-01,-3.300218209974652983e-01,-1.868968920042039239e-01,-3.264609875514007942e-01,7.122778847831894300e-01,-5.422744098362681786e-01,6.133480769533894428e-02,1.877461388701466394e+00,6.175957207549739175e-02,1.710320029518401785e-01,-5.018711107102193925e-01,-9.178203127473248957e-01,-1.392822894473346951e+00,-3.234462930165599159e-02,2.087417987707129274e+00,-6.156994169536784689e-01,4.627970469686042143e-02,-7.557654138707561309e-01,-6.181806138167958986e-01,1.716916086647677808e+00,9.038509118905866391e-01,2.175425804114405892e+00,1.191825813547204627e+00,3.563305298277316124e-01,6.798265863398428310e-02,1.628043056535104505e-01,5.639611177783724477e-02,8.388268318965680370e-02,7.499622753155430477e-01,2.763790187557555900e+00,-4.716671716868510444e-02,-2.253206339284024029e-01,1.311066200844529739e+00,3.650871569582942122e+00,1.588412204346689727e+00,5.231429897811230578e-01,-3.626464186800661404e-01,-4.287926150058026797e-01,1.650765907864785831e+00,8.513257955751974970e-01,1.835007252777418330e-01,-1.432795377251141034e+00,1.789213440094928442e+00,-8.025986467054915807e-02,4.095968710018034198e-01,4.021339182338681262e-01,1.176667901189631049e+00,1.227430037817161868e+00,1.988676624073295318e-01,-6.718402806996494059e-01,-8.155638234912754303e-02,6.948464274300567567e-01,3.303647438206591680e-01,2.234348134211813441e+00,-4.088415660058459244e-01,-8.140066923730952808e-02,-2.289602114909507213e-01,-3.338514450680175050e-01,7.185349506034672817e-01,-3.075760016382800277e-01,1.279453466412884266e+00,-1.360380774795922232e+00,5.271768366226231572e-02,1.269744326017254066e+00,5.602348827307161994e-01,-1.251258415070756747e-01,1.416280736382235617e+00,1.541072508675910946e+00,-1.270818777871382865e+00,3.968452343488759748e-01,5.778241193778567153e-01,4.573096511428059174e-01,-1.628246820836435349e-01,1.772907227417580556e+00,-6.224954081415612350e-01,7.394460573623186095e-01,-1.351552783629623722e-01,9.333742400175839560e-01,-2.220896191778604645e-01
5.436699166979895859e-01,1.214663022985346119e-01,1.325292984526762474e-01,-6.106525565880279727e-01,-8.668640490611138893e-02,3.823442804520098548e-01,6.496572845843195942e-01,-3.891121415981688703e-01,3.734464767008420227e-01,4.701315342687178989e-01,6.604973375778825373e-01,-5.204388672147278183e-02,-4.273321819003738087e-01,-2.458624695858390163e-01,-4.190076613176465514e-01,1.357600266365821096e+00,-7.702864786534937558e-01,1.241425318401135625e-01,6.936929571928160398e-02,1.439795213470081159e-01,-7.492870761745544783e-01,4.344376478227667260e-01,-3.387101908820935314e-01,2.217556717261532084e-01,1.744544848045410212e+00,-1.449160507267994447e-01,3.872754652067655901e-01,-7.552718991486022659e-01,-1.221410648273099531e+00,-1.178666556729740078e+00,2.611812883801442053e-01,2.775314415759849496e+00,-3.060885385690813032e-01,2.194699199464021921e-01,-5.076225799488958135e-01,-5.122907114796615424e-01,1.275449493996083206e+00,1.074931532234876252e+00,2.315994286972482996e+00,1.564520520965422490e+00,5.229416281173061565e-01,5.224094485155186263e-01,-6.984920225454264997e-03,-2.656282221060982662e-01,5.456476611839876645e-01,7.381246044263201078e-01,2.266567345457655591e+00,-3.316099288114200405e-01,4.742421411725851466e-02,4.108511524488843714e-01,3.648101482424104258e+00,1.975355012312911329e+00,7.617751320077364996e-02,-4.191903457031698199e-01,-8.178889999169804970e-01,1.886304049881006417e+00,7.957066618866273089e-01,-1.877506770461122299e-02,-4.171590205541542140e-01,2.080573374927424890e+00,5.541438220654004709e-01,-5.544394104473776563e-01,-1.459281812540708656e-01,9.872892936747059700e-01,1.200307046177071735e+00,3.882640504558710903e-01,-7.537482717181328562e-01,9.861262373969090778e-01,1.812344849907119027e-01,3.967454282002272903e-01,1.939611195378373010e+00,-2.235195564419573677e-01,4.828274350696143413e-01,1.927371449933413527e-01,-2.433270518739319432e-01,9.230547264027070264e-01,-5.307558395436775545e-01,6.248116356740649469e-01,-1.135576199845520495e+00,-4.104254156789820529e-01,3.014627935642414935e-01,2.214260523917996326e-01,-2.977553011908268821e-01,1.984098150928942816e+00,8.833952211922396769e-01,-1.398812004171981815e+00,3.211531443399929797e-01,1.322017141499991943e+00,7.336428267308734430e-01,-8.752659136815083007e-02,1.556645121915460672e+00,-1.310131527781424055e-01,4.249726394949276953e-01,3.541824215485365190e-01,5.690315234706381231e-01,-4.439484537877676495e-01
8.649244539997629211e-01,8.159218739145885912e-01,-1.806281527224896655e-01,-4.704777991304524010e-01,-2.314183982197265954e-01,4.744857238473851879e-01,3.728473240412882861e-01,1.045693162951455979e-01,1.080019980984272543e+00,2.968657940825343289e-01,4.871792459687018795e-01,8.769135612554905534e-02,-4.130655995172510253e-01,1.788752512703013428e-02,-4.016390351773340139e-01,1.675857161591020938e+00,-2.748541766329691272e-01,-2.275248568618359057e-01,3.515313433545413924e-03,8.383840459429867109e-02,-6.863518894873112952e-01,5.174504599929693471e-01,-4.771001543107812881e-01,1.677439295163797861e-01,1.584871319955116542e+00,-2.132003189357609962e-01,4.956224479951666650e-02,-6.503739164217375857e-01,-9.080330041661426321e-01,-1.004291525643523419e+00,4.151540441151279071e-01,2.461646952922910359e+00,-1.700326747088333201e-01,7.979512763003294984e-02,-6.974581478815987667e-01,-6.437318752415996936e-01,1.677243044036700326e+00,8.277193634357155050e-01,1.773171575573019965e+00,1.103801177753708895e+00,8.174819776950723593e-01,3.801212268020460749e-01,7.378050814083740583e-02,1.810293869039791836e-01,3.815890424469220443e-01,7.640843702491976197e-01,2.531166356442420273e+00,1.145079881740981992e-01,2.360906359238289509e-01,5.101387633073555250e-01,4.249304557967795049e+00,1.924623667541678573e+00,6.422337354912551755e-01,-3.852324458419790210e-01,-4.375810752786272739e-01,1.455110989263810550e+00,3.328082806873538524e-01,-2.465373614740944685e-01,-7.966719527829706493e-01,1.815177464991114764e+00,2.848498192018981134e-01,-3.281704500722458784e-01,-1.819264618986422832e-01,4.865561527076133208e-01,9.051388081134725816e-01,1.286579514132778213e-01,-5.321925606928844532e-01,8.160812309467690984e-01,-1.172088501204859023e-01,1.558502131701713367e-01,2.483943324640593531e+00,-2.243018251915654959e-01,7.109239148327792246e-02,2.428511635755495335e-01,5.045306790830393628e-02,8.270362443991862156e-01,-2.897739834089785305e-01,5.023716578695457402e-01,-1.030296531609374622e+00,-4.765396425907639788e-01,7.034611145750452321e-01,2.681231555448481130e-01,-3.404988180779449647e-01,1.569450632920192934e+00,8.131295030133799395e-01,-1.175991348986896945e+00,1.383678038872079019e-01,1.259521440503123424e+00,8.737169647556890517e-01,-7.490238774117606857e-01,1.827463806685120318e+00,-3.283405854519269584e-01,1.030004967986984932e+00,3.248473474457586607e-01,-1.988764955561148073e-03,-4.686145341137633036e-01
9.508281073995960009e-01,7.250272247554505611e-01,-6.447833029396999871e-01,-1.067279708526400750e-01,-3.380746636569005870e-01,9.660583570616041449e-01,1.102351188430867435e+00,2.302102694541248162e-01,7.156416007204163821e-01,5.858424499726014312e-02,5.362032179075701954e-01,-1.458701340819695269e-01,-3.648992008474737370e-01,2.480261172028148664e-01,-4.921232100711029345e-01,1.618194341137757952e+00,-1.139524977243762116e-01,-1.031636153961362989e+00,1.003049521349211326e-01,-7.146223008478411187e-02,-4.795711029106637380e-01,4.562805572390378206e-01,-6.622035832436323766e-01,2.469923226576948572e-01,1.538457686068894326e+00,-1.348106822121339088e-01,-2.891262823021374384e-01,-6.531599559245478970e-01,-1.060803677619917007e+00,-1.068165615836249804e+00,7.129077217580248593e-01,2.225667698310182185e+00,2.613425459892184111e-01,3.633917816884041363e-01,-8.774255351579213213e-01,-8.407520210131332883e-01,1.978651064107219471e+00,4.181684676890818908e-01,1.686184659781385431e+00,3.356929929678492686e-01,1.047885618698658927e+00,3.879444574387707068e-01,-1.989596961370198591e-01,5.058614555752030117e-01,2.681944809223586468e-01,8.723421823732449010e-01,2.078547962146287009e+00,5.328294766888932443e-01,6.330405650239889770e-01,-2.133065183590132641e-01,5.133905056575580161e+00,2.417531594737079459e+00,9.068196057799627896e-01,-4.086516674370516689e-01,-1.862137233260791058e-02,1.075833232915865079e+00,-2.618056072214799412e-01,-4.437367664395843736e-01,-9.124767515788314576e-01,1.849418852483488473e+00,-1.265657066772298001e-01,-8.571434079237959525e-01,-3.645445987314616110e-01,-5.384401301072699875e-01,5.302525869203302822e-01,-9.497544888630421456e-02,-6.529326398985246804e-01,6.983121392058098120e-01,-8.450781165481692225e-01,6.531142968993235431e-01,2.674517093460050177e+00,1.073193028189483034e-01,-1.879199975233045716e-01,5.468523556115738593e-01,4.260234220021767992e-01,6.432774245383590106e-01,-6.594002589206695575e-01,-7.710924164244348233e-03,-8.390207710704180588e-01,-1.028527374949202766e+00,1.048415650793876441e+00,1.169888968611369207e-01,-5.356319781797163060e-01,1.571904550813476575e+00,5.497705627251252558e-01,-1.218833094173153775e+00,-4.132717044420081143e-02,8.898374557194810297e-01,1.266300959582530750e+00,-1.504302082277294561e+00,1.614435746991847775e+00,-2.167642520050803157e-01,1.236732556074870093e+00,4.829405319199057134e-01,-7.901605040126233881e-01,-8.630458059025791773e-01
7.873658576979694068e-01,7.603098581492635510e-01,8.419248740832112332e-02,-4.091998480655762993e-01,5.248153534867948389e-02,2.474435708285917523e-01,3.443545240807789898e-01,-1.809350896507186668e-01,6.194054246195257463e-01,2.819682269452704615e-01,4.792759020644632439e-01,-1.007400932312066399e-02,-4.430018247808878429e-01,1.132823406815940820e-01,-2.002982771386122574e-01,1.488069860697548430e+00,-4.842960559359894557e-01,-1.178297940042432462e-01,1.519851764509599357e-01,1.941008814916796998e-01,-8.175118672790252505e-01,1.192159204632338709e-01,-5.086889677349210048e-01,3.059045985356519948e-01,1.435937525193389241e+00,-2.072460803248702133e-01,2.908538292237289324e-01,-6.467395166060760925e-01,-5.672142125647834376e-01,-7.397195839830824626e-01,3.985349460510294040e-01,2.410052386693903426e+00,-1.775518287740865397e-01,-1.125662381454319849e-01,-6.160055609390728826e-01,-6.772848983159071024e-01,1.268434331140963378e+00,1.078438264922245038e+00,1.601182245723297370e+00,1.136864747806890286e+00,6.485539028565859843e-01,3.546992149248346382e-01,-2.104301374907689010e-02,1.172823678309941053e-01,5.208450326012187270e-01,8.643452330154743901e-01,2.483872574251773990e+00,-1.309274951205245952e-01,1.366291084294802283e-01,9.500206274076767876e-01,3.817019432737766671e+00,1.434154409119686058e+00,2.611899853349672340e-01,-4.706594293799489792e-01,-5.156463048898282109e-01,1.433766588172509460e+00,2.883450946801673909e-01,-8.563356173034517016e-02,-4.728483642272726106e-01,1.106067759270435324e+00,8.094931494329851152e-01,-3.442736427395252097e-01,-2.363166605438868084e-01,7.318923245590175375e-01,8.212865113515313009e-01,5.213688033380181608e-02,-5.749886502889330897e-01,8.860825474608210461e-01,-1.723375346446276435e-01,2.510098472700261762e-01,2.334981802818289598e+00,-4.370830930692055638e-01,1.876755832509975075e-01,6.087189727094532987e-01,-1.782681620141539636e-01,1.279799540465497598e+00,-1.159504060457797192e-01,5.117442278029287195e-01,-6.697575569681060159e-01,-4.743878898628262064e-01,2.637290831565413107e-01,-6.307439381151080937e-03,-1.256987779582808273e-01,1.500861216454727254e+00,5.982548881398584983e-01,-9.180153234860326528e-01,3.221997248415471859e-01,1.378912269487206022e+00,6.683554945732841368e-01,-2.310960468900896680e-02,1.574594013043012941e+00,-5.501108907857735764e-01,8.585030836864558923e-01,3.374008717905151444e-01,4.152108432570341678e-01,-1.958681912753749976e-01
7.435614858268678740e-01,8.910432614468786205e-01,-3.013680816290872921e-02,-5.692153963062356326e-01,-1.920644033758918401e-02,5.547048604503093117e-01,1.241326290175583047e+00,-2.758014691743799207e-01,4.990889736859662751e-01,-2.272232227286752060e-01,-3.837865033296184447e-01,-3.217774698404650136e-01,-5.128096659773438981e-01,-2.566145983351240945e-02,-2.966747736713637451e-01,5.635996934037944550e-01,-8.055109031896201532e-01,-5.658404316662793976e-01,-8.500635960088959164e-02,-8.635201184445856493e-03,-6.910235196341178998e-01,-2.155199207949498597e-02,-7.814340769907603956e-01,2.098007246736101616e-01,1.837052872138670967e+00,8.181168965980966101e-01,-4.209121661867876174e-02,-7.555394569023351492e-01,-2.178514448090161260e+00,-1.555961763065762948e+00,4.602545904627114992e-01,2.562866114778628912e+00,-4.300921882827296594e-02,5.827514594840745854e-01,-9.225469590170241041e-01,-3.927502031648122949e-01,2.117811153527764390e+00,3.148665263433260142e-01,1.874158692430503370e+00,-5.770347103275508260e-03,5.957957443522774454e-01,7.713248833183261599e-01,-2.668899213864727726e-01,5.333952316931715731e-02,9.214366474484032565e-01,1.068337721228393322e+00,1.895803380041000796e+00,4.912211773043487217e-01,4.205304200718555374e-01,-2.765882096955455394e-01,4.139123931934749479e+00,2.552774970586226821e+00,1.846213550541599413e-01,-4.139899035876792865e-02,2.190990020412902917e-01,1.077621237296369605e+00,-6.202799609092830568e-01,-3.497055534590275405e-01,-7.694700698232950220e-01,1.204407584683612420e+00,-6.128142842452249939e-01,-4.889153233805211829e-01,1.864185497672996572e-01,-3.345961407273485566e-01,1.506606713620112670e+00,9.624680420410678394e-01,-5.972809342450327019e-01,8.846391501898851484e-01,-4.691827710332029389e-01,9.829749820698793217e-01,1.554862712649667467e+00,-1.967739067102706740e-01,-2.237726202158945576e-01,-9.661145210498178759e-02,3.205840961060833494e-01,1.723379006388050527e-01,-8.994774744095082042e-01,-6.335165809932465919e-01,-1.543430242299979938e+00,-7.509999369271057601e-01,8.036592022494307708e-01,-4.708784587154709045e-01,-6.704655290839098836e-01,2.267557964246924129e+00,3.230250845716203800e-01,-1.319512577790385333e+00,3.688311108862692977e-01,1.911619347054482887e-01,1.312251424262691923e+00,-1.107630065719831691e+00,9.627408295260219129e-01,-5.876184920974583115e-01,1.110887904709692453e+00,6.223714883494149142e-01,-1.489973741569170729e+00,-7.492160158760488020e-01
8.175030963568860054e-01,1.414071730305777930e+00,1.691868375432223903e-01,-7.154975445866282868e-01,2.187017923671999431e-01,1.113251089642135760e-01,7.149374187274690762e-01,-3.018990024329681887e-01,4.896654386140324444e-01,-2.736784782986904085e-01,-4.167582593990242779e-01,-1.566686204895442747e-01,-5.101330641365453555e-01,1.568159735992974424e-01,-1.742156261625336933e-01,6.833306480059104793e-01,-6.318171700961836557e-01,-3.262834811547131175e-01,-9.986523290477014592e-02,3.340850678755577507e-02,-7.423562411224673419e-01,-2.617387585670729599e-01,-8.401332502646872147e-01,2.542816549686897076e-01,1.719698702442024274e+00,8.416884238858350908e-01,1.308170050986676713e-01,-6.645258447399654544e-01,-1.698530811343912372e+00,-1.325777294229759873e+00,3.229689233970474693e-01,2.341414691416478622e+00,-2.180625648241790449e-01,2.630524908037215615e-01,-9.076247664616146071e-01,-4.213779848943408624e-01,1.883345705357223121e+00,5.461840101643546941e-01,1.591973734631605630e+00,3.748235584576953272e-02,4.087682328269526266e-01,6.022198426855293052e-01,-2.119143011138659438e-01,8.816128960445958340e-02,9.227325421837113684e-01,1.134394715295824474e+00,2.165639032525035645e+00,3.351129246815433005e-01,1.972623586664829509e-01,5.538698819599577883e-01,3.652006693693951700e+00,1.883289272990141594e+00,1.960846507922187065e-02,-8.522682830003738830e-02,2.198723021683925971e-01,1.007903536378039533e+00,-5.853618696131511756e-01,-1.562051834497042158e-01,-7.982998244356992457e-01,4.461601783499433704e-01,-2.673729044003467781e-01,-5.997290387332390726e-02,3.222137538921482358e-01,9.811449933917448796e-02,1.482564947293487645e+00,8.565355188895695804e-01,-5.293849249670810053e-01,6.718030300359194573e-01,-2.508151922262006894e-01,8.562772587263932644e-01,1.566170245543633488e+00,-5.211443770749554227e-01,-2.862533863983858229e-01,3.734500156123975179e-02,6.174411276559839401e-02,5.395978311882743128e-01,-5.362761615644471291e-01,-3.488910017773743100e-01,-1.320842292225164583e+00,-4.925457500403436217e-01,6.611886419015418070e-01,-5.723885260420074061e-01,-3.973283753822366982e-01,1.973555335760118101e+00,3.593163159156026465e-01,-1.002327203691945723e+00,5.569521592736299542e-01,1.934309878337980848e-01,9.878381194880054839e-01,-4.373497686834633136e-01,9.170066592757901702e-01,-9.801941288531070828e-01,1.121028255800999407e+00,4.600158887448824174e-01,-9.506187318684289345e-01,-3.528914060810378617e-01
7.404561640050653093e-01,1.641623950427411494e+00,2.471195801678067183e-01,-1.031979755062442550e+00,4.355432615451141909e-01,-3.365388364914800312e-01,3.527861495069087305e-01,-4.644546875160799893e-01,-1.148848413555061398e-01,-1.998829928582856186e-01,5.039133714069793379e-02,7.803230460396165524e-02,-4.042065994180960575e-01,2.891106065151519133e-01,-3.338689407462654968e-01,1.013538966190144386e+00,-3.356813335329191239e-01,-4.329387335143263654e-02,-1.607860152816274479e-01,-7.544810596281048554e-02,-5.524543075791356062e-01,-2.831360380668126453e-01,-8.274208918288615822e-01,2.948815952344549518e-01,1.808508788887574603e+00,8.240440532102601967e-01,4.025095520843666730e-01,-5.794479943190512516e-01,-1.359247302187715389e+00,-1.373136335032880906e+00,3.541653269476946475e-02,2.095714901285760323e+00,-4.774621239721842381e-01,1.349257372408258215e-01,-8.243838753849054291e-01,-4.879010285045287110e-01,1.504458274853478716e+00,8.429063805733156833e-01,1.900128262868677975e+00,3.403783261761799128e-01,2.010731623169514926e-02,3.455849527126065857e-01,-2.279760820420571599e-01,-7.374816902837932897e-02,7.114988378696400773e-01,1.129993185986617021e+00,2.227491732700064730e+00,-5.031233586337929831e-02,-1.665869158594836530e-01,1.288952324465634236e+00,3.057011925716247358e+00,1.380357366000222630e+00,-3.017835930250718501e-01,-2.193136449166048219e-01,-1.255652624174652399e-03,1.266551501276702574e+00,-3.948502454653601834e-02,2.693377007949760982e-01,-9.250392583350861564e-01,2.683224584452976735e-01,-1.631199688510165391e-04,2.286345358361006053e-01,5.474373257799490800e-01,7.926748990979594067e-01,1.508455360933943945e+00,6.950778618067681158e-01,-7.393547494250640728e-01,1.444951381960166703e-01,2.437502015587428850e-01,1.043541212664042428e+00,1.394025846041625272e+00,-6.834225697795637267e-01,-1.688045388715588291e-01,8.407018405112684500e-02,-3.899161006905377258e-01,8.715810941887884855e-01,-4.852487677236644315e-01,3.394711752539431027e-01,-1.193252888987694993e+00,-2.034707360760511785e-01,6.972718808454864137e-01,-4.225572415490037037e-01,-9.145771882039793743e-02,1.817998557864994202e+00,7.794049543171738259e-01,-9.715415515969541005e-01,7.942473902602458224e-01,-4.605129370051086468e-04,5.481737172659668644e-01,4.848956038145181835e-01,7.885926419462178094e-01,-1.138033431021092001e+00,6.531536363317412830e-01,1.504775499873017286e-01,2.460747878695700164e-01,-6.331709863072931821e-02
5.981316258287731058e-01,7.265360980037742777e-01,1.564751330086843195e-01,-5.742467300604969793e-01,3.476995900948117724e-01,1.562939254559371216e-01,1.023491329441024167e+00,-6.384300862401404153e-01,-5.149818537951564856e-01,-5.235019484993522210e-02,2.896657910500318733e-01,-2.554898863193919012e-01,-4.253335237420708403e-01,1.933764615097761097e-01,-2.639766317953968766e-01,8.649593647441280453e-01,-7.210720674594111035e-01,-3.567373645033268814e-01,1.200638649683319903e-01,2.712176546814793962e-02,-6.424201138008498457e-01,-3.137123253762377217e-01,-7.315219727630678515e-01,4.137433840637074756e-01,1.673362839984030126e+00,4.952243633912634668e-01,3.873923586036802647e-01,-6.888089417206059162e-01,-1.288355326198138862e+00,-1.182341474457814012e+00,3.108857876008497834e-01,2.307361069432971590e+00,-1.369667187983580059e-01,2.637003421554363625e-01,-7.183593730583228698e-01,-6.007264569736715520e-01,1.284005725212104876e+00,8.681569257971912812e-01,1.973463682948717990e+00,4.532801181787354805e-01,2.484743299990780363e-01,4.799162196777597700e-01,-3.845399561863234172e-01,-7.318294553992854556e-02,7.411557924823019006e-01,1.098378827619206133e+00,1.864135881731864508e+00,-1.176639530969479930e-01,1.123409273783182033e-01,6.445880745791960909e-01,3.504757015549748278e+00,1.683541554633915194e+00,-3.223144406055209465e-01,-3.605330429991180363e-01,-1.856549616137312952e-01,1.331296632227864984e+00,-7.306750677165479990e-02,1.230419195152308021e-01,-4.572906360102206857e-01,6.383674911878458591e-01,3.546503379220811158e-01,-5.269442544004031559e-01,8.426200324199208114e-02,4.153947456903072655e-01,1.157611648522926417e+00,4.647155828724037763e-01,-8.646870815682625722e-01,5.918644840243235672e-01,-2.775541278302827153e-01,1.170707638574897125e+00,1.537302581835188864e+00,-4.106727125122671129e-01,9.588108848667188655e-02,5.469281056224617465e-01,-2.501997725643946846e-01,1.059098145228511534e+00,-6.737515486997709413e-01,6.735806675586347714e-02,-8.496981885016134939e-01,-6.567940551462279064e-01,3.458667517432283400e-01,-4.730753059897366275e-01,-1.883616714973516681e-01,1.960466506805129239e+00,4.612638042034817865e-01,-1.052332227759801953e+00,6.186047691192684272e-01,4.461693745737036476e-01,7.633530692296524034e-01,2.859520675675095158e-01,7.604961173341723280e-01,-7.365929487934164133e-01,5.063679127871035801e-01,3.967645362647008178e-01,1.187005926591464811e-01,-3.155745990726016581e-01
1.144279464616413611e+00,1.270353835979871837e+00,5.753392084234504322e-02,-4.326610047701270889e-01,-5.675039894910182126e-01,5.992982254963119537e-01,-1.977773345348035616e-01,6.122761198598544174e-01,3.179418849036014905e+00,2.623128263019126605e-01,-6.491654536660971253e-01,1.356438523648466621e-01,-6.465591435439170809e-01,-3.161618752944473920e-01,-4.043182603032535738e-02,1.350084889400162247e+00,-5.712871117487042794e-01,9.468583150672793547e-02,-1.662624925585270419e-01,3.723002423540210937e-01,-1.187606994419473150e+00,7.033140352960695063e-01,-4.108918257667748541e-01,-8.817997709447381038e-02,1.468366380052192444e+00,-1.344318932582840576e-01,-2.625272149116314457e-01,-7.045343506758618979e-01,-1.291399245203148416e+00,-8.740348490989333641e-01,5.718548281692232838e-01,2.932558801444016261e+00,-2.531206922928821990e-01,-1.044143675592662523e-01,-8.064152346552465600e-01,-3.077828988371040797e-01,2.389998524083880138e+00,5.674769440684577226e-01,1.003218713868928802e+00,1.090797860843369715e+00,1.337643710903711147e+00,7.243314354955725509e-01,5.223759276590023148e-01,3.484239826754549352e-01,8.033247857466232489e-01,6.764796985680333608e-01,3.214617928563473725e+00,6.473579848885606669e-01,4.489119989126216792e-01,2.470976692716625456e-01,4.500289394800657483e+00,2.194990922233154507e+00,1.262950139261512117e+00,-1.493829631752430220e-02,-1.992156231096713359e-01,1.144197721675931367e+00,-2.515678410301650514e-01,-8.812264735755424017e-01,-8.626250808591815478e-01,1.848712291939076824e+00,-1.085206286684354537e-01,1.844523068557442080e-01,-1.927281152844505796e-01,2.240113872285663388e-01,1.303772706099169509e+00,6.734506081957145618e-01,1.653922893366407409e-01,1.633990535160575908e+00,-1.392694519162965272e-01,-9.214521859743698418e-01,2.797165082144582371e+00,-4.008206508277293856e-01,-2.022948533276047733e-01,-4.046607068253202932e-01,5.791943377699856343e-01,2.330446620570723049e-01,2.123157622132426092e-01,-1.673285511795936653e-01,-1.622472059803455435e+00,-2.290310477046869631e-01,6.516126531462117510e-01,2.133055101377529794e-01,-6.917390358805457495e-01,1.598480554700504097e+00,4.435227367220498929e-01,-1.058169302355640218e+00,-1.251761249166533085e-01,1.769278024123651871e+00,1.249804847215298942e+00,-1.929194004307480226e+00,2.459177436831494923e+00,-4.301594985766208357e-01,2.058648467133152860e+00,6.010770945331321835e-01,-1.638881349929316666e+00,-4.902786003560893890e-01
1.039207645985203765e+00,1.821443911827065998e+00,-1.761686380981013489e-01,-8.812135739430579928e-01,-1.840008368587081888e-01,1.815687843847494931e-01,1.168683124990136379e-01,2.944689894978728129e-01,1.521240503366525942e+00,-1.018742100179848842e-01,-1.818266140047594681e-01,2.474855184155281274e-01,-4.360434861839017628e-01,1.078665783767850800e-01,-4.508899459135882748e-01,1.420728659003864136e+00,-1.974782371135486159e-02,-2.196149671493438094e-01,-3.339467174918595016e-01,-7.864246459042067983e-02,-5.786717495103911313e-01,4.338555379527232470e-01,-7.176827969968457843e-01,2.816959807557933848e-02,1.808086676855157116e+00,5.098532802773835249e-01,-1.357257884313628205e-01,-5.821491939123381032e-01,-1.562034600757741032e+00,-1.435015475906840532e+00,2.503689850974240572e-01,2.280309788214786249e+00,-3.675941828495377095e-01,2.068842546880951538e-01,-9.593699824736668935e-01,-4.487762284430668602e-01,2.290450019108149160e+00,4.413205919549916256e-01,1.643593808354212538e+00,3.895830967177599247e-01,6.596944839729638188e-01,4.248502610473747221e-01,1.128734545477931978e-01,2.555134145243674881e-01,5.346974695868773608e-01,9.039105251675677577e-01,2.653003328587925314e+00,5.318357604803350958e-01,1.630264191521354211e-01,6.008876457311320696e-01,4.092757138210372680e+00,2.076191945087703772e+00,7.149109773568297355e-01,-6.927308581554436628e-02,1.337096852573923522e-01,1.121121333181589241e+00,-1.864225521454104806e-01,-2.885290789739362038e-01,-1.360099645312862204e+00,1.353298017670069520e+00,-6.339468230114482239e-01,3.136190754184714491e-01,3.787225216310254883e-01,2.406714399458881881e-01,1.432778292074354365e+00,6.702256008395250930e-01,-3.671759084087996561e-01,4.357321786810554598e-01,1.054046473015625152e-01,2.993807268203665384e-01,2.130722421787790477e+00,-3.916064126070090690e-01,-4.250358601894685950e-01,-4.049592686813857645e-01,2.034520230109445049e-01,2.131624474086416532e-01,-3.741306660585416721e-01,1.691581474879420566e-01,-1.638452544039476599e+00,-2.258573974956203656e-01,1.258169030840625702e+00,6.232444715014422154e-02,-4.852205831932199787e-01,1.678904801782371337e+00,8.896730445620897321e-01,-1.181768299575919778e+00,2.874834373772886531e-01,3.743338627537001750e-01,9.895183694793450169e-01,-1.134818735395991984e+00,1.618180795915727721e+00,-7.760384298176179474e-01,1.417527323245461268e+00,2.487433637500595929e-01,-8.644709643855621461e-01,-4.604172182491376164e-01
4.774950340171741359e-01,1.765146420666249272e-01,7.579678681811242991e-02,-7.005709530472393753e-01,-1.299525584766743347e-02,4.760978320520538598e-01,1.214718447622439079e+00,-5.593663063710999639e-01,-8.950784268550215916e-02,1.655586594610113926e-01,3.284626653506055316e-01,-2.439039525379989026e-01,-4.354815252937312975e-01,-2.323921587740303552e-01,-4.866807074782358855e-01,8.568490330692737356e-01,-9.171651056720044881e-01,-1.694096747110821755e-01,-1.707466252708948057e-02,3.852162462342559324e-04,-6.204159623194227535e-01,2.363224215985574861e-01,-5.239890275736561742e-01,2.332863364860115474e-01,1.954405073429168249e+00,4.393419237030133373e-01,2.842058023189306670e-01,-7.991716158787406377e-01,-1.991356430298785840e+00,-1.603251625102914968e+00,2.677195846006813484e-01,2.751773658565403569e+00,-2.199911662268143331e-01,5.922860248035624053e-01,-6.609594714866897647e-01,-4.143797103388358050e-01,1.582554123737330176e+00,7.219793179452320686e-01,2.524467370126888266e+00,8.888352648119506316e-01,3.789233742884208223e-01,6.887241889456472421e-01,-2.333011457412127454e-01,-3.195961620330591280e-01,7.306473330028964153e-01,8.952044033284797253e-01,1.833266941650320447e+00,-9.030763863460751495e-02,1.551337506959237500e-01,-1.243490648110067154e-01,3.711625872438002904e+00,2.448524314063462715e+00,-1.246606900281903019e-01,-2.457546199796279973e-01,-4.256030184287825091e-01,1.700930456735264995e+00,3.325925301373590104e-01,-3.913178718386381427e-02,-5.365962952727167945e-01,1.940606322219716073e+00,-1.033636008044608590e-01,-6.883829767407542155e-01,9.814516561495252589e-02,4.576026650029534348e-01,1.504974901810247401e+00,7.987814603480440923e-01,-8.726696729111782513e-01,8.472607798971640847e-01,6.964954131869136034e-04,9.956631742911279392e-01,1.431771063606501970e+00,-1.149372660032880189e-01,2.868026701011371915e-01,-3.456347171633808446e-02,-8.298204466471977014e-02,4.765880209150879510e-01,-1.002299519727464450e+00,7.790156698366745847e-02,-1.463119337387836172e+00,-5.985892529661408501e-01,5.503676177715511875e-01,-9.664688211667996076e-02,-5.037536027445785880e-01,2.376983404924102317e+00,7.402941931534100517e-01,-1.573672195352605385e+00,4.284301462021047890e-01,5.682996832234845641e-01,9.965919797893343368e-01,-3.823186721702155344e-01,1.060257044809540083e+00,-2.109126674578655214e-01,4.024511899007983118e-01,4.674269468846647957e-01,-1.931864999051419729e-01,-6.886398484353949412e-01
4.106158238284951523e-01,-2.628212382455253904e-01,1.481417623048266741e-01,-5.177943401482602015e-01,-2.030494224385205604e-02,5.194712918052201145e-01,1.108859076726109505e+00,-6.255449674890706246e-01,-1.562454224466323094e-01,4.352611087318701832e-01,6.968661149249304465e-01,-2.514369828871464430e-01,-4.308029309745498026e-01,-2.813419851672886440e-01,-4.182982370702311159e-01,1.090985473235472680e+00,-1.016540977973694471e+00,-2.423796656421955964e-02,1.585754487478131247e-01,1.330140010778590176e-01,-7.321842619381310202e-01,2.929354122909004210e-01,-3.599893591895602651e-01,2.966831806505699776e-01,1.787104364136280488e+00,-3.810308404861225545e-02,4.368048805726663097e-01,-8.152966591625194770e-01,-1.451840409569868040e+00,-1.267744573003017905e+00,3.156744459797983793e-01,2.847878627074882374e+00,-1.898435442330745349e-01,3.931535133124888781e-01,-4.868568882396662190e-01,-5.138959094577332243e-01,1.177839897464302732e+00,1.037015302744696221e+00,2.503896878428242267e+00,1.437411756166933730e+00,4.577736778016965324e-01,6.210195311150292774e-01,-1.748510495266216158e-01,-3.622547338486393764e-01,6.365768332032541998e-01,7.937708303676409560e-01,1.933434421892298083e+00,-3.851303224882967058e-01,1.208180092328616645e-01,7.985502077212580652e-02,3.660369132459634578e+00,2.169085484823763288e+00,-1.504400259330463951e-01,-4.344033647315870272e-01,-8.134832270948676447e-01,1.916086018564327365e+00,7.156840760867984041e-01,1.009686603701107077e-02,-2.236988080598729667e-01,2.102505205817161382e+00,5.515339789372720736e-01,-8.869848099341075542e-01,-2.030502962535837563e-01,8.026641761603332537e-01,1.212066389710305447e+00,4.615103904254761469e-01,-9.014690641639974134e-01,1.067239839499379395e+00,-8.970516834279559926e-04,7.355506362901619299e-01,1.700878579024696302e+00,-1.189119889185507595e-01,5.801634335740483150e-01,3.190022182302535425e-01,-2.381950466415156953e-01,9.189023744177367004e-01,-7.877099568282958097e-01,4.056210939012101502e-01,-1.090707726181572523e+00,-6.139893003472188804e-01,1.770370422344340611e-01,6.309197096255403370e-02,-3.510971066343967495e-01,2.211400877943022536e+00,7.419390580983620254e-01,-1.491737952506477116e+00,3.633695035477811364e-01,1.197517574299738374e+00,8.282911296675351531e-01,-1.864677027786815211e-02,1.282264827436190524e+00,-2.850804559730363286e-02,2.194145051578219041e-01,4.599051986443277729e-01,4.744745163626425399e-01,-5.692727064147202753e-01
5.186537495716925239e-01,6.494467527217406833e-02,-4.562242749796198149e-01,-8.868426191529469316e-01,-3.966061726321617464e-01,5.649453368695410704e-01,7.784657928445701813e-01,-1.444071511669129393e-01,1.975954389842216052e-02,5.935035140235094264e-01,1.483019857556543863e+00,2.366217411486133682e-01,-2.069946501325491406e-01,-2.318999028186638500e-01,-1.061210015467630274e+00,2.076426902813612863e+00,-8.773706796242830563e-02,-7.672819393442001368e-02,-1.576476491971552374e-01,-2.452890766912641518e-01,-1.773301102664419093e-01,1.149359812060394503e+00,-2.734261351925838524e-01,8.975229618886754190e-02,2.122862648322596968e+00,-2.664436294062667021e-01,2.056952148727891616e-01,-6.997700801455126740e-01,-1.497067036809293539e+00,-1.753207103098206154e+00,8.346899327701201576e-02,2.561333404748441733e+00,-3.806499746605494505e-01,6.035874132498642020e-01,-5.530382469296026837e-01,-6.424110967516600823e-01,1.522679832998989236e+00,8.837652226246077714e-01,3.176712478171668685e+00,1.739541049784794513e+00,4.378459562187743126e-01,2.819994312533131153e-01,-2.203852737517079247e-02,-3.087546935928069392e-01,-4.341927152789715194e-02,5.589295428760332474e-01,2.089113148262473185e+00,-3.210458315709762145e-01,-3.869096172341969508e-02,3.510341986060250274e-02,4.091155225453513289e+00,2.554211226288617631e+00,3.872287396310377661e-01,-5.094838700690750288e-01,-9.404890727744791290e-01,2.238654290327484198e+00,1.486703289083923352e+00,1.696580046869764768e-01,-1.053435834031264617e+00,3.436534452460502820e+00,-9.668532363613138725e-02,-6.444172322217140980e-01,4.010461281465756145e-02,1.015381554806203512e+00,1.165634016368283010e+00,1.718027726528145727e-01,-1.099149691626313041e+00,2.419431467650337009e-01,5.546979596878812702e-01,7.590693773044536741e-01,2.038042945347537049e+00,2.055742343491215318e-01,4.795346753763152226e-01,-1.790363252305376129e-01,-2.753233999862872428e-01,5.085636426835066226e-01,-1.061011747004798611e+00,1.302685803644189955e+00,-1.480080277182486581e+00,-3.847413123275472135e-01,1.171738233575483346e+00,8.965947207158588839e-01,-3.967101706279562712e-01,2.017138077175560706e+00,1.697239439694544938e+00,-1.951451624069612922e+00,1.831381688607720826e-01,8.395324680024705000e-01,7.314428165428019657e-01,-4.914552242515373148e-01,1.740013987764323034e+00,3.139566610869047869e-01,3.081991025162866826e-02,4.789182554753840249e-02,1.174415407981922232e+00,-8.236844274696708545e-01
7.448530927828400650e-01,1.732135600772803707e+00,-9.981591539816553338e-02,-1.373157219838835985e+00,1.510423017984853788e-01,-2.863060800055011179e-01,2.225516293273626101e-01,-2.114313349580457246e-01,5.452738313486471533e-03,-8.112969882132323174e-02,4.923689855393493797e-01,3.784309544255055058e-01,-2.703510014416801166e-01,1.909527050382512914e-01,-8.022682157530662828e-01,1.530434057851046248e+00,1.484654230328728564e-01,1.793650593844794972e-02,-4.252230573691992976e-01,-3.357838137040008997e-01,-1.891841970130858641e-01,3.496521863013115627e-01,-7.385878715906655234e-01,1.161500018964261305e-01,2.147147569373311082e+00,7.899016304281696321e-01,2.660166837454480127e-01,-5.423075290395870107e-01,-1.708215308243651087e+00,-1.873765527727610847e+00,-1.688742751539211162e-01,2.044834753674564354e+00,-6.625440472522002855e-01,3.948613736650637973e-01,-8.581569262868764536e-01,-4.768739824125122762e-01,1.805780554661123638e+00,6.963112827626894985e-01,2.535776502650531228e+00,5.969950243080410779e-01,-4.031587516047252517e-02,2.137457635456567195e-01,-1.148219203822325868e-01,-1.660681609500714861e-01,3.329537185822243339e-01,9.544522438809035503e-01,2.272648914900576411e+00,-2.177167343002019140e-02,-2.968338965137535257e-01,1.064834682277600475e+00,3.252358503530397016e+00,1.838818494767512135e+00,-1.510718054851351022e-02,-2.017722732303089961e-01,-1.170279825747707614e-01,1.580949878168986134e+00,5.397526556915902551e-01,3.686400571464011344e-01,-1.475986732176890026e+00,1.387097957805409898e+00,-6.030049987625812902e-01,3.821061867362948172e-01,7.896091162863662083e-01,9.759923097194114217e-01,1.685038328630749982e+00,7.137392648921585536e-01,-8.889965335643454925e-01,-3.440098706914683779e-01,7.318469634791656686e-01,1.100949813678354428e+00,1.426111362240570557e+00,-4.291267879478402048e-01,-1.863358931775792593e-01,-4.585509290844260732e-01,-4.034124917029806023e-01,4.066987088670364070e-01,-8.009957680756081277e-01,8.709701824815189175e-01,-1.682406560117187588e+00,-8.818894832768431336e-03,1.380013328121396210e+00,1.440568283364167257e-01,-2.082072904297048721e-01,1.888143983670325543e+00,1.463632246250718527e+00,-1.424838907787364661e+00,6.924832416268891233e-01,-3.261610915166965885e-01,5.375891273440810414e-01,9.508079422389609237e-02,1.053870316492504733e+00,-8.281973664813000457e-01,4.514306636304175613e-01,-9.523208986101261431e-02,5.864987140532755827e-01,-3.105735020357824339e-01
6.500784005742950011e-01,-1.734818247306812999e-03,2.746849459627023760e-01,-3.254955958116676484e-01,-2.418130455889564434e-01,6.066663280846582573e-01,5.456600442378090055e-01,-2.096712148653061547e-01,1.310474818373086991e+00,5.302868493410910489e-01,1.732650371218349417e-01,-1.757550690554365858e-01,-5.709180931938520054e-01,-4.081612252010382580e-01,-1.128923535990588034e-01,1.147809495279703995e+00,-1.102753493600098222e+00,1.779719109121892240e-01,1.616272620009235883e-01,3.948474352327996373e-01,-1.114271365397895286e+00,4.210939316160540180e-01,-2.637192067585034105e-01,1.774347155644212803e-01,1.522850409038577046e+00,-3.332302999616138517e-01,2.617871640252209531e-01,-8.165016383764833741e-01,-1.150419431272933446e+00,-8.572190658203699964e-01,4.889271017193586588e-01,3.075913047925689536e+00,-1.860881371017256702e-01,5.421928052674572507e-02,-4.950357224913980447e-01,-4.231106301646250234e-01,1.434423705788427927e+00,1.040733300731936595e+00,1.783135163799532297e+00,1.643865628122812561e+00,9.096919638965130783e-01,7.258430961871009668e-01,1.671914213962477080e-01,-1.334479817571336824e-01,7.919100480101981532e-01,6.940552560055527342e-01,2.533976189904727061e+00,-1.296610063989559747e-01,2.717812629160512583e-01,1.880855584097868016e-01,3.918398921579368643e+00,2.037737039865524125e+00,3.698540516509091214e-01,-3.303089113969787105e-01,-8.005976644062369196e-01,1.709067898172736522e+00,4.453162392702393890e-01,-4.035847893905828432e-01,-1.574403674005265819e-01,2.018701848334417459e+00,7.284328251735583404e-01,-5.942911487637847490e-01,-4.218757548530246426e-01,7.492518992138862410e-01,1.149170074295736699e+00,4.674157747511824557e-01,-4.076603588384709598e-01,1.658178521200439626e+00,-1.111822459494814508e-01,-1.957748779098698044e-01,2.255572618277707164e+00,-2.747258130048681468e-01,4.701131352193190782e-01,2.164644403217901303e-01,5.003673729244055568e-02,8.826149686212038104e-01,-2.033824962010309378e-01,1.866653213983982540e-01,-1.121101779771420226e+00,-4.755285771163932917e-01,-1.851285017329762361e-02,1.195746841514092329e-01,-4.424909367255457360e-01,1.945145928875577690e+00,4.694761138119635802e-01,-1.237869263909937123e+00,1.215690244261296016e-01,1.929985315789315869e+00,9.562687939711755902e-01,-6.251094554486693600e-01,1.893503012436638988e+00,-8.654680685805532514e-02,9.338610839369847483e-01,6.068725623072428466e-01,-2.185900619890839280e-01,-4.572965017243942332e-01
6.104495009000729944e-01,6.213474041019150240e-01,5.171232880674331289e-01,-1.018358715321347585e+00,-1.412483515839580983e-01,4.967156238532510759e-02,1.223818918059088601e-02,-2.647957111130081476e-01,1.454716653748667987e+00,4.479607095852077281e-01,-6.567239216009523872e-02,1.356390505615404640e-01,-5.538537012584193731e-01,-5.405382147330162201e-01,-2.861404220793959952e-01,1.082407224018637315e+00,-9.603137055684045631e-01,7.513870143990954986e-01,-2.035535199365539338e-01,2.643543162427245408e-01,-1.002404834274109202e+00,5.335122369221687588e-01,-2.841628030130918248e-01,1.254910031473210896e-02,1.889373728972376432e+00,1.927487538208372542e-01,4.151660106934212946e-01,-7.732884986466352917e-01,-1.724120947448789742e+00,-1.375772738260312433e+00,5.330671606789522121e-02,3.092557888418073997e+00,-6.882401415326313554e-01,1.237709316497286882e-01,-5.356397572262134865e-01,-1.491910114771805573e-01,1.624407319490719148e+00,1.041950076285466320e+00,2.173903040973095280e+00,1.753582224648408294e+00,4.779680454519199539e-01,7.161227928809995591e-01,3.185746861725169965e-01,-4.482030172231742382e-01,8.648176262992615104e-01,6.903906416985023942e-01,2.757656688487154284e+00,-2.378145928635972961e-01,-1.460066407765382435e-01,6.349656165796921936e-01,3.112219905543248899e+00,1.977545089630574626e+00,1.128355755766696222e-01,-1.155945161367981089e-01,-7.747885611969529407e-01,1.930270518732565943e+00,7.716349736199176190e-01,-1.440787761096733177e-01,-5.806227483732053773e-01,2.037478987284709220e+00,1.952682417820225669e-01,1.524160167087929008e-01,2.173111190586695385e-01,1.406409649882712554e+00,1.883620769334920286e+00,1.046043701344471666e+00,-3.980065864702418410e-01,1.230846427221258477e+00,7.404929299619695815e-01,-1.638697824314512275e-01,1.673744606457242545e+00,-5.105442785017988427e-01,3.807537393316045016e-01,-5.780380385838883583e-01,-2.099048996580746840e-01,4.691741574071194298e-01,-2.719232532010941727e-01,5.072337060477891679e-01,-1.822710152542338147e+00,1.042190751567875773e-01,3.062540819761859767e-01,2.098877242017402889e-01,-4.184031050224332193e-01,2.167646354532429598e+00,9.592390152591574459e-01,-1.430439251863930838e+00,4.035531436687416207e-01,1.310016880302397269e+00,7.205691503690427879e-01,-2.537531700128546341e-01,1.779599001223342469e+00,-3.473884912844755202e-01,7.547138123495396034e-01,3.521035088611197406e-01,4.209943815057251570e-02,-2.758496033802234626e-01
5.759313675453943127e-01,3.668921364821023934e-01,2.027045339720623396e-01,-6.653868419802824175e-01,-1.146525961840012819e-02,3.185103937885357950e-01,7.078606968215217510e-01,-4.183487248436275618e-01,4.166713817716103385e-01,2.908447601876001376e-01,3.151853722237619726e-01,-1.084516546172442364e-01,-4.674129456288996232e-01,-2.149561331425999811e-01,-3.429860663456181236e-01,1.082683143491094846e+00,-8.456186244871646274e-01,7.300233706428724267e-02,1.663899272854436201e-02,1.357029990242199502e-01,-7.835151502712784932e-01,2.551909642003634127e-01,-4.476246841686457034e-01,2.180293568997116183e-01,1.773720239666755294e+00,1.577643743672436372e-01,3.453840956143806595e-01,-7.570344727128405227e-01,-1.479306796808971258e+00,-1.268898760419007843e+00,2.626541600313652691e-01,2.753313972449790370e+00,-3.076023303309114443e-01,2.687713041238600775e-01,-5.955753170354980419e-01,-4.356004796335637419e-01,1.440907139832012351e+00,9.368224434344679663e-01,2.187150138539786237e+00,1.213930522216758456e+00,4.766335787305527871e-01,6.028128059014822293e-01,-5.177350493629220840e-02,-2.423032267482790325e-01,7.076690292852516606e-01,8.347491181000368243e-01,2.219655045534800308e+00,-1.799374685473840718e-01,7.755182431511015162e-02,3.670630347589419751e-01,3.578892286654778765e+00,2.021592137536179834e+00,6.863236968880803701e-03,-3.009627243164360033e-01,-5.772860030207869197e-01,1.704617112684841285e+00,4.559506441582490965e-01,-6.574671690814783143e-02,-4.685126659150122830e-01,1.723987295275001941e+00,3.107220329994508923e-01,-4.390064976310966705e-01,-5.884195950472712738e-03,7.904617008977168346e-01,1.371897732432445949e+00,6.177617644605406522e-01,-6.906991240847573099e-01,9.848772029073393774e-01,1.116284517867056070e-01,5.107135867030035969e-01,1.747030064948803751e+00,-2.994863373286018593e-01,3.241754252442586304e-01,7.504219159933595007e-02,-1.626668329572076299e-01,7.609134674482265215e-01,-5.703828662584173870e-01,3.170350783840361064e-01,-1.272332760076568592e+00,-4.136591942158902024e-01,3.458494308590439603e-01,-4.165107222454028646e-03,-3.590481245380356401e-01,2.080478729480713884e+00,7.324981109597397122e-01,-1.345288466573127728e+00,3.950577424165844231e-01,1.035008857921111414e+00,8.224652716910877404e-01,-1.842139482765028924e-01,1.369906578241379069e+00,-3.187391188659122188e-01,5.746996856482393667e-01,4.127117820629113698e-01,1.066977096641674033e-01,-4.400755454865149519e-01
7.167417700205488407e-01,7.106891562196222534e-01,3.080242473204279907e-01,-6.871831994430073198e-01,-2.288506467476061901e-02,8.743404047699931958e-02,2.373320979025794752e-02,-1.992987254030889055e-01,1.042079028632896254e+00,4.328680566012491626e-01,3.501099509371653484e-01,1.194901380856798062e-01,-4.829786389148759129e-01,-1.666446616990071017e-01,-2.283179763485783109e-01,1.447963871040756745e+00,-6.417111831993358440e-01,3.703703881718962698e-01,1.179781649722851794e-02,2.542594839878966062e-01,-9.197575163322159186e-01,3.353920622413436026e-01,-3.652219697384999630e-01,1.793627295874697103e-01,1.590900611837157586e+00,-1.666010212050304806e-01,4.018319916656174495e-01,-6.846365929311216680e-01,-8.598962871912843031e-01,-9.176578361950630258e-01,2.165090211941120002e-01,2.696588356467574776e+00,-4.505955924456885864e-01,-1.152143163575264084e-01,-5.348112476171520413e-01,-4.704591330902735957e-01,1.310546546064900841e+00,1.179502691554525029e+00,1.824142778162144651e+00,1.598300486688202904e+00,5.673367554126175216e-01,4.533258423923839375e-01,1.816148000126843742e-01,-1.374120245461945555e-01,6.180469624887425795e-01,7.527595387785243064e-01,2.716920697761313619e+00,-2.756289275539881567e-01,-5.092368379132823641e-02,1.019414214171668442e+00,3.419091447962051333e+00,1.501697933749402303e+00,2.035695975046478978e-01,-3.661807088844021285e-01,-7.439623314390024778e-01,1.718923436306345032e+00,6.572456867756162335e-01,-6.542734049030148047e-02,-4.952089813666893936e-01,1.510853430971686562e+00,7.301815547273926565e-01,-6.022608601293999442e-02,-7.166437459807689647e-02,1.228323082234449526e+00,1.224916597685766995e+00,3.839435652257307541e-01,-4.844931122067815954e-01,1.029196395162759181e+00,3.210984122153984210e-01,-6.063801260996803943e-02,2.140919479951894022e+00,-5.196034383310184079e-01,3.317850794090829170e-01,1.461308298868949085e-01,-2.767847339005614082e-01,1.066454064731314322e+00,-5.996833092984554803e-02,6.988871316715239423e-01,-1.085734982300971652e+00,-1.432166204137157450e-01,2.131706769571493076e-01,1.686839477015170119e-01,-1.735540687914676194e-01,1.687784380162083098e+00,8.224337315288350325e-01,-1.091856837616606013e+00,3.603579539852355684e-01,1.513265011393024828e+00,5.836919597627090450e-01,4.721615920944299827e-02,1.765767194153251340e+00,-4.655014527598950180e-01,7.754708589841744493e-01,2.900552532325627597e-01,5.436528370681590339e-01,-1.370283219242520167e-01
8.453808375698506072e-01,1.703537902228183132e+00,8.778161492808951583e-02,-1.153905466419095971e+00,5.963202387130515925e-02,-1.765591696246593956e-01,2.471597311124845708e-02,-6.896522993956701042e-02,8.536021037135212985e-01,-2.913138420717586996e-02,3.315905992955459070e-02,2.953357671950873620e-01,-4.040446605538879354e-01,6.212711079379622942e-02,-4.970222669121557857e-01,1.344066563141812276e+00,-1.445113691188449068e-01,1.385094052578442481e-01,-3.465300926585098140e-01,-9.387911469974152823e-02,-5.398401256361253786e-01,2.897543716505247557e-01,-6.751725546032466552e-01,8.227743135070568481e-02,1.930866053589880726e+00,6.317544660637798293e-01,1.979693014077266444e-01,-5.850901112445977548e-01,-1.572820423907371534e+00,-1.546250675359777116e+00,2.994938720719708680e-03,2.294881073484765110e+00,-5.990385577228558578e-01,1.859043353907464668e-01,-8.371872801275533904e-01,-3.888722663751198461e-01,1.897466833193845570e+00,7.181980540043361172e-01,2.012391334949374055e+00,6.985649398055927550e-01,2.649672765094394089e-01,3.763128771643840520e-01,5.798587426062156575e-02,-5.905807646393736177e-02,5.707608314517096382e-01,9.251087541513123291e-01,2.568136186067281113e+00,1.176941715822450302e-01,-1.456179917657672851e-01,1.021494371466685980e+00,3.372421408407221932e+00,1.769038259940588942e+00,2.005411164358060772e-01,-1.243561605893899746e-01,-1.144656387724126700e-01,1.422635117603040733e+00,2.430683405087674664e-01,6.047530017304106331e-02,-1.232916796391366532e+00,1.193536413213249325e+00,-3.741394404298024057e-01,4.332015072288823987e-01,5.720390903103307334e-01,8.685686793179091536e-01,1.658156394677151813e+00,7.883841398643209875e-01,-5.612748119540095226e-01,2.402923998270422024e-01,5.286021597986344522e-01,5.337732236057917135e-01,1.690966563572768644e+00,-5.438585967022703249e-01,-1.964166178146692365e-01,-4.278287432827370118e-01,-1.956080177382741869e-01,4.352290151937333595e-01,-4.362650748338297579e-01,5.274219746026158617e-01,-1.643618096890514302e+00,-6.260512445071753085e-03,1.045033745293633354e+00,2.918615560161821887e-02,-2.886532122680791623e-01,1.815397209044471882e+00,1.096324281279188906e+00,-1.225773901768123064e+00,5.549268081243230455e-01,2.316392024693514351e-01,6.731199509733798436e-01,-2.452568272593851906e-01,1.346588979605750414e+00,-8.599244032862050080e-01,9.017966838376928473e-01,1.055824592165741094e-01,-1.826832490692947841e-02,-2.423675890532183685e-01
8.459438060376106572e-01,1.006456580628365183e+00,-5.055615755237122255e-02,-6.838262705476004788e-01,-1.406794125760347236e-01,1.850296156093322875e-01,1.766058869495062966e-02,6.126767053122517126e-02,1.051700952405744349e+00,3.611059879133894368e-01,5.935753543826338685e-01,2.491226102575228307e-01,-3.903445682833884822e-01,1.986671121257381489e-02,-4.327313239142457912e-01,1.819351700736043576e+00,-1.719886846941154068e-01,6.546693515901230720e-02,-6.276624710521751249e-02,7.906627703041779753e-02,-6.702596723578860827e-01,5.347038657675332596e-01,-4.397576700028377195e-01,1.487076023737255448e-01,1.625617154607478687e+00,-2.198527079054931332e-01,2.012988685699601266e-01,-6.107633016749043353e-01,-7.554337542324958132e-01,-1.007971262833686987e+00,2.407824097576028444e-01,2.415657059716979305e+00,-3.748851151283448813e-01,-4.621571822747716496e-02,-6.436129034692965600e-01,-6.133382601303128956e-01,1.521958774702368400e+00,1.006958855242000128e+00,1.858109347340166639e+00,1.359906651116511878e+00,6.401972660436112683e-01,2.829561390950262045e-01,1.530006049910603849e-01,7.223584034254540431e-02,3.341421010087763377e-01,7.382898539279455496e-01,2.702972019685423444e+00,-8.123723374971474065e-02,1.512054232036229295e-02,9.655606120521211810e-01,3.845354524673569863e+00,1.624679613755125152e+00,5.087785107217239755e-01,-4.088816563065682530e-01,-5.792839037503592081e-01,1.604279780176958381e+00,6.299497791536035063e-01,-6.836164037780220748e-02,-8.590044130592633387e-01,1.716909721045684289e+00,4.307481538089376061e-01,-4.298918973079146610e-02,-3.680509556581946368e-02,9.580297788235226930e-01,1.016849916138831578e+00,1.381303706765172890e-01,-5.462424122914947278e-01,6.443998215764232818e-01,2.391782927858420726e-01,6.628415426970624136e-02,2.401800880515874148e+00,-3.754351289783381396e-01,1.332147282516833453e-01,1.498555287873752917e-01,-1.767018098630970258e-01,9.558014169433614038e-01,-1.564143766492022969e-01,8.552231371470131460e-01,-1.059003699914813135e+00,-2.208339188519750085e-01,6.738472311362599942e-01,3.596690730784275480e-01,-1.937856399975641519e-01,1.490453346299262849e+00,1.027943365924566033e+00,-1.140139299775475124e+00,2.583509989346465807e-01,1.259477738554233506e+00,6.328651720534483882e-01,-2.984361672128817977e-01,1.858916271806968945e+00,-4.411456885505056214e-01,8.755302244904514808e-01,1.714507426955327873e-01,5.427853182392672338e-01,-2.654135712285759507e-01
6.798482855599304875e-01,8.928077161901512016e-01,-1.400191858625064734e-01,-9.206000917885462931e-01,-4.081155826392732916e-02,1.368480947627319089e-01,4.324429259645866663e-01,-1.965391066254963681e-01,1.793721342664219565e-01,2.491963885793255229e-01,8.052671864037665994e-01,2.098286107951869706e-01,-3.052628842691584299e-01,3.236829816385432268e-02,-6.896298120992414571e-01,1.682526354237207311e+00,-1.358936621680436052e-01,-4.111883971828679540e-02,-1.552080987180723404e-01,-1.366193238122512810e-01,-3.874113853414135611e-01,5.171667711201963780e-01,-5.177782632093257398e-01,1.719383559979596465e-01,1.914328608818644195e+00,1.436925691136128336e-01,2.693369275264071439e-01,-6.253951507057353698e-01,-1.273849845418312476e+00,-1.473636810151614185e+00,8.334902916261283101e-02,2.324522308951262328e+00,-4.269727100768724304e-01,2.949556660788380524e-01,-6.796805236899201574e-01,-5.908528725333025422e-01,1.526944388882048864e+00,8.898373062049624860e-01,2.448073894198877554e+00,1.139599903004609560e+00,3.149666924244439725e-01,2.788766357137674179e-01,-5.840939021806217102e-02,-1.319421250951053892e-01,2.785481156476553588e-01,8.033428226497699720e-01,2.279466853947839322e+00,-1.675860632455134780e-01,-8.871197300388465601e-02,7.240134937524524972e-01,3.666257957833527037e+00,1.917861097624319333e+00,1.774438417519139666e-01,-3.869553843277894201e-01,-5.125238543149455150e-01,1.750344818136349456e+00,7.703113915488200014e-01,1.741929343745492742e-01,-1.013664646711422090e+00,1.926575628401663520e+00,2.300102532919048870e-02,-1.685130197815828124e-01,2.319577131937096970e-01,9.346587500518812597e-01,1.252956619788364812e+00,3.358827514265636527e-01,-8.611315568009214605e-01,2.288425332456905936e-01,4.007530540294657051e-01,7.300552472785111213e-01,1.891934512514922062e+00,-2.403760740762591885e-01,1.516843310447004711e-01,-2.625290979768632460e-02,-3.072267652538140936e-01,7.306092107522604850e-01,-6.632012133432398926e-01,9.030617269161853589e-01,-1.291317827736314650e+00,-2.680943655464710362e-01,9.442874250956314608e-01,3.274422927419118889e-01,-2.320262725126269188e-01,1.809048395959338196e+00,1.263995181283330993e+00,-1.426403101370302018e+00,4.253800986040471299e-01,5.824864638567237574e-01,6.273412715986020904e-01,-8.832072313227357085e-02,1.423795015581940548e+00,-3.861665791131754233e-01,4.304812178591137517e-01,8.381227292258211503e-02,7.487843593590117752e-01,-4.242336259604083670e-01
8.066262457527803020e-01,8.069618108402054624e-01,1.775056314257664192e-02,-5.401894938040904259e-01,-6.613276429300304904e-02,2.054460384933625428e-01,9.018256280149594684e-02,-4.582048864147322820e-02,8.604602741593172510e-01,4.103872522727004535e-01,6.737834961893147678e-01,1.625883343715629481e-01,-4.039821350543505996e-01,4.858487370125666449e-02,-3.339658647241793843e-01,1.782583224241167885e+00,-2.969553169137792992e-01,4.539263539665089331e-02,6.347233386236328379e-02,1.543419511293675217e-01,-7.481073685693813147e-01,3.995178702848281582e-01,-4.190916279419197310e-01,2.253997629002708614e-01,1.509126815758013107e+00,-3.548086744024694927e-01,2.834668255006181914e-01,-6.240007932544355818e-01,-5.139768277043874622e-01,-8.125325398375452535e-01,3.039019773188850748e-01,2.427725475474022065e+00,-3.014404154615168974e-01,-1.342877733131341844e-01,-5.827756810770103879e-01,-6.699907892473229154e-01,1.303718781837463592e+00,1.131536624762065735e+00,1.762690160044430687e+00,1.441391910851701486e+00,6.556236417019055684e-01,2.780711460191354623e-01,1.063944863709242322e-01,7.656794988534579294e-02,3.648646815807014554e-01,7.553188559700538818e-01,2.657048829043557436e+00,-1.927341785124485063e-01,3.893026172881958180e-02,1.046853903923422591e+00,3.806940935929555181e+00,1.455389645221220940e+00,4.065833615922582744e-01,-4.906539650611354553e-01,-6.709872241660495007e-01,1.607784981137741376e+00,6.296237642286036662e-01,-4.768407167881062725e-02,-6.373427312271842116e-01,1.530530993259408001e+00,7.644685341891633845e-01,-1.974418163694191541e-01,-1.890712557023021545e-01,9.933467629180086078e-01,8.572568940770530777e-01,-6.391415049766258072e-04,-5.702530669076162351e-01,7.740786073152079449e-01,1.020575307298244028e-01,6.312916386316469453e-02,2.456160260757774161e+00,-4.047326465460216460e-01,2.366317088035908012e-01,4.225903950511628038e-01,-2.347793883787731573e-01,1.213061571475750888e+00,-7.502782370482669050e-02,8.481267994878591843e-01,-8.026456643396099322e-01,-3.086921676849114782e-01,4.231687787182299432e-01,2.782355252862572792e-01,-1.140923103510709802e-01,1.435086898540993250e+00,8.859797721970189555e-01,-1.031300199478940804e+00,2.691262981239750385e-01,1.476474729702265787e+00,5.830036527956847792e-01,-6.772108087404610233e-02,1.817690835541122762e+00,-4.365308191965761586e-01,8.069676597219506142e-01,2.180894331387507323e-01,7.257429099722993993e-01,-1.954853664193357266e-01
8.469283381793084597e-01,1.522910416319454008e+00,-4.229279164465929441e-02,-9.696433516005502629e-01,2.320425489944963338e-02,2.458421088049667080e-02,2.992814388509582590e-01,-6.360059217787904229e-02,6.942710386935135869e-01,-5.188718252745019854e-02,1.101294546926934181e-01,1.847865217643651636e-01,-3.941837250860120156e-01,1.147243199839583783e-01,-4.988773381038049126e-01,1.330461778248358540e+00,-1.601478080404861171e-01,-1.133496811620905986e-01,-2.616458017931698743e-01,-1.070711354428044715e-01,-5.096273580940162695e-01,2.640601074622815903e-01,-7.003677578209054344e-01,1.292072725810355927e-01,1.875983318322713256e+00,5.612169438875627137e-01,1.185465361002919632e-01,-6.003589981061151493e-01,-1.537271830471612422e+00,-1.493966781439021174e+00,1.293164054524057749e-01,2.261615641514064912e+00,-4.292848990056040148e-01,2.533635080603802159e-01,-8.563648642344673378e-01,-4.709129681310779136e-01,1.906756339105769804e+00,6.425798925163581643e-01,1.980535559748195062e+00,5.490547615688260441e-01,3.678173865079282234e-01,3.872546904017208358e-01,-3.330789465263730292e-02,3.238812611920648815e-02,5.362974639116427911e-01,9.440421064121993222e-01,2.408451796844691906e+00,1.960550565839406512e-01,-1.387790230887697707e-03,7.698398893326231507e-01,3.669287617741829877e+00,1.903076643713925709e+00,2.674084841895164044e-01,-1.698011409773908797e-01,-5.741430341090664191e-02,1.339421111600715308e+00,1.020795076129603907e-01,-8.839551828166897218e-03,-1.167886628665659732e+00,1.242899595692023018e+00,-3.647611301537502237e-01,1.702262959593752734e-01,4.273691110124214765e-01,5.674682801399139054e-01,1.471752534291631997e+00,6.566168000309542396e-01,-6.106548158923634784e-01,2.902549122238396451e-01,2.507069543766251019e-01,6.594202344031845353e-01,1.794643802757048379e+00,-4.227770341351450023e-01,-2.072856294148915923e-01,-2.360101917678037176e-01,-8.951142048803750750e-02,4.643981109355421188e-01,-5.322810627794873906e-01,3.794748437622712522e-01,-1.496225595140814324e+00,-2.217180230484587788e-01,1.049615668132989788e+00,-1.113026231820382628e-02,-3.353133669514761217e-01,1.809845762770989408e+00,9.727332766735025116e-01,-1.228624125407149936e+00,4.772967852756134777e-01,2.551522807376919166e-01,7.906103712611821654e-01,-4.358801352486977310e-01,1.303952558534310802e+00,-7.673538073208903132e-01,9.278653499445738140e-01,1.819347528109480638e-01,-1.868918107708062437e-01,-3.655987212753354920e-01
6.913319205101177145e-01,9.473680108337063643e-01,2.498875031299105376e-02,-8.695683534158522576e-01,5.087405947744767787e-02,5.414951207071649897e-02,3.491531044288653796e-01,-2.567245679061215258e-01,2.811991020736509528e-01,2.198257158992432125e-01,5.976207649200625527e-01,1.557828394744787959e-01,-3.603096209229237346e-01,3.664097921233225308e-02,-5.222949782256884887e-01,1.516822091549144158e+00,-2.925173860515266622e-01,3.885172432436992396e-02,-1.036798877448113776e-01,-3.547343724335045440e-02,-5.352880436105214024e-01,3.293033505813013906e-01,-5.343699029781245891e-01,2.044483511881972915e-01,1.814444858373433611e+00,1.734654793514841808e-01,3.292351739969288094e-01,-6.325522613188566678e-01,-1.172080852354885794e+00,-1.316328698118389706e+00,1.127681682841482624e-01,2.366659938609590341e+00,-4.285656346194006705e-01,1.736934996255840580e-01,-6.652915202376776804e-01,-5.567011870159761511e-01,1.449293343030318537e+00,9.577789960784570678e-01,2.217050949824401762e+00,1.112739664395724137e+00,3.215180926299253117e-01,3.265306799876069865e-01,-4.411310352258055595e-02,-1.231525423636613409e-01,4.248854630615875871e-01,8.491045417423880304e-01,2.352481914225565518e+00,-1.851339768179495748e-01,-8.887930712198162386e-02,8.841576299513429493e-01,3.512066701197595897e+00,1.723699748584503588e+00,8.980739469004123121e-02,-3.660866141040777233e-01,-4.883942942851030589e-01,1.664595133545904382e+00,6.122470302710738554e-01,1.421384461628126816e-01,-8.603033019088097699e-01,1.544570813004405574e+00,2.097925882873991066e-01,-1.053028813648485690e-01,1.991897788767121036e-01,9.735558752959384554e-01,1.267263014835382506e+00,3.866611140576463601e-01,-7.671798627667025805e-01,3.998765212905523447e-01,3.372668263430441682e-01,6.196244093612548465e-01,1.868039020385785509e+00,-3.733301141851727012e-01,1.507903683705438258e-01,6.527119413154440497e-02,-3.210742999449917034e-01,8.570544512043122287e-01,-5.004385973253512310e-01,7.642285697246189446e-01,-1.197972978480502659e+00,-2.459467584212708946e-01,7.179003564530137549e-01,1.592835365758909216e-01,-1.873282552542579193e-01,1.779956229656726396e+00,1.072045557346821276e+00,-1.268807444063674295e+00,4.734404997447348995e-01,7.083277828773715257e-01,6.004850531210603748e-01,6.277004176395467594e-02,1.383208450306240511e+00,-5.238520692259657219e-01,5.286921154068626727e-01,1.452393808204515691e-01,6.450238262927714405e-01,-2.980496648154247197e-01
5.663400687565582903e-01,2.732370721879733289e-01,1.493972984042912788e-01,-5.540258503630053344e-01,6.637920689504377136e-02,2.732394770082577917e-01,6.454867428855828315e-01,-4.584188228625703521e-01,7.803620356273976988e-02,3.870119105012604921e-01,7.010674575444401091e-01,-7.610390299168601214e-02,-4.130907191977503667e-01,-7.377000544714860941e-02,-3.525688515752714025e-01,1.354780663524185691e+00,-7.024789497320496068e-01,2.219095058061729131e-02,1.364385457070260710e-01,1.395679095913696377e-01,-7.327084717123225621e-01,2.104690379225625796e-01,-4.213558094131938381e-01,3.069441530510624849e-01,1.647321094978137390e+00,-1.207734195765555463e-01,4.408780075797373854e-01,-7.166222461488556128e-01,-9.600045328748613160e-01,-1.033893376922294660e+00,2.774648972454875073e-01,2.593308508245444788e+00,-2.585024397004371255e-01,1.205748037229704417e-01,-5.233769590057394394e-01,-5.987176129768172483e-01,1.126348403551484134e+00,1.135536232741925611e+00,2.158788592214663016e+00,1.388863666452000878e+00,4.489028047338011751e-01,4.370498134355703668e-01,-9.821014739681452332e-02,-1.861723733301897110e-01,5.366005256812078628e-01,8.223571066782985328e-01,2.218421725509376774e+00,-3.669844105049794858e-01,3.126716789365953375e-02,6.769851449210121386e-01,3.568826842527806242e+00,1.697277042350408882e+00,-3.999628618613909614e-02,-4.804231970567013899e-01,-7.368317122173571043e-01,1.762457058515896735e+00,6.607980173028005222e-01,7.016247219490259757e-02,-3.693468302410239934e-01,1.597710564241998421e+00,7.408202138427446570e-01,-5.485219497325779514e-01,-1.580716877406664611e-01,9.611459449182495618e-01,1.049814187355248452e+00,2.422185373376746775e-01,-7.942073627766571553e-01,8.614026410277269008e-01,5.803655815354309688e-02,5.389045142589309334e-01,1.949430584780180720e+00,-3.145898554920514290e-01,4.304597867900932795e-01,4.516028799596722987e-01,-3.257061304473721219e-01,1.165813269908054117e+00,-4.530534723593917512e-01,6.302430847980162731e-01,-8.745350660996737968e-01,-4.638338099173023310e-01,2.194506359052079136e-01,7.095032163432946071e-02,-1.702414520892305272e-01,1.844910845744856642e+00,7.825747395476942980e-01,-1.217418815572062440e+00,4.048294303134568617e-01,1.244018358429586746e+00,6.404955525980620124e-01,2.131045244093626168e-01,1.395139786753814670e+00,-3.121569439760133458e-01,4.033487452078046709e-01,3.253560236848332399e-01,7.456647705545529359e-01,-3.170515773300850992e-01
8.880229222631117469e-01,1.069086733205430795e+00,-4.600853671529620548e-01,-3.575627947098550252e-01,-3.732610155027565879e-02,5.934487977827476168e-01,1.072492564913175794e+00,-2.908266862869378355e-02,1.410831075566897352e-01,-1.366198907330359591e-01,4.113164984669877011e-01,-1.350911002092169411e-01,-3.507880804856836066e-01,3.757066120396458375e-01,-4.756768391674412455e-01,1.374398743283522295e+00,-1.181184046995193138e-01,-9.354242404813470912e-01,3.606188757945712892e-02,-1.448364085550649383e-01,-4.078952243431869240e-01,1.152301096985030582e-01,-8.048572188297702379e-01,3.095459910248511415e-01,1.632820173700438193e+00,2.827986746257094564e-01,-1.127803099013700849e-01,-6.169296805632505931e-01,-1.200686665315472190e+00,-1.214509462427570963e+00,5.338267405224598194e-01,2.050290380051036809e+00,1.172672560863292079e-01,3.719395228214534832e-01,-9.180934508979159414e-01,-7.884680446667524656e-01,1.855994404251760654e+00,4.593512508116458504e-01,1.766875384723245235e+00,5.196823405970518728e-02,6.819655346859821998e-01,3.483278885952735271e-01,-3.314609279643929152e-01,3.855204567300424268e-01,3.839311587456841757e-01,1.024490297319355259e+00,1.949731351678383184e+00,4.205266789648617887e-01,4.352297695981593995e-01,1.775526206355583225e-01,4.586910293535940930e+00,2.138187682635561693e+00,4.786005462307419411e-01,-3.597960633361846905e-01,1.347124091799862811e-01,1.023546207324795621e+00,-3.628623248116642497e-01,-1.875917455854374527e-01,-9.630275341463989669e-01,1.186135486319213062e+00,-1.986334996419137078e-01,-6.164665796584574142e-01,-5.314021379297899361e-02,-3.481668899937806483e-01,7.685538385221870605e-01,1.118717948630508496e-01,-7.641613912649396489e-01,3.761970260813002898e-01,-6.613285002981503791e-01,1.044793048893106313e+00,2.210603765135144894e+00,-9.578533018977500313e-02,-2.682084119524668631e-01,5.066912013478587218e-01,1.976029200528958696e-01,7.100426978238270070e-01,-7.357329929791276424e-01,-1.000803373749536984e-02,-8.754238762324523249e-01,-8.984209302006302966e-01,1.035201257275903286e+00,-1.588477137437472875e-01,-3.990696440869181405e-01,1.657780319902279142e+00,5.673482393960661563e-01,-1.127020053757042728e+00,2.523751879716035762e-01,3.615499151506031961e-01,1.088154373802148855e+00,-8.927193618249931184e-01,1.167113496552246499e+00,-5.626461983561998892e-01,1.027768496113991015e+00,3.846442636364795775e-01,-5.597815818188121018e-01,-6.670900452966418426e-01
7.826226137033509556e-01,3.467848572980225530e-01,-7.203275633082834029e-01,-4.341285403060501924e-02,-6.852375683796238515e-02,7.292931475750750181e-01,1.046713127157067103e+00,-7.657538445709266561e-02,-6.116413561901370421e-01,3.281466942248860708e-01,1.679568856504675356e+00,-4.080085402141836459e-02,-1.853390975556133413e-01,5.303909776141431109e-01,-6.600824806437266545e-01,2.250133314587334787e+00,2.023807422130454170e-01,-1.015201642191917220e+00,3.384736762700069068e-01,-1.474350678766704337e-01,-2.327996375623316849e-01,3.746809441926314266e-01,-5.727942389860215533e-01,4.688685047855478683e-01,1.408449939354295299e+00,-6.815819467162149703e-01,9.056472428577712341e-02,-5.689780532100219279e-01,-1.963564184573129978e-02,-7.382633228227806210e-01,5.851489107368221809e-01,1.855085760479126655e+00,2.532762467663027262e-01,1.361159688941652179e-01,-6.511572453768635915e-01,-1.194386048910644149e+00,1.078869273370415272e+00,9.720601288037754584e-01,2.039508769927306897e+00,9.015820464376236298e-01,7.301167242660842049e-01,-2.965200040811172277e-02,-3.770445934493278362e-01,4.207313589047892988e-01,-1.803870661786868279e-01,8.368347755433884760e-01,1.913492468074063257e+00,-1.291034963833432581e-01,3.564189872488934818e-01,5.643373468376536861e-01,4.788597535538999139e+00,1.677297148680092498e+00,5.139561049304565143e-01,-8.596247576104023569e-01,-5.358874434380048735e-01,1.448723193480991656e+00,5.475942591520767122e-01,9.919806195626909573e-02,-6.926438934961623994e-01,1.737056674675215184e+00,8.543012925172295269e-01,-1.129993490790785371e+00,-5.718527798708369358e-01,1.579844166706694808e-01,-6.171312443872545295e-02,-8.859531017077095782e-01,-1.094038638463596280e+00,1.921431112583689704e-01,-6.980341992063561207e-01,9.994258084005730458e-01,2.835429581972317425e+00,9.307035465062013513e-02,2.008814379940514483e-01,1.332120069082583402e+00,-1.679494539987932411e-01,1.590975229587514805e+00,-5.956255968022432512e-01,9.663528678578299225e-01,-1.105558741725243266e-02,-1.059915033524894135e+00,7.798793621809599896e-01,3.533983970803188379e-01,-3.554282489744714502e-02,1.186661153446743722e+00,8.970183942903525720e-01,-1.085559901526743420e+00,1.167481120002367423e-01,1.152188028325600522e+00,7.044242271199745442e-01,-1.745969099156217397e-01,1.483938524865137998e+00,-1.417873941880201105e-01,4.391065235617176432e-01,1.753630735342551206e-01,1.201979093227179218e+00,-5.672042654052189548e-01
5.781167688343555877e-01,6.088339389501828958e-02,3.268259016969332631e-02,-3.706893896192449134e-01,-9.727605160866119316e-02,6.803032416351173506e-01,1.190139070370919816e+00,-4.062021091278892881e-01,3.027024255848599910e-01,2.297260259385205394e-01,2.786644976469854207e-01,-3.238112715578322920e-01,-4.827001167618207300e-01,-1.920695885281425985e-01,-3.103662997220780762e-01,9.337329979906411337e-01,-9.708282494322406642e-01,-3.149942269283624863e-01,1.343551885588788186e-01,1.390385596930234502e-01,-7.870480669383101979e-01,2.087005764595511181e-01,-4.896627760930398754e-01,2.700730378946339383e-01,1.704748610051145086e+00,1.195697921080075554e-01,1.879071433778261302e-01,-8.045708179049886333e-01,-1.585842139853562704e+00,-1.228838547963148287e+00,4.842645727682586276e-01,2.784048426008817856e+00,-3.253881405901937196e-02,4.158038884206887720e-01,-6.424910806350286885e-01,-5.085146050607058932e-01,1.548931446601095940e+00,7.561279977606574221e-01,2.108541677731145203e+00,9.246952849044652867e-01,6.765107862548243034e-01,6.976354010480372292e-01,-1.812631343006240181e-01,-1.119851199383075230e-01,7.380990661983475309e-01,8.700632654500622953e-01,1.963665130262555625e+00,9.654875048147305849e-03,3.455923831399681512e-01,-1.670583471866007308e-01,4.070964782059860454e+00,2.345667710731218936e+00,1.287702885450520141e-01,-3.136312714459421058e-01,-4.401740051160147882e-01,1.542283645352830579e+00,1.322246513354707609e-01,-2.478272519271006447e-01,-3.473261878213209086e-01,1.826509509703762468e+00,2.232556998505985657e-01,-8.558269248755099312e-01,-2.222030356239763638e-01,2.297508543482568166e-01,1.168218555221948618e+00,5.342935221940902091e-01,-7.182408253557514000e-01,1.174709470299547975e+00,-3.559438014801736272e-01,6.741029572218327770e-01,1.857810274729783773e+00,-1.024907839243747731e-01,2.856217923912854895e-01,2.849467582896471063e-01,7.840691184866309393e-02,6.894594817111936447e-01,-7.452808652108791065e-01,-7.066700358583677399e-02,-1.147090482792040511e+00,-7.630804842875930083e-01,3.411538033538209502e-01,-1.175242767665189425e-01,-5.043525450438799407e-01,2.157459376104920779e+00,4.669232088608440967e-01,-1.377049998567319911e+00,2.565702890076068110e-01,1.061145398484777180e+00,1.088719047786484762e+00,-6.378459218434590072e-01,1.300216539266137783e+00,-1.634994764467002093e-01,6.944874608773934366e-01,5.933544031977887601e-01,-4.265558800542775253e-01,-6.795784172066885453e-01
4.844337076194326630e-01,-2.014583060450590990e-01,4.674985435109710874e-01,-3.769881886643221547e-01,1.796163197405013789e-02,4.279919312598951531e-01,7.443242467729748180e-01,-5.843309191197690877e-01,5.352451440568564145e-01,5.010442418104776863e-01,2.777207707368122280e-01,-2.903995624580672508e-01,-5.619379210296531202e-01,-3.703212246409033903e-01,-6.756885480687568890e-02,9.122728765059895384e-01,-1.314803820091841935e+00,2.489058653807687538e-01,2.496353597965060844e-01,4.007877725466139074e-01,-1.109207216487075875e+00,1.142366185222771779e-01,-2.973340086046473707e-01,2.968617342810611071e-01,1.544169352488600877e+00,-1.867893928800689052e-01,5.041055065198561946e-01,-8.362992005066250956e-01,-1.145952126842820995e+00,-8.647764608521238960e-01,4.049796691987634922e-01,3.048969191327276729e+00,-2.178780959113990612e-01,7.093733247572557576e-02,-4.237230327717806388e-01,-4.252586367042641147e-01,1.084888941632301984e+00,1.206726161904647210e+00,1.959490078561616500e+00,1.640547816538003634e+00,6.306684377509336192e-01,7.285770064945378266e-01,4.768702959281369280e-04,-3.151384379011945569e-01,8.931864397906210673e-01,7.882424937031233814e-01,2.288779846003777596e+00,-3.976865475274478645e-01,1.449769262020757510e-01,3.773817263961870561e-01,3.475108288111053323e+00,1.814993061266818586e+00,-1.068870044242226647e-01,-3.914752352969296245e-01,-8.828546139089841205e-01,1.805757820522426949e+00,5.228485124802277895e-01,-1.690103297972698204e-01,7.811427844154583688e-02,1.631895204760315909e+00,9.911591734611938653e-01,-7.072063743181521422e-01,-3.655533333194085355e-01,9.663337250351828889e-01,1.207718297383643336e+00,5.160725025440131564e-01,-5.932540597757377521e-01,1.581793438757036485e+00,-6.775285684962670252e-02,1.678422926237878587e-01,1.883708419021429270e+00,-3.669555223189748805e-01,6.206133404323749270e-01,4.196317376453916337e-01,-1.978824568414724039e-01,1.138339046306554803e+00,-3.128909511763018347e-01,2.166786637145089456e-01,-9.546926139884297502e-01,-4.989657720851803369e-01,-2.914745910245186700e-01,-1.000658400871942966e-01,-3.006030850572333213e-01,2.077519538003040012e+00,4.042920920206387048e-01,-1.193910875441979158e+00,3.373076198990113683e-01,1.771577038558316941e+00,7.958981485782556931e-01,5.686070531107251247e-02,1.504591104084547881e+00,-1.885595234912911256e-01,5.562638926803091799e-01,5.936654039046981302e-01,2.275977758027936670e-01,-3.276940283707434065e-01
8.791145336112196063e-01,3.566585174321359464e-01,-4.406196205603982730e-01,7.446679565363911735e-02,-3.111729333245584761e-01,1.077123364534131156e+00,1.264739543095868113e+00,8.228654177371524936e-02,8.009671357199661390e-01,1.136188645109919709e-01,3.152349403658424309e-01,-3.383320443655410403e-01,-4.554119662309272787e-01,1.111319546010500897e-01,-2.812863914801044807e-01,1.300824933753617740e+00,-5.359335151845769918e-01,-9.625234121873839088e-01,2.317829578009287794e-01,1.011750670461478707e-01,-7.182860302235253291e-01,2.959381865601046213e-01,-6.055023476945380345e-01,2.910260702063223737e-01,1.429173244215775185e+00,-1.905967386792460916e-01,-2.206679011930562095e-01,-7.301932282479512981e-01,-1.091960607915391623e+00,-8.972683610188523229e-01,8.268883982894168483e-01,2.473393254611236713e+00,3.436804519113759171e-01,3.213746615321185218e-01,-8.055757214055623283e-01,-7.736814714480241273e-01,1.859763754434283989e+00,4.906100113468424007e-01,1.531065318234516859e+00,4.374226730666713747e-01,1.145928200480546000e+00,5.606817300979396457e-01,-2.002084057896943992e-01,4.404522224194563629e-01,5.006432861277927415e-01,8.834012297752884546e-01,2.041123360712338020e+00,4.813852836117457068e-01,7.268987244182775198e-01,-3.866922659067598689e-01,5.078006934175150811e+00,2.428619943621893817e+00,7.922811355269930855e-01,-3.917762584616751864e-01,-1.040948954565001916e-01,1.072040203682273152e+00,-4.000368194323323801e-01,-5.677921176786141499e-01,-5.473689848052336604e-01,1.728564731594114168e+00,1.416187506359733173e-01,-1.055162498901850210e+00,-5.478714697980128223e-01,-5.851818461342649380e-01,5.437423245148854667e-01,8.257365528077709182e-03,-5.687967951548014156e-01,1.155013858147405426e+00,-1.028910473885157550e+00,5.147142420031971533e-01,2.624580490660296306e+00,7.335713821095340981e-02,-4.841597745175860168e-02,6.788396040448259061e-01,4.831427822868826771e-01,7.388964839187153189e-01,-5.821016383862323007e-01,-3.043095241001231299e-01,-7.546661744867475541e-01,-1.127926956281787518e+00,6.460219713650140472e-01,-6.453260023298268422e-02,-5.808726168426272540e-01,1.701717478714347864e+00,2.344005648853788593e-01,-1.153001671785929272e+00,-6.250216194156849037e-02,1.227382925432217942e+00,1.352952897008453892e+00,-1.489480747691214191e+00,1.594765459955624909e+00,-1.586744826618147197e-01,1.284688338327875323e+00,6.720658054159067696e-01,-1.055679462605461305e+00,-8.538183597185666773e-01
6.396926640391273899e-01,7.084275318106242336e-01,-1.618578328017177340e-02,-7.328864057447123104e-01,5.733642544569293731e-02,2.370223799761772276e-01,7.331829254058821466e-01,-3.580223884917050348e-01,3.043443934889955571e-02,1.531051977306093770e-01,5.341384406273954610e-01,-1.899882026552301983e-02,-3.758146658472887869e-01,2.897227207145652850e-02,-4.966249097313595318e-01,1.295992745095604359e+00,-4.627633203220893887e-01,-1.713038679247842755e-01,-3.323508359820177144e-02,-3.890576050624678511e-02,-5.379365577328316661e-01,2.247555130291207237e-01,-5.755504061338240218e-01,2.525399012199112114e-01,1.814995745274290195e+00,2.591412788870925965e-01,2.845492578299814168e-01,-6.776817969600025249e-01,-1.364634739831699362e+00,-1.359356618018234819e+00,2.173479864061265698e-01,2.412536326180066748e+00,-2.798666483856801501e-01,3.131744239518164385e-01,-6.883449242792134548e-01,-5.667514269671442007e-01,1.480366378485414192e+00,8.495282035996406522e-01,2.249126726205087579e+00,8.957090074237920030e-01,3.608845233737191238e-01,4.218797568652428720e-01,-1.684422101734898702e-01,-1.159365208162863176e-01,5.065288238274548993e-01,9.008440283727324749e-01,2.109374154805905288e+00,-1.109630606030028166e-01,4.670258500413491248e-02,5.307288198374029431e-01,3.685513662309332084e+00,1.941467093233345320e+00,2.702644536248521856e-02,-3.537158769832360328e-01,-3.961628032533741073e-01,1.589125405965270854e+00,4.016019823447830039e-01,7.607047351809831381e-02,-7.411634188228862774e-01,1.540229348908630724e+00,1.291648699477312423e-01,-3.800833161937207660e-01,1.204171131315250887e-01,6.553715244392180894e-01,1.234185480422822945e+00,4.347310015408145101e-01,-8.270944085928810807e-01,5.109627869050142879e-01,7.894753626908911082e-02,8.393700361996117021e-01,1.770304918457310306e+00,-2.682220046821985893e-01,1.524179462701173993e-01,1.674208650841491619e-01,-2.136335899041106878e-01,7.932108281255649818e-01,-6.830259421369202499e-01,4.709162128427515914e-01,-1.165383385566514329e+00,-4.599019302874584048e-01,6.701411911233934315e-01,1.238253430246941122e-02,-2.783927024592796062e-01,1.928159805773893343e+00,8.880139516392671073e-01,-1.315452147233491909e+00,4.518980466876366675e-01,6.175104469871850466e-01,7.574855935491737746e-01,-9.919503723221911873e-02,1.211182667950867931e+00,-4.516034255482045956e-01,5.124008394463333005e-01,2.692492839839894514e-01,3.191615523024516898e-01,-4.418773690920694830e-01
6.552321480931677655e-01,2.138063574068417294e-01,-1.643998328268601039e-01,-3.605860097354842142e-01,-8.635025270527786623e-02,5.024522213509629021e-01,7.059049238835093387e-01,-2.388917762048640703e-01,1.213296708207247665e-01,4.526305623722224336e-01,1.046106600775215112e+00,-3.164803156383438898e-02,-3.462914824906069278e-01,4.805749845026198452e-02,-4.676597812193612480e-01,1.742253465751498309e+00,-4.036219595331047572e-01,-2.659329425609290309e-01,1.935849115360014361e-01,7.412835388567307060e-02,-6.018938368943619333e-01,4.145385128596935642e-01,-4.047736621059157547e-01,3.164699931942854816e-01,1.562740861855526076e+00,-4.343468921709994213e-01,2.847191341919966256e-01,-6.796678298716425370e-01,-6.356009053784421603e-01,-9.160946243976124670e-01,4.000598753752299119e-01,2.438453678825989623e+00,-9.646525166038191768e-02,1.123455064626786015e-01,-5.426210292411337566e-01,-7.809619352642491741e-01,1.161493398900435015e+00,1.086635709721680998e+00,2.121199252012138992e+00,1.393915127724449476e+00,6.431507148268814644e-01,3.005669443139079022e-01,-1.079830756897994098e-01,1.848187328809699700e-02,2.688964872470098744e-01,7.593567547292752185e-01,2.214482714450922263e+00,-2.734136548865445104e-01,1.634629610896635443e-01,5.554350046208406111e-01,4.077209065531977039e+00,1.773567602280844202e+00,2.807560077011113098e-01,-6.045047856123035857e-01,-7.527419016801000229e-01,1.718211783174764307e+00,7.207213003399379758e-01,5.649745239433581756e-03,-4.821780109943598625e-01,1.911057498827508638e+00,7.850750598143675374e-01,-7.465994073440602730e-01,-3.581967551215762269e-01,7.282592043966940043e-01,6.705115192207384833e-01,-1.498570191907197535e-01,-8.381491516673060804e-01,7.475013981761959858e-01,-1.563905768040925737e-01,5.044056484345357250e-01,2.370063486086693594e+00,-1.363275447665289186e-01,3.939130347821969691e-01,6.738208118616111353e-01,-2.211987229270170330e-01,1.252631960643719955e+00,-4.534424348977016961e-01,7.916017989822525802e-01,-6.458932378604974600e-01,-6.347496627548415704e-01,4.151408905428093932e-01,2.895891450599909489e-01,-1.701862943021830721e-01,1.613312143383419883e+00,8.648813380154010133e-01,-1.224385527363555992e+00,2.235305449423313218e-01,1.398847800054200841e+00,6.947560003859084565e-01,-9.394927843396744249e-02,1.608598676184292087e+00,-1.437553101044033443e-01,4.767940811034915849e-01,2.881841799243609059e-01,8.596537796163259415e-01,-4.425927612494230945e-01
7.843596171108156989e-01,1.149471646297680838e+00,2.963674010212072329e-02,-1.161837433103765749e+00,-2.798754413056059320e-01,1.020112463353484156e-02,-2.574731741986862610e-01,1.122946789591151018e-01,1.418008353156103407e+00,4.284702583504967910e-01,4.887694166150838848e-01,4.694783366549108439e-01,-3.798040757818754720e-01,-2.595716465489281144e-01,-6.574830255924057898e-01,1.835287699012979390e+00,-1.325467556876088748e-01,5.002476131374021806e-01,-3.584782537510504685e-01,-1.703001663818082961e-02,-5.837233920142543830e-01,9.094856184917102793e-01,-3.451135713244447567e-01,-4.941279376787216515e-02,1.976464210150395751e+00,3.506836194046347027e-02,2.238969050041503817e-01,-6.300535718448279088e-01,-1.403823743640944643e+00,-1.513143144637955739e+00,-4.078053538669018652e-02,2.627672100344010886e+00,-7.208083150363470137e-01,1.397995753030076838e-01,-6.439706828856669452e-01,-3.679591954910165219e-01,1.801791803371789458e+00,9.340304434375864551e-01,2.344306886758280140e+00,1.657168084548648279e+00,4.672968247995099023e-01,3.601052695028341133e-01,3.388580092689744694e-01,-2.138696544238101738e-01,3.425494804782324709e-01,6.235162342683978620e-01,2.861080776430495298e+00,-1.181174370702122167e-01,-2.138455410293420567e-01,8.791503743276422034e-01,3.499840344482451737e+00,1.955272907622822354e+00,5.037494955550060327e-01,-2.286807471933400837e-01,-6.839093415835040268e-01,1.914823675580142215e+00,1.041881912853552583e+00,-1.687824165290507938e-03,-1.186267809135187701e+00,2.400132036588472406e+00,-1.188954853785550159e-01,3.515726528434667264e-01,3.483517481733193755e-01,1.378130262179506627e+00,1.604843212913886097e+00,6.175593227012959874e-01,-5.300116032077561989e-01,4.958759864970204156e-01,8.971708612460113086e-01,-4.382322817499550993e-02,2.056930935658656256e+00,-3.685904925500840812e-01,1.594523987446730406e-01,-6.198253385620602351e-01,-2.417314578072284892e-01,4.201846383053245981e-01,-3.326160606898383443e-01,1.090158925809179724e+00,-1.778659718584306715e+00,1.690467874422457717e-01,1.002720981862099681e+00,6.368549461247270393e-01,-3.315001263985580815e-01,1.789537397239223893e+00,1.485509472923195240e+00,-1.506965443886870037e+00,3.147924087690167627e-01,9.707990007717303138e-01,6.011886267280713847e-01,-4.418671036920801543e-01,1.987856903717643231e+00,-3.355284972778123098e-01,7.462562393435639985e-01,3.810855872571314307e-02,5.604510886932085878e-01,-3.378477852559164107e-01
6.401193761880494826e-01,5.806506553206195465e-01,2.400335415960232477e-01,-5.961186327295686649e-01,8.347376976021640693e-02,2.563649816500661038e-01,6.722532888377343863e-01,-4.119398270745295854e-01,4.266929575841922340e-01,1.806716776297993543e-01,1.547735364341071562e-01,-1.448857384151559791e-01,-4.904642613205271173e-01,-9.544531978136909511e-02,-2.267165362955537722e-01,9.943410978227892327e-01,-8.349687931768393634e-01,-1.694391125005807741e-02,5.392105849559278991e-02,1.654738078847513005e-01,-8.350635757920454871e-01,5.421329130993313150e-02,-5.327717265797757840e-01,2.632170116009229788e-01,1.671258516773531877e+00,2.290268814079135795e-01,3.311150021743203276e-01,-7.319117325307844535e-01,-1.338459563274166042e+00,-1.133942096146896006e+00,3.145724580715402174e-01,2.646326395986560165e+00,-2.548114079095789020e-01,1.750945177031577316e-01,-6.419591083926301511e-01,-4.657550461390995156e-01,1.436681713580403974e+00,9.207776849332972580e-01,1.921903064007313588e+00,9.797787251126383046e-01,4.881211620981452670e-01,5.868849458159403065e-01,-9.065724136415934109e-02,-1.325262091388234587e-01,7.749909162844066390e-01,9.145936588215323182e-01,2.240974257103671707e+00,-1.024916658809859882e-01,1.160748449970761542e-01,5.244392333127629868e-01,3.574871848637393157e+00,1.840901245557775345e+00,-1.067508100328351528e-02,-2.919070533333561479e-01,-4.261648077267787826e-01,1.513186538657496083e+00,1.860881977444219515e-01,-8.964905392368789638e-02,-4.397742137803686835e-01,1.257168337545560233e+00,3.792958792585636174e-01,-3.797890875007812750e-01,-1.327362334394275450e-02,6.587725673902949941e-01,1.295495245897795300e+00,5.808177340232635322e-01,-6.293129895578954969e-01,9.873004278298264103e-01,-4.681509133181132459e-02,5.266062987813495688e-01,1.782527316328404110e+00,-3.979497496859092376e-01,2.122846025344581333e-01,2.199088078632924215e-01,-1.359347759327675376e-01,8.695243053615411277e-01,-4.550087936947776468e-01,1.647979696160192797e-01,-1.126668812960106125e+00,-4.561395133465045992e-01,2.803159321969586615e-01,-1.826859924242368316e-01,-3.108699855936485901e-01,1.975438627714324102e+00,5.568358397059749443e-01,-1.163182076621894323e+00,4.337753431303284501e-01,9.885864518433016279e-01,8.215252034689803917e-01,-1.237761543879464243e-01,1.278680552004338722e+00,-5.091087609747952936e-01,7.225359873074648220e-01,4.424810007278559554e-01,-5.517004906070827053e-02,-3.486922076887648547e-01
5.819883121101550039e-01,3.694061250237729022e-01,1.297144304483477395e-01,-3.600472514234107080e-01,1.973315427333672267e-01,4.986262135697832609e-01,1.377924496704113322e+00,-6.136992117572837024e-01,-2.467521061515209890e-01,-5.384208954979982642e-02,3.957537255629006712e-02,-4.558576926040075472e-01,-4.958903915312482535e-01,3.872431273389459472e-02,-1.779052928949566570e-01,5.931457000538306046e-01,-1.022135607065354002e+00,-5.149668030830090171e-01,1.821204055678919131e-01,1.068244696934074200e-01,-7.721978982885387977e-01,-2.783932555678928500e-01,-7.023448614530450884e-01,3.942493740727363027e-01,1.649787617798203820e+00,4.917506043163992757e-01,2.482113896405606646e-01,-7.746016195028327944e-01,-1.600517751394763710e+00,-1.196246007356166707e+00,4.954987488171401777e-01,2.551306074614136499e+00,3.801568782541725477e-02,4.065898840943684145e-01,-7.358401062203104859e-01,-5.388022221156499869e-01,1.477460539119857863e+00,6.971185622113971192e-01,1.901168050880970739e+00,3.476827084099379794e-01,4.828840206635653942e-01,6.895122224496698093e-01,-3.948595218574261212e-01,-4.633964918972691138e-02,8.990709923101687373e-01,1.083839542872175654e+00,1.743677938203382016e+00,6.848565743803350370e-02,3.492486408143441468e-01,4.150743529812472854e-02,3.862897971133433472e+00,2.100269976676471639e+00,-1.843842022976397432e-01,-2.830117652132105310e-01,-1.210605952032048349e-01,1.252156836831029407e+00,-3.408787724359669813e-01,-1.405087785160559488e-01,-2.939151552599547079e-01,9.101291763274282909e-01,2.075528131715882185e-01,-8.252035431501116847e-01,-9.088239012809237738e-02,-3.100110763872510056e-03,1.174956707120307753e+00,6.078753441669150215e-01,-7.775798783376580703e-01,1.000259113749082607e+00,-5.851238074139862855e-01,1.098877031861274389e+00,1.571987049488396959e+00,-2.579318064943928457e-01,1.089113530881747477e-01,5.104940037693999066e-01,2.473721055785636780e-02,8.299795874830868669e-01,-7.896327243313656652e-01,-3.854099954820037199e-01,-9.599459592001837738e-01,-8.744908707023359984e-01,2.601837585036844702e-01,-5.573116250401977112e-01,-4.109991387174377064e-01,2.162143239231157477e+00,1.937138292948972218e-01,-1.149198263385315499e+00,4.645884770398189256e-01,6.093508166053296371e-01,1.064575876872661420e+00,-2.822730885349518659e-01,8.138737383737084663e-01,-5.375895085870736612e-01,7.001127620101834648e-01,6.253582615570214553e-01,-6.092720849720703047e-01,-5.512051247685247901e-01
7.819348510912618178e-01,1.395994187947114051e+00,1.883753759782025305e-02,-7.121958522250902979e-01,2.706626616861669832e-01,1.695762047321179022e-01,1.019925710293131171e+00,-3.813478716171100902e-01,-1.967474197148799675e-02,-3.820719487804077330e-01,-2.711419140720764953e-01,-2.153429844316879227e-01,-4.542690808533502156e-01,2.699237660505745540e-01,-2.902600567189824732e-01,6.594077984840649442e-01,-5.313619131038237464e-01,-5.768875183792179229e-01,-9.591303260879631420e-02,-9.342439949345526795e-02,-5.674996890686867523e-01,-3.249150051166427300e-01,-9.298037755356538536e-01,3.042783802383602909e-01,1.793059780196299524e+00,9.812305947088397762e-01,9.659493698899317138e-02,-6.545582756916662470e-01,-1.826442902381080646e+00,-1.474766405388449275e+00,3.283572361885612745e-01,2.187204394820080555e+00,-1.313953816979917255e-01,4.241429078561970156e-01,-9.628043259557308442e-01,-4.933844625835805964e-01,1.900347615874564022e+00,4.361519312245461522e-01,1.768506639261603786e+00,-2.463149403467477239e-01,3.133873434468297803e-01,5.600532994702969170e-01,-3.765563358650636516e-01,1.091721396358034946e-01,8.464484489704282577e-01,1.199650058938293240e+00,1.895581018904530346e+00,3.752887307893754132e-01,2.340740799072945633e-01,3.940059122613740472e-01,3.767577370797286385e+00,2.016452656034523283e+00,-6.909560033509992705e-02,-1.117329766415982029e-01,3.474450583188797292e-01,9.569105402138234906e-01,-6.688335788343166000e-01,-7.070153636304007949e-02,-8.846418073861281872e-01,4.255845858894236056e-01,-4.519510485098129360e-01,-2.229455242125872871e-01,3.777333964962601431e-01,-1.285308275839622816e-01,1.427200231838100963e+00,8.117888458375193128e-01,-6.980317353454079665e-01,4.248318471790603068e-01,-3.732891840926914062e-01,1.259755436871697887e+00,1.438151987276484522e+00,-4.146518248065073631e-01,-3.472239517011789789e-01,1.192750640699750397e-01,6.146369136708969283e-02,4.947517808747387003e-01,-7.885524907369172443e-01,-4.000628682895525090e-01,-1.280449808045739157e+00,-6.442226851752412831e-01,8.351164481055411981e-01,-6.339779266037179895e-01,-4.093157599234804045e-01,2.037239900892923394e+00,3.902507483540533229e-01,-1.074109173406442741e+00,5.999523584975438029e-01,-1.635270688157215435e-01,1.033091675313569935e+00,-4.290109619645354755e-01,6.731650211300610476e-01,-9.759648688879964951e-01,9.766647075060522765e-01,4.378214427448463564e-01,-9.411163043121060223e-01,-4.640581026259529285e-01
6.618279245189364612e-01,2.727815781562469288e-01,4.022536381943702111e-01,-6.238735008233771140e-01,-2.362396472535874814e-01,3.011422920822415250e-01,3.164141172883405684e-02,-1.499240517408148565e-01,1.588969570002388476e+00,6.334297748769464054e-01,2.291629422802507199e-01,6.960065127876023661e-02,-5.538513032675936865e-01,-4.780206324291426667e-01,-1.806611625401878252e-01,1.364356021242507211e+00,-9.494608137983460150e-01,5.833481040463641687e-01,1.958969677628519951e-02,3.886921858749281533e-01,-1.106108617151329687e+00,5.849154284745281540e-01,-1.868277880494014220e-01,8.888885669505647291e-02,1.611810090037938847e+00,-3.518022286782446217e-01,3.769841259431780389e-01,-7.741598617906864099e-01,-1.080108803800234440e+00,-9.256164095765506694e-01,2.726596456522797363e-01,3.089924879156888959e+00,-4.687720763533981261e-01,-7.427365767034171951e-02,-4.458011259060872811e-01,-3.391985686146146151e-01,1.393192873233147999e+00,1.197538592177643135e+00,1.894757832341603221e+00,2.010647772613343154e+00,7.678056030952105093e-01,6.392742152551114110e-01,3.445633023756716762e-01,-2.600341166262085113e-01,7.276674405207963492e-01,6.154170670616798677e-01,2.837709941815687475e+00,-2.903319922759041161e-01,2.015629246205553893e-02,6.383402924504724130e-01,3.514657250395329946e+00,1.807003456596256719e+00,3.487089909933535070e-01,-3.082021680035083033e-01,-9.704075328832821867e-01,1.908207752784686129e+00,8.304697376880989523e-01,-2.664982651656541690e-01,-3.228416667309920718e-01,2.126494772244536424e+00,7.562246222797186501e-01,-1.749345005831214606e-01,-2.221717524998914339e-01,1.307594306733879552e+00,1.361781626008787383e+00,5.523001432168067604e-01,-3.553949095595286822e-01,1.499241819709624002e+00,3.899804322984299909e-01,-4.489024347352728039e-01,2.213143959760932145e+00,-4.272626218120936237e-01,5.159458909114863490e-01,-7.181775858256950196e-02,-1.476759885537710371e-01,8.768483167197116401e-01,-3.196541837333211067e-02,6.074183402202214532e-01,-1.317843477627085758e+00,-1.094978090452304320e-01,4.593146415270887850e-02,3.262263447067031419e-01,-3.397525227335638776e-01,1.872059229541641168e+00,7.903712132745723817e-01,-1.263720956651325222e+00,2.034024930717472923e-01,1.966910568232847822e+00,7.233162972582888317e-01,-3.252981465207288592e-01,2.073170748358151627e+00,-1.642419165894910549e-01,8.511701005970453426e-01,4.252453574801792202e-01,2.675854097126046938e-01,-2.676178618212872728e-01
6.480473272359003056e-01,8.066346080234214622e-01,4.235012490139229424e-01,-8.089100908238653354e-01,1.538376013181669277e-01,-7.628254921817084755e-02,1.363364550372582196e-01,-4.022412353482534009e-01,6.241735283810967427e-01,3.052390790042253110e-01,2.438362596561987894e-01,6.604934038371942928e-02,-4.837139785017001703e-01,-1.210665769161304445e-01,-2.128499179895803339e-01,1.208330857197801533e+00,-7.305362915029057769e-01,3.897560760294779270e-01,-1.023285367267157825e-02,2.138359585589762191e-01,-8.858795508308621169e-01,1.094994841406009001e-01,-4.525153541197108886e-01,2.254206780938182719e-01,1.664155686935182787e+00,1.212218325154769960e-01,5.027908842263811851e-01,-6.855870278516540406e-01,-1.050907962451781419e+00,-1.041774058332045838e+00,1.331588574879356279e-01,2.638453390375006258e+00,-5.026294859496280854e-01,-5.135649332358882546e-02,-5.589371555086333210e-01,-4.240820241761616982e-01,1.248726663898003242e+00,1.172148408067184233e+00,1.914379211534578573e+00,1.388322799371497052e+00,3.533259092383946864e-01,4.775403035942712426e-01,6.895714978741868117e-02,-2.344789134090153881e-01,7.286474677651297860e-01,8.538603375624924663e-01,2.558494169172633281e+00,-3.314111317427230752e-01,-1.336931064675964120e-01,1.114689671935352067e+00,3.120905984034057390e+00,1.430427883267717304e+00,-8.898404891105493597e-02,-3.237805248612317111e-01,-6.405682470555672525e-01,1.688898299177433726e+00,5.526018087001689505e-01,6.648020209591723462e-02,-4.764488121755496852e-01,1.155577724447242716e+00,6.495867096155192311e-01,-5.465978322745090878e-03,9.800982626270136888e-02,1.264019682208409323e+00,1.392622491950530339e+00,5.581573515811090180e-01,-5.712076704160125029e-01,8.936174403057718374e-01,3.749877069578677613e-01,2.389215100802324909e-01,1.800916114228460874e+00,-6.045520766274721236e-01,3.024210675899733913e-01,1.214163331345382846e-01,-3.826951742924619704e-01,1.062373333212169424e+00,-1.788169687131531682e-01,5.998240807523631535e-01,-1.132728786009011168e+00,-1.217692500352314799e-01,1.790789953473903573e-01,-3.841347779100331983e-02,-1.323381823602245988e-01,1.820260780623413233e+00,7.819538559192129590e-01,-1.075400508708067582e+00,5.324706717127559719e-01,1.172224021496308444e+00,5.310287561532032186e-01,3.613024633173394506e-01,1.443017667038295260e+00,-6.318154978842325242e-01,6.276072631820881487e-01,2.764115751726181069e-01,5.712776868577187361e-01,-7.341256061647999376e-02
8.057455071083865494e-01,1.055616991261056903e+00,3.584899542673883888e-01,-6.665263557031905206e-01,-3.602927565235190116e-02,2.833087138103674296e-01,5.068399973289152705e-01,-1.732649174222188337e-01,1.441884188295482705e+00,-2.993424553835433155e-02,-6.973137135165654588e-01,-1.625136783587591838e-01,-6.238436280299417547e-01,-2.252605314175149531e-01,-4.434627234422333641e-02,5.939919779645790321e-01,-9.938055520344817317e-01,4.194955559903207343e-02,-1.143818188879790754e-01,2.469150751658831244e-01,-1.046602504070625050e+00,2.640482414099032393e-02,-6.187937375052989797e-01,1.192534201717670161e-01,1.698253345069006048e+00,6.060372381299097277e-01,1.032085173294272629e-01,-7.575657554136783212e-01,-1.877244671153250222e+00,-1.253648883767340072e+00,3.776755308540548639e-01,2.830799620845421583e+00,-2.962128330805496867e-01,2.036061732965898097e-01,-8.033794275243526517e-01,-2.292627728618249483e-01,2.011319016705830354e+00,6.012782093995585608e-01,1.513739043775283566e+00,5.798066307255420604e-01,6.821678625074528712e-01,8.256765207336129730e-01,6.704903470188516845e-02,-3.078800195746339563e-02,1.098414800851209794e+00,9.623556278719882506e-01,2.480062807732480668e+00,3.393623180084701096e-01,2.541854301746260258e-01,2.654099994153433228e-01,3.688841130017651349e+00,2.122034179864787262e+00,2.493747472903778961e-01,1.530734151248203112e-02,-4.363787751246933633e-02,1.194451152984542741e+00,-4.147257305580952513e-01,-4.360049255115782119e-01,-6.037559142066450946e-01,1.045922788764247935e+00,-1.852177603593284927e-01,-2.974930851193857695e-02,1.603911417142155349e-01,2.843652674568544203e-01,1.683428624142873975e+00,1.089564050218568614e+00,-2.644238488892600714e-01,1.301106770551898606e+00,-1.071768743535346513e-01,1.923449577208030947e-01,1.718556700880440324e+00,-5.068153757236137924e-01,-1.025340901697899126e-01,-2.760647411190115807e-01,2.204140483919979077e-01,3.307888467594606863e-01,-3.388734732438878350e-01,-4.518537750550735144e-01,-1.619482249306742006e+00,-3.511290096152319684e-01,4.147938700294938608e-01,-3.909600673185880670e-01,-5.748169153610073190e-01,2.118948079956476160e+00,2.947497653546580221e-01,-1.121934199388812337e+00,3.693256003219097527e-01,8.404528674806597266e-01,1.120666522948510657e+00,-8.803115556558013255e-01,1.385498368484504583e+00,-7.086096271066499863e-01,1.345155319834507868e+00,6.155745683912844379e-01,-1.336315267059110079e+00,-4.167721686735099684e-01
6.207968779403567616e-01,6.860087530327385608e-01,3.222817146851419401e-01,-8.668773659972518475e-01,-2.281847860064682709e-02,1.794124818145922118e-01,5.067335960002784523e-01,-3.565469232703497582e-01,8.179406450680734020e-01,1.991818763974966822e-01,-5.727241298627128163e-02,-3.854804282798529602e-02,-5.142562463281621365e-01,-3.010699475258679647e-01,-3.125899227441979455e-01,9.124843324544632539e-01,-8.825750241005616559e-01,2.549163141000790889e-01,-1.327158556946015644e-01,1.397093150573865683e-01,-8.415684390086874966e-01,2.655589478389210889e-01,-4.798324329534235932e-01,1.262510311645619332e-01,1.872916057700229731e+00,4.244304438265237844e-01,3.126530006283674279e-01,-7.572525481134504410e-01,-1.813317913906388412e+00,-1.435495208794852484e+00,1.727249541077061079e-01,2.833082711647986862e+00,-4.544701869663578808e-01,2.894527835363694956e-01,-6.581596413664955181e-01,-2.768747650947922523e-01,1.682401942442159015e+00,8.336194890059158702e-01,2.136146549212582624e+00,1.112854097113839869e+00,4.330994742891287053e-01,6.901106232852614042e-01,4.579786851951697657e-02,-2.935481053477508873e-01,8.516262719790452795e-01,8.509107183805485475e-01,2.366742633575672716e+00,-5.987781091844648906e-02,1.607443254335934324e-02,3.989777873859615687e-01,3.394583091596792723e+00,2.094420635255566765e+00,2.256606023625379320e-02,-1.365290350414448406e-01,-4.431132260696639680e-01,1.652185582828396671e+00,3.284987288951236595e-01,-1.219620501014956754e-01,-6.195540338204243991e-01,1.641047174486393256e+00,-7.883185660597730182e-03,-1.216127159428844196e-01,2.163143436452913682e-01,8.403803064814063806e-01,1.702846948919296999e+00,9.525726323764197589e-01,-5.544255634235063512e-01,1.002995917060626407e+00,3.119832625963731010e-01,3.900123090491073308e-01,1.569496514899364037e+00,-4.066800053852747121e-01,1.977557288289796267e-01,-3.013980596923024891e-01,-1.081143231805208604e-01,4.733094784137041322e-01,-5.372139239064162020e-01,1.774321033218643762e-01,-1.623771698355248372e+00,-2.231442182220219894e-01,4.556384107412080886e-01,-6.181388177495433789e-02,-4.432383464107862991e-01,2.191533765580480519e+00,7.562795956613531656e-01,-1.374337135215933259e+00,4.482231741725735130e-01,8.394616184994646568e-01,8.636892850292972046e-01,-3.400633044409039907e-01,1.378196965810646324e+00,-4.592113292263563240e-01,7.476938949986934313e-01,4.127208814483997457e-01,-2.760130192541392358e-01,-4.091256524672371997e-01
5.862419760142411063e-01,8.578460600479549392e-01,-3.626782648424839439e-01,-1.083667139022068460e+00,-4.358643420351290820e-03,1.470825059992420525e-01,7.713978443403275431e-01,-3.136874083104864153e-01,-5.773463287870201910e-01,1.613437233551557326e-01,1.148899006693527847e+00,2.275237298020256205e-01,-1.919538452443373122e-01,1.235936804173669162e-01,-9.820165594601351078e-01,1.762876192035452316e+00,8.437518120267722965e-02,-2.515865048034535145e-01,-2.338379973129309231e-01,-3.746071742500243218e-01,-5.654987173487024954e-02,5.886456658106445916e-01,-5.944140759900078397e-01,1.922709787561485140e-01,2.142382812840302631e+00,3.533147701260301865e-01,2.628429786158531511e-01,-6.073603357953755166e-01,-1.573603485858648288e+00,-1.847767384533500312e+00,-2.739491350429384964e-02,2.133557898073527692e+00,-4.269830974800485901e-01,5.807332631715511617e-01,-7.317046715469694984e-01,-6.542198929468764357e-01,1.555941529117034872e+00,7.643808977601835863e-01,2.950865378790449522e+00,9.238844309533734700e-01,8.458189898605028567e-02,1.888126727597213284e-01,-2.460196560553907785e-01,-2.146084959244300983e-01,9.325616106448392229e-02,8.399721914243667431e-01,1.925160140436837697e+00,-2.002722879989277671e-01,-1.493326923338662571e-01,5.300320540882192955e-01,3.697555892263221899e+00,2.169971137617315193e+00,2.389811870772939884e-02,-4.191317491745669699e-01,-4.396733561703908277e-01,1.850061665957031698e+00,9.265152049199815165e-01,3.860922163316194977e-01,-1.250141177664065628e+00,2.201859975946229842e+00,-3.437866627186016988e-01,-3.046712544614486040e-01,4.231741838997093996e-01,8.410171135376089957e-01,1.306847265653356072e+00,3.360858031241549804e-01,-1.160668159211257544e+00,-2.573749581409351395e-01,4.890074609050658605e-01,1.313755768999086637e+00,1.619038804730787762e+00,-6.436901261303729083e-02,1.240040563211242119e-01,-1.047089279568168829e-01,-3.974882889759777660e-01,5.695357580401573250e-01,-1.099751896176053956e+00,1.056841924642067720e+00,-1.405582002240828965e+00,-3.519929017370740931e-01,1.311934524553708847e+00,4.007790000339708780e-01,-2.466862810182309240e-01,1.962230360331883805e+00,1.545099453899927866e+00,-1.670030256245805367e+00,5.128939495224064116e-01,-4.368368343535045106e-03,6.184702340303102064e-01,-1.933713158493444162e-04,1.124038462658863535e+00,-3.050494951458615489e-01,7.044803440209645995e-02,-4.130982350293899152e-02,1.025176958944709282e+00,-5.946860228945523019e-01
8.864494900287922530e-01,3.131550041958166553e-01,6.174105119968735511e-02,-2.900672085169387349e-01,-6.073243254111838629e-01,8.094199983223666628e-01,1.667243487591591744e-01,3.244548275209524490e-01,2.521395461408224126e+00,5.917378993871630355e-01,-2.755832795102558519e-02,1.170211095400396084e-02,-5.980182976843750886e-01,-4.961161246336133757e-01,-1.516711233127183700e-01,1.470123994792964961e+00,-8.316879252922781962e-01,1.731811349232854069e-01,2.051671883298266524e-02,4.136583987571788024e-01,-1.162676402271604514e+00,8.627656432322994284e-01,-1.967962196103766881e-01,-8.481798920868754976e-03,1.492514375482596245e+00,-5.404521458711110116e-01,-5.659197012836089669e-02,-7.898280364405030340e-01,-1.155932859489680498e+00,-8.345002968637000862e-01,5.821317052637282607e-01,3.154283836157426801e+00,-1.895228948317584927e-01,-6.899074220230061449e-03,-5.824451411774816956e-01,-3.862924882218472522e-01,1.924260426032766924e+00,8.382745909245650218e-01,1.510008021087747121e+00,1.721866725665024855e+00,1.297663236602110803e+00,7.344051254940739959e-01,4.469250216666845188e-01,9.656121546708712478e-02,6.792116749294325739e-01,5.486857710825983059e-01,2.953106172980057842e+00,2.269205232508937631e-01,4.172173375523922645e-01,-1.009710418531306608e-02,4.458515835708867669e+00,2.307834454440894412e+00,1.036587452839283330e+00,-2.262282706342265137e-01,-7.149651734977426898e-01,1.596494383475846046e+00,3.696836418700501503e-01,-7.378862620854849119e-01,-4.808255077602267558e-01,2.551514074654773978e+00,3.842705641104919856e-01,-3.572526020591074158e-01,-4.804338483345319544e-01,5.378200049658622417e-01,1.122172047258433336e+00,4.448495856893466271e-01,-1.056223115485996900e-01,1.808040028547452049e+00,-9.876222550439228698e-02,-7.997105179750032544e-01,2.769867638072443405e+00,-1.885529778680368196e-01,2.713743008157601944e-01,-1.261742158345312836e-01,3.808781432104128561e-01,5.185769050228439259e-01,9.940671584162563690e-03,1.682203511544001495e-01,-1.398004086962617798e+00,-3.751591473502902674e-01,3.284423945471853790e-01,4.385727963867043222e-01,-6.350389219176973965e-01,1.758713367094655533e+00,5.719531515425679835e-01,-1.287936250191488829e+00,-1.720706639218950174e-01,2.206890317113881839e+00,1.155782538555281569e+00,-1.551399093189580025e+00,2.484778879410626473e+00,3.675739319769266711e-02,1.486664032013489845e+00,6.197888085634846167e-01,-8.327201620571758056e-01,-5.978335517890640549e-01
8.305708833079703535e-01,5.516415206769320623e-01,-1.184195110401873446e-01,-4.092982882230014052e-01,-3.766352272754859842e-01,7.100988472447333777e-01,6.123243222160956734e-01,1.110122494535125126e-01,1.461534838204699982e+00,2.903521240382587743e-01,1.235381531086272022e-01,-5.939494420237176331e-02,-4.971473961201668956e-01,-2.139253179230286572e-01,-3.323333592125278235e-01,1.337277316758955115e+00,-6.117448303907603302e-01,-2.191409620276320580e-01,-1.786851746215573772e-02,1.591028689124737716e-01,-8.301611014549140632e-01,5.875237746419362805e-01,-4.352756288610358237e-01,9.933475323285159697e-02,1.647873329515783247e+00,-9.299167733375615641e-02,-5.439922803872659918e-02,-7.417159606527882199e-01,-1.407634984825326896e+00,-1.140577047386623022e+00,5.083272956521592834e-01,2.772555250781822522e+00,-1.143163125545547387e-01,2.451547225218277393e-01,-7.158424312293197866e-01,-4.888924556202575156e-01,1.932244005278781041e+00,6.535221834279605346e-01,1.784127981379558303e+00,1.056373026665927028e+00,9.750257194574932784e-01,6.273870420927887270e-01,1.174563098983027604e-01,1.141115253673709862e-01,5.978111170213114001e-01,7.394774845098134319e-01,2.475016560026797929e+00,2.809387664970250942e-01,3.885595223119121533e-01,-4.532442203648645584e-02,4.414793729109787179e+00,2.368296319110454462e+00,7.238579877742010726e-01,-2.383060468516275676e-01,-3.821121709556324908e-01,1.439034353239352582e+00,1.312452071476367665e-01,-4.837317168368286957e-01,-6.955238724490884206e-01,2.133032308268385080e+00,1.043749756837961118e-02,-4.624845776280346321e-01,-2.216765217164673729e-01,2.199805961806413634e-01,1.131552858375100890e+00,4.569785950442645794e-01,-4.160604628078153899e-01,1.208249231633321763e+00,-2.261410345407189881e-01,4.225410376456195660e-02,2.369298706930073717e+00,-1.255858820479344162e-01,8.197057073561836438e-02,-1.424084350988560899e-02,2.881306090630647021e-01,4.679237411197282315e-01,-4.160599306601527880e-01,7.422433530081673503e-02,-1.344690609485618804e+00,-5.554083655826850263e-01,6.536208048451718211e-01,1.970247903039245574e-01,-5.853345217882253149e-01,1.862997734056095922e+00,6.290914347389655603e-01,-1.332343258557998178e+00,3.740281864364985998e-02,1.328952667552921296e+00,1.147122303493236739e+00,-1.279979186929751878e+00,1.876763511257438788e+00,-1.660302761208579669e-01,1.204747091765503431e+00,5.247200642314047148e-01,-7.528903335203021019e-01,-6.751650322964664053e-01
6.039113054732594410e-01,5.432966458323690295e-01,-1.357614224002496317e-01,-8.462650272243470440e-01,-8.344546141615460932e-02,2.309256364483616430e-01,5.170604793592066262e-01,-2.617724445937636979e-01,6.522887077949968138e-02,3.915839027443508424e-01,1.013059252273237121e+00,1.742260501486236068e-01,-2.966032448866084970e-01,-4.837098538948457482e-02,-7.111468575671306969e-01,1.751790552952597446e+00,-2.333273255481707609e-01,5.964651662396902587e-03,-8.305052007447311091e-02,-9.890960443423191251e-02,-4.079936070124232650e-01,6.034836955148660254e-01,-4.225209796287912045e-01,1.901352643400461839e-01,1.899304694752565581e+00,-5.342279198941837087e-02,3.298423252186994392e-01,-6.572729285963540002e-01,-1.183791529250130647e+00,-1.419395322799088976e+00,1.035820066287469199e-01,2.428835421485577406e+00,-4.014376454560314444e-01,3.007993157150689600e-01,-5.925227900613930787e-01,-6.172431317175043342e-01,1.370383346595792862e+00,9.963488910259975517e-01,2.582804385154497062e+00,1.413443915905207238e+00,3.456811948030629189e-01,2.870932497413229423e-01,-5.307601926302024653e-02,-2.054546229523565581e-01,2.338966305593751516e-01,7.398546608969165383e-01,2.237491842966459199e+00,-3.077643724108043433e-01,-8.683330176597058025e-02,6.338285861638551788e-01,3.685132532413265771e+00,1.951772752263701838e+00,1.484141721567699412e-01,-4.633461223467099099e-01,-7.173023902415003317e-01,1.911489612753044298e+00,9.986243057073607154e-01,1.916380483093825526e-01,-8.655858869170988124e-01,2.211667668387801822e+00,2.317770908072370462e-01,-3.534737657955120405e-01,9.608389440941722537e-02,1.054125561623647123e+00,1.168280364040759967e+00,2.364491361264157987e-01,-9.222794554180939741e-01,3.454712400153367446e-01,4.089082803137649158e-01,6.857294236658191267e-01,1.945611001352401503e+00,-1.669887218071178514e-01,3.269216809615693164e-01,7.330973270186549873e-02,-3.573102698293392221e-01,8.392188863261733633e-01,-6.870157421427585120e-01,1.026958596693821502e+00,-1.204550294821208789e+00,-3.117675117348691072e-01,8.088862394886572327e-01,4.333902249152197239e-01,-2.178338953645553022e-01,1.839656270327282517e+00,1.298754582189038276e+00,-1.495744249374341805e+00,3.791823940527146997e-01,8.272036297888171186e-01,6.012014201550639481e-01,-4.752034588610676291e-03,1.501732268258082703e+00,-2.024015230343085836e-01,2.733624551511164569e-01,1.004744511494739534e-01,1.011063312567480610e+00,-4.586064883886202814e-01
8.958942147441385506e-01,1.070201791373623257e+00,-2.217909205512859638e-01,-6.333162559102493150e-01,-2.965417907643589368e-01,5.358417091450291547e-01,5.767585623772462089e-01,1.580038799286921092e-01,1.282621802102415387e+00,6.552305662583748913e-02,2.706905713659879531e-02,4.021576956257943980e-02,-4.477731953099903239e-01,-5.676166044854523418e-02,-4.580442114992878677e-01,1.329949182168356225e+00,-3.296696192447493567e-01,-3.339653622331154592e-01,-1.752085271830890467e-01,-1.334479690723412715e-02,-6.327776963210800520e-01,5.266744641156646534e-01,-5.953256186786419768e-01,7.358687693384223516e-02,1.788077626278858911e+00,2.705382857481048453e-01,-1.247152733183650997e-01,-6.784982976316287218e-01,-1.644363649441942909e+00,-1.399957124024501010e+00,3.944635076283449227e-01,2.522824449978136041e+00,-1.895559058987205669e-01,3.506698468466831753e-01,-8.552521614787828019e-01,-4.795146493146653643e-01,2.150540811236345107e+00,4.720059583827943550e-01,1.854139271853516791e+00,6.245545583764049447e-01,7.985339932486825720e-01,5.486260155192757004e-01,4.316912505156852986e-02,1.647565812757664505e-01,5.485941507535125883e-01,8.341092952468921462e-01,2.407994305672057855e+00,4.335619499438548852e-01,3.175484344030490291e-01,6.881045859306578194e-02,4.349310449320880956e+00,2.395488060767801741e+00,6.903712786695656023e-01,-1.515902607481881548e-01,-8.783932421785167755e-02,1.290770373710907970e+00,-4.814371747290419057e-02,-3.788036587754356477e-01,-1.046034450554409689e+00,1.878626878658705701e+00,-4.437552159494436710e-01,-2.088151478896392854e-01,8.672865454430747634e-02,9.335906879519928481e-02,1.291226722117208903e+00,5.890675434567965718e-01,-4.729002770573998982e-01,7.716117370367138184e-01,-1.229069738714681503e-01,3.531143754139122737e-01,2.168420262059823411e+00,-1.649577785332848601e-01,-1.704390642646302911e-01,-2.193999284920501169e-01,2.795610896092450837e-01,2.519089570298816971e-01,-5.647275725265208379e-01,5.439821323047239199e-02,-1.533977060676029014e+00,-4.827626722267923665e-01,1.035081661900616457e+00,1.210787723245459746e-01,-5.888342654530159814e-01,1.869075395176808430e+00,7.707474634701123595e-01,-1.351720793420967626e+00,1.560464883427248317e-01,7.095967394431390574e-01,1.137189392048413072e+00,-1.298047305216926128e+00,1.651344418970343231e+00,-3.969421793938924803e-01,1.233334749816122677e+00,4.070854079251792212e-01,-8.867264911829264573e-01,-6.774126794702703958e-01
7.725105279556740978e-01,7.785565250331496490e-01,-2.963130620501128742e-01,-6.912230844830760113e-01,-1.970975278052592705e-01,3.338015482924928667e-01,3.380364797372529817e-01,2.093691644573375532e-02,5.286013197894321447e-01,3.825602381171627209e-01,9.940841608828601128e-01,2.414164658087757931e-01,-2.961510285977586032e-01,6.341725655957733410e-02,-6.714515268886606103e-01,1.991131955021115729e+00,-5.052644513584614305e-03,-1.542350129501689482e-01,-6.662445629110087808e-02,-8.069787301248076972e-02,-4.252688125733335989e-01,6.908920534361353560e-01,-4.418791751478387542e-01,1.683705727169613753e-01,1.753590987061125039e+00,-2.504271569156377164e-01,1.625159162916175737e-01,-6.104547419402722719e-01,-8.687476461394547655e-01,-1.215777149403176827e+00,2.248190122898566234e-01,2.312285422267649881e+00,-3.027322998849619196e-01,1.680066696543398574e-01,-6.492301999503423682e-01,-7.121473361122290235e-01,1.509032827690007794e+00,9.333149288081505901e-01,2.250494994227940637e+00,1.324912133815593140e+00,5.745906688353843439e-01,2.072339471588002802e-01,2.516380399655390732e-02,4.280118996080178179e-02,1.248128667840104344e-01,7.141240325238688014e-01,2.429915530031944826e+00,-1.176669986492112352e-01,3.477059022656515952e-02,6.929149167460354475e-01,4.057903088415973691e+00,1.883717678653389349e+00,5.000624787729706089e-01,-4.899785427459327214e-01,-6.172522134455402654e-01,1.725732038595207962e+00,8.319136762797789686e-01,3.915646291379532018e-02,-9.787734961180034610e-01,2.160793109816681046e+00,2.584108056147855215e-01,-3.004778868730816344e-01,-3.594674783140994201e-02,8.388508637349008090e-01,9.155230368930644680e-01,1.268625023197578194e-03,-7.822180525704789389e-01,3.673528217602590185e-01,2.175246544433265816e-01,4.289340398721262493e-01,2.360520865208166175e+00,-1.538644190307846826e-01,1.808616231250558259e-01,1.894848981681386269e-01,-2.016613515488997477e-01,8.858037595278556164e-01,-4.816159045621422052e-01,1.018460163592760814e+00,-1.054580737628942666e+00,-3.649362141037659768e-01,9.219431055201493530e-01,5.159800864301478107e-01,-2.230407990645089378e-01,1.565906912696615860e+00,1.239431670400698238e+00,-1.355231573795653510e+00,2.295667423117129236e-01,1.020512212155030296e+00,6.625560226754434456e-01,-3.542469322537096232e-01,1.757322326133011092e+00,-2.336932615789441281e-01,6.002394538309266947e-01,1.035433584983949384e-01,8.040622390374456696e-01,-4.603287433914364235e-01
5.381044310589259139e-01,4.313671500921117397e-01,4.244532094892615737e-01,-9.347485774059403063e-01,-1.058589814482492203e-01,2.459042861681632608e-01,5.739995308699734622e-01,-4.165195529950559417e-01,9.841003203401486044e-01,2.786282142663438210e-01,-1.732795844207347113e-01,-7.750545655889801155e-02,-5.535664704211081810e-01,-5.179037193393534189e-01,-3.202801239723345184e-01,7.514996419843219533e-01,-1.115755384189283994e+00,4.294458669843085330e-01,-1.727322466136853030e-01,1.844691136869457404e-01,-9.186007760755638962e-01,3.822158816001832715e-01,-3.930754207994717753e-01,6.580437637025660091e-02,1.975140325793407925e+00,4.696016231840444699e-01,3.377116157872169788e-01,-8.214210246927314829e-01,-2.149534845718725329e+00,-1.581297413670742946e+00,1.408450273189003066e-01,3.086860249418831970e+00,-5.201141104712885266e-01,3.942736143276647787e-01,-6.134134888946589648e-01,-1.459327785122138676e-01,1.748502802386249666e+00,8.189145964309839654e-01,2.316830621402043100e+00,1.309357977115166882e+00,4.439531490945178849e-01,8.331388867224622796e-01,1.091712647112223350e-01,-4.555790194537969184e-01,9.634806777580662285e-01,7.928919999110052297e-01,2.360323806300783644e+00,-9.565782371732184375e-02,6.037766119239021401e-03,1.376757519010997077e-01,3.306560630632578324e+00,2.339612325806168514e+00,-1.729964280159745904e-02,-6.062002872791721897e-02,-5.541373793712831564e-01,1.806360532125328877e+00,4.490453185301617745e-01,-1.826518738390855434e-01,-5.442264974851446224e-01,2.006920562232002325e+00,-1.192539261846032039e-01,-1.559988374124794408e-01,2.400184609016461357e-01,9.325421006845943106e-01,1.935260291483043016e+00,1.196933407849885223e+00,-5.273691309552712703e-01,1.216171881331286286e+00,4.490851744192078110e-01,2.963412498833593034e-01,1.410566518353439935e+00,-3.601416573049881498e-01,3.107400644994818828e-01,-5.477044127804276963e-01,-7.353760259171515656e-02,2.663533684738108587e-01,-6.310150619632970415e-01,9.658704652716326722e-02,-1.889704400565116016e+00,-1.646099799202438430e-01,3.912973362287799350e-01,-1.282255066139217914e-02,-5.601634550757901287e-01,2.425347836067662133e+00,7.812460994516008395e-01,-1.546454159320540533e+00,4.261173245454081271e-01,9.208092532648755046e-01,9.402785171792400476e-01,-4.790734375629990272e-01,1.433630337021645884e+00,-3.032733697661624817e-01,6.943193260584916704e-01,4.803891556983621580e-01,-4.461797814140772700e-01,-4.996865626885272360e-01
8.249414917415816006e-01,1.081213495602686869e+00,-4.380502073257992457e-01,-6.322107677105395229e-01,-3.164821441509312744e-02,3.066691700596286263e-01,6.020187136109063086e-01,-3.289220274032739894e-02,3.500997483587564574e-04,1.166099075431753368e-01,9.625177922896122062e-01,1.584670370361200842e-01,-2.548395640971578002e-01,3.454817309763255628e-01,-6.808438985406350952e-01,1.886787319716257016e+00,1.684180848295079858e-01,-5.430098232771043421e-01,-4.060073477509765216e-02,-2.044268193853046589e-01,-2.705042670751209299e-01,3.986392107352833003e-01,-6.532908374454430289e-01,2.673830044557357621e-01,1.726704491426168664e+00,9.597801801082862794e-03,9.289768306308307522e-02,-5.597716041698850287e-01,-8.531626117251494001e-01,-1.243971931818579568e+00,2.788055071479345615e-01,1.987049582492609767e+00,-1.576609323571092625e-01,2.382237318301468620e-01,-7.800855717970460734e-01,-8.282481236279336523e-01,1.555468599198016832e+00,7.743931832581357755e-01,2.133359780088766477e+00,7.055926548983161295e-01,4.748276059413352734e-01,1.263621605325481734e-01,-1.973466069016233670e-01,2.086529718738144856e-01,1.023253853642623890e-01,8.823678989423977548e-01,2.171746239225686104e+00,3.916971551883799418e-02,1.119301847674086525e-01,7.243510059728803796e-01,4.186941753949889211e+00,1.817952470935089160e+00,4.025315211156346162e-01,-5.004062705073394346e-01,-2.720233690965453976e-01,1.430308844288324499e+00,4.154399103163148865e-01,1.111848022113192391e-01,-1.092440857317154457e+00,1.582923036178313092e+00,8.528108281053967121e-02,-3.689501046872533108e-01,4.757170112772321491e-02,4.285297892801700481e-01,7.751064364948015983e-01,-8.844800788505297051e-02,-8.933916301087901912e-01,4.749982689965626115e-02,-8.307238581239420605e-02,8.996650152871513706e-01,2.264762704558733297e+00,-1.558249888641510539e-01,-4.897965068490595097e-02,4.198080783694803086e-01,-1.677384231103135892e-01,9.380910576039166449e-01,-6.260891815254053805e-01,7.996247502766082871e-01,-8.623090118987136732e-01,-5.645743960703375475e-01,1.090827612069926511e+00,2.499991327560935894e-01,-1.797054739291809033e-01,1.497310624303978432e+00,1.095972733743549865e+00,-1.221918812548998590e+00,3.257463804339026381e-01,5.217062238143701514e-01,7.076816381976367420e-01,-2.942760643818951860e-01,1.384174736501275316e+00,-4.737745393478236533e-01,6.316468411568343377e-01,9.478629972233093559e-02,6.166163774706208134e-01,-4.742906907572519981e-01
1.004728481429111753e+00,1.379916165385265403e+00,5.361531187590749814e-02,-7.409479606230280346e-01,-3.614367133938654608e-01,3.577663040375265169e-01,3.379788160837338129e-03,3.342882728541811677e-01,2.278668204131399477e+00,1.254296548453557869e-01,-4.509376327775289073e-01,1.652979312724213445e-01,-5.586992329474549379e-01,-2.260185059265900631e-01,-2.509922818440195602e-01,1.255659046995900363e+00,-4.624658757276012278e-01,8.947344908311313794e-02,-2.687808934715524845e-01,1.687676897138316312e-01,-9.197915009058419411e-01,5.799107675166953468e-01,-5.172074973224050076e-01,-4.552191241219685769e-02,1.716184114820799467e+00,2.544501690236659619e-01,-1.178455146771645035e-01,-6.809156668680755864e-01,-1.624095589419341401e+00,-1.256428806724395830e+00,3.501403601601678073e-01,2.745111021938217544e+00,-3.830063413501253455e-01,1.102767741150831454e-01,-8.377423004510604621e-01,-2.948113383672837928e-01,2.296206175750354017e+00,5.451057450427331252e-01,1.488762888737371837e+00,8.799739735114284755e-01,9.212810183630615324e-01,6.494455101240328432e-01,3.283305563090220813e-01,1.519151958893188714e-01,7.499047095782902517e-01,7.727994932298172248e-01,2.894316044493506990e+00,4.923817053369656804e-01,2.457514934493445491e-01,3.544418740143880364e-01,4.103326216545245764e+00,2.210171269349239687e+00,8.488246046723977312e-01,-9.141495489742301750e-03,-1.281586193299664167e-01,1.263595625973225722e+00,-9.522306215774306581e-02,-5.488830008892773282e-01,-1.033974704873636963e+00,1.735286974865507093e+00,-3.828766735648846398e-01,2.415855866881642666e-01,1.446614936243693916e-01,3.854058040913667660e-01,1.540834566893778179e+00,8.365112103195646576e-01,-1.285387896361523397e-01,1.116178876406947129e+00,1.217666674999255960e-01,-2.919319404456680589e-01,2.272868747279165991e+00,-4.025803646603893782e-01,-2.111217294479394990e-01,-5.316193759232080707e-01,3.341206571646002099e-01,1.561844071900602149e-01,-1.539304788397652113e-01,1.568420601012476823e-04,-1.769467614468967609e+00,-1.655683563446602447e-01,8.681083631217070273e-01,1.335613310313642499e-01,-6.148240376299023424e-01,1.802959396946261839e+00,7.003629728670948129e-01,-1.216645172665132391e+00,1.290058693482240282e-01,1.070280712902365483e+00,1.105660501394284623e+00,-1.425147978839570673e+00,1.989199485158960279e+00,-5.442626363922870025e-01,1.605964412731944346e+00,4.421068290257093025e-01,-1.200921384393802249e+00,-4.831914162674795787e-01
7.992027432005592846e-01,9.270813320962892901e-01,1.709986587506359679e-01,-9.074416099553909154e-01,-3.572797368418826891e-01,3.249074482949759757e-01,1.336960515612836686e-01,9.159655812418127097e-02,1.903008594940257092e+00,2.884805332346251916e-01,-2.223559011344289904e-01,1.538411904718060552e-01,-5.375925081158250407e-01,-4.381577462114564780e-01,-3.762425448951546292e-01,1.195093064039274955e+00,-6.701997744414400771e-01,3.484112842019504996e-01,-2.891163313855487638e-01,1.536860194786632272e-01,-8.826419432637238049e-01,7.091934386096098164e-01,-3.894720421858768877e-01,-6.150819084903214051e-02,1.897849860989639481e+00,2.574333156518532895e-01,6.406057775530268894e-02,-7.427969902106762445e-01,-1.900380624594266044e+00,-1.480812525345802433e+00,2.049912060423165761e-01,2.956882486618175321e+00,-5.182050817393684117e-01,2.569997436853606043e-01,-7.146787161401170207e-01,-2.046667300016555280e-01,2.110698356337110226e+00,6.775638091458946466e-01,1.994676710571408496e+00,1.285098304927936086e+00,7.361831722199765338e-01,7.128011140787332556e-01,3.213084866340061851e-01,-1.614135860562145863e-01,7.583388225196520116e-01,6.982502599835473944e-01,2.755536642061700014e+00,2.065804722436529461e-01,9.508140609231727214e-02,2.243132534481068197e-01,3.777209190258862481e+00,2.364329529323343060e+00,5.762862261036667544e-01,-2.950054504062582517e-02,-4.268391320622296758e-01,1.635768391898003271e+00,3.719892107007013449e-01,-3.905594842315417425e-01,-9.158315945762119936e-01,2.232769244856066759e+00,-3.402759399608160651e-01,1.288201702812495908e-01,2.095368312964314139e-01,7.697693608261826359e-01,1.769483692384087758e+00,1.001512593557128072e+00,-2.974729643300131898e-01,1.134590319510836887e+00,4.423651866182937153e-01,-1.645404477121488185e-01,1.955927592277433291e+00,-3.332667796141862704e-01,6.540167400362302541e-02,-7.040619316359848501e-01,1.469971702571928884e-01,1.032564361302277245e-01,-3.727064954753960269e-01,2.240253246957303324e-01,-1.961872233620194361e+00,-6.912643603241619417e-02,7.663223596312305208e-01,2.674295727500676234e-01,-6.211718778306973832e-01,2.084038499262852895e+00,9.202236705884394574e-01,-1.479229319468526427e+00,2.056059087253284678e-01,1.080468178656438516e+00,1.015030428485468761e+00,-1.117119006060039110e+00,1.917939355893673925e+00,-3.165805314290125461e-01,1.173247217381171215e+00,4.040433222204536934e-01,-7.429833783982118245e-01,-5.322213505396844457e-01
7.930357691407484699e-01,1.142626381043283734e+00,4.381406692669399527e-01,-9.897892953948719263e-01,-1.535683101934846584e-01,3.134867449060232958e-02,-1.214907720308037731e-01,-4.349112123261077156e-02,1.870261253775393318e+00,2.465522197883891486e-01,-4.092779877985222581e-01,1.703101703631927921e-01,-5.814114325455620458e-01,-3.960581591948511004e-01,-2.057351350119757671e-01,1.043742207587416537e+00,-7.836657502823008992e-01,5.750248100335355605e-01,-2.700935896204442743e-01,2.450703611738948295e-01,-1.017190065801726995e+00,4.406907470953205230e-01,-4.213335923310478348e-01,-1.750930535626335494e-02,1.819287141405349306e+00,3.595902195398143486e-01,2.325227133297514404e-01,-7.227499859600386989e-01,-1.724612549753604895e+00,-1.329520138341280688e+00,1.263989452662084290e-01,2.934488024991010580e+00,-6.345234209778580770e-01,6.461222396561266956e-02,-6.827600810258392938e-01,-1.533065550512450748e-01,1.922365360529254774e+00,8.443352875250903500e-01,1.791681776201187848e+00,1.310995099135897179e+00,5.916956413765772638e-01,7.042745369103212694e-01,3.415306531006692681e-01,-2.166449903528498422e-01,9.099406568592900424e-01,7.681452015805980693e-01,2.883995409468679938e+00,7.482343235702391959e-02,-4.220989481764388096e-02,6.921832036106095876e-01,3.327475824264006121e+00,1.949849261875800099e+00,3.376542382198458592e-01,-1.562668642499376315e-02,-4.338225824223083116e-01,1.594948835979842272e+00,3.136669264412165203e-01,-2.901225341410214043e-01,-7.864725465511328562e-01,1.629490451560548614e+00,-7.176691068935567297e-02,3.672017540947416503e-01,2.939362375538625560e-01,1.058321855880902662e+00,1.863760554528711255e+00,1.082207574046808896e+00,-2.283674727548640204e-01,1.169807234418333453e+00,5.600958630778016811e-01,-2.412161017549397934e-01,1.813151341523842053e+00,-5.853781063685550290e-01,7.552601228957873947e-02,-6.341093001625348613e-01,-1.899935221705777166e-02,3.288302445983220523e-01,-1.470839825887370889e-01,2.401511242720255068e-01,-1.859839147755408595e+00,8.902263864214504663e-02,5.039474315082606015e-01,7.159274367990313415e-02,-4.719162511042502839e-01,2.020469432097487861e+00,8.109064976932236490e-01,-1.265541411673164252e+00,3.694765624135380455e-01,1.115439329882853547e+00,8.371119073468068494e-01,-6.181044349289712692e-01,1.797787084173821714e+00,-5.881676600563374713e-01,1.166430859688021959e+00,3.789783028756159022e-01,-5.455547148787607270e-01,-2.612953397061692495e-01
9.188367235750195539e-01,4.283883337429745808e-01,-3.079125170222404839e-01,-2.692361351499398814e-01,-5.122734778920773335e-01,6.435837434694282599e-01,-7.041557838099621325e-02,3.955736251396411163e-01,1.678543560131189993e+00,7.547750510194423113e-01,1.073235413381801173e+00,2.843977151309236562e-01,-3.751204494995328265e-01,-8.935585298760262418e-02,-4.534520543223708455e-01,2.395646550427062316e+00,-7.848862122076782910e-02,-1.856826147702389518e-02,1.148223212955847006e-01,2.100943419265312029e-01,-7.626042902879965890e-01,1.011765701549679708e+00,-1.848064307090159231e-01,1.161389030645770537e-01,1.394039875899071523e+00,-1.064037760334622051e+00,5.684046981457234471e-02,-6.337401668562632207e-01,-1.292600900987934676e-01,-6.019244287800182835e-01,4.816007682849788862e-01,2.582308334563790275e+00,-1.751025052924181646e-01,-2.065746627842250938e-01,-5.043667074349296175e-01,-7.929949175313690812e-01,1.420572317950625330e+00,1.150713656663547635e+00,1.730479224340584432e+00,2.010956017208755497e+00,1.131828356908887834e+00,2.135543670881667466e-01,3.450491452037953155e-01,2.522195023036598593e-01,4.499889414412150401e-02,4.901469421787165714e-01,2.944484611345576930e+00,-1.129917185134768076e-01,2.242154902711299969e-01,7.112841704536886356e-01,4.538967238345099631e+00,1.729019209237354193e+00,1.071303079973237704e+00,-6.180660665275217180e-01,-9.831150088426561240e-01,1.774832447577624261e+00,1.012334650600742458e+00,-3.177820490022355004e-01,-6.896322779521234514e-01,2.599728195824403176e+00,9.228758200806129741e-01,-4.243159414827311071e-01,-5.951119248708938159e-01,9.335152805823008215e-01,4.602017387030162832e-01,-4.313552378635718831e-01,-4.488830153250705224e-01,1.042358582345541906e+00,1.318021849579591870e-02,-5.498430770409895585e-01,3.219833091038886597e+00,-1.254381490646802322e-01,3.688456021012337938e-01,4.656747757069399363e-01,-1.122188501496707014e-02,1.193889175271479974e+00,8.997391568072615753e-02,1.162386349281939735e+00,-7.194492959599373405e-01,-3.870283064435759424e-01,5.504591831625992304e-01,8.439718181619177972e-01,-2.263195730895501134e-01,1.183413341013843434e+00,1.071710482937148434e+00,-1.173405628162966119e+00,-1.468284058588712471e-01,2.249909687619508158e+00,7.083369705192359422e-01,-8.021092268618981169e-01,2.564733169111862665e+00,6.508816008517159801e-02,1.023351180163446061e+00,2.313001773961383123e-01,7.943207191830499170e-01,-4.134612083691335815e-01
5.474647702154654683e-01,4.185590146077368123e-01,9.624680697137762142e-02,-7.060649230926880904e-01,9.953294554871459920e-02,2.026666631154357134e-01,7.115342914557130083e-01,-4.925149669249888063e-01,-1.420576080312084821e-01,2.964813543003958496e-01,7.130691244761568903e-01,-3.877418342359092995e-02,-3.773380510324803594e-01,-4.038425193618414705e-02,-4.667471344159256907e-01,1.327243797483715237e+00,-5.996521634377183219e-01,-1.411458610551676041e-02,4.638431348836528217e-02,2.963345855140810808e-02,-6.000128547052507866e-01,2.181294386543059793e-01,-4.823004779995704872e-01,2.896492040877088336e-01,1.779241700111003910e+00,8.816019784002743220e-02,4.306128651582040723e-01,-7.013846802147886139e-01,-1.194371561800271486e+00,-1.253888282243078356e+00,1.905479840933313185e-01,2.508583521042160758e+00,-3.137593106604214532e-01,2.445990005088179986e-01,-5.764434305258325786e-01,-5.758297653282529183e-01,1.220046400365185413e+00,1.043558060756531347e+00,2.344966656176878494e+00,1.222376330074907980e+00,3.145197216223032388e-01,4.164615040828776316e-01,-1.557327986016669441e-01,-2.315860005535680943e-01,5.061056304608152479e-01,8.574280130564956304e-01,2.113102501752489815e+00,-3.361248960122414364e-01,-2.555734919006023842e-02,6.444840527426793919e-01,3.497107807217417985e+00,1.800769399073308019e+00,-1.168812131010101840e-01,-4.363819984426344223e-01,-6.351429635705473364e-01,1.767934235520706832e+00,6.620395729802019957e-01,1.578512140207936898e-01,-5.390318750765304978e-01,1.620713387965165397e+00,4.653755973935745915e-01,-4.742553227893326340e-01,2.167822751397827791e-02,9.364220974278010257e-01,1.188317911085226219e+00,3.568988271370039933e-01,-8.806878314329258384e-01,6.220948880590666530e-01,1.662682431651764658e-01,7.757216246285350003e-01,1.755924629642063195e+00,-2.917057998432026622e-01,3.553376577437757367e-01,2.957585193592056072e-01,-3.568516048073571145e-01,1.007633157189615769e+00,-6.266554641467347864e-01,6.489826408719998607e-01,-1.034922531004647706e+00,-4.289169150084742865e-01,4.271921326794331786e-01,6.243281075063908392e-02,-1.922711596419582336e-01,1.936860668404052577e+00,9.111518985637694357e-01,-1.314464400250292542e+00,4.785765634665889445e-01,8.805711472636663650e-01,6.383543413212440232e-01,2.313085126454105800e-01,1.240634411031640294e+00,-3.607163708273792846e-01,3.083229984515206690e-01,2.608595690611213991e-01,7.434033354113240843e-01,-3.631687776180424487e-01
5.156702303611793159e-01,3.246780637811003123e-01,5.452151931691751052e-02,-7.482112532445509556e-01,5.877944983559633962e-02,2.210481296411523910e-01,7.203776804729185024e-01,-4.940209193995263592e-01,-2.055850519130029141e-01,3.560120375165048978e-01,8.546961385712505965e-01,-3.601386595516703482e-03,-3.516137383662992777e-01,-7.672507938985463627e-02,-5.480567212133387045e-01,1.420530080194294387e+00,-5.585922664054181475e-01,1.890907982237971519e-02,2.786003644516760885e-02,-2.464095007010967675e-03,-5.449763355442170942e-01,3.278794585849006404e-01,-4.420143670389936608e-01,2.727711274994266133e-01,1.832810476083335693e+00,3.518579924594286007e-02,4.436059665282180431e-01,-7.047577919714750339e-01,-1.222370012479307988e+00,-1.321354404777148384e+00,1.540762726195578636e-01,2.526821777114220957e+00,-3.426464178767303359e-01,2.878017129507586813e-01,-5.516197434832439406e-01,-5.815019893421559116e-01,1.199612533722610230e+00,1.063765941879909693e+00,2.501147353277534791e+00,1.347221531252646542e+00,2.921671102859819125e-01,3.950363843079845450e-01,-1.449176204983433913e-01,-2.811371963893464776e-01,4.360154692622350003e-01,8.159199219597905728e-01,2.095930527928783871e+00,-3.922331557404410418e-01,-5.868966179740382760e-02,6.026471660195911184e-01,3.499296467071403960e+00,1.865969983312619984e+00,-1.106839680638402879e-01,-4.599274325154141807e-01,-7.205384274899382380e-01,1.874641977009816829e+00,8.333601832973067669e-01,1.977327267588220028e-01,-5.739712358175776963e-01,1.859962168223845858e+00,4.452530184122941437e-01,-5.038576955662540380e-01,2.899738042293056872e-02,1.023226400115397006e+00,1.198440161884371191e+00,3.341407908233902657e-01,-9.352169983879418114e-01,5.661006494936111633e-01,2.582554423222003792e-01,7.944932991366381314e-01,1.751671997758924126e+00,-2.373765408590203796e-01,4.131438754040580030e-01,2.465107033692503502e-01,-3.935618107481655414e-01,9.811287424005710189e-01,-6.900980215625640568e-01,7.809719796651775070e-01,-1.080133244329587017e+00,-4.062503982803340463e-01,4.834776834977358995e-01,1.739828516339346209e-01,-1.954464761416455643e-01,1.963689546053783541e+00,1.033977858530701344e+00,-1.405419676708978161e+00,4.645818116951394572e-01,8.864149904826222892e-01,6.142497406817127859e-01,2.430680285795491780e-01,1.282317742124090998e+00,-2.657891048009763946e-01,2.030142970635152588e-01,2.211690215316154395e-01,9.138647533505022125e-01,-4.016934916166771119e-01
7.010520978500158762e-01,8.021620799359236997e-01,9.742266234640960254e-02,-6.430040196393986829e-01,3.658868534558025465e-02,3.148086732952308231e-01,7.806218301913279145e-01,-3.118125806097969410e-01,4.669445832113834349e-01,3.875086432102947676e-02,3.824068833419907998e-02,-1.363967325893630234e-01,-4.733785470185903899e-01,-3.662560373420482851e-02,-3.066292411786951666e-01,9.590997413456304743e-01,-6.970987093959226666e-01,-2.000297433694392946e-01,-3.276862277649478239e-02,6.424099066471246344e-02,-7.263718213564717141e-01,8.568705417498018173e-02,-6.250079786839538576e-01,2.280188865912854967e-01,1.752257422958870547e+00,4.252743172737770139e-01,1.889884503851356201e-01,-7.154325862164583327e-01,-1.587922895031192105e+00,-1.311178188002060541e+00,3.269161100772713935e-01,2.551126747584875787e+00,-2.173933552220789212e-01,3.069108663367279277e-01,-7.523075814694080155e-01,-4.589230295993994568e-01,1.695660374276991567e+00,7.087354280065019108e-01,1.937884702012360183e+00,6.476940304888944011e-01,5.019150528472162698e-01,5.944606219971466654e-01,-1.342339970159373008e-01,-5.012036539404636504e-02,7.537519657104768678e-01,9.559331098809978888e-01,2.163319930254175016e+00,1.057666253504039172e-01,1.839353792721200309e-01,3.321243824557230107e-01,3.771207759307943164e+00,2.057411811057713091e+00,9.955143296507457107e-02,-2.141870457602551014e-01,-1.979125379957234754e-01,1.374401703190071933e+00,-2.808569963189755381e-02,-1.431136869024864922e-01,-6.568622382859858888e-01,1.278422349970205207e+00,-1.318958886093432592e-02,-3.396713146475718315e-01,1.037778107058585364e-01,3.654716028020675300e-01,1.360978411567329127e+00,6.727856702972797587e-01,-6.310756709570455314e-01,8.286013083113584754e-01,-1.190572062873437864e-01,6.851662525243329416e-01,1.738789424554434859e+00,-3.299573369205227036e-01,2.940809772402470934e-02,7.081390959062394685e-02,-3.932085884669755949e-03,6.170473698979003219e-01,-6.021826720256663323e-01,2.805370562465769879e-03,-1.289745450497358226e+00,-5.096968398054941840e-01,5.653812962973536749e-01,-2.136304982677046937e-01,-4.124077832606767302e-01,2.021208064156665429e+00,5.772458351839917512e-01,-1.227428958271101989e+00,4.145066057039623053e-01,6.521073402876740310e-01,9.507581361951851218e-01,-4.523720744812919636e-01,1.203457176487795044e+00,-5.539351509022359954e-01,8.483104751387553488e-01,4.429067005344536345e-01,-4.404733197780228982e-01,-4.731261188713197230e-01
7.459188432185366313e-01,1.069197166707464897e+00,-2.242004901934921413e-01,-6.688400069977501472e-01,1.472722632147993038e-01,2.034179882923355387e-01,7.855313856247181370e-01,-2.754660368736893128e-01,-2.777290788192485760e-01,-1.978933316788183960e-02,6.556107897505585314e-01,8.327325605245447515e-03,-3.114130952772721228e-01,3.249930031911704709e-01,-5.460198294368113769e-01,1.451987965461098096e+00,-1.268050684817055573e-01,-5.069432663016061325e-01,-1.747703640140949727e-02,-1.595279598134702603e-01,-3.661942248332287209e-01,8.496035478208630032e-02,-7.324583381174493146e-01,3.217816389022795653e-01,1.748010418798583432e+00,3.198748197554485140e-01,1.928202632652737392e-01,-5.976117122776802848e-01,-1.115598381749308254e+00,-1.299458413739424278e+00,2.625493493988004245e-01,2.051844824803452649e+00,-1.653256401625761984e-01,2.884523297970927880e-01,-7.952003640924831807e-01,-7.307334768000880443e-01,1.508228213100705206e+00,7.555040358529432343e-01,2.095200173708061886e+00,4.699529532768620399e-01,3.308909231306657595e-01,2.550770041808242405e-01,-3.016679037691692433e-01,1.041577990168499890e-01,3.555052264017719565e-01,1.000245676963084529e+00,2.012530171664007383e+00,2.037923782675345880e-02,9.684292782637260455e-02,7.041111569582610974e-01,3.892836199879947223e+00,1.784733246136013252e+00,8.929460124035959456e-02,-4.165556287537627300e-01,-1.493688243050950160e-01,1.346837145562810756e+00,1.565975652372239291e-01,1.441530427027117867e-01,-9.262444950871095983e-01,1.127318709740166014e+00,5.885069712433893541e-02,-3.747112070891542857e-01,1.494283422760005753e-01,3.741678681778524140e-01,9.809479072530435939e-01,1.830969347563594918e-01,-9.022925187129398061e-01,1.511910044001559816e-01,-1.420409866615124361e-01,1.112933402455432041e+00,1.898540179329737398e+00,-2.658639660709109509e-01,-5.989539609017481558e-02,4.138726760428423912e-01,-1.999850197023085308e-01,9.194887581186406145e-01,-7.006565154274179141e-01,4.794767638923582709e-01,-9.144472360327555727e-01,-5.906723864083494036e-01,8.923149957437610524e-01,-7.511577914935269051e-02,-1.898232821131919934e-01,1.700927588864715512e+00,8.693035152151828981e-01,-1.163715412805106819e+00,4.800594510042017204e-01,3.061701590516543448e-01,7.353768263006826844e-01,-6.787281548916612728e-02,1.053450642418992000e+00,-6.424557057693900397e-01,5.838095032226748859e-01,1.909666731862822431e-01,3.590139367820643912e-01,-4.180218367870943696e-01
5.612371169956089645e-01,1.262058640860534986e+00,5.771092277533789172e-01,-9.948918995969213697e-01,6.737999705739791123e-01,-5.016144558559183508e-01,4.246852060324355360e-01,-8.496000397205965005e-01,-6.329071344357937168e-01,-1.052090840891214685e-01,1.072307289278855991e-01,-6.014241848280693636e-02,-4.444179983087527819e-01,2.286102800852882200e-01,-1.629717929851607350e-01,7.605972264510073577e-01,-7.238032857093881223e-01,1.924097584850211762e-01,-1.818404645493716665e-03,6.475896883889922795e-02,-7.171936668248278801e-01,-5.880553350975974425e-01,-7.685409383505928949e-01,4.154717969259704158e-01,1.727842165936173124e+00,7.830904206508615406e-01,7.086856190146511025e-01,-6.269997556645197090e-01,-1.181041009623119198e+00,-1.189552513254050536e+00,-8.356350597138517688e-03,2.225845511498518725e+00,-5.200202494141177301e-01,1.953967147077564914e-02,-6.715160219642387629e-01,-4.615297788591851136e-01,1.031065929799241498e+00,1.146529519722908397e+00,1.942291160406719897e+00,6.148811565990673911e-01,-1.665845358263690068e-01,3.978749295941308994e-01,-3.032157804363549980e-01,-2.873837710257310940e-01,8.876532997334561914e-01,1.173737634756774950e+00,2.124821325160355823e+00,-4.108906589402903098e-01,-2.909929875955476475e-01,1.552085070949125178e+00,2.540803749104422860e+00,1.037064153683052492e+00,-7.656611204272446569e-01,-3.046788473277295961e-01,-2.483246666341110687e-01,1.429631534869827192e+00,1.209204048629518302e-01,4.384518756595356948e-01,-4.870708414709343237e-01,-1.051847681727584582e-01,5.617482879258278716e-01,9.807145514959009214e-02,4.616445484546831679e-01,1.174630713696023010e+00,1.528940995182380913e+00,7.151021501034059424e-01,-8.269041795025884323e-01,3.532110124967542952e-01,2.926409701291323717e-01,1.119373623041304944e+00,1.135157376141174401e+00,-8.350224221930468982e-01,1.080639018505615695e-01,3.614424527150025823e-01,-6.530047682104201945e-01,1.269444550970722396e+00,-4.056873595891365980e-01,3.859221977996313280e-01,-9.409823909910044470e-01,-1.860149492102889657e-01,1.579015755503071494e-01,-6.246098570699893937e-01,7.664771040026485682e-02,1.914166940501150105e+00,6.159386540824863809e-01,-8.566362541402798847e-01,9.670285795108579663e-01,2.380785266929754673e-01,3.544500854446316351e-01,1.238011030145525160e+00,5.624612923047109803e-01,-1.187273971284875884e+00,3.227306289987207366e-01,1.961705996532490115e-01,7.576430734163626113e-01,1.463845653050307449e-01
8.031925912239855636e-01,5.589282694158861364e-01,-1.219074384742679373e-01,-4.357415221266658922e-01,-3.279432332157779517e-01,6.983822205973062580e-01,7.335008108167513363e-01,4.086503450806970583e-02,1.257139970475185553e+00,2.272758951166151675e-01,1.020309672924545885e-01,-9.819564419484955176e-02,-4.897838754316330978e-01,-1.889707271140134703e-01,-3.513193606323815055e-01,1.243705069135815133e+00,-6.323729401260249627e-01,-2.776640406690703555e-01,-2.494537544658650616e-02,1.221396547120741916e-01,-7.882636157882459971e-01,5.166296476808738269e-01,-4.789429819746623962e-01,1.185930689178827657e-01,1.689149374301951445e+00,2.768708307643140062e-02,-4.587439047612401621e-02,-7.455122593189044133e-01,-1.525558507205686976e+00,-1.219551928545959285e+00,4.952677458356546936e-01,2.739616517107195115e+00,-1.018475092696813911e-01,3.132576629359219433e-01,-7.388058720724074435e-01,-4.835292389617128483e-01,1.941832976676571842e+00,6.095536188691971224e-01,1.848436594867690852e+00,9.225373468130233512e-01,9.076996508380070772e-01,6.409100831059327819e-01,5.034827050608575716e-02,9.153309063727539663e-02,6.238784187674222270e-01,7.812884833175318677e-01,2.363606414775259346e+00,2.916360170651550732e-01,3.880706922080301435e-01,-9.945065586073276176e-02,4.379524036559239164e+00,2.414376099712929769e+00,6.333432735211216302e-01,-2.221196101501072828e-01,-3.156006047715782525e-01,1.413733521945384153e+00,6.363989935801950271e-02,-4.464846783006830577e-01,-7.070576490398103875e-01,2.053256725510292036e+00,-7.928822362569468152e-02,-4.959809749770223153e-01,-1.653565404145880824e-01,1.500712919597925188e-01,1.177890304015148937e+00,5.155872425982827023e-01,-4.705854094884480698e-01,1.138773519267095358e+00,-2.521946404261771191e-01,2.122022070330594479e-01,2.241489775014946950e+00,-1.150767244641348330e-01,5.659704422373855459e-02,-1.950352288235110421e-02,2.794245306054245481e-01,4.283072567503378725e-01,-5.177560526885222059e-01,1.862128707711407927e-03,-1.370044495229626014e+00,-5.933210475330950029e-01,6.865275958512969678e-01,1.208035665109363915e-01,-5.957039982985707915e-01,1.933145740410418423e+00,6.113795069511671620e-01,-1.355390042414992058e+00,8.562259653417805816e-02,1.153557756142451041e+00,1.165483822013940962e+00,-1.237644239279748426e+00,1.735192039397732922e+00,-1.995105011752450475e-01,1.147033245522962153e+00,5.302712911094659143e-01,-8.036111777630354780e-01,-7.008432546537677332e-01
8.921250897531378676e-01,1.125472359375319753e+00,-6.435985194882112848e-02,-4.425016307602159804e-01,-5.722376692973925316e-02,5.083379950041120310e-01,8.511074097454814913e-01,-5.085941832059699685e-02,9.453916025891417885e-01,-1.526520569432808505e-01,-3.201856026632031171e-01,-2.021722316590360280e-01,-5.165604763514138886e-01,8.756115309898676591e-02,-1.986205732713212657e-01,8.781978393388216730e-01,-5.984483171185139838e-01,-5.417954386110743759e-01,-3.299377416355837866e-02,7.158368021060489139e-02,-7.730711245538883780e-01,1.738533780184636779e-02,-7.525314992811904524e-01,2.111524512855247615e-01,1.629558277898678131e+00,5.051302033310299811e-01,-8.184256489780966648e-02,-6.946287967861829449e-01,-1.607816727656461664e+00,-1.210260867425013931e+00,5.265736748562712677e-01,2.450622572328670312e+00,-2.465417217325377441e-02,2.993224639651013153e-01,-9.074946962806483830e-01,-4.956072358722139470e-01,2.050729529160007836e+00,4.366931828341334421e-01,1.493517433900124036e+00,1.406789265741017481e-01,7.640275791098978253e-01,6.390885054520194508e-01,-1.398314713042907442e-01,2.510912446074093363e-01,8.097893223317218503e-01,1.024223128831065699e+00,2.209850961440103845e+00,5.115586060184584838e-01,4.343252932962077262e-01,1.034813598745557561e-01,4.269029101233168255e+00,2.202589088646370818e+00,4.377172948518212037e-01,-1.249835519897419811e-01,1.693513843400952235e-01,9.789683817579291070e-01,-6.131412606976148760e-01,-4.145215901700671779e-01,-7.813596281561011603e-01,1.004922918989665792e+00,-2.845139198042943018e-01,-3.405459801227260774e-01,3.041093673657630989e-02,-2.422732708735250151e-01,1.221556568345621319e+00,6.493601598017251231e-01,-4.449051051940506318e-01,9.296360516355296477e-01,-5.302813470808152019e-01,5.948278835900122630e-01,1.997546719918988911e+00,-2.976933004202986788e-01,-2.710825701867464743e-01,1.140849618674711768e-01,3.262385693436307688e-01,4.440597731280718219e-01,-5.249022654707824476e-01,-4.419174578234764672e-01,-1.264659022166156443e+00,-6.914518038761969798e-01,7.348468293158704201e-01,-3.664307579830068939e-01,-5.493193442674635385e-01,1.897059324691152238e+00,2.953936912699105521e-01,-1.082249512133133029e+00,2.752235452559940732e-01,5.794502186187081572e-01,1.209172065199235035e+00,-1.099331324931838383e+00,1.267563068277079985e+00,-6.755452797198024939e-01,1.351190635250793637e+00,5.717080861746342002e-01,-1.302998607626402849e+00,-5.836571351081500936e-01
7.420376993269784949e-01,1.424528722169071893e+00,1.288351546708673134e-01,-1.423513976296003181e+00,-1.279321133111920306e-01,-2.553106920860977458e-01,-3.324875442186651653e-01,-1.958217597498068674e-02,1.120945917520537627e+00,3.119396379706784184e-01,4.156928547407325869e-01,5.353989771335405656e-01,-3.585798739467294660e-01,-2.187862743486659323e-01,-7.164821835803467653e-01,1.720305967476651654e+00,-8.072169639071946623e-02,6.235749168291971900e-01,-4.688798558181005438e-01,-1.024847118747979069e-01,-4.932477489259273762e-01,7.907718149923397277e-01,-4.230923723741550901e-01,-5.364556537283537985e-02,2.115607929114720953e+00,3.500553947219415818e-01,3.232795506571368715e-01,-6.038975153934963425e-01,-1.620252229888013096e+00,-1.723888499331651669e+00,-2.133540703184928500e-01,2.532457637062425881e+00,-8.787179911625542239e-01,1.928705969411369792e-01,-6.797941033846816028e-01,-2.974370103839140134e-01,1.800397848970067383e+00,9.292480905121676127e-01,2.507040053829977300e+00,1.517335785949736948e+00,2.018534128530125038e-01,3.336187848573404224e-01,2.892052822910767818e-01,-3.325826763300460120e-01,3.889064980082130307e-01,6.948517961874349780e-01,2.807833531795758120e+00,-1.814652231909356095e-01,-3.833002479990644251e-01,1.104838769589294722e+00,3.117514974200278122e+00,1.859196127296505408e+00,2.561510814703755745e-01,-1.648856199419262147e-01,-5.941161773628755860e-01,1.938625981811840315e+00,1.065869139086567330e+00,1.783511330215541701e-01,-1.322761936715937114e+00,2.144135745477084853e+00,-3.093121121269086782e-01,5.878520366776216477e-01,6.322666704918337155e-01,1.564203435945453524e+00,1.860574355580893791e+00,8.258115149205482730e-01,-6.067978465191237181e-01,2.184778435266618302e-01,1.146965099070677008e+00,1.996578442023075328e-01,1.711025858410676115e+00,-4.814994398198083059e-01,9.642907348354767816e-02,-8.065860933755159001e-01,-3.939042602089335432e-01,3.401491596010441931e-01,-4.309990461521973071e-01,1.156837430856687110e+00,-1.950510077158913891e+00,3.263703303439565717e-01,1.108958778135891832e+00,5.390467920005403979e-01,-2.744714449272303014e-01,1.889566975691908901e+00,1.615933340010843100e+00,-1.532479697967920718e+00,5.052864697643396630e-01,5.458954158005555612e-01,4.841443875418871001e-01,-1.108862051789195058e-01,1.736342101534173343e+00,-5.299588911402893787e-01,5.899546771059527295e-01,-6.550015118077778808e-02,7.183759511915084328e-01,-2.411123743337918734e-01
5.868032946835722852e-01,5.851474499286279940e-01,4.536445745939052254e-01,-9.035971240542260974e-01,5.791065506017226139e-03,2.714536432793049348e-02,1.828295089882513436e-01,-3.873611305777882596e-01,8.861571178375116098e-01,3.949664187591629405e-01,1.645987579234362008e-01,6.945202507513474621e-02,-5.078593738836407745e-01,-3.490739505230963657e-01,-2.818979930193222794e-01,1.130041270260415232e+00,-8.807493562285459987e-01,5.454161353917627020e-01,-8.989940579574409729e-02,2.239784109452764571e-01,-9.169134928776284665e-01,3.326340167460375974e-01,-3.564982034939032651e-01,1.318409333225643576e-01,1.803323228266780820e+00,1.508482043441825848e-01,4.761330567596248065e-01,-7.434583959436089629e-01,-1.436085014706199647e+00,-1.248400224879070874e+00,9.350453884414713923e-02,2.884783243046548318e+00,-5.769320520974823285e-01,8.933464222818214562e-02,-5.311435451656529860e-01,-2.946847322133471225e-01,1.399012869599784770e+00,1.110493128748079705e+00,2.146753965785251683e+00,1.595003682052937855e+00,3.937502718258071299e-01,6.063892925270117917e-01,1.583299850876694337e-01,-3.796083934999585074e-01,7.841542742742882988e-01,7.677270114819262359e-01,2.574763646893326374e+00,-3.222502493227704101e-01,-1.352913731350943727e-01,7.877244739814228680e-01,3.125310985886030402e+00,1.767393345883841782e+00,-3.560363174502967354e-02,-2.377566832271911790e-01,-7.441545070091734049e-01,1.858975585769076622e+00,7.156260114938052252e-01,-1.459203059117727963e-02,-4.955861456357231187e-01,1.695241029490577533e+00,4.251175277320216606e-01,-1.965783365282655626e-02,1.411887856795372154e-01,1.328038459108775049e+00,1.633389779818873899e+00,7.975517857981883063e-01,-5.423661388283330664e-01,1.056402489284265611e+00,5.478021862610923387e-01,1.223814540312825327e-01,1.689904114977794913e+00,-5.108388777016855675e-01,3.890057874364414858e-01,-2.072022636699537845e-01,-3.118754356108105474e-01,7.649295557404435231e-01,-3.061902830609487536e-01,5.627764880089792809e-01,-1.473304055369126342e+00,-4.991345518647488655e-02,2.340498864444987559e-01,9.652528181103958715e-02,-2.846956407583992044e-01,2.049139397244198690e+00,8.871798854773317311e-01,-1.306750993280733297e+00,4.704141513314543666e-01,1.222401299922801332e+00,6.348072510489162212e-01,7.994998891244692318e-02,1.567499994381906125e+00,-4.268049903626328079e-01,5.998804189849318291e-01,3.212153220031093159e-01,3.665755678363086245e-01,-2.169649614625905887e-01
5.081686875771722622e-01,2.255952581732116879e-01,2.778586609878977987e-01,-7.569504997631150145e-01,-5.751890589039447554e-02,3.547665506924078116e-01,8.080684966742601727e-01,-4.837187120670310425e-01,4.863367894888706577e-01,3.001918946587218695e-01,1.708525878329008596e-01,-1.483186351323081131e-01,-4.964668283326072462e-01,-3.735509920654063731e-01,-3.646333125185609036e-01,8.951102461893751805e-01,-1.024779886802442919e+00,1.815849853812279147e-01,-4.133972322408024230e-02,1.421896171278725085e-01,-8.165583877728138651e-01,3.166618500929407887e-01,-4.130710686707378954e-01,1.680554645035319816e-01,1.891568082099827075e+00,2.956205021784868991e-01,3.532376062460887423e-01,-8.067087992034347455e-01,-1.852832533115903679e+00,-1.454720357694936350e+00,2.223359248351607920e-01,2.931811222261061722e+00,-3.646546508668293551e-01,3.978166103954925426e-01,-5.881906530749659856e-01,-3.156669368980878909e-01,1.543718410951570696e+00,8.749513230935670460e-01,2.358168565439621833e+00,1.262154123937494932e+00,4.476000770362109638e-01,7.281369469746852285e-01,-2.975333709338933569e-02,-3.771429364375842308e-01,8.172273823417989247e-01,8.150747840594767535e-01,2.167648886050793422e+00,-1.728500571387370788e-01,6.814653268226948668e-02,1.253653137976457055e-01,3.492129787692605625e+00,2.260794706236473939e+00,-5.689051643068565589e-02,-2.115111083508444401e-01,-5.978485801620767592e-01,1.795697767307115722e+00,4.878570641109312711e-01,-1.031412397100254230e-01,-4.525715055046917734e-01,1.965166578300493905e+00,1.125230226625102414e-01,-4.460523105819378387e-01,7.392570596925546189e-02,8.084898661540725895e-01,1.613464340033813782e+00,8.762681198270703131e-01,-6.845351505057236663e-01,1.099878078305324802e+00,2.211397639229310819e-01,5.250020570498213912e-01,1.539564877007415955e+00,-2.622176096250977695e-01,3.705493529636478822e-01,-1.701735281422910029e-01,-1.242984787309431571e-01,5.297184236836793847e-01,-7.039527637394298321e-01,1.945339297158433789e-01,-1.541002327117754644e+00,-3.716820365470797638e-01,3.512212675570991482e-01,-9.691839687855308139e-03,-4.715416420339024195e-01,2.310655708666556230e+00,7.509251666139062920e-01,-1.499954356973156600e+00,4.054291471551863535e-01,9.605690552473779009e-01,9.051355503393151425e-01,-3.145821145171424082e-01,1.337825413403139097e+00,-2.316589304659226745e-01,5.312288875492967577e-01,4.660718702177575890e-01,-1.174089591727008053e-01,-5.310150762047819439e-01
9.072096905596930272e-01,1.745844939595154965e+00,-5.895425221338466137e-01,-8.507006774002245919e-01,9.061802257870489596e-02,2.108792428126033680e-01,8.873473234878510585e-01,-2.637411248707129119e-02,-3.174970219772528246e-01,-3.445066043165562197e-01,5.506692492050152543e-01,1.259107755753500202e-01,-2.283386794669118591e-01,5.555478500535488973e-01,-7.893074903497184769e-01,1.548434953600668518e+00,3.783986628353395720e-01,-9.057678177926685725e-01,-2.396296209648797748e-01,-4.441227226266848960e-01,-3.088660005604937364e-02,1.649039619965856074e-01,-9.618886659623400170e-01,2.523801487491820761e-01,1.936322159981870072e+00,7.396342830975477511e-01,-9.479983478049161527e-02,-5.134410589550103543e-01,-1.506396740290759650e+00,-1.690961267492912867e+00,2.223684186862064927e-01,1.689447904539925993e+00,-1.351201426529325400e-01,5.298145382257639646e-01,-1.048289929599079739e+00,-7.711155762458822283e-01,2.024799419969263603e+00,3.328662364454676448e-01,2.162100614915285046e+00,-2.627806042872962156e-01,2.772504371586503868e-01,1.544913323970695807e-01,-4.044476460094175718e-01,3.131995497829292985e-01,1.944884773576044390e-01,1.097434723630738240e+00,1.880942980638590889e+00,4.322259400364062976e-01,1.631816602341412958e-01,5.209312919226647409e-01,4.253914447771042440e+00,2.104236567362490984e+00,3.220632187637400556e-01,-2.897410108347323598e-01,3.543485812950312175e-01,1.051185551625865244e+00,-2.136623481239309230e-01,1.365043113663618746e-01,-1.524747575027241453e+00,1.085048491822274475e+00,-7.825462853845738254e-01,-1.723204321829559515e-01,4.776406752626839447e-01,-1.513213017750754119e-01,1.070675725015667101e+00,2.745431668403121028e-01,-9.568774878803210093e-01,-4.312222920754283928e-01,-2.006878683567664412e-01,1.521549174796337889e+00,1.835110852638610179e+00,-1.535512892478985425e-01,-4.993179792883168377e-01,1.189596892804826028e-01,-7.308137446038240337e-03,4.521176549215663587e-01,-9.936986886287906273e-01,3.335504678236852483e-01,-1.207509467193310426e+00,-6.412003809461535031e-01,1.625589935787933538e+00,-8.190458366302372228e-02,-3.211806929653591158e-01,1.681440806206021987e+00,1.051691086775629502e+00,-1.267992896584164253e+00,4.843740334310246975e-01,-5.415727370056906409e-01,9.032746907869855235e-01,-6.063436200409266785e-01,8.748751155171032856e-01,-8.194687114073859746e-01,7.936341967045464907e-01,7.960406467270889075e-02,-1.820434237592107873e-01,-6.157275915383173537e-01
5.449447458295466618e-01,2.956724137201026670e-01,2.664969614147145172e-01,-6.996015537456086175e-01,1.908788710184340653e-02,2.067044623934155834e-01,5.052504758666045426e-01,-4.513353819361018981e-01,3.656236105955497084e-01,4.240799711064350830e-01,5.336157847750025995e-01,-2.615307460099748627e-02,-4.469066096289824319e-01,-2.246102069603258533e-01,-3.514397382631180844e-01,1.267360561054143631e+00,-8.051135839940322114e-01,2.494904719492607725e-01,4.686574992888647290e-02,1.700556791351615638e-01,-7.978837804641875087e-01,3.047141010694869312e-01,-3.690015469529613901e-01,2.307589874560358467e-01,1.736851172941779708e+00,-3.322865797184767350e-02,4.649693007977360182e-01,-7.408287633018013629e-01,-1.200659425405912195e+00,-1.155732925642689812e+00,1.970041004894255710e-01,2.753032914366035921e+00,-3.898297748949528518e-01,1.434664836702668200e-01,-5.081180031272345410e-01,-4.683485783921519374e-01,1.223173480414672998e+00,1.132387628751681641e+00,2.237826771387111613e+00,1.538455691061382913e+00,4.239003869351319898e-01,5.197542521877822619e-01,4.973938717316052707e-03,-3.028552776108577316e-01,6.269447960116287799e-01,7.802446283138089189e-01,2.332574107267138430e+00,-3.786549414879138986e-01,-3.841423051829158386e-02,6.500315095749893413e-01,3.393920416317359301e+00,1.788447085528932945e+00,-5.012816309936429793e-02,-3.888082434319956038e-01,-7.891796768025498565e-01,1.859817618993149235e+00,7.548658921818915957e-01,4.143450467748621691e-02,-4.021771311302612117e-01,1.772257134703020265e+00,6.087538753957341120e-01,-3.847745999279315043e-01,-4.926690634003884350e-02,1.134159009698224807e+00,1.301840630014339695e+00,4.778593061334739378e-01,-7.188850239914028606e-01,9.591544019531081933e-01,2.809485973173836970e-01,3.834040801482366811e-01,1.822746590457759552e+00,-3.579096958134752593e-01,4.592000346725639282e-01,1.629416459109919724e-01,-3.266706172067249114e-01,9.811593746250946158e-01,-4.402960520027903168e-01,6.275641339139932384e-01,-1.146013058985826394e+00,-3.034742972139571338e-01,2.215656201214337706e-01,1.193370584897877618e-01,-2.334279800011339057e-01,1.973096882291222709e+00,8.567081133016379857e-01,-1.309125118685148692e+00,4.205128785163489979e-01,1.257137656323306985e+00,6.461184113128265460e-01,1.490537676715474880e-01,1.474800871926243095e+00,-2.920862010435502087e-01,4.259456468300703014e-01,3.275133582344005867e-01,6.330737948148783545e-01,-3.109541262899198077e-01
1.002478063227596472e+00,8.043307940645104681e-01,-6.302549750650692229e-01,-2.386037441389285418e-01,-5.169889270806052872e-01,9.418617848458052944e-01,7.411855114360006436e-01,4.327521278157460127e-01,1.353149610698812344e+00,2.007576558579342862e-01,5.071562357870574855e-01,2.678982350466957429e-02,-3.776483658689436806e-01,8.764251565782682496e-02,-5.470006274303071958e-01,1.821938716856710272e+00,-3.393020855920381162e-02,-7.629486556626344784e-01,-1.601924258894978775e-02,-4.019510450943427488e-02,-5.272097791112669851e-01,7.712717825369170832e-01,-5.425407306017377973e-01,1.166835934665199637e-01,1.595769985257215584e+00,-2.708669780840746166e-01,-3.313158495157590977e-01,-6.509486343378688700e-01,-1.102658711234277389e+00,-1.118914652867390336e+00,6.392252052216489400e-01,2.373751974180527746e+00,1.069753025407551572e-01,3.071270096497260571e-01,-8.475248172577429795e-01,-7.514870619255930029e-01,2.124558055570555215e+00,4.443361699001822651e-01,1.725068810599983404e+00,6.908209683154888925e-01,1.143975001140126846e+00,3.956255419583767363e-01,2.148187555140931154e-02,4.625432704737311163e-01,2.151980853786236714e-01,7.395605137666929618e-01,2.382488831142859365e+00,5.411803246927030520e-01,5.632067278960973811e-01,-1.727502110534094859e-01,5.123449096077401066e+00,2.492151413819134298e+00,1.138321485985901216e+00,-3.555405553693939957e-01,-1.640504317439452908e-01,1.224246066918122322e+00,2.162135310595447724e-03,-5.222730164457513036e-01,-1.052701543213533819e+00,2.305438819180302801e+00,-2.176887419220241149e-01,-6.196039108818530705e-01,-3.225535788804910764e-01,-2.801238421947284118e-01,6.715287126370572679e-01,-1.549187703601584420e-02,-5.154531592454494326e-01,7.823412843144211815e-01,-5.477021796822189037e-01,2.437018286524754440e-01,2.824261628289571391e+00,9.964567823242825861e-02,-1.567880945968366802e-01,2.234054142686043853e-01,4.544437626540182018e-01,4.671278924067018279e-01,-5.226776279823326377e-01,2.037742073235158657e-01,-1.100744222358727820e+00,-8.015467250174053149e-01,1.153708626476422694e+00,3.900121268108991401e-01,-5.918899233824174155e-01,1.542174300000430431e+00,7.645136047686346137e-01,-1.322422648634493214e+00,-1.369486405841688348e-01,1.118595185558445060e+00,1.244968381457307594e+00,-1.737876706556241047e+00,1.977945298694399945e+00,-1.059102806337210989e-01,1.353254878644916337e+00,4.247258304336822832e-01,-7.679032135638346190e-01,-8.604613891177561591e-01
9.056997882224830931e-01,1.425226418042518262e+00,4.078076525046016310e-02,-1.049889363891622684e+00,-3.338035946330981107e-01,2.110547564179222624e-01,3.141031165810587167e-02,2.241546991723128435e-01,1.927901828592079925e+00,1.095663466030991212e-01,-3.088547341969008486e-01,2.637692129177518496e-01,-4.981240421267078555e-01,-2.840129043003595810e-01,-4.682185363675768208e-01,1.270584786267895616e+00,-3.684460761608043811e-01,2.211866690845604166e-01,-4.176993559367747078e-01,2.093389689381023461e-02,-7.303382792386371447e-01,6.997594469700147979e-01,-5.198809697334051405e-01,-9.506563946042487223e-02,1.970225773287531235e+00,4.876185401541973108e-01,-4.456731585107953642e-02,-6.769585730527731826e-01,-1.998550894526766264e+00,-1.631851921489468005e+00,1.447941721035209406e-01,2.725467736657394724e+00,-5.579235799782757965e-01,2.987438951830307943e-01,-8.435165367103492073e-01,-2.210980660717632440e-01,2.335889976880580754e+00,5.133139175027718881e-01,1.952053834604738691e+00,9.246716451785983448e-01,6.653625969037257892e-01,6.247982672579011076e-01,2.953370307013178375e-01,-4.774533445621079175e-02,6.835871643357503968e-01,7.614249161935922050e-01,2.774720482662447640e+00,3.875557960372983390e-01,6.964246806766216658e-02,3.401926640449015604e-01,3.833009899495972039e+00,2.366733944714643378e+00,6.649042565610243649e-01,3.558114549783553127e-02,-1.644727487365405250e-01,1.466148593429045244e+00,1.884619153599846886e-01,-3.542557784399039678e-01,-1.241221259141172872e+00,2.028857628061209617e+00,-7.043265160427437666e-01,3.642957393727567217e-01,4.231768577717114344e-01,6.163992065825442124e-01,1.830450785816293502e+00,1.042170850914742708e+00,-2.944104250102435039e-01,7.900563259132531435e-01,4.839327014012573258e-01,-9.509173705069207116e-03,1.924189984851310875e+00,-3.633137033230180446e-01,-1.823977018744302181e-01,-8.510989413620180244e-01,1.871836818596265828e-01,-6.538787046253780044e-02,-4.235489067595274992e-01,2.160595066330335823e-01,-2.082555292871809627e+00,-1.396638309275388679e-02,1.114297147564926815e+00,2.427530405837449168e-01,-6.272575013981172010e-01,2.004373017894736542e+00,1.027510292438461814e+00,-1.456260752778517187e+00,2.533878970672741593e-01,6.462992061204639871e-01,1.023140329544983462e+00,-1.245227391034363862e+00,1.828650341400291257e+00,-5.102045826790990724e-01,1.300619134410653910e+00,3.061451624003326266e-01,-9.114734021187231860e-01,-5.326494458224073636e-01
7.585707135654278233e-01,5.638713841700682128e-01,-8.946848646745209077e-02,-7.561282577680561445e-01,-3.376633194344798583e-01,2.129801572548090383e-01,-2.873956363096746291e-01,1.346708118209811456e-01,1.220226723832456894e+00,7.743967714960000581e-01,1.188601853107819961e+00,4.509216112591724057e-01,-3.273706630611472601e-01,-1.820268704617426514e-01,-6.191087947405645719e-01,2.352291508569772649e+00,-6.517958610692303756e-02,4.200495330429538932e-01,-6.159570822954305025e-02,1.062209820297354002e-01,-6.339625680312637179e-01,1.022053360504272757e+00,-1.615259262280870911e-01,7.512149730838664496e-02,1.672924258384692831e+00,-7.583203744982141004e-01,3.233538160169792119e-01,-6.202469330841478001e-01,-4.437167502468105651e-01,-9.642955644798298920e-01,1.266680199000863039e-01,2.591443749703207455e+00,-5.314870859748042076e-01,-1.295358959734415616e-01,-4.454125272533360214e-01,-6.477821174435014484e-01,1.265987058595857695e+00,1.303317679339961455e+00,2.241638134310566688e+00,2.258351809436235591e+00,6.799434781401824113e-01,1.701610929628463442e-01,3.540741734481996361e-01,-1.014083750694837610e-01,5.564755289709111263e-02,4.906694577022309711e-01,2.928168593023554589e+00,-4.282131555983416105e-01,-1.503281747211352992e-01,1.088069574939214634e+00,3.778607810353320051e+00,1.592579700540332599e+00,6.359123388244767305e-01,-5.699758956885442318e-01,-1.142474651888574222e+00,2.101319379950129740e+00,1.483515386884234566e+00,3.568329663708061372e-02,-8.269018512165186019e-01,2.646230213390812658e+00,7.933809742323392200e-01,-7.819415547376692976e-02,-1.865966266190828282e-01,1.595257450488750894e+00,9.208566516407974412e-01,-1.153018439580653087e-01,-6.189675840315087552e-01,6.768044001944483190e-01,6.631749086208470478e-01,-3.120770550692132383e-01,2.668066439422223546e+00,-2.681271103251501864e-01,4.890563584919425111e-01,8.531770004029945453e-02,-3.777332878543725458e-01,1.112895760523235689e+00,-6.356973640547525228e-02,1.563921946162595944e+00,-1.056492742751640623e+00,-2.049848692329842015e-02,6.222841037585009616e-01,9.079990584199320036e-01,-1.095618149568900468e-01,1.401042609847742870e+00,1.474481014269100942e+00,-1.351854088647731489e+00,1.354628905055776933e-01,1.832351065197277862e+00,4.193689563884211990e-01,-1.114250020244988981e-01,2.328106818589251059e+00,-4.189024179800571179e-02,5.549896086630758951e-01,1.584379105201300098e-02,1.486360999096215441e+00,-2.510180476037084940e-01
1.070015396104798677e+00,2.488518390511616385e+00,-4.922867221286104655e-01,-1.418922435749090827e+00,-1.488135059575158015e-01,-1.544671470728897211e-01,-9.908931003477372546e-02,3.995251528893886683e-01,9.876416900382789521e-01,-2.398590038469233521e-01,2.710117079478431279e-01,6.169678185352835964e-01,-2.417370041965035410e-01,3.214904710684436395e-01,-9.422091813393560500e-01,1.898329204981781260e+00,7.256827834228958274e-01,-2.470720255566175305e-01,-6.507815280495043986e-01,-4.776067235053134130e-01,-4.049380227187437953e-02,7.044097788147817285e-01,-8.409247132933042046e-01,-5.717660650237479936e-02,2.174397178656413132e+00,8.331674535925710501e-01,-1.634276701737258086e-01,-4.491729783294460820e-01,-1.788655923412429738e+00,-1.994531276644459394e+00,-1.006625295879036708e-01,1.825405031858145843e+00,-6.328878833993001329e-01,4.146027885229488508e-01,-1.086539736995549399e+00,-5.075003691945154660e-01,2.475658434177668621e+00,3.084014080935093549e-01,2.237205585916329564e+00,1.906777923188699431e-01,2.563383503016058440e-01,1.184399960273928021e-01,5.254088995640148613e-02,2.048352676381849924e-01,1.282234478513376574e-01,9.101639068527549448e-01,2.582485808105354330e+00,5.192189426995217350e-01,-1.383898974904894108e-01,9.272180254331581217e-01,3.912458777321511594e+00,2.120381856587410851e+00,6.865545396423111679e-01,-6.548984827309839440e-02,2.763813679248379174e-01,1.254930321886512878e+00,2.094794170265910638e-01,9.785592214914023979e-02,-2.093272684312539322e+00,1.627503382271434873e+00,-1.294092811716816671e+00,7.329978346982578552e-01,9.132661902740170090e-01,4.905696617937773674e-01,1.635181360829903507e+00,6.667605363198254587e-01,-6.527149752122964887e-01,-5.929945256717269464e-01,6.633261936928782632e-01,8.181170916578210939e-01,1.885567515255290871e+00,-3.359215394308018854e-01,-6.414974676891177507e-01,-8.198406440622836300e-01,-3.249320513245335107e-02,-6.955493170130311320e-02,-7.146588476622872665e-01,7.922531429243436785e-01,-1.976170924954026908e+00,4.183059730680321886e-02,2.073553178664391261e+00,3.743658034676138335e-01,-3.937007529904789083e-01,1.624922598511768346e+00,1.621117776179702430e+00,-1.437606969934263290e+00,4.609256778305572122e-01,-5.674065880180612087e-01,7.634300898411113812e-01,-9.159389618031986702e-01,1.440616739480109487e+00,-9.025823042637008964e-01,1.076455087228442409e+00,-1.656470427223497577e-01,-1.834160684903256566e-01,-4.819726622655748915e-01
3.943740927529669760e-01,-5.528619698167361873e-01,-5.477349893642786960e-02,-5.810122635639873856e-01,-3.658844623710771904e-01,8.163663298333674323e-01,1.193875440244925867e+00,-4.167898603473152996e-01,3.010324703305390370e-01,5.936856386762587867e-01,8.071915765410895283e-01,-1.802092269560633953e-01,-4.106018558162832788e-01,-5.356955504392294509e-01,-6.434026461391275653e-01,1.267156404925418478e+00,-9.731542314090502188e-01,9.353953830853412033e-03,3.407853052243212805e-02,6.854274347565675329e-02,-6.485422261915710918e-01,8.110571157746496729e-01,-2.170104028871214785e-01,1.400595309228918062e-01,1.979219318368472980e+00,-1.611336018064158659e-01,2.633127007388630925e-01,-8.675381550053693491e-01,-1.875611103755808973e+00,-1.565923076060050434e+00,3.139029842508697099e-01,3.087460875590264386e+00,-2.157526853882644202e-01,6.283155855653576038e-01,-4.814085113496113788e-01,-4.340363576297463499e-01,1.495251485873122288e+00,8.700105345023667613e-01,2.866181280921074492e+00,1.713705448716946300e+00,6.361969617073719441e-01,7.098558281992839447e-01,-3.835216246328495421e-02,-4.370181982805798615e-01,5.126858862352351442e-01,6.185486884357798143e-01,1.964911763849508386e+00,-2.728384012794453639e-01,1.953126536135617042e-01,-5.041693953659577287e-01,4.026926089239196038e+00,2.772637706233271881e+00,1.802309424428191753e-01,-3.686335365525553187e-01,-9.447215653698060045e-01,2.138264209700639906e+00,1.007250239685622883e+00,-1.499366437071283364e-01,-4.170779017735987693e-01,3.179167896329594623e+00,1.310952700213454392e-01,-9.884676112921986224e-01,-2.174466621894895757e-01,7.297445164924936112e-01,1.357896222644128459e+00,5.849246445472686684e-01,-8.905986602695727949e-01,1.160727725141090350e+00,1.606655227282533793e-01,5.569922182984321513e-01,1.804691146084060893e+00,1.539129938662394670e-01,6.450227890062051328e-01,-1.049429371019051371e-01,-4.969687807208112568e-02,4.543267686637101344e-01,-1.011232929208824016e+00,4.804855754980359439e-01,-1.521173610952304411e+00,-5.938601654731471280e-01,4.922535182260888709e-01,4.459110399123920598e-01,-5.978110187934915221e-01,2.404525857617750173e+00,1.016390138253083997e+00,-1.878042782296314606e+00,1.477469021645710923e-01,1.285843175642753966e+00,1.028679220038865472e+00,-7.109599752377515625e-01,1.619933155225473653e+00,3.858746233269118031e-01,2.405006426225390070e-01,4.752407456192279112e-01,2.132388300602342524e-01,-8.906383625506592017e-01
5.257920956515125255e-01,9.333158972768851314e-02,-1.218048288388353939e-01,-8.759964787532477093e-01,-3.731501448647530639e-01,5.334396390546072286e-01,7.074975745567435581e-01,-1.992347443354034742e-01,6.021740350271761466e-01,5.261543220321405201e-01,8.056522267640080504e-01,1.058835665875678955e-01,-3.592466198490539275e-01,-4.301095546547297754e-01,-7.728595675111393781e-01,1.562135596407183469e+00,-5.475484628176363611e-01,1.511924246662757487e-01,-1.684159700856439623e-01,-4.851839635473859796e-02,-5.077206745046609626e-01,9.548042395793656656e-01,-2.699902771401960777e-01,4.512520442630088557e-02,2.073021873855156905e+00,-4.451904412616814605e-02,2.184335830731072292e-01,-7.709742372478740613e-01,-1.823432988165261781e+00,-1.696875336430975878e+00,1.352159654074824302e-01,2.873159953152232937e+00,-4.263098050699360986e-01,5.454377826435596877e-01,-5.621668926583369696e-01,-4.178869129258391268e-01,1.674573413188034543e+00,8.362649397135251128e-01,2.856119917568797462e+00,1.672196510194685626e+00,5.265090681717977672e-01,5.478009091019160337e-01,8.190295151815818464e-02,-3.781816478643218460e-01,3.620615858612900029e-01,6.034664788593376850e-01,2.234540159628196854e+00,-2.037769178896531030e-01,1.989428878228426123e-02,-7.624207003264571458e-02,3.879732809896901724e+00,2.598524734834366079e+00,3.216547474632053261e-01,-3.145855270012960503e-01,-8.386369882747679583e-01,2.110924164770087152e+00,1.118011567201957490e+00,-4.826627626060907977e-02,-8.351521785692658240e-01,3.107328187584406542e+00,-1.389469622128448878e-01,-4.945371863831109494e-01,6.682615519884183009e-02,9.596743862651234691e-01,1.489427603109687581e+00,6.071711677084123959e-01,-8.315979192564229017e-01,7.516881797159058465e-01,5.138876182219422883e-01,4.553223909427771554e-01,1.851193860589438245e+00,3.420073515564459044e-02,4.476741534310411663e-01,-3.983343869219403421e-01,-1.288449927061755262e-01,3.280685284770189503e-01,-8.936229404977704682e-01,7.975494058865011393e-01,-1.719367095393403710e+00,-3.027283546188059837e-01,8.617233861664580497e-01,6.097759626433021385e-01,-5.269389529875544431e-01,2.219535403735334977e+00,1.338825260410321238e+00,-1.855193821308087632e+00,2.079650145099518621e-01,9.992268653817333313e-01,8.775136144882960121e-01,-6.764779958040640917e-01,1.737504726274588407e+00,1.779021452474046638e-01,3.428453396730828384e-01,2.574788886193160597e-01,4.117035537267143552e-01,-7.618107485100211740e-01
7.647870890128122268e-01,1.921775466202525706e+00,-7.376980183295692162e-02,-1.656193096866038550e+00,2.205506112219413062e-02,-4.121818849816679120e-01,-1.238460801028222202e-01,-7.014043786813559112e-02,4.617790674145356711e-01,5.544431106414837718e-04,4.536503198045900298e-01,5.856222311774568201e-01,-2.619977479024332423e-01,3.619983982566478409e-02,-9.317412062806946782e-01,1.683670441896824022e+00,2.713845853171308886e-01,3.245697552052984602e-01,-6.163796667274131780e-01,-3.761340244291280221e-01,-1.540787387362449468e-01,6.511280574101635521e-01,-6.569903626422080034e-01,-2.818142827534719785e-02,2.315129098442746169e+00,8.342294123849526288e-01,2.537867504079233116e-01,-5.315930130524066932e-01,-1.942726254017896892e+00,-2.098454064124827934e+00,-3.368575004749031487e-01,2.150668474299353594e+00,-8.947728556472818173e-01,4.200733411157508979e-01,-8.546497063612219502e-01,-3.476260666562690504e-01,1.991329291452395456e+00,6.840850952140349328e-01,2.733631989580417532e+00,8.684650663640751667e-01,-8.280700658389017477e-02,2.140651479513144551e-01,7.108855807509339986e-02,-2.828417080574230913e-01,2.829072176617382084e-01,8.494269987640921116e-01,2.511367094136722322e+00,-2.961738028812078288e-02,-4.454834456197337977e-01,1.133587960426236885e+00,3.089545855913776062e+00,1.954022478216782988e+00,1.046988945529193638e-01,-1.082832402872533906e-01,-2.111161591749869393e-01,1.762632408165986320e+00,8.389978002080645814e-01,3.813571593886475597e-01,-1.723943188571359864e+00,1.828672178240704271e+00,-8.758580445402028847e-01,7.130723658339315207e-01,9.940815539627692043e-01,1.295762231943673903e+00,1.979741338448074650e+00,9.201688739415203599e-01,-8.160717840964923919e-01,-4.325935917583202395e-01,1.168634122706105671e+00,8.616361487334396330e-01,1.376156554537636856e+00,-4.512768412079926073e-01,-1.894132424814444771e-01,-9.255323222427729313e-01,-4.357716373798022902e-01,1.228281442653041955e-01,-7.822294325059233611e-01,1.117196660468798619e+00,-2.086789170183591224e+00,2.853964706637204252e-01,1.603323083630341372e+00,3.983296811207515664e-01,-2.656463076656386257e-01,1.949326374941521056e+00,1.785244805849639071e+00,-1.599980637438491282e+00,6.825106137288583508e-01,-3.708680419511207749e-01,4.835382913248568171e-01,-3.822489287650499001e-02,1.283224259417342417e+00,-7.733694415750870244e-01,4.633420510422892602e-01,-2.099541855839199278e-01,6.617098913573331576e-01,-3.096755587048830582e-01
7.457711014081893630e-01,9.998957888998538657e-01,1.822136351710322844e-01,-9.873097443602156797e-01,-2.299492256116095756e-01,2.587766962314260177e-01,3.585792086728891159e-01,-6.492977615425872540e-02,1.458829815033847233e+00,1.373475482412857274e-01,-2.903054936310580092e-01,8.221050688657065286e-02,-5.225931260372969067e-01,-3.706918876484640024e-01,-4.089986984734468867e-01,9.859251259788476274e-01,-7.033519869823334769e-01,2.408400947032641737e-01,-3.133549153443355162e-01,7.279185210304808806e-02,-7.935530156524687184e-01,5.313876455185155834e-01,-4.947931667253250287e-01,-1.883216277337990130e-02,1.986706243223684609e+00,5.445079058882275058e-01,9.388175006594069727e-02,-7.441131792310269333e-01,-2.145387802450980264e+00,-1.649669788399234172e+00,1.612666517405548505e-01,2.867763693060217722e+00,-5.094578008559856874e-01,3.878307657988917523e-01,-7.690530683965187686e-01,-1.880817085139748768e-01,2.126869078882827502e+00,5.899294977300832965e-01,2.115591992428205614e+00,9.790479723011590307e-01,5.682180842714993352e-01,7.338823256821722651e-01,1.779497667958798157e-01,-2.108593236221780742e-01,8.230623119958546674e-01,7.987653170786184198e-01,2.530774086133067424e+00,2.257638669038026236e-01,7.476440979301911260e-02,1.662878965442906032e-01,3.654123029498273834e+00,2.421353720666955311e+00,3.612143111525576433e-01,1.127967829061787830e-02,-2.688278615199553023e-01,1.569612226760656037e+00,2.146472884188411201e-01,-2.944894853018221736e-01,-9.526002010785166174e-01,1.990541047583147094e+00,-5.330174453120688494e-01,1.004047417353862715e-01,3.575482725425502828e-01,6.448519245474318984e-01,1.886586466105233395e+00,1.140366140327191191e+00,-4.093624748825545612e-01,9.606091177646922663e-01,4.081987855990527603e-01,2.052360339546236423e-01,1.660838340916948486e+00,-3.386381267297249309e-01,-3.869117641291511256e-03,-7.227660556329160713e-01,1.109130948064898231e-01,2.790194099192311317e-02,-5.737614936361125073e-01,7.543853030001151927e-02,-2.018069723475427679e+00,-1.270722498335910000e-01,8.368987554001197093e-01,8.490966764506195641e-02,-6.278702584817025256e-01,2.224391452335294339e+00,8.842322961167186079e-01,-1.508316206870315757e+00,3.309651315846496300e-01,6.736453394421393348e-01,1.034261825450178973e+00,-9.794793422443743847e-01,1.594816076072024913e+00,-4.289946844880065946e-01,1.052566011531365531e+00,4.039655480985357983e-01,-8.354856277152351574e-01,-5.592314099649450254e-01
9.020483593994892413e-01,1.907713861270221800e+00,-5.187180290687364304e-01,-1.134166977853514835e+00,5.779634130594769881e-02,-6.714606940283024406e-02,3.461324223973297753e-01,5.141276682588488689e-02,-9.988978699860351362e-02,-1.518027742383135370e-01,8.184886067747547678e-01,4.120931945910931149e-01,-1.803838819723541931e-01,4.821549301277807675e-01,-9.191974596669217901e-01,1.933229345046410641e+00,6.037471912534506657e-01,-4.858283653089502385e-01,-3.619156505370258459e-01,-4.638283946850049189e-01,2.095269895450757591e-02,4.333354458941073850e-01,-8.331690173820689438e-01,1.656276642945765376e-01,2.022300796129268718e+00,5.684653125632679327e-01,4.006746400993280166e-02,-4.648698260244285008e-01,-1.302250519443526100e+00,-1.731334210606839896e+00,-4.547055868672156276e-03,1.692495852258571132e+00,-4.205321944123168176e-01,3.861124142488413513e-01,-9.574090628280071957e-01,-7.359006078609611201e-01,1.899053415767397723e+00,5.568136804683611052e-01,2.368079498698397956e+00,2.775772249233946498e-01,1.455066569850875235e-01,1.073454137242202400e-02,-2.112513847597758398e-01,1.754939187854447913e-01,2.335692436342373668e-02,9.686070946276446048e-01,2.197894460289487650e+00,1.903997635879192685e-01,-1.121504264589729266e-01,1.000616343027650457e+00,3.890522177554772476e+00,1.853194037629665836e+00,3.368230052972985833e-01,-3.346313459266444523e-01,6.279017339822440258e-02,1.350697507155617538e+00,3.663422181059903804e-01,3.148041740591656090e-01,-1.689546995048778033e+00,1.395100664030977322e+00,-6.479932401521205643e-01,1.898156885403660121e-01,6.181280555105771457e-01,5.119974939835258976e-01,1.189470772977946567e+00,2.276565100637546468e-01,-9.550239411891370267e-01,-6.334838660595157878e-01,3.491337857927110377e-01,1.238153767727517174e+00,1.889340795001869910e+00,-2.579561679811436248e-01,-3.767442562174445619e-01,-1.115114735692870063e-01,-2.562879294905199279e-01,5.267286948730867113e-01,-8.201557043780722811e-01,9.421364656433490747e-01,-1.334969367921177152e+00,-2.722427603666168761e-01,1.699574653236161303e+00,2.567229783958619449e-01,-1.815390611275368160e-01,1.553110736302544481e+00,1.479700238202182216e+00,-1.332658164743491636e+00,5.318925365516221637e-01,-3.902449132385956698e-01,6.160098501452651032e-01,-2.470982551789263904e-01,1.142832085623449290e+00,-7.983057146266689941e-01,6.135247886731369782e-01,-1.486852187831896321e-01,5.812064034991066830e-01,-4.331311919816146494e-01
4.659492904774077959e-01,-7.841895267777879708e-01,-4.063517467753362949e-02,-2.519524298823708208e-01,-3.558393016038072232e-01,7.297123892602299655e-01,5.768248046167416820e-01,-2.810047325866231183e-01,4.606914054073225628e-01,1.024406378448168731e+00,1.539877957893918348e+00,-9.504638506705465062e-04,-3.635228008691670509e-01,-3.833937613014420376e-01,-5.087970894077837869e-01,2.051958873419498897e+00,-7.301316678051672504e-01,2.085789798795148475e-01,3.186137992177855427e-01,2.741035308656673553e-01,-7.920260962925197434e-01,9.109243287767601061e-01,7.714509394276647392e-03,2.522508979658131811e-01,1.540771339653557614e+00,-1.147493493379921459e+00,4.647942744346070798e-01,-7.867678359589583836e-01,-3.980409801387836399e-01,-7.461231516134951836e-01,3.956058476857767792e-01,2.956434641613070458e+00,-1.831524513698371825e-01,3.041742586532636405e-02,-2.326479948701823952e-01,-7.391094140077942853e-01,7.930001300051918722e-01,1.472013149613597527e+00,2.489297101417523805e+00,2.596348601229815145e+00,8.301085050834842161e-01,3.743174414814641193e-01,1.394225137705408790e-01,-2.703513848127696573e-01,1.660548824387971800e-01,4.496419472180244181e-01,2.418009466737338187e+00,-7.121793244997599581e-01,9.461864557652982510e-02,3.682478979051889145e-01,4.028403246345021671e+00,1.885472338470383313e+00,3.648888152039549970e-01,-7.661221060507755753e-01,-1.527377702581206531e+00,2.339638333976812756e+00,1.623444938657189862e+00,-3.661369954653834191e-02,-8.281280137271185282e-02,3.092500337154076462e+00,1.411050530303578299e+00,-1.050058186437158980e+00,-7.412401064851391608e-01,1.386778664137293671e+00,5.920399294730719353e-01,-3.166059511444658803e-01,-8.438573903157157163e-01,1.293370761121694468e+00,1.547939521264974916e-01,-9.515846434728292280e-02,2.642007568983944843e+00,2.033171296231256475e-02,9.771728616090423758e-01,6.704843853005253429e-01,-3.539776717163796160e-01,1.447224560820621120e+00,-3.271462236667009305e-01,1.305523202731302401e+00,-6.290842818190206520e-01,-5.233129091122497023e-01,-1.465308895047734428e-02,8.066985947954348202e-01,-1.734242494437805704e-01,1.696636581309294067e+00,1.096411460129935289e+00,-1.485822626429223803e+00,1.258484494845990564e-02,2.439413879635025317e+00,5.867040779624113078e-01,-1.582146735042033736e-03,2.187640572720110477e+00,4.794849648169243750e-01,1.442751746624730824e-01,3.181308551980578381e-01,1.621928810799630138e+00,-4.933359665035655928e-01
6.810912186535402757e-01,1.384205669867170974e+00,5.586031313674535426e-01,-1.171707078671873070e+00,2.839796663582784264e-01,-4.208054586031058641e-01,-1.103669452966374864e-01,-4.272688075874459535e-01,6.782725001435273571e-01,1.063230738958585997e-01,-8.942108232433798598e-02,1.943155126725875925e-01,-4.911259939879333847e-01,-9.207696833787204493e-02,-2.425404030059737093e-01,1.031065540922261103e+00,-6.336153273980253964e-01,5.782142164126798933e-01,-2.188149605093732963e-01,1.268285503245870360e-01,-8.282990544801449584e-01,-9.888247199026367618e-04,-5.713787211024838886e-01,1.594078806855547259e-01,1.834681178436625704e+00,5.891685604734658854e-01,5.373902113308838269e-01,-6.436153423493079506e-01,-1.414681238421436005e+00,-1.318955444016930434e+00,-7.169564779339043792e-02,2.545470354660469781e+00,-7.317402716486534064e-01,-1.470581981229218682e-02,-6.595658850500140113e-01,-2.753082739227924458e-01,1.446662131826869091e+00,1.074119959199077989e+00,1.954263729438095343e+00,1.119754401329607241e+00,1.029148450231009981e-01,4.834677908049630490e-01,9.163538761225373253e-02,-3.183922893522910247e-01,8.444904596575244504e-01,9.412652010599438235e-01,2.639236848568037086e+00,-2.593088602986656221e-01,-3.152854263684255476e-01,1.389737795684572896e+00,2.702946067035817190e+00,1.355889918322043197e+00,-2.496912501633580250e-01,-1.549145599107224491e-01,-4.131358451686367728e-01,1.613814590899075530e+00,4.257613647032291171e-01,1.797936100371819446e-01,-7.537253756652778636e-01,7.869223959485196485e-01,2.383322298819086082e-01,4.635552033433610886e-01,5.113560616353554078e-01,1.413756173200882538e+00,1.806322208664072004e+00,9.325388312901851107e-01,-5.282356021466992901e-01,6.075725168652338359e-01,7.025350562627757922e-01,3.676299908696292196e-01,1.426127295891671753e+00,-7.915854339538649365e-01,1.020896273850941949e-01,-2.811650541767597433e-01,-4.622178004081749503e-01,8.031122625939660642e-01,-2.110582563673097933e-01,5.613423380606065161e-01,-1.496133245905340914e+00,1.452319335399226974e-01,3.994428609458010593e-01,-1.722629015202559177e-01,-1.278602759867434879e-01,1.922744472674502436e+00,9.089621149738904560e-01,-1.076091884200956583e+00,7.324142345857346248e-01,6.253908438299857764e-01,4.548414718980913762e-01,5.145350911444486197e-01,1.234237893156604482e+00,-9.499810611434333918e-01,6.688080126728884744e-01,1.693936193147266844e-01,4.152538670790071884e-01,4.799766849703968052e-02
6.696726647806299226e-01,4.571462272863830445e-01,7.282427426723789288e-02,-5.427550742265375705e-01,-3.635676385227556290e-02,2.903015457320323178e-01,4.206741558218312638e-01,-2.530307523227530719e-01,4.928122950696686155e-01,4.179109870541387606e-01,6.878006705400372400e-01,2.747735494888058072e-02,-4.116080614924590431e-01,-5.686210888404234776e-02,-3.606564211299463918e-01,1.549819344212902461e+00,-5.374936764768400987e-01,3.442253164097819340e-02,9.564872475460628465e-02,1.468942544019635477e-01,-7.416454919830435255e-01,3.509262524605477607e-01,-4.009759006528665903e-01,2.532547756355352231e-01,1.602720634040774472e+00,-2.428980267900303913e-01,3.486329387256986712e-01,-6.859275257805194093e-01,-8.170364341673286290e-01,-9.628546667118811353e-01,2.982077619577581662e-01,2.561475761285266550e+00,-2.730640933305554796e-01,3.532420693402468781e-02,-5.473544871186596383e-01,-6.178459812682189911e-01,1.243585955338201376e+00,1.112540989021935989e+00,2.015088498438153408e+00,1.445408146918231607e+00,5.723951684082120295e-01,3.871975288645259083e-01,9.260053593209159606e-03,-7.797799191126451868e-02,4.569870372891582933e-01,7.718513401611426517e-01,2.414852885341220112e+00,-2.725405697223984292e-01,5.302850612941972103e-02,7.537858480777365200e-01,3.726399500854669533e+00,1.669578999495811678e+00,1.990661667810227631e-01,-4.750351680554827927e-01,-7.238520862613212481e-01,1.716364779786891059e+00,6.687685004584803528e-01,-1.269289766385695017e-02,-4.950982951957176303e-01,1.695262206931584137e+00,7.087565274376164126e-01,-4.175303261252806264e-01,-1.851257047348987550e-01,9.543447202966635068e-01,9.803594356021246847e-01,1.539896353867177825e-01,-6.870577628807137405e-01,8.596720661533990837e-01,8.163063856694975640e-02,2.974183023296962380e-01,2.189141425598803981e+00,-3.205404444535644992e-01,3.560946965739614778e-01,3.937113831520283602e-01,-2.537071588648783793e-01,1.131015131642216343e+00,-3.091258273086531227e-01,7.148651809803898693e-01,-8.914069955181116445e-01,-4.012132254057340086e-01,3.311962892883206222e-01,2.001457946950736533e-01,-1.808848250104623245e-01,1.692411703943401013e+00,8.427545026449239085e-01,-1.178555723209696371e+00,3.138208937926623143e-01,1.375375726371774299e+00,6.487797687445076011e-01,-7.882810896356506891e-03,1.625258102724578269e+00,-3.126389757465802277e-01,5.941152701709354611e-01,2.915062252589578629e-01,6.784305934893606338e-01,-3.055128854459191468e-01
1.023670425899779080e+00,2.203173660555374447e+00,-3.775170466323522489e-01,-1.019565426643533668e+00,5.370603947795778155e-02,4.332688697426148594e-02,4.880706784417767619e-01,1.312871425327878649e-01,5.232574515847241425e-01,-4.366708838721148345e-01,-5.642993391409117931e-02,2.128856525588069815e-01,-3.299772144059270884e-01,4.359426091019848459e-01,-6.323708868017399176e-01,1.329348088781842296e+00,2.815246806050374917e-01,-6.286730057034310981e-01,-3.943873567208944220e-01,-3.485446099873282244e-01,-2.295509571576638264e-01,1.506583796458048352e-01,-9.827926652997478474e-01,1.295165674121552812e-01,1.953051667294909866e+00,9.786268308955494710e-01,-1.573000122110777832e-01,-5.128838379515756607e-01,-1.769974540815160813e+00,-1.730374541835868252e+00,1.693647663968639028e-01,1.837684401611458851e+00,-3.026611065190707439e-01,4.300623758707023958e-01,-1.118910307355351907e+00,-5.625512369489500397e-01,2.337326367632885038e+00,2.379101851232319209e-01,1.855304116963313321e+00,-3.398470144796217340e-01,3.375075114239590168e-01,2.864528316754074710e-01,-2.063470445147749244e-01,3.183939671747261224e-01,4.334528227698591918e-01,1.106370110326384104e+00,2.219794315514211469e+00,6.261740057952418503e-01,1.273835875740212398e-01,6.458630525601528616e-01,4.061159704693429795e+00,2.086515644988347518e+00,4.428836254191707567e-01,-7.361660869662650653e-02,5.204047533503537437e-01,9.118812091439706391e-01,-4.714321742523953640e-01,-3.361530265759772595e-02,-1.641766164772678227e+00,8.455626032820809934e-01,-1.044266105334896722e+00,2.855666302284757818e-01,6.697224264599341836e-01,-9.386309033397344237e-02,1.429820238342790706e+00,6.634680121554356047e-01,-6.545025101625292496e-01,-2.279743152789415195e-01,-1.741615498198813977e-02,1.126217728544024022e+00,1.766894936934833016e+00,-3.558526695478604340e-01,-6.749348577523391901e-01,-3.021272708765277981e-01,1.175461653048850835e-01,1.600997358909908019e-01,-7.607240375206119065e-01,8.884183589982114215e-02,-1.580127579557069728e+00,-3.820508104954363215e-01,1.641388421632127059e+00,-1.822478313147549156e-01,-4.206025194357742580e-01,1.724325040427539646e+00,9.595788037816961324e-01,-1.186898536525783365e+00,5.018578514909067811e-01,-5.530855719928102765e-01,9.679731168692042864e-01,-8.792350067994882945e-01,1.021160450817335974e+00,-1.041083223604074570e+00,1.194794388520437289e+00,1.282889932275765865e-01,-8.051447795559933951e-01,-5.108281604883800897e-01
1.055673567185170025e+00,1.869376718638734225e+00,-1.883830007951298180e-01,-7.299071229999163357e-01,-6.983432435232073132e-02,2.490215233540273299e-01,4.097680686767932734e-01,2.059828992502770184e-01,1.248789257910666528e+00,-2.839456240022768529e-01,-3.686722094889566814e-01,7.801828612113494155e-02,-4.598632531070380725e-01,2.385233112889480478e-01,-3.414585970066089660e-01,1.159564425581342872e+00,-1.155634306125065958e-01,-4.946858280073781478e-01,-2.532132686545353617e-01,-7.830682754913728671e-02,-5.969632993348199523e-01,1.443876752004697450e-01,-8.505787722071480594e-01,1.145380082337519867e-01,1.730352529438397013e+00,6.866906273578442521e-01,-1.830165223561092402e-01,-5.878603583143267031e-01,-1.604899365973757153e+00,-1.374575561092012288e+00,3.679117694427686547e-01,2.179928409562056579e+00,-2.029204842615447424e-01,2.489572820020513888e-01,-1.033449794999308002e+00,-4.916229174201617869e-01,2.314936359743869687e+00,3.259900186533117861e-01,1.447791857463604837e+00,-5.453009094650318467e-02,6.683058933345553676e-01,4.721463025456541507e-01,-4.576260764726529373e-02,3.636296596809747150e-01,6.518517986495470096e-01,1.034777147941945197e+00,2.448023145890998009e+00,6.663203749134610776e-01,2.961954932506440374e-01,4.796393597701963385e-01,4.212153863721110447e+00,2.078941895800290318e+00,6.228840099478670789e-01,-5.019610372291649636e-02,3.765694765611956596e-01,8.717254483644811813e-01,-6.179747403549782359e-01,-3.365841812855485671e-01,-1.268402972120485028e+00,8.777001335360450351e-01,-6.723468914301712340e-01,1.585262399463266414e-01,3.415721782138279039e-01,-1.485926713059683157e-01,1.343410048921976463e+00,6.781298910646602618e-01,-3.826813980975581897e-01,4.630678281184230638e-01,-2.428338157004486519e-01,5.567503655029955034e-01,2.049948942663378570e+00,-3.996254381242938525e-01,-5.478359065827211882e-01,-1.903648495681833641e-01,3.005920546350370204e-01,2.560717650562223113e-01,-4.441011689713731392e-01,-2.013885398551381600e-01,-1.480168229324336338e+00,-4.390152995835358563e-01,1.195808833376465152e+00,-2.359187340320631487e-01,-5.053380207933070301e-01,1.703802464075377943e+00,5.962697660457600968e-01,-1.053092652711121069e+00,3.278632985095309427e-01,1.760274807837727273e-01,1.105771220963557067e+00,-1.177210640887483617e+00,1.347748868451144721e+00,-9.197094356159508655e-01,1.518149577218212309e+00,3.594696773819194835e-01,-1.255958691748760847e+00,-4.904363746367356169e-01
8.662123517259306960e-01,1.396594029030756801e+00,-7.072685111861826135e-02,-7.866056211974270518e-01,-3.389379033936645857e-02,2.691245860566159331e-01,6.374291165680687765e-01,-5.398537898444584482e-02,8.308622977998023629e-01,-1.665958543546155191e-01,-2.084141297330305842e-01,-9.439243804232944068e-03,-4.563897676330829212e-01,7.432832858756635575e-02,-3.934132385028305534e-01,1.015800067771188919e+00,-3.795127563134854665e-01,-3.445738803202775813e-01,-2.141113016819242154e-01,-6.393896082212030541e-02,-6.009673269055010314e-01,1.615017771511207956e-01,-7.587449193554127724e-01,1.382562273325836644e-01,1.839754490307311752e+00,6.909914183085098527e-01,-2.247276675225975962e-02,-6.545761988670470988e-01,-1.818832237787878503e+00,-1.507028719444167386e+00,2.983907626926227130e-01,2.369201695864875390e+00,-2.516770082317403290e-01,3.752909825749818351e-01,-9.260596468191670816e-01,-4.312530181227583470e-01,2.114195257056993071e+00,4.369991404030679760e-01,1.818285421035760852e+00,2.192634471114820460e-01,5.313652204364627263e-01,5.550637905359619984e-01,-9.960133148095473565e-02,1.144198797302562604e-01,7.070844830970073325e-01,1.000915012819253214e+00,2.259086441848744187e+00,4.293886300202955364e-01,2.189416971478854168e-01,3.097066100928467791e-01,3.970261031920049088e+00,2.204595248252263495e+00,3.467538163751218150e-01,-7.930675247349044943e-02,1.468031444067326996e-01,1.139536542355034321e+00,-3.233200945692521477e-01,-2.246419614416916288e-01,-1.070047202222008886e+00,1.184620936852503359e+00,-5.649328133155401277e-01,-4.125282886367603874e-02,3.345034138557920755e-01,7.978210263872742569e-02,1.484111393605771045e+00,8.003338324246118685e-01,-5.334516947270044884e-01,5.559494508180869987e-01,-9.920566311792697323e-02,7.170832280983494567e-01,1.770753627302233957e+00,-3.356889732870925180e-01,-3.017345881533587404e-01,-2.251505365495571620e-01,1.645658601570880175e-01,2.689651372754088277e-01,-6.392442539673819368e-01,-1.255654873460931853e-01,-1.555443375664663064e+00,-4.423359602999061835e-01,1.016712698990283492e+00,-2.123372024005387160e-01,-5.126897327538850746e-01,1.959084899121974255e+00,6.645233650543910242e-01,-1.234914511768458345e+00,3.939949770361853565e-01,2.152106635298658421e-01,1.063304449647889172e+00,-9.008262722548683321e-01,1.219818926305488382e+00,-7.324541681097989088e-01,1.157204115814296053e+00,3.823068331622878069e-01,-9.506419153279632717e-01,-5.409083847657275568e-01
7.732223727218919818e-01,1.362699655630573048e+00,2.461627004568688326e-01,-9.377804665321636257e-01,1.050411910045927349e-01,2.834728470417732793e-02,4.611555639603612256e-01,-2.562583458493437050e-01,8.085090273356027035e-01,-1.231654752248532436e-01,-3.771608012439629509e-01,-1.050727391104086528e-02,-5.095659237737559799e-01,-4.708617274795537377e-02,-2.765097281164557441e-01,7.947761520709685223e-01,-6.395469920157684784e-01,1.241278970734938092e-02,-2.250238916865471839e-01,3.616599524529454102e-02,-7.502518639893792640e-01,1.697899159987853457e-02,-7.118510683028147490e-01,1.410088399422560479e-01,1.864167609373382994e+00,8.017918060039695982e-01,1.831512999953683885e-01,-6.819322307838759922e-01,-1.890351095190921482e+00,-1.497475956007923159e+00,1.749894129799299813e-01,2.525178633189618438e+00,-4.249348535074474187e-01,2.868525582992010881e-01,-8.457815514984340366e-01,-2.981942338201794551e-01,1.936900821092887748e+00,6.119235929256018336e-01,1.846285260951510132e+00,4.438279508086701020e-01,3.645215713160124826e-01,6.309635072977659576e-01,-4.648864244609640650e-02,-8.943123855558703095e-02,8.966839225699599902e-01,1.014134245420662772e+00,2.346634560259212687e+00,2.256182002767014028e-01,5.220918867906144956e-02,5.747863619117240530e-01,3.445435187229004104e+00,1.989428754443587355e+00,5.461700413518011388e-02,-3.374808724103944835e-02,1.169554054417160094e-02,1.270650753122140708e+00,-1.975077496824916290e-01,-1.272257247116468093e-01,-8.947375468934777309e-01,9.515631695929114287e-01,-3.709410988390280384e-01,1.367548509755443509e-01,4.393660892780516525e-01,4.830831546194111481e-01,1.739592427906125227e+00,1.031963902728149307e+00,-4.954907741937149002e-01,6.949328900810358700e-01,1.587046634191436045e-01,6.230017851607297930e-01,1.494115026580238981e+00,-5.231732007534540818e-01,-1.715827882292149664e-01,-3.319884584392305271e-01,-1.231910338930047866e-02,3.538410306801894056e-01,-5.308836089216157905e-01,-8.907724428608032596e-02,-1.645787545592197754e+00,-2.421470912003275688e-01,7.303326396190639169e-01,-3.241506286625489563e-01,-4.378211554240509229e-01,2.080748142354440944e+00,6.385391181084650869e-01,-1.192114622660988221e+00,5.464275950376495938e-01,2.929890136711802429e-01,9.176200673906531602e-01,-4.520511632961031756e-01,1.131585337597800223e+00,-8.438444313713799882e-01,1.024438869976352251e+00,3.807720901061024121e-01,-7.434874792740981952e-01,-3.528979693112280769e-01
6.647531569551381470e-01,5.956748881536764184e-01,-2.427493640677378939e-01,-6.710245795339587760e-01,-8.797256422612394211e-02,4.070614380744768113e-01,8.000168562046527931e-01,-2.199048741045160349e-01,4.425593213789591474e-02,2.303841874080962693e-01,8.149145262715993265e-01,3.262224948829599291e-02,-3.190979933385134637e-01,4.676440726444160145e-02,-6.443327113979669951e-01,1.572056471734266436e+00,-2.654836626482593442e-01,-3.157644167452811068e-01,-3.539500913903306095e-02,-1.123875662425471988e-01,-4.113075895818761873e-01,4.596436145348273827e-01,-5.338383088798691611e-01,2.284195873099146012e-01,1.836815892661003202e+00,6.786720942615845353e-02,1.827778547509271712e-01,-6.656224947370307232e-01,-1.286607501569206002e+00,-1.394631198309486786e+00,2.573518419846379524e-01,2.360414213820084761e+00,-2.124207014814329386e-01,3.794136237020610536e-01,-6.905333491004540525e-01,-6.572741777895640958e-01,1.538273688077798296e+00,8.005402973053803439e-01,2.382009710729938501e+00,9.787568424780830334e-01,4.632617279512110109e-01,3.470758270189526207e-01,-1.605587722194781741e-01,-4.606283490356018195e-02,3.050019248563843322e-01,8.267030325628412779e-01,2.083102841556660589e+00,-7.206916996101128681e-02,1.073864637798231658e-01,3.546227221653257544e-01,4.006911956820079723e+00,2.111963653631700577e+00,2.363788370174504661e-01,-4.214032574974506673e-01,-4.555578963266797565e-01,1.650843705584924770e+00,5.605707345024271149e-01,5.081214774119494071e-02,-8.607813002173421157e-01,1.981302615582327231e+00,5.822793573437556880e-02,-5.175490602211572089e-01,3.037742888319057422e-02,5.560690531247391988e-01,1.064861830419923328e+00,2.370640592371983657e-01,-8.912966585986190626e-01,4.068703302682348810e-01,3.758427982385199179e-02,8.406155606858904950e-01,1.986702307166565928e+00,-1.011321402907786604e-01,1.650797616352886465e-01,1.948322003925363755e-01,-1.540284922654509558e-01,7.493721247730071866e-01,-7.704320600847114342e-01,6.356394308256411163e-01,-1.135551351117460639e+00,-5.404918379200076561e-01,8.681913121445536952e-01,2.364784635853841022e-01,-3.157710760130862382e-01,1.855046422113704629e+00,1.044129029178086254e+00,-1.429931790807814407e+00,3.256386478460774336e-01,6.748888232037792978e-01,8.027958057681926496e-01,-3.487133252357343949e-01,1.371360524062793962e+00,-2.580890731182879927e-01,4.853277714926303998e-01,2.254072319717629613e-01,4.348035712668829045e-01,-5.809730816001467124e-01
4.729316655969383332e-01,-4.814417685252482260e-01,-1.636781993454258233e-01,-6.099932014459996665e-02,1.055463925283538218e-02,7.813941827416646113e-01,1.407420864383596815e+00,-5.760000544361002506e-01,-6.753299248419926126e-01,4.557365510558606947e-01,1.200480128789502610e+00,-3.694599292967032933e-01,-3.544974588086709510e-01,3.973206018322102129e-02,-4.033732686257002764e-01,1.423200049762007202e+00,-7.833565364455783442e-01,-5.588646552388918387e-01,4.272315120598280669e-01,1.124823350681310452e-01,-6.255967044678725220e-01,1.690109583787527403e-01,-4.129058466970084162e-01,4.745140268183584142e-01,1.503132700754668649e+00,-4.676764452776956404e-01,3.619257636984980486e-01,-7.675303783094473697e-01,-7.036758304450717594e-01,-8.514492290157354981e-01,5.682330585284045554e-01,2.528681743122716430e+00,1.677423457147488861e-01,2.798317279126492640e-01,-4.767828079290262200e-01,-8.622587620963801935e-01,8.950040778881414028e-01,1.103622928425900707e+00,2.265942447967968842e+00,1.272819848778756979e+00,6.391071495431276395e-01,4.155192371365540316e-01,-3.665411461571222440e-01,-5.069093212675551685e-02,3.693897856266044610e-01,8.319817963549207551e-01,1.733839115387727503e+00,-3.851605116455198430e-01,3.331076074607461357e-01,1.033671083946041680e-01,4.215454999593371888e+00,1.949141671171186641e+00,-6.083294103266245756e-03,-7.065914729931546123e-01,-8.086886071367390683e-01,1.734188992423598474e+00,5.919079167685414866e-01,1.600090889078285838e-02,-6.775786378820480849e-02,1.877895177801567117e+00,1.035316020597398134e+00,-1.370835434873750813e+00,-6.131122131588837565e-01,4.144377995204545639e-01,4.766794899559099186e-01,-2.360493448770806246e-01,-1.046919011527030374e+00,9.697737876113525779e-01,-5.847402704372635096e-01,9.272696909655255837e-01,2.201475774596405532e+00,2.947208233786641207e-02,5.887803371892389448e-01,1.099056821540206563e+00,-2.058361759902024579e-01,1.444574511548353035e+00,-7.325081975570553183e-01,4.846899585387365872e-01,-3.452127244469558320e-01,-1.029525568570171856e+00,9.349366777225287528e-02,5.510853164089710154e-02,-1.997254931463187111e-01,1.831020804905473476e+00,5.559906123644934306e-01,-1.266331926013961384e+00,2.311221341150495046e-01,1.454198585501929486e+00,8.230959820793926074e-01,4.641887745604661442e-02,1.270833337280004915e+00,4.458388075245212079e-02,1.994950807920966573e-01,4.780327871573055720e-01,8.208227055236598790e-01,-6.011461039697720832e-01
6.890334601502301481e-01,-7.540723653091141454e-02,-2.899488645467289405e-03,-9.626076204157563154e-02,-2.166686484972386584e-01,7.372900882656887589e-01,7.251290357140353082e-01,-1.656946761510484922e-01,8.230755270574620086e-01,5.376686270243283827e-01,6.436920386840104813e-01,-1.933499792214064539e-01,-4.788601762785862914e-01,-1.509182514255816843e-01,-1.979232284493365746e-01,1.482061884504663585e+00,-8.099430649759802314e-01,-1.964287332357864402e-01,3.012050432247073140e-01,3.098923496479099593e-01,-9.397473720275180131e-01,3.942021949935628489e-01,-3.118845561765640761e-01,2.900104368773472330e-01,1.389586726197670652e+00,-6.010864415866354893e-01,2.141056822046053243e-01,-7.615045319864517381e-01,-6.506975917359938411e-01,-6.612913180462034468e-01,6.020077809979548222e-01,2.777184620937873216e+00,1.820621890403795184e-02,1.299206802115231152e-02,-4.997065128262121458e-01,-6.838868510618184571e-01,1.245594562392951188e+00,1.079121016910409736e+00,1.746082887890074486e+00,1.527734003674596330e+00,9.627685242071547522e-01,5.228045772141723946e-01,2.063915523191901802e-02,6.593258534382805125e-02,5.204194019124362969e-01,7.142949375297363845e-01,2.374134218275894437e+00,-1.535004309928676980e-01,3.627008455614920135e-01,2.596341343825405712e-01,4.273632522770583364e+00,1.891004884633695760e+00,4.590960170972216425e-01,-5.326883003767042268e-01,-7.986261928162752266e-01,1.628439590088933464e+00,4.652434628616325396e-01,-3.213366112247593165e-01,-1.655046347717097355e-01,1.945681005559236176e+00,9.760270931872542244e-01,-8.796806521165426718e-01,-6.272256230021563406e-01,5.426055900181179226e-01,6.572879384518146573e-01,-3.944341686166180638e-02,-5.735924065295743279e-01,1.408237981758244661e+00,-4.145471840481449455e-01,3.325287749769761936e-02,2.567756636221942834e+00,-1.514903800041621229e-01,4.595253176789741434e-01,7.033672093007323767e-01,1.851460875321282729e-02,1.217881244288035791e+00,-2.311385716812986990e-01,3.796608948904564018e-01,-6.453858506170215836e-01,-7.225929430019264466e-01,5.694080238617604817e-02,1.862435440310647450e-01,-3.141851392940523957e-01,1.669801154071822946e+00,4.820573254215367864e-01,-1.135144625477774838e+00,5.695230677128110264e-02,1.964810628461536091e+00,9.035081426667479487e-01,-5.191768154549671888e-01,1.860192602712102516e+00,-3.633988299838353253e-02,8.314933528555015219e-01,5.422080901033595746e-01,1.964570383019599298e-01,-4.859009935436976457e-01
5.983270557910775889e-01,3.086025492598450937e-01,-2.552637219285380232e-01,-5.862402184033683739e-01,-7.552774843619743106e-02,4.445039982432118508e-01,8.470858906166671698e-01,-2.999291247847869490e-01,-2.146177736956031978e-01,3.642576138402088270e-01,1.120586581562369899e+00,1.792151908545581984e-02,-2.890691145224754677e-01,4.704466675856143476e-02,-6.687855306801571142e-01,1.717551514568091298e+00,-2.818987738720620806e-01,-2.995347139630599731e-01,6.114678016967785984e-02,-9.007393293162668790e-02,-3.981003980631332428e-01,4.926886679835381644e-01,-4.597200987538538897e-01,2.798633511819462738e-01,1.785732438213480489e+00,-1.644130833400745395e-01,2.734878513279846990e-01,-6.725766146184434247e-01,-1.032559205753205145e+00,-1.277519593510177520e+00,2.682867865967130117e-01,2.366954559833946981e+00,-1.804401520376689716e-01,3.334523445151824084e-01,-5.995908602343540394e-01,-7.384193481208175536e-01,1.293611848819981480e+00,9.567882113838737101e-01,2.486888589909742375e+00,1.235537484588092871e+00,4.544603864146238292e-01,2.868505798382543492e-01,-1.846040364036740655e-01,-8.780551721559549938e-02,2.081691662665918208e-01,7.818496597331724418e-01,2.036926141134659307e+00,-2.559317441626594025e-01,8.114633179584236633e-02,4.180783561277900962e-01,3.992539350319040281e+00,2.005954750126123010e+00,1.727216071381400542e-01,-5.463502417144595613e-01,-6.633203880311210332e-01,1.794573679482825757e+00,8.096973631677335526e-01,1.319037257755080461e-01,-7.163279551112947674e-01,2.123168231729501976e+00,3.710885687105949793e-01,-6.924035861721209439e-01,-1.131711463736738699e-01,7.182268896549246495e-01,8.895267508721333982e-01,2.794397908283674514e-02,-9.884844549975242423e-01,4.246382087956303564e-01,3.253362303937434169e-02,8.480946916260726498e-01,2.077258413485411737e+00,-5.710966841061787536e-02,3.347543519587223293e-01,4.117139274553555106e-01,-2.666018464852714653e-01,9.868389316638853659e-01,-7.561486819347400523e-01,8.510340087417265220e-01,-9.210816695694653555e-01,-5.891885911209412408e-01,7.226300365054250108e-01,3.332555316181715632e-01,-2.269083056835696222e-01,1.795869377028263214e+00,1.094840463541858711e+00,-1.434060819174799661e+00,3.098038622612239168e-01,9.046182277236115565e-01,7.053333711219913482e-01,-1.029685094127982814e-01,1.412607080962394290e+00,-1.304909370625515486e-01,2.835576854238289757e-01,1.982673789188243996e-01,8.933384430643191987e-01,-5.544559622677561750e-01
6.132095448956187411e-01,8.022982838450767318e-01,2.665357515017715007e-01,-8.078881470224630323e-01,2.339702260663796274e-01,-7.515333270565460744e-02,3.516476107826452258e-01,-4.845158012195048824e-01,3.132736329418273069e-02,2.397908896688173974e-01,5.316721577371856799e-01,5.300749933053633400e-02,-4.052918552039126987e-01,3.668245570650819493e-02,-3.439235931835664672e-01,1.310823407853597633e+00,-5.518776249603241091e-01,1.693289682060394874e-01,1.455969450464070919e-02,8.391754163609044248e-02,-6.876922512745459182e-01,5.222849031282161825e-02,-5.261595312301979854e-01,2.945127620996144668e-01,1.706385032313793237e+00,1.653227586951143135e-01,5.139076930425091616e-01,-6.543238916506723957e-01,-9.892827346513071163e-01,-1.120821226605700494e+00,1.147192736006738267e-01,2.423763375113026530e+00,-4.355325834107036664e-01,4.258593337310644100e-02,-5.855642089089203584e-01,-5.435731560874040857e-01,1.155389939206917127e+00,1.147885495013888812e+00,2.095025821952894773e+00,1.204453895347892933e+00,2.285409459692127609e-01,3.634637387337524284e-01,-9.008644382693326014e-02,-2.069379437347872996e-01,5.812184249433354211e-01,9.059742464781476157e-01,2.326955524290810207e+00,-3.731370207231420322e-01,-1.457875228636693610e-01,1.123533393320754747e+00,3.183879567096182139e+00,1.420772000176075522e+00,-1.940717355963271773e-01,-4.093482104485123285e-01,-5.847049745511170293e-01,1.679932581399304237e+00,5.867734269363209521e-01,2.183034334282128175e-01,-5.575204774882713821e-01,1.101237273273826922e+00,6.106576962614347348e-01,-1.482835946567553631e-01,1.304540977429758664e-01,1.164720178252206084e+00,1.251921904025621535e+00,3.922819974594274339e-01,-7.699964235355326592e-01,5.737681884737354521e-01,2.986467449985122924e-01,6.241313786463794644e-01,1.738583643531242506e+00,-5.228593483013462828e-01,2.787627187012242103e-01,2.955541765170761614e-01,-4.645330405922543648e-01,1.154991896001308804e+00,-3.697318490306366612e-01,7.132713513923930604e-01,-9.803235077288197097e-01,-2.433314666002928117e-01,3.261719182750998924e-01,-4.683424261024268787e-02,-6.500699404840679096e-02,1.789563505790202624e+00,8.749388412234693213e-01,-1.105512819508074340e+00,5.901227165766327332e-01,8.828639826569150140e-01,4.827812700805921842e-01,5.439027821674962127e-01,1.229260104338290693e+00,-6.391088229377622776e-01,4.150615993346505328e-01,1.976094574869412257e-01,8.644821166955383163e-01,-1.176602305876875976e-01
9.732329625892186531e-01,1.282874332329148492e+00,-3.042286067231257385e-01,-7.215940847942764469e-01,-4.081181339718633061e-01,5.426480295681122001e-01,4.216995969270068700e-01,3.366108160975633812e-01,1.645035913482017165e+00,5.096537942277326594e-02,-4.750424960543164765e-02,1.459366353640964564e-01,-4.415775709148472283e-01,-8.028922630556750706e-02,-5.264298015148024534e-01,1.442161807028266018e+00,-1.766372445659396273e-01,-3.110716770106161100e-01,-2.821295984400982726e-01,-5.619604426079404663e-02,-5.919890068815705231e-01,6.967943307266942776e-01,-5.946438060602942111e-01,-9.536066737878434729e-03,1.846828306108025508e+00,3.004408979443840555e-01,-2.316713705561656289e-01,-6.583707747222263817e-01,-1.755432098022470688e+00,-1.501093141335106074e+00,3.664773489760516090e-01,2.514987015428586492e+00,-2.448594178032668101e-01,3.734430240075704011e-01,-9.079645807529446166e-01,-4.438340794123455391e-01,2.368355910462961234e+00,3.700041646558548947e-01,1.847449020460427027e+00,6.030810703373711279e-01,8.598280151801065418e-01,5.376614892997197970e-01,1.335100408852086806e-01,2.129946945846175610e-01,4.956993420301702424e-01,7.936587836960048437e-01,2.538997194751432041e+00,5.628546948576313991e-01,3.190510490749486894e-01,2.731727767032254839e-02,4.463827792397021987e+00,2.516574554158357735e+00,8.871066587421231331e-01,-8.771834216512244820e-02,-2.083592043534310267e-02,1.267442405217380941e+00,-4.766363218197910978e-02,-4.463579337719265627e-01,-1.254525975512343683e+00,2.076367534344199406e+00,-6.954574343874148079e-01,-4.428422879851304228e-02,1.721301866111344114e-01,5.765225997347367404e-02,1.373297292096424815e+00,6.513728126970022014e-01,-3.962777638780899392e-01,7.032474832247338492e-01,-2.084772427295115277e-02,2.223852678439232622e-01,2.251574046646147131e+00,-1.427849113598826936e-01,-2.751581054805305460e-01,-4.457490986618866113e-01,3.659507607012264518e-01,4.448578177529083355e-02,-5.507466681782873241e-01,8.668131329720418776e-02,-1.730519898923130739e+00,-3.938155455645165892e-01,1.258197867028508998e+00,2.427396092313785503e-01,-6.593462850389596452e-01,1.841587207993573561e+00,8.912394053758385670e-01,-1.414035834953750737e+00,9.609209259740866815e-02,6.390247833571678360e-01,1.186898933387365629e+00,-1.591738372382117017e+00,1.803418703229285436e+00,-3.894907511231888164e-01,1.384068519926760166e+00,3.670637003046860469e-01,-1.074666719332481257e+00,-7.284755187108509222e-01
4.502037617216695931e-01,-3.964922371272471269e-01,1.575873760804563095e-01,-2.704721070063790256e-01,-4.042047055245676090e-03,5.939409339858696679e-01,1.064121173126603592e+00,-5.965756987001399336e-01,-9.168653383328329021e-02,5.161268923929759334e-01,7.941967087014923932e-01,-3.062058933524589577e-01,-4.490925303027406557e-01,-2.087168219805690117e-01,-2.785316475251431445e-01,1.194841853944553112e+00,-1.052033169131498802e+00,-9.412157244397548195e-02,3.164635471697223035e-01,2.439780828224017151e-01,-8.473149604213754404e-01,2.043983782522839077e-01,-3.256640984443954778e-01,3.687385658475936245e-01,1.569647520609006586e+00,-3.346968825122508817e-01,4.556521600587886134e-01,-8.084042941113180891e-01,-9.800774677626893361e-01,-9.166045843983071650e-01,4.481414010497052347e-01,2.823842309273089768e+00,-6.566255860958084001e-02,2.033424390762385847e-01,-4.307827044591898691e-01,-6.249280095273053171e-01,9.789764142152805881e-01,1.173787962913436234e+00,2.220583919206243095e+00,1.551157209825380079e+00,6.047484086616311538e-01,5.735846815971508139e-01,-1.668537953190034062e-01,-2.383942335046986827e-01,6.119242704879863659e-01,7.843366260194954975e-01,2.010891329816570039e+00,-4.370043491527975665e-01,2.021594876653221851e-01,2.237178994705217860e-01,3.795250003527883109e+00,1.921966328627803255e+00,-7.666835468324856295e-02,-5.493415001812423926e-01,-9.055819936755602484e-01,1.850032922333304963e+00,6.724190043219494539e-01,-4.779775420312053213e-02,-1.009189333365512198e-02,1.898155654246808322e+00,9.916007742367881628e-01,-1.030969198636172424e+00,-4.632481819524465472e-01,7.792117490935563939e-01,8.935420362896778768e-01,1.694359874555027290e-01,-8.459491638251479539e-01,1.256253461358037615e+00,-2.340940775326214585e-01,5.480154003660755446e-01,2.001710497296715907e+00,-1.509678050116350922e-01,6.480002478265433075e-01,6.918852067138500095e-01,-2.344817915860253899e-01,1.257477322135050812e+00,-5.599988802970953250e-01,4.262282432426131029e-01,-7.135682862950845085e-01,-7.244019545491282575e-01,-7.917757564184535468e-02,3.782229996869422572e-02,-2.554708756389873492e-01,1.996069553759104664e+00,5.588545693204314269e-01,-1.293620079025016079e+00,2.895208373012158609e-01,1.610228662552755097e+00,7.887496471802881715e-01,7.995054254818362294e-02,1.406616641870972240e+00,-2.172473068917896155e-02,3.060321711029716507e-01,5.127163872883079287e-01,6.218105068116872580e-01,-4.778596914868896151e-01
4.834427968034725742e-01,-2.226604291533927915e-01,-1.422239769615352145e-01,-3.297100329305889810e-01,-3.488540990916261242e-02,6.617672177772324638e-01,1.268621803853589913e+00,-5.187764186904602060e-01,-4.630426835704100075e-01,3.936453017940313437e-01,1.026629984271461016e+00,-2.554882224657555323e-01,-3.526440977125667731e-01,-4.668847107763086923e-02,-5.079846406656256530e-01,1.373660516309847646e+00,-7.115899192815042795e-01,-4.045749539760482572e-01,2.421980399832804332e-01,3.456743824183958202e-02,-5.604935046643073626e-01,2.975808352294789239e-01,-4.301737064897775964e-01,3.700354715644595949e-01,1.690725112596408231e+00,-2.114145380369739924e-01,3.270449909716243164e-01,-7.614059034877336263e-01,-1.104476387799063763e+00,-1.147491161668698467e+00,4.271771182100191355e-01,2.568407160105101283e+00,-8.250434252782268274e-04,3.905268897588159982e-01,-5.349396990535897345e-01,-7.294819448120964944e-01,1.136991251972937711e+00,9.853749202695132325e-01,2.438595747597493091e+00,1.223713444895651037e+00,5.379747579513581845e-01,4.550790833516403788e-01,-2.946164035691499206e-01,-1.446568110973566745e-01,4.008397441655840998e-01,8.188787836676200138e-01,1.804602707424928232e+00,-3.069719749269302911e-01,2.344604027718126815e-01,6.927167966991409909e-02,4.062542175698940383e+00,2.125098429242600062e+00,6.641178491396670935e-03,-5.710694041837038881e-01,-7.229192870910421398e-01,1.782427047424723021e+00,6.375120123795545712e-01,3.368608996963798341e-02,-3.169504460422380987e-01,2.055801788797055885e+00,6.155605719627424977e-01,-1.096981732359386452e+00,-3.458996621934431470e-01,5.078144329490793529e-01,8.123290310333971531e-01,6.222085521985920575e-02,-1.014468956955446366e+00,8.239099458893581751e-01,-2.925895642015457487e-01,9.348037254428389620e-01,1.988763835068266150e+00,6.858437872047318251e-03,4.923220098101138142e-01,6.669258745687769441e-01,-1.945717947247234680e-01,1.100628228975162770e+00,-8.351315890297008604e-01,4.990948152792727410e-01,-7.527890976532239931e-01,-8.369171614445334306e-01,3.481479986675751759e-01,1.181854996894445980e-01,-2.881335687728550643e-01,1.976406496124141210e+00,7.501386142153707581e-01,-1.417354049779037117e+00,2.830681527590235280e-01,1.140156470035076586e+00,8.422875398566787020e-01,-1.008918195417951025e-01,1.266865804678608987e+00,-2.593043803485794996e-03,2.248929664729035771e-01,4.117401664740791833e-01,6.382850241254904855e-01,-6.386240067473667459e-01
5.077121024762911716e-01,6.076535106330875902e-01,3.612553009485164335e-01,-6.585339350032791694e-01,4.136544858576661210e-01,9.637437900317724626e-02,1.110579369705041008e+00,-8.121159131198756320e-01,-5.549015232088165828e-01,-7.828764241107341593e-02,4.254566195656306338e-02,-3.435448750690690001e-01,-4.814943080636431283e-01,5.581507987900755779e-02,-1.853751449996464962e-01,5.353964019571828548e-01,-1.016556840767176118e+00,-1.933925892222987386e-01,1.019960466278150568e-01,8.433060629262556507e-02,-7.494504396944263735e-01,-4.286868938329232437e-01,-7.225998986089134934e-01,4.063115312519277600e-01,1.743472706020120278e+00,6.983601448499705544e-01,4.764160326690709546e-01,-7.423643002147602976e-01,-1.608645817992580440e+00,-1.289501391237694472e+00,2.641176201223579545e-01,2.488598663802241706e+00,-2.057365863412051188e-01,3.287420561861374990e-01,-6.955185133655731322e-01,-4.622782827935889016e-01,1.279979539019576062e+00,8.715724441391807797e-01,2.047393792327210083e+00,4.619821773047282365e-01,1.562298158733665954e-01,6.271305221521228379e-01,-3.921885780119152565e-01,-2.358283243153269648e-01,9.524238966986215971e-01,1.129992956385111658e+00,1.802602291045204197e+00,-1.681497240622681633e-01,7.216623895661962440e-02,5.467832469893370018e-01,3.233198852305652071e+00,1.760673347653370024e+00,-5.361051123170823551e-01,-2.679565611113551293e-01,-1.931405505214183194e-01,1.383323527647669637e+00,-1.265630836876035503e-01,1.218867374265179271e-01,-3.234509338718422611e-01,5.597481720509052128e-01,2.976608046106655192e-01,-5.047524497781089581e-01,1.729211934497504599e-01,4.954463875158950925e-01,1.425433328539195799e+00,7.665374902817655434e-01,-8.447753701585501984e-01,7.648440749235859704e-01,-1.904427485124111641e-01,1.211109888071633112e+00,1.231468284293192106e+00,-4.732653734106470056e-01,1.582411647595295956e-01,3.883127382928336369e-01,-2.725628566625989957e-01,9.458750050175883661e-01,-7.402770690584652424e-01,-1.278624211023410284e-01,-1.036707547542111918e+00,-6.020558499387442808e-01,1.840248139232493196e-01,-6.253003515018600300e-01,-2.437520770632463640e-01,2.197445865681148192e+00,3.627922569594375646e-01,-1.104735800997334705e+00,7.079919210135783292e-01,3.799675318667897761e-01,7.948044526709237001e-01,3.858902691427579801e-01,6.135864558429680038e-01,-7.651490369230087296e-01,4.446742368345170116e-01,4.754037134416893018e-01,-7.668765523032455844e-02,-3.042822507994048520e-01
9.690132726068900748e-01,1.083861576931845594e+00,-9.744274699047877908e-02,-5.235407116790069537e-01,-2.688146872055874881e-01,3.137502625759932551e-01,-1.324851982791822036e-01,2.831208574176390380e-01,1.629652808553119447e+00,3.934517465585243290e-01,4.481837683751898060e-01,2.617381520512689907e-01,-4.327214235835305511e-01,1.288466095058586613e-02,-3.295615425021744538e-01,1.908396825079516468e+00,-1.438665250524568950e-01,1.761339180675584870e-02,-3.430099340627885962e-02,1.659385135821343782e-01,-7.904787931213124175e-01,6.138861171425894492e-01,-4.126457317201354669e-01,1.122953917067940760e-01,1.487997282030047552e+00,-4.029609637560703228e-01,7.040832527578831657e-02,-6.054896255293057417e-01,-5.696617671972250552e-01,-8.089992137075624479e-01,3.688499001144367462e-01,2.460705285461965541e+00,-2.970827691311059837e-01,-1.672703873184835932e-01,-6.644503917506142665e-01,-6.315626685282342834e-01,1.653124127484064676e+00,9.667944436623301385e-01,1.535425231980639404e+00,1.378629468116549850e+00,8.896494635754303992e-01,3.020050815108018538e-01,2.658776795436014750e-01,2.380168641254977735e-01,3.397735215687122112e-01,6.957625851162260178e-01,2.907863587367375047e+00,7.753260214528608085e-02,1.430579570990788141e-01,9.220059819372596888e-01,4.132661890774050661e+00,1.622703422417331121e+00,8.073286154015903993e-01,-3.953693168319055706e-01,-5.420388474665905898e-01,1.473174727516384674e+00,4.709099138730530321e-01,-2.721207968146515110e-01,-8.509353659891267796e-01,1.734931909948481232e+00,4.922422831730310921e-01,-1.757804230233867004e-02,-1.926444756353958565e-01,7.950027819369545057e-01,8.741856406759629383e-01,3.770756331790664495e-02,-3.603501537249844677e-01,8.673635387535439945e-01,7.479701255196041787e-02,-2.834183028714067909e-01,2.735063659843540051e+00,-3.765922009882139987e-01,6.137467164538490394e-02,1.929303571621859836e-01,-2.995729356922841036e-03,9.532508763267982799e-01,5.730028399928133176e-02,7.440973334895307767e-01,-9.963090461633941075e-01,-2.531317441441133242e-01,6.477131444288838358e-01,4.057110610421678643e-01,-2.467642694399472536e-01,1.332745205747127404e+00,8.958738893885119792e-01,-1.033459541951275984e+00,1.058249272152072262e-01,1.572935908895608303e+00,7.320755878140984274e-01,-6.711078473403270239e-01,2.133004309814063859e+00,-4.221133387375820556e-01,1.204990082611032021e+00,2.441548960464056395e-01,2.075169536682988647e-01,-2.765511585862026056e-01
8.432542612029413354e-01,2.180322579034427166e-01,-6.372566746247053660e-01,-1.892495388846495707e-01,-5.800538848470366826e-01,1.085478796961246939e+00,9.572045923764052056e-01,2.809569216277251202e-01,1.030299160653090240e+00,4.094411427288886518e-01,8.634405247245449111e-01,-3.244291448036498715e-02,-3.491082529158150427e-01,-6.313073493373203005e-02,-6.436097999366532374e-01,1.893894979763964592e+00,-1.926324310911874393e-01,-6.881328849894888799e-01,6.415965286001121259e-02,-2.616963098396096060e-02,-5.032064397401370126e-01,9.306372902585003937e-01,-3.990887565860783970e-01,1.368915460948530172e-01,1.651404409681848540e+00,-4.955847629697374690e-01,-2.255275849317246173e-01,-7.096581042233414127e-01,-1.118462609588639856e+00,-1.159131428540873143e+00,6.296181818018065091e-01,2.545824996632285231e+00,1.224859502659850219e-01,4.031448753737766344e-01,-7.165700665690393212e-01,-7.705812017054496366e-01,1.902034995628793634e+00,5.786472746440396442e-01,2.086668897973772197e+00,1.097547157370223347e+00,1.126297654456750674e+00,4.219114442565443657e-01,-1.161475331795683297e-03,2.869347894593946569e-01,1.403181012050004339e-01,6.435327511755726260e-01,2.235209315054026646e+00,3.058152372983038991e-01,5.407152738840778072e-01,-3.964269190516719332e-01,5.110349076048729344e+00,2.644140193581953291e+00,1.030632883321383808e+00,-4.580121924497585484e-01,-4.810259818751640437e-01,1.527073309385126088e+00,4.092503272606896614e-01,-4.525854893736368512e-01,-8.615342779411637730e-01,2.857224354794019483e+00,-8.315394905289902328e-03,-9.272321460802595006e-01,-4.678381394573633001e-01,-8.525715532745359315e-02,6.226317650644430657e-01,-9.717539553670118124e-02,-6.715669703130348056e-01,8.927171539240174036e-01,-4.731630409055990194e-01,2.966221156924975233e-01,2.786307833264983103e+00,2.506922378444125799e-01,1.286104834407609809e-01,2.958366134288734628e-01,3.558348806077893944e-01,5.508980475084722661e-01,-6.789128530125720928e-01,4.064428755322596620e-01,-1.060006387062483624e+00,-8.650017969045415978e-01,1.009433584261228534e+00,5.663633334643163320e-01,-5.952801230697128965e-01,1.683045066608062967e+00,8.851547065519685953e-01,-1.518186550886454489e+00,-1.798193175433587254e-01,1.360902659571991524e+00,1.213005167923000283e+00,-1.595541815611633885e+00,2.024932115447508618e+00,2.132993886849515741e-01,1.013087382923946622e+00,4.349512610525885226e-01,-3.383403802445594244e-01,-9.618606554611306425e-01
8.425616352144702503e-01,1.067646687932141347e+00,-1.302493166369288746e-01,-7.683690366046440623e-01,-1.104807553298449430e-01,3.611612734898828059e-02,-2.246973036154695236e-01,8.719181013089205567e-02,8.198849558967905571e-01,4.829937073662334823e-01,1.040729739879549864e+00,4.214022149562317021e-01,-3.047458269626105998e-01,1.200391682492772533e-01,-5.661351838105215251e-01,2.227624962727670521e+00,1.203728867652216761e-01,1.529460947880894039e-01,-6.438268261339516463e-02,1.344523636421585122e-02,-5.317993218910792574e-01,6.578453153363472694e-01,-3.893156210555546171e-01,1.661849566911456355e-01,1.621146847326522478e+00,-4.456790646509100062e-01,2.977828598314524733e-01,-5.485891851692277221e-01,-3.573746712024320482e-01,-9.419569392711021338e-01,1.317651790741276030e-01,2.243179975886385069e+00,-4.653155987351446088e-01,-1.583402924317426907e-01,-5.800528049692194044e-01,-7.301582114523450517e-01,1.294998749137904248e+00,1.195032184930196362e+00,2.006762104351820675e+00,1.646224205341444424e+00,5.336282939113130563e-01,7.334363723319042849e-02,1.784204852048181245e-01,6.277091643562031364e-02,8.336215126744611625e-02,6.785227768373754964e-01,2.793770891543599255e+00,-2.894033134966536580e-01,-1.427500035534637335e-01,1.358407151940058011e+00,3.727162701414551194e+00,1.347015914543133519e+00,4.992216379108654900e-01,-5.536898267221266323e-01,-7.759980265834280910e-01,1.772097799710105726e+00,1.038389044736407252e+00,1.338023151680503009e-01,-9.563322240835437915e-01,1.826224540601976365e+00,6.732601413892844722e-01,4.169498868884297105e-02,-3.237998449393983402e-02,1.320938155232721289e+00,8.465486954144294529e-01,-1.550690352172555131e-01,-6.633279529078605075e-01,3.441932415864439321e-01,4.583704302905545758e-01,6.170274452268620369e-02,2.546868000530622567e+00,-3.931574392503562332e-01,2.219585322478327960e-01,2.761387602246488937e-01,-3.972113785474883918e-01,1.213555180771074049e+00,-7.625785716454974716e-02,1.375483707135305655e+00,-8.736160459986969107e-01,-1.049249381155605843e-01,7.425053566196454513e-01,5.922244486055848744e-01,-1.073479956432854543e-02,1.274389353363207578e+00,1.322057220379013742e+00,-1.124344150252864161e+00,2.901900677600905976e-01,1.333722055759894998e+00,3.873632570922033169e-01,9.568540277905418501e-02,1.959326626865200316e+00,-4.218945452299486809e-01,6.458038437321178549e-01,-2.467018629798040097e-02,1.341143979457614321e+00,-1.401064436483990816e-01
9.974936315848165203e-01,1.181052250865328723e+00,-2.739363936035968949e-01,-4.699204089399559026e-01,-2.971845709939338609e-01,5.346210566132932884e-01,3.708399601069778395e-01,2.924990013501287400e-01,1.463103183447862499e+00,1.160262278105537587e-01,1.432751348334665997e-01,8.959649971596814200e-02,-4.415773504136172312e-01,7.364764181580174540e-02,-3.744675712616952756e-01,1.570361346460444452e+00,-1.770408388718046622e-01,-3.972250669056426875e-01,-8.644921823942547379e-02,4.561486711925703819e-02,-6.817541716310488997e-01,5.024600712187674567e-01,-5.870529302666522842e-01,1.128122335502412948e-01,1.595101723873050048e+00,-1.955397897403877983e-03,-1.467379596653576035e-01,-6.318693279280763742e-01,-1.130213821435362975e+00,-1.087154897375046225e+00,4.796263769866215831e-01,2.398014212203747775e+00,-1.187348621756578460e-01,1.340966417830717350e-01,-8.381806808836227418e-01,-6.037638239982370258e-01,2.034161778639740348e+00,5.785773784501005990e-01,1.551591972427979416e+00,6.944306060244032075e-01,9.284864488041439934e-01,4.305369218809784737e-01,8.883825869209190096e-02,3.398921569998291092e-01,4.462041276330659945e-01,8.188548179587753495e-01,2.577313052816282202e+00,4.317044777073083539e-01,3.564099231481455687e-01,3.465640671102507842e-01,4.495241913945979384e+00,2.099652949866100737e+00,8.527475384584890516e-01,-2.546167518124043960e-01,-1.238731909738515213e-01,1.193616958142937445e+00,-7.160733115438272511e-02,-4.124140070480952769e-01,-1.002443843361912501e+00,1.661080455709244008e+00,-1.145791361065772451e-01,-1.932428242897604453e-01,-8.711548843396096919e-02,1.040902110756580790e-01,9.816514586916313956e-01,2.696642870852482554e-01,-3.974987622876974269e-01,7.970562973602459689e-01,-2.646723581117528812e-01,1.348242254180419541e-01,2.527527659712382135e+00,-2.218365244140174664e-01,-1.917533552855477663e-01,6.955542929348830505e-02,2.755114907127771406e-01,5.441785466701986040e-01,-2.984068274829365652e-01,1.858482551560642348e-01,-1.207303893732743161e+00,-5.126064606421667502e-01,9.422922498761552301e-01,1.657433853656209988e-01,-4.724634785119760094e-01,1.563252090459806842e+00,7.023714369472747743e-01,-1.141725855132306622e+00,8.536327881789701477e-02,1.016049703561689999e+00,1.057863345426071744e+00,-1.236251747779503418e+00,1.831019622830465376e+00,-4.576122056181685660e-01,1.378644119925341638e+00,3.811846568704629901e-01,-6.897612548817257938e-01,-5.565019477063719577e-01
9.831020956244226339e-01,1.319781854716930214e+00,-3.431535988804870069e-02,-6.161340151007739241e-01,-2.291441138374198938e-01,3.413992895512615866e-01,1.450575264930265007e-01,2.299694452613040840e-01,1.705916806421926335e+00,1.062393296298641543e-01,-1.396396994471728603e-01,1.209034411545059917e-01,-5.007484870781286901e-01,-2.747848136954626763e-02,-2.661888962881925336e-01,1.381213019993352109e+00,-3.422456821988287268e-01,-1.126507575540385969e-01,-1.465459782856043669e-01,1.252037994200398130e-01,-8.196188996546158734e-01,4.181107049806038756e-01,-5.712277172815606319e-01,7.468208750220263481e-02,1.619818165276054378e+00,1.445901273878325288e-01,-5.253863107213802008e-02,-6.448898192759288106e-01,-1.259767008042538716e+00,-1.103849635247328598e+00,3.888671412537937355e-01,2.523848649617169038e+00,-2.718712097627699054e-01,5.725630385994669169e-02,-8.188800266926736793e-01,-4.640114096891773676e-01,2.038278190846423144e+00,6.423366468868055845e-01,1.477776191879629497e+00,7.865876896670043195e-01,8.472024647398469499e-01,5.106893726330080652e-01,1.786977547277135980e-01,2.275095688970155683e-01,6.232743129284873396e-01,8.308558999708918202e-01,2.730368922033686641e+00,3.809022440620401517e-01,2.480078263187715515e-01,5.384309318255355858e-01,4.137936520676461782e+00,1.974875045373584159e+00,7.257531584863352592e-01,-1.596597791216865792e-01,-1.410547113792147700e-01,1.222021633231193283e+00,-8.184847121285676597e-02,-4.060205988683336376e-01,-9.531397758924882169e-01,1.453449266017556862e+00,-1.018773346034352045e-01,5.776701428530184312e-02,4.194014477768197302e-02,3.477489648602389849e-01,1.242267711291202170e+00,5.241060358449984857e-01,-2.850236348531562935e-01,9.223508380611875612e-01,-5.620931760268672167e-02,-3.147260040395349900e-02,2.344943327177193115e+00,-3.903943539851739697e-01,-1.800739747102721999e-01,-1.296447190005302341e-01,2.134356333504802139e-01,4.936614608152468109e-01,-1.706327855567655316e-01,1.340997642431006054e-01,-1.381248144577990056e+00,-3.158013884501051916e-01,8.003674022524202014e-01,7.271640902199992540e-02,-4.611553764786419096e-01,1.645041357176952213e+00,6.675150708298416280e-01,-1.095106865868761714e+00,1.799164849708694280e-01,1.036728357090834995e+00,9.946220286116678189e-01,-1.068870191561774208e+00,1.821545057887404173e+00,-5.945079801303470024e-01,1.427362733744780954e+00,3.901553360333100962e-01,-7.660316983968351590e-01,-4.187276085240241308e-01
1.123510231936526216e+00,1.599613204373001363e+00,-8.011594748002215383e-02,-6.910799799937853427e-01,-3.770366077006903627e-01,2.188185221183443774e-01,-4.926397767347185375e-01,5.486850499297007966e-01,2.400688945403615104e+00,2.965899444150706388e-01,3.873910731161600562e-02,4.095930505017514878e-01,-4.774008931557838231e-01,-3.261724236887249273e-02,-3.060381730105157239e-01,1.899694730543881160e+00,-1.321962338185928010e-02,1.450534692636870071e-01,-2.190655970668773933e-01,1.643222847758869787e-01,-8.438125820853501491e-01,7.349081666184309469e-01,-4.503019255224697814e-01,-2.378289735492902790e-02,1.541011023601985164e+00,-2.219592531948408609e-01,-7.872794101495780850e-02,-5.752358989940942191e-01,-7.920830610385654058e-01,-9.161496697543278778e-01,3.211033808748923746e-01,2.485232868757702551e+00,-4.254118557931478306e-01,-2.062538055876843024e-01,-7.715097355754192421e-01,-5.016469169988322374e-01,2.040651425466506907e+00,8.008330211948848643e-01,1.324693942200845242e+00,1.241089964280414959e+00,9.762697178243820995e-01,3.459577981204246533e-01,4.410591001933093502e-01,3.193414040799731346e-01,4.114420916212012114e-01,6.814371457716015268e-01,3.206250394166400675e+00,3.317410639243768555e-01,1.337171941721634616e-01,9.783259335077431063e-01,4.157887136340564282e+00,1.701920017363675708e+00,1.064857146145218980e+00,-2.189870430892352504e-01,-3.417456019690410240e-01,1.329727792191038649e+00,2.754325732474465771e-01,-4.242920527803919484e-01,-1.136074350207417982e+00,1.706477568683914647e+00,9.569559745805214512e-02,3.979007379721292148e-01,2.080097111643114394e-03,7.456348462435796742e-01,1.121225744251062029e+00,2.864118761311383321e-01,-1.253526102169478795e-01,8.706796070709839075e-01,2.358188519802128791e-01,-5.870997036253058354e-01,2.787063478786250492e+00,-4.738110356181662874e-01,-1.711245052172451486e-01,-2.208647055967698780e-01,1.533625146196040956e-01,6.106084121624008043e-01,2.006696125680578757e-01,6.234123927536903143e-01,-1.355221986637909160e+00,-4.412090035648008612e-02,8.935746455267374877e-01,4.391906751570944234e-01,-3.574636935457988773e-01,1.301030931864639362e+00,9.438340949326867735e-01,-1.019152400308443562e+00,6.633179016069093437e-02,1.449763943269035682e+00,8.151641130193342244e-01,-1.096631532274618737e+00,2.327944475259751567e+00,-5.755553828462018906e-01,1.589514659067405411e+00,2.268586880063218347e-01,-3.323099105552830834e-01,-2.599649803931430858e-01
5.284508066412130223e-01,-1.480450038644559596e-01,1.489010806889070615e-01,-1.994489482388442925e-01,1.107573981099141264e-01,4.658336709197264391e-01,8.899058913688191463e-01,-5.617883461481155694e-01,-1.800289837938705562e-01,4.729242723614011101e-01,8.721722828872786604e-01,-2.608480286412860893e-01,-4.308716753870072136e-01,-1.366581262352290632e-02,-2.045143055236076646e-01,1.338215594743961123e+00,-8.832034679397080534e-01,-1.630530632637088584e-01,3.784968820701359871e-01,2.565401479781189709e-01,-8.450014763514337446e-01,4.561175293919456086e-02,-3.864715917585490046e-01,4.357937156310812687e-01,1.422538999950401895e+00,-4.257207487708811744e-01,4.865225208272230262e-01,-7.463940888545224084e-01,-5.444424555643356811e-01,-6.823257409564480458e-01,4.702099227567174689e-01,2.610685671963357546e+00,-3.414591757638968383e-02,1.487613709715002175e-02,-4.416304637468818073e-01,-7.383171526891609826e-01,8.332982275304793296e-01,1.270742904424119857e+00,1.965068140382902007e+00,1.461865771134630121e+00,5.904536586052523406e-01,4.369490557658149976e-01,-1.924180988361103295e-01,-9.910280284007012830e-02,5.437988108045678226e-01,8.361703449920955267e-01,2.096549252329203306e+00,-4.629101829880969965e-01,1.775841289454451188e-01,6.165890448055045825e-01,3.764795575885012902e+00,1.548967906791231419e+00,-7.670860663613743302e-02,-6.331016444334018889e-01,-8.557769996668077583e-01,1.717194680937051299e+00,5.855710590961389350e-01,1.888871062157844449e-02,-5.182577026499712858e-03,1.428725573236928170e+00,1.252888504267615222e+00,-9.444306120955153760e-01,-5.107276038072968705e-01,8.144019907447725970e-01,6.673887004851247751e-01,-7.436207867035421470e-02,-8.303041992046564790e-01,1.127496732630006493e+00,-3.301890513188792675e-01,5.299119177599059816e-01,2.173173125432985131e+00,-2.674693024182079881e-01,5.789227937667520418e-01,9.703451041656175891e-01,-3.144271123645244748e-01,1.556950957685613313e+00,-3.579084852937519656e-01,5.381833232499109165e-01,-4.019590248964343138e-01,-7.286519823980165400e-01,-1.431771746652155120e-01,-3.119821178338269552e-02,-9.556452974082485508e-02,1.731010958313265347e+00,4.977279399446644104e-01,-1.059141889992322172e+00,3.311183771529562780e-01,1.662615832304653818e+00,6.570028002240912990e-01,3.499179970032843534e-01,1.387511296370529834e+00,-2.137095199772512943e-01,3.667270636944825468e-01,4.494574213427630083e-01,8.795688251785207523e-01,-3.038450658923369518e-01
5.973670091243219460e-01,9.552010358200538898e-01,1.170581769687883827e-01,-1.000100954943508924e+00,2.298043923938655198e-01,-1.496973263939938570e-01,3.688760045357464823e-01,-4.702522657583979027e-01,-2.618412473791686956e-01,1.972840110363790755e-01,7.512387883458604421e-01,1.668255001103332580e-01,-3.234666319929475065e-01,9.835305836809946078e-02,-5.627387218954612580e-01,1.479173238853927819e+00,-2.917448470112912196e-01,1.228098507948516271e-01,-9.858647309826679139e-02,-8.419744333923509516e-02,-4.577580685340548738e-01,1.805430467067973832e-01,-5.650248451792585502e-01,2.653454216782381581e-01,1.872385827308651329e+00,2.881147052937466091e-01,4.977983522171341990e-01,-6.166223146603559968e-01,-1.140945005825576120e+00,-1.378481530503930630e+00,-1.067520143801964361e-02,2.271169551794137487e+00,-5.140120955844570405e-01,1.776933348009591684e-01,-6.288775938010706668e-01,-5.696599358590457296e-01,1.226654837868968784e+00,1.078215362059238069e+00,2.402470992953729123e+00,1.131151469606853865e+00,7.371039256250988547e-02,2.615272358791740359e-01,-1.386278615915900181e-01,-2.482045503228295091e-01,4.153341054418452361e-01,9.021573831774103436e-01,2.231738689839020129e+00,-3.843306851998599116e-01,-2.425492198341070438e-01,1.139073032047426270e+00,3.158315498283996714e+00,1.524164003433918779e+00,-2.177720651173833399e-01,-4.142375001121029188e-01,-5.456758025868999606e-01,1.761432699320721884e+00,7.635917117144879196e-01,3.671519817054665902e-01,-8.248767060291405384e-01,1.316247583460495862e+00,3.258375018777732723e-01,-6.881293711082633879e-02,3.199979078010556366e-01,1.220599879926167919e+00,1.328698706568117727e+00,3.956978730935215571e-01,-9.184248193991770837e-01,1.833418586569167119e-01,4.911055879789789635e-01,8.854407313250926004e-01,1.616539681084450786e+00,-4.504887917640498785e-01,2.225125251246271585e-01,1.364352049826311197e-01,-5.440191323289617076e-01,1.015730869188836039e+00,-5.754286171533257166e-01,9.372210498444829563e-01,-1.125510571635827795e+00,-1.829910019531115761e-01,6.526196049004328037e-01,8.675958102616368461e-02,-5.548279413595533227e-02,1.820226552081879223e+00,1.165213420327989358e+00,-1.257927770482430985e+00,6.447834333308981591e-01,5.013820157099612151e-01,4.254181398443849793e-01,5.903772553365951303e-01,1.137515203119454643e+00,-6.258611863274951004e-01,2.330191143882142102e-01,5.232856878964003977e-02,1.118022456725701774e+00,-1.801443027398837438e-01
5.076484778057266389e-01,2.230471279698273968e-01,9.800134870597949910e-02,-9.467908354315026642e-01,-1.597422741543065849e-01,1.546861627323345978e-01,2.263003104127464526e-01,-3.150664328313116935e-01,4.142449205619213592e-01,6.637909504332422106e-01,1.068822963844223262e+00,2.511678823039212860e-01,-3.387075051601336484e-01,-3.232185746443167473e-01,-6.747376436089577156e-01,1.807307826707351239e+00,-4.626149621957009739e-01,4.778897215106322482e-01,-9.059061729207359970e-02,4.052200495660561452e-02,-5.794285193662127575e-01,8.038480940340102521e-01,-2.109338055516236099e-01,1.210994578576671254e-01,1.924306775533931813e+00,-2.837124992742834917e-01,4.951520615071020037e-01,-7.074090298161561652e-01,-1.152122604424819174e+00,-1.369784763057504406e+00,2.482869667019826920e-03,2.748489436079166737e+00,-5.908778085368270316e-01,1.947527183742419621e-01,-4.296526457193599047e-01,-4.926715309790066777e-01,1.195946827230745413e+00,1.240954799971192957e+00,2.730545055555876566e+00,2.085692120317078846e+00,3.488955360948872153e-01,3.572319223357355855e-01,1.466740022121145182e-01,-4.355962079967662381e-01,2.895996525149294731e-01,5.930279823873911837e-01,2.477759674939235435e+00,-5.717499554843838983e-01,-2.346161578009177129e-01,7.499955165757806741e-01,3.356742072502041374e+00,1.883905280636347213e+00,9.569153912474853696e-02,-4.719865057820359366e-01,-1.112472714448293543e+00,2.251450760937141915e+00,1.475172491275297482e+00,2.042995896676230994e-01,-6.812412435500034835e-01,2.638113498914510746e+00,5.276822768433087063e-01,-2.575527009719518201e-01,4.285209903299094791e-02,1.612384331122119319e+00,1.341328354383464871e+00,3.420007324379142899e-01,-8.471335887069596504e-01,6.430548893416728751e-01,7.768230074578484912e-01,2.678025122478211451e-01,1.937499518623327255e+00,-2.300991441348837485e-01,6.101881793903753959e-01,-1.092988326641138597e-01,-4.955807762836687558e-01,8.929802333892533639e-01,-5.223316095310890361e-01,1.303917776382955473e+00,-1.346147291379999666e+00,-6.931430522801701466e-02,5.340303954241891748e-01,6.453736087357335727e-01,-1.937062505947634850e-01,1.921695984876179875e+00,1.441484084662537413e+00,-1.592861705555744134e+00,3.609198033878712186e-01,1.315044221113881973e+00,4.689511453602702162e-01,2.036213773929537729e-01,1.786137949367337718e+00,-1.924575730866090462e-02,1.317160742548028063e-01,8.672878106171780233e-02,1.400663407364425517e+00,-3.604725211587237466e-01
7.737747236140820606e-01,1.672114436499154699e+00,-1.361494929355827888e-01,-1.226557529131803603e+00,2.211953694529341652e-01,-3.952206966965454149e-01,-8.677154242161655429e-02,-1.801645174609260436e-01,-1.787415162466821084e-01,1.195009147541317707e-01,1.019270716781958352e+00,4.966969838931847847e-01,-2.075081227887059787e-01,3.618047404044487658e-01,-7.809920256562399299e-01,2.019831191342355226e+00,3.853127855601169993e-01,6.810548003645627846e-02,-2.687557231672107472e-01,-2.816483672606980293e-01,-1.791092200326221406e-01,3.566914798808890619e-01,-6.548728338447906694e-01,2.098334842090165409e-01,1.923872705971074959e+00,2.841932019809357834e-01,4.052803939798191868e-01,-4.730965667587190282e-01,-8.334460045627738456e-01,-1.450090826539632838e+00,-1.593415446030787552e-01,1.852277834287277880e+00,-6.463626608061707746e-01,7.822486315335394624e-02,-7.324032271328249077e-01,-6.948535043242258791e-01,1.355913173074453359e+00,1.041414650395378727e+00,2.395167479423245815e+00,1.007661956091089328e+00,-2.334577255555780884e-02,-4.103403927253279626e-02,-8.041297696989478661e-02,-6.821915093569161370e-02,7.656396650673952253e-02,8.919575088454259060e-01,2.448968846301838642e+00,-3.035636350512823101e-01,-3.933178790594037966e-01,1.647463381307078922e+00,3.207478963106797032e+00,1.275139639022300653e+00,1.235235973782117247e-02,-4.587772289397527015e-01,-4.127223080903973940e-01,1.688255618872274599e+00,9.094574943571530623e-01,5.290393128554284896e-01,-1.343137898387169127e+00,1.237891018114859909e+00,1.054783500307745897e-01,3.470285274008215737e-01,5.481813998304638780e-01,1.357007473214211668e+00,1.217415316307153939e+00,1.467502354772315942e-01,-9.482960453590667527e-01,-4.519800858893147089e-01,7.410690428909691985e-01,9.076965861644201716e-01,1.841874913171627881e+00,-5.050845381088007180e-01,-2.194470438148188318e-02,3.999099975869542523e-02,-6.436983028300935494e-01,1.022783096469335629e+00,-4.773664022956753961e-01,1.416813980689508146e+00,-1.117984002123242560e+00,1.731834007176652479e-02,1.162003952887814329e+00,3.311336142441297370e-01,8.558386855076322020e-02,1.461191737620045838e+00,1.568607627140735428e+00,-1.196176786854186380e+00,6.724380881044438318e-01,1.589385594015904068e-01,2.312995598218233750e-01,6.515287829978657630e-01,1.259540052341713290e+00,-8.270965686944056205e-01,2.945550382661042965e-01,-2.420456026997339083e-01,1.562626306142746557e+00,-6.608457617721091859e-02
1.027192467939010534e+00,1.795052729902627542e+00,-4.752658620467669626e-01,-7.253215948109564826e-01,-5.971525190143453510e-02,2.729367381344428578e-01,5.227360300339567445e-01,2.059679358903965252e-01,6.065192482443028110e-01,-2.252060159198855105e-01,2.683434074808260794e-01,1.703133353753416290e-01,-3.205716797176860755e-01,4.273961085864660947e-01,-5.934478834309837580e-01,1.595029940941011359e+00,2.684443111372974422e-01,-7.125319653469628367e-01,-2.205809943888324964e-01,-2.535231532707967195e-01,-2.980275037678646322e-01,2.766155489066944861e-01,-8.581963603381441708e-01,1.763080060334327459e-01,1.768925960545807863e+00,4.909367325833868811e-01,-1.675982517481373890e-01,-5.276654188997709216e-01,-1.295263618356811364e+00,-1.414027131022395967e+00,3.233585684334419619e-01,1.892757757193047397e+00,-1.491121549580892713e-01,3.052286361729498188e-01,-1.014937857626403872e+00,-7.041659622079741165e-01,2.125714474625380213e+00,3.891395204285169607e-01,1.754051743647393691e+00,-1.998340841182777439e-04,5.630374266443123332e-01,2.323194507317311031e-01,-1.689903237804354919e-01,4.113310553180749007e-01,2.949926610950519557e-01,1.007533124317304685e+00,2.272188973753724195e+00,5.281676518981994750e-01,2.398936148140389801e-01,5.868189854504830549e-01,4.371569782924511038e+00,2.015391538844197417e+00,6.254558436640664798e-01,-2.415806216585212884e-01,2.735667300545634451e-01,9.939518726092633205e-01,-2.838752910135571295e-01,-1.151562854399844071e-01,-1.422566648105842990e+00,1.127245582786044586e+00,-5.863612657269551276e-01,-1.877527627149805367e-02,3.058058685952733669e-01,-9.279872786856657729e-02,1.035554325754449501e+00,2.729476164958137274e-01,-6.527180203714493256e-01,1.959950497798401692e-03,-2.276219180358428074e-01,8.851076751372366491e-01,2.184956859034451249e+00,-2.468967141378699270e-01,-4.961753579627687372e-01,5.961443744289886965e-02,1.433485917115859820e-01,4.641479605010206955e-01,-6.131493453548864103e-01,2.491031693602953623e-01,-1.220694309109006559e+00,-5.366630591828599472e-01,1.432805873545515585e+00,-8.320489737347364079e-03,-3.703872570533146558e-01,1.533857413903675582e+00,8.979965670180366510e-01,-1.131161179140372619e+00,3.255824675253286005e-01,2.465391178499953817e-02,9.608407283079799521e-01,-9.317469053951799030e-01,1.298603198067871833e+00,-8.002157643580795066e-01,1.187950390783960142e+00,1.758823148872372122e-01,-5.146079755278567536e-01,-5.376510690697460237e-01
7.656870063570213603e-01,1.145408241824672047e+00,-1.266794917787341102e-01,-6.036450786014350145e-01,1.894005806718263574e-01,2.766027222464150226e-01,1.009914949311486065e+00,-3.269912561242814264e-01,-1.456762281988541741e-01,-2.088751865512932515e-01,1.649691346180570395e-01,-1.634316846703801618e-01,-3.942194453430962753e-01,2.962281430467864074e-01,-3.892084035854834756e-01,1.007322860885900395e+00,-3.831886198813645450e-01,-6.247846912542017739e-01,-1.795559387654976913e-02,-1.085986883482764065e-01,-4.906291178229330585e-01,-1.421007272202895466e-01,-8.357736691922843519e-01,3.279207714315334754e-01,1.737732889787875878e+00,6.266781193347376044e-01,1.111185058605621556e-01,-6.406581157053519160e-01,-1.477245693365056400e+00,-1.350972991509348464e+00,3.584108905201263129e-01,2.142052329888506801e+00,-7.796828234728211959e-02,3.754413842108015875e-01,-8.844202633303449579e-01,-6.267252144058156338e-01,1.719819020786836905e+00,5.632784874681115994e-01,1.884013132068388385e+00,5.679432992115540646e-02,3.834762001368806628e-01,4.386104164820975315e-01,-3.632610828628462518e-01,1.401847512685361341e-01,6.232150661253258450e-01,1.107528033006413670e+00,1.905960443412513250e+00,2.404556987413586644e-01,2.357451879898151970e-01,4.269434859802437865e-01,3.944883620410396752e+00,1.962956493406001091e+00,4.057640976016047007e-02,-2.676834614107231336e-01,1.239654283439554083e-01,1.108433646683571139e+00,-3.443751774819627798e-01,-1.910273836166183348e-02,-8.502577229944670023e-01,7.808132840950469111e-01,-1.850444311006650688e-01,-4.025586863831394635e-01,1.939932389925401179e-01,-8.161540142591072744e-03,1.148408198523250823e+00,4.759458243380788045e-01,-7.920364901797938284e-01,3.705710124874433409e-01,-3.826660900895331174e-01,1.196063798984002391e+00,1.707531312531165302e+00,-3.022813031927680805e-01,-2.051056929508000559e-01,3.316507880109055839e-01,-7.395528783612034807e-03,7.067751307104916947e-01,-7.630472978976808873e-01,-6.807042722009315483e-02,-1.052824145722499605e+00,-7.028476069060110021e-01,8.289987923677628601e-01,-3.918694101533418128e-01,-3.328027236990211968e-01,1.882498445622259986e+00,5.414217097522598943e-01,-1.111038584562589637e+00,5.024793711681734276e-01,1.185045248870922885e-01,9.495151712316827197e-01,-3.547551793887313565e-01,8.583130278540778146e-01,-7.737286210057566782e-01,8.243343077687234066e-01,3.695370252852671067e-01,-4.331645972737407368e-01,-4.889554642403989293e-01
1.051984154805455818e+00,1.442546113336224067e+00,-5.600635744113086067e-02,-3.063509843967310298e-01,3.363721532387188573e-02,2.371042313234316135e-01,1.240543127020417025e-01,1.467797579481597836e-01,1.168655144170384741e+00,4.786928908972129526e-02,1.227295214681387581e-01,5.012656085775284154e-02,-4.680070803727776618e-01,3.523438292401454008e-01,-8.340214091490616433e-02,1.545358691070503943e+00,-1.892093298054119410e-01,-3.866673544478645419e-01,1.045376469171522826e-01,1.805631838802863320e-01,-8.362861272377343225e-01,1.337718347705907362e-03,-6.799970874017119415e-01,2.865022242477451853e-01,1.279930772430248664e+00,-1.060603332597969128e-01,4.832716854519095162e-02,-5.646554228962699096e-01,-3.726051074644045613e-01,-5.725836185961178382e-01,5.250036948690923744e-01,2.151797820176843512e+00,-7.344310241018855989e-02,-2.554893183128901235e-01,-7.958257695799515474e-01,-7.405605264404092614e-01,1.596396495225035128e+00,8.646164181516529101e-01,1.028273805211640912e+00,5.987227346265605599e-01,8.385636143622603456e-01,2.873847794804078593e-01,1.356086114923946151e-02,4.777307728810495924e-01,5.216520952171197489e-01,9.559623422772007828e-01,2.685491045967625112e+00,2.608442677544955957e-01,2.863863564296523778e-01,1.108734105806028936e+00,4.165223954239730020e+00,1.302479426533493800e+00,6.070463508818704224e-01,-3.921847627250181212e-01,-1.005858976748453815e-01,9.792746599293136178e-01,-2.872727119211931912e-01,-2.750525026575723619e-01,-7.227369792199008769e-01,5.352063936160140756e-01,5.902946783686437993e-01,-9.091543473608676429e-02,-2.098669652186253842e-01,2.827844236824555435e-01,6.633437268322918134e-01,-4.063598575150167980e-02,-3.505753805523196820e-01,7.978180354130490759e-01,-4.627673422456272112e-01,9.928669262644679305e-02,2.649322502950226976e+00,-5.360893206965966495e-01,-2.027894707402944641e-01,6.596306848522592858e-01,5.991757985497193906e-02,1.214608370484036914e+00,1.201740904906848928e-01,2.357437079478292841e-01,-5.836339752560767424e-01,-5.201729063085529514e-01,4.945282883468413715e-01,-1.541290493764424507e-01,-1.494136687536655739e-01,1.200181449459959637e+00,3.970469027899701797e-01,-6.423153643670078683e-01,2.492206371524749442e-01,1.234492087795134641e+00,7.876079176150474481e-01,-4.625028950027517127e-01,1.657297521087558456e+00,-8.624414010957726084e-01,1.413984901367024261e+00,3.571368531309456196e-01,-2.306699779371502723e-01,-1.456104264306976870e-01
4.933815731525128534e-01,2.005417872425808712e-01,2.445686348039395885e-01,-9.224066549101860302e-01,-1.333382953275209504e-01,1.868937855278580418e-01,3.445005334541129671e-01,-3.856220580440034573e-01,5.790505541456191230e-01,5.744998845874758064e-01,6.829163503566411109e-01,1.256396146388947532e-01,-4.167721102508479825e-01,-4.138229480506621649e-01,-5.355531778474544868e-01,1.446276216313833851e+00,-7.379760767039166280e-01,5.027915713504408357e-01,-9.050765976779948097e-02,1.167923525704684107e-01,-7.236536388274589227e-01,6.550616274484155621e-01,-2.447751271266239703e-01,1.132633042648692467e-01,1.923979171269170951e+00,-8.131392385721106231e-02,4.791660430877527910e-01,-7.558113496482621319e-01,-1.442752321491360235e+00,-1.401592588599584799e+00,5.143620894433631463e-02,2.900739015267579379e+00,-5.689779255717046791e-01,2.406414513473456307e-01,-4.598664568019003029e-01,-3.755820265012747017e-01,1.313174607063714916e+00,1.150364235731182516e+00,2.601710011847831794e+00,1.913162814882384932e+00,3.804272091264331856e-01,5.254070556441362561e-01,1.394990790287464200e-01,-4.712069618591934184e-01,5.275956495287655867e-01,6.485126269348491235e-01,2.440906285777738383e+00,-4.674118916667579504e-01,-1.635605942628817755e-01,5.603724355332497797e-01,3.297796940903038987e+00,2.004165671556386918e+00,2.285020672981430412e-02,-3.535942152722453824e-01,-9.890629097127484615e-01,2.144349856601994730e+00,1.185833051347907174e+00,8.348983728018175010e-02,-5.651026357949811008e-01,2.443535195564203288e+00,4.095937916217210484e-01,-2.585889609445495285e-01,7.054041868888688560e-02,1.447529711730132007e+00,1.526397810799847043e+00,6.124383412787508529e-01,-7.451927404969582724e-01,8.926358595448886657e-01,6.748161606142596414e-01,2.468936074985173257e-01,1.762049117886929750e+00,-2.802115954452715219e-01,5.667695103170020676e-01,-2.164816780726719625e-01,-3.823792700169231229e-01,7.405720404538105317e-01,-5.371166330716685700e-01,9.250511216970715989e-01,-1.490420024040468139e+00,-1.003622285016992910e-01,4.039872579253084295e-01,4.292297318203966427e-01,-2.993682943578455102e-01,2.096993418419894617e+00,1.206440964189715581e+00,-1.572358687162431323e+00,3.843147946767805356e-01,1.273641252048250294e+00,6.048555891352218605e-01,4.805890757551695147e-02,1.680571513499287128e+00,-8.672595014170791927e-02,2.787196983433645192e-01,2.286413319753560769e-01,8.651490142191511357e-01,-3.885279801792683729e-01
1.097616233995829083e+00,2.282647162902512239e+00,-3.448811552193730562e-02,-9.264935975591780393e-01,1.118823521747945721e-01,-1.846721173432964158e-01,-1.604491296078764395e-01,1.947008315345929996e-01,1.206953673297737506e+00,-2.334557028132528689e-01,-2.040305542634961999e-01,3.062722466444311453e-01,-4.248674020706891818e-01,3.750509410720810899e-01,-3.144437759288841727e-01,1.436616327821618855e+00,1.245861486202198831e-01,-1.857528336638885613e-01,-2.876247503699386199e-01,-6.495734401001920788e-02,-5.905453353267368088e-01,5.721630093804574990e-02,-8.451150737053247930e-01,1.352328121546464146e-01,1.663822618974007739e+00,6.010508815253812198e-01,1.408302586125545486e-02,-4.963692259839448950e-01,-1.098895026306060618e+00,-1.195630815562118920e+00,1.818881831991676357e-01,1.981757629010356903e+00,-4.250300400358333341e-01,-4.925062321612519445e-02,-9.766177326615490539e-01,-5.331409080086855212e-01,2.034024356741387152e+00,6.103593207416051492e-01,1.340264425072756449e+00,1.974993768897929103e-01,4.635557961262148918e-01,2.621950806179905724e-01,4.377490661755387147e-02,3.414538571907762554e-01,5.517843471492602792e-01,1.036716722408176139e+00,2.737321944540537899e+00,4.226522150008525380e-01,2.017105794600290714e-02,1.308544820039768242e+00,3.717599512818474672e+00,1.448996251375596289e+00,4.831549347603008027e-01,-1.349219644439691723e-01,2.419228986634659462e-01,9.483162573216399327e-01,-3.334169599485689028e-01,-9.148266231800047943e-02,-1.336246609374727834e+00,4.236604320358157150e-01,-3.032473847611603102e-01,5.713763927587101055e-01,4.719835176960388567e-01,4.389920712570639649e-01,1.312260680685099157e+00,5.145777693165544120e-01,-3.699486279111133813e-01,1.886984057041188323e-01,1.105363677602679284e-01,4.009896420375822501e-01,2.095974912330224704e+00,-6.689483681832049111e-01,-5.260801296506626423e-01,-1.058476420353751390e-01,-1.748258646896233559e-02,6.233270954599843261e-01,-1.181583950881640588e-01,2.932758187675064687e-01,-1.292386178887126036e+00,-1.313007377230877015e-01,1.106700054724757631e+00,-1.726961702268968724e-01,-2.190051585707524784e-01,1.409793296548742525e+00,7.995550379577133215e-01,-8.334980965470912828e-01,4.914671945802240871e-01,2.427706947972860796e-01,7.283047586284268071e-01,-4.682460082406593171e-01,1.395637669396150304e+00,-1.192757462447412431e+00,1.403025050481734315e+00,1.364055512452230778e-01,-4.448401080992065437e-01,-1.191331976868005293e-01
9.811138560831640376e-01,2.003042662478432323e+00,-1.740714326373767884e-01,-9.512809259583578925e-01,7.796421883933031538e-02,2.395045320067590300e-02,4.027397572513729540e-01,4.888244635250767189e-02,7.061089713945184476e-01,-3.375419206760457147e-01,-1.774019510867946292e-01,1.533856052728592712e-01,-3.942579308694448281e-01,3.191007074444971447e-01,-4.750116101630759147e-01,1.197866521359148839e+00,1.775820172550668374e-02,-4.325797701906594073e-01,-3.199249330779336264e-01,-2.002003093310008586e-01,-4.269263307747421798e-01,7.950220322792772576e-02,-9.023466700355131653e-01,1.420238979122788181e-01,1.864079881469408617e+00,8.693099634618897120e-01,-5.715991798139125057e-02,-5.531891806253363963e-01,-1.674087693607206440e+00,-1.561186559463151102e+00,1.964056930484301133e-01,2.025293219638501174e+00,-3.265290580526516440e-01,3.126733243624548741e-01,-1.033993531089053564e+00,-5.016952835479832062e-01,2.192176874627810079e+00,3.806376118257825403e-01,1.730832674853063136e+00,-9.504911803112836566e-02,3.846890754409976743e-01,3.728676502467989651e-01,-1.366985558535704914e-01,2.431092436432594761e-01,5.763616881618928156e-01,1.081073875028088160e+00,2.323955952435383221e+00,5.133759175047976075e-01,1.156427278590763524e-01,7.166632031908943823e-01,3.889644133780655100e+00,1.958961266618983288e+00,3.633886217046952138e-01,-7.575269969896086808e-02,3.695799763650705616e-01,9.763967827413373435e-01,-4.295389418973495355e-01,-8.409990931032540473e-02,-1.390167623876412017e+00,7.636906118009234579e-01,-7.457185969424453553e-01,2.695908999746098877e-01,5.580181902096317259e-01,8.508201249466296190e-02,1.459750845315442414e+00,7.156646006744217248e-01,-5.617172782589203717e-01,8.958573842627315376e-02,-4.864354334065325303e-03,8.877016284992307327e-01,1.772167655802051378e+00,-4.450132262705867037e-01,-5.371052039840210623e-01,-2.424807506080959019e-01,8.364264690691523840e-02,2.956474774896362123e-01,-5.933301141862286077e-01,3.674723322650697011e-02,-1.519915984313053858e+00,-3.362352820608168757e-01,1.314957995592133999e+00,-2.402538167112247547e-01,-3.961607193954234107e-01,1.752058297979270485e+00,8.143038580679328176e-01,-1.111196638893873212e+00,5.025476830197652678e-01,-2.033091899690799842e-01,9.344985567735131227e-01,-7.324238167308432246e-01,1.101798307961201040e+00,-1.023104977491975820e+00,1.212720331853798683e+00,2.094396815767202158e-01,-7.824481359784289936e-01,-4.137122106479713679e-01
6.682335610443603802e-01,8.332555480013165150e-01,1.948591929972057213e-01,-8.106573436741315586e-01,1.398944644576355367e-01,-1.113082843207808814e-01,1.971016393632180064e-02,-3.195711461947949861e-01,2.897331685670430645e-01,4.125300335951499475e-01,8.204969799829853194e-01,2.228976913855521269e-01,-3.660104302982822300e-01,4.693595084350363211e-02,-4.065822374201596978e-01,1.718517904844917288e+00,-3.271449177733168900e-01,2.948337172253627236e-01,1.277225762631464118e-02,9.697019442096582731e-02,-6.654111857093338855e-01,2.783439277191455119e-01,-4.241484598420921515e-01,2.596491337199988703e-01,1.645878362614219936e+00,-1.666545164037834537e-01,5.248652833274142226e-01,-6.124564370561450533e-01,-5.960290880274035086e-01,-9.736741744008596822e-01,8.186559012932909107e-02,2.381804488175188972e+00,-5.004045167522280790e-01,-1.156778007889665283e-01,-5.219616148118799703e-01,-6.189556883381500674e-01,1.055522292002267770e+00,1.298341099301463242e+00,2.080746549741477658e+00,1.576560259127313124e+00,3.032075810370532531e-01,2.237570311062064277e-01,4.376889581598000789e-02,-1.607595744022495277e-01,3.801218003477989660e-01,7.937357514317455731e-01,2.567359325067887443e+00,-4.774962242621738628e-01,-2.183406675451259882e-01,1.387614631228667683e+00,3.232581660357423115e+00,1.237290928578779203e+00,-3.488100282558026510e-03,-5.106657186572221008e-01,-7.931028700935980336e-01,1.811480910319264837e+00,9.248605559871810877e-01,2.501913970223291761e-01,-6.268569137099515576e-01,1.362052554637926960e+00,8.439854438173940432e-01,-4.756286244345625525e-02,3.983918878884562531e-02,1.448459266268917967e+00,1.078072204449853633e+00,1.298566340468838010e-01,-7.396750899464419327e-01,5.130595249130818214e-01,4.599410500050816752e-01,3.294494040234251520e-01,2.057113695644945395e+00,-5.267520789630963929e-01,3.548349774359661479e-01,3.463202900418501651e-01,-5.461213172593445409e-01,1.322764313416044279e+00,-1.712499213719976821e-01,1.121021155923938473e+00,-8.627514867127389353e-01,-1.215403965865914926e-01,3.569251205747101530e-01,2.371935216400100632e-01,3.318861041765713837e-02,1.552214101707589222e+00,1.086720468181388899e+00,-1.080291317089041137e+00,5.057708442025682372e-01,1.205850275635428792e+00,3.381998170652154023e-01,6.130723686433534603e-01,1.548326442026976224e+00,-5.509858558372722204e-01,4.060693847381052768e-01,7.828128867270034430e-02,1.348061286219129240e+00,-3.388992598514817267e-02
4.856118135407353487e-01,3.475280340019536451e-01,3.612856421256477324e-01,-7.015293419854196078e-01,2.259876257168268454e-01,1.203111008901509016e-01,7.710740191052689596e-01,-6.812094960131045429e-01,-1.490256639690330509e-01,2.396193304021486115e-01,3.707998293681799562e-01,-1.718496392150521412e-01,-4.608586640097656617e-01,-1.255605678290918070e-01,-2.752988044172365312e-01,9.314828799776995183e-01,-9.515310411821868986e-01,1.223865710471145618e-01,8.789411574573413599e-02,1.464228889454539939e-01,-7.881085561712342091e-01,-3.656415749815439264e-02,-5.003946041559973468e-01,3.217383996443556882e-01,1.747092970863160621e+00,2.704846172597820120e-01,5.347508937845134591e-01,-7.497109494401922314e-01,-1.359797302603967806e+00,-1.208400753319841758e+00,1.978239125945480681e-01,2.665645521111589478e+00,-3.368556616093910105e-01,2.148932194262891671e-01,-5.543110704467986150e-01,-4.582775092537597073e-01,1.155240507209418732e+00,1.083267503082152139e+00,2.216337792010012908e+00,1.161762051720806710e+00,2.565312078708866239e-01,5.675520385132855061e-01,-1.754878111967748122e-01,-3.337919488310817639e-01,7.801576391312206038e-01,9.281197248928056975e-01,2.083529861988981047e+00,-3.745088012646040077e-01,-3.294720445856018365e-02,6.557367226935054694e-01,3.211090232502884056e+00,1.726455768010811687e+00,-3.514038904004639363e-01,-3.561179770597917016e-01,-6.015898963687285050e-01,1.719231953346340935e+00,4.606598861386922983e-01,1.266668610531418437e-01,-3.058693905870832896e-01,1.244188342507836387e+00,5.643917817155599259e-01,-4.537154240815011175e-01,4.634683596176925047e-02,9.690583301004592753e-01,1.374992464009641591e+00,6.089643897654793969e-01,-8.064820989413247210e-01,8.856353787633476360e-01,1.303845347107104591e-01,7.635740491401556973e-01,1.506139334623159076e+00,-4.259184629936421107e-01,3.952694774642627751e-01,2.843234124739300039e-01,-3.701566438645734203e-01,1.027071760683759605e+00,-5.743560006501807758e-01,3.570864370994908388e-01,-1.076131271799296352e+00,-4.108472705327607666e-01,1.280333740543087018e-01,-2.063633187580165007e-01,-2.049438480964167197e-01,2.098122632550592392e+00,6.591622395814649149e-01,-1.228101113567670044e+00,5.798155788182732806e-01,9.099173629563612753e-01,6.604409987556449924e-01,4.075125416264999134e-01,1.068594274901662811e+00,-4.853469267916697971e-01,3.367151657180298407e-01,3.818269485924989937e-01,4.818556306513839815e-01,-2.748204342237073328e-01
6.604001095339391281e-01,3.664035214501975002e-01,4.798520303845925372e-02,-6.195292116838544416e-01,-2.284185237355575437e-01,4.852918105964729167e-01,5.950081313350786827e-01,-1.677372566814888111e-01,9.181059054940216013e-01,3.786904912206925378e-01,3.579336638003036697e-01,-2.390926161969429697e-02,-4.615235552860704749e-01,-2.807954714777629035e-01,-4.129283759400488307e-01,1.309978936852850051e+00,-7.070173302544509042e-01,4.726380849678640805e-02,-3.099232378082360934e-02,1.311282864474489496e-01,-7.728748363738116023e-01,5.453685908148253603e-01,-3.785787116926030427e-01,1.311621401358508965e-01,1.773195842054007487e+00,-3.029341032313544874e-02,1.931526684476704003e-01,-7.539551006451905568e-01,-1.464314891536608876e+00,-1.271223703801904747e+00,3.168799253917551906e-01,2.811950864667230654e+00,-2.864395657795025807e-01,2.748600782626576255e-01,-6.108191034750782844e-01,-4.449509818938051642e-01,1.637542030409515181e+00,8.570684037722147153e-01,2.159533979777358059e+00,1.347821289126541311e+00,6.806413566678845006e-01,5.953420395960761224e-01,7.425050289226707567e-02,-1.515565672332908620e-01,5.938495488766613040e-01,7.312453442453159536e-01,2.377006787826685841e+00,-5.012727738934165400e-02,1.584048588843356420e-01,1.849608786089567136e-01,3.908457557075853295e+00,2.218450197520241307e+00,3.459674004983848694e-01,-2.896474758876247391e-01,-6.133267346164466005e-01,1.724313726820891901e+00,5.344339127595982841e-01,-2.156977540980151709e-01,-6.056150133068497476e-01,2.182889156421917054e+00,1.783553346341510693e-01,-4.274585845465732059e-01,-8.728770185864015430e-02,7.013794061949643055e-01,1.305582762833150001e+00,5.419821016866672725e-01,-5.959723707717882180e-01,1.055948088367866244e+00,1.155370981161829569e-01,2.410082650912553359e-01,2.032422861087385346e+00,-1.888040345488391225e-01,2.914323098862948713e-01,-5.822220581183779053e-02,-1.188063831349318866e-02,6.000354787068405971e-01,-5.225592911170220400e-01,3.826973428305887048e-01,-1.381664300346537200e+00,-4.030235297010458240e-01,5.223412365672179813e-01,2.296090836188237616e-01,-4.587539948610304119e-01,2.003918907542663330e+00,8.358377819808302522e-01,-1.432691471174328823e+00,2.186332182500561050e-01,1.228720136478995695e+00,9.220291476131626807e-01,-6.487343951060984271e-01,1.691488464590491070e+00,-1.514647887636072499e-01,7.600030503509055402e-01,4.130138322767501480e-01,-7.157224456695568393e-02,-5.596939163924338212e-01
5.938419089760254010e-01,6.210552604402111987e-01,6.217299443404936676e-01,-7.317252880332256737e-01,2.188541138163808686e-01,-8.128951930560274208e-02,1.832902082274059929e-01,-5.362916349295304697e-01,6.622086247078298182e-01,3.292323542643448286e-01,5.420766370560103908e-02,-5.013053158007985122e-02,-5.511750886829339668e-01,-2.087448572097836963e-01,-4.723828380346412059e-02,9.598680797522963770e-01,-1.031804799980418519e+00,5.000059126370027807e-01,6.817116585906937698e-02,3.400422683953672198e-01,-1.064527511255418224e+00,-4.943051897140554596e-02,-4.228167324937885940e-01,2.590079122005934376e-01,1.592461857971421146e+00,1.285423446149815407e-01,5.900249849063420315e-01,-7.320986194803953406e-01,-1.064435461817547557e+00,-9.221301915151254303e-01,1.759349464670581786e-01,2.799225791549595499e+00,-4.890025355994265799e-01,-1.101670435777960533e-01,-5.058703179234841363e-01,-3.590707958977307768e-01,1.136060405589633948e+00,1.253254575292345629e+00,1.793618948944227576e+00,1.462470302749517836e+00,3.688147523870297095e-01,5.912574295007280156e-01,7.329218862925665490e-02,-3.044615363923962592e-01,9.168680570250218320e-01,8.765012448804727629e-01,2.558951991293447747e+00,-3.988726870253567203e-01,-1.149290676606325029e-01,1.104497785850626190e+00,2.960657903942484737e+00,1.356435590383219258e+00,-2.299393982048758556e-01,-3.023405633927912506e-01,-6.980541618902302847e-01,1.688859742707156997e+00,4.625029581530919476e-01,1.735106382862726393e-02,-2.215009061003546664e-01,9.564048331687047266e-01,8.598565078621883684e-01,-6.750392946778749348e-02,1.837414903578542952e-02,1.314020770172513064e+00,1.449778755464741220e+00,6.666935935034445926e-01,-5.065787605385054793e-01,1.185342541128932670e+00,3.075233735563633330e-01,1.439960562028084756e-01,1.709049988210515458e+00,-6.841216035789554617e-01,3.961744464653835784e-01,1.947881395405560156e-01,-3.899293331043471311e-01,1.155178998225310227e+00,-9.274452285271300722e-02,4.164070411839612129e-01,-1.082736120137223645e+00,-1.376344585843955193e-01,-1.292239921702197369e-01,-1.975459822772157037e-01,-1.318645851582168071e-01,1.907944993431424319e+00,5.690564537899822639e-01,-9.995695778295012879e-01,5.643981855332855790e-01,1.373072364496583209e+00,5.444666975636915929e-01,4.906365336716991821e-01,1.393282476148682392e+00,-6.555618716804647583e-01,6.431395188346865632e-01,3.879560643380874918e-01,4.476077809665217622e-01,-8.669773190891238990e-03
8.472581843415922798e-01,1.160808208821384468e+00,4.722589580924507757e-01,-6.100973004747753947e-01,1.147367614179750778e-01,-2.492856417992533880e-02,-7.707694154911665096e-02,-1.642480625435441821e-01,1.373801368415632052e+00,1.929245353171064048e-01,-2.368766463035823500e-01,3.070478512269349258e-02,-5.796897105373819414e-01,-5.245103627033688432e-02,4.974220342127111394e-02,1.096506316685573967e+00,-7.632175711888723457e-01,2.998714681772256530e-01,2.413555489377044311e-02,3.546808080120566475e-01,-1.111054781036224570e+00,-3.484403767985022604e-02,-5.206390219283869580e-01,2.090834213407914421e-01,1.439155040492512860e+00,9.984487116826423758e-02,3.408944998541670324e-01,-6.667704723338958583e-01,-8.540599970266515850e-01,-7.411106530899953526e-01,3.106261287491785539e-01,2.635573873093294051e+00,-3.968553963788080119e-01,-2.578624859241508971e-01,-6.457919228667198253e-01,-4.107461287717978360e-01,1.461106459947797420e+00,1.072880406939467735e+00,1.272032934055924436e+00,1.121840378162488605e+00,6.264388344527660468e-01,5.399966647224720973e-01,1.714505264825238462e-01,2.792901685886441110e-02,8.871507047560982517e-01,9.024692651176022817e-01,2.822119464935873623e+00,-3.941357022645278207e-02,4.123828719335696780e-02,1.188523852372274536e+00,3.364541042763168566e+00,1.292788338960745964e+00,1.960218085005794864e-01,-2.378339610646169888e-01,-3.982761556109971068e-01,1.328509217794434871e+00,2.859152857665581138e-02,-2.124488706616327049e-01,-4.442489107243672297e-01,6.555604512104307169e-01,6.887146739836361720e-01,1.494996473235946643e-01,-2.004994517018263145e-02,9.398092268410725980e-01,1.282042916241765473e+00,5.509289565675850042e-01,-2.603219123481819164e-01,1.195577896207654200e+00,6.831237008973339853e-02,-1.503087697900560293e-01,2.109924213740961285e+00,-7.382199832780032001e-01,8.115078521710757109e-02,2.019193695057855953e-01,-1.360090184345574826e-01,1.069943461665733064e+00,1.665025144471809493e-01,2.176808958332232535e-01,-1.033333778385122859e+00,-1.613294352588511282e-01,7.850600115757788711e-02,-2.257472504312615924e-01,-1.831037176453323423e-01,1.614635506326392189e+00,4.216997891156598621e-01,-7.853714340604905919e-01,4.259652580861297833e-01,1.410596771375221437e+00,6.739094411559141129e-01,-4.106210633524143283e-02,1.623390795219478822e+00,-8.437625148878252768e-01,1.192048366591229591e+00,4.149991226626789098e-01,-1.452248183392685910e-01,6.146617903494910884e-03
6.508944049333101889e-01,4.081290939468656953e-01,1.668113048168127777e-01,-7.310084023300138512e-01,-2.321950800398817627e-01,3.540511630641901553e-01,3.365257930824095967e-01,-1.596896500423844456e-01,1.127052322439177967e+00,4.669109433048038715e-01,3.474123760416429896e-01,6.905611210236892172e-02,-4.751910006077785242e-01,-3.625023698369635450e-01,-3.977032276629534624e-01,1.371429044863234692e+00,-7.266587768809772419e-01,2.983811044455276784e-01,-7.329669830639398698e-02,1.776509294614739831e-01,-8.345356412620572595e-01,6.162093460394246769e-01,-3.097802164695754867e-01,8.949755110319701501e-02,1.788749744497353911e+00,-8.460754048946389494e-02,2.722993836361715658e-01,-7.507856911349670703e-01,-1.412682255296476175e+00,-1.253074383260204261e+00,2.297704587737580406e-01,2.892570336773129469e+00,-4.221541055594782987e-01,1.845211909315880305e-01,-5.586407341028502005e-01,-3.839389217934046084e-01,1.580632859396466472e+00,9.711760121863868278e-01,2.179654925578975444e+00,1.610503917484888969e+00,6.419364575222890057e-01,5.891285432913004882e-01,1.842406044793457043e-01,-2.363956124974729844e-01,6.082571795400680825e-01,6.794439863609019747e-01,2.552231011306913988e+00,-1.571150813646091660e-01,4.473227577861345339e-02,3.893407271057784946e-01,3.684341198178660459e+00,2.093561613563043711e+00,3.241504042695037002e-01,-2.787933083198269046e-01,-7.483339317692471182e-01,1.845164407131146822e+00,7.347954483802159320e-01,-1.785519433386834054e-01,-6.001170242010815947e-01,2.247302417526853002e+00,2.799987808522377275e-01,-2.492307339821218382e-01,-3.873517105938836802e-02,1.011664435820757157e+00,1.414738870961721684e+00,6.003786424724059101e-01,-5.394258326238390300e-01,1.099029073184087046e+00,3.507225935782363191e-01,3.511545551083378180e-02,2.022781963661350435e+00,-2.770167982166168441e-01,3.628493570162663606e-01,-1.821964614184830300e-01,-1.047250495022945954e-01,6.276600089836741336e-01,-3.947478005791728028e-01,5.583850514208522631e-01,-1.464295546947592452e+00,-2.221983692084661677e-01,4.502995048757237884e-01,3.192033857662961438e-01,-4.134680136555431984e-01,1.986291790996894679e+00,9.408004691778277806e-01,-1.432766115420837094e+00,2.458265127656679705e-01,1.373549101439900388e+00,8.134262609035011193e-01,-4.915149870075167238e-01,1.816150270034901260e+00,-1.626712584491206703e-01,7.307079173002843930e-01,3.599759971524672530e-01,1.462482522330028345e-01,-4.534134221051625557e-01
6.167361387773311332e-01,1.231267318672437661e-01,1.456624293150485250e-01,-2.833826809538693703e-01,-1.569804987405459817e-02,5.643577310875600439e-01,9.456962048260122433e-01,-4.043567733833954292e-01,4.049205191598261311e-01,2.922755837769685505e-01,3.066350358755202676e-01,-2.956135145524238506e-01,-5.034891155366791882e-01,-1.263525940628640876e-01,-1.697919827983621899e-01,1.025348980932936804e+00,-9.762565763373993732e-01,-2.111312013408535304e-01,2.223716710886910475e-01,2.438430114017129946e-01,-9.063614042453241870e-01,9.146605451264377962e-02,-4.637416146865137589e-01,3.181123928062108974e-01,1.535163848500808781e+00,-7.008777557626125199e-02,2.771531322613635662e-01,-7.778924721524201891e-01,-1.147351350558240668e+00,-9.314899070537597803e-01,5.073000027101355336e-01,2.743710413209431653e+00,-4.170749442123583561e-02,1.779736801660171119e-01,-5.851174437269368589e-01,-5.617770721819974611e-01,1.336183744337052115e+00,9.435837470911803138e-01,1.846883868279233676e+00,1.084845781554574895e+00,7.059154944894707739e-01,6.297019097428082635e-01,-1.293974341067890554e-01,-5.476547117077502913e-02,7.450397219132951498e-01,8.707809876247420977e-01,2.137242624517709633e+00,-1.003918349371854951e-01,3.035252780283358987e-01,2.113531602827304900e-01,3.940988070393231624e+00,1.963552220671747950e+00,1.102534521882060914e-01,-3.910375332652981095e-01,-5.378119974705364292e-01,1.513883973787079285e+00,1.604541127849865578e-01,-2.242965247532376361e-01,-2.000116869615139459e-01,1.485110261274152244e+00,6.375511515320407829e-01,-7.784419348924633830e-01,-3.376433419525649571e-01,4.263297975356901137e-01,1.001131461889080310e+00,3.513723407624763095e-01,-6.419880146832157575e-01,1.270227786444891205e+00,-3.795952758018286133e-01,4.557701304362024586e-01,2.036025068037929930e+00,-2.458589960148923059e-01,3.366943426291752473e-01,5.237409285262658587e-01,-1.742884571331711208e-02,1.016454876547826514e+00,-4.584004054950145957e-01,5.257598082416287122e-02,-8.712251899847910375e-01,-7.093014146932175024e-01,9.584064816102377815e-02,-1.519411637442336649e-01,-3.564254234748919226e-01,1.944564246328488455e+00,3.731890638583429398e-01,-1.158003868418874927e+00,2.741919954206422094e-01,1.374157917917310234e+00,9.448406131113284978e-01,-3.353533058353895258e-01,1.394639183536044325e+00,-2.762897030844985169e-01,7.465758515135103579e-01,5.759409696462280959e-01,-1.385337970661808527e-01,-4.761474426639268342e-01
5.203962272580392456e-01,-3.058382131448152963e-01,-1.413222190823581331e-02,-4.619487867020528049e-01,-3.050608803838256167e-01,6.532171538713011927e-01,7.214721154403211933e-01,-2.738122782551204448e-01,5.691661198506818842e-01,6.898504045665388995e-01,9.557560947146468422e-01,-4.733605514533709147e-02,-4.067854134938267419e-01,-3.717085200196980632e-01,-5.071329929214107857e-01,1.611656507189643595e+00,-7.669963434445339345e-01,1.010989843170792823e-01,1.282108853760259293e-01,1.718263786230746493e-01,-7.463372741647772424e-01,7.497964728229772335e-01,-1.867712170136570649e-01,1.862306950805005523e-01,1.723547707165405729e+00,-5.177790391384582414e-01,3.240211997156814960e-01,-7.903940125455922727e-01,-1.107792961667467324e+00,-1.120541390091502887e+00,3.456521123865120004e-01,2.922008319973343315e+00,-2.284797651647265948e-01,2.519852061773814045e-01,-4.266997705187345336e-01,-5.684269187408673707e-01,1.250572125802809520e+00,1.116086649182193691e+00,2.456452087862777578e+00,1.938364171183293294e+00,7.245518839002923484e-01,5.231561874966492720e-01,7.088420239593158645e-02,-2.631815440179054999e-01,3.940154509624918533e-01,5.928677047222176144e-01,2.297154062441496336e+00,-3.769513237854644205e-01,1.363059220482710221e-01,1.192391418912525092e-01,3.978823043501411139e+00,2.194826446893134442e+00,3.099688454045145258e-01,-5.074485841014716447e-01,-1.062280216138749012e+00,2.069460615702901851e+00,1.091222150823007553e+00,-1.184291552836145706e-01,-3.514381594920855667e-01,2.767487204131333201e+00,6.794346732819994683e-01,-8.082111242674788754e-01,-3.823932267491924053e-01,9.935380689617279160e-01,1.018082021927676051e+00,1.903521945218844269e-01,-7.705065908328824209e-01,1.162066835540649823e+00,1.427841828959650894e-01,1.856514284664996794e-01,2.230081336504190048e+00,-2.785624246471901655e-02,6.515010564118436376e-01,2.397310106837472754e-01,-1.684945018358845470e-01,9.253853772595508342e-01,-5.531334528112035187e-01,7.936117506371128671e-01,-1.094089508638238506e+00,-4.956371630870796130e-01,2.975976958731779698e-01,5.140643826361452895e-01,-3.656524570462368340e-01,1.961638894120290466e+00,9.878967442758652684e-01,-1.550794492389068413e+00,1.230054109805921447e-01,1.729544328306901413e+00,8.008686668368277806e-01,-3.786800409802463241e-01,1.871206092047204894e+00,2.226368230120969738e-01,3.819192659383622845e-01,3.823657185661553104e-01,7.094648278176642897e-01,-6.020079211598924340e-01
3.831429609853100882e-01,6.255991200264818808e-01,4.442898240237313501e-01,-1.133845345589030940e+00,4.541365464935403495e-01,-3.929082238563553209e-01,3.901233473205052427e-01,-8.717251792858028425e-01,-8.352861852659314579e-01,3.016399348332350350e-01,8.604263368965701098e-01,1.049767212140608474e-01,-3.378168116962652068e-01,-1.246654692681980342e-02,-5.016747085402742945e-01,1.263007271118233854e+00,-6.189018292433324797e-01,4.637295465755358892e-01,-3.201032459973408850e-02,-9.749940886845269439e-03,-5.407581902707769839e-01,-2.067942982447856792e-02,-4.918621503614015178e-01,3.404644289702521975e-01,1.921330429247477101e+00,3.436108421929441326e-01,8.295758269495165926e-01,-6.605766501626080256e-01,-1.149745198811764180e+00,-1.382112522837665836e+00,-1.645038457800138687e-01,2.412116670469197643e+00,-6.659606873898890056e-01,1.410474062609332613e-01,-4.774187858610806634e-01,-4.923910797817768192e-01,8.021379748086739925e-01,1.367124250029623234e+00,2.662970967478258455e+00,1.473573200289620022e+00,-2.195903893527046957e-01,3.032657610653722857e-01,-1.932527376356295012e-01,-5.602496984818662318e-01,5.541518060414019065e-01,9.216407567242561605e-01,2.124952972635051118e+00,-7.873678307951584854e-01,-4.619900187410330150e-01,1.407398223155992500e+00,2.510497105871889900e+00,1.264267225761434688e+00,-7.298919819822752286e-01,-4.663455245800388616e-01,-8.250573643191987383e-01,2.037411795917789537e+00,1.091100082543168259e+00,6.145765154534322816e-01,-5.134550706901860329e-01,1.141982730492228093e+00,7.130949854501225094e-01,-9.369797522767411846e-02,3.785432415243328297e-01,1.749820776755294460e+00,1.513159744847406118e+00,5.305913331739172678e-01,-1.058593042868065659e+00,2.475714420996215637e-01,7.597520499545507011e-01,1.028558462697153342e+00,1.214972051339542780e+00,-5.888686207059916633e-01,5.106226287255403173e-01,2.057403372235594996e-01,-8.700415692192162709e-01,1.276081814719419505e+00,-5.987036131753556978e-01,1.114742084275429423e+00,-1.067506210080277018e+00,-5.426736712985674727e-02,2.513913715187813258e-01,-2.419410203659619341e-02,9.728415232876574947e-02,2.005149739397477315e+00,1.189313797733217104e+00,-1.269397751544732333e+00,8.630043845867689800e-01,5.674014441195300851e-01,1.899058246467447697e-01,1.387846029763344591e+00,8.917643148500778993e-01,-6.495615231919059651e-01,-2.153961585730485018e-01,2.367200913934319750e-02,1.758742771357374224e+00,9.019684724555387945e-03
7.747722850125928762e-01,1.232919117169994916e+00,6.475764112274247364e-02,-7.258371169586316229e-01,1.505942927664165598e-01,1.820312672421324218e-01,7.739245814172723836e-01,-2.950448620135548983e-01,3.439074691259141892e-01,-1.784978609695820617e-01,-1.458902151060860741e-01,-1.194917202716317406e-01,-4.628452671342198066e-01,1.299653895086408384e-01,-3.005672618287719144e-01,8.602441106661747883e-01,-5.476395937848523854e-01,-3.404765635915799615e-01,-9.935501923747155906e-02,-1.881095258800081355e-02,-6.456921446391810093e-01,-9.772227634364499815e-02,-7.819900072490899579e-01,2.453572849212367069e-01,1.773990652210067909e+00,7.119791965324133720e-01,1.357798856425483369e-01,-6.670872019807586595e-01,-1.674224569057703782e+00,-1.390214803245375608e+00,2.991783536335185789e-01,2.341974491137222003e+00,-2.184043973297172814e-01,3.257030033345525988e-01,-8.693734534495007882e-01,-4.666708871840409278e-01,1.830963018308102264e+00,5.765613257307833361e-01,1.811592441594674696e+00,2.102175187427159919e-01,4.020881001686852363e-01,5.523154531073283247e-01,-2.160046085297616103e-01,4.634753186080504267e-02,7.860577484116169078e-01,1.072196540684922317e+00,2.112441578519998142e+00,2.557783380970702902e-01,1.769861983339993672e-01,4.669677624031318697e-01,3.732757026734685901e+00,1.980244582643436724e+00,5.339394473562020238e-02,-1.488621010526364474e-01,8.998799515713312713e-02,1.152920106093200836e+00,-3.380836857328547440e-01,-1.022858333009506598e-01,-8.355065924295684843e-01,8.131150549828441987e-01,-2.574059057740494261e-01,-1.689451984532979734e-01,2.844404909162631112e-01,1.751542359463464371e-01,1.418913950216433850e+00,7.491488678941126134e-01,-6.286430020182327549e-01,5.832107887768671617e-01,-1.797047816618409788e-01,9.055601255094891666e-01,1.616650020409806654e+00,-4.120457879536473245e-01,-1.959995198077109646e-01,4.071477228052976238e-02,1.858906532830843783e-02,5.433253255557533024e-01,-6.364929328275463760e-01,-1.469386723785306437e-01,-1.317257334854342821e+00,-5.098462666101906127e-01,7.439528776334617399e-01,-3.978231683443301248e-01,-3.948928952052235819e-01,1.980938028008161877e+00,5.263741292829648977e-01,-1.126530543402276319e+00,5.139471924595847563e-01,2.323254242096820521e-01,9.610483338050663793e-01,-4.372200940184218787e-01,9.844984886523217016e-01,-8.147551890764610505e-01,9.607491794838788346e-01,4.062323259066605852e-01,-6.717054290558084340e-01,-4.275996327990458923e-01
8.762165530557730619e-01,1.006708891354596735e+00,-1.935955916635729301e-01,-5.027777768438019823e-01,-1.699510871521621169e-01,5.275731770491911554e-01,7.115438652818624199e-01,3.978930348243543691e-02,9.458220748441048542e-01,2.015463994967575667e-02,7.453070581190351929e-02,-5.836727525415497109e-02,-4.481871714347214763e-01,5.622246415735365765e-02,-3.714900420889432064e-01,1.253966289827659342e+00,-3.885699765230152258e-01,-4.593555249845371891e-01,-6.173872483851815252e-02,1.400512990079937764e-02,-6.546020282080161623e-01,3.069271883139274015e-01,-6.463969500614916708e-01,1.711326108575421945e-01,1.682075043510629975e+00,2.502076917764715080e-01,-6.698113168098809855e-02,-6.733757055263456248e-01,-1.437093712274732926e+00,-1.243567855645670850e+00,4.575619200429174027e-01,2.431051030750058572e+00,-9.045673601771811456e-02,2.931145050154779774e-01,-8.435941313096297911e-01,-5.587586440916292307e-01,1.972329463451756526e+00,5.343690670598340020e-01,1.734559546772186156e+00,4.988162897578322097e-01,7.679453903455392139e-01,5.201972971121008316e-01,-6.654994402479752491e-02,2.131533407138331837e-01,5.767129945023174997e-01,9.055368258730552844e-01,2.290581560141082829e+00,3.805518279372317458e-01,3.525111345190878875e-01,1.680300292692631370e-01,4.328578201642822698e+00,2.215265144309976897e+00,5.558469797527950673e-01,-2.213932193535673998e-01,-5.674566039342726631e-02,1.201741583007777781e+00,-1.800247180765217614e-01,-3.308386280415805958e-01,-8.896432060047908541e-01,1.512150332926006868e+00,-2.093653518810618397e-01,-3.477832429507164980e-01,-6.135296580986958348e-03,1.115142943746771920e-02,1.124303090448136810e+00,4.544712507911391475e-01,-5.274005463346703726e-01,7.790988743865401300e-01,-3.221507550737686132e-01,5.010605557026626133e-01,2.167623150466174931e+00,-2.026141462397495485e-01,-1.541458933532834918e-01,8.068470578675213112e-02,2.308700740092491377e-01,4.918356655134261679e-01,-5.360546811863354799e-01,-1.999908942333106232e-02,-1.258630417665725698e+00,-6.099514098429621445e-01,8.655599235992518237e-01,-4.212971631608888878e-02,-5.016071000028716753e-01,1.803894308661152968e+00,6.033444053291496800e-01,-1.211533009198790367e+00,2.065912540355666072e-01,7.291573498986066992e-01,1.100177769773761804e+00,-1.056164145407862520e+00,1.487787022252975655e+00,-4.820330261777379666e-01,1.179591068339383764e+00,4.417073455309767915e-01,-7.807603184709617228e-01,-6.104588984036992683e-01
6.995210979522115124e-01,1.401744195016220829e+00,5.720494002247878962e-01,-1.446443264500001380e+00,-6.754261832976427016e-02,-2.639564805126180524e-01,-2.101948250360920478e-01,-1.885795184135695690e-01,1.675122880704742689e+00,1.459353955840922978e-01,-5.577064829813869196e-01,2.875020779654586800e-01,-5.617489419260037753e-01,-5.030352299089675405e-01,-3.651573421731216240e-01,8.590283317116640394e-01,-7.779830378784458045e-01,8.562383428648072670e-01,-5.036836249090803630e-01,1.145987139219136752e-01,-8.898104670204649569e-01,4.734863613009874239e-01,-4.621134378125193454e-01,-1.048455475032160911e-01,2.133627265135912943e+00,8.282811157192108142e-01,3.339506734615586003e-01,-7.227558951311042756e-01,-2.329011039516808879e+00,-1.804758914391051849e+00,-1.540847006229419391e-01,2.967815935340396560e+00,-9.195396777090594220e-01,2.542905947380896814e-01,-7.226474429905700436e-01,3.978686632261008160e-02,2.064754582400730953e+00,7.733696202542466036e-01,2.209611943157272496e+00,1.259584557691045159e+00,2.511276814128283186e-01,7.508299197219141519e-01,3.460099844059891239e-01,-4.819916449807680747e-01,9.921368461317665588e-01,7.978939145981580605e-01,2.831953564169018112e+00,1.076794801013079839e-02,-2.843851658001084193e-01,7.610596051947378093e-01,2.818736017117397186e+00,2.087329458981912467e+00,6.065801036488138731e-02,1.424189114371537945e-01,-3.732605479538441129e-01,1.754960702622980762e+00,4.804370571621483510e-01,-9.762428007546243569e-02,-1.039171408810924291e+00,1.714462190939938457e+00,-5.545378069896562678e-01,7.104407183101365542e-01,7.431480867667668022e-01,1.360469247281655969e+00,2.407108229047832726e+00,1.550249255184878328e+00,-3.156472177593657169e-01,8.634386813881436140e-01,1.058977848069924121e+00,1.397712929658057046e-02,1.258223317626410598e+00,-6.632097053897987315e-01,3.279673188667804606e-02,-1.172994694137845073e+00,-1.720759655464170201e-01,-3.657776654921307546e-02,-3.905852062536410152e-01,3.289666752409375894e-01,-2.381675726391578873e+00,3.743985798578727264e-01,7.481878018441406875e-01,6.317210047600556322e-02,-5.125920903198355472e-01,2.322635139811499272e+00,1.107931396122573631e+00,-1.489940841187421317e+00,5.828371380191641471e-01,5.255164089190637045e-01,7.531660711932263164e-01,-4.027154873525954359e-01,1.555043303289534551e+00,-7.044123100461525677e-01,9.359235201767803769e-01,2.510279141878115627e-01,-4.798145572978889661e-01,-2.447699106897978927e-01
5.271946842167253289e-01,4.407452464400587466e-01,6.077995804475498920e-01,-1.278090097873115116e+00,-2.945621532328949188e-01,-3.072304146603682673e-02,-2.835759017008127603e-01,-2.316004780769078952e-01,1.787639442031998760e+00,6.895091648078258695e-01,8.410065443032493926e-02,3.154044677331871438e-01,-5.438289932261946014e-01,-8.157093172507060563e-01,-4.326844079579877933e-01,1.267694808217095792e+00,-9.845861104693709454e-01,1.192408489786319858e+00,-3.363914343843049104e-01,2.734948696186230710e-01,-1.006769124871585985e+00,9.176382990248421745e-01,-9.010951603967565227e-02,-1.211068114089720316e-01,2.067999812199314391e+00,6.742629346931061640e-02,5.071184322240377407e-01,-8.022611235287534504e-01,-1.915995261846323849e+00,-1.573889873591350019e+00,-1.326099397278591718e-01,3.345180188055143056e+00,-9.430878694498865400e-01,1.536871191801616465e-01,-4.258721744897272510e-01,-1.154937129351929492e-02,1.625014844289548233e+00,1.169188810379737653e+00,2.553532164716937558e+00,2.366483410242274488e+00,4.228420523109979734e-01,7.420723594517951716e-01,5.250434803979918685e-01,-6.974202525874981795e-01,8.010926943851537363e-01,5.162512805438060903e-01,2.968334091696611221e+00,-4.349550938181953597e-01,-3.365647338025054003e-01,6.497401294745458467e-01,2.852924520401996844e+00,2.109447922584642310e+00,1.421711816726403677e-01,-8.577022599736577879e-02,-1.114244142470449450e+00,2.324154990692488987e+00,1.358474723391278172e+00,-8.693018503844721079e-02,-6.588530237048551008e-01,2.774191798610424087e+00,1.453858964993045844e-01,3.376682306373463005e-01,3.209025964149000432e-01,1.947063471923610845e+00,2.167775104634163785e+00,1.215717268634098236e+00,-3.879058093944662833e-01,1.275423626119360332e+00,1.268314620382906766e+00,-4.605807520917315490e-01,1.604394942434039351e+00,-4.868885145257214608e-01,5.884104457116231535e-01,-9.992551784910168600e-01,-3.336867322284391979e-01,2.865089324595344600e-01,-2.757840371375787081e-01,9.045830098888250070e-01,-2.190255527319806550e+00,4.072355453881167930e-01,3.549316579724005050e-01,5.688987802893088475e-01,-4.539039685725564377e-01,2.302941065053402347e+00,1.339837277760577816e+00,-1.693661447113729901e+00,3.785722956410867424e-01,1.512109682954690282e+00,6.098799629180592374e-01,-2.184910981659848872e-01,2.073692799413022314e+00,-1.128560691922828596e-01,5.615104120746650107e-01,2.461548656554039261e-01,4.390528158947526460e-01,-2.827395044100408650e-01
7.753927911375649851e-01,8.330217929252461406e-01,-1.155172476725540021e-01,-6.147547392709677982e-01,-1.635807642294209163e-01,5.166184895951057010e-01,8.346774342231659816e-01,-9.220908657739404490e-02,7.936787489531111905e-01,3.850060183237224987e-02,4.500000891956251747e-02,-9.398831878455948807e-02,-4.550895722719169867e-01,-6.887982002315183594e-02,-4.206043871976351545e-01,1.098211350170378520e+00,-5.439521839859646768e-01,-3.481817909947407252e-01,-1.029456238570585769e-01,-1.501627713653759522e-03,-6.459418410226901441e-01,3.345567325993789032e-01,-6.153510512965372214e-01,1.495725256123967561e-01,1.808980285221186257e+00,3.814664459396771012e-01,-4.361167417269579127e-03,-7.151697569888297856e-01,-1.749774274497759130e+00,-1.431728575604579667e+00,3.858269694156571394e-01,2.561807813124893585e+00,-1.588230234700664378e-01,4.210696257946335286e-01,-8.167697033243102034e-01,-4.677381713002214947e-01,1.975464927934415194e+00,5.244451668443822490e-01,1.980417518649868258e+00,5.744136226697584835e-01,6.659050444380767431e-01,6.052245161024800701e-01,-8.399458397826241318e-02,4.756357368381110284e-02,6.505071276269794867e-01,8.960771437948042983e-01,2.186133258259204570e+00,3.078627867608509927e-01,2.986823481596887486e-01,8.409073371021036358e-03,4.160586147522124634e+00,2.382664480196061696e+00,4.024755119606395759e-01,-1.720316563812206434e-01,-1.172522514002474203e-01,1.336304955603675237e+00,-6.752934741161681353e-02,-2.855100394965682797e-01,-8.564643243918568238e-01,1.712264442300167167e+00,-3.343693220510948194e-01,-3.797020037766440925e-01,8.540380577157848097e-02,1.080744930288610739e-01,1.337324122410401994e+00,6.621995588999907145e-01,-5.903978118939325892e-01,8.075940748255167057e-01,-1.801595335206938597e-01,6.134570381506667669e-01,1.913445609316555052e+00,-1.713975636253338430e-01,-6.944452113153619377e-02,-9.731194800936351919e-02,1.887694810814912194e-01,3.467946406575634910e-01,-6.988544380394270394e-01,-4.914856388737565140e-02,-1.460288762926483797e+00,-5.682236152774577942e-01,8.514748176215194420e-01,-4.723205220596718434e-02,-5.593623995913674651e-01,2.024620842856343472e+00,6.655793509558192156e-01,-1.364318786316318421e+00,2.611332017692182816e-01,6.125193430069133527e-01,1.117434126306163344e+00,-1.002315111726988617e+00,1.386722951384592895e+00,-4.038407267590898853e-01,1.016041808211433750e+00,4.570197656949653853e-01,-7.847740161819110050e-01,-6.698259884497282934e-01
9.889671464835330106e-01,1.145413226672351126e+00,-4.033499914582804879e-01,-2.757399829445441597e-01,-1.388270610825464157e-01,5.893434262421426428e-01,6.981632660335268525e-01,1.679459859377676056e-01,7.826788883520189311e-01,-6.827164839509985983e-03,3.464190731467938766e-01,-4.149946429412157411e-02,-3.928594054221788978e-01,3.261423984296932255e-01,-3.609002530179233337e-01,1.560111420143790451e+00,-9.151578746891897431e-02,-7.688558043876962955e-01,5.724904048376906057e-02,-1.680650969630727992e-02,-5.700407309449240234e-01,2.323266589484982436e-01,-7.124804832357232165e-01,2.616546363478476356e-01,1.486210669728991629e+00,2.225808191645098355e-03,-1.397243961770179566e-01,-6.024953412580842382e-01,-8.659155100611066747e-01,-9.546521690348190869e-01,5.829793226688162466e-01,2.133632818555764032e+00,8.414300631273480269e-02,1.449562724427405358e-01,-8.730405056838332900e-01,-7.866576862101908318e-01,1.851035927550106264e+00,5.701685942259449025e-01,1.472815696152756759e+00,3.406832713489851283e-01,8.746693841621840937e-01,3.285538499704971915e-01,-1.419502092002880023e-01,4.751974792759494637e-01,3.717680172816902884e-01,9.383135620319170700e-01,2.290952790818677531e+00,4.291721617109228171e-01,4.461838653947994282e-01,3.833470967882718905e-01,4.649929531152189988e+00,1.951227167269879548e+00,7.192742146170620909e-01,-3.778836815990197495e-01,1.283584252200020703e-02,1.019970526847620906e+00,-2.944183825491369921e-01,-3.161086703790585428e-01,-9.152638134010583348e-01,1.221096123791206134e+00,5.505599626545348846e-02,-4.674457506175511146e-01,-1.948262322306043848e-01,-1.897419384871545933e-01,6.597168937208486295e-01,-1.130198697226186821e-02,-5.633048234406390353e-01,6.070222323006936316e-01,-6.261632665856159408e-01,5.438375152696870440e-01,2.553370484093202109e+00,-1.801465732978949907e-01,-2.438345517705687304e-01,5.290810223455048034e-01,2.410541286535478611e-01,8.284935858458057911e-01,-3.960930665415489660e-01,1.012980310982515286e-01,-7.954559010310672251e-01,-7.844890106392513607e-01,9.044135163633948427e-01,-2.901583690430456497e-02,-3.661353821319366930e-01,1.446986982012527401e+00,5.365350958004050375e-01,-9.955203142962567586e-01,1.378892288881711226e-01,8.358889783644930516e-01,1.045620616182068474e+00,-1.005925074582344037e+00,1.532870218669724061e+00,-5.536766982652097102e-01,1.269576817199614460e+00,3.919667034076457224e-01,-5.427080427004182805e-01,-5.545884155319907860e-01
7.258766565300094342e-01,6.424858273022615585e-01,8.040308748846729248e-02,-3.856176367971296259e-01,1.464974996825351150e-01,2.118223408605444669e-01,4.549428756724351874e-01,-3.114145035539424011e-01,1.933762314124034543e-01,2.933805009149159648e-01,6.781531214756727488e-01,-4.404196982532548876e-02,-4.096512625802657404e-01,1.806582847503643285e-01,-2.255974448166390978e-01,1.513731267195887131e+00,-4.789012938140456699e-01,-1.664069097021647070e-01,2.148233468997303719e-01,1.685008312613536507e-01,-7.592206723526897516e-01,2.851383442130517309e-02,-5.195753441926969085e-01,3.739038513311910839e-01,1.423911959021750828e+00,-2.388542902594561201e-01,3.779347799639210526e-01,-6.406809457133285646e-01,-4.394135728099897165e-01,-7.078136228723630463e-01,3.821730805153688570e-01,2.331304255727610908e+00,-1.510271103706098961e-01,-1.106640707916968780e-01,-5.807530031910639323e-01,-7.443573382348768197e-01,1.078098797402135212e+00,1.162954699614363818e+00,1.700144240815710361e+00,1.152549937951458325e+00,5.489982183531055826e-01,2.969277357170967968e-01,-1.136219010062788498e-01,8.290768430994351068e-02,4.708928350628637238e-01,8.915642272938453239e-01,2.354265070100752588e+00,-2.592694547431251273e-01,9.764753379371378383e-02,1.040270359543978618e+00,3.730409272863312697e+00,1.321812157313221325e+00,1.043608062102607259e-01,-5.523091736749061731e-01,-5.762109683209317712e-01,1.483912118236744515e+00,3.786554545786715575e-01,3.697454846605177647e-02,-3.941262297717351148e-01,1.006790081821736349e+00,9.743581478547624908e-01,-4.600049300900599936e-01,-2.644170577596666183e-01,7.996886265681686368e-01,7.234388800331176261e-01,-6.464621650598978420e-02,-6.997420393187815391e-01,7.801455029660657736e-01,-1.985090615508364187e-01,4.420042499439975070e-01,2.274171675500646916e+00,-4.303470765451432589e-01,2.611745025941270559e-01,7.934470285463667283e-01,-2.949711146370740389e-01,1.458958276411294719e+00,-1.742316173199848772e-01,6.174048249907860830e-01,-4.986222545701388675e-01,-5.321986114467356366e-01,1.903942402199746420e-01,-3.806672576290687227e-02,-3.687380374473542277e-02,1.485236055786131715e+00,6.144015589952518397e-01,-8.983203681004117147e-01,3.847230531627121031e-01,1.338034759813998331e+00,5.817303726710396639e-01,2.743964037924023214e-01,1.436424398377230682e+00,-5.511596363447897051e-01,6.596179588947694850e-01,3.024546746140427955e-01,7.489152084580674718e-01,-1.586077607047011728e-01
5.971312926065985849e-01,4.512428992409359685e-01,-2.308130801129409937e-01,-4.306960999052151240e-01,1.878006735730599619e-01,4.202355920683813473e-01,1.240702987926185719e+00,-5.118175214099787151e-01,-8.460809753369951114e-01,7.334082594782959097e-02,9.088484571921238153e-01,-2.085706261811440254e-01,-3.053313769822187385e-01,2.936471885282589955e-01,-5.191294599944066279e-01,1.337231506256929547e+00,-3.872541401676162787e-01,-6.650225936750862044e-01,1.775703741039334760e-01,-1.139488279922611924e-01,-3.871530533574132349e-01,-1.697363374471855257e-02,-6.810103639641620354e-01,4.365217413680217984e-01,1.685112181158837430e+00,1.514224116770992445e-01,2.804131019147191317e-01,-6.623154560733901519e-01,-1.036687074168173073e+00,-1.197057461196160855e+00,3.793815910180483031e-01,2.143370309804764506e+00,1.522212936795225291e-02,3.708062160099305782e-01,-6.995335555983271947e-01,-8.154481509637745429e-01,1.226895873378714530e+00,8.477165080605421066e-01,2.245297161633327487e+00,5.702929524262174699e-01,3.482763189270652315e-01,3.073704337392235142e-01,-4.566632414567047271e-01,3.399457823028587122e-02,3.683902696196320048e-01,1.005933426362833893e+00,1.706378138861977201e+00,-1.427823988030749169e-01,1.969473657366234698e-01,4.211633410614922246e-01,3.993512407931698593e+00,1.868530755289677492e+00,-9.576169673954965100e-02,-5.422167696854461871e-01,-3.144897685729839409e-01,1.449173165595244672e+00,2.275790926693946337e-01,1.721209874330893730e-01,-5.853877830572523644e-01,1.250846520788222005e+00,3.779909034156991865e-01,-8.635835761138226374e-01,-1.008709800323979028e-01,2.687469050110606328e-01,7.735147821508550070e-01,2.605408958973459699e-02,-1.069837048758381259e+00,3.368718950532756939e-01,-4.048046677155639483e-01,1.337180361062947576e+00,1.861790596238800610e+00,-1.273065459234620778e-01,1.643618427576545860e-01,7.715126940606892303e-01,-2.342990784591538200e-01,1.144487540240050283e+00,-8.614929003656521811e-01,4.016200520914219307e-01,-6.351885686038568624e-01,-8.584409575893133804e-01,6.105881421887477956e-01,-1.454249798315913611e-01,-1.773992607109677599e-01,1.814040159138570196e+00,7.077661121614440276e-01,-1.208888275606473606e+00,4.561596637952634037e-01,5.071710114973078110e-01,7.775420714252397891e-01,1.015822232558419302e-01,9.045949382674511874e-01,-4.266722906426312356e-01,3.178175517091286206e-01,3.040582579003408559e-01,5.528107601487839418e-01,-5.173841078198644361e-01
8.955109926586075630e-01,1.311051271782030181e+00,6.852953382736738652e-02,-5.714851636742273033e-01,3.203610711718091197e-02,2.855967573003668769e-01,5.793696296601976714e-01,-8.391480028958035742e-02,9.847656946903173836e-01,-1.358275358674669586e-01,-3.409320404286323991e-01,-1.080469340724507232e-01,-5.202019723311537280e-01,1.003427067598663264e-01,-1.634244281563327905e-01,9.167959159591321239e-01,-5.651693360966829616e-01,-3.331970915929518551e-01,-6.860099269116952392e-02,9.644554564225607529e-02,-8.073436726110860828e-01,-3.664629152504189635e-02,-7.440304655991265559e-01,2.056383432693095203e-01,1.624161673089028035e+00,5.284735840211204350e-01,2.508155932531314081e-02,-6.666945529222715328e-01,-1.482098608265788542e+00,-1.166267531413638814e+00,4.221063633742800358e-01,2.421009139026897294e+00,-1.601812311765695995e-01,1.761840567316299566e-01,-8.789195257774251591e-01,-4.631947960242439599e-01,1.947219946595711626e+00,5.609741700518999785e-01,1.454903526554434112e+00,2.675538608080348935e-01,6.523601508652867587e-01,5.887898304320469123e-01,-8.170992164926783874e-02,1.958930401836200819e-01,8.278545160486807664e-01,1.027818894091011570e+00,2.354451852764364528e+00,3.987637837608871694e-01,2.925194523232246269e-01,4.606061787156472409e-01,3.963157842962495625e+00,1.942663043889850005e+00,3.348632374391165012e-01,-1.250496310206041239e-01,1.094549670579831879e-01,1.027893844711885940e+00,-4.976387085300721935e-01,-3.143688116466293314e-01,-7.936277835753909882e-01,7.907038421502926573e-01,-1.555412743252476415e-01,-1.119913697559883903e-01,1.277901575237751497e-01,5.970084338308490057e-02,1.304733223329514802e+00,6.793183618406435365e-01,-4.140363839822892578e-01,8.596212259026345670e-01,-3.215136915989690314e-01,4.998494695036109214e-01,1.938972169445309923e+00,-4.456613567451373492e-01,-2.536590728579709020e-01,7.088202897690187854e-02,1.834011077269313006e-01,5.542840312498944488e-01,-3.800603079256826833e-01,-2.698207909831438212e-01,-1.263131388190074755e+00,-5.131190905199938257e-01,6.628941057752989474e-01,-3.687717464306465298e-01,-4.423301621175148579e-01,1.828179388130623417e+00,3.707623786377166608e-01,-9.997833997954908014e-01,3.700919796721013344e-01,5.957282544100893640e-01,1.048608098907567676e+00,-7.773080876196007960e-01,1.273245110115715395e+00,-8.128408450257724738e-01,1.306603729051166507e+00,4.893234664768565945e-01,-1.016280760759535218e+00,-4.084060975386094583e-01
8.052521580738705165e-01,1.071273498499292209e-01,2.058327325273869857e-01,-1.229304411533062025e-01,-3.940829178668212029e-01,7.674953945592940530e-01,3.751838466055734678e-01,6.391723838912335975e-02,1.997955661929717630e+00,5.578676067537553518e-01,-3.729384444268513121e-03,-1.639129868172404803e-01,-6.203495778019039175e-01,-4.020938838567182927e-01,1.198813430368439459e-02,1.256625376812233519e+00,-1.056335252232712074e+00,9.627447654208076688e-02,1.983364961697030027e-01,4.948489944184487621e-01,-1.253094700205732215e+00,5.075666641634691834e-01,-2.403732371313344607e-01,1.372104821696716326e-01,1.351532119803682930e+00,-5.494240982805288498e-01,9.471910684744745679e-02,-8.072802455645928799e-01,-9.187453616557315073e-01,-6.130578439273769442e-01,6.509279018972572439e-01,3.114264651726457167e+00,-8.108500900299325798e-02,-9.069960072088792402e-02,-5.275167412798771327e-01,-4.530829453088026648e-01,1.599822406090838589e+00,9.820825473173310227e-01,1.380160878328199558e+00,1.636422534562305131e+00,1.214816587978624796e+00,7.442275338413322228e-01,2.953187272496172744e-01,8.118579843433802734e-02,7.946687674145573865e-01,6.489678494109707430e-01,2.773349139446145362e+00,7.536558568698120686e-02,4.351539267713206427e-01,1.325158855247583478e-01,4.285692988344216303e+00,2.034868322985617262e+00,7.372668177358385755e-01,-3.152514149474897054e-01,-7.377674243230722961e-01,1.532694985638846541e+00,2.295412766406877969e-01,-6.524006027952266029e-01,-1.548134111665592227e-01,2.018349237702777188e+00,7.946390986534254131e-01,-5.691090923895854026e-01,-6.120239211864517692e-01,5.246001397466961702e-01,9.626807850164220692e-01,3.354534265536621707e-01,-1.845708623975866880e-01,1.916211794444567129e+00,-3.310169239539166308e-01,-6.038605608729795682e-01,2.666183902591505728e+00,-2.734490182186664065e-01,3.698056628703002002e-01,2.823130950387603977e-01,2.676810776419774607e-01,8.815281874552360897e-01,5.193081974683566582e-02,4.019982749680256484e-02,-1.033016877395317890e+00,-5.273653691904738317e-01,-3.931974322589149029e-02,1.662041868067623551e-01,-5.064795610991785768e-01,1.745622319876788620e+00,3.008928137202124820e-01,-1.100935982227836396e+00,-6.419534598308562767e-02,2.293114901086597879e+00,1.082209114824789431e+00,-1.087012926907404253e+00,2.215670556683470238e+00,-7.207019418876936534e-02,1.342421616399270157e+00,6.958787611321242128e-01,-6.413532753705128986e-01,-4.741770166063309921e-01
9.600271539164537682e-01,1.161052401699775638e+00,-4.226238873896822623e-01,-3.883905695291633986e-01,-1.673709655240361305e-01,5.913479410477111564e-01,7.710703014328321725e-01,1.517820397345819305e-01,7.480139053148534556e-01,-4.317096268924278113e-02,2.976452469268044965e-01,-3.073634743376255085e-02,-3.846915771300649656e-01,2.702731108881042954e-01,-4.414509527382567411e-01,1.491332068786486165e+00,-9.510256003384628953e-02,-7.524265509530720930e-01,-2.087544858986906809e-02,-7.558267107779265137e-02,-5.089898262025797093e-01,2.969366911203967785e-01,-7.238970645342860388e-01,2.214296807340557782e-01,1.607858468824814757e+00,1.524222100574383343e-01,-1.627741756555085295e-01,-6.153450330276476476e-01,-1.152660975028242829e+00,-1.154487102277666821e+00,5.277728862556290146e-01,2.169354153829750054e+00,3.636145947030450243e-02,2.711273657354621447e-01,-9.017580220714968009e-01,-7.258972209203884418e-01,1.971261037354342438e+00,4.809285851383039989e-01,1.643956765524174024e+00,2.808322946665100517e-01,8.155836425542999368e-01,3.703401961066932202e-01,-1.514641514322632720e-01,4.060868652313135430e-01,3.874458984237537096e-01,9.374250272139442730e-01,2.225463416730821820e+00,4.675135306333086938e-01,4.245696086239296729e-01,2.332506185771729412e-01,4.621080768380390502e+00,2.138097570522742519e+00,6.924882763492934412e-01,-3.148797491900297563e-01,5.792622244826245437e-02,1.061579312582225487e+00,-2.752404317785615007e-01,-3.039435909105981937e-01,-1.017132133721865728e+00,1.392942807610160649e+00,-1.980346168568639931e-01,-4.347211190786367530e-01,-7.495480787719155380e-02,-2.150287465169283818e-01,8.267611781012859096e-01,1.502973672309876885e-01,-5.979553264171045823e-01,5.341553475451967792e-01,-5.267712445319777670e-01,6.513409459654901923e-01,2.394981061849141835e+00,-1.351544450410991915e-01,-2.701698629583810241e-01,3.269226343627937292e-01,2.616519814890446161e-01,6.232519312047537507e-01,-5.457000364755102417e-01,6.251657605823063291e-02,-1.008452651765757491e+00,-7.517133574794794271e-01,1.042983423406950383e+00,-9.325881767278665357e-03,-4.398742881381602077e-01,1.586815384574538301e+00,6.241878434692738065e-01,-1.125656980057289758e+00,1.596702232856355985e-01,6.270711100851998898e-01,1.095225022488937272e+00,-1.113417100866170628e+00,1.471454644485614471e+00,-5.209842805210970207e-01,1.222275583125723708e+00,3.814154718359058505e-01,-6.671405150570328679e-01,-6.366648336154423493e-01
8.075104273155631063e-01,4.602310562659116533e-01,-1.348027050383150682e-01,-1.614366576137827303e-01,-1.215230312317244765e-01,6.259891340065337761e-01,7.140039810347156291e-01,-7.571621507825332387e-02,6.925378791469901651e-01,2.887789074295938896e-01,5.197435823521026066e-01,-1.458868603091041383e-01,-4.437565029951732187e-01,8.906340230719976547e-02,-2.333694918879443692e-01,1.484266321249025022e+00,-5.234931976939704024e-01,-4.400018942405562461e-01,2.243280193934567568e-01,1.822125090514677415e-01,-7.946381066901894163e-01,2.381722982988680182e-01,-5.003590431324248522e-01,3.083895457045859878e-01,1.401696745442700953e+00,-3.310632696689600474e-01,1.043522687520475195e-01,-6.881306980467605250e-01,-6.705366130488223941e-01,-7.380696823595930267e-01,5.911178082083686780e-01,2.469842799172146552e+00,5.016810819461520188e-02,3.432280294713430102e-02,-6.512622565052211820e-01,-7.423749468043965294e-01,1.429536000473745627e+00,9.018622980351227447e-01,1.591270693440632211e+00,9.961394076235708939e-01,8.866891801752507796e-01,4.258023891706254616e-01,-7.687901198732718933e-02,2.395318433154506876e-01,4.762212577817724335e-01,8.368215923189029626e-01,2.320296093618819722e+00,5.676114467505732203e-02,3.807450368889843673e-01,4.061130824479518564e-01,4.359482074572406773e+00,1.815700341167959975e+00,4.965837348516037864e-01,-4.847632886106553185e-01,-4.489808356292141478e-01,1.349590103456465684e+00,1.156324233493589149e-01,-2.820318526603238785e-01,-4.373257506945047446e-01,1.472751606879209030e+00,6.721438136021985477e-01,-7.043488632609540279e-01,-4.460359963955380369e-01,2.593190399431163917e-01,6.325722756054130702e-01,-5.169426287894207661e-02,-5.837403663208805549e-01,1.053589350996526619e+00,-5.262584183004784810e-01,2.927209835848985087e-01,2.533000054310458715e+00,-2.048511598201374628e-01,1.669853749290495237e-01,7.094861639561041988e-01,6.961679523659268509e-02,1.141650159011255328e+00,-2.738852097601902624e-01,2.607661743013580113e-01,-6.301289848681881356e-01,-7.555044856565740208e-01,3.510377861975694236e-01,3.367688845112049023e-02,-2.906766252141073092e-01,1.551994001682396096e+00,4.642129755007172731e-01,-1.018935728533514995e+00,1.314162404439140341e-01,1.476835058878952278e+00,9.237663929710894228e-01,-5.840411660366782165e-01,1.656419801503934419e+00,-3.136822031052363124e-01,9.875609859856686601e-01,4.751191671311683073e-01,-3.950745519239540204e-02,-4.621366087940537160e-01
8.317128862632157116e-01,6.668521401033793428e-01,3.751321758423113717e-02,-3.993710781510472208e-01,-2.420144533362552641e-01,5.921077806099672713e-01,5.846110310310466129e-01,1.092149282628701590e-02,1.413291759436754225e+00,2.049080039361692585e-01,-9.391015305478883635e-02,-1.211334695907847758e-01,-5.409368729805740239e-01,-1.743746728995441142e-01,-1.889334932477768625e-01,1.126040727693395249e+00,-7.458108778089689306e-01,-1.780944802361456580e-01,1.543791166411267318e-02,2.214281306121693715e-01,-9.321584634116559798e-01,3.487887535000016026e-01,-4.925209451407318584e-01,1.430591731627449403e-01,1.583455420652923218e+00,3.755194606800008050e-02,1.114941652062301225e-02,-7.423558650915926815e-01,-1.379426351008466778e+00,-1.048555353187710537e+00,5.139434419529422815e-01,2.763735840266248189e+00,-1.206854150076160093e-01,1.660922986332509788e-01,-7.255502216725846498e-01,-4.543037800534577286e-01,1.868059793635598265e+00,6.884445067296842691e-01,1.598186812482859320e+00,9.180773197613042447e-01,9.175077122510225669e-01,6.676379373316143617e-01,8.523527030570454688e-02,1.132521179967291153e-01,7.493661180351509632e-01,8.190873781570584544e-01,2.480439144449536837e+00,2.739518478208174956e-01,3.730226285349582116e-01,1.181838105586269227e-01,4.219555996168684153e+00,2.184251367468552640e+00,5.728949643993497265e-01,-2.048089885674852229e-01,-2.969443832846791476e-01,1.328369663721441718e+00,-7.201477740236428282e-02,-4.738979014293677183e-01,-5.824581752122193201e-01,1.667581613764411719e+00,1.160307894450050836e-01,-3.876849802289345504e-01,-1.899631730361999449e-01,2.234391978664799772e-01,1.183502815893360927e+00,5.456187943668937557e-01,-3.630872685589615623e-01,1.285984346131950007e+00,-2.863601976972172669e-01,6.210778369034897217e-02,2.252241770039780544e+00,-2.622973795781229911e-01,4.510078162056346124e-02,6.250658885851032021e-02,2.566231964393125287e-01,5.656220905276793109e-01,-3.202664858247372126e-01,-9.125871739991731069e-02,-1.273934393015885735e+00,-5.422723775876967522e-01,4.793087792762520394e-01,-2.080432551413666231e-02,-5.368640427190121134e-01,1.866670018041221679e+00,4.472076359468825091e-01,-1.184225237261106400e+00,1.305014467712444504e-01,1.294306049300700812e+00,1.117498447578314069e+00,-1.079259701971160723e+00,1.730154778864429144e+00,-3.515517724742864836e-01,1.262759106423075206e+00,5.708534891965618696e-01,-8.664633512966144480e-01,-5.538256458282783123e-01
4.723381747366406924e-01,2.172947198530541524e-01,2.987570157607913890e-01,-8.901794658960104911e-01,-2.823480439161349387e-03,8.539435221916355512e-02,3.380417398999955303e-01,-4.915061526446565798e-01,2.840918099601248969e-01,5.583545232770803501e-01,7.724649325523771370e-01,1.041733183077031832e-01,-4.050366592973682622e-01,-3.157298725419426799e-01,-4.858249747201250912e-01,1.446401780518989932e+00,-7.355340677808064331e-01,4.900928730456914906e-01,-2.303024976305448335e-02,1.297501294740833477e-01,-7.246247658327176211e-01,4.901024979335913967e-01,-2.753708002854683423e-01,1.857563013208477776e-01,1.855432936440968517e+00,-1.017494565443693710e-01,5.730208294548679859e-01,-7.361505892567397069e-01,-1.221436423513050595e+00,-1.282321201013031375e+00,4.264839940180920053e-02,2.801128258919565628e+00,-5.558885356924802013e-01,1.564855057305619135e-01,-4.345586123216631513e-01,-4.350229548151579584e-01,1.119314407725241489e+00,1.257317704507967537e+00,2.542919821404829417e+00,1.892636564159385859e+00,2.944086941351231612e-01,4.629976228345268896e-01,7.413008873578616487e-02,-4.650775463849738944e-01,5.229258545505928168e-01,6.969641778881168204e-01,2.398553707569676341e+00,-5.743043924187029026e-01,-2.095857741539360886e-01,7.916290151917604323e-01,3.155741745613200866e+00,1.762182698633137479e+00,-1.258261761725016359e-01,-4.212367934849486906e-01,-1.009423108530373092e+00,2.123205718170495526e+00,1.184697924466299623e+00,1.864311805636630071e-01,-4.707457032770339667e-01,2.125298874430488372e+00,6.397359058707240420e-01,-2.779526163512803238e-01,4.622464330978232061e-02,1.534618950748891208e+00,1.422244100941687517e+00,4.975886013597251578e-01,-8.009168095215114525e-01,8.240820841978354627e-01,6.335480631252813355e-01,3.472961544146588864e-01,1.738086022920672269e+00,-3.550574941421835717e-01,5.976342203732328828e-01,-3.618705693828577763e-03,-4.987269013888622204e-01,9.761104872768777696e-01,-4.769657229364004936e-01,9.935978626511940970e-01,-1.275660178636822684e+00,-1.203082735371270862e-01,2.721809521214975103e-01,3.357693753567809747e-01,-1.787462378792493700e-01,2.013594924827959876e+00,1.153880391074090017e+00,-1.451568362996699113e+00,4.640305581197546325e-01,1.277981662272042351e+00,4.932408338964122674e-01,3.913954012884416911e-01,1.558154099515117075e+00,-1.902121698389315219e-01,1.781078413778592884e-01,1.994626059221784597e-01,1.145143071689216141e+00,-2.709338951291200281e-01
7.550721475140064198e-01,8.070581391278520700e-01,3.568044395406120839e-01,-2.847112412752519917e-01,3.253463970469714361e-01,1.235802710203343646e-01,5.005897369737457581e-01,-4.409827832372110734e-01,3.323803893396081732e-01,1.058834733923801202e-01,9.500430216612354428e-02,-2.270096856230058302e-01,-5.288854738777827302e-01,2.017546918427207125e-01,9.361894409098447944e-02,1.002141517454248287e+00,-8.274670963963901560e-01,-1.610727992373680029e-01,2.830629026140584203e-01,3.199966035600336212e-01,-1.014920591725503751e+00,-4.045676151448039937e-01,-6.306929460182759684e-01,4.335995534633941828e-01,1.285494693455351278e+00,3.025413581033646604e-02,4.115919355616893816e-01,-6.696178862699181389e-01,-5.250572547808266544e-01,-5.369425236484378638e-01,4.755146496584533033e-01,2.403145481131790717e+00,-9.432141961831097543e-02,-2.146526283504032739e-01,-6.292144464766598055e-01,-6.442001688955867333e-01,1.099090975128566683e+00,1.126102085427924004e+00,1.255467424574657098e+00,7.965546589072366457e-01,5.621035574347872377e-01,4.617208867738993305e-01,-1.585820803844062987e-01,1.259743946510681334e-01,8.320959137849320841e-01,1.040723157918996833e+00,2.358221441824637665e+00,-1.415460667235459713e-01,1.782735332807933726e-01,1.111570273294737898e+00,3.539355983348225987e+00,1.147686933615391869e+00,-7.285012252668671140e-02,-4.333718402969517491e-01,-3.398056712228332277e-01,1.195205311929725234e+00,-1.786795103046087130e-01,-8.488733830390682300e-02,-1.553937847680076922e-01,1.981991889503038617e-01,1.059416301543880667e+00,-3.860530933980118040e-01,-2.585635376231686378e-01,5.935438660951903866e-01,8.419004623671222376e-01,1.813404408869725426e-01,-5.229031286520110511e-01,1.096232808990045715e+00,-4.473408587076849185e-01,4.064154813212992878e-01,2.095645497887588693e+00,-6.413101730246548726e-01,1.472923675055921033e-01,8.866137671185869706e-01,-2.060018104795641181e-01,1.509443451131231573e+00,-9.863439728751255409e-03,8.134633178098660267e-02,-4.400568546391625535e-01,-5.818929730686885904e-01,-1.369850022665858313e-01,-4.928458932595741193e-01,-5.183315041431463266e-02,1.552868748026369872e+00,1.468095124467395651e-01,-6.376755186855933566e-01,4.862543218413005741e-01,1.322092506090881026e+00,6.696158234679401300e-01,3.409907864089252727e-01,1.207920693949894320e+00,-8.547141183133543096e-01,9.289584781589113049e-01,4.866283042425804672e-01,1.274086523128841186e-01,-2.306069587945996924e-02
9.248824173881474708e-01,1.770607953728775552e+00,4.011038936070974170e-01,-8.789066158667002693e-01,1.480513773615964590e-01,-9.100090207153860300e-02,1.275679514154628991e-01,-1.132152112276864492e-01,1.420711442401581648e+00,-2.176399056881873351e-01,-8.228584301471655316e-01,9.240834165664346678e-03,-5.968468206810439991e-01,4.146145838260187344e-03,-3.073164549051909944e-02,6.743600421353270757e-01,-6.818359791313184370e-01,9.289720361622524902e-02,-2.264067286627492182e-01,1.696213190087417222e-01,-9.650799807494024884e-01,-1.615609723047707336e-01,-7.678765071472358761e-01,1.244568212287501807e-01,1.691960121534786143e+00,8.457422907156044722e-01,1.338602753831271419e-01,-6.544258993690801329e-01,-1.704016116326916297e+00,-1.248129419682969754e+00,2.410305123349291700e-01,2.520234603598701995e+00,-4.382970892000020990e-01,5.238453250119345928e-02,-8.993703605830234427e-01,-2.459862153332532664e-01,2.045697431229823948e+00,6.068428648237467193e-01,1.311137269764077296e+00,2.907813102577633257e-01,4.914570892037745109e-01,6.686356025975345174e-01,6.746116269707616575e-02,6.523412893264744772e-02,1.069468225662532079e+00,1.066532762348849861e+00,2.639013965827273545e+00,3.862530402182651201e-01,9.400993147971081765e-02,8.577730408410710883e-01,3.398656097373256024e+00,1.717887878485868658e+00,1.806023427373781298e-01,5.237086923129813387e-02,1.808569171411439358e-01,1.009864942878566652e+00,-5.670973877923944917e-01,-2.835913739722477622e-01,-8.651433821441211203e-01,3.747336271382701867e-01,-2.766099436356922459e-01,4.207901761340723246e-01,4.305713048913865082e-01,4.212218100586373470e-01,1.748377196363990915e+00,1.095307326277393134e+00,-2.235111226823125463e-01,9.051492554091157272e-01,5.788678718830200104e-02,2.678731846658686244e-01,1.650448546833649388e+00,-7.401183701124811609e-01,-3.396178372597961626e-01,-3.203141461165479598e-01,9.024689046780377810e-02,4.110185020543884460e-01,-1.723084196852069927e-01,-3.215325821044754395e-01,-1.594291061883867933e+00,-1.503175311089017252e-01,5.870528443115503592e-01,-5.091643109959242963e-01,-4.163988895253168399e-01,1.905384471743412300e+00,3.805493727665069104e-01,-9.086658925463994008e-01,5.416522031659785075e-01,4.625580672881733357e-01,9.332047334401495364e-01,-5.486435232905727544e-01,1.245273145058027886e+00,-1.120813305431461293e+00,1.443810106641289615e+00,4.486263045329684229e-01,-1.173067492713412818e+00,-1.712585743610760269e-01
7.357452177529093529e-01,2.805451373157701322e-01,1.397390448870613339e-02,-3.439406109833140213e-01,-2.717897148719074507e-01,6.587918047590153314e-01,6.500699282350206332e-01,-7.427587928337775480e-02,1.157326334379295218e+00,3.871736661699610171e-01,2.722431002291557656e-01,-1.235020885195209361e-01,-5.033627672061241620e-01,-2.316792592682421770e-01,-2.602618245182133361e-01,1.300446785783437198e+00,-7.771892721938615800e-01,-1.189382079413022208e-01,9.607483839198149855e-02,2.340748290402608900e-01,-9.018546521350035983e-01,4.679519263118895323e-01,-3.800129435916415055e-01,1.739899086229166614e-01,1.577348691671066838e+00,-2.230191047425245376e-01,1.085295377758816321e-01,-7.623896005347358118e-01,-1.195429419862383824e+00,-9.910065124947464721e-01,5.034638541289780944e-01,2.824714740635283938e+00,-1.118332532347848518e-01,1.622761492102567371e-01,-6.136733757613148654e-01,-5.181591987716672731e-01,1.627282481027352290e+00,8.507805288173866387e-01,1.817316657414871806e+00,1.278303832957679909e+00,9.055194456920385715e-01,6.201150684501809396e-01,7.941338171158351944e-02,2.065983206203163974e-02,6.300434680689870337e-01,7.393550874378748139e-01,2.424975091266260208e+00,5.721878701434002235e-02,3.316355824783550621e-01,1.057844798069011993e-01,4.204585960330962102e+00,2.161924281189498309e+00,5.150815008421781860e-01,-3.306762194741156846e-01,-5.710071371552427610e-01,1.555918972707434511e+00,2.910406479275448599e-01,-3.863336889980035771e-01,-4.451391315100390322e-01,2.014201201125227048e+00,3.979512432364190611e-01,-5.897142051352368686e-01,-3.310792440582933649e-01,4.417398505834297939e-01,1.047477617057053667e+00,3.606918789434711003e-01,-4.839211820069128089e-01,1.313251578532264485e+00,-2.231775021009024806e-01,5.876389190112485394e-02,2.322902175513768874e+00,-1.759616152174370840e-01,2.653756480714034027e-01,2.119938994875640859e-01,1.351977638334783682e-01,7.513389564604214810e-01,-3.563962128242790794e-01,1.816479996881456560e-01,-1.128227673652168361e+00,-5.724710388177978171e-01,3.563853600079979755e-01,1.501703402271269971e-01,-4.725380409411966687e-01,1.859618085263422316e+00,5.689312175120131432e-01,-1.269015373220951703e+00,9.740790599594503774e-02,1.548192472657670571e+00,1.024150921172941597e+00,-8.645331270940908031e-01,1.811106877375687763e+00,-1.394944734576415435e-01,9.991536907652783794e-01,5.352053956676277036e-01,-3.500553556218944928e-01,-5.684931493490339438e-01
5.835227193335682516e-01,4.041551042193589627e-01,-1.607480651173482378e-01,-7.090942212602333594e-01,-3.437552419070746823e-03,2.225653014173130106e-01,5.336360808841786874e-01,-3.295882941248159947e-01,-2.587417225570458612e-01,4.623545294719090260e-01,1.301288424171717528e+00,1.537371761093810352e-01,-2.632429565052161191e-01,6.572544755872955502e-02,-6.851587129509915108e-01,1.911804768273176247e+00,-1.803699248664492882e-01,-6.462057366288205540e-02,4.648761736999606348e-02,-7.590664101471453207e-02,-3.933715800260453865e-01,5.163962456250938970e-01,-4.061321332627306768e-01,2.819797587305958864e-01,1.773053435827105728e+00,-2.788453955867795653e-01,4.144415968855603705e-01,-6.354959028206903504e-01,-7.598060725293158679e-01,-1.197291917741857281e+00,1.451554844780483799e-01,2.316500254446505647e+00,-3.270699531986228648e-01,1.826597685517059033e-01,-5.288146265312614336e-01,-7.531994783050390829e-01,1.088753232605804699e+00,1.159790083589379961e+00,2.530540773594290638e+00,1.527420258137258458e+00,3.350376191893993383e-01,1.755011750532101122e-01,-1.147911762684995091e-01,-1.579097480615161975e-01,1.290891896448803089e-01,7.442375777869683073e-01,2.197473153639248000e+00,-4.607276723616083314e-01,-9.677118609287398143e-02,8.451474004637991033e-01,3.688928438212918159e+00,1.690451936642153097e+00,8.068967771263313438e-02,-6.134284190746188692e-01,-8.404423298742271786e-01,1.938042611215954558e+00,1.112499134890272412e+00,2.869664836492046289e-01,-7.213545772784042409e-01,2.053399943918303272e+00,6.243520597327839594e-01,-5.029766418009617990e-01,-6.387733577214825542e-02,1.144794574798976061e+00,8.851725312170337645e-01,-6.917943257969283444e-02,-1.008261546931582098e+00,3.021789037469362893e-01,2.977911767647805075e-01,7.312286011161706067e-01,2.097879512682778724e+00,-1.768996808117364594e-01,4.266708571890264201e-01,4.356613603756759323e-01,-4.770858728274203764e-01,1.197227094167432337e+00,-5.971560802278705893e-01,1.213102232164338545e+00,-8.390080557505537051e-01,-3.977987527837071324e-01,6.443170738622958638e-01,4.433252794723966939e-01,-6.862872106944895023e-02,1.666595394629712956e+00,1.270258923652115346e+00,-1.372817190460242198e+00,3.876690998769289354e-01,1.023484361395675002e+00,4.743138083981834341e-01,3.266579714115186994e-01,1.486447942098880315e+00,-1.951786571393177017e-01,1.352652187389590255e-01,6.455769252101517530e-02,1.478888409229794254e+00,-3.643875104773088291e-01
1.105521828933940132e+00,2.709304792366108661e+00,-1.722840187068543361e-01,-1.351000832516069394e+00,8.453427624643226890e-02,-3.986726288812044161e-01,-3.272608062349142144e-01,2.733254005252658825e-01,1.085348883404072318e+00,-3.211268910576544622e-01,-8.443267742976684476e-02,5.472715936886931587e-01,-3.316250695689740846e-01,3.977670276683254458e-01,-6.239975558470605144e-01,1.628477402760112769e+00,5.026671439996581725e-01,-9.247554207432713558e-02,-5.542956360658363169e-01,-3.023422598005211515e-01,-2.943642396858580645e-01,2.910570172338211581e-01,-9.004062305051885318e-01,2.407571116501239228e-02,1.968394809951053315e+00,9.054398708174373755e-01,-1.952404771960705721e-02,-4.374747040002596177e-01,-1.489729886961303373e+00,-1.664958103398330280e+00,-7.387585069899726964e-02,1.818190250486069859e+00,-6.575226612182034636e-01,1.372866159062234026e-01,-1.065185016431432263e+00,-4.703365351170329944e-01,2.274624915141208792e+00,4.727900940516765460e-01,1.767348476429086990e+00,1.048143284026210598e-01,2.129084587235722248e-01,1.536286488372078374e-01,6.335890690927245550e-02,2.398591045826159451e-01,3.785482589879927695e-01,1.020485700823398956e+00,2.736973497764713770e+00,4.563696685966659450e-01,-1.824974451254899321e-01,1.397639816449590455e+00,3.542805754501272109e+00,1.618884303724585472e+00,4.772262112748072438e-01,-4.748107922791916513e-02,3.408704329769257635e-01,1.068991637746990353e+00,-8.700809046656693413e-02,9.874044040491894436e-02,-1.830761874483756158e+00,7.374894067153463517e-01,-8.876885162823755504e-01,9.184311128989881556e-01,8.862462095175823729e-01,6.232301287643760013e-01,1.631444575065602809e+00,7.122653450711067258e-01,-4.925835209429815231e-01,-3.717977044639063644e-01,5.691652052306954701e-01,6.500241732434939301e-01,1.836726218329769234e+00,-6.383304274063155148e-01,-6.682194829260369451e-01,-5.917147373528132137e-01,-1.192711069307313410e-01,2.542415409495215606e-01,-3.657243180885349498e-01,6.012052821074514997e-01,-1.730098551469728463e+00,1.133777682697029165e-01,1.650867985806895977e+00,3.315865905902955213e-02,-2.446406175841050468e-01,1.501446936019247058e+00,1.279937959225390554e+00,-1.078544676186166784e+00,5.977288765703846485e-01,-3.857882572316404524e-01,6.427681007528734947e-01,-4.762796646218076524e-01,1.318880340239904747e+00,-1.247596460195062651e+00,1.237446434682785146e+00,-9.582092847213374842e-02,-2.349898867059492802e-01,-1.728724974954535254e-01
9.292495576711528038e-01,9.284374643423305429e-01,1.221298245664481641e-02,-8.210259414456260174e-01,-5.896132782320470112e-01,3.586503578619090193e-01,-4.472301221682377093e-01,4.570566674550106123e-01,2.553691280678359821e+00,6.201568272714713670e-01,2.538764383591227691e-01,4.334376347112167682e-01,-4.848111348341086480e-01,-4.396342127531928656e-01,-4.525019136489077942e-01,1.938129515376687539e+00,-2.929437667702207704e-01,5.269007826364247027e-01,-2.653949994091395759e-01,2.130276077501055965e-01,-8.903187825816331058e-01,1.152830436988244722e+00,-1.881420383992304379e-01,-1.329918647890689087e-01,1.739014331677376290e+00,-4.210248185680477984e-01,2.679361602190813429e-02,-6.778346783329534109e-01,-1.155082998895722080e+00,-1.147992044131766143e+00,2.154364234115153653e-01,2.924783409946231760e+00,-5.779451851022714415e-01,-4.479465802864199264e-02,-6.028819438505599315e-01,-3.492805321902882620e-01,1.979989980748688705e+00,9.211032249146146045e-01,1.872066829694253531e+00,1.962349423580506791e+00,9.828538931839230219e-01,4.884807928030022173e-01,5.901232778000674584e-01,-2.232452562461016699e-02,4.047649463008599069e-01,4.767792125238334844e-01,3.224422203855221714e+00,8.168276648274674923e-02,3.939745525401315562e-02,5.977805716157049698e-01,4.017730584386892012e+00,2.090070910861710374e+00,1.031430200576526790e+00,-2.103709871686293975e-01,-7.970214572082188198e-01,1.831695482215145221e+00,9.147996244502674124e-01,-4.267166432245785845e-01,-1.007073524531239217e+00,2.767909293925772118e+00,1.003904557291737804e-01,2.522414309563387191e-01,-4.213843539201106436e-02,1.174241350912438087e+00,1.391127383147048979e+00,4.917609091777849217e-01,-1.859743506286017922e-01,1.146620981589645094e+00,6.307665516711914444e-01,-8.049827601554988554e-01,2.651232708421639828e+00,-3.081975665854558288e-01,1.947197153506476375e-01,-5.806071775354951781e-01,8.610093284919496937e-02,3.917298814347286440e-01,2.908878251467778009e-02,8.798900681027508330e-01,-1.723669237970970158e+00,9.794614653997768539e-02,7.975282799027322289e-01,7.934361229022333095e-01,-4.859020609938006774e-01,1.628940182558635597e+00,1.229863735861184804e+00,-1.417855851959634261e+00,-2.015975366987921014e-02,1.797474492609919983e+00,8.227830154344113467e-01,-1.175914340172039552e+00,2.588133608724891399e+00,-1.078813479396403263e-01,1.267568468483713851e+00,2.408566851971563616e-01,-3.883017150363143877e-02,-4.222194038233008095e-01
5.471398441945476421e-01,-1.014628238932498983e-01,2.685049040285176769e-01,-6.754047542612187094e-01,-3.100295808882900794e-01,3.573566759282937322e-01,9.561856662181961175e-02,-2.070002701799442402e-01,1.195475553617288966e+00,8.438234202372100201e-01,7.998582613470079927e-01,1.510023117758778066e-01,-4.604364368347614311e-01,-5.299844122172819860e-01,-4.091530703281600068e-01,1.704549931285495701e+00,-8.171129834868964270e-01,6.380054884505242940e-01,3.605694416750127723e-02,3.040044143163957990e-01,-9.335807148321325633e-01,8.556016721462239571e-01,-6.041665260473982890e-02,9.087616934616603304e-02,1.710360431467559561e+00,-6.151078127276176089e-01,4.641792483090911858e-01,-7.768802226769420116e-01,-9.627845678132852525e-01,-1.019764055314510198e+00,1.871625006349619813e-01,3.091088760026983184e+00,-5.108182376987417950e-01,5.111556974342373882e-03,-3.377548666556307033e-01,-4.249442891945676148e-01,1.180267276270578813e+00,1.339922067723927857e+00,2.346532957796929608e+00,2.432033046484189054e+00,6.885219246219650424e-01,5.247879200158260815e-01,3.336381286417771652e-01,-3.913099740718579689e-01,4.724823358589583799e-01,4.985422821731577137e-01,2.743806980005004448e+00,-5.409179252229707746e-01,-8.080537826675739110e-02,6.036164229585267993e-01,3.518432511866929957e+00,1.877705618156606748e+00,3.138809213527102848e-01,-4.557276119897281652e-01,-1.287337906010603383e+00,2.242083719135256281e+00,1.394173020952623077e+00,-9.494034148374856652e-02,-3.401426681102553418e-01,2.755165240353595557e+00,8.973348761247170735e-01,-3.592486995307638820e-01,-2.836132977582661585e-01,1.603526539351370683e+00,1.250322581805169531e+00,3.350156582272291739e-01,-5.721679052542818500e-01,1.314015043170615016e+00,5.976186344340211898e-01,-3.454551163325851881e-01,2.258813381266219444e+00,-2.655323367958981606e-01,7.457339710758253970e-01,-2.559780085399851468e-02,-3.202176581797186450e-01,9.815575766851717399e-01,-1.919507415590955002e-01,1.082004306345118128e+00,-1.263186349774213513e+00,-9.765410960929682416e-02,1.201351027607153732e-01,6.513741765527845118e-01,-2.751907394899462123e-01,1.879346406527864000e+00,1.132729134088408474e+00,-1.477306232658666563e+00,1.712128040075469038e-01,2.073705619624227836e+00,5.910050131374732230e-01,-1.105164839166359325e-01,2.168560507301832363e+00,1.265812104340520161e-01,4.512576044344511761e-01,2.948280158882342628e-01,1.011321908219747545e+00,-3.404729851188988965e-01
7.102440626251604883e-01,8.254638553087219055e-01,4.392733252556288437e-02,-5.184884521119735856e-01,1.127245655097534188e-01,4.135316375496055907e-01,1.104315564908260550e+00,-3.819110095282192696e-01,1.960468712378197198e-01,-1.349510044066618286e-01,-1.148605593885625997e-01,-2.925048501005164114e-01,-4.858901451727839493e-01,7.146653369420014057e-02,-2.483612305161387868e-01,7.243794729091448392e-01,-7.661834821800919126e-01,-4.852085110449697036e-01,2.225067783722833176e-02,3.614557576606478029e-02,-7.071162003359705572e-01,-1.357874501308048432e-01,-7.489798254034927272e-01,2.951486128873810899e-01,1.718513251613207338e+00,6.115042680002599207e-01,1.190253126591888644e-01,-7.248965517176605422e-01,-1.711591640702984973e+00,-1.321081822214194013e+00,4.323407233432044472e-01,2.462241871449160069e+00,-5.972892272949781312e-02,4.002498863392300321e-01,-8.324166309684382092e-01,-4.947035039997731976e-01,1.766890914160265336e+00,5.602662042028441203e-01,1.824488904378831933e+00,2.141736866831542851e-01,5.111332434324719065e-01,6.450353541366919963e-01,-2.897842975029081281e-01,4.267576675387838026e-02,8.424235454463229189e-01,1.069691747113810987e+00,1.937434367443567673e+00,2.546875062184764671e-01,3.188529493665729353e-01,1.295779642056645864e-01,3.932975781204335775e+00,2.152483901684362877e+00,3.587876586284516334e-02,-1.862911877363990776e-01,4.013644817685563249e-02,1.157093855853010389e+00,-4.154700846662087166e-01,-1.931419694665757469e-01,-6.144072632160677561e-01,9.493189344697521292e-01,-1.407570383110489376e-01,-5.080073434823798584e-01,8.734225682775842436e-02,-3.910227862733062221e-02,1.300173902268014992e+00,7.016092262835207372e-01,-6.668653858578040827e-01,8.232909617353095788e-01,-4.353903470028687717e-01,9.672211951310065725e-01,1.645070513436371007e+00,-2.941099235903514852e-01,-9.300009493261225668e-02,2.196649588237389039e-01,1.090617237884125429e-01,5.849536178824271682e-01,-7.332104016106868460e-01,-3.473046182086978462e-01,-1.199763297741018198e+00,-7.220437892297294491e-01,5.765203713270210528e-01,-4.609554315920516010e-01,-4.640910495176117090e-01,2.081817480088250072e+00,3.419792846301547007e-01,-1.164475968057605781e+00,4.380391035940603972e-01,4.085974532919600666e-01,1.090035725416900192e+00,-5.731026761165221028e-01,9.487941492719741410e-01,-6.469059663964836782e-01,9.267322489378591044e-01,5.434774898628635942e-01,-8.474334954918709695e-01,-5.538253242666070220e-01
1.051388143712647771e+00,1.381354512073445395e+00,-1.034151204596159168e+00,-6.997076905685037929e-01,-5.583739781368449728e-01,7.155959832103175877e-01,5.629787902815888145e-01,6.087707600615744896e-01,8.954066734143321105e-01,1.080228093748457352e-01,1.050046567979208811e+00,3.952291539366448170e-01,-1.726582247817909921e-01,2.972131803924891735e-01,-1.066496060250285094e+00,2.400431349020802241e+00,7.557423983705764403e-01,-8.619858313426045360e-01,-3.099220303825651057e-01,-4.412942565385623572e-01,2.639619904047829646e-02,1.134795813191292080e+00,-6.380334107641867369e-01,2.460053434439524178e-02,1.937606729944509887e+00,-6.863369903718133380e-02,-4.133063883360131863e-01,-5.205676170811657233e-01,-1.264131795136401504e+00,-1.643191190053457262e+00,3.395871211889110453e-01,1.925548536912506270e+00,-1.025478847016360606e-01,5.235943101115720921e-01,-9.693931323755531348e-01,-8.506653802479895443e-01,2.332378056812691725e+00,2.942093791910147527e-01,2.317293728293007948e+00,5.402447054125858461e-01,8.310997457277947698e-01,7.565537978099251548e-02,-2.559291315045422732e-02,4.601961296889395814e-01,-2.570783901530542259e-01,7.096559582881913908e-01,2.316026392810700774e+00,5.588888008936774288e-01,3.194318206417438577e-01,4.794258263332606962e-02,5.124311578010230406e+00,2.610827804284307607e+00,1.227677773098505121e+00,-3.829257159238309560e-01,-5.351414294720235887e-02,1.366419191720257276e+00,4.310421714928385772e-01,-1.864872272530597175e-01,-1.791562748262655713e+00,2.761109370104525063e+00,-8.621875390251361182e-01,-2.915059233386474435e-01,1.239775541122692532e-01,-1.071221257229062473e-01,7.704210142354200874e-01,-1.184594915361067979e-01,-8.001010856514986225e-01,-2.127500700005199308e-01,-6.047270773779898217e-02,7.085552014059537385e-01,2.717700789577127907e+00,2.287388673578217291e-01,-3.591561939597968101e-01,-1.449142770796338631e-01,2.736018605225877809e-01,1.845268526491676830e-01,-8.672581487143116163e-01,8.521572459966775259e-01,-1.395003137065922605e+00,-5.933177086383181198e-01,2.004692862190863067e+00,7.854931039764183609e-01,-5.266276984235269687e-01,1.446448400462914119e+00,1.508559427610151271e+00,-1.605330267509083475e+00,-4.302861017027714841e-02,2.845215781053309634e-01,1.061801691594012942e+00,-1.672727518759850929e+00,1.901679414766685783e+00,-1.350554080221332831e-01,1.044634341665133359e+00,2.280066979319306242e-02,-1.021211222279877762e-01,-9.455058742775999114e-01
8.694454302892802300e-01,1.474282712515055938e+00,-2.081514435802472307e-01,-7.572140946033218967e-01,1.201749400485138536e-01,7.169171062519813509e-02,4.316464058721329877e-01,-9.043967776091441091e-02,1.857160251438118026e-01,-5.895883979372198991e-02,4.867091648155491557e-01,1.463560204373561269e-01,-3.264151168892576171e-01,3.652219662392820476e-01,-5.104900712128893625e-01,1.561856557311132487e+00,4.005593071530649807e-02,-4.070386487206583692e-01,-1.066958994839816433e-01,-1.485355461674288113e-01,-4.003167328776371381e-01,1.292221298741292601e-01,-7.559367122277220741e-01,2.598249486550978649e-01,1.717644320712556683e+00,3.424441127549741060e-01,1.341999481491523427e-01,-5.500050712659606544e-01,-1.018546486320984990e+00,-1.251227471902024213e+00,2.244733882924342117e-01,1.987552890545202899e+00,-2.565069663536846956e-01,1.604644733240985777e-01,-8.453998074527357964e-01,-7.005509104755398564e-01,1.651436478851250333e+00,7.342032562565014020e-01,1.879170571994632333e+00,4.398047166983963807e-01,3.744488013019078299e-01,2.077914826710701157e-01,-1.796511161889626784e-01,1.965701343813442414e-01,3.470106278211727568e-01,9.916379949345338618e-01,2.271025848726812679e+00,1.254888683273008565e-01,5.365240759283665395e-02,9.559215565676155713e-01,3.863234381698066322e+00,1.641689828950940067e+00,2.533100438045398084e-01,-3.589786185473062829e-01,-6.037172317139821720e-02,1.247857037034411531e+00,8.364269636225679649e-02,9.564142368683348217e-02,-1.097063310773835676e+00,9.666759716673670733e-01,-2.403544871310006603e-02,-6.192095110885642573e-02,2.418604926402360411e-01,4.435192176504771377e-01,1.031277729421232525e+00,2.081566773119730429e-01,-7.514386011499600837e-01,9.702144928833456028e-02,-2.932041822348519650e-02,8.694040926207349251e-01,2.028714903894293542e+00,-3.816580969209648067e-01,-2.003553266052638393e-01,2.721386246547392584e-01,-1.681694199251569377e-01,8.649314367909918255e-01,-4.980481504332309184e-01,5.326007189159573940e-01,-9.972797497015237767e-01,-4.291351487454732605e-01,1.002742550733817906e+00,-3.537596060728981362e-02,-1.706956963627762891e-01,1.548387458329384847e+00,9.169826245018150024e-01,-1.061407391292713775e+00,4.699296727702380050e-01,3.116788701350574620e-01,6.955031249299455931e-01,-1.685792093937929503e-01,1.211770437031909786e+00,-7.981761172497012780e-01,8.188217186873565367e-01,1.319872489833711637e-01,2.471816943115106302e-01,-3.132620090806815805e-01
6.378700930253112800e-01,8.112725646022727055e-01,2.044281182975910549e-01,-1.240722931553269293e+00,-1.989447362055627444e-01,-1.489620411015434853e-01,-4.115517947154647138e-01,-9.052559322292472177e-02,1.112210747597492944e+00,6.605484570924680110e-01,8.395870896296404595e-01,5.246028086618220732e-01,-3.565233070791631320e-01,-3.582606596035610158e-01,-6.774605446682263610e-01,1.974287625428267967e+00,-2.426558459740077445e-01,8.298879258950945248e-01,-2.927385723165963349e-01,4.587475112837217928e-02,-6.197863048925656981e-01,9.517631619913067276e-01,-1.965308602637528823e-01,-1.351304141417306037e-02,1.979265960636481303e+00,-1.994398901139873281e-01,4.841514977786881557e-01,-6.449785718100518039e-01,-1.144107814663409162e+00,-1.422265823725938683e+00,-1.687622678985892799e-01,2.730825030163968492e+00,-8.617644194314719730e-01,2.920190479534678918e-02,-4.681046247175673081e-01,-3.726166401463664180e-01,1.388460714612051783e+00,1.264477601267199436e+00,2.591983530529543778e+00,2.227168799484679163e+00,3.104635488643192054e-01,2.996508490971009353e-01,3.817938183680320008e-01,-4.347367340988563811e-01,2.864103590271222521e-01,5.426822318054795868e-01,2.910999155735196187e+00,-5.187395349010834877e-01,-4.170250401926744455e-01,1.192747693692096433e+00,3.084903676738158129e+00,1.683068289237710458e+00,2.514318228075350659e-01,-3.575899173143378129e-01,-1.084561238413250139e+00,2.257229114580351581e+00,1.580147540370396175e+00,2.072295458980975280e-01,-9.723998825927868683e-01,2.567668788642891720e+00,3.559827428646714642e-01,3.283493707186633248e-01,2.930202863850687178e-01,1.971575586050541951e+00,1.598588649951757867e+00,5.114822665164158177e-01,-6.435221533005359706e-01,5.222256952757844406e-01,1.199918035907470371e+00,-1.244003187962499646e-01,1.985651429587422356e+00,-4.329321691606419775e-01,4.720546697233032885e-01,-5.126079377559332739e-01,-5.438623461380380775e-01,7.370601662849686209e-01,-2.510855261351125356e-01,1.528573889249047468e+00,-1.642418082596816209e+00,3.203067199741944648e-01,7.119510853689032803e-01,7.854847658954819956e-01,-1.589016423512902287e-01,1.787066876713602426e+00,1.666516433625776727e+00,-1.537932587475985713e+00,4.002647671097712134e-01,1.285046694260890909e+00,3.344340779671954311e-01,1.911973920717049968e-01,2.037278740909235886e+00,-2.239650341688027568e-01,3.538112138868015899e-01,-5.859693440820235022e-02,1.424222598151805963e+00,-1.730874763013779960e-01
4.583286782887064925e-01,-3.654712136851256954e-02,1.533658970101613450e-01,-6.654673156504277154e-01,-4.622004044307902182e-02,3.607425903332138195e-01,7.616635543013184906e-01,-5.152808753315629708e-01,6.727450122728795279e-02,4.989683450977170365e-01,7.885022441969780083e-01,-7.313282508988094843e-02,-4.053384727219752626e-01,-2.767023238557173581e-01,-4.792598351575434457e-01,1.327805063174097855e+00,-8.219116529748673461e-01,1.595080987542503159e-01,7.501320846784134688e-02,1.125296779528775770e-01,-6.973250238498962528e-01,4.317787964591740524e-01,-3.203644892145471323e-01,2.412909707933550141e-01,1.813248400891192436e+00,-1.124039501732744528e-01,4.636329975883686227e-01,-7.710572794513536055e-01,-1.307994888869022487e+00,-1.270240588005065119e+00,2.074837457465649460e-01,2.796310940340250184e+00,-3.339628210019269239e-01,2.913545802838185539e-01,-4.718270661562186108e-01,-5.065678442206158483e-01,1.175999837942941273e+00,1.118024968491701632e+00,2.523903270058501125e+00,1.638785657175135579e+00,4.165008992992033088e-01,5.237844374549373017e-01,-5.930708751652173649e-02,-3.722945971183029279e-01,5.325473413221502028e-01,7.367526733823425156e-01,2.148613922179012814e+00,-4.451613791219784511e-01,-8.450360732814132803e-03,3.765194717971928062e-01,3.525553805405202468e+00,2.011350578820235491e+00,-7.235769209746656383e-02,-4.442279197913467370e-01,-8.978318437715165912e-01,2.002445694767158280e+00,9.413743409872757928e-01,7.790187994557634665e-02,-3.768907469494091611e-01,2.185830703489081817e+00,5.708424146367478969e-01,-6.314757378118190934e-01,-1.120377457909165764e-01,1.091767231468155241e+00,1.252453556014197389e+00,4.179816959331551507e-01,-8.621889352294281883e-01,9.226025439952164620e-01,2.619962233503131399e-01,5.534722955571803604e-01,1.789511077020933705e+00,-1.916752955022963389e-01,5.724049627890649417e-01,1.888873216984311154e-01,-3.337130656059093536e-01,9.389757474627349332e-01,-6.534003125356286912e-01,7.051754616304505285e-01,-1.155312585269386849e+00,-4.120444149717713556e-01,2.785777708627232840e-01,2.346941360409427468e-01,-2.788249523632855276e-01,2.083355779649262551e+00,9.581461518262164301e-01,-1.484156157167656032e+00,3.757528587870183623e-01,1.242463209792372014e+00,6.889413506533577092e-01,9.388707080677632932e-02,1.450054702510796156e+00,-7.233470790283480500e-02,2.189645329595709677e-01,3.295586477627485134e-01,7.875133007355650250e-01,-4.618157862222908028e-01
7.803398756885913112e-01,1.249368193419818196e+00,-3.462594532431627070e-01,-5.700592079952373492e-01,2.692724511534340115e-01,2.645329379187690844e-01,1.147272560722077506e+00,-3.391971962750108260e-01,-7.143535819690836064e-01,-2.788920194754400672e-01,5.280728089927408941e-01,-1.339094400403987861e-01,-2.966816677189529350e-01,5.339804294458633249e-01,-5.281343415799065744e-01,1.239466077142235223e+00,-7.463724786733216821e-02,-9.025802437600395356e-01,1.746508717989845444e-02,-2.533864764120278279e-01,-2.615240132008501139e-01,-1.922989234108402057e-01,-9.259500945324379284e-01,4.075927261955762937e-01,1.730778638632478383e+00,5.976472475756686720e-01,9.638269176026870166e-02,-5.790467438839297376e-01,-1.237153197357728107e+00,-1.353681800524798584e+00,3.560108655613347661e-01,1.829366009905039059e+00,1.047464982236961939e-02,4.088719249452219540e-01,-9.241938021905076184e-01,-8.062248060804761973e-01,1.612376813791636554e+00,5.521344770018810078e-01,1.981852074233431127e+00,-1.523854896311678253e-01,2.863176635727447961e-01,2.531287032329487818e-01,-5.179956027274320585e-01,2.483671606696069567e-01,4.003522637325421796e-01,1.160038531594288935e+00,1.723176468954397800e+00,2.178719346365801668e-01,2.294210367231028780e-01,5.503945844035897927e-01,4.083110155024930243e+00,1.855089733041032529e+00,9.833019539032261669e-03,-3.916685823177845638e-01,1.996227357575452999e-01,1.051406353909627889e+00,-3.182239795571160101e-01,1.415828263647564145e-01,-9.824449860141417634e-01,6.522909132212622030e-01,-1.680516190574064816e-01,-5.166647918696567476e-01,1.981619976822741602e-01,-1.243617660446780793e-01,8.903111190782446727e-01,1.783495009590842784e-01,-9.844636985878421065e-01,-2.885365714920073987e-02,-4.972125630956243381e-01,1.552990021087080397e+00,1.774787019900553764e+00,-2.300503103047450981e-01,-2.707688114188354644e-01,5.943346619971168199e-01,-9.373045810827396185e-02,8.822832632077191040e-01,-8.860642327267163054e-01,1.243690663220193282e-01,-7.940067964479686768e-01,-8.324982673885225060e-01,1.021606504370124791e+00,-3.666050358944021315e-01,-2.195408892066369189e-01,1.723917241035135328e+00,6.545651101450913334e-01,-1.076380976495537434e+00,5.405726824822477683e-01,-1.449563789170851269e-01,8.668701642776382998e-01,-1.617507811126393524e-01,6.929536148820422126e-01,-8.183746138849323781e-01,6.574162527250195787e-01,2.525228784068725418e-01,-4.663383259565831440e-02,-4.993251518546643064e-01
6.349545714567279564e-01,3.451845342978201447e-01,6.050108542968683778e-02,-8.365499029501745065e-01,-3.254940338772059349e-01,3.163741910162205517e-01,1.346235536247332720e-01,-7.517621531190284145e-02,1.124426717016367760e+00,6.391471898319478484e-01,7.440375460579833344e-01,2.420174946120210446e-01,-4.034229832230189494e-01,-3.895360808026028243e-01,-5.762103343139490796e-01,1.762106386696769000e+00,-4.947432610265891650e-01,4.284074165590542327e-01,-1.201470454989227443e-01,1.150207473945355496e-01,-7.102949614387363830e-01,9.021294083059675506e-01,-2.046252782830536021e-01,4.455491573963296648e-02,1.853167875119486441e+00,-3.207189322716035851e-01,3.096999365888482014e-01,-7.212233568302749420e-01,-1.231846944726486148e+00,-1.297124206948743197e+00,1.275066639036464278e-01,2.859160095128017609e+00,-5.262208522009551581e-01,1.606247438054553001e-01,-4.921297759524647653e-01,-4.379403558788298456e-01,1.488286714733228600e+00,1.090082396176211610e+00,2.431990856440403803e+00,1.990763445605060467e+00,6.098247885088905473e-01,4.548501910398449755e-01,2.691164545084157034e-01,-2.912107714131855207e-01,3.719914788478251300e-01,5.615800400939336967e-01,2.661235243142393347e+00,-3.120800915918807150e-01,-7.618452723009451477e-02,5.338591014049901551e-01,3.669718482209450183e+00,2.057371415451715535e+00,4.172287265947998702e-01,-3.720936103160818464e-01,-9.831128161813864619e-01,2.083767654761460530e+00,1.202949699854598320e+00,-6.403103147853493604e-02,-7.305577888793913788e-01,2.720035345411060845e+00,3.591069482133469881e-01,-1.948599743660557326e-01,-3.693542892497937713e-02,1.337266551586429486e+00,1.348417067455370821e+00,4.200308723765349694e-01,-6.221993015222535561e-01,9.089300624800692452e-01,6.220215463718056226e-01,-6.490232286533836881e-02,2.167177964976567672e+00,-2.121317158028759864e-01,4.782567949492052550e-01,-2.434332044632181724e-01,-2.360727221157302158e-01,6.848374608651750517e-01,-3.870233439919392726e-01,1.029763408396022317e+00,-1.474964997308673587e+00,-9.340229391594284669e-02,5.874949470375687710e-01,6.502117971113678951e-01,-3.433293223292880336e-01,1.883245155594644338e+00,1.284551296570370704e+00,-1.554788007064390465e+00,2.030835058759134504e-01,1.498447706042246974e+00,6.660274644441598335e-01,-3.764305258848195668e-01,2.031356385247310659e+00,-1.041304932209941025e-03,5.400096228390691699e-01,2.026416460079129289e-01,7.408472646561323760e-01,-4.449609243341244857e-01
8.316032482269576365e-01,1.029198084545076108e+00,-9.306842967351738882e-02,-7.639697173284210052e-01,-1.493554120914599159e-01,1.409344586168324032e-01,-2.956994145374558514e-02,6.703404953331568161e-02,9.597835655951755252e-01,3.893435649565222256e-01,7.316453200090821118e-01,3.147682888923710176e-01,-3.558462430010088107e-01,2.655232557136173732e-02,-5.206286463685242394e-01,1.934922300802006223e+00,-6.915550057909841675e-02,1.005157712905588585e-01,-1.002955676141453617e-01,2.744964506587887348e-02,-5.913083807394554636e-01,6.160031532531476950e-01,-4.254878897487323619e-01,1.344096798899555301e-01,1.682258034189052287e+00,-2.333247865279917954e-01,2.204366531685059971e-01,-5.956129123349735988e-01,-7.529229187240347176e-01,-1.080655896759703527e+00,1.787021412946546151e-01,2.374079327399383654e+00,-4.267734392503983454e-01,-2.312922762509331265e-02,-6.348578278280777587e-01,-6.266267234692521892e-01,1.502973499678102343e+00,1.028184309860446843e+00,1.994185345349898109e+00,1.435101759715589287e+00,5.799109477714383676e-01,2.295272624613579060e-01,1.585971691248986293e-01,3.769406543986052183e-02,2.500885780567213557e-01,7.142880800399441510e-01,2.703480114860959738e+00,-1.336119382104121733e-01,-4.721176789330368273e-02,1.022515767864444758e+00,3.801013940373850097e+00,1.624159099152061803e+00,4.999809168187597797e-01,-4.305080176320682517e-01,-6.287304615567026467e-01,1.684550192492644261e+00,7.851509962429610301e-01,4.891977197291896839e-03,-9.431276596533065826e-01,1.852211518638239074e+00,3.926967606526174936e-01,-2.876992136096073738e-03,1.782751826730741285e-02,1.068579532806128940e+00,1.033103440016854613e+00,1.088895054934508333e-01,-6.038206007602167080e-01,5.065883632275276494e-01,3.608193168580740018e-01,1.128839913889265190e-01,2.383775538083463541e+00,-3.549372308117131336e-01,1.527107003312871414e-01,9.716758242417683489e-02,-2.402584854552817228e-01,9.450517443220320946e-01,-2.016887814991964734e-01,1.020139858834069102e+00,-1.096448931104075042e+00,-1.674959617050194860e-01,7.677059720101356843e-01,4.565027055016877555e-01,-1.677475956500436294e-01,1.481050508397133258e+00,1.174883565548820563e+00,-1.200476114430845120e+00,2.749210954036585552e-01,1.190927735506467799e+00,5.739987538226779540e-01,-2.232960177421604020e-01,1.871169354607601143e+00,-4.116960171327475604e-01,7.740495930960176185e-01,9.852691532511070882e-02,7.602053816418439247e-01,-2.658465945435519728e-01
6.507825641552802409e-01,1.208483252217641191e+00,-5.976515950894950580e-02,-1.226402406353030106e+00,1.182159034965140770e-01,-2.591062712362354747e-01,5.648561578869032429e-02,-2.761569708887345875e-01,-1.346482460436635442e-01,2.770453772536907167e-01,1.064822500860780119e+00,4.310171638457130361e-01,-2.331644887078995199e-01,1.259290102673526479e-01,-8.081504774760801535e-01,1.924192374980056464e+00,1.219300418655015483e-01,2.258726669638151385e-01,-2.522492456287974694e-01,-2.243891673511560492e-01,-2.502549600245869144e-01,5.145191047502177817e-01,-5.211836956209806582e-01,1.726386220139113081e-01,2.004226446727829014e+00,1.954385296812404804e-01,4.590039185754171136e-01,-5.507383217676242726e-01,-1.074015302042734987e+00,-1.546853137988508653e+00,-1.660393448762085278e-01,2.135153836726191745e+00,-6.733532063374008114e-01,1.857108890636102183e-01,-6.399340565394917579e-01,-6.051483855995226646e-01,1.315221698329346989e+00,1.087724616049728477e+00,2.648270789530205338e+00,1.339101405797854305e+00,9.994493822007011197e-03,8.867894073482840422e-02,-3.274272887614344818e-02,-2.515123193523303713e-01,1.389055261420529264e-01,8.024188559219785910e-01,2.395823945660813692e+00,-4.188338382276129979e-01,-3.900076423423988747e-01,1.334751737148070827e+00,3.168559228305709574e+00,1.529060437097003344e+00,-3.820406843734019953e-02,-4.456892252673078092e-01,-6.353754716894306487e-01,1.922233811462123576e+00,1.153595581024846606e+00,4.854260420133491571e-01,-1.181943285770586716e+00,1.753012308081418835e+00,1.344327272536189333e-01,1.732730096004269638e-01,4.735878215601203589e-01,1.487251393981252168e+00,1.352399451463121460e+00,2.861199993324354818e-01,-9.741563396479114845e-01,-1.961890018538920977e-01,8.453185656188741959e-01,8.194496161077277074e-01,1.740354329117644649e+00,-4.030040783569951990e-01,1.881213823255742934e-01,-9.815796415105412787e-02,-6.382702476580324191e-01,9.095661992863752765e-01,-5.922195086449515422e-01,1.416565552095258695e+00,-1.285984700832089045e+00,2.088546046177686133e-02,1.027299728441650517e+00,4.408957475578295648e-01,-1.231391651599811343e-02,1.688617713373272933e+00,1.608801224375695504e+00,-1.397368694120388888e+00,6.183820221251470350e-01,3.772422738412131160e-01,2.915392507323566473e-01,5.681693338664122184e-01,1.348962940878475125e+00,-5.624510894311429698e-01,1.417089243064566517e-01,-1.683032875133241291e-01,1.573223129744597992e+00,-1.818139012830289059e-01
9.296140626031053067e-01,1.558221131272769178e+00,-2.118536724167770502e-01,-7.109253403088874324e-01,8.296312165993718901e-03,2.701468340009443581e-01,6.576361465055258204e-01,5.402941093009219764e-03,6.399059253435592787e-01,-2.323863606968457896e-01,-6.121627373886889822e-02,1.098369542197273618e-02,-4.113663816252908778e-01,2.577621381555229574e-01,-4.238601188454628743e-01,1.171497151538649639e+00,-1.633833155699933037e-01,-5.509810987546805983e-01,-1.785765249541242383e-01,-1.256539443037394121e-01,-5.004605364534522316e-01,9.984023106180189844e-02,-8.320520123739582052e-01,1.887727703017177960e-01,1.771462376713052400e+00,6.433008441363763374e-01,-7.062213309760612123e-02,-6.046875858739843013e-01,-1.573034597096804266e+00,-1.419009577346106665e+00,3.404633286172219497e-01,2.149510704664729488e+00,-1.669497351223322434e-01,3.334634572619999404e-01,-9.704723698228241435e-01,-5.574509271251686382e-01,2.082568381853203032e+00,4.165635242928403814e-01,1.718915761851946611e+00,3.118580717437913208e-02,5.374761866694360846e-01,4.338214911504680860e-01,-1.731722742520404590e-01,2.585682677518545414e-01,5.822425550441417963e-01,1.043474501454768388e+00,2.214269240520460258e+00,4.787370581894567767e-01,2.541459814282941432e-01,4.345012884060471259e-01,4.127373445427114262e+00,2.078066602912931771e+00,4.062752467032032522e-01,-1.508960563429311008e-01,2.462765980676979716e-01,1.016348284914370348e+00,-4.180159652208614851e-01,-1.813400649310897006e-01,-1.152835621346633532e+00,9.774754500003367541e-01,-5.212392374331985545e-01,-7.598116559132978010e-02,2.996106262053586100e-01,-6.322096784491337829e-02,1.264384142409309186e+00,5.743845853435533000e-01,-5.857965695073658052e-01,3.550083151962679651e-01,-2.482824722973871467e-01,8.466407366366799359e-01,1.915478107018229847e+00,-3.219876022632159884e-01,-3.968347795321690574e-01,-1.438764445308371442e-02,1.604112777979160298e-01,4.087097637883808643e-01,-6.216027751774113597e-01,-6.447642473278480946e-02,-1.338552823387327173e+00,-5.352699208052142943e-01,1.120236821593896703e+00,-2.277128082382576801e-01,-4.387989316084230373e-01,1.781093715698335078e+00,6.610531757458250057e-01,-1.132381176543405088e+00,3.893345720022040601e-01,1.173418781477507666e-01,1.031532078005614084e+00,-8.579804387613347849e-01,1.169273198786063839e+00,-8.134227877495363579e-01,1.183272777181210156e+00,3.298852045039775693e-01,-8.309671795182895782e-01,-5.197880897531838018e-01
6.416207192684709737e-01,9.799258860852768649e-01,4.803156039981579806e-01,-7.362619569614351489e-01,4.078226305527985485e-01,-1.917435094949757057e-01,3.438819020052080733e-01,-5.937016140902685590e-01,6.575386045189035578e-02,9.155224709782476544e-02,1.326492476019170974e-01,-6.819439200419677438e-02,-4.857813990323636144e-01,9.745607938642049384e-02,-9.772802786071060899e-02,9.613930558949537186e-01,-7.726186851369807318e-01,1.736444748115937298e-01,7.613114700428880166e-02,1.935580158662646155e-01,-8.684258768391270866e-01,-3.130960844226244877e-01,-6.227337672912705013e-01,3.571958631828117681e-01,1.580969647970926095e+00,3.568715990648709813e-01,5.637667226227928152e-01,-6.607611144486722488e-01,-9.590200482067519072e-01,-9.536241877671862710e-01,1.726494161871383604e-01,2.423778406271806407e+00,-3.999484644251412035e-01,-7.453857177417805291e-02,-6.192394134720109466e-01,-4.928121097304598575e-01,1.118074353337246141e+00,1.154966002295425120e+00,1.733982771481377805e+00,9.302163042062987497e-01,2.083218488692563652e-01,4.494704645616171002e-01,-1.353876013472333217e-01,-1.609371993420732339e-01,8.324380340488943819e-01,1.031058716474448467e+00,2.339934594926611044e+00,-3.137785293024595301e-01,-1.103978568612872663e-01,1.289239494933504648e+00,2.994794955820811122e+00,1.191957575334759767e+00,-3.562866230638526144e-01,-3.430745866760315232e-01,-4.079460570909187456e-01,1.451857048397970695e+00,1.777384736813234500e-01,1.664884124013606692e-01,-3.788979701639998421e-01,3.856199177890877738e-01,7.392460974156015441e-01,-6.585585747840672077e-02,1.401546563241783949e-01,1.052659794472207366e+00,1.302468826613064401e+00,5.263426058015344688e-01,-6.503772322016305729e-01,7.570022706205408181e-01,1.178652227299358812e-01,6.169296900606382472e-01,1.615900464105784806e+00,-7.128226983350923751e-01,1.882407373926943961e-01,4.244062559153372050e-01,-4.404707714738000934e-01,1.269618540817066377e+00,-2.116266222009774989e-01,3.634853924199787922e-01,-8.687478219453756978e-01,-2.691328042555835021e-01,6.534850931872526747e-02,-4.014926380338300071e-01,-2.848364614217541169e-02,1.788109831514959058e+00,5.307545474747166203e-01,-8.639206791687538134e-01,6.921567026042291237e-01,8.616379810332280842e-01,4.996774360910726243e-01,7.059695746595746613e-01,1.034425094980975013e+00,-9.144068503531221914e-01,5.958283646265081224e-01,3.087819131657546512e-01,5.124886962358478071e-01,3.297820429406367326e-02
5.487806255718933324e-01,4.025971719948757688e-01,1.828219425439162049e-02,-7.343829177173653022e-01,5.773845273467446970e-02,2.050506290837962042e-01,6.546747632951659401e-01,-4.456849097003878768e-01,-1.761444890029882915e-01,3.560066480754126017e-01,9.016565626154215973e-01,3.035545827032967714e-02,-3.395799128770714548e-01,-2.790109259331811226e-02,-5.535107252600780514e-01,1.509201939567470951e+00,-4.718181995473038626e-01,-6.460905825067225772e-03,3.085188801292492594e-02,-1.104712122794467705e-02,-5.266345422658644804e-01,3.372227562772121545e-01,-4.502730322059806944e-01,2.766453557660460971e-01,1.802578997880814660e+00,-1.308602634862317954e-02,4.291368928083785228e-01,-6.842363228417908116e-01,-1.105398509797413054e+00,-1.272677504007374560e+00,1.594786092700787861e-01,2.465460477054878918e+00,-3.363322626238747226e-01,2.443628471420337123e-01,-5.589191820571492997e-01,-6.172298439160958106e-01,1.190998576954819921e+00,1.076006779364403920e+00,2.447811023464823155e+00,1.341094134895724377e+00,3.081680451264742215e-01,3.476319038666582095e-01,-1.360362193895415239e-01,-2.317548689444153820e-01,3.868524479699196883e-01,8.137454210278778355e-01,2.137671605157275057e+00,-3.827696660373034465e-01,-6.081309519552370590e-02,6.879812225797139469e-01,3.538196380435903343e+00,1.796776714977075029e+00,-6.126083392306236330e-02,-4.833187425487025513e-01,-7.119417385700106404e-01,1.847967702869073969e+00,8.367254266134849239e-01,2.050348271817360180e-01,-6.109095134823642193e-01,1.814843152059648856e+00,4.820580309096832439e-01,-4.731266733049738216e-01,1.531486374871322310e-02,1.026404088002347059e+00,1.128779585784430051e+00,2.523441629588519253e-01,-9.275201902991383474e-01,5.135904186479713918e-01,2.463250660352385157e-01,7.657698961140960714e-01,1.835818764991004493e+00,-2.480839252258065786e-01,3.867419843349084174e-01,2.949363672444730300e-01,-4.001359251173003395e-01,1.033502621720990167e+00,-6.397127905090149724e-01,8.412014370570354282e-01,-1.017585632691210940e+00,-4.012819726675830867e-01,5.136733957058532418e-01,2.010571361450532168e-01,-1.639310693524541340e-01,1.878884925680196272e+00,1.053976956660275244e+00,-1.363570261478484147e+00,4.531287737899180046e-01,9.068184390105961112e-01,5.869097622641541445e-01,2.544461164289474886e-01,1.320582982781901338e+00,-2.920859812081277318e-01,2.334512578034403374e-01,1.926797178217860285e-01,9.825392064617126664e-01,-3.746863022767833451e-01
9.775329047442820052e-01,2.081402918255657930e+00,-3.342111576328316014e-01,-1.223871643884808513e+00,5.409456743626119002e-02,-4.126888810042835254e-01,-5.613604485812893063e-01,2.168639090128962055e-01,4.629436313165327110e-01,1.864617209288824684e-01,1.149711452784532684e+00,7.431728431347434105e-01,-1.685069163372691914e-01,4.667845610495097719e-01,-8.466586852186014367e-01,2.524528446136611315e+00,8.281291226929619054e-01,6.524822617552919479e-02,-3.433339391364628179e-01,-3.083164012082202365e-01,-1.251379185658751947e-01,6.331779387103561030e-01,-6.260489074324346870e-01,1.262259993514568135e-01,1.833708937690979424e+00,3.536920289454632826e-03,2.503422269574440695e-01,-3.861752608774022266e-01,-4.196531142134534154e-01,-1.295918779124670461e+00,-1.484253018664257739e-01,1.687574176046929608e+00,-6.835390314343475771e-01,-1.120137755761271559e-01,-7.739643579852391042e-01,-7.893753066180011491e-01,1.509358069210779973e+00,1.039463473587811215e+00,2.158751199503812668e+00,1.132419919323675028e+00,1.653856825972377376e-01,-2.205804843234649426e-01,1.036171469194292483e-01,1.593030612501634136e-01,-1.691282051806998199e-01,7.959071332576166391e-01,2.819544251796173295e+00,-1.725052294453395807e-01,-3.936147223767764713e-01,1.928205832818939314e+00,3.493528329574842495e+00,1.122418900158663080e+00,4.575419932347601359e-01,-5.013100566555123150e-01,-4.104344230795238246e-01,1.619327257494208805e+00,1.012071653980989527e+00,4.488993444537534572e-01,-1.634111667035682780e+00,1.394373444796516370e+00,1.030241525023961324e-01,6.128531147772766641e-01,5.064424253624760786e-01,1.410228361567566591e+00,1.002892898523811249e+00,-1.393960509020912841e-01,-8.002882819509129497e-01,-6.029802720231601798e-01,8.189560402054911759e-01,5.082879191323723678e-01,2.342017491160355291e+00,-5.185944830351727486e-01,-1.639408622154610029e-01,5.138401588553581645e-03,-5.755467811987461380e-01,1.051070275247682373e+00,-1.965258858498101779e-01,1.730697160344846219e+00,-1.059440309193356189e+00,1.472479851171197840e-01,1.425778861441622691e+00,6.268900285648992821e-01,1.328678456397204832e-01,1.084925018181975176e+00,1.768103513823600537e+00,-1.101177562546852062e+00,5.192433367458669791e-01,3.702345697635711641e-01,1.704065875555074161e-01,3.664451400444280194e-01,1.687038283781421288e+00,-8.487962927241878841e-01,5.838044715247968641e-01,-3.757561655801427425e-01,1.684998774194417459e+00,-6.479865195690548418e-03
8.022230732829442879e-01,8.773388032241364876e-01,-4.471236025688833382e-01,-8.046934505204625943e-01,-2.837877059814817304e-01,2.891103731221414952e-01,1.391387402992363964e-01,1.550817458929815706e-01,5.617963451407940179e-01,4.757315728061977111e-01,1.311175161525834021e+00,4.216526986657007092e-01,-2.220594144706551087e-01,9.404205923234278119e-02,-8.521556520492489240e-01,2.365161056444409216e+00,2.992550283916654563e-01,-1.059613550306587743e-01,-1.413416152424797900e-01,-1.747327802230147220e-01,-2.714273561319158756e-01,9.433970799467794599e-01,-3.923552890281839511e-01,1.189589775607357292e-01,1.820252675831123046e+00,-4.011116935881818280e-01,1.437567760312514764e-01,-5.636942095681826137e-01,-7.265407991789596398e-01,-1.286515426945780805e+00,1.343522167751585172e-01,2.207216611702431663e+00,-3.879308213345445400e-01,1.582132701918835815e-01,-6.361809775498706854e-01,-7.731086446676004309e-01,1.512178917105733600e+00,9.745863683064686089e-01,2.433951914379397508e+00,1.530009227428564600e+00,5.490359585592051728e-01,6.235262940661617792e-02,9.169245272689423298e-02,5.103900775595274220e-02,-1.104256549284522437e-01,6.296265227042270318e-01,2.533135698360904353e+00,-1.767771855413978743e-01,-5.909405228012439004e-02,8.337089760055446108e-01,4.108466821811897596e+00,1.864340768592217312e+00,6.378375960468638528e-01,-5.534356810347020872e-01,-7.302635860276788238e-01,1.864092975086515391e+00,1.161092582761710901e+00,1.318602176495273504e-01,-1.195085470804483352e+00,2.516274511310947481e+00,2.126419584338007929e-01,-1.952535736686167034e-01,1.318475024245416814e-02,1.038469814450535988e+00,8.519803227823142810e-01,-1.618908653768284522e-01,-8.452870128423789486e-01,1.061723403215424355e-01,4.356877563941259912e-01,3.780098134879867344e-01,2.509024893148758206e+00,-9.634623011607557075e-02,1.949662830195166840e-01,1.056103982939902708e-01,-2.829557751230242779e-01,8.822943201962681892e-01,-4.849989594159117567e-01,1.410846116237086001e+00,-1.087601415675503613e+00,-2.535367971967665834e-01,1.156323982386561200e+00,7.994885505115902902e-01,-1.711333369405337312e-01,1.437753616154468617e+00,1.558249678515008618e+00,-1.448342943543840633e+00,1.904125882426230543e-01,1.011146150590136239e+00,5.523567127149060507e-01,-3.376347002754064297e-01,1.933161098171317871e+00,-1.457443530069003623e-01,4.993842146821432793e-01,-5.580915393343799380e-02,1.234380386835485233e+00,-4.644170500002939850e-01
5.417493703761655510e-01,8.766033263481445292e-01,4.672326200581784494e-01,-1.465391576859881972e+00,-7.318132768159210655e-02,-3.289317619533250192e-01,-3.571370605344263427e-01,-3.070650920613573476e-01,1.027131384875062503e+00,5.453237778911370626e-01,4.511765675315403401e-01,4.603120099896251260e-01,-4.172848895663693880e-01,-4.937394984367866058e-01,-6.126790785117028904e-01,1.526701359891854626e+00,-5.367052177208584407e-01,1.050768286382664840e+00,-3.881727511598224156e-01,6.446083248169619251e-02,-7.005803012314294476e-01,7.745308837194865292e-01,-2.400241288429764697e-01,-4.047517148984550173e-02,2.130992643729928027e+00,2.200356547391933704e-01,5.913275155397184069e-01,-6.911403993882454522e-01,-1.664833870744113709e+00,-1.665667566522798015e+00,-2.931304779442891473e-01,2.889032378058474571e+00,-1.009967953556808018e+00,1.403626645927159022e-01,-4.858701125927125108e-01,-1.683018078545700513e-01,1.462064224389969747e+00,1.215513640429419340e+00,2.713553492861842109e+00,2.102657909241552936e+00,1.061381483377739632e-01,4.681637673140767175e-01,3.606449845431925483e-01,-6.482211421072927582e-01,5.621829015926138595e-01,6.180554853918189817e-01,2.833911239178929620e+00,-5.418257976230818063e-01,-5.203319213789184827e-01,1.149313764007248162e+00,2.644236749407776088e+00,1.769564160031696476e+00,-5.925844868733076698e-02,-1.923899044914565981e-01,-9.936426703201619581e-01,2.282419923909495996e+00,1.459158094776508818e+00,2.533675504991909078e-01,-9.294316930678840905e-01,2.349119626248709292e+00,1.141466013330255796e-01,4.984952657222448957e-01,5.488864844924912223e-01,2.081884792555965813e+00,2.048671154457321286e+00,9.893334354683374077e-01,-6.252447181840156132e-01,5.910403632930376627e-01,1.398719174410566257e+00,1.820072252047127970e-02,1.484598771563600206e+00,-5.555725719998714229e-01,4.631308434121900741e-01,-8.317570440479156169e-01,-5.934581215737341209e-01,5.026093743956094873e-01,-3.734927388206041310e-01,1.278302872896604603e+00,-1.986215887685360393e+00,4.572960489810447005e-01,6.290757705126395205e-01,5.550924623907088629e-01,-2.263700082854375462e-01,2.106947863000143251e+00,1.600940601607677038e+00,-1.610019419383938555e+00,5.774232055098648120e-01,9.679941907189270056e-01,3.537758627023790403e-01,3.509732489186710436e-01,1.764482165492391008e+00,-3.672115572182110821e-01,2.829908959436236993e-01,-6.902352817450940758e-03,1.133346124109140929e+00,-1.349537148642157014e-01
1.015875364735283171e+00,1.446656590552728439e+00,-4.239259736313109594e-01,-5.526893381897010071e-01,-1.285287814634810399e-01,2.863086470626942104e-01,1.870243576575913724e-01,2.647851021502328761e-01,8.152896124818931334e-01,1.183859254775227604e-01,7.000102159017334014e-01,2.632497713933802386e-01,-3.097179777376148913e-01,3.758764932022003458e-01,-5.326281235799417146e-01,2.022027211793225643e+00,2.850981936701756925e-01,-4.818398350246209660e-01,-6.427550602997122997e-02,-1.001596023091848586e-01,-4.263735056363871512e-01,4.516149122791691672e-01,-6.471389686341094682e-01,2.045381934444291949e-01,1.562133844738519795e+00,-1.370652315823592537e-01,-3.128020545198187397e-02,-5.195989035729782213e-01,-5.703116042637527139e-01,-9.943154439254986432e-01,3.583411057988873383e-01,1.979367536183031628e+00,-1.645935320004125457e-01,4.455975197515532615e-03,-8.225955648355604000e-01,-8.214215089588210450e-01,1.723213652170976662e+00,7.614369726733082322e-01,1.660609122249982583e+00,7.173852971019650804e-01,7.060220820963755139e-01,1.066933619420858959e-01,-1.185816310154591199e-02,4.117722577973313980e-01,1.235554017466543586e-01,8.489641539413669280e-01,2.550838302512517863e+00,2.218690335336958031e-01,1.752660232778383564e-01,9.407389352381309022e-01,4.350473324211955095e+00,1.638798606166418148e+00,7.386810229192648514e-01,-4.546262252409167259e-01,-1.891286389435973825e-01,1.242214170914200499e+00,2.208950083515405782e-01,-8.517462554108656825e-02,-1.167430551425961749e+00,1.386390916560230835e+00,1.527350273901306732e-01,-1.051643813989700249e-01,-2.703064224017313888e-02,3.829440020774096953e-01,6.826706211484924181e-01,-1.627777060056894709e-01,-6.159077329125688394e-01,2.217238953390270328e-01,-1.411079199384769611e-01,4.060086962793183485e-01,2.636982721812780373e+00,-2.771561243516776352e-01,-1.986523944507945783e-01,3.928199152423251794e-01,-2.305989415024652101e-02,9.550063173542014949e-01,-2.537801521202135424e-01,7.462861087980720010e-01,-8.266960078559700831e-01,-4.627812895009150718e-01,1.085226080882560007e+00,2.866382721700546643e-01,-1.830387653309304141e-01,1.234921025817809159e+00,9.878015496551607599e-01,-1.015805578631479911e+00,2.081476444660702863e-01,8.299383929413085559e-01,7.348705848743992686e-01,-5.988442053788457509e-01,1.719392164383329202e+00,-6.036814968099752932e-01,1.078615292305716844e+00,1.163593954557265164e-01,2.946789924389121573e-01,-3.641721757783685787e-01
8.508172841737879910e-01,2.082444953366211493e+00,-3.668912800009198616e-01,-1.163405001372851855e+00,3.166480793982391351e-01,-1.740492094308689341e-01,7.079073956189789740e-01,-2.218353074401267500e-01,-6.102443191962274582e-01,-4.664636395827087556e-01,3.920592480044707839e-01,1.994650822569648818e-01,-2.283699026549628752e-01,5.856514129203765906e-01,-7.839773280799507971e-01,1.356983682887302978e+00,3.598578664776020397e-01,-6.599199421021193501e-01,-3.511084864045979081e-01,-4.890328277605826557e-01,-1.612122927058590172e-03,-4.507054452116537879e-02,-1.040884617054158578e+00,2.570055074287902475e-01,2.060542240197812625e+00,1.103723108339933701e+00,8.011729819759874638e-02,-4.859985443165494856e-01,-1.693992110978234766e+00,-1.863314365872257961e+00,7.125688155913523225e-03,1.615314650345816005e+00,-3.557116099512168672e-01,5.170409253094133684e-01,-1.064443695739877960e+00,-6.618793495092640811e-01,1.952682958876369890e+00,3.976689661119251484e-01,2.272761429178973280e+00,-3.602437546306520577e-01,-5.237052937942465736e-02,1.394004969061984900e-01,-4.359097880637228806e-01,1.471509187321055068e-01,3.136230175480667626e-01,1.188714192346099319e+00,1.882569341060432944e+00,3.053171055528209887e-01,-7.073685190821128732e-02,9.147484468147698555e-01,3.665972970301711875e+00,1.865576160938352546e+00,-3.150218807036481161e-02,-2.108761173636119202e-01,4.234388752521645038e-01,1.083907750617865595e+00,-1.869697275653428026e-01,3.561448600056247304e-01,-1.604383292886293777e+00,6.327549447116065373e-01,-8.789113460487267826e-01,1.653805724296870117e-01,8.056959201113993441e-01,1.777211097844705323e-01,1.399692829443757169e+00,5.483307032148680982e-01,-1.004326341327752559e+00,-6.762789059449983986e-01,1.275576617094971721e-01,1.722513189771806230e+00,1.406315148130573345e+00,-3.658586201601338739e-01,-5.425394723051415458e-01,-7.698880576330366377e-02,-2.295209527535143068e-01,4.376651772881164359e-01,-1.012000503942362517e+00,4.087731723000947448e-01,-1.376128901371117319e+00,-4.039602715288242440e-01,1.620698942662398334e+00,-2.483674755579376447e-01,-2.149367124047940059e-01,1.784812204871847996e+00,1.150977475089320468e+00,-1.230629217749265703e+00,7.424973179714234872e-01,-9.469300815401775484e-01,7.167884026373423367e-01,-7.844546634599003365e-02,5.816099599146162813e-01,-1.106560857650074947e+00,6.210069431675304674e-01,-3.146633573783086391e-02,5.161125689725712395e-02,-4.162665422082227895e-01
6.178838372327564166e-01,6.207212082527702179e-01,4.104286110893980155e-02,-7.437173510686947431e-01,3.517733271016131036e-02,2.331229625839845720e-01,6.789309913143124486e-01,-3.697799913129369842e-01,1.287690081821379895e-01,2.149631971884874149e-01,5.288781961540994780e-01,-1.192428075302161272e-02,-3.905438644758258970e-01,-4.092216875436668899e-02,-4.786744139388321995e-01,1.292183522348939961e+00,-5.335314305883878117e-01,-6.790380633387058107e-02,-3.029827001375577644e-02,3.222401452810594313e-04,-5.883415293832761073e-01,2.670344783712164105e-01,-5.259463383993656649e-01,2.366813174898845240e-01,1.815705186363336665e+00,2.056567849000060788e-01,3.174351597336838027e-01,-6.932239243812539087e-01,-1.366749548471567266e+00,-1.342397547111405132e+00,2.041025765797437053e-01,2.498376137630379468e+00,-3.150411490010003868e-01,2.907131950438875956e-01,-6.513160570736362676e-01,-5.345625334509084281e-01,1.447062594019903559e+00,9.000612810667670827e-01,2.270876571895211526e+00,1.044856212199544609e+00,3.737966715500007364e-01,4.488566178069244295e-01,-1.219887637983118472e-01,-1.663334321614756139e-01,5.307935656466222785e-01,8.676008115404331145e-01,2.162525569817728144e+00,-1.630401525118783945e-01,2.412340998647952151e-02,5.351515451098582954e-01,3.623141361108154435e+00,1.938406641546708498e+00,2.010117866736427228e-02,-3.516724458656833030e-01,-4.832544974189879605e-01,1.660350803845983325e+00,4.934666315487426513e-01,6.508090792135662328e-02,-6.865819174074762055e-01,1.638759301600865914e+00,1.970236966756817865e-01,-3.695593295673137435e-01,9.822783798909508202e-02,7.651719297690360300e-01,1.274018504900566784e+00,4.660406164057432354e-01,-8.020755033037840764e-01,6.041534017061220840e-01,1.466491706187738053e-01,7.347765784633234487e-01,1.771374931709982947e+00,-2.799128990009461249e-01,2.177665817902426082e-01,1.272632890836263297e-01,-2.325923167243215128e-01,7.994941590489240690e-01,-6.441104221904314642e-01,5.095415134280123493e-01,-1.199264731504819492e+00,-4.135922659230566456e-01,5.959085744928460660e-01,5.247125063694084435e-02,-2.816410583395732581e-01,1.954090451331038203e+00,9.021464132985999029e-01,-1.336579030282701197e+00,4.413621651010326552e-01,7.428120368752648695e-01,7.402583584543703799e-01,-7.405818004973502289e-02,1.279271035670633383e+00,-4.046315254095056990e-01,4.933002079032104970e-01,2.786198314445698654e-01,3.713816363284626054e-01,-4.260479636869310971e-01
5.927582882253159546e-01,3.260413861984663431e-01,2.969894728143296359e-02,-5.867368637077114979e-01,1.549457446021164364e-02,2.670265001920089087e-01,5.469714178736875265e-01,-3.684064167890862551e-01,6.253885689740379394e-02,4.411701651249968492e-01,9.292765445261186308e-01,2.515870208102310990e-02,-3.618800869448076107e-01,-2.635016787504891600e-02,-4.613617392925472571e-01,1.609154508655231464e+00,-4.937380880743012512e-01,4.330808288198831346e-03,1.106034669482172106e-01,7.914906442585649404e-02,-6.292228841282163643e-01,3.534756005757221931e-01,-3.983497959825191281e-01,2.903656407066210754e-01,1.664935950665916931e+00,-2.429427690479654955e-01,4.194836982069810594e-01,-6.832502006141787376e-01,-8.151078847680423012e-01,-1.044602928252985841e+00,2.435990320435806877e-01,2.499955960876977468e+00,-2.807024690600982697e-01,1.057830371713493478e-01,-5.178205699037196075e-01,-6.640534185374870058e-01,1.112163615278000117e+00,1.161286007932813558e+00,2.246268681496341735e+00,1.491108107599725008e+00,4.494431167754623369e-01,3.317588106291072814e-01,-7.317082350946786662e-02,-1.518891864599322128e-01,3.717972840685708769e-01,7.754399530641225002e-01,2.266480226443140289e+00,-3.966479229234122217e-01,-6.973019208927760948e-03,7.643431736760293305e-01,3.649106606272430220e+00,1.669043441174561826e+00,5.989868081447591308e-02,-5.389413281447792414e-01,-7.982438807230196609e-01,1.826061274374409127e+00,8.431906765477488186e-01,1.248500925277054308e-01,-4.940985508498189072e-01,1.790513022212529615e+00,7.442423201074918060e-01,-5.194877860017115268e-01,-1.586653446329450157e-01,1.044129147032619276e+00,9.521211680008854206e-01,8.773064611757763753e-02,-8.420821910557352297e-01,6.912493932985206424e-01,1.410922569282515304e-01,5.238595550577764826e-01,2.081917145719604623e+00,-2.680999267170621203e-01,4.334952100132600239e-01,4.610370343482503852e-01,-3.689202079199753737e-01,1.201730384641388039e+00,-4.502249358758390052e-01,8.710398921565394303e-01,-8.366450908953374510e-01,-4.298793316522134811e-01,3.615444482475936305e-01,2.410671784354531111e-01,-1.279160918925764667e-01,1.734172517349064080e+00,9.604702787614350923e-01,-1.254219426097172629e+00,3.697684177635184866e-01,1.252603021826098839e+00,5.754890993054984083e-01,2.205520548806881309e-01,1.500940684719995311e+00,-2.567560415978670241e-01,3.471984875452861496e-01,2.297275708816024498e-01,1.024581850804413552e+00,-3.228971648362213842e-01
4.563472316632818382e-01,1.645602020599258308e-01,2.844375870821154173e-01,-8.446598432812140178e-01,-2.398475608558402195e-02,2.503016363643221220e-01,7.033927364098931934e-01,-5.409992747388079337e-01,2.680548185054487664e-01,3.948624913781116907e-01,4.374583792697223084e-01,-6.489223362254392669e-02,-4.510519589875590651e-01,-3.681653946057366622e-01,-4.494498738424457795e-01,1.072712902161612414e+00,-9.352771044656582600e-01,3.000711319734251092e-01,-4.483882494558277115e-02,1.109299916959538834e-01,-7.460939248178288796e-01,3.860400127420637872e-01,-3.615660372736959061e-01,1.777698539051799087e-01,1.927098118107264169e+00,1.932600890210272593e-01,4.578297556319190775e-01,-7.885368218281347819e-01,-1.706391131571578068e+00,-1.464861108866858608e+00,1.274100419432932507e-01,2.891084108167099931e+00,-4.493293450328630922e-01,3.638644610336921326e-01,-5.253550407257114863e-01,-3.503253764195815578e-01,1.370398057570443084e+00,1.012335584728373261e+00,2.539584827623096341e+00,1.498933710984341694e+00,3.371125252723299881e-01,6.366714090552754168e-01,-2.035866962790338491e-02,-4.602434050349204497e-01,7.042848408907105284e-01,7.742479123895283921e-01,2.185118661066312029e+00,-3.551860652795263973e-01,-5.680158568407946140e-02,3.257022520469442517e-01,3.321875555899767463e+00,2.127211946466914139e+00,-1.473786239801186948e-01,-2.886615519904758842e-01,-7.659169432759722618e-01,1.963991212327352187e+00,7.972748288389538418e-01,4.537839002698920710e-02,-4.636749907506790280e-01,2.089125346423971852e+00,2.634367687055253482e-01,-4.152597813688001516e-01,9.858267036152434937e-02,1.100355784133705273e+00,1.588144536557628772e+00,7.734724637026397787e-01,-7.810958770977035615e-01,9.525908297553726811e-01,4.135154636248113413e-01,5.543925137979994755e-01,1.523555084476608368e+00,-2.727309528276150030e-01,4.807990041711589502e-01,-1.395724276072443371e-01,-2.926137869702543637e-01,6.644530279600876499e-01,-7.022264009418525132e-01,5.086605812395417203e-01,-1.483835254210539967e+00,-2.814097587163958414e-01,3.428230326250849558e-01,1.216147927990386401e-01,-3.693914536824943751e-01,2.265048724318706519e+00,9.417946024417158668e-01,-1.538338023753689443e+00,4.533843968506428013e-01,9.972685120751032528e-01,7.471514861265249330e-01,-3.305267436301384532e-03,1.356983779367001874e+00,-1.893378777206485841e-01,3.098423493895345882e-01,3.565771977792879244e-01,4.079576720016508395e-01,-4.601976612069884065e-01
6.996564842378847349e-01,-4.655256851284587105e-01,-1.849915206409057933e-01,2.255257463219173530e-02,-5.117474895460863982e-01,9.991527551525078987e-01,6.163814770181640368e-01,5.813110076733463139e-02,1.245441103754809431e+00,8.396042725119347017e-01,1.030123748285666663e+00,-9.289237198558622510e-02,-4.454220722467581717e-01,-3.037818330184298699e-01,-3.272661175655696697e-01,1.921880911405159598e+00,-7.008658179603466376e-01,-1.345932071187861123e-01,3.295263224164799443e-01,3.410776540827405445e-01,-9.299805853395566313e-01,8.610694975158615927e-01,-1.043320885940791642e-01,2.121644965978841946e-01,1.365650933774778863e+00,-1.108402927137662308e+00,1.342487992415702935e-01,-7.808464994008301741e-01,-4.263783582550154660e-01,-5.756530729773554622e-01,6.617442565317316339e-01,2.934670356331825047e+00,4.521121228080188237e-02,-1.027421954856827524e-02,-3.975738556569153870e-01,-7.482697899124211016e-01,1.235314958906057914e+00,1.162557685036292643e+00,1.894099814038182394e+00,2.085240985271839875e+00,1.213975698264553316e+00,4.768513345420187788e-01,1.883844843748789244e-01,8.153440035498479843e-02,2.833834557625352080e-01,5.033326965649954632e-01,2.545382117865683469e+00,-2.185975768208660575e-01,4.181626623678574295e-01,4.906076515356994072e-02,4.639091805542686409e+00,2.082234461357871158e+00,8.188653835670743897e-01,-6.408305163254599535e-01,-1.132262072128450425e+00,1.880833727130338584e+00,9.221216274562062942e-01,-4.312641906475471743e-01,-1.688310391957710266e-01,2.830866788126268130e+00,1.135369127986431970e+00,-1.050307173225391466e+00,-8.810031504675819303e-01,6.791428054754288235e-01,4.460049292388621467e-01,-3.084598612266747919e-01,-5.523200364794272899e-01,1.570191721078889158e+00,-3.409583049040461056e-01,-3.555017964140274600e-01,3.000878860745894272e+00,4.974520523588699117e-02,6.499707590630533494e-01,6.903265971182717120e-01,8.169241643512999140e-02,1.222853681179988605e+00,-1.683617298685740615e-01,7.251661541514139442e-01,-6.290702074212666250e-01,-7.238233003332101845e-01,1.077857894995382093e-01,6.368279159323817495e-01,-3.682467390819982866e-01,1.561903093295601286e+00,7.086461524130576173e-01,-1.307531983130715947e+00,-1.947391211970854186e-01,2.512061486857063208e+00,9.266646273962801938e-01,-8.636703504257130515e-01,2.359872289378265542e+00,3.732851906730623170e-01,8.174699124097702940e-01,5.169371355803005219e-01,4.838245767677974429e-01,-6.264033057773028546e-01
9.680129667170344065e-01,9.860942205172418262e-01,-1.552132626168065688e-01,-3.081475870229899439e-01,-1.491124037450561324e-01,3.564532284338134405e-01,3.455541581969739928e-02,1.963622672750362508e-01,1.196403968245445260e+00,3.674905949341280564e-01,6.450982904029950449e-01,1.628896604111347846e-01,-4.076959075845635327e-01,1.975055203923257729e-01,-2.618294320078184967e-01,1.956247457900870845e+00,-1.126981186965048121e-01,-2.133494829283123506e-01,1.275969662106086200e-01,1.787742653268057647e-01,-7.719628710842328934e-01,4.033122373435154007e-01,-4.665938728505854005e-01,2.406962780984416295e-01,1.327396995234832122e+00,-5.407903330810737152e-01,1.091961585110324956e-01,-5.839062071418386068e-01,-1.775514539683749060e-01,-5.681934721652448506e-01,4.752586239705630655e-01,2.288586964054446060e+00,-1.327945627892341274e-01,-2.539904606210792171e-01,-6.478585371528664538e-01,-7.936157229539451130e-01,1.414231167764188335e+00,1.050929137038072891e+00,1.384651516089214551e+00,1.250407817918171682e+00,8.981659971817121946e-01,2.102483660812169419e-01,1.269891553772694581e-01,3.555954801151437472e-01,2.792226554737694544e-01,7.625140412460389427e-01,2.766646296400078420e+00,1.654043858420094909e-02,2.116069314775517185e-01,1.047255412473406810e+00,4.239274972275646647e+00,1.390273349186713414e+00,7.260769784331593257e-01,-5.324624080834482465e-01,-5.275804990640761138e-01,1.363892546622438751e+00,3.577382489213594141e-01,-2.129889855765880469e-01,-6.882208736685614392e-01,1.369338596841048084e+00,8.291374678181027136e-01,-2.449921569642021790e-01,-3.700308010447471707e-01,6.584992713672457310e-01,5.389788347723483142e-01,-2.703942993982113574e-01,-4.512110482230033415e-01,8.240736985959458138e-01,-2.205626236956344521e-01,-1.096213565805291834e-01,2.867254296615660891e+00,-3.757271669404941838e-01,8.244805283062055234e-02,6.499461511928126267e-01,-5.464425909286125399e-02,1.307566317814862433e+00,1.027519692054980616e-01,7.404023655351209543e-01,-5.638924771784102896e-01,-4.532535799837679735e-01,4.885654080445613889e-01,2.807942929348525296e-01,-1.198603028170890927e-01,1.165848312743935855e+00,7.301174230736156012e-01,-8.554525816992115672e-01,1.205552838718100539e-01,1.655265654310717593e+00,6.789176281952225001e-01,-4.153300727898524558e-01,1.996696512711606530e+00,-4.787982241787284710e-01,1.137266267944000875e+00,2.620115122672245223e-01,4.451662442310722057e-01,-2.155349611200262916e-01
9.119663107179478700e-01,1.424433833262389815e+00,-5.546518610469653998e-01,-8.952395044641153765e-01,-2.608396134832841051e-01,3.769331093424223567e-01,5.442159221015632209e-01,2.208423218824677181e-01,6.470975585386762319e-01,-7.645714043727824816e-03,5.763956293027803213e-01,2.716190334603473810e-01,-2.724072245472786147e-01,1.860714353141821320e-01,-8.388488490895635863e-01,1.795553268936561420e+00,2.805298037128822197e-01,-5.108265970623917518e-01,-3.196484001726511148e-01,-3.217026580885414266e-01,-1.865782889007184808e-01,7.051207463535725806e-01,-6.882242365807060835e-01,7.022806697657212049e-02,1.987657693063660469e+00,3.604548686113475120e-01,-1.485286265679507667e-01,-5.714448786335015740e-01,-1.591313472691680886e+00,-1.704176771751576114e+00,2.026473179774990474e-01,2.100414497111279921e+00,-2.781827815975627671e-01,4.892511360837589751e-01,-9.300412363959068562e-01,-6.343410924484175206e-01,2.165410171939382344e+00,4.122003278927268699e-01,2.286440638308568474e+00,4.725652941472301416e-01,5.371578390927659319e-01,2.567868339111040177e-01,-7.158668996159456288e-02,1.937922855375215914e-01,1.508402723333946982e-01,8.415147285743634908e-01,2.262545657638456831e+00,3.861736762081654506e-01,1.486383075448666491e-01,2.954981388068000925e-01,4.370868912473066636e+00,2.378148028452841789e+00,6.841713296903157993e-01,-2.476983323017535044e-01,-2.047055012709081412e-02,1.378305611593199309e+00,2.681833898906541558e-01,-6.750177856268199661e-02,-1.522776040646355522e+00,2.079717387568992049e+00,-7.636053483930298480e-01,-8.630991753122160826e-02,3.489976599098406629e-01,1.914443662804997670e-01,1.213613573102678922e+00,3.628403346045106503e-01,-7.621989881774505760e-01,-2.832026278545851650e-02,1.295537574810023129e-01,8.283455330675927319e-01,2.118542715767157247e+00,-5.802072863147672566e-02,-2.906705467468578274e-01,-2.781396371905950904e-01,9.109504875466105378e-02,2.160464133179559321e-01,-8.337121029071195011e-01,5.767786491520699999e-01,-1.550859291114791150e+00,-4.190771762240316223e-01,1.602927063779248762e+00,3.710250918655102481e-01,-4.701046734322488208e-01,1.735376666571189386e+00,1.282050065448071985e+00,-1.502422113902530221e+00,2.477909503657104717e-01,9.706650654543713674e-02,9.567468879029243922e-01,-1.074913756806588294e+00,1.504778413700719852e+00,-4.306668520278795209e-01,9.111721809228732205e-01,9.972294927068853232e-02,-1.962163960068952773e-01,-7.153784296165865975e-01
5.971245201928427893e-01,-1.612799609614198326e-01,3.512097724797956788e-01,-4.227650344161181239e-01,-2.417656638653077894e-01,3.846766620094975164e-01,3.166946917973562092e-02,-2.078296414717307194e-01,1.294661970343879975e+00,8.762281379847497442e-01,7.568023707923386967e-01,6.661420815864578515e-02,-5.053386374314186025e-01,-4.455971364758460340e-01,-1.949765045431104127e-01,1.695245205190806015e+00,-9.201439939302928916e-01,5.856333442262631195e-01,2.018628758960012703e-01,4.478187985152443096e-01,-1.105966507215670580e+00,6.598602849915722324e-01,-5.587245987241223899e-02,1.753855637253868005e-01,1.462995440954590443e+00,-8.379862292822183312e-01,4.982403585680048597e-01,-7.716633178822821515e-01,-5.023083014232839760e-01,-6.302238152493783163e-01,3.285213434799398313e-01,3.072462540159895283e+00,-3.884203737496103592e-01,-2.193464428257304588e-01,-2.945529399796622538e-01,-5.100365353080955622e-01,9.831761528593777610e-01,1.474935283966018584e+00,1.955269074280659547e+00,2.462570910575994532e+00,8.240380494161394509e-01,5.075688893138563529e-01,3.354654361821145514e-01,-2.594489940580480547e-01,5.311951828251160190e-01,5.266857192035094837e-01,2.836322082806452372e+00,-5.708754734836615219e-01,3.933892482138920399e-03,8.039207422726328822e-01,3.579297896375959631e+00,1.564032296162131352e+00,3.379815957919213298e-01,-5.408243356481069464e-01,-1.321207060435904745e+00,2.108027867427349378e+00,1.226477118460202131e+00,-1.692116643358815287e-01,-8.332632831958375341e-02,2.333406468425765823e+00,1.357394653050953748e+00,-4.553373545087118224e-01,-5.248629307294606638e-01,1.557141440220509043e+00,9.700824016324639532e-01,1.048366437824302111e-01,-4.730114187368942291e-01,1.556877365131711821e+00,3.289488752090682366e-01,-5.438287470355331887e-01,2.509913748863880745e+00,-3.625462166506618900e-01,7.803724718780885583e-01,3.598163236358499772e-01,-3.092483182259931906e-01,1.337284404034218221e+00,8.594114706118660685e-02,9.948123434326703318e-01,-8.763175074736906378e-01,-2.000596736863569924e-01,-2.074748521106907218e-01,5.186430158340972207e-01,-1.723237091457108516e-01,1.670621935442607064e+00,8.521716267563956837e-01,-1.209646430813052120e+00,1.327390487800804708e-01,2.468020816106623716e+00,5.558677559081450781e-01,3.278111752211232410e-02,2.235892073323845430e+00,4.202717346369899687e-02,5.994060415707730405e-01,3.787312112433963707e-01,1.037771760420555189e+00,-1.999471697108357315e-01
7.089855921213038537e-01,4.733898710276830402e-01,-1.147121244716066690e-01,-4.639053551405941667e-01,-7.566223017562984099e-02,3.832884480626955748e-01,5.045307712315407755e-01,-1.711112676530170962e-01,3.517644922822167342e-01,4.078791770176157794e-01,8.968607082761312910e-01,4.589911403471659546e-02,-3.602672599261214637e-01,5.448006414043243817e-02,-4.470969450973747428e-01,1.740597539603412347e+00,-3.407849816518002117e-01,-1.683655248895749856e-01,1.196284293276757560e-01,7.455800709928001035e-02,-6.225774308817565439e-01,4.125104825612748161e-01,-4.285552639447132162e-01,2.758100350883999630e-01,1.579202216496496503e+00,-3.424394968594814959e-01,2.729076864608012132e-01,-6.565976653409454356e-01,-6.689765581816942142e-01,-9.411699493017298135e-01,3.465753659448888024e-01,2.416111012326422003e+00,-1.822155767332627185e-01,6.028535812944810224e-02,-5.759725704156927195e-01,-7.308060793088710927e-01,1.254115195009643635e+00,1.067370882350711314e+00,2.032939281135649701e+00,1.353626435294369434e+00,6.195889350406358353e-01,2.931583170331678034e-01,-4.391923843313023934e-02,3.188922484464853241e-02,3.014042057261242524e-01,7.681725896717619406e-01,2.347880011460877991e+00,-2.224620348175361528e-01,1.105299513105098969e-01,7.088248857291115090e-01,3.972646817270848008e+00,1.699701076329699134e+00,3.153717385579867249e-01,-5.449000026824631915e-01,-6.854207209320093419e-01,1.670844728355438402e+00,6.713189837747342015e-01,-8.474515633802165437e-04,-5.877601209462123277e-01,1.781136376458476001e+00,6.874491536418618765e-01,-5.266738549629406130e-01,-2.479899964672657997e-01,8.000293246455159046e-01,7.805485252740771429e-01,-5.565477897801873741e-02,-7.571038398925264978e-01,7.013243062490194246e-01,-4.158264629151778996e-02,4.032708313701886538e-01,2.350776723458370743e+00,-2.252874173709247807e-01,3.089313898730855490e-01,5.317681706467727309e-01,-2.221919771650873177e-01,1.180970376774250097e+00,-3.643363597656428254e-01,7.989253444454622599e-01,-7.560767580292810930e-01,-5.103735936528801531e-01,4.795527955481875271e-01,2.791266791895180566e-01,-1.646232356222920579e-01,1.577743743981353086e+00,8.992781165560239653e-01,-1.181746289576576903e+00,2.552748391330231237e-01,1.325844603080140072e+00,6.650111914936367441e-01,-1.063716081726256424e-01,1.645635932532493184e+00,-2.632219246589497796e-01,5.864403203277874788e-01,2.514906737337377352e-01,7.740765561702882547e-01,-3.721611781317880063e-01
6.044716001122047988e-01,4.693853597481937867e-01,1.438864721768083332e-01,-4.140090563526616085e-01,2.859464860731662506e-01,1.875609197900816039e-01,7.729144527847628954e-01,-5.656029625279388462e-01,-3.877090671884255713e-01,2.136319456246312809e-01,6.893056395369192568e-01,-1.742169416336802334e-01,-4.019406812625710979e-01,1.913652712597432859e-01,-2.371948373762397810e-01,1.261210379492482270e+00,-6.450642487180135998e-01,-2.337263765132423232e-01,2.513619653767125151e-01,1.283203255917284291e-01,-7.105373610798434436e-01,-1.635799645368913868e-01,-5.753506586065028072e-01,4.440379206002988965e-01,1.498064453642397931e+00,-3.084295413481637910e-02,4.736928603750792943e-01,-6.715656450927960375e-01,-6.589985904506874270e-01,-8.364695192156463843e-01,3.527874329859063129e-01,2.326672325802044305e+00,-1.231350291413231823e-01,2.570579894669094978e-02,-5.758144585306457230e-01,-7.286269959572204691e-01,9.664372767197197955e-01,1.151806512290769469e+00,1.893093374104346083e+00,9.892418399789770778e-01,3.748634118352249800e-01,3.493063916879013409e-01,-2.752557536494436574e-01,-3.575855877757280754e-02,5.598992730667378126e-01,9.741069764910297302e-01,2.070650581022726477e+00,-3.443852991574477551e-01,7.666299318220029524e-02,9.267730822843456284e-01,3.556757804657693089e+00,1.380910738686386807e+00,-1.982004669591421742e-01,-5.503802108204998156e-01,-5.365956345338738220e-01,1.508101040911706603e+00,3.210773108727517644e-01,1.514047978816071283e-01,-2.837772998097476407e-01,8.485986159903722292e-01,9.393967230038083871e-01,-6.197034716254216091e-01,-1.967745737819364682e-01,7.481614922383994504e-01,8.155961650043492828e-01,5.393715309508878564e-02,-8.530126969288727157e-01,7.159065735342342585e-01,-2.468426445032519401e-01,8.194281818454999256e-01,1.946843793494706931e+00,-4.128931272599545288e-01,3.130412145070680663e-01,8.568473394815154798e-01,-3.745100063351516906e-01,1.469831109197888841e+00,-3.967255981200109582e-01,4.867521586435651915e-01,-4.909077850626788475e-01,-6.280627558890479190e-01,1.125254932625887605e-01,-2.205184814253267067e-01,-3.053340445634111777e-02,1.681622361895676931e+00,5.458434065825679138e-01,-9.528898072834139921e-01,5.106528860405390446e-01,1.069141588738329540e+00,5.851652043110673329e-01,5.281590015494388446e-01,1.099077344816751012e+00,-5.760694240871534477e-01,4.231946893963483003e-01,3.360313209505202958e-01,7.902664636310892110e-01,-1.906069069953957307e-01
5.871591677455636482e-01,-6.292414226208520311e-03,3.079948099479138945e-01,-4.744533977523075485e-01,-1.513409044931573466e-01,3.767343189782428325e-01,2.962999611160249680e-01,-2.956218678729690685e-01,9.683720725374078686e-01,6.692852103038546829e-01,5.922777636408644852e-01,-1.873734642436725162e-02,-4.980341041314115813e-01,-3.594754465339386473e-01,-2.235743877547614333e-01,1.456571856987099567e+00,-9.233478165679698257e-01,3.876155644729441518e-01,1.590327837010099277e-01,3.526497302918326082e-01,-1.010737438964697477e+00,4.879831061032719464e-01,-1.954821305302886780e-01,2.030919394722144333e-01,1.549798173981412397e+00,-5.006324731309692577e-01,4.480434728849013171e-01,-7.706766639056452650e-01,-8.202072848854153886e-01,-8.220847347267232763e-01,3.256667975153391126e-01,2.965286985730895886e+00,-3.379557504886465669e-01,-5.727858034861557646e-02,-3.962845439854096319e-01,-4.911336841177255108e-01,1.123371760709659384e+00,1.292724284900090392e+00,2.005953061930282555e+00,2.012805726260118444e+00,7.146223096181533174e-01,5.487847334365284491e-01,1.886282586857512822e-01,-2.447491134129369805e-01,6.082053094880661703e-01,6.421251654246564744e-01,2.606508091555188145e+00,-4.348436766589288127e-01,4.668396690286244488e-02,6.415570819866762697e-01,3.591233298706291155e+00,1.711445440644523419e+00,2.121249624098091036e-01,-4.636455447499823190e-01,-1.058688483462673080e+00,1.950856406397367460e+00,9.258510960043050408e-01,-1.429008855978138592e-01,-1.801330165456744847e-01,2.077697259876018165e+00,1.030303322932395682e+00,-4.822030276834517459e-01,-3.710487975439988872e-01,1.262907560112273231e+00,1.085445369024088613e+00,2.704307221476671685e-01,-5.465631206278511733e-01,1.390185955847956567e+00,2.089449049167199646e-01,-1.721194955728505560e-01,2.251544905552838927e+00,-3.423427616372401450e-01,6.272244533527190358e-01,3.045278640905932921e-01,-2.512412036704162466e-01,1.165096564287861680e+00,-1.344352898027939280e-01,7.247543001360370329e-01,-9.766959931896015412e-01,-3.011115262077512789e-01,-5.334611031272584736e-02,3.083580315912211045e-01,-2.346576028120177515e-01,1.810802013773663788e+00,7.679825581024526393e-01,-1.236612402195457427e+00,2.220973266087416520e-01,1.995012778483683080e+00,6.571483115762439819e-01,-3.471833108589650330e-02,1.920430104254297943e+00,-8.658921613655468086e-02,5.980757301687278371e-01,4.092222390036694968e-01,6.916570605605656397e-01,-2.812280198403895870e-01
5.964483529569839515e-01,4.096910581926344053e-01,6.939702476845915902e-03,-5.887335500825110479e-01,4.949948865041829682e-02,3.100132872718623367e-01,7.558768647885181213e-01,-4.072846624937251914e-01,-4.952252046911076455e-02,2.921045422236735467e-01,7.329599168349639760e-01,-6.118379087484196455e-02,-3.760776608853648728e-01,4.858238559474009621e-03,-4.508798163695574845e-01,1.391059267905423891e+00,-5.479900609852065285e-01,-1.458788134756437704e-01,8.509537744228526379e-02,3.633153643991103576e-02,-6.019745277386622240e-01,2.373074101470548092e-01,-4.919835857493809472e-01,2.995731707241061637e-01,1.712875553183167199e+00,-4.467330067304826902e-03,3.541215257184530119e-01,-6.952534065590721957e-01,-1.085102027414416970e+00,-1.168199446961612376e+00,2.747927155580859870e-01,2.472051657249682677e+00,-2.227357739190883867e-01,2.263267421258603751e-01,-5.962876253825621919e-01,-6.314987571678394307e-01,1.260776748444012441e+00,1.002195524427521800e+00,2.231783241978991583e+00,1.155729446312832032e+00,4.252165087240709629e-01,4.008640211230735106e-01,-1.613610665628430474e-01,-1.274565652538128258e-01,4.651582680869952857e-01,8.534947214704524665e-01,2.117085180099026243e+00,-2.548243711823946489e-01,6.424652592393798045e-02,5.672479374622655390e-01,3.714678216222092821e+00,1.829495903864212458e+00,1.320498823032556501e-02,-4.611860658803403901e-01,-5.931187942897876431e-01,1.687213467100953102e+00,5.660468314718056781e-01,8.293319252001771225e-02,-5.392584465741573352e-01,1.631597128135699792e+00,4.874535483589924612e-01,-5.576490257426045538e-01,-7.717985807437589829e-02,7.688416044704988739e-01,1.045502256551569253e+00,2.400674240599492970e-01,-8.528914469850372715e-01,6.622510644025969562e-01,8.553110335788753626e-03,7.321384356767860480e-01,1.920863928223091932e+00,-2.441767868032118094e-01,3.149833852908027199e-01,4.007653700144703235e-01,-2.710777674360622114e-01,1.034910877617764902e+00,-5.948203470724475750e-01,5.915464678796789055e-01,-9.361248651775351259e-01,-5.221939933668855449e-01,4.508890241160508627e-01,7.431089916614511126e-02,-2.119776672046503052e-01,1.855216557792920273e+00,8.444029034170853487e-01,-1.273754359449205564e+00,4.026809039067930085e-01,9.651281814354575328e-01,7.001172965380534352e-01,5.658926433324862337e-02,1.309228937413877691e+00,-3.304199137952640863e-01,4.164123085511533540e-01,2.934996912409599257e-01,6.196782438821915040e-01,-4.078329518959096789e-01
5.196677552306474546e-01,-3.488041313438366986e-01,4.650574642179272633e-02,-4.938890394666872741e-01,-4.224322285394663257e-01,8.012171231790667925e-01,8.857490859433547747e-01,-2.374851755778350504e-01,9.848457521721514230e-01,6.072237541881289058e-01,5.030128263729815030e-01,-1.468128964773505463e-01,-4.858149914673998704e-01,-5.637526418746567902e-01,-4.570892703309465954e-01,1.256549635417172350e+00,-1.021142327920683934e+00,1.167317602864682280e-01,4.169108255261786550e-02,2.062458399292852462e-01,-8.523195926309182768e-01,7.953917484550123707e-01,-1.954560157371137419e-01,9.790910738255026446e-02,1.827825817111625284e+00,-2.648520532802270955e-01,2.001396584928459288e-01,-8.592146236381850155e-01,-1.687900790404111007e+00,-1.332062986358666823e+00,3.917194119010814490e-01,3.166176588715980067e+00,-2.219496158567422495e-01,4.267937786183535476e-01,-4.924880570887743003e-01,-3.896837683363520433e-01,1.593746670084110972e+00,8.880642087830329379e-01,2.450784274794875373e+00,1.761558449803639625e+00,8.271613260066537077e-01,7.531901976163966062e-01,1.166236504284703240e-01,-3.153513764501367778e-01,6.181640369619018083e-01,5.982242331947696945e-01,2.268043724909825087e+00,-1.531854791836649576e-01,2.528941358260813344e-01,-3.561989506836144015e-01,4.083801153717886656e+00,2.619985599684135025e+00,3.880931371546392228e-01,-3.142240211486284629e-01,-9.051274629352851209e-01,1.996273067722033279e+00,8.178468086253773972e-01,-3.328160034795529798e-01,-3.702775647377998247e-01,2.963420776136416634e+00,2.546965299695772567e-01,-8.009783999457127379e-01,-3.034350469538918960e-01,7.174988279419591830e-01,1.330439916585053339e+00,5.946622531443508386e-01,-6.383838636938196087e-01,1.434567065895167914e+00,9.786752735658099667e-02,1.176225929893601196e-01,2.048408588847117517e+00,2.634331910819226463e-02,5.682826551765002288e-01,-1.208378693446884589e-01,6.764451715991458280e-02,4.842797313296812733e-01,-6.864803508328746195e-01,3.511295188163928160e-01,-1.498120263612872760e+00,-5.130212172824757388e-01,3.599227454067984722e-01,4.105165096532897295e-01,-6.110976076486377417e-01,2.250721353738192043e+00,8.434339994608134328e-01,-1.695291608587365051e+00,6.646069837148005366e-02,1.613440262737814379e+00,1.063703857462111602e+00,-9.161347736165825761e-01,1.869172438283689841e+00,2.803277019600420861e-01,6.039960751898902913e-01,5.438228643997069511e-01,-1.182814373006039199e-01,-7.832527916812191959e-01
9.111537085702858807e-01,1.608966627683289241e+00,2.312156930887877548e-01,-8.570952642348144135e-01,4.854308695627750081e-02,2.954217272289672014e-03,1.388832492803290797e-01,-4.234261379721811214e-02,1.313029255160462982e+00,-9.421331085051340426e-02,-4.523209659589210729e-01,8.233136722312500710e-02,-5.310751065160996820e-01,1.321431026784818108e-02,-1.830439647245131751e-01,9.815340393716074363e-01,-5.007210004828279715e-01,4.156209450701384145e-02,-2.162685626943408046e-01,1.058633580840648292e-01,-8.398310050695050322e-01,5.861722333532537466e-02,-6.992501653245527526e-01,1.152250332919686621e-01,1.717595941986047592e+00,6.185769332824729849e-01,1.137260589762358054e-01,-6.401376171010203509e-01,-1.550024686380254257e+00,-1.263516350562768675e+00,2.327245057318044763e-01,2.472180611360447866e+00,-4.199919772423970077e-01,8.253027324673664622e-02,-8.590730363090778310e-01,-3.385431396112956182e-01,1.982427992680623863e+00,6.514711739859345707e-01,1.507881505960101620e+00,5.025753321377084415e-01,5.246687598491919235e-01,5.671887979043755967e-01,7.815020132842943890e-02,7.388383023690137108e-02,8.550490445393662542e-01,9.826951614948328251e-01,2.623357567975125093e+00,3.106208741318864930e-01,8.356746201504144933e-02,8.115093485122868433e-01,3.569864892550493884e+00,1.781725992477128040e+00,2.957496856205726332e-01,-4.898039696131950560e-02,2.826850372898093156e-02,1.154661870931730006e+00,-2.719358586529333488e-01,-2.312573366495145888e-01,-9.379625700710314540e-01,7.993164499121603317e-01,-2.211907317549890173e-01,3.030532206728737132e-01,3.495514463588462739e-01,4.974092523751640904e-01,1.586866133610921104e+00,8.741998795373537856e-01,-3.251338233867854255e-01,7.739639412960512832e-01,1.115900623871107222e-01,2.736185395620054361e-01,1.823151398201628082e+00,-6.090481714094646559e-01,-2.543626828845332311e-01,-2.612190902644402346e-01,4.951739984214360846e-02,4.648848550137490987e-01,-2.354466472398018262e-01,-3.029701704025677955e-02,-1.522261335121496639e+00,-1.780567675195231514e-01,7.111486126324775281e-01,-2.634019882263106682e-01,-3.916845558957789963e-01,1.825260565097553966e+00,5.898542116157772242e-01,-1.017259978355325334e+00,4.604256279261689233e-01,5.643258736787044594e-01,8.882759340723158648e-01,-5.776955878069762740e-01,1.388949801284192986e+00,-9.302591841611063117e-01,1.300415530250508045e+00,3.663436960203751425e-01,-7.977360166979436951e-01,-2.456732905214899787e-01
6.884687586350374255e-01,6.220373831210113114e-01,-5.403574216662960367e-02,-3.537617666364301638e-01,1.715845352995680750e-01,4.166271475512532962e-01,1.074933214260271885e+00,-4.211008493896324922e-01,-2.188452485407030856e-01,1.268994159231973118e-02,4.090647695624172742e-01,-2.633551037638934833e-01,-4.144299069229021026e-01,2.230863333424141781e-01,-2.812154486042435786e-01,1.085483134141596251e+00,-5.974450292442641253e-01,-5.696030960218888550e-01,1.801505388211658010e-01,3.902189807971806479e-02,-6.362949038269498647e-01,-1.412836739163317867e-01,-6.958017175173494273e-01,4.007131899132736486e-01,1.567862561090422657e+00,2.212032088105987115e-01,2.214650935635933959e-01,-6.843539272099956605e-01,-1.082752437290222636e+00,-1.038971343130351777e+00,4.682808047204799484e-01,2.291158438701433209e+00,2.249182564727286726e-02,2.427168360385760226e-01,-7.336997970166554417e-01,-7.044422928424114438e-01,1.383237766052001660e+00,7.983722961820490793e-01,1.830116413266922093e+00,4.708408486130215564e-01,5.078207814624301486e-01,4.478387840472529136e-01,-3.460137942091147667e-01,1.089917581232636157e-01,6.094359434955970434e-01,1.034214744514744266e+00,1.915708712573062300e+00,2.337843531781624504e-02,2.846976149538196776e-01,4.280486626706337949e-01,3.988411978521084311e+00,1.817053409708651257e+00,1.003819042261028249e-02,-4.192257257110501012e-01,-1.876047748475835608e-01,1.256743590974764402e+00,-1.254187674638418959e-01,-4.346657411514233404e-02,-4.811613095222090353e-01,9.203638646261995682e-01,3.878103046765961626e-01,-7.056833444406271916e-01,-1.374997170512652633e-01,1.466632301220870405e-01,8.778822129453687229e-01,2.155030738353418962e-01,-8.074798402098131156e-01,6.976303721246717160e-01,-5.209066620901113831e-01,9.955816574447845513e-01,1.925967171273303524e+00,-2.676494042729710143e-01,6.449515467113527134e-02,6.890982418919244790e-01,-7.190487454995919681e-02,1.068437606720373134e+00,-6.183455820035799189e-01,4.695804037318046520e-02,-7.109859943291874096e-01,-8.133880972983353885e-01,4.288419770448983481e-01,-3.275093455099717388e-01,-2.527002765921785299e-01,1.806172157748083373e+00,4.163350229226421284e-01,-1.044929605264245165e+00,4.173335906359628145e-01,7.100805191294815577e-01,8.903347372763323886e-01,-1.477894336880343773e-01,1.013552060188725346e+00,-5.716951154313354433e-01,7.000805355093661086e-01,4.468949475065872590e-01,-6.095713728877955040e-02,-4.452184886343936165e-01
4.228317094962645850e-01,-7.332094661776585864e-01,4.053111109039631010e-01,-4.423736097422782954e-01,-3.508159027541595254e-01,5.949278841217087166e-01,4.018012453885233537e-01,-3.769552139786925826e-01,1.169304645395920161e+00,9.813278319047569198e-01,7.499798671609679834e-01,-7.297637628694725320e-02,-5.314776102682079451e-01,-7.233483125414340575e-01,-2.651240126122252905e-01,1.447375724456123391e+00,-1.271067524680070893e+00,6.681976019059109317e-01,2.001457263331576364e-01,4.639759531662906999e-01,-1.136239028210347390e+00,8.050849213188647768e-01,5.251556595929252058e-02,1.368765461563981878e-01,1.628396174011763398e+00,-7.831337117343052379e-01,5.288713297620171172e-01,-8.792125389076410613e-01,-1.022410213369888465e+00,-8.830567981272047229e-01,3.254017003796876861e-01,3.400744447306287999e+00,-3.851990669481029639e-01,3.650185846867931572e-02,-2.269515191654863928e-01,-3.832364238205357432e-01,1.020189757041975787e+00,1.422383875708466361e+00,2.351213349845007627e+00,2.664193339555908313e+00,8.215226134155383386e-01,7.076679160362693288e-01,3.154674319712666986e-01,-4.971059125796248868e-01,6.433588061785622259e-01,4.618659416408170681e-01,2.621028279604831202e+00,-6.424753344003377720e-01,4.514537209329456957e-02,2.415365475081239222e-01,3.575641472621142292e+00,2.031859587786032151e+00,2.196821909028625619e-01,-4.830709454119278545e-01,-1.480621385299683235e+00,2.345760283757480025e+00,1.400937325068809525e+00,-2.220185554225593827e-01,7.243770791388570718e-02,2.953693463096836780e+00,1.192469023409359119e+00,-7.338436100840536325e-01,-5.506971696786066017e-01,1.544692496501947065e+00,1.207335320878337503e+00,3.770145279444585551e-01,-5.582744012061338079e-01,1.809144539986049072e+00,3.925475969091678508e-01,-4.473342586554788225e-01,2.240888174896410678e+00,-1.866884131467662633e-01,9.831972273099229831e-01,1.370524906089730655e-01,-2.553595147085394035e-01,1.068212357709952265e+00,-2.166314416651856090e-01,8.448676902205618511e-01,-1.168377777788468963e+00,-2.681079345916697054e-01,-2.819896966261272730e-01,5.707614911322703710e-01,-3.538714907728194303e-01,2.065365375533017023e+00,8.712565880390663597e-01,-1.520381519209311971e+00,9.327520891831625471e-02,2.500392114606235339e+00,7.104586916224790993e-01,-1.624291827372846275e-01,2.192550084924365095e+00,3.595102790330888531e-01,3.866682791619539539e-01,4.984706017033668224e-01,8.468828434528756777e-01,-4.293725901058785821e-01
6.042330005538899540e-01,-2.025341802257242252e-01,-2.066872965481786895e-01,-3.442859556308821567e-01,-4.229053544069059645e-01,9.404752827495184153e-01,1.112221691798317647e+00,-1.411154129887731423e-01,7.522661619796704446e-01,4.643795572466909438e-01,5.990885483627658159e-01,-1.939155186863424363e-01,-4.372358038708817340e-01,-3.481873255486573893e-01,-5.122601104059725241e-01,1.348543966361658963e+00,-7.908048854494735824e-01,-2.893852570381387768e-01,8.115790498207320347e-02,1.023830885517844624e-01,-7.052792003222566608e-01,7.286326799440552282e-01,-3.200322121917710261e-01,1.531366166095422254e-01,1.772774828564954497e+00,-2.430283422781534808e-01,4.800503763789830403e-02,-8.182706122996153963e-01,-1.579226830909790991e+00,-1.306492098357393550e+00,5.077135008644051428e-01,2.916089213016241022e+00,-3.387981327152367328e-02,4.889301770232008515e-01,-5.952868201276301230e-01,-5.377105496498251203e-01,1.695066796931214981e+00,7.259700583779742367e-01,2.342128570854719705e+00,1.346426939105841658e+00,8.966539301429037323e-01,6.644010253271543931e-01,-2.073812057106239060e-02,-1.002014582280168903e-01,4.932814854604814503e-01,6.700374528840282728e-01,2.101573983055423867e+00,3.556644618446903883e-02,3.991110021575285938e-01,-4.807948767413180446e-01,4.472522357561213191e+00,2.684783790081083588e+00,5.223796234662224647e-01,-3.605922513848304756e-01,-6.716949323747747336e-01,1.768878241350007041e+00,5.377288210278370340e-01,-3.635239633678618576e-01,-4.997367939680847915e-01,2.797841327986203552e+00,1.135385566580180139e-01,-9.584264524311002509e-01,-3.589051327351043819e-01,2.790587891231534057e-01,1.072106343674598339e+00,3.784989873300164120e-01,-7.070713960132404274e-01,1.224735100353983031e+00,-2.290126639709866296e-01,3.753662376420418556e-01,2.203229535832745167e+00,1.321742069220800397e-01,3.904241789651561878e-01,1.004270518517763888e-01,1.890852794198018549e-01,5.022388519360065917e-01,-7.912318249457428454e-01,2.257727845104878783e-01,-1.304625335797243046e+00,-7.416455183976364829e-01,5.760848495099811784e-01,3.449018156723504536e-01,-6.227485326719675029e-01,2.119689742649975894e+00,7.655137249887500328e-01,-1.631599212649368358e+00,1.322119014661038428e-02,1.381358802476461145e+00,1.166898618875340965e+00,-1.139872880401959554e+00,1.757489478271995864e+00,2.322582627294169644e-01,7.082132303286421404e-01,5.480649675973439106e-01,-3.130919297084773789e-01,-8.896729866954383725e-01
8.086771148456188829e-01,7.441569156912297700e-02,-2.157840755196085425e-01,-2.028625232185466420e-01,-4.574992650546859108e-01,6.621807273690695217e-01,4.648046450048726186e-02,2.204737632624396149e-01,1.382634606157319368e+00,8.643231174445779041e-01,1.238645468656407234e+00,2.064397095092208034e-01,-3.773940234410839145e-01,-1.478535869939996417e-01,-4.217634518957240619e-01,2.352453212197136878e+00,-2.592725202973596432e-01,5.523312452208248291e-02,2.160431984553982665e-01,2.675259210759619588e-01,-8.122647135267555552e-01,9.589773540219675985e-01,-1.148870225745358686e-01,1.736280714959129723e-01,1.363136804825637149e+00,-1.190630047570830907e+00,1.891305648355426638e-01,-6.692840666062022104e-01,-2.601199558248157295e-02,-5.199734919695699897e-01,4.854221821662644265e-01,2.675538259978703426e+00,-1.582453318453575231e-01,-2.225508782283046050e-01,-4.052574624793515712e-01,-8.105197668081522977e-01,1.168901837839110058e+00,1.303865156510833678e+00,1.844820535754797097e+00,2.240795453133364035e+00,1.084895480120586786e+00,2.328980876049548954e-01,3.046219170609816840e-01,1.409668670188635731e-01,6.677068012013492870e-02,4.714535615725822248e-01,2.852393212185234006e+00,-3.126470351056950259e-01,1.937751216164585455e-01,7.150382878290245658e-01,4.403641150275051430e+00,1.656246315094692445e+00,8.947020120685182931e-01,-6.981150444845574121e-01,-1.178822205346089946e+00,1.921867110334405382e+00,1.195056917274115005e+00,-2.461880483898767069e-01,-4.579307994613753263e-01,2.656966776942115249e+00,1.221193619730908342e+00,-6.094309204818615378e-01,-7.090874999553009594e-01,1.100763763642767179e+00,4.018882995051344942e-01,-4.958007552248863137e-01,-5.338386619545434364e-01,1.163658425358736981e+00,1.200352194482725426e-02,-5.098502578777664995e-01,3.159886544534473707e+00,-1.141628800411302602e-01,5.640079173635265120e-01,6.339913694515286746e-01,-1.247530724925833695e-01,1.389078817477655825e+00,7.317472087239212941e-02,1.244190296775573135e+00,-5.732112656382706284e-01,-4.315339091610514988e-01,3.044803747447069053e-01,8.366408992810570044e-01,-1.655726999148592615e-01,1.240871270521465508e+00,1.037693042426261814e+00,-1.186583086437629664e+00,-1.181319193408696955e-01,2.449388288782686107e+00,6.375484259873919202e-01,-5.094310715868273221e-01,2.514661091064688048e+00,1.688260497104392410e-01,8.033983936398004788e-01,2.580423809803892299e-01,1.120453826130513697e+00,-3.818517441948531266e-01
5.450369869702369474e-01,-1.591511849442539539e-02,2.365937240435134203e-01,-3.898412550316612268e-01,-3.591699928096270256e-02,5.245513067948712749e-01,9.104880120838998447e-01,-4.735704596805772604e-01,4.252359230247282351e-01,3.698090423144566596e-01,3.156549600662972854e-01,-2.748177469423744856e-01,-5.122542679889017236e-01,-2.577549291569810053e-01,-2.022580602194689048e-01,9.821154835862284660e-01,-1.085503805546558898e+00,-2.432809732497273614e-02,1.839072654979175270e-01,2.597594702027339331e-01,-9.304821642401603921e-01,1.747907415042691814e-01,-3.949211081479351848e-01,2.817968092249976131e-01,1.619772713861972857e+00,-5.372443943169751684e-02,3.486852929480758201e-01,-8.069117994686034745e-01,-1.307019133330736826e+00,-1.034284066040266126e+00,4.301632374905505207e-01,2.880871742958007964e+00,-1.402574935322610239e-01,2.192396359958393992e-01,-5.339643191435863301e-01,-4.816933914430994723e-01,1.305956807561301503e+00,9.971246746990651832e-01,2.027081145480726487e+00,1.298239987000697759e+00,6.443140132015042765e-01,6.808595625232776172e-01,-8.075810979376060739e-02,-2.000590676076495211e-01,7.828540404315109669e-01,8.248967692692527054e-01,2.156226713392188188e+00,-2.035259651697891858e-01,2.252388094353215409e-01,1.761030689877937094e-01,3.762973098077442735e+00,2.032613991916118579e+00,2.603919162011003596e-02,-3.649427816762540466e-01,-6.674931318723733575e-01,1.676469527787679992e+00,3.586524773854460335e-01,-1.881793979601101841e-01,-1.666930289222562367e-01,1.714504919055432897e+00,6.233525267199451214e-01,-7.435401011334871191e-01,-2.834748691591266745e-01,6.359370883538434382e-01,1.166968016960937549e+00,4.883560557880352593e-01,-6.575706131815135524e-01,1.328923979927400856e+00,-1.836221060073326139e-01,4.075111258116820290e-01,1.901306854741075192e+00,-2.470286116608373383e-01,4.437285188991830220e-01,3.600448155928898109e-01,-8.090181009511107635e-02,9.404733726061125232e-01,-5.031849933970922173e-01,1.352647856974808493e-01,-1.031222268905259698e+00,-6.073904826659604073e-01,4.952929410450512826e-02,-8.236118605276077087e-02,-3.780786171636695281e-01,2.073733128053918406e+00,4.721216286969482923e-01,-1.270402104978797242e+00,3.007208138946034781e-01,1.414449899059599280e+00,9.110205544195251193e-01,-2.550342317354878929e-01,1.422368719480100463e+00,-1.938150553426530864e-01,6.229665770097044808e-01,5.641023557767179675e-01,-2.058237372917243180e-02,-4.798215171375114219e-01
8.478559087686404760e-01,7.431375062811812482e-01,-3.021897924375181455e-01,-3.292398432655918583e-01,-1.871122410068206121e-01,6.764206786498101476e-01,9.000447242773876866e-01,1.149871576242178506e-02,6.886281669418643503e-01,8.494738531770007484e-02,3.294881676122173308e-01,-1.267484208443877824e-01,-4.179507011950104323e-01,1.084322189923606211e-01,-3.937455948341155865e-01,1.365374940646693513e+00,-3.748504891105495784e-01,-6.253739736941305027e-01,5.117145397369831511e-02,1.247495611539746474e-02,-6.159503134824738657e-01,3.157373901947586603e-01,-6.218655697239940938e-01,2.337621671484799435e-01,1.608460168983379956e+00,5.015178679716904286e-02,-7.003424637597244207e-02,-6.801360069059768643e-01,-1.225159803902174271e+00,-1.127697892231114052e+00,5.469102635388458644e-01,2.389746717267766218e+00,4.151066799164399024e-02,2.984850244644216000e-01,-8.047842348436713422e-01,-6.741603454626192704e-01,1.829847682387663266e+00,5.810558950613371465e-01,1.765373106607055043e+00,5.512485670466307219e-01,8.328818811622467067e-01,4.734747404137092941e-01,-1.393596176438230416e-01,2.639255958475469344e-01,4.759707595027084515e-01,8.901686694555448476e-01,2.169115374713157518e+00,3.245723428395317356e-01,4.294300448046843854e-01,6.817114604365015484e-02,4.528660185362263668e+00,2.219488228224572257e+00,5.777155634195529910e-01,-3.344845875424802273e-01,-1.405852357763477944e-01,1.226212063476453729e+00,-1.183913672135086803e-01,-3.224800059097512328e-01,-7.773366205941402152e-01,1.620089659443169960e+00,-8.493090594849400654e-03,-6.152034057156783309e-01,-1.889310455430966984e-01,-8.808003360250904468e-02,8.740703530587381476e-01,2.145095270169686819e-01,-6.190092809159272180e-01,7.976491852346945244e-01,-5.088884467815513180e-01,5.843049073894690526e-01,2.316100550724375040e+00,-9.803145204001278978e-02,-6.897856521160432297e-02,3.507208172737927843e-01,2.295139342604924915e-01,6.684420889600874993e-01,-5.784983152640346127e-01,3.637499167139657263e-02,-1.014466993865358324e+00,-7.788344052554252439e-01,7.976132101951298736e-01,1.306969120077300373e-03,-4.684288169473040941e-01,1.737248868906444699e+00,5.647596146506359549e-01,-1.205300858324601432e+00,1.429608324961142152e-01,8.821591891949690512e-01,1.109038439888026417e+00,-1.029773200121759436e+00,1.495393654192109123e+00,-3.522469532936810532e-01,1.081717853630469461e+00,4.634973707638558871e-01,-5.883821739540195939e-01,-6.684138880801996363e-01
7.196656823114114809e-01,1.139792243401035243e+00,2.194842959521853820e-01,-1.081598711400806101e+00,-3.064719764406959035e-02,-6.952314866808417815e-02,2.831392740750027226e-02,-1.682157285830341853e-01,9.491294912749811408e-01,2.392474553135625903e-01,2.042717116127835131e-01,2.521609608135269021e-01,-4.337366676722262948e-01,-1.738321101807375202e-01,-4.654351386790377409e-01,1.370886914621116004e+00,-4.248332789417387234e-01,3.901365012155750267e-01,-2.576955634213897173e-01,3.634943905243356865e-02,-6.817815111525723504e-01,4.499997754588048737e-01,-4.765562684494187295e-01,7.106793884446488407e-02,1.910280064472931194e+00,3.269750734891044841e-01,3.234781229001646996e-01,-6.568672966941839775e-01,-1.505409219250689157e+00,-1.449502381446327037e+00,1.124021184434659260e-02,2.597199923336118044e+00,-6.314702397115656840e-01,1.514550251289476790e-01,-6.723557862521460926e-01,-3.432402529012688608e-01,1.674795529867261656e+00,9.226510650540378222e-01,2.179042059096480521e+00,1.270657329315915129e+00,3.359117454564373717e-01,4.591913489215397881e-01,1.545694398026252747e-01,-2.376201842816236809e-01,5.975961791039542392e-01,7.961103162491672824e-01,2.622951068160118915e+00,-1.223107425171930662e-01,-1.732894292863558783e-01,9.027710343973344154e-01,3.275801974802092786e+00,1.815856127596643166e+00,1.534339607843110131e-01,-1.916374734542379277e-01,-4.951522301333267095e-01,1.722517415595990808e+00,6.337261405009722015e-01,3.769208729648929057e-02,-9.449978412521763405e-01,1.677330640277419516e+00,-2.025458395285775759e-02,2.438373547927096818e-01,3.741580559496425762e-01,1.186573454365312585e+00,1.656826860201280560e+00,7.665910902153478812e-01,-5.641652512163396471e-01,5.892198450443402180e-01,6.476305378413205194e-01,2.714094169725126404e-01,1.741372136235126211e+00,-4.898931232088369336e-01,1.188802630649968550e-01,-4.024687491643216264e-01,-2.688352517974921252e-01,5.518811325463116590e-01,-3.840514420342286406e-01,6.886147382689746799e-01,-1.625080369356952437e+00,2.695783253310229943e-02,7.315060311825096750e-01,1.981136681798165988e-01,-2.934964735130224378e-01,1.916854137196050134e+00,1.127221707732344314e+00,-1.337742483220697443e+00,4.811906198808444390e-01,7.521369995099662642e-01,6.309904860605015653e-01,-1.327189596468485444e-01,1.558553740617022010e+00,-5.710099784520393795e-01,7.163356230473896247e-01,1.630636957591724279e-01,2.994742768087195195e-01,-2.545638601172624527e-01
9.872350296504550649e-01,2.000421231875399553e+00,-3.129816166771182129e-01,-8.643209878697604154e-01,1.152334332038497527e-01,1.026307813661401780e-01,6.251670431021452146e-01,2.670292690352017717e-02,3.667811476372578872e-01,-4.200083929965147123e-01,-5.860111478348228875e-02,9.423433739028526379e-02,-3.558531719953579864e-01,4.494604876879175204e-01,-5.225784727981054312e-01,1.217431861856011599e+00,1.159750536544714716e-01,-6.853074215336458774e-01,-2.755015466856587381e-01,-2.735313120437116163e-01,-3.179441023340788264e-01,1.995403793380812196e-03,-9.779996892641814599e-01,1.997229230464107608e-01,1.848807242808990337e+00,9.006961948446001731e-01,-1.064740455498206229e-01,-5.371329983104837780e-01,-1.630368048412980997e+00,-1.569430519821201298e+00,2.535726985370370667e-01,1.874169625323681032e+00,-2.073684560857610992e-01,3.814129632476023768e-01,-1.078775749499902403e+00,-5.984583356937631660e-01,2.183923635730091295e+00,3.071101745375864889e-01,1.746749713823403383e+00,-3.377866707712491312e-01,3.732397736443815450e-01,3.207698692232783255e-01,-2.640410823477670199e-01,3.291459472535258612e-01,5.039175802932182036e-01,1.136243789097571844e+00,2.142678875510187098e+00,5.699098663275453669e-01,1.874072736859173638e-01,6.256724594057082589e-01,4.068199944864698381e+00,1.998350116192444847e+00,3.523038957063098220e-01,-1.235264514238543776e-01,4.818390328933117583e-01,8.777951449414995722e-01,-5.584522695508346013e-01,-5.341099548628677751e-02,-1.422754866663677564e+00,6.595345359542814645e-01,-7.948836840091419997e-01,1.100445386331763697e-01,5.258518905706522917e-01,-1.539941072351350693e-01,1.306375212766168747e+00,5.851864010122291848e-01,-6.631253490964352793e-01,-6.050131536976421920e-02,-2.011962581359765245e-01,1.145746664747137267e+00,1.788913960449303175e+00,-3.685142794072662209e-01,-6.005975676928249074e-01,-6.690210322149514610e-02,1.120322140126659566e-01,3.435157509974305912e-01,-7.170289940069498602e-01,-2.504560738894467953e-02,-1.374743913548608809e+00,-5.000196279801887300e-01,1.408504613463362087e+00,-3.037506612982653897e-01,-3.861415783061219464e-01,1.717641497003700390e+00,7.708816400160177773e-01,-1.094873521057843302e+00,5.031271524142094664e-01,-3.828413700847450585e-01,9.770224841277350691e-01,-7.546479667396677193e-01,9.537942283357303541e-01,-1.035029044493550154e+00,1.171622345934706821e+00,2.105904754557978709e-01,-7.984314389014448565e-01,-4.820358288845396633e-01
8.714569945597159251e-01,8.556603237966734499e-01,-1.111970498603292862e-01,-4.485988260435927466e-01,-1.238158084087149363e-01,2.827565827892168926e-01,6.171273046627573367e-02,7.656882010247606507e-02,9.461355323471261070e-01,4.241880246086584538e-01,7.861045708162979206e-01,1.938351150370937193e-01,-3.806096464499000298e-01,1.246541375790199274e-01,-3.586713364575127572e-01,1.960050088487069520e+00,-1.449001414380978459e-01,-7.984636171401350568e-02,8.796252291184719629e-02,1.361683084808424093e-01,-7.074820995030010051e-01,4.658374829692503716e-01,-4.236508812336451379e-01,2.299155316871572818e-01,1.445908837363058419e+00,-4.931442177478953526e-01,2.071094259967446172e-01,-5.981293796017373987e-01,-3.209228141541673462e-01,-7.222945594887112408e-01,3.641565770881484698e-01,2.337778497099372466e+00,-2.315707481593471950e-01,-1.754400567342012107e-01,-6.008098258555871762e-01,-7.537740312605218929e-01,1.328373143935937861e+00,1.112106036743742310e+00,1.672179613075230664e+00,1.417006830792526095e+00,7.538415970215730511e-01,2.081823384953158385e-01,1.144640046193907551e-01,1.967291434163169761e-01,2.543913992510986599e-01,7.359265542186790299e-01,2.696704562294871099e+00,-1.312608245978260646e-01,9.860813795688105898e-02,1.054354150742353280e+00,4.028900869621683256e+00,1.435542129536716338e+00,5.691662915209765305e-01,-5.410248276388622823e-01,-6.521726854658105310e-01,1.549301336189243150e+00,6.117061699849288825e-01,-8.759520642473404839e-02,-6.960978787711866733e-01,1.579079612815363021e+00,8.014053219409178475e-01,-2.403378009321483766e-01,-2.762684840223874616e-01,8.853275746325999229e-01,6.755360434263159020e-01,-1.854798696199626562e-01,-5.589710059577129853e-01,7.261952224580738857e-01,-5.220878164932336862e-03,8.255538602151779592e-03,2.674542576098556168e+00,-3.565365046622742673e-01,1.915646385125527318e-01,5.345415322471570585e-01,-1.820155140209249178e-01,1.272362152658224499e+00,-2.313726191624915218e-02,9.084761542531201162e-01,-6.795608241490376233e-01,-3.709514141291491707e-01,5.031958330647324784e-01,3.560092757826878174e-01,-1.010479793059871900e-01,1.291160263905099859e+00,8.987917854485597546e-01,-9.893230442260561031e-01,1.904198126702799643e-01,1.558093573543542387e+00,5.988989908960974384e-01,-2.021992297862605370e-01,1.926646726803080245e+00,-4.071975135731508155e-01,8.922468425065005482e-01,1.998181986181933878e-01,7.482076005256221851e-01,-2.203067330383526590e-01
4.872085641669528511e-01,4.913518844581414302e-01,-2.792003614100903031e-01,-9.850590187413889032e-01,6.335013699999068881e-02,1.205677379704362395e-01,7.535999500527506001e-01,-4.669715403844515444e-01,-8.963361363850668173e-01,3.498821702687611168e-01,1.493763868947697748e+00,2.053122022461707219e-01,-1.728322734699390129e-01,1.098735577638220579e-01,-9.504892799740521925e-01,1.900972672427828192e+00,-9.090840299083691178e-03,-1.345277579277973368e-01,-9.106912072661196844e-02,-2.985873510633032524e-01,-1.036054657628914244e-01,5.624669659982841630e-01,-4.868490984157899937e-01,2.711708573201543349e-01,2.044680873993029557e+00,4.964998085189491900e-02,4.431433142451816076e-01,-6.189789831127981978e-01,-1.181764400887118871e+00,-1.632059425580941747e+00,-3.142256921348857146e-02,2.172208452555278502e+00,-4.215463261491378955e-01,4.548364076409678880e-01,-5.868787597058293670e-01,-7.370833349615600882e-01,1.160291512660450719e+00,1.038659370900171686e+00,3.029266633124666264e+00,1.323203515873625946e+00,4.344039531556842526e-02,1.212993448836385824e-01,-2.584376463311126582e-01,-3.013176538475270672e-01,2.355375016988509040e-02,7.900904592107592661e-01,1.914783174280263456e+00,-4.997508898510391040e-01,-2.234993355560628836e-01,7.397803518415178026e-01,3.535130946017043918e+00,1.910046061670906514e+00,-1.326414279912910832e-01,-5.818590379301358251e-01,-7.490085860564827946e-01,2.049868551541076389e+00,1.262191120142817535e+00,5.119930373061463147e-01,-9.865788681034457497e-01,2.244417202223337959e+00,1.854346935409762476e-01,-4.790212016479556967e-01,2.368612938386140676e-01,1.166733278496342674e+00,1.107265122705296312e+00,8.966405532549598378e-02,-1.258673731532674811e+00,-1.730721119251942275e-01,5.232651986956744494e-01,1.262158898803831253e+00,1.702852214693493682e+00,-8.108358154004549623e-02,3.790747589187695721e-01,2.026900137851539163e-01,-5.961236162549403694e-01,9.590630834354879619e-01,-9.996955451582569818e-01,1.346426890430442391e+00,-1.092667894242731474e+00,-3.652826442877484259e-01,1.001917917852331197e+00,4.788370502627006808e-01,-8.871893368419433989e-02,1.875999930014099037e+00,1.569692918042475238e+00,-1.616661945062357164e+00,5.319105830093705523e-01,3.695346974042557076e-01,4.377465827749728033e-01,4.742056064272476834e-01,1.167094562883023823e+00,-1.938698565185346667e-01,-2.018387014404240398e-01,-7.235544162667362222e-02,1.695542137352203715e+00,-4.779089473102062779e-01
8.367549821639218566e-01,5.272367928504284595e-01,-1.743018197391822954e-01,-6.635856939259774379e-01,-5.520742628460620915e-01,4.564844518275114615e-01,-2.357591448817632496e-01,3.432522770781761823e-01,1.826060381033152158e+00,7.740756773595879325e-01,9.332560735091295356e-01,4.166894595657408829e-01,-3.781394021831459007e-01,-3.078540576647447735e-01,-5.951751929976587530e-01,2.290247775066011293e+00,-1.309788465295545767e-01,3.445651124269797361e-01,-1.053635962161593720e-01,1.449794630324578171e-01,-7.151613042833553369e-01,1.203514362679642291e+00,-1.319422756105402272e-01,-1.554404676913340166e-02,1.676847201972725854e+00,-7.781241534049597730e-01,1.246775971795515137e-01,-6.578086358950026025e-01,-6.919233021644592974e-01,-1.011227443303238882e+00,2.440720672606288000e-01,2.757552624180343415e+00,-4.567941257756894524e-01,-5.168298436330459600e-02,-5.004480314125223650e-01,-5.781127191290693634e-01,1.591597206139783172e+00,1.109738740804256940e+00,2.120781489071358550e+00,2.194327982962703150e+00,9.310194789771313317e-01,3.002610448986087199e-01,4.526319019602586535e-01,-1.545277383428429741e-02,1.177074755798384609e-01,4.362067549589784266e-01,3.013379100749936867e+00,-1.766482788221392930e-01,2.274204136677603072e-02,6.719115903286390079e-01,4.146726554943217735e+00,1.949208261134934839e+00,9.460973279583816398e-01,-4.640734154612065065e-01,-1.047220915377151229e+00,2.011053765233925539e+00,1.289996873562718527e+00,-2.299972385617435611e-01,-8.884719187629244175e-01,2.987402735082219429e+00,5.146201514124714160e-01,-1.178365531293449481e-01,-2.594975531112602152e-01,1.283603219872495815e+00,9.765701531925159440e-01,1.110668148431437352e-02,-4.563496304158687344e-01,9.355581859771174846e-01,5.291713815803824605e-01,-5.538848059799922341e-01,2.827694093103100936e+00,-1.591183316686854143e-01,4.016004943774518221e-01,-1.215596498394390934e-01,-9.988244980007533746e-02,7.983777895834613947e-01,-7.153074601181513836e-02,1.285845796073494363e+00,-1.279605392021913257e+00,-8.237040854824251301e-02,7.368291372265832750e-01,9.673327036593613037e-01,-3.182494525623378312e-01,1.473790479082399463e+00,1.378059987148513521e+00,-1.441195314716717135e+00,-4.257150117745833739e-02,1.956899912452376267e+00,6.672918438658045348e-01,-7.838220844145863397e-01,2.552582402526587746e+00,9.433487189122891081e-02,8.713101635124950173e-01,1.426971901338017212e-01,8.070459376726475398e-01,-4.384517721941409985e-01
9.060867348187815473e-01,1.028644769624902366e+00,2.091383960539267006e-01,-4.624745150614770761e-01,-1.117156139183439340e-01,3.266350255577665784e-01,2.029539888814217430e-01,3.169717406639616097e-02,1.620222823562771364e+00,1.689555743670930754e-01,-2.558858773358289596e-01,-3.188752689440979560e-02,-5.720485956578200692e-01,-9.030346106975005449e-02,-4.454674526695301395e-02,1.138088591966558871e+00,-6.999868280932458608e-01,3.195278229780149082e-03,7.360851992123267074e-03,2.960860501339624418e-01,-1.041048377113581891e+00,1.803733931641432475e-01,-5.252337325164609938e-01,1.558697708174807128e-01,1.474428166280852270e+00,5.531730383284080843e-02,9.659960201625500398e-02,-6.938309086014921023e-01,-1.090648802435700171e+00,-8.551711070020998617e-01,4.584111501554749002e-01,2.679708635050816579e+00,-2.264392847812372322e-01,-7.169663033718221001e-02,-7.230976980326654369e-01,-4.390975989501708643e-01,1.772378109743918184e+00,8.188981918461868403e-01,1.301297515272152427e+00,9.357718011416948922e-01,8.608565275813073736e-01,6.055412791374554793e-01,1.605882613279830395e-01,1.579371487311426181e-01,8.164636874647431819e-01,8.603876277776589809e-01,2.719322517991548338e+00,2.267902859362038170e-01,2.640063088371548683e-01,6.249451729295392166e-01,3.930015752302292942e+00,1.762889564521295416e+00,5.175951440751105359e-01,-1.971068274552589261e-01,-2.698565297500437055e-01,1.235713694928115336e+00,-1.421401918067242143e-01,-4.256735398031623596e-01,-5.686723279174431545e-01,1.131627922524905072e+00,3.370441461481680223e-01,-7.894802339396153612e-02,-1.261411652299443131e-01,4.589252201573774670e-01,1.194828025935527727e+00,5.304465881487157031e-01,-2.384277143029668866e-01,1.272953270758848898e+00,-1.831575404896763071e-01,-1.378104700087142698e-01,2.294714583065831537e+00,-4.987682227333782858e-01,-1.730361411930164683e-02,1.169409651496483016e-01,1.496606045398092277e-01,7.674516676822313865e-01,-1.817785340466576693e-02,-1.244537133900658343e-02,-1.161457977585160339e+00,-3.675915456040630414e-01,3.373395502654384370e-01,-1.224909955439622000e-01,-3.941117270114479765e-01,1.679409128133970475e+00,3.884734338793602859e-01,-9.447162591542535015e-01,2.251714700104219813e-01,1.379077846001761642e+00,9.531450336372015997e-01,-7.565565777674868597e-01,1.755214549198224505e+00,-6.233983049517757280e-01,1.387404177790883431e+00,5.138714242605593174e-01,-7.139622762308879267e-01,-2.920695453116108897e-01
8.277488455564516734e-01,1.776599189112812116e+00,7.455446621358091663e-02,-1.165853908599649102e+00,1.975915450947021146e-01,-3.190474468762671267e-01,-2.318137137539066917e-02,-1.578075791640176639e-01,4.279730964123124037e-01,-3.364126358648314441e-02,2.838630604494137288e-01,3.347771882999879267e-01,-3.518194428762257964e-01,2.148919685216758024e-01,-5.248170517125697598e-01,1.486321729815316184e+00,-1.551161997868422127e-03,1.070952638231300602e-01,-2.966065653051923601e-01,-1.362349968449676763e-01,-4.523236752981405484e-01,1.732281675240183172e-01,-7.102206994001095675e-01,1.585933942007399233e-01,1.886207274705549386e+00,5.776441930485476384e-01,3.014562710467520446e-01,-5.392421072400566118e-01,-1.267257726800036455e+00,-1.453787405212817241e+00,-4.692743317964020999e-02,2.102922307508933830e+00,-6.081231900787940070e-01,1.017516833205831944e-01,-8.118440946674326808e-01,-4.949465298022400761e-01,1.666340362164321798e+00,8.478413579913246512e-01,2.037112283040403593e+00,7.039861841853001234e-01,1.292552893626277011e-01,2.345060765398475355e-01,-2.070368576296476720e-02,-4.504391832391044237e-02,4.621604714569168548e-01,9.636633891462557111e-01,2.518888285279692774e+00,-2.915651140124755902e-02,-2.378136182417364131e-01,1.347436206360294264e+00,3.226342003544420578e+00,1.478585541861509256e+00,5.582745552309581472e-02,-2.336700405802141500e-01,-1.588390425130235817e-01,1.440114273098774156e+00,3.549391109856765425e-01,2.395919073653494935e-01,-1.222075287810957089e+00,9.264619444777797419e-01,-1.441035557489799557e-01,4.378617941305891215e-01,5.786761917599265725e-01,1.023325722822664874e+00,1.503194623633854698e+00,5.814840678734864987e-01,-6.789253867952173005e-01,7.443291762891823815e-03,5.515418787697826675e-01,7.006686070636860553e-01,1.694796876035238542e+00,-6.023331056824946517e-01,-1.677595508767263377e-01,-1.929695982973672896e-01,-3.730815070166151881e-01,7.137584255682739576e-01,-4.003108572000407817e-01,7.592038059984000942e-01,-1.391350467405205071e+00,-3.906247253292804977e-03,1.006735259020511863e+00,1.340534060765066759e-02,-1.199870356272470517e-01,1.670998972788166448e+00,1.164575452456332538e+00,-1.122366339949501635e+00,6.486412823299005925e-01,1.674264797166262753e-01,4.963209646990730528e-01,1.900809866533810788e-01,1.224091758634183069e+00,-9.609874896647481179e-01,7.185468415566325096e-01,2.879652236269514276e-04,4.960198459180118480e-01,-1.118322291760354137e-01
9.317830109246965087e-01,1.022591215886591298e+00,-2.690080925727559302e-01,-6.519843443878836631e-01,-3.626886157318415793e-01,3.549525051625673777e-01,-7.758000582530283351e-02,3.251682711495246236e-01,1.453105197711212160e+00,4.480648036392007594e-01,7.395511891604089616e-01,3.586405939251851582e-01,-3.571353817774492456e-01,-9.915743350832246367e-03,-5.598552612718797894e-01,2.127361962020421160e+00,5.431977539722931958e-02,-6.307059487967087152e-03,-1.191147951509411995e-01,3.159044754354699280e-02,-5.936800774987220919e-01,8.598530472604655195e-01,-3.788615647654076657e-01,6.542014659645967178e-02,1.645066136563284598e+00,-4.222207398404089762e-01,3.908964899364528178e-02,-5.943554616356488962e-01,-7.139094981068730972e-01,-1.041135154578233246e+00,2.816276424888053964e-01,2.415006620497240242e+00,-3.489212500911188508e-01,-1.771089900290312436e-02,-6.659334924634729980e-01,-6.565489336170895474e-01,1.713546706842000056e+00,9.191193764841434355e-01,1.893334055081680622e+00,1.480229967499187449e+00,8.232555693193043256e-01,2.317727076919338935e-01,2.582809536188414579e-01,1.755535174604039850e-01,1.519964914898085939e-01,6.310357765572345290e-01,2.829290913141366381e+00,4.208111302210046367e-02,8.598362399914860621e-02,7.911376330979793536e-01,4.214040538871692831e+00,1.830972954306771872e+00,8.609179323222275748e-01,-4.220440034679588392e-01,-6.149693401721292307e-01,1.638483479587502734e+00,7.584219390006347039e-01,-1.812169191671849089e-01,-1.053120642075040747e+00,2.232842027759724957e+00,2.689829658987746841e-01,-4.692925332447181463e-02,-1.056035001824673358e-01,8.636849904030032832e-01,9.107660958965483333e-01,4.123758015003087252e-03,-4.985626169769332705e-01,6.118044330059000391e-01,2.544236917230931483e-01,-1.356530656037733262e-01,2.704787511358383689e+00,-2.329681885248760520e-01,9.190904836298008362e-02,3.325151534223574901e-02,-4.464912265483957088e-02,8.012051517203575557e-01,-1.516110800308914652e-01,9.965601978030809160e-01,-1.148904966863274257e+00,-2.222387250658244828e-01,9.272894751468812036e-01,6.390285836118774210e-01,-2.790136997209566871e-01,1.388377353099830902e+00,1.198765619389019044e+00,-1.252072836081414398e+00,8.087558507318420853e-02,1.390695081739874439e+00,7.148598871084377304e-01,-7.496034467222844055e-01,2.170394889571382713e+00,-2.570492997239197108e-01,1.012514191616285864e+00,1.337543952829987892e-01,4.679956482248590621e-01,-4.034006402934797730e-01
5.753631507498990771e-01,6.596066834777958299e-01,2.639106444901864190e-01,-8.697841179584120397e-01,1.632692978901523762e-01,-8.410590934868289459e-02,2.304531588235019246e-01,-4.643233733526672680e-01,9.753826551732414085e-02,3.845220699720183766e-01,7.291167530127522500e-01,1.360769426642749746e-01,-3.827124998092361619e-01,-5.112541984315492616e-02,-4.229697086845550236e-01,1.488706878743698780e+00,-5.163956970503122967e-01,3.243555002481732230e-01,-5.149217326991674393e-03,8.599804872616723106e-02,-6.685446604192739617e-01,2.383060517192152339e-01,-4.255040070766230587e-01,2.576286532701922982e-01,1.748843677214310333e+00,4.542070074972218152e-03,5.631081838826750285e-01,-6.590745038234888664e-01,-9.298207332131654956e-01,-1.143237282725451331e+00,5.252364922012506265e-02,2.497659495875262703e+00,-5.157805591778805709e-01,2.763660858524329134e-02,-5.165625346125514161e-01,-5.373585815362166285e-01,1.080439225379561385e+00,1.247688762337790580e+00,2.265188326545399811e+00,1.532065654219488371e+00,2.220933680793803489e-01,3.301257531521579747e-01,-1.164442715762949859e-02,-2.912575305574500173e-01,4.890478009939427384e-01,8.155635953384985370e-01,2.410340747210451884e+00,-5.005186537581214345e-01,-2.227471774306056806e-01,1.165700962411762909e+00,3.124050947279291002e+00,1.427367589769526379e+00,-1.625488997682430492e-01,-4.523915719742425123e-01,-7.858761410527920210e-01,1.874151670792923330e+00,9.098764384790930526e-01,2.648373557852041760e-01,-5.660263370775353575e-01,1.457272166128885438e+00,6.999323877891266976e-01,-1.322238088852832338e-01,1.099857927299490723e-01,1.418952088149064927e+00,1.264086118197355280e+00,3.422347313040252081e-01,-7.978394561518417083e-01,5.706860513796285783e-01,4.935551396950128566e-01,4.956155506743570305e-01,1.795081580001271382e+00,-4.887788765697893556e-01,4.049104231105348783e-01,2.214578113913340252e-01,-5.443178818175165024e-01,1.175547310452668137e+00,-3.529268314991563793e-01,9.737782070492677633e-01,-1.028445353396937323e+00,-1.459886895502677806e-01,3.269174029622221589e-01,1.551998600063783651e-01,-4.244449196683275360e-02,1.783393043568087366e+00,1.059884701711238053e+00,-1.202982528077696234e+00,5.580484429143912628e-01,1.052165169758698449e+00,4.030479416842047691e-01,6.145628590421909898e-01,1.389305238196042902e+00,-4.989278265457303685e-01,2.875408815023237086e-01,1.337312519052786253e-01,1.199151630628560783e+00,-1.140819791768258318e-01
9.380537444231662469e-01,2.046544300231448066e+00,1.180138951392116081e-01,-1.075094670436072430e+00,1.794659702986855510e-01,-2.082199562279498650e-01,1.222212186203462947e-01,-6.436555292742468515e-02,8.737063674444379702e-01,-2.791490474949341882e-01,-3.586130632675255669e-01,1.895311040631587063e-01,-4.512166178688833407e-01,2.133320164968792176e-01,-3.411705016607447516e-01,1.058953937580298543e+00,-1.802104953237806673e-01,-7.498189254092793576e-02,-3.338261563028334655e-01,-8.369545287468796446e-02,-5.962822515597305806e-01,-2.366082548890291459e-02,-8.471030181686941551e-01,1.292060042661286878e-01,1.846417838594609728e+00,9.089074558575702678e-01,1.114522681311461150e-01,-5.665595107277261455e-01,-1.642290473675200424e+00,-1.485278173918020528e+00,9.473938721898622628e-02,2.165159934386489127e+00,-4.952557175061992334e-01,1.663399159768473579e-01,-9.608307641717732661e-01,-3.842060599668360443e-01,2.048671377153462814e+00,5.573085238243480344e-01,1.658915292844989064e+00,1.543379109196095778e-01,2.833061478552530987e-01,4.258141039589307120e-01,-3.687676841824852336e-02,9.865552732108094636e-02,7.379662910052388058e-01,1.075753933604991275e+00,2.505626100370673015e+00,3.488265567771978160e-01,-3.404262061486697244e-02,1.034733296356025845e+00,3.437501926696532983e+00,1.702100452095001382e+00,1.766485337232858721e-01,-3.481237434766876193e-02,2.388521096696838431e-01,1.073651688417697869e+00,-3.181668020256674945e-01,-2.955746132714701102e-02,-1.246473425192992313e+00,5.302840236562582632e-01,-5.247306190854225116e-01,4.974946773301879288e-01,6.303252887102103186e-01,4.804912653292386371e-01,1.660621653873201931e+00,8.893968851028828393e-01,-4.674122984920210944e-01,2.497076595059185555e-01,2.385788544092062313e-01,6.709549048554970252e-01,1.621389683589964381e+00,-6.451777299111099984e-01,-4.374634563189506165e-01,-3.398637196876614919e-01,-6.076712380265893165e-02,3.974140581272888606e-01,-3.964789633510305555e-01,1.002244000018462922e-01,-1.582801480529332672e+00,-1.177079951513071432e-01,1.047228619450021325e+00,-3.099352017303196871e-01,-3.164635359116735325e-01,1.788435456870181683e+00,7.876934861945744659e-01,-1.025951953650839910e+00,6.127683387320909114e-01,-3.439809382782388347e-02,7.892775919155357034e-01,-3.661764933821837209e-01,1.118371144763368186e+00,-1.144625570248140711e+00,1.177726830392616719e+00,2.010207573745582399e-01,-6.046936179184052573e-01,-2.070254336046598587e-01
9.408413944102813620e-01,8.166125667821778622e-01,-5.179834890720540486e-01,-3.027305318537483192e-01,-3.662830352145978186e-01,7.868613203550711699e-01,7.464570677990284286e-01,2.650091260228848999e-01,1.006765693575272458e+00,1.724191352078956740e-01,5.415595642921579023e-01,8.367613457019376644e-03,-3.710549040139798915e-01,1.315136249727926754e-01,-5.191273268620675285e-01,1.733451091753739348e+00,-9.078485274146946837e-02,-6.923240543301580896e-01,7.797710060577077440e-03,-4.091102495867657979e-02,-5.222058530620906636e-01,6.048866660945894091e-01,-5.710446658831559441e-01,1.709176755275863269e-01,1.602008831132477162e+00,-1.803286360525195031e-01,-2.009746920350015953e-01,-6.443842828403613110e-01,-1.056328832185289723e+00,-1.111334092064969248e+00,5.710453511801159010e-01,2.323746772131911165e+00,5.682208642354241723e-02,2.771192703575460214e-01,-8.197675184943180593e-01,-7.506089037896500615e-01,1.950771696994617610e+00,5.420041904659137488e-01,1.776127194365668904e+00,6.826984825528181755e-01,9.812351877674627687e-01,3.710211359291950006e-01,-4.413228114991357698e-02,3.825739332156598560e-01,2.591026064974889520e-01,7.928754468783374421e-01,2.312593778703809111e+00,4.053107329332175657e-01,4.665654595187379572e-01,3.428104883188054508e-02,4.845074497220697829e+00,2.304754859861357197e+00,9.002819073690128127e-01,-3.811767480523949869e-01,-1.896850774698111697e-01,1.257215299775989115e+00,4.210808130125703874e-02,-3.840353514725474149e-01,-9.740111838637093289e-01,2.026645102990574543e+00,-8.269114368857113928e-02,-5.883507341716424088e-01,-2.559760589167751066e-01,-1.177396681898337238e-01,7.142357947191835255e-01,7.629074157360304920e-03,-5.902500437247981679e-01,6.958288748344995112e-01,-4.783422682455771291e-01,3.986188720080093839e-01,2.643547097339905338e+00,9.986742998068898203e-03,-1.093272194092832078e-01,3.074866829340621721e-01,3.050527067354463773e-01,6.128009160012695133e-01,-5.293395757491021758e-01,2.615802721768692995e-01,-1.018552659144152939e+00,-7.631428167780528460e-01,1.034955038085296541e+00,2.796091983285358129e-01,-4.925638973890197336e-01,1.565807994928239522e+00,7.562158832341167036e-01,-1.265709870995557651e+00,-7.165053835669954463e-03,1.014912733799548050e+00,1.125830423082103238e+00,-1.341366899727486572e+00,1.790691223014153621e+00,-2.160765670515001347e-01,1.185257378474068535e+00,3.876947480250756417e-01,-4.978668449781905037e-01,-7.471689994530115175e-01
8.736682130413855329e-01,5.282639668919877352e-01,-3.137925036624364394e-01,-2.961995703532209756e-01,-4.488808310600569951e-01,8.754381242007611696e-01,7.803751582864917324e-01,2.055166243938865711e-01,1.398721071300390140e+00,2.563260433678620220e-01,2.355735733830798262e-01,-8.628876570380894506e-02,-4.642969935359372857e-01,-1.344549218797082557e-01,-3.999510126404524080e-01,1.442408775397289178e+00,-4.786917672443261051e-01,-4.669924867858482598e-01,5.577289807274718458e-03,9.693658240479224864e-02,-7.362431785668190898e-01,6.491990903816777791e-01,-4.702824957428699548e-01,1.116602058905239725e-01,1.630339535823294383e+00,-1.521781678410157601e-01,-1.747632536159482164e-01,-7.306529618750013944e-01,-1.374596576460246578e+00,-1.146190644763072530e+00,5.957164126644873825e-01,2.676760054061729122e+00,1.313793626665721304e-02,3.155469202606220325e-01,-7.634190596690086927e-01,-5.774163731088448603e-01,2.022342302124230162e+00,5.433402797283797270e-01,1.778565388803781122e+00,8.935349920801096690e-01,1.071120654581447340e+00,5.886887812291838884e-01,5.940742963346408445e-02,2.349679719782126197e-01,4.905745418055839635e-01,7.416757834385456771e-01,2.377315053770502562e+00,4.002044429452432106e-01,5.034459123433455696e-01,-2.410248433537364177e-01,4.744437882150285724e+00,2.512863496386628093e+00,8.748348616209029593e-01,-2.726892781067220550e-01,-2.945266008740041741e-01,1.353948270475832105e+00,3.478840435118690788e-02,-5.391327037450077686e-01,-7.751123680206033484e-01,2.258259418784403394e+00,-9.719609985754110171e-02,-6.182548003616477050e-01,-2.994099466359374517e-01,-5.849140010957387670e-02,9.621285395936379770e-01,3.112645104395149187e-01,-4.587394889207164761e-01,1.130513075940915435e+00,-4.202427519140420897e-01,1.464555095317762179e-01,2.517473603233488788e+00,7.935646677584284880e-04,1.141287254205367030e-02,8.493768207982371754e-02,3.969958483711542585e-01,4.289610694618531395e-01,-5.095236422628308670e-01,2.261724654527696998e-02,-1.266119310004998777e+00,-7.108043923433866595e-01,8.094380633120096258e-01,2.397886315034369054e-01,-6.327431318039098418e-01,1.806837972637384659e+00,6.193962190069417506e-01,-1.360168591225845214e+00,-5.068256492313383266e-02,1.268080856342059359e+00,1.246627984795068311e+00,-1.539773632298596651e+00,1.892669046367005503e+00,-9.071359371433906915e-02,1.263378200021191278e+00,5.393518403418307017e-01,-8.875272457184761876e-01,-8.023850919803124926e-01
8.231797500729579609e-01,1.004324999682033592e+00,-2.292357946021986864e-02,-5.182801391468360164e-01,7.574797492124067666e-02,1.644167760583409854e-01,2.974027789400415234e-01,-1.313666989875497126e-01,4.772465914513120411e-01,2.072913065488316275e-01,5.713917543565608659e-01,7.769370983708742684e-02,-3.918730221828909954e-01,2.180429297142782996e-01,-3.111697045084482194e-01,1.611461548135583399e+00,-2.548603108636868786e-01,-1.896027333740784027e-01,7.868995319538424349e-02,8.445024165290831997e-02,-6.716037637970376784e-01,1.474633523713997918e-01,-5.720972722581826320e-01,2.961098846576293298e-01,1.503113535634896358e+00,-1.087733165349068221e-01,2.579862461088802128e-01,-6.011325854741156327e-01,-5.829809568669455100e-01,-8.537986872423286577e-01,3.319632615542655318e-01,2.240451511824721464e+00,-2.151383802228597486e-01,-7.296976899427645713e-02,-6.723714830818064980e-01,-7.153563304196678407e-01,1.335793564884416806e+00,1.018817561456833776e+00,1.682546248497040153e+00,9.896579201797888192e-01,5.596780771026326207e-01,2.604882284945715387e-01,-5.541483576783788612e-02,1.560038832631568673e-01,4.121688564247393272e-01,8.885475367023429882e-01,2.459461957755898265e+00,-9.039993222404030249e-02,8.435024368370550030e-02,1.053636308014719525e+00,3.821548561433928626e+00,1.417756570976282049e+00,2.770452579329003573e-01,-4.713140976944409921e-01,-4.182477837405077503e-01,1.400288025901148314e+00,3.020626532404490638e-01,1.624254617331941097e-03,-6.797122585579264964e-01,1.067950005908778088e+00,6.297276663791061546e-01,-2.341102145849266181e-01,-1.047581495200337609e-01,7.172114202765255131e-01,8.281475781338307751e-01,1.797045387700491048e-02,-6.389834642670328968e-01,5.950802867395814655e-01,-9.584324648593178786e-02,4.082275126226996287e-01,2.305359973442576038e+00,-4.306520174959587166e-01,8.325803689925172224e-02,5.499651416857497255e-01,-2.154367553809916624e-01,1.225236260499478869e+00,-1.877161283390268720e-01,6.293213753478232864e-01,-7.097888953417816893e-01,-4.365771754238279012e-01,4.941404105644763289e-01,3.590156102914622560e-02,-9.549267526939664297e-02,1.445220689819365800e+00,7.460612233989547537e-01,-9.392905957479026346e-01,3.649796865551261371e-01,1.100966223936148625e+00,6.232347896806753607e-01,6.763104799873354001e-03,1.506788242312092407e+00,-6.278936122408627085e-01,8.222812532890935167e-01,2.352426698808238736e-01,5.280024324080250242e-01,-1.956559769926141112e-01
7.394251743623883044e-01,1.311676317199828912e+00,4.549284848939121328e-01,-1.149348365495880930e+00,5.293351326549483593e-04,-1.179545563839252131e-01,2.631743026237859384e-02,-2.048828327069578958e-01,1.375104400555980710e+00,8.724690268430029816e-02,-4.398207674805331702e-01,1.513037125868886834e-01,-5.497815363975662173e-01,-3.080512873846982802e-01,-2.746780293640561088e-01,8.813375432306976842e-01,-7.474963506495330146e-01,5.153124280443300842e-01,-3.301342988329504791e-01,1.340740530301038347e-01,-8.875748223735731024e-01,2.716191803622051149e-01,-5.354379885625505375e-01,1.749764587137239702e-02,1.941741466070650013e+00,6.840194206105801866e-01,2.884142520775793694e-01,-7.066851057794502067e-01,-1.965196194302541333e+00,-1.541024408925260047e+00,2.531469727656876501e-02,2.799634907606098455e+00,-6.818424764966402041e-01,1.879048088601305289e-01,-7.404545865296131568e-01,-1.334089535970712226e-01,1.926644002031194569e+00,7.754927060931456895e-01,1.963046734773085777e+00,1.018037384986016702e+00,3.572125741627642515e-01,6.876237375689515652e-01,2.037592764751748331e-01,-2.880780378872125902e-01,9.445048430918614457e-01,8.708809123399769980e-01,2.681350292228398491e+00,6.226186877524846064e-02,-1.243245923114218582e-01,7.449708806517576498e-01,3.110426027183846198e+00,1.951032553699741712e+00,8.833023877742268715e-02,2.516071803499636550e-02,-2.792526932496683933e-01,1.555586533646490244e+00,2.215196934219382519e-01,-1.328827170944627545e-01,-8.879089096252946733e-01,1.361721864029368234e+00,-2.919875690072969432e-01,4.262388146764508612e-01,5.137001521075447164e-01,1.029349356465799170e+00,2.021477610550697968e+00,1.230796090648629271e+00,-3.621817559135555031e-01,8.873951059881116654e-01,6.262726966946505769e-01,1.592921312425440716e-01,1.474667521185659691e+00,-6.200925053531294306e-01,-5.544492856274993442e-03,-6.995337909911528707e-01,-1.127585188942762523e-01,2.548565086570347971e-01,-3.492417000784119319e-01,1.871716441416848009e-01,-1.946433098884922552e+00,9.603441582932936704e-02,6.271322140579884685e-01,-8.595365805238155965e-02,-4.449223564875304238e-01,2.145053190634981455e+00,8.579087186111304941e-01,-1.300505879373533347e+00,5.353950061081129697e-01,6.250908959443811641e-01,7.974925157677713594e-01,-3.776403134687060792e-01,1.454038083721789665e+00,-7.429317828056736239e-01,9.974754825424932969e-01,3.229996484396731038e-01,-5.050468118404030093e-01,-2.494623452939849773e-01
8.383158739087440692e-01,6.339067044694030040e-01,8.777373222146751808e-02,-4.298467858430654043e-01,-2.488529556574783363e-01,4.312228720914719204e-01,1.427962293790177029e-01,7.047184700108760635e-02,1.535914109140332107e+00,4.446347566062590073e-01,2.810065540777762494e-01,6.526677540383260534e-02,-5.034051373052871314e-01,-1.709421613638654192e-01,-2.074089105872335970e-01,1.550397920519903883e+00,-5.822248565778821439e-01,9.836909101675508915e-02,5.445910093950345060e-02,2.818386620090827521e-01,-9.570040642534664022e-01,5.052098583486995809e-01,-3.520165020253093746e-01,1.414326336760413638e-01,1.487476433478079008e+00,-3.639763779126363730e-01,1.546182420329526852e-01,-6.979753251105695888e-01,-8.140667697840469064e-01,-8.071536261412597391e-01,4.280866758116010362e-01,2.736494921435932426e+00,-2.490050747259620056e-01,-8.993567390426632224e-02,-5.929565926001394427e-01,-5.323485405248509217e-01,1.561695869979730311e+00,1.001030883467394661e+00,1.596696750966305700e+00,1.481492991265961345e+00,9.071221211688635933e-01,4.966831504132626640e-01,2.302780041565986591e-01,8.366445472871661404e-02,5.619169382896144205e-01,7.016992764768389401e-01,2.764809482808100682e+00,-2.809889380367799200e-03,2.034258758935776901e-01,6.216691493389855383e-01,4.025622463615587954e+00,1.780420856498828419e+00,6.163800129917361703e-01,-3.579347107644931247e-01,-6.418740307532683209e-01,1.554446923545650616e+00,4.230965916361444368e-01,-3.435913908926544469e-01,-5.335268941225876915e-01,1.800141174605642602e+00,6.096925828935453318e-01,-2.501190852243904139e-01,-2.950783516294540609e-01,7.704638584535711265e-01,1.000435933794247889e+00,2.389316340169667097e-01,-3.573093170131116381e-01,1.242346990208562207e+00,-1.815502475483241757e-02,-2.733255978643166495e-01,2.528837761404556073e+00,-3.533866047396579391e-01,2.300785822630049271e-01,2.064591537381629260e-01,2.796439360723135259e-02,9.294073120295424095e-01,-2.675434529406184314e-02,4.699191020539111308e-01,-1.046155610239293710e+00,-3.444023761832672448e-01,3.310135279202901515e-01,2.553092870041697715e-01,-3.311976578814482819e-01,1.593347629918680175e+00,6.777075253883972916e-01,-1.097167528947215365e+00,1.155782934750513580e-01,1.746504934805430898e+00,8.327326601020451635e-01,-6.515093048518396657e-01,2.030525878195211575e+00,-3.002506663611178017e-01,1.119570805011076642e+00,4.139012199753028254e-01,-2.217110137679367821e-02,-3.385264528925902017e-01
1.008744825849156923e+00,1.764244362242238129e+00,-2.906576478246480355e-01,-6.603817900597866997e-01,1.275181607576514886e-01,-3.910081759833594628e-03,1.098353102441215756e-01,9.909529877628628358e-02,4.049404405742387247e-01,-3.448377332414465091e-02,6.211615505510370561e-01,2.680143056783440003e-01,-3.017656724234693555e-01,5.448655361959208188e-01,-4.624869112500575863e-01,1.890110420799618218e+00,3.218391645463401507e-01,-4.583367008144814125e-01,-6.344068022664077489e-02,-1.266248993429002212e-01,-4.014771400425312109e-01,1.280534626941091103e-01,-7.707500453576507926e-01,2.832421443400306993e-01,1.540960299502430519e+00,9.747503260740429665e-02,9.922414123034395406e-02,-4.734752295540661238e-01,-4.632874784218821151e-01,-9.618951892635114742e-01,2.680495346601664552e-01,1.781920479268835455e+00,-2.291784758231747710e-01,-8.107383772160192681e-02,-8.530514218138761651e-01,-8.355891455724107075e-01,1.570956785443557768e+00,8.321028739728725254e-01,1.565645231827863526e+00,4.753908380298659253e-01,4.721997119903508233e-01,3.471039310964224578e-02,-1.157553432027515067e-01,4.004304046002649664e-01,1.939217721698456853e-01,9.796438726089493620e-01,2.497972889700156962e+00,1.426731706093261609e-01,5.035658065386096338e-02,1.359052482015030483e+00,3.982893949039048920e+00,1.283661418862394266e+00,4.496264463899162234e-01,-4.576169885726600883e-01,-5.843025864629280974e-02,1.130421278190758105e+00,7.726262167427783156e-02,9.697497594788612174e-02,-1.164937432338490675e+00,6.989661793355504971e-01,2.455986528376220834e-01,7.206894232566024572e-02,1.371302369804004440e-01,4.981298984701486576e-01,7.303833790455926955e-01,-1.308658093915690546e-01,-6.708384569518294205e-01,-6.350666683559880177e-03,-9.923270662106778439e-02,6.484166856516226929e-01,2.409230057993727137e+00,-4.686403221703716038e-01,-2.805768106909417026e-01,5.152960115878119085e-01,-1.967958313795790670e-01,1.145685509056160400e+00,-2.026837992235896724e-01,7.508245487035445365e-01,-6.924693755878813528e-01,-3.972745289430454907e-01,1.011160596147374191e+00,4.425466206324585317e-02,-2.547845177328522670e-02,1.177711193031274250e+00,9.281153731959860265e-01,-8.328983704376364816e-01,4.179598439179805780e-01,5.298528776722026823e-01,5.718583591159325241e-01,-8.138072557247771899e-02,1.407247643029199802e+00,-9.230724044168145959e-01,9.864141809897593038e-01,4.484450337980480650e-02,5.149112204926200587e-01,-1.554017754946380725e-01
6.087652261736549164e-01,9.707494066991855242e-01,1.055803892320141130e-01,-1.059683930531406970e+00,1.554199165206621158e-01,-1.428740847266712355e-01,2.748167196274898250e-01,-4.003087452170387417e-01,-5.721080994749927484e-02,2.414835797748626223e-01,7.448252412675320233e-01,2.252191707010567645e-01,-3.238397916867059578e-01,3.261206422801816301e-02,-6.040780373970398021e-01,1.543053513354748274e+00,-2.607782257506403578e-01,2.046790859886299385e-01,-1.514006470834653728e-01,-8.858154076900609519e-02,-4.559894294348242338e-01,3.103724445140289001e-01,-5.248937256132449880e-01,2.130779671707369594e-01,1.916901384748737058e+00,2.628620811232503796e-01,4.725268466927291522e-01,-6.193256865633732788e-01,-1.213067547692590065e+00,-1.437856187830636623e+00,-4.138865393209173460e-02,2.328321541951776208e+00,-5.682096544165722296e-01,1.907597846005848197e-01,-6.246573740649168371e-01,-5.321106941778924737e-01,1.303487661843042655e+00,1.064375229957479352e+00,2.457586884309849395e+00,1.240100657924250616e+00,1.017299226276610069e-01,2.715914328711266368e-01,-6.821182946085992127e-02,-2.731718674532212510e-01,3.923832414009382763e-01,8.539514022944110216e-01,2.314246988433956709e+00,-3.703028385949234669e-01,-2.634410100458350334e-01,1.103288234192400630e+00,3.170836311727762258e+00,1.601918409547590239e+00,-1.349844828320921897e-01,-3.870421232337680761e-01,-5.878602763514633178e-01,1.822030837659246227e+00,8.604787932814234042e-01,3.392644097030929062e-01,-8.945995231896827216e-01,1.529938418127887001e+00,2.398921245398045743e-01,2.818780146588817370e-03,3.502235968348031969e-01,1.289960411082406999e+00,1.399928915689967024e+00,4.456822491386672191e-01,-8.833415993062125882e-01,1.967464449089667555e-01,6.025568053902455867e-01,7.725097342226234787e-01,1.645142814149472610e+00,-4.322738002958863013e-01,2.295402502394137678e-01,-9.185688239667422206e-03,-5.240669077921965568e-01,9.113589450304071526e-01,-5.679254027568156893e-01,1.001971543189948077e+00,-1.254157556939419882e+00,-1.095649665194112776e-01,7.237650987512401768e-01,1.916009468786093184e-01,-9.390937735054982749e-02,1.838435492187660003e+00,1.258388456985462200e+00,-1.326507285076049980e+00,6.089223179941276598e-01,5.403372241045004687e-01,4.348823372314757352e-01,4.717950628948702207e-01,1.253468911642569905e+00,-5.685198435140417228e-01,2.612432281452250482e-01,3.202066675910070215e-02,1.098124215654302738e+00,-2.069842108578328621e-01
9.161498227870202848e-01,2.275212346076328274e+00,3.258560489283897632e-01,-1.600558361582385070e+00,4.002828318129217355e-03,-4.876350940980948567e-01,-4.977896011640950413e-01,7.122085131245309286e-02,1.683313550684825355e+00,-1.104181229392788566e-01,-5.484497872848141942e-01,5.073673332380481682e-01,-4.767870532787560345e-01,-1.470970912132993358e-01,-4.879746835563673057e-01,1.159388128299909004e+00,-1.643312360937537464e-01,6.140281528512825382e-01,-6.536615571541957159e-01,-8.492722845954192579e-02,-6.379139382286795890e-01,4.266543841884876120e-01,-6.732602165904093550e-01,-1.193765077102056094e-01,2.143655163887900006e+00,1.035649577592465009e+00,1.779755418091946706e-01,-5.792157724372506422e-01,-2.135053083764800519e+00,-1.867234011513405623e+00,-2.260035041217964835e-01,2.476464190057482639e+00,-9.536819665670801527e-01,1.892590272693154829e-01,-9.116017135569459695e-01,-8.223226797394850296e-02,2.299930401593036855e+00,6.033369534316467275e-01,2.008426358417520596e+00,7.316962194004973385e-01,1.633364587218320008e-01,5.037558067279728213e-01,3.077560369037745103e-01,-2.089382782522952176e-01,7.782234937496470550e-01,8.975348359594201852e-01,2.936881633401088099e+00,2.535204845319933842e-01,-3.360405962059975771e-01,1.182422723184022972e+00,2.943131808964235319e+00,1.861307473219283581e+00,2.489616867220740826e-01,1.599767080002338915e-01,8.406303682132298949e-03,1.448471770355179045e+00,2.252614200639330710e-01,-7.400497960172586209e-04,-1.544056726140377478e+00,1.225024961835134540e+00,-9.078468317864938353e-01,1.098429037190480573e+00,1.000764123107426018e+00,1.174378408780099914e+00,2.301593537276380275e+00,1.387651424687809554e+00,-3.107667460212126809e-01,2.468645333935485242e-01,1.071271559147621399e+00,1.984962529237439821e-01,1.395690830426600471e+00,-7.520136292942275480e-01,-3.636381298774760684e-01,-1.199937816785030309e+00,-1.644416939788423682e-01,-8.062152685546075670e-02,-3.300650035107974833e-01,4.679513717863704736e-01,-2.340512219452208775e+00,4.526355865238147480e-01,1.258277327098767717e+00,5.659698858285265588e-02,-4.138736380300194195e-01,1.995766683031759303e+00,1.280834098600392101e+00,-1.324701783303271929e+00,6.479958429563049682e-01,-3.278521530746347779e-02,6.710691623260464089e-01,-4.521766922497083563e-01,1.476155290517250362e+00,-1.066398092411401155e+00,1.153245691686155094e+00,4.403933211037741602e-02,-4.813908504848016245e-01,-1.492710802696174954e-01
1.062856502612409937e+00,1.970815593886541262e+00,-2.169719834956171378e-01,-7.745720603656126579e-01,3.941330903009426789e-02,3.862722793511519370e-03,3.661164295671331947e-02,2.040044058079573674e-01,9.356478036118849317e-01,-1.278195577905980318e-01,1.745790471773550623e-01,2.753020926013516889e-01,-3.682704967590828549e-01,4.127975460043695199e-01,-4.165946834136319277e-01,1.657673708731627338e+00,2.139546654286885174e-01,-3.633269797372384313e-01,-1.955259870570242309e-01,-1.048581361967473036e-01,-4.904254505215322468e-01,1.799622762407510901e-01,-7.944365370923415215e-01,1.782706128806845758e-01,1.630804929052272811e+00,3.463943376395806073e-01,-9.970631764827653232e-03,-5.001361684629967996e-01,-9.011355822099794688e-01,-1.136262495482476487e+00,2.548886237540921584e-01,1.934467261801660065e+00,-3.006922409083591652e-01,-2.982978153755394546e-03,-9.313772778374411754e-01,-6.663750392310345827e-01,1.910683634658569829e+00,6.474592777115385500e-01,1.483345007260590931e+00,3.217003687703022807e-01,5.357543284202727074e-01,1.874332651787387893e-01,-1.808468085211465542e-02,3.826655110880111677e-01,3.701290909981361787e-01,9.843224561164732878e-01,2.607185659110828890e+00,3.555808174859801940e-01,8.956319121895510438e-02,1.150497293180775094e+00,3.986714513760774015e+00,1.530933318696833245e+00,5.598749512848835153e-01,-2.675750856690481960e-01,1.115904313214145516e-01,1.037716439464408502e+00,-1.527767166158855439e-01,-6.831562705075072683e-02,-1.286909424660025003e+00,7.535338003118619010e-01,-1.541576720904544173e-01,2.768050794023156902e-01,2.884053567645603611e-01,3.616812797293444404e-01,1.044269267929594847e+00,2.319129736893444094e-01,-5.003146952783251722e-01,1.427248406325916097e-01,-2.586227831784041614e-02,4.945934128685678943e-01,2.283487290898539079e+00,-5.017739794942467357e-01,-4.194448298669923303e-01,1.234478516521935743e-01,-2.171764556111981104e-02,7.582864831788120874e-01,-2.154546975838436962e-01,4.535399807172438291e-01,-1.084329757476814038e+00,-2.966637633200902568e-01,1.130353841671027926e+00,-2.008755580506968452e-02,-1.997715469758644113e-01,1.343056206144435105e+00,8.682050394528839643e-01,-9.036286641650168594e-01,3.949304682029103342e-01,3.904721473458192538e-01,7.363179464630846827e-01,-5.030775050394824532e-01,1.460323692137020624e+00,-9.786559283017515209e-01,1.252601627665319350e+00,1.233758505095586822e-01,-1.538824447385593319e-01,-2.287211985109333934e-01
1.104754399566415524e+00,1.014821876832693093e+00,1.245359145687136709e-01,-3.912848483522824439e-01,-6.126936103776383646e-01,5.739999845357929287e-01,-4.287910854712870257e-01,6.158475012401789517e-01,3.291718700482191728e+00,5.040601433385876184e-01,-3.644470107503306466e-01,2.130367158839847619e-01,-6.379204725853619973e-01,-3.982654722479392340e-01,-3.024692750354213144e-02,1.606319004397111394e+00,-5.890411283924563701e-01,3.223702464986020755e-01,-9.530176666147341380e-02,4.627084700632386749e-01,-1.262081077374098914e+00,8.505315093216969657e-01,-2.545236642724372778e-01,-8.758690757187906351e-02,1.388573793226434816e+00,-5.030508987822898126e-01,-1.428544226281362739e-01,-7.080832560339536119e-01,-9.179456099116860557e-01,-6.755582122230057163e-01,5.465301824504655848e-01,3.031600085740926875e+00,-3.162590191193121458e-01,-2.679084782602313974e-01,-6.676526002177488595e-01,-3.464140002542385188e-01,2.127279523904444858e+00,8.211478666928553327e-01,1.043260565822246244e+00,1.623141937555744096e+00,1.381466564487800364e+00,6.592569954822333766e-01,6.375825127966376904e-01,2.804202114740352303e-01,7.037459859638465209e-01,5.601075551605569913e-01,3.392060365342786987e+00,4.073485562657825909e-01,3.618244580613311223e-01,4.685914463129098317e-01,4.392981492217183259e+00,1.986386044197781198e+00,1.287042164356196006e+00,-1.357736811750808181e-01,-5.393455843182428655e-01,1.374439855053119164e+00,1.611432747652322695e-01,-8.307008996714022597e-01,-7.091789254502073314e-01,2.107789451349186827e+00,3.279181509614124135e-01,1.611608905216119769e-01,-3.563794517140602691e-01,6.246536310409220860e-01,1.166478774206739510e+00,4.653253748635990394e-01,1.709745504589783582e-01,1.762774056513139342e+00,2.024053250315600155e-02,-1.219760975278908921e+00,3.004180694302106769e+00,-4.222178902654430965e-01,2.401198424704215073e-02,-2.805879777460247304e-01,4.360153364246541763e-01,4.999707314976179484e-01,4.056752880513140869e-01,1.973457815141915206e-01,-1.456705194014422000e+00,-1.283008463324110116e-01,4.358680926651068988e-01,4.318754280637777110e-01,-5.790619430302750281e-01,1.469287023227831446e+00,5.640261174752461137e-01,-1.041457459660418028e+00,-1.764239905550682996e-01,2.254411596671333839e+00,1.083952212338282761e+00,-1.667400027001401996e+00,2.720647112177013049e+00,-2.803826512647326075e-01,1.921362714610651778e+00,5.453798957070848941e-01,-1.056855684180189714e+00,-3.806065163199854884e-01
7.922386881812825132e-01,5.529754205876034057e-01,-3.542950021671960603e-01,-5.500986087515222778e-01,-3.105312533711703238e-01,4.316852073946683133e-01,1.735246518199089760e-01,1.342920344142022049e-01,7.457670486994998349e-01,5.963510533513307621e-01,1.285135162821676502e+00,3.036829941567535385e-01,-2.802583980622848636e-01,3.167012178012959533e-02,-6.730180658208241296e-01,2.313482307371878655e+00,6.296138143605228832e-02,-9.144568649865529586e-02,1.933986253866416122e-02,-9.245632883628104870e-03,-4.725154899090308058e-01,8.812788058915781431e-01,-3.095990762160178433e-01,1.667346892494595834e-01,1.633538302823105415e+00,-6.734022408747996069e-01,1.742694506329682813e-01,-6.051897114368300912e-01,-4.506505495849857379e-01,-9.816702162531391052e-01,2.814625905569940745e-01,2.359733750821766840e+00,-2.719688970851567578e-01,2.155078656824747918e-02,-5.520920424299833318e-01,-8.028287798927743468e-01,1.346820026710805696e+00,1.099295726488099367e+00,2.200052255690612135e+00,1.734310464162814647e+00,7.312375650168656538e-01,1.278475797814188630e-01,1.293425650327670595e-01,9.014871128278789669e-02,-2.726203345587158156e-02,5.966134602968271583e-01,2.595377611769324577e+00,-2.348658430105107775e-01,4.859209879182262160e-02,7.860698110730552912e-01,4.212231304216054184e+00,1.764151458023326846e+00,6.825169819905582136e-01,-6.187293236821076459e-01,-8.751263188400850712e-01,1.858311607511791141e+00,1.122213305055264509e+00,5.011006982915330865e-03,-8.797861106743465331e-01,2.470713795619643882e+00,6.224303098443120241e-01,-3.985990666202965382e-01,-2.700782850920587785e-01,1.018062699325288589e+00,6.559709169685021823e-01,-3.011263917139176405e-01,-7.529685366478404696e-01,4.976188650252559298e-01,2.176866959667719259e-01,1.192244601162880113e-01,2.721953990869162343e+00,-1.059741764243868345e-01,3.327083484518320589e-01,3.723391517634524472e-01,-2.319057828150378198e-01,1.114743103094767873e+00,-2.962621885680049028e-01,1.304059971419463171e+00,-8.385024168436190362e-01,-3.639116307294316677e-01,8.016556805886592141e-01,7.549829339149589646e-01,-1.557586532877212604e-01,1.370799381203797518e+00,1.313686640494559077e+00,-1.325409557936694682e+00,9.509627718276056352e-02,1.517486395786435960e+00,5.862088663685334211e-01,-3.457697497212598448e-01,2.079640104977640735e+00,-5.069440169118694106e-02,5.895944842620329807e-01,7.651335480029652913e-02,1.190208509916834689e+00,-4.289401179824104404e-01
7.454202279723499691e-01,2.818554675348976524e-01,5.361541884160606619e-01,-3.834783067543990343e-01,-1.911837395765522141e-01,2.836800133508746158e-01,-2.102178174473087746e-01,-8.905299735929049498e-02,1.938263242390239949e+00,7.072790498759420341e-01,1.318263012197696815e-01,3.531347727292148686e-02,-6.174252211725588246e-01,-4.220053943953354092e-01,7.703727703273371974e-02,1.404966268571033350e+00,-1.048168450342562119e+00,6.383562194479637242e-01,1.735181244007208690e-01,5.792500437594795271e-01,-1.342613111218139199e+00,4.252779800981669744e-01,-1.498543725820238870e-01,1.476163244694678467e-01,1.327802674382361436e+00,-6.412143888359784771e-01,4.176814390868409665e-01,-7.619720863471095562e-01,-5.279318203946885557e-01,-4.633446569710636398e-01,4.048842110869302346e-01,3.108368716550052202e+00,-3.925227790189452226e-01,-3.862847119757891190e-01,-3.863699783538487864e-01,-4.022346561207802429e-01,1.198525685965288412e+00,1.380167435018255340e+00,1.406424998122935088e+00,2.155935974155745338e+00,9.449636971962072085e-01,6.186143177642833280e-01,4.269885982726687734e-01,-1.177702234943216603e-01,7.987000891954294524e-01,6.147208066009064442e-01,3.074913903912805058e+00,-3.281956266854187954e-01,8.039325693934322448e-02,9.553224547347731743e-01,3.530707745950496523e+00,1.406122943346996834e+00,4.349138238189847461e-01,-3.844970619448558891e-01,-1.048151935748428576e+00,1.783558440593482786e+00,7.004343869373673703e-01,-3.723249240626689271e-01,-6.229702973915351993e-02,1.691968737598305905e+00,1.290666618532266829e+00,-1.635885519722239945e-01,-4.760980794340112787e-01,1.368836864161468547e+00,1.092450146913837905e+00,3.200431215246762329e-01,-1.756208002695917036e-01,1.813366357346063662e+00,1.872596852200265616e-01,-8.372441166372892596e-01,2.547635361583369118e+00,-5.808847759743176464e-01,5.561878376934921153e-01,2.762072599279452589e-01,-1.404781445096672798e-01,1.259204664390542572e+00,3.777018565242245551e-01,5.726549361962324225e-01,-9.411926207868140937e-01,-1.296759105120986189e-01,-3.281636907211984422e-01,2.345191894731766813e-01,-2.195790031317543245e-01,1.600434769405754576e+00,5.165631110158490635e-01,-9.496718377423731816e-01,1.458029717182601770e-01,2.505751089950991606e+00,6.541811889936154367e-01,-1.842451130733408493e-01,2.263576952237309925e+00,-2.716719840732113034e-01,1.080671230355182200e+00,4.999691325360507976e-01,3.129811842104474051e-01,-6.402805007747369714e-02
1.085525700648905634e+00,9.582848073599885552e-01,-6.716033100848050053e-01,-4.355794598799787032e-01,-6.921100684855946428e-01,6.991404862841605894e-01,-1.536602819168631506e-01,7.445120713322331829e-01,1.963015375884478164e+00,6.022145338890390054e-01,1.092773492936489177e+00,4.796194239765617096e-01,-2.950432480325468898e-01,3.281770142764734582e-02,-7.149109880590387434e-01,2.688005701566829941e+00,4.364706646629241127e-01,-2.602851521084584285e-01,-1.046977954048398662e-01,-1.805360858623778625e-02,-4.821891374808674469e-01,1.304194443774017387e+00,-2.908667711911775977e-01,-3.574043903730755867e-03,1.558234403027671133e+00,-8.957684423487396463e-01,-2.240756743281628049e-01,-5.588257191012017122e-01,-3.776664135485718887e-01,-9.149990308805904249e-01,4.374081053277200093e-01,2.339838217923630115e+00,-1.933608695294936897e-01,-4.042737222942249797e-02,-6.856420649221700581e-01,-8.268721259384756994e-01,1.898781244655744826e+00,8.274766377679406704e-01,1.823992072137449183e+00,1.645728158054860835e+00,1.182593706543707546e+00,1.008664997811173913e-01,3.746860116723223499e-01,4.342803119575860960e-01,-1.877389992622954251e-01,4.751793829167826333e-01,2.988947611213919942e+00,2.229868909767264151e-01,2.677267387736576576e-01,5.495707189830952855e-01,4.942655324927327953e+00,2.046936493441766203e+00,1.449148739192634761e+00,-5.292045895034076519e-01,-6.859992702988020330e-01,1.629801028957859499e+00,9.060608454952060464e-01,-3.711793479673846097e-01,-1.259008087300167222e+00,2.921626907256309025e+00,2.316922283252385029e-01,-2.053678026083067543e-01,-3.686702929128189421e-01,6.129423514251630678e-01,5.067092940420905300e-01,-4.240197380697918739e-01,-4.449199934834071057e-01,5.927136691209516917e-01,8.002370505164915770e-02,-4.414108466136940079e-01,3.350122977882347808e+00,1.396862496995587843e-02,4.602770333726528829e-02,1.218652781216852388e-01,1.715132829097256173e-01,7.598974908637758929e-01,-8.251042813445513824e-02,1.221351249360786095e+00,-1.028767288104502242e+00,-3.519693686118326448e-01,1.232299121791267327e+00,1.052142526842888115e+00,-3.570840695976054691e-01,1.100918552381496163e+00,1.365440639819329949e+00,-1.326210471909509581e+00,-2.396829470892948843e-01,1.746357273577152425e+00,8.370567364476718675e-01,-1.411515353605452328e+00,2.669257799597845704e+00,4.483292545780648286e-02,1.241328170779463225e+00,9.876898479071630210e-02,4.482484918782541072e-01,-6.052511869119852062e-01
6.078620514145121057e-01,8.087001514191898277e-01,1.678396318470051218e-01,-1.177183680444697567e+00,-1.307397392497089972e-01,8.590829301425961795e-03,1.347547467370175944e-01,-2.257074421147997334e-01,7.898058373078996608e-01,3.827051888743312480e-01,4.678297736581291111e-01,2.838057483710091367e-01,-3.930844156448887183e-01,-3.222440838965022203e-01,-6.364518618079708645e-01,1.474887548663146974e+00,-4.489729518105274875e-01,4.923183255300808137e-01,-2.954716544069467266e-01,-1.783345968629306694e-02,-5.891300776359504887e-01,6.929363223536415539e-01,-3.688584890895366675e-01,2.835115822458000867e-02,2.059777067489261704e+00,2.469790647937284978e-01,3.664316691054025354e-01,-6.927195238949792611e-01,-1.702045350181806249e+00,-1.648148693844209811e+00,-6.696446577382225707e-02,2.724985664530377161e+00,-6.953927995155113617e-01,2.991249960916640971e-01,-6.034668716100584085e-01,-3.142506711512194628e-01,1.637552826413179119e+00,9.552506994292917497e-01,2.587865585621487163e+00,1.573312167026407415e+00,2.824133959211332923e-01,4.737274069588904291e-01,1.720412539228031168e-01,-4.059714036709788365e-01,5.005454243155665894e-01,7.000831158083926642e-01,2.536281013926711569e+00,-2.588845757578862039e-01,-2.351675590657388293e-01,6.870116281778030354e-01,3.252808900873369602e+00,2.055153993438600502e+00,1.192714535090490524e-01,-2.192267716315644266e-01,-7.070799340939474265e-01,1.997192666033859698e+00,1.016195274884402533e+00,1.066009387542867504e-01,-9.650928097877451428e-01,2.290640578491210277e+00,-9.618965420217132078e-02,1.231262841714847456e-01,3.887122215989774476e-01,1.370034137837578214e+00,1.752548466006742300e+00,8.065804078690633760e-01,-6.909904635124497485e-01,5.511506415736703302e-01,8.555623535162962812e-01,3.312878273113438743e-01,1.646907383802379332e+00,-3.477248576463135010e-01,2.890376001651982496e-01,-5.628793949526808005e-01,-3.345047925944695244e-01,4.324499592273559623e-01,-5.826801615897545528e-01,9.060090145931321004e-01,-1.795135963631171450e+00,6.292337322815161338e-02,8.091868576474275931e-01,4.215153277377787222e-01,-3.438472965489263733e-01,2.079120899094403896e+00,1.369522449806526154e+00,-1.593828103340734437e+00,4.521081317591643112e-01,7.713066405147732674e-01,6.179202312026381705e-01,-1.392038676139655817e-01,1.621460536075753245e+00,-3.105382769686768629e-01,4.497118866294792516e-01,1.170200681606043680e-01,5.884492547215703917e-01,-3.805195501786576839e-01
9.077553222893149920e-01,1.311251776267288394e+00,1.287547918389677637e-01,-6.887119773741775530e-01,-1.380498799986754621e-01,3.631359972150364213e-01,5.127831140233362062e-01,2.771138177535135971e-02,1.574887554017605718e+00,-1.177420603000846888e-01,-6.675255301949998277e-01,-8.483707068685164554e-02,-5.799519461078426197e-01,-1.304456922041237199e-01,-1.698801178266910183e-01,7.621901679598529489e-01,-7.109154171444929116e-01,-1.614769457128424901e-01,-1.997746042167986569e-01,1.296970567087298298e-01,-8.979378218696149050e-01,1.643879030704599731e-01,-6.847864411269788398e-01,7.263546387592495490e-02,1.748851283642427257e+00,6.562571775761939508e-01,-7.072441478630625555e-02,-7.165980486699461416e-01,-1.948974306501815468e+00,-1.371886824273512495e+00,3.978600355507275199e-01,2.678614192144448403e+00,-2.528646628357877346e-01,2.854536936114766554e-01,-9.058091728663051345e-01,-2.801770966080366354e-01,2.259907453870796612e+00,4.173917737986002630e-01,1.513343133597350842e+00,3.416803957062343189e-01,7.500342975299589821e-01,7.585019961049694892e-01,6.260766696759231809e-02,1.112948472044847231e-01,9.609577412417192877e-01,9.613951154726878556e-01,2.480124098820899015e+00,5.438203911374264177e-01,3.211624246788504777e-01,1.444356215546009903e-01,3.995188901694742167e+00,2.292531107262785639e+00,4.836400392695930361e-01,4.309928358525311198e-02,1.339186440067474670e-01,1.076936595224530224e+00,-5.247587102056465724e-01,-4.888270094286863987e-01,-8.845134717911359301e-01,1.189300968453728125e+00,-5.191734731768942179e-01,2.345159286078901673e-02,2.269504560242783242e-01,2.878664926839469285e-02,1.629409776579473945e+00,1.030492036739097284e+00,-2.634089616599735173e-01,1.080189478347103771e+00,-1.646343932186462855e-01,2.606971718031089180e-01,1.849783128091379236e+00,-4.110622343914818178e-01,-2.850518620894614275e-01,-3.782612108860586853e-01,3.481070770020238125e-01,1.367076815066640139e-01,-4.250971703599566442e-01,-4.568833080653693646e-01,-1.711419393423782465e+00,-3.928698377056209501e-01,7.671773311861723732e-01,-2.952585804149743809e-01,-6.451984548170799361e-01,2.041604744479281308e+00,4.030867116560767349e-01,-1.176447580640487267e+00,2.941516500725484540e-01,6.056915976848146199e-01,1.214128008657337388e+00,-1.250145586121225838e+00,1.443814302800958016e+00,-7.095875848051278467e-01,1.491135004451083823e+00,5.651256913527572534e-01,-1.560028843561462208e+00,-5.362290720402331790e-01
7.170241105367218815e-01,7.141834325524597515e-01,-2.771584866998694219e-01,-7.957729045321324524e-01,-2.834457646970978684e-01,5.149296412157131630e-01,7.678468283019987961e-01,-4.127308111086375186e-02,6.418235831078427100e-01,1.888743251837272097e-01,4.825980219065364452e-01,7.351666473977178096e-02,-3.610281420919569384e-01,-1.312331136748281502e-01,-6.985210168483615423e-01,1.455837440825673124e+00,-3.009488555893449213e-01,-2.520860666998160915e-01,-1.998921670598188260e-01,-1.339921952414671602e-01,-4.346529058197349249e-01,6.866888827562274145e-01,-5.184408434830511947e-01,8.411413454481318774e-02,1.984670159338340234e+00,2.501567608190541914e-01,1.415541212284260331e-02,-6.985558712866924980e-01,-1.804324571240879749e+00,-1.658643975724789055e+00,2.444842893323503907e-01,2.541310208495219047e+00,-2.776401338793841878e-01,5.342606436392547398e-01,-7.689911145742908127e-01,-4.962495833421354252e-01,1.957759072397855071e+00,5.669259800070681754e-01,2.436374817031140338e+00,9.032964580239313257e-01,5.763459517047507807e-01,4.929962682867476964e-01,-3.783732824038484738e-02,-6.862349624063444897e-02,3.932877582460822530e-01,7.756340071844333162e-01,2.181082089757643949e+00,1.679481401313334676e-01,1.694912819101458412e-01,-2.082149221698059716e-02,4.162378080286719850e+00,2.535562582361512440e+00,4.607750866493079966e-01,-2.368444204542015097e-01,-3.297935917925138849e-01,1.630305059600546835e+00,4.491535331094901329e-01,-1.409839398754889894e-01,-1.066913717494924363e+00,2.389921316016102359e+00,-4.619410427631878147e-01,-3.685365683813046633e-01,1.676660827747432359e-01,3.871937382843960718e-01,1.371779648975889110e+00,5.756209152451903233e-01,-7.487602584412257345e-01,5.231124139850567012e-01,1.484931486518538124e-01,6.723941840618584687e-01,1.924496600662785717e+00,-2.900033098644727581e-02,4.406528622700796316e-02,-2.866622620063270510e-01,6.653114883453266348e-02,2.476225840263741595e-01,-8.694531741100108846e-01,4.132596118457995127e-01,-1.617716921727127222e+00,-4.531882601928000076e-01,1.121188207683836868e+00,3.176238660465663388e-01,-5.492075701075735950e-01,2.047734992397599818e+00,1.101498637758099752e+00,-1.622840753243467216e+00,2.310381617191734072e-01,5.433802205004425456e-01,1.014907463712166669e+00,-9.666529009241902060e-01,1.525537167269384931e+00,-1.743193536736641347e-01,7.286303616977614084e-01,2.862766325171224313e-01,-2.328627345198915899e-01,-7.610577571457954882e-01
6.618435316574028393e-01,8.512281357751210198e-01,-6.087491602263840618e-02,-8.374374588564748034e-01,-3.224954761523293745e-02,3.485232732411306378e-01,9.523215939104541228e-01,-3.020269471012288487e-01,2.562732016442517136e-01,-2.800753738941133553e-02,1.270352707648115254e-01,-8.334354589859352402e-02,-4.138095468325482251e-01,-6.592079070409449792e-02,-5.389079272103328710e-01,9.822416244317535572e-01,-5.501900569325326451e-01,-2.774649922908426491e-01,-1.751031504905510294e-01,-1.083977183426609037e-01,-5.107143672945146928e-01,2.596095618334548494e-01,-6.608882875881080254e-01,1.661159478671926648e-01,1.984921090341507321e+00,6.466728664621627098e-01,1.156752397031645119e-01,-7.153552732290150429e-01,-2.026945558250984547e+00,-1.695483299307664282e+00,2.268999806345605719e-01,2.509043912884198591e+00,-2.722964113631025640e-01,5.634882142348789369e-01,-8.186500829032549165e-01,-4.200496274778370287e-01,1.906822519850964959e+00,5.289330968941577948e-01,2.319293368268524613e+00,5.040078722578125170e-01,3.872004738416657821e-01,5.935927463021596351e-01,-1.880865525713264486e-01,-1.290295551087268788e-01,6.608122044214134183e-01,9.479308471575711437e-01,1.994505787658474638e+00,1.799147619790778529e-01,1.500083608166916660e-01,6.037503221504381123e-02,3.832878032642512700e+00,2.409928080875785916e+00,1.002012318883171438e-01,-1.492522397972251835e-01,-1.086490348282237450e-01,1.453937490144456390e+00,6.587382133941888096e-02,-7.686497222624333325e-02,-9.279699487455272955e-01,1.677052226545044489e+00,-5.019579644743025204e-01,-3.293393430970400493e-01,3.130492361795216283e-01,2.734854684285270565e-01,1.558033128401392409e+00,8.362465722889230735e-01,-7.648387735329165160e-01,5.394580781881308518e-01,3.780253575669472593e-02,9.797084243620628463e-01,1.522993782126548012e+00,-1.869913186741424260e-01,-3.894570355940553397e-02,-2.329353478937720434e-01,2.041893537923285262e-02,2.723271290016560098e-01,-9.317601354296021210e-01,4.418815450110324949e-02,-1.610203006762640054e+00,-4.944943627476062753e-01,9.397303337097351328e-01,-1.030337347168082951e-01,-5.231680720530464956e-01,2.209508964889108196e+00,8.263061789441207283e-01,-1.488662272716691604e+00,4.348295942920807899e-01,1.992173102721748190e-01,1.023673595632622391e+00,-6.572387334095141087e-01,1.091044872455004811e+00,-4.610848486025683202e-01,7.073176021813905034e-01,3.700825698588162682e-01,-5.173265611136375064e-01,-6.588335138566998594e-01
8.601305906602336737e-01,1.045331153040468086e+00,-5.050015435283380372e-01,-5.983197098290046201e-01,-2.145125613775433759e-01,5.855105015755723841e-01,9.042831823181767259e-01,8.012661569697465680e-02,4.458725585961900717e-01,-1.598930408068102715e-02,4.977958508524983339e-01,2.741392846475095013e-02,-3.239955898198618178e-01,1.848679328077433848e-01,-6.695589570482022301e-01,1.541445002161778044e+00,-2.479802489521637510e-02,-7.022712837781185380e-01,-1.317674966871336117e-01,-2.123086222324379047e-01,-3.247234454094513056e-01,4.876142769889482143e-01,-6.964168555586358611e-01,1.716920445513764881e-01,1.838515393290299338e+00,2.809891753656423852e-01,-1.401477155609808511e-01,-6.292260053573746070e-01,-1.514525393285507615e+00,-1.500885333091263263e+00,3.906211740230669527e-01,2.194268263858721202e+00,-6.382546962026508508e-02,4.916126820374618345e-01,-8.975522211115055660e-01,-6.799221311389637146e-01,2.031084499163067214e+00,4.226226055655558644e-01,2.114218036895365138e+00,3.618508356564391626e-01,6.569117955478311899e-01,3.657270790725796195e-01,-1.859578344900384428e-01,2.378483463409256093e-01,2.912195516932417627e-01,8.958040317642792516e-01,2.071705754391468091e+00,3.943026650982889292e-01,3.267704672279097555e-01,4.218413388084452098e-02,4.536618197747178449e+00,2.411449663619071870e+00,6.000370073604360810e-01,-2.930901772362196067e-01,-1.018906123652768558e-02,1.272710144567115398e+00,1.168948290298932324e-02,-1.769141004561730623e-01,-1.184089123215775530e+00,1.874869623547680719e+00,-5.039392931337752790e-01,-4.533216381445970278e-01,9.841727820549450723e-02,-9.681529104064623414e-02,1.028428400880782023e+00,2.892074569833101849e-01,-7.657942329290957639e-01,2.973134786211845682e-01,-2.701768241369708057e-01,9.001099886767903735e-01,2.150208440915876817e+00,-1.031938686225825075e-02,-2.102208558905379054e-01,6.005016638262695994e-02,1.863604425974330625e-01,3.874858314280371641e-01,-8.465889704179110353e-01,2.394425147433283385e-01,-1.285991982486392349e+00,-6.893293023309241541e-01,1.285682168921594037e+00,1.506638287402138621e-01,-4.994439010522329081e-01,1.792707933646799034e+00,9.200375923217810614e-01,-1.404782496209467268e+00,2.032834409434122469e-01,3.196248715368602555e-01,1.084696186839095411e+00,-1.106717773490818457e+00,1.384469595636293793e+00,-3.698220577027570566e-01,9.422443514233274087e-01,2.904691924943285097e-01,-4.607394959891320529e-01,-7.714977884800351404e-01
1.159156137180276103e+00,1.349071364638167125e+00,-8.466604757307806262e-01,-2.803447793315179126e-01,-4.505940697014496066e-01,7.503649281740316646e-01,4.061396220601000695e-01,6.335077386957027601e-01,1.239501221924955043e+00,1.375024272121865565e-01,8.267733149310148022e-01,2.468066195827136600e-01,-2.768009270180898929e-01,4.126821516118710509e-01,-6.539604406260990377e-01,2.307651315133537828e+00,5.312873732752942946e-01,-9.138182601433728625e-01,-4.807969852515410480e-02,-1.678763717880928374e-01,-3.216998682914468666e-01,7.817920797207977834e-01,-6.379216208729863169e-01,1.481374649801053545e-01,1.510432499006741924e+00,-3.947309708394554084e-01,-3.752214236736457487e-01,-5.176513849938824130e-01,-5.474693328582228569e-01,-9.785086857658344961e-01,5.876426456890870842e-01,1.936674388686472792e+00,9.063773935330837750e-02,1.269062257552564521e-01,-9.125184635665745114e-01,-9.512179301979478696e-01,2.066752894568269383e+00,4.939341395588844885e-01,1.568903371525047774e+00,5.535962107294550849e-01,1.089406401953358250e+00,8.928751542537238794e-02,1.023660658690493837e-02,6.918334662885367026e-01,-8.962554626355456744e-02,7.651625218454430888e-01,2.527591829439511439e+00,5.613199413036397134e-01,4.768920288013799857e-01,3.776364850150894514e-01,5.210870282622074967e+00,2.090891746095708381e+00,1.293668558571509308e+00,-4.794497296369795714e-01,-6.521628610575214147e-02,1.093127224481962978e+00,5.550658353191784133e-02,-3.661654554456373889e-01,-1.355654119087559728e+00,1.979056933073539692e+00,-1.310715655121606205e-01,-3.884457092303397197e-01,-2.640758693289582126e-01,-2.140123897380421525e-01,3.610461926960190082e-01,-4.235052325231386527e-01,-5.631892952088796145e-01,2.757174699301254139e-01,-5.179352916940281881e-01,2.933765735192408464e-01,3.130602387498226058e+00,2.767494351964999710e-02,-3.376470741008435472e-01,4.398219459100730644e-01,3.369905310363642825e-01,7.267662577224986986e-01,-3.510570016342846600e-01,6.074171408472255340e-01,-8.050866689127585962e-01,-7.382309338015369260e-01,1.431223525913755346e+00,5.160808697979275550e-01,-3.835959204921590149e-01,1.111664386236204560e+00,9.760834617915252753e-01,-1.127935465504580348e+00,-1.114733603845124987e-01,9.635629989373919457e-01,1.036761992564198653e+00,-1.512499012440876145e+00,2.036689361165740397e+00,-3.206511819751307613e-01,1.395320051847504850e+00,1.967315714769301005e-01,-2.433088923654225799e-01,-6.961628933834831390e-01
7.099094758569023389e-01,5.693810503486202990e-01,1.351221074811067013e-01,-2.550862197861147873e-01,1.959901128723425257e-01,3.625572121998171804e-01,8.486569445727900618e-01,-4.191779182300455209e-01,1.186780816319400467e-01,1.058825878943593368e-01,2.733444054619477148e-01,-2.781275143287311735e-01,-4.804063614248350600e-01,1.656688778681226770e-01,-8.691841178608450402e-02,1.045250792714408350e+00,-7.706153448616490653e-01,-3.815354680765365991e-01,2.604661189931272713e-01,2.050393709629978467e-01,-8.541402379572323733e-01,-2.228504510467401722e-01,-6.273255576597147609e-01,4.133989061407093990e-01,1.410778958623455814e+00,4.724254355918218462e-02,2.976117727155617176e-01,-6.972004578623139937e-01,-8.083089087353672042e-01,-7.628086856736966404e-01,5.145557822123650871e-01,2.414440591036157713e+00,3.001404658668382908e-03,2.957012481254714387e-02,-6.615199014805087652e-01,-6.764945851813044531e-01,1.241584327962995449e+00,9.613897898845649159e-01,1.551382734495897697e+00,7.033858487149284855e-01,6.022786356933681473e-01,4.857808700202638219e-01,-2.401190270434291341e-01,1.162774688633725212e-01,7.221770607816233589e-01,1.009492134177778500e+00,2.126839286794390382e+00,-5.624302686552989927e-02,2.777812026055658245e-01,6.466670789566426603e-01,3.857104858725715957e+00,1.561173312810242519e+00,1.621804549294636466e-02,-4.369440888054480499e-01,-3.120847897492251555e-01,1.253530655638468883e+00,-1.296743713620447935e-01,-1.154988103109922531e-01,-2.612065891308024135e-01,7.048529590094105846e-01,7.587847887782144252e-01,-6.402518215361612253e-01,-2.755474435519637000e-01,3.288463551806621865e-01,8.233511099072154948e-01,1.771453878400381932e-01,-6.559585946920686306e-01,1.001493854196271016e+00,-5.362830975907172393e-01,6.460142576005980519e-01,2.067438972113929907e+00,-4.048934674447598470e-01,1.510977034703429034e-01,8.089475311562337456e-01,-9.630947100999835697e-02,1.280040109415231164e+00,-3.233621466375978248e-01,3.416348663022594767e-02,-5.661428037577483918e-01,-7.437813036565499303e-01,1.052969663311202897e-01,-3.758490595959670943e-01,-1.874506339387377596e-01,1.701753916447842574e+00,2.525223300528637305e-01,-8.731302663285986920e-01,3.981686835164135463e-01,1.135949985878165425e+00,8.259780798952964798e-01,-6.426605816087116452e-03,1.173092551896540936e+00,-6.223196090177616213e-01,8.253145643627162187e-01,5.071967475880825305e-01,-2.127469603872456094e-02,-2.849656547885177638e-01
5.899230374944451905e-01,2.063660314455896261e-01,-2.836170956766184692e-01,-4.313686930312676804e-01,-3.476600508989317884e-02,5.788759938367227242e-01,1.149828491815682030e+00,-3.696252685403416116e-01,-4.048941194840369739e-01,2.612865581017829730e-01,1.002269328359641554e+00,-1.426623426467487077e-01,-3.112995938184523470e-01,9.848872632289849827e-02,-5.960542502274872589e-01,1.507326615585288243e+00,-4.089878592537055102e-01,-5.257391987200121797e-01,1.390827543048775150e-01,-7.965491151894232846e-02,-4.221683428923868053e-01,3.225692575851915045e-01,-5.316310998683967393e-01,3.398806647830410754e-01,1.734171191973567616e+00,-7.424534742644300911e-02,2.218347165925441122e-01,-6.975432431770034469e-01,-1.115407445116271656e+00,-1.244371034431989376e+00,3.856856500438925472e-01,2.352828170101844751e+00,-2.572703074183174676e-02,4.045144868788945747e-01,-6.410233347264524539e-01,-7.665056868831339187e-01,1.321931032562164710e+00,8.565893679408745909e-01,2.385103100486234418e+00,9.486468295667555006e-01,5.040901863979432296e-01,3.553486654286620583e-01,-3.037314523480873496e-01,-2.191188914130751120e-02,2.985625608059963021e-01,8.583207405342742069e-01,1.848225989285193549e+00,-1.523036996723085568e-01,2.186874669749261924e-01,1.897121738034502902e-01,4.157736875726168790e+00,2.108245152590443094e+00,1.291507277224844819e-01,-5.353803042811622337e-01,-5.173277333690232682e-01,1.640442291642378647e+00,5.098232538132707603e-01,5.937353346106127860e-02,-6.075324568492763699e-01,1.918158531379326126e+00,3.372040827288422804e-01,-9.002195635929790551e-01,-1.917408401956092467e-01,3.820368561522041184e-01,8.124735823104864973e-01,3.701404679080100291e-02,-1.007844840697773581e+00,5.196259978345829644e-01,-2.650557935080855021e-01,1.029849592282385817e+00,2.032257279457875931e+00,-8.503461443615856208e-03,2.824602164129048631e-01,5.701990347793860492e-01,-1.576290611149562260e-01,9.851466982350701729e-01,-8.515417391439545902e-01,5.397968441578750998e-01,-8.196185493466203731e-01,-7.929231374949882172e-01,6.589275902794208273e-01,1.376323941373736592e-01,-2.823144922215837238e-01,1.861218432400120859e+00,8.614153076674043730e-01,-1.388353102758502100e+00,3.003427130460916694e-01,8.192444071815820905e-01,8.398718404099559942e-01,-2.288555919365238278e-01,1.240463433904359647e+00,-1.509176595309871804e-01,3.467352240588009726e-01,3.156348246082166242e-01,5.438612775403336430e-01,-6.372657027034031030e-01
7.498981830045647889e-01,3.139458834027315515e-01,-4.052991892876840474e-01,-2.451705689200215921e-01,-1.894168688095252129e-01,6.751787689442496632e-01,8.131974754157519358e-01,-5.900165557656268656e-02,2.018089203211663740e-01,3.923271539565229560e-01,1.117306541163995748e+00,-2.612291196794008785e-02,-3.122271745157715328e-01,1.569651098550526314e-01,-5.393307612569901988e-01,1.897031050702024491e+00,-1.900983837780702568e-01,-5.504137534836254231e-01,1.925286385391609678e-01,-1.217958443560235304e-04,-4.973001400970643582e-01,5.056916809238961585e-01,-4.583763905920364423e-01,3.101164015465749935e-01,1.533337511767629779e+00,-4.921862532505698051e-01,1.086113675715627280e-01,-6.525490481639386608e-01,-5.816086531195648890e-01,-9.139606038145740019e-01,5.012852770121575263e-01,2.303038294313010326e+00,3.766269926163984261e-02,1.664756618331107718e-01,-6.220551802760021509e-01,-8.781899562969595063e-01,1.333370541081115634e+00,9.314259020411144174e-01,2.042390041515830035e+00,1.167425829541291593e+00,7.824946234880743035e-01,2.441050949272230708e-01,-1.423823071497946624e-01,2.010108333915254231e-01,1.384795196925270311e-01,7.608445365644539438e-01,2.170906402083120579e+00,-7.960820186099071272e-02,3.003703170647504805e-01,3.717804767754417372e-01,4.490481171704852059e+00,1.924654137598528658e+00,5.268270869074496154e-01,-6.231135749669807211e-01,-6.053938449613922579e-01,1.573494437596131501e+00,5.617030684875612412e-01,-8.767229653751593133e-02,-6.380207543127190961e-01,2.019773967404280945e+00,6.075819341528686524e-01,-8.446231370487573553e-01,-4.247753062430849047e-01,3.845201008458147829e-01,4.810234906424004642e-01,-3.134871559164924548e-01,-8.395476074905938724e-01,6.403975860627407757e-01,-3.711736968208701470e-01,5.584734777011878260e-01,2.593345013426620049e+00,-1.164516538772680798e-02,2.551517092984687540e-01,7.443645911115607250e-01,-6.422039431708520540e-02,1.171718477354122045e+00,-5.117252563595906523e-01,7.253056160290153320e-01,-5.844578231327512974e-01,-7.824710122011504509e-01,6.499312637001061210e-01,3.503769015900957129e-01,-2.323070033518328525e-01,1.502459724294574972e+00,8.604323714350740060e-01,-1.230115467930126494e+00,1.070878489370767905e-01,1.317572977109062293e+00,8.177920310387339908e-01,-4.738583502681708026e-01,1.677072429463712488e+00,-9.799094034694744160e-02,6.351428303942425746e-01,2.940157104253171561e-01,6.221295637764934217e-01,-5.763888943911809060e-01
8.171236434614785882e-01,3.071173093208526828e-01,-6.861549644268067905e-01,-5.205972720903506712e-03,-2.975504229791903765e-01,1.133421442255699851e+00,1.578081503453355960e+00,1.551870725926873806e-02,1.426360638247079482e-01,4.718489270011391734e-02,6.726437126474473782e-01,-3.281101335333956315e-01,-3.483923329984547901e-01,2.242843626996425255e-01,-5.365907222654424658e-01,1.433571600209015084e+00,-3.015341412475207594e-01,-1.212709464946288840e+00,1.914762643382508234e-01,-1.064182123371401612e-01,-4.201310458402250925e-01,3.699488785227622034e-01,-6.725164502890456086e-01,3.212401233509085685e-01,1.589221777898387478e+00,-8.023140279791490803e-02,-2.523991954502765589e-01,-7.077052620521803172e-01,-1.255041737261755053e+00,-1.166875514613839648e+00,7.685492769166052396e-01,2.273757979697070830e+00,3.896763534387664429e-01,5.521172437282042544e-01,-8.521864744293842220e-01,-8.718657561765905673e-01,1.872650849245335536e+00,3.813362089582927883e-01,1.926157643273955555e+00,2.407208923837533820e-01,9.915763461259852196e-01,4.567342791284803027e-01,-3.716822357799398069e-01,4.194410605570976225e-01,2.976317738329984364e-01,9.100954771128800802e-01,1.730386924120846270e+00,4.694858446463878732e-01,7.094978590060385670e-01,-5.659421179081799425e-01,5.207297569071291932e+00,2.636079680292467309e+00,7.144626885274156791e-01,-4.506218753620924167e-01,-4.078427648682003692e-02,1.133550026559538182e+00,-2.779425940256846639e-01,-4.012501183346592892e-01,-7.478038574881226141e-01,1.977525598319164413e+00,-1.297621394233145209e-01,-1.226590433707921646e+00,-4.407643502348043141e-01,-7.248154882926264309e-01,4.929989482838672554e-01,-8.457701177191373487e-02,-8.323164758319048229e-01,7.311480411491274589e-01,-1.025495896652139249e+00,1.011173068461598934e+00,2.481920191630228700e+00,2.522438697774143646e-01,-7.804234745027376074e-02,6.931404028524157379e-01,4.262086622294950500e-01,6.480035937581537508e-01,-9.431978665365086112e-01,-1.579173238732904938e-01,-7.724658252491374277e-01,-1.249223544588596635e+00,9.714541034035890643e-01,1.944167157654823341e-02,-5.848598474424255844e-01,1.776516282855251649e+00,4.621823006521815769e-01,-1.340898975030170748e+00,-2.123488366116804693e-02,7.720041470091612013e-01,1.355145046140567189e+00,-1.455044947193266269e+00,1.368505137672174188e+00,-6.684106620555824163e-02,9.962618301828872758e-01,5.666049787124364245e-01,-7.987838398657556294e-01,-1.015031656912407598e+00
6.989871059003628373e-01,5.473270166226911204e-01,-5.701612391384390799e-01,-6.713104350767306050e-01,-2.354477142615760132e-01,4.978683167090283135e-01,7.162777007085217029e-01,-3.318877968127791067e-02,-9.443285356555575216e-02,3.819949827108349849e-01,1.423733095330463216e+00,2.140589484908827500e-01,-1.934349643421758025e-01,1.441642412005897933e-01,-9.145999290035616847e-01,2.161437181287865883e+00,1.797862964915644679e-01,-4.379909450465407361e-01,-5.308045363017528662e-02,-2.550103416505311027e-01,-1.574701662347817166e-01,8.135881356380110230e-01,-4.647532232973053956e-01,2.077274427218077091e-01,1.871075836122733094e+00,-2.741617195983389599e-01,1.174543364022038461e-01,-6.060329776307797900e-01,-9.580998786859658001e-01,-1.414892356046862476e+00,2.251716360394133698e-01,2.168387049323417859e+00,-1.980000112224021558e-01,3.932060546009155111e-01,-6.640853304398967039e-01,-8.376946222079675319e-01,1.481484374238986046e+00,8.480021756977951242e-01,2.638139219512582567e+00,1.226700625229578012e+00,5.030770709229437365e-01,1.177295972365245968e-01,-1.387351005008957139e-01,3.543462232682274837e-02,-9.829009628656526498e-02,7.075992435690302562e-01,2.108561602953073599e+00,-1.456782956077727897e-01,7.190077985955323214e-02,4.089338612900663694e-01,4.306469686753773729e+00,2.137611689308654306e+00,4.782458173873540552e-01,-5.863331277172154632e-01,-6.277412374548327900e-01,1.818992404041829491e+00,9.959901007608636947e-01,1.577115584644448176e-01,-1.095243920520285741e+00,2.553714246648712383e+00,9.136064067031265945e-02,-6.016555592597742086e-01,-4.750209735886419538e-02,6.620682148227591268e-01,7.694684467765606772e-01,-1.732085607361377733e-01,-1.044641671899476876e+00,5.638595923667577559e-02,1.394905234061183941e-01,8.599135032550768720e-01,2.321535513797816641e+00,8.112897345899316992e-02,2.152346299183759970e-01,2.885801356985977506e-01,-2.246016836092381563e-01,8.434132140199150918e-01,-8.321005557064777847e-01,1.163181497131284825e+00,-9.990183540673495122e-01,-5.533804587542082709e-01,1.178978016882788360e+00,6.461097598826253119e-01,-2.434163915235297293e-01,1.629213488133532728e+00,1.429914122327467840e+00,-1.556493281772703074e+00,2.054397506161727005e-01,7.415299814440621251e-01,6.982742656053853025e-01,-3.959237081099969413e-01,1.610359385473668636e+00,-3.616269613729428123e-02,3.115787364584010621e-01,3.780362144464155527e-02,1.070260448259745756e+00,-6.647997534022010990e-01
9.628044794511918525e-01,1.236379029508087202e+00,-2.534218144870295508e-01,-7.590726987924972802e-01,-3.286609121689803015e-01,2.180103473592151508e-01,-2.620273443368367761e-01,3.602905833320405038e-01,1.494714983395102781e+00,4.304037900815008699e-01,7.492600837114098411e-01,4.531035749775561006e-01,-3.413226127888882022e-01,3.287816548939563599e-02,-5.853651752273641984e-01,2.213777632633766590e+00,1.771360795633310503e-01,7.414823038945198008e-02,-1.747183604726482709e-01,3.717868150541099592e-03,-5.589123604049404115e-01,8.677011334969146894e-01,-3.957697860137805446e-01,4.752563110165156091e-02,1.665452113212498864e+00,-3.833933412704373378e-01,6.235051504409870604e-02,-5.602184282722270092e-01,-6.539161062698943816e-01,-1.059750481977223213e+00,2.074246204582998743e-01,2.337894830132498214e+00,-4.342615903897296681e-01,-7.150777677250913511e-02,-6.788291892144476813e-01,-6.519879974136900680e-01,1.716295500867554891e+00,9.480983037521724111e-01,1.884714532158023204e+00,1.491727900004965912e+00,7.545774137848213492e-01,1.696567799597263337e-01,2.924902345272955562e-01,1.769510953360656780e-01,1.135528185549718461e-01,6.341733963583822131e-01,2.921930597260487428e+00,2.196248620041411914e-02,9.421319528511856722e-04,1.007317770372809118e+00,4.088860687948701056e+00,1.703728248754462937e+00,8.543723284749212832e-01,-4.154061002767859279e-01,-6.014017805946439976e-01,1.641969202379409243e+00,8.161946511113470359e-01,-1.162333124396098399e-01,-1.159494857226548881e+00,2.133886441192311967e+00,2.456368077045699427e-01,1.311250827069616598e-01,-7.062459638378495996e-03,1.001451300840790148e+00,9.551791814544549064e-01,5.583588387857829627e-03,-4.874874421060825247e-01,4.721336830534990092e-01,3.926148013824370953e-01,-1.620199645421119827e-01,2.694499183229923212e+00,-3.038000195980420370e-01,4.687958872775896402e-02,-3.254777568158409573e-02,-1.127774758323571852e-01,8.157040816042551157e-01,-8.912426564075931479e-02,1.128807286735768134e+00,-1.179961534229404307e+00,-1.082314624385241619e-01,9.997087982329295741e-01,6.717778555264120044e-01,-2.230201052787077476e-01,1.318487706956649186e+00,1.299754047425491610e+00,-1.218396847381469472e+00,1.293649299547511844e-01,1.307987817814056708e+00,6.259437505322533735e-01,-6.267757562629973078e-01,2.182773452610216047e+00,-3.536097694467379982e-01,1.011412046898100492e+00,5.235425127890852570e-02,6.207746520527270828e-01,-3.193638099884275605e-01
9.468630434264584395e-01,2.301283267759139939e-01,-3.478799251664831949e-01,-6.226195749894791742e-02,-6.329815059693939538e-01,9.236265146894455658e-01,1.839060245482636025e-01,4.629999823099876233e-01,1.975552571029142390e+00,7.229413565267110986e-01,8.229709588006981491e-01,1.250312115342671337e-01,-4.376227688982566866e-01,-1.730381207295565993e-01,-3.548850072327068839e-01,2.187126976434962788e+00,-2.838480926700592821e-01,-1.925898363663767487e-01,1.703950645607677505e-01,2.808810356561203259e-01,-8.793067648838933659e-01,1.012034769001264767e+00,-1.853560492553765204e-01,1.039605585278349786e-01,1.335837557755918947e+00,-1.070250507091251579e+00,-8.912901243167251075e-02,-6.908087657582815400e-01,-3.203486801743997692e-01,-5.629181769487257014e-01,6.595767074294556220e-01,2.739364081641142423e+00,-8.309646393692138311e-03,-1.253227472274801024e-01,-5.412803295461372510e-01,-7.600811732355078343e-01,1.609750393558674997e+00,9.904872258687946740e-01,1.566004096148180924e+00,1.850365280614560071e+00,1.358522944660494058e+00,3.706674511043232534e-01,3.403102812724844162e-01,3.356656839641171119e-01,1.734401447664558615e-01,4.929706647967085353e-01,2.879537466729286344e+00,9.148157388263621070e-02,4.441706334294839853e-01,2.571761396377091335e-01,4.887562245082305523e+00,2.027769754327320761e+00,1.235486507904028475e+00,-5.517775931921904409e-01,-8.744091409436740570e-01,1.637260568805844363e+00,7.038261932675767829e-01,-5.624600020982962745e-01,-5.766431185531415426e-01,2.713770696141194705e+00,8.040172487825626435e-01,-6.399669621017110011e-01,-7.512790166110647760e-01,5.250537706804414562e-01,4.284875271380759187e-01,-3.488526551433470679e-01,-3.420211883929125674e-01,1.373831941160450487e+00,-2.977273622510995810e-01,-6.400497719935671626e-01,3.312498827403328683e+00,-1.978424410217921592e-02,3.263469319160334225e-01,4.727922226261814798e-01,2.461907545676728093e-01,1.024575563958193047e+00,4.647293131006413613e-02,7.530614849076099349e-01,-7.672369579166761211e-01,-5.794171588616950919e-01,4.942795002876083643e-01,7.478969485524573635e-01,-4.026462774446561421e-01,1.288150213557888613e+00,8.090816534984506259e-01,-1.195398967165558046e+00,-2.857603560871410653e-01,2.387674803185106942e+00,9.670300964478230066e-01,-1.316203434100039260e+00,2.624450096133413624e+00,1.783056670973695024e-01,1.267477536000059635e+00,4.240843621835076460e-01,1.185911765621753544e-01,-5.894336733835205955e-01
6.518936957100598395e-01,6.568977471869865692e-01,5.394874320071371132e-01,-1.000898096715572283e+00,-1.456765506822890188e-01,-8.057891401579803103e-02,-3.954634894905657005e-01,-1.722190855264052467e-01,1.617468434487607798e+00,6.360410571429971904e-01,2.379710104379166857e-01,2.970433402558310121e-01,-5.241529290246913497e-01,-4.951600451537276348e-01,-2.749576246077422015e-01,1.473719794869698729e+00,-7.819277356022568126e-01,9.425872939190770294e-01,-1.548155420313565012e-01,3.249204847458818657e-01,-1.034372487876711100e+00,6.429478086790346714e-01,-1.806960143006255404e-01,1.982166817522701407e-02,1.761543937069055321e+00,-1.795764354955240727e-01,5.125593595636284139e-01,-7.232461146749744607e-01,-1.149994677440399959e+00,-1.105038043443400619e+00,1.050948389462752486e-02,3.028617323887014656e+00,-7.688915464592357418e-01,-1.357827368046164995e-01,-4.361164735780470036e-01,-2.421694895804641368e-01,1.370975796097070987e+00,1.303193672338802678e+00,2.074179819542518732e+00,2.186114026509468733e+00,5.070836095373669750e-01,5.505321691094761105e-01,4.446301815385156342e-01,-4.139650744933321413e-01,6.944503046893039100e-01,5.997731791959562964e-01,3.030741431262277796e+00,-4.380291598867396829e-01,-2.646534939423683674e-01,1.107208705479762356e+00,3.006327475144288552e+00,1.581669278244503651e+00,1.989896147915577174e-01,-2.559962314155995733e-01,-1.033876938018771785e+00,2.063213407187530546e+00,1.127427371716813509e+00,-5.699342559006291553e-02,-5.440656632127821579e-01,2.058485492068022449e+00,6.503149368239922179e-01,2.787926685245842306e-01,9.721451087242273525e-02,1.819731394092340526e+00,1.661294556340211503e+00,7.270349162427263146e-01,-3.652240871218894736e-01,1.196662347850356856e+00,9.059811033857603224e-01,-4.847186262086030650e-01,1.987766846475829796e+00,-6.021319229050434707e-01,5.020560440925080359e-01,-3.951378419500041206e-01,-3.809146225487694548e-01,8.213835567030121076e-01,3.308075928198611626e-02,9.663979139612370872e-01,-1.563156170753861263e+00,2.521176885303919590e-01,1.783258959101576835e-01,4.286634029301132909e-01,-2.294269479940662937e-01,1.866815529078151403e+00,1.114883931351333013e+00,-1.298517608930225720e+00,3.737103156041228225e-01,1.727966765753273126e+00,4.822476506972966925e-01,8.046980727161007207e-02,2.059570729517194998e+00,-3.388431631287271428e-01,7.018771339506740814e-01,2.228538816114359333e-01,7.230075677873337714e-01,-7.391563661935185436e-02
6.224608688871393625e-01,6.405613698893275476e-01,3.632931406992191969e-01,-4.923089579977752983e-01,3.150232604579612516e-01,1.283401056743891377e-01,7.490046601605038212e-01,-5.970283349574374565e-01,9.060790492416148645e-03,7.844382008511260884e-02,1.054489109213727627e-01,-2.542194574523846673e-01,-5.062259528383720175e-01,6.612908072654158365e-02,-6.877710962333538625e-02,8.245454358210827506e-01,-9.304064794736783828e-01,-1.015458345343481228e-01,1.771552636791225710e-01,2.150502023814400698e-01,-8.952062646252059164e-01,-3.180971410387782861e-01,-6.263933972380759663e-01,3.907679789247677782e-01,1.533462008854590053e+00,2.973683987167020093e-01,4.468974065390749484e-01,-7.148422184804003043e-01,-1.079498592160655468e+00,-9.273497170736040296e-01,3.540269599190281613e-01,2.510582607291593771e+00,-1.830829299815462941e-01,5.557099469984828899e-02,-6.364559128829183621e-01,-5.330484728670831229e-01,1.195731002559420775e+00,1.023244837688701558e+00,1.705430834046686828e+00,7.733289981725445239e-01,3.852839352199030065e-01,5.532465077506056872e-01,-2.233097874524641036e-01,-8.868424073147014586e-02,8.724664061107223478e-01,1.039115036197052033e+00,2.135704040384406532e+00,-1.831932426064766251e-01,1.086621534602167233e-01,8.024954299934234925e-01,3.386221414594209556e+00,1.495909869207991738e+00,-2.599657414921227039e-01,-3.510079805744623083e-01,-3.461407481363792393e-01,1.365665745493993555e+00,-3.631356656683148998e-02,3.883275910957911803e-03,-2.423634984183647978e-01,5.674253117635361665e-01,6.878874215046416607e-01,-4.331802237579157611e-01,-5.720085830010997185e-02,6.302688718904595477e-01,1.160385807110126066e+00,4.831076567517100240e-01,-6.682995387661900821e-01,9.760989013015270999e-01,-2.410708776050355939e-01,7.100208880432214986e-01,1.698127563974857424e+00,-5.378634164463619305e-01,2.007038614850846225e-01,5.697786010516669997e-01,-2.419567348725436551e-01,1.195745970413054415e+00,-3.606594432894165148e-01,4.962991615968481707e-02,-7.960354519263892481e-01,-5.476761996736307925e-01,2.418818619868312592e-02,-4.697471111788197873e-01,-1.643668631392505852e-01,1.888271175318606110e+00,3.177769249132682550e-01,-9.223637853420681987e-01,5.650700855423944624e-01,9.485472134364401064e-01,7.262356814661643511e-01,3.189165973119352793e-01,1.009362402587307805e+00,-7.367005857927722001e-01,6.734692166437024063e-01,4.722837657274395196e-01,7.962504419364008212e-02,-1.783599830182749924e-01
7.592392522663641286e-01,1.071722182152853975e+00,1.730172031728321458e-01,-1.073670671470841498e+00,-1.666004167054363772e-01,-6.451367019524384405e-02,-3.021594817983625503e-01,6.097779290901161886e-04,1.313819020308414576e+00,4.570047234350081977e-01,4.707012219821990473e-01,4.109990626791754642e-01,-4.094903327665322945e-01,-2.318194458042875938e-01,-5.176609271786093425e-01,1.758451576176870645e+00,-2.703010383074101464e-01,5.672035698089220590e-01,-2.569140997666204962e-01,7.895940563545519875e-02,-7.000058651197174076e-01,7.268110481860063921e-01,-3.349971347851471992e-01,1.806959839550098534e-02,1.855415663062355724e+00,-4.414253614685834798e-02,3.349535738502402715e-01,-6.346955601790779111e-01,-1.158753443729833466e+00,-1.304476246196734524e+00,-1.272591107266990429e-02,2.641182889350988550e+00,-7.032070463050026365e-01,1.333942828627698862e-03,-5.870173631768187406e-01,-3.895486286949848553e-01,1.584982472464707914e+00,1.082231645085515170e+00,2.185367659364156445e+00,1.737602201401148516e+00,4.479900979277842699e-01,3.592826631115435543e-01,3.223972871570369714e-01,-2.231291442168470973e-01,4.213248009123890525e-01,6.545822916375311218e-01,2.887474849339021432e+00,-2.372392759497665704e-01,-2.349374631791822376e-01,1.090760413403255580e+00,3.333671090002861437e+00,1.692911284887627765e+00,3.663887029370117565e-01,-2.818166631070362915e-01,-7.572939139492653737e-01,1.899953416828712438e+00,1.015979765348641983e+00,3.151357104155613764e-02,-9.729086081430899924e-01,2.067960479961097775e+00,2.252914971743445183e-01,3.199041408995543234e-01,2.526530017937954620e-01,1.497356238026835040e+00,1.515127625535865441e+00,5.417463702859897090e-01,-5.091734643645658975e-01,6.287651670463295650e-01,8.292184752408264803e-01,-1.035541065166907249e-01,2.068732901272786862e+00,-4.762136201314892681e-01,2.394520114047273829e-01,-3.972287566978834894e-01,-3.290216629907299350e-01,6.838254898508924207e-01,-1.801826474733606576e-01,1.081630747492416944e+00,-1.556077455980569013e+00,1.585788214339677316e-01,7.204641024618191336e-01,5.149517581387252907e-01,-2.278355437448897347e-01,1.721629838317318750e+00,1.333931494698918474e+00,-1.349845499325210696e+00,3.670742639668937990e-01,1.172927942718417604e+00,5.115801463670419658e-01,-1.287571240067785783e-01,1.939447918332256826e+00,-4.185966524461492977e-01,7.149674940168355697e-01,7.140939097013807024e-02,7.374079418517496265e-01,-1.953925898832145347e-01
9.108732256035869668e-01,5.038446058913204073e-01,-4.395749494063222462e-01,-2.130300656041924090e-01,-5.177110032145513241e-01,9.902962446612630920e-01,8.442444810830271873e-01,2.942665741110494504e-01,1.440356073099296363e+00,2.613102540423971054e-01,3.178137717813198093e-01,-8.886850733493917298e-02,-4.459659515931983509e-01,-9.650233449171755074e-02,-4.381019648723367133e-01,1.547057227358743070e+00,-3.867579182161879903e-01,-6.031609455761760552e-01,2.293918038266703346e-02,7.113461656632234786e-02,-6.917714385342600414e-01,7.214268991337904335e-01,-4.738158117660531965e-01,1.108707593101178196e-01,1.604942982879109525e+00,-2.390440045264298485e-01,-2.565700117478697528e-01,-7.230928777701749466e-01,-1.312334460605033781e+00,-1.121972989484653738e+00,6.573220694617545323e-01,2.631684748499573345e+00,9.047723218827813385e-02,3.372564066532756089e-01,-7.843697369798656727e-01,-6.355319947591611118e-01,2.078462699237444866e+00,4.884760603383599409e-01,1.754829828632770594e+00,8.449654888910665962e-01,1.160898485150339887e+00,5.601445760134751151e-01,4.910081522683469590e-02,3.197583903239997749e-01,4.107548816250355395e-01,7.249099652255465154e-01,2.356838052689089746e+00,4.728187353743746879e-01,5.785509597250411140e-01,-3.534890846704176193e-01,4.973598508960034081e+00,2.594852298427819726e+00,1.009276756467526237e+00,-3.007721753095145001e-01,-2.666404749138267527e-01,1.312360802163198725e+00,2.824759247208374902e-03,-5.908314140750869914e-01,-8.217962879286904165e-01,2.382120342030344062e+00,-1.343549875638750113e-01,-7.086096532852226293e-01,-3.724817395111960083e-01,-2.109317736514022545e-01,8.365203148249382714e-01,1.961422546280019441e-01,-4.655075158045268169e-01,1.110114438354941724e+00,-5.338829015631652020e-01,1.461597834630311010e-01,2.662721439119776434e+00,8.132811346203044911e-02,-2.194195843085565423e-02,1.473621065859264112e-01,4.720703368437502156e-01,4.151927979655022360e-01,-5.331837266736412229e-01,1.782195660897134548e-02,-1.209590838668777479e+00,-7.966606927364945356e-01,8.982510926782695249e-01,3.005525289691025614e-01,-6.618814169460331964e-01,1.746641551981193086e+00,6.221292675705898390e-01,-1.373638994078170805e+00,-1.283192025423923188e-01,1.299380564022452278e+00,1.305762708398035432e+00,-1.729503849772029866e+00,1.960832470976185071e+00,-2.371622855994537371e-02,1.322263182056836683e+00,5.474660066847663042e-01,-9.563661572138781874e-01,-8.779813226552970473e-01
6.756171926731011634e-01,1.166896428232276461e+00,1.097707470375341110e+00,-1.200180317840090272e+00,1.514987666859650695e-01,-5.367333316728948311e-01,-7.713144855981521886e-01,-3.629156035031455563e-01,1.989154419234042681e+00,4.276175567489909346e-01,-6.066193646710831278e-01,2.508638815815498746e-01,-6.834188392627258413e-01,-5.499279430553198900e-01,1.113761848804055710e-01,8.463079259399167720e-01,-1.185648515837456340e+00,1.361039110483564851e+00,-2.174092042678133774e-01,5.206088100265336971e-01,-1.383998265956175144e+00,1.353708528849958126e-01,-2.865457559161816992e-01,1.971520409568799925e-02,1.698306496129950993e+00,3.042702125710371464e-01,6.938423579149799458e-01,-7.332327100186766256e-01,-1.346494334503645307e+00,-1.008395976974788333e+00,-9.588755700523504677e-02,3.160943999024152795e+00,-9.856651035215093781e-01,-3.580647583013820134e-01,-4.685759038399399112e-01,2.008653913397806523e-02,1.379175297210847306e+00,1.376460455960746287e+00,1.607073951407419710e+00,1.967807412337721606e+00,3.249459986791187194e-01,7.351462581132364171e-01,5.238645045474474848e-01,-5.248738333555096336e-01,1.200262274450102140e+00,7.624586229034895357e-01,3.272874926430751508e+00,-4.280426678469372304e-01,-4.140235449520255906e-01,1.611321791599988895e+00,2.253358209635832665e+00,1.150526223266129966e+00,-1.616978682607160822e-01,-3.039605105903570026e-02,-8.244432767760387915e-01,1.846620216547095961e+00,6.704719204355088502e-01,-7.314204497198817378e-02,-3.660523214711320916e-01,9.610147199020167008e-01,7.153255340428118503e-01,8.064788588492115551e-01,3.678576242724563850e-01,2.063897807086062741e+00,2.135601452302137382e+00,1.266599414066622575e+00,-8.405231984356842379e-02,1.473182728663287477e+00,1.069209592796431130e+00,-6.882218050881101501e-01,1.553881166598432673e+00,-1.063424693377519992e+00,3.755285611776703614e-01,-6.064774520614253372e-01,-4.591387056308405268e-01,8.258110624866769056e-01,3.666265924821701661e-01,5.467807222472236273e-01,-1.746898865871659101e+00,5.474159662944046989e-01,-2.204616472305302999e-01,-8.046257039135376599e-02,-1.686543348339707982e-01,1.978608475159518765e+00,7.510548123358676831e-01,-9.816776865769888394e-01,6.460715978068514165e-01,1.615165139589382903e+00,3.917796918213741764e-01,5.072466345929604881e-01,1.808654913099993600e+00,-8.778089115263210118e-01,9.644505246900207940e-01,3.175540358026063825e-01,2.462104744034954995e-01,2.956635090662507181e-01
8.373402655956990737e-01,1.269874353268855671e+00,3.594380722770509906e-01,-9.438686947671343086e-01,-1.656699706636444169e-02,-2.378794222833913730e-01,-6.019530747972119400e-01,-3.768322105635699137e-03,1.490059828975913492e+00,4.539678707846056538e-01,3.334134630868118565e-01,4.084909069865826359e-01,-4.620810453390779560e-01,-1.138054950269161286e-01,-2.660102120961724270e-01,1.748820363806888434e+00,-3.214762052824724492e-01,6.607938638800557873e-01,-1.426781607944627994e-01,2.316276252591911722e-01,-8.959022452629640254e-01,4.594703962582200596e-01,-3.555412262367827481e-01,9.140141724339855001e-02,1.608572294617375498e+00,-1.806789180389726246e-01,4.298733963816863124e-01,-5.986114244805236240e-01,-6.378117111818687457e-01,-8.992938609115658233e-01,4.317791441854645917e-02,2.569755712038256146e+00,-6.930314592955273412e-01,-3.191501327836711588e-01,-5.513679971978006078e-01,-4.380304579940426657e-01,1.364222384285969980e+00,1.275169242158039395e+00,1.715843752958975843e+00,1.772612897142684663e+00,4.899519607715738800e-01,3.047835341167400847e-01,3.683368690102070686e-01,-1.096187958358311593e-01,5.139143023654992870e-01,7.069594831536692991e-01,3.106115167732731663e+00,-3.042211059329379408e-01,-2.576807486776161449e-01,1.590272583937427209e+00,3.153601226863682605e+00,1.171889177330038612e+00,3.218643028974858544e-01,-3.386773194876459558e-01,-7.670548280269364749e-01,1.747807811198990091e+00,8.552420088916017349e-01,2.425893706321924359e-02,-7.723876402478918601e-01,1.385441985755968108e+00,7.123049850675041705e-01,4.613453078357983017e-01,1.311608902765765416e-01,1.639683764354967765e+00,1.330977592564423384e+00,3.735972334394405125e-01,-3.623851065803141425e-01,7.864653447284548626e-01,7.162360625578111373e-01,-3.639018620375559232e-01,2.255206501982869316e+00,-7.121117639655187848e-01,2.283626601307109372e-01,-8.164178291356177786e-02,-4.075313810788678826e-01,1.083798261381296868e+00,2.177854758294310300e-01,1.077187231435684955e+00,-1.201005544754997434e+00,2.075181009455003833e-01,3.798406399052534632e-01,3.418709699275505054e-01,-5.056256248109219920e-02,1.453242464613131224e+00,1.094688419878251162e+00,-9.956151755968392081e-01,4.160639682417441865e-01,1.500217165298502131e+00,3.654461611952556366e-01,2.275595676918907295e-01,1.985749095554269594e+00,-6.701110505058488487e-01,8.861661852427025199e-01,8.995399430476946900e-02,8.833097353644878691e-01,9.015663199487417012e-02
1.050556150827348212e+00,1.799767233459967475e+00,-3.983753376904326515e-01,-6.886660922598201173e-01,5.048122819440392650e-03,6.042803700081678109e-02,2.744197677732879148e-02,2.417889816031299488e-01,6.382228083707985888e-01,1.386131343103111369e-02,6.928517985466311480e-01,3.488661619045007600e-01,-2.816628093679274247e-01,5.129107861887115538e-01,-5.490685017859958661e-01,2.059017114119366276e+00,4.536329743478652587e-01,-4.583895253590971608e-01,-1.193209140596397100e-01,-1.621323608185628595e-01,-3.503270796690684530e-01,3.256137176007729561e-01,-7.339054964945523896e-01,2.241933186171968795e-01,1.579945395806371167e+00,1.527890748274011307e-02,1.870210276170303221e-02,-4.634953041627030146e-01,-4.860705062210345373e-01,-1.020050732493311241e+00,2.617808801020594656e-01,1.789679211932992509e+00,-2.480509913630712937e-01,-5.517048506702096344e-02,-8.658823003298812271e-01,-8.401539825925408156e-01,1.690967688026874916e+00,7.829653358325106005e-01,1.622524397334550450e+00,5.597508986397606856e-01,5.473865118697910370e-01,8.060593146681782617e-03,-4.590965002046015070e-02,4.324933698824125483e-01,9.545541802549184496e-02,9.159242561283765793e-01,2.580315749968213446e+00,2.017753535739840176e-01,6.291988202481299530e-02,1.278577837090528746e+00,4.138846357066319648e+00,1.406195078798508025e+00,6.304032633110330242e-01,-4.510914138272845708e-01,-8.347308862613989078e-02,1.172253088334798354e+00,1.804851082914420701e-01,5.012779180911430821e-02,-1.299735154293684358e+00,1.011132537565245570e+00,1.174434707449036608e-01,1.123336936110909123e-01,1.387699329624737243e-01,4.909856618731194833e-01,7.222362052675797006e-01,-1.654128508739959313e-01,-6.461396436846497116e-01,-4.872536306085784030e-02,-3.106071915917447274e-02,5.371743396214545552e-01,2.538675183247304901e+00,-3.987013857587669019e-01,-3.036101009159236086e-01,3.926392972603670595e-01,-1.393796374463279197e-01,1.026569190396080078e+00,-2.109153399313336286e-01,8.536729342783409002e-01,-7.949934828500457851e-01,-3.606659862722039755e-01,1.174970734471517009e+00,2.130177202589610408e-01,-7.523415536514152513e-02,1.141946339782330844e+00,1.060640275289606471e+00,-9.168808549407712061e-01,3.344704786242630457e-01,5.665780227537310365e-01,6.046147012657928643e-01,-3.151187998868928419e-01,1.577560245634204605e+00,-8.268062521345033167e-01,1.045174284437045964e+00,7.962797189785486562e-03,4.925014709618127928e-01,-2.265990916777471942e-01
9.013462023989080585e-01,1.294480352175450655e+00,-4.803850046098433468e-01,-6.614464351758265748e-01,-8.964460947356669984e-02,3.257320740180597585e-01,5.410934806268142827e-01,9.344522299116367337e-02,2.950766492765512505e-01,4.018433391702250224e-02,7.725339081255668816e-01,1.885575577265632408e-01,-2.716701359102807745e-01,3.498121385322622845e-01,-6.763166117674185296e-01,1.858104910971253076e+00,2.325120648457475458e-01,-5.846387151810696903e-01,-1.100291796232193559e-01,-2.216933864714437097e-01,-2.737949421731246114e-01,4.363718870622862456e-01,-6.945395990901938044e-01,2.174953381683916720e-01,1.745695995899944064e+00,1.100989593065284794e-01,-1.364466155021470950e-02,-5.491368979296803454e-01,-9.850783844355925911e-01,-1.302474692096274866e+00,2.954786291910368456e-01,1.975244942172225793e+00,-1.605699988092443853e-01,2.595266316320097300e-01,-8.504525327696277337e-01,-7.899236854561575427e-01,1.766706219880845197e+00,6.472746789539078893e-01,2.027623249642743097e+00,5.422056686100196199e-01,5.400085477691731750e-01,1.542062145698257780e-01,-1.556992042596999637e-01,2.809828671665651201e-01,1.307867550926339328e-01,8.924982833288150896e-01,2.242901324950972608e+00,2.054553435431036579e-01,1.587163148520495115e-01,6.515336515604105427e-01,4.301273144669085724e+00,1.919072085612332890e+00,5.415355761415986402e-01,-4.205504488747582315e-01,-1.270865637612673127e-01,1.316979365229352661e+00,2.445393606870196468e-01,1.669219070409450056e-02,-1.226533915287423504e+00,1.565303417405366826e+00,-1.456063843428998805e-01,-2.522070355191131097e-01,1.134672833531754632e-01,2.745058508061005154e-01,8.473791510945789529e-01,6.727204414627596663e-03,-8.024489774487456595e-01,4.358029842226218697e-02,-1.051995507561081789e-01,8.306021208898366481e-01,2.299326515422312145e+00,-1.599138048960616620e-01,-1.842157060297670013e-01,2.703388677754647862e-01,-4.942845709389821068e-02,7.580578881530967150e-01,-6.117615235504494375e-01,6.673270708507820226e-01,-1.003537771520210731e+00,-5.420597966647771049e-01,1.235496546503707549e+00,2.354617295245626241e-01,-2.566652242061140954e-01,1.493521529852710028e+00,1.075008937987885327e+00,-1.221085639842480752e+00,2.890073623740636033e-01,4.167027848752377084e-01,7.977978558806061438e-01,-5.773103121746050448e-01,1.435521012185830170e+00,-5.307317205024117968e-01,8.291506957629873886e-01,1.125025161171259724e-01,2.612653034825426213e-01,-5.168272538298056551e-01
7.264840197483447559e-01,8.309107422495667361e-01,6.662333179780036141e-02,-6.912703206148487212e-01,1.060043739197410323e-01,-8.385026898020048192e-02,-1.234150270059655718e-01,-2.035787354851459896e-01,2.911192167094325267e-01,5.145284786016443013e-01,1.138834457199910055e+00,3.029986288342883527e-01,-3.183052734390540150e-01,1.619122067034671208e-01,-4.369975840960385050e-01,2.070491085269794862e+00,-1.043553603867317103e-01,2.224971091889596519e-01,8.550560139474575050e-02,9.640220923760295380e-02,-6.179683396491612024e-01,3.652038437302721485e-01,-3.854634128618949496e-01,2.922154702095636769e-01,1.522773006017355213e+00,-4.837322699622710886e-01,5.157344110805444082e-01,-5.662861171315639597e-01,-1.177399626921826759e-01,-7.562766043576694130e-01,1.264049420073379282e-01,2.243539489037098100e+00,-4.454847821678008524e-01,-2.594437145876783424e-01,-4.838398558044400555e-01,-7.686475336155016436e-01,9.064830003030903693e-01,1.415845497758828841e+00,1.987541374692596730e+00,1.743615875900354162e+00,3.882596057103354648e-01,6.729284039763655523e-02,6.989542820509178633e-02,-3.673471487300496163e-02,1.779447874154733156e-01,7.428677984598504036e-01,2.667841704046502560e+00,-5.436733743035073729e-01,-2.130047909628476344e-01,1.601601472284770900e+00,3.399705820479977270e+00,1.026794781309649185e+00,1.467399901642721938e-01,-6.520029671281215577e-01,-9.092704914217042411e-01,1.829036775015157712e+00,1.089375144763963021e+00,2.834523844878930054e-01,-6.349214889043801602e-01,1.407100672765554394e+00,1.133106398231768619e+00,-9.872903717725775574e-02,-1.205176432204572157e-01,1.524484701172741374e+00,7.586353844543528568e-01,-2.371166025225385221e-01,-7.612181448938468709e-01,4.245681979598435740e-01,3.995820271732578588e-01,2.076454798171902538e-01,2.394413046447031235e+00,-5.035955745799208794e-01,3.924109615958280006e-01,6.080321146846823233e-01,-5.990229358541908633e-01,1.592280885579627991e+00,-1.867508758920849443e-02,1.405666571889509164e+00,-5.654218462518622035e-01,-1.544177187912016136e-01,3.547211384427266245e-01,4.000090676545746682e-01,1.513276690494406163e-01,1.279966340088540377e+00,1.165973068414684732e+00,-9.819666290392765617e-01,4.281558922484756113e-01,1.461012807219669973e+00,2.321015321124826336e-01,7.068201297531826466e-01,1.731123595725106767e+00,-5.032752132507160026e-01,3.979058594180799324e-01,-4.604576922769831882e-04,1.766222646610259073e+00,2.824450483169688164e-02
8.970752470599512307e-01,1.693057614245473630e+00,-4.498274542040923696e-01,-9.287299900388938934e-01,1.374662290848056856e-02,1.767048664135754399e-01,6.838666738659047173e-01,1.187708980319396312e-02,1.111990370497937253e-01,-2.438294200061308092e-01,3.998225577004782538e-01,1.743303502517616344e-01,-2.770454857838875462e-01,3.796295267640982241e-01,-7.409879104971411889e-01,1.507913858398196361e+00,2.397450983738285690e-01,-6.398690076761913703e-01,-2.895623526914960499e-01,-3.583736275191233278e-01,-1.602011894743389786e-01,2.845575672584613747e-01,-8.664885641619588519e-01,1.773947347786369588e-01,1.962507422909096855e+00,6.977188337352857594e-01,-6.421146336946498279e-02,-5.434625637241637941e-01,-1.613228316518638072e+00,-1.701379687206382219e+00,1.778672154612924994e-01,1.896881743115953256e+00,-2.505946132511821522e-01,4.828870335378219747e-01,-9.998773014847376350e-01,-6.525287851673776673e-01,2.072003896994864647e+00,3.870121490457733016e-01,2.159511758335919129e+00,1.185554649295439411e-02,3.241080027754714710e-01,2.395871433034493236e-01,-2.568097277275461221e-01,2.153678869594621292e-01,2.842833913567808235e-01,1.024567853720310895e+00,2.070158283495070251e+00,3.947689687162067584e-01,1.124185846326280352e-01,5.240990087513854867e-01,4.113803717747352984e+00,2.139809279241655204e+00,3.668094466935170050e-01,-2.249119094872972791e-01,2.284513914368910825e-01,1.166000381379445283e+00,-8.091545798820887203e-02,6.617436385707725632e-02,-1.482268699762273156e+00,1.292415838640368353e+00,-7.678662298040808132e-01,-3.325957955627498186e-02,4.943643887247979318e-01,6.632467608409831072e-02,1.251620098274971671e+00,4.418916888279519339e-01,-8.354437444417931458e-01,-2.167667790721407028e-01,-5.307098170930564518e-03,1.218717726738516971e+00,1.824871957626771346e+00,-2.062530905143164506e-01,-4.230674218535353526e-01,-1.043299110084515147e-01,4.019629317606882024e-04,3.479737785862155319e-01,-8.826993784018661859e-01,3.592335275203003553e-01,-1.405370837020458508e+00,-4.813109352012280850e-01,1.530886875005397885e+00,1.865868082812249806e-03,-3.699495319238992885e-01,1.752960745429239076e+00,1.088122873092342457e+00,-1.319409226883397679e+00,4.554738773488344883e-01,-3.208691822669993421e-01,8.991519623005348461e-01,-6.802851800362196277e-01,1.063301613792294376e+00,-7.608149829813016796e-01,8.592226602733138430e-01,1.031424807023490486e-01,-2.546043626695249085e-01,-5.835657189723895133e-01
7.298644278804508057e-01,1.034361994048078826e+00,3.587701932798824100e-01,-8.352146493554546414e-01,3.212012539944635037e-02,1.105716541176423595e-01,3.921600290600795180e-01,-2.705914971145408909e-01,1.062077449854759159e+00,5.628237909871672273e-02,-3.521602140213478394e-01,-4.393563286727528161e-02,-5.533732890965714635e-01,-2.008702968117461185e-01,-1.873299862228942070e-01,8.047219126048961169e-01,-8.471655670440008112e-01,1.864441508715804496e-01,-1.473850733989638950e-01,1.700309070535565292e-01,-9.118511447599487729e-01,1.011154989055582099e-01,-5.774182100629472458e-01,1.307069557740929144e-01,1.786978694639735021e+00,5.542616495888693651e-01,2.439363922235600890e-01,-7.277102867094356053e-01,-1.761505585654292272e+00,-1.337780741471191970e+00,2.214837856110550285e-01,2.743165635020835325e+00,-4.273674549083821272e-01,1.969873369786802608e-01,-7.396603707410369655e-01,-2.663498497883600713e-01,1.807299436474578913e+00,7.539867403475620788e-01,1.807526871029508264e+00,8.220928721112198412e-01,4.820054339964791046e-01,6.985594290465507727e-01,5.435564672284333432e-02,-1.566531562635993802e-01,9.477371662056812696e-01,9.275989987275942150e-01,2.463254193761002409e+00,1.068300320960709204e-01,6.704631199625048221e-02,5.331897849188118599e-01,3.423067919153150118e+00,1.965962393674841380e+00,8.859240845458205005e-02,-7.038200095692703773e-02,-2.235884074881595018e-01,1.410801281324383316e+00,-1.928565234836454589e-02,-2.050711340903851876e-01,-6.698501405832515410e-01,1.180370659393625843e+00,-7.314314455606588106e-02,4.075609834442206481e-02,2.589057847755811270e-01,6.619324947794208436e-01,1.700175645129264890e+00,9.977063417184355298e-01,-4.216737266723182831e-01,1.023355223423783933e+00,1.799611893769212934e-01,3.216687135487719118e-01,1.619316387258673107e+00,-5.224603640654195136e-01,1.432878263048310147e-02,-2.809707299080860254e-01,-1.771375817436850186e-02,4.637093166151153301e-01,-3.925250380948329676e-01,-3.985132988681427957e-02,-1.591544563993222416e+00,-2.199668830260818331e-01,4.644068400820121623e-01,-2.372535677290920075e-01,-4.419792000771735063e-01,2.090396737337339772e+00,5.798470759420832898e-01,-1.195389620384140761e+00,4.671097996521829665e-01,7.550248566086059654e-01,9.070786248751958603e-01,-4.417468612059209376e-01,1.341857828763290517e+00,-6.843321219376596876e-01,1.019364942240735372e+00,4.502071658207858484e-01,-6.442152115520280997e-01,-3.298376606711284076e-01
8.464160320516760372e-01,6.105078395145147052e-01,-4.509227608472641258e-01,-4.567714453515894224e-01,-4.167506858311616491e-01,7.199957625197088706e-01,6.208836174042974276e-01,2.071884205594625161e-01,9.950802687321709250e-01,3.429674986813349147e-01,7.423347573222121021e-01,1.005279521591053715e-01,-3.497406590896083856e-01,-2.350347876580409501e-02,-6.237292891693881902e-01,1.855644040797736594e+00,-1.244575071640234287e-01,-4.210891653658302425e-01,-4.137045572249344050e-02,-4.229193182285236746e-02,-5.023203349084431890e-01,8.065077527634071375e-01,-4.442699349893008964e-01,1.204542618653968583e-01,1.712682762906589273e+00,-2.821143342329290871e-01,-8.847407577599206152e-02,-6.646158739283211103e-01,-1.122049085947714131e+00,-1.222944448125788952e+00,4.420318882720889464e-01,2.462227540084438893e+00,-9.562197789577775442e-02,2.998508447162555601e-01,-7.236217366064077172e-01,-6.914810819919978702e-01,1.842218032430138264e+00,6.755112364069790765e-01,2.083195549768202870e+00,1.106173799427619953e+00,8.928012336545141370e-01,3.655690524562649202e-01,4.212511777026438364e-02,1.917134669875849573e-01,1.994820409046598741e-01,6.915061232123839163e-01,2.377394618117920633e+00,2.001406235223082419e-01,3.217907376279052212e-01,8.057945118790310612e-02,4.621502566649700938e+00,2.336948085217593896e+00,8.270539969072667752e-01,-4.047779186618480907e-01,-4.545051124277642018e-01,1.550393691959737197e+00,4.801411939784740457e-01,-2.834157173433673460e-01,-9.671470878980269470e-01,2.465881510282502909e+00,-1.732533389675067204e-02,-5.392116756948979184e-01,-2.091486104941043811e-01,2.785509620841057910e-01,8.538200655375556281e-01,6.422079901514726741e-02,-6.502742340291711720e-01,6.872649358439000267e-01,-1.465367368213416621e-01,3.024382127009343502e-01,2.557791589828698697e+00,3.017012054639328644e-02,7.740552436580072637e-02,1.302658632645481984e-01,1.607680313755284751e-01,5.898145076050986813e-01,-5.650974865984860207e-01,5.716529848456981533e-01,-1.170142318097345591e+00,-5.972926519616756913e-01,1.010895350962688344e+00,4.950183552032267342e-01,-4.712002757848825496e-01,1.657564803447052482e+00,1.007342446583028961e+00,-1.431835281477747079e+00,9.704983669279687586e-03,1.139597081247386345e+00,1.009322101364149127e+00,-1.155156389850879872e+00,1.908849053415266894e+00,-5.442752147476781488e-02,9.456689349986686643e-01,3.063267994944470773e-01,-6.154607226477637472e-02,-7.335850026785104561e-01
6.003332210637102317e-01,8.202804928132563234e-01,-3.641400679293725906e-01,-1.003433618884230771e+00,4.135903509501180630e-02,6.965366532645236863e-02,5.683910411728017031e-01,-3.013816775917254054e-01,-6.683055163308899704e-01,2.870018330888808311e-01,1.448981332586177562e+00,2.998254377829235318e-01,-1.591876004788362331e-01,2.148359188067713310e-01,-9.597469571360452978e-01,2.044459924868529122e+00,2.090084735143061256e-01,-1.958614508851788116e-01,-1.414436327133997140e-01,-3.329706851183804051e-01,-6.410088723268159150e-02,5.890837630128554769e-01,-5.388451931094863090e-01,2.460860729141097769e-01,2.008164678869702069e+00,5.224228640646710886e-02,3.562548447952291197e-01,-5.680172068188125145e-01,-1.052628847912218113e+00,-1.590084233236862543e+00,-2.747206417744396667e-02,2.032648752065565390e+00,-4.284889654316510477e-01,3.826982891966554390e-01,-6.510591995895741446e-01,-7.748421201924099444e-01,1.279897914910208545e+00,9.816105748120763641e-01,2.862381266417571180e+00,1.189553503799222645e+00,9.090034474981412149e-02,4.272130436242910223e-02,-2.168141857294003105e-01,-1.668155318711221358e-01,-4.753532732216125822e-02,8.007448334461014783e-01,2.044030795409857770e+00,-3.786616471032315800e-01,-2.155322968429488339e-01,8.935359138472511731e-01,3.642852839759395334e+00,1.820836193830104976e+00,3.036733811914960057e-02,-5.687776230981491654e-01,-6.268141492084697841e-01,1.922169103974109117e+00,1.155564324445695901e+00,4.824151058843474393e-01,-1.159645961623197330e+00,2.104646768705892512e+00,9.306499370655300918e-02,-3.117322431159693652e-01,2.821055715768009398e-01,1.094444234622961254e+00,1.042821440975886027e+00,1.155557347831326354e-02,-1.187830600941330417e+00,-3.052834013580713046e-01,5.109296661095171777e-01,1.179116325750761973e+00,1.858350956791400499e+00,-1.217508165839414624e-01,2.303352803116529013e-01,1.833552547818664835e-01,-5.481866844988770859e-01,9.409291876574801261e-01,-8.932075393602763036e-01,1.384770626028863916e+00,-1.076116763363995421e+00,-3.217084974633676597e-01,1.162568485370011340e+00,5.095054435452376351e-01,-6.850286030585039931e-02,1.712055306974085811e+00,1.605193265749643938e+00,-1.529928010086533785e+00,5.060592648761945700e-01,3.015122340620695063e-01,4.283377337222565306e-01,3.501131864292779672e-01,1.251785262081566596e+00,-3.089611952619226165e-01,-2.356732857674470605e-02,-1.275959414379143619e-01,1.614180341652953210e+00,-4.369830627379638899e-01
6.277727759842354205e-01,-1.997550927693835243e-01,-2.042773764819696414e-01,-4.921093629926289736e-01,-5.661791828925576420e-01,8.105531514391277614e-01,5.621932231408501845e-01,3.922672463999149484e-02,1.191071349772318211e+00,7.548865692070261257e-01,9.527147957883523866e-01,8.564599898995566007e-02,-3.948206793626892197e-01,-4.564885530807310521e-01,-6.282568047661066801e-01,1.861858130876666628e+00,-5.622564281198685343e-01,9.097798631757461618e-02,1.239087556827905140e-02,1.297647720190277243e-01,-6.978548322693844952e-01,1.117679040834037130e+00,-1.258487048629667315e-01,5.604158883042964501e-02,1.783741702538204965e+00,-6.392174273747909252e-01,1.263271210363260955e-01,-7.805304747377854735e-01,-1.219469686666593056e+00,-1.224282594260620582e+00,3.669668482566253997e-01,2.978677206812151645e+00,-2.479704022775041650e-01,3.020067124322818319e-01,-4.735160773239147636e-01,-5.459452187012415747e-01,1.566517995018406495e+00,9.707569757643100816e-01,2.475654477124206387e+00,2.036519450479049809e+00,9.254451809648160943e-01,5.194018042128925039e-01,2.271012752045206695e-01,-1.739701304523928460e-01,2.640739073545774751e-01,4.774050772723986147e-01,2.486872066686368843e+00,-1.863696925789979919e-01,2.050330406474187295e-01,-1.062200891057990537e-01,4.331383113024344311e+00,2.482645397019265232e+00,7.104394374083402575e-01,-4.515553342046155216e-01,-1.052454128459220595e+00,2.088587321677188857e+00,1.172441119818640409e+00,-2.836742069006721323e-01,-6.068933783379905078e-01,3.333225746994826544e+00,3.705185113938683772e-01,-7.107741404249725559e-01,-3.848754728909258294e-01,8.887178829492843324e-01,1.037491437985754272e+00,1.889625609112224602e-01,-6.579008275217029800e-01,1.170624561544334696e+00,2.223681975770162855e-01,-9.484082942446969700e-02,2.493056410405271706e+00,9.792370605981065568e-02,5.643518199868274854e-01,-4.310023794461365076e-02,1.577673403470954139e-02,6.253330658672082709e-01,-5.429328445858248031e-01,8.644782707830205304e-01,-1.343106070720659906e+00,-4.348620382314253296e-01,6.067184249047470335e-01,7.958208778293422991e-01,-5.093978632447885291e-01,1.912589098189375614e+00,1.167585612937676487e+00,-1.696228405576205356e+00,-6.271771377815499315e-02,1.817738918856057095e+00,9.278876141809353495e-01,-9.738800314510858147e-01,2.224557134298088990e+00,3.899279565904740785e-01,6.097607789982067983e-01,3.585078153444244409e-01,4.297389390245967555e-01,-7.585926949058188207e-01
8.071597143881179548e-01,1.088608438318297678e+00,-6.570523639152289208e-01,-6.824868459574605639e-01,-1.302451890072433005e-01,5.657666928394822214e-01,1.172414425958817397e+00,-2.850531612882074850e-02,-1.909154828385547509e-01,-1.316279904593510575e-01,7.118777544496250886e-01,1.356367261806760982e-02,-2.447024290494988485e-01,3.161770721320631417e-01,-8.403959103747247195e-01,1.558331901426599053e+00,1.400867171821634227e-01,-9.140806643130300335e-01,-1.626676925255942652e-01,-3.818072788144858398e-01,-9.051360445319811543e-02,4.345105856996693827e-01,-7.949031879962915603e-01,2.188432451058958672e-01,1.962810168997059845e+00,4.689967776936198041e-01,-1.394269192041276695e-01,-6.051577542112993591e-01,-1.665106821050690744e+00,-1.719036634803787322e+00,3.311696218229743804e-01,1.993166034474806336e+00,-3.183014223700986189e-02,6.697145397923438548e-01,-9.527008119531721331e-01,-7.509807035238735828e-01,2.023357586700065269e+00,3.304121543785636383e-01,2.390311277026705206e+00,9.080150356484617546e-02,4.747456463775123758e-01,2.856950578212350544e-01,-3.622660915164536144e-01,2.191305667453091188e-01,1.776045274808767394e-01,9.647591962338515348e-01,1.787348682630602204e+00,3.871143684044545674e-01,2.966488068198387951e-01,-3.152344271619322846e-02,4.549975283616340960e+00,2.510800368120037707e+00,4.504925226720439824e-01,-3.248484019458325878e-01,1.057213459777859299e-01,1.267729696418113283e+00,1.566979812837698827e-02,-1.185704313782393049e-02,-1.333095663710521794e+00,1.858600905085493471e+00,-7.271813264354420880e-01,-5.553802269322588581e-01,2.324937653799468706e-01,-2.255463047625084760e-01,1.020003571887908800e+00,2.578170151467406024e-01,-9.843157773744419803e-01,-7.914392107581880165e-02,-2.862404690589124279e-01,1.381993167975802406e+00,1.947573898500138068e+00,8.232714332218610265e-02,-2.695879544991283683e-01,9.610399961618479314e-02,1.161696433734163841e-01,3.392982400839088530e-01,-1.138266184156790262e+00,2.932469696637566847e-01,-1.280851644700790493e+00,-7.866540587831883924e-01,1.519928638404248300e+00,1.163670432437065305e-01,-4.787067628837083921e-01,1.864210155237582933e+00,1.049470196679729295e+00,-1.505555358352466788e+00,2.953544610676228088e-01,-1.516536613760395280e-01,1.069652535862848142e+00,-9.735853846034587811e-01,1.091688973549962638e+00,-3.915922087018578468e-01,7.067168037128608304e-01,2.085540845343868965e-01,-2.857486109878441538e-01,-8.578941349178665909e-01
7.476519335159932389e-01,9.756107074968094484e-01,-3.205126803739925534e-01,-5.886506178787062060e-01,1.086133348804159543e-01,3.163695743924618831e-01,9.239781588217197417e-01,-2.545073020389998497e-01,-3.598095636687110854e-01,-2.182979981853039320e-02,7.352539154940084254e-01,-3.042105449658120964e-02,-2.959082992510962407e-01,3.498455063705787071e-01,-5.789603731562825706e-01,1.486526114028275503e+00,-9.865331589968584503e-02,-6.414251636469139317e-01,1.319578303301421202e-02,-1.841131256235405134e-01,-3.242777347936162124e-01,1.141924067155909439e-01,-7.393780325224013072e-01,3.366563829807618369e-01,1.737992280062368833e+00,2.721569786643267541e-01,1.412575624807270724e-01,-6.024764259864321403e-01,-1.108317372792938960e+00,-1.299409778216596312e+00,3.184008915074930668e-01,2.027062617275983580e+00,-8.405463565232842993e-02,3.393406836048291630e-01,-8.066382343725917448e-01,-7.782341843443545404e-01,1.528378738714129215e+00,7.080247015401334165e-01,2.119125619110381997e+00,4.098412224156686712e-01,3.837341574402600153e-01,2.485635389602700307e-01,-3.439127236065167015e-01,1.498686567169164596e-01,3.070116562361389079e-01,9.979425947237241523e-01,1.929828496208653377e+00,6.218294500733029251e-02,1.662999259027287680e-01,5.576814276429182815e-01,4.069756101175044272e+00,1.882665598581276800e+00,1.464287736517260463e-01,-4.437793718241829222e-01,-1.293003409987664720e-01,1.323534086224916084e+00,1.229831120746391893e-01,1.148162875353359591e-01,-9.267875461588225283e-01,1.228893573301583109e+00,3.163119781338605274e-02,-5.095685073301615686e-01,8.318023542957268812e-02,2.251891817129680895e-01,8.839015350247174663e-01,1.040713378135869616e-01,-9.405674323185855279e-01,1.434028781346522452e-01,-2.619781642577980185e-01,1.183875382467280080e+00,1.963567495690320186e+00,-1.826214109960105914e-01,-6.531346892398827431e-02,4.891019713180845274e-01,-1.454033946984154835e-01,9.117128846131029585e-01,-7.710452019628608600e-01,4.413822341277894301e-01,-8.591755229374333780e-01,-6.959389448716604143e-01,9.392356961570961227e-01,-5.612408777363081525e-02,-2.196991511011996412e-01,1.696818215385354600e+00,8.494244869136583498e-01,-1.193226335773604596e+00,4.299840826038199282e-01,3.026992631570610826e-01,7.955074323802772129e-01,-1.927311250821014676e-01,1.050716791965064179e+00,-5.703866160341374281e-01,5.825715115985430348e-01,2.142239253127876664e-01,3.018504550009468712e-01,-4.997742899593841104e-01
8.478541385619293713e-01,1.159598685440947685e+00,-1.606630564626999602e-01,-4.423221793573742788e-01,1.074392153727630334e-01,4.163323190312843702e-01,1.007512960559896475e+00,-1.943246519492607682e-01,2.225798065599222664e-01,-2.205429741276594136e-01,7.183765981467749029e-04,-2.120400972416676133e-01,-4.363249886320205717e-01,2.952293262312061239e-01,-2.878789751099743999e-01,9.820898887175368852e-01,-4.229237220674884057e-01,-7.246302813784986085e-01,2.423222098659166129e-02,-3.933701220265681947e-02,-5.922170414818019868e-01,-1.400369335243154545e-01,-8.380587133779623388e-01,3.174519415856560389e-01,1.628294785289424729e+00,5.371018448319384575e-01,-4.951748006253031686e-04,-6.493364392265538187e-01,-1.400323578179338169e+00,-1.207926638367339711e+00,4.881573488088796209e-01,2.185800234637404138e+00,2.535178188422515522e-02,3.194217904598758428e-01,-9.132924617879193407e-01,-6.380790112275910309e-01,1.833947720349762944e+00,4.955164220604756364e-01,1.623244410456061715e+00,-2.388361279346318256e-02,5.798313478342083105e-01,4.871981853430512599e-01,-3.183024929167383443e-01,2.724672866964595319e-01,6.703142894981286570e-01,1.101666090309170176e+00,1.990104348287548897e+00,3.926135573764759079e-01,3.743830750901860904e-01,3.017256457994677010e-01,4.199389910511484914e+00,2.012380129241824189e+00,2.373535926526625095e-01,-2.452895436680991859e-01,2.003330428472692715e-01,9.659961870640203507e-01,-5.630330544920595370e-01,-1.963779954898788316e-01,-8.048731098993554545e-01,7.366619293964113968e-01,-1.667157830778560335e-01,-4.511420167546028037e-01,6.123973135312586746e-02,-2.382630991892789041e-01,1.040395277297191390e+00,4.298913957434655209e-01,-6.596296197438774600e-01,5.777697274206723410e-01,-5.939888577574815587e-01,1.000384816716806125e+00,1.917258453431608833e+00,-2.868984282479188908e-01,-2.725493040980258019e-01,3.956463653733616193e-01,1.595136431632378504e-01,6.857784980725780688e-01,-6.467999120366986210e-01,-2.676777320082058820e-01,-9.954096707678745659e-01,-7.900014913251099946e-01,7.857600433644410520e-01,-4.281714135751776840e-01,-3.990842948202694696e-01,1.808189843404916397e+00,3.644477002683382816e-01,-1.027545271924001469e+00,3.900038790945787315e-01,3.132192214979723222e-01,1.073873436700261808e+00,-6.784243593561644081e-01,9.970804821214609426e-01,-7.632963837676277619e-01,1.085856990705815983e+00,4.676067004243684710e-01,-8.187985190374904576e-01,-5.298847910866906208e-01
9.449737380122520403e-01,1.690610581620970887e+00,-2.363652451892343520e-01,-8.594211467153252126e-01,-5.774504656689062598e-02,2.331792663708164848e-01,5.645852038898279135e-01,7.866236251317698658e-02,8.206964727467780385e-01,-2.444009063336792520e-01,-1.214656661392810588e-01,9.512523118651941556e-02,-4.033296831203105892e-01,1.978495104612854050e-01,-5.093286338840439242e-01,1.201425198576838937e+00,-8.725270807951979180e-02,-4.691018174291482490e-01,-2.920075526438201674e-01,-1.777753095967749830e-01,-4.491787735207417032e-01,2.359966117394373675e-01,-8.256707995228554919e-01,1.149694460212273978e-01,1.884163777988507205e+00,7.459208444757513545e-01,-1.134494084648721424e-01,-5.999071936303115304e-01,-1.792944949246751518e+00,-1.594884494345776949e+00,2.647754417716921549e-01,2.177746282660900867e+00,-2.605633105494310486e-01,4.031874413550388669e-01,-1.002298820505620025e+00,-4.894641837277521335e-01,2.244631810354814849e+00,3.406502893215750394e-01,1.836804283011844952e+00,4.182845117193856321e-02,5.093425848492478814e-01,4.472663726144744389e-01,-1.132719076670203467e-01,2.156780051797493880e-01,5.652434084210888887e-01,1.013463886234799105e+00,2.274135509106154363e+00,5.344392389079761774e-01,2.068666438196384849e-01,3.823252355072418451e-01,4.099383806392556728e+00,2.216131149579633419e+00,4.701041742769211940e-01,-7.967564256990522509e-02,2.760933261440853270e-01,1.062184274466011713e+00,-3.517651503822992742e-01,-1.866771610152142824e-01,-1.322963970279683155e+00,1.187387817309956795e+00,-7.797664281863648794e-01,7.249788184778044320e-02,4.365537563054764369e-01,-1.384033153579533604e-02,1.436971929307149454e+00,7.184069002422270867e-01,-5.642175413275914986e-01,2.683257047415098517e-01,-7.199607553503264978e-02,8.156523618520310492e-01,1.845174324894258255e+00,-3.066330411275771661e-01,-4.483786958841078918e-01,-2.800498457654063689e-01,1.839078495155200277e-01,1.898944440197646299e-01,-6.827312344207507877e-01,-2.025723560064607298e-02,-1.585804845000992280e+00,-4.245951048612272571e-01,1.304279557587652238e+00,-1.354878159353142819e-01,-5.025508009004998611e-01,1.849992617822119545e+00,8.083803958870119377e-01,-1.244392319004210101e+00,3.877089254540396768e-01,-2.980753801863966768e-02,1.052850647551514252e+00,-1.010896831820585540e+00,1.224005026242827476e+00,-7.983358457753270132e-01,1.208418525175606772e+00,2.840617921307276306e-01,-9.269680317571689088e-01,-5.663004049248616667e-01
1.274162575391898367e+00,2.339684060997169635e+00,-2.692987908319844914e-01,-7.378675530530656168e-01,-1.475262678393560178e-01,-3.724192747873333875e-03,-5.106741283446138979e-01,6.036982655521692109e-01,1.915964480019744398e+00,-4.201404760665697347e-02,4.596558922670296310e-02,4.753151940831167321e-01,-3.986849800865582272e-01,4.103052785230339450e-01,-3.477398766156823418e-01,1.990853299835775303e+00,4.517663047438659762e-01,-2.390675846508554525e-01,-2.589026660352887754e-01,-2.169269697685998616e-02,-6.049554424643648343e-01,4.149742815618986391e-01,-7.313605743759521438e-01,6.965111838462194338e-02,1.493459189448155033e+00,7.566070768574290062e-02,-1.582101974793820587e-01,-4.470279227175847359e-01,-5.576423172646846060e-01,-9.078299086031699217e-01,3.020935189829214718e-01,1.934986052556031177e+00,-3.551533379487142872e-01,-2.509245847651223049e-01,-9.550773284111087058e-01,-6.711003433103338578e-01,2.105863407779134278e+00,6.581031626385840383e-01,1.087937573641343691e+00,5.128689720942027908e-01,8.044264150976612182e-01,1.192589368837911334e-01,2.427628362168924303e-01,5.851636011883097899e-01,2.834339481182606146e-01,8.799619948756971510e-01,3.087270795805279633e+00,5.176254387858729711e-01,1.202894646761445696e-01,1.391354148367568211e+00,4.208942666279105183e+00,1.381464916967877432e+00,1.019585915357376305e+00,-2.438104970518597536e-01,1.017527652590415888e-01,9.420222433854333888e-01,-1.554344126650476499e-01,-2.629743810283269867e-01,-1.454478616861133666e+00,8.395743125131778228e-01,-1.020306523101481566e-01,5.936003690513602660e-01,2.079590885783416110e-01,4.305764334332927157e-01,9.314363014594853052e-01,9.049012214491003459e-02,-2.163150233266548095e-01,2.674481930770144511e-01,3.818792216572452353e-02,-1.252135986340594531e-01,2.775939906649043998e+00,-5.835240368134786415e-01,-5.412038855231239287e-01,1.507151253400848545e-02,1.121346982027485034e-01,7.431705503764671761e-01,1.849093505410669969e-01,5.917644791159512030e-01,-1.101073369299808258e+00,-1.244089027044784079e-01,1.223132979969597800e+00,1.986268143266573527e-01,-2.036733865951948497e-01,1.023536135244680345e+00,9.180679101636592954e-01,-7.622113607358999010e-01,2.204767130493274219e-01,7.920568185153467056e-01,7.306263446852213628e-01,-8.850028697044990400e-01,1.965579019031375552e+00,-1.018348368550046512e+00,1.689552121825325770e+00,8.384480757020443265e-02,-3.138574293417394911e-01,-1.364609024487501987e-01
7.176778931932437100e-01,1.115453359161302727e+00,-5.385436757599839502e-02,-8.243342263827289074e-01,1.227674636859858864e-01,1.385773205484501780e-01,7.144805988514861816e-01,-3.062667117487467561e-01,3.419896026556434876e-02,-4.503889615579734218e-02,3.163559396595877482e-01,5.700886814241815093e-03,-3.734137192339370692e-01,1.488318410335345843e-01,-4.994806160467030187e-01,1.196639233898279420e+00,-3.303749281537273208e-01,-2.862897758508640700e-01,-1.195406673522179664e-01,-1.152112031733242836e-01,-4.711766960375244340e-01,1.035486636436228625e-01,-7.115147712278264702e-01,2.429166993369838989e-01,1.855395818427718169e+00,5.371551065512392142e-01,2.061965994000494184e-01,-6.390916716254061436e-01,-1.518082471486487783e+00,-1.467907174259148739e+00,1.926115330452313201e-01,2.255230881277123789e+00,-2.906715976256679101e-01,3.512201073672015506e-01,-8.057157509648796845e-01,-5.487963064966985272e-01,1.672345693739511141e+00,6.936327268512327837e-01,2.138813418165260494e+00,4.972072647813913226e-01,2.965337722729928793e-01,4.064293191254615412e-01,-2.172550531351254421e-01,-2.906250691827481913e-02,5.466762466509438312e-01,9.938746577042685271e-01,2.087342815326593826e+00,6.494219124667925669e-02,5.249934876369071607e-02,5.916366008549248656e-01,3.684301964591112810e+00,1.940378028427745649e+00,3.211813796032275681e-02,-2.660636316480446406e-01,-1.198484059109293787e-01,1.386768151614503841e+00,1.075868645583364369e-01,7.722225698872248190e-02,-9.364832480244886792e-01,1.196512370075932807e+00,-1.713628671232543532e-01,-2.010878318857008684e-01,3.002595663909248813e-01,4.573270853765476485e-01,1.330969741037729914e+00,5.527641181951367111e-01,-7.974411823011233746e-01,3.136162005109185413e-01,4.178130336149665780e-02,9.978988986387578031e-01,1.662449738552411960e+00,-3.293236617569051949e-01,-6.982802096072261711e-02,6.251441939425413097e-02,-1.544574785202233458e-01,6.463515298352641159e-01,-7.234068632829715462e-01,3.040478824051626172e-01,-1.266753407921856978e+00,-4.448305783286694015e-01,8.725188665488953221e-01,-1.335405280402105488e-01,-3.011184037581641215e-01,1.917241055242220105e+00,8.527859474162567954e-01,-1.254884805305362505e+00,5.206749035937855430e-01,2.306999725092434561e-01,8.018961891499677419e-01,-1.951277861937038838e-01,1.051008579019421241e+00,-6.691034485790980924e-01,6.596976980944333491e-01,2.460993863293452766e-01,2.093139899119897396e-03,-4.304101991152306517e-01
1.011996275666745770e+00,2.114059487815806104e+00,4.085237515009626508e-02,-1.345545345998901965e+00,-2.218672291608823066e-01,-1.517152935466615782e-01,-3.897141752311816254e-01,3.275673890019462076e-01,1.980259272765987344e+00,-2.833054055656372694e-02,-3.587773384942919974e-01,4.978313685316417270e-01,-4.519460367189930272e-01,-1.164339429778424168e-01,-5.460765531667770567e-01,1.440757610750535544e+00,9.304024617712292056e-04,3.358779879709218319e-01,-5.888941710875620350e-01,-9.396414788843407417e-02,-5.968373630213000824e-01,6.654551449901182636e-01,-6.279190480115901529e-01,-1.379821154127893468e-01,2.044369550745219755e+00,7.110007515429213054e-01,-2.898300017533236850e-02,-5.763969650274277656e-01,-1.930533086103458196e+00,-1.739112543282094858e+00,-4.298739834942433280e-02,2.453860358470893122e+00,-7.577086410024715946e-01,2.029395220806065048e-01,-9.314692761812890520e-01,-2.120675652441497694e-01,2.429527988274545969e+00,5.029274660031268773e-01,1.903149679297738484e+00,7.521039062189316393e-01,4.653333721097480113e-01,4.619547511351005942e-01,3.404088185152510659e-01,-1.954055800541726340e-03,5.954493806493862396e-01,8.141950067968222182e-01,2.961272198245429532e+00,4.211466962145363757e-01,-1.273377958464961268e-01,8.678951046252413315e-01,3.551205039935138252e+00,2.076642762383012375e+00,6.485343414891523439e-01,8.530282251828841256e-02,2.134877791402645109e-04,1.382234904027599187e+00,1.947095520216078068e-01,-1.895100363046510472e-01,-1.594616330486732236e+00,1.648950591112037012e+00,-9.115038445079204354e-01,8.519339011780509008e-01,7.420125758601903154e-01,8.365093954559683631e-01,1.969111019685339414e+00,1.086945736361852211e+00,-2.729137058838942420e-01,3.400490145971251099e-01,7.869835089352527069e-01,3.578775776445752843e-02,1.846123360652616618e+00,-5.459197493621086306e-01,-3.939813538546595439e-01,-1.046005338121041461e+00,5.052646467517689366e-02,-9.964458823590049974e-02,-3.172801100545349917e-01,4.611509964733687128e-01,-2.196166142642179686e+00,2.500752301730663207e-01,1.399591572696895714e+00,2.576533355708455764e-01,-5.042040003696873773e-01,1.834819203735064130e+00,1.262353269828925484e+00,-1.358185582868116414e+00,4.010655535538089067e-01,2.446126263294493564e-01,8.338708514939882077e-01,-9.969728373309076908e-01,1.768876814917607954e+00,-8.327272038580528779e-01,1.347877968588845787e+00,9.650008806431617514e-02,-6.778533577998413495e-01,-3.395385126202898896e-01
8.192739108238991097e-01,1.383925556829360248e+00,-1.417473937426215747e-01,-1.007139256752428880e+00,-1.207429319869585405e-01,2.134807598784344840e-01,5.365619860325246959e-01,-2.086833684782232745e-02,8.017034763066560599e-01,-7.762064296676315922e-02,1.225755028819974779e-02,1.370533661571306516e-01,-3.988300639890561272e-01,-1.388607374363988456e-02,-6.029675563831871088e-01,1.215812590110294744e+00,-2.254196095972153813e-01,-1.944342421794583997e-01,-3.393977504106781007e-01,-1.666432111668025018e-01,-4.548714503350557159e-01,4.312472580376374709e-01,-6.912181731533417750e-01,5.930796785164636764e-02,2.022182867507486215e+00,6.930429821562650305e-01,-2.763947991701154461e-03,-6.464713482226789321e-01,-1.999651439032501088e+00,-1.756371533007980101e+00,1.480145608090769338e-01,2.391752329078112194e+00,-4.012750527112366461e-01,4.823028015027803206e-01,-9.033793375964143113e-01,-3.924227861361740954e-01,2.165661538654580998e+00,4.429413771737226724e-01,2.187580970479266362e+00,4.526295734600583875e-01,4.267439955910736771e-01,5.043307652351062265e-01,-3.862791081251466807e-02,-1.651347471968907243e-02,5.646086955628095705e-01,9.143662935322236507e-01,2.285586767028266131e+00,3.412761837469520665e-01,8.715306059871436029e-02,2.909859651838422878e-01,3.876539392526542116e+00,2.354079932036018619e+00,3.644301661432081119e-01,-7.367709326920540702e-02,1.448384156977972070e-02,1.369486212850203888e+00,5.369780410390068148e-02,-1.168215245930909751e-01,-1.271082712994157315e+00,1.691360365657269327e+00,-7.692524486392740002e-01,6.526142915093857688e-02,4.823588718803341058e-01,3.342455870039554022e-01,1.642635076341401490e+00,8.644019500166862935e-01,-6.249202531068747124e-01,3.406174137872184371e-01,2.399072858104304706e-01,7.459845939894707012e-01,1.682997376839645121e+00,-2.609414123901054317e-01,-2.398325178986807638e-01,-5.061720262003038817e-01,7.279354522016735773e-02,9.385439194550049269e-02,-7.799014130415109491e-01,1.894133751087627160e-01,-1.806692461207739298e+00,-2.856513424978178728e-01,1.250262466630110092e+00,4.545401188219019839e-02,-5.320277148814720469e-01,2.039404901963183470e+00,1.016603058344911714e+00,-1.458990084607863613e+00,4.014420027276103808e-01,8.207254938658181675e-02,9.914099052224141229e-01,-8.915026977020559240e-01,1.307715239365222271e+00,-5.956301351631959617e-01,9.593221812000380933e-01,2.497309044560822866e-01,-6.266552077153750844e-01,-6.017500034696986466e-01
1.063746995498716652e+00,1.485669984963205348e+00,-3.316360060197476312e-01,-5.569631305086149009e-01,-1.945370562619098131e-01,2.284009853593046702e-01,-1.475148389932125492e-01,3.785420109157104362e-01,1.287510493998945460e+00,2.456094566483197350e-01,6.647914275870685508e-01,3.593795822437023113e-01,-3.412580381402563479e-01,2.973187362171884618e-01,-4.606690466331273548e-01,2.158624291731000344e+00,2.799421495949375172e-01,-2.577460391786697835e-01,-7.008855940391268968e-02,-6.980078869925424034e-04,-5.528525474536137851e-01,5.623486170615411561e-01,-5.531013768610018033e-01,1.556350881242315742e-01,1.487154090895450587e+00,-3.346792775389211827e-01,-5.760384515586386422e-03,-5.132110686456223814e-01,-3.573868180071315681e-01,-8.370588967419261284e-01,3.452535266954395166e-01,2.079146828813559722e+00,-2.493986362863346573e-01,-1.666115667704800574e-01,-7.658899310719130549e-01,-7.886428955141679964e-01,1.687956254868762107e+00,8.847955901864397177e-01,1.512400215786979807e+00,1.030406599838008974e+00,8.015394479588305865e-01,9.684648713036464462e-02,1.530846346929906066e-01,4.148102599048474337e-01,1.239313633702088246e-01,7.689516200951869163e-01,2.830426616775491233e+00,1.679749009262812010e-01,1.272001471785325633e-01,1.144672959808920254e+00,4.279187484437518840e+00,1.480654000823125038e+00,8.661313294227620529e-01,-4.614538612148473273e-01,-3.380752525535085651e-01,1.310894802760602662e+00,3.720186663150814588e-01,-1.431439473831690179e-01,-1.128158038004302588e+00,1.464700613291846309e+00,3.547238640970900025e-01,5.615507426551541448e-02,-9.209766142210641660e-02,6.316987551527389888e-01,6.744142353375003340e-01,-2.041205303819517702e-01,-4.746307335634249447e-01,3.881506286421751994e-01,-3.471285128277899756e-03,1.165075711225099786e-02,2.829693962227282089e+00,-3.626438554640732392e-01,-1.382921853966769254e-01,3.434662508664789726e-01,-4.336143971256365554e-02,1.035379510557259408e+00,-2.345751797583339737e-06,8.991053711517862368e-01,-8.240609265656043680e-01,-3.106320139469777586e-01,9.672060919975459248e-01,4.124860785225898385e-01,-1.454353061358133192e-01,1.112742865375378365e+00,1.023353388376515349e+00,-9.488294185902891309e-01,1.512921659232888683e-01,1.189028350049634808e+00,6.595475064903711937e-01,-5.907262200329888024e-01,1.997499424964381376e+00,-5.892731401352675480e-01,1.195555875600460949e+00,9.794674602592329249e-02,4.165645565096655067e-01,-2.531147519833040205e-01
8.884742409899348825e-01,1.149507222339009926e+00,-1.682141218317576015e-01,-8.136684617924350160e-01,-1.866295207417990598e-01,-7.418991354808945893e-04,-4.661679823202204420e-01,2.161375434362983183e-01,1.075978756602456343e+00,5.741185156980612714e-01,1.154294495541674515e+00,5.465118577790789578e-01,-2.864786549450885067e-01,1.050588263435815323e-01,-6.132317383285162959e-01,2.461039308276378179e+00,2.666572034765612442e-01,2.591878339504748441e-01,-1.027733507285761849e-01,1.437967024602904154e-02,-5.189705918232352388e-01,8.238994712930735043e-01,-3.302055442167840527e-01,1.194732534300355781e-01,1.612649348518195191e+00,-6.011535022187118882e-01,2.857089325947304026e-01,-5.226293636482862714e-01,-1.966670009016676657e-01,-8.996913020480846734e-01,9.364596615489775844e-02,2.233896226236026905e+00,-5.338931967799596112e-01,-2.402679548703710033e-01,-5.567253712698487789e-01,-7.455220614131382595e-01,1.300537257423315829e+00,1.255199051619820816e+00,2.002893756369363842e+00,1.857298920042963264e+00,5.788374013099500948e-01,3.350575245134490565e-03,2.844008780349872034e-01,8.386725052236131128e-02,-2.411240176351564513e-02,6.060243021069464664e-01,2.971595308641859834e+00,-3.194912179651117068e-01,-1.953896635466561005e-01,1.503981797442705215e+00,3.745356455722303579e+00,1.275175995461532930e+00,6.402235173295270920e-01,-5.814058361843184031e-01,-8.767549268323754363e-01,1.847370366942168607e+00,1.230591850039526758e+00,1.364647077750887061e-01,-1.047802221290431879e+00,2.015695523664092104e+00,7.270834859697687946e-01,1.647786435158244966e-01,-4.198116803268024666e-02,1.494961184222527217e+00,8.064809654477348433e-01,-2.508502168778803387e-01,-6.189347878822060167e-01,3.018585179202607494e-01,6.021201103271462962e-01,-1.457813446072083741e-01,2.717372260960340125e+00,-4.028666163691961843e-01,2.395943083995885070e-01,2.151123725433653489e-01,-4.266831095260185669e-01,1.237628222473681427e+00,4.069233609892358716e-02,1.605408779977780975e+00,-8.881124538945577296e-01,7.107439911737345462e-03,8.093727201705169794e-01,7.748537612955994636e-01,2.286457380341128109e-02,1.152731974719312991e+00,1.473721014628089243e+00,-1.130798286423176036e+00,2.384835863122476141e-01,1.487239418360090104e+00,3.155718645843968440e-01,7.135469390678500501e-02,2.171680027684229408e+00,-3.802546577864199251e-01,6.784066597413970223e-01,-1.011802042130546808e-01,1.551613084903274320e+00,-9.810766572690488019e-02
6.761514238264868526e-01,5.056237013785338519e-01,1.046935023529885905e-01,-4.817661062712078057e-01,4.304024126806609007e-02,2.860046355692215103e-01,5.286282355966682722e-01,-3.131662490672694754e-01,3.664316650812995957e-01,3.253700110938287926e-01,5.665106567404859517e-01,-5.301929389587031749e-02,-4.304036362535009208e-01,6.693344956939822898e-03,-2.843724085856254580e-01,1.399006465564210266e+00,-6.041892540437054926e-01,-6.471154077704026342e-02,1.357117502651354335e-01,1.606822804715817565e-01,-7.711211000926899706e-01,1.782703740778215362e-01,-4.677988235489107804e-01,2.987991152064739531e-01,1.556611212042636527e+00,-1.421278752712425431e-01,3.472275657462334797e-01,-6.874678359576628095e-01,-8.231448596629795667e-01,-9.165775467071977101e-01,3.445838908147467183e-01,2.516262343557072345e+00,-2.102123381118610190e-01,3.213787593111780416e-02,-5.786946352241488789e-01,-6.281006474560114627e-01,1.234678788839910002e+00,1.077148304389992317e+00,1.894798288524796259e+00,1.236939416768717992e+00,5.592915569070366910e-01,4.129385549505991682e-01,-6.232709389499530017e-02,-3.551274359532463620e-02,5.372641047153907667e-01,8.431154322855946015e-01,2.334358671478932834e+00,-2.234464208305832478e-01,9.995689549487869752e-02,7.503892576009545401e-01,3.724182455664468261e+00,1.622418589028187252e+00,1.242976139938013480e-01,-4.611046235190313092e-01,-6.081568235331815675e-01,1.592056525880428230e+00,4.522499664297949806e-01,-2.597084237131180862e-02,-4.327963420146738183e-01,1.392775770909832289e+00,7.212579383748921602e-01,-4.601298168843256375e-01,-1.912139394869657449e-01,8.043912129726712434e-01,9.556510235839781320e-01,1.753339447018214814e-01,-6.827555525837746275e-01,8.839926011607743828e-01,-6.886669377867585262e-02,4.070953190604892358e-01,2.128769505441155729e+00,-3.571955683484749344e-01,2.989889367520602859e-01,4.995280451409176425e-01,-2.259949038148318379e-01,1.174998249722081667e+00,-3.138967791224435144e-01,5.335121391189060480e-01,-8.088749735278197850e-01,-4.816899842169467538e-01,2.655355382954185384e-01,3.059318058826673847e-02,-1.745750756439455320e-01,1.701004074501899277e+00,6.856689728838437636e-01,-1.091282337351302978e+00,3.537481299177573923e-01,1.286364082044586965e+00,6.845499490063347015e-01,3.037444730042848651e-02,1.481294252267510991e+00,-4.153783203980953020e-01,6.442901634112871978e-01,3.440169491563540571e-01,5.056128949813373241e-01,-2.864216571985123139e-01
7.375529798392623793e-01,7.562659429818895385e-01,-4.853217056784655536e-01,-8.124506707457600507e-01,-3.691574532408309905e-01,6.562360546334394806e-01,9.907415391188283404e-01,3.637856701259092884e-02,5.385107188850615234e-01,1.003252375681572828e-01,5.259578715851196407e-01,6.499933555221035220e-02,-3.196808716721304955e-01,-9.386404526364063028e-02,-8.441668099478066845e-01,1.484142077952620875e+00,-1.575555515894815350e-01,-4.809140824315695784e-01,-2.638552327815186227e-01,-2.606610414870951242e-01,-2.751492331841512984e-01,7.943431792855416562e-01,-5.778764596346503968e-01,5.651568601705990458e-02,2.091789789184110848e+00,3.698348589279751852e-01,-1.272900082934971533e-01,-6.946943486016760039e-01,-2.061951423498388891e+00,-1.870520694979874721e+00,2.668392746590018128e-01,2.462733335739923923e+00,-2.078028366391700410e-01,7.258006094328952607e-01,-8.539367285123456996e-01,-5.210497826963605972e-01,2.175313539655392425e+00,3.628616511077624729e-01,2.589772604527800670e+00,6.504877075831752009e-01,5.971476643854235489e-01,4.904543834666162394e-01,-1.081918655300883464e-01,-1.319494556596302604e-02,3.069515476836957024e-01,7.871615937509519600e-01,2.022938930540279401e+00,3.321140811123887149e-01,2.527702565610602803e-01,-3.339270342220690413e-01,4.439087622216772999e+00,2.846066199371208860e+00,5.741871033245271594e-01,-2.011310274131229425e-01,-1.753859365469104814e-01,1.571163483341390776e+00,3.520654421193407102e-01,-1.747982653777963580e-01,-1.265567832381214952e+00,2.634716058082640977e+00,-8.389551206772838388e-01,-4.607421088369190731e-01,2.334256249458659394e-01,8.639771040733323915e-02,1.383037734805760977e+00,6.034461167942222204e-01,-8.233217742964324959e-01,3.473488587984693288e-01,6.363939653638112093e-02,8.968761199314667643e-01,1.897650706116733588e+00,1.257370144265076983e-01,-7.164276636557219413e-02,-3.987311533394080065e-01,1.894343939503720375e-01,7.824859798155614499e-04,-1.107289758873152730e+00,3.194450701314288099e-01,-1.758200181240501925e+00,-5.632659073416259599e-01,1.427458306697340085e+00,3.638303553575088500e-01,-6.632964763318235368e-01,2.125708635462935980e+00,1.180353410163285988e+00,-1.768228410181019949e+00,1.796801235500061766e-01,2.365342883045613576e-01,1.155522910973335371e+00,-1.314062342074038270e+00,1.461230416028007850e+00,-9.762822951549499084e-02,7.473377591026346689e-01,2.822071101425847051e-01,-4.971404195561967554e-01,-9.559099544893430167e-01
1.027686983503019791e+00,9.511314583689781665e-01,9.889837641744368690e-02,-3.073248250890086575e-01,-4.188028075808238326e-01,6.251450770447076755e-01,1.058702461359562474e-01,3.596973219529280286e-01,2.530413451418811910e+00,2.683103674551567397e-01,-4.545951357541050952e-01,-1.522564742848719899e-02,-6.296524566598077355e-01,-2.519290740549540719e-01,-3.994229319410347312e-03,1.234333060313912878e+00,-7.243941643942551911e-01,-1.893885246210293138e-02,-1.919582062730547378e-02,3.842586523823575684e-01,-1.174246599559040760e+00,4.890966023816779029e-01,-4.276051343076698874e-01,3.657559663843187869e-02,1.414440803746055852e+00,-1.672538791027409211e-01,-1.334325677017840495e-01,-7.275822721371733026e-01,-1.160680085270914486e+00,-7.842570472488765709e-01,6.119942802779611002e-01,2.893742265692390792e+00,-1.486428203706447460e-01,-8.164293740876182870e-02,-7.460032810456900254e-01,-3.897300647290199427e-01,2.095235997647558968e+00,6.768601564391393266e-01,1.092157331388321939e+00,1.066505902811128781e+00,1.234987681801394732e+00,7.142526834840625671e-01,3.541799028049829046e-01,2.913144309255913944e-01,8.223136522423242223e-01,7.374163393901667085e-01,2.955675930085580383e+00,4.764183484113257427e-01,4.589407170640713018e-01,2.419911716804788449e-01,4.409735460493146242e+00,2.085693872987845143e+00,9.911693622220490996e-01,-1.225592169993323099e-01,-2.736340447895811989e-01,1.181056501977529871e+00,-2.362829367011002324e-01,-7.607900787687115196e-01,-6.165401115121150744e-01,1.642861823765094265e+00,1.820438990178385452e-01,-1.053240977697980918e-01,-3.052390131987501309e-01,2.118753267849846633e-01,1.153685787693431219e+00,5.457374742790480626e-01,-9.638753659024779097e-04,1.638998532121093810e+00,-3.080068725435976540e-01,-6.275283769922670452e-01,2.673742666944374236e+00,-3.782556438382528308e-01,-6.668332015056256667e-02,-6.823051740095223416e-02,4.602658683438134446e-01,5.038410841734528578e-01,1.088795505330564239e-01,-1.881249831648630355e-01,-1.337241782180107474e+00,-3.996745382361089338e-01,4.200303020497515027e-01,6.702132820215327136e-02,-5.995058246231018684e-01,1.644704699823109628e+00,3.183792080432171767e-01,-1.012666181677719157e+00,-4.580785505818835146e-02,1.776447430416124185e+00,1.193216653918875991e+00,-1.543100108618316479e+00,2.205172471420676406e+00,-4.084404555171030071e-01,1.794895795207966716e+00,6.389362245865946033e-01,-1.336810924971229664e+00,-4.680221690403217338e-01
1.143032885309281266e+00,1.101577444692962260e+00,-1.401791872480503687e-01,-2.931429548703803345e-01,-5.998759560922601874e-01,7.204759076742557333e-01,-8.194335862131779669e-02,6.455316907803020365e-01,2.876352156154325712e+00,3.378301509802494884e-01,-2.448238065821943255e-01,1.426668552187272399e-01,-5.764775875535045335e-01,-2.025220747916572916e-01,-1.399094160599603232e-01,1.635116097073120223e+00,-3.849354532657933148e-01,-1.029720856283087294e-01,-7.763312190686588732e-02,3.157977592966780267e-01,-1.061828585893725974e+00,7.845856535487776284e-01,-3.914562273320609798e-01,-3.155262575463030350e-02,1.407801155776917890e+00,-3.872027352697398062e-01,-2.825773484321741913e-01,-6.795554813008666262e-01,-9.738883626109142710e-01,-7.713021867670133425e-01,6.315310267399022459e-01,2.790274941774738338e+00,-1.373768607382422346e-01,-1.110769949184072236e-01,-7.772140049506508497e-01,-4.751404456961264566e-01,2.243830197052794517e+00,6.217436649862966291e-01,1.080916155494276110e+00,1.160703732816286582e+00,1.384192397391298845e+00,5.914854217834647487e-01,4.533725986881096959e-01,4.361719822181077677e-01,5.853815794927973437e-01,6.443888106257369408e-01,3.118486887684169595e+00,5.825203440836059787e-01,4.937195551683998263e-01,2.409460969959892895e-01,4.745411509057226418e+00,2.156109729989565071e+00,1.342853108329193468e+00,-1.661500313287878894e-01,-2.922753347411047864e-01,1.186502760435359516e+00,-9.505336858093582642e-02,-8.209180247226540716e-01,-8.602492611615828455e-01,2.021814639689341941e+00,7.478117305769003964e-02,-4.075785022291453230e-02,-3.529637503010790711e-01,1.666062151722823015e-01,9.847294370265433638e-01,3.245277834043472365e-01,3.494573221609775793e-02,1.490987335908517952e+00,-2.739642579698698399e-01,-8.135587229790872676e-01,3.024010761719666984e+00,-2.765003115115816090e-01,-1.419850374485996936e-01,-1.208980705267793387e-01,5.419917086344090418e-01,4.386295848259160746e-01,1.693238073080819972e-01,5.081939065909324427e-02,-1.343362182640792435e+00,-3.738303410121354142e-01,7.045213806452275129e-01,3.528889027351362895e-01,-6.186962315352126929e-01,1.441928902528738288e+00,5.271690947159957119e-01,-1.060390874824028051e+00,-1.967348145129514392e-01,1.872745305439315278e+00,1.205915998668616762e+00,-1.875542892993977251e+00,2.508334993687352465e+00,-2.987548810386386755e-01,1.926902791391832626e+00,5.459394147721048363e-01,-1.255050530874369130e+00,-5.405593217547232099e-01
1.017982256873902536e+00,1.896431339582315800e+00,-6.675171948667634192e-01,-1.188610844951759615e+00,-3.260933035858610829e-01,7.454369692474693831e-02,-1.346914873862312123e-01,4.789170330570734491e-01,9.295028226934459736e-01,1.329516453346667182e-01,9.730410676284375615e-01,6.756910756646697935e-01,-1.709412200748848254e-01,2.714206794724243199e-01,-1.055152223128084099e+00,2.448336250471089048e+00,8.403916390433283645e-01,-2.347566978660373394e-01,-4.863816185618013432e-01,-4.306130710799939698e-01,-5.000093519875403736e-03,1.049076951366257227e+00,-6.169004094414138883e-01,-2.805943136168118079e-02,2.050871426251565044e+00,1.394107185114514535e-01,-1.138069521568349229e-01,-4.555359583757450093e-01,-1.188013700732526656e+00,-1.722885588012515790e+00,-2.412109977527954197e-02,1.881813122327946175e+00,-5.450672254191111232e-01,3.012579473649849016e-01,-9.057627017279272774e-01,-6.983572975505186742e-01,2.130401165739713942e+00,5.773769593204067796e-01,2.410437226147070788e+00,8.742971107100295791e-01,4.370865235646955171e-01,-2.982615940800925625e-02,1.273399673324807080e-01,2.148120691371158686e-01,-1.961271093294416623e-01,7.148176380679558406e-01,2.653429158419148948e+00,2.476449795782457164e-01,-1.204624519171084013e-01,9.258873080626925933e-01,4.196441805533819291e+00,2.049114954023138591e+00,8.843550623462144156e-01,-3.289572922536046495e-01,-2.045320353355959409e-01,1.573953973145123308e+00,8.186076630097687268e-01,1.299350392628852990e-01,-1.917188668492274317e+00,2.342990528269523587e+00,-7.261715605113026051e-01,3.837224416492455159e-01,5.219570917323729242e-01,7.636839173795784141e-01,1.177408003153651350e+00,1.243355132506511751e-01,-7.630233258091888571e-01,-4.926574677947795911e-01,6.549790010557837716e-01,5.574753762359954123e-01,2.376951812208422332e+00,-1.464573350110635330e-01,-3.139227855389546962e-01,-4.654715243137154124e-01,-1.347149566930913034e-01,3.087948604067621283e-01,-6.129585583960461825e-01,1.333274674783615499e+00,-1.598965153563607799e+00,-4.622801141535037850e-02,1.925955957939480490e+00,8.085269758941726614e-01,-2.859095659967337832e-01,1.397975498471689226e+00,1.828272150141912578e+00,-1.510736861389572194e+00,2.572790322862991141e-01,1.276702121136861212e-01,6.376458909185602764e-01,-8.186997138083081937e-01,1.849585640547449117e+00,-4.820551083681995919e-01,8.328503762551692224e-01,-2.302140330296779669e-01,6.518325931090995784e-01,-5.234692769496170905e-01
6.034316316951264803e-01,5.422862854658322407e-01,-2.121312171265279933e-03,-7.260309728160622145e-01,4.141425872486280413e-02,2.009469888715926245e-01,5.875289910297250007e-01,-3.691986178129914031e-01,-1.442239245671950165e-02,3.176841923243024501e-01,8.152688790372166761e-01,5.161815661476697181e-02,-3.481347825202865676e-01,2.411246789882727504e-03,-5.308919845301054430e-01,1.522360450065901372e+00,-4.178401825856929430e-01,-3.577158547914130460e-02,1.131660556461174666e-02,-9.240128713402510907e-03,-5.384585276712334778e-01,3.337117905790253358e-01,-4.757940357029498690e-01,2.619543337227886459e-01,1.778273163574916493e+00,5.735279266344525673e-03,3.783878092203895038e-01,-6.698048834044504352e-01,-1.084406379165431700e+00,-1.247727431610202720e+00,1.787680681965285179e-01,2.432271930452611919e+00,-3.286613582838980863e-01,2.148526467472512691e-01,-5.929900627379699474e-01,-6.174345268592539293e-01,1.271417024694363906e+00,1.032595090214154521e+00,2.336715570901582772e+00,1.257245151405269379e+00,3.521676260518532553e-01,3.414021263731198963e-01,-1.123736412718095573e-01,-1.674332485116770686e-01,3.917964442261560598e-01,8.233971564446344038e-01,2.198991201945438068e+00,-3.021808173723951052e-01,-3.565016104941738651e-02,7.153543643398896368e-01,3.600813043924351309e+00,1.782187407495498865e+00,2.031146691006230354e-02,-4.587949617479485376e-01,-6.375170964830457754e-01,1.767845770569766106e+00,7.354465489620714003e-01,1.585561398744559647e-01,-6.677858561743731380e-01,1.732751017286078721e+00,4.252740598576597586e-01,-4.035985981553783519e-01,2.702898817509829729e-02,9.543515739034117429e-01,1.118399727258186260e+00,2.525608008709047669e-01,-8.698584686418436851e-01,5.102858903014175773e-01,2.116601331741958525e-01,7.049212875357516728e-01,1.899679185541330639e+00,-2.700588188634020503e-01,3.111919860787090708e-01,2.729865467916718913e-01,-3.480737153262237760e-01,9.995475547749881340e-01,-5.849354834736174569e-01,7.906188353204226527e-01,-1.029127538360658844e+00,-3.922742032587124839e-01,5.636401019607989449e-01,1.857535949932272723e-01,-1.770430541060628582e-01,1.825832336287960933e+00,1.024578886149044799e+00,-1.318399055521876528e+00,4.333037820099142623e-01,8.918651836048732129e-01,6.130798350030622901e-01,1.457607420883051952e-01,1.360017821215454337e+00,-3.472692743612876276e-01,3.549969113751577643e-01,1.964601692853389647e-01,8.391929146755343627e-01,-3.657645345652935642e-01
7.089138254833070585e-01,1.424199342252538081e+00,7.118953779398426995e-01,-9.119148076705749784e-01,4.642152979864115347e-01,-3.452095003060793865e-01,2.265108675637675373e-01,-5.790388413777465271e-01,5.698882144031047758e-01,-1.424245276933485405e-01,-6.134601209907508679e-01,-1.026392960100388774e-01,-5.961891782549995078e-01,1.015641485267830546e-02,7.224945712743024995e-02,4.728128281083963103e-01,-9.859182168757214537e-01,3.156415479486058828e-01,-7.427659846670336963e-02,2.471894489105983528e-01,-1.034030954226031085e+00,-5.083127602340979934e-01,-7.361680609055409885e-01,2.762545286647659637e-01,1.654063837683888760e+00,8.521781805241611663e-01,5.018088819133564860e-01,-6.813813887976519768e-01,-1.490523592199232805e+00,-1.120820025515706586e+00,1.320932860060101133e-01,2.547078226083518082e+00,-5.117033209163388552e-01,-4.027262625599103973e-02,-7.416825820929411339e-01,-2.568998648428989506e-01,1.475608988151709600e+00,9.500448885671548549e-01,1.483997399446170151e+00,5.421945593392837326e-01,1.753944948439843943e-01,6.519849708083018669e-01,-7.183692391878564176e-02,-1.866197932086426925e-01,1.181574824700188042e+00,1.135007755154048503e+00,2.452313784469311031e+00,-6.030961430307615889e-02,-1.048375407440625268e-01,1.242014846177331933e+00,2.764844872286966293e+00,1.293608814616570291e+00,-4.069926432386340442e-01,-7.396016266157351415e-02,-7.888824682543527089e-02,1.218096266428377650e+00,-3.103697038803145958e-01,1.751087440556658992e-02,-4.682871795219540334e-01,-6.656027492635319120e-02,3.012353098429428888e-01,2.959101680278595214e-01,4.137402214427848834e-01,8.952488447530727589e-01,1.759764989079150244e+00,1.068372608391718881e+00,-4.192857225937577370e-01,9.182770119447801749e-01,1.778489267236929017e-01,5.299392917207872422e-01,1.294341663793503683e+00,-8.991836397535253322e-01,-4.806660175582368189e-02,4.877810475577726290e-03,-2.847653376825440841e-01,8.820013492887339712e-01,-1.656642664178063218e-01,-1.399326647051855055e-01,-1.291567811114350484e+00,-1.188120070307160936e-01,9.415872747285580768e-02,-7.103489426980096333e-01,-1.774112938191492184e-01,1.994248857248061668e+00,3.138334036745222821e-01,-8.062770978698210467e-01,7.912991772462303341e-01,5.395079843752668136e-01,6.490419049166623600e-01,4.455344049834509268e-01,8.938007135919454615e-01,-1.209112815805713392e+00,9.463062227028712359e-01,4.194853316921060005e-01,-3.737649378490042751e-01,7.428331092683332360e-02
6.630082745049469262e-01,5.487749316372866337e-01,1.212848568634460195e-01,-4.730386326075201597e-01,1.297666830689662154e-01,2.431488243591383713e-01,6.102757713100319670e-01,-3.901176947433555031e-01,1.402976343622653888e-01,2.574124814651668203e-01,5.505735926069982300e-01,-9.522669692346216741e-02,-4.259776991263652945e-01,7.461459951658284961e-02,-2.620054195899649274e-01,1.318841330134857825e+00,-6.163521904264852580e-01,-1.310071453713655409e-01,1.593094138527051951e-01,1.443706957999761620e-01,-7.515278503203726146e-01,4.572183910708021992e-02,-5.222489962371680283e-01,3.421146555293052005e-01,1.545077801318173183e+00,-5.492169415116093106e-02,3.753350739177857553e-01,-6.803561842380818625e-01,-8.136831617243793779e-01,-9.103351872218785612e-01,3.459481875816010632e-01,2.445319576265442052e+00,-1.839065679863940983e-01,3.926714133907156790e-02,-5.958669406412010483e-01,-6.490511501726652366e-01,1.184988903086936496e+00,1.073058844246755461e+00,1.873036447655001879e+00,1.093920222827738042e+00,4.936457017300968086e-01,4.017975259039567870e-01,-1.361866076314827145e-01,-2.700236258845227499e-02,5.650452983554373754e-01,9.003556790353461903e-01,2.245928758200782305e+00,-2.308571546097984428e-01,9.724707084829857517e-02,8.013863800522125214e-01,3.666524805974658019e+00,1.555429194534128534e+00,1.855161922069392677e-02,-4.690529681887080082e-01,-5.400801974332569699e-01,1.532117633516193012e+00,3.535050424029161364e-01,2.268733541532481912e-02,-4.064080831321588705e-01,1.164405319267794336e+00,7.389811403293310432e-01,-4.849621505695668744e-01,-1.651505654470073470e-01,7.500672184022618705e-01,9.386415664976867079e-01,1.722262632694168960e-01,-7.260665608982707075e-01,8.191324511270653419e-01,-1.344569488458885187e-01,5.576911097729598810e-01,2.043976181156009542e+00,-3.860399714292362949e-01,2.702571727736719498e-01,5.882593685979997655e-01,-2.576337077331724568e-01,1.235981889937998179e+00,-3.476112206232262469e-01,4.723743639568365182e-01,-7.343491950671428015e-01,-5.266560484746872772e-01,2.381539230189059775e-01,-8.143474024205962780e-02,-1.396358544761858445e-01,1.705892861384836756e+00,6.234133839341299277e-01,-1.039586546155712776e+00,4.143366413964209016e-01,1.160723433313699759e+00,6.680438908163082168e-01,1.635214578551998366e-01,1.332231984301067929e+00,-4.996082478097958468e-01,6.034563111141206804e-01,3.469495952890810364e-01,5.176116682528302260e-01,-2.569907685887256044e-01
1.325958619236527358e+00,1.913453291168348613e+00,2.091963487298144631e-01,-4.433724781940225901e-01,-3.848524857300389956e-01,2.080592476013258807e-01,-8.814423435198568413e-01,7.520514179817743283e-01,3.519459627535685087e+00,2.334552189274226031e-01,-7.237154238022696084e-01,3.290857971482309963e-01,-6.612679663946183783e-01,-7.196270647319276403e-02,1.653180747568098186e-01,1.601848667790918501e+00,-3.090453472612525454e-01,2.739638607573260387e-01,-1.388514824653258317e-01,4.728288804781474730e-01,-1.310046737926847893e+00,4.794353189856114805e-01,-4.660620168901333793e-01,-4.565552391667801468e-02,1.209637342068807797e+00,-2.844397953350278896e-01,-1.685613284539031198e-01,-5.882463184656460120e-01,-5.255075903619148558e-01,-4.302985278003749192e-01,5.286628597551350506e-01,2.666376816096530433e+00,-3.625027670196775409e-01,-5.671965128159108804e-01,-8.054168129668952680e-01,-3.947882767314632169e-01,2.188055213287895207e+00,8.087605878701380480e-01,4.323664951578707338e-01,1.134045095067858000e+00,1.317183692228090175e+00,5.142721854843079754e-01,6.450914168259389569e-01,5.426803030810691819e-01,7.688260678838818585e-01,7.247629913067055174e-01,3.649242212142780772e+00,5.827636750652386288e-01,3.035149868963327724e-01,1.176181548955607337e+00,4.210770845619388858e+00,1.403014513277341724e+00,1.307617771323944300e+00,-8.667361750962293554e-02,-1.695358868231812977e-01,9.528770343516879127e-01,-3.299605459467759294e-01,-7.986894641520276839e-01,-8.877319973101367445e-01,9.774250483246017529e-01,3.736721537897486067e-01,6.479235321845260298e-01,-1.863079675272728275e-01,5.641456092302264969e-01,1.092871244034057332e+00,3.988731191975978807e-01,3.555067811596646088e-01,1.519516653731316724e+00,-6.180888560541720339e-02,-1.289397291227003528e+00,3.105226499139908114e+00,-7.545536935442171966e-01,-3.285791814615825479e-01,-1.404921813321692581e-01,4.072395363130983936e-01,7.057806553966983198e-01,7.829163659388471697e-01,1.024572196955946257e-01,-1.244592764550611630e+00,2.567286761912146442e-03,4.774054356821337275e-01,1.383289629567702739e-01,-3.981714305547695565e-01,1.102423892943813488e+00,3.851039325317592299e-01,-5.980472905285818541e-01,-3.257079452917210904e-02,2.010898174099562397e+00,9.444572308800710525e-01,-1.420433626212748601e+00,2.602840716607424554e+00,-8.587509974552783865e-01,2.299373215530105874e+00,4.607376344940015134e-01,-1.208237475732380828e+00,-4.873333091894815894e-02
8.389817730398614337e-01,6.089270087348488403e-01,-4.169729745854485747e-01,-6.326129174821015777e-02,-3.646810164345333505e-02,7.436644987933560547e-01,1.158727769935875118e+00,-1.042681455514817557e-01,4.425699914515146549e-02,4.449767630978648802e-02,6.387437437795268069e-01,-2.499956366165407284e-01,-3.694170273437807350e-01,3.609469439765360943e-01,-3.469652412316991397e-01,1.453204912433223805e+00,-2.961824588954985460e-01,-9.598244172525350892e-01,2.522882820215119892e-01,-2.229780094330988116e-03,-5.470404361012599637e-01,6.367582388544607008e-02,-6.991299127055277118e-01,4.013214284953049438e-01,1.426010792405706162e+00,-1.160382971393928153e-01,-2.809539846659089846e-02,-6.489507470212155793e-01,-7.442571233162894595e-01,-8.583964605499110334e-01,6.760031044162218006e-01,2.140107459215324415e+00,2.598749094047687058e-01,2.215460691088691758e-01,-7.903449340723743832e-01,-8.976384289601470057e-01,1.528397282312160321e+00,6.717139570572069340e-01,1.630996675508662008e+00,3.618287862716370595e-01,8.253865689834489761e-01,3.394243941362301009e-01,-3.404486176657584018e-01,4.136823793985599518e-01,3.643955826542514265e-01,9.771333745284896954e-01,1.944879216575711611e+00,2.465090657210802505e-01,5.164637507012413975e-01,1.984780132872439040e-01,4.692556849136240160e+00,1.956084286186782872e+00,4.695062850148939426e-01,-5.197633400401630022e-01,-1.145576400707834508e-01,1.096438963189057869e+00,-2.419423928628865461e-01,-2.245906148326252127e-01,-6.011752941444129528e-01,1.199730861869754417e+00,3.818971110470179564e-01,-9.332927852381109890e-01,-4.032054049222810743e-01,-2.852412307263291202e-01,4.335589410898946783e-01,-1.980214060907845575e-01,-7.734644301098851926e-01,6.800134245349085393e-01,-8.872639478734914986e-01,8.754373629094551745e-01,2.471789517612636544e+00,-6.729617831949941120e-02,-4.626747848968403021e-02,9.375483669838122758e-01,1.575123869110117703e-01,1.107233511924862190e+00,-5.729712619446043487e-01,5.666912475711716191e-02,-4.634104984536899785e-01,-1.053780367379378413e+00,6.456643390572726071e-01,-1.402272662815872706e-01,-3.078760737884249088e-01,1.531872970607092377e+00,3.890938978765997036e-01,-1.007012518931991174e+00,1.638189203503502556e-01,9.253603635616735046e-01,1.042784312366472621e+00,-7.057475914043814802e-01,1.294439970252171612e+00,-4.066697714385629769e-01,9.547886153898600403e-01,4.702948274071023782e-01,-2.460787279904855240e-01,-6.168314630267398568e-01
6.028537344280979760e-01,1.087378588237066790e+00,2.962397870028994629e-02,-9.581864084746918309e-01,3.472832586557254020e-01,-1.329944986072159607e-01,6.614380871686742491e-01,-5.562698005413637681e-01,-7.031934227006850779e-01,-4.437056792981425302e-03,6.911876869741011564e-01,6.288065023267365439e-02,-3.019088272090352243e-01,2.634675293556053011e-01,-5.719497741693528869e-01,1.313853721599105295e+00,-2.452224913482738688e-01,-1.677236299204902525e-01,-7.877047929705568996e-02,-1.743166965525495826e-01,-3.512936187878952787e-01,-4.188306656238127701e-02,-7.173099899220478637e-01,3.372767844549257044e-01,1.884378464971597111e+00,5.288419245412867564e-01,4.497769664108803855e-01,-6.007449715228375675e-01,-1.255780009379591000e+00,-1.454744690609996782e+00,3.333742862261362960e-02,2.086006085898274964e+00,-3.977876182872833177e-01,2.874756275941753314e-01,-7.229652919028446423e-01,-6.271497112228372472e-01,1.278224928927239157e+00,9.346128795844506065e-01,2.376836283186332555e+00,6.583333424755402064e-01,-9.147579146223328017e-03,2.494870198397405314e-01,-3.227264465326646903e-01,-1.671463816527773982e-01,4.408253799212900059e-01,1.030567617867975017e+00,1.978565741632582808e+00,-2.665803203776722641e-01,-1.699295254347367168e-01,1.044400754583096225e+00,3.247440590884123068e+00,1.568625992023814586e+00,-3.313840034687817182e-01,-4.009587504490507159e-01,-2.892620775490574170e-01,1.562692106840862127e+00,4.401044600330616952e-01,4.081439557335744261e-01,-8.756116220349789980e-01,9.502780433454786069e-01,1.455107141856452624e-01,-1.748847903966457562e-01,3.880650598065639167e-01,8.801393076623507117e-01,1.281538008857247890e+00,4.024632920483497411e-01,-1.017090364338063768e+00,-6.225729618601461013e-03,2.576945113388104946e-01,1.283914461375440297e+00,1.466244908050358342e+00,-4.248610985492583536e-01,7.437012167643049232e-02,2.678345807460467687e-01,-5.005989483157139430e-01,9.938512515504192013e-01,-7.520460891894356070e-01,7.019318695580309964e-01,-1.041085015441879147e+00,-3.564371077710268287e-01,7.611338608199141875e-01,-1.373911392511326657e-01,-6.294692193248599410e-02,1.858399136073002778e+00,1.034963005208178632e+00,-1.209064464994680232e+00,7.201031719848298707e-01,9.913733364174337481e-02,5.001337446799045683e-01,5.968411899287078271e-01,8.158911464826071880e-01,-7.659225308048709380e-01,2.252904653861367290e-01,7.918004187195010202e-02,8.907746471338127137e-01,-2.354180227716682061e-01
6.871472637452984422e-01,1.438583322827397648e+00,3.965501224752655540e-01,-1.255188367204296496e+00,2.251371068260198394e-01,-4.040254538141479501e-01,-9.782556102893003036e-02,-3.590477897767793691e-01,5.523595531970660888e-01,1.151195154160305628e-01,1.290555998982789720e-01,2.825398575680849178e-01,-4.269560931297746165e-01,-5.263292890510500033e-02,-4.126270872407803991e-01,1.233624773746363035e+00,-4.137614661604979149e-01,5.091078331525794587e-01,-2.833465609627608406e-01,1.191446987362972110e-02,-6.614868943899210318e-01,1.604128022513851559e-01,-5.746519849437198291e-01,1.315740492069017720e-01,1.928869251055123302e+00,5.779979177171243876e-01,4.901595347580082196e-01,-6.168625341185401956e-01,-1.456017621383701721e+00,-1.464225302188753908e+00,-1.262285576266606868e-01,2.443860167371332270e+00,-7.543985573613711804e-01,7.317440022055740623e-02,-6.833652750885964577e-01,-3.218179045699713914e-01,1.508884762214473430e+00,1.022128108202067898e+00,2.158639594676926787e+00,1.120330631690635848e+00,6.136167729508568147e-02,3.979949018515160919e-01,7.698987515751637423e-02,-3.115107748965553203e-01,6.787895971733396427e-01,9.088542809607060846e-01,2.594618400632517474e+00,-2.500277833792599047e-01,-3.481164453821230520e-01,1.348116321939614393e+00,2.805474020545879910e+00,1.464563597115206006e+00,-1.757978623820329878e-01,-1.818782150293244693e-01,-4.165262008893578227e-01,1.680111940729457798e+00,5.837737411822174760e-01,2.482327949412352075e-01,-9.466785128519582537e-01,1.064148855890323375e+00,6.315812200393716713e-02,4.697733142941808993e-01,5.807473929610306174e-01,1.417585900723825620e+00,1.784900070285458273e+00,8.588370489991214995e-01,-6.238102348056486779e-01,3.604151437754126719e-01,7.988641638328294325e-01,4.899106427841881661e-01,1.451382548169731557e+00,-6.965992861152603410e-01,7.422540780029365792e-02,-3.614997737941071376e-01,-4.833757765668087458e-01,7.138634613337853096e-01,-3.402661341900002911e-01,7.514743563948074190e-01,-1.564493183939245746e+00,1.574553645042551242e-01,6.491229721313623857e-01,-1.119731766031820119e-02,-1.340655713442172325e-01,1.902630716920309162e+00,1.126933553709873914e+00,-1.195360877163236690e+00,7.130276809020399398e-01,4.522861661502592945e-01,4.363229958216883198e-01,4.456353873868429960e-01,1.257749631915751509e+00,-8.752752018300898884e-01,5.704655050059176391e-01,7.166999648261299094e-02,5.983709840748756559e-01,-3.034104615535015981e-02
9.829091356284733738e-01,1.558450154768035834e+00,-4.137819138716452017e-01,-5.451814132961463333e-01,2.209372748161340938e-02,3.246400919546633679e-01,6.601727525637646199e-01,8.165202788779940546e-02,3.671395716348703764e-01,-1.896145894518856123e-01,3.386813707485719638e-01,4.989792453221580243e-02,-3.375747599585470771e-01,4.651660806361001543e-01,-4.810943879386146982e-01,1.522258704972112797e+00,1.156357115969949834e-01,-7.779864120637991487e-01,-7.375112574516798358e-02,-1.746146510375953809e-01,-3.807595691471855059e-01,1.100991695053348263e-01,-8.478307213247771035e-01,2.671846860244655453e-01,1.639587376882845726e+00,3.620731390837554353e-01,-9.245599681817137649e-02,-5.468019341949548195e-01,-1.059960719414966945e+00,-1.206451846782026216e+00,4.117000824472037968e-01,1.904102272035781418e+00,-4.207171333950013303e-02,2.301343889403514309e-01,-9.579882837611347624e-01,-7.700309147656088093e-01,1.902698073135649759e+00,5.001612467298730547e-01,1.643274528331625017e+00,3.646203444591145093e-02,5.898247982258753019e-01,2.394829257744233164e-01,-2.403708100357116462e-01,4.270004613527444981e-01,3.396913755809496394e-01,1.037244483886522239e+00,2.185780408710051415e+00,4.296689702788957788e-01,2.915212560079762372e-01,6.212112751917023834e-01,4.368414206153066637e+00,1.864579962021539972e+00,5.129850466991285884e-01,-3.268211878185965924e-01,2.009657818178703925e-01,9.734989426515489042e-01,-3.330778578901448794e-01,-1.069133208454671746e-01,-1.171319435456387170e+00,9.100850642946697322e-01,-2.452798504942541868e-01,-2.253363973669824660e-01,1.294962481915848396e-01,-1.193735186748162702e-01,8.519752863937481990e-01,1.264715793291044388e-01,-6.847343479804668398e-01,1.542072488088690463e-01,-4.262346242290664389e-01,9.176637232816401424e-01,2.235531548753791675e+00,-2.629922451839054598e-01,-3.946995665949699084e-01,3.740573333667815970e-01,1.035144111167420750e-01,7.308725843882113438e-01,-5.509189858341814183e-01,1.878621726372318723e-01,-9.345677635049844945e-01,-6.689632012703836672e-01,1.162122367901735176e+00,-1.239364656122831088e-01,-2.990551275641374351e-01,1.489885833129764414e+00,7.106029275855569871e-01,-1.014400947575248235e+00,3.323117468185255441e-01,2.373665784432046344e-01,9.351770367374330206e-01,-7.186822091588414008e-01,1.226080681783316750e+00,-7.915676898835530828e-01,1.123480035364831764e+00,2.460524400807728718e-01,-3.836671372336094010e-01,-4.848175428645513096e-01
6.668473171649280662e-01,5.812226447299964072e-01,1.780710609147076462e-02,-6.576059708153515482e-01,-4.235612533937772872e-02,2.756386687866601015e-01,5.035393759792116120e-01,-2.510037483882665565e-01,4.119214201959813804e-01,3.266200959007885540e-01,6.228344839771049468e-01,4.324919223911981303e-02,-3.942220979946445270e-01,-5.287069941564755127e-02,-4.480276761727146617e-01,1.485363088616760585e+00,-4.761126656869679730e-01,-1.705328539286300737e-02,8.089304387392408369e-03,5.976258176645712905e-02,-6.465303960867381239e-01,3.760639287935327868e-01,-4.554808560982416266e-01,2.221614539038112568e-01,1.720543811403003165e+00,-4.183722743642647596e-02,3.001569821538804805e-01,-6.822899671911224484e-01,-1.093420631555031441e+00,-1.170448499350490668e+00,2.474692089537370299e-01,2.523204432936203112e+00,-3.038784406097169710e-01,1.653461977606576483e-01,-6.090344174657771337e-01,-5.779548195453906301e-01,1.396735821116941612e+00,9.852697424078753485e-01,2.147799149826725706e+00,1.262702238880097028e+00,5.003709254136901041e-01,4.043373246019304479e-01,-2.812479059608744003e-02,-1.025201689781986142e-01,4.583808312160441711e-01,7.996521004264421917e-01,2.329106279535217094e+00,-1.881831144737941275e-01,4.152418670485061303e-02,6.324648591123958052e-01,3.729634090705107763e+00,1.836870390816440324e+00,1.812866521215194815e-01,-4.078061353472228756e-01,-6.012554453167999746e-01,1.692130394775827051e+00,6.061035312670304265e-01,8.134775583917966402e-03,-6.504210372041138166e-01,1.756915649987082606e+00,4.002344972125532196e-01,-3.613965770330416216e-01,-3.583773197918992126e-02,8.548954887751470944e-01,1.124974493794392627e+00,2.977842483360086945e-01,-7.285975566461739827e-01,7.082849316300054987e-01,1.400292846922016610e-01,4.700551380502928644e-01,2.032047435874926311e+00,-2.828750212706162004e-01,2.665056583686968295e-01,2.127856219854385722e-01,-2.206656054344330875e-01,9.212460074456274572e-01,-4.694415755866236939e-01,6.481256180100603004e-01,-1.082981891222473125e+00,-3.879523379402584071e-01,5.304919918916661814e-01,1.835360273129140740e-01,-2.466812596905919308e-01,1.800120717762478062e+00,9.195418635420675724e-01,-1.278473562401794883e+00,3.493566876235368879e-01,1.064062527004427272e+00,7.041519714656477857e-01,-1.277339284861786495e-01,1.515443291113359070e+00,-3.384432044272470685e-01,5.790569765857225271e-01,2.682851305075891202e-01,5.075677558766826802e-01,-3.844481465374530171e-01
1.103589209372183078e+00,1.090796589320630838e+00,-6.812435889780057430e-01,-2.784655974563434722e-01,-5.117908518607822144e-01,7.591735956833760568e-01,2.733749130941319772e-01,6.015483590009698123e-01,1.535464481527889280e+00,3.043136571081314079e-01,7.826100496230856685e-01,2.458697319760871913e-01,-3.265310904367997868e-01,2.197263878815215454e-01,-5.788978913760260969e-01,2.271607886677787569e+00,3.081442476471310532e-01,-6.443341690404329469e-01,-2.424081113501339035e-02,-4.345358229910673692e-02,-4.836122114314691522e-01,8.774886465983859907e-01,-5.030572998825860731e-01,1.103935848636198452e-01,1.491056037012062241e+00,-5.507266032702896608e-01,-2.911665487181738232e-01,-5.649074104931751661e-01,-5.407346239505507191e-01,-9.026462864872026870e-01,5.736928944111869821e-01,2.184464755301740446e+00,1.405021076316803619e-02,5.579976546945578098e-02,-8.109371499133426475e-01,-8.636874030339707353e-01,1.975048682583102178e+00,6.300494606789854846e-01,1.587024154419271138e+00,9.487749125345787959e-01,1.148193084784913109e+00,1.767140886467191974e-01,1.361912435749245975e-01,5.666430887425232266e-01,-3.367690873170070542e-03,6.785060886745142295e-01,2.673391960467999429e+00,4.312124058010844974e-01,4.363948294375873393e-01,3.711307059253700080e-01,5.062321493704821762e+00,2.081070884556146972e+00,1.282182299483844545e+00,-4.725872295350305174e-01,-2.959184330411542829e-01,1.267095336460722477e+00,2.673395878963912842e-01,-4.193027301456712097e-01,-1.176167394304636016e+00,2.217744291466183348e+00,7.804419072860618867e-02,-3.805235133644713219e-01,-3.507543903909203786e-01,5.383659413004993066e-02,4.537802266451198552e-01,-3.408768727224821271e-01,-4.787641445801558704e-01,5.759654149696679104e-01,-3.741627639151903773e-01,-1.163276710325106267e-02,3.150293107585858898e+00,-6.683482980804233975e-03,-1.595462772366936233e-01,3.558309799524801420e-01,3.041133437828086872e-01,7.556624342837093833e-01,-2.282371410914566801e-01,6.701558049678618678e-01,-8.765000056531881967e-01,-6.318607391147070818e-01,1.195797320969724353e+00,6.027183453829521032e-01,-3.985452096093684560e-01,1.180030914302342193e+00,9.708735043823424338e-01,-1.167038451339872829e+00,-1.499718806631085699e-01,1.341395707678367355e+00,1.006487467174275618e+00,-1.466768570769698465e+00,2.226545619064919990e+00,-1.936711767742615442e-01,1.371496529828009514e+00,2.445983757382187984e-01,-1.544732005906546690e-01,-6.538927838542646365e-01
6.435741505093209858e-01,1.731148121873758994e-01,1.595410565496967470e-01,-3.973655834047490898e-01,-1.055723009489063779e-01,4.481089590800043654e-01,5.245348887878139577e-01,-2.708941700396737540e-01,7.392506020173181813e-01,4.858173371167182619e-01,5.301541436169434629e-01,-8.954816374157961723e-02,-4.765688624480910462e-01,-1.926067868252978044e-01,-2.400110058700918592e-01,1.383573321594705474e+00,-8.060328462406289862e-01,6.796108828190508544e-02,1.681496401434580124e-01,2.662566724446134292e-01,-9.079739987376502786e-01,3.494478224781684128e-01,-3.348054779292132244e-01,2.487814531586095002e-01,1.536543245481096776e+00,-3.355192383464255523e-01,3.342493539899175081e-01,-7.459651210998817783e-01,-8.803500138203974590e-01,-8.638811596258135772e-01,4.026525969510706959e-01,2.776320089945624403e+00,-2.023360838409419826e-01,2.910501167876079764e-02,-5.046408374517437068e-01,-5.641034497767419831e-01,1.249878996041977830e+00,1.118312164201138659e+00,1.911541981983915450e+00,1.556141595976070491e+00,7.207334737566845062e-01,5.230847683800715631e-01,5.120302225063838586e-02,-9.925949874622859437e-02,5.913916708749763496e-01,7.414967580287057380e-01,2.429493160446409394e+00,-2.508662672079928213e-01,1.587995784509757813e-01,5.163221415833909589e-01,3.819765468087080063e+00,1.790088428148491229e+00,2.416197228735558755e-01,-4.491657337460491783e-01,-7.915321329538267392e-01,1.722871922995282024e+00,5.888262512310132868e-01,-1.663763119435215654e-01,-2.844508407339501055e-01,1.808341742567953769e+00,8.199910801486075540e-01,-5.693158568494488536e-01,-3.424500817631825900e-01,8.656901056800753169e-01,9.841339126988148944e-01,2.241858380752798086e-01,-5.938390829860198394e-01,1.224649083019480944e+00,-5.355904716834505169e-02,1.113377091245281725e-01,2.239995915502529300e+00,-2.914095229205709292e-01,4.437315148229719619e-01,4.181879868559685853e-01,-1.434813289077755960e-01,1.109147135582919219e+00,-2.601920588056073069e-01,5.003939508710069095e-01,-8.976655307046497168e-01,-4.770494446702633895e-01,1.163714171628631444e-01,1.526999272422921716e-01,-2.679746854280635748e-01,1.783879396104850468e+00,6.507046839787252734e-01,-1.182824371192262358e+00,2.299069309787211135e-01,1.672835923461638341e+00,7.667730619239172540e-01,-2.025330648707151238e-01,1.721961002573803023e+00,-1.956179698048949867e-01,6.968059052515055418e-01,4.373410420985637259e-01,3.777274351378857031e-01,-3.633006534876626059e-01
1.129531646850908899e+00,8.051592926115254123e-01,-2.283140254388623114e-01,-1.211579732050516167e-01,-5.680490424992209464e-01,5.854756297761758432e-01,-5.794547441445507818e-01,6.887075716512381929e-01,2.559832967285101013e+00,7.800385528093417564e-01,7.884449091694647471e-01,3.798518246765028028e-01,-4.497535335557187874e-01,-3.103904616512793979e-02,-2.131049891725066703e-01,2.538997126533163229e+00,1.115279540958191706e-03,7.919320770341781168e-02,1.468443453089414430e-01,3.797216021726946278e-01,-9.982066961886564282e-01,9.849952108647357374e-01,-1.692278859501002430e-01,8.182274778082473943e-02,1.132059834528997833e+00,-1.299826275088211247e+00,-2.937998359870977461e-02,-5.866111413050008050e-01,3.608839276947866104e-01,-1.892142236337862604e-01,5.920451845574232763e-01,2.569907167549623672e+00,-1.683282200921008553e-01,-5.577658217338949953e-01,-5.204963122015935362e-01,-8.087310946764502129e-01,1.488795721586771315e+00,1.221717178976356788e+00,1.097763523818297671e+00,2.079381149323712208e+00,1.395115169735967164e+00,1.784148335942801200e-01,5.511575447693036756e-01,4.909343323919003188e-01,9.398630635508808950e-02,4.637247400277200171e-01,3.400460535829288755e+00,3.007972562741181854e-02,2.875576352065065677e-01,1.084177994410371326e+00,4.656126595119808087e+00,1.371806773166145854e+00,1.398636633598230095e+00,-6.046761825877403629e-01,-9.354215945049634273e-01,1.552392800916391646e+00,7.881240370521088723e-01,-5.241292208650991657e-01,-6.647869011329309297e-01,2.206833743547807813e+00,1.202334580258057173e+00,-1.441999028621558376e-01,-7.446271471414358523e-01,9.471925130634919476e-01,2.807918504697419770e-01,-5.861323754171547940e-01,-1.214116514081181597e-01,1.305465605726088274e+00,-9.542046513478705250e-02,-1.157085909259521150e+00,3.681162477178937742e+00,-3.176736027589965317e-01,2.418775748795604086e-01,5.722493121669052218e-01,1.062741376577855806e-01,1.371680260045860189e+00,6.080662845954423190e-01,1.118368053015325270e+00,-5.385136436763313661e-01,-2.797470216577768176e-01,3.970255531599768406e-01,8.358238143337910486e-01,-1.674846475631217579e-01,8.254314590003122287e-01,8.742762376113322187e-01,-8.477064411985200110e-01,-2.617509853180321477e-01,2.730160711339649993e+00,6.856051292682869835e-01,-9.836688084408586885e-01,2.939318483436074381e+00,-1.220776617466744485e-01,1.519805019629895337e+00,2.678291879459761549e-01,5.485357354129933860e-01,-2.092481860915387237e-01
5.115182958848585315e-01,1.001374045621088449e-01,1.011767966009172598e-01,-8.154380023065983529e-01,-2.158367584864050448e-01,3.684266895752668081e-01,5.397869984930320220e-01,-3.226323125717158180e-01,5.669231560534084835e-01,5.550464125009014760e-01,7.260143478367688807e-01,7.054674495213697494e-02,-4.043158258556803775e-01,-3.973146642934352601e-01,-5.796905072268055958e-01,1.467826678273791652e+00,-7.045355631089565973e-01,3.067093383923221173e-01,-6.819008361960271491e-02,8.197517666847697893e-02,-6.737776712282337321e-01,7.175097444860867313e-01,-2.595327766318775153e-01,1.149779669952083055e-01,1.922257058477575331e+00,-1.168080857623111091e-01,3.723240652134647277e-01,-7.667934962245795960e-01,-1.504632699708244203e+00,-1.430025527409874542e+00,1.388754317058384646e-01,2.887308402596376666e+00,-4.535963639160911498e-01,3.315577727997526258e-01,-4.939684447423291491e-01,-4.209421801252762885e-01,1.413927166616963937e+00,1.039437464044732362e+00,2.616754579260128555e+00,1.790960765565861923e+00,4.821784620143887423e-01,5.405913325134839020e-01,9.551184776917455432e-02,-3.960410662437847673e-01,4.791311665301598022e-01,6.435120801032285787e-01,2.339330069787070698e+00,-3.565948164538103593e-01,-4.477207393054279116e-02,2.934690769200126725e-01,3.587607592674189938e+00,2.203629967571917536e+00,1.458763625047211909e-01,-3.614576092324582879e-01,-9.244273385247681052e-01,2.087218835955573670e+00,1.089435491814369605e+00,2.276916951780408316e-03,-5.950285098135046358e-01,2.618428498941475446e+00,2.907085707065730773e-01,-4.283056138482490560e-01,-7.950564358336499604e-03,1.184644207741646360e+00,1.426450279334111393e+00,5.493017176664999335e-01,-7.691577215769807019e-01,9.071900563061487954e-01,4.984848539914115695e-01,3.196597019715128329e-01,1.854114266575662917e+00,-1.545651353335379119e-01,5.282614123585591681e-01,-1.718178385871245439e-01,-2.596507466050787527e-01,6.551109226859149759e-01,-6.440549438002993732e-01,8.134512539804634734e-01,-1.475426266970111477e+00,-2.461100218209873458e-01,5.063793324121277362e-01,4.534442420978508914e-01,-3.794120477739065800e-01,2.113050173035809109e+00,1.166459669910151042e+00,-1.629906517006873390e+00,2.961337397890699275e-01,1.248190840882361874e+00,7.311918932562051499e-01,-2.391138189647697143e-01,1.697006064435128359e+00,1.683029699007732027e-02,3.357877209783440842e-01,2.783677649273124111e-01,6.470021763619910882e-01,-5.312171206061400142e-01
6.686032458446917737e-01,1.178808684328607193e-01,-1.578805776046061093e-01,-6.580087108907789473e-01,-5.217526370671601299e-01,6.376561598278305265e-01,3.666132779548538223e-01,7.572486839465825126e-02,1.299000366875935786e+00,6.811473436157970962e-01,8.272554910855864918e-01,1.816408730920825998e-01,-3.932758441108942793e-01,-4.278868946169560039e-01,-6.444529933609328687e-01,1.856702456843135840e+00,-4.602515763710347541e-01,1.923835988090195070e-01,-8.821182821035497557e-02,9.268887426451907774e-02,-6.706416736021790781e-01,1.098848369311582918e+00,-1.718007503309993411e-01,1.763156083628372728e-02,1.842127730779568484e+00,-4.761198912020792595e-01,1.333006278022264846e-01,-7.482292344660211869e-01,-1.302363672626285940e+00,-1.314383289573559654e+00,2.708461792982844729e-01,2.913588513583567963e+00,-3.637728233773927511e-01,2.780038716554092959e-01,-5.180730142549948569e-01,-4.927088076576250364e-01,1.656596039519858676e+00,9.438288002727053261e-01,2.455806079235371975e+00,1.952546481474455309e+00,8.316163260667188695e-01,4.924266381811570614e-01,2.662153842683466221e-01,-1.852778437070533579e-01,2.831446954084877454e-01,5.028603186962591343e-01,2.584632869908330299e+00,-1.520458105181484720e-01,1.127435118270133652e-01,8.799596730959968749e-02,4.157744322620182231e+00,2.399919354315043662e+00,6.879493095246262957e-01,-3.865983753226484576e-01,-9.626140089795667265e-01,2.052431872682900504e+00,1.143962635526849514e+00,-2.345903279217354809e-01,-7.617211211793691872e-01,3.170070177847448711e+00,2.137220379169102735e-01,-4.536720527217210086e-01,-2.059321443397678364e-01,9.920929345628769491e-01,1.191592583448255027e+00,3.114357756527918464e-01,-6.174122847587574237e-01,1.022398578490901766e+00,3.922355525345232463e-01,-1.021100075845163824e-01,2.393842882752432288e+00,1.024517934922197782e-04,4.633470654531308686e-01,-2.192621305942001053e-01,-2.546193483587291806e-02,5.346138447107049441e-01,-5.030280351657338000e-01,9.079553254008759788e-01,-1.485707961984148229e+00,-2.863701663693297705e-01,7.243024327732212608e-01,7.760809576204923399e-01,-4.883250733151641709e-01,1.898063457796455689e+00,1.254005078773407611e+00,-1.673251263849630854e+00,1.281040225065233074e-02,1.616794571891857935e+00,8.692597315982240058e-01,-9.077072359263322898e-01,2.191424709980460683e+00,2.364146549029872979e-01,6.595137731443471152e-01,2.869234185225147948e-01,4.133266202324556993e-01,-6.790427146119792923e-01
7.233635141780027089e-01,1.024911107867685356e+00,3.391746898157947943e-01,-8.499477991850215020e-01,-4.355653563308248266e-03,1.910451367281337798e-01,5.503447260571814326e-01,-2.727130431601172411e-01,1.104333635316117057e+00,-1.753817596283199776e-02,-5.170929117038560729e-01,-1.031895786066124310e-01,-5.720687314249326416e-01,-2.486781838488166252e-01,-1.987653184235820825e-01,6.404490824874742305e-01,-9.239887302781335521e-01,1.160819796566478213e-01,-1.872844477876938196e-01,1.463313284417334936e-01,-9.061868915569695204e-01,1.009549088699446262e-01,-6.113375688253747109e-01,1.053015590007165825e-01,1.854405900710500932e+00,7.129171403888459047e-01,1.749843445979251677e-01,-7.536450799515391763e-01,-2.057169023133018193e+00,-1.476156514074808523e+00,2.437229267515360343e-01,2.800885582046388933e+00,-3.990006905301847207e-01,3.209318713333218498e-01,-7.888733035740261856e-01,-2.083313813209247689e-01,1.971748713535460773e+00,6.157466958435892090e-01,1.849831813701221739e+00,6.492531105428505089e-01,5.002818124373579201e-01,7.869013859468312333e-01,2.658626226720791838e-02,-1.686520194081694290e-01,1.024775437115696519e+00,9.511620032185972295e-01,2.373837673196908415e+00,2.248232810639580193e-01,1.305874033830818626e-01,2.786987972633109267e-01,3.506832845384693531e+00,2.192435648341803933e+00,1.016406777616355450e-01,9.977071828964234612e-03,-1.079307699614713290e-01,1.355984235993414444e+00,-1.744662403711564336e-01,-2.768113513657843860e-01,-7.106970664394618442e-01,1.251442053023632539e+00,-3.239434166157068029e-01,3.086710827119976130e-03,3.142345817279023068e-01,4.663130563045535526e-01,1.823133331609636976e+00,1.165124151107185480e+00,-4.095899968265975799e-01,1.066641047718958957e+00,1.221774627209250008e-01,4.100933423113260479e-01,1.502907855323044606e+00,-4.692112328671689259e-01,-4.833941391382735875e-02,-4.196263939664589548e-01,9.017439912885062692e-02,2.509302656137365473e-01,-5.237780960478644054e-01,-2.552313873043520198e-01,-1.760925186362448658e+00,-2.712820887529322489e-01,5.501115414109627455e-01,-3.038917709477677587e-01,-5.550271098739307796e-01,2.233783773437488129e+00,5.237827635987342134e-01,-1.277291287639974904e+00,4.549168111045970853e-01,5.906174818530562920e-01,1.038519031822490835e+00,-6.842812326001286305e-01,1.268675278579092236e+00,-6.641443697568825133e-01,1.083703411808650818e+00,5.144210518639089624e-01,-1.019531215188091533e+00,-4.420958792259930270e-01
1.207934631981550266e+00,1.477243599927618778e+00,-3.008851753218481639e-01,-3.288137057588824685e-01,-4.299900653276925167e-01,5.111088660964583363e-01,-2.128615454763548853e-01,6.579568996816890225e-01,2.338699303901696780e+00,2.508480210649596809e-01,1.316282562715295756e-01,2.708744042267674512e-01,-4.692557690696573247e-01,1.313856469723623799e-01,-2.421382420421092641e-01,1.976022709012720036e+00,5.488479350687835989e-02,-2.843824773310801302e-01,-5.845579403118301293e-02,1.779470027439119806e-01,-8.372137200476579277e-01,6.582923900184218802e-01,-5.077627362524202992e-01,6.069512571846644167e-02,1.347201510567503924e+00,-4.280075791587776846e-01,-2.368277011410351574e-01,-5.678597277940549137e-01,-4.873207993464869769e-01,-6.687988447484460863e-01,5.659794837928477929e-01,2.354306717268166871e+00,-1.292395889792137542e-01,-2.285706690184154399e-01,-8.164873501516974885e-01,-6.805290305098667947e-01,2.048053005949010519e+00,7.086234517993540427e-01,1.047587400824095960e+00,9.749116387013098128e-01,1.215205789947314319e+00,3.085704577842016683e-01,3.341206386287511876e-01,5.808951093831669077e-01,3.301664058680954250e-01,7.179001106713287506e-01,3.079260855905455507e+00,5.027160668021714018e-01,3.866801644478721767e-01,7.543848187199211353e-01,4.699603050936818960e+00,1.744278489196336768e+00,1.278950145987080678e+00,-3.160675745206703025e-01,-2.133773436699917536e-01,1.094726942711983231e+00,-3.736403953076639084e-02,-5.745146530341151969e-01,-1.043225514042275703e+00,1.582432511952281295e+00,2.327410841482599468e-01,5.584336038957488091e-02,-2.869909610936292044e-01,2.431565685008832411e-01,6.936536678816291879e-01,-5.160327331398090189e-02,-1.240271371882423757e-01,9.631275657811720903e-01,-2.822357476364326101e-01,-5.310289916341088823e-01,3.138693810445014609e+00,-3.424828333289335891e-01,-2.507966225260482296e-01,1.973503816172212655e-01,3.444017962722105697e-01,7.757575896956842021e-01,2.199078419493330494e-01,4.077103219049349470e-01,-9.815810630680806836e-01,-3.800527876573500108e-01,8.742879502320218821e-01,3.660387199982108042e-01,-3.794207716441103662e-01,1.119001307239674947e+00,6.867478006765834753e-01,-8.837115663597088222e-01,-8.792543249741946454e-02,1.610713177615156422e+00,9.726992911909800865e-01,-1.410523317966664747e+00,2.354991062980702043e+00,-5.164923017990711296e-01,1.780299965804832851e+00,3.385826596324592597e-01,-6.049753563109150356e-01,-3.754660332883894558e-01
9.329935234117796572e-01,1.132268468324863164e+00,1.747805091402859778e-01,-6.311828626306420498e-01,-2.105986530428496373e-01,2.009251259338414586e-01,-1.993342383415225849e-01,1.775371520148515958e-01,1.894143828465657098e+00,3.385285684004214479e-01,2.375026488719400586e-03,2.012016736952076390e-01,-5.249237978416321226e-01,-1.428292648768670348e-01,-1.768840615705244979e-01,1.526372648504833451e+00,-4.599162980384722266e-01,2.567906688104976687e-01,-8.576160859657060154e-02,2.679258229911489209e-01,-9.775765889389234076e-01,4.766780887040242831e-01,-4.132880186111114740e-01,7.326163844322078345e-02,1.529088156494029960e+00,-1.554948278735343858e-01,1.346602384299849520e-01,-6.532444803688330914e-01,-9.017111151707289940e-01,-8.757124087726217976e-01,3.234591588906088333e-01,2.673798431263838982e+00,-4.044313258976749981e-01,-1.689862655376767608e-01,-6.641840437640251782e-01,-4.418849696299450014e-01,1.735423509460802149e+00,9.519341219779620111e-01,1.448598050595778952e+00,1.358025546508581316e+00,8.397788948842378476e-01,4.805296499349719364e-01,3.267095697041707547e-01,1.067620789938502762e-01,6.248369134043736395e-01,7.330309692189442838e-01,2.979406047485488429e+00,9.613824698893949638e-02,1.030484750995179222e-01,9.025414447741508805e-01,3.820961305473927538e+00,1.647880340784404485e+00,6.538054032617052203e-01,-2.444824881499479130e-01,-4.917275846170851006e-01,1.453968109220087346e+00,3.084271602373204746e-01,-3.399378770356726864e-01,-7.398530607197369990e-01,1.521532981304638099e+00,4.013381806115905448e-01,1.532708646450348100e-01,-7.033127303318600920e-02,8.817947171676098206e-01,1.213043720462881891e+00,4.242405009692905016e-01,-2.252948325457475587e-01,1.122506816194074997e+00,1.864380948550074801e-01,-4.040565245138711958e-01,2.457559619846439336e+00,-5.177516000422561770e-01,5.913529177216318711e-02,-5.351069484380535646e-02,2.059509615673200955e-02,7.898412371518026553e-01,1.100320695541103233e-01,4.676167432311726935e-01,-1.251745840521512498e+00,-1.244476351350889687e-01,4.669281887064854475e-01,2.121237668345443417e-01,-3.192036091941642950e-01,1.540214679647550655e+00,7.392193447046950805e-01,-1.019865715326683020e+00,1.915084425345481844e-01,1.549282411371551760e+00,7.786914502164357099e-01,-6.546076766231015975e-01,2.053178881126139554e+00,-5.395579634982859973e-01,1.306078748616473995e+00,3.426760306720630922e-01,-1.871106690062450117e-01,-2.115857502778866750e-01
8.190502054470304438e-01,7.503658175679184250e-01,-1.435541714531056723e-01,-4.880469134080534510e-01,-2.346345266277766739e-01,5.931301284468379897e-01,7.250525201820927634e-01,8.898612937593503025e-03,1.033006944651005732e+00,1.385560056063113443e-01,1.275177869981753420e-01,-7.493265793278430786e-02,-4.633696193707357858e-01,-7.364564691343705727e-02,-3.731759919992978514e-01,1.253511906811761722e+00,-5.193841391598679191e-01,-3.419290011872004875e-01,-4.147005932724531080e-02,6.459629300224709048e-02,-7.128625072997651912e-01,4.114607177807073080e-01,-5.535984046966045957e-01,1.497673375134415674e-01,1.698157161126277792e+00,1.359743618944802557e-01,-2.824542310433697523e-02,-7.110911648485641612e-01,-1.479549745625782453e+00,-1.243060803004035986e+00,4.568969772332279744e-01,2.589496757555939777e+00,-1.122849273913165691e-01,3.067850504251034005e-01,-7.769425206730302680e-01,-5.202239044733061313e-01,1.918225566789002468e+00,5.978696577366242604e-01,1.838279795969745445e+00,7.510985678857022840e-01,8.071110422950307228e-01,5.745761564206222083e-01,-1.400309814517715357e-02,1.229184524936598327e-01,5.941755816329523654e-01,8.401413209554852157e-01,2.313330660381927917e+00,2.949902393952343327e-01,3.458552866229862022e-01,5.682280283005181065e-02,4.303918502763210974e+00,2.298999190218923516e+00,5.541401570797052090e-01,-2.322344399525357872e-01,-2.186097786614435712e-01,1.344231539649477947e+00,-4.640376614114372078e-03,-3.575332631526010330e-01,-7.851759209485336122e-01,1.799800033314799430e+00,-1.176828462258178998e-01,-4.270419851064206629e-01,-7.731234002046910581e-02,1.354298334811303572e-01,1.162048294471974108e+00,4.851315845994436105e-01,-5.230078770960104873e-01,9.419372650386802492e-01,-2.516864766832415667e-01,3.796100009886740345e-01,2.173280616058003822e+00,-1.612352798861830805e-01,-2.019267834535676265e-02,3.329664564890358336e-02,2.202349650094118649e-01,4.808343429031562977e-01,-5.404337039884634653e-01,3.256003780135052761e-02,-1.311254543217857282e+00,-5.887144488535694942e-01,7.598770812089263860e-01,4.877454359664910866e-02,-5.331262679669572790e-01,1.881872365006888481e+00,6.331559805737979607e-01,-1.296737350284731471e+00,1.633603848920152091e-01,9.381534576795816927e-01,1.106649579838043351e+00,-1.074848336849649089e+00,1.594222962034031577e+00,-3.316606419057402388e-01,1.107725795259167700e+00,4.728831006854681274e-01,-7.030872305238493603e-01,-6.451109721407988218e-01
1.049970095914043000e+00,1.271740372327688995e+00,-5.827924527956254153e-01,-3.045568512150625962e-01,-2.063901912982514797e-01,5.665451192289494564e-01,5.071386639016843834e-01,3.245312381185459505e-01,7.971163676478102422e-01,7.008174462644747860e-02,6.827968838666204077e-01,1.189878254640914512e-01,-3.179100778894202173e-01,4.242092588377038287e-01,-5.023572576355634922e-01,1.966363025557246846e+00,2.459878486713719670e-01,-8.038194039062674934e-01,2.879872673650545750e-02,-9.698091783105969310e-02,-4.269145686276240581e-01,4.271425062156214980e-01,-6.847934895257278276e-01,2.432367260742040460e-01,1.479970452371829115e+00,-2.060121980071814296e-01,-1.755304543734616807e-01,-5.428616834152403259e-01,-5.706405933109561790e-01,-9.198378390615682410e-01,5.436955818336504098e-01,1.967439790816243317e+00,5.846682572930644861e-02,8.294000248307586975e-02,-8.676662106928418883e-01,-9.002808730646418844e-01,1.818279836022145490e+00,6.215931857752871048e-01,1.538028362601871368e+00,4.837262854169471771e-01,8.912874978032022666e-01,1.531067434023162810e-01,-9.740286858228684730e-02,5.585311545493396590e-01,1.185077284107308726e-01,8.727447570638513508e-01,2.395587925258362727e+00,3.923533940852757529e-01,3.928909768287163762e-01,5.747390493948461021e-01,4.780789234681501298e+00,1.849430126706531841e+00,8.900555621907924042e-01,-4.751894971800402767e-01,-6.896519549309881869e-02,1.085315579718312495e+00,-4.700858230858884212e-02,-2.399693763746671704e-01,-1.100096180478220997e+00,1.435818047339093795e+00,1.047697751169977542e-01,-4.031890473450771006e-01,-2.123583294393245058e-01,-6.770386554434215665e-02,4.732498123489934372e-01,-2.824173186169123273e-01,-6.155563884710792966e-01,3.524865035385832401e-01,-5.246901501623967290e-01,4.873013333463572794e-01,2.800532456212049492e+00,-1.318596693252662710e-01,-2.553572275532296487e-01,5.845063620751410616e-01,1.765690524147626173e-01,9.264075496662997899e-01,-3.415085197496360303e-01,4.694708780921206248e-01,-6.902082802137792239e-01,-7.324862705642328775e-01,1.102865494346690234e+00,2.172546761703757490e-01,-2.823544015024772591e-01,1.229909140508297138e+00,7.828850567319778353e-01,-1.005647503638672058e+00,8.160190197713748650e-02,8.817500905723418825e-01,9.346424766002123796e-01,-9.797926848540221556e-01,1.710109413646015319e+00,-5.012943002117604685e-01,1.221829953264476964e+00,2.448544588955826606e-01,-1.136381978508391177e-01,-5.348527995238495647e-01
6.530763121964406892e-01,1.085031618112161533e+00,-3.790534894043955105e-03,-7.879735382591850357e-01,3.231575103121823167e-01,4.097028928487109201e-02,8.917976346427041179e-01,-5.195080633847235507e-01,-5.694405426721713681e-01,-1.276585575189561339e-01,4.119919856962135918e-01,-8.509631959270935742e-02,-3.520840678484924990e-01,2.857352242497969153e-01,-4.611053092545491228e-01,1.080830665528353940e+00,-3.736979583678550765e-01,-3.914023801821854831e-01,-3.212088687606955151e-02,-1.376951340508528465e-01,-4.278086973312070218e-01,-1.694672148137533751e-01,-7.916561748167604273e-01,3.563915525384570571e-01,1.815831115956149766e+00,6.318915544119091399e-01,3.219731396716922767e-01,-6.275452802403047592e-01,-1.394852752626297043e+00,-1.410442660218965027e+00,1.854678338446262287e-01,2.114260479983500307e+00,-2.383352690952238451e-01,3.423516006332300021e-01,-7.969640123993781966e-01,-6.193760679013918802e-01,1.447017352133550538e+00,7.663311090775000167e-01,2.151060615924595076e+00,3.240497676285708506e-01,1.345855360609190532e-01,3.579105941521758538e-01,-3.809944859869902611e-01,-4.691805162887013880e-02,5.716002738636105640e-01,1.096067812911692529e+00,1.885138109435676057e+00,-4.902185382893101129e-02,1.756225475960482285e-02,7.525449498934899673e-01,3.511741262948570697e+00,1.735879219074577762e+00,-2.437427340809212861e-01,-3.347530679762934502e-01,-7.714926565643898115e-02,1.336654494217746958e+00,2.557330476903396654e-02,2.295668416406589640e-01,-8.129171496752495285e-01,7.630529424539603811e-01,1.081479369608201457e-02,-3.117762150880755700e-01,3.075778331315477399e-01,4.500714581209745435e-01,1.240493955477536936e+00,4.718316110904723915e-01,-9.337034987413894704e-01,1.806390902700936163e-01,-7.061105997259656264e-02,1.320273002379877436e+00,1.497372973456630341e+00,-3.844624206115649923e-01,-4.761032426933398121e-02,3.319445958271292074e-01,-2.888774381783366096e-01,8.832301129618566060e-01,-7.853583833217154808e-01,2.822912505314250087e-01,-1.026151750268931018e+00,-5.420530201001849679e-01,7.389248153211188663e-01,-3.317259898660743778e-01,-1.806769945673904754e-01,1.910774626420315814e+00,7.522935270795763074e-01,-1.148231896653980622e+00,6.563719778370329383e-01,5.949844322945418984e-02,7.090211759630409283e-01,2.344036041385175184e-01,7.442488249446096438e-01,-8.006481221671695181e-01,4.675788114528992567e-01,2.342500149375613960e-01,2.576375923088571884e-01,-3.421795981161570022e-01
7.098618283093214298e-01,1.258843738969532833e+00,3.288701572465185796e-01,-1.138199843142770229e+00,-2.254955895393268017e-02,5.191488870795996080e-02,4.516422813455795993e-01,-2.547192135760232290e-01,1.120847929065086124e+00,-7.589682983843246133e-02,-5.710964033490766312e-01,2.003782599513220797e-02,-5.432266335219947395e-01,-3.017757349901217245e-01,-3.520190503933063875e-01,6.406437572402305936e-01,-8.020818051946967397e-01,2.445091152780582977e-01,-3.669570973791820290e-01,3.148338166773378272e-02,-7.806029785653856301e-01,2.279281586933419590e-01,-6.348180880113095670e-01,1.957177617469949005e-02,2.063478677207812417e+00,9.650145728432697467e-01,1.670093872543445823e-01,-7.388894852858460816e-01,-2.427462147281270077e+00,-1.799654955428234837e+00,7.775254567270384332e-02,2.787803055218163628e+00,-5.694603735628094299e-01,4.531370786120895167e-01,-8.392751879816096050e-01,-1.073570599218176547e-01,2.155046635301526958e+00,5.190032738376548771e-01,2.111452620508752709e+00,6.053641070986702788e-01,3.431980869040641147e-01,7.858651873251231157e-01,6.004341519835723617e-02,-2.799579185024827499e-01,1.003473269419204783e+00,9.427873966199262767e-01,2.385605595575043480e+00,2.530349812504031348e-01,3.188341221931137448e-03,2.774943949345748395e-01,3.328058772367435303e+00,2.346766593094263165e+00,6.238020717036057983e-02,1.113827466155089541e-01,-4.488348328028535228e-02,1.440674892995996714e+00,-5.658194991258524986e-02,-1.917417234477863941e-01,-9.762494572250193237e-01,1.446807300311689248e+00,-7.256052908553434211e-01,2.438049631103494930e-01,5.960438398148949490e-01,5.959990885715982234e-01,2.128090123048096416e+00,1.412103163008331830e+00,-4.471477494561711397e-01,8.191536536500165777e-01,4.369418049865830822e-01,5.222554913405353938e-01,1.260036436319943887e+00,-4.728120294712414573e-01,-1.237166530572089557e-01,-8.083264356161092845e-01,4.685175676478979534e-02,-4.837609010801546816e-02,-6.793882467928664681e-01,-1.558267803860435841e-01,-2.126835687212388581e+00,-9.054947894320874990e-02,8.339927251307386324e-01,-2.197100866261714747e-01,-6.095539806551124595e-01,2.373524511327847808e+00,7.772221515423959337e-01,-1.448891524315242263e+00,5.327779607149153440e-01,2.110130974331830833e-01,1.016388161358860120e+00,-7.222835329866930110e-01,1.210676037005893324e+00,-7.009565030317549406e-01,1.006401453547208780e+00,4.099968865519888483e-01,-1.029321093839144829e+00,-4.789238632777338411e-01
7.743038554640617743e-01,1.077319056609034043e+00,-1.581074562011790530e-01,-8.964208812108493962e-01,-1.229215328761433523e-01,1.858218758005786286e-01,3.302834380780405032e-01,-3.813701550853326044e-02,6.265660665811003671e-01,1.995638018731933638e-01,5.672629758001734857e-01,2.286755321598441526e-01,-3.426271445506746116e-01,1.479865411970858469e-02,-6.336864337190839525e-01,1.650532407009370317e+00,-1.153148900403919708e-01,-6.270703056474125070e-02,-2.011080724174409418e-01,-1.073480783208081712e-01,-4.527142840282515346e-01,5.586978232191912586e-01,-5.377521573603475380e-01,1.183379934973331216e-01,1.884639491828559388e+00,1.789105773706594349e-01,1.522049175765616269e-01,-6.215655116398982605e-01,-1.342850184110499612e+00,-1.454267991961415429e+00,1.362588096155493145e-01,2.356654161174478013e+00,-4.127092241859451338e-01,2.689819369776524915e-01,-7.379959507109501438e-01,-5.483730655844943902e-01,1.736536810821269317e+00,7.808667677255757278e-01,2.249409633808177489e+00,1.025713573006673762e+00,4.457322516511825206e-01,3.263411615853381575e-01,1.821207538344011417e-02,-3.575397207978567304e-02,3.326071638461651769e-01,7.993512772254668386e-01,2.410119247947746235e+00,1.168748945753450216e-02,-1.302629722343352781e-02,6.496709266257519877e-01,3.818439066761237122e+00,1.996523375527671895e+00,3.675137459318418842e-01,-3.074447050767172840e-01,-3.890088451019628746e-01,1.620342906733958088e+00,5.724963716781740208e-01,2.531848940001801829e-02,-1.095552094366479157e+00,1.900697735038680891e+00,-1.342360720448627920e-01,-5.811167003180345292e-02,2.374929614844177583e-01,7.732259160767288586e-01,1.292567128625403905e+00,4.126221990053516864e-01,-7.149611048797936963e-01,3.340760125487733379e-01,3.381531981578386192e-01,5.435580691868027170e-01,2.004025404873866822e+00,-2.577415961782995590e-01,2.851154089253420121e-02,-1.473739369903197816e-01,-1.563272467156880952e-01,5.793770582402948399e-01,-5.732307033948589314e-01,7.362274147806089353e-01,-1.400935762634680337e+00,-2.500996618415248784e-01,1.020570978901878867e+00,3.124819290425904783e-01,-3.158496228296214237e-01,1.774984639804469300e+00,1.184834541247181239e+00,-1.388273766244628948e+00,3.533870517666214406e-01,6.147268705488908580e-01,7.343593940841829371e-01,-4.264833560865371465e-01,1.549426681483148105e+00,-4.316221802317868894e-01,7.010040276505166146e-01,1.339698159547495770e-01,3.268730044584169936e-01,-4.537436080991785747e-01
7.476930426574041055e-01,1.646741336432788749e-01,-1.551924578951094369e-02,-3.405861699802467668e-01,-3.372265239827376138e-01,5.462032201402620135e-01,1.670713803350334647e-01,4.274584769682239493e-02,1.290418396381649346e+00,7.112547776409104960e-01,8.436490161774119478e-01,1.092531604612868301e-01,-4.365351659330064527e-01,-2.226182315370027198e-01,-3.369784421111610140e-01,1.913920591571900642e+00,-5.170333024845277237e-01,1.474852046277118078e-01,1.531199651063937239e-01,2.820020392790851260e-01,-8.855429094833158210e-01,7.440709153155118383e-01,-1.914483342071591765e-01,1.680266926507229530e-01,1.464703410195722366e+00,-7.929565570165307831e-01,2.433831560902495750e-01,-7.077791456620169397e-01,-4.780348213714229466e-01,-7.056372555941337055e-01,4.245991242428055479e-01,2.777576672753779619e+00,-2.285152637701591549e-01,-1.171782186457327457e-01,-4.503693033443888494e-01,-6.521926058517061309e-01,1.269135324783059016e+00,1.211458907030624754e+00,1.869851277790541388e+00,1.993907950899844739e+00,9.387400132670860042e-01,3.886662374191897085e-01,2.506306701188081298e-01,1.162227065908186946e-02,3.267166619735507593e-01,5.686852157566457677e-01,2.743755443540772276e+00,-2.660251763286765603e-01,1.593528500292898109e-01,6.255625858075876122e-01,4.108124410080368882e+00,1.748123574887832543e+00,6.449168075674041045e-01,-5.476650840086644267e-01,-1.017128631543917194e+00,1.855028077026467104e+00,9.493374774888775347e-01,-2.419734524984870072e-01,-4.146156407141968758e-01,2.353684122487086583e+00,9.816651536923535204e-01,-5.041412059440081306e-01,-5.090439653480491877e-01,1.051628716082603887e+00,7.475288861550311026e-01,-9.541718635943485793e-02,-5.076703211233720703e-01,1.234387537772374976e+00,6.587087038361902347e-02,-3.383963579298904234e-01,2.744166645504174440e+00,-2.124772899242726720e-01,5.034991644359579910e-01,4.155555342692839327e-01,-1.148324961686361390e-01,1.183225729222157963e+00,-4.267853818643657648e-02,9.142716471002451106e-01,-8.268512679229207407e-01,-3.812113489078656214e-01,2.400361260156850252e-01,5.669267772815107520e-01,-2.404462695467048383e-01,1.505883157610685252e+00,8.959807631255432003e-01,-1.209863479778693574e+00,2.585551802086960560e-02,2.130869864174361528e+00,7.038652774819830205e-01,-4.461717974995320635e-01,2.231991871716379805e+00,1.011340618748474141e-02,8.082124433285315934e-01,3.369139202660684784e-01,7.139574088454259115e-01,-3.698946779738348511e-01
6.232523487175587462e-01,7.930384180890326373e-02,-2.107402379261844594e-01,-6.534423037066990902e-01,-4.037952668075618923e-01,5.459371269405428606e-01,4.008658021003386196e-01,-3.365279722023392650e-02,7.686091462504061056e-01,7.041306333813101004e-01,1.172530673858099393e+00,2.063253690151229391e-01,-3.260118904209917123e-01,-2.875374226121447663e-01,-7.136766382121909613e-01,2.027692217649494921e+00,-3.181254643751383338e-01,1.283999710569900254e-01,-2.484553162047629243e-02,3.212165175931799843e-02,-5.492975628066600891e-01,1.022913480078825543e+00,-1.901221141040047580e-01,1.000903568942761723e-01,1.817375361529067090e+00,-5.662079622227126352e-01,2.379698336082754218e-01,-7.110286486539637574e-01,-1.014482194323016007e+00,-1.250562781381957311e+00,2.262644244396888604e-01,2.730904515760397722e+00,-3.517497869517875464e-01,2.371452978083268548e-01,-4.789255607204588872e-01,-6.168314347268465392e-01,1.401388890228656425e+00,1.074196952690854800e+00,2.570806509201934098e+00,1.995436861689678043e+00,6.948077674930515091e-01,3.469738114098719906e-01,1.654080856047165371e-01,-1.906154917110726155e-01,1.382464095539205906e-01,5.266342726821682252e-01,2.475854165440254384e+00,-3.248683418727293382e-01,3.047504209913744211e-02,3.326075028651240273e-01,4.057811748097530646e+00,2.172981606494682971e+00,5.369343521097267313e-01,-5.196623625622009968e-01,-1.046797780880496020e+00,2.116963789714302990e+00,1.321294466340005025e+00,-4.107726132670581898e-02,-7.393258392301267357e-01,3.034614516168051335e+00,4.449360537618771705e-01,-5.340338755316692554e-01,-2.261842631932401981e-01,1.135632481832536511e+00,1.008709121991311353e+00,7.207752898333824598e-02,-7.840661323065142296e-01,7.754200585420042424e-01,4.048908405703436908e-01,1.195178613624070518e-01,2.395820873791150163e+00,-3.924761709425350631e-03,5.316481643684308755e-01,3.683601779689710254e-02,-2.085467931506329031e-01,8.118819540865462869e-01,-5.321458904391064282e-01,1.173300249906003234e+00,-1.223136430167193645e+00,-3.222874943459865804e-01,7.007376662161877157e-01,8.004532672655038095e-01,-3.292722714071857348e-01,1.781310879587057361e+00,1.355518246727996257e+00,-1.622405430139201687e+00,9.078977292399670329e-02,1.556317036118182395e+00,7.020989397347300320e-01,-4.816874518935490013e-01,2.063262774760967311e+00,2.079027687241655764e-01,4.057465266797797843e-01,1.804272288557396131e-01,9.946330757454167060e-01,-5.947084314200192789e-01
5.792962491701889594e-01,6.356336057872933321e-01,-4.251209316463223226e-02,-7.814133960615842200e-01,1.932832531663481457e-01,-6.348475087219973556e-03,4.439106022144663766e-01,-4.546670281162625837e-01,-5.427012482751563116e-01,3.630540689769011786e-01,1.245838283675335223e+00,1.611138548982321006e-01,-2.611989510878591214e-01,1.898947292137359022e-01,-6.160788640377636849e-01,1.823077370934589769e+00,-1.623414379654880557e-01,-2.328638711852974719e-02,5.695249980731326850e-02,-7.977221691450250840e-02,-3.934505539590723577e-01,2.683118508130655222e-01,-4.891692216659315195e-01,3.438639518209832824e-01,1.739519016589532008e+00,-1.311810865766478429e-01,5.254797599927850671e-01,-6.002654558362171544e-01,-6.336546975562393769e-01,-1.139625859621334447e+00,7.857388364871695230e-02,2.175745651345207587e+00,-3.805034221042460363e-01,9.111549315760708589e-02,-5.406199068738365421e-01,-7.655850498307479324e-01,9.480498761633826543e-01,1.238875068015634406e+00,2.435547582822758628e+00,1.383159837072714282e+00,1.652901862264065658e-01,1.178620625486540008e-01,-1.811339939938828025e-01,-1.668313562851979071e-01,1.849388419423510510e-01,8.374539793871413895e-01,2.182653021757419154e+00,-5.383930409905072212e-01,-1.972481293621883847e-01,1.197385799865323230e+00,3.393408494333471914e+00,1.385007611238890934e+00,-1.378612582080791515e-01,-6.239046305384019497e-01,-7.647362816394163154e-01,1.861110347842358514e+00,1.020701641884687927e+00,4.241916949443444995e-01,-6.969023939931160427e-01,1.517979865039419396e+00,7.463000081013624332e-01,-3.619609762145138410e-01,4.328936675933588857e-02,1.265496732670142732e+00,9.077135544549880253e-01,-6.127673695048457825e-02,-1.038495030910628891e+00,1.536583587769556614e-01,3.350518102382964991e-01,8.762104811932545090e-01,1.947070780512102806e+00,-3.359577416106604986e-01,3.796190889244956956e-01,5.475834497130388501e-01,-6.194145593090939483e-01,1.375100114785192673e+00,-5.242331271824122174e-01,1.234977472219650263e+00,-7.136678930577553537e-01,-3.376848041526537836e-01,5.538155445956811640e-01,2.643649860476346425e-01,6.420769153220257097e-02,1.604738516229058387e+00,1.217989988758695574e+00,-1.216241124553149699e+00,5.446097632016034806e-01,8.487106567674009838e-01,3.352326698750618950e-01,7.480851206580116930e-01,1.272173996161693799e+00,-4.388349146542034895e-01,6.885064967829168658e-02,1.044208942785174177e-02,1.681323747019161763e+00,-1.854105261453029840e-01
8.103371107990953170e-01,5.834959310277197941e-01,-1.069172479968017175e-01,-2.170065253700268482e-01,-1.529279768338017709e-01,7.857864844103985558e-01,1.152456093972624052e+00,-1.146385230246476511e-01,8.497083610927840258e-01,-1.687755906836371778e-02,-1.654921719466441732e-01,-3.511799495554053241e-01,-5.298484289804148428e-01,-1.950621384416170723e-02,-1.791414867006876077e-01,8.481781899819734738e-01,-8.114886242841619080e-01,-6.390899220992022345e-01,1.023625478878714690e-01,1.394522755889440746e-01,-8.353967420073566963e-01,8.829071763992107913e-02,-6.567346306991033167e-01,2.476444491155208039e-01,1.572744207183135234e+00,2.702158557383071424e-01,-8.809446154713260202e-02,-7.604746725335311819e-01,-1.579473968991875310e+00,-1.118558468987685517e+00,6.596984334219692103e-01,2.621782911411131067e+00,1.264053601434042551e-01,3.636408840791266472e-01,-8.284003258597186781e-01,-5.366373321374611205e-01,1.940804206223806894e+00,4.719358539018484455e-01,1.574639001438906671e+00,3.290991811861760930e-01,9.109232816198464810e-01,7.190658018479396674e-01,-1.744505223090261903e-01,2.228732970518353396e-01,8.098020751701886510e-01,9.661558941360839370e-01,2.070384822150648674e+00,4.523529377930858852e-01,5.683524058906935794e-01,-2.601995790540406750e-01,4.506903292680367379e+00,2.398564247147985995e+00,4.689915375027307598e-01,-1.992258634044653809e-01,1.409145304208603289e-03,1.079204767254104969e+00,-5.305067689625443395e-01,-5.077350022963437182e-01,-5.350465157371079306e-01,1.365453770267922362e+00,-8.652372108337377798e-02,-7.277731876763527952e-01,-2.290687382406900452e-01,-3.663680174980704640e-01,1.059306749209593335e+00,5.360301138871621518e-01,-4.939678832774013761e-01,1.211550197267524887e+00,-7.384428592679556091e-01,5.684676205235754676e-01,2.107154445468433224e+00,-1.376435598053836473e-01,-8.915003286764643098e-02,2.988996695090863076e-01,3.996640122683436380e-01,5.152814174121278512e-01,-6.076708782462770797e-01,-5.237682265885710287e-01,-1.133722425374855236e+00,-8.913455216470337339e-01,5.469976812126111643e-01,-3.146571501521240322e-01,-6.157840263209048981e-01,1.982547453633668466e+00,1.799604014140533392e-01,-1.168087120664778489e+00,1.525717329657806376e-01,9.073839465166397833e-01,1.318622639546923825e+00,-1.247307330929473990e+00,1.343507021324634065e+00,-3.991046141574988160e-01,1.266576002751510055e+00,6.957107751692470643e-01,-1.327591096805399218e+00,-7.290338025358633622e-01
9.821347085894752693e-01,7.478083449774238778e-01,-2.721449529823538049e-01,-2.702932122023400385e-01,-3.626450335195866015e-01,4.711110760260383556e-01,-2.018621445239273116e-01,3.836779497946278816e-01,1.550012467472248412e+00,6.437449786163489396e-01,1.021062868889996755e+00,3.112001308021545842e-01,-3.690033439251103609e-01,8.890293362503051688e-02,-3.765974827376866174e-01,2.403096051557174206e+00,3.943915539761372324e-02,-7.029992034013103630e-02,1.346982020176649697e-01,2.045297511825666659e-01,-7.569348389345409434e-01,7.971063659331145690e-01,-2.823850966899318915e-01,1.731064550144764680e-01,1.304250287566448785e+00,-9.906379098170912112e-01,9.168970359508230028e-02,-5.795565407287305293e-01,1.156197086689711995e-01,-4.702077986271597787e-01,4.708000508351311009e-01,2.383629420099813601e+00,-1.751864490507994143e-01,-3.377731587028272586e-01,-5.445011706586178057e-01,-8.516202196231678068e-01,1.341964739187235578e+00,1.191388388596142045e+00,1.509913164715348310e+00,1.805169978435787304e+00,1.055821943423737252e+00,1.218387396262358702e-01,2.972383386552799878e-01,3.507040480783645831e-01,4.962124812320922729e-02,5.771355054839696352e-01,2.984933477709586391e+00,-1.044289389777805221e-01,1.831779853228479027e-01,1.062574472312954210e+00,4.419577437689576449e+00,1.414269026649875416e+00,9.970203511929309759e-01,-6.419277109497660838e-01,-8.547927317249426338e-01,1.614724398767992009e+00,8.401350184639166940e-01,-2.424274262555153048e-01,-7.164338044503877345e-01,2.049297005892236179e+00,1.039780686923855946e+00,-2.829858426011733208e-01,-5.442245307735078530e-01,9.361372278575711414e-01,3.690345815142269670e-01,-5.266756660763800557e-01,-4.336993997079400809e-01,8.897706546636099390e-01,-4.759355854440864425e-02,-4.801814693726000893e-01,3.236042084783375294e+00,-2.656738692169275939e-01,2.564852082373831887e-01,6.352168167482467043e-01,-8.290991857924774611e-02,1.385008894751960096e+00,2.256179681676765969e-01,1.169679265543833502e+00,-5.272550529466493163e-01,-3.676422057811757904e-01,5.205523561948827149e-01,6.946668609836648134e-01,-1.005291687170052906e-01,1.014332956629591553e+00,9.926215571789156478e-01,-9.658914716554365398e-01,-5.325106229024367810e-02,2.131762928301841775e+00,6.044927079988338114e-01,-5.381240521817308720e-01,2.439703517697302093e+00,-1.856173544259265840e-01,1.084930704948291913e+00,1.807584599195666275e-01,8.998041381822097229e-01,-2.498078747684913115e-01
6.699026374807234285e-01,1.621803034820434863e-01,5.220914273729375665e-01,-1.052881552683927469e-01,4.269638677373303881e-02,5.943762217982495599e-01,9.296162972850445794e-01,-4.510878473627946694e-01,1.095797925971540909e+00,1.699384860772398809e-01,-5.476776994799346099e-01,-5.256270673140210903e-01,-7.018601041064437274e-01,-2.754113176321105749e-01,2.714648931174525881e-01,3.797812703941327861e-01,-1.544312164114946428e+00,-8.822204298864561034e-02,2.962005578189433330e-01,5.214475221418453099e-01,-1.352753115675360274e+00,-2.669417379957922387e-01,-5.000032843913708724e-01,3.178762038676578028e-01,1.350318516798792112e+00,1.316807156640908416e-01,2.556146334904390582e-01,-8.567668074485854657e-01,-1.349314587394342624e+00,-6.912392666441546929e-01,6.775439975628748668e-01,3.056949022156508100e+00,2.280652952640521702e-02,4.006295616273598814e-02,-6.130044486603660747e-01,-3.596262146012314531e-01,1.481601614219269614e+00,8.799580571206807589e-01,1.242364075628970221e+00,8.638707379628113303e-01,9.012543536066334182e-01,9.398095822493197637e-01,-4.922259161313156939e-02,-1.862447664406521874e-02,1.252055173328282756e+00,9.658133716756476250e-01,2.290044946377617574e+00,1.021369958744920564e-01,4.707018609995575198e-01,8.677772473960232436e-02,3.834998878807010847e+00,1.925809126658762249e+00,7.552320492559150278e-02,-1.925514136883878791e-01,-3.413566183211767524e-01,1.217069678684818967e+00,-4.840972519977360111e-01,-5.479851326517719556e-01,1.534567031510364332e-01,8.370602730518772461e-01,7.258867460850814135e-01,-6.991646160443008018e-01,-4.289031412426201895e-01,1.721492634245933573e-01,1.210649611083505883e+00,7.435054362772064440e-01,-2.860355238851780557e-01,1.963053980354496630e+00,-6.680502638425029893e-01,8.392661030977405234e-02,1.946117611975423545e+00,-4.627971269303263746e-01,2.543126382741883185e-01,4.844860788718834410e-01,2.207118293524938935e-01,9.367578858664087349e-01,-1.757346447273326617e-01,-6.890086445643255342e-01,-9.494037028289583624e-01,-7.369618513763673828e-01,-3.710244403184568274e-01,-6.042793696335229114e-01,-4.898105052641159585e-01,2.083975206423196447e+00,-2.394538154327129353e-01,-9.065599310197690608e-01,2.706527984022232269e-01,1.662942867452814610e+00,1.160975964155878559e+00,-5.950605692294578253e-01,1.371832834656623756e+00,-4.942885297949878853e-01,1.238152611784391066e+00,8.887757280054986442e-01,-1.185202819681717035e+00,-3.834325022963279150e-01
1.202977814178107563e+00,1.628194051207305426e+00,-6.851598778454262018e-01,-3.464612174054835791e-01,-3.145947373153566429e-01,4.920082692257133905e-01,6.698671063518724100e-02,6.165199699117105414e-01,1.324474944416333066e+00,1.283932897823094610e-01,7.549497341134667749e-01,3.316590393570419404e-01,-2.940722718300309291e-01,4.910493686740127761e-01,-5.394956967039459261e-01,2.344952363298070441e+00,5.744832056543309751e-01,-7.310153226637662316e-01,-4.379067200592193232e-02,-1.054548257528390431e-01,-4.046787525328459090e-01,6.291170104774241878e-01,-6.556204031825215717e-01,1.716217076650501938e-01,1.417002872410748626e+00,-4.040978531955266573e-01,-2.634165430504967764e-01,-4.731835168522251500e-01,-2.492377172225812565e-01,-8.009644904918495900e-01,5.197891762988965381e-01,1.853545660365796266e+00,-1.523964612084410808e-02,-9.104253771405060314e-02,-8.901433125426537751e-01,-9.500304324386500410e-01,1.917500401638357665e+00,6.513032127149253059e-01,1.352510912982765268e+00,6.240029525665213850e-01,1.005588593456916424e+00,1.492506043899505253e-02,6.680912693852703033e-02,7.058100393471749001e-01,-5.052093662091061699e-02,7.974059939947011344e-01,2.724059719422094794e+00,4.628226944724319614e-01,3.519475260608580514e-01,8.729059297716403876e-01,4.903317562037623034e+00,1.676807470301917125e+00,1.199689035458736619e+00,-4.977409184460713787e-01,-8.692719235415030665e-02,1.053097582498594420e+00,6.457203394518973294e-02,-2.807193088197755260e-01,-1.322422209688002503e+00,1.513033911434108258e+00,1.253204467600959882e-01,-1.298957852788539535e-01,-2.110709085201967483e-01,6.330342248175491182e-02,3.563965566888654957e-01,-4.669451007955555122e-01,-4.861734113289626347e-01,2.363585051361084544e-01,-3.949069931444066373e-01,1.431895807145807387e-01,3.152192136118322718e+00,-1.846736188661074474e-01,-3.552539829886892098e-01,5.208231283672051237e-01,1.937917792857347110e-01,9.584971388974631301e-01,-8.907525725840548247e-02,7.446631583166704038e-01,-6.707706901876351324e-01,-5.749232457404955809e-01,1.279684464497373497e+00,4.419040367550260973e-01,-2.265424074170854229e-01,9.410846462056602357e-01,9.547612566217305030e-01,-9.198512887167603624e-01,-9.372046901558517273e-03,1.051156998778685736e+00,8.503248546332827784e-01,-1.122099292177720864e+00,2.042849968617552747e+00,-5.509741946418296177e-01,1.434715554150875150e+00,1.258962664662706676e-01,3.361892711758501795e-02,-4.445233893630168298e-01
7.862642815988232226e-01,7.964043845568559155e-01,-3.526177449889760229e-01,-5.873720938691868731e-01,-1.378985138290171608e-01,3.876430320951386177e-01,5.167678107981732438e-01,-1.515734284528173076e-02,3.073640104367967862e-01,2.896494286027485598e-01,9.790603262074719648e-01,1.571724948652667986e-01,-2.909119459141880637e-01,1.698915505305896856e-01,-6.390863685570205011e-01,1.916168356545639773e+00,1.437138570452523023e-03,-3.538533457826902873e-01,-9.916642842731068774e-03,-1.009175577698630810e-01,-3.980222132302426719e-01,5.480006716939980205e-01,-5.178762119185720270e-01,2.271207890750328307e-01,1.701995199859084540e+00,-1.960295765166298332e-01,1.286608896731072926e-01,-6.038978100780858504e-01,-8.250647654091980421e-01,-1.168309664646656643e+00,2.971172007126685055e-01,2.211161141083858084e+00,-1.907400699081202577e-01,1.909138993429159437e-01,-6.898559242088141419e-01,-7.739849505000375718e-01,1.499056776678507452e+00,8.753993174318239756e-01,2.159855309887655839e+00,1.078341033013467953e+00,5.823096185460505669e-01,1.973130778284560849e-01,-7.920305264210862617e-02,1.263504330866316305e-01,1.359506580527553576e-01,7.827413917368514218e-01,2.297036508118965870e+00,-5.141188819969451373e-02,1.136125668574182734e-01,6.371827182878233575e-01,4.175279287063682787e+00,1.872399058627232105e+00,4.684909557311859318e-01,-5.103356739898203820e-01,-4.914881284317558219e-01,1.590492529130152377e+00,6.228397185001990355e-01,3.155410943968037230e-02,-9.459180117194110338e-01,1.923493911645804522e+00,2.604480964066162585e-01,-4.205848101539405581e-01,-7.827802126243051106e-02,6.091496184745160969e-01,7.996538877757732866e-01,-7.012624338191447704e-02,-8.211378730935562364e-01,3.281423363120221093e-01,2.108012265391513707e-03,6.048147454966799064e-01,2.362329349712593007e+00,-1.340567587788097093e-01,1.141443786050974490e-01,3.629467450070649193e-01,-1.580320733798777078e-01,9.486082407831565311e-01,-5.320204905014657148e-01,8.671646029252388921e-01,-9.111608124737147207e-01,-5.090328846914451422e-01,9.178279313174368959e-01,3.817394289607343172e-01,-2.157500432757693543e-01,1.539788589188621382e+00,1.105021375480815138e+00,-1.283133972437735526e+00,2.408605470251054537e-01,9.088008457488880865e-01,7.137113584331457039e-01,-3.644539718595186106e-01,1.612684112970511396e+00,-2.959421606075122169e-01,6.294912595739133865e-01,1.447196166018997476e-01,6.735743108444132154e-01,-4.854118028983998578e-01
7.263095570647595256e-01,1.548235040346537250e+00,9.266148812420620107e-02,-7.327260709541119077e-01,6.467254286273687036e-01,-2.344557841589321456e-01,8.235602468529654718e-01,-6.417969794143362217e-01,-1.000263663429450611e+00,-3.636072836652181062e-01,2.815339768986701019e-01,-1.300401592261227757e-01,-3.529726670307211656e-01,6.144040245252518906e-01,-2.817179838274028736e-01,9.532241589891810030e-01,-2.769270291432177067e-01,-5.511154474931567737e-01,5.324351774444873592e-02,-1.343917718596516209e-01,-4.376743853981341914e-01,-6.705084660325466572e-01,-9.924444409651537180e-01,5.013553868386525503e-01,1.640178173245409932e+00,8.206614423786792178e-01,4.093737502211265422e-01,-5.504959995111841087e-01,-1.006507342594024967e+00,-1.164640991838959305e+00,2.013247488817061781e-01,1.771644232031330812e+00,-1.818245211985961840e-01,1.440871046110766551e-01,-8.668370525991155873e-01,-7.277655819031174644e-01,1.254759994977538984e+00,8.305633813710666669e-01,1.754380846248806414e+00,-1.406485327200885926e-01,-2.477230706283328754e-02,2.347312037346699354e-01,-5.397222992952248610e-01,1.125914569120067960e-01,6.449734173472578824e-01,1.294272050740156610e+00,1.836702713932875319e+00,-4.421825744424516536e-02,-1.961331529849180688e-02,1.299328451184272204e+00,3.283898944546790766e+00,1.190932214613253048e+00,-4.815048343573317124e-01,-3.807770023172644680e-01,1.840678232937538183e-01,1.016580731190711351e+00,-3.822547213932598886e-01,3.687147921930247207e-01,-7.589188536175698330e-01,-3.466933639781746290e-01,2.573922408887769908e-01,-1.744502012764245213e-01,3.692240000194778604e-01,3.621161128386117811e-01,1.066959549668754725e+00,3.268106124802004353e-01,-9.438645740717371835e-01,-3.997372757927064590e-02,-2.899541575494656298e-01,1.570674810635278806e+00,1.436132658782959926e+00,-6.277984483704638352e-01,-2.298215258430323371e-01,7.268320410119935016e-01,-4.129945316563779500e-01,1.262057607280867355e+00,-6.037433792117630205e-01,1.649639960669511685e-01,-6.228202309565515904e-01,-5.946497745471668317e-01,5.953415488905272612e-01,-7.151003003143092673e-01,3.881193560026291456e-02,1.674381675571045225e+00,4.987869456273712476e-01,-7.603718602566105211e-01,8.537285759092168025e-01,-1.937710689603917569e-01,5.563649445627232293e-01,7.666842207284836341e-01,3.889489913461727788e-01,-1.260039142377494592e+00,5.333981123107136568e-01,1.983940850397917788e-01,3.708483632089979998e-01,-6.652870626048434932e-02
9.666351367590304555e-01,1.738337999891444108e+00,2.605638754872019458e-01,-7.150044989195196710e-01,2.206413954141981937e-01,-1.866004473320510004e-01,-1.520266387945389819e-01,-5.677513497132122278e-02,1.072654852832304995e+00,-2.128285266434187806e-02,-1.279355380378252582e-01,1.551755633449285465e-01,-4.929000481076196705e-01,2.564922269150165524e-01,-7.652905434108209226e-02,1.298899387226265523e+00,-3.039694372453324300e-01,4.224123211242936105e-02,-5.998519637818197636e-02,1.678997587897740618e-01,-8.631735739327319745e-01,-1.283884719516596995e-01,-7.032219506201093928e-01,2.384434478689020642e-01,1.465303375342289049e+00,2.883911064816156444e-01,2.553242461570089938e-01,-5.604287013226874059e-01,-7.172298634239540061e-01,-8.208262883222687822e-01,2.523725524198790482e-01,2.215151196803629929e+00,-3.896026686387833449e-01,-2.557157324462899783e-01,-7.841401255291005068e-01,-5.380110036310085109e-01,1.564287923564136040e+00,9.502604544896936511e-01,1.215306101186830023e+00,6.634498960749941610e-01,4.941019727866127198e-01,3.350746326726071755e-01,6.129076958476054743e-02,2.112857414934225520e-01,7.033272801551428977e-01,1.005630724688984623e+00,2.769230213099142635e+00,9.760974543085927657e-02,-1.663980641438814190e-03,1.477418258833633535e+00,3.441612838888638226e+00,1.127715622783207694e+00,2.371650504549346616e-01,-2.586363949535696594e-01,-1.077388047721078435e-01,1.112044824459777814e+00,-1.511201770941478228e-01,-7.248377417727201733e-02,-7.970493393270453586e-01,2.506132637302538324e-01,4.404112509990139035e-01,3.412797704650097907e-01,1.755661376909354032e-01,7.685364705528635598e-01,1.165842395568680523e+00,3.915675252408389873e-01,-3.501409614622312261e-01,6.487606884124759166e-01,3.498541129802933830e-02,1.719987588669145695e-01,2.135040593629894623e+00,-7.733938800372042177e-01,-1.930290448805261905e-01,2.687008683290883493e-01,-1.750524231626796046e-01,1.087857176415027105e+00,1.140508517075323747e-01,3.316763707140611417e-01,-9.357651113622761363e-01,-1.676595732743055289e-01,4.604022092271091715e-01,-2.693409427562414860e-01,-8.429843239952181100e-02,1.401701859855127630e+00,5.547349388708855411e-01,-6.800085299863454225e-01,5.134920057745750999e-01,8.863907718560599669e-01,5.967567559500948082e-01,4.243694820607374352e-02,1.436774874031053750e+00,-1.107572280527964192e+00,1.231658831483782635e+00,2.503575211695837632e-01,-3.012394266188889169e-02,5.866922705089505641e-02
4.704743119469148027e-01,1.789162371225939685e-01,-5.242529086630878798e-03,-7.007851524798075493e-01,1.002272998832586109e-01,2.303957812821206264e-01,8.035871419752675937e-01,-5.651025211971860696e-01,-5.583138431176732919e-01,4.083853442886143936e-01,1.132789516832461540e+00,-9.960440661884534252e-03,-3.061440425485373873e-01,-1.213705852959459652e-02,-6.042531174241947411e-01,1.549834680190494751e+00,-4.941646475225003332e-01,-4.546110172314243858e-02,9.229961524779067839e-02,-3.423316887574553297e-02,-4.685774321646175022e-01,3.203878800341819488e-01,-4.277254764888450689e-01,3.281952732297913622e-01,1.811759638700468189e+00,-8.635657516546968449e-02,5.025442576664005401e-01,-6.937174576404968596e-01,-1.031692551949215719e+00,-1.270461130009268969e+00,1.515382424428422525e-01,2.444451417200931509e+00,-3.041670044169070275e-01,2.817009424164722553e-01,-5.091226468394293159e-01,-6.738055508539815275e-01,1.019766801252104838e+00,1.151885600206343785e+00,2.610735848211400700e+00,1.429896459580250134e+00,2.406957080648672309e-01,3.123720608032682922e-01,-2.122465123833948697e-01,-2.896040480919817028e-01,3.253169281315857475e-01,8.102419692384763561e-01,1.999197318835767900e+00,-5.149914429978922348e-01,-8.328284040703735902e-02,6.710452481879471964e-01,3.504450949941908533e+00,1.777876654180178928e+00,-1.837227658823147314e-01,-5.646609751212153805e-01,-8.188414711513742894e-01,1.948784692781046823e+00,9.877143491707591760e-01,3.023247452769798338e-01,-5.225783075425437518e-01,1.896774336712525599e+00,6.240871575767389379e-01,-6.407009646169021799e-01,-4.039698293835045778e-02,1.091827488120600265e+00,1.041293510173172843e+00,1.460690038549645742e-01,-1.057472863561180088e+00,4.555255094396927218e-01,2.317833753280828246e-01,9.272167789140428606e-01,1.790045171415476366e+00,-1.932033783188051856e-01,4.979740750868692500e-01,4.405862769044351923e-01,-4.934705204206586426e-01,1.164432794129774962e+00,-7.341107969677098666e-01,9.553605246557390629e-01,-8.916234857837400662e-01,-4.702054097312625691e-01,4.493581380993365570e-01,2.252578262860511216e-01,-1.111230018703335265e-01,1.903612147001940036e+00,1.096688676944396867e+00,-1.405481812393849061e+00,4.793620342722144101e-01,9.196837990839356047e-01,5.311070558134149966e-01,4.657912076557771397e-01,1.233282756665753377e+00,-2.081289293280534913e-01,1.699890825300887087e-02,1.719969379281213184e-01,1.297612091097692488e+00,-3.891185459840104111e-01
7.487659857090209758e-01,9.975692967587446169e-01,-5.014346646451230960e-01,-6.968354126990754516e-01,-2.598967092758171227e-02,4.382091523918957843e-01,1.079384403407970261e+00,-1.620447548728056741e-01,-3.373955947949649481e-01,-6.742329193603366355e-02,7.624105992279694988e-01,6.502145252648652840e-03,-2.575891318278895614e-01,2.995968209669533366e-01,-7.671422375402384697e-01,1.524810732709128924e+00,2.699020675222479904e-02,-7.515439116495125083e-01,-1.076596596976295839e-01,-3.152537181034874569e-01,-1.655676527166379253e-01,3.279059888944875212e-01,-7.564819452081357198e-01,2.606654244982042901e-01,1.915556980554297795e+00,4.102301979836460721e-01,8.448102224908271562e-03,-6.101683639011310500e-01,-1.499250941878702781e+00,-1.606649574056370211e+00,2.858455843865652657e-01,2.029665223032302013e+00,-9.034022838089017515e-02,5.647722636836205456e-01,-8.772102972153013045e-01,-7.436513632240143723e-01,1.797174269638158517e+00,5.032100766502607403e-01,2.381740032358973025e+00,2.798156713304629228e-01,3.874991527423725102e-01,2.738155414586437297e-01,-3.566964630048138907e-01,1.324968178510119721e-01,2.258783146603483283e-01,9.683492514664460149e-01,1.822949480321733873e+00,2.051592788016292634e-01,2.036883845197658416e-01,2.060272784621702269e-01,4.277932457014235190e+00,2.276604651527869727e+00,2.721056471392306886e-01,-3.723824727076547880e-01,-3.275488240677798535e-02,1.356297962824035030e+00,1.469934495979441091e-01,8.096809030252158368e-02,-1.171317781322827711e+00,1.680116092259466676e+00,-4.348954071595332316e-01,-5.313562217423166700e-01,2.077506846612851288e-01,3.810024462886485441e-02,1.020768854841472617e+00,2.339404439215245768e-01,-1.001287267030264383e+00,-1.823744479538913499e-02,-1.969324112278164618e-01,1.338899467131021481e+00,1.881998131339070124e+00,-1.946125238725132656e-02,-1.487037365422011481e-01,2.062908237716920834e-01,-3.264884417601815469e-02,5.519725675352608052e-01,-1.033732661957265320e+00,4.076826277312592950e-01,-1.159147254988895037e+00,-7.177277123359451227e-01,1.289215225201093995e+00,7.201602171940724162e-02,-3.702850208477863614e-01,1.845337668041797219e+00,1.026911805240781295e+00,-1.428259569669757756e+00,3.746035489622042691e-01,-1.949215448537988671e-03,9.326691766054963084e-01,-5.873600457227078353e-01,1.051752518302612849e+00,-4.388382989185080629e-01,5.732428909132254446e-01,1.907320010265316224e-01,4.880467852375897087e-02,-7.151854188823538738e-01
1.005606403964044215e+00,4.959199369075332209e-01,-6.414812418539236893e-03,-1.306032079597663209e-02,-5.346297910285581212e-01,9.275785431388365865e-01,3.449818619424957489e-01,3.849427125684937723e-01,2.535391650687360610e+00,4.000291935849820679e-01,-2.680784197232864430e-01,-1.411075028856713098e-01,-6.359689111247457394e-01,-2.915790475038940177e-01,3.174604574741568541e-02,1.310617592856986757e+00,-8.376133371365767077e-01,-1.904144106415802118e-01,1.375663338536611546e-01,4.559761539314984291e-01,-1.233565403167137475e+00,5.676098394964690375e-01,-3.449368003880560196e-01,8.078230602924509063e-02,1.289261583745761497e+00,-4.901750382795576066e-01,-1.870551630062208537e-01,-7.702503837965435363e-01,-9.593056070835606075e-01,-5.923711079122614409e-01,7.906217419375815014e-01,2.992639084079955492e+00,4.704794483907320801e-02,-8.121798841309549322e-02,-6.832396947134877774e-01,-4.863380158001365805e-01,1.996116166132701375e+00,7.091533868683114195e-01,1.044602468239851811e+00,1.218328842396787293e+00,1.452403334762662812e+00,7.445128095585380468e-01,3.324710080774708199e-01,3.621744217600816329e-01,7.673323602499417806e-01,6.773958642307572608e-01,2.874432820356047635e+00,4.665472920453582750e-01,6.315085456101789951e-01,-5.686730999208466919e-02,4.774246553285101058e+00,2.210854677048411876e+00,1.131265530759159921e+00,-2.267160861757453183e-01,-4.105079582852164677e-01,1.209563691516795547e+00,-2.079929463981166071e-01,-8.875196015098212321e-01,-3.995644888754922852e-01,1.935430773800412840e+00,4.368335285123491341e-01,-4.860882256164548165e-01,-6.239784139910059535e-01,1.927568430343351569e-02,8.620039215447907743e-01,3.053314139662924309e-01,-1.603043169778672894e-02,1.903350494976556284e+00,-6.007747273091774698e-01,-7.223005005737603845e-01,2.944753198122139093e+00,-2.199797107052997580e-01,6.722625079633740008e-02,2.117867003014513583e-01,5.683191909076132919e-01,6.441221912454626608e-01,1.094365408103057380e-01,-2.475404671712703175e-01,-1.098124651469821966e+00,-6.300657172636379144e-01,2.582403479047685746e-01,1.406913784651387944e-01,-6.419822943174218199e-01,1.604078794215673343e+00,1.785392746754148607e-01,-1.025058365455203013e+00,-2.127846054469526016e-01,2.176546846258957224e+00,1.302549189173650923e+00,-1.756638088067243864e+00,2.355258813006407159e+00,-1.569651427200165483e-01,1.806492349707199407e+00,7.540302542153184406e-01,-1.366596997033572958e+00,-5.957832565329606034e-01
6.943922924120704554e-01,2.221157952645994582e-01,2.731950710249330672e-01,-6.576161555312439733e-01,-3.939477739175396009e-01,3.372457229838774495e-01,-2.080265758101076945e-01,2.784734700231665527e-02,1.840944738941469483e+00,8.172062131596662393e-01,5.485134040658152799e-01,2.373232014018338831e-01,-5.031408545564821644e-01,-5.206926720885949322e-01,-3.168624343738859483e-01,1.773014861747033377e+00,-7.229114386643883394e-01,6.855425366864704717e-01,-1.697037949367439374e-02,3.629498254790963219e-01,-1.035261816676289026e+00,9.109999110036586245e-01,-6.909955386038679759e-02,2.486539345194913042e-02,1.625512833870322860e+00,-6.554691114373333294e-01,3.502040004246309568e-01,-7.481536696855640711e-01,-8.580926975406051316e-01,-9.005682960320029462e-01,2.307610027549300002e-01,3.091763376624991011e+00,-5.335262518641403773e-01,-1.321896650209524737e-01,-3.906958363764153064e-01,-3.934172199239561185e-01,1.374467099865937847e+00,1.284202638573885835e+00,2.020065068732131319e+00,2.389723468894509928e+00,8.495831230391508448e-01,5.275038693027069847e-01,4.755598922393521888e-01,-2.487147273281737903e-01,5.032771125591628536e-01,4.785541537083521368e-01,3.021223705928910430e+00,-3.660851811320453009e-01,-3.525661433172787296e-02,7.200623451795310492e-01,3.639030590562321699e+00,1.806418802337521834e+00,5.730154975076444668e-01,-3.875168332458266418e-01,-1.183595220499872092e+00,2.090850256124258344e+00,1.219192009814263011e+00,-2.512999745430165022e-01,-4.474045276199994370e-01,2.635213414689111744e+00,8.361394337054454118e-01,-1.251298302818907304e-01,-2.878571116815069608e-01,1.539942824730706761e+00,1.247561069898021735e+00,3.483510341393361021e-01,-3.580039850165665505e-01,1.420732944536925002e+00,5.819165466318924063e-01,-6.923360049403632921e-01,2.488811243736632761e+00,-3.507897185376727678e-01,6.007339090423462480e-01,-1.305112953349057692e-01,-1.894817035770667846e-01,9.063810485535223060e-01,4.845048194993567536e-02,1.004811166300513037e+00,-1.322655235841386556e+00,-4.428751358229787716e-03,1.766749992545870729e-01,6.737888182307598672e-01,-3.093339422431051755e-01,1.723752163221973666e+00,1.070079051613479493e+00,-1.355706728672035011e+00,8.927525500337979425e-02,2.218923587051513380e+00,6.377408882366475407e-01,-4.056672679228974232e-01,2.402523336679265764e+00,1.957137172276274262e-02,8.056736201540047881e-01,3.104636624664866007e-01,6.733407913776208176e-01,-2.829250327701920975e-01
9.404344946916770587e-01,1.724432290058202533e+00,-6.139407977144359929e-01,-6.802695225382525690e-01,1.282487737839761444e-01,2.918301794367141322e-01,1.006952326815473642e+00,-2.975678924459288638e-02,-3.761529773987635217e-01,-3.980751167604537066e-01,4.995089932534728661e-01,3.155523098176728908e-02,-2.451285141508330878e-01,6.421143131984577979e-01,-6.943383780920626691e-01,1.483766830158901096e+00,3.380516416225474718e-01,-1.076145902035387403e+00,-1.482928256809879497e-01,-4.067051749266024641e-01,-7.724392512499667074e-02,2.215062486479552062e-02,-1.009570159843099280e+00,3.117753192048204336e-01,1.819516494992921896e+00,7.004327815228800214e-01,-1.311985174641301100e-01,-5.127526126790659111e-01,-1.355990035545047823e+00,-1.535896704997552042e+00,3.356248568898051454e-01,1.633725125265945932e+00,-4.085227219497833406e-03,4.846804007767601674e-01,-1.068353207836129304e+00,-8.353484656793535024e-01,1.990014879581480489e+00,3.129078577464234900e-01,1.959550294010805160e+00,-4.333651766533830330e-01,3.580588792219255856e-01,1.585861704074820189e-01,-4.679492638691860051e-01,4.245733379706954636e-01,2.285723703706553089e-01,1.148189192428549887e+00,1.822390824170220247e+00,4.979984618305957622e-01,2.694577491618229681e-01,4.897371824464946122e-01,4.404633249473328682e+00,2.040862134171355535e+00,3.435119047574413664e-01,-3.207457916119988983e-01,4.413108679767112630e-01,9.029288190946147541e-01,-4.379531670198136828e-01,7.470757537227143419e-02,-1.421131867954944727e+00,8.265046742212694975e-01,-6.621284466913918143e-01,-3.014035016905509679e-01,3.565431183056188003e-01,-3.692302598029332250e-01,9.013021879257148150e-01,1.622340830004985746e-01,-9.351779547340479670e-01,-3.459506400957285122e-01,-4.606510838297085408e-01,1.555617047810186060e+00,1.937248937143621008e+00,-1.546789645143815950e-01,-5.425073424520671095e-01,3.463142243318212410e-01,6.103938115421593535e-02,5.759964990924085759e-01,-9.434466479262071381e-01,1.633173347370506789e-01,-1.004180362275570060e+00,-7.883350657369260217e-01,1.527171181710246906e+00,-2.128073455747090947e-01,-3.085015310738454253e-01,1.606144378473065348e+00,8.520445176580514479e-01,-1.142690932558627415e+00,4.571859133496694039e-01,-4.745155759788723948e-01,9.595393514700334414e-01,-6.483990291371208858e-01,8.201541823810775123e-01,-8.699362312068434910e-01,8.968918481151053612e-01,1.531492868822648679e-01,-3.462397437440662973e-01,-6.132572083001504026e-01
8.218461721018381905e-01,1.497832702530060622e+00,-1.960968242436567643e-01,-5.759422374112943555e-01,4.374439032132786953e-01,2.747106652973213547e-02,8.780471523867066086e-01,-3.855597290340813665e-01,-7.436649945158742003e-01,-3.070156315969131411e-01,4.785181119805590466e-01,-8.915798505066047097e-02,-3.121539934103829683e-01,6.557281128105422185e-01,-3.895921963595887494e-01,1.256517994462139853e+00,-4.348709047882864942e-02,-7.911595427901051414e-01,6.372981991871748408e-02,-1.865315840243741974e-01,-3.448317941921397178e-01,-4.121324622396301818e-01,-9.640271709134602407e-01,4.648717297667350756e-01,1.599133130457343732e+00,5.752484470378346204e-01,2.122135366581736071e-01,-5.333945217627308333e-01,-8.716994542721616668e-01,-1.124045136296523140e+00,3.223667205674938807e-01,1.710140812998552029e+00,-4.511376079957390983e-02,1.815587042778898930e-01,-9.032812201375637340e-01,-8.397385461169799559e-01,1.416447045074940014e+00,7.155362180733914057e-01,1.722596923061092022e+00,-1.437738787922022698e-01,2.070561035588046606e-01,1.693854155179414511e-01,-5.046385844254545061e-01,2.920038810688405095e-01,4.410691295168203685e-01,1.216381792967501596e+00,1.867617578306109527e+00,1.178880481279192260e-01,1.331089970798477184e-01,1.046750899283472203e+00,3.810230789842005805e+00,1.403496640316512778e+00,-1.108560054228510117e-01,-4.354559447434941943e-01,1.990630325370782439e-01,9.705809021268487768e-01,-3.695204782320564707e-01,2.319676475120826253e-01,-9.014805931009366446e-01,8.064108276192150093e-02,1.532265209914595305e-01,-3.270472018418213445e-01,2.081922121031752615e-01,8.755107057410327354e-02,8.119909487059716602e-01,7.721684213541463171e-02,-9.283087585529226082e-01,-6.543340185469592729e-02,-4.680175875120646811e-01,1.461903836203920282e+00,1.812418139859403032e+00,-4.389976714759885046e-01,-2.901782452404926826e-01,7.862217744717311385e-01,-2.363249281417665881e-01,1.186293125122958703e+00,-6.262276488313476275e-01,2.217470163706423691e-01,-5.607633444020643232e-01,-7.326756416718200882e-01,8.273512889000218529e-01,-4.932638608102197231e-01,-4.249324986369951151e-02,1.529390290796075913e+00,5.701174953155634384e-01,-8.256086549725414336e-01,6.474158843393469365e-01,-5.376457541024559639e-02,6.844537761701290357e-01,2.715248593130554222e-01,6.467321406821858742e-01,-1.065789253902899469e+00,6.891015494973129485e-01,1.995675040915342313e-01,2.368519438203147698e-01,-2.430011370777116486e-01
7.025069759601383357e-01,7.632759839427873949e-01,3.924876032502808143e-01,-6.332213729225976140e-01,1.456371695142027467e-01,-3.348947219234710282e-02,2.682865261954781033e-02,-3.272153683157046355e-01,7.253172811522847763e-01,3.840679872506531645e-01,3.788503237317431549e-01,7.250496417892619838e-02,-4.828406000223457450e-01,-4.364031038058739653e-02,-1.343963046185587817e-01,1.389549766992770330e+00,-6.697938898906143912e-01,3.402034018412571359e-01,9.634086239160272180e-02,2.832698028247865873e-01,-9.468411750097063262e-01,9.355643882856001792e-02,-4.195287343036246952e-01,2.696747010106285147e-01,1.493794548876512973e+00,-1.541039640839461933e-01,5.036408195687438472e-01,-6.636226296547941272e-01,-6.162494192054686071e-01,-7.606915186173555110e-01,2.228698871689838157e-01,2.581594711898214101e+00,-4.218835938586783518e-01,-2.218214738970959443e-01,-5.179545309286212040e-01,-5.306529291836443729e-01,1.102573178720837266e+00,1.287188070331093837e+00,1.694191826956102265e+00,1.511289590019595952e+00,4.761120568411326137e-01,3.993052838639965518e-01,9.834616147002302189e-02,-1.141079186581211574e-01,6.525080785741868006e-01,8.289951367208011623e-01,2.666429610394834615e+00,-3.706290024869449140e-01,-8.663883721226058043e-02,1.286220051725701197e+00,3.252475496140195155e+00,1.209049399729619445e+00,2.295985112354193003e-02,-4.282201062565173522e-01,-7.251247466129473462e-01,1.647173789531482857e+00,5.722019130727622471e-01,3.270102945866562583e-02,-3.679763543637035172e-01,1.042178106890593314e+00,9.911705179178827985e-01,-7.465432662358358062e-02,-9.902152257316206019e-02,1.281596289477241246e+00,1.112386342496376690e+00,2.769129714092517514e-01,-5.255489468107672479e-01,9.815561455822973125e-01,2.308046211017080740e-01,5.546281211272807710e-02,2.100316904031654719e+00,-6.271963106490621165e-01,3.418463587346770027e-01,4.041367816072091168e-01,-3.902420443443556097e-01,1.336830218496983580e+00,2.652149657677921324e-02,7.036169253537734036e-01,-8.302691907304202701e-01,-1.794624428835214502e-01,3.572892170062025308e-02,4.298441625225607465e-03,-4.034650596806038658e-02,1.594573319153802071e+00,7.020564255159341682e-01,-9.191970153686583878e-01,4.601174090841448905e-01,1.505443476376816081e+00,4.734958883335167457e-01,4.292494228205717133e-01,1.597009369791227762e+00,-6.244567740702200442e-01,7.047256799666454796e-01,2.796739814483884534e-01,7.691407711667939129e-01,8.811233505979843006e-03
8.864005058829784733e-01,1.231936190242867823e+00,-3.161350820293990505e-01,-5.891553162482610073e-01,7.898898657149693026e-02,3.455856881089083843e-02,3.441135605886885829e-02,1.624936729249752687e-02,1.097045579070822230e-01,3.021901825248652917e-01,1.266285702134195557e+00,3.363488881728707303e-01,-2.346813114770024133e-01,4.746344317998334450e-01,-5.693259911549761743e-01,2.298644046610771596e+00,3.532593612653296966e-01,-2.875228054661037591e-01,6.185411423302767525e-02,-8.952579681589911687e-02,-3.650607176413409038e-01,3.542364045760566515e-01,-5.667571850636310415e-01,3.246475166577298954e-01,1.492902293299244398e+00,-4.152449517085785025e-01,2.770889607387640452e-01,-4.821360774982276221e-01,9.214920719244457104e-03,-7.888299066047874675e-01,2.271200836355686259e-01,1.846891847394689812e+00,-2.585024629971560128e-01,-1.828419596569233474e-01,-6.542382456674853408e-01,-9.580541495371888150e-01,1.134674404515932933e+00,1.164910934215294347e+00,1.856399922035212091e+00,1.169173951203132056e+00,4.604002375537206149e-01,-9.869017404558150242e-02,-6.968069059450023028e-02,2.739760666929660915e-01,-4.707765405072994458e-02,8.263613226210517748e-01,2.530142120417380180e+00,-2.475739954058781556e-01,-6.306106388503270044e-02,1.526526165292336312e+00,3.911146997538009984e+00,1.104951402326764365e+00,4.016202196763692389e-01,-6.888742505047364961e-01,-5.554504913422033674e-01,1.517845552695501699e+00,7.512269778156561717e-01,2.603847913070801434e-01,-9.668585728823551051e-01,1.224908779959334115e+00,8.108566773647098991e-01,-1.553465043126927569e-01,-9.990807261230860714e-02,9.858281980319854032e-01,4.634445887237816919e-01,-5.100703300094023840e-01,-8.322339008322241494e-01,9.440670856171284875e-03,7.656602042435822764e-02,5.166520734436892415e-01,2.625200530612395333e+00,-3.799752858009889378e-01,8.232941854655483060e-02,7.793883478234240325e-01,-4.408594339854481348e-01,1.535036464975935155e+00,-1.406748693501645164e-01,1.333154169589768845e+00,-4.017729654193680222e-01,-3.708329481836522001e-01,7.984230578468068940e-01,3.854289063152305239e-01,1.379831794050474514e-01,1.055939563439961093e+00,1.180418340377435538e+00,-9.136350640384681698e-01,3.605720254047687923e-01,1.046298057549847504e+00,3.422477807096815372e-01,3.543030736556412319e-01,1.636995311235606154e+00,-6.130864717379478357e-01,5.828647095487746732e-01,-6.312465378380482939e-02,1.527846092588479365e+00,-9.926662898670490787e-02
7.862717722850008917e-01,9.618829603393863614e-02,-5.787648414186569168e-01,-2.748569268409417621e-02,-3.120090622425241156e-01,9.020687718439692748e-01,9.087993780783725217e-01,6.100197550861466422e-02,2.739607867876105440e-01,4.900800584858291398e-01,1.343230661590538277e+00,-5.337657753962543605e-02,-2.898053783816795237e-01,1.882381330696735189e-01,-5.624799539360372247e-01,2.113235420438486667e+00,-1.094110996845413519e-01,-7.318610857737798403e-01,2.880476130290934855e-01,1.476570982315722480e-02,-4.815333104075759652e-01,6.357072672789521040e-01,-4.068321365865225636e-01,3.302172534379410607e-01,1.429037775363003249e+00,-7.928557324877100188e-01,1.863247988219932094e-02,-6.537914716145586391e-01,-3.216369045513476355e-01,-7.553696005730889951e-01,6.348192987192298187e-01,2.286306731527985470e+00,1.884182193128060012e-01,1.414539181477239005e-01,-5.978407922156946386e-01,-9.987408237255646082e-01,1.300405397299492005e+00,9.373619129956306528e-01,1.980287824265159369e+00,1.263760403820373135e+00,9.751281526186013071e-01,1.959375277471844812e-01,-1.398059644065292595e-01,3.262151778602663255e-01,-1.461133461671759726e-03,7.003716799179644514e-01,2.163885532481014451e+00,-4.650512213227363245e-02,4.311536888344611462e-01,2.127931703961954968e-01,4.867930754606173416e+00,1.990673926645879499e+00,7.430685642400278734e-01,-7.245522627946106020e-01,-6.847434065331134967e-01,1.568170603233508764e+00,6.085615492225779910e-01,-1.792470373349216994e-01,-5.857165862297410985e-01,2.280975161240617055e+00,7.648277638299419978e-01,-1.081802444075590675e+00,-6.618524852009687320e-01,2.194856380381187688e-01,1.811279030951010727e-01,-5.985471030599857079e-01,-8.484439657655822309e-01,7.259703850898955313e-01,-5.857697176328584554e-01,4.591179633818844863e-01,2.920666468136605687e+00,1.246395260832366958e-01,3.017873882951923048e-01,9.661518093432635013e-01,2.820270347437682512e-02,1.284796436668713904e+00,-4.804629615748149396e-01,7.816739574493734022e-01,-3.723915729836143607e-01,-9.449674852794156532e-01,6.488445797022110995e-01,4.871026483635914062e-01,-2.453947751001078759e-01,1.365981655635214675e+00,8.326379341264271705e-01,-1.225542241787060282e+00,-5.167050999029310088e-02,1.601079245959124542e+00,8.818978116100929521e-01,-7.003981898803500750e-01,1.864685778674700423e+00,8.333468914203068234e-02,6.896624880637789445e-01,3.277854809763303123e-01,6.676011931110792386e-01,-6.733089732828971830e-01
9.717117618478245955e-01,8.486234038472666441e-01,-5.858771327230918313e-01,-3.172482157999822472e-01,-4.467794173947600700e-01,8.349364661330480608e-01,7.032637654465645483e-01,3.602120749366248265e-01,1.175334810797442842e+00,1.925444581124963750e-01,5.588103967983407694e-01,5.298524961891569462e-02,-3.625475419493150442e-01,1.094474631416514354e-01,-5.676938267422244611e-01,1.821345748374714635e+00,-1.546634241198180382e-02,-7.010648078948414907e-01,-3.022065319421646246e-02,-6.196022869673015881e-02,-4.951403393026607702e-01,7.243255721232375599e-01,-5.532262185951559719e-01,1.312604023062100000e-01,1.626908811698453805e+00,-2.170757794180221134e-01,-2.617209633985151385e-01,-6.398024773636054041e-01,-1.092421192589913215e+00,-1.152862039078894618e+00,5.733396516673280319e-01,2.333047839466241946e+00,4.999459839869585531e-02,2.991871837048646343e-01,-8.347649223026092358e-01,-7.478531587829124749e-01,2.046429493928337173e+00,4.960173183596585655e-01,1.798910234369837990e+00,7.120427997416411969e-01,1.036376175226113805e+00,3.636714457930820821e-01,-4.551775850458843198e-04,4.084042798715497580e-01,2.085164792069482687e-01,7.566851572198314280e-01,2.362839635729620635e+00,4.606495789082176717e-01,4.843283105518279008e-01,-3.623907498062228782e-02,4.955844274193720977e+00,2.397829520369230583e+00,1.021582423971391318e+00,-3.674480850005898969e-01,-1.880021911009844837e-01,1.268760059689108655e+00,7.874532494498642787e-02,-4.266088344880792915e-01,-1.061919387150483507e+00,2.214183472936262387e+00,-1.852083722027577928e-01,-5.616883207771943276e-01,-2.521898655110758058e-01,-1.481577657254042890e-01,7.177863127018383471e-01,1.234980013721131975e-03,-5.657761126438086707e-01,6.799279642222516573e-01,-4.484265680557193434e-01,3.276257104527613984e-01,2.721428265403987190e+00,5.472781370840140713e-02,-1.356841742592680977e-01,2.199698978616414780e-01,3.568263244013057389e-01,5.190891259702310467e-01,-5.375046809267496339e-01,2.967204389775445206e-01,-1.095672573323586585e+00,-7.455372885592796983e-01,1.143222298913818769e+00,3.739985865455879299e-01,-5.349971636508662476e-01,1.550932855155636503e+00,8.250478227507177520e-01,-1.317948559784683837e+00,-6.278252561207275928e-02,1.027783018040050900e+00,1.161596029792249185e+00,-1.519275568318586567e+00,1.894645604766128866e+00,-1.603488663764962019e-01,1.242407647331988940e+00,3.736359398740080051e-01,-5.641544561945714964e-01,-7.994672314676465330e-01
9.247164822065573331e-01,1.429689693418211727e+00,1.344913623071467002e-01,-1.087923411686238184e+00,-2.540741694654217175e-01,-1.989972327233778260e-01,-9.002727094171758537e-01,3.019292766123311544e-01,1.937452811553442178e+00,5.800399767477302237e-01,5.823043727956547233e-01,6.565002667275345871e-01,-3.952299406719066988e-01,-1.605848321449317995e-01,-4.962925988807179722e-01,2.213698798513589416e+00,5.350960051090675185e-02,7.371858006729343771e-01,-2.929478160513422358e-01,1.288527294437284421e-01,-7.424667395737214459e-01,9.144781322770837440e-01,-2.677634672963261631e-01,-4.207844652480260961e-02,1.717368857918342151e+00,-3.700564433265663422e-01,3.009906084623209521e-01,-5.546457702589199235e-01,-6.155855845144853067e-01,-1.042281560804547702e+00,-3.873213937936798024e-02,2.535159880012770817e+00,-8.033761794947593682e-01,-2.967831407120765097e-01,-5.653978347033208340e-01,-4.567493202321086798e-01,1.569814618839542542e+00,1.226069152348228330e+00,1.899666688885511157e+00,2.036139916437293529e+00,5.808871322405816384e-01,1.871010561761062285e-01,5.375845919801806039e-01,-6.829725800722295792e-02,2.443576779941616928e-01,5.575208140269738433e-01,3.331418465170698173e+00,-2.457326958983389043e-01,-3.132084255230934700e-01,1.583140910463924467e+00,3.374408318446862509e+00,1.335598813457996137e+00,6.785430085865482575e-01,-3.461312499207800375e-01,-8.688033906852441479e-01,1.896363800810647815e+00,1.209145004849204064e+00,4.605567625605849758e-03,-1.121609357763762471e+00,2.057348523005235741e+00,4.679458626811481281e-01,6.438746914409164690e-01,1.930559518769238148e-01,1.785554784580869470e+00,1.328879357984499077e+00,2.678471359689078568e-01,-3.377465488539952432e-01,5.750303763012156733e-01,9.952406747923285835e-01,-6.023213184582105750e-01,2.521128601537702352e+00,-5.967728631645490278e-01,1.925352012434649041e-01,-3.715491554846745981e-01,-3.718331997390857957e-01,8.738679390891936904e-01,2.259550291581576276e-01,1.467005629316252779e+00,-1.422277315522894714e+00,3.711337151647611243e-01,7.703390036213533243e-01,7.664080571762226235e-01,-9.861858718126889634e-02,1.329973723855337742e+00,1.495536979804720445e+00,-1.176785333188677729e+00,2.755086670848540531e-01,1.545346088773615678e+00,3.420870366343007341e-01,-1.171688928087458170e-01,2.363531506368434787e+00,-4.936835391774074822e-01,9.370457537596682540e-01,-6.594696783956277564e-02,1.081292064003863018e+00,-2.158531522930995372e-03
6.892270832037131756e-01,7.498454615215999208e-01,-3.235740805008866516e-01,-7.461132684027247386e-01,-9.251200198036030331e-02,3.784705299103785503e-01,7.987668971341180812e-01,-1.768613364547116373e-01,-1.454788982094823435e-02,1.711789816632494632e-01,8.414641204706436728e-01,8.167112473049653598e-02,-2.894857642971326861e-01,9.835401455112872948e-02,-7.244140623409955904e-01,1.626963531732086965e+00,-1.274715829798648281e-01,-3.759103109120615627e-01,-9.577898581685759249e-02,-1.897947917258527573e-01,-3.138901091281360300e-01,4.951675254766295664e-01,-5.779015461386117769e-01,2.110478334911286558e-01,1.898257456168727098e+00,1.588607539651417655e-01,1.396363892592462630e-01,-6.420631062907916631e-01,-1.366594143053706079e+00,-1.503500008475125993e+00,2.195575505576096709e-01,2.268172958037448339e+00,-2.318484319909120683e-01,4.349174633901941034e-01,-7.381212770098195541e-01,-6.679748123433345564e-01,1.628624303381693617e+00,7.274800188994404726e-01,2.448528000291450013e+00,8.552177710889893314e-01,4.178327035080438012e-01,3.058050625512478415e-01,-1.820203245966212635e-01,-2.226990700739930884e-02,2.457279192237065701e-01,8.414692966735729529e-01,2.054942492033815959e+00,-1.492985512422138200e-02,8.963386828642580517e-02,3.548455867966290866e-01,4.041588342867605377e+00,2.164195465023455167e+00,2.649108774716784076e-01,-4.027485088344545661e-01,-3.706993215667231945e-01,1.621689138636204675e+00,5.438346234873759899e-01,8.539488322420860089e-02,-1.012050525267415235e+00,2.001891628308875681e+00,-1.233945331717142546e-01,-4.528111464884296278e-01,1.262587198498429097e-01,5.027717746693594059e-01,1.097363690879943787e+00,2.513964619927407940e-01,-9.265727750820063058e-01,2.301781299587672969e-01,7.962661049808691938e-02,9.494366626028180045e-01,1.952341615992573276e+00,-7.894081212970854855e-02,8.349628026502228795e-02,1.145585095702189027e-01,-1.480911437719067414e-01,6.556883556142817371e-01,-8.462358144936359405e-01,6.700361428523484708e-01,-1.209204071754261145e+00,-5.245104557293038816e-01,1.046913897368880964e+00,2.630428966417772685e-01,-3.269744497205153699e-01,1.850075659834975905e+00,1.136516885078404204e+00,-1.469809430309349851e+00,3.425792631865324234e-01,4.659974925176246785e-01,8.070138996435610723e-01,-4.053570624060679473e-01,1.327257785122416323e+00,-2.937182495884755884e-01,4.819498898059281222e-01,1.724122487044829066e-01,4.187899728571262137e-01,-6.125731251257449106e-01
4.911742106600385238e-01,-1.535498502344726512e-01,1.413468795260774957e-03,-7.810636059414619581e-01,-3.795166274787986072e-01,5.246256055111711003e-01,5.508008422308148244e-01,-2.335978772690049110e-01,7.315034233517936357e-01,7.073237383006616419e-01,9.245354737117199573e-01,1.083647858404715586e-01,-3.843601346210161473e-01,-5.076287337639505681e-01,-6.767993373655056821e-01,1.655150948619875217e+00,-6.770671808992854146e-01,3.376584582167247994e-01,-6.980989158803577177e-02,7.989308238143988383e-02,-6.484696452295166669e-01,9.807185106426168364e-01,-1.495737115635502601e-01,6.614012106050093376e-02,1.955843760961551991e+00,-3.331795018947994458e-01,3.295452427823432062e-01,-7.890012609564887036e-01,-1.504918147016079732e+00,-1.460566598180838227e+00,1.565458539056003018e-01,2.997974276092759460e+00,-4.458264095152002504e-01,3.790623020263728105e-01,-4.432545051439130135e-01,-4.333866184655000842e-01,1.435333080105401171e+00,1.054510810835570522e+00,2.778714472004851110e+00,2.070681702931277179e+00,5.909726648981890040e-01,5.416069699134852256e-01,1.682068870302255159e-01,-4.256547612147418280e-01,3.664887131599814940e-01,5.323604837893507469e-01,2.377483411162107263e+00,-3.894744418096409699e-01,-1.675529813929231560e-02,9.435733894231634888e-02,3.771539575785296972e+00,2.390719303905176840e+00,3.060298084886919900e-01,-4.006507498428805158e-01,-1.096447481392019752e+00,2.247526320062963379e+00,1.343593724912118592e+00,-4.948135163241769441e-02,-6.073669481622866462e-01,3.166751140805932785e+00,2.958970419989636058e-01,-5.444126146747306771e-01,-1.118394769031652303e-01,1.239780030132006328e+00,1.372798466864267652e+00,4.679087633697851523e-01,-7.845656837294097130e-01,9.836212015206700077e-01,5.588366488840291746e-01,1.756546982493307762e-01,2.008831087426970363e+00,-1.972530645962866647e-02,6.381486160035093613e-01,-2.368462947936483542e-01,-2.204869328239553727e-01,5.886789307313785580e-01,-6.863271405237203471e-01,9.689867222310901695e-01,-1.536383516442365149e+00,-2.536712176756225623e-01,5.630007161595297349e-01,6.910266127417892257e-01,-4.390303759470634004e-01,2.128225525232338988e+00,1.306542718019413796e+00,-1.779563412438816661e+00,1.714678979764915623e-01,1.468400827098566452e+00,7.684352664033425873e-01,-4.508575161673395448e-01,1.921834039393220728e+00,2.644517980053333606e-01,2.867434263743812162e-01,2.721367729403207925e-01,7.578261930199639007e-01,-6.472872866323267083e-01
7.036967352088694394e-01,1.005152837676071442e+00,2.182049895550314811e-01,-1.073236355184230995e+00,-7.588754891240950817e-02,-8.894856939828238440e-02,-1.453835345175449878e-01,-1.357753855084077865e-01,1.008777940840467569e+00,4.036514825726263966e-01,4.561883784414038634e-01,3.357873298051909372e-01,-4.100101977688468402e-01,-2.085353231586974387e-01,-5.004871243813601156e-01,1.613715453007774192e+00,-3.618011176700633991e-01,5.238872323442699264e-01,-2.267460868845900257e-01,6.769823798952931404e-02,-6.881271546262566208e-01,5.912075039980821956e-01,-3.741066612820960202e-01,6.433721863738635360e-02,1.872609954471235572e+00,6.621570994844476477e-02,3.888482679553112442e-01,-6.474727031873935834e-01,-1.237168396799723125e+00,-1.340012222496813177e+00,-1.904711890825994125e-02,2.625019183794110145e+00,-6.803329194492853116e-01,5.091200645143958980e-02,-5.870021394906711487e-01,-3.874558526610312192e-01,1.513403982460303387e+00,1.083487043741389044e+00,2.240715427497435464e+00,1.628131139298725660e+00,3.590718344595320577e-01,3.835165477744710838e-01,2.328990490865827656e-01,-2.699308373150406948e-01,4.796385117049165592e-01,7.091722805623389414e-01,2.745545938134839936e+00,-2.782652770118322350e-01,-2.416902490956519545e-01,1.065485857498363664e+00,3.235125970676318463e+00,1.683876550215360091e+00,2.007049702315728268e-01,-2.835035323523204531e-01,-7.219733032039092890e-01,1.886644893505909248e+00,9.501967998517596437e-01,8.942964938797220986e-02,-8.995878468654875393e-01,1.906553267127514495e+00,2.377060006930608038e-01,2.425292908865698815e-01,2.799540686396830846e-01,1.460419058912556745e+00,1.545677817645676910e+00,5.917673705860597710e-01,-5.792877662348797640e-01,6.034441219545483293e-01,7.788848621880720691e-01,8.948774369126716310e-02,1.906837506576320784e+00,-4.859492218614817061e-01,2.565610303915746848e-01,-3.310544280560936414e-01,-3.717572106441763280e-01,7.203025359491486146e-01,-2.705923723892358357e-01,9.949388591479229049e-01,-1.518470149126236679e+00,1.023869553760323736e-01,6.551800421909894645e-01,3.911231653779527750e-01,-2.117821499748688552e-01,1.804126199509253015e+00,1.266958626744129734e+00,-1.344714470986845489e+00,4.396499370730436729e-01,1.041221981301542199e+00,5.077246714247720671e-01,2.848703530041191145e-02,1.751407506250515000e+00,-4.606184016909666279e-01,6.103010231074645908e-01,9.435850570689366390e-02,7.497040862707153863e-01,-1.916526808977014329e-01
6.276515794232467860e-01,8.922379993822271427e-02,1.794712447071106221e-02,-5.173549835692946575e-01,-2.099705764171482247e-01,3.647474473542762774e-01,1.855243631115689740e-01,-1.559186130656180780e-01,6.970578069172203017e-01,7.519144227711290762e-01,1.156356584932018317e+00,1.671670839825482591e-01,-3.690517765819595897e-01,-1.940058880248202167e-01,-4.719719187868073318e-01,1.996279838999133638e+00,-4.504929783301067636e-01,2.595124475225979999e-01,1.335370446251938348e-01,1.934285558996493848e-01,-7.412822383060394538e-01,7.258884640288103540e-01,-1.800725691477271240e-01,2.071920060837619260e-01,1.580284516625091173e+00,-7.412280430292742528e-01,4.162962410584888362e-01,-6.918640905757685866e-01,-4.689545484172221723e-01,-8.412631891971826814e-01,2.625745689237732883e-01,2.691948013832667908e+00,-3.444418318121190148e-01,-6.800255541935454340e-02,-3.915588549548728592e-01,-6.758648385071077680e-01,1.036174467324870951e+00,1.347525027190295877e+00,2.219399413592425319e+00,2.142415938677591836e+00,6.734211814072591507e-01,2.932618042478684628e-01,1.717856356973460619e-01,-1.565624507385391384e-01,2.297484563827474624e-01,5.743760105514179592e-01,2.612870660051911820e+00,-5.160830134034579686e-01,-2.796274143687065006e-02,8.379059665210151220e-01,3.774703453170973333e+00,1.621296302115459609e+00,3.628888647803293899e-01,-6.218595944049836177e-01,-1.160954524360446882e+00,2.061976784248654493e+00,1.285635880675547682e+00,2.296370083956131292e-02,-4.340262680552497976e-01,2.393795259033023370e+00,1.064590277139385810e+00,-4.920182346286569586e-01,-3.791903077543764544e-01,1.385163947974083154e+00,8.120757391255910562e-01,-1.209818060833252606e-01,-7.150201633476018781e-01,9.449246513492758348e-01,3.191333455551267906e-01,-5.871494928256060231e-02,2.505016449805520740e+00,-2.274107574331662440e-01,6.282453383332574637e-01,4.297125292396347662e-01,-3.718148431502638629e-01,1.307712398933321030e+00,-1.830057337682013952e-01,1.238595611920163098e+00,-8.044170323557168212e-01,-2.923440560784980602e-01,2.547454177369975481e-01,6.261575325472642506e-01,-1.130261380043215691e-01,1.563069031850911728e+00,1.131353870134848227e+00,-1.297256440336496341e+00,1.757129205139521533e-01,1.926951646245517402e+00,5.041561518150559085e-01,7.505385910474582367e-02,2.043634281349417492e+00,1.068686285246123191e-02,4.097271811675536890e-01,1.956664980937339315e-01,1.368485174462910958e+00,-2.965536090023199178e-01
1.007772385853697994e+00,1.314109105405621314e+00,-4.035112840564087366e-01,-4.765730357021096264e-01,-2.706115571838448308e-01,6.412976694320088322e-01,7.547867063590145698e-01,2.604577894918703174e-01,1.195029191863252738e+00,-1.244900205365382651e-01,-5.990566411432324267e-02,-2.833637636067036503e-02,-4.339075878620263782e-01,1.554943168943860865e-01,-4.306343813459799774e-01,1.310073363768518462e+00,-1.663674774794373645e-01,-7.134131876627524127e-01,-1.392015003623565950e-01,-7.555928823919830228e-02,-5.593653987111226744e-01,3.771449891155050915e-01,-7.448372769824098683e-01,1.256726929257614145e-01,1.700202491207586153e+00,3.618714878260279599e-01,-2.842063395933355219e-01,-6.403914410618992692e-01,-1.563849492205067637e+00,-1.334187726136165875e+00,5.275927842499967824e-01,2.296987066350978157e+00,-5.868509900694041104e-03,3.727726818287722121e-01,-9.778578840884677437e-01,-5.891069445845883434e-01,2.296276932402765425e+00,2.907241850772509517e-01,1.606670938062796150e+00,1.284585315219286539e-01,8.874360921223770626e-01,5.020368343577756853e-01,-7.614118769903918671e-02,4.008051052063366093e-01,5.157833828623831218e-01,9.348697888159380742e-01,2.291873351741193332e+00,6.750187324668939226e-01,4.797978423230606637e-01,-1.984538706851268763e-02,4.693846208626903937e+00,2.417001385241039024e+00,8.198525580007596236e-01,-1.519966368232675002e-01,2.145830684531508936e-01,9.825401151495445351e-01,-4.729984360444329239e-01,-4.586989156090693909e-01,-1.147576925500726430e+00,1.522329984711481954e+00,-5.940334664207715942e-01,-2.949599498248024476e-01,4.833248412840877861e-02,-3.857664489301119159e-01,1.084283595026176439e+00,4.527504358022639841e-01,-4.657001091790742842e-01,6.465625417713855017e-01,-4.850140625297586494e-01,5.453904425681987966e-01,2.301061718468835338e+00,-1.243996364492829243e-01,-3.972965715736123116e-01,-2.132194654134320078e-02,4.382400001604082052e-01,2.512973403364643366e-01,-5.987711978100445087e-01,-2.012259123322100995e-01,-1.362704507687528821e+00,-6.925100105743895451e-01,1.193483453890609614e+00,-4.063855518635861586e-02,-6.132133093602316620e-01,1.741108986157395400e+00,5.889359814979185925e-01,-1.219565711721970480e+00,1.183360115827394032e-01,4.833600617997546034e-01,1.265654801373857552e+00,-1.552328978516120950e+00,1.524318311074047694e+00,-5.326524648837400733e-01,1.451000131064851484e+00,4.518550261442503269e-01,-1.279101202039158558e+00,-7.431922129049801651e-01
5.760585016259645030e-01,1.076101253400130187e+00,-8.924371765776804855e-02,-9.802400968698888883e-01,3.479942333886221206e-01,-4.521528202744423686e-02,9.504643395908689563e-01,-6.000017315296864995e-01,-9.958644438194159676e-01,-1.174978112297482558e-01,6.915049003690473262e-01,-1.042753678795443895e-03,-2.737697066700987003e-01,3.010553930858639871e-01,-6.696738697307151877e-01,1.210005434711593830e+00,-2.135883561287246213e-01,-3.679643115070660997e-01,-1.124801846735209720e-01,-2.797116964609817069e-01,-2.235405655112409073e-01,-6.069501351548445278e-02,-7.934757479035389194e-01,3.460733840582868592e-01,1.987458089326398003e+00,7.211771110699750631e-01,3.797792983616395390e-01,-6.095680305172808122e-01,-1.541569997665665603e+00,-1.657741041884521316e+00,4.218138158267728532e-02,2.023045324025201541e+00,-3.328810349913026156e-01,4.787257399349054143e-01,-7.911473883868352930e-01,-6.341168675756149176e-01,1.405774841021811605e+00,7.707123496906794768e-01,2.539402142511488325e+00,3.752498217964378435e-01,-6.226164611382400960e-02,2.748802825244597292e-01,-4.410131817811360211e-01,-1.659234984696423276e-01,4.294218519539462209e-01,1.081479715665465413e+00,1.751628771034793530e+00,-1.646036418619732100e-01,-1.119623014707645386e-01,7.738006375475255938e-01,3.377636633272670164e+00,1.813905152103761687e+00,-3.711298067053868666e-01,-3.645835417862545724e-01,-1.372071906058514590e-01,1.506340134080602189e+00,3.078659681055487818e-01,4.210771079020414476e-01,-9.773997195905075319e-01,1.019924215824643543e+00,-1.560103289749706634e-01,-2.941359577278708781e-01,4.701877966484289129e-01,6.191254598216321403e-01,1.334609844272060419e+00,4.848689641823054064e-01,-1.121699345172516793e+00,-1.542659156899875983e-01,1.627839046945794010e-01,1.599958394082326318e+00,1.308213999822311457e+00,-3.154858649295835815e-01,-5.925810817079130155e-03,2.090954542420160600e-01,-4.331057562806489569e-01,8.110760239756088508e-01,-1.007943846566431434e+00,5.501217672519105317e-01,-1.143794331133179298e+00,-4.768112028521995227e-01,9.514757437254086625e-01,-2.002115233819592999e-01,-1.469773883436709672e-01,1.994398847922694396e+00,1.043765656387677376e+00,-1.323356677416142269e+00,7.376446614954133008e-01,-2.479646049708932320e-01,6.119533178981362287e-01,4.350406787035539513e-01,6.217323752811302340e-01,-7.413379802813729880e-01,1.672017732452596439e-01,9.685834750721791786e-02,6.681252820226795119e-01,-3.857235977963093254e-01
8.515680318319986952e-01,9.009797675379961346e-01,-3.382535869763067526e-01,-4.185756665516565111e-01,-1.149219758466351882e-01,5.452498452745199176e-01,8.123898612379749640e-01,-6.985972803917328555e-03,4.573287603292826020e-01,6.193652710685798590e-02,4.861315328897733989e-01,-4.752117647829107172e-02,-3.708343356048707795e-01,2.085252407630773797e-01,-4.644781738734480303e-01,1.497105685604860348e+00,-2.030126367624947581e-01,-6.237689563891070099e-01,2.462568622635393639e-02,-5.596829806814693914e-02,-5.115847777785348383e-01,2.949235942124717180e-01,-6.556207240240372602e-01,2.532095595355397522e-01,1.633853030640559645e+00,7.382832939514279158e-02,-2.347356120697965953e-02,-6.376453206913047511e-01,-1.105323132142074227e+00,-1.153520751414691903e+00,4.697474617328395441e-01,2.238360624021560330e+00,-1.133395102933082432e-02,2.721783562445382332e-01,-8.117169299555060391e-01,-7.248223585564392835e-01,1.752515993331638766e+00,6.280566204099322647e-01,1.836736738936237012e+00,5.308979667625350896e-01,7.138863230274308247e-01,3.646508429612920765e-01,-1.722290595453821460e-01,2.655240125817781571e-01,3.770105307553122120e-01,9.092304377314384123e-01,2.161911409334663858e+00,2.567470498937289292e-01,3.370898029251149230e-01,2.957064102743243161e-01,4.416144060505917679e+00,2.068728554550025134e+00,5.103647266818887029e-01,-3.786941823779045868e-01,-1.384038250430446038e-01,1.246965799492391502e+00,-1.694206521514929342e-02,-1.882125205211907237e-01,-8.784034175910155895e-01,1.507115461055885008e+00,1.128709218162607386e-02,-5.241013105258678362e-01,-1.033460964346528260e-01,3.633649900379665176e-02,8.407675009958770485e-01,1.267514099690002505e-01,-6.975343834556453348e-01,5.517324605183152597e-01,-4.065732982773683224e-01,7.075262326001761082e-01,2.287455491418163067e+00,-1.348039492401627293e-01,-9.269846276707245647e-02,3.907175590164500001e-01,1.119498209033164410e-01,7.601578544160131345e-01,-5.852390291720910298e-01,2.327600205938847866e-01,-9.504357707371975383e-01,-7.218229396826949529e-01,8.876363127899828953e-01,3.405786199587779173e-02,-3.727924563898816768e-01,1.652746016716853283e+00,6.962226322788881427e-01,-1.179588886324028918e+00,2.143828101066583280e-01,7.296470381685160600e-01,9.878236909495179408e-01,-7.899699114695112323e-01,1.424506351672593540e+00,-4.346294390758077553e-01,9.670953771239250152e-01,3.541021582298435888e-01,-2.604216989985514985e-01,-5.943019583347453061e-01
8.732123314355151322e-01,1.441825101987786351e+00,-5.268080372944428102e-02,-8.607715268078584003e-01,-7.222007371794236796e-02,2.284299137990885298e-01,5.126000455426573676e-01,-1.009417518832608079e-02,9.871879083221424267e-01,-1.279445324895778502e-01,-2.123794721584209566e-01,5.469133484972442394e-02,-4.564307211055893543e-01,2.550831759594657938e-02,-4.207273849554643563e-01,1.073423060789314709e+00,-3.491983581585695329e-01,-2.380691616607617522e-01,-2.621563933287457959e-01,-6.366433394226461706e-02,-6.042859177092541056e-01,2.514870926726169298e-01,-7.253943358509965522e-01,9.727676443966630504e-02,1.875339166796936130e+00,6.767226782384510031e-01,-1.806585642532010372e-02,-6.512814370968658118e-01,-1.851043307627388224e+00,-1.546985927924316329e+00,2.515702514606579232e-01,2.407377247012171928e+00,-3.220509650114742328e-01,3.626093052507525227e-01,-9.159151551539214120e-01,-3.958506095062922503e-01,2.149452287513547333e+00,4.529291109431546336e-01,1.860012464199470639e+00,3.318411326463331923e-01,5.269632038797826823e-01,5.520692616743709813e-01,-3.495143058644842315e-02,8.082035918644314698e-02,6.916948453217942605e-01,9.641532684789264618e-01,2.348700146161459834e+00,4.137026569904149742e-01,1.720588883299177807e-01,3.539658483395572430e-01,3.914472416657189591e+00,2.212902155150156869e+00,3.857288224855275338e-01,-5.937945251391130164e-02,9.936639809052155714e-02,1.200171772348785026e+00,-2.195957321406847296e-01,-2.225071009716584336e-01,-1.125957774790245169e+00,1.310438696902627820e+00,-6.048011117335926334e-01,5.829737818849778375e-02,3.787850786027954220e-01,1.982680066478513248e-01,1.557159578498580998e+00,8.451562480100652808e-01,-5.037602918238279770e-01,5.490076168458887240e-01,3.223875978772372530e-02,6.155300308958708833e-01,1.776920188351913010e+00,-3.504062310397582092e-01,-2.900674903238328883e-01,-3.465399040788439411e-01,1.479424546743390301e-01,2.113145157351176140e-01,-6.079393397345193018e-01,-3.683305942760073393e-02,-1.654982729701793609e+00,-3.492843507774547884e-01,1.057287225819492749e+00,-1.305275357020074800e-01,-5.198456399290461993e-01,1.961670444406412583e+00,7.551373991636524119e-01,-1.274024270588459240e+00,3.871033608410372473e-01,2.459062151526223428e-01,1.036290128432247881e+00,-9.213986411972876489e-01,1.307687060776334231e+00,-7.139816956949744942e-01,1.163238887933204069e+00,3.485710346490641376e-01,-8.995688769148482145e-01,-5.266779616283490117e-01
5.807170502157082970e-01,3.118887302168218412e-01,4.265226408532172275e-01,-5.813837146561933178e-01,1.284669099147481286e-01,2.394096741973242293e-02,1.002144914245925444e-01,-4.565456508935805124e-01,4.693174869649398562e-01,5.838845835062044243e-01,7.096504740029301317e-01,4.832113479383245980e-02,-4.601814028220411190e-01,-1.412068295632011306e-01,-1.779939222172701174e-01,1.502550391282846842e+00,-7.839110615900481971e-01,4.539290632898219657e-01,1.870716049500380229e-01,3.237121481653529864e-01,-9.561020020185999613e-01,1.914929962540161679e-01,-2.897044020468112491e-01,3.025478303787605960e-01,1.488914701506367511e+00,-4.075807207198285931e-01,6.336805460424865810e-01,-6.985388965789492977e-01,-4.648333178920605047e-01,-6.983109938682907636e-01,2.066951912800573943e-01,2.698676670967286473e+00,-4.273770400584866458e-01,-2.287608567728905418e-01,-3.858495155138010335e-01,-5.673969803654302924e-01,8.302082105964522230e-01,1.476302783162811938e+00,1.923824899763337148e+00,1.922355113352753220e+00,4.529142010862143297e-01,3.840748570476243962e-01,9.914224431709985075e-02,-2.485969128950492046e-01,5.790543848233279389e-01,7.471720465059963345e-01,2.609816404398783263e+00,-6.217498441148524568e-01,-1.389727877205992335e-01,1.265640178731878507e+00,3.169612411904984661e+00,1.183051741133008594e+00,-8.410594313878816397e-02,-5.457431740434717238e-01,-1.033798032504394060e+00,1.904196747391316391e+00,9.520220113842818854e-01,1.194565281317712391e-01,-1.707747629654638999e-01,1.385057750242264518e+00,1.314546333081462626e+00,-2.856807315720565343e-01,-2.458204537994607974e-01,1.547604856414988905e+00,1.017933392847274021e+00,1.390132736886254550e-01,-6.390059483556154163e-01,1.076613361829102056e+00,3.144397670920714427e-01,3.081530959340433862e-02,2.123354592995492673e+00,-5.573706380495870860e-01,6.013914367954497076e-01,5.419609912542273644e-01,-5.267288589914632668e-01,1.529920490349651718e+00,-3.141419252588539823e-03,9.532170458483253395e-01,-7.010955345371618908e-01,-1.962575032279680332e-01,-1.599583042545683620e-01,1.523240613002746491e-01,2.134203603024165119e-02,1.630538050203587108e+00,7.972340162987732182e-01,-1.008718275099498962e+00,4.407016515396253720e-01,1.803268338031998264e+00,3.758607316784242647e-01,6.911971699214956022e-01,1.666936579373726302e+00,-4.034489518520276707e-01,4.175405676809793576e-01,2.646162189007630339e-01,1.285114174378800822e+00,6.999392782180036132e-03
6.181046544732937686e-01,6.162900514511712169e-01,1.752772320582119403e-01,-8.537161354238140820e-01,-6.109103257317806401e-02,1.992095485637246921e-01,4.650876094943244832e-01,-3.068654769136170968e-01,6.301380416927636618e-01,2.966807927162790626e-01,3.225535305479199089e-01,4.787918915507150680e-02,-4.432059737922270926e-01,-2.330067451444893245e-01,-4.421911749845250372e-01,1.231482400700335544e+00,-6.642851490839873918e-01,2.051082849151696363e-01,-1.119452284825183941e-01,7.499333388141071755e-02,-7.123024149929494397e-01,4.106174886972998594e-01,-4.376740926258412268e-01,1.406612344788535363e-01,1.869697785665882295e+00,2.119873858702867320e-01,3.237093783492066557e-01,-7.242195739988580572e-01,-1.557928256887042506e+00,-1.402584925920865810e+00,1.497315146543771736e-01,2.717620142021432095e+00,-4.462421724354664887e-01,2.686535653873738383e-01,-6.209688280087076739e-01,-3.914745387806656263e-01,1.562017430272454988e+00,9.141956463116134302e-01,2.277471298925302534e+00,1.285750762143545334e+00,4.236891448795144788e-01,5.503562063296177920e-01,3.903202194146214443e-02,-2.663242436032490223e-01,6.332973474847900519e-01,7.939965101908731393e-01,2.363518637523617461e+00,-1.609881559446324495e-01,-2.454124280319079643e-02,4.993420891731058520e-01,3.492481631393641983e+00,2.028543867108800747e+00,8.954324984852657376e-02,-2.556106807046507057e-01,-5.755723776126633329e-01,1.764004180204714167e+00,6.001371055732866999e-01,-2.437399176330924677e-02,-6.900751336372358269e-01,1.879792291721451569e+00,1.175133080461270157e-01,-1.914509349508682345e-01,1.533019488569601352e-01,9.576240659795105525e-01,1.509669120615094062e+00,6.907442253429456613e-01,-6.628737526105646927e-01,8.114627460663630387e-01,3.661213422037169485e-01,4.247871430899344269e-01,1.737458400180353468e+00,-3.289462391741511671e-01,2.636068283835610315e-01,-1.747159082865696045e-01,-1.975041996210282758e-01,6.161141450092793015e-01,-5.521223402964807736e-01,5.030176683935911885e-01,-1.474583683732092254e+00,-2.344160044283158384e-01,5.532351229771809153e-01,1.399510968901637176e-01,-3.610614947511028294e-01,2.053005826416242297e+00,9.528871453096982025e-01,-1.413176611678084615e+00,4.089156933013678996e-01,9.106875081627138213e-01,7.623393502676125699e-01,-2.267622951640184681e-01,1.474219334424440309e+00,-3.514156357014150966e-01,5.937157354987732116e-01,3.038159880474109453e-01,2.010462272944816553e-01,-4.148408276496119984e-01
9.239444604824657015e-01,1.125501303821442534e+00,-2.312698909425120464e-01,-7.822025392756061235e-01,-4.657256151065432559e-01,5.428042500802894299e-01,3.526818314558821110e-01,3.179910882985673704e-01,1.786546968119992362e+00,1.566833727552504052e-01,-3.219688783098906271e-02,1.723231764501974572e-01,-4.559321093877778397e-01,-2.180619029252136021e-01,-5.429186966812308279e-01,1.446254902630697892e+00,-2.761937085395258507e-01,-1.314124190088896416e-01,-3.058500130505428238e-01,-1.856978710358005852e-02,-6.407738480478929466e-01,8.165685787758204528e-01,-5.068726256784049644e-01,-5.250372314148563091e-02,1.896258949540362782e+00,2.402907782771389888e-01,-1.845483939157989972e-01,-6.872250156183117298e-01,-1.845491751204288988e+00,-1.547774762290402339e+00,3.202405545549614763e-01,2.667368827308413515e+00,-3.230001769621839713e-01,3.833544157335707636e-01,-8.507198063117877851e-01,-3.767002706839903126e-01,2.347162619714667997e+00,4.301152212508005945e-01,1.970068592885937830e+00,8.603077481996657117e-01,8.609573142586792738e-01,5.861057423443269965e-01,2.109669644302510916e-01,1.016721239869584487e-01,5.182749990071952029e-01,7.275125771093979843e-01,2.605678622012197909e+00,4.777630012579298091e-01,2.684852205160218053e-01,-1.880589588183367855e-02,4.360553722205606775e+00,2.582811774330187937e+00,8.762760180088343676e-01,-7.249565771539395742e-02,-1.703311682605511135e-01,1.421300730397729861e+00,1.515336915931984885e-01,-4.521218784487297526e-01,-1.208726491253642177e+00,2.351472658445997510e+00,-6.657536189275636840e-01,-2.303455459229980518e-02,1.720451942031673565e-01,2.493742537418103811e-01,1.486159433197290713e+00,7.397556226328574347e-01,-3.780302572492917346e-01,8.170762861572349323e-01,1.414723440569411461e-01,8.429883014256689400e-02,2.212827146520112365e+00,-1.338532529311899366e-01,-1.641127241404286008e-01,-5.831107634628530656e-01,3.336800567208274004e-01,-1.274076104287769073e-02,-5.449462784006996463e-01,1.749053709845224125e-01,-1.858870896143428597e+00,-3.026298578293033503e-01,1.196940072330750837e+00,3.461528292303865384e-01,-6.871401535677823524e-01,1.926956612161334181e+00,9.736032961916344375e-01,-1.509085700723125756e+00,7.913495920316476751e-02,7.851923292248621511e-01,1.167554324645355690e+00,-1.585452476346994155e+00,1.912261225608170134e+00,-2.787870821328480853e-01,1.316413866925184584e+00,3.677136334100944426e-01,-9.830297978788955504e-01,-7.370925264925529685e-01
6.732867914260606268e-01,1.008405778519390950e+00,5.000210437495885563e-01,-9.645299969772502813e-01,1.128073581827414712e-01,-1.269074824811522451e-01,6.527740401967918604e-02,-3.534745011949222415e-01,9.605934256394577098e-01,2.175609338314192232e-01,-9.958929393539567299e-02,9.083955636206776652e-02,-5.274967627419846483e-01,-2.244743761520500147e-01,-2.026156959148294467e-01,1.012225808888429057e+00,-8.022321623966308657e-01,5.009702273994525168e-01,-1.408241808664149330e-01,2.078751560668852805e-01,-9.281282853983690018e-01,1.410455266828983256e-01,-4.803752125522071648e-01,1.396141172017631993e-01,1.775349611124124261e+00,3.782477668835763640e-01,4.442036411937223539e-01,-7.023107414138400895e-01,-1.449944116379437986e+00,-1.237367975975432355e+00,7.742097805919340159e-02,2.743629566100646233e+00,-5.998663022771403286e-01,2.948330136661188317e-02,-6.225385199484881893e-01,-2.749469442275470632e-01,1.508466398549230592e+00,1.031774417173090930e+00,1.915092577845812105e+00,1.261669310764696128e+00,3.386385407716784868e-01,5.897771409249173979e-01,1.362432075035460988e-01,-2.867887072107830893e-01,8.679620433056106643e-01,8.662279783841075886e-01,2.628195061796398502e+00,-1.912402342965185964e-01,-1.474522787313256589e-01,9.934436411318847693e-01,3.033895982440983907e+00,1.614104585221358912e+00,-6.099295903723367385e-02,-1.642809082818171007e-01,-5.046170571438707286e-01,1.642474660790083751e+00,4.089655489574557379e-01,-1.546828804202778074e-02,-6.043023161181551028e-01,1.182691066160588944e+00,2.930699078522928103e-01,2.013379429579164048e-01,2.809916950626963894e-01,1.217031029016974575e+00,1.700398658885827086e+00,8.882688234813894690e-01,-4.643758798018327583e-01,9.429016259868157057e-01,5.056760215735969233e-01,1.758100389545516895e-01,1.620307638465138034e+00,-6.471652621836548880e-01,1.925596236446425746e-01,-2.364785537032737250e-01,-2.872534876019414152e-01,7.369142834501248851e-01,-2.222163502793456646e-01,4.032134801134179547e-01,-1.487083115950980972e+00,-3.236666857446668377e-03,3.010092004067810301e-01,-9.302476997703346129e-02,-2.568437163677426138e-01,1.980290184297822886e+00,7.838526324873974493e-01,-1.153033324786651992e+00,5.557728933468851773e-01,9.713585011175365214e-01,6.291863861902033950e-01,1.108657691851286375e-01,1.434062030839164503e+00,-7.014727829459186381e-01,7.803427165722246484e-01,3.092599294679913013e-01,1.128747738953638641e-01,-1.152878745694326246e-01
6.878303625376676056e-01,9.072778207352074631e-01,-9.447683138677887005e-02,-7.419446861594011233e-01,6.444975384319105716e-02,2.817826216167846343e-01,8.877581384082715577e-01,-3.198626948834185635e-01,1.327443644835468728e-02,-1.753707620397790268e-02,3.345496431052658037e-01,-6.658120240731946193e-02,-3.805143478606694551e-01,9.548796297441806968e-02,-5.075489296200084155e-01,1.147130718895512214e+00,-4.198497923221597428e-01,-3.603433243471542702e-01,-8.436261032733430310e-02,-1.050551000889333730e-01,-4.816293458108616976e-01,1.456335576076057126e-01,-6.866893816465939882e-01,2.458215913332246760e-01,1.860128678085945175e+00,4.949834759445599919e-01,1.708617890202499545e-01,-6.712576582827312066e-01,-1.607587783230463696e+00,-1.486600106143915134e+00,2.527802035218828514e-01,2.332769549607182746e+00,-2.192235240451068101e-01,4.244592355982411136e-01,-7.954186305198046592e-01,-5.505105116272007715e-01,1.696045542025307329e+00,6.522107464620697792e-01,2.192560734102341868e+00,5.067987778229057216e-01,3.643349560241243013e-01,4.612763228161040341e-01,-2.403868616525627333e-01,-3.719819540676266856e-02,5.589588907936239304e-01,9.763968261353193068e-01,2.001105618297990496e+00,8.973729616116496444e-02,1.295224026808949325e-01,3.541362143932610951e-01,3.826812443713973888e+00,2.105834684532663204e+00,6.396660625630223862e-02,-2.695163412912297551e-01,-1.421779910798222080e-01,1.406513190990653861e+00,9.149783758903939912e-02,1.559713633068336713e-02,-8.708124598645391456e-01,1.383910479086264633e+00,-1.952987387489293625e-01,-3.669047916752070093e-01,2.187109664055524871e-01,3.316377900006179935e-01,1.301971447000253690e+00,5.558136559082753614e-01,-8.162572784527192260e-01,4.228146899817526450e-01,-6.014221823779069415e-02,1.022277443986461254e+00,1.677052300370133420e+00,-2.390728825893335130e-01,-2.629145975591197504e-02,8.374859009012640410e-02,-8.392631956237470159e-02,5.929771639408030204e-01,-8.079033779922848435e-01,2.078668928911608926e-01,-1.276247015596501999e+00,-5.436057454701277436e-01,8.505469648131807059e-01,-1.230281347184765672e-01,-3.686534405533430370e-01,1.993798290794360106e+00,8.012700799530194651e-01,-1.323404811220271204e+00,4.622340454987975411e-01,2.934953263434499915e-01,8.929208525802668772e-01,-3.553775032143068335e-01,1.062891831857060154e+00,-5.475126241390108062e-01,6.504858269960565043e-01,3.112129253171708743e-01,-1.344416820785341860e-01,-5.344709720186575641e-01
8.514746203974863370e-01,1.630392621959001032e+00,1.040004744964886790e-01,-9.332925545484940244e-01,1.005364479442780040e-01,8.554987862788474007e-02,6.075172745759511717e-01,-1.693207678725572873e-01,7.886825677415926217e-01,-3.122003809940266938e-01,-5.342452357800311358e-01,-3.685475661931805758e-02,-4.981828533642905787e-01,6.874512161790466425e-02,-3.127632539792387645e-01,7.163668501697961766e-01,-5.057202971678937953e-01,-2.421903928937410855e-01,-2.810593973755030617e-01,-5.739824707603444903e-02,-6.534641172694789502e-01,-4.475161617793099733e-02,-8.424567544479081294e-01,1.357703333347070329e-01,1.899632125577769948e+00,1.020923632570465811e+00,3.401781080316820804e-02,-6.584748561660372923e-01,-2.079565092982873953e+00,-1.617114429781817186e+00,2.219123858001743332e-01,2.380132118881526981e+00,-3.428169310776791323e-01,3.949911642347358476e-01,-9.739452193412110326e-01,-3.168714368582580265e-01,2.179781554026677615e+00,3.892700853860972532e-01,1.766873786164438354e+00,-1.566156823814113253e-03,3.846289811492092925e-01,6.323564737142179926e-01,-1.273456335804770134e-01,4.111741611977220295e-02,8.976108505724504916e-01,1.093061935782049243e+00,2.240264009661374622e+00,4.630641867086236485e-01,1.504984927235405445e-01,4.132373361235909259e-01,3.666865134795451731e+00,2.147678379315308916e+00,1.471494594207095052e-01,3.678779562787493074e-02,3.028912440022106800e-01,1.050969105539413917e+00,-5.307503093413503681e-01,-1.880552367636884603e-01,-1.082942623167208573e+00,7.866638169255550928e-01,-7.255394119989256874e-01,1.538669001318699325e-01,5.349432976457587641e-01,1.031609989617215950e-01,1.748674675021398617e+00,1.089674713953981744e+00,-4.918070618145699568e-01,5.365530914864461431e-01,-1.381878859261041065e-02,8.264542393005052112e-01,1.463332874798091598e+00,-4.772272780797193747e-01,-3.925828611419536762e-01,-3.868177375578579769e-01,1.339862760417200871e-01,1.589515879705908352e-01,-6.555727289860636686e-01,-3.272370665823641778e-01,-1.722607235331858444e+00,-3.462514238936271749e-01,9.822364358270209150e-01,-4.375605454598583965e-01,-5.210243967715948443e-01,2.090548036400592835e+00,5.730404101803427963e-01,-1.186322976147808461e+00,5.400002630654090474e-01,-6.805144091131065665e-02,1.056361444452065701e+00,-7.550534940614281876e-01,9.966960878545203517e-01,-9.514019327203494525e-01,1.191450541898825488e+00,4.019000339562131541e-01,-1.191801477186922753e+00,-4.560985636373456886e-01
6.272172526147395955e-01,7.680129822255483685e-01,2.124999871449673172e-01,-7.325558412565814637e-01,1.212824420268082543e-01,2.548106952625059929e-01,9.243256937458275146e-01,-4.713962355190896569e-01,2.632231286171976548e-01,-3.910303945167384332e-02,-1.280605117633631385e-01,-2.117319419308928974e-01,-4.971807668796781599e-01,-9.020803560453520553e-02,-2.846587421980077970e-01,6.890397186402581475e-01,-8.720633567304101330e-01,-1.512135584119966292e-01,-5.996437674041969063e-02,5.746801411992087660e-02,-7.432577525956485243e-01,-4.215525670834868732e-02,-6.632080467616384700e-01,2.372023707003553250e-01,1.838002192336036789e+00,6.655631828872546896e-01,2.480659720871289942e-01,-7.463745780687919273e-01,-1.888071182749252896e+00,-1.456565952953263521e+00,2.779257832038161125e-01,2.617846730194056448e+00,-2.567396560736117661e-01,4.065994020208406612e-01,-7.640563888415871086e-01,-3.707084917257321144e-01,1.710627669806778162e+00,6.677149115861429340e-01,2.043722841786637989e+00,5.252507470683046575e-01,3.778301038250378996e-01,6.870547485714117997e-01,-1.965753905824980108e-01,-1.659974175593406653e-01,8.964757513194214766e-01,1.013280249241603093e+00,2.033751499207165914e+00,8.859907482364220987e-02,1.509586478869611170e-01,2.425129751856435756e-01,3.569170480371135046e+00,2.139304541146508143e+00,-1.067371620347754568e-01,-1.413982834405237698e-01,-1.351135811960638144e-01,1.381066264171302738e+00,-1.172078874536720550e-01,-1.033479720755342834e-01,-6.081793212509881696e-01,1.154755070925315374e+00,-1.450379254564939380e-01,-3.350927284882415091e-01,2.234161941146907693e-01,3.585671506783962847e-01,1.570621454131796213e+00,9.088323178095895072e-01,-6.685677280238175868e-01,8.459285564516390021e-01,-7.435236849740350928e-02,8.655645852057149980e-01,1.437805210296924319e+00,-3.624528106007505190e-01,3.368470591953053039e-02,-4.289917187118849617e-02,-2.957312792622274200e-02,5.059275905497282455e-01,-7.331141520390660471e-01,-1.657869871019475028e-01,-1.434855392789004203e+00,-4.990504499559930141e-01,5.181597095523789998e-01,-3.677222525466201097e-01,-4.518727330425922339e-01,2.220223484933305347e+00,5.181808590758061328e-01,-1.280176401142476328e+00,5.161289404545085224e-01,4.330546464129483297e-01,9.795014527352390310e-01,-3.510065000874950103e-01,9.878155397258844284e-01,-6.116491500388238078e-01,7.608070957651928978e-01,4.843287270313135773e-01,-5.939141852660820842e-01,-4.849654669243995131e-01
8.985972313969823322e-01,1.390835914581959765e+00,-3.994334129905514619e-01,-7.023118465715948444e-01,-3.922905546767566087e-03,1.992235202701170826e-01,4.349750232515181558e-01,4.182013583313171079e-02,2.228849789464120157e-01,2.752438218758776478e-02,7.596582239970690598e-01,2.114105564883318467e-01,-2.746040734680462170e-01,3.885489776979252907e-01,-6.339362406699555752e-01,1.846045469510547044e+00,2.336182568987497654e-01,-5.084386348162668323e-01,-1.034427372037401149e-01,-2.040051610630841117e-01,-2.963505004725184855e-01,3.414838839398471326e-01,-7.095054989911175891e-01,2.398736609486327165e-01,1.719225569030752077e+00,1.352563836951418963e-01,5.744044261164298060e-02,-5.325512316228923071e-01,-8.793782388762649838e-01,-1.246610314651559026e+00,2.538640052315730422e-01,1.932270630145065837e+00,-2.086963193284191997e-01,1.832221982610236499e-01,-8.368542485235209716e-01,-7.895706393469741347e-01,1.672725298698899632e+00,7.227785715779480036e-01,1.974568240713191258e+00,5.585392199125022161e-01,4.663728417259968007e-01,1.226692853486571200e-01,-1.568966353412303283e-01,2.636497591770818882e-01,1.542877420720353276e-01,9.183213814968042010e-01,2.284787526772938726e+00,1.375527425241223622e-01,9.146940490857755068e-02,8.672220773046162012e-01,4.126047668014682479e+00,1.735951022407778099e+00,4.452385454400705211e-01,-4.330254335903528373e-01,-1.386745046241949497e-01,1.312429619245762291e+00,2.576152589364864021e-01,8.358305584028638546e-02,-1.197591754573138711e+00,1.338425881158058495e+00,-3.083071076983620595e-02,-1.596049171604535799e-01,1.515417321973913656e-01,4.065751447183549860e-01,8.587498127531927317e-01,-8.565558304152176561e-05,-7.998728080408581409e-01,2.253549646259012107e-03,-4.586239933661085538e-02,8.295050464603959117e-01,2.254275551483787332e+00,-2.521902909288228911e-01,-1.787437804141590592e-01,3.178843427358066798e-01,-1.367347697143380392e-01,8.703518258171468736e-01,-5.323062826980717865e-01,7.275859995017222026e-01,-9.394619165393813809e-01,-4.791081892403538101e-01,1.158363726186544262e+00,1.810399230487405031e-01,-1.790860235848274196e-01,1.445857316255040992e+00,1.067855045028773819e+00,-1.139777636324207144e+00,3.585267112122545452e-01,4.097279946767324876e-01,7.052299413593375865e-01,-3.430541309390123805e-01,1.383285777365935720e+00,-6.361649126497941342e-01,7.945043122504866773e-01,7.834461676169693356e-02,4.243030029390130742e-01,-4.057171479464960484e-01
8.017269375698885536e-01,9.693717742786562841e-01,3.391755565206048262e-01,-8.054946175708755929e-01,-1.252012682772801200e-01,3.409738104026535654e-02,-2.535800481360063752e-01,-2.139262312704372920e-02,1.615678994605806551e+00,4.291419317470480665e-01,1.196643573809435535e-01,2.327877957010301424e-01,-5.151147799011900341e-01,-2.483766102621410288e-01,-2.202689731916134264e-01,1.477828146713039414e+00,-5.834544283778013707e-01,5.247605454004861114e-01,-1.092339598530670530e-01,2.729945985896761740e-01,-9.754855681521623634e-01,4.770760701310547969e-01,-3.450976878776348400e-01,7.492367084913914566e-02,1.631936412528821378e+00,-1.123462610116464644e-01,3.230738906267007771e-01,-6.743393043614435145e-01,-9.948858486790778111e-01,-9.817818942712861485e-01,1.733460135720463202e-01,2.770823749926056401e+00,-5.601740586408774369e-01,-1.516995655803737297e-01,-5.743580065042370730e-01,-3.710195158554789874e-01,1.538995795750598639e+00,1.109873188758654816e+00,1.727298123640419014e+00,1.642497264586363137e+00,6.386603783025212033e-01,4.903444095536810265e-01,3.340710471325884501e-01,-1.199270773126505790e-01,6.563791576108939374e-01,7.077819712667678953e-01,2.952163041730624826e+00,-1.529119673508265442e-01,-7.495484395965602842e-02,1.050836642492396944e+00,3.412742668905486276e+00,1.564315385678791470e+00,3.855035617197919429e-01,-2.589198371801206822e-01,-6.931945434181884247e-01,1.694718480343658795e+00,6.323207684196064937e-01,-1.687466954334010394e-01,-6.563312320276899481e-01,1.622678674623046158e+00,5.182168901022886631e-01,2.097217050425983498e-01,3.301735131081550562e-02,1.284724392890623124e+00,1.400737176279023055e+00,5.470201979447893992e-01,-3.226223159522401129e-01,1.082559133912699645e+00,4.863068604550677687e-01,-3.382911773028676183e-01,2.196719003028253070e+00,-5.751116497666632910e-01,2.351691773788031070e-01,-1.552886723298680105e-01,-1.906580686057224305e-01,8.455988385303074839e-01,5.378658306900779840e-02,6.830838896759248158e-01,-1.344484661672893377e+00,2.693215881565441672e-02,3.409828682201723749e-01,2.526788019142199859e-01,-2.482458185784567894e-01,1.677665499139537220e+00,8.929030368880799262e-01,-1.114088537957571123e+00,3.156351277071094974e-01,1.533556401079140930e+00,6.220526934471826142e-01,-2.252452638237869009e-01,1.964033873394770424e+00,-5.078076933144370919e-01,9.994434742505949876e-01,2.749664003938229739e-01,2.668423826582264069e-01,-1.256991493435176688e-01
7.630273039468512541e-01,1.671300876656990120e+00,4.146674710718031287e-01,-1.141052099051922619e+00,3.799394539354618572e-01,-5.457392888601477754e-01,-2.646700165473763744e-01,-3.563121492826410996e-01,4.012098784087584358e-01,6.885217424240694384e-02,2.113314784570869964e-01,3.029228863922293624e-01,-4.141993615844378196e-01,1.713638086696716578e-01,-2.962925728056498564e-01,1.357936263228615825e+00,-2.723721325716128017e-01,4.265787426389581194e-01,-1.825791620679712568e-01,4.752882695664559232e-02,-6.849737798134184485e-01,-6.803526583739116784e-02,-6.432823134223957240e-01,2.273792157606283060e-01,1.736126578398113240e+00,4.627035748031068652e-01,5.467572456278101400e-01,-5.529585814204881489e-01,-9.275869260841261843e-01,-1.157233439155560539e+00,-8.479268433998038423e-02,2.212672532130628422e+00,-7.000505931597125198e-01,-1.561245471052852829e-01,-6.834849282050889929e-01,-4.560511825543794862e-01,1.296043451313693140e+00,1.155985228143271870e+00,1.841665246209704732e+00,1.021424264451877839e+00,4.475631843857785785e-02,2.530347248358613133e-01,3.210777797057903782e-02,-1.575065304205823802e-01,6.264408863531336635e-01,9.781765179422317047e-01,2.671957085252780306e+00,-3.015614531286938682e-01,-3.675386413819365372e-01,1.802147613400881809e+00,2.750914955553994456e+00,1.007439201475310409e+00,-2.137750323113866147e-01,-2.885233751260272705e-01,-3.716507531077275495e-01,1.522994390655090680e+00,4.642753228676050892e-01,3.252669859778718475e-01,-8.793133094599372424e-01,4.658393870784003354e-01,4.303717101404295753e-01,5.297986279777199270e-01,4.959711923951209966e-01,1.455307277591564086e+00,1.505213059879445092e+00,5.698629763284662753e-01,-6.091042918000924011e-01,2.571003472762226072e-01,6.506167223221233087e-01,4.778367829598421657e-01,1.638144030826785391e+00,-8.401876370232181923e-01,1.776899453380985372e-02,1.398419435128508970e-02,-5.838631250723144150e-01,1.106184807934909919e+00,-9.731914083784160008e-02,8.499467083080400887e-01,-1.158715368611194840e+00,1.285917871362811660e-01,5.070932943316823760e-01,-1.285358379222578118e-01,6.088801099140322970e-02,1.603938060824841694e+00,1.007361357467347007e+00,-9.021060523234653017e-01,7.689411546784731266e-01,5.512770254302361561e-01,2.823745521980063344e-01,8.064692937802790951e-01,1.209414309850796343e+00,-1.099730785017622559e+00,6.264864954674227437e-01,1.992911400315300341e-02,9.026313615333203533e-01,1.828884185455461608e-01
5.425263971726073109e-01,1.187127930302896983e-01,5.870154579791062588e-01,-6.180309454649862699e-01,-5.087790493882927284e-02,2.624467125043346560e-01,3.717277149482150489e-01,-4.529682414987683536e-01,1.120873378588756575e+00,4.990275788682195790e-01,-9.540001351715010625e-03,-1.366083679465942835e-01,-6.008044212196833600e-01,-4.996855430282196031e-01,-6.721629804464496205e-02,8.927442876391032955e-01,-1.289534037998844473e+00,5.477373652838990470e-01,7.626256811413628656e-02,4.187954131585744366e-01,-1.174892137718575702e+00,2.541304421765218091e-01,-2.672667769400868254e-01,1.687128544875441394e-01,1.645093347941477546e+00,-4.311908576911132468e-02,4.834523161952292147e-01,-8.276148443723966297e-01,-1.384318188798445703e+00,-1.005871372951880893e+00,2.795010811632274716e-01,3.161744282691966390e+00,-4.273537609221368383e-01,3.567678432962534396e-02,-4.519635641837313478e-01,-2.623535329254327308e-01,1.308189362050145688e+00,1.167782262431847906e+00,1.935710830005238137e+00,1.749758693391648467e+00,6.135908410305465077e-01,7.815169507474684085e-01,1.833532570325244193e-01,-3.837082059993073280e-01,9.745684596274375444e-01,7.416036428561040283e-01,2.564914246369468742e+00,-3.293593649862590067e-01,3.455785726457567819e-02,5.014020076897528488e-01,3.267203518502764137e+00,1.845093919937685900e+00,-1.306408488619120734e-02,-2.465916676064511259e-01,-8.598850687414238969e-01,1.844655852858787970e+00,5.756593553827377141e-01,-2.199959153143821455e-01,-1.073585922136631732e-01,1.730104833594501512e+00,7.365667243179139234e-01,-3.119054306562928924e-01,-1.562313714083668481e-01,1.186510759814612515e+00,1.534136965782164186e+00,8.038488506381472609e-01,-4.270664259880161406e-01,1.605911133405470981e+00,2.639125537700875990e-01,-1.203426311617555866e-01,1.806127356578378196e+00,-4.812467895240227778e-01,5.419425508623970655e-01,-1.596657536326931415e-02,-1.781763762247759453e-01,8.688491328905019184e-01,-1.983399555474767151e-01,2.528620214718565462e-01,-1.333434936989703612e+00,-2.152188965063570603e-01,-1.696011470812206490e-01,-1.728499754547380141e-02,-3.633239820070277570e-01,2.129037708201337864e+00,5.421445162618296898e-01,-1.245628389864235075e+00,3.558392295110960335e-01,1.723520327544060260e+00,7.792994007448994509e-01,-9.097957361309538804e-02,1.673570807487008594e+00,-2.743894904153446612e-01,7.239303516773726299e-01,5.449697243074029807e-01,2.480388342983573524e-02,-2.654770670194422366e-01
7.273425509510940135e-01,9.345795179099807282e-01,4.525762914390432656e-02,-7.028296567277606544e-01,3.229440707841500779e-02,2.704159186351893229e-01,7.148676686762953647e-01,-2.640430714193017780e-01,4.629882395467281309e-01,1.711307277195431298e-02,8.472611739612140314e-02,-7.522140277394326335e-02,-4.493597150373657145e-01,5.244386685771734724e-03,-3.622400727965736089e-01,1.047475705794441048e+00,-5.714378102306814089e-01,-2.118022561310654583e-01,-7.600488336388963595e-02,1.595380500033907745e-02,-6.615595684775622543e-01,1.267227482519938109e-01,-6.448359612559368959e-01,2.128549230138598869e-01,1.782710819749409259e+00,4.507376996513019485e-01,1.688605057334839343e-01,-6.909051242781811819e-01,-1.578594352924140853e+00,-1.359048747342383789e+00,2.903167991881690502e-01,2.476546483873511839e+00,-2.479499558782584379e-01,3.118335233786742600e-01,-7.763749770414467566e-01,-4.740114612651276094e-01,1.736801676847913756e+00,6.868478471708336919e-01,1.968885220856925855e+00,6.113171466937427079e-01,4.715599119001885886e-01,5.441810055671367774e-01,-1.288019575270213934e-01,-2.856073980597087503e-02,6.920221653262457195e-01,9.551836599917689075e-01,2.186686739506853883e+00,1.256887117783840047e-01,1.526324140283833453e-01,3.997673589207351719e-01,3.776139407916733415e+00,2.042852457983483472e+00,1.340734326508070673e-01,-2.136075565320941783e-01,-1.651088754553179105e-01,1.367859880562360519e+00,2.171450267529850819e-03,-1.083198779292244562e-01,-7.692231228188020076e-01,1.290988914173967217e+00,-9.581746985527625493e-02,-2.618951921312995257e-01,1.658681177462091594e-01,3.840563080574647126e-01,1.365724049556137576e+00,6.511552458941305410e-01,-6.465875827153405586e-01,6.944994162198521170e-01,-5.882576158133685090e-02,7.155915612755496813e-01,1.751546052292364930e+00,-3.308135314593563248e-01,-1.970834575239165110e-02,2.358662298535139923e-02,-2.053412583322421214e-02,5.863971757561535769e-01,-6.133828192740109486e-01,8.558851131248690347e-02,-1.320424715397128690e+00,-4.705142180684302455e-01,6.835668542575796813e-01,-1.665828035392507567e-01,-3.975310223652918640e-01,1.978861789956316120e+00,6.667468895496333481e-01,-1.238388714293411352e+00,4.246206089818740370e-01,5.489497848558384518e-01,9.226505519802135069e-01,-4.546001853113585400e-01,1.210380255000529814e+00,-5.853620233296239483e-01,8.468220492651340470e-01,3.861365894874245197e-01,-3.741052488971584045e-01,-4.668532788469547112e-01
5.996546302109402315e-01,1.420821087518728376e+00,1.502339139802533752e-01,-1.036428377948187540e+00,6.121396875349416344e-01,-3.670754396110992857e-01,7.309345308436718813e-01,-7.404724851724899803e-01,-1.147381117473468937e+00,-2.416171510304368220e-01,4.759110533829818968e-01,-2.585102137667966149e-03,-3.102097462659555993e-01,4.413217276735891259e-01,-4.786399614154958626e-01,1.034190472395302818e+00,-2.689191300125101103e-01,-2.473574346890215492e-01,-7.981096742182589021e-02,-2.119872669189485914e-01,-3.297344030343128396e-01,-4.371573884729933468e-01,-8.920416429906692368e-01,4.231538620603080281e-01,1.876914051833499686e+00,8.889803404583441759e-01,5.312098312449070603e-01,-5.684408637698081801e-01,-1.308642934671027991e+00,-1.476096294112069884e+00,-1.610994633159434919e-02,1.892204325270689935e+00,-4.079823274379156262e-01,2.728226524367929895e-01,-7.984068276236186978e-01,-6.215501257047979511e-01,1.220199013795786769e+00,9.047179620156448054e-01,2.248049966373753428e+00,2.155340234184491832e-01,-2.292192234226606562e-01,2.341186505066169543e-01,-4.775596678589686950e-01,-1.548625614866296907e-01,5.804319791660969008e-01,1.205868980879633900e+00,1.834780713444416511e+00,-2.484219753950859810e-01,-2.289818600454952002e-01,1.306513809775298629e+00,2.953399750956753778e+00,1.327470774684378130e+00,-6.321214668886038224e-01,-3.564868212013228010e-01,-3.612918225574757169e-02,1.357336073554966216e+00,1.058036260266504991e-01,5.391949483394249398e-01,-8.742384123248886363e-01,1.763033487935343757e-01,9.865367517867011660e-02,-4.927108618960840403e-02,5.724181186823831258e-01,7.977566235977753273e-01,1.370547532667461654e+00,5.227256759193408264e-01,-1.065437286716209186e+00,-2.046793481968545159e-01,1.838996156116642355e-01,1.629311106105667761e+00,1.162582722660389756e+00,-5.935973096171434094e-01,-7.379378311911689858e-02,3.701784921116078042e-01,-5.929315241256595259e-01,1.084846255230659473e+00,-7.804871976381153598e-01,5.029020266507074899e-01,-9.556201944478587285e-01,-3.675732916412201012e-01,7.171471350988333215e-01,-4.881465832513209313e-01,3.156043105797484705e-02,1.877328440203141824e+00,8.727502818440840970e-01,-1.033131746440973497e+00,9.328731582781781828e-01,-3.332586247172499849e-01,4.335789005115578409e-01,9.751630031016971234e-01,4.028528145996594922e-01,-1.114272495022171627e+00,1.981158189556432303e-01,6.780119311155674566e-02,8.153967646918842682e-01,-8.962280557332108488e-02
9.042604197847714520e-01,1.890084977100467967e+00,3.488592192534343828e-01,-1.002909676193259214e+00,1.910388992333387215e-01,-1.562680533004720540e-01,2.001042072244651748e-01,-1.563924855576686868e-01,1.169326336933014243e+00,-2.987121220920186948e-01,-7.837165641977679176e-01,3.719282866965376716e-02,-5.602270578423608205e-01,5.037082576904364228e-02,-1.324983615472928866e-01,6.586743888828197058e-01,-5.835188305758107763e-01,4.495555289326047532e-02,-2.943547525898354000e-01,6.912510509322755681e-02,-8.394916959247210597e-01,-1.711855710370040473e-01,-8.260780652014132475e-01,1.206607906988271528e-01,1.800475194855276850e+00,1.021431540069006383e+00,1.332516893771742428e-01,-6.382711357554027298e-01,-1.879553877915449034e+00,-1.429289929970049222e+00,1.666654802512159139e-01,2.426962835404944840e+00,-4.780425815888194596e-01,1.575307623174862226e-01,-9.434004369731240347e-01,-2.402093592693348434e-01,2.102086838661735957e+00,5.362480208881263977e-01,1.477196107184982621e+00,1.374649526830180601e-01,3.636792320956168667e-01,6.387353498209845659e-01,2.383456719487208469e-03,2.917438863239026070e-02,1.032626517554813050e+00,1.103031502891818505e+00,2.529528416653278100e+00,4.004310674168919948e-01,4.256123778078453601e-02,8.464378243887242803e-01,3.333464158482359885e+00,1.787043751566962158e+00,9.712444618142396235e-02,7.749215184604069107e-02,2.675330546754752792e-01,1.013140511533632715e+00,-5.626612687909927635e-01,-1.914418500159913716e-01,-1.004972503736859979e+00,3.686413107035413361e-01,-4.921648750670495343e-01,4.689046337720460533e-01,5.805888898247215657e-01,3.994232965552485526e-01,1.845695732992265192e+00,1.170167888558882652e+00,-3.153471486003813773e-01,6.771616451353321686e-01,1.391669814393330651e-01,5.024600361899389522e-01,1.482038608410635838e+00,-7.195641206876887130e-01,-4.008060496664005434e-01,-4.214025282261971705e-01,4.955405844307016194e-02,3.031701691508752461e-01,-3.281726832636964186e-01,-2.924582106169197893e-01,-1.700954981341225691e+00,-1.324661773878689774e-01,7.612039208335292795e-01,-5.234844239570826119e-01,-4.212175088344310425e-01,1.974709888307923489e+00,4.909662013283405679e-01,-9.839687604567277646e-01,6.131535122184208486e-01,1.384387392916338611e-01,9.199605744901282467e-01,-4.946373445831643845e-01,1.091078672513011938e+00,-1.168114697227631726e+00,1.339966789185667251e+00,3.871275889258932734e-01,-1.131935001257344364e+00,-2.052230713021025443e-01
7.637046248420396033e-01,1.334989016794360328e+00,2.211546163658106856e-01,-8.921756397419153828e-01,1.852776689174906455e-01,-6.171844040734891790e-02,3.525550271789002488e-01,-2.950317005575918694e-01,5.229444224531668572e-01,-4.269166472054716777e-02,-5.159875999652474565e-02,4.548349273784216273e-02,-4.601958840124528716e-01,7.138671655465120280e-02,-2.947500056492053933e-01,1.036580627339056981e+00,-4.982600678706356478e-01,1.641653933757353245e-02,-1.454337584435040909e-01,3.198331833666116092e-02,-6.991770703400759235e-01,-1.748460948344565669e-02,-6.897998142023403778e-01,2.083327373958359652e-01,1.775389536181634531e+00,5.900232538872446364e-01,2.830020998528435805e-01,-6.409817046560007947e-01,-1.458145474241837380e+00,-1.319979905161121847e+00,1.534873950902399531e-01,2.380949707411927907e+00,-4.223339927353392254e-01,1.519196387077611510e-01,-7.834140983926382029e-01,-4.236175102271920179e-01,1.665743177880755432e+00,7.949170695023384248e-01,1.842848211496964428e+00,6.126326888816728822e-01,3.058620044966411933e-01,4.792234762560792505e-01,-7.367880251923124291e-02,-6.185609735263507269e-02,7.494596220214075899e-01,1.002976787515463597e+00,2.370391950229943312e+00,4.738514079456438571e-02,-2.444454176559214542e-02,9.015688566668018655e-01,3.367518895410718027e+00,1.681772741268646065e+00,-7.390377724303898166e-03,-1.788655528507854531e-01,-1.305439350626720341e-01,1.338134048477719329e+00,1.176733929674655954e-02,1.583360982029589914e-02,-8.375539506189421113e-01,8.277765945972407335e-01,-1.793048552038681298e-02,1.038223010414088820e-01,3.523340787671374041e-01,6.945799575903619516e-01,1.505866972478000054e+00,7.371867461740062577e-01,-5.840973460253324756e-01,5.515595196805727074e-01,1.792911975886979370e-01,6.432425943178327055e-01,1.634465474861614531e+00,-5.608835831041424358e-01,-8.376309155359927539e-02,-5.290088611156315568e-02,-1.817530097048577487e-01,6.920792631242039805e-01,-4.215815922962600215e-01,2.209452397814339886e-01,-1.338664508102330064e+00,-2.376419673531758314e-01,6.375610797838252575e-01,-2.506894023036180252e-01,-2.622903637142159350e-01,1.880190403164031965e+00,7.204195692984166621e-01,-1.085735702183721951e+00,5.785441265288837620e-01,4.382796381197213709e-01,7.312062612526114558e-01,-5.829449154015514667e-02,1.148427882030067959e+00,-8.640327419891437044e-01,8.601034991703233601e-01,2.809307361447868079e-01,-1.432010992077757949e-01,-2.213258188060150955e-01
8.210353781013145502e-01,2.012162494622296016e+00,-3.584492084924342792e-02,-1.179029907825374757e+00,3.527240074145305271e-01,-2.660178664385022818e-01,5.326890958989175529e-01,-3.065808075517667541e-01,-1.746158960214745370e-01,-4.205794946042582527e-01,-1.904258680724307817e-02,1.370383105908339061e-01,-3.431976427331122625e-01,3.937739497846129977e-01,-5.522748883692829569e-01,1.038118992648434435e+00,-2.368464875455311702e-02,-3.376401481179396313e-01,-3.370336042339336924e-01,-2.980104773351122671e-01,-2.912697543986425552e-01,-1.658686728853783210e-01,-9.745724665601908088e-01,2.274680728056992784e-01,2.003359882251198876e+00,1.157524801383521318e+00,1.802402041403205479e-01,-5.419446147260634783e-01,-1.803799932653823213e+00,-1.751862608444736846e+00,3.630777610515112386e-03,1.899278309809769416e+00,-4.516473860626545322e-01,3.967054195268337469e-01,-1.004181419015237609e+00,-4.887347251443960872e-01,1.923511986364249804e+00,4.953232265963142256e-01,2.068523674299021398e+00,-1.712444097596561576e-01,-1.748487899591433248e-02,3.170539245615920376e-01,-3.115347629497470239e-01,2.809171852078236331e-02,6.046792150091353513e-01,1.183519844295603196e+00,2.067285820695935250e+00,2.545287439844716171e-01,-1.017599853746103261e-01,9.848389117782373470e-01,3.354011760006518017e+00,1.767044343762698366e+00,-1.393494199661757804e-01,-1.071558092853241440e-01,3.456228610026543802e-01,1.104604119134449114e+00,-2.706014375377099324e-01,2.478260475235800342e-01,-1.359915316968745902e+00,4.307977127915578741e-01,-7.094601322636451268e-01,3.075868338926786016e-01,7.944235511496636759e-01,3.760459291020677997e-01,1.636710335799729688e+00,8.317585991360090247e-01,-8.077903517072748674e-01,-2.492722768579249681e-01,2.171407070149868890e-01,1.386985222347072444e+00,1.282677559776857823e+00,-5.393327400705156816e-01,-4.570807686610664500e-01,-2.100274278427799735e-01,-2.217319969669538926e-01,4.280458376391278463e-01,-8.007780084240925245e-01,1.958978418805030208e-01,-1.503901678499257821e+00,-2.628034809061566834e-01,1.263482108617004940e+00,-3.993689076807403482e-01,-2.458863385651776645e-01,1.906227975362995819e+00,9.386829574934858478e-01,-1.144957785637725323e+00,7.801250926794320861e-01,-6.522671716393477759e-01,7.232303707378314739e-01,-3.777118431463277748e-03,6.479572318533034503e-01,-1.179820412434607668e+00,7.584833774497350412e-01,9.230052640535546526e-02,-2.220105684241733823e-01,-2.874259628459360227e-01
5.364450121137465111e-01,4.691215201349355213e-01,1.843384539960927770e-01,-9.481920985477139130e-01,-4.650937013805456210e-02,1.454888475691200889e-01,4.694029882023251221e-01,-3.975665553837071098e-01,3.800111291138595360e-01,3.807056097904909509e-01,5.441269430811188634e-01,9.023891639252054619e-02,-4.057308848857748562e-01,-2.761903384946941542e-01,-5.406860149337828769e-01,1.320409813811332489e+00,-6.485182742155239932e-01,3.092225704260673780e-01,-1.248527294650706165e-01,3.678609747032217381e-02,-6.410376776662922715e-01,4.910342733236291446e-01,-3.842136106749096669e-01,1.415536272449579025e-01,1.948956581222781814e+00,1.697694328687086862e-01,4.162405350972809837e-01,-7.287179242509200794e-01,-1.571848210150142089e+00,-1.490423046461411882e+00,6.017030167052866974e-02,2.734978639950693680e+00,-5.199840195010724253e-01,3.098242453248348793e-01,-5.631825006636365094e-01,-3.935219825767025670e-01,1.435173089716784034e+00,1.004548781056299189e+00,2.531552915472374377e+00,1.491920961868750783e+00,3.110638920099519922e-01,5.117867036229655220e-01,3.011270577059084463e-02,-3.881912964167322233e-01,5.594472590167464121e-01,7.549444212239313501e-01,2.313831515059263655e+00,-3.225635890474695677e-01,-1.261261608142469903e-01,5.475672657753098971e-01,3.340655642050143204e+00,2.023807003611090671e+00,-2.504367386219247260e-02,-3.030927367608353684e-01,-7.297792335129215102e-01,1.948596618511756695e+00,8.857866274775666460e-01,1.018538253025302043e-01,-6.878392409229410198e-01,2.099435587534166814e+00,1.742394058712915528e-01,-2.167560408236222369e-01,1.921765872028625699e-01,1.188172678562174900e+00,1.552179702849642684e+00,6.741912053540448646e-01,-7.747348505620847980e-01,7.057092353011631403e-01,5.465609533577246992e-01,5.097294253638398054e-01,1.640343187431372307e+00,-2.993342260678226729e-01,3.847804031434724492e-01,-2.080850141938886677e-01,-3.311826610361127687e-01,6.563146397035689583e-01,-6.378682352126960886e-01,7.310383896465590947e-01,-1.501809861441046223e+00,-1.733858876360763746e-01,5.569651613288916225e-01,2.517822355709120052e-01,-3.144818912741293437e-01,2.107609845925845438e+00,1.127480319509375217e+00,-1.518066235291143151e+00,4.530594881071437485e-01,8.930947298982727656e-01,6.624823059042441731e-01,1.261217330401076531e-04,1.452173676935450519e+00,-2.619561397494183375e-01,3.520500234276372487e-01,2.296315270225315897e-01,5.973846057911367247e-01,-4.082801348845709888e-01
6.195411767259704217e-01,4.959740621965645357e-01,3.877150649411353345e-01,-4.396553483592988698e-01,2.325714342496449927e-01,2.162320307237046713e-01,7.325662116222129150e-01,-5.555768553592600467e-01,2.483660365708794115e-01,1.539314742613575315e-01,6.291252792796175886e-02,-2.712463073237263989e-01,-5.337950782725372489e-01,-3.086307049166272382e-02,-3.589228646970155090e-02,8.177688153378870339e-01,-1.026997185792931866e+00,-4.175091903237852786e-02,1.927486055618426730e-01,2.738579122610269034e-01,-9.736823762077222444e-01,-2.316492369427364251e-01,-5.624564716856474966e-01,3.621421394244911385e-01,1.512599372310704959e+00,1.962622104177429994e-01,4.267700919186745434e-01,-7.426258607462326022e-01,-1.099065446805680191e+00,-8.871480837734564417e-01,3.933415571470385563e-01,2.640567479290991226e+00,-1.732917258213251821e-01,4.432226450990586764e-02,-6.053851541183472573e-01,-5.006438194475901771e-01,1.221893756055921099e+00,1.034882306462595603e+00,1.679971404960254100e+00,9.200001252502134630e-01,4.853660201900056315e-01,6.108721186450222218e-01,-1.579934463932365363e-01,-1.037064310124835437e-01,9.039951907820467092e-01,9.883564006539072855e-01,2.201105802882030726e+00,-1.766036439998502350e-01,1.493639133411918396e-01,6.841394992871860925e-01,3.456638129357183065e+00,1.578988330872941770e+00,-1.763148484729802901e-01,-3.396587984647619352e-01,-4.242332859800524991e-01,1.411803272030186074e+00,5.652983276071332774e-03,-8.480483529937023202e-02,-1.729536640079922805e-01,7.615003290119481960e-01,7.321485835678734899e-01,-4.779807432374008069e-01,-1.395224795621725355e-01,6.400644441237998139e-01,1.167764259379707292e+00,5.056620670902733927e-01,-6.052093344125591967e-01,1.161474816895196049e+00,-2.489175699895431193e-01,5.359419025503637801e-01,1.777219440421932362e+00,-5.086710483690684015e-01,2.588411489434248591e-01,5.280439872881941277e-01,-1.831687447793570178e-01,1.156831255386895574e+00,-3.155341731803855687e-01,1.477318253900261613e-02,-8.397436318758128015e-01,-5.468757683431635375e-01,-4.769017907134176504e-02,-4.119315559106528357e-01,-2.168627508817113358e-01,1.916777941388003725e+00,2.854540014333145637e-01,-9.558571682388760093e-01,4.929457790231551728e-01,1.155904016540509227e+00,7.779336387092802285e-01,1.669704084614490047e-01,1.147266469989492332e+00,-6.342005146953211270e-01,7.349863510502832042e-01,5.255022468209140651e-01,-2.828090402107813484e-02,-2.164929233710375378e-01
6.268424440797383257e-01,6.770985675571946638e-01,1.789122659672043869e-01,-7.556099982323469799e-01,5.478000917850207874e-02,2.019222682839515448e-01,6.408117854170104488e-01,-3.905457268346145261e-01,3.630714613374073085e-01,1.684688140464325190e-01,2.313212679312175446e-01,-5.955623598551967879e-02,-4.521538212503704579e-01,-1.108584556340392741e-01,-3.619990001250281697e-01,1.072316060081624167e+00,-7.078903773959128731e-01,2.240473308786428142e-02,-4.556943883371828569e-02,7.273426320486464647e-02,-7.162562935164905609e-01,1.744832577718446187e-01,-5.375159339472211917e-01,2.170369668775491145e-01,1.801977486752775359e+00,3.272718863942309375e-01,3.197804669211140594e-01,-7.178906966293390202e-01,-1.515989715748216504e+00,-1.332792479308142708e+00,2.172521974418646085e-01,2.609944788628301815e+00,-3.409355374207370115e-01,2.690879569816730377e-01,-6.654022339559209076e-01,-4.389247994974911915e-01,1.524317297263851234e+00,8.693182942661253909e-01,2.133396111549540564e+00,9.830796780314303707e-01,3.969450910624424678e-01,5.546316599756286880e-01,-8.316434295883802508e-02,-1.908663915231960662e-01,7.010436491735522191e-01,8.950713027562682278e-01,2.222306991242215091e+00,-1.032567067649187431e-01,4.213415022319139114e-02,5.062988339992202658e-01,3.522904245821241620e+00,1.949962475247994709e+00,-1.277011600374072797e-02,-2.629252707538552447e-01,-4.172512539651793695e-01,1.592490174235789757e+00,3.207822095688466768e-01,-1.835295782460218128e-02,-6.179834672769047854e-01,1.466547605563169654e+00,1.515516493980939572e-01,-2.829285886625360069e-01,1.327786510250810181e-01,7.354364805589092002e-01,1.422134768480448397e+00,6.594016334384595890e-01,-6.909610115624206239e-01,7.881877919743814909e-01,1.368085496809390289e-01,6.268802752564073266e-01,1.677567557772975615e+00,-3.602931595026808154e-01,1.845246715651022718e-01,2.278141317279898381e-02,-1.734036278195839054e-01,7.127082380460942890e-01,-5.784411716733763864e-01,2.939161908869930562e-01,-1.310303614766695102e+00,-3.715217938521662155e-01,4.882087085242759472e-01,-7.866204223541151119e-02,-3.338358183472837637e-01,2.036695966919212175e+00,7.575516185690452931e-01,-1.291444914990003578e+00,4.630105504158559260e-01,7.661973217164678163e-01,7.983090346096182177e-01,-1.457265406937053309e-01,1.260063683591068129e+00,-4.853729479389081725e-01,6.296350872259864895e-01,3.583158363427725313e-01,4.099230266485776042e-02,-3.945772537180278206e-01
5.736198734865294302e-01,3.963516313912239797e-01,3.164436259352766401e-01,-9.200341162916867432e-01,-1.871013352911415351e-01,2.140219284929394117e-01,2.705458500978738523e-01,-2.765006977007826161e-01,1.083540115070605658e+00,4.823626633085619231e-01,2.625787127194387782e-01,9.873313041428614933e-02,-4.894027154546832792e-01,-4.774256073308437709e-01,-4.186512743758788457e-01,1.240245384755700897e+00,-8.458582822136517798e-01,5.277885904302563880e-01,-1.479888981758372135e-01,1.785001385906497262e-01,-8.534291609349912155e-01,6.204514131055229864e-01,-2.805143040819050859e-01,5.370030593084562653e-02,1.907935963106516697e+00,7.030571758076267774e-02,3.744804726956568741e-01,-7.723742405681022216e-01,-1.659570445863855603e+00,-1.413394136715336424e+00,1.029624631890226905e-01,3.002914921490691835e+00,-5.709616277782292304e-01,2.326638248927728470e-01,-5.287193463150491324e-01,-2.675047438662555011e-01,1.565349611442867106e+00,1.012763140968556907e+00,2.363385631427831868e+00,1.733731408004334673e+00,4.954148135974669187e-01,6.478830331599165770e-01,2.161862159383306503e-01,-4.128561761710217159e-01,6.980430720550354629e-01,6.724018462791729878e-01,2.561942114674186310e+00,-2.602351162336117296e-01,-8.193960372132595704e-02,4.383742710916487262e-01,3.362898537758484352e+00,2.115988055299769854e+00,1.486675408307044366e-01,-2.143366917141454886e-01,-8.160127376603412142e-01,1.980824715139554604e+00,8.778543501436296692e-01,-9.867329010233177877e-02,-6.000728154715881946e-01,2.308611366091687156e+00,1.958954538828268088e-01,-1.151361712161344808e-01,1.176577034934517679e-01,1.258531285825124302e+00,1.683949068868209276e+00,8.375366670123167712e-01,-5.566578231743584126e-01,1.092941682881559906e+00,6.090213680712787125e-01,5.799460715843340886e-02,1.757149011807050742e+00,-3.391969919489905005e-01,4.282789707554617853e-01,-4.110760749646042989e-01,-2.048206657134734598e-01,5.188944974758110673e-01,-4.527952123585216038e-01,6.064522165314729651e-01,-1.686237116822113080e+00,-6.725113190166642774e-02,4.178472786317099508e-01,3.119015650932028261e-01,-4.208613254793576730e-01,2.153333086579960476e+00,1.039032784553023170e+00,-1.527110448425756495e+00,3.448428011586050501e-01,1.262795584218511680e+00,7.521341841558772945e-01,-3.085288265130367580e-01,1.742035972906830432e+00,-1.810362593560105315e-01,5.940735918424520090e-01,3.304979725769492949e-01,2.379503431281792536e-01,-4.114515939271614631e-01
8.278973890619376608e-01,3.374458648597540300e-01,-7.606215906379790170e-02,-3.086742653881769383e-01,-3.274318072887112963e-01,4.407219974221891490e-01,-1.512207009891057274e-01,1.685549576686750095e-01,1.377491216889055181e+00,7.975599172762924960e-01,1.099545883021623593e+00,2.530818041125996731e-01,-3.942622781213904193e-01,-9.329637261041072438e-02,-3.461730815233988179e-01,2.278525735838635491e+00,-2.539233122239763496e-01,1.845331984135886172e-01,1.856359728008510068e-01,2.885391428180463236e-01,-8.554637778856756247e-01,8.015054216526233954e-01,-1.629880742910047586e-01,1.861864642592015451e-01,1.344664917386671821e+00,-1.061514168530381497e+00,2.712816931429067324e-01,-6.408406542529214711e-01,3.939013731855744993e-02,-4.801950315118349577e-01,4.092591081998612212e-01,2.611405817631770265e+00,-2.553161405283780327e-01,-3.274562988934490160e-01,-4.158945926407052740e-01,-7.737545216018673067e-01,1.112814550618066889e+00,1.368186910942190693e+00,1.726643836197148563e+00,2.182571127508575515e+00,9.680567137846546322e-01,2.072608311511947021e-01,3.177278046320803906e-01,1.223511438826896391e-01,1.427668630778297643e-01,5.264675270937888563e-01,2.944012757524011370e+00,-3.554791811067158913e-01,9.055083065146646293e-02,1.038994774729140591e+00,4.118017662310831106e+00,1.404989065467758813e+00,7.639616451559767540e-01,-6.679637905886955940e-01,-1.124898354768230746e+00,1.868123587434729727e+00,1.132591661595895527e+00,-1.690013018203443129e-01,-4.683388936336259634e-01,2.252120483865734268e+00,1.283457943834250159e+00,-3.861846585529624676e-01,-5.887276449162885950e-01,1.264886220655791149e+00,4.974611781307692882e-01,-4.189093098915832591e-01,-4.904572386052825639e-01,1.093294095981674374e+00,1.233579858529618434e-01,-5.232794281731922847e-01,3.048844867855555307e+00,-2.807263428096241631e-01,5.120142515107583003e-01,6.145874047369048743e-01,-2.247144955650454134e-01,1.472683266797131019e+00,1.966176984586260335e-01,1.265621439345770538e+00,-5.636846651071938386e-01,-3.026147989699078944e-01,2.362164354655903464e-01,7.187381563081838287e-01,-7.620409571448133468e-02,1.191387295784692046e+00,1.014517395450037274e+00,-1.059857491225143500e+00,5.370961611850244566e-05,2.354338115090865990e+00,5.235898047548704914e-01,-2.259758167747151214e-01,2.421418189702886359e+00,-4.600750002818343454e-02,8.222012245194835200e-01,2.116017213667353292e-01,1.212370523518583987e+00,-2.123785542401186166e-01
7.869345310379238789e-01,1.157130509154887132e+00,2.370661000256933937e-01,-7.953523202773855605e-01,1.232652705799427845e-01,-1.394054312447653987e-01,-1.375925672714845560e-01,-1.776269184312878890e-01,7.547523254754135991e-01,3.018779296481731711e-01,4.611088539713589785e-01,2.342017462015760221e-01,-4.212413941252557970e-01,7.270993399487014897e-02,-2.850718724377356295e-01,1.608861683208191007e+00,-3.226028997408377785e-01,2.829174561403395294e-01,-3.277078204209385448e-02,1.455442243806888691e-01,-7.683471582105034781e-01,2.052868925541959377e-01,-4.869404229534503026e-01,2.211470963396667266e-01,1.582688288906318297e+00,-5.343758361317327982e-02,4.226800035013398293e-01,-5.970441811997925230e-01,-6.349725101003168559e-01,-9.098261392611848297e-01,1.325882239399387985e-01,2.376071750382118708e+00,-4.960219520864821430e-01,-1.924434820797593093e-01,-6.014202246316054934e-01,-5.645434793901809023e-01,1.263239685995168449e+00,1.191236260312763973e+00,1.760594723768539982e+00,1.357706002855560978e+00,4.074188520477074471e-01,2.738030337460443109e-01,1.118509428688027330e-01,-3.937560087509280049e-02,4.951068768462784653e-01,8.338215643927233689e-01,2.726313718300668487e+00,-2.748926787301446129e-01,-1.534739350677815639e-01,1.431267556259967266e+00,3.301363901563043601e+00,1.206567669817915966e+00,1.408765119522857323e-01,-4.082845627327089111e-01,-5.957175237655321087e-01,1.598980863636831229e+00,6.025060616899267085e-01,1.047019498085210720e-01,-6.978534422133176873e-01,1.070164847677507636e+00,7.066936328858299809e-01,1.446005797257675640e-01,8.197963614697605095e-02,1.276094413854774956e+00,1.139796602246703427e+00,2.425638145037267712e-01,-5.543095682575570615e-01,6.175421415727140317e-01,3.732858783327302477e-01,1.440100008513724716e-01,2.132706958001531650e+00,-6.230383330980893142e-01,1.771878531387833244e-01,2.492566173529797147e-01,-4.035152941966785312e-01,1.208726844377057574e+00,-1.634736316476426143e-02,8.809784541684038128e-01,-9.431606134871233227e-01,-8.254300575016948471e-02,3.893110688491756566e-01,1.183851721872527241e-01,-2.232050674411445446e-02,1.489200568939095248e+00,9.305930241742003117e-01,-9.528273666530634456e-01,4.799486301422107304e-01,1.188282883979366655e+00,4.266425925243335082e-01,3.527913967895696667e-01,1.611384367171273091e+00,-7.191898332111352765e-01,7.402664956394431339e-01,1.359362438186517974e-01,8.520593166744796498e-01,6.537151088510384511e-03
9.613196723131191002e-01,5.671362712057119726e-01,-2.840715831417139903e-01,1.380812726517266498e-01,-1.804868036210514615e-01,7.898904591420665700e-01,6.740011839041496478e-01,1.373174879714936791e-01,9.824724764687036149e-01,2.684965540598457934e-01,5.204768454773204267e-01,-1.773271202987825035e-01,-4.543573859124601100e-01,2.525385818276006944e-01,-1.158300442931363139e-01,1.654588458519973049e+00,-3.827414586944245523e-01,-7.096490113799150956e-01,3.417720084133347713e-01,2.416182881767708346e-01,-8.555291635349375756e-01,1.917118913843716410e-01,-5.380790731044127195e-01,3.534005240162615968e-01,1.162972096098636277e+00,-5.859723022352650856e-01,-4.327395725967289608e-02,-6.516533879872222768e-01,-2.161958110764187202e-01,-3.995468862668157817e-01,7.947088938948390080e-01,2.333875290062730201e+00,2.525222465480734813e-01,-1.315452862469783102e-01,-6.925204105019009404e-01,-8.925572261753451642e-01,1.455791270766011669e+00,8.722091237806111064e-01,1.154030319921591108e+00,8.411372806380945644e-01,1.149121754700939135e+00,3.532676000705936570e-01,-6.834773955514635013e-02,5.318164013031577708e-01,3.997499366113823616e-01,8.482904262141549578e-01,2.425620735812799023e+00,2.280849096614539495e-01,5.687334936654389050e-01,4.454675063589361717e-01,4.792034152299208039e+00,1.674886858074418505e+00,7.927280247146891723e-01,-5.612919585534142941e-01,-3.418343728465257358e-01,1.099485595229728663e+00,-1.625410289138253805e-01,-4.482667240665906272e-01,-3.993770350562649285e-01,1.233235177632218349e+00,8.806984836861753152e-01,-8.107686916617122819e-01,-6.982657706518586860e-01,-6.681366014048595314e-02,2.368439579393519789e-01,-3.895021541278663735e-01,-4.643313218639597006e-01,1.164451330929539896e+00,-9.128332629953004318e-01,9.749853038421374407e-02,2.989627666057466993e+00,-1.892389156401741712e-01,5.031889498239212888e-02,1.054045434124135427e+00,2.334647709273979799e-01,1.346007938862466613e+00,-4.727330584511385547e-02,1.504512376482623481e-01,-2.785764330452382698e-01,-9.362703764844619858e-01,3.138490804594551431e-01,7.895183192403121275e-03,-2.636520198615852073e-01,1.245511431900563792e+00,2.456657566517079783e-01,-7.899044866643728513e-01,-2.115647521191688085e-02,1.763311122804444020e+00,1.001357601722534296e+00,-8.536388256637248428e-01,1.836114452400587682e+00,-3.549584295144856405e-01,1.308214510872362402e+00,5.393429695500925325e-01,-2.547992525413708687e-01,-4.513096924041531954e-01
5.518859891796337180e-01,-2.349123312012580955e-01,-6.842043906392334396e-01,-3.641155060741406713e-01,-3.458258447088709553e-01,9.586983449400532376e-01,1.419764613882737336e+00,-1.957006578400217467e-01,-4.776749258483261595e-01,4.527713012203732346e-01,1.553337678614750361e+00,-8.666975164531387499e-02,-2.071323677633652438e-01,1.128667959712424673e-02,-9.287954356354322094e-01,1.933566652595616553e+00,-1.687628437492696420e-01,-7.378047617301367600e-01,1.170981405209969017e-01,-2.277073139761588427e-01,-1.741586858707960261e-01,8.382553543790094430e-01,-4.062675164848670306e-01,2.736031001961067854e-01,1.872556569939368920e+00,-3.892879466207614381e-01,5.886261168134430954e-02,-7.174305912130412022e-01,-1.214892450614367680e+00,-1.455213731643097308e+00,4.302704843058006157e-01,2.386050835513413126e+00,7.595982692394348534e-02,6.504408684659033213e-01,-6.142429976059587959e-01,-8.767079622945852524e-01,1.439797816749081472e+00,7.488052684343817766e-01,2.855719349337497714e+00,1.206647646413090635e+00,6.596264084194385369e-01,2.896312908229624616e-01,-2.988824902549274687e-01,-1.585986043222560593e-02,-4.512363750594139411e-02,6.893731441973244278e-01,1.701366588595246476e+00,-1.313650634725119781e-01,3.212924824399858159e-01,-3.568603946428808849e-01,4.714697626024387134e+00,2.626100600724954326e+00,4.465239207869167726e-01,-6.371627260787533498e-01,-7.077696729894759065e-01,1.885402107444430486e+00,9.279982813164483479e-01,2.047461323325237836e-02,-7.909250067308414289e-01,3.034548001732027878e+00,1.110496306232625352e-01,-1.252904277898397867e+00,-3.376203550452716584e-01,2.363869664687903160e-01,6.251832900716089991e-01,-2.029814419299340589e-01,-1.185168696738670091e+00,3.847892918333489787e-01,-2.631241297297353121e-01,1.101641244728917668e+00,2.287120482285947887e+00,3.778681545140724629e-01,3.986326738242198520e-01,4.951343448795920699e-01,-5.061901466350586520e-02,7.764116497397990369e-01,-1.166223955293879566e+00,8.289035252061955905e-01,-9.157715795929144420e-01,-9.472797288352353684e-01,1.024340147464659179e+00,5.975020920536547875e-01,-4.215844765169596275e-01,1.905292329438474486e+00,1.208331530078597726e+00,-1.757365104309722259e+00,6.510606689500852973e-02,8.963969143705519116e-01,9.687020758062501180e-01,-7.361973258959715327e-01,1.506773060000745179e+00,3.457098254300770002e-01,1.637089064995888021e-01,2.610911681287626518e-01,7.443157321362909862e-01,-9.909451031041169866e-01
5.772157200312189040e-01,-2.381874903644576325e-02,-1.447152770402691524e-01,-3.407855922441568319e-01,-1.712728533997464608e-01,7.957050641194371998e-01,1.314262340359411363e+00,-3.505636921435962283e-01,1.562574292992373604e-01,2.534302888696120526e-01,5.034426332049395381e-01,-3.051217546611278975e-01,-4.305231222327166041e-01,-1.554830134965399235e-01,-4.395883603339491574e-01,1.100075119358251419e+00,-8.236076364175808351e-01,-4.618155686418066730e-01,1.319715230889040303e-01,5.687578147044116544e-02,-6.573604700123277800e-01,3.416139039934460997e-01,-4.843946694587834001e-01,2.681543436339090536e-01,1.745460826572603263e+00,3.993008223356427078e-02,1.232983728769545401e-01,-7.952809748401653556e-01,-1.578838306771134237e+00,-1.299886264277740899e+00,5.027005120568277530e-01,2.713532391426256574e+00,2.555025541066008321e-02,5.044135195256028714e-01,-6.547106069551031915e-01,-5.817696939715081283e-01,1.581400534993427476e+00,7.020429015123696992e-01,2.258074902805581097e+00,9.136805453108922670e-01,7.042147228789918945e-01,6.390994353256199689e-01,-2.212699148617556233e-01,-7.416217614776489386e-02,5.903422929082443593e-01,8.394916609952024489e-01,1.870619417636879556e+00,3.281899234787855058e-02,3.847078502133189915e-01,-3.165342452907923265e-01,4.285748769805949543e+00,2.488145691714854557e+00,2.234272253316046952e-01,-3.642183544354668512e-01,-4.529129707703826169e-01,1.580536758085273608e+00,2.277555568374142747e-01,-2.311273440867141760e-01,-4.442149789579776797e-01,2.108595577806801735e+00,1.308042841685626567e-01,-9.846951722742085522e-01,-2.575022715643574545e-01,1.251081493214334373e-01,1.056542333130490174e+00,4.039381334398198242e-01,-8.110536919969787428e-01,1.037158410112660523e+00,-3.991404310866927263e-01,7.905628323675802926e-01,1.945249652642845328e+00,3.061977163914447742e-02,2.857215540908416007e-01,3.176217115096641175e-01,1.053070265560834134e-01,6.501600210741288466e-01,-8.747647399794873380e-01,3.139794337094609089e-02,-1.123876837785896310e+00,-8.477771141815338973e-01,5.102296533700527714e-01,1.068133624864120446e-02,-5.283361320559797347e-01,2.136773931980651131e+00,5.840405158180147493e-01,-1.475877637290807787e+00,1.947765861230359441e-01,9.962736775820759672e-01,1.122147428072232556e+00,-7.728424717288645551e-01,1.329832469415356044e+00,-3.727158753121750934e-02,6.209443018439146922e-01,5.554644593488358151e-01,-3.273332890528073968e-01,-7.949674900622084595e-01
8.797183826140030360e-01,1.748635915031251820e+00,-1.918934270785861984e-01,-1.064750712445884595e+00,6.908094246703079533e-02,-9.798502090414978882e-02,1.830269404577543058e-01,-1.427161710985520859e-02,4.034260421777950412e-01,-6.820864022933589843e-02,4.249628143762058663e-01,3.230379792346849688e-01,-3.057988868440705832e-01,2.821159958925100741e-01,-6.496065861369159089e-01,1.634662304438691427e+00,1.839327026385436104e-01,-1.849589492706735783e-01,-3.019458957368075791e-01,-2.339009473623871460e-01,-3.122565816691105223e-01,3.181357180649534433e-01,-7.428733446292625775e-01,1.472637266356231489e-01,1.908298048360836718e+00,5.222820082614126891e-01,1.306236526701692879e-01,-5.289050927619051157e-01,-1.314490586106948022e+00,-1.529515096112701755e+00,4.326239798810088688e-02,2.006113357898254179e+00,-4.712483777154298226e-01,2.292739459947030767e-01,-8.778137137169136350e-01,-5.849266325995572391e-01,1.836214763286124985e+00,6.797030937856952670e-01,2.095154204347407401e+00,5.205515877761678345e-01,2.505315005436918319e-01,1.957824033169436317e-01,-7.471835204611045056e-02,8.671834220216297073e-02,3.139371111876807507e-01,9.478532958711960443e-01,2.402654982952700635e+00,1.375762330480350959e-01,-1.005089518156211531e-01,1.041916894815030581e+00,3.656739663439626309e+00,1.740306453564647082e+00,2.759293602158291447e-01,-2.566697404046308084e-01,-5.280572867522503877e-02,1.364070320729566133e+00,2.743468200353421649e-01,1.620879121412389379e-01,-1.374037340984272770e+00,1.214431814793328623e+00,-3.718855054868467347e-01,2.628142714594874918e-01,5.138154985341062408e-01,6.801075017380993071e-01,1.343081274765921540e+00,4.425258429775457691e-01,-7.337102634866674578e-01,-1.084463714729191341e-01,3.613275124788359882e-01,8.243067286429159868e-01,1.862857778534015019e+00,-4.172660101601224358e-01,-2.604394775938520534e-01,-1.598436948523618562e-01,-2.206759826310901174e-01,5.799208498372787624e-01,-5.574889368550366431e-01,7.110323229790842525e-01,-1.381893356658534744e+00,-1.747429350542741566e-01,1.268591146249803181e+00,1.149789908750726009e-01,-2.120896635195051172e-01,1.636748085765795890e+00,1.208971777127975766e+00,-1.216177152319541710e+00,5.250223626494956441e-01,5.471157703442663944e-02,6.402101160432815963e-01,-2.144770943942018726e-01,1.272440893316456378e+00,-8.300820311252246064e-01,7.887117648609905940e-01,8.563964363684506420e-03,2.931853504142665212e-01,-3.084715264257535394e-01
8.679824794064693316e-01,1.305451485767783026e+00,-3.895724914187741472e-01,-6.369573440796318931e-01,-2.502911209591995173e-02,4.393684947944055397e-01,9.905593080899293135e-01,-5.153171538694799325e-02,2.113483052784875804e-01,-2.258818382648321299e-01,2.073085073076442741e-01,-5.763606281269365028e-02,-3.547564803526156441e-01,2.948984149226678286e-01,-5.578218636279406173e-01,1.233790626049523720e+00,-1.100495816194668741e-01,-7.754646354556579135e-01,-1.353514182587132741e-01,-2.188835264623607557e-01,-3.516399858425121594e-01,1.599949508769221151e-01,-8.407254201207695621e-01,2.282242323748790436e-01,1.827094284166624449e+00,6.053186842380395838e-01,-1.067767258975653444e-01,-6.179614766184939878e-01,-1.641290351417150628e+00,-1.522456727165176105e+00,3.813602434653182716e-01,2.090962378157957602e+00,-5.332331815364294014e-02,4.953470497591923594e-01,-9.723671150703806498e-01,-6.440228775698236818e-01,2.052053530615876475e+00,3.539801390922377999e-01,1.956441028061618015e+00,-4.172258122425631655e-02,5.256652675574267075e-01,4.054444157376977942e-01,-2.983898726757976405e-01,2.573993111383756638e-01,4.620136487297455408e-01,1.041700876166179235e+00,1.962532042351590178e+00,4.674542576125174098e-01,3.212280969404391895e-01,1.593681835730613172e-01,4.344038777776651372e+00,2.285939675782867830e+00,3.892762272897012932e-01,-2.196409114642680904e-01,2.339426499837873319e-01,1.067461264154799805e+00,-3.507126722686841891e-01,-1.362853924350014012e-01,-1.163837093025336777e+00,1.249138355466698602e+00,-5.971177099002934474e-01,-3.598037187890090749e-01,2.369516306521609328e-01,-2.453182110923989301e-01,1.138620184118899425e+00,4.535378427371240528e-01,-7.581008496741024061e-01,2.295935056597683266e-01,-3.773395451476048157e-01,1.135729853816648482e+00,1.899364807578386216e+00,-1.428960498807789747e-01,-3.520439817938026406e-01,1.000777714338355745e-01,1.762326072416759426e-01,3.920484165643279839e-01,-8.674173428186261470e-01,-4.121686611040364934e-02,-1.269420344563580771e+00,-7.165887523029443873e-01,1.234578051995664172e+00,-1.710783386792799621e-01,-4.726856784219932162e-01,1.848394199938564020e+00,7.207136393671763619e-01,-1.264909479186358210e+00,3.527877203177731680e-01,-1.226442170557962008e-02,1.094290112410378102e+00,-9.289903449986465223e-01,1.063551021578548639e+00,-6.476751734277976791e-01,1.000836147316888969e+00,3.302963035394979041e-01,-7.301562487029504833e-01,-6.838248054147646471e-01
8.575952009633868167e-01,2.722938288052769717e-01,-8.455275639725015613e-02,-2.723185383826827177e-01,-4.997510313582453345e-01,6.748967153019987952e-01,4.368710219197591282e-02,2.736746135146750358e-01,1.886166204755655107e+00,7.226729663335876852e-01,6.648906865128102472e-01,1.454224076447269698e-01,-4.713795193096941283e-01,-2.742828578824664243e-01,-3.010044931847375427e-01,1.975694955389452723e+00,-4.719911433198668016e-01,1.212062687063649724e-01,1.141364748899067194e-01,3.230350166808531598e-01,-9.575542350161211358e-01,8.945252739385319840e-01,-1.681329811587294887e-01,9.288925961611929627e-02,1.420280078344362096e+00,-8.745043980078158752e-01,8.742637563207251994e-02,-7.090851707839929130e-01,-5.007817120587428894e-01,-6.580345121589099566e-01,5.075526372826781873e-01,2.848870020075515708e+00,-1.944734421969941951e-01,-1.491316534108159120e-01,-4.940646190006625638e-01,-6.239129221425163685e-01,1.504190571852074276e+00,1.102829610008294825e+00,1.673017297491516064e+00,1.982781143263232959e+00,1.152344109861736854e+00,4.334578911056595207e-01,3.702973479309439320e-01,1.307432556887683228e-01,3.331933165299343358e-01,5.173940173688746924e-01,2.921689619611089306e+00,-7.245482285255311350e-02,2.679773174011093606e-01,4.774895926715773120e-01,4.383336377381347404e+00,1.888036252529120551e+00,9.470127266996449800e-01,-4.851628977822465272e-01,-9.497386476685991674e-01,1.758830029929553618e+00,8.183234590441759160e-01,-4.416074216628403937e-01,-5.015604742594411691e-01,2.526628548205885672e+00,8.433260844350825014e-01,-4.353896753239892004e-01,-5.717751837714493135e-01,8.798308942686985379e-01,7.312149748299372476e-01,-7.861610766716259358e-02,-3.388398466605002657e-01,1.397293269283736095e+00,-8.171296073464763554e-03,-6.328805678590418982e-01,2.978099985144277095e+00,-1.793386235039547416e-01,4.069557256545406898e-01,2.894819059035753650e-01,7.814493766301115751e-02,1.016483586562538788e+00,6.969294879321175085e-02,7.924144040207941053e-01,-9.361274838409726629e-01,-3.755293606857854627e-01,3.353060231710739414e-01,6.487515780392678622e-01,-3.506807323832534240e-01,1.441609662429199190e+00,8.471261474939749681e-01,-1.204341426624418787e+00,-1.186146382603388560e-01,2.297333769384452218e+00,8.384056249407177974e-01,-9.204983083433733171e-01,2.486461096853735953e+00,5.750636710252921002e-02,1.115253963808973570e+00,3.942014885877002106e-01,2.881968359537300239e-01,-4.424872597170607658e-01
5.859491549551989475e-01,5.776940662682243932e-01,4.200393814960648453e-01,-9.823271184862212291e-01,-6.015403163750160376e-02,-3.796549183013586681e-03,2.818879026812742827e-02,-3.226200814336852019e-01,9.926229225145183355e-01,4.915009792519972054e-01,3.212548550392289037e-01,1.751341336915480107e-01,-4.804161328990572688e-01,-3.921273987286250651e-01,-3.671297785474272324e-01,1.323676634865354584e+00,-7.730784806725300440e-01,6.594478436273480959e-01,-1.342948869787385924e-01,2.027112003510172233e-01,-8.734779759256507958e-01,5.056597588098513674e-01,-2.911658100694687890e-01,8.875245441256082723e-02,1.846114025281907933e+00,3.757420520333740188e-02,4.906137528259574276e-01,-7.308460512485737137e-01,-1.377482971077699014e+00,-1.283281261505916371e+00,2.991388234978648031e-02,2.899420951192600793e+00,-6.564920305248649335e-01,7.016819426511845814e-02,-4.969794571610822720e-01,-2.961600227182660250e-01,1.384019865945068428e+00,1.167952786419443001e+00,2.267105908232924349e+00,1.821082319675241923e+00,3.874712427584681151e-01,5.527698661971292005e-01,2.339142944233832400e-01,-4.186179942419899769e-01,6.800537097173297019e-01,6.956831222572090745e-01,2.675380506342700748e+00,-3.915748082521753326e-01,-2.064680635687705657e-01,8.642498266972953314e-01,3.097409458010310868e+00,1.761685167347670333e+00,3.348208666392143984e-02,-2.644251337964810822e-01,-8.701995349593690809e-01,1.990707239932287820e+00,9.648117354052146988e-01,2.572802820992955986e-02,-5.763659502984735949e-01,1.969653131777323152e+00,4.388218117438963395e-01,5.523231635594760824e-02,1.593745570781963106e-01,1.524618965574266349e+00,1.644144790521446353e+00,7.473771989097519608e-01,-5.539234454559037735e-01,9.874999916769677810e-01,7.283779224549621345e-01,1.091267798147182999e-02,1.762346874611721237e+00,-4.904961106777133706e-01,4.447063361179586227e-01,-3.005210587821596224e-01,-3.690365033570933706e-01,7.545705135478680825e-01,-2.802369937785017528e-01,8.018254766591826899e-01,-1.533635045383345163e+00,5.351504747414825847e-02,3.088965783230419038e-01,2.815384855192597513e-01,-2.634621886175346761e-01,2.007104267208193793e+00,1.074646814804534944e+00,-1.378606392580607798e+00,4.426930683518660037e-01,1.306384604502392355e+00,5.637699671134303037e-01,1.016602510008206006e-01,1.715951335746930040e+00,-3.443218073955076619e-01,5.332624443871303299e-01,2.419036452443183438e-01,6.280835731688680923e-01,-2.080733369631895258e-01
7.081988756479230540e-01,1.320457751984586148e+00,-4.572707394141019011e-01,-1.202856948192078113e+00,-7.447123829018673091e-03,-2.205597785606305816e-03,4.714474158648808144e-01,-1.313872238527923342e-01,-3.808412032980936779e-01,9.430823914409268427e-02,1.164774089466022566e+00,4.014301033863015289e-01,-1.538780100160539455e-01,2.562599061379375875e-01,-1.046775092159268450e+00,1.995558124045786030e+00,4.147484514224630270e-01,-2.557026373880774139e-01,-3.348705462340209049e-01,-4.513121363771775973e-01,4.119625104910051849e-02,6.504268604524796604e-01,-6.538012744379407826e-01,1.511668522931111369e-01,2.148205396722952631e+00,3.862762274471100432e-01,1.974807741398950656e-01,-5.310327973380923883e-01,-1.426305272557418791e+00,-1.859035464759076328e+00,-9.499874187766260691e-02,1.930638782125051467e+00,-5.054365846566116760e-01,4.962258841411318344e-01,-8.021891153644149508e-01,-6.927222831449648677e-01,1.673293026865122490e+00,7.270565741522916348e-01,2.846318201382334934e+00,8.166103225038725544e-01,6.012235899020568208e-02,5.423103220945096892e-02,-1.877560635539192169e-01,-9.769023171712361286e-02,-3.286770896498869554e-02,8.455089071588197669e-01,2.097523875416158479e+00,-1.109881484210304414e-01,-2.173397279980157637e-01,8.238441632173161278e-01,3.710752849593991431e+00,2.016173635496693706e+00,1.715757603793274799e-01,-4.082498344718494265e-01,-3.241390125872630756e-01,1.757525469979188237e+00,9.139898900316814068e-01,4.280679726865991297e-01,-1.523702187037470956e+00,2.060927538376187584e+00,-4.798271791784431972e-01,-1.950654734866463791e-02,5.560469497601068234e-01,8.887017905271830109e-01,1.283350891690482998e+00,2.557898425543816412e-01,-1.112907404168732128e+00,-5.355105548537270055e-01,6.085089573803450502e-01,1.251335693073535316e+00,1.746470560722648280e+00,-1.351343499339179299e-01,-4.510970081104748175e-02,-1.904695913995977652e-01,-4.157110059350417330e-01,5.462334820724532580e-01,-9.885021096614494684e-01,1.234176339103966402e+00,-1.430880614868190293e+00,-2.221735681992982880e-01,1.560300644611383181e+00,4.857943046300519097e-01,-1.861671234344185466e-01,1.763590906788227830e+00,1.701870599238172854e+00,-1.594884649450094116e+00,5.263481928508819685e-01,-1.684422269441943065e-01,5.358473807968375802e-01,-2.158446915844797198e-02,1.208314818828382098e+00,-4.649895750854990961e-01,1.994375188890326056e-01,-1.740419199589937627e-01,1.116000218055737347e+00,-5.098453259837392171e-01
6.956198078295982024e-01,1.176098235859673879e+00,-2.230125286347814373e-01,-1.003278680784012611e+00,1.246860058621088035e-01,-5.529413836090879553e-02,3.951982524356091875e-01,-2.554113901351885429e-01,-3.394574580096327843e-01,1.462526973553238685e-01,1.035767863304287273e+00,2.842098528897970544e-01,-2.277719015979162154e-01,2.668006229071665514e-01,-7.752458967975097703e-01,1.837365273830797729e+00,1.425545001621214558e-01,-1.594295749194631351e-01,-1.621402677766479172e-01,-2.575213026032138752e-01,-2.061235718685163198e-01,3.764458069700132858e-01,-6.254496290556473825e-01,2.432111180119353455e-01,1.919401311208382754e+00,2.274155568730983346e-01,3.289958510342742004e-01,-5.510330698927387028e-01,-1.047779415590646801e+00,-1.480202281017956478e+00,1.387919738380705148e-03,2.010968295560624064e+00,-4.453820042757080655e-01,2.596326351000488586e-01,-7.178557352021803784e-01,-7.098024218273765173e-01,1.390568183765609422e+00,9.328695700196564244e-01,2.493925723537342876e+00,9.408536781148694184e-01,1.197401480236420790e-01,9.631833854551785645e-02,-1.792026151531185274e-01,-7.658889885506638129e-02,1.338909647601022601e-01,8.835136062606713248e-01,2.186802010368262827e+00,-2.371100822964093413e-01,-1.929986619124082203e-01,1.077277704949936243e+00,3.539628415249238547e+00,1.648640309056893294e+00,3.694409534692111308e-02,-4.691326433069757940e-01,-4.228191072739173606e-01,1.690931706358751452e+00,7.907353341709388861e-01,3.907975579863764981e-01,-1.153135627399875851e+00,1.556916714160788917e+00,6.259580349594759396e-02,-8.520510928060159861e-02,3.501498753694310961e-01,9.963764752247861178e-01,1.130780081535395443e+00,1.543860811963857493e-01,-1.009640661373897741e+00,-1.955971267818216175e-01,4.313547726689415107e-01,1.042847908788344657e+00,1.837566027909679045e+00,-2.994654369000044891e-01,6.671886066601384613e-02,1.515500957065007703e-01,-4.753669191765571567e-01,9.265835276861861258e-01,-6.976989396975141755e-01,1.119571515165383335e+00,-1.092733347817646639e+00,-2.618687670785070365e-01,1.078674480380924283e+00,2.815826080677013010e-01,-6.665583487777579363e-02,1.653229303154273744e+00,1.383612011061362779e+00,-1.327696426360621684e+00,5.569519129227400445e-01,2.578756068265768420e-01,4.575488651864261791e-01,3.134431057816239874e-01,1.206767143495676819e+00,-5.757618628729732624e-01,2.663086521924219463e-01,-6.763639734796283998e-02,1.196813520027690148e+00,-3.084219979249009369e-01
8.212396747260580776e-01,1.202934171345708458e+00,-6.442913971368352533e-01,-6.829713657453427844e-01,1.537065471540606520e-02,3.166224679422586785e-01,8.213900274872216745e-01,-5.551238367470306273e-02,-5.029674999094084775e-01,-6.450627717498269575e-03,1.170441184911163779e+00,1.688192391565909722e-01,-1.729695921659567259e-01,5.079958750833993841e-01,-8.510636911431244123e-01,1.974621531526719931e+00,4.091589836010691150e-01,-8.037606877619926093e-01,-7.594824621532400566e-02,-3.771879171459935898e-01,-3.128456092561759938e-02,3.803413640064096657e-01,-7.599499270302325638e-01,3.036765051041043773e-01,1.820378510451134524e+00,1.535352046784414226e-01,3.966584947873505462e-02,-5.214715923783325158e-01,-9.353096137565013457e-01,-1.422592327785694444e+00,2.490070575500616668e-01,1.749471445422932980e+00,-1.013072567362970633e-01,3.892750738117534692e-01,-8.564238098025075407e-01,-9.236677019818708700e-01,1.602856480816442053e+00,6.532107389160590749e-01,2.328205060269467719e+00,3.994811370291048158e-01,3.543647953044036791e-01,2.314537791477710993e-02,-3.515045990015200905e-01,2.596343988364345212e-01,-4.684071992623106695e-02,9.435323152668803059e-01,1.939000397826746269e+00,9.398957527021828406e-02,1.151550219422747823e-01,6.566782767672278975e-01,4.311589373925090563e+00,1.914519476427698264e+00,3.582630282116709419e-01,-5.347012669368801374e-01,-1.198031628749061661e-01,1.372953503599774638e+00,3.727600060588449615e-01,2.336345440446081223e-01,-1.291402871284446530e+00,1.569215397849996085e+00,-1.585937172941059570e-01,-4.493505096885805905e-01,1.561263013022795298e-01,2.322854879179714893e-01,7.054792725028782296e-01,-1.776511274202681179e-01,-1.074828277044590275e+00,-3.374809602921290397e-01,-1.451704540905218999e-01,1.317761264368597862e+00,2.173032945710368313e+00,-5.405590662675818781e-02,-1.574306085941915567e-01,4.702575509789591601e-01,-1.898981568262947950e-01,8.830914018722791914e-01,-8.718816600707288700e-01,8.518483923173036931e-01,-8.329597823213230612e-01,-6.738692509789361296e-01,1.379353932419364881e+00,2.452052358032759116e-01,-1.667425326484016090e-01,1.497293469279217248e+00,1.220890976427619679e+00,-1.293726781842704288e+00,3.751469476517088064e-01,8.252016083690316695e-02,7.145795927104694467e-01,-2.770012830170460183e-01,1.162286255659458423e+00,-5.028692000759309444e-01,4.891505268439439447e-01,9.666806317701504003e-03,7.217708023449236343e-01,-5.694450790094633952e-01
9.051950270386431852e-01,8.110042188729487123e-01,-3.482605643701505715e-01,-5.597053716220657948e-01,-4.313544666275809236e-01,5.240849349074216956e-01,1.347240291960002667e-01,3.222169434156699208e-01,1.395821385460486397e+00,4.660776105762929333e-01,7.856687599896075014e-01,2.830526847183487127e-01,-3.550541730298870102e-01,-4.830659520984421917e-02,-5.899279938508282806e-01,2.095671088658920933e+00,-6.428112539019759097e-03,-1.263484192013512308e-01,-8.455057494740567114e-02,2.263714391288996694e-02,-5.768509153095306985e-01,9.148231100357667733e-01,-3.627052776680473323e-01,7.023332820365492390e-02,1.657067750654610538e+00,-4.631512273723002449e-01,-1.588772319488468421e-02,-6.242712290767145067e-01,-8.137842862932772592e-01,-1.077240526363214546e+00,3.506279783439323339e-01,2.471156465328065543e+00,-2.584146729901709016e-01,7.856939156413950132e-02,-6.656704413580780688e-01,-6.732060363319125607e-01,1.754890961059187404e+00,8.542376183251144672e-01,1.966081817280612043e+00,1.454875291415138161e+00,8.969762936204519477e-01,2.781126982190295083e-01,2.193536398126434417e-01,1.825451712073635768e-01,1.414947408049926358e-01,6.153912886125864068e-01,2.714480590984492014e+00,8.552135488476474146e-02,1.785073354368254539e-01,5.140754199513350997e-01,4.408646580471176080e+00,2.030813090529246967e+00,9.106732309158576122e-01,-4.306748823039170948e-01,-6.195916750418901664e-01,1.648512894066709089e+00,7.321802536675174888e-01,-2.439954196900471217e-01,-1.010318836025954070e+00,2.451246498157416021e+00,2.105097339977413384e-01,-2.406747955628102398e-01,-1.901900304269619757e-01,6.903263598207959317e-01,8.602263285907192358e-01,-1.255869893619865341e-02,-5.348424474152637664e-01,6.903233027872728300e-01,1.268193179847885155e-01,-7.270365139632894991e-02,2.730224700113571323e+00,-1.163343105951452627e-01,1.223990954393193581e-01,6.356436731801747009e-02,4.029018466940717524e-02,7.323363482727694995e-01,-2.683337636622634692e-01,8.965478127440760225e-01,-1.153930969186591993e+00,-3.475538913643633765e-01,9.452413634381980900e-01,6.587143311837815318e-01,-3.557555400509764265e-01,1.463719170448621210e+00,1.156827720147208138e+00,-1.335344050662245152e+00,1.223227252652231423e-02,1.419211726396824913e+00,8.220656905206477072e-01,-9.494964930508467127e-01,2.173017279252490219e+00,-1.209564623517948578e-01,9.997030123889220077e-01,1.965821758059226876e-01,3.170041498172297967e-01,-5.345404218836444787e-01
1.025315011730300485e+00,1.082156066441775533e+00,-4.616911900200621477e-01,-4.297979305148234008e-01,-4.765198869211440535e-01,7.480115752280714903e-01,4.991669912068057990e-01,4.390055591628493348e-01,1.647529678211460569e+00,1.424642930046830513e-01,2.054323542780516210e-01,9.784111956638444352e-02,-4.213406350611592632e-01,1.865322742405919193e-02,-4.905990515586046152e-01,1.675393263789260567e+00,-9.059469445428880441e-02,-5.321880390303569408e-01,-1.284030130781302070e-01,-1.248424849820919252e-02,-6.043035383841482977e-01,7.318300510592512520e-01,-5.597774386755192122e-01,5.384547703594522172e-02,1.659599584329289668e+00,-6.057271060073864816e-02,-2.968287990714351121e-01,-6.466478121221183040e-01,-1.303149732301808195e+00,-1.211660627958110581e+00,5.349305668527682966e-01,2.440568978456008065e+00,-5.341539407284592866e-02,2.688729935670686744e-01,-8.739776459615880011e-01,-6.138178570510011145e-01,2.239579495876447446e+00,4.306655724339895630e-01,1.664761885579688183e+00,6.757450886172187143e-01,1.062730280658296778e+00,4.545138504397132628e-01,1.121284910644797933e-01,3.891309139796708116e-01,3.534328294810605842e-01,7.576493097790160114e-01,2.540018145735265520e+00,5.700998047307981320e-01,4.615021208235808303e-01,-8.315226429484234849e-03,4.837649519341208126e+00,2.431685747792014407e+00,1.080085426000462645e+00,-2.333730657479008430e-01,-9.844315020871863275e-02,1.208500073464002345e+00,-5.405166211509004892e-02,-5.243025194421373492e-01,-1.131895572858388155e+00,2.130073725510624794e+00,-3.709109919257516097e-01,-3.080516209502300318e-01,-1.288888384357202432e-01,-1.136146739556127550e-01,9.570076657384712915e-01,2.579057155865179807e-01,-4.007511677404905770e-01,8.016532708602652768e-01,-3.249359603202213176e-01,1.164685332202787249e-01,2.648940953024114364e+00,-4.808277051665105217e-02,-2.271005159372560533e-01,-5.771261826202658818e-02,4.315769186039873917e-01,3.149199194184868489e-01,-4.357395885061252083e-01,1.470564314971433695e-01,-1.349968006682956911e+00,-5.942778363959650978e-01,1.162714070295400637e+00,3.225722648336765697e-01,-6.090462208842262193e-01,1.612525191801782221e+00,7.849997991683954623e-01,-1.302957638221639236e+00,-5.149325071497706796e-02,1.000659821773523417e+00,1.210534004900353677e+00,-1.694419075942762420e+00,1.970122542021777834e+00,-2.669707582328830764e-01,1.454044784097399790e+00,4.057542968177370035e-01,-9.409617399277192540e-01,-7.591673337065594218e-01
7.825846340680416846e-01,1.497969800922878125e+00,-3.292369436813747940e-01,-9.010316016208899104e-01,2.524313452351513165e-01,-5.190992536817218284e-02,5.951921367007050323e-01,-2.514693105573310161e-01,-6.106974489213801149e-01,-1.106767881381876817e-01,8.764551883910960406e-01,1.921593850383283286e-01,-2.193672031071033646e-01,5.127765218427491334e-01,-7.177147039769190551e-01,1.696404387675784164e+00,2.604562335574227006e-01,-5.176816189702840854e-01,-1.309498373289529061e-01,-3.272244738291680277e-01,-1.331091390751535375e-01,9.057644753347782185e-02,-8.220150177211362763e-01,3.227742048069600633e-01,1.847888301268377331e+00,4.561160630416897788e-01,2.270742913107338667e-01,-5.091456548514841085e-01,-1.020343868273731136e+00,-1.443373227154693517e+00,9.532338664230854963e-02,1.748270037328372606e+00,-2.904693380994804452e-01,2.842124089576053558e-01,-8.514968414167802813e-01,-7.981509127675495696e-01,1.491556983390945668e+00,7.627432980117803130e-01,2.246988897843663402e+00,3.391033137846408696e-01,1.041101509414550930e-01,5.679850504631112074e-02,-3.483505888883799972e-01,1.217509472663710207e-01,1.658319565120573436e-01,1.040082003092738461e+00,2.015839161767367660e+00,-2.609370352198709525e-02,-7.618515961198916997e-02,1.085634061336617329e+00,3.715535760662667997e+00,1.586947603089919667e+00,1.811450135293618535e-02,-4.502240974442598409e-01,-6.528670648923873276e-02,1.351602505278362898e+00,2.961936672244851465e-01,3.758024355865239308e-01,-1.233655125788969631e+00,9.576170356113200555e-01,-9.202602299581272294e-02,-1.216733279614238550e-01,3.916607567175514060e-01,5.491703308199040734e-01,9.969943066961428624e-01,9.530602915858354951e-02,-1.029547376163571837e+00,-3.777599958487433129e-01,9.111314864644194655e-02,1.358901528956605320e+00,1.815059388095594528e+00,-3.255645559403156364e-01,-1.805307392825186708e-01,3.576783379307095223e-01,-3.759452577231258141e-01,9.542758345193778080e-01,-7.534717805992634521e-01,8.134628845348956805e-01,-9.197936886836338699e-01,-4.513947444479444737e-01,1.194717859504080826e+00,4.565864443643874448e-04,-5.522601659994330614e-02,1.566901803088656564e+00,1.162358248898315294e+00,-1.154914475982992128e+00,6.110261718336666981e-01,-1.157158691648554338e-01,5.462553844641333534e-01,2.452696389154910839e-01,9.233407403658523416e-01,-8.221933673429373535e-01,4.302906864865065906e-01,-2.973018782933012361e-02,8.252508762186463454e-01,-3.150124473472769027e-01
7.381702121763547009e-01,6.773479039908517629e-01,-6.027820212653276638e-02,-6.092767539634831309e-01,-9.828610348685916376e-02,2.908103968534300199e-01,3.491827669470050077e-01,-1.146108409648616544e-01,6.087579247288065210e-01,3.696230239747915203e-01,7.149824259534313109e-01,1.170148740729450298e-01,-3.785899342929960332e-01,-1.001680622224689760e-03,-4.571514461374933669e-01,1.690505034132498752e+00,-3.230359723606935907e-01,-4.065274972123393560e-02,1.447286236723040881e-02,6.390733321185704252e-02,-6.367478121672349722e-01,4.625348036464503321e-01,-4.371916460306944918e-01,2.095635862990627707e-01,1.654200608258930449e+00,-2.011948232020028537e-01,2.520910245897614033e-01,-6.512851695770152105e-01,-8.615401402118185725e-01,-1.059225096200159699e+00,2.747355058232791025e-01,2.456987379411645467e+00,-2.896111085673335750e-01,7.380457597404775638e-02,-6.102545115697139977e-01,-6.382607976821671469e-01,1.403539948349446398e+00,1.011688023825027871e+00,2.037115729061166558e+00,1.332884608226596379e+00,5.878550283684457201e-01,3.281073969113465494e-01,2.926330518885440074e-02,-4.713243838186560730e-03,3.563370793156969141e-01,7.626075778191292454e-01,2.455638280530741735e+00,-1.610445526053126963e-01,5.592019596842176532e-02,7.454762715084612967e-01,3.861047788116375390e+00,1.747024716739113748e+00,3.441145065641250667e-01,-4.516265513845629798e-01,-6.259680421114890425e-01,1.666927701303913212e+00,6.513959336582246795e-01,-2.143714832529357295e-02,-7.120352949089808758e-01,1.797576150588824362e+00,4.826143410083065799e-01,-3.143060623703161083e-01,-1.021272652234028466e-01,8.691905405043091060e-01,9.823905926311964354e-01,1.325076269777467619e-01,-6.824968733700510493e-01,6.776277258389509228e-01,1.231472522826024957e-01,3.170261469062860549e-01,2.259164464200507538e+00,-2.817765138378336975e-01,2.380990443246399635e-01,2.786571969230259849e-01,-2.022191627635483435e-01,9.982113249787976095e-01,-3.463952128388225193e-01,7.749993236086898385e-01,-9.860021681983393016e-01,-3.718859653638873497e-01,5.808892714522549960e-01,2.906295655041982728e-01,-2.108450310485676105e-01,1.633037750815986122e+00,9.663586156754679912e-01,-1.219627240235771071e+00,2.819659090626223108e-01,1.207615024052787644e+00,6.735769304460371698e-01,-2.002174107952067184e-01,1.680580075652335692e+00,-3.311958710744212775e-01,6.736792770440978018e-01,2.276071636481081795e-01,6.056122818433085087e-01,-3.551046626726220845e-01
6.133580826594280389e-01,8.821656026471392797e-01,3.095303675020060208e-01,-9.079283231006403110e-01,1.118473809149983372e-01,1.445525865277314526e-01,7.885334703841417880e-01,-4.750509676985283924e-01,4.432296935656328540e-01,-4.646205335039674256e-02,-2.804273658758968391e-01,-1.489387094741380091e-01,-5.162012982577049991e-01,-1.880000919340349963e-01,-3.037042304796695458e-01,6.090920225653881914e-01,-9.139055688207193828e-01,3.904059105882756731e-02,-1.630462246819656402e-01,5.370513167326066567e-02,-7.640087206480856707e-01,1.262441860215202105e-02,-6.473419552511299191e-01,1.724147255280499003e-01,1.940465323215424087e+00,8.108725876367620655e-01,2.739513569068091625e-01,-7.544536107785048129e-01,-2.125120315774462476e+00,-1.604589565665886841e+00,1.777612536736671855e-01,2.705436956135143234e+00,-3.928540100004592750e-01,4.376952132456017885e-01,-7.704130291004516184e-01,-2.567969332272285188e-01,1.808896303876140976e+00,6.489833798863064995e-01,2.131382309156296451e+00,5.865839193915971528e-01,3.050426107074720727e-01,7.388662309690819940e-01,-1.251761245717263882e-01,-2.682784713220260908e-01,9.678319605056660002e-01,9.977573305361786549e-01,2.117954063403445275e+00,8.534981922793437314e-02,6.316723451561459535e-02,2.725552668291275626e-01,3.369379597985583175e+00,2.194868184514044529e+00,-1.483624177663046551e-01,-5.165263101100342480e-02,-1.366376700620091089e-01,1.447005478851993931e+00,-5.405958898474316765e-02,-9.097431778802618496e-02,-6.903631625191040122e-01,1.231194282572840581e+00,-3.179515659626216406e-01,-1.405476323129337957e-01,3.798672600917176734e-01,5.149426590621274391e-01,1.820683767164681832e+00,1.135104100741461730e+00,-6.219261651943690516e-01,8.410495072907411274e-01,1.514020733603868296e-01,7.984628609317725445e-01,1.275132573857060470e+00,-4.191963186906909611e-01,2.186311534675509927e-02,-3.192079068252164920e-01,-5.337745085928469885e-02,3.292888174756664621e-01,-7.445971929773516074e-01,-1.547942412206902985e-01,-1.692044859132383783e+00,-3.382584996663333676e-01,5.728435184766546007e-01,-3.469981672773218007e-01,-4.923806059003772440e-01,2.330846770618912434e+00,6.117608045130284999e-01,-1.355590267392454695e+00,5.659950726686997502e-01,3.283404024267737586e-01,9.637065744730862749e-01,-3.565628230590580650e-01,1.000109682565337277e+00,-6.476639974909026432e-01,7.634981564476824856e-01,4.577451436345474356e-01,-6.696269532751519815e-01,-4.631983217819064524e-01
5.207971813097505009e-01,1.053400758911360979e+00,4.309843013880939600e-01,-1.319736876328112318e+00,3.031863829227087193e-01,-4.854308760250726773e-01,-4.201117820356953247e-02,-5.834977828781939824e-01,-6.271809063562983066e-02,2.991039300052907857e-01,6.275898653517173464e-01,3.098369823624321784e-01,-3.579476784290878122e-01,-8.492784909195494336e-02,-5.375386198801486159e-01,1.411214836483995594e+00,-4.274190185160700040e-01,6.554733254942949339e-01,-2.166183883485985895e-01,-1.876705515294860988e-02,-5.635784568471038369e-01,2.188224713674314370e-01,-4.698667153415487796e-01,1.913538930833527940e-01,1.985859263823916088e+00,3.904224531341091708e-01,7.069892745096798548e-01,-6.255829947432779425e-01,-1.272489684620305317e+00,-1.479529059662370027e+00,-2.422970879946479972e-01,2.449085463931633733e+00,-8.277128610387254337e-01,8.236857077199204180e-02,-5.409791719901752005e-01,-3.865829679178391376e-01,1.121909129013488160e+00,1.271702897312598557e+00,2.552151496416886101e+00,1.537314219410768512e+00,-1.313311975132890330e-01,3.007340288185570421e-01,2.062917500369317730e-02,-5.095342456795886044e-01,5.353417614133382241e-01,8.505301165482069825e-01,2.468688132696597037e+00,-6.174977491946332941e-01,-5.141772205020466169e-01,1.510923165243848842e+00,2.531930669377449483e+00,1.323678681225390452e+00,-4.386820658704647657e-01,-3.392873518683496847e-01,-7.540292679999868186e-01,2.009256774721755789e+00,1.107716693663525431e+00,5.018737185272410528e-01,-8.095196631112732133e-01,1.329672617137474200e+00,4.025050620144652314e-01,3.115034235106418636e-01,5.403505504858902020e-01,1.848638098414983055e+00,1.714986115395724653e+00,6.905472716559021285e-01,-8.557846506734958503e-01,2.187045657055472492e-01,1.019140630696818928e+00,6.588261065169870312e-01,1.341897501077867538e+00,-6.552088509997558985e-01,3.555965465612712650e-01,-2.055777821028028363e-01,-7.701983875600156848e-01,9.848723371457653863e-01,-4.398186869494645768e-01,1.189048001376048713e+00,-1.406099130321713631e+00,1.969818206119875459e-01,5.078809597071293203e-01,1.492975517259762797e-01,1.773070967807871545e-02,1.933220955433877508e+00,1.361133125574382152e+00,-1.302905898376920391e+00,7.962737090812932461e-01,5.592653795258428762e-01,2.119054694912010373e-01,1.021906469878221868e+00,1.191666943687218705e+00,-7.121257979319050024e-01,8.048264529857440674e-02,-4.507880973033517868e-02,1.484342587138710812e+00,3.000258964275209772e-02
7.362006145389479173e-01,8.810860810371272667e-01,-2.635999249379637477e-01,-3.748367352525261431e-01,2.063086471265931920e-01,4.792850047553136594e-01,1.372190442806594080e+00,-3.948914397763894635e-01,-5.469324324926032599e-01,-2.296442623873071465e-01,3.455442082747158250e-01,-3.112483776485355236e-01,-3.693539936204741636e-01,3.943083915173468679e-01,-3.901861507575851151e-01,9.958474503476997253e-01,-4.091302975946872755e-01,-9.312164198286918548e-01,1.182516340797780952e-01,-1.281513785285016138e-01,-4.376668995439022547e-01,-2.358223570590787244e-01,-8.711328075508828483e-01,4.213427131343635557e-01,1.657910210026205311e+00,5.272456279157501369e-01,7.296210372174677383e-02,-6.547749071132706877e-01,-1.351663869929837114e+00,-1.256762999403337133e+00,4.966877810558368855e-01,2.063750645719195642e+00,1.301297304494353768e-01,4.400798104590940563e-01,-8.853184467812066361e-01,-7.552734938661929132e-01,1.618599073659101384e+00,5.307189475282818591e-01,1.878759513459258290e+00,-1.045681348441853675e-01,4.488338674980638099e-01,4.220205923568572937e-01,-5.152333818894110351e-01,2.282931005485016596e-01,5.674108395796158000e-01,1.147051917000301735e+00,1.662645344048112150e+00,2.578678403078710768e-01,3.789455259509397211e-01,2.067778659598244473e-01,4.224535700025657370e+00,2.034320799617824971e+00,2.652790511969488341e-02,-3.635709525497636263e-01,1.565684389755019890e-01,1.033358245903974959e+00,-4.679182125585162888e-01,-3.442930218953400845e-02,-7.199528021184815607e-01,7.498210282529369497e-01,-6.424172053640561653e-02,-7.592095856797259623e-01,8.792915270313336057e-03,-3.094984252740391462e-01,8.801981407393157930e-01,2.623139371326909663e-01,-9.071572174749285011e-01,3.848041348442241549e-01,-7.195747225667880054e-01,1.429862133689039805e+00,1.795646118246500222e+00,-1.725630115763075456e-01,-1.772856945630582048e-01,6.615325190704760550e-01,4.845968174168120701e-02,8.519032606981521427e-01,-8.866155791141487885e-01,-1.878635420520730070e-01,-7.801219671183459159e-01,-9.775979245378313420e-01,7.740174000066403215e-01,-4.675942043653099067e-01,-3.322976210715280487e-01,1.861149900010948155e+00,3.932453591077264554e-01,-1.087985539069945773e+00,4.509568710127779823e-01,1.387308974030989628e-01,1.032568500974807124e+00,-3.964275974607480157e-01,7.345796323520260573e-01,-6.805884319469579502e-01,7.556703645928418700e-01,4.420525863864170901e-01,-4.485310951963949466e-01,-5.967732000805338055e-01
5.408958069765091858e-01,8.496348171568899321e-01,1.680950457786848928e-01,-7.998981412414133407e-01,4.387273285970490488e-01,-5.686995070401562602e-02,9.137927870683197895e-01,-7.314654961415509860e-01,-8.701068795652209253e-01,-4.761428560091721107e-02,5.010607638217905446e-01,-1.366245889991929419e-01,-3.632859875827095797e-01,2.332666798326572533e-01,-4.032942292475308887e-01,9.856162799637765426e-01,-5.661295085528688098e-01,-2.289270510250163704e-01,4.067502344353895322e-02,-7.412768696772434329e-02,-4.957771669017216887e-01,-2.862822582299926477e-01,-7.397415792931842926e-01,4.117258584178172809e-01,1.798966504742245842e+00,5.905398642701460421e-01,5.016498924732158970e-01,-6.536941063834782462e-01,-1.310306804386123014e+00,-1.342769588909774159e+00,1.358564790846464032e-01,2.195283127094211917e+00,-2.871089475421456094e-01,2.924882913480023605e-01,-7.006866683857579936e-01,-6.018468589408345615e-01,1.177073518269571961e+00,9.478836156236072341e-01,2.245153565127735007e+00,5.411502477359366736e-01,1.458090138617607057e-02,3.755544299392042928e-01,-4.106505320321088282e-01,-1.923369504189637036e-01,6.390702154905207877e-01,1.100281964606490304e+00,1.833575950400065047e+00,-2.776966949307727028e-01,-7.630537424979970396e-02,8.986522228316345950e-01,3.207525740024890659e+00,1.565153359662547761e+00,-5.001414407712324595e-01,-3.890586340310686619e-01,-2.548105023114772827e-01,1.479358196860030228e+00,2.002372211451478867e-01,3.455252633113925498e-01,-5.933138931526460436e-01,6.595307419754513623e-01,3.103321512496882706e-01,-3.765234879517146416e-01,2.743722652671972684e-01,7.208915542065618132e-01,1.269110257314927770e+00,4.813339905262509211e-01,-1.002262446344099001e+00,2.657498527204853467e-01,1.762575181777668171e-02,1.360642534770410084e+00,1.346714869627130717e+00,-4.528390147865173909e-01,1.304899476894529342e-01,4.488935877430814125e-01,-4.577496714313434856e-01,1.088641995041296440e+00,-7.619585521115324056e-01,3.783365682727047874e-01,-9.176769329218780191e-01,-5.062653714961177220e-01,4.678084813237748385e-01,-3.898590088795972908e-01,-8.575249868540696374e-02,1.974646669188074188e+00,7.265574474085471079e-01,-1.124621982643361884e+00,7.507619916530963167e-01,1.914551892692092361e-01,5.826977091098770600e-01,6.678373035656928192e-01,6.421382945751979987e-01,-7.929587109387050692e-01,2.377841907610878103e-01,2.355678902184422663e-01,6.279809732873375960e-01,-2.344655621532230616e-01
7.238702915999436494e-01,8.275319464794981261e-01,5.370845393530933043e-01,-7.773803272166553979e-01,2.483980303070713880e-02,-8.660109441944396913e-02,-2.652011560095163811e-01,-2.197324995298769457e-01,1.372208527729267935e+00,4.669401446890276697e-01,1.173737013956870356e-01,1.646631553081648325e-01,-5.430926063209412513e-01,-2.566540704703735298e-01,-9.670903042335993183e-02,1.340507008783936138e+00,-7.833912258400301809e-01,6.587716888708429197e-01,-1.720633239278019505e-02,3.627381540842287699e-01,-1.084639286245640211e+00,2.742872370665262460e-01,-3.248821487654225404e-01,1.466930683711011596e-01,1.558850511697400076e+00,-1.354655668428368653e-01,4.931378555083389958e-01,-6.911909314587466602e-01,-8.374718161012169038e-01,-8.367495575962016208e-01,1.540001315668458881e-01,2.818964472159849244e+00,-5.851373484409075898e-01,-2.560495546914874354e-01,-4.961833158579562753e-01,-3.619381516465398074e-01,1.271799350387502914e+00,1.287882357420802260e+00,1.678222982417850950e+00,1.770217711357598978e+00,5.408346297944939263e-01,5.079427075550266846e-01,3.000444869006489435e-01,-2.119307229542216620e-01,7.631850719920665327e-01,7.429933557809207390e-01,2.931127384121697155e+00,-3.419585910585771771e-01,-1.460217545227457947e-01,1.267935082369571420e+00,3.112261239659976475e+00,1.308728770056581059e+00,1.363450475977689980e-01,-3.058292646412162918e-01,-8.084554342994885179e-01,1.748436882850685103e+00,6.799602594678691991e-01,-7.930620789412815008e-02,-4.134386946419315589e-01,1.311085381556425844e+00,8.618531071496171592e-01,1.775262880639892904e-01,-1.501815310001523851e-02,1.498870830602708093e+00,1.394311696499601183e+00,5.423415074010349279e-01,-3.455873563583079511e-01,1.199144809383323018e+00,4.998412870276415232e-01,-3.277248282314753069e-01,2.079852530431775648e+00,-6.931772376963514226e-01,3.650451468196762028e-01,2.407629649814541084e-02,-3.381637795028807902e-01,1.100607634470208929e+00,1.505106767238676979e-01,7.015005569582348777e-01,-1.171406194569499126e+00,4.826995823622437509e-02,2.465508106014835388e-02,1.159507739178086555e-01,-1.355263825047158810e-01,1.688838672906354699e+00,7.756390801860055806e-01,-1.000858913512380211e+00,4.183822461948131233e-01,1.679925897327346762e+00,5.000653398748566847e-01,2.167443249959973284e-01,1.843968744409739235e+00,-5.835368291566638277e-01,8.585039763968593807e-01,2.977071678901885843e-01,5.412963065211394698e-01,2.708510495592442169e-02
7.656629989580225892e-01,7.240980562182441904e-02,-9.734830924239141758e-01,-3.546907975893329734e-01,-6.737796896104959465e-01,1.124301360410754125e+00,1.067010752304799359e+00,3.042465251916611213e-01,4.327865553724840053e-01,5.284868746319607569e-01,1.588295575447510766e+00,1.390070419206717867e-01,-1.814668335903625584e-01,3.290365928971111797e-04,-1.056716516604740974e+00,2.398633693136327238e+00,2.366170907192416961e-01,-7.945530986452573607e-01,-1.464852260023694758e-02,-2.753261420494352296e-01,-1.103491533963347759e-01,1.295863249601172384e+00,-3.484854525276094295e-01,1.181535830737425463e-01,1.863517395463370363e+00,-6.405184994893763362e-01,-2.233719821036109499e-01,-6.656090995857569803e-01,-1.103618724765254466e+00,-1.453081471011995252e+00,4.837311064281585304e-01,2.347502135694104375e+00,7.063135272891696292e-02,6.019470968414089018e-01,-6.898708436767029273e-01,-9.126216408779209699e-01,1.827175082246262683e+00,5.913994415859589182e-01,2.709828727611095722e+00,1.306407405407759681e+00,9.667509703457810577e-01,2.033782262449422840e-01,-7.346088963470805144e-02,2.100301073377184857e-01,-2.788369386966195185e-01,5.448696109166193402e-01,2.049773686131880268e+00,1.438509780181966846e-01,4.164843527375382548e-01,-4.575370577625584856e-01,5.237731034461876156e+00,2.827854661365289068e+00,1.060888074553018257e+00,-6.046908465354599027e-01,-6.649341515769326971e-01,1.828125434646246994e+00,9.901775594466613040e-01,-1.983594504613714060e-01,-1.163899240099428356e+00,3.597349022372764438e+00,-1.815015230133309176e-01,-1.055665577137079092e+00,-3.824873613992355592e-01,9.522979661250641215e-02,5.076790420485293165e-01,-3.596169907617767780e-01,-9.959309824455905291e-01,3.381338762550308297e-01,-2.122311961020589832e-01,6.473540455739135169e-01,2.804504506999372371e+00,4.945060590083323881e-01,2.260660913151286699e-01,2.464967806878651524e-01,1.853000913265451244e-01,5.131962295568073262e-01,-1.013560560840149005e+00,9.968339799245409250e-01,-1.092751445237767793e+00,-8.609517903802186289e-01,1.439636854236902241e+00,9.794669790544383581e-01,-5.417479819675012909e-01,1.662334771037017767e+00,1.430110172449390760e+00,-1.825508012143056025e+00,-1.965499920860634409e-01,1.085980642159692922e+00,1.083503277973467460e+00,-1.480252309442968262e+00,2.041055497330880097e+00,4.823397377367886207e-01,5.588640824011036345e-01,1.926287982727353243e-01,4.665392024700165674e-01,-1.118821060420184921e+00
1.010318369067374045e+00,1.581818976634564944e+00,-1.628067852840185958e-01,-7.825580940782232986e-01,-1.988499195229741778e-01,1.854412469316023826e-01,-2.140264756025334059e-02,2.871675710690967942e-01,1.484081295139210166e+00,9.425535734271098254e-02,1.399266941807559284e-01,2.908722040086478833e-01,-4.144267932054779280e-01,9.997058185557336496e-02,-4.404052305388413413e-01,1.676795894920098728e+00,2.175338944178484279e-03,-1.152397615940501802e-01,-2.311353901445804826e-01,-1.119113022349003256e-02,-6.175472048402517178e-01,5.165641021297350255e-01,-6.030501121285473110e-01,6.353052877448597813e-02,1.699618959871646018e+00,1.512798295496169121e-01,-3.641662897312070157e-02,-5.757699136638795290e-01,-1.131925227842171422e+00,-1.208047137559616235e+00,2.617440278102899920e-01,2.300146538524682427e+00,-3.669658432528909442e-01,5.379135609579929755e-02,-8.424576786407247386e-01,-5.379209256916137605e-01,2.011884128156652629e+00,6.685013672282443808e-01,1.647214158839860554e+00,7.933808656250478375e-01,7.045963816800179247e-01,3.336035181346728162e-01,1.670033813621354390e-01,2.420631559516338571e-01,4.119475025751177522e-01,8.214630646384628587e-01,2.755414919485986935e+00,3.212937716531642507e-01,1.147666290948659851e-01,8.087496806139069516e-01,4.065307531002010144e+00,1.850631570079959376e+00,7.314214877591426189e-01,-2.153357364498340587e-01,-1.443350320335757275e-01,1.283275092680485230e+00,1.360600722745459179e-01,-2.286571155991255211e-01,-1.205140360491016027e+00,1.498877386564902547e+00,-1.885621559184497420e-01,2.200352613081143494e-01,1.885459035264910876e-01,5.217556462694117325e-01,1.205890308075554973e+00,3.885739134240955295e-01,-3.971589886559637184e-01,5.085066186115936304e-01,1.498334625821584887e-01,1.095238440447174888e-01,2.359629606632358989e+00,-3.936199209732781368e-01,-2.352549164318220032e-01,-1.686326859225563413e-01,7.433566649496421708e-02,5.310832742336726309e-01,-2.114592743566285904e-01,4.889197889053142343e-01,-1.373827448991094213e+00,-2.069777224476311295e-01,1.060824384427998979e+00,2.285577403397052454e-01,-3.572738692826528117e-01,1.514026597264219065e+00,9.607207255484715436e-01,-1.126899456407430167e+00,2.394049917656252691e-01,7.936738408574250947e-01,8.394187435939258757e-01,-8.660062192756485810e-01,1.806725026161145831e+00,-6.545060964417008798e-01,1.281141062841272937e+00,1.999113570687871544e-01,-2.997407445088806077e-01,-3.645874134241723352e-01
6.658477484268481295e-01,8.999448850204245787e-01,-1.105847732101320480e-01,-7.131229552088153012e-01,2.499848620213033779e-01,-9.292221923200838507e-03,4.885058546089017795e-01,-3.958262436554668140e-01,-5.644310003349950478e-01,2.087527130028082600e-01,1.111608871370355356e+00,1.300533946933744855e-01,-2.629210342835627823e-01,3.440328030329662390e-01,-5.640579714420528301e-01,1.771304860356009980e+00,-5.973585782202334160e-02,-2.284506030324797710e-01,6.636447692506006191e-02,-1.092164514798628361e-01,-3.689556406861096427e-01,1.145609208787100042e-01,-6.065146982717010138e-01,3.780803654017929061e-01,1.673712304701377329e+00,-1.739168114834738904e-02,4.400320682236346093e-01,-5.665592259545388920e-01,-5.727938936951175730e-01,-1.082961444014505448e+00,1.446937408359708077e-01,2.012148891135066897e+00,-2.920293620949798163e-01,6.920755744227666262e-02,-6.301039069437734952e-01,-8.180398333445745296e-01,1.043636675655252866e+00,1.131108911021085239e+00,2.214422809935208125e+00,1.023583490487881331e+00,1.934854458859797677e-01,8.692596789513024058e-02,-2.495428245574027870e-01,-1.250759322989238032e-02,2.006729818645046071e-01,9.239944246173864562e-01,2.146436755501440530e+00,-3.782963176335006894e-01,-1.189288995151060596e-01,1.239845539432959276e+00,3.530057260017759102e+00,1.322106788664572541e+00,-8.636362492861648921e-02,-6.041790122809184149e-01,-5.346032689124317061e-01,1.627573579391337066e+00,6.971908217037152689e-01,3.840576316202203300e-01,-7.702658751855419039e-01,1.136874764450514164e+00,6.531617421920848932e-01,-3.329346040033245302e-01,6.148166458109773080e-02,9.909747422941372896e-01,8.139022453395745593e-01,-1.099969427354992035e-01,-1.005154605005357915e+00,6.184993046546516382e-02,1.286935141333469534e-01,9.839133458073263672e-01,1.998216951972361599e+00,-3.695922815838594278e-01,2.021961052793901370e-01,6.580803229986885716e-01,-5.353765380613415559e-01,1.387278926734882845e+00,-4.982228860423916217e-01,1.051116677196896276e+00,-6.110201422828744899e-01,-4.301856906055183116e-01,6.365878090058016969e-01,1.100266884547919100e-01,6.963105839665068020e-02,1.506702381944951208e+00,1.078282330272155587e+00,-1.082672656307834380e+00,5.562659888662939700e-01,6.675373004125064735e-01,3.921246639478504492e-01,6.494812574849171405e-01,1.162391637607482320e+00,-6.075673713299512002e-01,2.422915852792740798e-01,3.151306638534012716e-02,1.408413906015172579e+00,-1.731988515112379834e-01
1.107615138943205846e+00,1.448089120734154633e+00,-2.527216198086193466e-01,-6.654241057659829872e-01,-5.013021417145799852e-01,4.189129983013064606e-01,-2.452585147322767223e-01,6.016868106217255763e-01,2.349793219896397112e+00,2.890581292747519404e-01,1.170363126091946704e-01,3.736119040874720798e-01,-4.501096784721699828e-01,-7.426501826371181836e-02,-4.338100506834440262e-01,1.920696272584136555e+00,2.700087840848547360e-02,-2.318642867292047827e-02,-2.494451674840921229e-01,8.386910785550030778e-02,-7.375413661738225990e-01,8.924151594947882238e-01,-4.481662500417721295e-01,-5.513615786526981921e-02,1.635592823713392097e+00,-1.999474430609455011e-01,-1.941471641880269938e-01,-5.983285205653162686e-01,-1.041567516379720004e+00,-1.092909691011064277e+00,3.624190644662305671e-01,2.512479600130131718e+00,-3.496389823391808926e-01,-1.875653969405255417e-02,-8.082966008278060777e-01,-5.112587533955310626e-01,2.203907014095339179e+00,6.468570699446309913e-01,1.515306403615123587e+00,1.151921534689780202e+00,1.039459586700535620e+00,3.814765210048987609e-01,3.994132364113625600e-01,3.278788281844824959e-01,3.426843097618696432e-01,6.530964756659225490e-01,3.058500161821741781e+00,4.387525527521884405e-01,2.282450181949613466e-01,5.891569033873140793e-01,4.437547638273056094e+00,2.051958762979627870e+00,1.178679104422140078e+00,-1.999589780986556764e-01,-2.965903053586619875e-01,1.351493270472701402e+00,2.734039425037665394e-01,-4.860252757051910510e-01,-1.235130260836171834e+00,2.111581939263568408e+00,-1.794310532405816450e-01,2.257861729653755090e-01,-9.065484693721405363e-03,5.068838505925240545e-01,1.125642928387502906e+00,3.108703564143625586e-01,-1.926196654546885600e-01,8.309182801156390630e-01,1.587253635437291532e-01,-4.508350342847251557e-01,2.786466357168457364e+00,-2.921473633464652941e-01,-1.922954722677098771e-01,-3.208260583394594301e-01,2.756963593789851230e-01,3.878645525558846452e-01,-2.474812377697432897e-02,5.455910833445449803e-01,-1.490576270872120412e+00,-1.624035182713677028e-01,1.097683470507360370e+00,5.302359927288854413e-01,-4.875050259639855943e-01,1.417675213076138752e+00,1.009479524700725106e+00,-1.200570547994241455e+00,-2.067521339645017608e-02,1.317702329435004760e+00,9.648262800925390126e-01,-1.453116417129799220e+00,2.334861981505279793e+00,-3.985116624260619522e-01,1.571057096830983824e+00,2.570715930774573610e-01,-5.534535592333131859e-01,-4.741521160445389960e-01
1.017232145253859077e+00,1.996213785823635956e+00,1.216547279497451201e-01,-1.196194420475634956e+00,-8.583259555614815295e-02,-3.932742046406245140e-01,-9.223545031891171586e-01,3.054493662650725749e-01,1.772005973222473996e+00,2.941114428259935520e-01,3.190680530045278962e-01,6.721304034155562990e-01,-3.881935796232980351e-01,5.643203176905962903e-02,-4.665057726401160565e-01,2.059370299195024678e+00,2.235151258914540029e-01,5.740849192838878290e-01,-3.729730218741083014e-01,3.389800189142229414e-02,-6.563979100704874226e-01,6.448567062713844722e-01,-4.740170041000971723e-01,-1.334254556219818810e-02,1.735253897617439200e+00,1.188606643683339653e-02,2.487868626443998643e-01,-4.926215531778985746e-01,-7.146530107216094718e-01,-1.126805905546021780e+00,-7.743474736140409931e-02,2.268160247835433907e+00,-8.109140722006356050e-01,-2.893570979183987535e-01,-7.130152462473301478e-01,-4.606335490738900362e-01,1.725057054796555578e+00,1.070219540975733796e+00,1.712897427803696138e+00,1.469073146928959073e+00,4.407183125690927183e-01,1.373883504336644301e-01,4.310027557208512272e-01,5.041938550929110641e-02,3.077811604633606812e-01,7.163664500732573881e-01,3.272283755136528249e+00,-6.341780118740392158e-02,-3.304776519350842157e-01,1.792326382851378241e+00,3.283641917804974053e+00,1.199893349424740574e+00,5.920432534713002681e-01,-2.594887472885858415e-01,-4.960629994787393859e-01,1.603312055062761310e+00,7.938038627974977057e-01,6.295332552891336197e-02,-1.330089690726191431e+00,1.392428597269565804e+00,1.818381304266958598e-01,8.783053416870740815e-01,4.295631053237585206e-01,1.558896736538558425e+00,1.412431703789868376e+00,3.777058470080317254e-01,-3.270469199612128230e-01,2.729011825514847112e-01,9.182717777179180141e-01,-3.228796108921885288e-01,2.346262157455647479e+00,-7.262973313741100112e-01,-9.575800476302613606e-02,-3.984855801619104909e-01,-3.550618620897315614e-01,8.011382940633517968e-01,2.016298167893377236e-01,1.261621935782244908e+00,-1.445216123951653886e+00,3.795507466242186156e-01,9.664299944603382819e-01,5.014828649103826308e-01,-6.429805713910197174e-02,1.277213007165557634e+00,1.407920247123618074e+00,-1.024462034687256384e+00,4.192687465485079867e-01,1.010423856684039334e+00,3.434134963855341449e-01,-5.244421676211891148e-02,2.064236813657704506e+00,-8.555208877225541908e-01,1.083331198419998476e+00,-1.090934106492041367e-01,7.876730368407900418e-01,8.044693396607882629e-02
1.245263891369704279e+00,2.234051780826882716e+00,-7.244387205617501824e-01,-9.725441424824619041e-01,-4.483603132575029737e-01,1.853027642030073419e-01,-3.997023067926763207e-01,8.176659975797834212e-01,1.771982966888200117e+00,8.025987419311556015e-02,6.412739621697526315e-01,7.001632567081145231e-01,-2.386375454925186157e-01,3.464282507365889496e-01,-8.636381243095490046e-01,2.525354476205613707e+00,9.363778714467458908e-01,-3.543923240766636562e-01,-4.621062807134304617e-01,-3.172986326535173762e-01,-1.770119925809229278e-01,1.049892045321696221e+00,-6.503527887891807913e-01,-6.761278778233895115e-02,1.826040825292855496e+00,-1.420163635556522669e-02,-3.230695227508685319e-01,-4.227025047844509831e-01,-8.970542030511188258e-01,-1.414377183790996639e+00,1.617456508907149371e-01,1.851732008883931524e+00,-4.296430623893497946e-01,9.072887994887561536e-02,-9.867618486289504443e-01,-7.297714653230165105e-01,2.367239901635432187e+00,4.777545198175049412e-01,1.809651773729646695e+00,7.051968281166736130e-01,7.711978638889603888e-01,-2.154963878585530734e-02,2.668577035420485188e-01,5.185088049996433579e-01,-1.542288269563685255e-01,7.110442603015475482e-01,2.965762943439482768e+00,5.488365071186084299e-01,6.591962133162578008e-02,9.779790202330331805e-01,4.583388027566536849e+00,1.952170071500202608e+00,1.304142988511427292e+00,-2.810098205178391817e-01,-1.604547654316873517e-02,1.256614744761686220e+00,4.133983854658768720e-01,-1.615712314149624074e-01,-1.960547420774481076e+00,2.072935614854149566e+00,-6.920585141989548106e-01,5.206034647987087816e-01,3.588742113859858529e-01,4.486538779681086275e-01,9.768435770638677074e-01,-7.595518818368507397e-04,-4.610631831911516931e-01,-2.433807767231416230e-01,3.688158342046024551e-01,9.814656855531567192e-02,2.837324263086338672e+00,-2.165144967196174774e-01,-5.268591619331816078e-01,-3.846436407965683202e-01,1.295015939637018110e-01,3.124392800561712757e-01,-2.595558507226726208e-01,1.088367767104394535e+00,-1.483213815827865822e+00,-8.630464577148094785e-02,1.924192714683353067e+00,7.681670426912254879e-01,-3.396499978060819047e-01,1.116837981350514042e+00,1.573634757675402840e+00,-1.262693621260481125e+00,8.065681809177924211e-02,4.449822767788930156e-01,7.768578723917962670e-01,-1.332959458844661160e+00,2.165550678092825976e+00,-6.047179945317253669e-01,1.403723390175579677e+00,-1.322527260711534591e-01,4.541130174363790240e-02,-4.851792116530856402e-01
6.219075940219581655e-01,4.010749940637351463e-01,2.151666835587093263e-01,-6.710325806661198156e-01,-7.443141900648020393e-02,2.535128296798234704e-01,3.686594214997472307e-01,-2.939416234298256048e-01,7.267506189074836032e-01,4.448035040076580016e-01,4.765379361837742689e-01,2.884956198025984131e-02,-4.574277354286955255e-01,-2.344684910730718275e-01,-3.415712694638467495e-01,1.371781599517972960e+00,-7.237466565430772381e-01,2.500670098054035284e-01,2.023070173072143846e-02,1.886578152043679735e-01,-8.268327545250987454e-01,4.108218545605803462e-01,-3.505807616365482771e-01,1.856700807127944497e-01,1.701125717424957662e+00,-1.172995997533076151e-01,3.803754059656522246e-01,-7.284972637511510918e-01,-1.138386904398125177e+00,-1.104861208424211538e+00,2.321193790836879045e-01,2.763643831002620121e+00,-3.854939807125514761e-01,9.339799962523599730e-02,-5.290090969030263324e-01,-4.686953200856276980e-01,1.339182649423136695e+00,1.094390056348425899e+00,2.114123612666829466e+00,1.567785159120807847e+00,5.435949962425042914e-01,5.118220729436988581e-01,8.900941762454732398e-02,-2.209058146600457739e-01,5.948275825407098871e-01,7.415389085643303568e-01,2.473619555667458503e+00,-2.833681669393818270e-01,3.609414371225277973e-03,6.413742745200949891e-01,3.543572313515050087e+00,1.814347173780983757e+00,1.439348710210096860e-01,-3.697160502298696416e-01,-7.687813412793458312e-01,1.813467005969597423e+00,7.229052325783078548e-01,-5.499435340265981104e-02,-4.768670287056367973e-01,1.867440434747515976e+00,5.633889099496520725e-01,-3.097831519657137100e-01,-8.465278497807514346e-02,1.084381225388523218e+00,1.263537331605090630e+00,4.412784751895784119e-01,-6.206871026784054335e-01,1.013464181544834197e+00,2.683864164670665131e-01,1.843921878400989200e-01,2.000701061792971025e+00,-3.513743532885826859e-01,4.022715349515872396e-01,1.045939580437232064e-01,-2.389580410663518228e-01,9.220482462847754412e-01,-3.397712404437079337e-01,6.301508050304490682e-01,-1.181325933752421564e+00,-2.746020979860524514e-01,2.913096880886388851e-01,2.010750516936794796e-01,-2.694679114362314998e-01,1.885843449897528501e+00,8.662211557903108927e-01,-1.288731882745900892e+00,3.365539046168064541e-01,1.375029160907248915e+00,6.883587697442994369e-01,-8.496114772279017568e-02,1.654754285519923762e+00,-2.758279814514510431e-01,5.999352632639267657e-01,3.310420949653767875e-01,4.823341405418248296e-01,-3.256545955213554500e-01
9.570009554507027394e-01,1.538595560636840442e+00,-4.448944130884381898e-01,-7.708793177117813089e-01,-1.616520085287354580e-01,3.658961964056707261e-01,5.963386321136558976e-01,1.805095345319724376e-01,7.211121771216005838e-01,-1.312083620131782868e-01,2.646385700607138958e-01,1.529983551025132504e-01,-3.358711005547405648e-01,2.494633714483264209e-01,-6.430295395044378637e-01,1.538634532389868248e+00,1.236521846485622023e-01,-5.951677246247104591e-01,-2.522484709342618370e-01,-2.363144354733798247e-01,-3.257349481039149008e-01,4.358938746253399610e-01,-7.705925888876196117e-01,1.222066201249112638e-01,1.862882577727170474e+00,4.727954401985169364e-01,-1.619761210008716368e-01,-5.783358343326319151e-01,-1.548144522782099797e+00,-1.545969652475754463e+00,3.004985055745165168e-01,2.091324217151125264e+00,-1.914783028103280160e-01,4.094756815659495452e-01,-9.717198876007585584e-01,-6.202033144836875955e-01,2.177938375538770455e+00,3.762183585167725997e-01,1.956640744677075272e+00,2.041098331601707283e-01,5.880842531590191324e-01,3.280672761296757334e-01,-1.162410207260214517e-01,2.841922150638401812e-01,3.310185151281233029e-01,9.377927427434736840e-01,2.255400897954764172e+00,4.909630376152578357e-01,2.381129845257314304e-01,3.338592407778562809e-01,4.364538702835089268e+00,2.255522724551626723e+00,6.324225865519088607e-01,-2.021366244383202559e-01,1.505684521571364343e-01,1.153539909309180933e+00,-1.185159569986190542e-01,-1.598533397298979031e-01,-1.384594712881906275e+00,1.555054554108210585e+00,-6.823027569261097547e-01,-8.721671435135326667e-02,3.024678107794688264e-01,-1.934277656467198181e-02,1.184967232076431509e+00,4.202451248035501408e-01,-6.567563632327763079e-01,1.459596808037636473e-01,-1.115619700065300091e-01,8.146998779556207104e-01,2.100947885728231324e+00,-1.649293522225145359e-01,-3.861530550118524308e-01,-1.333263379220690215e-01,1.733069519335809217e-01,2.924245257797170039e-01,-7.175695188183829343e-01,2.442937458713689836e-01,-1.428953311128048131e+00,-5.047878829464997885e-01,1.423164325778018657e+00,9.657324013074704283e-02,-4.700368967928799657e-01,1.711857050486827792e+00,9.699985412370234483e-01,-1.308514606180879447e+00,2.798415750372627020e-01,1.107567189608436031e-01,1.025017632699411596e+00,-1.082858844857398584e+00,1.382125637812420038e+00,-6.148640407223977533e-01,1.113970842837877395e+00,2.151954162261370262e-01,-5.857197415810784236e-01,-6.446471237077227023e-01
8.457798312431615839e-01,5.662206914856067197e-01,-4.622845609283537383e-01,-1.189845396576657555e-01,-7.706414741374736921e-02,5.907804887529448656e-01,6.935996545927867185e-01,-5.033221881778765505e-03,7.682685081841578167e-02,3.274881168013945576e-01,1.213926019291430958e+00,-1.899944507229578416e-03,-2.882805379448142302e-01,3.942457772749053402e-01,-4.622641110983866097e-01,2.055377523218954838e+00,8.872393934383271397e-03,-7.087420086140612252e-01,2.771260388725974577e-01,3.475872278418057348e-03,-4.795365175841720395e-01,3.265732573401159411e-01,-5.398612281087403764e-01,3.935627771079071024e-01,1.358324775124719608e+00,-6.010267072796622312e-01,1.081766214552804667e-01,-5.852181158206394285e-01,-9.965344122533381643e-02,-6.485228225737276198e-01,5.618934196989001650e-01,2.047823241977988040e+00,1.211778264280457540e-01,-1.915159500299226658e-02,-6.486241379946580121e-01,-1.026784929096758114e+00,1.196392606350215937e+00,1.002555435978703224e+00,1.743249252027025964e+00,1.002765767723504009e+00,7.992168138246029674e-01,9.386995548373044951e-02,-1.955921735189691257e-01,3.911733210237883229e-01,5.017339937518450199e-02,8.259389700260301170e-01,2.224035533718359936e+00,-6.830632909975564715e-02,3.178427293063068038e-01,7.313603697623921596e-01,4.555557476890390589e+00,1.558644402987575006e+00,5.600871851005353452e-01,-7.225243533745336899e-01,-5.158447054943573473e-01,1.389606602191677753e+00,4.087414870788225185e-01,-3.888572869344626010e-02,-6.345917167445818130e-01,1.510133480908726344e+00,8.718074264292843267e-01,-8.112467012175367254e-01,-5.087973728084551617e-01,3.196520227990465868e-01,1.811639321589766372e-01,-6.165040963906250893e-01,-8.314697612946563288e-01,4.989585044942050907e-01,-5.590276192667842370e-01,5.762805320685773225e-01,2.816619286153454915e+00,-1.050670699257932328e-01,1.584087241109632949e-01,1.094537362874327124e+00,-1.124435966202249060e-01,1.494345761833812736e+00,-3.176460058832959454e-01,7.991746218367333787e-01,-2.090674250432839054e-01,-8.474832035561181698e-01,6.035751366093411452e-01,2.625201164247186192e-01,-7.417558631180337647e-02,1.203505330823222863e+00,7.606258054939158963e-01,-9.714611336967309274e-01,1.286986744707863117e-01,1.361129802329273275e+00,7.124915668420735981e-01,-2.550127089701447747e-01,1.645038803634079283e+00,-2.921622160565239823e-01,7.265255813163898901e-01,2.434613155111076122e-01,8.314237785629479127e-01,-4.236056879496634675e-01
8.341888875691287897e-01,7.848446262602011281e-01,-5.954753846988214416e-01,-9.095724870595175426e-01,-6.707640889269539386e-01,6.704797814025902358e-01,4.002488860424556205e-01,4.053144863232303052e-01,1.376829699415321295e+00,4.170623907843818978e-01,8.283581304231764086e-01,3.788857276373647776e-01,-2.850185695008337072e-01,-2.471034466917131911e-01,-9.890558210644931902e-01,2.098135436670670373e+00,1.450225661517379749e-01,-1.580745730988039333e-01,-3.692135737323448685e-01,-2.332855813185109040e-01,-2.741585704544989288e-01,1.362734925332793834e+00,-3.554873441964797043e-01,-1.042908988821103222e-01,2.098886634786378380e+00,-1.129846984524493225e-01,-1.871511368218562732e-01,-6.596184683801546988e-01,-1.750289037491580935e+00,-1.799337349790322005e+00,1.882669854946608656e-01,2.573264680917654701e+00,-3.836263626335353893e-01,5.610852410006479385e-01,-7.651399305301544995e-01,-5.241761123114034859e-01,2.241181885948024366e+00,5.046961748244126467e-01,2.659256667238292682e+00,1.349934323263448643e+00,7.934061478378395815e-01,3.672658303234769273e-01,2.199446642538086527e-01,-1.020117579489734916e-03,3.191287278886351109e-02,5.377348229419044445e-01,2.504523020889587670e+00,2.579277340393403284e-01,1.503065372676713751e-01,-1.498163217146005755e-01,4.575064143168000363e+00,2.827585383271988828e+00,1.019960659773864853e+00,-2.582746436683264202e-01,-5.232731257721433549e-01,1.852744055892687536e+00,9.453605601268196823e-01,-2.393191910398115296e-01,-1.473437367731810888e+00,3.450516001444722924e+00,-7.356201704427320909e-01,-2.116634332311261857e-01,1.533733063443563915e-01,5.419970722607346802e-01,1.317530384862922954e+00,3.991683283468240862e-01,-6.844125892939432187e-01,3.739193884312015381e-01,4.635302727217439633e-01,2.458785706884530353e-01,2.378656762143214198e+00,1.730956947826446379e-01,4.146501416902316495e-02,-6.517276328882933845e-01,1.706185792900679621e-01,-3.759602791866234472e-02,-8.371246578850799480e-01,9.073637635467337592e-01,-1.898287479438035774e+00,-2.759440666840278222e-01,1.594559959639113345e+00,9.351245764090811985e-01,-6.516707820679197294e-01,1.885128452043997260e+00,1.602001318710279287e+00,-1.887104691291060510e+00,-2.888787459655672851e-02,7.744085847553492385e-01,1.034234053788401164e+00,-1.564213363895940789e+00,2.135208957474791447e+00,1.602309233233397689e-01,8.393306667024320600e-01,1.231365498481398202e-01,-3.964229668639851489e-02,-9.324832859480512992e-01
8.470134887275960756e-01,1.615267799799287918e+00,1.201595438681398315e-01,-1.024478522743070608e+00,7.156738582807380122e-02,-6.593022855838187590e-02,2.132426784919911888e-01,-1.070055025770931811e-01,8.790383691057266358e-01,-9.563695877342168195e-02,-1.641359077124549537e-01,1.612467233253774279e-01,-4.493577274082119488e-01,5.272459508729036848e-02,-3.905001864996974215e-01,1.125522899209110861e+00,-3.168756881647472046e-01,2.213081362690011433e-02,-2.878651963783180334e-01,-4.139536066844460432e-02,-6.269198389854939713e-01,1.593803917257716751e-01,-7.122455364881484785e-01,1.116436071854600559e-01,1.874100841077176005e+00,6.977532939640356258e-01,1.542292063385076739e-01,-6.173417436313132223e-01,-1.666747028357685068e+00,-1.493153123206452326e+00,1.071534379234221901e-01,2.355335641195392515e+00,-4.911752797113262403e-01,2.158507922429861448e-01,-8.625516503123149548e-01,-3.717003157626101451e-01,1.948354702109591274e+00,6.431549507543409261e-01,1.868808672155540807e+00,5.157550347600280416e-01,3.440358353600763697e-01,4.736921878894739812e-01,7.540145549289624036e-03,-1.600012577071750763e-02,6.997116388627000472e-01,9.742763042626774173e-01,2.481312935206700931e+00,2.158698738338332701e-01,-2.691329847287994570e-02,8.264271239702596361e-01,3.483487706077628143e+00,1.856927796266152786e+00,1.905048766151784256e-01,-8.639399019670446211e-02,-9.884416563387010690e-03,1.296288709914189763e+00,-2.258377355664864528e-02,-4.852936392508696434e-02,-1.109803209246094546e+00,1.031598296549911531e+00,-3.876466934675799614e-01,3.034540843281604561e-01,4.964449428968632505e-01,6.196030338238448509e-01,1.642944711627198906e+00,8.548033542138613328e-01,-5.137650669078105414e-01,4.274542432545401782e-01,3.028817787743892653e-01,5.651616794080306372e-01,1.665793060044798768e+00,-5.316089574775413329e-01,-2.307731730208424925e-01,-3.503608202563557317e-01,-7.923796572907700064e-02,4.049494134579533777e-01,-4.558201846363743037e-01,2.240656413526591062e-01,-1.608015402407376948e+00,-1.384273644074863752e-01,9.375131032721404356e-01,-1.383367638944854594e-01,-3.567824382924797422e-01,1.884891544346843917e+00,8.656743608587204042e-01,-1.176857569349778698e+00,5.314082566989172252e-01,2.521389447328274969e-01,8.015983627430095515e-01,-4.033184128057346052e-01,1.265083233324146628e+00,-8.767069223819903279e-01,1.020877830022282273e+00,2.318340975447892305e-01,-4.087692777028177349e-01,-2.961521328003673403e-01
8.711212861182331402e-01,1.727858391343486621e+00,-2.509279125353347517e-02,-9.870644335594742635e-01,9.177504839514104285e-02,4.369627816905585771e-02,5.376667208686107813e-01,-1.120867804336350693e-01,6.321847671646082523e-01,-2.922079966019556219e-01,-2.797116303196414688e-01,6.346224656109052120e-02,-4.338149019346970170e-01,1.585053362821324807e-01,-4.377553744586735740e-01,9.631613776511270819e-01,-2.645337250247284389e-01,-2.918418849763932954e-01,-3.092974707767859877e-01,-1.454650212395308673e-01,-5.123796546563190724e-01,5.237198985198099344e-02,-8.485522389908264351e-01,1.364300406836896351e-01,1.929471274615612630e+00,9.483040884409573712e-01,2.701131550470914355e-02,-6.152201434127513302e-01,-1.934314296451310478e+00,-1.650522039496747029e+00,1.708725014523059249e-01,2.230736769033281774e+00,-3.654489150591361257e-01,3.931773733503049484e-01,-9.799706129186374071e-01,-3.975805955016686877e-01,2.144437185128929446e+00,4.111071599782773478e-01,1.879036739102196485e+00,3.258095866812849017e-02,3.336569260558795436e-01,5.041610935214770883e-01,-1.404796635000525873e-01,7.523923010416719293e-02,7.213094978297693860e-01,1.071404638513310026e+00,2.241897269786811364e+00,4.233969439931573042e-01,9.465416109095110830e-02,5.423694710941917574e-01,3.711064498577890447e+00,2.088006892586134811e+00,1.946712450714154774e-01,-2.927031220878750783e-02,2.735447057546187555e-01,1.098660802665863301e+00,-3.652108136852001419e-01,-8.823890606737300191e-02,-1.228884404436229483e+00,8.936170738591285856e-01,-7.383968984908302335e-01,1.870384590722898310e-01,5.694112200095078347e-01,1.789473209435866741e-01,1.647961389129923404e+00,9.268430467089091573e-01,-5.778923237518919231e-01,2.836056356243250587e-01,6.760192952421333057e-02,9.085284782890744593e-01,1.546715569146109859e+00,-4.393811432544092455e-01,-4.084372585187819871e-01,-3.509851904331257044e-01,6.038855111366485395e-02,2.157571653620997676e-01,-6.860426621142108328e-01,-7.546877177410415971e-02,-1.661050417259396950e+00,-3.210203987718504015e-01,1.149493087307982941e+00,-2.997239685782536744e-01,-4.551378045210431877e-01,1.977678227011528289e+00,7.618929075458813482e-01,-1.213046326464929603e+00,5.413056293107667560e-01,-1.591299378809885035e-01,9.690702965523793067e-01,-6.671831488634889507e-01,1.025654666507119117e+00,-9.369263902260343002e-01,1.091927623881258969e+00,2.853171563999031268e-01,-8.572981958992618168e-01,-4.490086319981640983e-01
9.003829425732109426e-01,8.787253374871375478e-01,-4.415420996786969393e-02,-5.304605374523072570e-01,-2.672724727695669489e-01,3.201499945327393459e-01,-9.746269147376124264e-02,1.995500991060764617e-01,1.524478733285447918e+00,4.756324700538422379e-01,5.430787671297582220e-01,2.435872381011541243e-01,-4.324624339755921421e-01,-5.913729599483336097e-02,-3.401401109448203286e-01,1.900921664085866825e+00,-2.411151869872115716e-01,1.080057385771691636e-01,-7.306690451683750531e-03,1.905744691393891355e-01,-8.107804753700378342e-01,6.449235389264287299e-01,-3.535388543288234819e-01,1.196278880664185806e-01,1.507184676946951907e+00,-4.684754110811282790e-01,1.427495383649879934e-01,-6.295482584429604733e-01,-5.757824806646320015e-01,-8.137606002904799185e-01,3.450911677879310302e-01,2.546411171910914373e+00,-3.221804053897596720e-01,-1.557884855716830663e-01,-6.042350779892790014e-01,-6.165422595854603838e-01,1.543095612970557529e+00,1.047205989863749354e+00,1.657774630367751190e+00,1.563755485166577586e+00,8.578977901728030986e-01,3.220356952884682600e-01,2.705824826989168264e-01,1.449214200717695300e-01,3.451835132225463676e-01,6.635309233936190765e-01,2.879461371039536477e+00,-3.996900641443422442e-02,1.060064509636485935e-01,8.991447338575572212e-01,4.037838552150594396e+00,1.630124959896674497e+00,7.238835888639365557e-01,-4.245579858610470936e-01,-6.776095726561597310e-01,1.599829037158091438e+00,6.351528003160666902e-01,-2.323861297282315275e-01,-7.534569050525645739e-01,1.881932120264843578e+00,6.065672681806392186e-01,-8.959818149701934131e-02,-2.280782701469810381e-01,9.365756962347782100e-01,8.966704962499849607e-01,4.398258292046469675e-02,-4.042161642783309028e-01,9.321530950610769084e-01,1.454130558170843579e-01,-2.910288929822664183e-01,2.682565815066189518e+00,-3.595203400992981746e-01,1.828669622050176358e-01,2.031975993043626250e-01,-6.832010018805872997e-02,1.002961558125327723e+00,3.058487709356511042e-02,8.250705313115898054e-01,-9.926257875945487807e-01,-2.381390018359213490e-01,5.450120771570332590e-01,4.497207565800080409e-01,-2.322869874248693067e-01,1.395475456651819268e+00,9.325825430734320243e-01,-1.088968857347193397e+00,1.156914503576938202e-01,1.680179307834559488e+00,6.930579357867745482e-01,-5.424655739277997046e-01,2.140939285193431019e+00,-3.324650037354364707e-01,1.068708207198482807e+00,2.465187465898077135e-01,3.971122838068356087e-01,-2.749462133146243215e-01
9.931234601717556787e-01,1.704589675375966618e+00,-1.918259274015650107e-01,-7.380489982326050580e-01,4.047175694823969272e-02,1.049595984972601093e-02,2.250650981013563312e-02,1.297525555860373214e-01,7.698779926712838728e-01,1.913245658636802959e-02,4.341410703673210802e-01,2.834085092070073864e-01,-3.474670158167730838e-01,3.718139479563639660e-01,-4.399956278697952916e-01,1.787954837477703451e+00,1.761044866773490702e-01,-2.707880597681870949e-01,-1.273370317326442958e-01,-7.279625348667390083e-02,-4.968922241029692932e-01,2.415489802806084496e-01,-7.040699783153119284e-01,2.064708667553518395e-01,1.603743215262576793e+00,1.355147676629446796e-01,9.133814880300665517e-02,-5.113780518839902145e-01,-7.028692079316697372e-01,-1.049293428449608490e+00,2.374157215356632045e-01,1.983104622185641652e+00,-3.139872707530210749e-01,-5.165688486017205872e-02,-8.347904584676406614e-01,-7.099963493430477834e-01,1.689784686959124649e+00,8.098453576456233760e-01,1.606053208062123261e+00,6.310279770185316384e-01,5.166511529341026865e-01,1.455549469796318385e-01,-6.822344404330701884e-03,3.075718889609166951e-01,2.962564187085433010e-01,9.259352902343530589e-01,2.606565077467021041e+00,1.636527720247158146e-01,3.577513500569395877e-02,1.229019860888795890e+00,3.910209655178457755e+00,1.435095732866945362e+00,4.941798072242842288e-01,-3.672694060885270950e-01,-1.151852181444392720e-01,1.211645441284807223e+00,1.319981086064739018e-01,8.880600081989598049e-03,-1.156224224176490845e+00,9.375144378669325596e-01,1.285480559107134435e-01,1.641099714954202260e-01,1.800727082573486404e-01,5.907822620705788230e-01,9.420184023551433361e-01,8.720576327936618855e-02,-5.724807006414076582e-01,1.828472020858884495e-01,4.526712434785632594e-02,4.466174345206428975e-01,2.342140846581457048e+00,-4.778914700551884498e-01,-2.419519330813958979e-01,2.552907115821940742e-01,-1.414546514283739898e-01,9.496317927010300419e-01,-1.858902962668314562e-01,6.825741344372638908e-01,-9.462820736589894199e-01,-2.882281872271400536e-01,9.849615071690348556e-01,9.524030080641227025e-02,-1.225175039461120774e-01,1.311535772149885926e+00,9.473417613019449179e-01,-9.285763807262232827e-01,3.862394704766497489e-01,6.287933815668614868e-01,6.308627621218660941e-01,-2.622330508631965929e-01,1.531192839188990407e+00,-8.521591938260562049e-01,1.058366520615282802e+00,9.051078353173214186e-02,2.907905143263767589e-01,-1.904102976506952816e-01
9.538216253257275623e-01,1.560920262340633080e+00,-3.635562633768180119e-01,-5.978767982948154369e-01,4.046235921915376788e-02,3.270113981176555606e-01,7.737235532517734438e-01,1.968872551853997899e-02,3.373387820996566200e-01,-2.601569595246409072e-01,1.661070988522100333e-01,-4.697793522633025853e-03,-3.607407909576661464e-01,4.155657379487548431e-01,-4.695831433740607630e-01,1.323466992000601472e+00,2.233266477548012663e-03,-7.757785541065055357e-01,-1.103089206032312614e-01,-1.837313456281085555e-01,-3.945293059240211342e-01,5.457474726371680518e-02,-8.803325760729165950e-01,2.541655776243906817e-01,1.707082369151406098e+00,5.466735563597276970e-01,-1.007827121397598946e-01,-5.715287236745767441e-01,-1.332176217798489493e+00,-1.332132658855111451e+00,3.981802565332197563e-01,1.965020462783491739e+00,-5.398233697715076884e-02,3.233989061478840243e-01,-9.882429010146733805e-01,-6.968815029815247364e-01,1.996761924229986551e+00,4.166200655386376184e-01,1.693232940412803478e+00,-9.668059766135916888e-02,5.475724509099402226e-01,3.244596786861783100e-01,-2.703534565227118658e-01,3.723767049850330579e-01,4.460417052506076008e-01,1.072750274253100322e+00,2.106075344680163663e+00,4.838567032216209429e-01,3.040448822745045465e-01,4.753998176672072917e-01,4.310383097531418350e+00,1.999585454553282515e+00,4.360595814951934157e-01,-2.499327776456993222e-01,2.871308776164716026e-01,9.454155722408981166e-01,-4.523148574987919668e-01,-1.296223593739692925e-01,-1.174178430648626481e+00,8.775421508611076504e-01,-4.255363746444715822e-01,-2.189957725919113030e-01,2.142623986775223643e-01,-2.068858053865720859e-01,1.012952931679211632e+00,3.199139291774392158e-01,-6.815065963062503229e-01,1.900588623378067221e-01,-4.244346167220690025e-01,1.016191222884132328e+00,2.051719340809427639e+00,-2.625314598469687399e-01,-4.289797503795204636e-01,2.442982867603507025e-01,1.463214809761847479e-01,5.751308204759328913e-01,-6.546952153047413958e-01,8.524875433933154500e-03,-1.089207948089192968e+00,-6.753395140911859773e-01,1.180928553366099143e+00,-2.242434483752170915e-01,-3.708253603283442890e-01,1.640814584462152670e+00,6.561278945414128483e-01,-1.069651641489769878e+00,3.712282987286149583e-01,6.964891174662246609e-02,1.008966254439499277e+00,-7.958173875967284872e-01,1.107826319969862805e+00,-8.176141255259763430e-01,1.133178652976893019e+00,2.945677185463935199e-01,-6.451612930493981768e-01,-5.350144043946820638e-01
1.128938204050194738e+00,1.130203202272568763e+00,-6.203712904074427659e-01,-1.980430255398887840e-01,-4.630457435542444933e-01,7.501114398384616244e-01,2.651014914410364520e-01,5.876996849638790321e-01,1.591243352679442946e+00,2.677212898643536731e-01,6.589307356536939775e-01,1.944113143048037673e-01,-3.579884569372307479e-01,2.541770440210281978e-01,-4.701456773159553015e-01,2.179387775508311975e+00,2.343276731778657918e-01,-6.701300618842026546e-01,2.506209800264080217e-02,1.399512927103823204e-02,-5.664596018605351224e-01,7.484965514670627318e-01,-5.298885069859305963e-01,1.412760003598250158e-01,1.404668458862942115e+00,-5.478559225662948950e-01,-2.861333787604630752e-01,-5.657010359732779214e-01,-4.442291023891604684e-01,-7.784467722636131404e-01,6.276943873546410035e-01,2.180373615417853905e+00,5.804212041056378002e-02,-1.694066350215828187e-02,-8.169733037892352723e-01,-8.693954568247019843e-01,1.944303245308886652e+00,6.453753551018810430e-01,1.399866042578463698e+00,8.672728022716043039e-01,1.186370408031619084e+00,1.987527595381006207e-01,1.261926819238313735e-01,6.180815809773017033e-01,7.337564330178591998e-02,7.164837831652294264e-01,2.697017520729269258e+00,4.595752792768938444e-01,4.763130830239115654e-01,4.335915889055622086e-01,5.056282958093856195e+00,1.974306825332643678e+00,1.265860887631434117e+00,-4.690389050239184288e-01,-2.442740627941098197e-01,1.167176394705263132e+00,1.066720142685486650e-01,-4.628773301735247259e-01,-1.084123295529349829e+00,1.953407714738947254e+00,1.892920212908545674e-01,-3.839700923217239659e-01,-4.036333090689957492e-01,-1.392311755548247820e-02,4.029567158513106540e-01,-3.547948596476642180e-01,-4.198394433430810979e-01,6.804348556076158516e-01,-4.938594929659745336e-01,-6.075111931165677603e-02,3.184911538929025454e+00,-6.857177106586093140e-02,-1.868149141512843725e-01,4.661040197153680786e-01,3.305277460553813218e-01,8.448391824763099578e-01,-1.309566714163181156e-01,5.434611093562550233e-01,-7.716752859610435111e-01,-6.692492608986896352e-01,1.072429701856461026e+00,4.836978026608083625e-01,-3.779927636403417335e-01,1.134125034425097045e+00,8.154637007746826649e-01,-1.049595967207302305e+00,-1.420939205752567713e-01,1.417579279383384794e+00,1.018766858455273816e+00,-1.435628430319978666e+00,2.198724984401148497e+00,-2.789707030101483687e-01,1.470339087212052309e+00,2.971445813810661973e-01,-2.811336443154518472e-01,-5.970741559069900894e-01
8.548462554530642521e-01,1.237967274738348777e+00,-3.195896076312312317e-01,-5.672486930426771101e-01,8.502671871320167940e-02,2.758604500757535494e-01,7.119525561832207305e-01,-1.061593504402646715e-01,9.818429871887968119e-03,-5.896742616139835635e-02,5.818917342920727487e-01,2.806738282988162358e-02,-3.190936113872668289e-01,3.989811516629618859e-01,-5.068292811402190789e-01,1.542996419190687751e+00,-7.475675953343252633e-03,-6.343211545533508078e-01,-1.030601192345616951e-02,-1.492940527748782553e-01,-3.833648618788784157e-01,1.062217447778360246e-01,-7.648219763324758391e-01,3.101738622118864752e-01,1.660251655565736284e+00,2.488333150177693964e-01,7.420734012272976743e-02,-5.720811879645875120e-01,-9.739355843408753488e-01,-1.188408274184411306e+00,3.492587848579728482e-01,1.979592835675453522e+00,-9.030807734201815040e-02,2.238544814565179286e-01,-8.474938748516501752e-01,-7.791045792674436976e-01,1.628329897767886614e+00,6.830402457133745164e-01,1.865411757266298709e+00,3.407452698818553838e-01,4.747711632257102243e-01,2.257858419067065581e-01,-2.678278213216568338e-01,2.670367174336019112e-01,3.185365749811558955e-01,1.002551117399162806e+00,2.108973981213317028e+00,1.735474396703255429e-01,1.913704243787579251e-01,7.022601060943720608e-01,4.136608934552500116e+00,1.769986347891281842e+00,3.002452344140587037e-01,-4.128350686392858737e-01,-3.968770832055290576e-02,1.193440119150604106e+00,-2.120574066065578078e-02,3.194218276187785199e-02,-9.977270675689298152e-01,1.042689099262803509e+00,2.790241147805824773e-02,-3.451027342991314639e-01,8.063647893058689675e-02,1.779477819635050251e-01,8.452661477373986099e-01,7.478396552284599652e-02,-8.065716340274550200e-01,1.760769665706353182e-01,-2.963182940301847257e-01,9.827293950739612871e-01,2.125867858438985181e+00,-2.598228719688787658e-01,-1.784565089454001607e-01,4.749615795929591489e-01,-7.698771927223790890e-02,9.150665125327475113e-01,-5.911480511724878095e-01,3.998060856501491900e-01,-8.405519046090217383e-01,-6.425588439709517541e-01,9.689291568036149105e-01,-6.885401132731211460e-02,-2.122096763799978247e-01,1.554647627918185560e+00,7.926288312921621060e-01,-1.070870078281261240e+00,3.929869795855433501e-01,3.777505100685920603e-01,8.033653911193185948e-01,-3.251976291019190723e-01,1.175278370349206458e+00,-6.845360746571638177e-01,8.169213927596414848e-01,2.131421018255547084e-01,1.220919810145494055e-01,-4.320237596217354481e-01
5.883043373642007356e-01,1.921015726609104357e-01,3.356493688519553431e-01,-5.516317600125710818e-01,-1.245732084315217675e-01,4.843394670661252399e-01,7.551651824999343621e-01,-3.719680038031840108e-01,9.758797303019084435e-01,3.151856209743593151e-01,-8.543000103930209477e-02,-2.267123174468134716e-01,-5.730240975379637947e-01,-4.118211056009097315e-01,-1.736555503814318779e-01,8.000199720992694497e-01,-1.177440244412819581e+00,1.532924134641541758e-01,3.609155478572449033e-02,2.839574601672166798e-01,-1.017957057756543104e+00,2.658079546617599376e-01,-3.918109583585548394e-01,1.647932242864058594e-01,1.725314279832698139e+00,1.660176596234364810e-01,2.733962511139375051e-01,-8.296308987103087063e-01,-1.717096469392566105e+00,-1.215067428773228819e+00,3.768796539492831332e-01,3.047289146254617442e+00,-2.621374348293517564e-01,2.746124554860897016e-01,-5.899924229379169827e-01,-3.018399264307325414e-01,1.609897673810640528e+00,8.595928045172082088e-01,1.989660576957555049e+00,1.251336329103271083e+00,6.797070304619565739e-01,8.163117061767388716e-01,4.765166774342758510e-02,-2.542765736386427000e-01,9.394476959809456851e-01,8.073531193810573603e-01,2.312075795663872668e+00,-4.528684600183688347e-02,2.144140544530079850e-01,4.462797512402449929e-02,3.687011130589309182e+00,2.236833438950537101e+00,1.208896081628602071e-01,-1.834609201091725872e-01,-5.593395739418762780e-01,1.645841988240360099e+00,2.365088766888860661e-01,-3.195242147597268101e-01,-2.979328859115495387e-01,1.824124935872774911e+00,2.614383958184349765e-01,-4.872294477189512141e-01,-1.117879590152955627e-01,6.254286483395338214e-01,1.508389834776167060e+00,8.514424534538007627e-01,-4.905726686246439927e-01,1.458287818857703977e+00,-1.302849567454709284e-02,2.082691812855781976e-01,1.769827523852723239e+00,-2.993686977818625916e-01,3.398699973015027465e-01,-6.814731158581532888e-02,4.470711262102632089e-02,5.720706131798232175e-01,-4.899378585460389957e-01,-6.122602554880951509e-02,-1.444268427078229333e+00,-4.442755188841026603e-01,1.606809469312199257e-01,-9.470769950497343048e-02,-5.276824929596071190e-01,2.230126379007223214e+00,4.794770218966870612e-01,-1.355500144012721675e+00,2.904165765769051721e-01,1.310926723961967078e+00,1.024047938719073514e+00,-5.959375810010383301e-01,1.513452859596035260e+00,-2.400107803351512747e-01,8.435676771747324665e-01,6.086006261607257439e-01,-5.486948324321623272e-01,-5.202082142637691753e-01
7.599617810475318702e-01,2.807811431413042014e-01,5.484787867136699246e-02,-9.090885979196716704e-02,-2.352453722542127701e-03,4.352504786711899332e-01,3.750160981734991239e-01,-1.830773877056862675e-01,5.880602992630215020e-01,5.183976150183130516e-01,8.355735708632524572e-01,-7.820619077561086208e-02,-4.403084863337315413e-01,1.095319451594976567e-01,-1.156244918567990165e-01,1.723786936855240093e+00,-5.651118049692349654e-01,-1.572402134349709935e-01,3.718604189321211839e-01,3.246382880877289878e-01,-9.245715165890088238e-01,1.692508818748402477e-01,-3.719778750078915897e-01,3.864331116991333026e-01,1.213492821838021207e+00,-7.310372402899312227e-01,3.503476778951489790e-01,-6.661348756484847256e-01,6.728673016192399103e-03,-3.490386974668998610e-01,5.495987305916212318e-01,2.475206184965471401e+00,-2.641604160184046757e-02,-2.866161089980681642e-01,-4.756854679938556929e-01,-8.286724569374536165e-01,9.319570762674318498e-01,1.311722254443877800e+00,1.480451809399247365e+00,1.542709387809499955e+00,8.399762338336261847e-01,2.963019386795779919e-01,4.121399101078421223e-04,1.800803534384111670e-01,4.088421085501492414e-01,7.757939125195703056e-01,2.526867846037009091e+00,-3.142496550791402665e-01,2.223588642883621846e-01,9.872124404418143317e-01,4.021185871054778538e+00,1.247892273816707975e+00,3.499874125617055132e-01,-6.712006450840806160e-01,-8.215769798766126009e-01,1.542506771784831310e+00,5.114352520812937009e-01,-1.265243394398421761e-01,-1.507821877552072420e-01,1.271877682603789861e+00,1.432223849213245082e+00,-6.767170425197945871e-01,-6.358295313201979271e-01,8.231091354069568489e-01,3.964231121397265856e-01,-3.713939381583326593e-01,-5.897149354550703659e-01,1.157130090528048827e+00,-3.858026487783157710e-01,1.299181806196769706e-02,2.729048814851045890e+00,-3.696111432867721924e-01,4.267258340860413113e-01,1.069076147507933783e+00,-2.174541933755831935e-01,1.710531960679352981e+00,7.578537099611976080e-02,7.012851089788870729e-01,-2.133614714327549677e-01,-6.287278467373509372e-01,-7.594986724964114533e-02,1.247319602752991891e-01,-2.100651160409244822e-02,1.297860328031652077e+00,4.946411188945631920e-01,-8.123503934898764767e-01,1.813316513211896130e-01,2.036000735504555958e+00,6.046779327555470429e-01,1.137321351065405106e-01,1.813067271195823116e+00,-3.303120836382111847e-01,7.857282136441471332e-01,3.895673592363469995e-01,8.550023330098626140e-01,-1.597921256906888465e-01
1.025678302020728072e+00,9.188329428869729254e-01,2.203036155048730960e-01,-3.555453594811486817e-01,-4.049818698365457714e-01,4.186809293653466213e-01,-3.979406403531091097e-01,3.948054909589551187e-01,2.708456593394551248e+00,5.234897209926216988e-01,-1.316657732974589323e-01,1.734188867399912293e-01,-6.089812606414728435e-01,-2.765015251440839372e-01,1.737223792912656606e-02,1.619419402351065518e+00,-6.180363769680305985e-01,3.387479393108211445e-01,2.174038640237884595e-02,4.787338253335606808e-01,-1.248076792616080732e+00,6.186809250517913972e-01,-2.723823889604614079e-01,3.265794296862142843e-02,1.307135061654670860e+00,-5.662411192912059077e-01,4.676177543410965642e-02,-6.884526111881732469e-01,-5.838655577520939222e-01,-5.147542556254419699e-01,5.103411962748124475e-01,2.906731187060939803e+00,-3.101620282152127706e-01,-3.753782642638232026e-01,-5.953047821835965037e-01,-4.397662123580515781e-01,1.756116188759759167e+00,1.030478466302897189e+00,1.060433498371369243e+00,1.689185490053436656e+00,1.211393682234519042e+00,5.611430747038655964e-01,5.244737605512277412e-01,2.317287047567796465e-01,6.789558258280802283e-01,6.182959622851418313e-01,3.285134307492872718e+00,1.652694065412105562e-01,2.620450731484240126e-01,8.109255189596547009e-01,4.119656120342918726e+00,1.623782560521944029e+00,9.966501284230079305e-01,-2.655823424491902673e-01,-6.493651978431491667e-01,1.424995086771049468e+00,2.746723130201864649e-01,-6.274817092448830014e-01,-5.233268761833693716e-01,1.718187530175788513e+00,7.358533770118500517e-01,7.805818275998577249e-02,-4.039963738626795031e-01,8.418816134458106948e-01,1.012316440819238217e+00,2.786896276546211859e-01,3.370105383064969651e-02,1.651725540124371561e+00,4.454221780235363692e-03,-1.025195714095032518e+00,2.923573595060091623e+00,-5.157984256387979638e-01,1.430181022518493550e-01,5.957031068236864901e-02,2.054630679763100876e-01,8.938800261567967365e-01,4.550554612628649465e-01,3.746531142782202339e-01,-1.118848946505229813e+00,-1.567261839136574464e-01,1.977638565891169931e-01,3.223835687396623406e-01,-3.785471526455894686e-01,1.379289565616477420e+00,5.289480874167298285e-01,-9.010319671367599259e-01,-4.043640486311489424e-02,2.285462682045727334e+00,8.810530165445598083e-01,-1.041850993987150975e+00,2.515513488083746196e+00,-3.826790985426987146e-01,1.654279615336219145e+00,4.880629471877910852e-01,-4.699872589559989655e-01,-2.059095536194063547e-01
7.156805448296276184e-01,2.136827871723275818e-01,-2.522459841773789790e-01,-6.705945535174395733e-02,-8.329685127976381442e-02,8.532753164241702049e-01,1.362602133611442223e+00,-2.558992205255972152e-01,1.121162355906764052e-01,1.112438629990668282e-01,4.476060288468822201e-01,-3.838953095034137730e-01,-4.350373060255163238e-01,1.156351329908289205e-01,-2.897102864742211459e-01,1.135436223721491222e+00,-6.882220386227613229e-01,-8.073977065118047580e-01,2.637657267278389894e-01,8.385576126373421590e-02,-6.838622950897044195e-01,8.190848529625527341e-02,-6.162183773143063981e-01,3.722430602625672602e-01,1.504535024497757112e+00,-3.793944230846999638e-02,2.455131089744996831e-02,-7.423835379831630332e-01,-1.137756511168680706e+00,-9.756475749048820756e-01,6.852891249309109867e-01,2.458263821814726136e+00,2.412101116156443736e-01,3.472672547678456456e-01,-7.311605346797094285e-01,-7.491258500476341009e-01,1.548261862193052174e+00,6.610163269503724903e-01,1.788078598983379175e+00,5.195902079839128662e-01,8.399050358751231071e-01,5.472839457483805736e-01,-3.200615102134639622e-01,2.227751002975853489e-01,5.666118175159549075e-01,9.462962735609419251e-01,1.856270731305357913e+00,1.968394648446787076e-01,5.463213466042625699e-01,-1.586145904416683683e-01,4.581473442144789132e+00,2.227726022253398774e+00,3.421266588061733227e-01,-4.368979402805949208e-01,-2.219193060518126759e-01,1.232713992786781398e+00,-2.090686160100271307e-01,-3.094247175135143024e-01,-3.947784774507526184e-01,1.478133411452529078e+00,3.315420238153169441e-01,-1.074273135620388953e+00,-4.272641594796324771e-01,-2.589552759095855583e-01,6.759767677549342046e-01,9.651842726267625960e-02,-7.513941765368769010e-01,1.018417448682573889e+00,-8.469053090743102752e-01,8.314620831063856965e-01,2.237821585254609058e+00,-2.111430648030432344e-02,1.055299108100839212e-01,7.574048432275938270e-01,2.088437954047179246e-01,9.268288461195692829e-01,-6.956023437384053487e-01,-1.682576000236430946e-01,-6.928660387971385948e-01,-1.064572679983387449e+00,4.514033031117358763e-01,-1.973544849179996175e-01,-4.435296342209105735e-01,1.842639497161514761e+00,2.862160483670351807e-01,-1.164262410639731016e+00,1.561552736192523549e-01,1.040596441884341417e+00,1.161338343606113099e+00,-8.152815353709368384e-01,1.264949526265542357e+00,-2.427657582303086592e-01,8.839039617905133372e-01,6.102939893795440440e-01,-5.290149698554982294e-01,-7.209862893304521680e-01
4.175986230638248919e-01,-9.024320146660534947e-01,3.272615997766283313e-01,-3.397289073714168661e-01,-4.045324405510009602e-01,7.012466695499484093e-01,4.576996633645061818e-01,-3.473367956873417151e-01,1.134249804085488478e+00,1.058018751606510932e+00,9.239032690173065721e-01,-8.544492470193126854e-02,-5.132902491555527691e-01,-7.181958086039329503e-01,-2.900076384543452956e-01,1.574163657488010903e+00,-1.241620602891158054e+00,6.015584101816060514e-01,2.579479107146749883e-01,4.713606723243912167e-01,-1.121030760672808935e+00,8.797050001282303855e-01,9.539139301471732946e-02,1.537762923675687066e-01,1.582961282833976746e+00,-9.612465055084229437e-01,5.130676985935808121e-01,-8.830715610450373676e-01,-8.718465915868460758e-01,-8.040698983151668422e-01,3.785508367948392516e-01,3.401671071249245060e+00,-3.194424956183157804e-01,2.498003570933010620e-02,-1.939594329012275242e-01,-4.490665885489054654e-01,9.526870637732010039e-01,1.459539328524355639e+00,2.371150816909118220e+00,2.774899391668466997e+00,8.961977537394780757e-01,6.753762354212030639e-01,3.120996280088110808e-01,-4.633326463284297425e-01,5.588556482020441418e-01,4.220077913541367964e-01,2.603021510479146983e+00,-6.752828724970898477e-01,9.025915929066369303e-02,1.770162064961517401e-01,3.728085191104399954e+00,2.050312521654793940e+00,2.939099865308831827e-01,-5.532813073449590613e-01,-1.569120723375649895e+00,2.389339598061420489e+00,1.494704613456926179e+00,-2.385598563966117025e-01,1.229640049644635802e-01,3.126525637742905595e+00,1.319118296687579406e+00,-8.760577800298916529e-01,-6.782779042223048283e-01,1.520616813850480309e+00,1.050987673735582106e+00,2.164100564302618712e-01,-5.901343093612438917e-01,1.845110739503597497e+00,3.141786252726545547e-01,-4.826280534966795877e-01,2.390382469542790211e+00,-1.126446308574142185e-01,1.047751763612415621e+00,2.660565440516226010e-01,-2.447117213967891503e-01,1.158629930954582221e+00,-2.123217961634996653e-01,9.264919199786392223e-01,-1.044459547193014037e+00,-3.439395724130488996e-01,-3.080806620023646136e-01,6.606446778629460059e-01,-3.431882240384421801e-01,2.005201270970353278e+00,8.845817182942212753e-01,-1.533904022158000924e+00,2.258225034977523471e-02,2.666614318708381060e+00,7.155549010689020717e-01,-2.045173292042923030e-01,2.282181560179243895e+00,4.762577407186616707e-01,3.511746852269397312e-01,5.038033006698283689e-01,9.796997212672764466e-01,-4.711786339888104358e-01
4.334730794218925043e-01,1.590084418422618162e-01,2.320657221959523397e-01,-9.461390145567809551e-01,-5.184002947601505651e-02,2.019512232256893969e-01,6.239041519143069259e-01,-5.264146118891359638e-01,1.826673557008432480e-01,4.589585724553064683e-01,6.387964509561255833e-01,2.788565586733363078e-02,-4.067009037892254653e-01,-3.788395878601788502e-01,-5.669501182273306572e-01,1.246198970546993579e+00,-8.081447740917624412e-01,3.700494229936067692e-01,-9.115361114280598476e-02,5.261961817967029248e-02,-6.518029041282961122e-01,5.214451399121409203e-01,-3.232451710180621607e-01,1.532247576384762333e-01,1.999228950407063277e+00,1.393874929765713255e-01,4.874697191567968213e-01,-7.721323207489818596e-01,-1.687715231839529206e+00,-1.550468991429079457e+00,4.562479262597657348e-02,2.859121352939185456e+00,-5.233884000042561269e-01,3.866071387613070343e-01,-5.009569609614542562e-01,-3.656805738535817141e-01,1.334608033562084906e+00,1.056681167298560098e+00,2.728833208237021246e+00,1.654967749681240274e+00,2.710208027195805114e-01,5.680370105690430993e-01,3.589235089172797266e-03,-5.147547925313651351e-01,5.865935305221168239e-01,7.265032849516126490e-01,2.204680629001013692e+00,-4.397745683267134664e-01,-1.417714105680311643e-01,3.965592594432320039e-01,3.266001135214337214e+00,2.130085575254203167e+00,-1.452280953582170131e-01,-3.233128294222979426e-01,-8.652070935559246223e-01,2.095838018426875227e+00,1.042555282745172729e+00,1.362427054259666703e-01,-5.622332935355947026e-01,2.324003499153303842e+00,2.392451185250760448e-01,-3.683346327836377609e-01,1.533311101561762868e-01,1.276738010472140195e+00,1.605146793441462716e+00,7.256903501687701485e-01,-8.516531521126828874e-01,7.961747955659667086e-01,5.904586704757220916e-01,5.770611193903107949e-01,1.521216426535300315e+00,-2.399441969318732160e-01,5.292828787942019941e-01,-2.137328271954684611e-01,-3.793318774428559581e-01,6.564387978016658076e-01,-7.492570644513431022e-01,7.522837124679568888e-01,-1.535019839118436202e+00,-2.019002731614236434e-01,4.517007233005028710e-01,2.776852519863171054e-01,-3.359073026897367864e-01,2.250476575092318576e+00,1.148478037757767245e+00,-1.627885722140043789e+00,4.622799464424472982e-01,9.591930069758023425e-01,6.649072323749085633e-01,9.047477695680045118e-02,1.409351392661991831e+00,-1.233784455176046291e-01,1.701339761060786104e-01,2.603859291217525684e-01,7.245084092609861415e-01,-4.618789483652321892e-01
7.611782674716696118e-01,-5.312000246412468263e-01,-5.429419824659873495e-01,3.700611092920389478e-01,-5.752320008809098661e-01,1.531716851344625319e+00,1.582166261750392877e+00,8.598072422541885862e-02,9.058654073850612720e-01,4.372464990923684569e-01,6.576842678967111944e-01,-4.744673239352992233e-01,-4.638681573292343097e-01,-1.415970328474724371e-01,-3.228874521677747023e-01,1.430333234171411005e+00,-7.965671833407093061e-01,-9.936382274684372184e-01,3.940280293586518323e-01,2.060069796128242425e-01,-8.044362255615298274e-01,6.232165628425643256e-01,-3.724695539704250269e-01,2.841962096118503811e-01,1.380434345880755753e+00,-6.904099169065924801e-01,-2.487318897788668159e-01,-8.326699049918588891e-01,-1.036642933938767719e+00,-7.889775440967261577e-01,9.957393658618884924e-01,2.811721963306716532e+00,5.105380656871563172e-01,4.115834922041940458e-01,-6.495690705898424788e-01,-8.181098941927031909e-01,1.729322032139736898e+00,5.764408046074187553e-01,1.753033860974311686e+00,9.795180068287543396e-01,1.426747323750844121e+00,6.667916641021063295e-01,-1.483618186986135901e-01,3.644762666588079458e-01,4.176949643384832989e-01,7.022454180922059752e-01,1.952902509995013025e+00,3.589764071633261833e-01,8.982763063181565810e-01,-9.648516069621514424e-01,5.485091048944104486e+00,2.800061936568106091e+00,9.718604594669171259e-01,-5.130897372371974186e-01,-4.939063453745834442e-01,1.356491895950722171e+00,-4.423942872610264754e-02,-7.327547149708363294e-01,-2.366968759968807179e-01,2.654586514874613723e+00,4.300295492416952303e-01,-1.595867832021100607e+00,-9.603473221573453067e-01,-6.242398886886032505e-01,3.180113000163899972e-01,-1.876121261360119696e-01,-6.163781699501550415e-01,1.608724959898038653e+00,-1.191787477915574600e+00,2.858372106586722916e-01,2.903749407531031501e+00,3.631333688985808883e-01,2.904029498841452783e-01,8.286319348883346425e-01,5.949138903146752311e-01,7.809582150070859541e-01,-6.755357822928897971e-01,-2.463929432983098522e-01,-6.587719686863908741e-01,-1.342342548515666145e+00,4.265903158678939211e-01,2.194452579278955984e-01,-7.070627072919275502e-01,1.813735208144825251e+00,2.182269412095363403e-01,-1.379200683749567613e+00,-3.220204344917870221e-01,1.885574899279190308e+00,1.501378765537462634e+00,-1.831353917109540319e+00,1.923843931275816654e+00,3.951532444977388092e-01,1.148474850364381350e+00,8.180617284362725616e-01,-9.640058864567726538e-01,-1.106500477937138349e+00
8.201265462629453440e-01,1.041370982043254623e+00,-3.800893760221424333e-01,-5.873741125624037940e-01,-1.192428907959784679e-02,3.185601388994314109e-01,6.278036790069079220e-01,-6.343810649075445895e-02,4.002974154560323683e-02,1.078533485915882384e-01,8.685785085135416805e-01,1.101060747668002743e-01,-2.817577971356196587e-01,3.278206429978487435e-01,-6.124005653858332066e-01,1.790276465759526481e+00,6.918887504181175929e-02,-5.342534263686116169e-01,-1.074494883967464648e-02,-1.595022745728087443e-01,-3.367179196643999006e-01,3.308338089604012100e-01,-6.548743369031446715e-01,2.804620973289125851e-01,1.690029317388767716e+00,2.010216684507457746e-02,1.041946471314190992e-01,-5.741920052682705222e-01,-8.557128866958634283e-01,-1.191430186707569172e+00,3.102572615406823386e-01,2.032444050015592030e+00,-1.358264573439612322e-01,2.161097006689391697e-01,-7.736971108380047424e-01,-8.100470935188229804e-01,1.539313791496192296e+00,7.827832612393431644e-01,2.054022217233722358e+00,6.869736782519184626e-01,4.984401986356636893e-01,1.689326574386685875e-01,-1.997313112636591170e-01,2.084119339125024006e-01,1.738211369698727249e-01,8.981240872699098876e-01,2.171665264006208407e+00,4.583658875254847248e-02,1.383024692367414987e-01,7.062189552573173712e-01,4.167355703442692239e+00,1.798480028204863412e+00,3.745402424575012268e-01,-4.872934546665896871e-01,-2.616440534483599478e-01,1.396800781123807456e+00,3.340866027938382832e-01,7.492501359901815317e-02,-1.009514303896737575e+00,1.480269371166796688e+00,1.423597668421940909e-01,-3.934015641718127121e-01,1.314092911434027941e-02,3.966000768139523736e-01,7.812921549642792840e-01,-5.444011721519625979e-02,-8.581571380290151652e-01,1.561862505889325403e-01,-1.432275508614047066e-01,8.652238841435146988e-01,2.250551583916515774e+00,-1.826735497443441048e-01,-3.980128154077826330e-02,4.558474585936660439e-01,-1.463435707709206390e-01,9.626878566815838534e-01,-5.900812441626923643e-01,6.983093814010346012e-01,-8.365736192644972480e-01,-5.871962121410768676e-01,9.923527731647083794e-01,1.770257669093443509e-01,-1.878062399019605200e-01,1.517412879117152613e+00,9.953091563235608730e-01,-1.180467589966017528e+00,3.284848622205147617e-01,5.838982964451041591e-01,7.312885299004032724e-01,-2.916978305739988953e-01,1.365532354685772942e+00,-4.950483496035569808e-01,6.742272327970658674e-01,1.444544233349737694e-01,5.086251612523124965e-01,-4.581945502251373314e-01
6.927770535691379905e-01,3.724450342605214459e-01,-1.433219709271353892e-01,-4.193565054668554892e-01,-1.264791846370745543e-01,5.333620168246664406e-01,7.573034325754169904e-01,-1.867152761166160913e-01,3.807060496189464960e-01,3.331471724487087283e-01,7.113202272454435260e-01,-6.426559030612666312e-02,-3.888106874872697127e-01,-7.711153685174054750e-03,-4.391085233840018587e-01,1.524823909021050916e+00,-4.779449839021383539e-01,-2.899039372650213942e-01,1.084323042768246259e-01,6.557174707705476502e-02,-6.369246871445286562e-01,3.976799109342574190e-01,-4.608381428043614170e-01,2.608439478602287420e-01,1.631153868818499442e+00,-1.952842405844795182e-01,1.863433998982176043e-01,-6.984589134340819516e-01,-9.937511281455460033e-01,-1.065177965070055688e+00,4.115879078454081075e-01,2.506337094225019158e+00,-1.053274236951683984e-01,2.089913870751425040e-01,-6.243146788829476712e-01,-6.761072388627603624e-01,1.425342483225002121e+00,9.071411182766476733e-01,2.061356598956792574e+00,1.152579910716591494e+00,6.766126742568288055e-01,4.138472781701779124e-01,-9.147924433274726153e-02,2.873961949217576639e-02,4.028996513487998476e-01,7.955760274748203686e-01,2.211926021161362499e+00,-8.247000632774799389e-02,2.231714305877034454e-01,3.459471322505336954e-01,4.127630753949022235e+00,1.987406334769153515e+00,3.359207324367029512e-01,-4.646461879082012247e-01,-5.614333967899867162e-01,1.598143603418213265e+00,4.627630207874239288e-01,-1.112408129101150334e-01,-5.770981313731519124e-01,1.876275586952407259e+00,4.425155689693470729e-01,-6.510802768575868482e-01,-2.419763953294174763e-01,5.165110413854820948e-01,8.778643661803473552e-01,1.119381306550457089e-01,-7.449264304002938264e-01,8.160125801199761275e-01,-1.830877816409166303e-01,5.066460454098258293e-01,2.242617529078467786e+00,-1.398594733144752911e-01,2.575606534312858131e-01,4.310046833181657711e-01,-7.224549791244688768e-02,9.595874551143820375e-01,-5.229104785038726222e-01,4.997951942876276976e-01,-9.057244645839568342e-01,-6.243604460160775416e-01,5.305390733757213706e-01,1.840279940131521741e-01,-3.073589377878073736e-01,1.751795758649222323e+00,7.794142779288071310e-01,-1.271174231628958040e+00,2.186136766344759230e-01,1.195531652893023766e+00,8.469824563584372745e-01,-4.211694588411623585e-01,1.561050666517463048e+00,-2.055552579503862609e-01,6.667827207686535251e-01,3.606706012985836374e-01,2.952935568724175397e-01,-5.257683781236172083e-01
9.654339036527449514e-01,2.350569003791279865e+00,-3.458446444711801848e-02,-1.214282007725824730e+00,2.295600797815239846e-01,-2.695263571856148510e-01,2.425564442750245131e-01,-5.185076560796369333e-02,5.615844406730223781e-01,-4.602414216904806565e-01,-3.413745325716600054e-01,2.315287959437458409e-01,-3.922799927017476262e-01,3.522261878849279881e-01,-4.883010838276131693e-01,1.062762224012277823e+00,5.374137636083020642e-02,-2.659234056455749839e-01,-4.378370594606841304e-01,-2.551576280076545689e-01,-3.849868742389191412e-01,-5.585196147779519782e-02,-9.805425635579647636e-01,1.262849714315423255e-01,1.976970812481773754e+00,1.187794894951296865e+00,3.683795102438955360e-02,-5.240475382621645473e-01,-1.866737607915834207e+00,-1.730747254497846166e+00,2.831224159894130121e-02,1.947552461241086608e+00,-5.013154750619477351e-01,3.187679627261885695e-01,-1.074670301206290146e+00,-4.102488301886761946e-01,2.215311496601255481e+00,3.811178821431961405e-01,1.800939188379331757e+00,-2.322289706606639470e-01,1.444344633997328153e-01,3.590173134091148022e-01,-1.499668296738997930e-01,1.417196680729234937e-01,6.592585990677595209e-01,1.153572612879848247e+00,2.344248348681526650e+00,4.737742527178227525e-01,-5.439274822234006768e-02,9.982237681522998507e-01,3.482559293766867903e+00,1.816199619514042185e+00,1.436563419170060751e-01,9.569111404136410037e-03,4.759509035799588395e-01,9.672511126374701007e-01,-4.529746401191668825e-01,6.357370556347910484e-02,-1.521945812951678967e+00,4.285564306169327153e-01,-9.198793189461875741e-01,5.751346449733147903e-01,8.451454978962809061e-01,2.870200613817232016e-01,1.736264265629895664e+00,9.510482140683181873e-01,-5.786817206697179028e-01,-1.348841429341202103e-01,2.523173343130618029e-01,1.037208638404396144e+00,1.453478584467195578e+00,-6.024101166239854699e-01,-6.230876540828426124e-01,-4.527001796535446987e-01,-5.182500917252154393e-02,2.147342514433022709e-01,-6.163642596922900285e-01,7.147002221850085046e-02,-1.704410727933942438e+00,-1.428622568846632801e-01,1.390687207978798856e+00,-3.587877508904018797e-01,-3.388108107791761858e-01,1.826058430929180521e+00,9.084194124882133403e-01,-1.092443308680843383e+00,6.900491764718335030e-01,-5.786673055045938874e-01,8.169662989328602132e-01,-4.235209397863213265e-01,8.911179092713180649e-01,-1.261718946021625598e+00,1.135981314449638235e+00,1.168367594142861732e-01,-7.007306526250978163e-01,-2.801336180655479291e-01
9.062889171293135870e-01,1.020093425667688791e+00,1.124983288330378833e-01,-1.601254661102046728e-01,1.501131895004669259e-01,3.767418883224755155e-01,6.407750115731138951e-01,-1.662088560840592755e-01,7.556455011264318067e-01,-3.789852660635847914e-02,-1.309629804084892490e-01,-2.565917205450341521e-01,-5.398189119569769545e-01,2.591366697271080266e-01,6.948232672805265686e-02,9.999491812281240399e-01,-6.781907183999649202e-01,-4.925256297292691654e-01,2.286439618335560642e-01,2.618402986095809126e-01,-9.689156552323338056e-01,-3.024593684413345862e-01,-7.192967911099761302e-01,3.757966204684082268e-01,1.274902817556722967e+00,1.085510815317492495e-01,1.184087631320168421e-01,-6.606877665226866814e-01,-7.187380825534280815e-01,-6.039306948741465231e-01,6.290363602074822147e-01,2.342105821518349895e+00,6.596907986645939026e-02,-1.031233469184395235e-01,-7.775930937312315328e-01,-6.652881066904970941e-01,1.515664539986416148e+00,8.115913836698078754e-01,1.054613228676118286e+00,3.811749324030835329e-01,8.017494143694191555e-01,5.072223214567579408e-01,-1.571163148309199786e-01,3.592849533340575219e-01,8.101037052414408191e-01,1.058523869772964865e+00,2.348441180837476772e+00,2.481927561869028409e-01,4.081867439650815887e-01,7.138870547153428614e-01,4.090312145083465190e+00,1.492318974239871032e+00,2.971180591730830933e-01,-3.395399087006910621e-01,-3.323473270729526696e-02,9.230791371334254869e-01,-5.875039494486127278e-01,-3.314872444135537055e-01,-3.737269917596383606e-01,3.091188142754448531e-01,6.236827859142413111e-01,-4.306194976425186116e-01,-2.865894915987757807e-01,1.739246987088716168e-02,7.722838967491427731e-01,1.968836241032428380e-01,-4.077267968173440837e-01,1.114942208133437251e+00,-7.449333211369252306e-01,3.812154406547283436e-01,2.305804656840995559e+00,-5.049705228331098361e-01,-1.118266839158824494e-01,7.836873461943913988e-01,1.241532276806587703e-01,1.190004676807043804e+00,-8.305727699548942633e-02,-2.602606849232806940e-01,-5.658379247024690750e-01,-7.479443163657331084e-01,1.793924618561184570e-01,-5.040457785444809602e-01,-2.457042569537812027e-01,1.522100284969268857e+00,3.147705790131638537e-02,-6.625997579750892985e-01,3.182622178401678381e-01,1.167285495332912371e+00,9.527924650023085196e-01,-4.165113903768928871e-01,1.307571441716356198e+00,-8.349706158045084869e-01,1.319477654864060767e+00,5.785944075344915394e-01,-6.627750762851509769e-01,-2.420673465922947853e-01
9.759717574969488663e-01,1.811003190705508636e+00,-1.960415725999093417e-01,-6.275276594965700783e-01,2.006005334118322603e-01,1.723381957058152669e-01,7.473831117406743996e-01,-7.523082705979800000e-02,3.124941847213661972e-01,-4.209200756196113113e-01,-1.739845261596614789e-01,-6.942257153394956748e-02,-4.134429664930245885e-01,4.774847961755980807e-01,-3.133618116100334028e-01,1.031953012921498436e+00,-1.241067617750592489e-01,-7.566494371251634155e-01,-1.115008665048362324e-01,-1.385365721061249389e-01,-4.914475113575164644e-01,-2.385641272211255215e-01,-9.848693702817783446e-01,2.904660876831535177e-01,1.663719999237975866e+00,8.019643092784964900e-01,-5.894399728823021545e-02,-5.658848242367280346e-01,-1.404165839343784361e+00,-1.290477667998993550e+00,3.936316873706543484e-01,1.927784698032012356e+00,-7.068125055837834458e-02,2.653859202419117658e-01,-1.039465504239688975e+00,-6.356762052831385068e-01,2.012290438334449316e+00,3.901530438736107720e-01,1.466252360868061322e+00,-3.803170829214765902e-01,4.650248769446855279e-01,3.821696047150652253e-01,-3.163788924484329801e-01,3.869375905500048729e-01,6.426128110890558798e-01,1.188556086258675037e+00,2.102478842974496498e+00,5.433931502683464476e-01,2.914947633365370105e-01,6.392245638315808831e-01,4.091572971070670306e+00,1.832320973906991224e+00,2.715118609474699296e-01,-1.690735516965999607e-01,4.753225229920986505e-01,7.626747353331604362e-01,-7.782719235660670032e-01,-1.298818531852042046e-01,-1.115705540138377527e+00,2.824119704165461986e-01,-4.419294930899213547e-01,-7.489306950968324661e-02,3.189646012183657842e-01,-2.747058330211171739e-01,1.134879375925672340e+00,4.933037417488961851e-01,-6.067557683322521989e-01,2.297711447428815723e-01,-4.925273228622397692e-01,1.085484246194650337e+00,1.864893763904428514e+00,-4.283983215366317099e-01,-5.424304163537922996e-01,2.573831306674424502e-01,1.431872357286147479e-01,5.971134454385124135e-01,-5.771407443270555326e-01,-2.527697487813648225e-01,-1.084377479463093819e+00,-6.506591438963922336e-01,1.060366644894255028e+00,-5.138675508991255025e-01,-3.436334330849541985e-01,1.670183850859561669e+00,4.429141747357874248e-01,-9.054750775030486754e-01,4.944783406758355149e-01,-1.053858521898707323e-01,1.007083444186320342e+00,-6.391291822186145888e-01,8.941114879592858555e-01,-1.083869209409447532e+00,1.251545697967032966e+00,3.471198313636165156e-01,-9.233834196530896765e-01,-4.115935065262431580e-01
7.076306024338899769e-01,1.123656781904391000e+00,1.100203616363056025e-02,-5.519922107356758367e-01,4.220208078531826890e-01,1.076307863242934870e-01,1.038577572132445059e+00,-5.485151147671540883e-01,-6.536468527573100484e-01,-2.406997521431996356e-01,2.554872509931336300e-01,-2.320248316513181530e-01,-3.900430384479933732e-01,4.274372128434958396e-01,-2.802880854023537260e-01,9.213350765186275604e-01,-4.619048004423715326e-01,-6.198136811451879780e-01,1.005371190098827139e-01,-6.812116952837668493e-02,-5.237896060454315661e-01,-4.516655799809690119e-01,-8.841397517170512810e-01,4.518632341306560996e-01,1.631374988367249701e+00,6.317869588893679778e-01,2.868605834807969046e-01,-6.233595438007509815e-01,-1.176791626691589210e+00,-1.165544754249271620e+00,3.441052478387863212e-01,2.023284752785577734e+00,-5.953125987844273825e-02,2.505782531689757509e-01,-8.350984479726465404e-01,-6.971509466992947823e-01,1.389817388206340709e+00,7.423214677147980112e-01,1.794228541873425176e+00,2.074523303559316911e-02,2.278195810335366112e-01,3.739554987025793809e-01,-4.791785071458770640e-01,1.164195878434391845e-01,6.695991304943396116e-01,1.197144900772517229e+00,1.811808404074424228e+00,5.202412297595145063e-02,1.606047348710820388e-01,7.734327847092871133e-01,3.659278216999797717e+00,1.581651308577603388e+00,-2.571781422787975391e-01,-3.621488897015942565e-01,8.772444371579735112e-02,1.080196472339693514e+00,-3.706439627991842123e-01,1.448648910993810823e-01,-6.448933452826249857e-01,2.277126208986344214e-01,1.989857743046491156e-01,-4.510519705574814742e-01,1.584846314219078012e-01,1.385905007648297049e-01,1.024405414911798928e+00,3.478101833229417794e-01,-8.802308230989015492e-01,3.143623167399831608e-01,-4.536683289093565996e-01,1.374265448426326808e+00,1.602760829254555652e+00,-4.368535089209724109e-01,-1.346451885315667063e-01,6.680499996917431682e-01,-1.998084295974642544e-01,1.081645569514952276e+00,-6.788147552911918403e-01,-1.551388273055065437e-02,-7.236414701556039830e-01,-7.388593505748460855e-01,5.567016122146266621e-01,-5.914185770390667507e-01,-1.470247319075613790e-01,1.800082071991144783e+00,4.129502963245263447e-01,-9.177799254591156863e-01,6.512026169601370373e-01,1.254164448151842137e-01,7.787040827020298428e-01,2.338960519121087711e-01,6.175946498699492748e-01,-9.466052495227377239e-01,6.451803140982705909e-01,3.492966882615281543e-01,-2.605199271075747669e-02,-2.951879001005832670e-01
1.095155536651819972e+00,1.338468111170125319e+00,-2.089061529131359674e-01,-3.430678223806990501e-01,-2.739081432043610764e-01,4.903834120057862789e-01,1.360750279894916981e-01,3.936516212437707329e-01,1.793324845327748829e+00,1.279057847383000546e-01,3.033424218749575241e-02,1.069274343775002967e-01,-4.808004533855982920e-01,1.426115928997561122e-01,-2.114963166395434357e-01,1.628954876329100632e+00,-1.634961428201436029e-01,-3.715395700598815854e-01,-2.045118068146932477e-02,1.527979325016967649e-01,-8.208740636048877937e-01,4.063173441013807619e-01,-5.883082587104931926e-01,1.342283638828715708e-01,1.411230754934666765e+00,-1.548412348453885590e-01,-1.547159871283500798e-01,-6.052493209278483333e-01,-7.652471242713926314e-01,-7.953722393250632905e-01,5.563578413168703829e-01,2.362644678652082497e+00,-8.535115585444280617e-02,-8.670949413993270238e-02,-8.308148932614554116e-01,-6.436972771437264873e-01,1.975279953401596122e+00,6.629987885323991303e-01,1.176797262702169888e+00,7.209327529824306469e-01,1.050639911789883918e+00,3.963534476920399507e-01,1.615443755333789699e-01,4.745928727868876651e-01,4.795750547031968347e-01,8.264913693751202439e-01,2.783505150351568425e+00,4.630406502926693868e-01,3.916914138552263780e-01,6.076737295759829793e-01,4.525442828453515531e+00,1.818059063220898386e+00,9.634108652792892080e-01,-2.831241433880044012e-01,-1.125076621632776774e-01,1.060527212973060296e+00,-2.092217729936308723e-01,-4.930326229246152492e-01,-9.141628558450255460e-01,1.317725374930661442e+00,1.599272630036801812e-01,-9.696614308476186883e-02,-2.090800788195734394e-01,1.179388670805427974e-01,8.178687922101506302e-01,1.253417926795076798e-01,-2.476472747759744797e-01,9.455172813359784545e-01,-3.818780117821793940e-01,-1.444924064773672745e-01,2.775114223048043449e+00,-3.446955500822572183e-01,-2.338733637496477891e-01,2.514173872599522186e-01,3.013388558981270893e-01,7.548495437042099798e-01,2.732269593540004315e-04,1.619630409655034020e-01,-9.926624409328073106e-01,-4.941093131332467969e-01,7.740905038109111569e-01,1.085408409863022616e-01,-3.955423785341718457e-01,1.342494665253318509e+00,5.418405542334178149e-01,-9.122524821843785992e-01,4.720648423196427412e-02,1.307034044986940868e+00,1.014052438585879790e+00,-1.201273868284827850e+00,1.975884343638314000e+00,-5.842671879070586716e-01,1.602792077387700687e+00,4.083399392505106529e-01,-7.260906338428361195e-01,-4.090861609649568686e-01
7.757702602449665363e-01,1.142230453747769880e+00,5.829741345942142383e-02,-5.843799324646723470e-01,2.705096841374749483e-01,4.194118430650312090e-02,5.058116581644152010e-01,-3.310126495309430039e-01,8.818784033499671438e-03,1.222373275769059187e-02,4.024864893232718011e-01,-2.362202238534130694e-02,-3.971233195071908195e-01,3.151808558163458618e-01,-2.710900201360377793e-01,1.308462917441499229e+00,-3.434089305625484534e-01,-2.880173205713806306e-01,7.507551318510777283e-02,3.408572334413850768e-02,-6.312770014799841123e-01,-1.517430668708223962e-01,-7.085185032849764530e-01,3.633647699256189467e-01,1.551823612741244585e+00,2.339860416479504490e-01,3.166272292406913103e-01,-5.999881100399171441e-01,-7.922875034259264648e-01,-9.650657071236209417e-01,2.962944911648696666e-01,2.136158405987165221e+00,-2.030650412151404904e-01,1.194235827072745448e-02,-7.332017135466671887e-01,-6.896132015317444353e-01,1.317426319275398772e+00,9.491785961579444209e-01,1.698053949876475510e+00,6.080954393653097423e-01,3.686317673531182559e-01,2.948278686208321564e-01,-2.164627988644843293e-01,1.171390620533263455e-01,5.453828882490763252e-01,1.029842005177075137e+00,2.239630597421738312e+00,-7.109604495013135961e-02,6.045336365327996786e-02,1.085419836122086590e+00,3.614470487195622805e+00,1.373088387497750640e+00,-4.882701539367539922e-03,-4.189107263916940216e-01,-2.140884236640387406e-01,1.270703824228898604e+00,3.711538292443861131e-02,1.014701005659666422e-01,-6.618044218390390920e-01,5.818989651312629352e-01,4.986504468396834033e-01,-2.279577254622815463e-01,5.188198169751125077e-02,5.854097107520450649e-01,9.539684211615730991e-01,1.841105602515382966e-01,-7.238195181443507487e-01,4.548614778001479619e-01,-1.718754794382489348e-01,7.864940430984231901e-01,1.968153594200080958e+00,-5.039531936307886095e-01,-9.043573510710042895e-03,5.852010204044739705e-01,-2.653674398474545337e-01,1.210120217473078741e+00,-3.338925669669831064e-01,4.013680293347641204e-01,-7.141915952860810046e-01,-4.939201996991504640e-01,4.796432137537083307e-01,-2.547800921023401499e-01,-7.356984830761792438e-02,1.573087817776916086e+00,6.159546417930221729e-01,-8.855268609676929525e-01,5.333645134136477672e-01,6.821238990106005540e-01,6.264664926820804336e-01,2.431139418348889358e-01,1.114204204626423111e+00,-8.362667298523824844e-01,7.372200626548024438e-01,2.567546531861836234e-01,3.837202628557633832e-01,-1.598617560554907446e-01
7.516137574620499473e-01,1.057039768777510824e+00,8.160719762105210495e-02,-8.076887370017211687e-01,-7.848438059799331401e-03,1.995206196591459702e-01,5.322580169367259195e-01,-1.966868726931269018e-01,7.108999596062098858e-01,4.013988142276711524e-02,1.705425788640685392e-02,8.807357369734730712e-03,-4.572873564537453528e-01,-4.915791708053522668e-02,-3.794149576194228435e-01,1.092034858348271964e+00,-5.323902735661358854e-01,-7.405811513687154957e-02,-1.488745362932758776e-01,1.941623721061165597e-02,-6.774190791748782026e-01,2.178301720751014137e-01,-6.182825870259903711e-01,1.561320054028687287e-01,1.825032409512148179e+00,4.709752597976883948e-01,1.648019796476490328e-01,-6.831903654945964410e-01,-1.638849529987084885e+00,-1.410985439895697802e+00,2.301655079456681463e-01,2.518115637072340540e+00,-3.437166885373612590e-01,2.873804973908227200e-01,-7.783453686886278033e-01,-4.167882617136098866e-01,1.812569119248629290e+00,6.895273324856895369e-01,1.979469218786727325e+00,7.071703412755432350e-01,4.661948005762138747e-01,5.477439461937866350e-01,-4.146418797565194769e-02,-5.882790570068650859e-02,6.954872549027257822e-01,9.207690665305601208e-01,2.318673466231278901e+00,1.341212170788910196e-01,9.477759402021684876e-02,4.744171005878178304e-01,3.693541807420683387e+00,2.042478842611671563e+00,1.885629645810429911e-01,-1.685926710964946729e-01,-1.871139814751975883e-01,1.410609076646593518e+00,7.993038749514769226e-02,-1.179228936792871829e-01,-8.562113498424066549e-01,1.383350992073746122e+00,-1.776961473515714929e-01,-9.474527470223791104e-02,2.443595439320908058e-01,5.144872624629575064e-01,1.482175102111583653e+00,7.383246832360612633e-01,-5.851135163563717656e-01,6.872640923931429002e-01,1.046171222829980207e-01,5.758626134815385544e-01,1.748603068680570249e+00,-3.714915635302554753e-01,-3.667476068945323131e-02,-1.529420347818215287e-01,-2.781221172316576673e-02,4.923856518990664122e-01,-5.563199167332848472e-01,1.596124204563585947e-01,-1.466700963838475147e+00,-3.400688099975468504e-01,7.434561748516903545e-01,-9.165233092197833109e-02,-4.118748461827927976e-01,1.979380060493820537e+00,7.604991453019902536e-01,-1.267928162854254692e+00,4.240586191094557478e-01,5.585973853059111871e-01,8.964312215907459525e-01,-5.001780327233192880e-01,1.312553224667010854e+00,-6.011574671506326739e-01,8.973740072717095728e-01,3.480921674723594372e-01,-3.811672477716613883e-01,-4.368306730957901007e-01
7.835834546246573939e-01,7.751819251821541190e-01,7.197536099614834648e-03,-4.542812170197542132e-01,-2.798405335617505652e-02,3.981716318069874472e-01,6.332858844802546905e-01,-1.611663112778259632e-01,6.806347881715575365e-01,1.407023224666274497e-01,2.156191975178269882e-01,-9.718109256642809557e-02,-4.631637582814295273e-01,4.099389575917104789e-02,-2.579877967045050013e-01,1.232563077675106422e+00,-5.669771270519199380e-01,-2.705470656460136070e-01,6.162546980362374610e-02,1.228430306802213157e-01,-7.683243183347464589e-01,1.522253707035393089e-01,-5.771939262998471154e-01,2.521513958253948640e-01,1.578746755044571071e+00,8.755281150980118166e-02,1.467153981736587232e-01,-6.860602730353797529e-01,-1.118412751570281749e+00,-1.025422986438397244e+00,4.294630848836277215e-01,2.485417444422486799e+00,-1.283554281730439617e-01,1.330952083138086661e-01,-7.174043489270575114e-01,-5.823985113505679712e-01,1.595020431047186049e+00,8.054454395486080331e-01,1.712153742746906460e+00,8.024331975068333955e-01,6.762008973630196929e-01,4.959654698757214875e-01,-7.526625868880787440e-02,1.057987264256608634e-01,6.249229669762796924e-01,9.032990317469649089e-01,2.313287062125019222e+00,9.915417426227583764e-02,2.494586153325151212e-01,4.760960111835250141e-01,4.002678976205373829e+00,1.873228978270624401e+00,3.101014340095483157e-01,-3.262034039541686359e-01,-2.911984417931075542e-01,1.335758941995961901e+00,2.300684356592203050e-02,-2.061862302264734215e-01,-6.002916120108435782e-01,1.284378095330263925e+00,2.991481786219182260e-01,-4.045309011736080151e-01,-1.158958496429604024e-01,3.604282428666538141e-01,1.040260765380743635e+00,3.425970972871554832e-01,-5.694004061861893673e-01,9.046808181054418752e-01,-2.633856734053277027e-01,4.402604674778837768e-01,2.132383344607633457e+00,-3.200275014430504217e-01,5.470315235845030211e-02,3.348620339650316691e-01,2.148093901237400905e-02,8.643787809813979761e-01,-3.825190903725591007e-01,1.510684923901896570e-01,-9.965845961643164941e-01,-5.668757144809279946e-01,4.864848336326680345e-01,-9.671720036628755901e-02,-3.360550244797310682e-01,1.753352531478443277e+00,5.404293465477696401e-01,-1.089483587465350567e+00,2.943751588831611254e-01,1.028897797718386853e+00,9.092404416208970108e-01,-4.964720494297020226e-01,1.445449092647266287e+00,-5.050664522828716141e-01,9.683617391268090069e-01,4.332776236510055279e-01,-2.515052930590174207e-01,-4.193628641923962674e-01
9.860644945563452612e-01,1.295995158137266401e+00,1.898823113782246996e-01,-6.744494877994806625e-01,-2.422576233380402400e-01,1.635942807901148710e-01,-3.403288595936032057e-01,2.658977409849185847e-01,2.160081497552129193e+00,3.187918256459414401e-01,-1.219309139270326470e-01,2.523666503074259992e-01,-5.413208191860749974e-01,-1.548648694246801960e-01,-1.568002589038838268e-01,1.537660815082688481e+00,-4.191865079845387143e-01,3.101810953261746051e-01,-1.358959266204449456e-01,2.790153139268733984e-01,-1.007521805320960251e+00,5.113612578405413167e-01,-4.190122972705468962e-01,3.283361093030620625e-02,1.529194159731578573e+00,-1.237879275387994971e-01,9.460606727228856871e-02,-6.417253430276999016e-01,-9.282438250200398810e-01,-8.796774834855811687e-01,3.114606783142633839e-01,2.682188972269379246e+00,-4.463336046160150117e-01,-2.050340176841337070e-01,-6.909329120548532988e-01,-4.054554410563184774e-01,1.838907977444635522e+00,9.185197782188458948e-01,1.357624095732170133e+00,1.339568633037974354e+00,8.747918462120096716e-01,4.884939942981888494e-01,3.911528944804995578e-01,1.378015045149282858e-01,6.462045672440271948e-01,7.249621771837468920e-01,3.095147020824724482e+00,1.657053534860951638e-01,9.694904920849950480e-02,9.530395066298703588e-01,3.821206988604501920e+00,1.639781001032395880e+00,7.398625133848404367e-01,-1.966031251285821901e-01,-4.429236347637185434e-01,1.409681999540612463e+00,2.555923868262826026e-01,-3.889616262466289998e-01,-8.156124629811170035e-01,1.493774251446225332e+00,3.174240110252740665e-01,2.912730136266539760e-01,-2.342543288923280842e-02,8.878472488870764456e-01,1.274001938667342237e+00,4.835992918975323684e-01,-1.413847444719271151e-01,1.138000384914539254e+00,2.372431594671226551e-01,-5.303357330654039359e-01,2.497656666230710254e+00,-5.600008035034691467e-01,-6.690891817912436590e-03,-1.641421639189967474e-01,6.274501962904503738e-02,7.112327561933445841e-01,1.853095796072551926e-01,4.450266483597332123e-01,-1.340828654205832304e+00,-5.184552460777991367e-02,5.210148491312960317e-01,2.261688932825479115e-01,-3.417548308752367259e-01,1.508855840517439262e+00,7.480721834930811331e-01,-9.969268458976929814e-01,1.764821841572924155e-01,1.550522431027379522e+00,7.921880675593081511e-01,-7.675888330956157635e-01,2.133225221209931632e+00,-5.928099640098646317e-01,1.434644423198199625e+00,3.359030425309870171e-01,-3.295497396455588368e-01,-1.887032256307601408e-01
1.144536176191699006e+00,1.703587099148794248e+00,-1.590153555632179416e-01,-4.696368759673603677e-01,-2.162691957556445166e-01,4.179400714747588119e-01,2.101762850386441339e-01,3.949224562274071815e-01,1.902058502111543259e+00,-1.174331833914501189e-01,-4.266454616287636559e-01,6.410092763794195125e-02,-5.232057184953902151e-01,1.636792213976649979e-01,-1.675448413653268798e-01,1.292547916278151243e+00,-2.122444044490886528e-01,-4.398709982143603203e-01,-1.389538085500583164e-01,1.048153113469083159e-01,-8.228114340689532957e-01,2.451784012174555161e-01,-7.328193615278362216e-01,9.771284721278655772e-02,1.506242441286297140e+00,2.862094228331682477e-01,-2.452226299032477519e-01,-6.057734146170792311e-01,-1.215629196217000274e+00,-1.007270820546077417e+00,5.340970415495740475e-01,2.335625597375866835e+00,-1.112594860149638265e-01,3.110425856873394457e-02,-9.669481680544018687e-01,-5.237273203124279686e-01,2.279081535780394852e+00,4.282604624720833808e-01,1.079536478246664988e+00,2.418577877592251735e-01,9.853765266715797111e-01,5.047621510882117635e-01,1.166385308920523528e-01,4.959843113002345705e-01,6.678879579651089138e-01,9.397239243633992434e-01,2.722225966149606879e+00,7.015383288036852738e-01,4.257112868537851202e-01,4.829139024920653944e-01,4.468858219471057325e+00,1.976564419100715231e+00,9.160024405926824320e-01,-1.003443292870678238e-01,2.273029428928584617e-01,8.378894037778765735e-01,-6.319725088242310607e-01,-5.611389771339370114e-01,-1.070869412570388590e+00,9.804397042917241123e-01,-3.023223815694785488e-01,9.006883412740313011e-02,2.898014877853759275e-02,-1.598907269661662411e-01,1.102946207637011788e+00,4.765369701807512515e-01,-1.698799355587338189e-01,8.885133929583822754e-01,-4.182922040561309895e-01,2.137292663913337165e-02,2.499509706158217437e+00,-4.120811322664761356e-01,-4.714218545248492487e-01,-1.457545920168026865e-02,4.321036646010756321e-01,4.291890972961257544e-01,-1.086854344758114710e-01,-2.293773178951036273e-01,-1.280654175010864648e+00,-4.740393045025758090e-01,9.432964234286853600e-01,-1.377006469430637758e-01,-5.154040555434193926e-01,1.503981302359392203e+00,4.150244660101335414e-01,-9.081838938533717265e-01,1.323542747544732001e-01,8.430687270369437991e-01,1.157279741120971206e+00,-1.435157202325124892e+00,1.749541888256855859e+00,-8.048252953455345970e-01,1.806048827678008895e+00,4.664729368633413475e-01,-1.392773057767548783e+00,-4.514436973140519838e-01
6.797746292701372095e-01,7.742375720335090694e-01,2.272677432179379120e-01,-7.151630661835236547e-01,2.786661014357104393e-02,2.328943292389615838e-01,6.044538979008807766e-01,-3.261588884148010070e-01,6.719861039075836207e-01,1.167083045738316061e-01,-2.498367374301924126e-02,-9.261572684000976552e-02,-5.014386564632502541e-01,-1.395195804155202057e-01,-2.658241952086994320e-01,9.432421332847477080e-01,-7.901655263219944381e-01,2.063273134778129125e-02,-5.625268526913237976e-02,1.272584519693627236e-01,-8.148577745953117235e-01,1.298635968165208765e-01,-5.586207516713298515e-01,1.930613429289894933e-01,1.761233090613145702e+00,3.891982016190871918e-01,2.573526334635510837e-01,-7.290798117177852422e-01,-1.594660064322645399e+00,-1.292524808138993730e+00,2.713901857379463767e-01,2.671397548095271635e+00,-3.194764960185574876e-01,2.424786543224259905e-01,-7.019527604309762081e-01,-3.863038443364484875e-01,1.653597152232652689e+00,7.986164462016807075e-01,1.943927464359134660e+00,8.735280120863092579e-01,4.876971676162958902e-01,6.292239309053371255e-01,-4.087174709928342864e-02,-1.377674536864716415e-01,8.110302632632294673e-01,9.131796579662151414e-01,2.297430418297957466e+00,2.124293973849570791e-02,1.088197842922914715e-01,4.398402407677042825e-01,3.583032911611733429e+00,1.990104207727980468e+00,6.805336058912409003e-02,-1.905011958990489862e-01,-3.157213674389460767e-01,1.475810286441615160e+00,1.092776129468370216e-01,-1.413430545722526577e-01,-6.031494281640555899e-01,1.341815141318607463e+00,7.724656063054828603e-02,-2.225969138502851274e-01,1.250031252210356825e-01,6.016781258953237677e-01,1.477270998816657022e+00,7.643761533864099622e-01,-5.678368474297950108e-01,9.440000514585497049e-01,5.223513056320164272e-02,4.949849770347253819e-01,1.707159159449436858e+00,-4.006135468245953235e-01,1.065531868115751901e-01,-4.146960465516116856e-02,-5.927823282104062452e-02,6.206255733266223817e-01,-5.008650047340296174e-01,8.216620400575286309e-02,-1.377841684580669579e+00,-3.744311400614186991e-01,4.559041007806201584e-01,-1.672500015707542032e-01,-3.987472592153891160e-01,2.049106637359102923e+00,6.164919132794761669e-01,-1.234627732394281807e+00,4.305395588693096687e-01,8.092418319813248218e-01,8.900306696860201816e-01,-3.545446263721353519e-01,1.303068872527000988e+00,-5.453815071423824268e-01,8.375794038825544741e-01,4.349176105272803960e-01,-3.449471413146659726e-01,-3.991601645390021047e-01
8.644604684072401124e-01,5.941024617898467142e-01,-4.208095274548991349e-01,-2.861838496040136626e-01,-3.301037469013577974e-01,7.743204079121890349e-01,7.829840412420603357e-01,1.453383986761064839e-01,8.703832262232411576e-01,2.519573458685936407e-01,6.094913119426266235e-01,-3.388272109946997845e-02,-3.820465054716152831e-01,6.571536236873010139e-02,-4.865833111669324862e-01,1.681817310701243962e+00,-2.376116163064463660e-01,-5.889954370199310674e-01,6.103369197269421093e-02,1.012792083510623969e-02,-5.773910085903317668e-01,5.745251952606285073e-01,-5.150366067513549861e-01,1.970762033291638959e-01,1.591055990763708738e+00,-2.479450907329825704e-01,-1.008547248377893724e-01,-6.718161060404868046e-01,-1.018732978447967064e+00,-1.066901509563411121e+00,5.570319474856959552e-01,2.416484176179109156e+00,3.912896712539809529e-02,2.581945337743110080e-01,-7.486223599623321734e-01,-7.357362502739775989e-01,1.791529297925505970e+00,6.528683061620188521e-01,1.851309854064240756e+00,8.679585874590747263e-01,9.423039462033249158e-01,3.995337771610940059e-01,-4.882210133632906846e-02,2.859029927576883789e-01,2.987180067947113882e-01,7.751010554590380686e-01,2.282472630121513024e+00,2.644025212834824612e-01,4.283470766247725603e-01,5.517834052598014072e-02,4.703182681032922474e+00,2.251071817944359843e+00,7.725361285614555928e-01,-4.171728832867857562e-01,-3.315163812982579450e-01,1.370197956210451373e+00,1.771663799412027118e-01,-3.398541786376654272e-01,-8.165710616820316403e-01,2.067184666855204966e+00,1.095198919302982354e-01,-6.700020576205261147e-01,-3.114275247381572687e-01,3.954797448455671383e-02,7.240486938858605725e-01,1.035525557055627655e-02,-6.262978583257028387e-01,8.024800906404645495e-01,-4.345254414885278416e-01,3.855337561811156277e-01,2.578540249879397894e+00,-3.600188349129507248e-03,2.717026400736680114e-02,3.717304859500834002e-01,2.229341682988354445e-01,7.218835132468160998e-01,-5.223246218091441850e-01,3.150640176142137094e-01,-9.639615956603129199e-01,-7.556271504552329876e-01,8.548392917169924665e-01,2.745116060013128023e-01,-4.566276626036009367e-01,1.622231390787900462e+00,7.388110332438511119e-01,-1.278598577638629719e+00,2.062542371379350037e-02,1.160414377067524372e+00,1.071746420563623348e+00,-1.136965365767862002e+00,1.771029495639751872e+00,-1.558349203909964453e-01,1.046940270594049816e+00,4.063318752060154360e-01,-2.947848237952326311e-01,-7.108131263595660609e-01
5.122831937971262795e-01,-1.011031026461458593e-01,4.562165600341490379e-02,-3.566416357895445532e-01,-1.548872759857596038e-02,5.954380929024586377e-01,1.141597351609976663e+00,-5.161614866643583488e-01,-7.699263474282980191e-02,3.452985040866783928e-01,6.354962167625831659e-01,-2.883643365426367122e-01,-4.342756843414095624e-01,-1.357963663843996804e-01,-3.491582995119193455e-01,1.126503210055541437e+00,-9.113429851690464378e-01,-2.527266194932649146e-01,2.137741434392176343e-01,1.375684702258418435e-01,-7.380048884113246110e-01,1.939241632486135569e-01,-4.373903389744734915e-01,3.352016597837392808e-01,1.660828562665015884e+00,-7.846746086134367970e-02,3.311162123630855825e-01,-7.854377009888501293e-01,-1.249991115016292120e+00,-1.110056264052188046e+00,4.355109610003583542e-01,2.708770368374033843e+00,-5.471361191412987823e-02,3.271320049776696437e-01,-5.504432081139725152e-01,-6.039999903877686371e-01,1.237969837225837644e+00,9.632656711836260488e-01,2.226536344575514637e+00,1.179743537063818293e+00,5.771711381695583398e-01,5.785008954787188573e-01,-2.157285357154911654e-01,-1.664836117902126489e-01,6.126602279459543166e-01,8.447475676721392102e-01,1.938726470305432770e+00,-2.321675959246806142e-01,2.428962017931916573e-01,9.483638235937841277e-02,3.916490425030413558e+00,2.096331284818979235e+00,-9.129552535890761433e-03,-4.565255622824532233e-01,-6.491703004070248362e-01,1.695574578430333768e+00,4.335065948940328706e-01,-7.710535270107073125e-02,-2.433264889541851828e-01,1.820901826098634935e+00,5.797798649639874791e-01,-9.339127500779478286e-01,-2.983236463571622421e-01,5.137284255964100765e-01,1.001242150607961845e+00,2.998740967282006453e-01,-8.454084964264432234e-01,1.062539475970903036e+00,-2.741804839799056870e-01,7.323129592822039680e-01,1.904134005919322581e+00,-1.197555849572577991e-01,4.437533305974983300e-01,5.199376585861713584e-01,-1.254661177547111983e-01,1.002883730877456969e+00,-7.001227359624844215e-01,2.576790575664760219e-01,-8.951168352364055059e-01,-7.474014385742276945e-01,2.082032896162671065e-01,-2.970804630732631901e-02,-3.421157875117866731e-01,2.047009513732570340e+00,5.793071840947165985e-01,-1.338705300209411142e+00,3.068442163655848431e-01,1.208928557809424653e+00,8.962621668844281686e-01,-1.850257030176840622e-01,1.286867206348657033e+00,-1.234388610086301075e-01,4.288279531282871426e-01,5.004207991007214584e-01,2.403687359664616885e-01,-5.698686405106879738e-01
5.691100084352460620e-01,1.184157842014497808e+00,3.556447266810158214e-01,-1.104451062955249085e+00,4.780445142333165642e-01,-4.531445409209773900e-01,2.258446795903805704e-01,-6.623906813440082475e-01,-5.203368056048109924e-01,9.984793637854331994e-02,5.913851196631201290e-01,1.578148798745165893e-01,-3.496665949765453973e-01,1.827150236715084919e-01,-4.276694745991474478e-01,1.281500428489340315e+00,-3.865116180779895050e-01,2.754956318423086303e-01,-8.413176002704808587e-02,-4.035558892970673300e-02,-5.307557539151575021e-01,-1.428289135327759363e-01,-6.395003120219622250e-01,3.313302131449789023e-01,1.830965502107612108e+00,4.836645606856421753e-01,6.714751612636742362e-01,-5.933763297865025654e-01,-1.040503643511173415e+00,-1.297591830502344390e+00,-1.028879027705080773e-01,2.190848559407314156e+00,-6.135850402451603625e-01,4.746693173799956811e-02,-6.189355481446241480e-01,-5.320832763469818261e-01,1.036345132667880975e+00,1.207920041796669341e+00,2.271716356050950125e+00,1.033205529440721637e+00,-1.368151318693255902e-01,2.437545049384998719e-01,-1.876127783547003047e-01,-3.135208509803714128e-01,5.608324457375164496e-01,1.008798929612658712e+00,2.250543693501894094e+00,-5.116824911939628073e-01,-3.830300764031992489e-01,1.572355709850779437e+00,2.694763589020287675e+00,1.141650123088756130e+00,-5.314863775152246506e-01,-4.004029786344740494e-01,-4.947871227798197324e-01,1.700295584794267345e+00,6.629084539779588336e-01,5.163518570346318226e-01,-7.229260116020629345e-01,6.508614062844815251e-01,5.184020886048574805e-01,1.306676817317484751e-01,4.526225038695154135e-01,1.445034579127587371e+00,1.436407599833987803e+00,4.936150519605106979e-01,-9.161808291576736263e-01,1.165213443121173587e-01,5.827030492785341131e-01,9.844300197230402283e-01,1.376138256020442707e+00,-6.831944529854740988e-01,2.074615404422612830e-01,2.232413241561231609e-01,-7.273811921588382301e-01,1.222786194139758642e+00,-4.495112196769666113e-01,9.220213087543654984e-01,-1.022913546383771521e+00,-6.666424994247432956e-02,4.427577500969627211e-01,-1.610213725850264677e-01,9.590723823025776307e-02,1.799444529695991335e+00,1.061757579125847117e+00,-1.065814604623417150e+00,8.507520936776169496e-01,3.649045378202980805e-01,2.531060191855479813e-01,1.141615603892722319e+00,8.883679865695439659e-01,-9.237906477523079030e-01,1.569733588858031048e-01,1.696580400734787331e-02,1.321685928239934915e+00,6.587150085787618625e-02
8.578120774251148939e-01,1.036310530902388338e+00,-1.462919436099588411e-01,-7.309000141164737618e-01,-2.247566881609770473e-01,2.740026929294036573e-01,1.243868058727356507e-01,1.256115188761101065e-01,1.128825021301381959e+00,3.126215031834319591e-01,5.330245580673503847e-01,2.510468614816809829e-01,-3.819173344452754804e-01,-1.645861213196211925e-02,-5.164959191196939470e-01,1.789977718331720036e+00,-1.298647847344439887e-01,-1.401608493335093630e-02,-1.340914997467812786e-01,1.470522378356262788e-02,-6.020392194806027941e-01,6.392109846837406018e-01,-4.604330069721556118e-01,1.005181847788946398e-01,1.721057427116970961e+00,-1.100896271587229747e-01,1.032840149814713282e-01,-6.207339394055459980e-01,-1.023813691761608080e+00,-1.184221790602169477e+00,2.413686438296009096e-01,2.434449038727892756e+00,-3.644105581121597215e-01,8.976793647692793421e-02,-6.981765846253723540e-01,-5.785073665991989911e-01,1.719409972473165515e+00,8.581882077638460782e-01,1.964276499422167088e+00,1.233665894081096059e+00,6.664208501352000269e-01,3.240612687415840298e-01,1.475768750833766907e-01,7.655665107711809303e-02,3.224529856015716511e-01,7.308479474938943676e-01,2.643193989626090978e+00,4.288378395548442940e-02,6.275962107315696814e-02,7.192408113913751899e-01,3.992302161084393841e+00,1.881515555454264410e+00,5.981592982706439576e-01,-3.448529803257454063e-01,-4.850541104164722284e-01,1.585147195524338137e+00,5.699636251079016613e-01,-1.243092549447527423e-01,-9.943751393996103083e-01,1.942955734857555683e+00,1.253349355970931334e-01,-5.393280423095286880e-02,3.376733428779370855e-02,7.899369373954308049e-01,1.113698770100862712e+00,2.495652882944625062e-01,-5.531846496217225351e-01,5.941411788376146363e-01,2.392902496732917939e-01,1.406977646602552978e-01,2.350697311561259717e+00,-2.847921715515014940e-01,6.023958505078635256e-02,-3.025227444454006709e-02,-7.298356214074602777e-02,7.122497503468184776e-01,-3.039270046959027249e-01,7.572470840458049857e-01,-1.254624761229647278e+00,-2.471953051244359378e-01,8.712345614037839692e-01,3.989256301119207260e-01,-3.059451855346713156e-01,1.592229581621001699e+00,1.082899309677478605e+00,-1.266106117493407623e+00,2.179959978313306956e-01,1.077454027355494004e+00,7.484415200963380199e-01,-5.962643383933239338e-01,1.855548024523015815e+00,-3.790222995409369133e-01,9.251787255183633318e-01,1.854646075730636001e-01,2.655362185391469954e-01,-4.022787334504550616e-01
1.210735108647490677e+00,1.932153420114520959e+00,2.348386591853595107e-01,-6.003700928089888977e-01,-2.303078687672149849e-01,1.533829612311913282e-01,-4.598613307901663894e-01,4.914737559828622482e-01,2.864751808522129295e+00,1.098712068272236775e-02,-8.726356622560467180e-01,1.976355527965673042e-01,-6.468604754844422544e-01,-4.707752950480355303e-02,8.670258804609598524e-02,1.207775285032826718e+00,-4.338684097624095903e-01,1.365516736560355993e-01,-2.040015818261481373e-01,3.420156551864717009e-01,-1.174131574556676050e+00,2.616104086324470002e-01,-6.078914438069499271e-01,-6.928491023441424312e-03,1.409836975048556207e+00,2.099759417790875438e-01,-1.341831685062472024e-01,-6.159487502945786286e-01,-1.094281553956904407e+00,-7.925091012952574232e-01,4.501070974657648271e-01,2.615562681518656785e+00,-3.637053312038085462e-01,-2.852476985060008463e-01,-8.875484868881157174e-01,-3.190043012341329809e-01,2.276435055597698209e+00,6.299566831472369621e-01,7.227021045803407873e-01,6.859595729616614346e-01,1.058311396329418175e+00,6.059607290442767802e-01,4.315297621248995186e-01,4.072357771596103460e-01,9.036109544697256135e-01,8.628778211042460455e-01,3.263484065701900416e+00,6.257939126244198569e-01,2.810494157776244339e-01,9.258693840247219642e-01,4.024703166360183992e+00,1.644478390798588041e+00,9.680974149552884489e-01,1.506987516614050060e-02,6.187123317062481753e-02,9.005266670786775673e-01,-5.475458423445579426e-01,-6.766232365319562181e-01,-9.475788722765972061e-01,7.810113840781697236e-01,-3.966772874884125222e-02,5.734793986480691830e-01,6.915088366324864677e-02,3.534165821366805349e-01,1.375591037123294891e+00,7.239690659216725388e-01,1.767738493842343495e-01,1.301801791540719844e+00,-7.465574509093952926e-02,-7.033187953282704630e-01,2.567029322130847113e+00,-7.188963687903540123e-01,-4.116520569013404907e-01,-2.887968629371141516e-01,3.844075056612256125e-01,4.612265008408962252e-01,3.863720770866544973e-01,-1.828561993514389306e-01,-1.465219986022890941e+00,-8.392150119727781465e-02,6.130335953317308517e-01,-1.247223085685509880e-01,-4.753082142192914805e-01,1.433693233271269296e+00,3.502789037550559925e-01,-7.379833419168355668e-01,1.491983397424081759e-01,1.347503263750433167e+00,1.029560465330279673e+00,-1.315572339711321259e+00,2.101246567665249199e+00,-9.614459188525912303e-01,2.089341744851250571e+00,4.878945616986575251e-01,-1.469001786219949368e+00,-1.604843528410622722e-01
9.140829279402221674e-01,1.767809131663270916e+00,-2.577568472568440849e-02,-8.324852220484058041e-01,2.342060905509982249e-01,-1.303613638384737983e-01,2.071806101576689207e-01,-1.120310880295244810e-01,3.715604335254186763e-01,-1.427052053963996647e-01,1.984689089709225918e-01,1.694954236429183081e-01,-3.760659201533882445e-01,3.917215100538839478e-01,-3.688655034861827997e-01,1.408184202999741119e+00,-2.344929590601807501e-02,-2.617951938474815110e-01,-1.357554111258632290e-01,-8.378475792530035160e-02,-5.156575571658106316e-01,-5.471982048389145703e-02,-8.065487253995532457e-01,2.595687731727222003e-01,1.668458186886984107e+00,4.911786163839263475e-01,1.894372296284612955e-01,-5.318288483099791186e-01,-9.870668189389999458e-01,-1.173475520279175344e+00,1.819865465507962965e-01,1.976222793599408556e+00,-3.426753158659072152e-01,3.096041612316133285e-02,-8.678016834623911713e-01,-6.299023372538312682e-01,1.654360324139544147e+00,7.722133844744697440e-01,1.646670468485927241e+00,3.474225279585730908e-01,3.151540969025831140e-01,2.312919259580900055e-01,-1.357267786915229424e-01,2.009209536144825337e-01,4.946026256060730986e-01,1.052411985261493932e+00,2.414093858982933050e+00,1.414755571670223977e-01,-1.222748170482827745e-02,1.244861685117495842e+00,3.600768536194486114e+00,1.404841234030181019e+00,1.639974883560957053e-01,-2.899017624605922938e-01,3.337191568323882862e-02,1.137461502064132102e+00,-8.863581342271009689e-02,9.848122890125837747e-02,-1.076315436351094501e+00,4.951919068771453158e-01,2.465817234560904736e-02,1.899824285789653566e-01,3.447965069289010698e-01,5.489828226938403555e-01,1.157687559394408483e+00,3.453453241944409724e-01,-6.315832432798055285e-01,1.437406846613394906e-01,3.561439111157275322e-02,7.585587912715671122e-01,1.938727574284628385e+00,-5.756778568416703878e-01,-2.812913445435530346e-01,2.226763939277397464e-01,-2.064663463511683394e-01,9.090307525486475138e-01,-3.170885179346139005e-01,4.340025581957735468e-01,-1.019658625472708025e+00,-2.989614018331369083e-01,8.879267858880262043e-01,-2.034352661029910636e-01,-1.163470812665431675e-01,1.507975573050845952e+00,8.041173329190600683e-01,-8.986623882935926844e-01,5.672523282735391081e-01,2.770225188143591311e-01,6.306613976981256808e-01,7.195149227226527167e-03,1.154096918579435638e+00,-1.039764175986723993e+00,9.543868857595394495e-01,1.356928478876641142e-01,1.281302714307685497e-01,-1.401212905798039365e-01
7.990635358707790514e-01,1.335873585559275156e+00,-3.171555793891531194e-01,-9.015515610151486614e-01,5.140430307094100149e-02,6.240276091987340124e-02,4.232710129471151106e-01,-9.855044361315121182e-02,-3.524770546410971317e-02,5.756055382751179561e-02,8.466872531129508994e-01,2.576343141840535811e-01,-2.511880395923240528e-01,3.145355419113652351e-01,-7.278966226454487431e-01,1.808816441678575693e+00,1.976412280429730717e-01,-3.301297158647866770e-01,-1.710156945584927479e-01,-2.535892042487055686e-01,-2.313771039576117405e-01,3.750731068027062243e-01,-6.817661949470833482e-01,2.223218728684271395e-01,1.863012485762768122e+00,2.570801002594547691e-01,1.746445944790381566e-01,-5.427069051321460336e-01,-1.077568341126890816e+00,-1.439041844108218005e+00,1.068043676470235015e-01,1.975742076170603934e+00,-3.482939175699715784e-01,2.629690775970432992e-01,-7.987888767607597140e-01,-7.222941703964086413e-01,1.599641577124981007e+00,7.815659455768495523e-01,2.271680260530268836e+00,6.975524417991134651e-01,2.738041162472364953e-01,1.255854410256380671e-01,-1.669586457619876008e-01,7.982558781764180489e-02,1.574532504628717300e-01,9.066442297952332918e-01,2.225571872613787860e+00,-1.470121065461358484e-02,-5.709451429145430412e-02,9.287893815133484443e-01,3.823390405137186310e+00,1.756303428327043781e+00,2.424816435580610940e-01,-4.166261490170037329e-01,-2.390112300615782615e-01,1.494948537559987800e+00,5.002247526419232315e-01,2.336087528703880423e-01,-1.230916001201511234e+00,1.476895943339869843e+00,-1.019209230697847024e-01,-8.294025337568508571e-02,3.092489636664472741e-01,6.772316400284945637e-01,1.066938174151671914e+00,1.499217536560878694e-01,-9.029856507620136474e-01,-1.296681630323144319e-01,2.279848321147323609e-01,9.677596017966613173e-01,1.988334394197718291e+00,-2.701809661144966013e-01,-8.875261220420609110e-02,1.448619454616292268e-01,-2.881097288417359126e-01,8.076038540351782036e-01,-6.594768446131079598e-01,8.913460148250170745e-01,-1.107287144684726110e+00,-3.504638689767841653e-01,1.184346555665825473e+00,2.271347117480059241e-01,-1.535697751950463041e-01,1.594226972057956937e+00,1.250890379664048258e+00,-1.270551512955031548e+00,4.679004723533866650e-01,2.366780540936063160e-01,6.048758626399827198e-01,-7.425318307091183234e-02,1.271966889549619673e+00,-6.167664204095973934e-01,5.422441229338856861e-01,1.309270571175358278e-03,7.223166763687636216e-01,-3.819665286074647170e-01
9.556642263462800102e-01,1.584167990236261758e+00,2.322500879909645821e-01,-8.484897116545643270e-01,3.780447949354244497e-02,-2.649424344724516378e-01,-6.628551312296162568e-01,1.115445485463635589e-01,1.451932968663220080e+00,3.414676476879483502e-01,3.626616819788623935e-01,4.380294465391816328e-01,-4.345601361742021385e-01,1.097321932968478159e-01,-2.394568629843864815e-01,1.885741209086636783e+00,-7.950769383782091415e-02,4.372004805638916025e-01,-1.120674381213319082e-01,1.904182724474355048e-01,-8.334058803827260054e-01,3.448176578585931407e-01,-4.611080871330635045e-01,1.394421811459123084e-01,1.492766337777667873e+00,-2.030493467789649953e-01,3.494744945241456402e-01,-5.338693898204358579e-01,-3.363023819630039934e-01,-7.492253457095578995e-01,1.089576003790579395e-01,2.315173058471487355e+00,-5.996172462500386491e-01,-4.184643109342848777e-01,-6.259217732059398909e-01,-5.630410032506893980e-01,1.383630701504654503e+00,1.231333544709321659e+00,1.458795044298954124e+00,1.490536461916157407e+00,5.329536875935664275e-01,1.809484496508897422e-01,3.144165150679476550e-01,1.010390689857773444e-01,4.208315508779542635e-01,7.725154327543259924e-01,3.130680490758777967e+00,-1.854841447298241075e-01,-2.010824871366026501e-01,1.790240142405605361e+00,3.333038747899915055e+00,9.759396136179636638e-01,4.333890688118409718e-01,-3.870078566954862631e-01,-5.883846424119918428e-01,1.525893607562508247e+00,6.281469835815727265e-01,2.428867551281713166e-02,-8.771361071464051085e-01,9.975894414506296659e-01,7.499755150850079266e-01,5.061742521782280901e-01,1.014168829352301848e-01,1.437043146499372703e+00,1.095760851716553574e+00,1.488033619479969261e-01,-3.452370616721177621e-01,6.059817062623112927e-01,5.168266000929657711e-01,-3.039047845887195010e-01,2.455266322870438334e+00,-7.508973529662106294e-01,5.886935688134752043e-02,1.411746870636903239e-01,-3.716587156217886490e-01,1.231115177038915265e+00,3.232590027481616057e-01,1.066312239573479204e+00,-9.614543759093696629e-01,1.253914959228075721e-01,4.823431716243985479e-01,2.710714684373195515e-01,2.814146524685956496e-02,1.210895736617880081e+00,1.021982094140908570e+00,-8.092011652059948323e-01,4.078873282732446426e-01,1.406718934153620149e+00,3.461568743302136375e-01,2.179513529525134996e-01,1.954404967438017504e+00,-8.412751989569100530e-01,1.043117322881778941e+00,5.011621338746036214e-02,8.619349306152339629e-01,1.526189436284293155e-01
1.015300915330348497e+00,1.500596716524921881e+00,-2.479417188717131793e-01,-8.001797961873345910e-01,-3.467610867814895914e-01,3.444548938589618858e-01,9.275264769540553234e-02,3.780299499533333329e-01,1.719117175047637724e+00,9.602596185543965657e-02,4.902633676525663953e-02,2.783627876630426212e-01,-4.238972032569046089e-01,-1.165827420105316689e-02,-5.119197688904965071e-01,1.634854659663371068e+00,-2.604974910402341193e-02,-1.574321743209056990e-01,-2.978334576366272191e-01,-4.151510229717938344e-02,-5.961009178120753038e-01,6.913087189048177095e-01,-5.792756781382175646e-01,-8.380415861286100165e-03,1.794130326869876058e+00,2.035349773600203804e-01,-1.531871883921530342e-01,-6.079426933839325864e-01,-1.448418138295183510e+00,-1.379260905635656620e+00,2.871424068770324078e-01,2.415837441018206633e+00,-3.501381055749865912e-01,2.002737782712912251e-01,-8.780033819050747645e-01,-4.754036550046635279e-01,2.241185720633244838e+00,5.157885878082344444e-01,1.758757934190595673e+00,7.628705333236106556e-01,7.975731054878418824e-01,4.211089832269414579e-01,2.038138099136566073e-01,2.285878300294555410e-01,4.225134067477189226e-01,7.775520631752865786e-01,2.727892677349684991e+00,4.552183756438642481e-01,1.927983830919043906e-01,4.503737819516009377e-01,4.267906533769399324e+00,2.194938006566140132e+00,8.782520987231543508e-01,-1.378432489585287857e-01,-1.009923991866775173e-01,1.302163941676841796e+00,1.077174845138626214e-01,-3.474840686050624239e-01,-1.300529984562392549e+00,1.890567500531724621e+00,-4.918514478967129788e-01,1.707073190850754152e-01,2.098425365950695454e-01,3.500107389753713272e-01,1.322279380015501493e+00,5.309299444738581064e-01,-3.665527483087569482e-01,5.828931181931743533e-01,1.489203462636164432e-01,7.797352317524108845e-02,2.348234456495034816e+00,-2.715694142811866940e-01,-2.681567807755259047e-01,-3.968539349887314494e-01,2.246860567899515160e-01,2.361709706360370919e-01,-3.497407947509056370e-01,3.590774586197618135e-01,-1.621878481407829753e+00,-2.358194910261000588e-01,1.223606986019206699e+00,3.119157898948479168e-01,-5.172043060967196348e-01,1.654117361461755253e+00,1.001190496331944013e+00,-1.294575899661790430e+00,1.477138727876568247e-01,7.357558469229705800e-01,1.001048932473858510e+00,-1.289682509928448573e+00,1.892959006630336116e+00,-5.099099948462622045e-01,1.366420547061970581e+00,2.526212614325836769e-01,-6.699667066013466066e-01,-5.433572924865588405e-01
6.914494744830750328e-01,1.311336268045329989e+00,6.016854381202620117e-02,-1.134189831046551689e+00,1.505484584784412272e-01,-1.708199235804569449e-01,2.634967548269885329e-01,-3.031757022201322371e-01,1.221596523098771314e-01,7.410433449212844303e-02,4.788607721532161521e-01,2.434161935669236776e-01,-3.366934953211002668e-01,8.646531192408621336e-02,-6.062511530488499112e-01,1.432768493199316762e+00,-1.723233732060764356e-01,1.084885894020312380e-01,-2.488926892316747075e-01,-1.452208237916370048e-01,-4.207758995937950219e-01,2.665116730919515065e-01,-6.291104994938375716e-01,1.726229908881738440e-01,1.967897698075312229e+00,5.106752842797896985e-01,3.560557840194908952e-01,-5.986456413049091596e-01,-1.444448055409921938e+00,-1.565434293855149983e+00,-4.351459987713790500e-02,2.251940639755273921e+00,-5.731795714276765041e-01,2.526556140718866361e-01,-7.389234820382184488e-01,-4.844741185149322726e-01,1.565216947549901372e+00,8.770055507916275639e-01,2.351437948798928090e+00,8.947874053897155733e-01,1.045782956470903136e-01,3.004062159087949047e-01,-7.619965097903648454e-02,-1.917584398573947135e-01,4.498844904104256637e-01,9.152637298213446293e-01,2.323305817581742261e+00,-1.557506385782517766e-01,-2.224713175497451956e-01,1.038740686667880553e+00,3.246436154990187006e+00,1.710715895781589779e+00,-5.396789450762462526e-02,-2.741047777611246850e-01,-3.307606614057995165e-01,1.638553495529222692e+00,5.720700351770235947e-01,2.716961832991972026e-01,-1.086685609761058657e+00,1.351209547713221770e+00,-1.139003144511538668e-01,1.617839671152216940e-01,5.019260078052760754e-01,1.056716058208185371e+00,1.528215810369633276e+00,6.077297062588742360e-01,-8.129037475360758602e-01,9.688286753323660516e-02,5.634112852869296306e-01,8.393030050261645059e-01,1.573700935031653536e+00,-4.573195305367048769e-01,1.910159647647734910e-02,-1.887259658766672066e-01,-4.025169077721397759e-01,6.779878722331034169e-01,-6.125681213133353786e-01,7.887511205879567111e-01,-1.433751010741043164e+00,-9.602839655317879641e-02,9.350109470705436632e-01,8.917439400862990639e-02,-1.758898029303859467e-01,1.866692051422550014e+00,1.217370189221813392e+00,-1.314032874815870500e+00,6.248978254653771991e-01,2.306637600276906230e-01,5.385197109535435622e-01,2.077075324629434339e-01,1.177843257850881731e+00,-7.149747462171555101e-01,4.652447310287308735e-01,4.319621069173229522e-02,6.408157857396961088e-01,-2.493076744598077266e-01
8.393357379746875235e-01,1.202801945819932161e+00,-3.665562918503323941e-01,-7.076568008364699791e-01,-8.514531811767189762e-02,4.004876835020522163e-01,8.176536520213342207e-01,-2.572463959803135414e-02,3.253799739808618807e-01,-8.197907464819567669e-02,3.752311013922535743e-01,3.660283762563248944e-02,-3.387126253173349255e-01,2.087681015751538527e-01,-6.165734194531002910e-01,1.408997966111167344e+00,-7.676658048472545515e-02,-5.897119316212373619e-01,-1.579907122663875008e-01,-2.036463601065449103e-01,-3.521853590110529120e-01,3.313635484620448546e-01,-7.401817588480494869e-01,1.892364253753429093e-01,1.857199743472988773e+00,4.454430891450896768e-01,-4.834387438857029595e-02,-6.187517657848591313e-01,-1.554878537126137772e+00,-1.522272894507359808e+00,3.126675651345229845e-01,2.165253357433308157e+00,-1.492945612725136706e-01,4.511242498206926022e-01,-9.018595850203972031e-01,-6.303785030413109336e-01,1.971076641105492522e+00,4.690862774971830129e-01,2.088767189167434868e+00,2.969005057155712501e-01,5.172889887830438571e-01,3.701731148704917596e-01,-2.045089428493638284e-01,1.755915874155435374e-01,3.831725015226891129e-01,9.532048735818978713e-01,2.082117624041843751e+00,3.361025313960949723e-01,2.317818801146525609e-01,2.566579517240404895e-01,4.248262036827381571e+00,2.247744709982070432e+00,4.187494954483200749e-01,-2.578084236058756362e-01,3.272759369606553781e-02,1.253350463486607724e+00,-3.467759241287837746e-02,-9.019651806702283503e-02,-1.168557405828999141e+00,1.551329538452097312e+00,-4.836644956567861531e-01,-3.026738223530693328e-01,2.235438257483077507e-01,4.083747350529642883e-02,1.159926228983692464e+00,4.102613862706331327e-01,-7.642555392832570682e-01,2.375481679586573525e-01,-1.653101636861448454e-01,9.691955914336125577e-01,1.961686832130094205e+00,-1.380780245629774361e-01,-2.313951107938183038e-01,2.211043380213634224e-02,8.753787248505535967e-02,4.292493216060104255e-01,-8.103468656628640687e-01,2.245711113815208604e-01,-1.313961475271411494e+00,-5.935880720122805876e-01,1.214748619428349441e+00,2.130641292264541520e-02,-4.375742776208429996e-01,1.824071052827116679e+00,8.973015602507825594e-01,-1.336303559910786865e+00,3.290373862071455102e-01,1.772753415498692364e-01,9.981531762291648846e-01,-8.303445415959225251e-01,1.235531597310440821e+00,-5.364965250220673498e-01,8.947682608535849624e-01,2.627968154017882307e-01,-3.898546054033192321e-01,-6.498901540094161877e-01
9.035133633539518261e-01,1.832226066266018361e-01,-1.936027419968913699e-03,7.817821361336130259e-03,-4.158626507265183458e-01,6.988028634601841649e-01,-2.325984738554126574e-02,2.594806057697605084e-01,1.930534026221619737e+00,7.720242682610882756e-01,6.757852198949001465e-01,5.750698900573908423e-02,-5.111702813707337256e-01,-1.702448411358675751e-01,-7.820388539218475765e-02,1.997324872101470250e+00,-5.688068115911821820e-01,6.144967616915389397e-02,3.063266921690777078e-01,4.749934268958944661e-01,-1.131859620254475729e+00,6.816210382908721721e-01,-1.579975592456713818e-01,1.950101173704069657e-01,1.145820968950817420e+00,-1.145488539351134261e+00,1.403102731648370738e-01,-7.000655882215125470e-01,4.725518494454172824e-02,-2.202329578641473162e-01,6.570001692956692896e-01,2.812266937530619515e+00,-5.932805745236036099e-02,-4.010768181739327587e-01,-4.362873807497144041e-01,-7.341750414288146231e-01,1.248862195638517969e+00,1.273996120015387756e+00,1.267529157370085535e+00,2.043557565313955493e+00,1.287281608863812821e+00,3.954720417842102487e-01,3.632742532469047658e-01,2.706124800189427249e-01,3.737615553550339142e-01,5.450984444510116322e-01,3.011826905432161361e+00,-1.351494903683473636e-01,3.495534947336641496e-01,7.239950347621184612e-01,4.440326378891118253e+00,1.518322210497170088e+00,9.577264753763700122e-01,-5.997602585073384951e-01,-1.012018189215345476e+00,1.631889934726420854e+00,6.756426709334887315e-01,-4.983717156458592479e-01,-2.120472381027306286e-01,2.072546699688097238e+00,1.387880199588170438e+00,-5.583057950740245579e-01,-8.465732232122522571e-01,8.579531978879515464e-01,3.961618692989097301e-01,-3.682146068307257103e-01,-2.532407635895813636e-01,1.638474035715296484e+00,-2.961442057459984789e-01,-8.311155056118793016e-01,3.261191743089637107e+00,-2.812727851586633854e-01,4.640468623203792276e-01,7.461462617271914510e-01,6.440630213924782022e-02,1.445854551352739659e+00,3.713911395804902482e-01,7.431558445982691108e-01,-4.766097713218608867e-01,-4.916722852549866851e-01,-3.140955216388363613e-02,5.184311492305034852e-01,-2.173763604673124572e-01,1.197715434726993156e+00,5.592608243478882635e-01,-9.102459249521487328e-01,-1.557454974694406635e-01,2.739937017922759566e+00,7.764529967116210463e-01,-7.087408614120578321e-01,2.555341338615752189e+00,-2.573132066306238475e-02,1.237941710782955784e+00,4.718846339521190481e-01,4.089549578808874819e-01,-2.800138001555746436e-01
6.401966655883153390e-01,1.630243101990809240e-01,1.418783244676269373e-02,-3.268017724959993986e-01,-6.186263018685123766e-02,5.132948807914465839e-01,7.454809151474339757e-01,-3.047024411364610552e-01,3.453902413057209908e-01,4.113639517450202732e-01,6.933952350100340833e-01,-1.379115466970339543e-01,-4.286513164786339147e-01,-5.752145651901284518e-02,-3.076036747536349258e-01,1.427402080977567600e+00,-6.889865490565961759e-01,-1.776820358081689921e-01,2.096803327976998754e-01,1.808858836174109530e-01,-7.789281697683698713e-01,2.814433903122771641e-01,-4.072981425970651492e-01,3.088241390910593243e-01,1.533051165986399234e+00,-3.089485541191582807e-01,2.980278868076995380e-01,-7.268282530569954991e-01,-8.277657501027531062e-01,-8.855910289178774430e-01,4.442295815370425061e-01,2.612626670458635392e+00,-9.356549252239038106e-02,1.029092879247813508e-01,-5.436020970787419637e-01,-6.676061198725182777e-01,1.220495220908936584e+00,1.057735433438637296e+00,1.966173234275640169e+00,1.334003089472972192e+00,6.870809457842729229e-01,4.562300659736300279e-01,-8.192174534195495461e-02,-2.601167601809213636e-02,4.988713211624171695e-01,7.934718356441967657e-01,2.237994647347377963e+00,-2.181374336034537786e-01,2.128126880194684545e-01,4.451394744348792787e-01,3.977395506536578473e+00,1.819958487903937217e+00,2.131538232879975903e-01,-5.077244077577526271e-01,-6.968693827319176748e-01,1.647686088965061524e+00,5.024876140174435735e-01,-1.095084016595713194e-01,-3.263181929754428445e-01,1.725677282603065077e+00,7.776647550535389364e-01,-7.293060329309345446e-01,-3.647313492549545400e-01,6.594413545930963849e-01,8.290944330481702096e-01,8.067186324150349419e-02,-7.175890631704270328e-01,1.038942766982241528e+00,-2.235583773707698341e-01,3.939275629461185257e-01,2.244989091623186273e+00,-2.109233220182553659e-01,3.924770207309467573e-01,5.959753450432657695e-01,-1.395090148095051719e-01,1.169295716597021251e+00,-3.982072821038216137e-01,4.824713503166454531e-01,-7.482087422103546048e-01,-6.326364159477924076e-01,2.210070977630780309e-01,1.068009775739094391e-01,-2.451330699296215831e-01,1.748495451878512075e+00,6.398626178184319002e-01,-1.178523080202328099e+00,2.401091063527846514e-01,1.476847918661606140e+00,7.889136855678416937e-01,-1.813645284489577292e-01,1.564850307921041850e+00,-2.008892578614088764e-01,6.159488206816998712e-01,4.205118391748436379e-01,4.367937068446947069e-01,-4.278565282764578148e-01
8.943943506450104941e-01,1.111065098561845543e+00,-2.937582918139974852e-01,-5.046364844938924232e-01,-5.788216585158964533e-02,3.210709616303550340e-01,4.087514178119461272e-01,4.949988121155680931e-02,5.215010403541170403e-01,1.540961953979539667e-01,6.894893574525031710e-01,1.266904514160444861e-01,-3.373044664952171701e-01,2.881353745206687300e-01,-4.718522486822152584e-01,1.796578835886373016e+00,4.639002176528739252e-03,-4.337163046023939650e-01,1.517852992136770746e-02,-4.286984070183826739e-02,-4.997929481938852003e-01,3.316752988885265374e-01,-6.149096922482766292e-01,2.556067666830883489e-01,1.568647161574001414e+00,-1.072402052099696856e-01,7.886351621534523626e-02,-5.752620767100647958e-01,-6.817071882544403216e-01,-9.945927579207756164e-01,3.714504598979510019e-01,2.116956344269190993e+00,-1.375559060593487259e-01,5.835954904105862540e-02,-7.578467744013726026e-01,-7.827669618867536538e-01,1.564191508540787146e+00,8.310772242992697789e-01,1.769123599564078164e+00,7.959554108312663079e-01,6.448715957150373823e-01,2.023620831098977835e-01,-8.138728017922468305e-02,2.793081311761881347e-01,2.458740063697421041e-01,8.687585476879579049e-01,2.393241593945892198e+00,9.371059290550665111e-02,1.770712251637017176e-01,8.123846479322961445e-01,4.199283100950256475e+00,1.675900943379130759e+00,5.147016501187892112e-01,-4.668297472916948521e-01,-2.862068524680372317e-01,1.330671603702340722e+00,2.499662979397844487e-01,-5.379471034129418294e-02,-9.306349871254073758e-01,1.369913777534474075e+00,3.016771445029562404e-01,-2.927936617865310454e-01,-8.487027280595807466e-02,4.294441167854677888e-01,7.398929171851823527e-01,-7.245845545431900403e-02,-6.825112958681340825e-01,3.930066727160512752e-01,-1.847078200699603379e-01,5.207194081153352361e-01,2.444095994523157511e+00,-2.685151139640703510e-01,-5.103604458904105468e-02,4.746414333458064405e-01,-7.786150701627231330e-02,1.023886942271409639e+00,-3.433218786088463315e-01,6.355411293436761255e-01,-7.905671358096216794e-01,-5.325809020676579575e-01,8.475977295865229078e-01,1.714121138315709558e-01,-1.877197591333695792e-01,1.405963083093567434e+00,8.705726302047878118e-01,-1.052651884149388373e+00,2.611385545503028260e-01,8.964190497006137015e-01,7.435304147380467077e-01,-4.044172003949111915e-01,1.569149406116858270e+00,-5.362392694979258856e-01,9.056259184500531356e-01,1.990089420770470019e-01,3.380798032729360192e-01,-3.760859675191991491e-01
6.620820385380947748e-01,1.101581576399195184e+00,3.337726942378151374e-01,-9.905048385647960973e-01,1.214990490594453493e-01,3.440151609327984916e-02,5.884690766275875173e-01,-4.080233037565988985e-01,6.117299137252417696e-01,-6.405335552921839759e-02,-3.374457868811660544e-01,-6.322619075477053929e-02,-5.162917668160589280e-01,-1.638844134842431521e-01,-3.003082813460016265e-01,6.727856461294621226e-01,-8.182098421943884148e-01,1.218253422994289015e-01,-2.176287598814510282e-01,4.866313687550995193e-02,-7.654056024719245732e-01,2.775250970123466221e-02,-6.593309663484173688e-01,1.435883682392409266e-01,1.942752938943836494e+00,8.400929717454864720e-01,2.728659040279398651e-01,-7.260078537616267980e-01,-2.075963681352270385e+00,-1.600164810412428640e+00,1.276076358331657556e-01,2.659991520177482194e+00,-4.671474018911263570e-01,3.719167140488323087e-01,-7.888019968203504595e-01,-2.383752517311934493e-01,1.851286502390414146e+00,6.605639565600563978e-01,2.063122914119226436e+00,5.929757365326815410e-01,2.827250519155624087e-01,7.009703254549388696e-01,-6.807527410006745938e-02,-2.478723531081206133e-01,9.560275209198817459e-01,9.957978852996292041e-01,2.244578302388005042e+00,1.025238771057579296e-01,5.534019178306773257e-03,4.536774939401326256e-01,3.284965725071272935e+00,2.089752425715834860e+00,-1.093329030213819331e-01,-2.741692747682117348e-02,-1.085710760397929908e-01,1.424179925582355510e+00,-4.497405931339415464e-02,-7.510195879100763083e-02,-7.856483015967025141e-01,1.134821776247421754e+00,-3.508287589075917978e-01,4.431868530406568585e-02,4.575868571170949028e-01,6.137574760674390228e-01,1.869379455919113031e+00,1.155863014678710776e+00,-5.672398293368444699e-01,7.692693268944363894e-01,2.604386819886118642e-01,7.044329764649419623e-01,1.299908494580407803e+00,-4.931147983015504166e-01,-3.685042325376848560e-02,-4.020895636439852927e-01,-7.900023911905412755e-02,3.172255499260109857e-01,-6.503343745745606697e-01,-7.869059820218715640e-02,-1.740376597168571404e+00,-2.279417456934511588e-01,6.302608704316736699e-01,-3.223195354702847459e-01,-4.608690536024291906e-01,2.259189920057328216e+00,6.720906037730767224e-01,-1.309753889306077168e+00,5.891552357306248933e-01,2.966715488988485028e-01,9.077178694065274334e-01,-3.214218533610837536e-01,1.054161445022756993e+00,-7.414171822700469372e-01,8.324717573413424887e-01,4.035105849761437269e-01,-6.329614346988643447e-01,-3.876703098332543451e-01
5.989446573044823197e-01,1.164671694420752912e+00,6.580375656937346163e-01,-8.993932209237837094e-01,5.559428660308051162e-01,-3.746923785315921518e-01,3.720769834884188332e-01,-7.527342513480421715e-01,-8.453435521237251393e-02,-5.647068710452804452e-02,-1.674330640011003069e-01,-1.110030961148764650e-01,-5.216348919480432444e-01,8.285744677127061808e-02,-3.680435432114548266e-02,6.335088980688629023e-01,-9.214740359481063958e-01,2.729010878678571062e-01,9.118799581357091288e-03,1.860552668152993250e-01,-9.014189346525556257e-01,-5.275275343924230587e-01,-7.076343432700687996e-01,3.614069098687128223e-01,1.667969735740111314e+00,7.164656816798852246e-01,6.380065695975879470e-01,-6.715606004969423282e-01,-1.273983807347757846e+00,-1.105397235547105339e+00,8.267046312995993129e-02,2.441169686900479974e+00,-4.936929211743104062e-01,-1.888138299550673471e-02,-6.620946442997703851e-01,-3.737367666466578364e-01,1.165728063880128174e+00,1.106085324537591230e+00,1.751095208389871427e+00,7.055867420819608160e-01,2.695633870261415765e-02,5.343466031423981244e-01,-1.877789221287391452e-01,-2.669668412077994546e-01,1.026283818938377612e+00,1.128538457689319152e+00,2.268300848214481302e+00,-3.038002993071705071e-01,-1.890035589403500915e-01,1.358024202448998352e+00,2.661706766289689163e+00,1.165823470867962453e+00,-6.061670658743368856e-01,-2.283833947764828121e-01,-2.609579227419147607e-01,1.390086238136776675e+00,-5.582868085941994352e-03,2.291317366825739998e-01,-3.821670567284937703e-01,1.557062568287093107e-02,5.600351505299019372e-01,9.724066538762227152e-02,3.568697937714455648e-01,1.083307150217029724e+00,1.591567329951282250e+00,8.385375359061166822e-01,-6.453064182058197984e-01,7.166351471644972770e-01,2.164175589225006135e-01,7.951391860149670254e-01,1.246833905177038293e+00,-8.391301180783135027e-01,1.172402690793086927e-01,2.555218434875444755e-01,-4.899067869096594419e-01,1.147900281625175101e+00,-2.826865989938942558e-01,1.623933926497920233e-01,-1.052278126120647306e+00,-1.835503554572225360e-01,3.204579058843004535e-02,-6.351154654388413423e-01,-4.001935434565001559e-02,1.964126997730250679e+00,4.535819516410260488e-01,-8.473452858675402100e-01,8.567488164606957834e-01,5.292438157112502317e-01,4.914170040301135134e-01,8.908890772256103929e-01,7.616261114244430308e-01,-1.116809821961727067e+00,5.690555553171954273e-01,3.271079150776785571e-01,3.040417752530238937e-01,1.014631173054691970e-01
4.929059941546852230e-01,6.175782306510522179e-01,4.791014239982956946e-01,-9.618076786954672386e-01,2.821111355303083101e-01,-2.037836075754672627e-01,2.851925934419255459e-01,-6.580069497693543656e-01,-3.327869423062879140e-02,3.330552544781598678e-01,5.006808417439734260e-01,5.833413081128473177e-02,-4.309952217667543106e-01,-1.333439884533496600e-01,-3.325200478513873903e-01,1.172500970031502998e+00,-7.726166747682579050e-01,4.775434267670103372e-01,-1.451451206213217465e-02,1.356338747357130892e-01,-7.624797406769754371e-01,6.000062802969702291e-02,-4.423248850946371880e-01,2.720364248604836832e-01,1.798414585244139108e+00,2.240499809087536376e-01,6.765752656434019796e-01,-6.958966190001485419e-01,-1.168195643463566080e+00,-1.216802264245667287e+00,-7.009965832344366987e-03,2.613836424860572105e+00,-5.895580647767486582e-01,5.695588366532253199e-02,-4.985891606606097093e-01,-4.218060614552593401e-01,1.028702116199962546e+00,1.276962160827421311e+00,2.302434909303916477e+00,1.497506029512913450e+00,8.964859639590305740e-02,4.414274831032536373e-01,-4.095214649404116392e-02,-4.369730030979071533e-01,6.906556334224797089e-01,8.718346695619061393e-01,2.347806181191746777e+00,-5.713963852938633847e-01,-2.873790469937708147e-01,1.185319164262037539e+00,2.797333885503983986e+00,1.401099657614277127e+00,-4.192462991329866107e-01,-3.770133460658154356e-01,-7.720923331603374296e-01,1.897612834790598058e+00,8.364936511987515200e-01,3.066427864540387516e-01,-4.361701230725834044e-01,1.225422717669756745e+00,6.936709447443376586e-01,-7.681946092881621058e-02,2.162096417585526453e-01,1.525054313941831996e+00,1.501139199358462850e+00,6.051094158262422251e-01,-7.922601547717265102e-01,6.789000615827268659e-01,5.771568967650442250e-01,5.783979154063570993e-01,1.481679583405698830e+00,-5.904814300136258520e-01,4.485528988513287629e-01,1.234891191979434477e-01,-6.084977608742169197e-01,1.135736956648553564e+00,-3.903919866524319660e-01,8.095818469360472891e-01,-1.148157621050032828e+00,-8.363399754405187458e-02,1.529948161873860846e-01,-3.363137789686140855e-02,-4.932627929674593403e-02,1.972390187651685389e+00,9.554219612005927509e-01,-1.200846738415158210e+00,6.839999263389890949e-01,9.445265433269941502e-01,3.879034240893730612e-01,8.348935994493382751e-01,1.193220914991777626e+00,-5.956072990168039816e-01,2.090838447670654299e-01,1.872994141105150945e-01,1.095064871080851931e+00,-5.022119449260642465e-02
7.503916176153515583e-01,1.107254089138614894e+00,2.717901892489427707e-01,-1.137611183962389028e+00,-2.796205201611817182e-01,1.900647325360129425e-01,2.105366923652820521e-01,-2.440837611497118087e-02,1.778126318154034324e+00,1.387157327046353861e-01,-4.911591735867700259e-01,1.417018934442444977e-01,-5.539410914857373358e-01,-4.927424549944918186e-01,-4.126108370204234488e-01,9.031466278803366166e-01,-7.604320182485548862e-01,4.286177200642488083e-01,-4.189322341370083636e-01,8.652680259073472491e-02,-8.418216888363188044e-01,6.190041949808662292e-01,-4.678372597185287973e-01,-9.986663800283232528e-02,2.077132538915194893e+00,6.666402531238713181e-01,8.668971287063717557e-02,-7.583626771367284469e-01,-2.398574980939370604e+00,-1.783725784193560537e+00,8.624624334495903377e-02,2.990238480620028838e+00,-6.328396351893779137e-01,4.153987249105415835e-01,-7.804258892132138747e-01,-6.288380514418234757e-02,2.274669402335216972e+00,5.483105790696720661e-01,2.160061616812704699e+00,1.048591024512264269e+00,5.507718917301605011e-01,8.076698230180718863e-01,2.766933540014659410e-01,-2.930117560118057352e-01,9.070928399794260244e-01,7.695840834859661861e-01,2.649595918603552924e+00,2.633542859290953775e-01,1.814582109045530245e-02,1.401232811141409629e-01,3.518796611439202859e+00,2.521241127147072270e+00,3.837670424255394952e-01,1.164963869797928653e-01,-2.634144586065719773e-01,1.619095678710844144e+00,2.467778422978327280e-01,-3.356071445422691424e-01,-1.034932771739157875e+00,2.119402563952512253e+00,-7.284115250032359157e-01,2.935888906057330106e-01,4.886821979104445379e-01,7.582716574077822402e-01,2.136213396245435270e+00,1.378554730364575098e+00,-3.221846640411417662e-01,1.019863102552991840e+00,6.088004258273200797e-01,6.508551860465849881e-02,1.546987522059156683e+00,-3.837570760960418159e-01,-2.649272082768068526e-02,-1.025765109526432406e+00,1.361096193790465314e-01,-1.882705812523939315e-01,-5.626249988973122118e-01,4.304964813153894232e-02,-2.301776568991532379e+00,2.784959309678608497e-02,8.943847645535012436e-01,1.196268987475311574e-01,-7.001066179531552081e-01,2.333690303152893719e+00,9.534519806555279420e-01,-1.587009801362476935e+00,3.440520664183206456e-01,6.258539552778241699e-01,1.057323755811020893e+00,-1.100487904577030163e+00,1.666182374483687001e+00,-4.421289384951451740e-01,1.123552034777350883e+00,4.017803348920399031e-01,-1.024336739645219208e+00,-5.600693514818878560e-01
8.030006337414450357e-01,1.801045840420575583e+00,2.794157781387710537e-01,-1.172680045003370974e+00,2.614762055423860421e-01,-3.101519425611118375e-01,1.544346570538795704e-01,-2.775289219893192771e-01,5.807502979663291542e-01,-1.922939908992571667e-01,-2.658737206831675581e-01,1.652816084484765025e-01,-4.537079121551808036e-01,1.072337687244435539e-01,-3.480533801437245001e-01,9.588666695233136750e-01,-3.654370663504536432e-01,1.345000153929219455e-01,-3.163541681332301958e-01,-5.504193714074697569e-02,-6.247001994023829718e-01,-6.028015534977382295e-02,-7.814318805861829587e-01,1.497093478307385817e-01,1.913475592898548072e+00,9.287338784368818212e-01,2.856935352672992923e-01,-6.009012024613619163e-01,-1.723318270636886584e+00,-1.545573578369892509e+00,-3.232624157757268968e-03,2.284263071172113246e+00,-5.934953606139155013e-01,1.884673751878312986e-01,-8.691326935113576901e-01,-3.254642992232965604e-01,1.842403801409981057e+00,7.035573184595436125e-01,1.888794457074471467e+00,4.027589050511610758e-01,1.267574734213919863e-01,4.626502490400504763e-01,-5.202660765666600184e-02,-1.058010848905820839e-01,7.974855834780558705e-01,1.060127241792444330e+00,2.438413508060439661e+00,1.203612608137647755e-01,-1.585247316725996725e-01,1.101865911274952481e+00,3.100854629126664541e+00,1.646112310584738170e+00,-8.571673844444188672e-02,-5.643483714364888604e-02,4.931542594160226445e-02,1.280462667258172704e+00,-6.655147616851198045e-02,1.014056080092305967e-01,-1.095545246311451226e+00,6.042065909168445881e-01,-3.666051902197354773e-01,4.653949625105308074e-01,6.700405094168626619e-01,7.910617427027721860e-01,1.799067112753042874e+00,9.920331159524055087e-01,-5.581834884573939615e-01,2.900611144193557811e-01,4.330029894205373875e-01,7.430637042852121787e-01,1.386393848510704352e+00,-6.820284016326598753e-01,-2.527318748777335755e-01,-3.697389345006335537e-01,-2.320795818734351368e-01,4.766425563249558905e-01,-4.567798455479577524e-01,2.262088363905968569e-01,-1.620974200394605935e+00,-3.617049971577429579e-02,8.640328961393940466e-01,-3.131555322848096901e-01,-2.630274877997241800e-01,1.935406300347097819e+00,8.553966296701613903e-01,-1.101236180347062277e+00,7.136961151524782165e-01,4.363957636880244628e-03,6.767645909118906733e-01,1.136679184882533056e-02,1.016214975898316553e+00,-1.091303553820450301e+00,8.990509523231458022e-01,1.817688747866105514e-01,-2.478235172743998294e-01,-1.468409689356736658e-01
1.056683994558987205e+00,1.449399599540761585e+00,-8.236620247695398966e-02,-4.238974370370593991e-01,-1.507095624690573954e-01,4.112499879903481759e-01,3.042856051146934360e-01,2.421369125314984938e-01,1.617461453033307572e+00,-4.555029695433385206e-02,-2.926376401467412625e-01,2.100002464811595582e-03,-5.217437835364725496e-01,1.370410002039305630e-01,-1.410206075081810728e-01,1.252235311427897901e+00,-3.452145891792439136e-01,-3.893560630944598588e-01,-5.755952421555696197e-02,1.437833771933641203e-01,-8.534331059544294495e-01,1.759855383039767018e-01,-6.901950068914903813e-01,1.518423457672118670e-01,1.480501978953561837e+00,2.051519775695555547e-01,-1.313249219972422444e-01,-6.290022976117223275e-01,-1.121913425234739581e+00,-9.413007226287126716e-01,5.306914672815931100e-01,2.385649786935577499e+00,-9.934756753613366298e-02,1.455958454790590162e-02,-8.924338802499822698e-01,-5.435630833919465887e-01,2.065962076153753824e+00,5.531791737070728132e-01,1.166309238564398054e+00,3.964562195642273856e-01,9.273045665090856593e-01,5.102647936691826480e-01,7.098676628017866475e-02,4.099319209328717850e-01,6.851758615280948428e-01,9.371394702426156798e-01,2.637590051673621261e+00,5.376913786333765710e-01,3.928284736250970965e-01,5.182132196525859325e-01,4.338403717038534779e+00,1.890997159552640472e+00,7.521453468819132571e-01,-1.669609683544024392e-01,8.599260078216230951e-02,9.432647568258683002e-01,-4.998864032834223758e-01,-4.862894906587964527e-01,-8.905488531187500945e-01,9.689169096306158302e-01,-6.057225873629193402e-02,-4.799998468285654463e-02,-4.834037255763537488e-02,-2.494326972738136750e-02,1.053764078584622510e+00,4.208821565622169469e-01,-2.474769785005709322e-01,9.560079783026538269e-01,-4.211024795707530854e-01,8.454541511114493924e-02,2.434537311562326334e+00,-4.149751154182266810e-01,-3.254866676020024552e-01,1.355343871362637287e-01,3.273751249137666353e-01,6.018949395923195445e-01,-1.237766703815219027e-01,-1.618135359373540361e-01,-1.147879452530671696e+00,-5.095681060376714422e-01,7.485986432458842099e-01,-1.630578731192667274e-01,-4.530072259170220828e-01,1.542460492701618113e+00,3.853225273775892079e-01,-9.043011624776471358e-01,1.724620052518123503e-01,9.680812606264698195e-01,1.087878055239787312e+00,-1.159729001891496969e+00,1.678966669379704069e+00,-7.482855908893667474e-01,1.619856668225101437e+00,4.798180767552677195e-01,-1.110343408920099417e+00,-4.120710983266101524e-01
7.013371040986893235e-01,3.435856801328032173e-01,3.998544928555793909e-01,-5.238104912007713887e-01,-1.260311707259317848e-01,1.556892735500275404e-01,-2.323969699805992772e-01,-1.417226757761484990e-01,1.404251554978874994e+00,7.329830437731964521e-01,5.734377554272360733e-01,1.590519603259173409e-01,-5.093865861002460083e-01,-2.955761679961528832e-01,-1.328500668121989636e-01,1.698988449750851837e+00,-7.511969740175086230e-01,6.069293182196480174e-01,1.380037907538197717e-01,4.277124086525091462e-01,-1.101641130837550442e+00,5.025902747298103268e-01,-1.637705050592609402e-01,1.771672402522454226e-01,1.422516556489380912e+00,-6.739498908588369419e-01,4.940871012128190687e-01,-7.071439625384037253e-01,-3.806771188915138993e-01,-5.797191643114020243e-01,2.730864523822525425e-01,2.886450461528681011e+00,-4.602985785926604900e-01,-3.455602030738926245e-01,-3.701591417386798089e-01,-5.100293090429454113e-01,1.042113697731937849e+00,1.458940174510717114e+00,1.715955508538559604e+00,2.225395942507116587e+00,7.460442491008146826e-01,4.304172658548560682e-01,3.498311726479682582e-01,-1.615142713545318909e-01,5.571646383145739678e-01,6.055721378268712485e-01,2.974136283179359186e+00,-4.907989238350326522e-01,-6.601404974855219765e-02,1.180566321303492039e+00,3.424020897668244690e+00,1.290699450457011954e+00,3.285766164038250725e-01,-4.960030795479321575e-01,-1.133002209626284174e+00,1.926967292693340328e+00,1.026236384852762917e+00,-1.232848746823638764e-01,-2.312116882751702462e-01,1.808292973153164285e+00,1.302439260739604032e+00,-1.466545120154950921e-01,-3.706354534603935047e-01,1.583572289871058913e+00,1.007231247308696842e+00,1.271457679673040075e-01,-3.918194225347171877e-01,1.372784482759045854e+00,3.773971518462643226e-01,-5.564865840964254851e-01,2.499412687025392099e+00,-5.370486369455822473e-01,5.940699602940761048e-01,3.403170485093520714e-01,-3.473818626684195277e-01,1.382697854225125145e+00,2.454484335448308685e-01,9.891936049472656034e-01,-8.518850608018243564e-01,-8.158376371816061789e-02,-1.288923934112253811e-01,3.951221056799411602e-01,-8.558162918946454756e-02,1.516344403927554874e+00,8.302776470927809571e-01,-1.025343925586468918e+00,2.292221480274007350e-01,2.263721136696479341e+00,4.674533189757312801e-01,1.767698711820713808e-01,2.163922124776179512e+00,-2.593028959598011607e-01,7.583758837310928813e-01,3.055327217844082677e-01,9.939543175433580569e-01,-3.139491953810291669e-02
8.510311496173649237e-01,1.854529977218850600e+00,3.638066978303862165e-01,-1.111506787637392524e+00,2.093338639352334551e-01,-2.161259809325160042e-01,2.084775586108116863e-01,-2.217847225719272453e-01,1.006268073949916353e+00,-2.795838589475997393e-01,-6.990083104215301102e-01,6.923779602823518231e-02,-5.380282442368045093e-01,1.725967285078967850e-02,-2.073156291232000070e-01,6.690280767654555039e-01,-5.734429734108533738e-01,1.201677663114409933e-01,-3.346392614744184701e-01,2.652741265928378403e-02,-7.802540601361477313e-01,-1.292191520526906334e-01,-8.109315652879498515e-01,1.095179102616879868e-01,1.887720493566445334e+00,1.077510184293802853e+00,1.863531819343826890e-01,-6.410681731701268760e-01,-1.987437788265693506e+00,-1.549024750785448212e+00,8.648881160260077361e-02,2.436202387842993478e+00,-5.478491711290764954e-01,2.153438259812301692e-01,-9.257446044179713507e-01,-2.150704671018534575e-01,2.069873251731089603e+00,5.588125731287589826e-01,1.665383077662695666e+00,2.106178516430824432e-01,2.606621663311464165e-01,6.286414422762265364e-01,-8.532629514176801738e-03,-6.490665533634447371e-02,1.008129685546990117e+00,1.091601089199009555e+00,2.484547961098824587e+00,3.216848527102516009e-01,-3.488070571753230931e-02,8.607676556408883073e-01,3.200615678454840740e+00,1.819879978401795162e+00,2.798430103906235367e-03,7.900750340876239175e-02,2.121606779971140222e-01,1.119195185249004743e+00,-4.125871539932074450e-01,-1.047641968288204467e-01,-1.044962249925537545e+00,4.900235988445620361e-01,-5.507743727618595875e-01,4.960940231533120803e-01,6.655241890265259919e-01,5.333578082028478384e-01,1.943702317427136617e+00,1.231766455800992199e+00,-3.868316680800104601e-01,5.761618908208211431e-01,2.869957436779832505e-01,5.972810337681555559e-01,1.350243541522176738e+00,-7.089402991150808298e-01,-3.541637783587740507e-01,-5.151019478959117937e-01,-3.017743125149371236e-02,2.601419338955457405e-01,-4.185172417566844771e-01,-1.819450531866310117e-01,-1.792225041488537896e+00,-7.215465246393193421e-02,8.085947980842367322e-01,-4.752381261546652635e-01,-4.103632496097264770e-01,2.050819586615582502e+00,6.150428625744565059e-01,-1.072032728481176589e+00,6.640737390291622244e-01,2.776740038860037174e-02,8.685400668970240101e-01,-3.687874753167118547e-01,1.035578596845555088e+00,-1.139522900161257457e+00,1.190331227197061414e+00,3.357197165932393479e-01,-9.497268642640022129e-01,-2.097578476909115752e-01
9.723763433816785540e-01,8.933413656821871385e-01,-1.211014093267005487e-01,-2.414323519585383493e-01,-2.831413727974875227e-01,6.665976391593718686e-01,5.032972180437704779e-01,2.105567416239911283e-01,1.616580312043937262e+00,1.520051734708788294e-01,-7.362159474748058985e-02,-9.079430954190687020e-02,-5.275013774000864020e-01,-8.949831914470809946e-03,-1.531475253058177666e-01,1.314178685120870771e+00,-5.241913872260687279e-01,-3.979354437137268552e-01,5.534515775829553647e-02,2.146514236208831583e-01,-9.128796472872009460e-01,3.394188827548570431e-01,-5.502503100393945079e-01,1.618710586592148615e-01,1.441754695604258396e+00,-9.743686971240614336e-02,-1.218864016915917337e-01,-6.917699152833033382e-01,-1.061324904871364883e+00,-8.573285820018987646e-01,6.286665658665833156e-01,2.586637033242898731e+00,4.839011611683652347e-04,5.706874510113145449e-02,-7.878633425454198980e-01,-5.745349453827888198e-01,1.942430418806220249e+00,6.308816263316198159e-01,1.300338605088025901e+00,7.337156827278934479e-01,1.075895332844827523e+00,5.714807881012220481e-01,8.974966764695010979e-02,3.516878611865607018e-01,6.446689649238109832e-01,8.358561288805935741e-01,2.570821297592949417e+00,4.333924827234928445e-01,4.847050595471919521e-01,2.038826391270728289e-01,4.540817544755540780e+00,2.074956655886166956e+00,8.176928098478399853e-01,-2.511337384983722831e-01,-1.635849008693081308e-01,1.122066459652745207e+00,-2.770646886420479182e-01,-5.650900957205757802e-01,-6.702491539199801895e-01,1.476078607756989847e+00,1.638419456981444755e-01,-3.849193952898368742e-01,-3.026363904936487659e-01,-2.053225116142476381e-02,9.101224345435834362e-01,2.943464144210882205e-01,-2.886254162873265194e-01,1.232241605734412104e+00,-5.208268274125966713e-01,-3.415565734016340338e-02,2.582315085737107552e+00,-2.548309728012667641e-01,-1.029344409440406810e-01,2.613065342668198232e-01,3.685039626863692575e-01,6.705495284230382769e-01,-1.737769319766169218e-01,-1.189284886882470138e-01,-1.056475654504874573e+00,-6.410384008839403736e-01,5.750279510639082492e-01,-1.333779881997212979e-02,-5.086262430503241116e-01,1.609862208140422357e+00,3.618523176214640813e-01,-1.024354748339906918e+00,3.444789761809469164e-02,1.373555961574593809e+00,1.156411979779875754e+00,-1.289897528798008119e+00,1.849128190111257952e+00,-4.268775401576228590e-01,1.506898100872063218e+00,5.675543538504026486e-01,-9.999211393485532007e-01,-5.428379810100815162e-01
9.656097835261538975e-01,1.399636578323476321e+00,2.360926251335239701e-01,-9.983759633359718944e-01,-4.036882204569844923e-01,1.032444621723462852e-01,-5.289287629289185499e-01,3.624021531749743730e-01,2.625611240114568368e+00,3.607592876437443197e-01,-3.039308554680827945e-01,3.986127392206923470e-01,-5.542477027779829646e-01,-4.006308962227251302e-01,-3.028741385706735234e-01,1.508595418807640032e+00,-4.247700872721875687e-01,6.120505666252991084e-01,-3.669086078390356720e-01,2.259924305127052890e-01,-9.792248419121873937e-01,8.273153737031434529e-01,-3.442455147575469998e-01,-1.400889841264301439e-01,1.785709163483652162e+00,7.183062085153107956e-02,5.226426459774335953e-02,-6.687113233580013194e-01,-1.490556556331288585e+00,-1.262783768913136040e+00,1.413376248361093157e-01,2.894022338999782562e+00,-6.792785804390282234e-01,-4.769811924593958530e-02,-7.101451492171649837e-01,-1.967777270827582581e-01,2.147988351542159613e+00,8.036310808474369516e-01,1.663048104739470512e+00,1.526369640916068082e+00,8.232297170091475991e-01,5.927840868647555883e-01,5.582708781062910575e-01,-4.718592148092211336e-02,6.872272103343710636e-01,6.292194774826634918e-01,3.240112338271736725e+00,2.202362200270581993e-01,-1.760736546215181664e-02,7.657155356625883202e-01,3.667299134666984983e+00,1.986789654621217149e+00,8.234292125951818697e-01,-2.463521338534413463e-02,-4.814978451642474844e-01,1.600869622356045685e+00,4.792628231489248769e-01,-4.257813988895892132e-01,-1.068217118189390469e+00,2.071373742357268899e+00,-1.735152231800269618e-01,5.774984129241909070e-01,2.418713352705729180e-01,1.097456137986217106e+00,1.734643672694490046e+00,8.903545808711916809e-01,-7.142570724198771259e-02,1.120120812236692354e+00,6.764413099340331748e-01,-6.887560669475019104e-01,2.281920950677005955e+00,-5.312985642429516320e-01,-1.903041766425118964e-02,-7.973074011123505445e-01,1.029186155443693601e-01,2.182405877519744131e-01,5.952162649358488933e-02,5.121886842282582508e-01,-1.942968014092150586e+00,2.183320498177625524e-01,7.868406357619392999e-01,4.311906950115240167e-01,-5.086056337012743178e-01,1.756469631894667538e+00,1.039427073561527193e+00,-1.285876543121274862e+00,1.686468371887892281e-01,1.373051975033961369e+00,8.478227915617302379e-01,-1.076792087425897382e+00,2.288468114699317546e+00,-4.862013197762830585e-01,1.447203879585281072e+00,2.830934294855666500e-01,-5.508455481381049346e-01,-2.935133627506620324e-01
6.618839172798586246e-01,7.120250324854860979e-01,-3.957419633093933742e-02,-5.872956858347730957e-01,1.631094079796955865e-01,1.938867495657612683e-01,6.988196735740964671e-01,-3.917193938232820249e-01,-2.324579095446446253e-01,1.714438007599288494e-01,7.437819676499024535e-01,-3.166919009707737376e-02,-3.495358279092956599e-01,1.958024876544485204e-01,-4.346239003483962082e-01,1.443041650297232970e+00,-3.694522793167082098e-01,-2.746438627698223334e-01,9.124912565181869661e-02,-1.345859532507408252e-02,-5.343687970294284106e-01,7.846964025684827204e-02,-5.981443122172820370e-01,3.497474275874296046e-01,1.655801657421627660e+00,7.294410028839654059e-02,3.465561140737293822e-01,-6.390075521579099416e-01,-8.934785122820296799e-01,-1.097622412763876509e+00,2.718373218394837254e-01,2.244774001327392909e+00,-1.965152408615106761e-01,1.557002922805267586e-01,-6.548916685713576102e-01,-7.109180657560214556e-01,1.232680627670188933e+00,9.903506609607917177e-01,2.081670451032863856e+00,9.024931065239831796e-01,3.596468385789104438e-01,2.961978642717942867e-01,-2.315810645333901685e-01,-1.202566521322846055e-02,4.180231404206697921e-01,9.340663083544544776e-01,2.103919080528494412e+00,-2.101600330187376464e-01,4.819085549831716997e-02,8.176628276078374835e-01,3.699454201850223445e+00,1.613483380452032323e+00,-1.693475822575202239e-02,-4.896346031139668931e-01,-4.405593356797681825e-01,1.528389782036376321e+00,4.019565864693159796e-01,1.555699611276179228e-01,-6.273017304398236238e-01,1.204651742573579432e+00,5.072254357039779338e-01,-4.662580158175371192e-01,-2.160987871083289158e-02,6.902938885400703439e-01,9.328790925499046427e-01,1.217329371939592231e-01,-8.750296239005465049e-01,4.444808365301213815e-01,-7.605518009276032720e-02,8.726645865851532236e-01,1.950550746455847806e+00,-3.209483510965455144e-01,1.825570630014972662e-01,5.525729614045868932e-01,-3.125492227641611387e-01,1.165609433795486538e+00,-5.387673239848929096e-01,6.058816343532738014e-01,-7.697030571396455967e-01,-5.435576298053365063e-01,5.209496614781146118e-01,-3.308808773268451242e-02,-1.156818529344457447e-01,1.699884143818581661e+00,8.107791093575158481e-01,-1.121817471787980303e+00,4.710036037724851243e-01,7.728567762566391774e-01,6.322884912202854091e-01,2.191721951483615594e-01,1.179942995841836151e+00,-5.324636024097142428e-01,4.615719830167353543e-01,2.334272158506015549e-01,6.979386492659596097e-01,-3.115272010512339373e-01
1.016751949560797730e+00,2.206564815826792536e+00,6.300574938122139868e-01,-1.465163931863631142e+00,-1.149048584132904560e-01,-5.920616145910209127e-01,-1.280860408885009072e+00,2.869067527881399293e-01,2.813121726681614199e+00,2.455904771604960346e-01,-6.415962747522991894e-01,6.601171504643625898e-01,-5.844385648849466097e-01,-3.372791678983322883e-01,-1.911439937889500007e-01,1.433755077037379477e+00,-3.198127209967831508e-01,1.159939199610620530e+00,-5.579957123879204506e-01,2.517340732577352247e-01,-1.058756734073961425e+00,5.844575973808502356e-01,-4.182904105007095863e-01,-1.845415493675189034e-01,1.839278574623984808e+00,4.262016176303023984e-01,2.918120677610778202e-01,-5.812656633849009324e-01,-1.413968064378152922e+00,-1.285691937798290496e+00,-1.816511013498465221e-01,2.768638876915270330e+00,-1.091958589194145235e+00,-3.239649046321776971e-01,-7.234741012039247465e-01,-3.265578796942403272e-02,2.061241345181996198e+00,1.001154778135199930e+00,1.497036306718440013e+00,1.571431740078594430e+00,4.557109286074021437e-01,5.022987396136653349e-01,6.987453624101460647e-01,-1.823186028443032902e-01,8.391155896989568319e-01,7.109962115556922591e-01,3.624010171287639803e+00,5.865187011585534099e-02,-4.095817032244157274e-01,1.727403621880267526e+00,2.762490164373524681e+00,1.340964379706373943e+00,5.141116117373181194e-01,9.225193976286155673e-02,-4.246103847342724835e-01,1.594897909340967423e+00,5.473068911014453697e-01,-1.743392073569651479e-01,-1.239665589153903458e+00,1.248711345332723432e+00,-1.264223879083853641e-01,1.375247922964881964e+00,6.903279314877281969e-01,1.786760010173106039e+00,2.154194564441536563e+00,1.192047095393767631e+00,6.355793638210593954e-02,8.429386596785806152e-01,1.267186577720217144e+00,-8.484460716005233216e-01,1.946666328478033448e+00,-9.972080056396972481e-01,-1.376542519128301501e-01,-1.105489156095909253e+00,-2.248986956425522155e-01,3.150573381616217916e-01,4.024920580820931515e-01,7.794442556836542746e-01,-2.131836944791962729e+00,7.528825532815280885e-01,7.274022439769510795e-01,2.831663650030945001e-01,-2.754006681601146589e-01,1.647339765736878681e+00,1.201273271559473610e+00,-1.050140667491314517e+00,4.954395411111562342e-01,1.093588001255129116e+00,4.727372174910409175e-01,-3.115418464459275283e-01,2.165721937364706307e+00,-1.029041935910973704e+00,1.452986633733478694e+00,6.734977885884224635e-02,-1.400153347672266624e-01,1.818526136808927829e-01
1.020203357758392215e+00,1.833703195383615814e+00,-3.716928295223168033e-01,-1.016204791922243444e+00,-2.860594705396490300e-01,2.568366539127249215e-01,2.553373838779330329e-01,3.531291299064002187e-01,1.377307093322731379e+00,-1.259544039933311599e-01,-2.063905712590391461e-02,3.125778677704285635e-01,-3.710862649875056318e-01,9.134505616369514858e-02,-6.794436883228933688e-01,1.537952441678057225e+00,1.657769145109401765e-01,-3.190502093727287103e-01,-4.478679234425755329e-01,-2.358350560905960736e-01,-3.708487866675388434e-01,6.500360206531585749e-01,-7.303168899874800113e-01,-3.000788744410057274e-02,1.994677987716354739e+00,6.149445994427523710e-01,-2.253219139008235394e-01,-5.762623124553394316e-01,-1.868521266331289343e+00,-1.741623868652037777e+00,1.826816130390335746e-01,2.228991620528985695e+00,-3.934968933539212399e-01,4.211365119430987014e-01,-1.011070885011106313e+00,-4.477848192990878662e-01,2.473554131646925835e+00,2.894174774211232259e-01,1.978677449856414805e+00,3.131494843478608292e-01,6.045111931816046225e-01,3.961934339973388619e-01,7.948968353226294747e-02,2.183272801158503418e-01,3.938078586088580857e-01,8.712818678318319243e-01,2.524812152893719741e+00,6.008585037712670385e-01,1.522136787056873053e-01,3.462613530987621591e-01,4.240963631695585434e+00,2.396787183187926829e+00,7.887478325758332520e-01,-4.109849394058773253e-02,1.808329238761888780e-01,1.204453662381552714e+00,-5.527661928310223516e-02,-2.445172501875561011e-01,-1.614550953541266320e+00,1.806197740297152965e+00,-1.033354494161344395e+00,2.883311615577028864e-01,5.139539754886344181e-01,1.477429027963936825e-01,1.530887239050605197e+00,7.302171717772913961e-01,-4.878472187696503704e-01,1.745844089462632032e-01,2.224654043745561138e-01,5.169120375321412109e-01,2.040273883171071390e+00,-2.304787779277461812e-01,-4.750782960369241414e-01,-6.357685670372628106e-01,2.391652073392578903e-01,-6.654856313847190563e-02,-6.494206909963566865e-01,2.652680511353441295e-01,-1.878506469925207867e+00,-2.320567550291628145e-01,1.615340791534706000e+00,2.271539858823291291e-01,-5.803052043635436030e-01,1.794021447004575220e+00,1.139956102248476766e+00,-1.418988160341016380e+00,2.617643380516144758e-01,4.708913818627702419e-02,1.055630785469934718e+00,-1.372224765992365203e+00,1.592050476684006455e+00,-6.440020840197477892e-01,1.303084794824278525e+00,1.736163990011508063e-01,-8.771379792158895405e-01,-6.442833483775716186e-01
5.778368854443184377e-01,6.522538581713497319e-01,6.476597445269006714e-01,-7.244052135924731184e-01,3.119363198078291544e-01,-1.495713028190033822e-01,2.097827651737586563e-01,-6.142745321784112145e-01,4.277217279651520654e-01,2.949522497406533716e-01,9.965131037799596081e-02,-6.979709892780416869e-02,-5.403709734266575193e-01,-1.361139724588245059e-01,-2.618339453738161016e-02,9.374263834955971486e-01,-1.023831554824063073e+00,4.700233270985100242e-01,1.022771406762557900e-01,3.322919034336699329e-01,-1.047260215993079502e+00,-1.690645446117520212e-01,-4.586162032122675369e-01,3.070226152319779356e-01,1.565020667060243786e+00,1.581025144315283126e-01,6.444663326404050929e-01,-7.186602295094111081e-01,-9.665898540449093801e-01,-8.775135340875770407e-01,1.651397746917291909e-01,2.720434956469220289e+00,-4.785109632693843595e-01,-1.403829826209642695e-01,-5.020785106934316788e-01,-3.946487010391480643e-01,1.030383919734948472e+00,1.299026194834680625e+00,1.774049751162945165e+00,1.398344601262011988e+00,2.958646575597725370e-01,5.536458682464399095e-01,1.385728938345127600e-02,-3.020169273900332185e-01,9.178955419423615592e-01,9.198643144222133916e-01,2.502758851924936856e+00,-4.531030139051637762e-01,-1.433359762068282528e-01,1.233102925068802591e+00,2.868616740799032616e+00,1.223381558069760455e+00,-3.408852934300780069e-01,-3.364931096866652371e-01,-6.814585699416028097e-01,1.662079625987441078e+00,4.355192314121632546e-01,9.109880138935241845e-02,-1.803885577655145456e-01,7.342641503577729267e-01,9.599588137349244210e-01,-8.021139384881201262e-02,2.702913894020151850e-02,1.340146329414379167e+00,1.401014428814391977e+00,6.141994066324105717e-01,-5.554687808661306070e-01,1.111048964653747806e+00,2.759193372778672715e-01,2.582467552709532543e-01,1.658702439716155164e+00,-7.271105035117164661e-01,3.979738587065269617e-01,3.171299135107736866e-01,-4.607116329910748709e-01,1.280238359143480942e+00,-8.680803724657210063e-02,4.372837962518439925e-01,-9.638938291459155927e-01,-1.588561686196841016e-01,-1.858805516940958968e-01,-2.760267322122859635e-01,-6.213899593361787987e-02,1.873488225285791398e+00,5.363245372620790707e-01,-9.319907181018385334e-01,6.274227254999711345e-01,1.310250011095277056e+00,4.827536082081430591e-01,7.041019091412854536e-01,1.276620677869266363e+00,-7.346054516679090263e-01,5.714698045169220864e-01,3.681578230715715216e-01,5.959536196499952698e-01,5.483426549579684117e-02
7.822537406113398983e-01,3.919049588666881911e-01,3.976292979693034080e-01,-4.811152736534313745e-01,-2.820017652618834747e-01,2.665625869070528120e-01,-3.615243605861149789e-01,4.606324195327386739e-02,2.025266120375603052e+00,7.645652449586498589e-01,3.446328961275912928e-01,1.814816106233845538e-01,-5.610098668532461641e-01,-4.039315969530177797e-01,-7.513227677054679088e-02,1.692138683211403150e+00,-7.947743614672859724e-01,6.594552978060015391e-01,9.545290243362125615e-02,4.953096763960656013e-01,-1.214465482750151093e+00,6.463309149062564929e-01,-1.183259484524558092e-01,9.417186109942599082e-02,1.394869103402581967e+00,-7.336419739617980884e-01,3.725106354900397099e-01,-7.254686115713533390e-01,-4.709786776088059623e-01,-5.497537201498631232e-01,3.379666403198922642e-01,3.029000022171151940e+00,-4.574785019229673511e-01,-3.729111048769849224e-01,-3.933896769071787980e-01,-4.397362803032551226e-01,1.260129663283229284e+00,1.373535200319117688e+00,1.547889757842163982e+00,2.279035799939741480e+00,9.416108436257657477e-01,5.152812208689130369e-01,4.863643892685160508e-01,-9.917594218511817383e-02,6.161892253306952005e-01,5.473615479879299084e-01,3.160347206815153243e+00,-3.322828355160795111e-01,2.172517303995613602e-02,1.018546381246101973e+00,3.611456377723110567e+00,1.442878065887974515e+00,5.796456879364793036e-01,-4.140132626518387982e-01,-1.104373653818607970e+00,1.873437959169181655e+00,9.264096031517895513e-01,-3.237465081970097303e-01,-2.694035826260984257e-01,2.004884994719749347e+00,1.180287369650182328e+00,-6.676035681158487556e-02,-4.210624285839749126e-01,1.479009594021500007e+00,1.064799377706102890e+00,2.198736050368988726e-01,-2.109914000704390946e-01,1.604900356660360128e+00,3.540730450559844700e-01,-8.821587949203635315e-01,2.666592749845486665e+00,-5.226747088467932345e-01,5.382984231927649965e-01,1.636969157301451649e-01,-1.706521799779665005e-01,1.196148828359883787e+00,3.586164137316300571e-01,8.476542376875252360e-01,-1.014602787419396801e+00,-4.307919958307127040e-02,-9.665446391203758036e-02,4.626728602360922205e-01,-2.067081897360364129e-01,1.512394731410265925e+00,7.707357988088885392e-01,-1.040342335870443780e+00,1.014915818899651823e-01,2.463979566257910925e+00,5.982109031022753154e-01,-2.589417566007056193e-01,2.413369927690435901e+00,-1.996322649959025863e-01,1.039820910075725635e+00,3.804819408464514829e-01,5.580800699724514091e-01,-9.346919661789265810e-02
8.842421703799128174e-01,6.912652403936517809e-01,-3.336469477341297285e-02,-4.253914930045190612e-01,-3.063857231379388812e-01,4.241889483406785510e-01,-2.037884721605837113e-02,1.917113869857537400e-01,1.586284721022708455e+00,5.281086610610036258e-01,5.428523273347883871e-01,1.821111859891384466e-01,-4.530363652402327745e-01,-1.078923584793628071e-01,-2.939192112682061375e-01,1.868406410712023069e+00,-3.495005122739438530e-01,8.978585729373148028e-02,5.107443701838915856e-02,2.442060774273433210e-01,-8.754818042128231781e-01,6.558488778622668658e-01,-3.139653082272356177e-01,1.305267829164484250e-01,1.458356443204184005e+00,-5.695024936916802671e-01,1.358801962447373779e-01,-6.564522886474672969e-01,-5.401909353375636824e-01,-7.371570523052487500e-01,4.112343365404661499e-01,2.631893011318595654e+00,-2.626131732250595596e-01,-1.633185431416384059e-01,-5.735592582830588704e-01,-6.219606744642062202e-01,1.509364652350989378e+00,1.066385259629193394e+00,1.618389507822735052e+00,1.640672772859221196e+00,9.425405336442389537e-01,3.667772606361017762e-01,2.780355364048192057e-01,1.487738848210596043e-01,3.741096930181715963e-01,6.417108601006403790e-01,2.867509185067884214e+00,-4.725187043125253505e-02,1.683833403530690109e-01,7.793667621583220129e-01,4.128171409747611875e+00,1.678579665916479113e+00,7.558693061887091780e-01,-4.430145392279477567e-01,-7.357971418352149406e-01,1.613939517484466402e+00,6.273478264292505768e-01,-2.982666806143747795e-01,-6.359670380151507540e-01,1.969202479295518504e+00,7.116416827325879879e-01,-2.155773180115500010e-01,-3.444469804690845072e-01,8.851487283363768110e-01,8.339081697427053186e-01,9.837216646946200793e-03,-3.823805233748387433e-01,1.097852130028389439e+00,4.829582804098016963e-02,-3.671175266001369675e-01,2.752321305909206206e+00,-3.221457239990076493e-01,2.449922935030400817e-01,2.780380110215850964e-01,-2.226110050465999329e-02,1.040060215712685254e+00,5.030428925977820098e-02,7.581738422303423430e-01,-9.349107565687437837e-01,-3.062814846144504277e-01,4.344989461912631690e-01,4.501704429196163315e-01,-2.600708177906929097e-01,1.411987377865303817e+00,8.462687450735055794e-01,-1.088927486483016738e+00,5.979901318557528933e-02,1.861833628956089726e+00,7.424996886860185663e-01,-6.216265072982198880e-01,2.199066761934378000e+00,-2.460094976491350172e-01,1.091737976866289594e+00,3.122458041060700573e-01,3.256317357893205311e-01,-3.112919491091101221e-01
4.953869630322727535e-01,-6.389729912314027205e-01,-1.140049979314956413e-01,-8.903017782055688834e-02,-2.664927396806062165e-01,9.968840729755059638e-01,1.364248589287830216e+00,-3.954822145507607134e-01,1.865508599656411359e-01,5.414740968032875079e-01,8.232559398734329292e-01,-3.784300041667610914e-01,-4.427861120857032318e-01,-2.822851723613544750e-01,-3.773014920883852596e-01,1.264476005750246657e+00,-1.018765908409071885e+00,-3.802642736801635781e-01,3.190254063856320377e-01,2.022618419536602041e-01,-7.921106730879625690e-01,4.688933563237196456e-01,-2.949942178515597146e-01,3.120783232953593389e-01,1.596662303795946869e+00,-4.539320855427956825e-01,2.114708218435385478e-01,-8.474795367023585380e-01,-1.196515708607262418e+00,-1.010575811636319710e+00,6.136106161481819088e-01,2.914342364694034071e+00,1.188424675310744694e-01,3.919263376613562055e-01,-4.842820271298635681e-01,-6.578575958914780752e-01,1.268605349563624252e+00,9.397565484243086686e-01,2.275826081385234900e+00,1.454777782494183658e+00,8.761707781100861459e-01,6.495569164137757756e-01,-1.624907224145910045e-01,-1.200662577568058081e-01,5.276186607347821411e-01,7.142975256112441551e-01,1.911606441024246150e+00,-1.931876350180959934e-01,4.405972519635933948e-01,-3.975086717517103407e-01,4.403999003179734473e+00,2.428265121935287763e+00,2.719358451490592188e-01,-5.258435860477711499e-01,-8.376330395742489499e-01,1.800956072398737895e+00,5.622984548286066309e-01,-2.807633118442484088e-01,-9.498480452691715481e-02,2.498965971174432088e+00,6.884912577661086441e-01,-1.317747396160662054e+00,-6.229605283640393676e-01,3.134554255988518667e-01,7.777233835915988713e-01,1.202613494360709745e-01,-8.254928681874929008e-01,1.394304103382919990e+00,-4.932739103266455816e-01,5.129385989951502633e-01,2.230450611422653662e+00,1.205639790681128365e-01,5.975798731726839064e-01,6.226248286279769673e-01,6.001755358157935538e-02,9.664915203656405662e-01,-7.442260527814765769e-01,2.194800004102979707e-01,-8.293674483748629811e-01,-9.471608194181027063e-01,1.473222328300926032e-01,1.870339819327745401e-01,-4.781693598429900272e-01,2.067950040170146941e+00,5.312775868695988057e-01,-1.479725994191235294e+00,5.449340020428666831e-02,1.679153001548155721e+00,1.078928947851000020e+00,-6.710104916366688155e-01,1.594391022731062479e+00,2.701421624313998793e-01,4.844639712805471898e-01,6.258370005863821417e-01,8.381831915206366945e-02,-8.008175811909860053e-01
6.841180377661291168e-01,4.499452999222111615e-01,3.207600680504242852e-01,-3.319330113656889791e-01,8.765134820466134735e-02,3.810269806907179424e-01,7.143219401070545205e-01,-3.953170979143597608e-01,6.681254531941533958e-01,1.933574431832999485e-01,-3.003369587864501700e-02,-2.795694094364121196e-01,-5.618480446865253830e-01,-9.089174242662681480e-02,-5.742701412120576610e-03,8.612066286511222968e-01,-1.038408037609256596e+00,-9.142307953441645985e-02,1.967114300578744479e-01,3.189081255925355629e-01,-1.039523298030155196e+00,-1.020933613871714551e-01,-5.238204005512925310e-01,3.155336458494347740e-01,1.464322071529056579e+00,7.736540098181277081e-02,3.059547867853542602e-01,-7.582724425868966334e-01,-1.104492856437082171e+00,-8.280969816776262427e-01,4.891202274738782885e-01,2.729728058292412829e+00,-1.086503184497954189e-01,3.583908782730879650e-02,-6.206498534354986107e-01,-4.926132656193438764e-01,1.372487723768666790e+00,9.601162329195849221e-01,1.549979700601384458e+00,9.513609530766699018e-01,6.819117092240137845e-01,6.608366089646182662e-01,-7.851543560802108634e-02,-1.703223528169617307e-02,9.051733054200616913e-01,9.367723752254402125e-01,2.299289688125474740e+00,-4.323901870694545069e-02,2.648275884908619093e-01,4.861405082394985033e-01,3.726741437882785224e+00,1.730229627203653475e+00,6.071296016629773584e-02,-3.122459582649885768e-01,-4.109807252021653312e-01,1.360406184588748513e+00,-7.559031316972197878e-02,-2.566372513808162781e-01,-1.819366334740514235e-01,9.753112421841170221e-01,6.750815409026155178e-01,-5.213617385812991945e-01,-2.500715421241372916e-01,4.756930860567418762e-01,1.110740781086963169e+00,4.852829167686001921e-01,-4.918074072266329644e-01,1.346254461129499091e+00,-3.590950164425839031e-01,3.123872991856967429e-01,1.983318395002162227e+00,-4.437660357503366848e-01,2.273039503395977157e-01,4.825627210925947930e-01,-1.968260638751266611e-02,1.050791458579841908e+00,-2.518726352423796278e-01,-9.550036397818784106e-02,-8.856104350527640445e-01,-5.938650679206518568e-01,-1.717989742785719365e-02,-3.378044661991654873e-01,-3.146432229671563552e-01,1.885046840171756388e+00,2.212438951131042719e-01,-9.707739857278944173e-01,3.541249358205214026e-01,1.356514760192760072e+00,9.055720962411161201e-01,-2.265267770948522497e-01,1.355617242907596998e+00,-5.331290483564397054e-01,9.461892794346681290e-01,5.972301480708042121e-01,-3.527620576460455126e-01,-3.068451341926497489e-01
9.192455200708571361e-01,1.035164967679615522e+00,-8.588790974915637422e-02,-3.050674592839621724e-01,5.604913351583647174e-02,2.181260407741648366e-01,1.435940964706454159e-01,2.573727902857508854e-03,6.652503036112848989e-01,2.737501967260658753e-01,6.961335430507078481e-01,9.760099591088002013e-02,-3.909952168618903712e-01,3.353045011780144691e-01,-2.156232770158069412e-01,1.841500288087174253e+00,-1.380036571682699553e-01,-2.821634771061408697e-01,1.927093653721776156e-01,1.583102822833485912e-01,-7.371277211073203883e-01,1.292606904738151374e-01,-5.522956519989761226e-01,3.417576408755689243e-01,1.291806647148448839e+00,-4.206171172369678746e-01,2.247963225752515337e-01,-5.650998099504294103e-01,-5.933548526802900902e-02,-5.154068156001239132e-01,4.498104676882246356e-01,2.142076662155777189e+00,-1.096954226843016300e-01,-2.826550468854110432e-01,-6.472953151081834999e-01,-8.481736441035203633e-01,1.212572425146090538e+00,1.122582364737963356e+00,1.369082828314414746e+00,1.072347271202659602e+00,7.274276217564844549e-01,1.586504107030658195e-01,-1.502903804195881987e-02,3.397772623771175282e-01,3.145746373284691311e-01,8.665350766986315012e-01,2.609417594951662256e+00,-8.632948994359827821e-02,1.572170829072089271e-01,1.263279909893133990e+00,4.027350890634155967e+00,1.156447169524198682e+00,4.584043973538993177e-01,-5.837984178625568177e-01,-4.686815188017964262e-01,1.302285419814299683e+00,2.659300316222864558e-01,-6.065061341731418920e-02,-5.945419643605609483e-01,8.937450017017327664e-01,9.885224961808762867e-01,-2.847570081079663362e-01,-3.290022802227010601e-01,6.824913040107676299e-01,4.829598298602670869e-01,-3.230359543741854189e-01,-5.617316308339255215e-01,6.783959375377822676e-01,-2.928695005619194602e-01,1.769724134121950510e-01,2.696414943515237361e+00,-4.613265921441513928e-01,8.148626292940332194e-02,8.763765286652158704e-01,-1.932255907176544940e-01,1.527140964427168512e+00,7.272505926221750627e-02,7.262128387994830625e-01,-3.554944924871632495e-01,-5.083330534827703584e-01,3.699328121388621438e-01,8.050166671344040348e-02,5.125393903917641047e-03,1.146737895341768176e+00,6.415352404666713193e-01,-7.338610447928124447e-01,2.673985309869889582e-01,1.467258646650328568e+00,5.727006442864958080e-01,1.908292813854423065e-02,1.703418016406581526e+00,-6.481080387994355707e-01,9.767231264560194415e-01,2.375505580603613776e-01,6.840577773821290286e-01,-1.013579199619779048e-01
8.535683041051449482e-01,1.551589793695111741e-01,-4.420116289604688053e-01,-9.387307524594679098e-02,-5.230480455318989863e-01,9.866408659357257527e-01,6.889264941986114055e-01,2.572487445047579313e-01,1.263179124575375400e+00,5.306571124629209102e-01,8.302199334811830589e-01,-2.569652936052968517e-02,-3.995140394044104371e-01,-9.085017745301772474e-02,-4.577853877309487340e-01,1.922107977353686881e+00,-3.294024252419123777e-01,-4.770906985119292010e-01,1.642520052115968021e-01,1.379898194252441868e-01,-7.048832324818680162e-01,8.365674069946475999e-01,-3.209043930845883463e-01,1.693679679593134146e-01,1.476165154101897636e+00,-7.249629930631730224e-01,-1.051485956255106269e-01,-7.106395170637302972e-01,-7.220286085437118695e-01,-8.390313476931110515e-01,6.559509761819122264e-01,2.630038608201883843e+00,8.948634097390567588e-02,1.494598770775743546e-01,-6.205220945557884393e-01,-7.740342333669482100e-01,1.666384700310608258e+00,8.076386502135646239e-01,1.825427574295646282e+00,1.397767329380451784e+00,1.185402228150989279e+00,4.139023181370863336e-01,9.762111941457905784e-02,2.861450122542834595e-01,2.119422098879382710e-01,6.149592516070954140e-01,2.453919817394611069e+00,1.554126203501263459e-01,4.951877163240839264e-01,-6.187442809580123715e-02,4.920396752758446901e+00,2.285776907070489639e+00,9.971735272898504254e-01,-5.187616289407063208e-01,-6.596627658296555508e-01,1.559686917443765530e+00,4.893651468996503828e-01,-4.673854008534303883e-01,-6.222457563569914196e-01,2.603881162857775600e+00,4.738088772781542390e-01,-8.602426053928193816e-01,-6.194709637694133519e-01,1.923375918882453406e-01,5.152125603533785902e-01,-2.122384116805234866e-01,-5.527113146496377416e-01,1.145946083955719619e+00,-4.566351178092131757e-01,-4.141496822971668657e-02,2.947966602975932826e+00,9.450775304419417600e-02,2.511457261070301761e-01,4.886322641401246170e-01,2.636097375232145934e-01,8.669475441761202994e-01,-3.535647849551839528e-01,5.032135612604567987e-01,-8.322194857520384126e-01,-7.791880218507867273e-01,6.514756858815803353e-01,5.412192466049532413e-01,-4.708609318894314555e-01,1.527312768476526639e+00,7.586045015834126382e-01,-1.319436880388241473e+00,-1.775881717040225238e-01,1.823025151889449802e+00,1.079168633199481864e+00,-1.301040616280191076e+00,2.180928106754985940e+00,1.533036733026315046e-01,1.068116978957263319e+00,4.583104223701674473e-01,-8.535323871570421606e-02,-7.527898795601244419e-01
8.587792632369001256e-01,1.006344281142701469e-02,-2.806157408862839375e-01,9.790049116481402969e-02,-5.670928630804576986e-01,1.264366824319821392e+00,1.130274276991874549e+00,1.990945746955862794e-01,1.680975558995307040e+00,3.212670959526647829e-01,2.180328263385616916e-02,-3.556657036498356850e-01,-5.614667837557814067e-01,-2.674692359869504377e-01,-1.853223784789979345e-01,1.175155029851722155e+00,-8.877813946002373058e-01,-6.381452327929619806e-01,1.954770809130100262e-01,2.802384141252932670e-01,-9.829902918660620159e-01,5.853981921710045278e-01,-4.066407092499575437e-01,1.518443467894247390e-01,1.450328485850521876e+00,-3.525357000482146064e-01,-2.682678053434640608e-01,-8.259060271512695950e-01,-1.381112190095304282e+00,-9.034732456497970299e-01,8.735754945990463760e-01,2.949406450990116113e+00,2.714791680354901593e-01,3.240013094347128364e-01,-7.237615683130205202e-01,-5.733033785295754692e-01,2.038134084057007467e+00,4.925698255139244752e-01,1.512327657895737865e+00,8.974672335939898327e-01,1.395303734270507023e+00,7.952422476907504700e-01,4.955663280652007618e-02,3.129232014245199034e-01,6.774075323589902053e-01,7.253541024819085692e-01,2.294752547481111904e+00,5.175961032637765857e-01,7.923399394128681772e-01,-7.536750532110322309e-01,5.136479120518817609e+00,2.748093091311827774e+00,1.007511701181944552e+00,-2.713960212843663511e-01,-3.198998530890945768e-01,1.247390218426206010e+00,-2.629093692638344582e-01,-8.415006131803733913e-01,-3.960254704211707555e-01,2.358320222281536704e+00,1.113480339372279471e-01,-1.040410356356411326e+00,-6.674582872251322296e-01,-4.638384097332889366e-01,7.849917803550960915e-01,2.875265364033939841e-01,-3.319553059740361078e-01,1.733897394231220357e+00,-8.908252119343846864e-01,-5.773050849644012494e-02,2.713573317062385026e+00,1.160942338171986887e-01,1.077617537547994747e-01,3.190370542423323075e-01,6.600044677768639456e-01,4.555605410572238778e-01,-4.649281891077508000e-01,-4.500944406060555236e-01,-1.110818820148411712e+00,-1.006839812736392670e+00,4.677274994602367841e-01,1.014987812264466494e-01,-7.877976515723789097e-01,1.898084891648416539e+00,1.846882568866655694e-01,-1.315570141661207781e+00,-2.398952684942712854e-01,1.754333114034761776e+00,1.517931373924028104e+00,-1.983639202460662387e+00,2.005392397677130845e+00,1.162727509423296945e-01,1.491412701615705050e+00,8.286254890533910622e-01,-1.515269513438340931e+00,-9.619009820466219995e-01
9.228293994118834664e-01,3.637817899494888430e-01,-2.894653522749580654e-01,-1.192393970553113913e-01,-4.537634038379433354e-01,7.146574632285731532e-01,9.696951590117136588e-02,3.376192541085117904e-01,1.564280429783920123e+00,6.909132138907895238e-01,9.766084630622604568e-01,1.619533849682581184e-01,-4.017694658717920198e-01,-3.230996675452585398e-02,-3.477820340495135776e-01,2.245788392357470631e+00,-1.910603826488970758e-01,-1.627578712975579212e-01,2.039908540982700580e-01,2.537660037659555945e-01,-8.238111846767157687e-01,8.363480378939990301e-01,-2.339329144510539082e-01,1.782640862883649313e-01,1.300925790632448287e+00,-1.045647565821684166e+00,4.423738767833375329e-02,-6.470936133770830434e-01,-6.839900370758367210e-02,-4.845673183236727244e-01,5.827034767987524511e-01,2.564850955337173666e+00,-5.549132221847463686e-02,-2.226876541088023687e-01,-5.195065935933298462e-01,-8.275144000434473401e-01,1.379373743133812891e+00,1.127846163095725940e+00,1.566063923729644314e+00,1.830751247537095505e+00,1.180691667737685746e+00,2.524614600454308522e-01,2.669471613930642917e-01,3.195611900317790743e-01,1.266786598689106369e-01,5.522288507422038473e-01,2.847873317720144293e+00,-6.339101175743473704e-02,3.215619115998339939e-01,6.420324394368541743e-01,4.625566906730221639e+00,1.695116590243176180e+00,1.027512796013438034e+00,-6.297888085502071354e-01,-8.957387550477872162e-01,1.642344647259519563e+00,7.767082135724352465e-01,-3.712348154988781568e-01,-5.528417880867702028e-01,2.326959598867266443e+00,1.022274774925915120e+00,-5.651298454913189495e-01,-6.923945282439754045e-01,7.255692415465782030e-01,3.541407843160092606e-01,-4.716914450148087523e-01,-4.375867462539527186e-01,1.156211627889303095e+00,-2.314986120014155269e-01,-4.749675471786909409e-01,3.232929859420538676e+00,-1.331752167164469425e-01,3.434962193041028455e-01,6.613891650843124470e-01,4.794382449767979615e-02,1.289614373340264741e+00,1.029748554527111781e-01,9.432369972117509160e-01,-5.585540044061483300e-01,-5.319022548312422050e-01,4.182433623876877227e-01,6.720528969225294524e-01,-2.274500627046627810e-01,1.175616479262850511e+00,8.508804017604720826e-01,-1.069265990502761943e+00,-1.478154102338735121e-01,2.279606487454541863e+00,7.738689960769543630e-01,-8.109435034595251501e-01,2.454627300455596739e+00,1.267412622686014956e-02,1.092596483981288502e+00,3.233286412387809117e-01,5.923095843164609686e-01,-4.164751883992320880e-01
9.345318781139371200e-01,3.784446218598239708e-01,-9.806912689586928800e-02,7.801404752479645932e-02,-3.079770936188299668e-01,7.746109818375042089e-01,3.774400931738428611e-01,1.916772866468459680e-01,1.572118231732562599e+00,4.781467860054996466e-01,4.198850489907784422e-01,-1.075594747904689563e-01,-5.158812792791837021e-01,-5.000239609104131788e-03,-4.916385240079451657e-02,1.677507829274503148e+00,-5.804399838620055707e-01,-3.225928362692105367e-01,3.109002711071348624e-01,3.835125567882691211e-01,-1.048350829981057997e+00,3.992191954863943404e-01,-3.628896015589617718e-01,2.592979956150585630e-01,1.165474067476662601e+00,-7.716217311481453622e-01,2.055322891214597658e-02,-6.970233598632914473e-01,-2.423808065564994063e-01,-3.449535548978051036e-01,7.491629385641491723e-01,2.643070000447145684e+00,1.066322224763716076e-01,-2.316849148302681516e-01,-5.864628013360811964e-01,-7.576602890225736520e-01,1.441053340883911238e+00,1.010338752020214503e+00,1.161404620635777762e+00,1.356077578995167787e+00,1.245934314197723713e+00,4.516170986806381515e-01,1.521679465378307783e-01,3.927751068640801257e-01,4.837801463352943143e-01,7.150775136039242419e-01,2.708145593254866590e+00,1.164336110280830838e-01,4.992080788242760914e-01,4.678170962342582673e-01,4.624078813246125463e+00,1.687580177982887175e+00,8.743669132635597530e-01,-5.188704010626852270e-01,-6.104618002157035095e-01,1.314816780399186369e+00,1.240686617129667657e-01,-5.413983988925535895e-01,-2.823629242808817219e-01,1.613816644344959972e+00,1.035951943907134076e+00,-6.788887541584712748e-01,-7.532045608682241822e-01,2.991811307538423392e-01,4.074211783456761493e-01,-2.497125405259901232e-01,-3.072467038927888527e-01,1.506239464154147001e+00,-6.467478205806794778e-01,-3.844936761671675640e-01,3.058711954623838825e+00,-2.431173060479299708e-01,2.240694527985500617e-01,8.213204364345284558e-01,2.194541127500700961e-01,1.289840842251339215e+00,1.437732471027109438e-01,2.728056573717268507e-01,-4.721221511156430406e-01,-7.269627240019027603e-01,1.201539157607580677e-01,1.852851659288838881e-01,-3.051145337815580616e-01,1.303923816580214057e+00,3.123389914915287724e-01,-8.586356446821072907e-01,-9.184760490351207007e-02,2.219557849732421317e+00,9.667979969050818356e-01,-9.110469539140486628e-01,2.167650214857250290e+00,-2.078253881948578519e-01,1.357815020333083655e+00,5.681652544606550226e-01,-2.032901532316171989e-01,-3.984950394101513527e-01
7.320944358617571535e-01,2.556700252235657445e-01,-4.937603261273721955e-01,-2.420856453547599041e-01,-2.506756676689671504e-01,8.418484907927474836e-01,1.140753757764756626e+00,-6.858525315587168936e-02,1.473526238937428179e-01,2.724334104626722763e-01,9.402966411825728343e-01,-1.323607024871977789e-01,-3.230827759868561966e-01,1.104160427293677110e-01,-5.925291365372689079e-01,1.673447523210236598e+00,-2.737630604823208524e-01,-7.355006230497843633e-01,1.443762463824975750e-01,-6.571917981309091661e-02,-4.424148670982681608e-01,5.145004695851571608e-01,-5.206560028254622052e-01,2.849695944697415162e-01,1.644296381877209612e+00,-2.602034901798698230e-01,-1.311701172367479851e-02,-6.908607065191397778e-01,-1.032170222173327101e+00,-1.144681833460970743e+00,5.504626853981344770e-01,2.356114510659964800e+00,1.180960576895873082e-01,3.936900937691804603e-01,-7.038423930543409313e-01,-8.218945724067059366e-01,1.579571062391274650e+00,6.987779379141398906e-01,2.154250646213418108e+00,8.617042922155340179e-01,8.097776658316672149e-01,3.621241932765205673e-01,-2.227422983691577651e-01,1.976708434221851052e-01,2.161305562314504991e-01,8.011429458406770232e-01,1.967500753161787408e+00,1.071731897813167356e-01,4.194859464340441324e-01,-7.791837208686669403e-02,4.690749834941832397e+00,2.314428854659842383e+00,5.508456984086963493e-01,-5.219414240978126340e-01,-4.179795147517340603e-01,1.487416867893261996e+00,3.264274157990649794e-01,-1.847916069427159580e-01,-7.133635585739169782e-01,2.175423036727947235e+00,2.032040143998425363e-01,-9.748480610681110603e-01,-3.578047825258213743e-01,2.088686657074401154e-02,6.188602981758037913e-01,-1.058935138416332578e-01,-8.669471384535260006e-01,6.572185927926199600e-01,-5.078600722212260887e-01,7.775837263803915267e-01,2.424845541944739669e+00,1.159775554495035554e-01,1.581768945606215615e-01,5.776331092073107021e-01,1.078184906293889606e-01,8.505900842604696699e-01,-7.726582760963918162e-01,4.020941533346332197e-01,-8.091319342977481011e-01,-9.155408062236300992e-01,8.221492095338659434e-01,2.594722227493585498e-01,-4.090741073456519716e-01,1.722684487334191106e+00,7.872783916835311979e-01,-1.378792488024131790e+00,7.805744511555984255e-02,1.021423191302185396e+00,1.034577921280375179e+00,-8.659977176163615731e-01,1.533985826226463178e+00,-3.471964033659125093e-02,6.953607944160139498e-01,3.886784302035387051e-01,7.355475457014921947e-02,-7.886580189648252359e-01
8.241461405244316918e-01,6.470464296065798759e-01,3.796674524661186045e-01,-5.512100145620403291e-01,-1.615163047925528006e-01,9.183304239347711562e-03,-7.173379433448752174e-01,6.911022606424285786e-02,1.809102330312865936e+00,8.251161288057032861e-01,6.958988952097471259e-01,3.608402223288069144e-01,-4.899454835277223808e-01,-2.152303999510150057e-01,-1.198938760839282636e-01,2.069741949519899205e+00,-4.777262225380284333e-01,7.490523767120872423e-01,1.135973696897101259e-01,4.589719040465908284e-01,-1.120545229222191130e+00,6.213171932605956460e-01,-1.189338013453967724e-01,1.428742629123040120e-01,1.312650193470908055e+00,-9.233369163510203315e-01,4.942591577714012807e-01,-6.362331347045441232e-01,8.693675459037475406e-02,-3.662598307591220514e-01,2.342585160706917025e-01,2.770952597067059209e+00,-5.511164475051892886e-01,-5.940267073843126244e-01,-3.482851218378494318e-01,-5.744774824829896875e-01,9.863738311170329176e-01,1.598099065958301868e+00,1.502800403618768987e+00,2.460536232691161729e+00,8.124814667143973601e-01,2.722569251025856452e-01,5.046904007084069832e-01,-4.755458991221843401e-02,4.068472688265593051e-01,5.392357636599303117e-01,3.314278077812306655e+00,-5.300573188438344463e-01,-1.540309528764141622e-01,1.638091949168040351e+00,3.402387810646226640e+00,9.515315820328081875e-01,5.314904922353596017e-01,-5.612385680048324055e-01,-1.227770510364290635e+00,1.931214073963002154e+00,1.200569253535076708e+00,-1.044376642023450014e-01,-3.467809500099521269e-01,1.737866715841907883e+00,1.529405057614048102e+00,1.223571558105920332e-01,-4.023152164008151344e-01,1.853585890040792883e+00,8.515724455082767097e-01,-1.085098199018658116e-01,-2.792110983177169548e-01,1.283898238101600864e+00,5.279164368819234676e-01,-9.123223337766792618e-01,2.834092155641180000e+00,-6.510358476865917288e-01,5.628804003763623331e-01,3.902597767924503858e-01,-4.216216379252283319e-01,1.578158291210228992e+00,5.692562474892617352e-01,1.334123710018482623e+00,-7.131558644311393191e-01,9.695452821839023461e-02,-9.965539867855488509e-02,5.826621103718090389e-01,4.862528672714006017e-02,1.191643212096918703e+00,9.728263230609267564e-01,-8.717019065189740568e-01,1.848314643851700911e-01,2.530192101994951592e+00,2.961158294728243323e-01,2.844870696121350462e-01,2.463486206030497172e+00,-3.461853992342227571e-01,8.921205452597109620e-01,1.758643187162819421e-01,1.362231610530974635e+00,1.511694050708412007e-01
6.757754579004510154e-01,-4.000669377453119901e-01,-7.192929332450777036e-01,1.055377061710857101e-01,-3.881529497843412835e-01,1.163560429385829265e+00,1.332569715570628421e+00,-3.986336942952474482e-02,-1.251824355333258643e-01,5.686976628539448519e-01,1.619571824821641748e+00,-1.811667588524747408e-01,-2.536506335218579045e-01,1.303955867498746701e-01,-6.728460934416647943e-01,2.116180477776746116e+00,-2.041317860415609864e-01,-9.185600715126324145e-01,3.720736066994072555e-01,-2.939364116765052354e-02,-3.932074884411256299e-01,7.341509671106496437e-01,-3.566580944318896162e-01,3.688383052976163534e-01,1.479376017033697588e+00,-9.059373223635935890e-01,1.063543976478842357e-03,-7.057497043248426305e-01,-4.412405954399756247e-01,-8.419207038005126487e-01,7.099839980438213960e-01,2.358639684713805362e+00,3.275364212912054707e-01,3.294891473199139664e-01,-5.543352001936917572e-01,-1.060820810330973085e+00,1.230308078306990183e+00,9.028665630930774455e-01,2.268049857336825070e+00,1.325821356185227229e+00,1.013498999921051524e+00,2.328975731410485306e-01,-2.518511198850976185e-01,2.695595843864069807e-01,-7.963136442353668798e-02,6.647035805070402592e-01,1.883638588325543761e+00,-1.008640416964096953e-01,5.320242703094516523e-01,-2.149677158402341082e-01,5.109771773596378353e+00,2.291701438248142875e+00,7.144487210682524125e-01,-7.997705718236349792e-01,-7.936263673603578539e-01,1.694055764095625527e+00,7.371020815806705873e-01,-1.795018805882994672e-01,-4.743089720182322999e-01,2.730846169524300926e+00,7.643594584483305310e-01,-1.488947606168724125e+00,-8.100506335372045230e-01,4.936832408020397356e-02,6.273114677297830788e-02,-6.931848431214131523e-01,-1.018405441219475183e+00,7.706338271172652465e-01,-7.411733725051038446e-01,6.886492893591678044e-01,2.901943225579446839e+00,3.491999658384756233e-01,4.451178395470802296e-01,1.088809687904601198e+00,6.625355963614452948e-02,1.263215257051063301e+00,-7.493064105382050144e-01,7.607021198284484864e-01,-3.148215124478044302e-01,-1.164760498315683623e+00,6.502267543989038723e-01,5.640720712182671903e-01,-3.199888465405991145e-01,1.513328626855234393e+00,8.474559314305012414e-01,-1.412059733017424046e+00,-1.283712317416101367e-01,1.632848596680150921e+00,9.870426894631737502e-01,-8.215683472881536442e-01,1.804470966637278240e+00,3.680409488940046270e-01,4.694506955923389846e-01,3.888146932763509311e-01,7.343806741476068822e-01,-8.862963089483879564e-01
6.324308274777237227e-01,7.093064010274207076e-01,4.254450841231818825e-02,-8.995002349831111577e-01,-2.259271424233404851e-02,7.822301152277597036e-02,2.785656029409183110e-01,-2.668671470282840685e-01,3.277194982862788875e-01,3.834926677179792964e-01,7.919052712668761540e-01,2.047786077490142964e-01,-3.470169812122123054e-01,-7.840683519051859507e-02,-5.824996017042077812e-01,1.654763511462278514e+00,-3.241516154735424315e-01,1.971304963902339447e-01,-9.915544510191259819e-02,-1.213530180426356658e-02,-5.426940536387057090e-01,5.052182365282236187e-01,-4.182653665336152349e-01,1.757920393227457023e-01,1.847443430419966948e+00,-8.044867953748362221e-03,3.905442048413217959e-01,-6.524304555825742868e-01,-1.124744621835266800e+00,-1.322608194722700414e+00,6.883913507661171272e-02,2.484057042650538172e+00,-4.907653228240107524e-01,1.664702588119363613e-01,-5.797676676735425971e-01,-5.448408361210100859e-01,1.347426160247911620e+00,1.070180528380128226e+00,2.394834738446689038e+00,1.472182243435824045e+00,3.292299881707802522e-01,3.193814935361302676e-01,2.798708772801681427e-02,-2.259478877976297539e-01,3.573347078206711158e-01,7.547378080433735370e-01,2.411594581387185965e+00,-3.306313967810837751e-01,-1.493195365578804945e-01,8.730806582280009609e-01,3.455918981409048296e+00,1.753184743006406254e+00,1.006213460070761734e-01,-4.139861533731704624e-01,-7.180537271214899597e-01,1.876074602791274248e+00,9.385653532611595296e-01,1.745962340564627124e-01,-8.078958879242185143e-01,1.928205470469414262e+00,3.414477173378852592e-01,-1.467961583211785381e-01,1.421166689497858904e-01,1.220546386938495598e+00,1.274610289288496734e+00,3.436999012904651263e-01,-7.979069909626861357e-01,4.640785349434471962e-01,5.034520094617128683e-01,4.859147701211937176e-01,1.914829118273777553e+00,-3.269815604379590068e-01,3.131814642791692638e-01,1.625707004551692203e-02,-3.948705731581684808e-01,8.912947229145302686e-01,-4.928655360171868005e-01,9.914353477083990285e-01,-1.231767980783865513e+00,-1.746834791513964258e-01,6.601463186980405240e-01,3.476267252481414216e-01,-1.750395954764625284e-01,1.804344942277974706e+00,1.220521390994828925e+00,-1.374607180059789213e+00,4.332046221242004114e-01,9.326322168428216042e-01,5.365689583739002844e-01,1.340299191669387935e-01,1.539426587446647510e+00,-3.498081753601363642e-01,3.840426109540929778e-01,1.100018348727557771e-01,9.626900901701911373e-01,-3.078404190813895380e-01
6.929295940464343939e-01,8.425958061998404247e-01,-3.004257456991654002e-02,-9.056118335535472408e-01,-6.489866177013188520e-02,5.956738695884761237e-02,1.265656989330735116e-01,-1.492613570319603067e-01,4.745351656207472124e-01,4.071375333792696116e-01,8.755746092870508868e-01,2.914470523798756707e-01,-3.252339319008052954e-01,-2.954680515387574091e-02,-6.174830806067683753e-01,1.840787865168062698e+00,-1.590683853683516613e-01,1.912622759537996875e-01,-1.209576965419358330e-01,-3.163859855472516552e-02,-5.064839122350968115e-01,5.918070318109285299e-01,-4.111877453956490069e-01,1.556611639243798417e-01,1.821414019448314381e+00,-1.043645554542607656e-01,3.514831372800528708e-01,-6.194545490642300312e-01,-9.667648278081997226e-01,-1.274568794064353527e+00,6.286738037120181977e-02,2.408781505788229360e+00,-5.056369799705684454e-01,1.043513995078120815e-01,-5.899861004197403114e-01,-5.878768793785430491e-01,1.372928920457630264e+00,1.081733625486254402e+00,2.340327286603160584e+00,1.517579410766044967e+00,3.710022695635478152e-01,2.435967462954083118e-01,7.697269953865978898e-02,-1.554787008131120474e-01,2.584159139789526938e-01,7.253709614391763427e-01,2.519157404525998789e+00,-3.073412583248320007e-01,-1.620717397069427745e-01,9.908625681192877455e-01,3.534765233173013943e+00,1.683166524326249247e+00,2.280529258154218586e-01,-4.410852582726166871e-01,-7.261831721631553105e-01,1.864439449627166567e+00,9.975616845912925745e-01,1.733315727751515156e-01,-9.079342768427749455e-01,1.973010213707332650e+00,3.559113972830352246e-01,-6.461058877346140261e-02,1.332074388689564182e-01,1.257537621267725614e+00,1.190837212907557285e+00,2.282232865879915695e-01,-7.710040163836788807e-01,3.787059543978042453e-01,5.387686625068435209e-01,3.852662565654898508e-01,2.072301267922530332e+00,-3.303789206876302509e-01,2.733583888635634507e-01,2.411585496096116388e-02,-3.948638087450858647e-01,9.240344207536965726e-01,-4.103761783499200178e-01,1.128512746335635919e+00,-1.192225496764642845e+00,-1.323637945352930390e-01,7.524385980086520931e-01,4.508549773968291152e-01,-1.430553254468300284e-01,1.672148702027764777e+00,1.305593792483178639e+00,-1.343853968013756006e+00,3.936403186002198074e-01,9.842864608890120603e-01,4.971013762695176696e-01,8.805256233683339540e-02,1.663019595971791054e+00,-3.592264286370568382e-01,4.456388852341705009e-01,5.095688851931859387e-02,1.071126683597456442e+00,-2.809976485550583769e-01
8.104090314801545292e-01,4.112104507067561032e-01,-2.851596400240031248e-01,-5.259598568239010064e-02,-1.297564633681306812e-01,8.089538965460876252e-01,1.095992717795276405e+00,-9.390742927156006670e-02,4.391384723008057156e-01,1.474531184755933921e-01,4.641124846403575921e-01,-2.787132313068695910e-01,-4.326048240300360281e-01,1.632835862602648458e-01,-2.678671053309686911e-01,1.335415379708661865e+00,-5.297696178613803264e-01,-7.648394140912569972e-01,2.486950150072424481e-01,1.075904824852172981e-01,-7.079125628581941498e-01,1.568913141377498432e-01,-5.993048208548361622e-01,3.446749561505599302e-01,1.427407728760052397e+00,-1.790426699359723428e-01,-1.644810540032667912e-02,-7.031366428140127800e-01,-8.863775894623806550e-01,-8.428689195104419607e-01,6.934316226101191472e-01,2.397004686300503451e+00,2.152603060476114272e-01,2.082487057154644716e-01,-7.366112830052758964e-01,-7.849688307336009085e-01,1.573174359800621591e+00,7.014336277057389157e-01,1.610790807894168619e+00,6.036493611344677657e-01,9.252478270785867709e-01,4.715579811256719323e-01,-2.237770410397083021e-01,3.244703937802842497e-01,4.912374301750861427e-01,9.100658900162383880e-01,2.063054250224721997e+00,2.319403130688206804e-01,5.348934215467516795e-01,4.881260302192702571e-02,4.647444533096788177e+00,2.073451185384002304e+00,5.158732632714331245e-01,-4.587220553581028981e-01,-2.357296259772555247e-01,1.190160718570878018e+00,-1.805075840034301438e-01,-3.469044905763278841e-01,-4.735768325612337848e-01,1.437764043682746795e+00,4.198709216628684349e-01,-9.263868991000738795e-01,-4.622991119084191025e-01,-1.871149914533137837e-01,5.743031114918503155e-01,-3.370132390422758695e-02,-6.553435115511312414e-01,1.002181013732956982e+00,-8.137256885641960258e-01,5.966922076321892199e-01,2.470386585336296736e+00,-7.476411238186730923e-02,5.395565040157228320e-02,7.783311901269795996e-01,2.201840442966825351e-01,1.001432806030925216e+00,-5.006614142468724937e-01,-3.572038508884523011e-02,-6.242759373104459497e-01,-9.862535017847924301e-01,4.887243639736843503e-01,-1.001513512603880163e-01,-3.955663230298076538e-01,1.648902998670455089e+00,3.303079624717728535e-01,-1.067503894471669934e+00,1.020413623292353300e-01,1.203130037146918019e+00,1.107527623161447483e+00,-8.679123255914357182e-01,1.462428021630628017e+00,-2.921210267711192299e-01,1.034418958022073509e+00,5.598113969982594362e-01,-4.532048593610774057e-01,-6.411104751771971033e-01
1.080162739023848628e+00,1.581297074851489404e+00,-7.092448739684287240e-02,-8.123117334910546772e-01,-4.063184796985273017e-01,2.241708942721297171e-01,-4.022752318482027412e-01,5.114913689598299396e-01,2.379907953853829472e+00,2.628608829694781823e-01,-4.873743614795356116e-02,4.052944691115827336e-01,-4.792510223013696224e-01,-1.191655990323645248e-01,-3.758956300031063846e-01,1.781616126704449909e+00,-6.821456483290372352e-02,1.877604898556834434e-01,-3.000229248083764455e-01,1.168267514083633218e-01,-8.025190628290144179e-01,7.947220894510113043e-01,-4.545836090512129224e-01,-6.884036392416656436e-02,1.674679012269967293e+00,-4.890199787046686092e-02,-9.305635789732438767e-02,-5.991414215865209503e-01,-1.136448599303678142e+00,-1.134386551013422784e+00,2.626434751884254570e-01,2.560463122050333329e+00,-4.815138590308474242e-01,-6.597630572258031401e-02,-7.950534226852172814e-01,-4.170652790823295986e-01,2.167305407058987665e+00,7.089985808425443015e-01,1.510966323689127755e+00,1.193637464551013050e+00,9.131335445870143452e-01,4.158136090093380033e-01,4.353356507199531711e-01,2.240664899618765582e-01,4.596479513708262576e-01,6.799005719235663436e-01,3.133632709640780778e+00,3.656691129688854347e-01,1.114508244440235718e-01,7.931263086818183261e-01,4.100798681213147390e+00,1.917330326395509044e+00,1.016097368930104050e+00,-1.402758853795205152e-01,-3.036564761863459472e-01,1.384493352052933890e+00,2.912861992175730386e-01,-4.212795126408201973e-01,-1.215247225041709900e+00,1.895458142273484192e+00,-1.704869413421709334e-01,4.264906750374848343e-01,1.287676430094882307e-01,7.280806870647946738e-01,1.330489929490650702e+00,4.968610872771226927e-01,-1.534001381402354536e-01,8.381948988746384943e-01,3.471921811039994088e-01,-4.851305716575552429e-01,2.588791465585477791e+00,-4.309216394105070957e-01,-1.835288485693343241e-01,-4.547241148770533314e-01,1.785981853028778543e-01,3.780919258990961263e-01,3.864499495425083309e-02,5.510667068665597856e-01,-1.605146680272466764e+00,-5.234215572806510952e-03,1.007785357058657461e+00,4.441196355689748798e-01,-4.476679935066617544e-01,1.482554255608041771e+00,1.016828191959397554e+00,-1.165640079710972721e+00,9.320340422115375167e-02,1.244735795693172609e+00,8.776698826468383174e-01,-1.211636198885081450e+00,2.256819032072100661e+00,-5.334260196982851809e-01,1.537304797468937778e+00,2.330886102805301008e-01,-5.006996617950350004e-01,-3.493581435336383101e-01
1.200410617726571427e+00,2.460848418477853183e+00,-2.732514896012386285e-01,-8.459207143803711970e-01,4.344666980706983483e-02,-8.964797794667705988e-02,-1.488071116979336472e-01,3.755042884959846616e-01,1.229180958118155420e+00,-2.835130918016167678e-01,-5.376183932994926806e-02,3.615328718275750419e-01,-3.728274594817621024e-01,5.282310238108197664e-01,-4.013496137126207342e-01,1.678056783634679805e+00,4.178577392339130614e-01,-4.363263714558032191e-01,-2.930053921173264020e-01,-1.523592024842507220e-01,-4.590621869367880747e-01,1.410379537305954667e-01,-9.012023903915130640e-01,1.379053244029496972e-01,1.624305283173652636e+00,5.143152349622632791e-01,-1.275563415336817552e-01,-4.464623549509768585e-01,-9.258085787787351251e-01,-1.163401437976828712e+00,2.466173999291077501e-01,1.782101219127100622e+00,-3.255738820749842777e-01,-4.557013701458770272e-02,-1.046721946378227130e+00,-6.565614979406670937e-01,2.142861879000489189e+00,5.090962498405576797e-01,1.261621832180229497e+00,1.284474635154797539e-02,5.577864711438835776e-01,1.464580420045879516e-01,1.473557268978841622e-02,5.280386501778903119e-01,3.733590898860263962e-01,1.038064222939875325e+00,2.732580915665353771e+00,5.652874276077853866e-01,1.036322396639133003e-01,1.286702072745159686e+00,4.057549249076760844e+00,1.478628860070233308e+00,7.067353818484948258e-01,-1.839025069386935329e-01,3.622063250684062208e-01,8.218928999413200875e-01,-4.203819888211487443e-01,-1.230087197307848795e-01,-1.520927361241620979e+00,4.620667965516711551e-01,-4.102931756648073858e-01,5.366526464563333709e-01,4.275942500596322526e-01,2.008043864294385972e-01,1.089993647110669928e+00,2.867144121723637640e-01,-3.898920398744628590e-01,-9.829767936746058865e-03,-4.221261868225543307e-02,4.551325746401280181e-01,2.340851312157942843e+00,-5.817186937565437255e-01,-6.618073762728666765e-01,1.636673484529477252e-03,7.084641453065963768e-02,6.255895788024252724e-01,-1.298173663448519144e-01,3.509473827141755264e-01,-1.174187140002421081e+00,-2.320615014078509786e-01,1.348714373524919186e+00,-8.415348894960331116e-02,-2.178366502971426366e-01,1.228236817698360461e+00,8.550804571717547375e-01,-8.026448165596365980e-01,4.046545205542592116e-01,1.561746390565144083e-01,7.718215046165763926e-01,-7.025565856978445156e-01,1.467478890326551211e+00,-1.191306753887209968e+00,1.518420527116770558e+00,8.622272466774230648e-02,-4.802705837237892239e-01,-1.887815239346546936e-01
8.003546323984740418e-01,7.526902861330762029e-01,2.072387640230350381e-01,-6.611374977391425434e-01,-2.200356810846018085e-01,2.381935990277943005e-01,-6.672559609939743286e-02,2.732378565352469590e-02,1.594249274681643236e+00,4.729770602268610347e-01,2.437778349624541985e-01,1.732649135974982380e-01,-5.017607431415340713e-01,-2.552438623998595779e-01,-2.572497935734400776e-01,1.545907851482261730e+00,-5.797030969778051990e-01,3.609977350316979638e-01,-5.223935214197601012e-02,2.649041629037124368e-01,-9.476931930149351535e-01,5.669584562455172172e-01,-3.191814125186455131e-01,8.577309222795354016e-02,1.603715067972560915e+00,-2.501108247070883972e-01,2.451826362913162305e-01,-6.929450435716210110e-01,-9.667175481762293465e-01,-9.531070950678417475e-01,2.712539055953793743e-01,2.791797861330187036e+00,-4.380976861019429958e-01,-8.988860981842902720e-02,-5.697591799840232563e-01,-4.325969617976860859e-01,1.562208233357984533e+00,1.059948280573680179e+00,1.757570096661459358e+00,1.647140274646396119e+00,7.611376232733824132e-01,4.986950487670390175e-01,3.042261594112799505e-01,-6.177282095966203646e-02,5.880150170940401377e-01,6.757767447236833203e-01,2.865235207016659569e+00,-1.036963201826359982e-01,3.996262918794442343e-02,7.970993826877605937e-01,3.701108670448537197e+00,1.731998512125127787e+00,5.071553695845275600e-01,-3.038956952061758199e-01,-7.176391756470386074e-01,1.694414583337615854e+00,6.278501281891837316e-01,-2.445920138978356639e-01,-6.199405127824837436e-01,1.873515975509021381e+00,5.236101750379514863e-01,-1.347186614994877463e-02,-1.106830914546324818e-01,1.091376235639250458e+00,1.247856667366239902e+00,4.222321837907910269e-01,-3.554552634343970396e-01,1.152388921002837296e+00,3.137924288590651645e-01,-3.204483118651502149e-01,2.340613856784411251e+00,-4.385732235276304514e-01,2.657676363300210953e-01,-5.058166985691778250e-02,-9.473747680036595509e-02,8.359004783108546777e-01,-2.215919054462883730e-02,6.377969515179040538e-01,-1.267799123284384599e+00,-1.246567461850379144e-01,3.697264607458561891e-01,3.204979440145604985e-01,-3.067400071613251011e-01,1.674165791889303589e+00,8.596393196254404900e-01,-1.171842182165904189e+00,2.075818520455212646e-01,1.643459691469149497e+00,7.220540711925621524e-01,-4.569480154761205171e-01,2.033082251705936816e+00,-3.470891274515687241e-01,1.011930658726064358e+00,3.269862448702443025e-01,1.784645956551970947e-01,-2.574321547379083697e-01
1.057778596409040484e+00,1.487484808899225630e+00,-1.864116985267810223e-01,-3.822999195046790089e-01,2.763331781620335936e-02,1.181930966683081841e-01,-1.295274952015495473e-01,2.128322992408923087e-01,9.596705053862431001e-01,1.960161235618750886e-01,6.442243371365778959e-01,2.461766548683345657e-01,-3.681033989244283933e-01,4.561901566871316982e-01,-2.524904768676330957e-01,2.036978843173300913e+00,1.600846035997389172e-01,-3.181468013093520786e-01,9.978804830488718913e-02,9.967448387360318407e-02,-6.694795635005285073e-01,1.889198213871955134e-01,-6.146779965177651128e-01,2.953937336902727750e-01,1.278220278693911638e+00,-3.895627369350894154e-01,1.244102378804902154e-01,-4.969188759602892747e-01,6.311825687280592234e-02,-5.076198106844685976e-01,4.198636513736496156e-01,1.965746971949746680e+00,-1.569084596413301558e-01,-3.636401681151152920e-01,-7.293481565466620742e-01,-8.792823214085423444e-01,1.377648001407579592e+00,1.051348310987500145e+00,1.204918161253886844e+00,9.258859854614860385e-01,7.562384584711436819e-01,5.328005939026198012e-02,5.051530118311609724e-02,4.846156030974688167e-01,2.165261317599548874e-01,8.735384220183111115e-01,2.788321230787419669e+00,5.464748932310022067e-02,1.344299710729883746e-01,1.484170048366840078e+00,4.113370960958307343e+00,1.048689478145580889e+00,6.530598730755040604e-01,-5.558462481733588145e-01,-3.219483419033602467e-01,1.168824569474708142e+00,1.767036734643300799e-01,-7.534877615029519915e-02,-8.528288817907150321e-01,7.530727193272335196e-01,8.285426377999955960e-01,-2.314253786298420268e-02,-2.259889669704936710e-01,6.460255574611482032e-01,4.511692196328962456e-01,-3.880599845580660068e-01,-4.782491495960534689e-01,4.696229832781189661e-01,-2.370924180139913906e-01,7.537558936124594267e-02,2.857158008808191152e+00,-5.207141932268810613e-01,-1.080128267467670850e-01,7.893518114939197527e-01,-1.540578279678659901e-01,1.470514382829489097e+00,1.948702021607146562e-01,8.175627482124342427e-01,-3.893653164006354306e-01,-4.096595275838132988e-01,6.092544841138216594e-01,1.438767989378930967e-01,3.182093424536441839e-02,9.546409856093435176e-01,7.399489397496644694e-01,-6.496982435727277627e-01,2.506172161184264113e-01,1.337460283753358015e+00,5.414730010487395218e-01,-1.158252844859522512e-01,1.811554955733939654e+00,-7.991598890746107742e-01,1.178604941926446159e+00,1.428471187659838271e-01,6.219303725282505635e-01,-4.304006633603868481e-02
6.889445904391878761e-01,7.994437891979234712e-01,7.482256678495294300e-03,-5.088686345567909886e-01,2.624417143375298855e-01,1.291611430548756934e-01,6.601121679218189264e-01,-4.267618248950932891e-01,-3.259589416326369449e-01,1.304032671032439028e-01,7.188663755432846969e-01,-6.158165486975403224e-02,-3.592839135991243160e-01,2.980868772706261050e-01,-3.374279005829075029e-01,1.420240961863600937e+00,-3.707951380570316258e-01,-3.200063337960994958e-01,1.584188927125038393e-01,2.549810359314471850e-02,-5.802176624024093510e-01,-9.243807499850809073e-02,-6.414515187184542944e-01,4.092229036550586452e-01,1.547214625729898874e+00,4.939284998595709630e-02,3.846495232156004196e-01,-6.182713446747976072e-01,-6.630637608184670739e-01,-9.309490153394837098e-01,3.089601990441256940e-01,2.155416077497622318e+00,-1.539397454787892472e-01,4.407971138504866715e-02,-6.549954404132625196e-01,-7.629471956182872772e-01,1.118855771660963061e+00,1.052862994533116048e+00,1.890811954511131932e+00,8.155449219335951794e-01,3.513854288183789754e-01,2.563276324916854421e-01,-2.693800742644189561e-01,5.659295324100166447e-02,4.450085848068015548e-01,9.869096818636056145e-01,2.117459545746635641e+00,-2.304030240353209247e-01,5.479244336452977759e-02,1.016437187751674909e+00,3.649979197623672622e+00,1.387151928254832356e+00,-7.489904798380475626e-02,-5.298215389072162829e-01,-3.991826344456972375e-01,1.426117340045376602e+00,2.782560943100582662e-01,1.784766714336959714e-01,-5.418496994006141154e-01,8.295340519035034887e-01,7.055695093851693800e-01,-4.601376316033281011e-01,-7.302937150977724390e-02,6.754618630761217712e-01,8.114279006061613231e-01,1.617863676388464622e-02,-8.571796489030883981e-01,4.502942401620589341e-01,-1.915070013075958477e-01,8.810062344668925238e-01,2.003435556896366432e+00,-4.065518526641483943e-01,1.569556550498061309e-01,7.577703371753166106e-01,-3.508092667080831561e-01,1.365139017436838298e+00,-4.188659424688120358e-01,5.735878613522169545e-01,-5.607497056188865958e-01,-5.797313740191252229e-01,3.932376328276500077e-01,-1.540377733004127392e-01,-2.764254442006847112e-02,1.583268497882451387e+00,6.837315582579199802e-01,-9.572470644294638342e-01,5.111001016326208735e-01,8.245663854995627373e-01,5.755767274426556446e-01,4.087474890608349676e-01,1.113372536598488338e+00,-6.625724227914293607e-01,5.022598967647016188e-01,2.415117708081148673e-01,7.680054654416148541e-01,-2.020026462542116596e-01
5.297689555451219334e-01,4.695467329158351522e-01,3.235442500722838233e-01,-6.558336609440510445e-01,2.919314170883273718e-01,2.522076420663479923e-02,6.069252024762685771e-01,-6.482734979353144134e-01,-2.653666033280812631e-01,2.686162777246379196e-01,5.766005467680497265e-01,-1.013302686704473932e-01,-4.244633003443345487e-01,1.698416009915445363e-02,-2.670981337081622664e-01,1.156078231592861716e+00,-7.709930291540978420e-01,9.720057118404570873e-02,1.408000890452475173e-01,1.432704864627356300e-01,-7.525422257130915948e-01,-8.355537106378840839e-02,-5.102881769356846231e-01,3.711963365730165387e-01,1.642825603117728184e+00,1.075012034703078101e-01,5.798282902735271138e-01,-6.972478351207321845e-01,-9.473262676072413679e-01,-1.023505021104666346e+00,1.943105936791528210e-01,2.496162035867666606e+00,-3.287691375615426903e-01,6.226835834266117309e-02,-5.326651374829486363e-01,-5.719950544063009401e-01,9.840208360460469539e-01,1.207739858079321493e+00,2.101821087133077803e+00,1.221782160409947249e+00,2.379197339853804105e-01,4.225747118354012399e-01,-1.814641184304345289e-01,-2.466963497850084841e-01,6.553462139294510269e-01,9.326360128652172454e-01,2.161395325645005805e+00,-4.590186890178276635e-01,-8.150325401203402376e-02,9.905024174715748586e-01,3.189063837557414516e+00,1.423147644033905479e+00,-3.388850348195255879e-01,-4.629135387195838502e-01,-6.517087769510117035e-01,1.697389959203625898e+00,5.440497988031181009e-01,2.167689622849466591e-01,-3.093502654051365486e-01,1.027140395333926648e+00,8.296846969728237653e-01,-4.102821050731535468e-01,-1.468043610969777674e-02,1.091984870951744124e+00,1.156142761835082799e+00,3.452378823538624353e-01,-8.325341015266680689e-01,7.450351131147123773e-01,1.155513978097771344e-01,7.328972068680510432e-01,1.685609274142163327e+00,-4.878670279501883256e-01,3.975867181115449456e-01,5.191563498403874988e-01,-4.779787590910863915e-01,1.305186020084197374e+00,-4.217450267556867582e-01,5.857597144367518993e-01,-8.058148175402548574e-01,-3.965909076756445328e-01,9.047013488043842422e-02,-1.648562735733430373e-01,-5.424987569512337848e-02,1.864489714415456412e+00,7.012965838126347107e-01,-1.081815035517589507e+00,5.972014427981829909e-01,1.014127081637267613e+00,5.127666873986430618e-01,6.746681279929753750e-01,1.109554549717117977e+00,-5.688948961896332923e-01,3.035500797114604188e-01,2.934558974931058550e-01,8.893690502344246962e-01,-1.406338133442441851e-01
5.299158575234785840e-01,6.912758861300961621e-01,3.971970558747356383e-01,-9.754974654557923008e-01,1.793928288656310155e-01,-5.406111058573170869e-02,4.748575070313843516e-01,-5.713482660466442375e-01,1.893374715369529060e-01,2.096408258322345342e-01,2.228589352435642879e-01,-1.131427275472968175e-03,-4.580820424122629686e-01,-1.917879417537418085e-01,-3.606940792655441985e-01,9.809813718526094739e-01,-8.168416256203385739e-01,3.366893680917370513e-01,-9.793299858185039453e-02,8.970651964541551115e-02,-7.444378074338691142e-01,1.126381805124250235e-01,-5.008644050825122873e-01,2.104178671760092434e-01,1.892612564159923627e+00,4.475249086458634729e-01,5.122102247231764549e-01,-7.238468897798880919e-01,-1.605181564733825450e+00,-1.423399732780151528e+00,4.476349345849725547e-02,2.679510912593294769e+00,-5.366881060040119555e-01,2.370151990663105779e-01,-5.994575560062874731e-01,-3.410318639205768276e-01,1.362890394779931791e+00,1.021901732748190517e+00,2.310377953945344842e+00,1.197994834720821355e+00,1.729107909445770086e-01,5.635142064051097410e-01,-5.368983039527795709e-02,-3.992275390587352035e-01,7.792653131767750541e-01,8.964854104188851869e-01,2.265228240925456937e+00,-3.203420988818479476e-01,-1.630136188110187234e-01,7.800991721730006212e-01,3.026869083898686696e+00,1.777023847328519368e+00,-2.917671879831675863e-01,-2.412729125114379258e-01,-5.537832698699685086e-01,1.770800694487175031e+00,5.589761184556973905e-01,1.514123397254256431e-01,-5.689395393049058169e-01,1.373137715447427354e+00,2.427407161156499016e-01,-9.436683919814602139e-02,2.987731647785932809e-01,1.163201142561243628e+00,1.665912250377860060e+00,8.394282710811946657e-01,-7.337214782047436490e-01,7.322859502858434233e-01,4.702167375119351567e-01,6.497118327322178866e-01,1.390154139022863555e+00,-4.963531977303313747e-01,2.985728913733494694e-01,-1.227576232296007930e-01,-3.897074024390485558e-01,7.608167522603448418e-01,-5.622957309869535125e-01,4.731300989209555885e-01,-1.431138439308775823e+00,-1.583554809486401593e-01,3.618368627842822316e-01,-9.787937463755980172e-02,-2.452824662532517852e-01,2.144287332941905433e+00,8.828297780834379882e-01,-1.320083196605868814e+00,6.243157236636520668e-01,6.983067621465532948e-01,6.194402799494632683e-01,3.212062567154347348e-01,1.153771911163548491e+00,-5.668795154444772333e-01,4.015363468249326107e-01,2.805178430469827955e-01,4.213616391872664901e-01,-2.421033358588196571e-01
9.434496489226686933e-01,6.049081142534804556e-01,-7.201167817198446119e-01,-4.787223760346337453e-02,-3.000421378819750906e-01,8.317992557630045081e-01,7.529360168150047716e-01,2.573137497351969949e-01,4.416925343110616464e-01,3.282910636507310742e-01,1.245124343904525865e+00,4.142965505795603853e-02,-2.653298206967485973e-01,3.859699214423874536e-01,-5.779684143078585024e-01,2.241574626169506868e+00,2.024143373136834678e-01,-9.104161174161605752e-01,2.194171903006288948e-01,-6.470593096586682580e-02,-3.914447551673424508e-01,5.930977816434750416e-01,-5.334574279648308659e-01,3.176449610745712970e-01,1.389239852383235885e+00,-6.902558104588252252e-01,-1.175792512003911161e-01,-5.788206499537258409e-01,-2.035696365509824801e-01,-7.346510533700595369e-01,6.509250560017980636e-01,2.033730987789115208e+00,2.131954195770962568e-01,8.439282982017642931e-02,-7.214878797290502632e-01,-1.063282326231149266e+00,1.492035333214847936e+00,8.038854130778447793e-01,1.744201760427620762e+00,9.086945342985455198e-01,1.006681384146566050e+00,8.852540819142967754e-02,-1.450097791895075816e-01,5.347521762538459678e-01,-8.285884022980205543e-02,7.615227480154701523e-01,2.254870685647446749e+00,1.648428773539986902e-01,4.643010556842140368e-01,3.895752316867840404e-01,5.036467022999668863e+00,1.888975546611967093e+00,9.235283705214674121e-01,-6.945904331561796319e-01,-4.212019311948035916e-01,1.322154581865438994e+00,3.436373273808677187e-01,-2.061879931670734245e-01,-8.466243174852627895e-01,1.957358706308977681e+00,5.594196379952744991e-01,-8.777180527181486225e-01,-5.648232731190057088e-01,2.934910174999028065e-03,9.265955264020697690e-02,-6.865426939276786378e-01,-7.822810018320193182e-01,4.776338378274386232e-01,-6.754232999533474890e-01,4.849427784575444100e-01,3.068591540518408323e+00,7.384272412938691632e-02,4.122823289884759018e-02,9.689036759174650681e-01,1.104208856332245942e-01,1.238813901969279208e+00,-3.986592903861420067e-01,7.445390763557302449e-01,-3.365299256035892972e-01,-9.386130159499229686e-01,9.118394846515032182e-01,4.464108668100051913e-01,-2.242177125927375392e-01,1.162638718829918538e+00,8.368385143507678370e-01,-1.092460626136696256e+00,-5.676900322250449937e-02,1.354016985690873032e+00,8.971065585323747538e-01,-8.722649053425453047e-01,1.864134610609165632e+00,-1.294163153040364667e-01,9.352346926797314719e-01,2.616264047621445488e-01,4.605243257368613063e-01,-6.361447919206901780e-01
7.876690683257550063e-01,1.142899595347507180e+00,7.593594282295944298e-02,-8.355312816722042513e-01,2.702130131907161392e-02,-1.609650324615913286e-02,3.498884586966638510e-02,-1.148925421807532599e-01,7.087848917207518751e-01,2.596849923801023419e-01,5.081279021455670231e-01,2.383588531104894881e-01,-3.882603493031825392e-01,5.835220547662111484e-02,-4.238017831898923671e-01,1.638301138156422976e+00,-2.257289116673628360e-01,1.431749977048332734e-01,-1.002289258316707149e-01,4.352660205463373955e-02,-6.401566783543090056e-01,3.451741720241902622e-01,-5.094828849704809981e-01,1.808219806277721331e-01,1.698170197329458508e+00,3.417066643635427448e-02,3.136565774202286772e-01,-6.030208690688605433e-01,-8.980635504051406315e-01,-1.118892047711395055e+00,1.335320099753396494e-01,2.357349927767914632e+00,-4.635551242372814018e-01,-1.697943700942894374e-02,-6.574447107488891051e-01,-5.630324116337612761e-01,1.450263989958149757e+00,1.030253381448859917e+00,1.944979461458825165e+00,1.222850672888960988e+00,4.232614248917316302e-01,2.867956726970186665e-01,7.622339142781014987e-02,-3.027180940741727722e-02,4.237831524730646948e-01,8.207065025047143303e-01,2.608548555424667903e+00,-1.594201423176833665e-01,-9.954582247553410423e-02,1.138542651912453074e+00,3.509052422448046382e+00,1.506614474121614311e+00,2.371729354397635325e-01,-3.710435956000701641e-01,-5.105763253543311730e-01,1.602105879483861628e+00,5.896752978680976920e-01,7.540258473494368396e-02,-8.630459474043089552e-01,1.387320363861301420e+00,3.774229995015262462e-01,7.288416121743701570e-02,1.442389211651983194e-01,1.078552087884652400e+00,1.191597073747808100e+00,2.990145883690148443e-01,-6.162702091651937053e-01,4.946536947316808042e-01,3.594151022702032905e-01,2.985646481279563003e-01,2.092796275559851260e+00,-4.819080532148053431e-01,1.124113311424633083e-01,9.789426709810672422e-02,-3.074634046737112492e-01,9.669117821071255836e-01,-2.284132086091877623e-01,8.329930864414480940e-01,-1.116132687681650193e+00,-1.462243521049391426e-01,6.452821362912390946e-01,1.981005913307248290e-01,-1.330294256773444650e-01,1.588885014612362534e+00,1.034918038894004688e+00,-1.117763058826875877e+00,4.296570924472222774e-01,9.605760180580994456e-01,5.432401959654717949e-01,4.803061634088179321e-02,1.591195941036543493e+00,-6.125468886943650215e-01,7.301465307647440062e-01,1.297669546768490945e-01,6.543491111634136548e-01,-1.699549043606390641e-01
1.005318116815063112e+00,1.381172898554028583e+00,-3.083785999798588362e-01,-4.287035306932027168e-01,-1.152852215763553040e-01,4.952693405905276292e-01,6.590988263467286723e-01,1.630714140620222741e-01,9.644424085533961355e-01,-1.323300972095408368e-01,6.119153552298084442e-03,-3.703018374299982263e-02,-4.323593964525287436e-01,2.719344669109405310e-01,-3.331639408520358780e-01,1.325054531844462424e+00,-1.652036616667687807e-01,-6.875806425788071330e-01,-5.494517109102526470e-02,-3.027293319773521202e-02,-6.014565552300773499e-01,1.730535300826229472e-01,-7.730192353850372511e-01,2.070019882948722634e-01,1.583725486587166609e+00,3.043681825927571083e-01,-1.689212668223923075e-01,-6.115733303085637562e-01,-1.228951710464210922e+00,-1.132433012467503497e+00,5.224340205600290776e-01,2.186434924721013751e+00,-2.889241868223146881e-03,2.155787513327174498e-01,-9.422529300396683682e-01,-6.550906882328535463e-01,2.058466858212872008e+00,4.442081917037007388e-01,1.454801011254298615e+00,1.393279185994397151e-01,8.102107664553263033e-01,4.244321999204255236e-01,-1.196783886464533458e-01,4.266457877709093349e-01,5.242371085569392797e-01,9.869125216187792926e-01,2.313897960730398662e+00,5.490517669472347873e-01,4.198532430917694125e-01,3.304668336602462064e-01,4.505034758189590427e+00,2.061322636684264520e+00,6.705406388636512283e-01,-2.308063920998143503e-01,1.810191065920403464e-01,9.409603606273696519e-01,-4.855690068005490412e-01,-3.555100773953528970e-01,-1.020885924235518383e+00,1.082373230169086487e+00,-2.620219868713670186e-01,-2.667720650884231048e-01,3.829724293529648133e-03,-2.442928206458675477e-01,9.488593530902311723e-01,3.037746872862729375e-01,-4.856941958926485614e-01,6.079240823009531836e-01,-5.266045615262623381e-01,5.704391625559721568e-01,2.323121104132325865e+00,-2.519155656066131010e-01,-3.656413217525595338e-01,2.412508229083008826e-01,3.003855576900295588e-01,5.666849702961764823e-01,-4.457756897924390338e-01,-1.114484864693706667e-01,-1.085168147239723435e+00,-6.852860374536502430e-01,9.964544591482933367e-01,-1.530565701537489609e-01,-4.536296103774727362e-01,1.596366029728783165e+00,5.040188695645212436e-01,-1.028912543897713361e+00,2.063666245556241008e-01,5.669085592713427602e-01,1.115456948086608335e+00,-1.133489554539392152e+00,1.430430342840247171e+00,-6.856078406342667186e-01,1.386646039322986690e+00,4.186492990862232810e-01,-9.493518102637612532e-01,-5.607632555501845806e-01
7.705534212378685188e-01,1.296544217682498612e+00,-9.779938247788286243e-02,-8.138473943384452181e-01,2.605210012921599927e-01,-1.710047526965416398e-01,1.592088154196575067e-01,-2.538569868517385197e-01,-2.557836410831859641e-01,1.648058814552030293e-01,1.010307252132196298e+00,2.677959087360465840e-01,-2.628867405491677189e-01,4.137999113232934678e-01,-5.467553873653808738e-01,1.895220987421357473e+00,1.274541929398342877e-01,-1.403834707821574046e-01,-1.302203707867254784e-02,-1.169524874838169248e-01,-3.712645417731504360e-01,1.284521543074138572e-01,-6.399620516650461610e-01,3.363486739465070263e-01,1.649949816998724117e+00,1.333198359995294013e-02,4.120824423931160885e-01,-5.125735837002669548e-01,-4.431079787877713061e-01,-1.040524532854858242e+00,8.839108223043823376e-02,1.907796973327612777e+00,-3.858323974282602542e-01,-5.487516125898692088e-02,-6.736203129956968017e-01,-8.084649809674868681e-01,1.129685448718582341e+00,1.134346567958399055e+00,2.042553266756190311e+00,9.867971478267467678e-01,1.877829771281125937e-01,1.300808659500735098e-02,-1.597379811887489343e-01,6.579921902434419934e-02,1.701534101485572270e-01,9.277422393053934568e-01,2.362622531434278361e+00,-3.156254186054676114e-01,-1.869060284047186493e-01,1.540530804546212496e+00,3.454547661945721160e+00,1.135854709072488866e+00,1.871928924377735948e-02,-5.702399031695422060e-01,-4.567398527056439894e-01,1.545145279158018026e+00,6.585399790827575206e-01,3.888147191762354460e-01,-9.361858598615351301e-01,9.327436930661275882e-01,6.045013491823755247e-01,-3.700137086505358996e-02,1.662406879204314791e-01,1.093460207529546757e+00,8.449159426442828247e-01,-1.160406377951286871e-01,-9.009492675584661603e-01,-5.759553249675908315e-02,2.522110172200091038e-01,8.189058826324476792e-01,2.093427403389863883e+00,-4.886375071160174999e-01,7.641277652621815408e-02,5.620921966820670024e-01,-5.511554091979051773e-01,1.383693465228867270e+00,-3.210362371050467512e-01,1.152398968969062576e+00,-6.497878096567064610e-01,-2.752701624840092620e-01,7.432460556129802942e-01,1.404802660243850143e-01,1.224857275659821942e-01,1.348454022236359240e+00,1.148782613464526481e+00,-9.764900225838215597e-01,5.770849436621854345e-01,6.257984188270229176e-01,3.147586271207052366e-01,6.618113188557139814e-01,1.263978113335443521e+00,-7.770446188269440890e-01,4.044358455203223013e-01,-5.108686346061525052e-02,1.421766535448308888e+00,-5.087428905666618872e-02
8.331327979000430206e-01,1.468923629280259213e+00,-4.558621517862748718e-01,-8.454202153665555386e-01,1.298837436122197153e-01,4.485916729624447874e-02,5.065254247645697427e-01,-9.779856084453456000e-02,-3.962067320132636183e-01,-2.323473061400563311e-02,1.034575253078865442e+00,2.622215066406900497e-01,-1.950161870415819676e-01,5.119611998462947344e-01,-7.789386029620450902e-01,1.937119497351072361e+00,4.054568702267011271e-01,-5.522404308668830142e-01,-1.312799652663672045e-01,-3.371339843104579903e-01,-9.944019754291932855e-02,2.786212898554321638e-01,-7.684300679290952951e-01,2.903151186239245063e-01,1.818676663942338845e+00,2.513269150840913846e-01,1.542379957503104693e-01,-4.941572957605799288e-01,-8.642263153204126080e-01,-1.388194833228699965e+00,1.301656452168483968e-01,1.734694922761477187e+00,-2.647022400287347144e-01,2.525377871454663747e-01,-8.407766807037307943e-01,-8.544740426202981354e-01,1.530016191065867837e+00,7.664508533794267553e-01,2.239650791072168801e+00,4.809869325510964799e-01,2.244176525838619818e-01,-1.717046697150892420e-03,-2.812651527457769030e-01,1.948676844671978214e-01,3.036473616880969173e-02,9.661925126895578586e-01,2.112951875776278854e+00,1.747280633200357092e-03,-4.038700826571038627e-02,1.052787629180720108e+00,3.931803487834743649e+00,1.629650973561527882e+00,2.276807276875971175e-01,-4.975200196780509843e-01,-1.384117177395590703e-01,1.389311596798643356e+00,4.221885263913601749e-01,3.239860583370508529e-01,-1.305731081746289490e+00,1.243461600439767167e+00,-6.397496768378854726e-02,-1.476991441726376308e-01,2.991274393667339160e-01,5.442298129664311368e-01,8.598865237364352598e-01,-6.763312585981201552e-02,-1.006538232548559897e+00,-3.841912650308855204e-01,8.689908959837064351e-02,1.201644207875476988e+00,2.058886102820390196e+00,-2.503671795538632283e-01,-1.699608104531462605e-01,3.744244243786464255e-01,-3.284494760751638931e-01,9.614008720158166987e-01,-6.993698757184378945e-01,9.625527460343090702e-01,-8.807801772882605240e-01,-4.580240831250910749e-01,1.288735338288377941e+00,1.868044080599465806e-01,-6.555351189975189286e-02,1.449600657485054622e+00,1.260983168430776402e+00,-1.185204205340630423e+00,4.982473147074827358e-01,5.978685666189187398e-02,5.560547559704530629e-01,5.684436892554484144e-02,1.140785977266582929e+00,-7.037272997594231638e-01,4.898415850004403382e-01,-6.190474323888117691e-02,9.126010584404657955e-01,-3.631384407326273545e-01
8.910968249146636877e-01,1.026700084272830438e+00,-7.121176352622954342e-02,-7.779144820804445581e-01,-2.639738268816005373e-01,3.808609943790597363e-02,-5.956235566023337924e-01,2.627097929818787980e-01,1.453064521502029027e+00,6.790146775277718927e-01,1.053999955359059104e+00,5.497777263439611595e-01,-3.338555911998339343e-01,-2.553792768778941069e-02,-5.342985425224217044e-01,2.444607116125987911e+00,1.272550800058808163e-01,4.214076881613716408e-01,-8.963900480707154284e-02,1.171175793393482989e-01,-6.591007971757004702e-01,9.061818520163411605e-01,-2.413711350331878003e-01,7.907322941681491080e-02,1.569402362960794051e+00,-7.283612589512088453e-01,2.957172075168055803e-01,-5.522970964946023464e-01,-1.728836718387618543e-01,-8.105205119415993531e-01,1.181830817580094284e-01,2.410393299095517250e+00,-5.661510500534286949e-01,-3.125943202588262748e-01,-5.049002084572655757e-01,-6.836616540939315367e-01,1.302347854808275862e+00,1.316404485538249958e+00,1.919590195735263904e+00,2.095884185008509260e+00,6.861634390474882217e-01,7.370458601263141230e-02,3.999214985593933513e-01,4.943133532254866125e-02,4.475256299890012501e-02,5.417978935052201184e-01,3.125737239881845042e+00,-3.426947921567064514e-01,-1.839401008382314240e-01,1.476159367282796619e+00,3.728123017330248867e+00,1.283622336458632773e+00,7.198506120857977031e-01,-5.596711516694270472e-01,-9.972154117204289347e-01,1.912608686277083692e+00,1.301529046284988222e+00,3.727337716307910220e-02,-9.421986111947160403e-01,2.167851358637344461e+00,8.461900191858380271e-01,1.927539403712588140e-01,-1.262808059946525507e-01,1.608688145404868930e+00,8.486970241285438643e-01,-1.999597834179933642e-01,-5.037186349393737439e-01,5.591260866877184599e-01,6.526160547538942813e-01,-4.404721988302418012e-01,2.809302807283601489e+00,-4.285759361224995012e-01,3.205270926115946772e-01,1.470821399322852774e-01,-3.885927166146967426e-01,1.228447241518233923e+00,1.749673504147171710e-01,1.592559189063912584e+00,-9.429046614476973565e-01,7.242405136933105503e-02,6.631593831283605356e-01,8.346702334804503298e-01,-1.228971354030727881e-02,1.164127685137986701e+00,1.429487258745697265e+00,-1.129796075144942735e+00,1.729800704637786679e-01,1.795914174347237768e+00,3.343640778531253299e-01,-2.791817785876876679e-02,2.365987094098024546e+00,-3.024157264255427080e-01,7.717594732608883401e-01,-4.627820086508610542e-02,1.468876767766985392e+00,-7.841213239570465898e-02
6.664070102258277117e-01,1.277970290775446438e-01,3.260245945274646284e-01,-4.408546011449968605e-01,-2.238545969754910936e-01,4.201461499588865500e-01,1.901390598844542867e-01,-1.639957449953992064e-01,1.412667941728498633e+00,6.400983601473253515e-01,3.502495322175719350e-01,-1.246389452028967559e-02,-5.437723858756978723e-01,-3.972228417356954977e-01,-1.455258931472345196e-01,1.402175426127372893e+00,-9.513304536563771396e-01,4.009367532514579446e-01,1.288546226516690818e-01,4.047908171299606228e-01,-1.104741129521316090e+00,5.149101808985770967e-01,-2.000744701758739308e-01,1.552626392130654620e-01,1.508575535939674639e+00,-4.850034255327799193e-01,3.564159351014195010e-01,-7.746646103403009853e-01,-8.725001011330024703e-01,-7.777527668233801261e-01,3.792413092743623926e-01,3.028809585929985282e+00,-3.287020849026555114e-01,-9.911314735390347463e-02,-4.358619461091622904e-01,-4.404210083263482289e-01,1.293966098635033202e+00,1.214916908353175229e+00,1.803297311149581361e+00,1.948655802403860271e+00,8.435553193854884446e-01,6.089554137968973269e-01,2.710187977280645866e-01,-1.698525836428517177e-01,6.836321252147282701e-01,6.340475043630510177e-01,2.743375009290373256e+00,-2.876912954874781825e-01,1.152488912167767554e-01,5.804583681855728372e-01,3.703195411511432056e+00,1.766329280771219423e+00,3.738136924242133063e-01,-3.895507435968936782e-01,-9.699096267279129213e-01,1.842295721548082632e+00,7.496789932150290658e-01,-2.898574494423044046e-01,-2.127731064512896619e-01,2.043111188870542883e+00,9.328545980496836254e-01,-3.842163848775341783e-01,-3.844422344024855942e-01,1.142622730942862930e+00,1.129367575167915305e+00,3.529434937112683746e-01,-3.959347637921978302e-01,1.542837954971685743e+00,1.532138798069450358e-01,-3.839259565652586303e-01,2.353781746441584222e+00,-3.724218268258311926e-01,5.371635548435449437e-01,2.004286170823731672e-01,-1.164682462977423838e-01,1.045355954158687428e+00,-2.520177458049288610e-02,5.593239986506370887e-01,-1.070599182905389135e+00,-2.772664122389081331e-01,-3.792026019785621482e-02,2.843496897040464488e-01,-3.096912896265430759e-01,1.786981994957671294e+00,6.698239043299474282e-01,-1.190551807461211808e+00,1.554680001754949747e-01,2.082960167187676070e+00,7.520707058052888971e-01,-3.250636226161858211e-01,2.049448876698043431e+00,-1.240706661306821834e-01,8.507434047274731181e-01,4.703818650117734812e-01,3.016698200926062334e-01,-2.938558928624311894e-01
8.263475705662715054e-01,1.300992898270207254e+00,-3.817202656160326169e-02,-8.176830387336279093e-01,-2.428469598232985138e-02,2.279725333993073144e-01,5.835611805211665670e-01,-9.766990115230231306e-02,7.518219016321885384e-01,-9.113060406309067552e-02,-8.113396604981476523e-02,2.032384199932953106e-02,-4.433797477880643267e-01,4.452369769469830679e-02,-4.179047504515951417e-01,1.087042601602298486e+00,-3.863643089670988906e-01,-2.495064236570907201e-01,-2.029955354938731416e-01,-5.523700213995786507e-02,-5.967486496821587938e-01,2.024711988641547111e-01,-7.105557194957808909e-01,1.421730801567659130e-01,1.849437340573444111e+00,6.107039808172382012e-01,4.593911855494381413e-02,-6.563378510520069264e-01,-1.742989200056397348e+00,-1.492901073108687360e+00,2.559544642921411928e-01,2.394229999361123351e+00,-2.971693414097541508e-01,3.490337365625960642e-01,-8.753898216382944852e-01,-4.365536376682044861e-01,2.003381338746408780e+00,5.296899773369410092e-01,1.910497890747265171e+00,3.998712335984627719e-01,4.885515452713508622e-01,5.284598253904184695e-01,-8.109304107998267785e-02,5.151111288181666609e-02,6.701537746350889613e-01,9.685132002473053614e-01,2.279303741478089673e+00,3.139721771572671627e-01,1.566615984016925811e-01,3.955387508033066934e-01,3.865971576746062510e+00,2.139244478027670038e+00,2.920413260960320057e-01,-1.199113193062480431e-01,2.278052858888635068e-02,1.250955449303426281e+00,-1.408893993443440795e-01,-1.613817954827966583e-01,-1.029571369560354777e+00,1.280767488959036360e+00,-4.426515534055055490e-01,-4.441808263104785048e-02,3.215714670076188497e-01,2.590425526634899667e-01,1.478862895774056385e+00,7.591037409388579071e-01,-5.714965577547768127e-01,5.444481149779494267e-01,4.171430020314607912e-03,6.896985598873388579e-01,1.763868895526541136e+00,-3.428629918844514624e-01,-2.109269172979499340e-01,-2.077479544407762335e-01,7.692840526282078428e-02,3.495424903955495211e-01,-6.226814339491945072e-01,2.914398415890728788e-02,-1.526556575883921463e+00,-3.926719633051224956e-01,9.590733724444214792e-01,-1.415409585299138850e-01,-4.649244675342653066e-01,1.952732053586258898e+00,7.450023742860635290e-01,-1.258819886814431355e+00,4.107617288785913034e-01,3.038544446523326892e-01,9.840658878331932646e-01,-7.345208880811024965e-01,1.252372580958029502e+00,-6.852426728646092702e-01,1.037833228262748264e+00,3.433812321048290706e-01,-6.786148098675823803e-01,-5.021244266235631581e-01
9.591072586474309603e-01,6.460533752644957994e-01,-3.802463469304293575e-01,-2.243082870228924608e-01,-3.788295975859907183e-01,5.764126901136819026e-01,1.431710417254467016e-02,3.594810253923683696e-01,1.321864126751193025e+00,6.116204573412968859e-01,1.115681134860693646e+00,2.583426509989226183e-01,-3.423144174603597323e-01,1.211142817620050743e-01,-4.436326866209133746e-01,2.397152537402277517e+00,6.695443669399187003e-02,-2.325443599956368013e-01,1.517642912280049716e-01,1.456904635255377445e-01,-6.722825291449688878e-01,8.072163878164453354e-01,-3.099073617409289216e-01,1.945371325338517421e-01,1.338250438880721482e+00,-9.642194527430401063e-01,4.805962450672590647e-02,-5.870639466173026566e-01,3.037057479288529649e-02,-5.448353317859142564e-01,5.057674584529205930e-01,2.340473574891000386e+00,-9.665161333293345591e-02,-2.297994637770278126e-01,-5.671113303322402599e-01,-8.942486044016797475e-01,1.369200745538889263e+00,1.116838955624091634e+00,1.616066957477850785e+00,1.683082282884151404e+00,1.055758676986236821e+00,1.192317022340879107e-01,2.145461127803433565e-01,3.683784552582651250e-01,2.215754983842688208e-03,5.929806555159280457e-01,2.826525925641865555e+00,-6.667614520504848430e-02,2.417136978974359640e-01,8.723383035154771425e-01,4.569367984438020613e+00,1.560141048724372537e+00,9.957927855508208470e-01,-6.609146048173265564e-01,-8.076926482169872745e-01,1.599846546425909066e+00,8.022616888840662375e-01,-2.365905373908593345e-01,-7.397181117372839676e-01,2.155186660233988860e+00,9.386170350481176650e-01,-4.390653297891344842e-01,-5.643821953888430443e-01,7.636211749859831421e-01,3.124324453332686380e-01,-5.659648902595825204e-01,-5.201475791619057931e-01,8.174313249999987097e-01,-1.561979672083222970e-01,-2.914705105862899215e-01,3.210634770161278961e+00,-1.641045213239895884e-01,2.445120885080449558e-01,6.858849793099524028e-01,-4.301576068308933520e-02,1.337604937890666257e+00,7.131610156549611501e-02,1.115700263934946257e+00,-5.080548226387029409e-01,-4.877301021115043600e-01,6.092077276950822462e-01,6.903343895319540291e-01,-1.392176294010886994e-01,1.065039006158498225e+00,9.946481051060065415e-01,-1.034404726522296869e+00,-7.281584226657494829e-02,2.004625026279762245e+00,6.707207793480617353e-01,-6.340673217736934042e-01,2.352224475653104996e+00,-1.162970463008788924e-01,1.021703860788107265e+00,1.960611184415302632e-01,8.459563416227404709e-01,-3.574487902751087298e-01
9.806194419244160798e-01,6.553253832677674584e-01,-2.743809073942560239e-01,-2.180449002838645289e-01,-4.102319843575782943e-01,5.580050132057714496e-01,-1.332207159124238482e-01,4.000169120748426899e-01,1.657733899035963354e+00,6.541039779399914211e-01,9.547469747756722747e-01,2.675965754343658798e-01,-3.891566488676087010e-01,3.947675724540543329e-02,-3.527968462567505625e-01,2.343876839526588540e+00,-3.841070824763287428e-02,-9.345243167913383497e-02,1.477591146008179201e-01,2.308643417824211841e-01,-7.979103229798268915e-01,8.208848130850812108e-01,-2.664181406527431628e-01,1.622202871555323556e-01,1.296697179578575998e+00,-1.005156925211866836e+00,5.587815680616484149e-02,-6.020016054904604452e-01,4.190641549974305491e-02,-4.685412392117331848e-01,5.163082809357857350e-01,2.457172311199336434e+00,-1.375996436408334356e-01,-3.091214775920075319e-01,-5.449973341397073012e-01,-8.313620547668538752e-01,1.393980064371918903e+00,1.153615043082498293e+00,1.487344385905804867e+00,1.803701521889179871e+00,1.123937669272361273e+00,1.767342453861394658e-01,3.080583535297504172e-01,3.555654861822689083e-01,8.931340515753977138e-02,5.655413240881201897e-01,2.973771994385239648e+00,-5.916857863539790041e-02,2.408434740166022769e-01,9.139230072302805263e-01,4.509359190283332985e+00,1.519112879352805923e+00,1.044572012561293395e+00,-6.208633403240597648e-01,-8.502981905032784837e-01,1.602885560402126597e+00,7.863209408757152463e-01,-3.158307416512715626e-01,-6.747901783164892420e-01,2.139450596476905719e+00,1.008790804631327420e+00,-3.485429451903770959e-01,-5.923900180075742927e-01,8.462352904117065311e-01,3.772634052297906271e-01,-4.888996762776695038e-01,-4.014435908744207748e-01,1.007187183459878677e+00,-1.129676240766486484e-01,-5.279444376351680734e-01,3.257453769519370823e+00,-2.291019841566123427e-01,2.649877181790350478e-01,6.145045251001216569e-01,-1.163429713674520027e-02,1.324005494845829300e+00,2.097165621010578795e-01,1.064895227393710897e+00,-5.633837309642413249e-01,-4.115787894251147772e-01,4.949044356239968301e-01,6.867118525516648919e-01,-1.587387620301267677e-01,1.061732750738594966e+00,9.308044417610197296e-01,-9.921862387565476560e-01,-9.889786862913280130e-02,2.198174589614950492e+00,6.791617885412013500e-01,-6.921396495030400775e-01,2.476495324755621397e+00,-1.282257004669919431e-01,1.142371927385623875e+00,2.382138982046212994e-01,7.174433526575827447e-01,-3.068647505520031293e-01
7.740752721624306609e-01,8.845617648851100689e-02,-2.021001764474709694e-01,-4.129661216892400732e-01,-5.311651891716316909e-01,5.716920680548220890e-01,-1.411251840878055552e-01,2.548037975803241761e-01,1.511099740815366799e+00,9.615160206688545541e-01,1.343833356154718439e+00,3.467266292992713939e-01,-3.515026831900735504e-01,-2.650258267927801392e-01,-5.541520553766389190e-01,2.492500511853196432e+00,-1.814407465409495490e-01,2.840356999537852478e-01,9.994959013165577444e-02,2.226957701592370553e-01,-7.514877372397564814e-01,1.185837934065763655e+00,-3.542124653423062153e-02,8.973829906253501243e-02,1.504910108481533282e+00,-1.194715500081265924e+00,2.287420184077162688e-01,-6.673942752902464193e-01,-1.740481907538142803e-01,-7.003931811208857772e-01,3.431111046679616861e-01,2.751094751138254413e+00,-3.282333530226635432e-01,-1.797597852794519113e-01,-3.707058903771364156e-01,-7.380518611169906151e-01,1.209763427569970240e+00,1.343091059042171853e+00,2.104937626282450402e+00,2.514932849919330415e+00,1.004873997002364128e+00,2.141503004403922106e-01,4.070066353690009464e-01,6.825484193770860186e-03,-5.679798681859804521e-03,3.862029832593665835e-01,2.958701424687582904e+00,-4.037312905644256933e-01,5.749577038684761110e-02,7.633679252076699395e-01,4.240417796323047384e+00,1.734158631872513734e+00,9.077028902919610509e-01,-6.712148175150476348e-01,-1.321159599428779474e+00,2.131520353921865230e+00,1.528215017436059142e+00,-1.741482969348510657e-01,-5.987422663796633238e-01,3.054909257021765523e+00,1.091235176190197720e+00,-4.435696247155729299e-01,-5.758670775455063673e-01,1.404098605278835343e+00,5.918111814067062992e-01,-3.881706177212003173e-01,-5.547880165608279901e-01,1.059810265121014172e+00,3.582305846307627939e-01,-6.019687832570808084e-01,3.082841841902256519e+00,-1.021373469510585275e-01,6.319753667382197460e-01,3.456180543259896876e-01,-2.113321637712171630e-01,1.241857491586279005e+00,3.062300991377797654e-02,1.509710599885992099e+00,-8.236080164286054828e-01,-2.342876228295824037e-01,4.382701824817850089e-01,1.051049066648750863e+00,-1.784296495390471082e-01,1.309840128872756360e+00,1.320221025412334548e+00,-1.352449264549895780e+00,-1.059429964474656316e-01,2.419829091650154140e+00,5.578481778389747792e-01,-4.774137028627738477e-01,2.640445006081555857e+00,2.613052942178039073e-01,6.769109542200755225e-01,1.539878165010635791e-01,1.375221390396734078e+00,-3.867286870897961304e-01
7.319523890684475065e-01,7.006850889180387121e-01,-3.477767851435202839e-01,-4.062591621091536376e-01,2.480987022736930170e-02,5.600386651769077018e-01,1.199394792999145309e+00,-2.568333646986753482e-01,-2.581243926210003981e-01,-2.210808443034645299e-02,6.057436641354118079e-01,-1.852389226571444780e-01,-3.392516751516426732e-01,2.707914072891933199e-01,-5.114312388032534740e-01,1.309632887259298162e+00,-3.037585291440221269e-01,-7.851453825807369613e-01,8.422283605046998467e-02,-1.272978159901547168e-01,-4.091831608268381992e-01,1.068262629925370577e-01,-7.248796074450034599e-01,3.451981380685652523e-01,1.697218112768651643e+00,2.424000136183503962e-01,5.595807093358624862e-02,-6.590553052228917963e-01,-1.258070241300931258e+00,-1.270781301765558924e+00,4.612758912371812126e-01,2.169669692290136620e+00,6.251464074558010786e-02,4.253014328049579684e-01,-8.124349695848174235e-01,-7.628563924244557981e-01,1.614896470385558613e+00,6.087488175412104630e-01,2.054800779756698503e+00,3.266783613078022563e-01,5.437361938874005762e-01,3.773833494306138014e-01,-3.748097008391199636e-01,1.824093108831316701e-01,4.034603138134579825e-01,9.968897048757107138e-01,1.819943877911659014e+00,1.726685300352457098e-01,3.382710145245438893e-01,1.613173200396252338e-01,4.329883810104296238e+00,2.132420905646910558e+00,2.230251179019821783e-01,-4.159163596574310118e-01,-9.084467448285549196e-02,1.259445862811646055e+00,-6.810247448258643921e-02,-5.295015032130356847e-02,-7.832427642036131621e-01,1.367135025182378838e+00,-7.985850151062928726e-03,-7.583324335541321570e-01,-6.865995013091572008e-02,-7.740464878748187783e-02,8.401234834439950117e-01,1.497909924168945861e-01,-9.004594401666370374e-01,4.175535902067135652e-01,-5.182030435761778575e-01,1.165920809472015041e+00,2.006480854929903579e+00,-7.472594056369935567e-02,-4.547427794733217843e-02,5.411909228683543516e-01,3.064631495570357966e-02,8.158855430284124299e-01,-8.471378593210228125e-01,1.366478351447797390e-01,-8.624300691174966449e-01,-8.789208678469244695e-01,8.503972424529008256e-01,-1.304594836704937588e-01,-3.506617363565733836e-01,1.811319535201359354e+00,6.424747026647031900e-01,-1.235081412398442602e+00,3.269301256595138483e-01,4.327521660200218667e-01,9.912308246385603816e-01,-5.332223782092659903e-01,1.064630533939084245e+00,-4.362279463777956612e-01,6.940875238740552566e-01,3.734302524506802889e-01,-1.444460547419622043e-01,-6.528472906831512823e-01
1.114715029276243774e+00,1.345026206634574617e+00,-6.686724910380710540e-02,-3.627967924304861258e-01,-2.379624526187020250e-01,2.387891278117669214e-01,-4.791586529421520413e-01,4.478585718990402142e-01,2.011444889866862873e+00,4.139864543359589311e-01,4.006496462392356017e-01,3.242847844322582773e-01,-4.592590923154751259e-01,1.536313585758916078e-01,-1.547243336288554039e-01,2.093525752547893859e+00,-2.013862855262271712e-02,1.963359000334521931e-02,4.908427556077526316e-02,2.762854397075941715e-01,-9.219502191151420778e-01,5.149567928906024772e-01,-4.209330984353273908e-01,1.456401126550113112e-01,1.241209579115981398e+00,-6.460366111616473450e-01,5.347419534087174964e-02,-5.494281470552219160e-01,5.036700653641590364e-03,-4.133966528570662824e-01,4.587484607008846527e-01,2.341474088621748439e+00,-2.530868182259090604e-01,-4.744413735594198989e-01,-6.590365979103548488e-01,-7.260589088431150806e-01,1.555717030218597641e+00,1.090271408420803834e+00,1.055951335603693586e+00,1.416923492883168212e+00,1.039854302138129905e+00,1.984382929855044164e-01,3.558911055478619079e-01,4.459967476954292964e-01,3.100950470672823034e-01,7.004428389075720851e-01,3.188588141898839545e+00,1.084576969025579651e-01,1.735842279597461513e-01,1.336794925860302463e+00,4.203236300962415406e+00,1.204985341592839099e+00,9.821153327040156311e-01,-4.651167314118622165e-01,-5.320930616371042365e-01,1.300543354481567881e+00,3.388284355549634475e-01,-3.428120467772393098e-01,-7.889483966065157228e-01,1.291534468036694250e+00,8.696355804321502792e-01,1.227905335944982634e-01,-3.515423149202339115e-01,8.326450651873389397e-01,5.944221128721579595e-01,-2.390577152544016704e-01,-1.906216301863864482e-01,9.637843650785095084e-01,-6.686846529729947863e-02,-6.283830506836951546e-01,3.118321438044363347e+00,-5.293615675911440555e-01,-7.812996430202015508e-03,4.723488352982453398e-01,4.714564443986601905e-03,1.274862932357527345e+00,4.576777639512338847e-01,8.108533979169618711e-01,-6.618696740808932555e-01,-2.255466354770057080e-01,4.855641709066046974e-01,3.789056639702480522e-01,-1.112013068199312060e-01,9.743022378908066106e-01,7.458836306190261833e-01,-7.213591711280777918e-01,5.261201763414724564e-02,1.934649794475883811e+00,6.370368141369230353e-01,-5.875875619466317534e-01,2.340776581721137006e+00,-5.945516660069893877e-01,1.476916861100157519e+00,2.343845963066651938e-01,2.929699363263566503e-01,-7.038672550755731283e-02
1.122048207237465567e+00,7.740096819563476727e-01,-5.518017388733373885e-01,-8.127767008807240678e-03,-6.327334389604867271e-01,1.026191515177938829e+00,4.042606670229821897e-01,6.448453576252634045e-01,2.110645000940433391e+00,3.544382459280203124e-01,3.866735798322358808e-01,5.116404217460580883e-02,-4.511300551188933139e-01,3.528140850766218334e-02,-3.326354314292634395e-01,1.966527034073354718e+00,-1.042079547016583618e-01,-6.454968123561443116e-01,8.469827311123750979e-02,1.635224199924023014e-01,-7.855132048994887262e-01,8.345686245082328814e-01,-4.347164053868201039e-01,9.527454241098971821e-02,1.343275682749893729e+00,-6.610183912739596712e-01,-3.761171555088872465e-01,-6.520080152893584780e-01,-6.356317834866354044e-01,-7.007473088603246580e-01,7.844908058335302581e-01,2.504480331033388296e+00,1.584077218327183401e-01,1.593409322070210576e-02,-7.851463264339044734e-01,-7.733781473691944131e-01,2.080233762926062102e+00,5.782140379936151486e-01,1.261521084377668522e+00,9.917003430705630951e-01,1.448707761058777521e+00,4.091738550644845041e-01,2.175478702865756842e-01,6.122649214879075652e-01,2.499011460521997074e-01,6.536856933973450579e-01,2.746362121623087127e+00,5.738850193913143105e-01,6.577172848575340014e-01,-1.290616415308853959e-02,5.296357260844921200e+00,2.268233788400341844e+00,1.431850224705315533e+00,-3.956516446149201394e-01,-2.983849160882247054e-01,1.159161197821084066e+00,-3.462385613496782311e-02,-7.387795798627984079e-01,-8.700102752820002561e-01,2.256627125820538371e+00,1.973495424908976448e-01,-5.723461794822121140e-01,-6.055459939823921722e-01,-2.185699983168133409e-01,4.459973194448130229e-01,-2.121908628967437149e-01,-2.542675084706299549e-01,1.199712409693810322e+00,-6.787984373773245927e-01,-3.697230040046771693e-01,3.293039935833680154e+00,1.306834322140920657e-02,-1.099864478368223070e-01,3.916987932954085760e-01,5.605316405597920992e-01,6.824686807834146052e-01,-8.936704053347355181e-02,2.019868011466218194e-01,-8.874025781927006307e-01,-7.709012066957730003e-01,8.760758485794859496e-01,4.666413285846795489e-01,-5.642449927901320716e-01,1.282248272050321658e+00,5.753672216365938175e-01,-1.107770828209579284e+00,-3.076409156694776548e-01,1.806234182792000098e+00,1.249460646121705043e+00,-1.921954209985656581e+00,2.402460728081027952e+00,-7.716813293218899306e-02,1.696159271835349758e+00,5.105787802172037093e-01,-8.776857870258480965e-01,-7.427843100149639222e-01
9.848895183495369743e-01,1.147762673461750094e+00,-2.577442431895964337e-01,-8.236745201877175848e-01,-4.745913310346883685e-01,1.364136279363130644e-01,-7.784032225989552245e-01,5.356154854448136327e-01,1.915011352504388142e+00,7.505567702457293100e-01,1.148991647993540921e+00,7.008789536832769063e-01,-3.025312943319602432e-01,-6.472336851045570882e-02,-6.697600754953972890e-01,2.746782180677612040e+00,3.772074085663300047e-01,4.184354551144799927e-01,-1.904401969053525490e-01,6.026098314069194134e-02,-5.791660082109881813e-01,1.238720850911223970e+00,-1.867362166281804070e-01,-2.573428945342678964e-02,1.620891951992628810e+00,-8.698585164613387155e-01,1.447821327220245868e-01,-5.275008171328109396e-01,-1.820891147371401786e-01,-8.888413544702458147e-01,1.123242521506730429e-01,2.406762123862575375e+00,-5.994275492867902067e-01,-2.912633131603145631e-01,-5.367940233852165344e-01,-6.940847824530527177e-01,1.526617581651640965e+00,1.226526152241499634e+00,1.966313002291184109e+00,2.218593688240972028e+00,8.289957780770500495e-01,2.002989970558355370e-02,5.314068701839689268e-01,1.297260995626498548e-01,-1.239478644696010434e-01,4.361266256420958665e-01,3.299546084516693512e+00,-2.189432970267518597e-01,-1.588149028579576294e-01,1.373410367264222165e+00,4.006975720441676714e+00,1.466295590591692122e+00,1.057279806051453885e+00,-5.433462126505161915e-01,-1.017904633130969572e+00,1.955103266326503109e+00,1.446725206782551343e+00,-5.546902395402366487e-02,-1.190979424693660693e+00,2.655072057907470029e+00,6.243668793619218116e-01,2.963561785120872871e-01,-1.207452009345706956e-01,1.585292897099066955e+00,8.248539037553177522e-01,-2.678283338655886858e-01,-4.376395729360399445e-01,4.835168710707015705e-01,7.615409234708662156e-01,-6.628388347340914422e-01,3.061399929833107603e+00,-3.254178637946932295e-01,2.550561692752048581e-01,-6.230696409282857062e-02,-2.790370012553032852e-01,1.027898075957434099e+00,1.951853486235021751e-01,1.762299198799729183e+00,-1.111105661085037388e+00,1.450133446449014540e-01,9.536361961214632199e-01,1.118528963791772801e+00,-9.316511780538877519e-02,1.071645150398806257e+00,1.646386732849288936e+00,-1.246783633674741099e+00,2.560074763354291960e-02,1.864159402343084970e+00,3.896008300318660744e-01,-4.480450681513821753e-01,2.676353452238703134e+00,-1.655254241115471370e-01,9.170683929142693369e-01,-1.123586639625321348e-01,1.399913259615451100e+00,-1.849641119539924827e-01
6.104669357777745553e-01,7.685688932933454343e-01,2.472427575648429576e-02,-1.056922696988923605e+00,-7.858431306452552667e-02,8.123685500323998832e-02,3.383859539328490373e-01,-2.576641369094898604e-01,3.904227629754700724e-01,3.308286578804403577e-01,6.716057948594662541e-01,2.288629674434906891e-01,-3.457325165364595887e-01,-1.672365576575992607e-01,-6.779943616356547409e-01,1.554324184711905810e+00,-3.315427981291919624e-01,2.369167573521293590e-01,-2.182599239000362068e-01,-8.117225802516711552e-02,-4.800568415730420146e-01,6.063172357810249213e-01,-4.319548021050905184e-01,1.064332036051612862e-01,2.008889963270767076e+00,2.014810187179731649e-01,3.420304692645217970e-01,-6.699589465285887835e-01,-1.530288086165571659e+00,-1.590422182158189424e+00,-2.218913415935330757e-03,2.549355857498598166e+00,-5.639702839844331628e-01,3.269029140425649960e-01,-6.263125227916288562e-01,-4.464335664438865425e-01,1.550267216722771790e+00,9.349677500096907901e-01,2.589153222221901363e+00,1.388630190626579441e+00,2.725718612841221411e-01,3.883198127953272349e-01,3.968787565149524410e-02,-3.090773209368382624e-01,3.942929085981581316e-01,7.487333434981194857e-01,2.362368302155964273e+00,-2.501609757059733985e-01,-1.718364568990237706e-01,6.661324897820364299e-01,3.427996192806142428e+00,2.016398860281516381e+00,9.951268342255531474e-02,-3.095412667176701826e-01,-6.422706991820620326e-01,1.916226436159678359e+00,9.386059914804413262e-01,1.622962962801780817e-01,-9.603964334656631685e-01,2.162554796916539068e+00,-2.825063786206769012e-02,-6.621329082673282906e-02,3.105181245238337606e-01,1.177419199946097894e+00,1.522344044375274930e+00,5.885115421711916150e-01,-8.097250004579067406e-01,3.942654024047738681e-01,6.447142850579904438e-01,5.770684521554352298e-01,1.718013551483660306e+00,-2.765467429145710421e-01,2.588013808320913101e-01,-2.959920943257574599e-01,-3.423927031991069181e-01,5.807251029365027017e-01,-6.688495383672112826e-01,9.142572351993201174e-01,-1.553719755568567562e+00,-1.119509872663673744e-01,8.560195011339866156e-01,3.764930904770853459e-01,-2.906590801982589234e-01,1.990068797953185253e+00,1.329655248229276943e+00,-1.545017845568122494e+00,4.505865826438417709e-01,6.671138863730080582e-01,6.190004814987408732e-01,-7.038492639757315539e-02,1.490433323518440156e+00,-3.148613207616284271e-01,3.730027124302021657e-01,1.036868086485582818e-01,7.186934526527590794e-01,-4.179052178061097855e-01
8.598802004641781238e-01,1.219967579237361877e+00,-1.292521371220093362e+00,-5.335088583400395823e-01,-2.915440238370214932e-02,6.134120012440178460e-01,1.422707736459349448e+00,3.953210731605387440e-02,-1.486684715560806724e+00,-1.715567923326475064e-01,1.850069641608091509e+00,1.495422710425173274e-01,2.512537665880526516e-02,8.934713916238365972e-01,-1.238669980933900572e+00,2.391490776337105828e+00,1.011984018799291896e+00,-1.591702689679465266e+00,-4.324795715257372108e-02,-7.318411478998640973e-01,4.982386205528648304e-01,4.844893811677734030e-01,-9.373592789694789040e-01,4.035587457244516063e-01,1.901829171746266756e+00,1.333002460232996789e-01,-1.920650833817516279e-01,-4.427484281268203592e-01,-8.378993972317487771e-01,-1.630279313463093072e+00,3.486771571753644050e-01,1.222071109023925795e+00,2.039951520167029297e-01,6.952902040253852167e-01,-1.001464782200966130e+00,-1.263995785685932072e+00,1.690006551483295372e+00,3.795036652452732362e-01,2.662697665930138236e+00,-1.806442598263335864e-01,3.274385834430548758e-01,-2.438506439456424313e-01,-6.841270642661334556e-01,5.220303912227386434e-01,-5.177838426681761197e-01,1.010760027379772552e+00,1.422029307297952627e+00,2.726348167709501391e-01,2.875481181301757228e-01,2.976456108597124728e-01,5.036932539705126111e+00,2.221233267455269278e+00,5.214192290639489968e-01,-7.157898387446652855e-01,1.382121223594592330e-01,1.224715059084065194e+00,2.994044667528297232e-01,3.760138841370939122e-01,-1.662049780663610754e+00,1.832604008002941098e+00,-5.285753427206039134e-01,-9.019126816737489394e-01,1.168368308967894509e-01,-4.182772186037685413e-01,2.153124312547114450e-01,-6.840076300010955457e-01,-1.468227003453354218e+00,-1.056162275175958509e+00,-5.479823751633624562e-01,2.108443289577994761e+00,2.349825164988156523e+00,3.267993905508398966e-01,-3.510251263288166612e-01,8.275373747371137512e-01,-1.109819463374372706e-01,8.738073805917594417e-01,-1.372977799119031284e+00,9.920633309465797245e-01,-5.362853343169535769e-01,-1.108745261671184146e+00,2.006624454818925152e+00,3.779157885703174902e-01,-1.678387446845487352e-01,1.349399961614309085e+00,1.438951081301911517e+00,-1.443436749650930828e+00,2.935587188809857251e-01,-5.500908940739375197e-01,8.236032737798616443e-01,-5.402090958409229149e-01,8.942793766566655700e-01,-3.594121673741052514e-01,2.670992838283207105e-01,-1.226943340174920238e-01,9.378486786653734697e-01,-8.984564865034824210e-01
1.017155562885382558e+00,1.419992807535177093e+00,-3.911924311372302898e-01,-4.633576834629992702e-01,-1.586392730371708470e-01,5.259023751748815867e-01,6.848864077976017928e-01,2.117520521043432247e-01,9.590882857561344732e-01,-1.453615334541456250e-01,5.682047799804151866e-02,-5.868681526990909836e-03,-4.095421642217626501e-01,2.809546746732139999e-01,-4.079450137361830819e-01,1.388921612373227532e+00,-7.423980060397239455e-02,-7.378675407890391558e-01,-9.454333316465227122e-02,-8.424959801695933170e-02,-5.299222128220343331e-01,2.526668826454431804e-01,-7.821737801045325345e-01,1.849270930664057566e-01,1.634063787986076655e+00,3.264948038833567767e-01,-2.162354949636302315e-01,-6.034307540275246629e-01,-1.302881166160583248e+00,-1.219025974185458994e+00,5.090665737635436949e-01,2.152285149752965587e+00,-3.936066221956746602e-03,2.749869418307416824e-01,-9.676472905182872397e-01,-6.641469316299737358e-01,2.136758131857920517e+00,3.846381543292382577e-01,1.534720277542247491e+00,9.765571336147060855e-02,8.105355759149429629e-01,4.046972604845256449e-01,-1.241067946304065112e-01,4.398186223664474759e-01,4.649828117632922031e-01,9.752172522502194907e-01,2.289971944765114564e+00,5.931611111883422494e-01,4.260553373996757154e-01,2.561755257331986280e-01,4.588808549684966209e+00,2.160166157999182435e+00,7.292053829055498149e-01,-2.226536936629598673e-01,2.118631473649634778e-01,9.477875669273951864e-01,-4.607284420807427061e-01,-3.531837880606663038e-01,-1.124178556064727719e+00,1.222478445206500952e+00,-4.003592954043062591e-01,-2.636693758819271816e-01,4.222084428264786388e-02,-2.971876889105066200e-01,9.594663217997027038e-01,3.024041236648095654e-01,-5.130938691835247312e-01,5.135727769655938912e-01,-5.033011488694905111e-01,6.228914566609842218e-01,2.330565967340138656e+00,-1.983902891764647847e-01,-4.016522322470620909e-01,1.719373666203323492e-01,3.266102411463035482e-01,4.748669164319894720e-01,-5.190684497417131782e-01,-7.883410576515492707e-02,-1.153542927151513853e+00,-6.901812246211656010e-01,1.134133942264287986e+00,-9.088866501427411704e-02,-4.850643049136380558e-01,1.606716287301051427e+00,5.852249543539664867e-01,-1.093892512614741630e+00,1.856504467425856286e-01,4.652235898533357283e-01,1.142216430614047429e+00,-1.245710721485039141e+00,1.443106523351574300e+00,-6.498664335679742443e-01,1.381131851267214383e+00,3.908343898869767186e-01,-9.740437974707683022e-01,-6.212101026342402577e-01
1.030091456848480247e+00,1.104826064811315289e+00,-4.064447846460401137e-01,-2.472630996313682772e-01,-2.620891130332884678e-01,6.536021231937862996e-01,5.391792292750838822e-01,3.010181448374241731e-01,1.202816262153476146e+00,9.280631402430622456e-02,3.225313840317366454e-01,1.183440187720992409e-02,-4.139883852605485970e-01,2.364537463011473495e-01,-3.446451593100687827e-01,1.669368657604835438e+00,-9.183170481999314294e-02,-6.708209995302681916e-01,4.321749165385970620e-02,3.946219479679707876e-02,-6.427980687396227522e-01,3.956448795414557740e-01,-6.333471134674477643e-01,2.042861137254587678e-01,1.455494177754851126e+00,-1.575561711585455327e-01,-1.861755652884300172e-01,-6.110460795219437857e-01,-8.067020738596794027e-01,-8.909255386132840515e-01,6.084202838603578467e-01,2.241588143342670314e+00,6.172417376748973172e-02,8.560585124863981377e-02,-8.467514591871466711e-01,-7.609261627621191071e-01,1.915395950384361168e+00,5.902260447247185127e-01,1.405119590143253383e+00,5.475026093821784290e-01,1.008851738797684083e+00,3.488668918916398853e-01,-1.821633466078907693e-02,4.952672811199357872e-01,3.531229840675265130e-01,8.585484684751449880e-01,2.463716427851163626e+00,4.551403635444799534e-01,4.692362772075311939e-01,3.479147334396023306e-01,4.750203686446880624e+00,1.994974463922566166e+00,9.002706791868505531e-01,-3.682005895469945278e-01,-7.888541129855614065e-02,1.068790466780916049e+00,-2.025565902992831901e-01,-4.187821532320088469e-01,-9.190357381180614960e-01,1.469135861593841019e+00,9.311842840912172570e-02,-4.204763468073424715e-01,-2.698865220712226565e-01,-1.258715291275417369e-01,6.486275047003395855e-01,-3.055696278442709968e-02,-4.580612752520463182e-01,7.614901302180971943e-01,-5.750718629832113349e-01,2.537489705183587074e-01,2.733104474553447627e+00,-1.652073832774295647e-01,-2.114160449462150759e-01,4.441902099246815006e-01,3.051022992662642541e-01,7.828965833038189492e-01,-2.773413293591887596e-01,1.568682218195168732e-01,-8.556619225420832864e-01,-7.242774605626336459e-01,8.917808376236775469e-01,1.086901017785644463e-01,-4.076983954936506116e-01,1.397755723635175640e+00,5.690138488259564031e-01,-1.015581455238069530e+00,3.639347013373800399e-02,1.097217733904584325e+00,1.072507033140721600e+00,-1.210851895793275679e+00,1.782449690681398247e+00,-4.575115050752715518e-01,1.393442587537502941e+00,4.073490441878059309e-01,-6.074334738091440311e-01,-5.690190954518477007e-01
1.070271078407710963e+00,9.152036287186635644e-01,-3.989194158678508462e-01,-3.163485161570371851e-01,-5.353963183290011418e-01,5.908740374131000728e-01,-2.344176272779740500e-01,5.994125338365848821e-01,2.014793457072989291e+00,5.960210937176858570e-01,8.439754856506216374e-01,3.665637471598751640e-01,-3.786407950846653603e-01,2.923115254681028785e-02,-4.452628400221856908e-01,2.432015454718446712e+00,1.428816033468088831e-01,-1.312539263820527158e-01,1.792879616388436820e-02,1.576408816637512034e-01,-7.247896073760758950e-01,9.968040417575100287e-01,-2.934328757155036937e-01,7.055874572659394384e-02,1.382748597477479802e+00,-9.112330573544463741e-01,-9.296699244522674266e-02,-5.803932605977262238e-01,-1.593247649084458262e-01,-6.287569197884258498e-01,4.949697769265891667e-01,2.427310305831777093e+00,-1.765779460504976472e-01,-2.374062701195543412e-01,-6.300333764160327421e-01,-7.920407251874276300e-01,1.688515464451027848e+00,9.845012050829504702e-01,1.494685566200619764e+00,1.677981129276312267e+00,1.188434062218733267e+00,1.745718377101952989e-01,3.791755449430587177e-01,4.235263113269870927e-01,3.534231628947609449e-02,5.390236255121854114e-01,3.067249723905983938e+00,1.319988667891925371e-01,2.671683559572017863e-01,7.944612746222217137e-01,4.685550622849244284e+00,1.718877378885740548e+00,1.266511199024545009e+00,-5.328245933230464360e-01,-7.147043060485114285e-01,1.539890232749251631e+00,7.186236961811794943e-01,-4.006590322494375522e-01,-9.400576591922980008e-01,2.350675399921225317e+00,6.355966201241755043e-01,-1.871970956557974797e-01,-4.745373806574505471e-01,7.126370854857446702e-01,4.820540393470056362e-01,-3.926113777058253262e-01,-3.305049605514707722e-01,8.982412118626040831e-01,-4.034036616660671010e-02,-5.985407608580428640e-01,3.316695747343466394e+00,-1.805287077407198015e-01,1.098641109554462508e-01,3.450048387807399530e-01,1.170668184626874192e-01,1.036115118061136764e+00,1.670407741109409261e-01,1.036153361928497052e+00,-8.111594240749926410e-01,-3.476427430780071326e-01,7.988481175236968879e-01,7.931244644206754124e-01,-2.647760717174982292e-01,1.060673954061577717e+00,1.050929197446557328e+00,-1.080272597111457955e+00,-1.643334329905247193e-01,2.022336363416858518e+00,7.744551626504679875e-01,-1.088014045608736824e+00,2.596028684299117373e+00,-1.272494654089952881e-01,1.323668985990840596e+00,2.044384256097988017e-01,4.029665478696901615e-01,-4.031924362831774689e-01
8.007001230666010994e-01,1.202006031942739472e+00,-7.077190973697965182e-02,-6.269319531288681802e-01,2.143081596773755426e-01,4.770066700876973709e-02,4.406249769359754098e-01,-2.418827345263098727e-01,-1.314721535447271883e-02,4.777000222970306798e-02,6.045937910969569895e-01,6.933292221697949509e-02,-3.465389863519655056e-01,3.576548818921099770e-01,-3.895074851089936896e-01,1.534592695477114965e+00,-1.396955456445100885e-01,-3.237787679258765650e-01,3.739877889586919885e-02,-3.779812427958651605e-02,-5.176275491481896474e-01,-7.506117010681823132e-03,-6.955218247077180616e-01,3.415881784802174970e-01,1.588462980713875039e+00,1.505646129522093257e-01,2.809765624629302905e-01,-5.699579015156333028e-01,-7.113278844631321096e-01,-1.012490233327058897e+00,2.624125908673426988e-01,2.046168492265318939e+00,-2.217887036660714517e-01,2.666208235299430407e-02,-7.399855802672364868e-01,-7.449636890294626390e-01,1.338391274123009289e+00,9.441242650870045328e-01,1.803438189407040371e+00,6.682651765178206915e-01,3.658116168467759888e-01,2.028606352580336614e-01,-2.004148293810862347e-01,1.485894158256381714e-01,3.904360459001767203e-01,9.891213128262481558e-01,2.264817400502951994e+00,-7.682634906107357886e-02,3.145687637621386035e-02,1.124537246166280813e+00,3.709746243669345134e+00,1.391770252546714604e+00,9.501170442242184988e-02,-4.615182059505910095e-01,-2.482074125934417008e-01,1.323793707009506049e+00,1.913242350970646433e-01,1.481804520827020577e-01,-8.048459645343365443e-01,7.897211720152785830e-01,4.411749204356694154e-01,-2.031069485659006690e-01,7.029792175833279866e-02,6.291992087105835463e-01,8.830159397487507000e-01,6.294363340030062481e-02,-7.752558927765215158e-01,2.767958893522285968e-01,-9.525481042577194080e-02,8.020580992317196678e-01,2.071516438869948296e+00,-4.452249695576995236e-01,-2.238958337297536350e-02,5.631341408651173719e-01,-2.902734117780894074e-01,1.199656382893341533e+00,-3.650527052103731407e-01,6.054980302733260489e-01,-7.136164410847964934e-01,-4.689536373847312811e-01,6.510476825764324182e-01,-9.605828130627974693e-02,-5.259663685206811268e-02,1.491400382169219219e+00,7.916060605844659204e-01,-9.423559443711333472e-01,4.992886749742482810e-01,6.400826133059973611e-01,5.853302446414205829e-01,2.061808843919875067e-01,1.198569431926179263e+00,-7.793616629960389286e-01,6.875659098901996114e-01,1.685302960549968920e-01,5.959802838918133450e-01,-1.894622114367739973e-01
7.861338437302312077e-01,5.817756811755701030e-01,1.301402016585155308e-01,-4.434384889527469564e-01,-1.700986567766855084e-01,4.102375237928952978e-01,2.962021818042542831e-01,-5.437103769366728734e-02,1.267248921900764325e+00,3.860668237594712116e-01,2.436286429729914160e-01,-4.983269222192970860e-03,-5.058498175993222379e-01,-1.588236389867084264e-01,-1.968562216890404060e-01,1.397640118075175630e+00,-6.725976568418541301e-01,6.034139912475061651e-02,7.032736888669488540e-02,2.662450281296657728e-01,-9.433511132824989875e-01,3.852750954018765439e-01,-3.916736231681924307e-01,1.770887167624033975e-01,1.518413238834765533e+00,-2.352039556285921151e-01,1.973458245705634884e-01,-7.122660242801097663e-01,-9.333075119282998600e-01,-8.665079654985815560e-01,4.175371382642624196e-01,2.730067964879801856e+00,-2.334476189287343351e-01,-2.752167432792679280e-02,-5.996555798706879603e-01,-5.182492718129070308e-01,1.521034958830035144e+00,9.846500760920988693e-01,1.660288890703336184e+00,1.363361433236941922e+00,8.214952807769767551e-01,5.298348829479753164e-01,1.484020594899919110e-01,3.379684350423264177e-02,6.254680638853598040e-01,7.536868129937120964e-01,2.628458759679258794e+00,-2.719359532876042262e-02,1.981250365382375145e-01,5.730382708094947652e-01,3.933355774146105155e+00,1.801059095968049695e+00,4.636275322943044230e-01,-3.456267095672869716e-01,-5.954915006407717204e-01,1.540169959974287295e+00,3.506647770003521458e-01,-2.957300129322391058e-01,-4.796029131720876970e-01,1.665743030483301856e+00,5.795691096819497456e-01,-3.127136561955639049e-01,-2.524159920599965412e-01,7.238854101967483468e-01,1.056655246616768906e+00,3.156161993043130054e-01,-4.194732949517619991e-01,1.217676858533564221e+00,-5.586287212548384645e-02,-8.665298384007619203e-02,2.357225234884968934e+00,-3.588889590543901664e-01,2.366818844177858705e-01,2.345149652235066773e-01,-1.554562187344329938e-03,9.277484829786016851e-01,-1.272024763078560272e-01,3.701306390318766515e-01,-1.046338083021247201e+00,-3.918213114701192823e-01,2.886212483080958791e-01,1.370736818477795160e-01,-3.309150123549604028e-01,1.690730191257957316e+00,6.190958666466593874e-01,-1.107197749393590502e+00,1.843659564732671174e-01,1.595934157349644167e+00,8.420120186963054865e-01,-5.339620351275777832e-01,1.849339457615008175e+00,-3.391574697983321673e-01,1.029093386985352909e+00,4.384154018309199263e-01,-5.360651363104240730e-02,-3.468659975889088476e-01
1.125908007265845612e+00,1.417995559881022105e+00,-1.151215125056467975e-01,-4.113707802663456592e-01,-2.902503691837328148e-01,3.259863018361666143e-01,-3.012224076226991953e-01,4.758682901088977513e-01,2.096683916965657701e+00,2.928019781530193377e-01,1.688772162981042047e-01,2.716326840603675019e-01,-4.775148340978377925e-01,1.096281331272981746e-01,-1.884852630456187172e-01,1.898727699850529582e+00,-6.703852154126371810e-02,-8.431553964143322089e-02,-2.994694592572125225e-02,2.235204458270647621e-01,-8.900736738884678090e-01,5.273530576129432657e-01,-4.824000443786949921e-01,1.010249637451580973e-01,1.345164648458537116e+00,-4.042737790420483091e-01,-5.788750683812032838e-02,-5.725970871345720248e-01,-4.038682889740707882e-01,-6.241941604718570513e-01,4.750908569463179187e-01,2.384929657459116115e+00,-2.282925323903720327e-01,-3.053005745422325279e-01,-7.443223651124157847e-01,-6.489100468134958444e-01,1.816779319186277997e+00,8.809770673939109065e-01,1.107762490659468968e+00,1.143378467692240275e+00,1.056306971003873274e+00,3.004246394973325573e-01,3.237449019694309538e-01,4.473945752684742594e-01,3.961303310862987481e-01,7.363113429042896785e-01,3.085515907390708357e+00,2.949079403973117741e-01,2.506096253260544637e-01,1.020321318261330656e+00,4.324215196592152033e+00,1.508909951242090930e+00,1.024327318989152857e+00,-3.462561383878575705e-01,-3.418414175613135875e-01,1.206503222879500736e+00,1.151387656815980043e-01,-4.346193949532536349e-01,-9.036619873669742287e-01,1.372829835714066027e+00,4.730756135151293895e-01,1.211338544078041091e-01,-2.412964383385785838e-01,5.587707736917485457e-01,7.722406229038197845e-01,-8.621361928737858449e-03,-1.692030927398363582e-01,9.660363110984824253e-01,-1.240582066342011958e-01,-5.018056179370053993e-01,2.965920123083756188e+00,-4.632934560977043370e-01,-1.304812174261006374e-01,2.512941472145686084e-01,1.552613932980659861e-01,9.579207386795008938e-01,2.803689133574080450e-01,5.346081823534184485e-01,-9.166432593142679330e-01,-2.752874235458889762e-01,6.624116775395921808e-01,2.991352450059235890e-01,-2.641259333026474421e-01,1.149260473261330073e+00,6.996201843528274678e-01,-8.309535601376121239e-01,4.006334397503952260e-02,1.654073783226985839e+00,8.113890824395796342e-01,-9.399996987090482037e-01,2.244508148089727761e+00,-5.944666792863210203e-01,1.587233634356442824e+00,3.001919605435993677e-01,-2.291505154676786171e-01,-2.195796500209747926e-01
1.207173431042395162e+00,1.342298608456610198e+00,-6.002216073407661279e-01,4.740285236647512335e-02,-2.870627023900489405e-01,8.238416472814509284e-01,6.065901080045523752e-01,5.117814545625758438e-01,1.395619920857520846e+00,-4.314231323703929255e-02,2.241128471507989328e-01,-5.397622277584029904e-02,-4.217589515489668095e-01,4.659547833466353706e-01,-2.322837938127081392e-01,1.745942885108298981e+00,8.315826144225729744e-02,-1.069648897942745869e+00,1.395232537955422014e-01,5.203089677521723772e-02,-6.579124372233965401e-01,2.650500473595704398e-01,-7.512073334566697902e-01,2.609657357747736661e-01,1.238448416203702163e+00,-2.582637847157676081e-01,-3.863110652816668100e-01,-5.657357738593464802e-01,-4.709453595273894733e-01,-6.204831448943071148e-01,8.288433152528428272e-01,2.027711428736310495e+00,3.049819195147054907e-01,-1.818496832018004494e-02,-9.527774633819336980e-01,-9.147504672772683865e-01,2.039329846457092366e+00,4.533126319626848977e-01,9.347819093921865274e-01,1.324392456019669595e-01,1.247311936426960255e+00,2.857465377159804087e-01,-7.533719865718498110e-02,8.361113223107625725e-01,3.042066315941169274e-01,9.300332917911675601e-01,2.480010008313521030e+00,7.309054666996283034e-01,6.979733380279106170e-01,3.183177441061315616e-01,5.242132540047002465e+00,1.915172016784296050e+00,1.182722310867417859e+00,-4.058024717188955521e-01,1.889086517627648343e-01,7.004746399293226844e-01,-6.747487330427827112e-01,-5.949311271213897356e-01,-9.512944120495510081e-01,1.069136566853538195e+00,1.313164808208205081e-01,-5.257148743297423987e-01,-4.575711536008424396e-01,-6.426163873773879098e-01,2.770762943865964223e-01,-3.140689822885777138e-01,-3.526610379751151658e-01,7.862662854317818972e-01,-1.055752567908200268e+00,2.150822456186426701e-01,3.115195814353753256e+00,-1.421320530462208687e-01,-4.368226939459415870e-01,7.771760069479483057e-01,5.239789257760020247e-01,9.039290143941147715e-01,-1.312275289090005792e-01,-1.026931824114408753e-01,-5.337251200017569808e-01,-9.646628538947923381e-01,9.530520619870911370e-01,-2.198395866477625971e-02,-4.131221141954294351e-01,1.120810460272958720e+00,2.924502444033740822e-01,-7.733708369730952770e-01,-8.922749981326222324e-02,1.158306518617725489e+00,1.212412426148748334e+00,-1.567501995553923999e+00,1.831275052529754088e+00,-5.804707425087249906e-01,1.769770428504968685e+00,4.882661005752335637e-01,-1.045035876577286915e+00,-5.971418961799803693e-01
7.113846428616980022e-01,9.038576881819672115e-01,1.295070414450678609e-01,-7.681613563953413326e-01,7.208405922299980506e-02,4.276768572840461413e-02,2.394897225187855860e-01,-2.549092585422521040e-01,4.675246917367963384e-01,2.686724021991285793e-01,5.165058318831297068e-01,1.268681986760954450e-01,-4.022153078182833519e-01,2.265444882557709344e-02,-3.861784896347981721e-01,1.487689863481233221e+00,-4.018927991744191686e-01,1.121395890268238604e-01,-3.216153180675300483e-02,7.277109529346240113e-02,-6.750739224821501461e-01,2.524914701735147537e-01,-5.013407343092195489e-01,2.263923913555369039e-01,1.691416112498589808e+00,4.959472693394443438e-02,3.674168485009171592e-01,-6.396980334487554209e-01,-9.620408165209909379e-01,-1.110744916833411366e+00,1.672869170045512555e-01,2.426849533307378071e+00,-4.089852299091740750e-01,3.329661811057263443e-02,-6.240948799501354616e-01,-5.583261405658034304e-01,1.350572601315740862e+00,1.055310328695625133e+00,2.005889192016213407e+00,1.222640716364080449e+00,3.987355062903056857e-01,3.467936353906820868e-01,5.601480736225546500e-03,-9.247148958043556466e-02,4.943324813533269135e-01,8.432343714214683983e-01,2.466803267603615346e+00,-2.221192842446182980e-01,-6.889651881465276573e-02,1.010329505574617093e+00,3.471946563423055299e+00,1.552963816038538614e+00,1.013235828299328123e-01,-3.883260397249544416e-01,-5.499662799695326232e-01,1.633091516157205936e+00,5.677219437353994147e-01,8.623551481747407377e-02,-7.029887111619069762e-01,1.365125308217958633e+00,4.688414834727867575e-01,-1.002130917068542876e-01,8.316701519449036517e-02,1.037376179629486916e+00,1.187778631961850184e+00,3.282887680486616389e-01,-6.735431046351115780e-01,6.008846456784689982e-01,2.684990007112375565e-01,4.148382433160078819e-01,1.984231628934946867e+00,-4.533635541700611338e-01,1.971896072513438236e-01,1.956297607446471076e-01,-3.223567996014515824e-01,1.019247473126483561e+00,-3.101863669816598557e-01,7.272480160571894725e-01,-1.057555070461261737e+00,-2.390988443242978712e-01,5.000031682705239344e-01,1.070034219094509048e-01,-1.427153764185347118e-01,1.695263775691263186e+00,9.319765611548294082e-01,-1.137452500994902138e+00,4.530736005269158095e-01,9.884052711344186726e-01,5.719199382026463052e-01,1.410920292116360497e-01,1.472040826061391305e+00,-5.604125562745976286e-01,6.233606896805444775e-01,1.963561272779499323e-01,6.463276345045725346e-01,-2.012972577884517000e-01
1.051856762308051696e+00,1.657402705763904915e+00,-1.328645257455790540e-01,-5.214143278718830210e-01,4.333202763067492413e-03,1.916162356368195097e-01,1.810761851047807958e-01,1.743736939292366839e-01,1.124422224508472956e+00,-6.939119230240001213e-02,2.905161639961512110e-02,1.108476166434278071e-01,-4.399635793223721780e-01,3.349704528387005276e-01,-2.335037524231584061e-01,1.484830722018884996e+00,-7.371864401724642635e-02,-4.090416875429588317e-01,-5.436874178672444768e-02,4.639634055321446154e-02,-6.902285211882012161e-01,8.944214473837780455e-02,-7.450574897922791484e-01,2.177455079280668504e-01,1.478097525665893031e+00,1.891652190811609346e-01,-2.260116758026750605e-02,-5.561876495254953756e-01,-8.042296155398197532e-01,-9.090760460914928398e-01,4.216740290071498420e-01,2.109963295374612358e+00,-1.583478972265550677e-01,-6.553221775064388410e-02,-8.839540454639923661e-01,-6.634575418889528953e-01,1.845741746886863544e+00,6.811905715017276819e-01,1.254476605408758605e+00,3.827869467806347403e-01,7.253492648185629887e-01,3.082156543306843743e-01,-9.127746209895239160e-03,4.234348524380499024e-01,5.109674212876821331e-01,9.780722569637001484e-01,2.603305880586096688e+00,3.788740519830476328e-01,2.422304511738359034e-01,9.527339969266498398e-01,4.140833841256199577e+00,1.558044654203381452e+00,6.015597244435380020e-01,-2.815773835102373668e-01,5.903988415299510351e-02,9.761412027271874070e-01,-3.224908950152614029e-01,-2.393408541544021495e-01,-9.915021692976373480e-01,6.975018734363470641e-01,1.018281520788764383e-01,4.821641294999043370e-02,4.094374279596849769e-02,1.977315279302592210e-01,9.186649264810672344e-01,1.966923388812427675e-01,-4.001176863128396155e-01,5.578019847611400683e-01,-3.019571947892140673e-01,3.092018102115606792e-01,2.416499396747869177e+00,-4.861807711284784062e-01,-3.326366447475077037e-01,3.221633809504093060e-01,9.874245702315366524e-02,8.681526184401380242e-01,-1.066780402254484117e-01,1.888157471840737900e-01,-9.248859807098309682e-01,-4.497094954608961137e-01,8.221535907190715697e-01,-1.323530351931707094e-01,-2.508105749650716976e-01,1.361626584748317770e+00,5.666095986256375339e-01,-8.149385024832966895e-01,2.997633878312767064e-01,7.766249005390954974e-01,8.543987142307037930e-01,-6.515511955722959048e-01,1.538078804868931115e+00,-8.917059212029809778e-01,1.391391973191604237e+00,3.007592968530602429e-01,-4.526078585070165139e-01,-2.570148962100697876e-01
6.606265061716123377e-01,4.761558066228037678e-01,-3.456086929000896646e-01,-6.439326340109630120e-01,-1.371051001260376045e-01,4.029772319967191985e-01,6.445129313311509511e-01,-1.586271426184146238e-01,-4.241239637855798161e-02,4.025497278388420197e-01,1.243341730007799351e+00,1.478908349648385689e-01,-2.548083156551524953e-01,8.593738192466297832e-02,-7.462705549712608244e-01,1.960886906894453663e+00,-6.385846967008873554e-02,-2.707822818361532158e-01,6.939167011877654667e-03,-1.320581228697006448e-01,-3.307715052824551916e-01,6.386065096898321247e-01,-4.418849113896601288e-01,2.396062477406011026e-01,1.793500006092163979e+00,-2.614200675709856259e-01,2.330642442008753479e-01,-6.324372697983644542e-01,-8.956450489253481306e-01,-1.274878706818722174e+00,2.283734462137598231e-01,2.284658060759704234e+00,-2.321964713717964424e-01,2.815778661285056605e-01,-6.098248146387952318e-01,-7.748986974790410542e-01,1.339267387570982848e+00,9.684927716759799132e-01,2.490393825957264440e+00,1.324433126066564492e+00,4.776614545830636382e-01,1.922921008289315836e-01,-1.146681719997990206e-01,-3.351869389955690337e-02,7.399020717185111895e-02,7.343193408550837686e-01,2.170386775710507088e+00,-2.425258197706741670e-01,3.745286847415481291e-02,5.576089562246360209e-01,4.053093688906436398e+00,1.950850367253313511e+00,3.188368216333395400e-01,-5.703972060884092699e-01,-6.907082211229973456e-01,1.820912945583614606e+00,9.417354149097884042e-01,1.514159780656611221e-01,-8.747850425339434022e-01,2.256697649247250581e+00,3.389034739687626918e-01,-5.632921496578401355e-01,-8.485193061070808729e-02,8.124234840937334390e-01,8.360681187925254054e-01,-7.987849123786217032e-02,-9.704959614967775261e-01,2.831883858754924432e-01,1.451720067923942259e-01,7.368245666821827689e-01,2.231841099837274633e+00,-5.385424939327460025e-02,2.947219066817330368e-01,3.556681670635366554e-01,-2.845072176686426757e-01,9.837497807084822909e-01,-6.856764249159545965e-01,1.062962546773962735e+00,-9.339558437936608115e-01,-5.028709198455006968e-01,8.756534444193457833e-01,4.947689648715165034e-01,-1.944903798376482751e-01,1.662192206004012629e+00,1.258994255397008821e+00,-1.439191236593383882e+00,2.708430461489986785e-01,9.272863814737792865e-01,6.454260936230056256e-01,-1.520069757770918795e-01,1.566984321242798295e+00,-1.255908606341759604e-01,3.221735722871815755e-01,1.043007792577979598e-01,1.068269507658593520e+00,-5.306870153953330282e-01
1.050522956289413168e+00,1.053446349910616586e+00,-4.679020963499155306e-01,-9.931513772768374437e-02,-2.767620445189497014e-01,8.368402538277639469e-01,8.511956974563805733e-01,2.970899096612816259e-01,1.177078679423071428e+00,-3.681409821344536204e-02,1.100810335318739286e-01,-1.457993519112681380e-01,-4.464246936854026626e-01,2.627454605620223593e-01,-2.813623020169557232e-01,1.433808418421826714e+00,-2.097352603440341134e-01,-9.247769958600119411e-01,8.490131877909631863e-02,4.059669888960668049e-02,-6.683668203738197811e-01,2.755922991314465609e-01,-7.141574945378560413e-01,2.312336790090936955e-01,1.427864994828224710e+00,-2.264293631156683723e-02,-3.040178796243342418e-01,-6.409521111719093112e-01,-1.006962455685917135e+00,-9.116533114055570541e-01,7.428550498696455673e-01,2.253515118721007848e+00,2.240377950189343381e-01,1.963962174048930198e-01,-9.210244997040792914e-01,-7.611957976222800681e-01,2.071326333092879057e+00,4.091919157466568091e-01,1.283262691697232061e+00,1.936561914915340132e-01,1.108748698752592077e+00,4.507100600356692688e-01,-1.143596661491689953e-01,5.862900864310556237e-01,4.602141480918306438e-01,9.290736336877614132e-01,2.293481050837229862e+00,6.512252302926750946e-01,6.464963623617299149e-01,5.240821137121320916e-03,5.008619271943713258e+00,2.213478860974202433e+00,9.418654183091442755e-01,-3.109523826597591079e-01,1.294957016578077713e-01,8.748305369328962522e-01,-5.775990657954150898e-01,-5.576608519389426588e-01,-8.726542800786381004e-01,1.343737792756014571e+00,-8.730960819270147666e-02,-6.042078394880749936e-01,-3.266551160429991274e-01,-5.638811652960510346e-01,6.201212319953237628e-01,4.417564103372267903e-02,-4.348493435744887337e-01,8.830077393640627381e-01,-8.902606563553527863e-01,3.995049480988692725e-01,2.701784947741646459e+00,-8.959978023471848463e-02,-3.187578582574940311e-01,5.028641524580186317e-01,4.952411608897360207e-01,6.516572472910766578e-01,-3.965599983950712226e-01,-2.407444743676946386e-01,-8.568515852057119186e-01,-9.317628927042053144e-01,9.096471039252536084e-01,-7.733564609227847053e-02,-5.290531859076077481e-01,1.493999474213744794e+00,3.278739841935374155e-01,-1.004872661753367424e+00,-9.935972201975673546e-03,9.699037686973190908e-01,1.280495941502786117e+00,-1.540958587908580313e+00,1.649682176872866668e+00,-4.638105235329467169e-01,1.552186649489056602e+00,5.483891282165294090e-01,-1.180344937393196458e+00,-7.091845353941237384e-01
1.091500860359038372e+00,1.467082646612486219e+00,-3.099409250134293470e-01,-3.457836453013848343e-01,-2.011606508061005161e-01,5.623024752830827477e-01,5.298876837666425255e-01,3.146092836289681172e-01,1.420383430577211614e+00,-1.209889112957502066e-01,-1.587283369854522452e-01,-2.487155933473519931e-02,-4.722753650978303575e-01,2.471042167407027645e-01,-2.491498588517585544e-01,1.345436158447971708e+00,-1.711045661979422594e-01,-6.843824435326690825e-01,-5.336747534990655961e-02,3.727369469879939640e-02,-7.029026706726645424e-01,2.208262930429471249e-01,-7.563268644666134577e-01,1.700538026713024897e-01,1.501543827784428631e+00,2.191061847572643717e-01,-2.569790043577272476e-01,-6.113038145253101296e-01,-1.154904478580029537e+00,-1.015821888088295211e+00,5.981325006503710462e-01,2.240766730598231060e+00,2.813090798321798980e-02,1.334868011631772655e-01,-9.617252972393999233e-01,-6.391391670616635157e-01,2.176523586020076007e+00,4.070534199595807756e-01,1.223059110880148292e+00,1.450044477229150974e-01,9.742649371100116085e-01,4.579255173564386050e-01,-2.735186269598163800e-02,5.258483076623273744e-01,5.608780234475323478e-01,9.607876581835474994e-01,2.475374104325873681e+00,6.695883017920565283e-01,4.982880918265006343e-01,3.033769394005466635e-01,4.662408493894646178e+00,2.068078525630796971e+00,8.671845373883673158e-01,-1.957610053937136330e-01,2.206632284180929382e-01,8.464175938857949610e-01,-6.150352403436701865e-01,-5.053823626993575457e-01,-1.021914286744376454e+00,1.075202126648692857e+00,-2.549142880403690858e-01,-2.064701683443893321e-01,-7.398152963620932554e-02,-3.424616880486911485e-01,9.059845638051335914e-01,2.929638850410359319e-01,-3.353228875076401105e-01,7.811563553620149980e-01,-6.105722590313150677e-01,3.077821255901757036e-01,2.517056306687218470e+00,-2.727852836857347918e-01,-4.259211969714287171e-01,2.170885457048798428e-01,4.258079771786824619e-01,5.266827757346187466e-01,-2.910274580505565756e-01,-2.175809215129572705e-01,-1.093686133096944513e+00,-6.790109864192883649e-01,9.759317310090203090e-01,-1.382511305194885076e-01,-5.027372161228685910e-01,1.512501047282965416e+00,4.063105589602697965e-01,-9.579798013323788108e-01,1.121351239757480689e-01,7.647308380257334948e-01,1.189826492564109772e+00,-1.402551611762167028e+00,1.616315812021066334e+00,-6.928822898049620260e-01,1.635865132649831910e+00,4.748483659747530505e-01,-1.240315294797377232e+00,-5.604869897107708221e-01
5.273909157011144044e-01,-1.012575331851396365e-01,-3.176778888914644772e-01,-5.653190462704463792e-01,-2.733823777394617238e-01,6.672520460321539337e-01,9.824327609002838635e-01,-2.642370227167822883e-01,-3.838238408884320219e-02,5.272141877253052611e-01,1.238531668712945732e+00,-1.141168606694692444e-03,-2.902406231691186944e-01,-1.649388577983708082e-01,-7.691552959778474863e-01,1.768286476275710672e+00,-3.984789545819634737e-01,-2.374131874321102342e-01,4.817898043908960121e-02,-7.942803108834350923e-02,-4.021483721561377456e-01,7.834064322544112002e-01,-3.254633799340835854e-01,2.114029277439086751e-01,1.877937879939412413e+00,-3.161542658692205188e-01,2.295955061430836608e-01,-7.344278624571091152e-01,-1.260747098046852033e+00,-1.405067974690714649e+00,2.888074204486487107e-01,2.602237948391335376e+00,-1.740546629303355020e-01,4.722916922285346208e-01,-5.396017206117167397e-01,-6.867323230525826938e-01,1.366600764176036931e+00,9.289929349806433923e-01,2.749753113647293912e+00,1.536717253796002769e+00,5.675779875885751391e-01,3.786603181990340072e-01,-1.146364987705289634e-01,-1.945167412879823532e-01,1.701123895857328816e-01,6.600618349561027109e-01,2.009328239246839232e+00,-2.809844890025040565e-01,1.325497698297348481e-01,1.066199711781889992e-02,4.168091347265895585e+00,2.368128195639115141e+00,2.938865731269551529e-01,-5.394894314826912396e-01,-8.520811322243230235e-01,2.005137273863507819e+00,1.062131803484024140e+00,3.996040313620019546e-02,-6.800782615126303998e-01,2.835507832639048154e+00,2.773156529458933317e-01,-8.775147172005983709e-01,-2.068293686970817946e-01,7.364081329709728507e-01,9.538982313152237769e-01,8.890374348784041425e-02,-1.007664396618358271e+00,6.114268340390662804e-01,1.047192978246354877e-01,7.277540143468279599e-01,2.116053778517628547e+00,1.229074107077313127e-01,4.877884688230013088e-01,2.373310156188690734e-01,-1.853176609029911770e-01,7.905021754729103511e-01,-8.969618207914675789e-01,8.928614385371160811e-01,-1.117230006615193449e+00,-6.148112691469302948e-01,7.544749290295366118e-01,5.536601508276322026e-01,-3.667138250985115255e-01,1.964670572405982085e+00,1.209235438163472232e+00,-1.681058593156722125e+00,1.764999232725650291e-01,1.109248490126594877e+00,8.177913589511122128e-01,-4.217363952139960293e-01,1.609609521214277583e+00,1.983555056380654769e-01,2.053226247017566619e-01,2.497922443215598309e-01,8.325755563285688332e-01,-7.494931101265069895e-01
7.553922011566289729e-01,1.066179653489580659e+00,-1.517159071316427355e-01,-9.906397431585920454e-01,-9.734759838465356641e-02,-1.939886243254757003e-02,-7.622421913569393803e-02,-1.861026784693749214e-02,5.181161459591430152e-01,4.257999933637002243e-01,1.068794169790525439e+00,4.433946682430978670e-01,-2.685638617026728792e-01,5.851918993591264523e-02,-7.310227670615692119e-01,2.131433479871981618e+00,1.330527291525427924e-01,1.905400690506675043e-01,-1.830656720448000652e-01,-1.105137275228022797e-01,-3.845385132255047522e-01,7.245426649478129422e-01,-4.150294696762182323e-01,1.275882590090422763e-01,1.842872167697638952e+00,-1.821582386421380650e-01,3.210608556386319590e-01,-5.626956869742649747e-01,-7.952976994213669659e-01,-1.292563184943123833e+00,-9.103291857857631619e-04,2.255114290804524302e+00,-5.643215423351906068e-01,5.803993848731074656e-02,-6.092809567249299896e-01,-6.517397155605287873e-01,1.394814894200103073e+00,1.097415827060151061e+00,2.381616326773792203e+00,1.567577815114697959e+00,3.465042887629504742e-01,1.051561882309802742e-01,1.187625008192649961e-01,-9.403385527639589181e-02,7.973199712431489061e-02,6.911594965762062337e-01,2.623962546441326094e+00,-3.104697869788573539e-01,-2.316975228231855088e-01,1.193691525836189538e+00,3.574988972251625707e+00,1.588009963055076357e+00,3.467362277714767793e-01,-4.842848786449175380e-01,-7.377544663535726688e-01,1.889316672073970915e+00,1.153059928099616771e+00,2.463148957985945298e-01,-1.111807807662174019e+00,2.063298054860797759e+00,3.127455522130983545e-01,7.868229966035106271e-02,1.942679022935752675e-01,1.366956737961004364e+00,1.114576929500008751e+00,8.018596779850123424e-02,-7.963343841716885585e-01,1.258919258326208768e-01,6.697750741928918394e-01,3.561254362910301619e-01,2.210552374178644808e+00,-3.282707136421798566e-01,2.164687354506638628e-01,-5.755831637401093159e-03,-4.513221454095811547e-01,9.501061269341394278e-01,-3.656305475756359558e-01,1.403152439570998444e+00,-1.174550657492274386e+00,-4.399367929375358477e-02,9.563892419220277885e-01,6.181920710843036293e-01,-7.833619625169097045e-02,1.510916473114509717e+00,1.517184265341558813e+00,-1.344865658428292976e+00,3.816362816588156903e-01,9.196547472982404825e-01,4.007078484295362175e-01,1.184645703410674433e-01,1.770574834478757520e+00,-3.830120862227808232e-01,4.340072031762373661e-01,-8.323035489046443081e-02,1.358662124684133277e+00,-2.431768902632156226e-01
9.896052470318277283e-01,1.755698982107408046e+00,-8.144199544827399606e-01,-8.601145513671950571e-01,-1.606760896960773843e-01,3.643282263447316094e-01,7.228151232762576317e-01,2.619541269405914474e-01,1.386858197554532435e-01,-2.145718716689048178e-01,7.541779874736753708e-01,2.810700104083123652e-01,-1.854868297774004138e-01,4.983314142018520077e-01,-9.523007637903256883e-01,1.930438097980871071e+00,6.413036764873996098e-01,-9.165983900133691797e-01,-3.188852024264337559e-01,-4.987752367248784457e-01,6.032767493131008241e-02,5.667720383289898134e-01,-8.703341732073375248e-01,1.474261252128423183e-01,1.979545207819771058e+00,4.954530677301393071e-01,-2.480099491755974606e-01,-4.937282433972300932e-01,-1.455832749196029674e+00,-1.746676151725812254e+00,2.316787101206228272e-01,1.705106026674992226e+00,-1.497732560145628999e-01,5.529576457663172295e-01,-1.054626737486116461e+00,-8.073230511958915390e-01,2.213328655886025675e+00,2.697447077466444965e-01,2.255333654573032920e+00,-3.832153756281431178e-02,4.546639620420191985e-01,8.628157412031739470e-02,-2.629906243113697695e-01,3.915138524235737272e-01,-2.538696676819046649e-02,9.578521093574410283e-01,2.053018498621280941e+00,5.237660908891396128e-01,1.998740158266159583e-01,3.753249075114135636e-01,4.598870597360295243e+00,2.314184418084568318e+00,6.992089992386077979e-01,-3.092933137210826522e-01,2.614960319189719717e-01,1.147844179161887190e+00,2.601486145967346619e-02,4.018108846222875896e-02,-1.752286362662062391e+00,1.726716286078806784e+00,-9.448652338086367397e-01,-1.382537609045755844e-01,4.224586053034521393e-01,-1.525477934155646809e-01,9.841716201554061572e-01,1.337587571495717498e-01,-9.116110654530211743e-01,-4.866264292769336697e-01,-9.704425937007626901e-02,1.267133434065884856e+00,2.158130031620292488e+00,-4.439155653913395838e-03,-5.136488687416369547e-01,-5.223553711052156268e-02,9.946595246728025252e-02,2.834192284742278467e-01,-9.795855823703898402e-01,5.746164216434507255e-01,-1.337814263571501128e+00,-5.910876865834437943e-01,1.908535265427417915e+00,2.767894082362750696e-01,-4.009816024102517140e-01,1.571457727435905616e+00,1.304980153473264348e+00,-1.416442211484266300e+00,2.971503802551282991e-01,-3.750656729006756063e-01,9.555789323791543666e-01,-1.048760593007054931e+00,1.250465235083484838e+00,-5.984964201404480155e-01,9.003945467125393787e-01,9.258219396286349046e-03,-1.512353268101759851e-01,-7.501154643069981587e-01
9.830558620888263377e-01,1.366867491099648557e+00,-2.158218362325630135e-01,-4.336431846865220763e-01,8.915005879225539054e-02,5.786469756456416591e-02,-7.724476845210398457e-02,1.014196275712075379e-01,5.359109607388061747e-01,2.497564265752282020e-01,9.384602998571183186e-01,2.729436384564673523e-01,-3.127611806797109817e-01,4.952826324259604895e-01,-3.511012490675702313e-01,2.156967142477560273e+00,2.310163592510394159e-01,-3.049032814806857394e-01,1.215613948539762679e-01,4.138595554911368019e-02,-5.615098266645582870e-01,2.009951352069089536e-01,-5.957249112452631667e-01,3.357385905714367347e-01,1.322403888043264919e+00,-4.435273739748173405e-01,2.222549444731075907e-01,-4.851208806083622260e-01,1.610041661593917262e-01,-5.472081100580341584e-01,3.494812358856733137e-01,1.891204454363381693e+00,-1.863137432808593952e-01,-3.388227472715008015e-01,-6.807931502259046974e-01,-9.386796294860377809e-01,1.192537167680923105e+00,1.151791438245083565e+00,1.426850651308539497e+00,1.047964112312624874e+00,6.238451654117598277e-01,-3.189198698138656640e-02,-1.300772399511444799e-02,4.077624011917119207e-01,1.057458653092447909e-01,8.646248726349552438e-01,2.684120098779841257e+00,-1.144136271245398961e-01,4.389830230878903616e-02,1.592458917656819128e+00,3.992133309515806250e+00,9.680603208033441431e-01,5.105031475685881670e-01,-6.437136255499413817e-01,-4.434095622551657012e-01,1.306571138486978700e+00,4.190408175180712069e-01,8.848720572489490732e-02,-8.434043219565607874e-01,8.358638041059669455e-01,9.467988722941355073e-01,-9.540123154246266113e-02,-2.104853080647874630e-01,8.241540209673914319e-01,3.944704134952619068e-01,-5.021089739834678767e-01,-6.326289006010989979e-01,2.868280710391374333e-01,-1.365468721195494950e-01,2.567224315632706255e-01,2.786535733572771179e+00,-4.916276150031916869e-01,-6.465732304872226499e-03,8.861813087263548105e-01,-3.109223562471604696e-01,1.607457980513898210e+00,1.047833872672296329e-01,1.059581901460555198e+00,-2.913172845458283922e-01,-4.051645270664403498e-01,6.120312649063305299e-01,2.164850261717376489e-01,1.237460669402911662e-01,9.490276215657138525e-01,8.884767291065793771e-01,-7.014350740493573433e-01,3.122753384977486890e-01,1.275273920106773318e+00,4.173792306346131298e-01,1.994077125863206734e-01,1.722460553635244640e+00,-7.502711816553179203e-01,9.091980498239329300e-01,5.437902702891500573e-02,1.105734496512502441e+00,-1.701568996766023023e-02
7.390789800646118124e-01,7.116773031842011932e-01,5.163632479623235516e-02,-8.176709831185187127e-01,-2.055333079291697396e-01,1.123966677451583851e-01,-1.842811318079207727e-01,2.564147269091113235e-03,1.101078743000880600e+00,6.100589188788612116e-01,8.621904707196818007e-01,3.589458442167938190e-01,-3.728796653060131305e-01,-1.695508224090977456e-01,-5.196305684286681714e-01,2.005551925143699954e+00,-2.324925288391433975e-01,4.179096379117210880e-01,-8.542649727818747707e-02,1.176361199865181006e-01,-6.906355575428870797e-01,7.754201067340265041e-01,-2.605947095499844823e-01,9.813218353365969759e-02,1.703973567328904481e+00,-4.396925439365748089e-01,3.533581164592798363e-01,-6.354712556272255064e-01,-7.044901137431250904e-01,-1.045768257401476165e+00,1.091638596419844121e-01,2.600073745202615250e+00,-5.462274820823751487e-01,-8.183861837650685533e-02,-5.011261203959912480e-01,-5.599131616209748197e-01,1.329970458605418182e+00,1.223599355857381443e+00,2.160645618050697436e+00,1.957238947210987678e+00,5.736215642926529856e-01,2.670299499955140488e-01,2.808910933586044600e-01,-1.414917514575045332e-01,2.582175517731735148e-01,6.002123373768618597e-01,2.831729627347965739e+00,-3.608860592757278107e-01,-1.529294580798022940e-01,1.078710984474889667e+00,3.582910146314123523e+00,1.588257304821020677e+00,4.425457072002266790e-01,-4.664244218341968007e-01,-9.534788609347378818e-01,1.966679766214184832e+00,1.186937724084264234e+00,3.784168927408113059e-02,-7.876409026879006570e-01,2.226503406539668273e+00,6.455532699032884292e-01,-1.027647174172446887e-03,-4.889445125746780252e-02,1.480677988543884549e+00,1.117985839067625609e+00,1.386929125698057874e-01,-5.928469874121099492e-01,7.042564812434779498e-01,6.152520491268905767e-01,-1.430056058839841437e-01,2.382167971440262821e+00,-3.683835197128194627e-01,3.948346261892641818e-01,1.205812642081946495e-02,-3.607195343435032897e-01,1.018661882464164892e+00,-1.190797357497278552e-01,1.262857096435027859e+00,-1.158788802432655363e+00,-2.251570753771181543e-02,5.610484529183599189e-01,6.345109720693840050e-01,-1.400551930188203287e-01,1.545298086238293456e+00,1.299420674313318536e+00,-1.294124754961834434e+00,2.571207003184903250e-01,1.558509822037192238e+00,4.687207653678946984e-01,-3.456734820498275074e-02,2.065012861254835741e+00,-2.338880214396491242e-01,6.051100686582000510e-01,8.251905666607500800e-02,1.139283797765164197e+00,-2.133231854922438275e-01
9.222224734650230626e-01,1.582736064562990208e+00,2.661023655190684900e-02,-9.582524312615405826e-01,-1.256982892431157406e-01,9.414425176102420023e-02,1.023819025708390118e-01,1.116731693094672739e-01,1.415237346196425605e+00,-7.659375590001349376e-03,-1.963718824680378838e-01,2.141828590399502408e-01,-4.658128881993352510e-01,-3.636779597207914771e-02,-4.060649042193194003e-01,1.274887526570062990e+00,-2.640347989163190912e-01,2.993653778906676943e-02,-3.163668922646744042e-01,-7.289418202774906874e-03,-6.730878057199041198e-01,3.983317031927554597e-01,-6.386187462092687284e-01,3.233930096218431971e-02,1.850166901350250859e+00,5.202337125718541344e-01,2.307670103076156498e-02,-6.263477503475683994e-01,-1.657749320174502383e+00,-1.458287367453818373e+00,1.745213227180510973e-01,2.458870044266662447e+00,-4.679602348100850850e-01,1.999240208091075943e-01,-8.668970795386901074e-01,-3.587162595233075457e-01,2.122944151160864656e+00,5.819576704679785273e-01,1.789278216446745340e+00,6.589558946177416221e-01,5.555427698246584445e-01,5.010081647374472480e-01,1.386643241868658061e-01,6.017188881251377131e-02,6.468363041138862624e-01,8.800677780618991752e-01,2.648442699622055585e+00,3.360230576379003575e-01,6.060873684643221931e-02,6.486182515252847391e-01,3.765596305088094287e+00,2.027619578210692275e+00,4.944420107463615710e-01,-6.293454329210007581e-02,-5.145602034397189772e-02,1.304689662452751753e+00,1.319714584958997516e-02,-2.185516021321561309e-01,-1.178353669898840828e+00,1.413081125294889384e+00,-4.669214534440607745e-01,3.112181594768017590e-01,3.970480414634669497e-01,5.391665112424387507e-01,1.598628813617772204e+00,8.178663796903400396e-01,-3.904672904300627856e-01,5.857676189574547720e-01,2.858324236094591519e-01,2.587512797990960123e-01,1.926269803994837382e+00,-4.512316423877089089e-01,-2.466323004261399832e-01,-4.691114399785215605e-01,7.504762387812023705e-02,2.652264484881505791e-01,-3.739411837256196858e-01,2.256269887840209876e-01,-1.708156863620642785e+00,-1.277315893885541676e-01,1.027006977876915972e+00,4.229280696973300446e-02,-4.579825179112285705e-01,1.829953516450985695e+00,9.004898670251024750e-01,-1.234642331842714436e+00,3.648525907098174592e-01,5.000982462817895602e-01,9.076743324987732731e-01,-8.397714552646728947e-01,1.574137770733582409e+00,-7.281533266419721873e-01,1.227700723519131731e+00,2.660214803648985882e-01,-6.463050822157843101e-01,-3.926354889431383222e-01
1.006852887287478460e+00,1.771130141732516261e+00,2.884411997219952783e-01,-7.912477823842838376e-01,7.997049572845342513e-02,-1.918305350184792979e-01,-4.302555902749491401e-01,9.788798766254830364e-02,1.600526365658053729e+00,9.783208289429699833e-02,-1.712962774760767304e-01,2.740310840799519143e-01,-5.123515631901787160e-01,1.223008157376874044e-01,-9.386367809601059431e-02,1.438765527789426901e+00,-2.755219323946027643e-01,2.557780402468571301e-01,-1.346794393731169381e-01,2.130781472144342437e-01,-9.279515385601854183e-01,1.039826722366011258e-01,-6.031817424748321388e-01,1.411148225443386028e-01,1.489540544717559367e+00,1.624579378838922339e-01,2.248216915076877431e-01,-5.642724828327032593e-01,-7.302706646841912175e-01,-8.283088392530811861e-01,2.117258157505135796e-01,2.351428100504813656e+00,-4.981839552488985801e-01,-3.144034018051710677e-01,-7.537959970161646206e-01,-4.665489910931368556e-01,1.666314943978537633e+00,9.804183861063482386e-01,1.212287198674115052e+00,9.540700411380759194e-01,5.894140995092966850e-01,3.538839967017350374e-01,2.381446172941961148e-01,1.814011842764430837e-01,6.805690387391474250e-01,9.011591394936021571e-01,3.014639262725396396e+00,1.031034549987365628e-01,-4.285338089784508642e-02,1.501361030694144727e+00,3.440306363552366076e+00,1.176696695827888384e+00,4.205540560024184638e-01,-2.187332548614723260e-01,-2.300741510203491158e-01,1.221188145854024354e+00,3.755264597487756317e-02,-1.520219421364228662e-01,-8.702539949973129296e-01,5.887991916062815800e-01,4.077757746400268446e-01,5.095494606354480371e-01,1.809873861938908479e-01,9.626524659285748964e-01,1.263314023150311050e+00,4.499279119704134855e-01,-2.272244601485102766e-01,7.645265481110260497e-01,2.411939590224588537e-01,-1.780517416831226551e-01,2.268373893996906698e+00,-7.846956237058082539e-01,-1.578870426068055277e-01,3.931929928019625708e-02,-1.432053631224438073e-01,9.693142203735524154e-01,2.431385312399818033e-01,4.708034961437952415e-01,-1.119555589701180409e+00,-1.288707521338194883e-03,5.005140041501281445e-01,-7.023734521572694289e-02,-1.298623161992656372e-01,1.376141284025326206e+00,6.870682097646504394e-01,-7.447704444104525923e-01,4.303678104823144279e-01,1.116206521824912423e+00,5.879774751039574809e-01,-1.460198210572344890e-01,1.732561106993292910e+00,-1.016945630613329543e+00,1.340732047948527406e+00,2.237149717695809392e-01,-3.940582179876161995e-02,6.557447064052290830e-02
9.575843749230712465e-01,1.081551407680466426e+00,-5.122078099614447710e-01,-4.524458965136612942e-01,-3.141628740577159795e-01,6.813684815137184270e-01,7.481431859737446288e-01,2.539812162521774552e-01,9.516891284398327766e-01,3.416171949331414659e-02,3.772833382847125550e-01,3.599125187212520033e-02,-3.667577278133501428e-01,1.672055215770981706e-01,-5.588879199960103961e-01,1.615474450184520849e+00,-3.126182492960549730e-02,-7.054923886728239335e-01,-9.246706986187011590e-02,-1.151265931162554490e-01,-4.549427320796726182e-01,5.436557230837996135e-01,-6.579629901996774111e-01,1.459108094710664660e-01,1.702641362605792574e+00,9.347845343728300449e-02,-2.271635017433844828e-01,-6.278053203822069328e-01,-1.311363115494416753e+00,-1.293816584205482068e+00,4.992539803654363340e-01,2.253056041697020895e+00,-5.436567470240238897e-03,3.590175652956056895e-01,-8.968755366888415681e-01,-6.928433610705392320e-01,2.100836594108585587e+00,4.257102991238521650e-01,1.821232326575914939e+00,4.333627014201978378e-01,8.706033495950271650e-01,3.843199803544530835e-01,-7.805673905273097235e-02,3.668571430867022531e-01,3.080727703631426229e-01,8.537297352157132702e-01,2.268651898330739769e+00,4.971483890907855141e-01,4.249098156121199343e-01,4.489635569308625396e-02,4.742482568242072816e+00,2.365467708448136364e+00,8.368369117427648662e-01,-2.912697441611347138e-01,-1.447375888998425619e-02,1.178842908548889623e+00,-9.739023598271778770e-02,-3.467263581283643870e-01,-1.135732961342550196e+00,1.870301115574951822e+00,-3.800947373047944833e-01,-4.302340636001423246e-01,-5.478714472105368494e-02,-1.846726514160819121e-01,8.994080690728905036e-01,1.937306526409937335e-01,-5.979976574751583174e-01,5.256908229892177653e-01,-3.992818169594448130e-01,5.622690772874655574e-01,2.443227985534158986e+00,-3.032252439361560192e-02,-2.428688797383252718e-01,1.205816252173487063e-01,3.145071064909663039e-01,4.294074955085238066e-01,-6.282756661983424085e-01,1.634103391786797532e-01,-1.205465269286634555e+00,-7.038086715274873839e-01,1.206155067174309314e+00,1.884424149940829851e-01,-5.273833256575131134e-01,1.648521262776901919e+00,7.946625840092125248e-01,-1.295203199144125739e+00,7.702927913131119020e-02,6.521957145634935671e-01,1.147889186450770316e+00,-1.369608139982686934e+00,1.634179759840214574e+00,-3.533376424400860305e-01,1.213213731557582831e+00,3.559284714457214283e-01,-6.951974129092886034e-01,-7.538886370333818254e-01
8.090130052839492603e-01,1.031828308974177544e+00,-1.242905853837505820e-01,-9.379437758355440025e-01,-2.318333337251690662e-01,6.899794471193337886e-02,-2.267035485736658695e-01,1.266667331403518448e-01,1.057944232361486048e+00,5.072391508000876348e-01,9.281137182841499023e-01,4.683121637038513696e-01,-3.146972931233023574e-01,-5.619520855235742018e-02,-6.679199166488039019e-01,2.162019269592510895e+00,6.823393936318078445e-02,2.904636281173000323e-01,-1.953734738938867344e-01,-2.461974843006719399e-02,-5.083583911407747458e-01,8.633326402447847325e-01,-3.405658169599863894e-01,6.217608899709028969e-02,1.796281938716309146e+00,-3.132012696550594555e-01,2.530266736168096386e-01,-5.827154461442833888e-01,-7.890072192455879208e-01,-1.214157121392277716e+00,5.202204161418910733e-02,2.408014520478149123e+00,-5.729403689149723533e-01,-4.251561840054651764e-03,-5.936840634477793532e-01,-5.976269555891606799e-01,1.508322572655236060e+00,1.088364447072913244e+00,2.242049161406641566e+00,1.734276135312297296e+00,5.204459769464017116e-01,1.705436259941324195e-01,2.565205670355105716e-01,-6.243940389664572044e-02,1.213889497133187612e-01,6.191577089310139614e-01,2.815184511163148606e+00,-2.369794219308362093e-01,-1.751448089556291166e-01,1.103970287574270515e+00,3.696936743597013741e+00,1.664226379020551594e+00,5.491561563783367017e-01,-4.418542207482369921e-01,-7.934983773478481162e-01,1.895395206585065884e+00,1.153224756531273432e+00,8.678621766226421452e-02,-1.088127303994030237e+00,2.269011137974332293e+00,3.247818205606033404e-01,1.312569289279163498e-01,1.083053755932187889e-01,1.369591693227961926e+00,1.134720921381946246e+00,1.185430165601607522e-01,-6.409846411987327741e-01,3.707626889183634478e-01,6.773314428454927372e-01,1.462271243516571895e-02,2.388075893586533383e+00,-3.257923170692804682e-01,2.280669137923378442e-01,-1.168476264821260435e-01,-3.360080049721806961e-01,8.620253300991033152e-01,-2.239351641240303059e-01,1.350090039719886503e+00,-1.267401855026140556e+00,6.334920207513417001e-03,9.106683082860957956e-01,7.093652296036834226e-01,-1.544631651880561396e-01,1.486685902626956102e+00,1.476195182318453814e+00,-1.348090021980417275e+00,2.661944150307735124e-01,1.209039089692606428e+00,4.749104027064596778e-01,-1.764050845834654602e-01,2.030323676221215123e+00,-3.008131578873864398e-01,6.377498009400235368e-01,-2.354641131929291475e-02,1.114534977365602586e+00,-2.669103076958558307e-01
9.267880228830573941e-01,1.927655066343680446e+00,1.380308271100643136e-01,-8.821518994642316702e-01,2.593781131576003429e-01,-9.690875893235634253e-02,4.077671320913032194e-01,-1.665400508549620406e-01,6.614793815431198043e-01,-3.771936238527755503e-01,-4.944611993775375747e-01,6.457288862928511897e-03,-4.856899248662889246e-01,2.792358523554268612e-01,-2.133002187996868304e-01,8.193116520483996190e-01,-3.539173224585715483e-01,-2.857184620150011733e-01,-2.186954294087949946e-01,-3.743507073542753222e-02,-6.649032293463580379e-01,-2.631383711725843177e-01,-9.190828042353649252e-01,2.134433979354616873e-01,1.745989420304547846e+00,9.716330535555696146e-01,9.279809421152737658e-02,-5.922122224238123289e-01,-1.633203275984525860e+00,-1.371101502120271931e+00,2.280932882529576600e-01,2.152326763229019946e+00,-3.289764933106562594e-01,1.846833789990049712e-01,-9.859037522238005558e-01,-4.214721594201937815e-01,2.007450182373005099e+00,5.043184043067627798e-01,1.483737397978947437e+00,-1.173530538058433770e-01,3.336923440345364589e-01,4.946207053307280499e-01,-1.614594774849947290e-01,1.706739401400151901e-01,8.587276208011664913e-01,1.165612082356551671e+00,2.329937289552197477e+00,4.205378336401655592e-01,1.025721065794182318e-01,8.805053765058734605e-01,3.555455774175433348e+00,1.709792730736665378e+00,9.318307550849447285e-02,-4.087538774219362514e-02,3.686614336885767340e-01,9.019233834032651664e-01,-6.447371532107422087e-01,-9.777547414866319397e-02,-1.063346989613013882e+00,1.929698111831192886e-01,-4.387944976597640823e-01,2.799638173906803251e-01,5.145327033350327595e-01,1.716168972096002721e-01,1.545987648985388763e+00,8.691123181327241598e-01,-4.727551917129126924e-01,3.961996923292817607e-01,-9.542268090691494176e-02,8.262307801677861718e-01,1.589676646012082362e+00,-6.363357282401320703e-01,-4.696740558339210225e-01,-9.796675007820740411e-02,2.539863737573549995e-02,4.887277502432270104e-01,-4.314727448946338306e-01,-2.260628823536050547e-01,-1.397987999049687957e+00,-3.295377801244793181e-01,8.845051264623952081e-01,-5.546649274992889733e-01,-3.369529141317522680e-01,1.823433376369571590e+00,4.904110787968708474e-01,-9.168559729345154841e-01,6.185396137810812434e-01,-4.654856420002451145e-02,8.975005954967789634e-01,-3.949104135051869635e-01,9.314049526265620882e-01,-1.200435351407567186e+00,1.245309866785393460e+00,3.338568437164546321e-01,-9.132428188142178715e-01,-2.393080722779092617e-01
8.376688324124480500e-01,2.987269290746332739e-01,1.418784053473122198e-01,-2.021026879862356518e-01,-3.831886810500617080e-01,7.109052055643244605e-01,3.348994071196746414e-01,1.082686905136013844e-01,1.954437995659267902e+00,4.948829264855781895e-01,1.005196801337104873e-02,-1.060439902419665903e-01,-5.933306132388375120e-01,-3.386353076134012707e-01,-5.250165926259237059e-02,1.315145828581017362e+00,-9.116942875930695855e-01,5.231940208475929777e-02,1.392150120428378157e-01,4.251683926805422398e-01,-1.166300263767108270e+00,5.229939670148491260e-01,-2.885017865495409506e-01,1.229613934960836208e-01,1.399275928209968711e+00,-4.592313852780752215e-01,6.134805810048818420e-02,-7.780208638614003469e-01,-9.614038828752595744e-01,-6.980388960907770723e-01,6.083159223989302866e-01,3.010006881444122762e+00,-1.097704002497892350e-01,-6.189276780926458721e-02,-5.744750600907861937e-01,-4.648616021839084289e-01,1.676178751378471166e+00,9.245099844636649467e-01,1.413752829984207260e+00,1.513872106705139053e+00,1.163178032544917695e+00,6.942905649653730027e-01,2.800405990941265966e-01,1.114057354370601299e-01,7.406079009908073107e-01,6.687858900209447954e-01,2.768901570592676276e+00,1.260950141820012527e-01,4.062675759895776340e-01,1.894396248565041740e-01,4.291018217407746249e+00,2.038457141546849094e+00,7.590295429442046604e-01,-2.981620190090356615e-01,-6.504205557461135712e-01,1.492766533424911168e+00,2.052716873455626423e-01,-6.112069666724749828e-01,-3.030325710390114891e-01,1.977784981924709751e+00,6.415955805874435924e-01,-4.744173483887927367e-01,-5.117265956827062867e-01,4.954953901724140075e-01,9.911328725475158086e-01,3.428356770870554238e-01,-2.083192913835187898e-01,1.736232738391895847e+00,-2.813009703462481803e-01,-5.138048204892092796e-01,2.638790526017886329e+00,-2.762538449336836011e-01,2.820679445682844344e-01,2.143938063178984499e-01,2.608904670104814083e-01,8.148117911006443892e-01,8.948229030932008943e-03,8.483148250060906781e-02,-1.088274434291846005e+00,-4.952192629498530230e-01,1.227910431592827978e-01,1.812695901505220752e-01,-5.002283548818338144e-01,1.717676887498301941e+00,3.860089159876674003e-01,-1.113031087319906742e+00,-3.698887751868301654e-02,2.094390966771809914e+00,1.067476833800941272e+00,-1.104896330578949426e+00,2.172807379902771174e+00,-1.371703693405217361e-01,1.350598675232667967e+00,6.363162425225454832e-01,-6.352164759078151590e-01,-4.768820924375602455e-01
8.805502342500134416e-01,1.102943552007591865e+00,-3.772962702919198108e-01,-7.283438476611334700e-01,-2.268418551069135147e-01,2.789874179364182361e-01,1.450756454852832611e-01,1.866327589325557645e-01,7.705235048443188628e-01,3.260511623807173520e-01,9.481556891212177263e-01,3.435819485830899356e-01,-2.822356637049380224e-01,1.528421840807175913e-01,-6.908480855005587618e-01,2.134758829360949406e+00,2.101703300253962570e-01,-1.955569986424524065e-01,-1.281643004541044295e-01,-1.180704881632017589e-01,-3.830848751539938091e-01,7.362026984301646149e-01,-4.871959141493200085e-01,1.348364952914462012e-01,1.732615362851456231e+00,-2.406035365897333522e-01,7.772197963369638363e-02,-5.617202158843044302e-01,-7.690173606538001083e-01,-1.195666320755768508e+00,2.174242524519270914e-01,2.186336443843294841e+00,-3.237553278093104336e-01,1.054720630119236752e-01,-7.113185942013506846e-01,-7.389847262122654081e-01,1.638142839187575195e+00,8.747220799547020809e-01,2.108940886155412642e+00,1.210594600437788104e+00,6.157829458894393815e-01,1.336990258821272870e-01,7.491952884986916028e-02,1.623011244521648244e-01,5.424316173635718163e-02,7.181568970322845802e-01,2.564004096012601597e+00,-9.801057170564161924e-04,3.360072223368613942e-02,8.370941444813067012e-01,4.151703634212461580e+00,1.812598712315211857e+00,6.619903432800812171e-01,-4.701543913681106579e-01,-5.044472985905397167e-01,1.615719605094221079e+00,7.479456077682045123e-01,1.187376722630627268e-02,-1.161692670209532929e+00,2.059867583214153086e+00,1.455592087964013015e-01,-1.218152914485408356e-01,2.261736690337018754e-02,7.862913623537904906e-01,8.760678630612848128e-01,-5.636627730930260372e-02,-7.119794381921478177e-01,2.335389865016521682e-01,2.334630046040283013e-01,3.402360048023852501e-01,2.500985213667162199e+00,-1.916611888793578189e-01,3.789193490034652861e-02,1.376814356239077775e-01,-1.566582676126021534e-01,8.449320940768513255e-01,-3.847624795060995417e-01,1.067631168784648477e+00,-1.069084500184145581e+00,-3.061190007322203144e-01,1.093260509452540719e+00,5.607881922761053239e-01,-2.098812591742019729e-01,1.417905149609751225e+00,1.294773181833967168e+00,-1.287410581827561851e+00,2.046714756122645085e-01,9.457945208896508804e-01,6.526708239094383135e-01,-4.850478890287928113e-01,1.849199294810505156e+00,-3.385289837674778091e-01,7.692615197646208713e-01,4.404959749513531753e-02,7.260808920820451817e-01,-4.247799692305606056e-01
8.743681410071948434e-01,1.539275530079128984e+00,-4.606688018506719384e-01,-9.777602791624870893e-01,-7.157916748758985648e-04,-5.929174683832633130e-02,4.072695831671163669e-02,8.309789371610110109e-02,4.966516925753761136e-02,1.866945569133378058e-01,1.254784936573475118e+00,4.969922320137832306e-01,-1.672740051852329435e-01,4.236741193645975900e-01,-8.687569765579159498e-01,2.336085211182842958e+00,6.046142206750040327e-01,-2.516782998929608661e-01,-2.094534804664821004e-01,-3.188874271710749331e-01,-9.723015317939032176e-02,6.006010261586680610e-01,-6.245746076531357716e-01,1.962190585367107887e-01,1.834680951945787619e+00,-3.203600008944230276e-02,1.877372864200068381e-01,-4.609103922669907094e-01,-6.194076024027685978e-01,-1.341463956595265961e+00,1.909505710276115931e-02,1.784333853795762703e+00,-4.420232568608982726e-01,1.074671452684548001e-01,-7.637242261394264764e-01,-8.458189295412854580e-01,1.490540005307080307e+00,9.263137471337556939e-01,2.314729930163635707e+00,9.883858789039035031e-01,2.641189663500372875e-01,-1.079513410313931998e-01,-6.756891206763002145e-02,1.539172906072771019e-01,-1.409570957366217403e-01,8.148536894983030576e-01,2.447280196149168141e+00,-1.281063547505852662e-01,-1.855889842526124434e-01,1.336784493325810619e+00,3.842791076817309914e+00,1.494912348884679165e+00,4.166464819897044425e-01,-5.440119631734179340e-01,-4.010611975950389430e-01,1.613306805790838627e+00,8.811782856380210305e-01,3.606137321404558893e-01,-1.431710400768766211e+00,1.663575974842864680e+00,7.216064708505225134e-02,9.323163530015343703e-02,3.024125046745922418e-01,9.945082671190135226e-01,8.613745729806705498e-01,-1.841494337539988368e-01,-9.374389478747662263e-01,-4.270106383991686405e-01,4.492997195796400445e-01,8.001050594524743431e-01,2.296224547568191277e+00,-2.833151968969837009e-01,-7.066945302151046715e-02,2.081136304161929629e-01,-4.341932283025811690e-01,1.004150302796289473e+00,-4.932916650212995080e-01,1.435229436448141938e+00,-9.595607636480975033e-01,-1.993233323209090968e-01,1.354204539283406117e+00,5.425423564260858367e-01,2.665121959708860455e-03,1.284770773329550586e+00,1.577873358729938946e+00,-1.236398238296634311e+00,4.291043082836822897e-01,3.775378923478236448e-01,3.892322860074218238e-01,1.100518154271115656e-01,1.530456159202861377e+00,-5.977579448305129217e-01,4.703748845235571352e-01,-2.091388790999174074e-01,1.401499927970607962e+00,-2.672443770725101420e-01
6.275461635648108549e-01,4.425631751382446133e-01,3.574280896608824087e-01,-8.580266431161256424e-01,-1.827700848142416734e-01,1.148418573042653545e-01,-8.285654851253521080e-02,-1.876080423629978566e-01,1.292092062168490596e+00,6.284775399810785812e-01,4.518640104684225056e-01,2.116354061824887722e-01,-4.817922376943997165e-01,-4.290033093266214514e-01,-3.554369282939072727e-01,1.533656841203558496e+00,-7.294460310325587837e-01,6.739656646566353215e-01,-8.407899328572290831e-02,2.611087914275495581e-01,-9.258744787351866901e-01,6.664729829724784782e-01,-2.015134978525663922e-01,6.909684998225519570e-02,1.754720207206993621e+00,-2.552701976920637161e-01,4.471323342048321159e-01,-7.316744617122753480e-01,-1.128760639297035295e+00,-1.120419406496566017e+00,1.008753256284723454e-01,2.955641931710649928e+00,-6.132650711912186470e-01,-2.258455094461372936e-02,-4.489512897649209910e-01,-3.476881511743754594e-01,1.352214305403131478e+00,1.233734167856286090e+00,2.178000817982446158e+00,2.065605138824146980e+00,5.574435266980547476e-01,5.226758193051839196e-01,3.271162998018920520e-01,-3.511108008233230771e-01,5.896335059278260404e-01,6.080345124419745950e-01,2.815723360650169482e+00,-4.029572402597709213e-01,-1.529031893727318958e-01,8.493426883981149977e-01,3.296498824073449629e+00,1.745263814280315851e+00,2.383984135808548677e-01,-3.284182564687779249e-01,-1.009847366182795358e+00,2.041605020779519108e+00,1.096409883535216512e+00,-6.245603884375116460e-02,-5.282230954502984410e-01,2.224141979551365722e+00,6.267918076982458286e-01,-1.182542262783620179e-02,-1.885068303764881464e-02,1.561784109612270433e+00,1.467147544278941451e+00,5.594128772819469964e-01,-4.892678245129208348e-01,1.130718201951907087e+00,6.838408538757660970e-01,-2.605075698283969565e-01,2.060135538031883318e+00,-4.399049280845240273e-01,5.145473434476414143e-01,-2.107664228903744774e-01,-3.211120982601201046e-01,8.475942831035949698e-01,-1.416769103878522396e-01,9.260124350362792800e-01,-1.423179077664917802e+00,3.730595837892980438e-02,2.557342674705508356e-01,4.496012570395198638e-01,-2.608773621066645676e-01,1.873385203717776060e+00,1.092754592373307077e+00,-1.361837193092382492e+00,3.094790178431129912e-01,1.672239536976615648e+00,5.683071740076277578e-01,-5.044435294906352008e-02,1.987984352516925401e+00,-2.042897234844268661e-01,6.174904941809370440e-01,2.521714513156798620e-01,7.230814471324431558e-01,-2.222599560038319710e-01
5.248423893086868741e-01,5.505936890862028754e-02,1.596032048877310539e-01,-5.670418674277740712e-01,-4.579942686807106367e-02,3.717509640858795428e-01,6.693101051652470268e-01,-4.399088691127212014e-01,2.606382948903109842e-01,4.887864283155887168e-01,7.135102334521961076e-01,-7.772073035102833316e-02,-4.270991308462758207e-01,-2.248898092750445388e-01,-3.884842043940989198e-01,1.355706360133887456e+00,-8.041447347143430013e-01,1.215116052526291346e-01,1.167836026229189250e-01,1.662036939941067271e-01,-7.681753513304370173e-01,3.766506310384207246e-01,-3.331608587907107788e-01,2.552754509859827547e-01,1.703213925991949873e+00,-1.944491474559155164e-01,4.302086777560645281e-01,-7.562914250263343963e-01,-1.113569406576455201e+00,-1.105999286007097737e+00,2.743121059100860903e-01,2.764655481004159476e+00,-2.857842700952581971e-01,1.821310200825547454e-01,-4.820256815279365670e-01,-5.393829750619191232e-01,1.173947126853034373e+00,1.133753672301341275e+00,2.292865106911482709e+00,1.600077149603680748e+00,5.101800224118560045e-01,5.083236649649475192e-01,-3.027490429671322869e-02,-2.691329230553933805e-01,5.476584237302133396e-01,7.470858909629434219e-01,2.245108904647815873e+00,-3.900424026951698764e-01,4.244628182218028456e-02,4.723614020133237723e-01,3.610109122134016690e+00,1.888401432497451848e+00,1.997480042249066834e-02,-4.575151239662791913e-01,-8.585824001652018200e-01,1.895356993209903695e+00,8.138913057209096191e-01,9.334537408652462953e-03,-3.373447065410342116e-01,1.993891847727919941e+00,6.929418194797689612e-01,-6.057475658557582854e-01,-1.947351207453598132e-01,1.024112025914018620e+00,1.136687749348171295e+00,3.254832449920053716e-01,-7.754199880118474164e-01,1.008595566583084135e+00,1.439837151859588993e-01,4.132201284840978928e-01,1.950890206177392505e+00,-2.406376307543745818e-01,5.256956624366424524e-01,3.052871947359753202e-01,-2.851936183264424107e-01,1.038390805630591274e+00,-5.012377194033832417e-01,6.485686514849344775e-01,-1.026947629065976475e+00,-4.365167894243956459e-01,2.079990843705295522e-01,1.923636336863437102e-01,-2.530979469109470581e-01,1.956016448621888948e+00,8.444167847670650540e-01,-1.354374545063821600e+00,3.370465546255969613e-01,1.389847186591977479e+00,6.962688223052593273e-01,4.346850820358072465e-02,1.528143571331571193e+00,-1.381129951549210366e-01,3.763229178554467480e-01,3.590215082594635509e-01,6.904577272975085389e-01,-4.056328901888163196e-01
7.234755047834172670e-01,1.476086265451691304e+00,-1.336106360661321601e-01,-1.099265713465849448e+00,2.489860840848199808e-01,-2.189277336156477127e-01,3.384406033874120534e-01,-3.050241659364562041e-01,-3.958980746855647048e-01,-2.958104992860144389e-03,8.081406136267033080e-01,2.841368010860745308e-01,-2.463775080712584387e-01,3.408249541689441497e-01,-7.144601095488397613e-01,1.666656813929387138e+00,1.426398640520782912e-01,-1.476899307026188213e-01,-2.104581341937615258e-01,-2.734902671987628486e-01,-2.153166798805096205e-01,1.857533360728093053e-01,-7.256340978995585722e-01,2.554154349363895182e-01,1.934315240630474886e+00,4.775683944976269468e-01,3.495812510148061936e-01,-5.290000209685226107e-01,-1.146148580655867777e+00,-1.524406254827158858e+00,-4.647238142407994488e-02,1.925150254055696841e+00,-4.944941494112796709e-01,2.417747705218782350e-01,-7.798179341148140375e-01,-6.642823769885289886e-01,1.445396650464729760e+00,8.848690381957385886e-01,2.382500897762141356e+00,6.822600968153850198e-01,9.361156934879266700e-03,1.058708375505506560e-01,-2.173921156035140689e-01,-6.675603510881514269e-02,2.398697202656306648e-01,9.751626044683316952e-01,2.183861163282362128e+00,-1.781531699691216442e-01,-2.382922644083400598e-01,1.241917772161944988e+00,3.352338666706420334e+00,1.531909073694541323e+00,-8.335252054924985332e-02,-3.973192337033393806e-01,-2.459021194727719350e-01,1.556331535336089589e+00,5.725787903973668103e-01,4.310847112671761794e-01,-1.212317900841637375e+00,1.125704512656519274e+00,-5.464786288824804994e-02,9.405141999994270918e-02,5.069925753560023951e-01,9.650741028873377481e-01,1.261329886136696610e+00,3.007011168377622390e-01,-9.779535879243366203e-01,-2.938255959695624808e-01,4.503893931250869676e-01,1.153555081073618371e+00,1.662199423487963124e+00,-4.238391007399696653e-01,-6.084029422302213164e-02,9.255127670094032144e-02,-4.978593562549229468e-01,8.906603698195199037e-01,-6.775295166590371565e-01,9.832999902398714687e-01,-1.147206567496465768e+00,-2.038231437791370171e-01,1.099745908139049932e+00,9.399926393861703089e-02,-4.079227624050535406e-02,1.669934292527624153e+00,1.308707020597082327e+00,-1.232088549745151917e+00,6.725144084774935527e-01,-6.459454794708885395e-03,4.346704251648239592e-01,4.393355986899816767e-01,1.023181277568182335e+00,-8.054162909713589169e-01,3.335479917994141896e-01,-7.773445606016404774e-02,1.034087341624301937e+00,-2.173089040146942708e-01
1.032266486586792764e+00,5.277315169688681085e-01,-1.620965065535643901e-01,-1.740684216673826779e-01,-7.233834941279851938e-01,9.228752683982681670e-01,6.537746559928026002e-02,5.873390038004103753e-01,2.811978300648164009e+00,5.725120649148056629e-01,5.591433187458288989e-02,8.941820467871633427e-02,-5.672841597547346737e-01,-3.671885256288321409e-01,-1.919427652409457785e-01,1.749075560063526158e+00,-5.411277054568882638e-01,-3.565183789580826657e-02,1.674667715493110415e-02,3.723226295070694580e-01,-1.095171014451465474e+00,9.879217714509156423e-01,-2.272712575274307700e-01,-2.891041187698062398e-02,1.404426845944167335e+00,-7.038797403174602563e-01,-2.284009499657252140e-01,-7.386808924649232999e-01,-9.076984088096496928e-01,-7.231831844271375820e-01,6.760649947300764184e-01,2.994866314155044673e+00,-9.175378889855440034e-02,-6.897885480502616296e-02,-6.484163316200126648e-01,-4.993251346062085316e-01,2.070416141571652435e+00,7.472241615269833437e-01,1.311434090638508465e+00,1.601999713398106984e+00,1.477066580349133629e+00,6.289965563269993565e-01,4.854305568868556020e-01,3.241239708564694344e-01,5.130530939739529339e-01,5.235397953741358634e-01,3.064750410997295837e+00,4.057769679545347730e-01,5.239314110771606803e-01,-5.076521177275528096e-03,4.851338546699725640e+00,2.309687196829984135e+00,1.363916226250845742e+00,-2.649325936108627433e-01,-6.098952325200085456e-01,1.446701247998484874e+00,2.625694140441597879e-01,-8.400647309197546431e-01,-6.563390860664232163e-01,2.605530056334572464e+00,3.232250890666299448e-01,-3.418633467006522153e-01,-5.720554783077291816e-01,3.073819066930667532e-01,8.762435456832824432e-01,1.996840317135588072e-01,-4.018142455796280821e-02,1.710926591088931303e+00,-2.614176289776255491e-01,-9.253293237969977270e-01,3.132585617992783789e+00,-1.239748644965970870e-01,1.252547786783092532e-01,-3.281715827557238341e-02,5.150425778758260797e-01,5.239279942484104113e-01,1.082853219835606673e-01,2.151825209956498286e-01,-1.278040156677518135e+00,-4.469945487505186943e-01,5.383423702523998378e-01,5.589624057371431753e-01,-6.454470454253853351e-01,1.518630550824404013e+00,5.953468175174667643e-01,-1.216036731097582368e+00,-3.088478051643480105e-01,2.272060003537990092e+00,1.214301172118220196e+00,-1.890818911928165535e+00,2.685260120801103767e+00,4.107382990441033055e-02,1.721787201191279815e+00,5.886007558705514953e-01,-9.557107162309228521e-01,-6.470478514133641834e-01
7.319771130846475238e-01,6.081868960899339260e-01,5.345702362063353696e-02,-4.718635328746282331e-01,1.839257062831975431e-02,2.307434770702815330e-01,2.964362329724875011e-01,-2.041910567315221581e-01,4.907859973975631229e-01,4.026160892658121604e-01,7.448398167457567220e-01,5.874098217142985356e-02,-4.015222817750664364e-01,6.856540823856552280e-02,-3.070005593009232925e-01,1.668140806345823846e+00,-4.200628848137933913e-01,-2.019438820260771594e-02,1.436195525058006905e-01,1.636938670222276293e-01,-7.492964367299718154e-01,2.670402941720404488e-01,-4.321818521623557174e-01,2.939646265402069414e-01,1.490226332463608472e+00,-3.400849831678684487e-01,3.540321936372350375e-01,-6.454103769308199290e-01,-5.005933496213826883e-01,-7.844879095850694206e-01,3.294875163378455651e-01,2.428093162090595225e+00,-2.395204417682455511e-01,-9.978117345151446549e-02,-5.525927966888196652e-01,-6.999278520149224692e-01,1.155451078752886662e+00,1.175797209719550818e+00,1.822397426474017035e+00,1.404460461255345738e+00,5.953822792955465459e-01,2.962824869033692243e-01,4.743028453484902235e-03,3.145903101748974418e-02,4.026163559131135106e-01,7.958069786895457520e-01,2.490198998846721246e+00,-2.779426236161494645e-01,5.325845013857506693e-02,9.979600671370283393e-01,3.750830163048929133e+00,1.430335735732995994e+00,2.376777807545351895e-01,-5.355828102102965227e-01,-6.990296921663442520e-01,1.624199440226938629e+00,6.108796396137430307e-01,9.342055579099034501e-03,-4.878456019119791764e-01,1.416479142919073286e+00,8.964861423980747812e-01,-3.724528048877361885e-01,-2.439118749178692813e-01,9.615301718257145414e-01,8.039598670154723958e-01,-3.119271963929515223e-02,-6.622363985145125476e-01,8.003550678446611499e-01,-1.741477352355684516e-03,2.459764787867551594e-01,2.349737269859156541e+00,-3.877512214311630845e-01,3.116981801867103608e-01,5.895889793651198918e-01,-2.880167299441548923e-01,1.333258398340007256e+00,-1.567712621086189972e-01,7.890037458397763936e-01,-6.721049503517080304e-01,-4.132947181016128346e-01,2.865411573202765183e-01,1.727725619683037062e-01,-8.132946976247562576e-02,1.498412841911793247e+00,7.951438234443808373e-01,-1.019234470687941263e+00,3.177956339041779765e-01,1.458235927986850866e+00,5.727853467800331222e-01,1.254459955121750014e-01,1.651772683376846240e+00,-4.213592677239471618e-01,6.610918919073186517e-01,2.567973463682141078e-01,8.301686634264788811e-01,-1.985027963419756514e-01
7.748523302863361550e-01,1.584817527170525819e+00,3.864878888566353754e-01,-9.506685142632677055e-01,3.637859414170908079e-01,-2.689051374449920595e-01,2.578738126154251908e-01,-4.018349698742154641e-01,4.165728853784573249e-01,-1.639546576343886841e-01,-2.699878815316692493e-01,2.423339214430086930e-02,-4.918922339463707716e-01,1.524580008289486144e-01,-1.687075351671066537e-01,8.429932695228670170e-01,-5.652693181653697385e-01,7.996488038875257387e-02,-1.435746690440428963e-01,6.579969722249065511e-02,-7.666505164779885417e-01,-2.870803054197379467e-01,-7.757202808631912250e-01,2.522764705101518956e-01,1.731791113110529690e+00,7.854729717380704024e-01,3.676489063617637831e-01,-6.212310260510429671e-01,-1.422327049112060093e+00,-1.258060008009622033e+00,1.124148742328995310e-01,2.307666678298839535e+00,-4.719160754690731041e-01,5.941133421206450105e-02,-8.091801439712664745e-01,-3.884292284409966989e-01,1.599283498818715232e+00,8.348192014024958807e-01,1.665036902014637388e+00,4.270383903994491304e-01,1.821738180849624134e-01,4.841272768711901708e-01,-1.129146618365125671e-01,-6.566221407079041172e-02,8.877632796769638901e-01,1.102786849896264298e+00,2.390146895800240312e+00,3.078058167684568497e-02,-9.034970613334543377e-02,1.185791912863664699e+00,3.083153476843061291e+00,1.425368526499881217e+00,-1.985466746738379085e-01,-1.387090024274474365e-01,-1.080668865310985272e-02,1.214524008787799314e+00,-1.881101001787949256e-01,8.004058007733769187e-02,-7.875191250947121135e-01,2.530786698862768080e-01,5.305212806693215821e-02,2.716425136881348568e-01,4.598514587368501827e-01,7.532818315569713707e-01,1.592424058780201657e+00,8.400006913533784036e-01,-5.445058378281790734e-01,5.193536170907950833e-01,1.845363882787418586e-01,7.114451866265641966e-01,1.468509634183193135e+00,-7.401912042240976763e-01,-1.580992653755283195e-01,-3.780274703758940147e-03,-2.596653883060229817e-01,7.966109904967475508e-01,-3.194275038798968236e-01,1.073533439415343405e-01,-1.281997925311851416e+00,-1.733815217312835999e-01,5.118158133237435958e-01,-4.831956997037575863e-01,-1.786111620395086641e-01,1.860235597274973340e+00,5.856314786923182414e-01,-9.165202021820263445e-01,7.203349523608355565e-01,2.928201061338909783e-01,6.516424845232924312e-01,2.427956872163696267e-01,9.533018146841590879e-01,-1.126379836705714066e+00,8.976163931987123368e-01,2.805122257020253862e-01,-1.776439798988917462e-01,-5.324520029460799719e-02
9.638682580207087458e-01,1.514525271200051204e+00,1.940075061785271893e-01,-6.387449103514439841e-01,2.384889067700730891e-02,1.079649549953275445e-01,1.159606567584291481e-01,2.940115032564891151e-02,1.436680242083991921e+00,-3.442207677130781907e-02,-3.804780362784991321e-01,4.162912811777427086e-02,-5.439365992900145885e-01,7.382140253080429759e-02,-8.412886753894721625e-02,1.090569222472649979e+00,-4.980831639408735967e-01,-5.737679236232861441e-02,-9.696850967324693871e-02,1.857234386517199465e-01,-9.213735012644757028e-01,2.605567982390666337e-02,-6.742142662581572798e-01,1.613374939162653121e-01,1.542510339750723158e+00,3.670884128681986547e-01,8.537763409679539894e-02,-6.333628280158708490e-01,-1.186182910063138474e+00,-9.895695722704127562e-01,3.606335947834790612e-01,2.448592491867504162e+00,-2.985076298342189682e-01,-5.461411131885066106e-02,-8.296623819518582632e-01,-4.349661912602835190e-01,1.878503670303132589e+00,7.225480431997173270e-01,1.265084298406883967e+00,5.642538488993987800e-01,6.845970901314261114e-01,5.302737424582245618e-01,9.204200013460731022e-02,2.054965579754473581e-01,8.169561865175246629e-01,9.671575483368808346e-01,2.691373896488642004e+00,3.176283489634578183e-01,1.807230739832050292e-01,8.653725036067581033e-01,3.770013291740209382e+00,1.639014078686923170e+00,4.222258036714083840e-01,-1.347518013219086153e-01,-2.032284418517182889e-02,1.078503228122482227e+00,-3.359081943871496945e-01,-3.132717894019118599e-01,-8.006180100571294034e-01,6.958845645143991732e-01,7.809325199676375728e-02,1.745102568708499780e-01,1.271481870937037073e-01,4.091327401509280426e-01,1.311082665905473066e+00,6.267879117000951794e-01,-2.667542841982712409e-01,9.285774452856486727e-01,-1.091769580271343687e-01,1.049824709243887266e-01,2.113441522748310764e+00,-6.056079538861005584e-01,-2.264509574451010754e-01,2.264671079743529880e-02,9.810636667915691167e-02,6.933943367157284765e-01,-6.200490426201799021e-02,-3.761156193576853379e-02,-1.236180728188746469e+00,-2.882005338699347163e-01,5.559413737229412789e-01,-2.605701355426419119e-01,-3.425617184934673931e-01,1.641896822989127092e+00,4.435846223036584157e-01,-8.716491767042151562e-01,3.671368652260088017e-01,8.958101791816562853e-01,8.939644912098544394e-01,-6.151159355353289504e-01,1.525383853807146028e+00,-9.023205108920461237e-01,1.418588951460484360e+00,4.168813899599341233e-01,-7.649366482280492985e-01,-2.089718873665876719e-01
1.173346493042175087e+00,1.904195406171540927e+00,-5.195872299317429999e-01,-7.904969563642763042e-01,-4.142973995666773823e-01,3.538899060947066633e-01,-5.771762863101609353e-02,6.421458480936205193e-01,1.844358923401906436e+00,1.912654429445487247e-02,2.038648190281615036e-01,4.238999896529299649e-01,-3.546864683265700813e-01,1.972425817774908774e-01,-6.297348300249991926e-01,1.987241370999925483e+00,4.211710783190847907e-01,-3.870554030352225117e-01,-3.567900957433128850e-01,-1.632126004599447899e-01,-4.216075988732662094e-01,8.080705912000916147e-01,-6.592059067460878108e-01,-2.879059779531961683e-02,1.762393005034359694e+00,1.353363027003705865e-01,-3.173368154836399002e-01,-5.216777705828595790e-01,-1.209100831306481938e+00,-1.356739461239402589e+00,3.093608848230176012e-01,2.126273192178973481e+00,-3.018746233254972489e-01,1.592684023882394717e-01,-9.778471294251569468e-01,-6.099448929757119719e-01,2.401500014657861559e+00,4.053390621833679597e-01,1.637443380723094366e+00,5.459753759921854854e-01,8.715994146781734786e-01,2.418019796985513836e-01,2.099310614580026657e-01,4.601143140995619385e-01,1.873293997631228502e-01,7.786722099304396183e-01,2.816421860282146472e+00,6.301764710622458354e-01,2.317880448410246652e-01,5.855180039964222871e-01,4.588263249210563721e+00,2.142381566810635629e+00,1.164198966253192857e+00,-1.789933269535954330e-01,6.463412796496403878e-02,1.143004754756514751e+00,3.164649301007782523e-02,-3.528370419254782675e-01,-1.616370260299796691e+00,1.864825102132456891e+00,-6.604039514568798008e-01,2.887824773670081835e-01,2.381635354013757477e-01,1.625589825701787006e-01,1.104380048604592490e+00,2.757997850996973255e-01,-3.612973874587368517e-01,2.517396433933647981e-01,7.685236050972080180e-02,9.184691608043427102e-02,2.643837323956058416e+00,-2.263880301149089336e-01,-4.787507927066783631e-01,-3.450732895619691432e-01,2.942839779424510360e-01,2.262585749041774452e-01,-3.022260550497324894e-01,5.147852689665043391e-01,-1.527551423225008920e+00,-2.578334060633328817e-01,1.579346165556088533e+00,4.457524520001480695e-01,-4.836655307965378459e-01,1.381405426367379174e+00,1.141845118553846961e+00,-1.230231728008158942e+00,7.326133827230651985e-02,5.739854860288694516e-01,9.953529450739928564e-01,-1.515998526502781774e+00,2.008942100280009413e+00,-5.877023440766903084e-01,1.536471822597729187e+00,1.339661226819995887e-01,-6.435705736304739855e-01,-5.635885522395823743e-01
9.788717750479801749e-01,1.672497811738837159e+00,1.671665871975724915e-02,-6.445919562756500243e-01,1.560583088693658360e-01,-3.831467275623390289e-02,4.429688774129625362e-02,7.838515529420525541e-03,8.145260664869693468e-01,-3.053210973162975850e-02,1.493601687354149110e-01,1.583252276024238181e-01,-4.237016588689584973e-01,3.545885942603228536e-01,-2.251183159087955243e-01,1.494281953601596324e+00,-9.689007401033813971e-02,-2.133749709955518326e-01,-4.498796620052785550e-02,5.549862208857583856e-02,-6.876985836794977658e-01,-1.975485839367907559e-02,-7.295486872090464203e-01,2.582503500560964782e-01,1.491942154194282777e+00,2.083230602243590079e-01,1.624561355113670058e-01,-5.403110680647681408e-01,-6.682946612498719130e-01,-8.833029210826538469e-01,2.978995332772321758e-01,2.072672639628425184e+00,-2.806895474714202199e-01,-1.494834562184783056e-01,-8.174786101523121573e-01,-6.572284857328786201e-01,1.599316803410293142e+00,8.653926080086878914e-01,1.353599219315262392e+00,5.525148094726884951e-01,5.276893714667016955e-01,2.467653813460780055e-01,-2.449641359499885040e-02,2.984378815531975593e-01,5.158064350396933673e-01,9.951975291547165980e-01,2.617409692321357007e+00,1.520650559535598467e-01,6.971418260328965388e-02,1.304171234917750777e+00,3.746352382601046305e+00,1.276188465787092330e+00,3.479332271944162169e-01,-3.315760075305190235e-01,-7.103056832019949418e-02,1.101580810572365898e+00,-1.112629191367120463e-01,-4.838244350397885585e-02,-9.179050128376551321e-01,4.869858582375732325e-01,3.313147957478588257e-01,1.563813783736220375e-01,1.221433853120239832e-01,5.619627819008962133e-01,9.764949929552965147e-01,1.913086554278496942e-01,-4.769251203697276731e-01,4.445361873075837633e-01,-9.280125231430036425e-02,3.772341228155284831e-01,2.255042274328145968e+00,-6.103166735035422397e-01,-2.273977987244663046e-01,3.787436740484607656e-01,-1.316562438905803378e-01,1.073608151602628569e+00,-5.122739903097939251e-02,4.176406313237255308e-01,-8.439551101016633528e-01,-3.175757990905399009e-01,6.770556689894587921e-01,-1.582284469682662675e-01,-1.011735232513190919e-01,1.346870947113461447e+00,6.570143668435093343e-01,-7.632408906751400046e-01,4.446323861714411296e-01,7.586873960665936334e-01,6.460665206256466231e-01,-1.149304551008810127e-01,1.423057048671256153e+00,-9.900125646843281890e-01,1.157978142076895978e+00,2.087382196172688498e-01,6.335755822854136077e-02,-8.117426109055519978e-02
1.118502812346855890e+00,2.641608209358529358e+00,-1.397639970454124803e-01,-1.264195592451594408e+00,4.877682639394466391e-02,-2.992087546481713711e-01,-2.390186304538670092e-01,2.881636933993720340e-01,1.267359403330532430e+00,-3.458340723942979755e-01,-2.728352914307137778e-01,4.653922531606149438e-01,-3.766240733393607654e-01,3.464048313390471479e-01,-5.409046142203630669e-01,1.476430872225444002e+00,3.612119172645818499e-01,-1.332597909645133749e-01,-5.293315809794265636e-01,-2.464276885686110807e-01,-3.861909686599785951e-01,2.521677050361433858e-01,-9.036067931287652399e-01,1.803974257532334202e-02,1.932136114934360327e+00,9.322122503064775856e-01,-7.110644517491432337e-02,-4.677134793618998865e-01,-1.592215318313619399e+00,-1.631567651260421137e+00,4.262434003646675684e-03,1.913927834937119599e+00,-5.958808850125698608e-01,1.540606502669244482e-01,-1.080715098659745799e+00,-4.313824669166907988e-01,2.359401372675708597e+00,4.087229746714007295e-01,1.648973622543391082e+00,2.645360913813032955e-02,3.107057228898154611e-01,2.471754151681591627e-01,7.163681458221998755e-02,2.670712723530969113e-01,4.844461056004904509e-01,1.031734771672695672e+00,2.730310873515812364e+00,5.491856074737988536e-01,-8.927877689876830003e-02,1.220409432768361668e+00,3.645153922468285845e+00,1.724877008795997035e+00,5.261577348323567271e-01,1.241539891052356737e-03,3.997144107941321689e-01,9.917107627162520256e-01,-2.644201764358887763e-01,-2.251882093922052963e-02,-1.751544059840769219e+00,7.105771800363209767e-01,-9.257574764029428138e-01,8.543802483532239034e-01,8.262575030896265327e-01,4.563277498487290917e-01,1.654190900120297236e+00,7.952840889780515843e-01,-4.154474580907071002e-01,-1.760543189891832228e-01,4.350407867039075005e-01,5.778399254637677229e-01,1.849465126545948301e+00,-6.260754899744872537e-01,-6.904737050322330427e-01,-6.033149758298634868e-01,-3.383587583172337210e-03,1.787685760317554440e-01,-3.533618393232452193e-01,3.727138031578016708e-01,-1.765671784965627600e+00,4.668218611384350458e-02,1.578720161062726834e+00,-5.169529764526725746e-02,-3.239404589189678885e-01,1.561832928862955105e+00,1.121469623829302265e+00,-1.063076863022567764e+00,5.508706896654522733e-01,-3.095329440090497375e-01,7.583064663839232944e-01,-6.849570242873364023e-01,1.334844815063177093e+00,-1.231188848539285452e+00,1.374743024114911227e+00,7.319344763267399134e-03,-5.925606140335946126e-01,-2.252895996885413699e-01
7.112651748739875490e-01,1.130199167023940854e-01,-8.085889306891128059e-02,-3.010234688665097691e-01,-2.648443211182282542e-01,5.806095313956747272e-01,4.057211881312031698e-01,-5.625031618648690390e-02,8.797049423623470865e-01,6.325763502918690939e-01,9.254710957632006352e-01,3.293731609046447045e-02,-4.085673915715949400e-01,-1.350514775360877606e-01,-3.729406005993547990e-01,1.846431629685681086e+00,-5.051138782114047432e-01,-2.975346449064071586e-02,1.909606766441584724e-01,2.206445799764689408e-01,-7.981376999620436452e-01,6.314756008528167319e-01,-2.581372272710989457e-01,2.273729214242587171e-01,1.481514308962871063e+00,-7.021763114015152629e-01,2.467628099298407318e-01,-7.064624479165854121e-01,-5.208622275839738247e-01,-7.554134550869144871e-01,4.464431823697791457e-01,2.677118987570119568e+00,-1.486209345748209232e-01,-3.032362270795663228e-02,-4.768198994050151795e-01,-7.079472894404299499e-01,1.224591959838376543e+00,1.163986443252270409e+00,1.946825317574245817e+00,1.788768527269638309e+00,8.685109095424778936e-01,3.699598447892510356e-01,1.173422847303383643e-01,2.482330157328182380e-02,3.083244374836592305e-01,6.310293826186952337e-01,2.537794600276747303e+00,-2.619414733800869977e-01,1.924824837824589685e-01,5.411059131002341482e-01,4.154734191802179843e+00,1.786238806739475216e+00,5.344192277799041380e-01,-5.775853666378610862e-01,-9.341940014541029180e-01,1.803076880798117676e+00,8.544634863793032498e-01,-1.795987216219396831e-01,-4.026198104223984164e-01,2.231890462736350944e+00,9.392359716208500409e-01,-6.506497022454380552e-01,-5.018566282234472320e-01,8.925833825278122191e-01,6.838466081181797662e-01,-1.384125100555565480e-01,-6.239407172085477127e-01,1.110519782122639798e+00,-6.608560745286409799e-02,-4.900180798365849633e-02,2.643333793565057821e+00,-1.614783211535422147e-01,4.802570680509129497e-01,5.448978850435687304e-01,-1.285120431058915658e-01,1.218903613395577956e+00,-1.932554662873357532e-01,8.401581322212954284e-01,-7.337249842920448017e-01,-5.109174585318292383e-01,2.757974061286583289e-01,4.680942917714298046e-01,-2.285854333256240600e-01,1.547236380817341050e+00,8.519005516927581345e-01,-1.217126321145696854e+00,7.137937387679230139e-02,1.923555565914742083e+00,7.263807086880638142e-01,-3.659609860828813566e-01,2.025430176382012171e+00,-9.452352245719330970e-03,6.999693911043425310e-01,3.443288730407032538e-01,7.298715142853546833e-01,-4.194883581686705831e-01
6.633998518096743124e-01,6.242551390089899899e-01,6.530127454118903607e-01,-5.191107397647723998e-01,2.924901645825369045e-01,-1.651014783069792435e-01,-1.342232726241073260e-01,-4.781253953705951187e-01,7.075702763638574977e-01,4.768608311230791985e-01,3.372508106071712142e-01,1.118645755592483082e-02,-5.396535894986054238e-01,-5.213356068976633673e-02,9.238548067740126601e-02,1.296365255405852235e+00,-9.068532239759556912e-01,5.379337917788689083e-01,2.413222875979007531e-01,4.604508991491372272e-01,-1.164937573893364497e+00,-1.357826714991898776e-01,-3.645802183303882837e-01,3.505358047184249370e-01,1.306673665666736817e+00,-3.236011609264562994e-01,6.903265209724420703e-01,-6.761217044217899819e-01,-2.254055486392935181e-01,-4.229190354742634606e-01,2.493562863532680918e-01,2.661066453206544669e+00,-4.355485808771234479e-01,-4.676605966901254408e-01,-4.067301830037856059e-01,-5.366919825272689071e-01,7.632179744350194861e-01,1.552445422712267042e+00,1.446791061876819162e+00,1.758423922493937530e+00,4.647563622008784590e-01,4.095695084790609286e-01,1.284693195824925249e-01,-1.557049852825438951e-01,7.829187286051468853e-01,8.449555015581894368e-01,2.785347471834973110e+00,-5.822305206747632189e-01,-1.433338710273771577e-01,1.645262242441823508e+00,2.951494867028504387e+00,7.896098004480649468e-01,-1.643130875116202150e-01,-5.032105562777078323e-01,-9.007366217949720477e-01,1.673782886343946785e+00,6.079701863710722520e-01,6.932354198021617453e-02,-2.540900762991737949e-02,6.098958511726273457e-01,1.560772920551281029e+00,-7.513475042801132098e-02,-2.530187623977093736e-01,1.564484175290886014e+00,1.008932575583876279e+00,1.820082195696317018e-01,-4.561301410981430382e-01,1.247214641099028576e+00,1.997955273120218811e-01,-1.543565061471309230e-01,2.144084041701523446e+00,-8.117527388094878393e-01,5.001756803758566905e-01,6.929600691332800100e-01,-5.354171688939393103e-01,1.737699898371220630e+00,3.162249100667993695e-01,7.401279500825919122e-01,-5.276694373902293123e-01,-1.364132465885408152e-01,-4.341772265893613092e-01,-1.340069028278580432e-01,1.183707534032535369e-01,1.487812864972502425e+00,4.970860043645368709e-01,-6.868295971832248936e-01,5.265625184536957271e-01,1.919665297485718902e+00,3.159754663633609906e-01,9.108097291183085975e-01,1.606233163374644723e+00,-7.273778617538000368e-01,6.693196412605501022e-01,3.267526553655184518e-01,1.078990198319929705e+00,2.503195862718486930e-01
8.406522732710600687e-01,1.216490586057455525e+00,-2.077668650345356194e-01,-8.111015071272653643e-01,-1.040845562569240046e-01,2.088632213638349777e-01,3.368969485226515626e-01,2.356910340453517716e-02,6.725694907347510298e-01,1.272777457323385764e-01,5.014004275772538932e-01,2.082101401486923242e-01,-3.472561985807212093e-01,1.129323053347884992e-01,-5.828985256998152620e-01,1.653405862688751116e+00,-4.989781005176069373e-02,-1.970325748631919782e-01,-1.737364122684890988e-01,-1.055056615819412458e-01,-4.586949299813962710e-01,4.748384558921048826e-01,-5.967189772440900652e-01,1.429978817961711501e-01,1.808291040092344648e+00,1.834416592965657511e-01,9.142506980241814352e-02,-6.000259335815962825e-01,-1.227354788540071517e+00,-1.361050953102031613e+00,2.023909294635588552e-01,2.260878039436013065e+00,-3.383070487100601764e-01,2.231947333727576921e-01,-7.838348286156191502e-01,-5.975267538280795154e-01,1.778532780461292262e+00,7.323556195613495357e-01,2.063811943410496674e+00,8.400080168007550974e-01,5.047327915071764259e-01,3.004562010862444343e-01,-9.450100714018586784e-03,8.503748299287246237e-02,3.309077195763224788e-01,8.412664106444360801e-01,2.417271243971621519e+00,1.108977032577039279e-01,5.401237774797829072e-02,6.857235834436997690e-01,3.948151160866085974e+00,1.932672961091096653e+00,4.393145674929560540e-01,-3.123471927795308245e-01,-2.684108896291311774e-01,1.469662165530037923e+00,3.754255415309939448e-01,-2.229489468774195626e-02,-1.114988506871702256e+00,1.672766979869842574e+00,-1.279949315730735393e-01,-6.044163818855460835e-02,1.990887393594970856e-01,5.981097672631938700e-01,1.180042582317338162e+00,3.311634697619355583e-01,-6.751744110116632003e-01,3.191602745539972030e-01,1.767202837840817775e-01,5.507517406319822895e-01,2.108255606359385137e+00,-2.761557239446886802e-01,-7.025763121275295509e-02,-3.220482225505003071e-02,-9.201961247785155062e-02,6.287042078099286391e-01,-5.129843760118116824e-01,6.325629192924644428e-01,-1.287422866534190025e+00,-3.212121533288770925e-01,1.040675659793149022e+00,2.336816437564572246e-01,-3.053389027806922007e-01,1.673978214437825462e+00,1.077361702438389912e+00,-1.280947391211062936e+00,3.336559789923154162e-01,5.922735601263634519e-01,7.704132720635238352e-01,-5.087759447086678266e-01,1.532140803202012513e+00,-5.198295423321939168e-01,8.381314306607694498e-01,1.561770765974541952e-01,1.683842680514674173e-01,-4.396660685945975033e-01
9.811172365746804180e-01,8.511230964202346483e-01,4.370259891075482794e-02,-4.102205329974771830e-01,-4.933734194163184594e-01,6.599754394471251118e-01,1.524914502624742929e-01,3.616917683154174390e-01,2.491484696624790551e+00,3.171075365646778277e-01,-3.473376962515627997e-01,2.734241175929642831e-02,-6.021991247114293344e-01,-3.354614816517316189e-01,-1.320613939041893614e-01,1.292115868112230670e+00,-6.922990295453672616e-01,3.042677014784012091e-02,-8.495588973777830344e-02,3.234644611620033361e-01,-1.091430794908303525e+00,6.570760134910820227e-01,-3.847523784035201677e-01,-1.093570778249505770e-02,1.539048004710164008e+00,-1.466516486635150718e-01,-1.418339619675220986e-01,-7.418026689149811448e-01,-1.364199118332170890e+00,-9.679172489046168337e-01,5.484372203945052648e-01,2.950633454690002822e+00,-2.048171194110189053e-01,3.648008860901900963e-02,-7.356643982423176631e-01,-3.548784453450660736e-01,2.157557226270551798e+00,6.416051914046154714e-01,1.347068866685584787e+00,1.175946929845380406e+00,1.195262590304484007e+00,7.247425929353441543e-01,3.711956334368501920e-01,2.013695136381654649e-01,7.621662034716871759e-01,6.862625117408674980e-01,2.912210908154247324e+00,4.489951871959843022e-01,4.200912993414123164e-01,9.014513684298564034e-02,4.413063415426011105e+00,2.279701883602494483e+00,1.002114453995830434e+00,-1.059024380313096370e-01,-3.414096792937174052e-01,1.318356227675367087e+00,-4.684603421859778738e-02,-7.290553785532908337e-01,-7.097331209500130633e-01,2.022367402550140358e+00,9.211783208878554507e-03,-1.190380241912478571e-01,-2.372497243962517210e-01,2.814623781017306925e-01,1.264071833440970627e+00,6.215155410739325870e-01,-6.543183304220934193e-02,1.563045152192704235e+00,-1.566103053485982388e-01,-5.733265814484578282e-01,2.592073076771693518e+00,-2.902160912128668446e-01,-1.965510352916303993e-02,-2.494886320309363248e-01,4.480237201956199788e-01,3.430415957394690185e-01,-3.771336411904441244e-02,-8.218091381220915537e-02,-1.520382648569963635e+00,-3.563599230387108907e-01,5.575460305773133340e-01,2.043456252765004644e-01,-6.567350905368695146e-01,1.756842409081202927e+00,4.934262972079606069e-01,-1.188659463058429955e+00,-6.064597501255836187e-02,1.686156981819875167e+00,1.208485814846947282e+00,-1.629551209211525631e+00,2.236267413970451035e+00,-2.771026005521442515e-01,1.675095860435114270e+00,5.991668385877058078e-01,-1.261338891766514703e+00,-5.642082480063577155e-01
1.126849770565556019e+00,1.106549142503453931e+00,-1.468769339000025043e-01,-3.432355998331997893e-01,-5.923573785214504284e-01,6.851765621163301567e-01,-1.021987451621159670e-01,6.297735346113398913e-01,2.802174464945813348e+00,3.510545362262734725e-01,-1.778610809784447189e-01,1.724512935937492775e-01,-5.599545959449014898e-01,-2.027647157615990459e-01,-1.819858408141031836e-01,1.677411074801206547e+00,-3.471804402961830571e-01,-7.234296139080800825e-02,-9.643744292603434465e-02,2.908469341463333913e-01,-1.023996099484045574e+00,8.131308117397099133e-01,-3.845452006151478530e-01,-3.591564851175921280e-02,1.441531453108976235e+00,-3.811951912903614459e-01,-2.596945419775923414e-01,-6.736261588556861080e-01,-9.830603811322334851e-01,-8.141149627971917546e-01,5.920768300522748495e-01,2.773527021123601610e+00,-1.711026096036695476e-01,-9.761085264487048829e-02,-7.691136018017585840e-01,-4.763676316996081628e-01,2.221242410346893958e+00,6.402185439363212716e-01,1.161427561450693702e+00,1.202788069840764473e+00,1.337714061434284396e+00,5.678291626678696469e-01,4.518012652274764340e-01,4.048925793383045812e-01,5.520565493538585056e-01,6.358576415911337820e-01,3.111109989665535203e+00,5.425660468026737293e-01,4.524906518995654991e-01,2.794622269274337212e-01,4.692295393956722904e+00,2.147683010362769540e+00,1.313352288397096945e+00,-1.759024057989642398e-01,-3.222254275474029095e-01,1.235085433330968430e+00,-1.004716881528622263e-02,-7.727867450224509271e-01,-8.933007662269583093e-01,2.075322554564156263e+00,6.199049310894375053e-02,-1.788553672794856997e-02,-3.166246023097656348e-01,2.404001441772955494e-01,1.007212001568875692e+00,3.227981771127302890e-01,-3.413934992168021765e-04,1.420077352998252440e+00,-2.006312533135244380e-01,-7.770856179045679824e-01,2.989785525743039241e+00,-2.733218000178607165e-01,-1.244592265951387916e-01,-1.499040175052092916e-01,4.971100305391045193e-01,4.379660922842561477e-01,1.413857811137446130e-01,1.351318116120999169e-01,-1.365704124604751879e+00,-3.408764282429976866e-01,7.391686888243222953e-01,3.918208089887437739e-01,-6.007847506405663562e-01,1.449094452565655722e+00,6.012699747351371027e-01,-1.091987686010357894e+00,-1.760327715108164215e-01,1.828243238533220794e+00,1.168048824960582710e+00,-1.805098790200047043e+00,2.497003621012985342e+00,-2.897904214506878406e-01,1.857873521325430044e+00,5.081233122459209994e-01,-1.128042756002257452e+00,-5.334482259164238238e-01
8.436224345769578470e-01,1.068742972416783621e+00,7.515705344569049984e-02,-2.479356413515182989e-01,2.892671521533796697e-01,2.717780719843500559e-01,7.988514394206478464e-01,-3.217762769393160416e-01,1.629380574408335614e-01,-1.262357983524518279e-01,3.237035690268280641e-02,-2.690149235681242312e-01,-4.839694200027889748e-01,3.753926203936892025e-01,-2.303013828303640542e-02,9.767705806555588843e-01,-5.911037486086700987e-01,-5.884522575947113143e-01,2.231949580418594592e-01,1.534652894768270270e-01,-8.156151622974104898e-01,-4.289691193036798689e-01,-7.986310304085300071e-01,4.370299152539824927e-01,1.351207842994694097e+00,2.693048277075248409e-01,1.914376197117541589e-01,-6.379808352943943106e-01,-7.648844792908909840e-01,-7.277305640881439608e-01,5.530034079025187843e-01,2.176088664647254589e+00,5.770072206025728123e-02,-1.681902102699550650e-02,-7.973396024214116640e-01,-7.157795833539317698e-01,1.409096612180192665e+00,8.126119504995730214e-01,1.248060540188750567e+00,2.066921229972547014e-01,5.965576482810163172e-01,4.339191895179855818e-01,-3.033578109294229885e-01,3.102149397432765743e-01,7.546712211109665169e-01,1.131690546109992646e+00,2.138185665324443985e+00,1.667400002659102098e-01,3.327257091834924796e-01,8.031593174646854960e-01,3.944996846289232195e+00,1.433886092796461398e+00,7.555705685635066837e-02,-3.785665327104483779e-01,2.557656768215521570e-02,9.348222189281094607e-01,-5.599791682403015836e-01,-1.467500982943348298e-01,-4.291065871070177118e-01,1.314410779229375770e-01,5.681793933636640759e-01,-4.703086190936505151e-01,-1.663898002378475238e-01,3.209213515595421562e-02,7.791530365408747549e-01,1.754825703429894468e-01,-5.864320929017374784e-01,8.190231079080565468e-01,-7.160017570573505852e-01,7.666779270083178277e-01,2.090267538125753610e+00,-5.004999626592954165e-01,-1.262692904737856003e-01,8.628521966687153766e-01,-7.505161562856618729e-03,1.253139216860164940e+00,-2.603674359787390147e-01,-1.808533230191198271e-01,-5.043483736310421239e-01,-7.851754509161446016e-01,2.638142477388114582e-01,-5.832088165122537582e-01,-1.695846746588877130e-01,1.564854466869622929e+00,1.126178225825249513e-01,-6.858525690963704902e-01,4.486033131648793915e-01,8.161248892394170618e-01,8.692620483091116901e-01,-1.022813060559967235e-01,1.023911011130584914e+00,-9.165724471900400516e-01,1.080230289069297189e+00,5.002005893133659731e-01,-3.834845350269887043e-01,-2.258844170843773425e-01
8.995107480277377832e-01,3.245546139416780607e-01,-7.239034267646643483e-02,2.428009511213091720e-02,-2.817658790185176287e-01,6.840697364021850468e-01,2.507656149369759113e-01,1.543450668338526843e-01,1.453182091578258284e+00,5.728454873837773853e-01,6.278321088608074252e-01,-3.655243760937498809e-02,-4.866283338329068786e-01,-5.580973081450155138e-03,-9.265098622513157078e-02,1.832555114859016676e+00,-5.211000102389915511e-01,-2.013350613325129990e-01,3.203139394378493043e-01,3.814618738017158672e-01,-1.020207257491514197e+00,4.518458799571175577e-01,-3.091129151020431953e-01,2.682631504448036441e-01,1.167965408018176277e+00,-8.926987455262150872e-01,1.135348798005508530e-01,-6.820536834144461658e-01,-6.745092676733155379e-02,-3.067219313289770710e-01,6.802340713616854551e-01,2.623051667559227695e+00,3.618013507070683143e-02,-2.951739866163560211e-01,-5.244250270577383022e-01,-7.867853340681550955e-01,1.278949855313890271e+00,1.147885366905841975e+00,1.264715193375448132e+00,1.589245758425784194e+00,1.175371494381854509e+00,3.767292646057383010e-01,1.785458603280325462e-01,3.322403450004983716e-01,3.991717009499949342e-01,6.750013178063587471e-01,2.760024067250570923e+00,-4.286057400175802279e-02,3.973522506587292003e-01,6.684901614228373479e-01,4.476860064225035352e+00,1.537336386017822409e+00,8.128242155160813054e-01,-5.882825377877187734e-01,-7.687089331893164346e-01,1.451651881656008003e+00,3.817748944180733295e-01,-4.319991363821432673e-01,-2.641151503772842801e-01,1.691470902804527832e+00,1.218226639213103146e+00,-6.434194284029364219e-01,-7.582936886730087256e-01,5.646781040995245693e-01,3.680083236298425930e-01,-3.519424029904055784e-01,-3.626297071723035836e-01,1.426717371942677337e+00,-4.930071879335181650e-01,-4.199529404847099912e-01,3.082069535312702779e+00,-2.696252095856314090e-01,3.257732699057346859e-01,8.686149122935491462e-01,7.952314884333309963e-02,1.435589638744067864e+00,1.942562095757849883e-01,5.379625384365701590e-01,-3.976106588235388539e-01,-6.430798211719155333e-01,7.112103796037327896e-02,2.947230184303621936e-01,-2.100422532039922241e-01,1.240616108128069550e+00,4.494227521837331762e-01,-8.629000634662414848e-01,-6.071533992182748252e-02,2.320934598549952987e+00,8.265364840661606483e-01,-6.419378312635203310e-01,2.217939291557619708e+00,-1.776997473472488043e-01,1.199421113550604545e+00,4.843026383570091520e-01,2.409061812468182850e-01,-3.169821067273842496e-01
8.273810807753565477e-01,9.844535817135403599e-01,-2.231421989297072139e-02,-6.550079223650614457e-01,-6.476920250803339107e-02,1.292715220273666921e-01,1.247221554414190692e-02,-6.177425050409482421e-03,8.542406571688468953e-01,3.704189661924957577e-01,6.875828564194618187e-01,2.384813751398566772e-01,-3.790593131387886561e-01,7.810455167347732375e-02,-4.078740420689292434e-01,1.845180701325941142e+00,-1.670151445174224980e-01,6.177382669637615509e-02,-1.212536777318310582e-02,8.926641665926482450e-02,-6.684992247438896751e-01,4.465566666124443085e-01,-4.472593726750177523e-01,1.964539580031548494e-01,1.578161273291228905e+00,-2.655900473988653809e-01,2.666386474467868362e-01,-5.990239149695703036e-01,-5.877915577295392824e-01,-9.213959529280086880e-01,2.363840482082530947e-01,2.356533405455381036e+00,-3.645912998927369753e-01,-1.041387304815771797e-01,-6.171994439664153509e-01,-6.594331880897135179e-01,1.378324112961562875e+00,1.090494908906575855e+00,1.835126817039350655e+00,1.384494636672162882e+00,5.904973598277962754e-01,2.362193821168230290e-01,1.145484980471762892e-01,7.250450525749201069e-02,3.156584550073391338e-01,7.592722157659066440e-01,2.677749524450658392e+00,-1.668436712181134429e-01,-1.616883962519065354e-02,1.113957799641467794e+00,3.762261016053031870e+00,1.466778815453613660e+00,4.187416141066179209e-01,-4.651495431770549249e-01,-6.190482970535406970e-01,1.610730055563321272e+00,6.646026232176297510e-01,1.936386632620648585e-03,-7.889647855202871485e-01,1.551877894055019524e+00,6.062655033608498334e-01,-7.245352779392125186e-02,-6.954953898734753115e-02,1.032950098897407187e+00,9.313963366254962573e-01,4.068289924160667370e-02,-5.895349314115804207e-01,6.044166980659712030e-01,2.172728201272789983e-01,1.201506056721728388e-01,2.405364159855134965e+00,-4.141541444401283800e-01,1.720059614026025474e-01,3.010392435204395367e-01,-2.593519035288016639e-01,1.124777281793600814e+00,-1.154104356552351218e-01,9.287327406304419775e-01,-9.055792642133047021e-01,-2.359029177622296858e-01,5.810612155168325410e-01,3.220101077514220256e-01,-1.107598504873257284e-01,1.429323782074605198e+00,1.007420331268589431e+00,-1.069108143462949245e+00,3.013463173929863959e-01,1.294820462968204522e+00,5.533077446022398593e-01,-6.792098911862348709e-02,1.798566130063218749e+00,-4.854196587170484523e-01,7.934465675860156164e-01,1.486176428341212385e-01,7.696236758110939213e-01,-1.918125598655726627e-01
7.166970411443386313e-01,4.906362308065274069e-01,1.203857904262633643e-01,-7.626118625536274509e-01,-4.044913107266044361e-01,4.814881929388320492e-01,3.067080678317051778e-01,1.880285825647878828e-02,1.673167551188395219e+00,4.427116500013024147e-01,8.169901262955070464e-02,8.855759091149567608e-02,-5.148517907792720116e-01,-4.865627082339232801e-01,-4.102268152348050312e-01,1.305094367050345650e+00,-7.503875501934083037e-01,3.081023575311794827e-01,-1.743313518914798577e-01,1.828035863830737573e-01,-8.784795129640181610e-01,7.919754925896511644e-01,-2.947745240495324159e-01,-1.673589501077721309e-02,1.855312328858428117e+00,-4.600549743172831219e-03,1.142322379875168048e-01,-7.750821110493694155e-01,-1.734571196577202379e+00,-1.387724159606999796e+00,2.640733033265280083e-01,3.030461565254592315e+00,-4.329094489796979084e-01,2.725512104771289357e-01,-6.208861363112385678e-01,-2.810242023702900771e-01,1.910206756755573387e+00,7.883843220704269683e-01,2.137627137611294970e+00,1.546415490990051378e+00,7.918035019580855760e-01,7.000546990014149262e-01,2.889792701880298242e-01,-2.049058499343839324e-01,6.712997855100228950e-01,6.353400723084906554e-01,2.654030408090043647e+00,5.862193065204959752e-02,1.339898733981493839e-01,8.593117380023007623e-02,3.890985034847271429e+00,2.407663864678992738e+00,5.594233789817524283e-01,-1.483702112481367352e-01,-6.445524822992811931e-01,1.790995914394450939e+00,6.022410759735299379e-01,-3.708149321785297881e-01,-7.356272189614734280e-01,2.544958935072576089e+00,-7.301102910847342975e-02,-1.643499031677897460e-01,6.938867114401902486e-03,8.227486975795021973e-01,1.581703053043395313e+00,8.060246474715111464e-01,-3.983113601432972661e-01,1.242722754926258499e+00,3.619651248275240207e-01,-1.552737504015949677e-01,2.066217055566608174e+00,-2.146103090427803894e-01,2.594970164324439388e-01,-4.948845882509934624e-01,1.040826763960940177e-01,2.734597448013990073e-01,-4.237636122989305587e-01,3.563461182854378295e-01,-1.777636196630124843e+00,-1.896625267187835862e-01,6.213899305306297416e-01,3.816918537695552782e-01,-5.970358373296151822e-01,2.086951462146175551e+00,9.354297253198908813e-01,-1.544425085850208657e+00,1.350844251787526595e-01,1.358022474678515668e+00,1.000070062701527540e+00,-1.037471070232037995e+00,1.985424167073246426e+00,-8.961147626338616945e-02,9.846196342857078676e-01,4.295409976434538257e-01,-4.273852548940004215e-01,-5.960866402630438099e-01
7.483731873959018621e-01,2.769595693029939243e-01,-8.862002917233539889e-03,-3.895762001510288397e-01,-3.539366069627822298e-01,6.768020923726449922e-01,5.530307869658042108e-01,3.406925680272454571e-03,1.362413855470625546e+00,4.454021686446008044e-01,2.964129697441280631e-01,-6.215518121041685440e-02,-5.002978807507024728e-01,-2.946547015200088881e-01,-3.053143675892431297e-01,1.392057621450817129e+00,-7.356973602583140037e-01,-4.268857111378374092e-02,5.156454679961990778e-02,2.313850425449792692e-01,-8.978791659241064371e-01,6.110323023964743250e-01,-3.322528712187248212e-01,1.238832945302089511e-01,1.612811255089039886e+00,-2.807033099891471650e-01,8.233989107469497082e-02,-7.639810136088741599e-01,-1.233384028314839398e+00,-1.033716224927111016e+00,4.789185116162777422e-01,2.879028916830236540e+00,-1.589817750659875129e-01,1.676700562399663363e-01,-6.034192370459552368e-01,-4.920919731989659152e-01,1.690594911711315707e+00,8.470852356825165907e-01,1.872044297048591099e+00,1.410623143688345182e+00,9.446372257542072770e-01,6.211854128551999032e-01,1.524657075023950759e-01,2.269107069212697447e-03,5.907285005495666041e-01,6.837400472130775730e-01,2.512060566392525285e+00,6.348538075754392440e-02,3.142469289340901750e-01,7.288067364680406168e-02,4.236775429250439373e+00,2.232980404075383341e+00,6.115267248614192352e-01,-3.160886358943488239e-01,-6.298434233132581550e-01,1.624413216061592280e+00,4.080088993951931919e-01,-4.146143903679957443e-01,-5.092882127732978326e-01,2.251391995707578086e+00,3.379254840519479441e-01,-5.331400684455118721e-01,-3.202487611494443387e-01,5.162782960787299924e-01,1.091894217076380569e+00,3.808828243003049563e-01,-4.521007860335428674e-01,1.328886360994517180e+00,-1.185889634619659572e-01,-6.640054138565570918e-02,2.380216925932122418e+00,-1.497797822679409474e-01,2.824405712245928735e-01,8.756219059890056611e-02,1.531977761424702655e-01,6.666131803582043824e-01,-3.410173646529648939e-01,2.685010382526770156e-01,-1.234335810218018636e+00,-5.056894304029517784e-01,4.233240581197071362e-01,2.727853128203999722e-01,-5.051820608939472379e-01,1.861489709050805352e+00,6.682873767764989648e-01,-1.336091783018109380e+00,5.099056749217023565e-02,1.617838711543172936e+00,1.028921493727720238e+00,-9.827772374966501356e-01,1.946226729627558161e+00,-6.690465659176692004e-02,1.022690787485275310e+00,5.119995955539186072e-01,-3.370850417576677915e-01,-5.964328068238962111e-01
5.343653301684487822e-01,5.978122079639245356e-01,4.519488193528947151e-01,-9.744722390808948642e-01,1.250491585449880483e-01,-1.152794723646938801e-01,1.619669421702797929e-01,-5.045849516635598775e-01,4.339829544981735898e-01,4.095901182118791839e-01,4.270743183499999818e-01,1.155794274969825786e-01,-4.522191132942029457e-01,-2.525605523088955140e-01,-3.514752093952765444e-01,1.249100067600741326e+00,-7.691553614924329096e-01,5.658862556217718609e-01,-7.011967575642095996e-02,1.655294652906232344e-01,-8.112948610121104576e-01,2.685428721462614909e-01,-3.706896734622200928e-01,1.875839247464102799e-01,1.821572036764290470e+00,1.341046816780012418e-01,5.941891242381072136e-01,-7.112753770333344328e-01,-1.259230743765966887e+00,-1.247652454267240252e+00,6.665357530343640757e-03,2.744119822725616942e+00,-6.236030142441379986e-01,6.153029449773081416e-02,-4.957152100285954766e-01,-3.650237306898711509e-01,1.186984532510098500e+00,1.231448510618135650e+00,2.292027152015327474e+00,1.655394846741367720e+00,2.235231570530851752e-01,4.894412221207437019e-01,8.664090956158664036e-02,-4.311363416206526744e-01,6.815963089098164840e-01,7.889471844524102995e-01,2.500353831218538492e+00,-4.945471433027278652e-01,-2.544668356643668972e-01,1.044638597174539552e+00,2.930094770731555887e+00,1.562612654282511837e+00,-2.127858022475273003e-01,-3.276926582743531768e-01,-8.232346486412676079e-01,1.946368155287911073e+00,9.066547181403656896e-01,1.819971224243782937e-01,-5.017197151090710960e-01,1.573430805758976980e+00,5.812231477734407514e-01,-1.414176894284865926e-02,1.908930833575460950e-01,1.535292111057549036e+00,1.566192493990938628e+00,6.670074562778076643e-01,-6.852597679208732862e-01,8.161044853474808125e-01,6.539822524452412189e-01,3.166693818506632896e-01,1.611310015860828448e+00,-5.448429698687815570e-01,4.503914956546721804e-01,-7.146363049121526312e-02,-5.037392375102112130e-01,9.644122764110625301e-01,-3.389485242898722661e-01,8.173737475533096042e-01,-1.324228930486757161e+00,-1.679602251366063559e-02,2.250018119552462670e-01,1.168360243693013917e-01,-1.445636126260540499e-01,1.986328358336863165e+00,1.017406799667367689e+00,-1.284082374855186393e+00,5.741033838665769995e-01,1.113179667771588832e+00,4.634605321469641992e-01,5.068739828062041042e-01,1.435879079580788531e+00,-4.782676696660410620e-01,3.515414275744092043e-01,2.084940750902459228e-01,8.978501852053302201e-01,-1.204377220937145609e-01
7.944759395346593367e-01,9.728823475093293371e-01,-9.180456756378918559e-02,-7.235905419842814101e-01,-1.116790661741145774e-01,2.614348314496253156e-01,3.619582017882432834e-01,-4.371333152984170634e-02,7.628609836643058806e-01,2.130309412236569555e-01,4.499635294915639849e-01,1.350992281734568479e-01,-3.908018634126317892e-01,1.302754984639412431e-02,-4.837779093302576050e-01,1.552982183246018444e+00,-2.654143864817020693e-01,-1.001172061358066578e-01,-1.019966506701264625e-01,-1.679798830999279513e-03,-5.926107661558335238e-01,4.466028529341293796e-01,-5.283356625372850335e-01,1.567267819551099450e-01,1.748010772294077864e+00,7.818677719680604266e-02,1.486127202390765956e-01,-6.413351739681701913e-01,-1.186510845210615672e+00,-1.249578391282715639e+00,2.476739520892105584e-01,2.418724211389210232e+00,-3.198468863582208388e-01,1.751687175717313305e-01,-7.172044597515920827e-01,-5.638272361085073792e-01,1.675677677192558113e+00,8.188764489609100528e-01,2.012321628235111515e+00,1.021307620235417657e+00,5.642801645172499381e-01,3.777218656485808457e-01,2.350468365590199782e-02,2.882935271728076163e-02,4.247707959949200140e-01,8.146534873807120825e-01,2.443243679194346818e+00,3.466565697032279736e-02,7.855715391112577661e-02,6.321645028873420502e-01,3.895951975524737598e+00,1.913605281648465217e+00,3.947512188070185224e-01,-3.238632311971754163e-01,-3.910945169629304052e-01,1.529975563129208682e+00,4.113987511305038369e-01,-7.669436954173375343e-02,-9.092513037844155432e-01,1.707900004330754173e+00,8.019910716806925854e-02,-1.568657542272293148e-01,7.979706695019372908e-02,6.708656015814952189e-01,1.174952681009836741e+00,3.529391778487954712e-01,-6.295178046330105470e-01,5.777527691961961143e-01,1.385112491296311421e-01,4.068814853417190291e-01,2.122813301396830443e+00,-2.925131787969248442e-01,5.130735770904371051e-02,3.266263690026893762e-02,-9.132402896292078631e-02,7.116296114113199733e-01,-4.394956057977079111e-01,5.690660638793297865e-01,-1.236224690429732043e+00,-3.387404288893643423e-01,8.047744861903345370e-01,2.047631317513564642e-01,-3.125937497136322407e-01,1.722510517096075944e+00,9.609472805013431485e-01,-1.260864829397297493e+00,3.081221406137714114e-01,8.648811290286270159e-01,7.817988581245601809e-01,-4.639499004176147468e-01,1.591058458949709209e+00,-4.466260178328733677e-01,8.314189390222286313e-01,2.369359097111611023e-01,1.541303121674604260e-01,-4.193995141196769083e-01
7.524298777816244010e-01,2.152439564381034565e-01,5.634587021928549877e-02,-5.500207025992911447e-01,-4.728988507399572438e-01,4.474651900038751906e-01,-2.065510658633396557e-01,1.665376831004706792e-01,1.795446675631074518e+00,8.676645319906328702e-01,8.481328286566500729e-01,2.945055165275730080e-01,-4.429635257801691761e-01,-4.092258843771706678e-01,-4.132450507052936040e-01,2.088570429059375400e+00,-4.706082408021571295e-01,5.036836856024142772e-01,2.040385154882184277e-02,3.038754176711682686e-01,-9.198955983575098916e-01,1.044386490697161385e+00,-6.037465280866916029e-02,4.004682215431998316e-02,1.568778956754900866e+00,-8.818187054316131146e-01,2.691338832628131783e-01,-7.099249783812160430e-01,-5.733384777981022085e-01,-8.128329196389083577e-01,2.887339870265922537e-01,2.943548371893007776e+00,-4.428770798197907421e-01,-1.581050386062106128e-01,-3.969182110581871981e-01,-5.362244669549198761e-01,1.352523480687400026e+00,1.283776216924723990e+00,2.016060754149824774e+00,2.416276906621310339e+00,9.442519915247420403e-01,3.966378223550375282e-01,4.629804050529905957e-01,-1.136279877618556894e-01,2.870378675881510855e-01,4.370546899509233918e-01,3.024617571695599860e+00,-3.409807166833493941e-01,1.970828590710960171e-02,7.275358530455500183e-01,3.937135274524014239e+00,1.791590670850039313e+00,7.649420177373034146e-01,-4.940781333118125507e-01,-1.213722273135255492e+00,2.079369022296141623e+00,1.313288969475124190e+00,-2.477695533845698517e-01,-5.413916101258595681e-01,2.815196817820187380e+00,9.057050242685904529e-01,-2.339091636653785333e-01,-4.076765972081070055e-01,1.445852025809964747e+00,9.694896914141345468e-01,4.095486718418273053e-02,-4.131390882558461097e-01,1.274803164145410950e+00,4.749883915123349065e-01,-6.915173584766649562e-01,2.775050919335334321e+00,-2.454818358294563463e-01,5.830022037859353690e-01,4.704527827438950704e-02,-1.667461206734031087e-01,1.016857794972020113e+00,5.935742252390646678e-02,1.195814109465641373e+00,-1.131170785392810130e+00,-9.801359758135674838e-02,3.183655014166431041e-01,8.398944091019948655e-01,-2.695721203952478606e-01,1.531514572943845742e+00,1.169702790215670696e+00,-1.347052945611044272e+00,-1.156248651826996543e-02,2.305419420887065307e+00,6.243846385785358777e-01,-5.129606346885084989e-01,2.535343511503554303e+00,1.131155383954693949e-01,8.091630114605786739e-01,2.483605573502557229e-01,8.924036888530475498e-01,-3.347746792605528765e-01
5.014056048879584893e-01,1.971333364274679978e-01,5.316533741062536844e-01,-9.267183872663786737e-01,-9.218649776608589530e-02,7.634155783574458898e-03,-8.056564407486477286e-02,-3.957545478384935089e-01,1.023661290152236836e+00,7.262560453678263972e-01,5.481640501339737348e-01,1.856356389412586183e-01,-4.889799693769411038e-01,-5.230925368043735091e-01,-3.349799114078200191e-01,1.448316663417695827e+00,-9.189118254794799157e-01,8.880834923619599364e-01,-4.608248926733914119e-02,3.101029618552942346e-01,-9.775145958639059884e-01,6.103113472718565413e-01,-1.313665277741337678e-01,9.923490223775147112e-02,1.786667146453685184e+00,-2.759299674471434316e-01,6.296927387667214937e-01,-7.628281976063463476e-01,-1.130557996843206459e+00,-1.122403267428887075e+00,1.691155410660488689e-02,3.069710687548956596e+00,-7.022759261953251952e-01,-4.009207138854298247e-02,-3.484212508629250249e-01,-3.017469219995594365e-01,1.113175454138265241e+00,1.407265253248215497e+00,2.353928174644932980e+00,2.335461543815902985e+00,4.178790681890306447e-01,5.505236943138714922e-01,3.191317764100685683e-01,-5.381385347951285203e-01,6.503567633965775530e-01,5.922341580774743708e-01,2.774579034470325389e+00,-6.426284105091113474e-01,-2.735227942355673014e-01,9.646315122038988665e-01,2.959468734440738213e+00,1.632404625995371727e+00,-1.708291480432011511e-02,-3.647905703615590411e-01,-1.213100681031741068e+00,2.236800797241161654e+00,1.341554685949064130e+00,6.302382659284255784e-02,-3.465059140183206488e-01,2.244190670254278430e+00,8.581860303847326232e-01,-4.490893469928447512e-02,-1.088575646205121317e-02,1.886431675799404850e+00,1.565192069053177093e+00,6.233148347444747994e-01,-5.645281573422089583e-01,1.198650786704736682e+00,8.555806916413962737e-01,-2.287476114348625522e-01,1.867999437811342700e+00,-4.948363190600704176e-01,7.068868406879406097e-01,-1.895603407714937794e-01,-4.985306989231158004e-01,9.833790233710344442e-01,-1.529801921898532868e-01,1.060749070221359336e+00,-1.406112012220471552e+00,1.158337904018341136e-01,2.811229692108163647e-02,4.389292411086754275e-01,-1.867760870676997143e-01,1.981746507087700948e+00,1.133454737614465913e+00,-1.397903917166390508e+00,4.054265109673320655e-01,1.775227287333480453e+00,4.406266652893954250e-01,3.589525997374039545e-01,1.906588489536980457e+00,-1.638384749543868590e-01,3.570698190376333514e-01,2.369471764019601412e-01,1.109900738878248472e+00,-1.345189359712315458e-01
7.203687756420636967e-01,1.189041489375785687e+00,2.013427076923837711e-01,-8.331356992212515244e-01,2.253205654857033946e-01,-3.263480009598901388e-02,4.713455538104405207e-01,-3.751221006074768050e-01,2.533883333417341621e-01,-2.047803436563441770e-02,9.265982332565292356e-02,1.843039810248553456e-04,-4.411268261258800560e-01,1.050700126061286238e-01,-3.062805144019117298e-01,1.052862001156932736e+00,-5.177382301430943912e-01,-4.587132656340456305e-02,-8.398998126890980243e-02,2.488054680359842730e-02,-6.705153421350534826e-01,-6.373608416609088945e-02,-6.865409085693215951e-01,2.569070029480535755e-01,1.753356430340056393e+00,5.317335909131190030e-01,3.258195464492512627e-01,-6.454929009564049913e-01,-1.366533202889104182e+00,-1.280048356110234264e+00,1.718630810466925674e-01,2.349761361567908935e+00,-3.734149055668495309e-01,1.620402430864326671e-01,-7.546797690940532100e-01,-4.772220778132503227e-01,1.540154358664400203e+00,8.442630869856384557e-01,1.902105762492742436e+00,6.336553521223453611e-01,2.764952485925120662e-01,4.531466437686827997e-01,-1.383625519921179436e-01,-7.401536897497558443e-02,7.145949619394210695e-01,1.012947289254033656e+00,2.268442088247749400e+00,-2.810979790830510361e-02,-1.857061257089676065e-02,8.956330853993939023e-01,3.373499802385382829e+00,1.644969568294615936e+00,-8.576386372960903559e-02,-2.414169786309637855e-01,-1.821269691430102977e-01,1.370803117192195497e+00,6.298536224149026141e-02,7.001034098507274983e-02,-7.566912717952365419e-01,8.138425318801720820e-01,1.089639652493248068e-01,-3.131654449420800956e-02,2.895356023196632433e-01,6.947759993153124203e-01,1.407368240670714421e+00,6.375583092614993674e-01,-6.655613835800121558e-01,5.272053282761954840e-01,1.136746973454627052e-01,7.575676133348573371e-01,1.628468579024792140e+00,-5.286101198548758262e-01,-2.054416289964593190e-02,9.849452363652666520e-02,-2.324459933945383638e-01,8.132951709832072495e-01,-4.682384337941712382e-01,2.642407289784809432e-01,-1.204441319337390626e+00,-3.135750105574681146e-01,5.717629331754796596e-01,-2.646103178832989733e-01,-2.198626357233078865e-01,1.874267514217135000e+00,7.053554125064204205e-01,-1.080841916114291479e+00,5.922990979032829451e-01,4.615446866537468162e-01,7.017063827139906618e-01,8.273529323212885922e-02,1.077471089549985273e+00,-8.248246457653524155e-01,7.388238463921537047e-01,2.807188835437337548e-01,3.956238538397641169e-02,-2.249264263338444647e-01
5.254100352299591048e-01,-5.038221527698588664e-01,1.159646320712543893e-01,-2.756029661932270503e-01,-2.818575609226166567e-01,6.447656597807371881e-01,5.255155378489412277e-01,-2.835424181234879604e-01,7.421829095583620806e-01,8.583107151443665206e-01,1.052245622035979267e+00,-6.368908512412133072e-02,-4.431275618768750757e-01,-3.856611121393719865e-01,-3.368154949422175193e-01,1.721306285154109439e+00,-8.866949073642895751e-01,2.367324926639441385e-01,2.797472300900064046e-01,3.391566104541073323e-01,-9.333580313684386454e-01,6.946767542980726295e-01,-8.463208981320230473e-02,2.389924337549095001e-01,1.509750323146344275e+00,-8.734016215878449563e-01,4.290686996843394718e-01,-7.951632334813227843e-01,-5.998408984116716525e-01,-7.383917928875307624e-01,4.215076269542579190e-01,2.998584050835251258e+00,-1.969183202791851273e-01,-3.315278081453765235e-03,-3.098441337204318469e-01,-6.278892355836424022e-01,9.622137500106736629e-01,1.365101777294832619e+00,2.204935026846582602e+00,2.292745102500156396e+00,8.403892564665101927e-01,4.925554513209913776e-01,1.525204660988851435e-01,-2.315451168006898985e-01,4.052325093067468131e-01,5.424842437661181460e-01,2.480593480333268985e+00,-5.451973920558798037e-01,1.356760935506657884e-01,3.892683649254499167e-01,3.918525018165146534e+00,1.855676603189657436e+00,3.253566851244363844e-01,-6.232529877513421912e-01,-1.293875746417717743e+00,2.121069307076029364e+00,1.217448054210271025e+00,-1.469640686915745786e-01,-6.651721143846445194e-02,2.622089449116387971e+00,1.255711963076225679e+00,-8.693820266130524166e-01,-6.363909900687995114e-01,1.222813463874899309e+00,7.809168257872814989e-01,-5.125208581021717391e-02,-6.827341379698292911e-01,1.441052493301610671e+00,7.256634654681837215e-02,-1.532740450372033214e-01,2.499849589261646798e+00,-1.228941822022545649e-01,8.175808782214961656e-01,5.501464295953478745e-01,-2.466787783948076185e-01,1.314597516888246442e+00,-2.362490757111586348e-01,9.297625247823384509e-01,-7.576993693927139839e-01,-4.874261495160921442e-01,-8.252092232851127029e-02,5.393286659124070237e-01,-2.346643234812237910e-01,1.763478653741010316e+00,8.537167291016107828e-01,-1.357465519915365570e+00,7.321450145037458612e-02,2.302649870025927914e+00,6.796819864147821688e-01,-1.186467622788645593e-01,2.074100116486162992e+00,2.473918895932407658e-01,4.096624174261103146e-01,4.170667225702054948e-01,1.043754682423263969e+00,-4.311453919438063553e-01
8.318691117006603575e-01,6.021434217293671898e-01,5.310027067264109224e-01,-4.490297264760371165e-01,-1.974589091205183056e-01,2.193214308637384535e-01,-3.422630877052383336e-01,2.111427683900217456e-02,2.203299314071667681e+00,6.035467698754578558e-01,-8.524145719280379341e-02,8.708845947884528982e-02,-6.342732193652896866e-01,-3.818252254016725744e-01,1.012836201318129126e-01,1.369092890129334661e+00,-9.592003658429539836e-01,6.286640110227664779e-01,9.506427749256179949e-02,5.615340279984060157e-01,-1.348293013153442743e+00,4.040287295181398397e-01,-2.135485016845928286e-01,1.067518568148731473e-01,1.337438436461496405e+00,-4.995561593530190581e-01,3.399608743435351688e-01,-7.361057832138597767e-01,-6.134981281270852627e-01,-5.035220669540171334e-01,3.934934299887631326e-01,3.052250189861768881e+00,-4.264111904322700486e-01,-4.053391471784652533e-01,-4.627808506264137201e-01,-3.626166553129135939e-01,1.381957713133359134e+00,1.277888336192424923e+00,1.259269824626397138e+00,1.961757003631796614e+00,9.631557076324468447e-01,6.234070285232091724e-01,4.663544314964033211e-01,-4.337634312898301647e-02,8.391082150783637505e-01,6.471849926136469255e-01,3.173717332680163317e+00,-1.791448670514537433e-01,8.822226994695549218e-02,1.015153889058077574e+00,3.549667494444070037e+00,1.403577156989990193e+00,5.278995481671846512e-01,-3.022640597005604723e-01,-8.801136704279595158e-01,1.646641783325017316e+00,5.102084209109983837e-01,-4.290038609463381336e-01,-2.097156541776484806e-01,1.517018351878064442e+00,1.087455188812412432e+00,3.149417317314476272e-02,-3.670511137451160089e-01,1.270993902098380479e+00,1.180835584360750090e+00,4.210854773525927741e-01,-7.853285029666412509e-02,1.758603143589108075e+00,2.001920699176992779e-01,-8.953157738574599733e-01,2.551637894162022135e+00,-6.431199373425924293e-01,3.972964771006582407e-01,1.371055051266435731e-01,-6.464217973668930084e-02,1.123724061753458070e+00,4.349902148070874941e-01,4.646082173966655793e-01,-1.060404420164316353e+00,-6.570307602851843676e-02,-1.965401397754620305e-01,1.810869582487228957e-01,-2.549915535000410460e-01,1.563519569544327137e+00,4.955117243781712033e-01,-8.976352159730379698e-01,1.535584029210561863e-01,2.354722600047934655e+00,6.953160754968922275e-01,-3.510097585815266097e-01,2.275647453947835963e+00,-4.111942344065554478e-01,1.277632347357318343e+00,4.919097500218525543e-01,1.951900898551811592e-02,-4.254290077891620392e-02
7.241422150657269574e-01,6.157360657534056703e-01,2.500429419082885740e-01,-4.705619106161553766e-01,5.957616256830990109e-02,1.842695973711480084e-01,2.502646496709112212e-01,-2.637018627208418953e-01,7.288168617891008783e-01,3.721154008786181633e-01,4.148291529156131197e-01,-1.052628244740030916e-02,-4.787572946430850851e-01,-2.431862330463001320e-02,-1.484287489879111410e-01,1.398347181739596490e+00,-6.680388141905858612e-01,1.163348003798894414e-01,1.494962280955747513e-01,2.709217953628085818e-01,-9.240371790229744420e-01,1.358399940296101116e-01,-4.303880550540187810e-01,2.838383530798476162e-01,1.456320271031894542e+00,-2.286676319673439373e-01,3.905728476090313817e-01,-6.802209846871963839e-01,-6.316911673790807091e-01,-7.364640040686956102e-01,3.455869544577524488e-01,2.579973147383066490e+00,-2.715704491197830639e-01,-1.475312349827062053e-01,-5.459974276753194466e-01,-5.890475357980433646e-01,1.185122755870233524e+00,1.182988153371666407e+00,1.658887158226938663e+00,1.388034880540534921e+00,6.145988399698661953e-01,4.239575054209376859e-01,4.952520579410744916e-02,-1.773326134162678258e-02,6.156213553187951382e-01,8.254174605272822651e-01,2.560422058934023859e+00,-2.533108882884194113e-01,6.360848769644684986e-02,9.952965141523966164e-01,3.587373023019357454e+00,1.400337560298911210e+00,1.604917335158518865e-01,-4.476883472953761545e-01,-6.646870614108708608e-01,1.569567377393974894e+00,4.404691698193454741e-01,-7.542166105699399381e-02,-3.496407785481727148e-01,1.192069574346980243e+00,9.287199068934417490e-01,-2.925487451119368476e-01,-2.295776406608478204e-01,9.774622079449506451e-01,9.646571782874280299e-01,1.813512422482332909e-01,-5.369858285831121680e-01,1.054269145995748502e+00,-1.060164433514031862e-02,1.044091391800585078e-01,2.234422847939067314e+00,-4.960935095184816346e-01,3.130508353539072086e-01,5.086554507954736959e-01,-2.468336068507209768e-01,1.288431612580721808e+00,-5.769426995423848625e-02,5.535205367669167043e-01,-7.618797704169130158e-01,-3.628930698327345605e-01,8.957111096371983550e-02,9.610456159354352490e-03,-1.216416281765557716e-01,1.595209721109820178e+00,6.077020771599017657e-01,-9.509818960022771162e-01,3.525434944357902500e-01,1.547503185525921587e+00,6.172811983125746638e-01,1.204371924939703908e-01,1.625985792119244433e+00,-5.094506672347118847e-01,7.876501899585102162e-01,3.565391624941878224e-01,5.146432683982351541e-01,-1.370962121265835165e-01
5.850893680419279042e-01,1.081442332772843296e+00,5.437988628121811496e-01,-1.048363482843231997e+00,3.354081243170003446e-01,-2.396942230602324142e-01,3.985148920787278115e-01,-6.195767969132793818e-01,2.367981382493888898e-01,5.256064551099615123e-03,-1.736994128479378285e-01,-3.297165759770898097e-02,-5.079118854815078965e-01,-1.059129189434499935e-01,-2.189777821830112547e-01,6.985298321277412237e-01,-8.775172806462587793e-01,3.443745643247295707e-01,-1.404329116479109130e-01,1.099168262762429960e-01,-8.181547050643587227e-01,-1.733925756927546802e-01,-6.338995828327537163e-01,2.281763451705679513e-01,1.868774229276944476e+00,7.661349094067539944e-01,5.209682922868433819e-01,-7.035724958081220892e-01,-1.720250634219170127e+00,-1.421775272717584970e+00,2.393159309056136497e-02,2.602191078942287739e+00,-5.730934228211881365e-01,1.845937550419997630e-01,-6.847944765616097440e-01,-2.696792434044752995e-01,1.456222838319303658e+00,9.489069527119029512e-01,2.057328746936968322e+00,8.322693144042649926e-01,8.322532405830540547e-02,6.102142633014638884e-01,-8.949413080196796932e-02,-3.575895376744490095e-01,9.707249218568243521e-01,1.023754991812886317e+00,2.290651018475725831e+00,-2.038539656751973128e-01,-1.816127401020494747e-01,9.695871859194020725e-01,2.817715291115941767e+00,1.618455704534780271e+00,-4.193059361853773703e-01,-1.309667195274404616e-01,-2.970740705466460296e-01,1.543063480394940123e+00,1.790847527853604015e-01,1.445364726861515237e-01,-5.965757331418803933e-01,7.347806410224922979e-01,1.201191039593799137e-01,1.319578213404060674e-01,4.630190161441948282e-01,1.061929421554820063e+00,1.824952855926005757e+00,1.046753036936506787e+00,-6.373192346080159831e-01,7.082655668417077166e-01,4.251018731506620574e-01,7.228411329596287072e-01,1.197658252776634402e+00,-6.773839605554479171e-01,1.174444163954733444e-01,-1.765934171834540878e-01,-3.713464161978736744e-01,7.183599093482428977e-01,-4.828968648831280519e-01,1.964946831204064659e-01,-1.483750422821328740e+00,-1.041054260781915652e-01,3.279644963594657847e-01,-3.916374751561499390e-01,-2.299113021027597015e-01,2.158746458476911378e+00,6.928867551947630599e-01,-1.150842328441243456e+00,7.544596495078326193e-01,4.275454251914646564e-01,6.271292074527220484e-01,4.165719232700528241e-01,9.378697694351301184e-01,-8.845035681275268402e-01,5.778410284110323536e-01,3.138839443943223229e-01,5.960084784660484025e-02,-1.172873389018805890e-01
8.230424177108082162e-01,9.609391310947634768e-01,-2.517811315963427443e-01,-3.682486145616709616e-01,1.271433079285627099e-01,3.249002096411248708e-01,7.201799734311945533e-01,-1.798313912871760123e-01,-8.593254644962922129e-02,6.257559119201261399e-02,7.350579408570683260e-01,-4.446496927012705269e-02,-3.347266214687935060e-01,4.123692502759233602e-01,-3.890904520280342727e-01,1.595697152450130218e+00,-1.316948229700144468e-01,-6.218285865157061609e-01,1.510025978655132883e-01,-3.631560782909503543e-02,-4.968268690168468060e-01,1.912354183655889939e-02,-6.983630707286336836e-01,3.883194234921584775e-01,1.492020122378108216e+00,-2.946270405638775486e-02,1.656827582442601809e-01,-5.858427212305514775e-01,-5.832911754608750554e-01,-8.960581955500261930e-01,4.365039641357537081e-01,2.018934709924638859e+00,-6.185669712687968946e-03,7.354694405542566704e-02,-7.510080275004338279e-01,-8.606850139943053035e-01,1.348929415258762310e+00,8.708852105703569491e-01,1.727490381668536301e+00,5.638183406227290639e-01,5.483945221912283063e-01,2.025779124142608190e-01,-2.748061412447679319e-01,2.871863315915048620e-01,3.157598210427323693e-01,9.825518541308000398e-01,2.129241853153976294e+00,2.129252445682324607e-02,2.219453925702686292e-01,8.251797934673705814e-01,4.136993444382566665e+00,1.544677938143766971e+00,2.538489758102416838e-01,-5.348039657982746053e-01,-2.191204564633250085e-01,1.234637301464433179e+00,6.086378685653714982e-02,3.319008934001826949e-02,-7.228780314363854043e-01,9.295482608035514627e-01,5.053884102411622115e-01,-5.282342779587061443e-01,-1.576704330993372039e-01,2.777105706228613080e-01,6.009596523813346414e-01,-1.582977864319300432e-01,-8.076462377246393931e-01,3.772745303724528987e-01,-4.406146060048550250e-01,8.555076790232962747e-01,2.302315750036870057e+00,-2.856312388715845918e-01,-2.122990986531844704e-02,8.163502731255239953e-01,-1.435757678841379781e-01,1.260161078069223395e+00,-4.284153136902723036e-01,4.713778279435149043e-01,-5.044192967953730067e-01,-7.278082401811859503e-01,6.501108962872852448e-01,-8.538933190698402842e-02,-1.081018855524495947e-01,1.432759575208360836e+00,6.532957028139403377e-01,-9.372064305107182802e-01,3.602105749621550834e-01,7.849324812760887227e-01,7.279268373039070594e-01,-8.347974478407987897e-02,1.244428654813331647e+00,-6.279192765592800374e-01,7.582431841619843294e-01,2.601586587144674723e-01,4.173169826603130850e-01,-3.403105743206222833e-01
8.372083181594422996e-01,1.257248799889175039e+00,8.320435036212779634e-02,-6.577256957567623186e-01,1.732139539276968399e-01,-4.210606758592944088e-02,1.046777179389458134e-01,-1.637763374094913515e-01,4.804962184709273831e-01,1.530619206811468513e-01,4.707452933275909635e-01,1.470906109213125368e-01,-3.969484586901096401e-01,2.531128931908518953e-01,-2.840800768299395762e-01,1.575397374438235243e+00,-2.153816798823239287e-01,-5.513238442072283807e-02,2.147541642737346018e-02,7.962764409804427845e-02,-6.797782220896809724e-01,5.645444199388210960e-02,-6.092802423359963138e-01,2.893861655917823739e-01,1.524823702033781592e+00,2.324781427378604104e-02,3.251912989852482339e-01,-5.732672677122209182e-01,-5.769412343659858777e-01,-8.750161526694165692e-01,2.369632141841447326e-01,2.183156794607822970e+00,-3.285592070599530623e-01,-1.402560438150436961e-01,-6.858271296113267468e-01,-6.721793026278604088e-01,1.315523598697928565e+00,1.062493640550698393e+00,1.640212903916419052e+00,9.568224445048904014e-01,4.378915571279791141e-01,2.309190761516347612e-01,-3.314117719488826608e-02,1.210078741679208453e-01,4.567223491317092265e-01,9.251440294776372975e-01,2.545260033201795391e+00,-1.286475981549199676e-01,-2.770695839479876688e-02,1.329025761507543368e+00,3.559005137909235117e+00,1.233672558678452713e+00,1.714642394502510769e-01,-4.353940142502186195e-01,-3.768014180599657537e-01,1.382694673629820903e+00,2.963850782440642928e-01,8.436751776132855873e-02,-7.402597750011479238e-01,7.945961373081151802e-01,6.200369903651269388e-01,-6.933823053560189686e-03,3.955370853020538646e-02,8.914287493252566197e-01,9.513030350033075955e-01,1.096756452146880889e-01,-6.128159442280762814e-01,4.862129057046213898e-01,6.223253028215656318e-02,4.067927151794063501e-01,2.186002857530689791e+00,-5.645579771590429896e-01,3.387682887461988812e-02,4.670680151587768281e-01,-3.112071522988104633e-01,1.248450054959247879e+00,-1.091919848968282980e-01,6.908693897845368248e-01,-7.618331654037101552e-01,-2.933211060909124979e-01,4.931996527833680255e-01,-2.704592965684851635e-02,-2.693746415384995485e-02,1.419300571566762814e+00,7.882744080945669474e-01,-8.692477288136173375e-01,4.712026197738904965e-01,9.700089258701068973e-01,5.176721666022774393e-01,2.375083778205689389e-01,1.435743873876222487e+00,-8.013728017364835088e-01,8.167679673717858080e-01,1.707747302154173363e-01,6.349991280020332862e-01,-6.164446533654410754e-02
5.122028092319298453e-01,8.339023393880407031e-02,-2.833621088027979407e-01,-6.173954975639373011e-01,-4.311823979998025136e-02,3.810143530926710653e-01,7.967136978219959698e-01,-3.934835908600139431e-01,-6.007540119648899779e-01,5.274896773707479225e-01,1.577350373927466576e+00,9.008793776384191321e-02,-2.207123414685757401e-01,6.313527812669687822e-02,-7.818035859289852452e-01,1.989269598695003305e+00,-1.819275159143735610e-01,-2.055508140532980865e-01,1.121184529644233818e-01,-1.215091580059729504e-01,-3.020258762233529737e-01,5.896905240007423998e-01,-3.726282560361660057e-01,3.198463691301956513e-01,1.796441240113734628e+00,-3.976587485249233889e-01,4.141405923865714156e-01,-6.568572389033630055e-01,-7.495843623363578345e-01,-1.232459127421828171e+00,1.871956259445065884e-01,2.315305020481103426e+00,-2.324515602354880750e-01,2.893529822928658790e-01,-4.929093772838608611e-01,-8.294748209229662050e-01,9.960788606519992427e-01,1.164885151032924782e+00,2.738061738055280081e+00,1.591333949438925588e+00,3.452748874562345804e-01,1.560240453086977896e-01,-1.995267955740192001e-01,-1.823538976848798066e-01,2.515341256124636882e-02,7.170283514444617534e-01,2.008926127532842720e+00,-5.270702498340855691e-01,-4.609875528382549603e-02,6.247222536578427299e-01,3.853719910825548656e+00,1.837535040759560312e+00,6.100104458101662797e-02,-6.973188701901347208e-01,-9.350904208215914393e-01,2.035435474347703000e+00,1.249859246068333540e+00,3.233984550554668269e-01,-6.615883109406082152e-01,2.348405967348585754e+00,6.740926752618697781e-01,-7.805478084113738335e-01,-1.730002500327225412e-01,1.065189027365688101e+00,7.490414182113881436e-01,-2.070650031671503744e-01,-1.150778815867306681e+00,2.679792218656076863e-01,2.015234630144334127e-01,9.070188707789217375e-01,2.122049528966717169e+00,-2.398339932162879551e-02,5.306980045958193948e-01,5.717042556400042663e-01,-4.863625050497278890e-01,1.244213998655185893e+00,-7.680025111490946799e-01,1.281509176813270479e+00,-7.392571203281337322e-01,-5.461537568113541408e-01,6.598624927644874960e-01,5.250529787044487806e-01,-8.192922467491969840e-02,1.715373875185562502e+00,1.319026530514047391e+00,-1.484308425919912411e+00,3.404522666762613836e-01,1.048566201933557984e+00,5.052570283295959586e-01,3.153331049267565356e-01,1.449789667018288597e+00,-5.901904695082726970e-03,-5.132254243241840541e-02,7.299001959599077383e-02,1.662603081828177620e+00,-4.883151680282369345e-01
6.218730160266865425e-01,7.796238285527956613e-02,3.243183044525040359e-01,-2.694130342531602107e-01,-8.559961246915187560e-04,4.396014996069789738e-01,5.977955229878482157e-01,-3.939440804080167058e-01,7.052962057494948089e-01,4.531626629558489494e-01,3.308350957569728967e-01,-2.237215235919792766e-01,-5.387879425036232739e-01,-1.941513041367278758e-01,-4.875974778303004964e-02,1.136357891251115415e+00,-1.054994089357876197e+00,7.652770236299283324e-02,2.718390283121285278e-01,3.820970665338118688e-01,-1.071806644685332932e+00,1.074409717125339725e-01,-3.543076899956580927e-01,3.131220279323150280e-01,1.417355669316926470e+00,-3.123882292944913375e-01,3.995778545688129513e-01,-7.744771043588044579e-01,-8.014271569810508256e-01,-6.861297562084256452e-01,4.798783945642518534e-01,2.846762070699495606e+00,-1.381751283598431079e-01,-5.619338550299560198e-02,-4.800858383131128004e-01,-5.441030588115197686e-01,1.131201927354339221e+00,1.179073184091390614e+00,1.690300892302983193e+00,1.490400310943523765e+00,7.435086003230019225e-01,6.052042637350407706e-01,1.329795478276382323e-02,-9.627660574395445481e-02,7.696196846422380666e-01,8.035369679391632936e-01,2.403424419751733598e+00,-2.752396258343480229e-01,2.090760389078211434e-01,5.580678594689232330e-01,3.716781955850759989e+00,1.646982271098645478e+00,1.075997283489152911e-01,-4.438224049175072405e-01,-7.686420524634287599e-01,1.626563392295413912e+00,3.771482285295388315e-01,-2.149071593248067513e-01,-3.748901819631644816e-02,1.416462868321322066e+00,1.052534687959598703e+00,-6.449400476302477037e-01,-4.385505108587093304e-01,8.111773073044374893e-01,9.557228509900157487e-01,2.629914866569367238e-01,-5.316595102178882648e-01,1.466544405941414109e+00,-2.284438962289676578e-01,7.700796107952034841e-02,2.190270477542782590e+00,-3.867153611076903363e-01,4.772794180186853974e-01,5.991252278640956108e-01,-1.354799884650135233e-01,1.265604355970768591e+00,-1.520024286156979598e-01,2.671871868359464997e-01,-7.436481558315780616e-01,-5.480977961179880342e-01,-1.825253053113854440e-01,-7.362881926769962448e-02,-2.404220985798254384e-01,1.803330666993750775e+00,3.730230950073031848e-01,-1.030239672380862670e+00,2.703346065071213777e-01,1.821746046938246932e+00,7.837157021559293391e-01,-5.765801272785953113e-02,1.617016620579167618e+00,-2.918037192617093933e-01,7.608080951075805176e-01,5.518128632688965585e-01,2.144521422480599737e-01,-2.783988499055178867e-01
7.958765874729060164e-01,8.093437544371349102e-01,-1.837564351163881171e-01,-2.332860510804946608e-01,8.780879251095478899e-02,6.366255625563689291e-01,1.347446055769435658e+00,-2.799624103501056616e-01,6.140261720493500608e-02,-2.125537719226667510e-01,-8.171965519507995435e-03,-3.924818958238504019e-01,-4.614285280244482812e-01,2.628355679875546969e-01,-2.240367830281201900e-01,8.189228845403608847e-01,-6.311984811613697843e-01,-8.995495246068001549e-01,1.430864781579109235e-01,9.372729164830485848e-03,-6.503610135563747674e-01,-2.165368539987746477e-01,-8.304948145674651006e-01,3.732442791631498391e-01,1.567135974984971147e+00,4.777151039148151423e-01,-2.802378702836777480e-02,-7.017858477836835807e-01,-1.446195245203671265e+00,-1.138879385067506078e+00,6.271627395149290685e-01,2.278123127384298119e+00,1.937129068380378238e-01,3.940411763266546963e-01,-8.945899767203242536e-01,-6.684011515962131611e-01,1.789789831022408295e+00,4.572145640362517138e-01,1.599958879380904531e+00,-9.577606043858177820e-02,6.828098878787264292e-01,5.791207048643647326e-01,-4.071492307026113866e-01,2.893602471133498999e-01,7.399629812899980452e-01,1.119782112582857536e+00,1.804282419160463613e+00,4.200600071882032438e-01,5.250388812779432923e-01,-2.459947755979163819e-02,4.404272676332695369e+00,2.172921175793006920e+00,2.144544367060464696e-01,-2.726009377915001863e-01,1.992116666655990853e-01,9.263026094745553385e-01,-7.066288719585890332e-01,-2.901468380685244819e-01,-5.978918465988136699e-01,7.864425107661534575e-01,-7.805730237540511873e-02,-7.754540130491024419e-01,-1.194127378789539562e-01,-4.984704170891961494e-01,9.224434472365743432e-01,3.920553011302194135e-01,-6.922955439821107948e-01,7.980870166631863771e-01,-8.791275952746272493e-01,1.092040239570888582e+00,1.932801081974449442e+00,-1.817017159471563392e-01,-2.047851552455198787e-01,5.832000019950965841e-01,2.616039670579951015e-01,7.216411911056779260e-01,-7.440268134913063935e-01,-5.108906762049474359e-01,-8.714838940587219529e-01,-1.013133843726259586e+00,6.322694844636187472e-01,-5.310235736201089907e-01,-4.681330893430069029e-01,1.902422698940518409e+00,1.524775429119776815e-01,-1.042059252833112293e+00,3.257394337917476346e-01,4.372294285728866026e-01,1.212223667330962318e+00,-8.210629749979538872e-01,9.262769375121253645e-01,-6.362955580330256211e-01,1.079868258582244112e+00,6.090553004022168926e-01,-1.053442427011442195e+00,-6.504571134556959011e-01
8.558658657653807067e-01,1.298879977739245684e-01,6.901088098423843742e-02,1.048328080614742142e-01,-3.268306215730792941e-01,8.934143063042923050e-01,6.340874885366756253e-01,6.097346520117480351e-02,1.703111478186615235e+00,4.340243874742779062e-01,3.244788672037635102e-02,-2.880853264732466945e-01,-6.054331940492299058e-01,-2.025869360809106623e-01,6.845667802980504035e-02,1.226199968741955137e+00,-9.927477387032470624e-01,-2.671217266005633251e-01,3.153499269290657714e-01,4.712735071934621156e-01,-1.210273719347163768e+00,3.075356723125911018e-01,-3.520986800731231714e-01,2.374688689718727208e-01,1.220595813602497470e+00,-5.616824104716778843e-01,1.472261487919501732e-02,-7.870436979860403470e-01,-7.173522294804592914e-01,-4.608526493218321196e-01,8.029528602359272682e-01,2.924128526863553734e+00,1.343213012281141427e-01,-9.450578118291574903e-02,-5.885721576372642261e-01,-5.946765546498427035e-01,1.569059865409041077e+00,9.033016655255321492e-01,1.172867807537487206e+00,1.268552724304414348e+00,1.286025454984335070e+00,6.965270454523802002e-01,1.405685612325175415e-01,2.710197976570941636e-01,7.642445586216413123e-01,7.434034707730465819e-01,2.594911843470536272e+00,1.936862919681903439e-01,5.907266381053968285e-01,6.296558691099818361e-02,4.573048527542214359e+00,1.982689774841094321e+00,7.641697023074318640e-01,-3.813458990158493100e-01,-5.526940365895012253e-01,1.297158064981124959e+00,-9.937900922947368043e-02,-6.884521533203823429e-01,-9.915033345809243226e-02,1.657927850708670769e+00,8.686069738791531991e-01,-7.917373609652241795e-01,-7.466160435418472963e-01,1.275659583926509466e-01,6.727892746239481081e-01,1.157939087121687416e-01,-2.330368757683858316e-01,1.864462228690352941e+00,-7.325965960745897121e-01,-3.819986765445183563e-01,2.794774191332922708e+00,-2.255661811453093524e-01,2.611295504382378230e-01,6.384885716508370557e-01,3.567712948249338600e-01,1.042655666550513338e+00,2.265430096122639236e-02,-1.641484276656688390e-01,-7.182537193684809251e-01,-7.874931410339818250e-01,-4.709634034651954959e-02,-8.744683072367087640e-03,-4.796135218901675379e-01,1.623267562712656931e+00,7.800553098237228422e-02,-9.518029024792944437e-01,-8.944163136693561444e-02,2.210986081079169274e+00,1.163170062015286499e+00,-1.147009746563082633e+00,2.056022001031423407e+00,-1.500244876360501411e-01,1.430567630730153361e+00,7.593029998456475305e-01,-8.133329059045453224e-01,-5.133141336518819431e-01
7.527672276874353141e-01,8.954016664538544390e-01,9.361261203363240024e-02,-5.457849062148580899e-01,1.297857145705888504e-01,1.749145144981886779e-01,4.924108788599308451e-01,-2.780506409865450834e-01,3.583222706779105593e-01,1.382849138603469696e-01,3.534716699499281245e-01,-3.854785688454101522e-02,-4.338199101891476728e-01,1.362751502868382869e-01,-2.550362043746404184e-01,1.296673397425983199e+00,-4.946892638651619878e-01,-1.681632084218628587e-01,7.546683045050267546e-02,1.076948940876268357e-01,-7.312084509451622916e-01,2.121190488856006251e-02,-5.992752293008962727e-01,3.047005553068959927e-01,1.562865257310026790e+00,1.027901805252917078e-01,2.908554043185830884e-01,-6.483467880454560905e-01,-9.013069394409214397e-01,-9.667855049476632434e-01,3.303983721110204108e-01,2.358521238905562534e+00,-2.134314339090047086e-01,3.191710033931934032e-02,-6.821533996401922817e-01,-6.206180051950763721e-01,1.375253055364284327e+00,9.579064100382744806e-01,1.739693326103246784e+00,8.634687721833651519e-01,4.988275490436128168e-01,3.923558618612454918e-01,-1.116280880331518427e-01,5.671825298891970679e-02,5.879782595656533051e-01,9.402313895823416479e-01,2.325631710716052680e+00,-7.363767138591797989e-02,1.039262670625320378e-01,8.645233036479513800e-01,3.697724069226166588e+00,1.555695910834645312e+00,1.099314201624003728e-01,-3.901987748203071260e-01,-3.521905858285478419e-01,1.384864221081811619e+00,1.556387111895496389e-01,-2.040746507206302185e-02,-5.800225832112555491e-01,9.779366761490817517e-01,5.095266593663354548e-01,-2.902608851036707627e-01,-4.201015701118895884e-02,6.325328292046734635e-01,1.018109373803039563e+00,2.613468560610604507e-01,-6.456380332476342465e-01,7.182932305366629411e-01,-1.267415131779325022e-01,5.408406337587413626e-01,2.042212483698138570e+00,-4.412107797499744688e-01,9.507024548842504807e-02,4.546397682364842208e-01,-1.846971757022803362e-01,1.096606947860373937e+00,-3.107747981199027176e-01,3.726374948179660973e-01,-8.486740550495970314e-01,-4.710134100808759383e-01,4.038013757279544369e-01,-1.356212437277045102e-01,-1.711606385345248449e-01,1.662459668649074906e+00,6.167007082461120060e-01,-9.903483548999988395e-01,4.281921709580259749e-01,9.607813351376209843e-01,7.073070553845023367e-01,1.319975926563077273e-04,1.322481866272452233e+00,-6.486535137915628857e-01,7.904931446954382990e-01,3.271825007633080151e-01,2.364409261134294282e-01,-2.414433340959044605e-01
8.211452956372498058e-01,1.570410700175077778e+00,-3.751414287747039666e-01,-7.144374025635356062e-01,3.850127035702333167e-01,-3.226677343291389777e-02,7.560925458137228716e-01,-3.063731938863536453e-01,-9.347334721409679137e-01,-2.290633589346962873e-01,8.873020121518395698e-01,8.499447538217336229e-02,-2.137352587169942253e-01,7.169378378454821510e-01,-6.186394599779705405e-01,1.639495182427184616e+00,2.917678109940234354e-01,-7.822517733694192010e-01,-9.794681520819775722e-03,-3.230956367120031980e-01,-1.276102601669055758e-01,-1.785505584965114689e-01,-9.316094585565716235e-01,4.354841294801539142e-01,1.699872717578081449e+00,4.599762489734646187e-01,2.170625554594274587e-01,-4.823448606842726250e-01,-7.515269076309463170e-01,-1.247728680026266579e+00,2.074208037321092490e-01,1.556408462373175539e+00,-1.277592280856885698e-01,2.160053773519133580e-01,-8.906707449371427110e-01,-9.230987870620881441e-01,1.377660338314360633e+00,7.581235578047741397e-01,2.006408622380272178e+00,2.602145158211022213e-02,1.153955318958391207e-01,-1.485878441806753880e-03,-4.906130211179535738e-01,2.758470519440385238e-01,1.714043394926685893e-01,1.147361531302692583e+00,1.884269037887777110e+00,2.170488802222123037e-02,1.679016910319997002e-02,1.186206983438414353e+00,3.831364980086725325e+00,1.391077155816032196e+00,-4.354416312618308860e-02,-5.204454417067084782e-01,8.658866296256473305e-02,1.134499759096377236e+00,5.071708027010735087e-04,3.899347989066624942e-01,-1.134731058416178939e+00,4.391196426464818447e-01,8.808691063690621270e-02,-2.637170996535203593e-01,2.870236748151635542e-01,2.929877763126217394e-01,7.418057551661165760e-01,-1.051533552890387968e-01,-1.067114082129138053e+00,-4.288210311820138676e-01,-2.383173902594293292e-01,1.551460190950619156e+00,1.892881627155104329e+00,-3.584876757425542460e-01,-2.645717652219519156e-01,7.307600995476858374e-01,-3.628693392936821471e-01,1.200014596337930950e+00,-7.108996251225954133e-01,6.588207838492576851e-01,-5.741638345275847932e-01,-6.441115969843118627e-01,1.097987286536294516e+00,-2.138990542156439800e-01,2.987362879856969577e-02,1.424981346997526765e+00,9.337317111841202388e-01,-9.491818361256472159e-01,6.429464368200372704e-01,-1.727038245395604577e-01,5.497759603525478322e-01,3.835540903169787907e-01,7.344997735818843410e-01,-9.737234772843323949e-01,4.836599453972666995e-01,1.233192912815833653e-02,7.874773851439873518e-01,-2.598960928078807853e-01
7.004621554173164899e-01,5.762724606439111330e-01,1.323382237076210499e-01,-3.590635159555987665e-01,1.970656417869735555e-01,1.737857307511642413e-01,4.395254302339113295e-01,-3.738084980205159669e-01,8.402208822897072604e-02,3.253314201979909948e-01,7.362211865148469148e-01,-5.894397548318808244e-02,-4.108811144890380795e-01,1.926099516556201152e-01,-1.901335341701041737e-01,1.516153038060529257e+00,-5.213650985422183526e-01,-1.285034749434958712e-01,2.604151042242917047e-01,1.987230150428721531e-01,-7.876931005599585589e-01,-3.053900680590765360e-02,-5.046014757774701653e-01,4.063076831830089164e-01,1.383178129451436478e+00,-2.951285919044719930e-01,4.424027197742282924e-01,-6.412215966036827197e-01,-3.156585464978780564e-01,-6.282913654822313010e-01,3.795905158019607928e-01,2.329840420554393887e+00,-1.519759331416183912e-01,-1.643452295619788894e-01,-5.440059367786447275e-01,-7.641421765285023593e-01,9.520945736174418750e-01,1.247605046729380884e+00,1.683251583329301582e+00,1.229730807495986511e+00,5.208798801905758502e-01,2.799319868038359638e-01,-1.259580399807246343e-01,6.164369404103241246e-02,4.771387896697875663e-01,8.959620573358325624e-01,2.352478525477527338e+00,-3.450740294173274547e-01,7.047588966112994235e-02,1.145114230254756116e+00,3.642441288525647636e+00,1.202387027893326188e+00,2.828122304965913214e-02,-5.930891131812990880e-01,-6.417032797729212978e-01,1.514301273804359749e+00,4.311188993492505728e-01,7.997231367685042613e-02,-3.038589201987516031e-01,9.120667166732856490e-01,1.144002975735887606e+00,-4.880752401124325290e-01,-3.059212142388065825e-01,8.934478048692532370e-01,6.742505609232727348e-01,-1.215561796283007867e-01,-7.192900614937983717e-01,8.058722944969834989e-01,-1.995070144192518935e-01,4.382995288023527891e-01,2.274556551940455584e+00,-4.653911277026018256e-01,3.207777354971241279e-01,8.991955416261916412e-01,-3.613183838003691806e-01,1.593083766067088014e+00,-1.256801134058968539e-01,6.721511089531513328e-01,-3.912713052682750270e-01,-5.316927290320783150e-01,7.410029734372980403e-02,-6.092683921761213317e-02,2.226378325346856091e-02,1.455033609993534816e+00,5.886521157332045284e-01,-8.492903962959794661e-01,4.123627719372895961e-01,1.426099043484057471e+00,5.198270918877117008e-01,4.579269778685329251e-01,1.414375030309381165e+00,-5.647638647718857818e-01,5.931212854497519560e-01,2.978721896639598410e-01,9.256159258052536476e-01,-9.703022925022519729e-02
6.993342670387266979e-01,4.879115484368406475e-01,-8.793250712684388404e-01,-3.919607226766133046e-01,-1.018456360344873607e-01,7.322461514139031458e-01,1.404850085135346038e+00,-1.521027809812169340e-01,-1.021558091333460094e+00,1.232348658345533421e-01,1.609081563646356239e+00,-2.279437924635482893e-02,-1.217832205075100593e-01,4.751271194452313940e-01,-9.690280709215454147e-01,2.051796525462535659e+00,3.092284685671407574e-01,-1.135034468365679672e+00,9.644462909162637709e-02,-4.129013978614131664e-01,7.083031160975239438e-02,5.036886164492346829e-01,-6.865712760702282758e-01,3.819823608679289162e-01,1.806859249986727756e+00,-1.240517938186272151e-01,-7.013376364104623173e-03,-5.847813854340107032e-01,-9.140360471073086801e-01,-1.414793669458420666e+00,4.159325870750276710e-01,1.813610459961220833e+00,1.571711330576396892e-01,5.884517639341759754e-01,-7.888615358381093623e-01,-1.068727323637977289e+00,1.460529276678891319e+00,6.310138157068236886e-01,2.613765776581405298e+00,4.923387750168138899e-01,4.825778700732459292e-01,4.300711137653934202e-02,-5.088623768748106180e-01,2.576334983850126492e-01,-1.919594225085397010e-01,8.897274274295783325e-01,1.573776116615510867e+00,3.018322701326529162e-02,3.046055519252593990e-01,9.246860153705560581e-02,4.764768273220047590e+00,2.263252289786664040e+00,3.885937576572531804e-01,-6.860688399074594823e-01,-2.815388489545047612e-01,1.501415040215700936e+00,5.155913905198258318e-01,2.001324157034451157e-01,-1.090485449260469419e+00,2.139942846871592863e+00,-2.803468233781247765e-02,-1.079165089666544119e+00,-1.536030901642941038e-01,-6.425092784284902603e-02,3.909048854447928489e-01,-4.479239756918541593e-01,-1.292428046750212944e+00,-2.329673136135078648e-01,-4.766538815643509563e-01,1.576929465870307912e+00,2.297447852501099508e+00,2.665725788907912785e-01,4.241827705892890765e-02,7.881093840190965816e-01,-1.127487050959914555e-01,9.653569905818566443e-01,-1.170508328413826238e+00,8.294311005276751025e-01,-6.039040427094747310e-01,-1.040755543022928498e+00,1.332422724512200229e+00,3.583646959958732836e-01,-2.428930785395065906e-01,1.599863015802961863e+00,1.181267848712710400e+00,-1.481440467097904001e+00,2.226443433504298186e-01,2.617337210397110425e-01,8.624448880566879527e-01,-4.684228998883405160e-01,1.138119045010723696e+00,-9.820102345054237958e-02,2.390656007266690475e-01,1.099141610800838387e-01,8.413621906039112641e-01,-8.522168118315568419e-01
8.556865911867623797e-01,1.583960615199055733e+00,-6.658905881143235561e-01,-6.656096133614108901e-01,2.712455048816231895e-01,2.063805602060637678e-01,1.113745793362329373e+00,-2.030560652857446302e-01,-1.083618808220410124e+00,-3.562219731369755671e-01,9.320140423449942979e-01,3.267344785858465606e-02,-1.659906457512931033e-01,7.845151984584773919e-01,-7.811151085062990607e-01,1.652284311517422388e+00,4.547584102047644294e-01,-1.150953914130120825e+00,-5.853951503704206416e-02,-4.752510955044445540e-01,6.483637281228415983e-02,-7.168130337607042657e-02,-1.019638644232266911e+00,4.177471428585995961e-01,1.802445633328197738e+00,5.926907838800410389e-01,1.106231786854486310e-02,-4.822219414508333024e-01,-1.053226786817316629e+00,-1.477186188844793024e+00,2.849377527123080345e-01,1.448753620286272081e+00,1.910874683571073263e-02,4.641523475322941183e-01,-1.007047495749933352e+00,-9.775016982668078835e-01,1.658553561907039287e+00,4.760940981008048301e-01,2.149260776163396169e+00,-3.567226281898803197e-01,1.843705702277884106e-01,5.083353216037256317e-03,-6.050878633126832717e-01,3.856313641950956939e-01,6.883247380826224004e-02,1.174162519243507452e+00,1.646647839969870297e+00,2.647475975929235448e-01,1.750542494192895981e-01,7.233916632064931740e-01,4.273581900242781728e+00,1.807810027482802839e+00,1.240419894443629267e-01,-4.845358255481929111e-01,3.127798267006841604e-01,1.012094019122022903e+00,-2.010307903110024608e-01,3.124654534831086128e-01,-1.352776673941364027e+00,7.149122673299305175e-01,-3.722298082620041360e-01,-4.543240976339084636e-01,3.180683250580356169e-01,-1.949611759045827286e-01,6.941848947527999858e-01,-1.073389749084481259e-01,-1.159168594011171116e+00,-6.120348221012591461e-01,-4.517279978258024187e-01,1.855611050496835057e+00,1.899722315568029618e+00,-1.389688153403253468e-01,-4.236473797519623163e-01,6.601446881994119664e-01,-1.650472566413323239e-01,9.059786591503402597e-01,-1.018903756148300754e+00,4.660662742941064085e-01,-6.944623739483161140e-01,-8.528918106480355421e-01,1.466735751189748971e+00,-1.897620872234634382e-01,-1.282376214719352647e-01,1.513094028128795232e+00,9.652150029054071823e-01,-1.111400841621529079e+00,5.535739053429743484e-01,-5.382349045041077140e-01,7.691753261522619178e-01,-1.204562266564954687e-01,6.406498826671135349e-01,-8.663531464284934813e-01,5.438663066709839011e-01,4.170889903672755916e-02,3.624538406408271962e-01,-5.337838830806829193e-01
9.172065888242759701e-01,2.356825507593974800e-01,-3.149134212517026854e-01,-3.558084476179568245e-02,-5.897513890205227094e-01,1.066817217721252931e+00,6.660175424817571521e-01,3.397941186726374796e-01,1.849564477181948607e+00,4.569621609091866210e-01,3.211082493434199714e-01,-1.108589279720345044e-01,-5.035622586026834435e-01,-2.115998242229538695e-01,-2.790953148773016590e-01,1.615225649071253988e+00,-5.706328833837237546e-01,-4.313225485193523667e-01,1.386281834105929645e-01,2.536861818620923525e-01,-9.122188259534278476e-01,7.756616217606878694e-01,-3.349495158555707564e-01,1.123819033314967658e-01,1.433109275064596400e+00,-5.889341033537055514e-01,-2.057304481853488298e-01,-7.543385377755927879e-01,-9.800713360113550987e-01,-8.113404902251170059e-01,7.479322459815263002e-01,2.825412751278128631e+00,1.139445457184423138e-01,1.391411573347825781e-01,-6.719379837027614766e-01,-6.360958399497576021e-01,1.914286374056326068e+00,6.743544314719699395e-01,1.539005827015007988e+00,1.249435315275195801e+00,1.349146444073364037e+00,6.012118582164114322e-01,1.849610409375436748e-01,3.271156153180763138e-01,4.577412148791873414e-01,6.353480332444847445e-01,2.572298356808317976e+00,3.674307649440799461e-01,6.168372099211149040e-01,-2.753790132060983664e-01,4.995737422779668258e+00,2.438113014317959681e+00,1.114751307318717632e+00,-3.629544379906302076e-01,-5.070005055560391494e-01,1.393166953031176325e+00,1.306782209576808351e-01,-7.088188563570830825e-01,-5.563724551954827291e-01,2.475193346635993663e+00,3.091998302095602114e-01,-7.759489463670915521e-01,-6.289578621632895272e-01,-3.119120406807207591e-02,6.902567076718226780e-01,6.189905684257740459e-02,-3.253068738799693715e-01,1.504848814294646342e+00,-5.796740088059835205e-01,-2.940213048922812877e-01,2.936325156339994358e+00,3.580885376960013522e-02,1.488459567477879997e-01,3.047248963008081235e-01,4.812991528773084005e-01,6.389032217907544275e-01,-2.504193785999051514e-01,7.502335520825559323e-02,-1.032644184611464455e+00,-7.762376170872855585e-01,5.582572443161424314e-01,3.791160802322263157e-01,-6.264110720734201720e-01,1.634572863961869738e+00,4.949342485350137211e-01,-1.268702225535246697e+00,-2.383218075590819995e-01,1.921328036719707200e+00,1.273792776576733843e+00,-1.713452904561038936e+00,2.257830881344558005e+00,9.161506079744830000e-02,1.421813405487575510e+00,6.264542479434431765e-01,-8.499380206859661335e-01,-7.911012955118450485e-01
8.189327311019768407e-01,8.499257062004501595e-01,3.856839812316120719e-01,-6.333785333131710660e-01,-1.452124042607169929e-01,1.792317042252882797e-01,-9.882279919461045559e-02,-2.431681167303988145e-02,1.788612300920437104e+00,3.898404528689521920e-01,-1.169221649978598454e-01,9.200242805401107060e-02,-5.774369142874715699e-01,-2.845754957222412229e-01,-7.709494889279527863e-02,1.261910518269306891e+00,-7.907794866960013991e-01,4.268045643754990737e-01,-3.537075918352180354e-02,3.629135781398558080e-01,-1.112791670992265836e+00,3.668341145195300745e-01,-3.598310730943717894e-01,9.556403746523761678e-02,1.540144370712555055e+00,-1.047477858299663556e-01,2.640327820994134433e-01,-7.138882857940028748e-01,-1.049950493796703910e+00,-8.725233500787858976e-01,3.081009557774803120e-01,2.876230759958590788e+00,-4.390092901698819938e-01,-1.545444765551964861e-01,-5.898902117765369990e-01,-3.472196144605076418e-01,1.600484840246285234e+00,1.044018666033823539e+00,1.515206102396256638e+00,1.509515248827341782e+00,7.795555456725463683e-01,6.074379862705115984e-01,3.183788624296281511e-01,-5.848715564459536220e-02,8.034988410527375002e-01,7.393965434552418614e-01,2.918115711017483793e+00,-3.879127538074876591e-02,7.074692411136801473e-02,8.359977182420365027e-01,3.567940653993264988e+00,1.652781999785885247e+00,4.305806479439581724e-01,-2.183185015317572475e-01,-6.098393594924954586e-01,1.560411798555300322e+00,3.518506957944073643e-01,-3.298014027171867202e-01,-4.963697248852308452e-01,1.487608209468815224e+00,5.519148556263101524e-01,7.317614119433635267e-02,-9.341830204385685732e-02,1.026554729680932532e+00,1.363485816605214840e+00,6.028464770856652999e-01,-2.267767369792351162e-01,1.365390878709138445e+00,2.318295858202294446e-01,-4.135483125230308143e-01,2.240935349498804463e+00,-5.658708656219265665e-01,2.119091883729702364e-01,-6.903721247020477847e-02,-3.976541563624789999e-02,8.233694071301391748e-01,9.195107017951958950e-02,3.519505329243825531e-01,-1.297318491785519390e+00,-1.076339037453019620e-01,1.866144200817955179e-01,9.696664069484342563e-02,-3.306150545053086476e-01,1.727443544774402540e+00,6.216062614015180898e-01,-1.045658706086867396e+00,2.551204618341376684e-01,1.672674615477420357e+00,7.717709337102325318e-01,-4.543098617635087932e-01,1.957117702071501819e+00,-5.024258844295763637e-01,1.183117982651303635e+00,4.292491999372499700e-01,-1.913678019802697028e-01,-1.786410014244203537e-01
7.348822214293762034e-01,1.493210298460967422e-02,1.172289757487326028e-01,4.716697150213966516e-02,-1.185666274181527424e-01,7.258803325148326380e-01,7.502879568547284883e-01,-2.033250227601218207e-01,9.187742791901045702e-01,4.375992126971767204e-01,3.533107934361694458e-01,-3.091874647698650835e-01,-5.444586914525022525e-01,-8.970368895995166347e-02,1.200306645545740070e-02,1.248800757430879926e+00,-9.732024714977887125e-01,-2.635011734938654815e-01,3.843505655253645070e-01,4.122587158942803143e-01,-1.096401470883852758e+00,1.275594749647280257e-01,-3.799812674302027737e-01,3.464322760154270320e-01,1.242248351598584488e+00,-5.358111061987139712e-01,2.121099882944861292e-01,-7.681160315980228859e-01,-5.455944341691405519e-01,-4.611759989290208361e-01,7.065078982323411694e-01,2.775702656796354084e+00,1.065361406243651721e-01,-9.580956246403227183e-02,-5.268871049783111493e-01,-6.782266514403151314e-01,1.224771486500401574e+00,1.073229802836535240e+00,1.394001692698096040e+00,1.308499475172018478e+00,1.027372628509257035e+00,5.870746390188367192e-01,-1.233851817162499170e-02,1.595557767379602865e-01,6.949507936355200366e-01,8.014851821150035249e-01,2.390740896038474617e+00,-7.029395859863231399e-02,4.500027804541106846e-01,3.302984674710430779e-01,4.263236484373185142e+00,1.730857888169853975e+00,4.137666730621039624e-01,-5.025654403511324864e-01,-6.592296259193139996e-01,1.415078149745480074e+00,1.042880091158198408e-01,-4.150460954816636017e-01,4.316153261743060909e-04,1.419108037599460248e+00,1.123013908670084327e+00,-8.866778421868061200e-01,-7.030216934390058903e-01,3.640319325962722563e-01,5.992138141487410863e-01,-1.474296530190799537e-02,-4.600151310357841750e-01,1.609168265319392610e+00,-6.576664305640682606e-01,-2.192837957255022729e-02,2.586212285673040512e+00,-2.664150009458878809e-01,3.850761246825484818e-01,8.813762676592922229e-01,8.989653526396358674e-02,1.338528683680520803e+00,-7.926074612587430401e-02,7.430611900919170676e-02,-4.860639683941208045e-01,-8.047894895973994878e-01,-1.606076873391250048e-01,-7.581332558846867742e-02,-2.983177060067807029e-01,1.620735400110724811e+00,1.639037209998222000e-01,-9.230138028583129151e-01,8.108214804538058096e-02,2.046772017319310244e+00,9.553959550077358864e-01,-4.984439854961625338e-01,1.767393913026765961e+00,-2.126420799888477653e-01,1.033917414556752457e+00,6.577280655526378528e-01,-1.421563671585863164e-01,-3.968463584593431293e-01
7.027370732185356239e-01,7.366688619963899232e-01,5.695929119527864959e-01,-8.437703945603306499e-01,-6.982721117213600004e-02,-4.861752539820435315e-02,-3.118161532219229648e-01,-1.843512285433035192e-01,1.616263889795965802e+00,5.331295256557289086e-01,5.644153722927064409e-02,1.916669798647558376e-01,-5.616891060974007477e-01,-3.962235352260546906e-01,-1.262014655333105750e-01,1.322369438942746278e+00,-8.573312585057291102e-01,7.898938927348208017e-01,-7.225565636431365013e-02,3.814897706501158003e-01,-1.120358308678142789e+00,4.215570920515659958e-01,-2.584268822060655779e-01,8.120014809222932117e-02,1.629441421370610987e+00,-1.407279824508120281e-01,4.792821356925426324e-01,-7.198921733780044852e-01,-1.026114328124350328e+00,-9.346358540982118157e-01,1.231050857601204973e-01,2.969181588196264876e+00,-6.494911437783308372e-01,-2.066969034065995192e-01,-4.757331466828092492e-01,-2.796490015104856064e-01,1.362766807014224035e+00,1.268819584914689713e+00,1.781404233220851951e+00,1.931629376336408299e+00,5.758631091891573961e-01,5.765407592347684407e-01,3.828158561913305169e-01,-2.914868840372027425e-01,7.940615506445645178e-01,6.818631351269096585e-01,2.997084793940771430e+00,-3.391821837111011484e-01,-1.602522035580705717e-01,1.129407083091570119e+00,3.096196302201863926e+00,1.469697330235185007e+00,1.925692979204172706e-01,-2.526832370060491106e-01,-8.831854791504030189e-01,1.851581927656413828e+00,7.938106295135005652e-01,-1.338177025276434118e-01,-4.336422830291858377e-01,1.621700797376062875e+00,7.521994616141048917e-01,2.174935899570032971e-01,1.186148714738017793e-02,1.580718850965691313e+00,1.539620068088739080e+00,6.789817138867606516e-01,-3.006787276415753274e-01,1.307071576069622765e+00,6.326086991829468209e-01,-4.634707364086539938e-01,2.046616779115357776e+00,-6.603813167970227216e-01,4.137285124703583561e-01,-1.858978245409027841e-01,-3.013441000667032577e-01,9.353310454607535185e-01,1.246572817355512952e-01,7.092315788704606216e-01,-1.376432138103923508e+00,1.255773124177825828e-01,4.993999502633794663e-02,2.147082685386503265e-01,-2.155876362455617645e-01,1.794677641564503823e+00,8.490189500752053364e-01,-1.119414885655171776e+00,3.768103392468689083e-01,1.753355246480216234e+00,5.438477158410821577e-01,5.482872036997393783e-02,1.962777613629714812e+00,-4.758549023141169787e-01,8.709637528976342802e-01,3.142883232190758491e-01,4.389626325660857531e-01,-3.148113096712995551e-02
8.713308521152705044e-01,1.002091822682136035e+00,-2.160132471354504480e-01,-5.348472890946286418e-01,-2.199307070088464267e-01,5.997826805302295394e-01,8.334735825527830322e-01,5.265214225112238577e-02,1.022746008096570902e+00,-3.603233423793358869e-02,-6.983067967329370518e-02,-9.606234907585273208e-02,-4.633588346697787852e-01,-2.146612459233490644e-03,-3.964842198941558316e-01,1.123537010850755413e+00,-4.468191025225543567e-01,-5.030160361331732499e-01,-1.123175887673633910e-01,-1.182517652533174313e-02,-6.442653922117702603e-01,3.400167707763778746e-01,-6.676976593790027170e-01,1.354967399927666794e-01,1.757634918418084391e+00,3.899956253741533874e-01,-1.340191687024448186e-01,-6.970033516181747268e-01,-1.725052617828257695e+00,-1.388612237480388423e+00,4.669861187808787006e-01,2.494538164418933057e+00,-7.993619990893577332e-02,4.114417443609718616e-01,-8.870508853877078215e-01,-4.976973676497161714e-01,2.138449095260036348e+00,4.060935913199929526e-01,1.794806224382399673e+00,3.692880768307523764e-01,7.864544807395573711e-01,6.005005652095224411e-01,-7.635037718122623940e-02,1.936713370552480828e-01,6.376551103859821046e-01,9.151390586087674306e-01,2.226263626509577431e+00,4.880054509980019661e-01,4.019460751096876616e-01,-6.989115907780230064e-02,4.404065550979565202e+00,2.440219123999214812e+00,5.843196306571628584e-01,-1.428894076877870734e-01,3.664504281941860508e-02,1.170344444602353651e+00,-2.909905253356868116e-01,-3.978415560446769694e-01,-9.471425733104001932e-01,1.632741873481856176e+00,-4.606479056825504292e-01,-3.641715901559353652e-01,5.504705593271888575e-02,-1.453922746150287937e-01,1.254698056282302021e+00,6.181355146255187449e-01,-5.124705625047716318e-01,8.134320900050051595e-01,-3.424623013820740636e-01,5.607946552235296700e-01,2.064653954470824004e+00,-1.486484039921404932e-01,-2.083691963596809860e-01,-8.223510608474796091e-02,3.298103719527883948e-01,2.728879041762105606e-01,-6.581011149558534390e-01,-1.932253417379886651e-01,-1.445158192910921180e+00,-6.373149922518694943e-01,9.650488916926096561e-01,-7.455732806891351983e-02,-6.121468675930936687e-01,1.939769572574440604e+00,5.815511600309211104e-01,-1.305856761210718808e+00,1.890332900312137188e-01,5.822682197048585362e-01,1.218996896387270379e+00,-1.298933157629717172e+00,1.446170521764935879e+00,-4.490314435504171309e-01,1.237609843612292648e+00,4.917001003436991535e-01,-1.115483655759625048e+00,-7.192714928602932378e-01
8.094434585454168829e-01,1.680042574562992552e+00,-2.361156058478067754e-01,-1.204228012242827051e+00,6.232282684999769506e-02,-1.265588947769574202e-01,2.615394683647967455e-01,-8.053402339433984869e-02,1.483699515149485837e-01,-5.112178793936814070e-02,5.796998295512063581e-01,3.629872419174148823e-01,-2.619861756606197689e-01,2.436384169504110520e-01,-7.950816097845796460e-01,1.674740431497442117e+00,2.367326888402389584e-01,-1.478833775558643371e-01,-3.657815161805366699e-01,-3.238647631184927711e-01,-1.875930304460362574e-01,4.180343280355760527e-01,-7.291032585281930212e-01,1.263913558104847734e-01,2.051055683998693091e+00,6.029057365089378617e-01,1.653439396656782301e-01,-5.332376755947682012e-01,-1.511058918365082882e+00,-1.739591271154709240e+00,-5.407966522241142160e-02,2.002298627902269867e+00,-5.404972447289675408e-01,3.583673386980725795e-01,-8.694311731793081810e-01,-5.651584029420545496e-01,1.838187007527288142e+00,6.639490430378953700e-01,2.401152855232921546e+00,5.772788944576149328e-01,1.253985527769010400e-01,1.778844501886466811e-01,-1.074097396168026963e-01,-2.608809385245054735e-02,2.455807937056795898e-01,9.276783677870629186e-01,2.296937142166175061e+00,6.526053357867805937e-02,-1.792914910104477788e-01,9.671074456127110031e-01,3.567419431319338585e+00,1.872397596187645563e+00,1.862581688789075041e-01,-2.554522541280387360e-01,-1.053709187016249604e-01,1.504897578933455105e+00,4.740774578612582113e-01,2.698627914815852069e-01,-1.471984509314166356e+00,1.478980966623753890e+00,-5.320047798390246108e-01,2.538517384537358756e-01,6.285148875823594050e-01,7.856064896232219930e-01,1.460098671523463620e+00,5.127762594427192067e-01,-8.565454620596547608e-01,-2.851611465820019786e-01,5.339235615826868342e-01,1.006252135150630167e+00,1.695313535536670857e+00,-3.501105454388646621e-01,-2.139241592591596408e-01,-3.017910304449641368e-01,-2.971425501340396735e-01,4.678938686365655131e-01,-7.445088599416995745e-01,8.521381290324050450e-01,-1.528801488047956791e+00,-1.306479107398832440e-01,1.408618225278708724e+00,2.091630982519304127e-01,-2.264843481210530862e-01,1.755790549570828585e+00,1.404035748452488352e+00,-1.380361722052547258e+00,5.705674387779897661e-01,-1.500483854254344163e-01,6.071375719086112843e-01,-1.388943789338293322e-01,1.194496009986895979e+00,-7.497930818065345893e-01,5.800677406069993935e-01,-6.205273246383380403e-02,4.962225365697289226e-01,-3.730131275428090198e-01
1.149490620984348954e+00,1.971429329205028225e+00,1.763542163092190473e-01,-9.153382544950932065e-01,-3.198256946401864531e-01,5.653218156209521839e-02,-5.724994566693537568e-01,5.132434712610455252e-01,2.833741950210970195e+00,7.966486527971183840e-02,-6.908542531983838941e-01,3.705652228811366355e-01,-5.855371356889367274e-01,-1.671095441392512759e-01,-1.650607075548587988e-01,1.374080437509183961e+00,-2.729477767227229679e-01,3.366838715872170762e-01,-3.859914950049445070e-01,2.080861714254586825e-01,-9.978599675105086497e-01,5.627529606027649178e-01,-5.462958352296746201e-01,-1.133393282050053907e-01,1.665620928770516818e+00,3.095261465646487187e-01,-1.112178061101795346e-01,-6.098573197337511242e-01,-1.428147388058218281e+00,-1.156186815744034480e+00,2.463643132395622326e-01,2.654159788885688709e+00,-5.690755946346790495e-01,-1.252875908266663507e-01,-8.786831861898414253e-01,-2.357736149205404974e-01,2.387565179105662239e+00,6.022400737931079551e-01,1.185208556939353119e+00,9.044218805866431898e-01,8.988335908894182769e-01,5.715039623223583387e-01,5.001815462738882223e-01,2.259085288997664254e-01,7.744401703985042129e-01,7.761276894868360809e-01,3.281743253830596174e+00,5.440860610350513049e-01,1.099231994038017968e-01,8.832850360345392282e-01,3.858151610182023461e+00,1.860209130851296688e+00,9.550898421143731998e-01,6.129246347048944443e-02,-5.114152533220567287e-02,1.162434096442063858e+00,-1.403325542630954881e-01,-5.452369803563924533e-01,-1.217367553917018563e+00,1.352207528920376323e+00,-3.794443542695864480e-01,7.483257516098056339e-01,3.103662436794359936e-01,6.473974890090794521e-01,1.653731419820210657e+00,8.944378863057281803e-01,7.352503023546186345e-02,1.028916525695690698e+00,3.655104648348030949e-01,-6.315705082823037664e-01,2.374131337503318839e+00,-6.455047652674543723e-01,-3.661977868292949356e-01,-7.062069606887313444e-01,2.811698410818223026e-01,1.771717346661469961e-01,1.841665912746427991e-01,1.391783386849777537e-01,-1.850240551080788443e+00,1.286209592625904286e-01,9.215065753220357259e-01,1.455610307880842447e-01,-5.211046100974083828e-01,1.584878096317255292e+00,7.704643994551705344e-01,-1.025358333542351286e+00,1.865057251111602588e-01,1.089138778339364455e+00,9.592355917617334526e-01,-1.318687299973580584e+00,2.156393092191693839e+00,-8.323980036746235767e-01,1.860570557191467245e+00,3.332010263358615165e-01,-1.175083273472236733e+00,-2.384837284209024855e-01
5.944310201517936099e-01,7.041361926616440670e-01,2.912106350125795440e-01,-1.172231770029651843e+00,-2.062558752865910339e-01,9.801969614327588065e-02,1.894050672430931392e-01,-2.238850517495453996e-01,1.172240161885037768e+00,3.752236691932867574e-01,1.178201416240007293e-01,2.014109952189105102e-01,-4.725125665704342226e-01,-5.016630420254835077e-01,-5.388176577618900565e-01,1.198176163422387308e+00,-7.196678297110650213e-01,5.928683524957475415e-01,-3.253712700394298385e-01,6.860459672737037606e-02,-7.438345649872390997e-01,7.063783320662340159e-01,-3.366019253585460502e-01,-2.982681013011997950e-02,2.090664976005496722e+00,3.589639128786548672e-01,3.227650539566260246e-01,-7.539101685593636581e-01,-2.039107050603337079e+00,-1.714554990263828849e+00,-2.631583625904471146e-02,2.967772762155648891e+00,-7.056442789321923925e-01,3.600541135830622741e-01,-6.108854003049123405e-01,-1.693332010479692840e-01,1.810014247402430554e+00,8.654087303299741185e-01,2.527509670441107303e+00,1.572005023399386747e+00,3.769849145700315818e-01,6.600258180996980695e-01,2.412272072531930767e-01,-4.693518780846703820e-01,7.040632350672857420e-01,6.875252383675078960e-01,2.576119402388791890e+00,-1.557366331512805846e-01,-1.643617449854568591e-01,4.076250341326579374e-01,3.255093312484569346e+00,2.282161585016180272e+00,1.518955766747449032e-01,-9.148675097683739432e-02,-6.709339826138027707e-01,1.978658825386551134e+00,8.614139975174036623e-01,-6.091314371771867214e-02,-8.792668798409858377e-01,2.400937034646200896e+00,-2.529264423275238149e-01,1.317809413112481232e-01,3.933712826174818877e-01,1.270479578004465093e+00,1.971750595924298022e+00,1.093406732770817236e+00,-5.574345836655734132e-01,8.669412353239025482e-01,8.398453890097273833e-01,1.662321316432804341e-01,1.542348040579941237e+00,-3.499752171503101028e-01,2.908104935491804266e-01,-7.853784844320383929e-01,-1.900521293628221198e-01,1.936442823396871127e-01,-5.909881683583075862e-01,6.015076013875942929e-01,-2.042924381992727856e+00,7.891259038976722318e-02,7.189982666319111315e-01,3.408578162758758578e-01,-4.969348982824374206e-01,2.274797718412421954e+00,1.220901135570388707e+00,-1.658352410727836901e+00,4.092609711945132123e-01,8.537420449548055457e-01,7.765336865035757929e-01,-4.450937993906599610e-01,1.672187325966426608e+00,-2.617993391043316187e-01,6.132620649588640394e-01,2.548559202664238965e-01,5.164102837289152870e-02,-4.584056595942460621e-01
9.818272597798094470e-01,1.139827861168047907e+00,9.450508800847780277e-02,-7.376628757245955459e-01,-4.685466837243567051e-01,3.283294416452855469e-01,-3.469217542160006329e-01,4.111273618090700022e-01,2.549139024297989664e+00,4.279152140334849808e-01,-1.011274878380372111e-01,3.132309963455889301e-01,-5.396192131231365430e-01,-3.416466026249502796e-01,-2.835453468745669503e-01,1.637892041477276406e+00,-4.096654879723240494e-01,3.872594234849941475e-01,-2.300333994124243997e-01,2.548847735105645440e-01,-9.820780792578056584e-01,8.513366941190219084e-01,-3.174405878406181825e-01,-8.195368527571508799e-02,1.653217303738207633e+00,-1.959424802317209224e-01,-1.024475625931842160e-02,-6.765635100295042115e-01,-1.212743923781881783e+00,-1.067386269689825529e+00,2.978357706964308571e-01,2.863951530057255557e+00,-4.913624344179780001e-01,-7.454236482342288528e-02,-6.838748701116300621e-01,-3.293857385600823529e-01,2.056374370894315629e+00,8.210079514889920826e-01,1.566824342922307878e+00,1.550673202737456124e+00,9.925436323771255065e-01,5.581643456241716095e-01,5.091099457594512323e-01,7.795026153358441956e-02,5.903146363254061502e-01,6.054296596553399024e-01,3.164164442495046359e+00,2.371638284906594230e-01,1.296606615163150844e-01,6.093235163277556099e-01,4.013753995453019918e+00,2.010880887255742433e+00,9.582060694978266069e-01,-1.368462613335852118e-01,-5.358834570045313273e-01,1.558747519123151459e+00,4.488371068554933285e-01,-5.031584958576397204e-01,-9.400471599796085265e-01,2.177538040560095034e+00,4.769797592062627323e-02,2.788364324086052837e-01,-1.728112953703422189e-02,8.854890438686513487e-01,1.408021071746846653e+00,6.005017681803730412e-01,-1.020760233782629367e-01,1.229907487430330182e+00,3.818263180063143358e-01,-7.071493436404596711e-01,2.559487879763830964e+00,-4.112922944118426738e-01,3.497511180867420022e-02,-4.815122653712375911e-01,1.827995347632785372e-01,3.966050570017399801e-01,7.831047505669597175e-02,4.929506698633742134e-01,-1.654168252752650448e+00,2.102617706856602098e-03,7.067689381993893516e-01,4.746511470286515766e-01,-5.030553108013258168e-01,1.635831698179882832e+00,9.253494578719066999e-01,-1.238236598633820185e+00,4.095915545734818419e-02,1.635801405174578171e+00,9.136192348150786735e-01,-1.214035753278240204e+00,2.379895031269873229e+00,-3.414921733511393498e-01,1.475927954875141612e+00,3.464939875602660591e-01,-5.203432316490688159e-01,-3.737858987384963250e-01
1.084604507707985555e+00,1.182492548259433285e+00,-4.193902856772663834e-01,-4.695254315349838281e-01,-4.692585540550356926e-01,4.600906048431568918e-01,-2.636258608866677844e-01,5.864059481098407023e-01,1.867786913606952259e+00,4.806740041999403301e-01,7.947219478305722618e-01,4.228822397681756273e-01,-3.525633171535844101e-01,1.002195793845207378e-01,-5.136825412456683670e-01,2.405254152969674486e+00,2.695755379247078420e-01,-1.479219844563421926e-01,-7.189654195155614769e-02,6.647022263088277205e-02,-6.212790767746073639e-01,9.491230480631163147e-01,-3.744442505061457704e-01,5.867859749385612167e-02,1.474683574684545029e+00,-6.927917273529435871e-01,-9.734238564650424252e-02,-5.492344675366076512e-01,-3.081638952354136540e-01,-7.864744411165736082e-01,4.072103921922831105e-01,2.305560685778574204e+00,-2.446769903174690619e-01,-1.794281120343568237e-01,-6.934322978250077041e-01,-7.719809410515192649e-01,1.775045466230488866e+00,9.107784081921656005e-01,1.569353822983440505e+00,1.476267822155986398e+00,1.053829333012178182e+00,1.361242673119373303e-01,3.373252472631541043e-01,4.133861174966314556e-01,2.346388312363328899e-02,5.921709679761061329e-01,3.025332614555081179e+00,1.759818915381715643e-01,1.977224022603278897e-01,8.894739956205991449e-01,4.570014195004171498e+00,1.711654343149733748e+00,1.194412798840514434e+00,-4.840241918021901402e-01,-5.789149627082584848e-01,1.490814523540568093e+00,6.595151864484003479e-01,-3.142805837587989148e-01,-1.114241169856578617e+00,2.199831357333672521e+00,4.065520201049089843e-01,-3.257169345962701579e-02,-2.835730568306547017e-01,7.081414364735897360e-01,6.069450447455958519e-01,-2.911950907853824155e-01,-3.746512390225921196e-01,6.549549572981442358e-01,6.322530857852259878e-02,-4.136691238710228369e-01,3.153368105539110733e+00,-2.196718114384981768e-01,-3.577528982424735271e-03,2.166121081873945697e-01,7.642902161598642830e-02,9.287060175217676239e-01,7.970612811006844156e-02,1.048822418707370030e+00,-9.298716519663571267e-01,-2.814454326434547293e-01,9.798331299029209296e-01,7.441706012612077092e-01,-2.533835713816385837e-01,1.088988647592308290e+00,1.143754820926095039e+00,-1.098928913903923332e+00,-7.242725854387432882e-02,1.672635686484327033e+00,7.425138605102374889e-01,-1.017347532369563767e+00,2.446957021752101724e+00,-2.608353780917289644e-01,1.292771837155572534e+00,1.314056090019792289e-01,3.931786826631424869e-01,-3.840290498863906388e-01
7.180043700657838812e-01,9.539176164919990208e-01,-3.913341822128540426e-01,-7.451706965106945635e-01,-1.072005439005026262e-02,3.809830058738589709e-01,1.006933715003087038e+00,-2.103343402629192227e-01,-2.578465345633591532e-01,-3.049981520398983847e-02,6.904051797990372608e-01,9.269152752104950488e-03,-2.824316972967402806e-01,2.245645242795459295e-01,-7.270090273848301976e-01,1.453678824910984435e+00,-8.077090055859548201e-02,-6.068797975604542927e-01,-1.168987923813745444e-01,-2.693336817157188645e-01,-2.334713314006422458e-01,3.192272987568517406e-01,-7.205831611657103064e-01,2.462737033632587669e-01,1.927940379552091299e+00,4.248478639863861872e-01,6.738414842763194856e-02,-6.270868091816383938e-01,-1.547867394059907920e+00,-1.607521779924754757e+00,2.492365126102040473e-01,2.122964089739543425e+00,-1.539171352513636071e-01,5.382826347567826186e-01,-8.435999605188373440e-01,-6.838661447354227318e-01,1.759747777215145970e+00,5.588123982484718422e-01,2.395688798590761337e+00,4.014671269378784491e-01,3.590824816662628871e-01,3.169207324781782575e-01,-3.138591584477197771e-01,5.580907068690806050e-02,2.957365739775620339e-01,9.542863974397346460e-01,1.877182448383609481e+00,1.432605251031872917e-01,1.555169259126297499e-01,2.546042795860762320e-01,4.121605422292425658e+00,2.242191021346832791e+00,2.057303190198813692e-01,-3.480036320549149131e-01,-9.981013954327105919e-02,1.419286214251167078e+00,2.099465428026414393e-01,8.709670625471310768e-02,-1.107806003585571020e+00,1.682045230603010477e+00,-3.796632982463807870e-01,-4.723688584692040116e-01,2.302043182401039834e-01,1.813933725026267707e-01,1.123137121323331877e+00,3.297897134393824592e-01,-9.685165181920712962e-01,7.483110025709438506e-02,-9.632716551405021144e-02,1.252602283838493369e+00,1.807718332237795433e+00,-7.128905822923059521e-02,-9.174968204958981743e-02,1.343131729819322384e-01,-7.262577491208453695e-02,5.493796556869320336e-01,-9.899112937254967992e-01,4.157380305645376195e-01,-1.224403946180851577e+00,-6.404689445467648401e-01,1.189343583545608762e+00,6.197483845531204238e-02,-3.664241651999830540e-01,1.900288429289522796e+00,1.023503434462461836e+00,-1.434860491257018866e+00,4.034681586404577636e-01,7.341641915255792128e-02,9.008058992775258567e-01,-4.962347755041423003e-01,1.069359454812558008e+00,-4.428496886209332128e-01,5.482867690974665420e-01,2.013073511145897221e-01,8.021180819931220118e-02,-6.682508953701367105e-01
8.280018747522647216e-01,9.997445123121091459e-01,2.481443192969939315e-01,-5.756009474243239943e-01,3.654718337017336116e-02,8.079403975120041936e-02,9.938588788872049218e-03,-1.120100409035533762e-01,1.095263256836746413e+00,2.908046479959676134e-01,2.118079005850806162e-01,9.356534066454182119e-02,-4.916713146654842492e-01,9.037365609869937866e-03,-1.375267090462749531e-01,1.430179121364255401e+00,-5.282721065900772839e-01,1.653709931333710026e-01,4.540918375662330447e-02,2.526953828369867261e-01,-9.279291130024267531e-01,1.635253112625885130e-01,-4.783886754980968270e-01,2.222521005570022856e-01,1.471319991396635052e+00,-1.144213309224390018e-01,3.150397535060992515e-01,-6.432284747654308799e-01,-6.796762217643467219e-01,-7.741075656318571196e-01,3.067599295040004947e-01,2.519810278260626202e+00,-3.473263487074194078e-01,-1.984815547805082736e-01,-6.179013903240269112e-01,-5.427638818820210709e-01,1.378181662764659254e+00,1.101370005548909736e+00,1.508327165750923626e+00,1.260024243912651221e+00,6.326201676873407509e-01,4.063373100800973248e-01,1.310321719207169777e-01,5.582276637958520638e-02,6.301405075261732325e-01,8.371493415992323772e-01,2.732969939999426501e+00,-1.147521260242576058e-01,3.875545885929256029e-02,1.131547329451546791e+00,3.576446663226159561e+00,1.360285761685916750e+00,2.896098002204159916e-01,-3.641173015432476734e-01,-5.226036124264431537e-01,1.456794532926304342e+00,3.125647843357853839e-01,-1.242209261496839412e-01,-5.404538505401633719e-01,1.054872172731651236e+00,7.280268474830902115e-01,-2.023839343166536353e-02,-9.888985660409489731e-02,9.603038806955086493e-01,1.068059498652298878e+00,2.750940455693285935e-01,-4.178168613836814038e-01,9.745901998754419315e-01,7.788082183165154215e-02,-2.771137958794256395e-02,2.273964967913898239e+00,-5.787247396086101503e-01,1.514292953433489242e-01,3.224431981060352781e-01,-1.892869148509226940e-01,1.149718151468138494e+00,4.613724073964814432e-02,5.249439665569458624e-01,-9.084823668244712547e-01,-2.378472396778299469e-01,2.487386391373710981e-01,1.042738233337406339e-02,-1.428552676689246459e-01,1.521702625794547403e+00,6.452857764092572168e-01,-8.978444723478464784e-01,3.561901939666620720e-01,1.425939222984311083e+00,6.250153702213209206e-01,-3.690806709472310709e-02,1.702511964829834579e+00,-6.564161424544153745e-01,9.993753450561100315e-01,3.157594618104659911e-01,2.892895671782410583e-01,-8.755270783809493418e-02
7.998031732590304976e-01,7.989083504092998611e-01,1.791055506140525888e-01,-6.930138911487038200e-01,-2.209883285507185380e-01,2.534265982393463790e-01,1.368779093182842521e-02,2.252603356707065518e-02,1.548154810537082371e+00,4.142379203018067835e-01,1.838895956474130011e-01,1.570259354478774627e-01,-4.991380876241292563e-01,-2.504307643165284425e-01,-2.852404618104691369e-01,1.479803392070276002e+00,-5.734719446175672308e-01,3.064572042940080787e-01,-8.447022807906535979e-02,2.275855825700349999e-01,-9.107318844155294357e-01,5.567492581053788969e-01,-3.546966013738226953e-01,7.690502450887388985e-02,1.652233982995931827e+00,-1.395361169197670281e-01,2.111795779646251647e-01,-6.959289275834014132e-01,-1.117751252332759515e+00,-1.047680169325114541e+00,2.658589992072036834e-01,2.777642830855650224e+00,-4.308119286699599870e-01,-1.764591986630395515e-02,-6.062401752803745492e-01,-4.136926419244555397e-01,1.647312360840181178e+00,9.811883936831453656e-01,1.800386893008723010e+00,1.518115538339139592e+00,7.393036371909502691e-01,5.213820003159606031e-01,2.732007270268419497e-01,-6.316933585730773182e-02,6.066165994522210170e-01,6.991117526542762750e-01,2.802183277825186725e+00,-4.283682104273349445e-02,5.715606761113519591e-02,6.997142896606290963e-01,3.729905870884783425e+00,1.832454852441331772e+00,4.981781450005539624e-01,-2.660730398361549343e-01,-6.357070406791446304e-01,1.658087802553704471e+00,5.486225220654245005e-01,-2.520303409414692553e-01,-6.784430768737070849e-01,1.876590101035998659e+00,3.658029143999738109e-01,-1.345783694370797368e-02,-5.100802812645198470e-02,9.912623217953659971e-01,1.310834312794515899e+00,4.991396983829666789e-01,-3.716126579263129281e-01,1.103194349411766639e+00,2.979359147331633872e-01,-2.213434383900528823e-01,2.260785541477191796e+00,-4.141247000274143608e-01,2.132839248140357968e-01,-1.215754234787796706e-01,-5.712526841853199366e-02,7.276972519651824234e-01,-1.095306163726306736e-01,5.525452687813385833e-01,-1.352072785620588968e+00,-1.462401508294410291e-01,4.552386946191185890e-01,2.836084385617112513e-01,-3.509341795287885257e-01,1.737539439233192429e+00,8.585346257255751512e-01,-1.213410773125231490e+00,2.202267261916147356e-01,1.486969925146331972e+00,7.730548190108447182e-01,-5.461793687940562636e-01,1.961417297169931295e+00,-3.618034671169810257e-01,1.023449806311452548e+00,3.364884002729027213e-01,2.756125629353038675e-02,-3.089546168399412984e-01
8.566754164206813460e-01,7.841964192678645418e-01,-1.161174094753620462e-01,-1.859017951915621913e-01,1.375997844948904925e-02,5.278165596621521294e-01,7.885454237363578311e-01,-1.166082374824099488e-01,5.346372457424837243e-01,7.183307884226214357e-02,2.766977385304020265e-01,-1.968712924996625646e-01,-4.561846396806077397e-01,2.314655865093203646e-01,-1.685508761198114547e-01,1.278986980684206909e+00,-4.949061805654123569e-01,-5.880606598699193999e-01,2.012327569966186891e-01,1.405659526131662063e-01,-7.715668468715234374e-01,-1.402072713472168886e-02,-6.535331403725667121e-01,3.479180990818075969e-01,1.392822622238280239e+00,-4.218113194093193324e-02,7.101488159094780650e-02,-6.613544399010865549e-01,-7.723504080243203118e-01,-7.735653862500512234e-01,6.001546604909424598e-01,2.315306559534630271e+00,8.519501906253584833e-02,5.227767629054662357e-02,-7.532268109993507377e-01,-7.384341223092765194e-01,1.525504243121486914e+00,7.821064192226703238e-01,1.425078813356932983e+00,5.499800019496750014e-01,8.041870069505934193e-01,4.313793655804624705e-01,-1.796403961641340197e-01,3.210755672142489026e-01,5.762272901964938798e-01,9.680275930593265077e-01,2.228598624601861644e+00,1.953347822331522599e-01,4.064004590165789521e-01,4.817915835607881614e-01,4.309856150801664398e+00,1.743883322527220114e+00,3.996056621494368799e-01,-4.173765753183994454e-01,-1.682337722825751891e-01,1.113964138197967912e+00,-2.567648722508090176e-01,-2.685798192542683815e-01,-5.087861616121622799e-01,9.413928042251744621e-01,4.979314998809560855e-01,-6.092571861360221996e-01,-3.154684688153567285e-01,2.837083995012179560e-02,6.860196101233744237e-01,5.039512835150700143e-02,-5.721269514942856071e-01,9.218559381644813033e-01,-6.624333381453926251e-01,5.169752808651528753e-01,2.379736760533174067e+00,-2.923831730075252544e-01,-2.533016622125698614e-02,7.375708494903226997e-01,1.076360234104466046e-01,1.101139166404454084e+00,-3.059528285966868211e-01,8.525081679619572750e-03,-6.186258797511567931e-01,-8.036852000253433825e-01,4.176636032830197132e-01,-2.233976390533493617e-01,-2.840474780629239637e-01,1.554417924989006661e+00,3.109952419432417958e-01,-8.959475482074048536e-01,2.332937788166100090e-01,1.119971388019569414e+00,9.629654901089171881e-01,-5.518975139629498372e-01,1.397581967079838838e+00,-5.666329616224281551e-01,1.102231652392008154e+00,4.951889155813225529e-01,-3.526864893123006217e-01,-4.190168935409041562e-01
7.436359113493109518e-01,7.200431589024846035e-01,5.274492842592056752e-01,-4.902061289822964851e-01,1.764061023708786702e-01,-9.517859419197316484e-02,-2.558302003698677551e-01,-2.935906741100933193e-01,9.973333014872030056e-01,5.137767964853799940e-01,4.020342807742021685e-01,9.306383870271769942e-02,-5.223446342294770783e-01,-3.390708589496611858e-02,4.222603177056361012e-02,1.503944462183765429e+00,-7.354966065050281276e-01,4.914058235819906972e-01,2.112865051475116274e-01,4.409097284978362175e-01,-1.131276052241554808e+00,2.874782241445594799e-02,-3.426486658177225753e-01,3.059975653835577125e-01,1.284613211551846268e+00,-4.548417607541010432e-01,5.893087803461948271e-01,-6.522117944785398302e-01,-1.186583206442386462e-01,-3.911051968037861926e-01,2.796721020841891336e-01,2.622625286428393654e+00,-4.198815905177946117e-01,-4.988031088492253518e-01,-4.288783531515311664e-01,-5.760277535327193998e-01,8.731244798385633388e-01,1.510673674029904046e+00,1.385813203640182900e+00,1.803324116382444942e+00,5.834285212469967341e-01,3.569478888636802849e-01,2.007954597340466107e-01,-5.646363173774311683e-02,6.711681324592603248e-01,7.910816880258396688e-01,2.904963538617520769e+00,-4.944128232017849234e-01,-1.032034991227912951e-01,1.628438436219825647e+00,3.168326168719338476e+00,8.353788781659479135e-01,6.634192719466519561e-02,-5.155071398542103722e-01,-8.976402779240607588e-01,1.651838983651190862e+00,6.445793789265854556e-01,-9.328736663774955806e-04,-1.517719630559619670e-01,8.075192912536330869e-01,1.500662586401525056e+00,-3.087581341273432090e-02,-2.967524771948030216e-01,1.509490784319064804e+00,9.128617557665288373e-01,6.842148571678846602e-02,-4.010954756788576159e-01,1.215087745374445083e+00,1.930267597891834330e-01,-3.113077166614859337e-01,2.370208751763527300e+00,-7.614823335106222224e-01,4.452610283649575673e-01,6.577261817085174878e-01,-4.587517981300083814e-01,1.688710565039187150e+00,3.806460311731860169e-01,8.307862557589653640e-01,-5.363039112068825887e-01,-1.248753070195134374e-01,-2.901031053821543360e-01,1.553453456091866136e-02,9.287477842101554693e-02,1.366692491110698571e+00,5.786754701722935934e-01,-6.968041464182662681e-01,4.243791940446074440e-01,2.014113501406782358e+00,3.453396424965893274e-01,6.650074927477744868e-01,1.806204230214730089e+00,-6.704677492646970993e-01,7.999438660777634658e-01,2.949261384083463611e-01,1.038961101827717393e+00,2.085465791308813710e-01
6.110303936437839756e-01,4.158465293685869035e-01,7.027609843539782408e-02,-2.773723509999573289e-01,2.326285256172493376e-01,5.236972055449788943e-01,1.439469310967461446e+00,-6.044545517209094498e-01,-3.689217985820818502e-01,-9.982881400192902821e-02,8.211513667221037593e-02,-4.844052467096374714e-01,-4.832844774756041017e-01,1.381005391814271732e-01,-1.600316230147835195e-01,6.212239373196170034e-01,-9.592731119421578079e-01,-6.525748617990889677e-01,2.272244931289928438e-01,9.296774936068780137e-02,-7.455902251007622272e-01,-3.571824592293231238e-01,-7.484438898851185629e-01,4.364445645320702560e-01,1.589382655907178421e+00,4.699473971404030115e-01,2.229949173340398383e-01,-7.565322657321453814e-01,-1.466684921787494211e+00,-1.118333208165006809e+00,5.465429693201060424e-01,2.448019755329274183e+00,1.141482205973099462e-01,3.823217228306632909e-01,-7.588650267710690400e-01,-6.078339323590956633e-01,1.447593605335877998e+00,6.829722656281617121e-01,1.807703321953715303e+00,2.133490299176764582e-01,5.024705749852590442e-01,6.460407894683726227e-01,-4.516296238992740242e-01,3.919535629444565600e-02,8.654641230826162213e-01,1.120414274143068489e+00,1.693673897380735927e+00,1.036929655365503855e-01,3.956346842698885702e-01,7.493881541306790517e-02,3.963295742586005144e+00,2.033206670064851895e+00,-1.694951711884373768e-01,-3.211035540452511494e-01,-5.361282990915294810e-02,1.158775742701726674e+00,-4.510055399944493670e-01,-1.374736788284907085e-01,-2.870129842359603334e-01,7.398712062511230148e-01,2.625956810111799711e-01,-8.882360107221247691e-01,-1.403120474414047691e-01,-1.298673997235478828e-01,1.039426163256291114e+00,4.892730631399220265e-01,-7.988015923718198019e-01,9.463938844089940794e-01,-7.282501503121127095e-01,1.178402275576897029e+00,1.645152431354446332e+00,-2.520453641740043604e-01,6.141928817544713842e-02,6.688341337480732118e-01,4.053585143049821815e-02,9.253302739121322951e-01,-7.774259987474363420e-01,-4.214636312004205188e-01,-8.095942206424817655e-01,-9.623011170080492116e-01,2.645127493565667676e-01,-6.135934233085311718e-01,-3.775372144158269938e-01,2.078298978458675172e+00,1.255155619355217134e-01,-1.072004249979777502e+00,4.602319264043109870e-01,5.806021998188450883e-01,1.069887600280537754e+00,-2.655203960769679794e-01,7.605081715275703313e-01,-5.859309648041657326e-01,7.308566709583568244e-01,6.299738562360708283e-01,-6.112346833285602354e-01,-5.435573550697834211e-01
1.004928298608221970e+00,2.084275791107829345e+00,-1.705137162522936123e-01,-9.767469640349738524e-01,1.095946943240093535e-01,-1.120634783547150848e-01,1.212763389281426574e-01,9.079901424190867099e-02,6.985605210570648982e-01,-2.321007227402982209e-01,7.286503241282138443e-02,2.815243465464495332e-01,-3.572249630150751698e-01,3.879609402323915268e-01,-4.947782386966921297e-01,1.485466402981020728e+00,1.912585128338968876e-01,-3.133189149880414859e-01,-2.985307830801475770e-01,-1.898659713120205983e-01,-4.052978299351917002e-01,1.313954990276666457e-01,-8.531686891619484348e-01,1.568447811981537876e-01,1.795582494758546588e+00,6.531143589731710497e-01,2.609199696049169237e-02,-5.058777874277258224e-01,-1.272949548520264429e+00,-1.404593210815166415e+00,1.379862943952679111e-01,1.924955454412184297e+00,-3.975008637311595039e-01,1.426383173506405033e-01,-9.742890152623340239e-01,-5.791131982975380454e-01,1.998521238763721675e+00,5.632161198124263635e-01,1.700355588035019849e+00,1.617431163194561483e-01,3.497168829431018811e-01,2.279049832441643053e-01,-7.582425307770916667e-02,2.615141011334357612e-01,4.347402630886348374e-01,1.035189309407177571e+00,2.484031401998580968e+00,3.582150119566620550e-01,3.641233411918742835e-03,1.101741987537238066e+00,3.770810463551236946e+00,1.650493644211806332e+00,3.797836472132642971e-01,-1.808146026817575303e-01,2.101067224878486739e-01,1.067548366359062140e+00,-1.701064293662710725e-01,2.739912922980017318e-02,-1.402821723405402121e+00,7.219365103381489845e-01,-4.524612335687565601e-01,3.813358180621259086e-01,5.192561216545459324e-01,3.924228384297699379e-01,1.310756472729657007e+00,4.855990836910341057e-01,-5.762620734685709456e-01,-3.051176285987400316e-02,1.376825046334038682e-01,7.468575294220775040e-01,1.946364694678061946e+00,-5.181985246107854159e-01,-4.693143369731032633e-01,-1.094143752761226607e-01,-7.308649199969849408e-02,5.542356218510888777e-01,-4.102757508144251331e-01,3.968861308728931503e-01,-1.330946777220114674e+00,-2.233622143999040299e-01,1.266142979594710560e+00,-9.801889757981163687e-02,-2.389503288240033274e-01,1.535896115097953984e+00,9.600586653645690749e-01,-1.018248446525609419e+00,5.171142273171911441e-01,-1.030262571171092212e-02,7.366250020407861809e-01,-4.176141043375211082e-01,1.237438093148853113e+00,-1.053401812706123319e+00,1.127641672746187540e+00,8.645213326139239429e-02,-2.253108091494855914e-01,-2.571462003829281251e-01
7.184310814867388428e-01,4.677828037837555852e-01,-3.536894608759033609e-02,-2.174348170857650087e-01,5.657352958617202499e-02,5.777562775740370249e-01,1.084218794817679354e+00,-3.319154218616727214e-01,1.804107981191275245e-01,7.469297835959995413e-02,2.658813879645960387e-01,-3.205083846474797160e-01,-4.670989558822849497e-01,1.205261059393144402e-01,-1.898808930438707632e-01,1.032400768958722903e+00,-7.404896546484583952e-01,-5.633350318200389673e-01,2.209082402672725154e-01,1.355469799308134937e-01,-7.718563360927469530e-01,-7.241650283091805029e-02,-6.368873837729170928e-01,3.710312606762332654e-01,1.494884772219039926e+00,9.440262583941474994e-02,1.500809644770622064e-01,-7.214553350793621034e-01,-1.089606347866175495e+00,-9.337062161005786898e-01,5.753577262134115244e-01,2.452633720698832676e+00,8.868998779632919494e-02,2.133414641961327574e-01,-7.174050879336923980e-01,-6.713227263235989062e-01,1.464614763882590820e+00,7.715535821890660007e-01,1.677551155964302820e+00,5.609924877896674822e-01,7.001064662656526494e-01,5.424349278649138739e-01,-2.679473331751817677e-01,1.517780005925243314e-01,6.824014579672141867e-01,9.875719598474504979e-01,2.004313834971247044e+00,1.061310351520248219e-01,3.990528552293112763e-01,2.275732805569777306e-01,4.175960357167813441e+00,1.935446816101595635e+00,1.717504118005786784e-01,-3.913430008330694987e-01,-2.206259690346007440e-01,1.227865560984280791e+00,-2.111642991397209013e-01,-2.221211834272050489e-01,-3.731694618691030474e-01,1.075406318791598537e+00,4.367763849004684396e-01,-7.881323803914727089e-01,-2.845665053322747884e-01,2.829681523853999625e-02,8.435439243379316832e-01,2.340441877161268946e-01,-6.814216884249894024e-01,1.000226068625269527e+00,-6.457063543552419294e-01,7.425319929508613637e-01,2.084399453269862867e+00,-2.311550177085475999e-01,9.153244869145724105e-02,6.805194598860605515e-01,7.275448633515456398e-02,1.013556291324329228e+00,-5.281076420632279111e-01,-1.163742787557816571e-01,-7.304676569327777091e-01,-8.656203125966792644e-01,3.208663411512682195e-01,-3.094841648913705390e-01,-3.439409478521999741e-01,1.817952415264559196e+00,2.769167983418902024e-01,-1.038536316714194552e+00,2.958058743447417038e-01,1.002531816394309327e+00,1.012669554257632720e+00,-4.567522916150285051e-01,1.197476066466178324e+00,-4.663745714182882529e-01,8.866942203927729027e-01,5.602054411740535755e-01,-3.881104123164333397e-01,-5.080942572283655423e-01
8.176440328883010089e-01,9.588006334760810212e-01,-2.687432417172217480e-01,-5.214371070791715690e-01,-6.512368699913925751e-02,4.758014449299070581e-01,8.574613269324293796e-01,-8.534157792656560382e-02,3.735357683680758378e-01,-3.812107593338026623e-03,3.548197402377579746e-01,-6.546789823664014851e-02,-3.829632124646829561e-01,1.763974895032660584e-01,-4.677303826199996073e-01,1.336752580680601987e+00,-2.761684279558770383e-01,-5.728426128840327092e-01,-2.581156624805573674e-02,-7.665986319121370629e-02,-5.063723014121348509e-01,2.320238518326762089e-01,-6.889542844938567612e-01,2.422537412198537687e-01,1.712322633159087060e+00,2.658329120295542247e-01,4.102764024276145394e-03,-6.493835080783203484e-01,-1.334779164174943800e+00,-1.284287675780146687e+00,4.141807785269374653e-01,2.266703821490430037e+00,-6.555289302102190740e-02,3.409931150699651026e-01,-8.338392732274876318e-01,-6.543773725607031633e-01,1.804221674687006560e+00,5.830552399573871725e-01,1.913228266928146848e+00,4.332307030386890467e-01,6.187728310913241936e-01,4.169347414463950852e-01,-1.976744945428493549e-01,1.908459535753136427e-01,4.627983408543109300e-01,9.460104301811971261e-01,2.104838585912287119e+00,2.649600010417720308e-01,2.969796476251757578e-01,2.639262937826871713e-01,4.266314571061409211e+00,2.126771264512356652e+00,3.924810678562420940e-01,-3.128904623575008426e-01,-7.431832377630614994e-02,1.246372995538700845e+00,-7.325447044118016393e-02,-1.568924212809911511e-01,-9.039675311553563297e-01,1.430300800521161264e+00,-1.391162324372226256e-01,-4.574931948284334804e-01,2.067958159634579463e-02,4.760128699415133724e-02,1.016631725234651951e+00,3.100265823074123683e-01,-7.115818866322640712e-01,5.190167763361861475e-01,-3.303982863439750006e-01,8.179016760725154045e-01,2.078277678903493353e+00,-1.672480327059817917e-01,-1.195418527428286776e-01,2.550847745886630769e-01,9.540610738807998870e-02,6.435070008821033305e-01,-6.700382769332455801e-01,1.403760892430660490e-01,-1.097339957625763640e+00,-6.778260845805370582e-01,9.115825156565505738e-01,-5.174988951873643606e-02,-4.032634418468862281e-01,1.779827307341704135e+00,6.952231500508444517e-01,-1.223260451956574402e+00,2.884919912564209432e-01,5.328564690498065470e-01,1.000861767187779749e+00,-7.444238856421410144e-01,1.292116739508013756e+00,-4.957886681629273262e-01,9.284803945842262651e-01,3.603557597044482752e-01,-3.768243662676375449e-01,-5.970264629115127342e-01
9.498560799358048978e-01,9.965278950338433139e-01,-1.339404294768687387e-01,-3.084869287297971607e-01,-8.720771068378764534e-02,3.241995772917588003e-01,9.625425967396389337e-02,1.306812433666910689e-01,1.027526248136354958e+00,3.264287633991931337e-01,6.363494559324214261e-01,1.310341238727697477e-01,-4.055400115475132905e-01,2.339386265657483754e-01,-2.474949335331966260e-01,1.891436279052441050e+00,-1.360944530897999216e-01,-2.456641908044647216e-01,1.438205690053586117e-01,1.694977233866699629e-01,-7.610231444270818546e-01,3.127615432166022669e-01,-4.990861630622148160e-01,2.703040183663270590e-01,1.325785393401550438e+00,-4.777769712256036416e-01,1.376090400157708171e-01,-5.824013900511041397e-01,-1.846913266752207017e-01,-5.714545362325303968e-01,4.707132923574330885e-01,2.251538051324568634e+00,-1.205798501197307415e-01,-2.442515033042453321e-01,-6.542774824454746785e-01,-8.021121890075795235e-01,1.371610388621375076e+00,1.054280225890426692e+00,1.386674726751228715e+00,1.167604733490228641e+00,8.450742966869924100e-01,2.080560585067986190e-01,7.600384761102317588e-02,3.472283044684546516e-01,3.039581388616050539e-01,8.000547560877249165e-01,2.700522105571099729e+00,-5.166488667652791023e-04,2.037093614767412908e-01,1.077569765341202856e+00,4.181443923908392257e+00,1.348722660814753560e+00,6.386675234608455431e-01,-5.371606976565395097e-01,-4.922174921346910148e-01,1.336505862487876506e+00,3.046048229242778183e-01,-1.742427008995144078e-01,-6.608251620499645540e-01,1.225125203876042956e+00,8.452871543843003543e-01,-2.658425785648300121e-01,-3.493688396306325883e-01,6.372582060476553734e-01,5.398145410433048408e-01,-2.612681791711477519e-01,-4.857701120487407653e-01,7.859103878411138888e-01,-2.535624854251950500e-01,-2.426930428261919737e-03,2.792307892636226363e+00,-3.955133066351886884e-01,7.447017214345839908e-02,7.037732430210164036e-01,-8.386511262018743473e-02,1.347822491319603522e+00,7.257743338994260274e-02,7.017355366430806374e-01,-5.210866469346455698e-01,-4.797586973610160066e-01,4.597168068672703445e-01,2.042207217063271296e-01,-9.638174696479215320e-02,1.183115388208580976e+00,6.911016791405673043e-01,-8.284758928539521783e-01,1.668851876174216875e-01,1.570896150453140461e+00,6.644288640087645526e-01,-3.087247608219511052e-01,1.888941450637643404e+00,-5.299659348573466655e-01,1.093191964555814355e+00,2.649241396970610785e-01,4.662633748346735607e-01,-1.954096898358607393e-01
1.234703040883498248e+00,2.359317749285698262e+00,1.239393361894243345e-01,-1.008028031445416861e+00,-2.472533392062303270e-01,-1.432291353365560682e-01,-8.592186342505159224e-01,6.052050579797557672e-01,2.806536832477896759e+00,3.802978475059748398e-02,-5.675948027590604905e-01,5.249637457966649379e-01,-5.375169809204455307e-01,3.065330991476530875e-03,-2.070532812284805457e-01,1.619212230188210588e+00,3.164442845821341388e-02,3.481236019840451834e-01,-4.312002158975645760e-01,1.470699601274127744e-01,-9.040516028987827246e-01,5.418725230524785719e-01,-6.005182563284379160e-01,-1.056614667445419931e-01,1.632142509783981232e+00,2.901575138331825010e-01,-9.584753007446208950e-02,-5.294912369089802562e-01,-1.131288319357445005e+00,-1.089119333610982121e+00,1.696593466067048417e-01,2.417224139535995686e+00,-6.419003242089011962e-01,-2.582719591941793347e-01,-9.101223881795390547e-01,-3.130526680426544694e-01,2.341415137482666609e+00,6.616208643132460709e-01,1.090078600359565275e+00,8.579966554166895687e-01,8.168676861977133274e-01,4.007079743613416456e-01,5.189901991194224573e-01,3.184227402786312666e-01,6.369667066737704220e-01,7.965457672896512076e-01,3.415996107056474607e+00,5.240352483443545539e-01,4.653443246128041721e-03,1.306416438260554536e+00,3.766901134826000863e+00,1.561639238710241129e+00,9.902587942832158374e-01,1.312218808581461227e-02,-2.874067461561047310e-03,1.104785840781858486e+00,-8.672838201206289899e-02,-4.265607488699589833e-01,-1.396837907135658696e+00,1.083612563109523030e+00,-3.236432716898172135e-01,9.834971852092895261e-01,4.046751593569165584e-01,7.950590832418091836e-01,1.557776324342819763e+00,7.284392642539040397e-01,6.755702141799679872e-02,7.305127850502273201e-01,4.770634296688132103e-01,-6.362113654728251966e-01,2.483714524439951887e+00,-7.486799102287695629e-01,-4.690474605895866289e-01,-6.448250635096888228e-01,1.692394987111620619e-01,3.247095787018822177e-01,3.226272274216741009e-01,3.969623446749972473e-01,-1.729758088948652350e+00,2.440549136120067075e-01,1.053782894154565497e+00,1.982213140268856977e-01,-3.797455550976017724e-01,1.349550799834029480e+00,9.111274166698416499e-01,-8.967685705217018910e-01,2.457496485036934075e-01,9.781041189491777033e-01,7.942339321228988336e-01,-1.088038801598144811e+00,2.176373869591114563e+00,-1.014034314287975302e+00,1.876207114569905965e+00,1.823820227357318413e-01,-8.307522867502148411e-01,-8.499929098171887798e-02
9.431359192554075177e-01,1.276643459734849717e+00,-3.722910036744717654e-01,-5.235430735056193496e-01,-1.477741627968938432e-01,5.270269495697454953e-01,7.935946144084713438e-01,1.149935932232362124e-01,7.580968903857754349e-01,-1.235372928355672750e-01,1.231067633835592479e-01,-2.735173195499324139e-02,-3.976154345124560674e-01,2.243547569789778873e-01,-4.649414322017223489e-01,1.334646450890508262e+00,-1.401802813995723929e-01,-6.980510493615293965e-01,-1.070944957657332941e-01,-1.115135530190642377e-01,-4.916941950856725807e-01,2.760847262667597279e-01,-7.619769927327925130e-01,1.850254612108311603e-01,1.714396488835601806e+00,3.801138244082649664e-01,-1.680327193066179781e-01,-6.252084932586364774e-01,-1.456349460433516985e+00,-1.335105345780449593e+00,4.627367009598978287e-01,2.203780341569125056e+00,-3.386167083071034423e-02,3.631624899794881345e-01,-9.436913958032563388e-01,-6.354728648632955723e-01,2.099750158232590369e+00,3.928314831504833293e-01,1.729874606108080748e+00,1.559628790975806645e-01,7.317733742118407436e-01,4.318117127512061670e-01,-1.571744190609867253e-01,3.371165164156208482e-01,4.719660414970553997e-01,9.677240304282416217e-01,2.190395652378430036e+00,5.211349371649722784e-01,3.878719285677474926e-01,1.629930937433859417e-01,4.499243183152214165e+00,2.254959760702786475e+00,6.198579261247907368e-01,-2.201095208935148206e-01,1.540662917150092959e-01,1.050920386257904848e+00,-3.481358605639817139e-01,-2.949554500401753709e-01,-1.103668541106872514e+00,1.373184881190017359e+00,-4.496543914771573558e-01,-3.240803330688005746e-01,8.548491227951514337e-02,-2.301254833962449453e-01,1.048608596025456308e+00,3.787851739918307592e-01,-5.920386106702951734e-01,4.851605007819189685e-01,-4.227763830640439702e-01,7.431158637167472047e-01,2.182079723493090651e+00,-1.581848330493767218e-01,-3.317103116907431093e-01,1.079594363143688562e-01,2.768665199050159842e-01,4.227659423493261848e-01,-6.459703658153808092e-01,-4.706718481691063438e-02,-1.234515643420227349e+00,-6.857883843434626758e-01,1.136198353005001271e+00,-7.394263449671348298e-02,-5.021602624657673930e-01,1.729738523047771093e+00,6.508998819388479573e-01,-1.197889241248702996e+00,2.215973491044695987e-01,3.827430746779686421e-01,1.134800732037441362e+00,-1.165842834034245490e+00,1.363814227340912177e+00,-5.811040245612958399e-01,1.225883241964244919e+00,3.834022298692454367e-01,-8.757170722060256818e-01,-6.644111950550932733e-01
6.456476432494744344e-01,4.831484335478468672e-01,2.491358204755360073e-01,-6.138257897375954952e-01,5.806169643200752295e-02,6.064741126638278912e-02,7.444764442389445458e-02,-3.158938132357714812e-01,5.109793618786736547e-01,5.480458477437116782e-01,8.170636703904523568e-01,1.305917425758033878e-01,-4.132637664164283686e-01,-6.440644617320413767e-02,-2.960212364158940623e-01,1.690406243354039661e+00,-5.398313542058600367e-01,3.274145022502856772e-01,1.262077173198939140e-01,2.277032417131833741e-01,-8.240400263125673419e-01,3.179453789147140830e-01,-3.234623921120514112e-01,2.717481579612149312e-01,1.530657278046229308e+00,-4.121208031753249568e-01,5.295305113763126847e-01,-6.615825215229319545e-01,-4.601228407026715095e-01,-7.801162754822971168e-01,2.002251006329898442e-01,2.568982950619939754e+00,-4.130114429811989618e-01,-1.812804722738255436e-01,-4.442476436642548987e-01,-6.216521272854499403e-01,9.647665106771992072e-01,1.378931892667612402e+00,1.968065719310313932e+00,1.813559903905199722e+00,4.800460296000126359e-01,3.036058395669423149e-01,9.886058523626480021e-02,-1.582999315675320817e-01,4.372517925887605683e-01,7.331012954819958738e-01,2.617067010372300384e+00,-5.187816174784343204e-01,-1.196668827589208312e-01,1.232325861064436090e+00,3.365366007543949323e+00,1.269660401859219911e+00,7.529610327990499119e-02,-5.517435650619565424e-01,-9.504494120427244841e-01,1.861394054483390903e+00,9.578433571905092814e-01,1.191456429499392067e-01,-3.832801902387562576e-01,1.530958586257920029e+00,1.116410654773884126e+00,-2.436193686389253876e-01,-1.984631559661408085e-01,1.433254029959974751e+00,9.554352145753397529e-01,5.088599797011927883e-02,-6.650934293196387737e-01,8.703055994743003065e-01,3.168323533550315707e-01,8.501183930905042985e-02,2.233265954460537550e+00,-4.853278384179913751e-01,4.960338258386505217e-01,4.859296417447610539e-01,-4.761233400843179475e-01,1.431026521135535745e+00,-6.225876323602375084e-02,1.042918034374208602e+00,-7.414942433272337929e-01,-2.075521241735193978e-01,1.016330742300711742e-01,2.661697785350061740e-01,-5.903357985705404154e-04,1.549675365497602986e+00,9.311327086689175081e-01,-1.056592645765083827e+00,3.921812690464935858e-01,1.649612669123273090e+00,4.015206252453156210e-01,4.965903486927750188e-01,1.724132010825244921e+00,-3.883895401136359116e-01,4.682382502000623781e-01,1.957675212085295269e-01,1.271632823819997871e+00,-6.335897109264265747e-02
6.294328082004971847e-01,-1.730324480137382936e-01,-3.847944844323040181e-01,2.733191886544739102e-02,-1.273503246784007947e-01,9.958682718065030581e-01,1.569580713045123810e+00,-3.234550115919163638e-01,-2.830990680721197084e-01,2.450474544444909419e-01,8.720827580355792197e-01,-4.127096534650216419e-01,-3.734724463785230597e-01,1.151119209194859522e-01,-4.133020013897684697e-01,1.329925861478251869e+00,-6.477985522464393409e-01,-9.056741876216459763e-01,3.491329173744425196e-01,4.049686504753560040e-02,-5.761094717699677403e-01,2.046467348710943601e-01,-5.438631209119944021e-01,4.177387314464255930e-01,1.513919977850230580e+00,-2.697779084701932284e-01,6.326224351133145907e-02,-7.563095807294156758e-01,-9.929762452706507592e-01,-9.658441453176493940e-01,7.089272459293373130e-01,2.446380847018569060e+00,3.186418407874621050e-01,4.150026433654313007e-01,-6.562167626985598856e-01,-8.584545397716738524e-01,1.359982727915757472e+00,7.443290954093758627e-01,2.044593371004592264e+00,7.308350873164461969e-01,8.401649262580825894e-01,4.803905198676374222e-01,-3.888523455128038431e-01,1.817747198273530485e-01,3.960709754391641968e-01,8.870508511264739715e-01,1.696062614214298936e+00,4.579629517968483027e-02,5.597862150465744424e-01,-2.928206677487540377e-01,4.719467477022340596e+00,2.302250506883045666e+00,3.199562204817701927e-01,-5.741885730776383756e-01,-4.184147177509045523e-01,1.407136127879425214e+00,8.017034051230231828e-02,-2.265476740687428492e-01,-3.150035483453343943e-01,1.858205562634531294e+00,5.073188315900285517e-01,-1.368196399695352339e+00,-5.753672546763088924e-01,-2.137647034155099046e-01,4.746600152995146260e-01,-1.391166996352064533e-01,-9.254311275357981481e-01,9.561555482613706136e-01,-8.886856177991556693e-01,9.705364351328282790e-01,2.323100404574018008e+00,1.374560418017272689e-01,2.749096366935359081e-01,9.516421547120306190e-01,1.355768593010949763e-01,1.071215057773918344e+00,-8.334547741755600203e-01,5.552612662626621454e-02,-5.213709680253281187e-01,-1.189969172438360090e+00,4.371874627780504285e-01,-3.396095986216307594e-02,-4.065898716352071007e-01,1.837556053875619266e+00,4.066165049254190089e-01,-1.278387763280484091e+00,1.022060811872756436e-01,1.167409703747245953e+00,1.124178593527596526e+00,-7.110167103607385464e-01,1.285434654703637714e+00,-8.049343979516399017e-03,6.168937417023930836e-01,5.780380927977497585e-01,-9.204279640949594721e-02,-8.142762022833932578e-01
8.306712550860912980e-01,4.942458412697818826e-01,-1.780918864780864919e-01,-1.511943787632756830e-01,-2.287028699414206945e-01,8.544602495226920613e-01,1.086759669192169042e+00,-3.117362544135354047e-02,9.596524761010687410e-01,7.880667729752177664e-02,-2.566573855701748119e-03,-3.101890450513254960e-01,-5.124539883953829200e-01,-2.385909031041061334e-02,-2.083144590208705904e-01,1.036896654951176888e+00,-7.338840020896708616e-01,-6.441592868068571898e-01,1.316858216353822553e-01,1.520509072520203342e-01,-8.285026456062787314e-01,2.121518411462964826e-01,-5.991213081994464229e-01,2.395469584840838606e-01,1.527666237055914866e+00,6.685954279245262533e-02,-1.094894386510533446e-01,-7.531645993221105506e-01,-1.393831208506655539e+00,-1.030971093747740763e+00,6.900303431255774278e-01,2.623869309887949086e+00,1.502714735687327718e-01,3.140407953948016750e-01,-7.947089771902381417e-01,-5.907638208040182359e-01,1.898139964735251262e+00,5.235239392676169778e-01,1.568863599478926396e+00,4.994180271391575054e-01,9.969408582233396654e-01,6.696571586993933511e-01,-1.273865195805062300e-01,2.633091486615535826e-01,7.076129625585595440e-01,9.054481310764361801e-01,2.141063730965465428e+00,4.226376323662592305e-01,5.863194186947836561e-01,-2.492979731528905951e-01,4.637014399696107070e+00,2.380586775884031780e+00,5.936989408543773550e-01,-2.608814452843278842e-01,-1.040183990514827461e-01,1.135429322218291404e+00,-3.924681519189388013e-01,-5.298652711827188666e-01,-5.306009469226689035e-01,1.566621621296235833e+00,3.548777076256201535e-02,-7.806047264878592795e-01,-3.355694300822043008e-01,-3.192632211135688625e-01,9.224227252524246357e-01,3.761335746373868361e-01,-4.882748106525418574e-01,1.237098739929777702e+00,-7.459014983156263545e-01,4.375617662355848481e-01,2.301793815869014548e+00,-8.928231255329549532e-02,-3.658509793388443898e-02,3.716198419061859104e-01,4.038061019457904743e-01,5.930846971617509400e-01,-5.436714161914290022e-01,-3.782829260210796019e-01,-1.044939265974716758e+00,-9.023530987538516124e-01,5.482451425327703465e-01,-1.744214893560376289e-01,-5.966598756737757636e-01,1.881977479045668478e+00,2.415295739748777315e-01,-1.173639785905246757e+00,7.258742631655693001e-02,1.111817019257714145e+00,1.297852477626757484e+00,-1.304141328745954231e+00,1.509457114797889909e+00,-2.963128279143086297e-01,1.271043461138374964e+00,6.737759916424669315e-01,-1.162796709220697222e+00,-7.413947141497474469e-01
7.944385749419816678e-01,1.279945441345003099e+00,-1.514065046606958842e-01,-8.047886374134471943e-01,9.848879735710035221e-02,9.722367532906284193e-02,5.120941378677765776e-01,-1.725132557252760934e-01,1.326411330246201059e-01,-6.267197088641845992e-03,4.912690123176175483e-01,1.167252764957652789e-01,-3.358713804597708297e-01,2.515772515979760593e-01,-5.363845373515300219e-01,1.476326917310252229e+00,-9.356863148445826450e-02,-3.124481729910870142e-01,-1.180486542019478224e-01,-1.378368954976176564e-01,-4.173309466320562766e-01,1.809985745770381349e-01,-7.058430008447313941e-01,2.420241623404922326e-01,1.789133820452139201e+00,3.682688663539707696e-01,1.793092839581079123e-01,-5.870873145895830758e-01,-1.200768355400043008e+00,-1.349269415154479290e+00,1.906549205849200068e-01,2.115902406435668848e+00,-2.951088250356327936e-01,2.359964820395063223e-01,-8.070199000155894309e-01,-6.399439381195534127e-01,1.633608559549673878e+00,7.497297677809566796e-01,2.046660099219790308e+00,5.681854990853744125e-01,3.384119558297517538e-01,2.745781440866117973e-01,-1.724963752188889421e-01,7.773727635389479640e-02,3.929887447155400171e-01,9.632008853987109598e-01,2.218356659994645597e+00,5.799249206286158365e-02,2.779194603931484098e-02,8.202321019944571745e-01,3.774233631443579817e+00,1.766840294788214027e+00,1.727943699026738000e-01,-3.377336959204116362e-01,-1.504048637478281603e-01,1.369150775378023877e+00,2.025042093260817355e-01,1.068350116944879191e-01,-1.037358186685583217e+00,1.180608034648944260e+00,-5.623638366593708415e-02,-1.174330442930312246e-01,2.591306581650666407e-01,5.304524824258605165e-01,1.153227077350341245e+00,3.269821513671972157e-01,-7.844140741727722022e-01,1.761099163545022939e-01,6.241547154080839821e-02,8.879867782619463856e-01,1.898202179199438122e+00,-3.459129815056440349e-01,-1.058510925556487986e-01,1.659937073124171658e-01,-1.904247258490447681e-01,7.841683243444214080e-01,-5.894361728231860553e-01,5.296138898593403255e-01,-1.119673346082105558e+00,-4.065172675010917391e-01,9.549453871164119700e-01,-6.878624042393366445e-03,-2.151990788771608876e-01,1.695555806300042656e+00,9.555520362391463074e-01,-1.174247285316651901e+00,4.803771996900744190e-01,3.283921247897925166e-01,7.117090389040177101e-01,-1.538272035174013674e-01,1.195620550215654498e+00,-6.978300760116087353e-01,7.066615256612618357e-01,1.551584583639560311e-01,2.656134085917236654e-01,-3.619251946575617884e-01
5.785100351693497345e-01,6.884350008698033596e-01,2.878053563058248776e-01,-7.721136685582112857e-01,2.421808531063027736e-01,-1.343113017231567508e-02,5.077896654389381093e-01,-5.488100748432558351e-01,-5.206200853879106027e-02,2.133348124029139925e-01,4.596697023562404949e-01,-2.699958771646279732e-02,-4.223663050528866925e-01,3.383517104673080048e-03,-3.204476305976032835e-01,1.169933532369014983e+00,-6.708505891154574741e-01,1.239353160058510317e-01,3.582033238233547218e-02,9.456826088890754600e-02,-7.105687047649085208e-01,1.133834022684077070e-04,-5.368855684981550525e-01,3.079610990757322697e-01,1.720327259628128047e+00,2.308905824030566822e-01,5.103749215821193896e-01,-6.819427361658338960e-01,-1.124279114217838993e+00,-1.157762533810657635e+00,1.461814618104821661e-01,2.480080683113760287e+00,-3.934154373688318884e-01,1.072975916610883762e-01,-5.896574813441388674e-01,-5.196055555520672220e-01,1.172210251354727895e+00,1.106224632673279418e+00,2.120563383006679015e+00,1.131364624112082939e+00,2.318772924290953830e-01,4.285676336418546839e-01,-1.332261113081866233e-01,-2.341821385679102585e-01,6.505782727089828299e-01,9.278223934242371129e-01,2.229985006708357975e+00,-3.518093062170853380e-01,-1.007192626474215508e-01,9.663680013171753735e-01,3.204527776673665951e+00,1.523594946895918234e+00,-2.490050452684416937e-01,-3.858429349867731895e-01,-5.539581098412296178e-01,1.663442912951170527e+00,5.008500519246807947e-01,1.881741584808323264e-01,-4.899763752750288526e-01,1.099694732287556320e+00,5.659872040133618887e-01,-2.458292798433944215e-01,1.156266210293697000e-01,1.060261545836433061e+00,1.291195026215478103e+00,4.682896924738849109e-01,-7.847264575698571498e-01,6.535783816991453943e-01,2.203360963136624662e-01,7.037027933173028993e-01,1.650702032595975144e+00,-4.927932328359243552e-01,2.914789022039044886e-01,2.973628514456024829e-01,-4.240697809483292557e-01,1.103561413632965671e+00,-4.487420852128793380e-01,5.672216136817137544e-01,-1.009264942829516176e+00,-3.113684064842867083e-01,2.806324105421111881e-01,-1.240578784730411721e-01,-1.133285691812635498e-01,1.889788336175026284e+00,7.898187127448398348e-01,-1.136209681577028396e+00,5.939450005971409485e-01,8.440397458694776089e-01,5.507460305575340165e-01,4.883870252717375515e-01,1.147268859741521041e+00,-6.119420108190423147e-01,4.028827280430537505e-01,2.598379690758836347e-01,6.983104198162273235e-01,-1.726665954439400019e-01
7.227879025141463742e-01,7.946429624794578706e-01,1.605660715750584777e-01,-5.865538890819641527e-01,8.591333894885870570e-02,1.782913327877011234e-01,4.408987565188202673e-01,-2.868234246579476898e-01,5.090453721216332550e-01,2.042097753658891068e-01,3.131399111428070370e-01,-2.805022848691603177e-02,-4.540760269681855532e-01,2.747786024451158438e-02,-2.491903953623236245e-01,1.266262358235747953e+00,-5.897772772919533946e-01,-3.409135563229050148e-02,5.525226438630131270e-02,1.449620805403455115e-01,-7.854246928119187343e-01,9.651954153064407071e-02,-5.396796956407206025e-01,2.692490595687945243e-01,1.595288191455938254e+00,7.846337644904072262e-02,3.170133640583223111e-01,-6.728640966597532191e-01,-9.930131162940393219e-01,-9.994655456191587906e-01,3.040840335140212458e-01,2.484489259852123322e+00,-2.686602308556417795e-01,3.831423443450455990e-02,-6.467219111499972195e-01,-5.584415521984376074e-01,1.382690328082855524e+00,9.883507176794592564e-01,1.800690500373145042e+00,1.029278589098323815e+00,5.109294750295023668e-01,4.449193748605482779e-01,-4.952651880949977825e-02,-2.055557915052187712e-02,6.296953425593667664e-01,8.968775269929607497e-01,2.382922706467590412e+00,-1.152654172105378738e-01,7.720392028692359132e-02,8.152357073040108482e-01,3.624298073591078584e+00,1.614678249386738207e+00,1.080273043367799279e-01,-3.634712688164508654e-01,-4.422777963472175333e-01,1.478051479867765750e+00,2.617597309978498821e-01,-4.484817768799599647e-02,-5.412927798127441514e-01,1.153872223238439076e+00,5.137209443660049057e-01,-2.641109615375230590e-01,-3.909247229200717849e-02,7.500702232566205385e-01,1.119014296119630991e+00,3.540814389103649762e-01,-6.119319304457658815e-01,8.307814112737004208e-01,-2.047083484972830186e-02,4.226893357704086251e-01,2.007218032457989132e+00,-4.430026632336520054e-01,1.635982999573163399e-01,3.379728490482714065e-01,-1.893938393775350670e-01,1.034177147029618826e+00,-2.978094891406049549e-01,3.936700471984369010e-01,-9.605449397928191857e-01,-4.040425403452740372e-01,3.506148796052154792e-01,-8.110847639240700846e-02,-2.045870448149135212e-01,1.735359316785265227e+00,6.499723221307257548e-01,-1.052359936731574575e+00,4.138844798316407281e-01,1.068105727987442188e+00,7.103368162870858926e-01,-2.789204068471823339e-02,1.401922703448756247e+00,-5.797361241323466530e-01,7.737845078129981236e-01,3.429339724063156236e-01,2.300968573947210771e-01,-2.490228297399350588e-01
1.054916835653218143e+00,1.633533088310355152e+00,-6.324372722604161556e-02,-6.965628465353130849e-01,-2.203879361802320025e-01,2.782947029362329294e-01,7.464712849057514310e-02,3.131778486890793856e-01,1.848654969142546678e+00,-1.835998975428593250e-02,-3.231167908076869044e-01,1.638156737202718649e-01,-5.048071893087889839e-01,2.992791993026955311e-02,-2.721722201881998648e-01,1.335555889161123666e+00,-2.364199948511028770e-01,-1.599197393378142817e-01,-2.297735547291144542e-01,7.794796835450701344e-02,-7.851769584149679293e-01,3.856342530821640358e-01,-6.516529151173152679e-01,4.248626820768483525e-02,1.655637023187229273e+00,3.259726930249262633e-01,-1.286909185612287454e-01,-6.178846563196742636e-01,-1.388741955212392298e+00,-1.189784843066628905e+00,3.674339728885805956e-01,2.439953716887766078e+00,-2.987972493960710518e-01,7.754085620208425733e-02,-9.041918969296682818e-01,-4.331929734753381944e-01,2.221029422531651587e+00,5.210726850480438266e-01,1.388395044045258597e+00,5.431104866228817496e-01,8.312221828939673207e-01,5.079337483665021802e-01,1.836632795281304964e-01,2.922093267587730914e-01,6.496789169628072180e-01,8.762427184558160276e-01,2.769488119450041363e+00,5.276912307177621386e-01,2.523283198680276174e-01,5.695386388330438976e-01,4.157052044026328552e+00,2.001814096891133765e+00,7.849761537397118571e-01,-8.060679639995016466e-02,4.684240092538383138e-02,1.087525101709358122e+00,-2.728620012664365602e-01,-4.344713748503263862e-01,-1.120952465701288370e+00,1.283134800692869337e+00,-3.500028589150818714e-01,2.262536241253599312e-01,1.751996559369623507e-01,2.229833375973083176e-01,1.336712862053734296e+00,6.293929160981655002e-01,-2.295050174258361775e-01,8.077556858163791320e-01,-4.773744860739165957e-02,3.506770678523063456e-03,2.301300578005353703e+00,-4.327222138039941157e-01,-3.455092500143469025e-01,-2.664896540283282489e-01,2.784747305666989137e-01,3.427232454056892696e-01,-1.747071220311009476e-01,2.574696153738548210e-02,-1.506417083557683112e+00,-2.728751876262021647e-01,9.696403154481474385e-01,8.851910819429958943e-03,-4.977639209797456443e-01,1.633348101089463933e+00,6.656319903156382445e-01,-1.067529385257607988e+00,2.050847651408680139e-01,7.981967152694988688e-01,1.038186145561688534e+00,-1.214775390568643365e+00,1.774528494567637171e+00,-7.326740713822494921e-01,1.576937115524553512e+00,3.722839055044782075e-01,-1.038676333004821206e+00,-4.182553150372377848e-01
9.526969426973515009e-01,7.156899963088761973e-01,-3.825935689965143105e-01,-3.249509559411960513e-01,-5.290757906594500959e-01,8.892025673142225362e-01,6.510543645033488591e-01,3.606646692534140608e-01,1.706190652849748135e+00,2.363882297653793763e-01,1.641606474218765543e-01,-1.314889882508440966e-02,-4.639606366801568571e-01,-1.265662136471117361e-01,-4.253422204669035644e-01,1.535781098260221356e+00,-3.524866300255645180e-01,-4.793228181728770299e-01,-5.782119468762583064e-02,7.694776360876862120e-02,-7.208119217353026187e-01,7.528065243401701467e-01,-4.791567922322351736e-01,5.818652531780327264e-02,1.638284834659185396e+00,-1.533058131590012974e-01,-2.683080514593497723e-01,-7.098883828615294433e-01,-1.393059580871682801e+00,-1.170228972157096647e+00,5.998808163652409320e-01,2.650464801746782673e+00,-4.665431785352891492e-03,3.027218685188633462e-01,-8.090450964241693299e-01,-5.677906688327621909e-01,2.183362562096561987e+00,4.672356989227728907e-01,1.701532591180553222e+00,8.482503186123813155e-01,1.145418941142758218e+00,5.721183795375687220e-01,1.270115487707993429e-01,3.093814838035554571e-01,4.511877911040205746e-01,7.187554289237421123e-01,2.492818406994665281e+00,5.178488650787208547e-01,5.255429283207680990e-01,-2.477513789823210244e-01,4.868426942624092035e+00,2.566763610860844036e+00,1.049509428877044792e+00,-2.325065721727197499e-01,-2.242744229750409657e-01,1.295776774109447471e+00,-1.434413429796166373e-02,-6.089476904172015370e-01,-9.200995601688825021e-01,2.337070287518320466e+00,-2.495532412874809369e-01,-4.984143676851890969e-01,-2.639708330452043006e-01,-1.229779183897563577e-01,9.763144670990262508e-01,3.197063543693688947e-01,-3.812083376463302753e-01,1.096406374884455914e+00,-3.950637021532821258e-01,2.273534302514496064e-02,2.631227463820326573e+00,6.929741370588771154e-03,-8.582990917708678558e-02,-3.480589690646887502e-02,4.785847737052564277e-01,3.091677311366558545e-01,-4.595480936471035838e-01,2.423919956512515794e-02,-1.361994249788675004e+00,-6.635325670465822556e-01,9.596536944799148872e-01,3.123154916330990183e-01,-6.764129474673280518e-01,1.743858704652602620e+00,6.700174207543576621e-01,-1.364314962449800772e+00,-1.073464764063268850e-01,1.249405912177541822e+00,1.288881519428684896e+00,-1.775731149147252275e+00,2.020090084053222323e+00,-1.070674480844596710e-01,1.422578579150910016e+00,5.189738481931229774e-01,-1.059533778928853032e+00,-8.272464146527112039e-01
8.700595219192328589e-01,7.675836666512108053e-01,-5.129488226123564143e-01,-5.307124160510007238e-01,-4.415721992635978643e-01,7.570333400774609256e-01,7.531955948850215243e-01,2.406841568424344380e-01,1.023491815800298355e+00,2.055637410008899768e-01,5.500138800617118129e-01,7.818744300681354509e-02,-3.534347461674086088e-01,-2.168198858485349823e-02,-6.731058470248545422e-01,1.709400707225187999e+00,-1.013181488006563435e-01,-5.315451548314189534e-01,-1.293173192581506536e-01,-1.163904144617768643e-01,-4.385605358674626864e-01,8.024851839845219548e-01,-5.238986030889460910e-01,8.323288558906194456e-02,1.815037124270070246e+00,-3.147970686166542270e-02,-1.902171444186546434e-01,-6.691668483376882470e-01,-1.471230085097227080e+00,-1.428616860296875402e+00,4.367327707465182840e-01,2.442072543680523289e+00,-8.582699640924609796e-02,4.479111934069709422e-01,-8.169587073275106359e-01,-6.352060275265266620e-01,2.083513106901519585e+00,4.791662174118109796e-01,2.130069099322432269e+00,8.077326727858120670e-01,8.752171950281324442e-01,4.257833297957883678e-01,1.053664777480520232e-03,2.087590316894422093e-01,2.525700177956710091e-01,7.381617586027802158e-01,2.284116342606961947e+00,3.753287193403531674e-01,3.710498370514242472e-01,-1.397937990250943674e-01,4.711528262639147258e+00,2.572538452361350814e+00,8.574306978051584593e-01,-2.997204442807084313e-01,-2.491840039007955920e-01,1.444615183258791902e+00,2.688259705475142258e-01,-3.350550924227947425e-01,-1.122456108819298359e+00,2.473895625987653446e+00,-4.048818617440683720e-01,-4.963608964141010826e-01,-7.025670658398810997e-02,3.591751512513208233e-02,1.010822116987222241e+00,2.572156213723951756e-01,-6.451558644910321272e-01,6.033126444657508358e-01,-1.797938047564352493e-01,4.607347427401520257e-01,2.410635576987430806e+00,7.486848617613484080e-02,-6.769042075662252966e-02,-6.907807925025374884e-02,2.768831788656330173e-01,3.106935661317821173e-01,-7.278605345168280838e-01,3.549663497204948448e-01,-1.392554573999079670e+00,-6.271182663697798532e-01,1.220800036788186382e+00,4.184601340968904237e-01,-5.877876860278549165e-01,1.786501733492387167e+00,9.956371189235414532e-01,-1.515453629178446171e+00,2.051017954251566078e-02,8.074372552826410976e-01,1.142224777762789856e+00,-1.431980008411675831e+00,1.792275449513816898e+00,-9.943974332125049553e-02,1.039242609946462892e+00,3.346271931164538360e-01,-4.882974230459780629e-01,-8.490040444320172686e-01
6.694548932596751101e-01,-3.283958617613902398e-02,-8.250266461885258362e-03,-5.010166153113815302e-01,-6.149077047805666663e-01,9.733019078618749820e-01,8.938142896154002148e-01,3.333995701870146044e-02,1.812320902409161549e+00,4.325390610086329302e-01,-1.089339741796971350e-01,-1.738393314565994663e-01,-5.702322344073795790e-01,-6.657251568608185677e-01,-3.929236158511758004e-01,1.002457799993877297e+00,-1.072514699625378709e+00,1.369745667570247682e-02,-1.047515625561967201e-01,2.173300632323250936e-01,-9.463156666026750763e-01,8.882504806792181906e-01,-2.682138285768847497e-01,-3.620080049084323237e-02,1.883468861005180628e+00,9.753936871036407441e-03,-8.483793564152450339e-02,-8.848197716058604501e-01,-2.211037227154578844e+00,-1.504002224745123240e+00,4.917067757039866871e-01,3.299410241462846116e+00,-1.824604465731561875e-01,5.495608828510669674e-01,-6.546479767566983909e-01,-2.328688631774593620e-01,2.172702256743605620e+00,5.243400252517076421e-01,2.196831605061793091e+00,1.364746873547391326e+00,1.059854551774229936e+00,9.453721833764294757e-01,2.212070379209318816e-01,-1.817753778331575032e-01,8.026550073292904042e-01,6.149696167155470627e-01,2.385785543299064670e+00,2.977092177764473768e-01,4.465991483586789212e-01,-8.029158952870772969e-01,4.428692311453460206e+00,3.055204495571971712e+00,7.277220260948121799e-01,-6.910008786668903058e-02,-5.541554567177626733e-01,1.723799739650933027e+00,3.122841194555263100e-01,-6.687719749449676510e-01,-5.851328516643299338e-01,3.047028971934844677e+00,-3.619295023442773429e-01,-6.360537441622886590e-01,-1.997570880101224022e-01,2.217117177100504377e-01,1.583771772141061795e+00,9.591724356785933381e-01,-3.766297800181656052e-01,1.649778174146065535e+00,-4.171122238019520784e-02,-8.950386670753041063e-02,2.073595702181639133e+00,6.468060969333710997e-02,2.794031727872005044e-01,-5.442530042188974404e-01,4.539610636799551457e-01,-6.997969739172948955e-02,-7.103495510946559177e-01,-1.839219431953698081e-01,-1.937091362946705253e+00,-5.240925557677881264e-01,6.224597068358399543e-01,3.193666308692156841e-01,-9.015501443989030195e-01,2.387023049794712914e+00,6.696053311970694422e-01,-1.754582819119228088e+00,-6.691880619973827882e-02,1.438288726706335785e+00,1.406626119848787271e+00,-1.800974584270648160e+00,1.996465705022774539e+00,2.327664197646891475e-01,1.134841440141185487e+00,6.985298379354953902e-01,-1.298384140078464366e+00,-9.782405387768958738e-01
9.815817598276947997e-01,1.320396426037194981e+00,-1.280489871400015689e-01,-5.902389360990142331e-01,-2.294568490554004803e-01,4.186000388407485895e-01,3.401435595909817478e-01,2.189903069139587100e-01,1.529502291520130841e+00,2.634442251035587490e-02,-1.393599812728515963e-01,6.921486017247521771e-02,-4.837922345761384579e-01,2.052255356773677666e-02,-3.128613476051683717e-01,1.325593549623033329e+00,-3.101370278915276391e-01,-2.821249233769450027e-01,-1.501337560001404225e-01,6.376772844149579400e-02,-7.436627098289869675e-01,3.892842186101036495e-01,-6.285544462576819758e-01,9.017737763064540002e-02,1.656241101458251652e+00,2.434872116978959722e-01,-1.132176337573571334e-01,-6.468027976951092883e-01,-1.390390002341606035e+00,-1.193170772416505709e+00,4.212912317144008045e-01,2.463592795686717629e+00,-2.007977590616898400e-01,1.632875865857500997e-01,-8.683888413176068521e-01,-4.886642247469212830e-01,2.118303210830253747e+00,5.324257905368179333e-01,1.530008442311495465e+00,5.742431797074065702e-01,8.406717685673371632e-01,5.192380272759604676e-01,9.584442655080839535e-02,2.634226928008862045e-01,6.098668543974090639e-01,8.695732514188505569e-01,2.585552691182705587e+00,4.661980818384537928e-01,3.101456528664146006e-01,3.658377189985063116e-01,4.272542290704371304e+00,2.114646620769151220e+00,7.262284504411679054e-01,-1.467682410360622858e-01,-2.589841310928403528e-02,1.151563731044956684e+00,-2.091156369877958943e-01,-4.149672936574527737e-01,-1.008053041015590123e+00,1.454898335935997711e+00,-2.681557686819241448e-01,-4.066719118249043086e-02,6.335611815515806988e-02,1.322271462414827958e-01,1.225843586660060325e+00,5.358758352796004765e-01,-3.429749693182881920e-01,8.389539441684925603e-01,-1.733703651423320335e-01,1.631460368313959741e-01,2.290686641035552196e+00,-3.177400837967472857e-01,-2.458767688840375887e-01,-1.160540181508767088e-01,2.754468958063147066e-01,4.056495984155729650e-01,-3.139186024298606381e-01,1.467173351794320846e-02,-1.397566640319611864e+00,-4.227387878159133416e-01,9.136170882350038713e-01,1.915033898267061441e-02,-5.106724336894843397e-01,1.698929981181793947e+00,6.391055958222258138e-01,-1.138599631210293062e+00,1.765786119830836942e-01,8.397068909956935112e-01,1.077066194204371330e+00,-1.196954137448522415e+00,1.704714732683878076e+00,-5.867753493556464583e-01,1.423401587959047365e+00,4.119135779249198936e-01,-9.369585665388091567e-01,-5.147028089863376898e-01
6.978397785735364067e-01,8.169290647321912902e-01,-1.150061708066700689e-01,-7.612508198322027742e-01,2.554407906231664915e-02,1.041881953634510860e-01,3.117490166461757695e-01,-2.091835649107563200e-01,9.038160273139794754e-02,3.417149326791210084e-01,1.008938936373157569e+00,2.115966141702506076e-01,-2.969545534840661305e-01,1.323688335282164341e-01,-5.972499417082952622e-01,1.856582313738426748e+00,-1.000126676300328588e-01,-4.430586292296921636e-02,-2.036633504605963457e-02,-5.925348655693670613e-02,-4.490297382113986879e-01,4.284124369826458611e-01,-4.832296807809682293e-01,2.500451439599954417e-01,1.731725448160012615e+00,-1.381918933910390168e-01,3.503454228725059183e-01,-5.992965055401576757e-01,-7.532788276903954472e-01,-1.156673336883126790e+00,1.411359267917706717e-01,2.243417072993033834e+00,-3.691334407952407970e-01,8.940740230510810238e-02,-6.077656438747158774e-01,-7.118214477321794798e-01,1.250895405500288327e+00,1.086536674499791300e+00,2.257381010988760650e+00,1.314618562787741141e+00,3.612708432417374160e-01,1.742141648592159253e-01,-5.721127707998939493e-02,-5.367808284865858981e-02,2.050330208931492315e-01,7.940535540457773767e-01,2.361969891542947231e+00,-3.065551025266305407e-01,-9.637279855206558332e-02,1.026911679478440087e+00,3.656129513556563460e+00,1.571018018169025865e+00,1.700217704530876950e-01,-5.270558262070357269e-01,-6.501138334166223220e-01,1.748940198123635659e+00,8.569801896366211480e-01,2.202678517325152574e-01,-8.423469126441655019e-01,1.694797657040169492e+00,4.974625259887959228e-01,-2.406806348472096124e-01,3.973990223822992246e-02,1.071677523398862686e+00,9.584631965897694172e-01,2.277705250939698889e-02,-8.608989364734505045e-01,2.811145604531800068e-01,2.948648756405673477e-01,6.034503576377150402e-01,2.132554645124197901e+00,-3.061301014185344171e-01,2.432654233646451281e-01,3.369626980608599331e-01,-4.092540361545461969e-01,1.126082004289133076e+00,-4.415474817687742859e-01,1.082404193873072629e+00,-9.060899773697274062e-01,-3.072780977217157705e-01,7.132567277580272869e-01,3.381200546339364621e-01,-7.113192885017963207e-02,1.572064679166876644e+00,1.190207173965349474e+00,-1.234741902946915104e+00,4.116498026653518383e-01,9.214656590656168378e-01,4.884374178301898461e-01,2.199040484150039387e-01,1.507298304468554395e+00,-4.150947162566345217e-01,3.994523898842797238e-01,6.134745660199888984e-02,1.167565245150785636e+00,-2.729211940202233011e-01
5.119632142913445039e-01,1.944432938623407159e-01,2.110486912070500543e-01,-9.663184260057253727e-01,-2.400600049655702284e-01,2.323687622068064396e-01,2.629982454927459745e-01,-2.879338545850205211e-01,8.441500486283964877e-01,6.274900404869505621e-01,6.723994285725665154e-01,1.821177264196632839e-01,-4.189118250920103037e-01,-4.943541736182837654e-01,-5.837277268644720518e-01,1.521505152182862641e+00,-7.057105597060422397e-01,5.695514969597239574e-01,-1.457969194853591943e-01,1.132978039509640045e-01,-7.236049397363869540e-01,8.202739061813631993e-01,-1.961939395462937163e-01,5.065003255946670668e-02,1.969870843635113111e+00,-1.256429133157087319e-01,4.289163981606678444e-01,-7.628307567754141205e-01,-1.534207032173312335e+00,-1.466573984771453176e+00,3.607299573250155600e-02,2.975672852950970615e+00,-6.104792143255426407e-01,2.662713395765020641e-01,-4.588901995358540820e-01,-3.367452619805237912e-01,1.422863912361997940e+00,1.116423948087011730e+00,2.656364797719600102e+00,2.028442400291964098e+00,4.417020937085407439e-01,5.452134296926907098e-01,2.207161071128088681e-01,-4.854683596020792358e-01,4.981568153305401814e-01,5.883488262020379889e-01,2.529115121552158563e+00,-4.289504272724732892e-01,-1.625432291788994066e-01,4.671569371280366312e-01,3.368455197513331889e+00,2.130885426561086593e+00,1.493669493533442416e-01,-3.215120502696927618e-01,-1.030939101577359240e+00,2.204070219902207306e+00,1.278562043475170551e+00,2.671392881466466696e-02,-6.435981697968470305e-01,2.727881935163453786e+00,2.963452267477295621e-01,-2.052268505758311212e-01,8.367346408721752782e-02,1.481684680837739077e+00,1.591150445932862478e+00,6.613529745817706695e-01,-6.988122594951287070e-01,9.308479322530924804e-01,7.698455986025409814e-01,1.076858986615802372e-01,1.821352026153666648e+00,-2.383287371398543075e-01,5.708081042272009631e-01,-3.792498540722810674e-01,-3.311863385993485398e-01,6.036682236746688801e-01,-5.367208364452675795e-01,9.736443726302848045e-01,-1.638283230663632128e+00,-3.972410830743555721e-02,4.945722594019358320e-01,5.565025499959163069e-01,-3.616546189260396726e-01,2.119922948410386532e+00,1.299549782912054807e+00,-1.659390917263954268e+00,3.209648549798359007e-01,1.336281704339723042e+00,6.424391244511062915e-01,-1.533841537474872063e-01,1.831555885630650193e+00,2.078043308508192855e-03,3.335735122350270698e-01,2.197681839267598969e-01,7.882852633629835459e-01,-4.445181753073986775e-01
1.093457085351205560e+00,1.662962580949171487e+00,-3.911332137641213014e-01,-6.953316284421088289e-01,-2.842153720378656767e-01,2.764207740807662073e-01,-6.877833360291729647e-02,4.635961959399276244e-01,1.508422074236329236e+00,1.254523803440843466e-01,4.077577782029961351e-01,3.729628464679082267e-01,-3.536361582653884672e-01,2.261523925698199489e-01,-5.403866673417663247e-01,2.011021519655882273e+00,2.984203195094817240e-01,-2.978141079243070144e-01,-2.161102013396088428e-01,-7.951069682971839692e-02,-4.947812592088169925e-01,6.592603717148438625e-01,-6.071349925015125937e-01,6.647196565895770182e-02,1.645761484226665017e+00,-5.403666732371267128e-02,-1.380456510954711502e-01,-5.272597334638209343e-01,-8.496079647546410651e-01,-1.128747761152916196e+00,3.127170876529656307e-01,2.128671206047803022e+00,-2.887159254925256713e-01,1.839313092754399359e-02,-8.665273776253995530e-01,-6.771580286301921436e-01,2.032977994025974233e+00,6.474472629306126104e-01,1.612444234137884624e+00,7.853516084262410768e-01,8.041114108531403071e-01,1.925058214070538565e-01,1.688400351005441280e-01,3.993599659781579270e-01,1.892157142977289319e-01,7.827454699552547357e-01,2.792569383633556335e+00,3.793974044789840683e-01,1.663460561073958344e-01,8.457442384606600472e-01,4.373362527370195707e+00,1.827753418331960811e+00,9.573450578573781122e-01,-3.074947954833227026e-01,-1.402974068272656027e-01,1.244461491003004072e+00,2.028254015939592869e-01,-2.335923127007191458e-01,-1.348238607774306930e+00,1.652233956810559290e+00,-1.657691084968060113e-01,1.665475869347565196e-01,9.579783667572884520e-02,4.161714192076128027e-01,9.399019785658224713e-01,8.998509987131986243e-02,-4.310123470071658414e-01,3.326703518473891341e-01,5.697888923779608622e-02,8.943490103132867297e-02,2.662363798635045686e+00,-3.015004846430466290e-01,-2.919862936336819481e-01,-2.489763286958862620e-02,1.103411016473571787e-01,6.137418214718575182e-01,-1.816253581423721841e-01,6.800811966227018335e-01,-1.207376792907059126e+00,-2.783641223982308843e-01,1.247831371929940536e+00,3.994128025263119497e-01,-3.205295001641820796e-01,1.298831337903182170e+00,1.073571536684907457e+00,-1.106882278890164439e+00,1.371516436187099064e-01,8.472378618432515607e-01,8.275837296537463805e-01,-1.011288218571818831e+00,1.956088445324972946e+00,-5.917523943664891872e-01,1.329514775501436930e+00,1.252620653013045704e-01,-1.222799788285804934e-01,-4.087536074185955659e-01
6.906565717968349283e-01,2.374575655454467249e-01,-1.176889859966344237e-01,-4.361115603495300252e-01,-2.495822330371555986e-01,5.689872659397099408e-01,5.740625208990989270e-01,-9.810057674932690097e-02,7.309405418345157335e-01,4.934035515637930081e-01,7.811709263237502920e-01,1.116436895799577389e-02,-3.996710359791200151e-01,-1.416354270553533135e-01,-4.563474066360933001e-01,1.672080021804164485e+00,-4.984426007124672653e-01,-1.041095610807046962e-01,9.076215581511323793e-02,1.218260426228311988e-01,-6.999334783470009258e-01,6.093040175054253993e-01,-3.394445483145426823e-01,1.985198061557908455e-01,1.632818136706736034e+00,-3.953947954697428213e-01,1.948384382411279814e-01,-7.142821226567900306e-01,-9.347976331181120369e-01,-1.028857340050368219e+00,3.924409734061031774e-01,2.653610756759490208e+00,-1.744951584648913312e-01,1.547312538005130578e-01,-5.579411632843421787e-01,-6.392999072669791616e-01,1.418217363094083971e+00,9.891557130306163348e-01,2.108167537047140438e+00,1.508234552689831975e+00,7.659257021656141751e-01,4.264765929654292798e-01,4.706619676122224261e-02,-2.306246299546289846e-02,3.621002006215126579e-01,6.865232088317744230e-01,2.386723464081396795e+00,-1.488494553919695873e-01,1.916694559418839483e-01,3.415321923754818245e-01,4.133294970855885708e+00,2.020322672921797569e+00,4.628720038261109337e-01,-4.756575390133309655e-01,-7.546634186949233714e-01,1.753934399017107237e+00,7.143387134338867739e-01,-1.620135117028402016e-01,-5.571493850262146941e-01,2.249541836267086037e+00,5.375339061507621308e-01,-6.078497956162784988e-01,-3.089896212146164833e-01,7.273640861868952978e-01,8.992356434164933132e-01,9.568650483939356022e-02,-6.774101143359991806e-01,9.606641082130279452e-01,-2.649413889205954470e-02,2.103079877115811569e-01,2.381842820507636738e+00,-1.200182603439132745e-01,3.680828178704718678e-01,3.191444007114617731e-01,-7.603721272774184581e-02,9.391435619829122672e-01,-4.215226690911650365e-01,6.716383912104157972e-01,-9.870083271220932986e-01,-5.177417938962469712e-01,4.871659326990063210e-01,3.844047681840058184e-01,-3.269844822801656892e-01,1.732908378013216844e+00,8.920790810628076439e-01,-1.340929263940447758e+00,1.336698740610290093e-01,1.500619262298855894e+00,8.206370547260420922e-01,-5.107310717322224303e-01,1.827631195668119712e+00,-5.591310812525385199e-02,6.788223090168108431e-01,3.465597537211865253e-01,4.283436826016233656e-01,-5.268816614831555167e-01
5.892406016625288956e-01,3.481870850341777235e-01,6.621922762143928054e-02,-6.624015992915478490e-01,-3.771904608488728383e-02,2.810788316813960241e-01,5.425089211735060202e-01,-3.451345321629198382e-01,2.632231963876083825e-01,4.235971801679862536e-01,7.626510443747516188e-01,2.799255113259380146e-02,-3.874451300480479810e-01,-1.222981037764346440e-01,-4.687103187330192156e-01,1.501296917274719700e+00,-5.663305464376195975e-01,7.594960049873256125e-02,4.274844553611911041e-02,8.148072064373823586e-02,-6.574890614852756388e-01,4.140764395572900103e-01,-3.888074604001577894e-01,2.350393916400113081e-01,1.739252370156181726e+00,-1.306315835650775081e-01,3.847282060230049483e-01,-7.055870043040408657e-01,-1.072410031657021090e+00,-1.169439729486020596e+00,2.193467809809171720e-01,2.603792923628799549e+00,-3.293042351344850349e-01,1.746344511923303422e-01,-5.388295931147516482e-01,-5.734568646088178401e-01,1.257388139129988813e+00,1.083995205978485643e+00,2.293555862527427713e+00,1.477608059900072046e+00,4.601801079864613619e-01,4.128668815971980877e-01,-2.793274811353729792e-02,-2.030864992309772132e-01,4.466348012029677239e-01,7.621892900446084473e-01,2.292623629681582731e+00,-3.302975781499346564e-01,-3.932835391192907037e-03,6.223448974099390352e-01,3.627777417959439976e+00,1.831484740469157213e+00,8.690537207278353771e-02,-4.525574777373334023e-01,-7.614515921147495536e-01,1.839739562537957784e+00,8.080947226063027733e-01,6.466505959696489114e-02,-5.442793703411232809e-01,1.925018168375938199e+00,5.447594296800716274e-01,-4.497362118294380151e-01,-8.090616153908276875e-02,1.021819265889551298e+00,1.129725627979544900e+00,2.790656200929425013e-01,-7.896523795831951187e-01,7.604819964237836682e-01,2.189719068172554239e-01,4.725594025280079880e-01,1.984744593017136793e+00,-2.597887861474727500e-01,4.071404432531960937e-01,2.441152274045803594e-01,-3.046516392749760715e-01,9.969462140833240671e-01,-5.003102820170222120e-01,7.650192647081035524e-01,-1.057657702734615679e+00,-3.749899497537644844e-01,4.200548698958411209e-01,2.432798382554284267e-01,-2.194731114750036183e-01,1.856202538323088458e+00,9.731347203183042804e-01,-1.338680494553269540e+00,3.608300020033916033e-01,1.185531043078198898e+00,6.491034488329860963e-01,3.775933919348473111e-02,1.524113383946255729e+00,-2.347017218067777300e-01,4.104516530593727563e-01,2.613242142077336072e-01,7.660605807675435752e-01,-3.795263285257266528e-01
7.710183042426110855e-01,4.392491437799661558e-02,-5.524426329161661320e-01,-2.532688677026701529e-01,-5.289188014539148996e-01,9.020414011184185732e-01,6.408425257107691619e-01,2.062000716508943232e-01,8.451836762606977915e-01,6.573486311279533867e-01,1.324026930419744064e+00,1.132732057654290136e-01,-2.979632128964227467e-01,-7.658239090646189184e-02,-6.935711146797360893e-01,2.250458043889437043e+00,-1.018347267357242181e-01,-3.953672189443439566e-01,1.209942190847739241e-01,1.394403717429657658e-02,-4.942285049974429745e-01,1.040001360009463083e+00,-2.547851102123110945e-01,1.650169595281094637e-01,1.604173879911123812e+00,-8.473874666412132273e-01,-7.612438208721233890e-03,-6.814771418470614295e-01,-6.292052231255716999e-01,-9.842402240051509876e-01,5.060308539041121767e-01,2.533243232013625335e+00,-1.755345903682847819e-02,2.077107395421138869e-01,-5.551161849737127341e-01,-8.439988107099420933e-01,1.495144783928365584e+00,9.286194655436692535e-01,2.243526034948040149e+00,1.688929011242298550e+00,1.015645974593573531e+00,2.609101649926043875e-01,8.079071856026716347e-02,1.663261040577926897e-01,-3.513126577732716971e-02,5.411674824744557855e-01,2.395347372671612352e+00,-6.897609966775170021e-02,3.298140544199498203e-01,7.913006208324002699e-02,4.795448370586980147e+00,2.255786587959322187e+00,9.154648399224707411e-01,-6.315081763733736420e-01,-8.779481545816152366e-01,1.833070078200736974e+00,9.891078470693824842e-01,-2.372511240490310924e-01,-7.510309199129079349e-01,3.009916270250582837e+00,5.162195762553238865e-01,-8.712984174491205103e-01,-5.472585756508276944e-01,5.299813419417088722e-01,4.821811819211452299e-01,-3.703674594526361608e-01,-7.618133912184399392e-01,8.071005001422097980e-01,-1.657368223324930945e-01,1.237072787961801812e-01,2.910208581816557505e+00,1.764339160829266340e-01,3.878836236019528316e-01,4.649174372245498121e-01,4.819514234315493140e-02,9.464470420989732347e-01,-4.930409895194433068e-01,9.976440052937389780e-01,-8.271790667958471843e-01,-6.859986385513492380e-01,8.117704197905409869e-01,8.118786948213094767e-01,-3.688167833087829250e-01,1.503599529916068267e+00,1.141919494843444127e+00,-1.485526369763637167e+00,-1.342789968221740904e-01,1.731329310312068381e+00,8.933216731902732244e-01,-9.834228971704912503e-01,2.195008600125933462e+00,2.942068383741620607e-01,6.916714221128954510e-01,2.703356855824470273e-01,6.696785654257420006e-01,-7.540320645449104520e-01
7.339495785390461879e-01,5.617833840370386467e-01,-8.063029055970637460e-01,-8.539645451671526999e-01,-4.578546187787929655e-01,4.458738586482555166e-01,2.504466820240234259e-01,2.352970950419914775e-01,1.393664867891889481e-01,6.837059903330643396e-01,2.086403522501516505e+00,5.713585157313771923e-01,-6.798037861921568670e-02,1.098356549820801581e-01,-1.233741558965123275e+00,2.938141997760859603e+00,6.816824844002051798e-01,-2.193237875018702321e-01,-1.658331155389061451e-01,-3.674355600758253404e-01,6.029060783962414405e-02,1.388272968615280378e+00,-2.797335143467724605e-01,9.608884317119489871e-02,1.966134309095012522e+00,-7.293846864052579981e-01,1.186714367136309234e-01,-5.369062721855974996e-01,-5.934133347705512485e-01,-1.469316534617947090e+00,5.992020552238727649e-02,2.087102653696857768e+00,-3.845894633380784189e-01,3.166932983690885495e-01,-5.724099195321756817e-01,-9.384712558767203117e-01,1.412011916249922061e+00,1.021309638881363613e+00,2.995906419135037524e+00,1.886052335315151707e+00,5.166499326617850496e-01,-1.393723594212005756e-01,6.499820497692562760e-02,6.294579241457390339e-03,-5.498642240706456130e-01,4.795938399311763245e-01,2.400540293106922185e+00,-3.420732620929025636e-01,-1.198483461306669579e-01,6.838165016671136076e-01,4.382473887994157380e+00,2.080144725255763216e+00,7.805515543217942387e-01,-7.355681794922499517e-01,-1.005482583725410883e+00,2.193771174328140283e+00,1.789582854234631260e+00,3.041373867884499260e-01,-1.409883909976385574e+00,3.426377206587678081e+00,1.726479831000797827e-01,-4.283304717780037629e-01,-4.670069305391957859e-02,1.196607279601515028e+00,6.270473364685390516e-01,-5.205448638151043417e-01,-1.126708847213390152e+00,-2.850848102773513304e-01,6.178180747376575965e-01,5.652519745251369798e-01,2.696923549912352058e+00,1.945846100800859291e-01,3.568643458056522388e-01,1.326224094490259797e-01,-3.995590977280245037e-01,8.971360699342936229e-01,-7.516714452032875471e-01,2.008114693465650191e+00,-1.045957001528915242e+00,-2.983965512777785323e-01,1.502865062383544448e+00,1.286010096453423124e+00,-1.383400190802646368e-01,1.373188422475290604e+00,2.058848077769624751e+00,-1.752251896947374821e+00,8.018946003100216324e-02,9.993512477546842021e-01,4.601568198056323333e-01,-3.498088442059860137e-01,2.103190500212885006e+00,2.378867988624435714e-01,1.003130597123360612e-01,-2.522315658222367696e-01,2.021727112204154242e+00,-6.544270329317354307e-01
6.837295941680680000e-01,6.398524844277150292e-01,5.319055981441241088e-02,-7.280083446854302975e-01,-4.517167652707334419e-02,1.169224358271381548e-01,1.243080571048997829e-01,-1.880024320725572351e-01,5.329525433746349350e-01,4.889246792734636138e-01,8.849450100791005358e-01,2.139367537685307463e-01,-3.615644249004999478e-01,-4.305287214861115708e-02,-4.793225142489997426e-01,1.817196845091837432e+00,-3.118294422919993814e-01,2.101333982302514003e-01,5.652295862178073615e-03,8.733266455677235474e-02,-6.466274453053044713e-01,5.055165127264862335e-01,-3.610164293676165759e-01,2.070341836931343937e-01,1.671418253467359616e+00,-3.029368978420837744e-01,4.023680704687769838e-01,-6.395543840211080910e-01,-6.992447838377451319e-01,-1.025271916136071493e+00,1.561578315361926705e-01,2.482112540571891568e+00,-4.304265428179678832e-01,-2.406057681109410873e-02,-5.235196655369773744e-01,-6.249474944695475598e-01,1.200777356713955024e+00,1.205385830237119427e+00,2.156695859945881644e+00,1.664145304532889780e+00,4.699574339259214861e-01,2.651955177537385078e-01,9.160143539643676724e-02,-1.262012526065457441e-01,3.107307498576845628e-01,7.141336214961604423e-01,2.565401406020148212e+00,-3.821301510848941763e-01,-1.088425766119622412e-01,1.047888628808835820e+00,3.554409603452776789e+00,1.528873629049012139e+00,2.196097905859725197e-01,-5.062029697227719005e-01,-8.364457009333982063e-01,1.857069282617074490e+00,9.803831442436793386e-01,1.189067877507798965e-01,-6.693734014243838404e-01,1.845055487288284723e+00,7.114205147453488420e-01,-1.931083121429498783e-01,-6.490160416853688052e-02,1.286993093647406550e+00,1.026970387823590514e+00,9.603382542003666145e-02,-7.186114628022602924e-01,6.235196676768524071e-01,3.905291468423665036e-01,2.214176408155227593e-01,2.218750555302972050e+00,-3.663143081858962757e-01,3.763853021429082735e-01,2.648208735883410547e-01,-3.993763612516933459e-01,1.157573676066821156e+00,-2.498656835806332965e-01,1.090496419666850514e+00,-9.588857062966282818e-01,-2.015104849562661671e-01,4.709424460848427030e-01,4.001053952474245556e-01,-9.167064070877045667e-02,1.591899260569051844e+00,1.130514008352764277e+00,-1.219229467680165158e+00,3.524759494185080722e-01,1.341179095098159246e+00,4.787442358021574140e-01,1.919704465206011901e-01,1.738751980321517010e+00,-3.297935321760113170e-01,4.817519529162663794e-01,1.269470030594614940e-01,1.139095044130191914e+00,-2.126534228626880130e-01
5.389294609771567712e-01,2.535967879672536007e-01,-4.918633729344989297e-02,-8.182342355351573948e-01,-1.528514762302985996e-01,3.250832589977128428e-01,5.826975181326297104e-01,-3.110904853325420216e-01,2.093163068785054426e-01,4.902390058845847998e-01,9.557788140252756470e-01,1.152781323390128648e-01,-3.353467898006445846e-01,-2.162197209898705785e-01,-6.766849500154653585e-01,1.643198194900264753e+00,-4.543096168944191215e-01,1.262461459384020823e-01,-6.193533257294755318e-02,-2.553537999884344240e-02,-5.089435570806399856e-01,6.788104518668562903e-01,-3.338049863890018010e-01,1.633874678053492679e-01,1.919712594935769623e+00,-1.147970344001628118e-01,3.577697188424961983e-01,-7.136133109188642631e-01,-1.329290774851801249e+00,-1.435918793651636882e+00,1.226344547891297654e-01,2.645689791759207932e+00,-4.112854424056722191e-01,3.393311594044061685e-01,-5.331240335480184056e-01,-5.420798385567955346e-01,1.358826870129942410e+00,1.026707489943519569e+00,2.661308699170318093e+00,1.623442333694230522e+00,4.039981585281365861e-01,3.985536480107960133e-01,-1.464239600917842388e-03,-3.094699807818831472e-01,3.208748668310659191e-01,6.852734640940600919e-01,2.242553719762186759e+00,-3.589063518278834963e-01,-6.429036902717628899e-02,4.328318165855032928e-01,3.662297125494146322e+00,2.098502465602571920e+00,1.342651201008092099e-01,-4.381374741320906985e-01,-8.487802313120765829e-01,2.029832764501012576e+00,1.094319517630749861e+00,1.202896315265855609e-01,-7.235870849398519100e-01,2.482202110518985982e+00,2.789385368845353486e-01,-4.503854764111151487e-01,2.501574203753782755e-02,1.118380079248544101e+00,1.261800480224852361e+00,3.505146586059897929e-01,-8.890449313375748952e-01,5.955044498912567263e-01,4.441548763216665030e-01,5.554929481702183258e-01,1.902422879032805936e+00,-1.267829127770898900e-01,4.545093958382711574e-01,-1.295507263620848670e-02,-3.245989028896076323e-01,7.689850620398772651e-01,-7.077007484674939786e-01,9.606312540679108336e-01,-1.309945940872929038e+00,-3.077518325388496345e-01,6.677585266942206443e-01,4.695118530176494720e-01,-2.918351210189867873e-01,1.981096783571804298e+00,1.260016550364422727e+00,-1.589414535770861114e+00,3.331267042809618051e-01,1.033252560695387734e+00,6.599961640960891884e-01,-9.740372165883443012e-02,1.585555777418155898e+00,-5.167496367671947644e-02,2.439096169246132151e-01,1.801109603525476166e-01,9.134889121225673314e-01,-5.173977450131178601e-01
1.093113427958169126e+00,1.474343206867028133e+00,-4.656929380155945819e-01,-1.955126176174892816e-01,-7.113986450233560077e-02,6.025440959212688963e-01,7.987347438522514054e-01,2.297133709890892828e-01,7.958112432778353673e-01,-2.284658244785720826e-01,8.027604579030384047e-02,-1.095421741576049213e-01,-4.116400784107812072e-01,4.918115417466589201e-01,-2.767748464467774672e-01,1.403524019319248639e+00,-2.321522690186283988e-02,-1.028467338682018450e+00,5.768854298932548502e-02,-4.632137887525813319e-02,-5.618066849628563508e-01,1.842282637870829021e-02,-8.705829214896081414e-01,2.960183891200584561e-01,1.420610313731713426e+00,2.124491241164880029e-01,-2.615328883637438873e-01,-5.733434187342600907e-01,-9.015959438658507352e-01,-9.209642953736733029e-01,6.741868276810745186e-01,1.967451925480027564e+00,1.989820422946245726e-01,1.500597206450784427e-01,-9.994652645151168580e-01,-8.184718986043670874e-01,2.024406584207508963e+00,3.936019644222137348e-01,1.187400408640871596e+00,-1.676079028945731686e-01,9.158418094774622986e-01,3.354551766587139383e-01,-2.315749336405315550e-01,6.565407492524368838e-01,4.465393991327246126e-01,1.059335185009361080e+00,2.225292978328213156e+00,6.685855501021685798e-01,5.645994220399465080e-01,3.579854346108383156e-01,4.820689484724884011e+00,1.937594180435667335e+00,7.731068373666847293e-01,-3.157648833016415968e-01,3.424695620392237405e-01,7.027613849989160499e-01,-7.725378547155717923e-01,-3.988367652772212280e-01,-9.993922501224024035e-01,7.303671355796232945e-01,-1.348437011658842055e-01,-4.319275178266860360e-01,-1.514671007069880171e-01,-5.915650543028913022e-01,6.043501050345272407e-01,1.101104583804629611e-02,-5.016076695604364533e-01,5.399024282818122300e-01,-9.036239947862232391e-01,6.901779874547094851e-01,2.561148755541874600e+00,-2.217268166720201272e-01,-4.850644914923673556e-01,6.137049635418433402e-01,3.841083281301381769e-01,7.721092208898439058e-01,-3.919264796219789071e-01,-2.299449239364025344e-01,-7.318333735723407951e-01,-9.094360877244204167e-01,1.005883737074624751e+00,-2.684054047582637437e-01,-3.994404521851682155e-01,1.383945924626133417e+00,3.170927406341191856e-01,-8.438881336074131045e-01,1.555754668860743761e-01,5.671362806111258648e-01,1.163219128967854399e+00,-1.201015899054849179e+00,1.365018632018242251e+00,-7.726071486561164603e-01,1.522124541807122089e+00,4.522985669108154916e-01,-1.044070979048663972e+00,-5.648373902639627353e-01
6.126789283385124518e-01,-6.382381748009469113e-02,7.381750883902599147e-01,-3.382283209453426642e-01,-1.295675820035867010e-01,3.826126371690625749e-01,1.705031589250415314e-01,-3.431872790216752844e-01,1.772513991261210453e+00,6.452179430970661489e-01,-2.048166416604799145e-01,-2.052687366943209413e-01,-7.009121586741540177e-01,-5.930106962182968289e-01,2.071748509582804765e-01,8.726587865336175032e-01,-1.529729308366728491e+00,6.621295529135706737e-01,2.230698018549749362e-01,6.633297222265298609e-01,-1.492993996476548402e+00,2.247159033600880929e-01,-1.581125374266245109e-01,1.754067588696383018e-01,1.380531755988807285e+00,-3.920784717402840958e-01,4.750600346947793096e-01,-8.607550951850067023e-01,-9.967228903189657707e-01,-5.745515937863797662e-01,4.555520387556477591e-01,3.369015175555248653e+00,-3.405777284128675975e-01,-2.276698450429508469e-01,-3.707790837896390301e-01,-2.575886990300548796e-01,1.214525865915169867e+00,1.310048714277723292e+00,1.471500606038155246e+00,2.029145364340451785e+00,9.106595486890354252e-01,8.651047904418314172e-01,3.389813256140454811e-01,-2.800084185755554733e-01,1.104401645983983382e+00,6.799774498327838534e-01,2.844649866959942486e+00,-3.219136177216721517e-01,1.588489669201109677e-01,5.626610765145543258e-01,3.393486140932975736e+00,1.655186577390308500e+00,1.789250724961890249e-01,-2.760802819452560231e-01,-1.001488890909735252e+00,1.778484948812719235e+00,4.708225252256301729e-01,-4.536238959714966601e-01,2.079091551392300286e-01,1.613402245833770010e+00,1.206584832766727899e+00,-3.662295077962356427e-01,-4.767013669046390456e-01,1.204289127252319958e+00,1.339752885346769951e+00,6.751594508907061698e-01,-1.751992672674658191e-01,2.149207293798183205e+00,5.865213678442210421e-02,-6.813451641906531631e-01,2.178545847754681741e+00,-5.689873745768052604e-01,6.374921984013693921e-01,1.993676140262261032e-01,-6.404350228173466553e-02,1.100950912654882208e+00,1.972515945949835925e-01,1.148939398648807231e-01,-1.102751197294104646e+00,-2.426945705407783371e-01,-5.796256700856599053e-01,-4.234065090950514532e-02,-3.562449996198873148e-01,1.962538132023292192e+00,2.368489112735050472e-01,-1.029008951057081012e+00,2.057510720611124833e-01,2.439591429022402558e+00,8.213273764732114124e-01,-2.322003548225334557e-01,2.009355842505890166e+00,-2.318313381714092458e-01,1.032619612514502627e+00,7.007426110329592062e-01,-1.842477880590678296e-01,-1.615812722082902164e-01
1.184497634583496106e+00,1.391671888020127756e+00,-3.695871591429114034e-01,-2.378056374241668269e-01,-4.395588933342021165e-01,7.424223612787768101e-01,3.210158717206910706e-01,5.808468266395467872e-01,2.169195343380111662e+00,2.895641914242094717e-02,-2.123004056387139404e-01,4.116098365738444370e-02,-5.088639787136686188e-01,1.152422489814843853e-01,-2.181600079703145956e-01,1.534427521216747969e+00,-1.548904414110494621e-01,-6.079335124346810781e-01,-6.281498795699289039e-02,1.282566676220286139e-01,-8.208999631836769728e-01,5.035754350552811287e-01,-6.364732721651212843e-01,7.604151872463320305e-02,1.427797171692606559e+00,-6.839383276395277766e-02,-3.880152894972092037e-01,-6.265840873363540675e-01,-1.050298336988469083e+00,-8.901528326111042277e-01,6.896074150351967358e-01,2.408646814429261429e+00,4.592292182398999278e-02,4.901896598597227372e-02,-9.376972728626571385e-01,-6.175756235238085701e-01,2.334135202686669075e+00,3.928312451485294066e-01,1.060798561628664149e+00,4.208464341627287109e-01,1.259165869692070672e+00,4.976467780422751952e-01,1.685752377130020352e-01,6.133281686623602846e-01,5.189431460736004809e-01,8.303416624425009607e-01,2.745639378382575657e+00,7.771395083183684216e-01,5.964229188958849459e-01,1.557920925106197618e-01,4.963445311927711323e+00,2.198296603910315561e+00,1.240104494097358012e+00,-1.798937528843080336e-01,1.114748559843712350e-01,8.750776968041371617e-01,-5.399640909795409005e-01,-7.275772667071780386e-01,-1.037074887878263851e+00,1.509024548462600812e+00,-2.257872722325773573e-01,-1.826746058994630495e-01,-2.420840758771224677e-01,-3.628994506351884697e-01,8.306525198317291636e-01,2.255304260846105469e-01,-1.460633290547677099e-01,1.063277322448244577e+00,-6.215759991100239246e-01,-1.775003930620486781e-01,2.883725115866481836e+00,-2.107468596744286327e-01,-4.048062389205627776e-01,1.093011297453513470e-01,5.970899764426241818e-01,4.278510667495057374e-01,-1.031389055229260387e-01,-1.924319743881270917e-01,-1.169587372779326895e+00,-6.400753454933423292e-01,9.857738197013329318e-01,8.647379279056965906e-02,-6.023352633452109250e-01,1.412263262998903812e+00,4.165288904640260803e-01,-9.856178950420169116e-01,-9.964447252070757211e-02,1.212188855608768323e+00,1.291096495170895420e+00,-1.880035199062883189e+00,2.053407188887407919e+00,-5.116308654932588684e-01,1.908391072330644089e+00,5.284034215671593593e-01,-1.477630971603336674e+00,-6.301774375586483012e-01
9.890017297252090556e-01,9.025747459612698531e-01,-3.155508331265049482e-01,-3.968430272505567569e-01,-4.957265411552603251e-01,7.567164526728027418e-01,4.316975073571478472e-01,3.963669205231089010e-01,1.856265343854155203e+00,2.361508803907379772e-01,1.075856407573052009e-01,6.297455276451020822e-02,-4.716319200020029911e-01,-1.090778567396323145e-01,-3.922212311542105367e-01,1.582441595080983365e+00,-2.980220833684970594e-01,-3.595970758581654159e-01,-9.176671184101373169e-02,9.705459077371475507e-02,-7.526499469516386709e-01,7.357217556887286625e-01,-4.801505752861301435e-01,4.138638526524671124e-02,1.618894634385107167e+00,-1.466140778096925723e-01,-2.353436259702338662e-01,-6.849414971425948906e-01,-1.295162049393600245e+00,-1.123492057896705587e+00,5.483963383510752632e-01,2.621825880249373686e+00,-8.554012528071613941e-02,2.052969274720792825e-01,-8.075713740747990643e-01,-5.475023132909927481e-01,2.169111725858535067e+00,5.221391702945048507e-01,1.612589573297266821e+00,9.012344295166376806e-01,1.113665966399707052e+00,5.373222646460771301e-01,1.872003603671331118e-01,3.136319474345398706e-01,4.594204804817467180e-01,7.179234938120383491e-01,2.631491598976719359e+00,4.945027319572453117e-01,4.540342850371067995e-01,-1.555994274725114312e-02,4.726940029375333197e+00,2.402813597603191909e+00,1.049999419423579994e+00,-2.198602499527292087e-01,-2.301132105346701817e-01,1.287649205464256763e+00,1.329768018519084105e-02,-5.812882441413069756e-01,-9.613913612137084952e-01,2.187784676040600118e+00,-1.973371959551449006e-01,-3.162351404163176172e-01,-2.054260819153676254e-01,2.976812993049904321e-02,1.017560604326919416e+00,3.322478349922779461e-01,-3.223439810005379602e-01,1.062292084841497619e+00,-2.804317696377229274e-01,-9.544168280825843231e-02,2.650199481970622717e+00,-9.310935510531492820e-02,-1.132922326084139369e-01,-7.985779643043761089e-02,4.245593635623193807e-01,3.553679522680488478e-01,-3.298997574191587789e-01,1.123174090972344774e-01,-1.371151004319807187e+00,-5.436929507549258522e-01,9.445519457874296254e-01,3.188058958799178111e-01,-6.208043984956567174e-01,1.665394226305883185e+00,7.066266164677289519e-01,-1.291520938982372080e+00,-7.034179131259116202e-02,1.275848310409304354e+00,1.205947477156613878e+00,-1.656491663388878433e+00,2.070312282077808597e+00,-2.110942849626470941e-01,1.471783826156805919e+00,4.700263594310427617e-01,-9.618128014053997088e-01,-7.165691255545195704e-01
8.290410618146524246e-01,1.363476090927967066e+00,-5.232874873168341656e-01,-8.738404212631218915e-01,-5.431779483962510813e-02,2.804000531733353840e-01,7.610102343472806563e-01,-1.594890161173857790e-02,-5.828381503474822090e-02,-8.783462931916155569e-02,7.288608438532353517e-01,1.808746453409842414e-01,-2.377469289292272747e-01,3.277844877067165874e-01,-8.327766525993232083e-01,1.693429115489301529e+00,2.522288938444794959e-01,-6.294934971437141646e-01,-2.342100773330964003e-01,-3.664168220269267140e-01,-1.093045672771009169e-01,4.417089048097849191e-01,-7.690949058895670820e-01,1.891041946963294695e-01,1.971317194163030972e+00,4.631608321880542056e-01,-2.266115895519629775e-02,-5.599041538378221050e-01,-1.488104970844855712e+00,-1.681122864889460056e+00,1.816259626174885899e-01,1.945307358623861171e+00,-2.271694762192100758e-01,5.086368059398167496e-01,-9.180397223697501774e-01,-7.139612850244394515e-01,1.922466874784552138e+00,4.856954437570443206e-01,2.365538278163786590e+00,3.018257174286625988e-01,3.464128652389315000e-01,1.971948345147295223e-01,-2.561978473186365957e-01,1.577102784742190900e-01,1.528105890925847699e-01,9.437264507662321833e-01,2.018766924876270963e+00,2.505274976812744692e-01,1.021242126101438302e-01,4.401215271146660668e-01,4.190577323551767819e+00,2.193565359420375671e+00,3.807984157267173542e-01,-3.276341608370819669e-01,1.045131754090938836e-02,1.354717271683631097e+00,2.263169575146489199e-01,1.152013586898503750e-01,-1.410022122263024702e+00,1.689053886147210193e+00,-5.963574912442121123e-01,-2.232472303957196424e-01,3.684851132325916989e-01,1.942286272981336159e-01,1.123393981065047287e+00,2.734829554918963845e-01,-9.380644556702369963e-01,-2.080445279752126675e-01,3.270644990396590762e-02,1.213062137218432479e+00,1.923073843546317496e+00,-9.271543746179139456e-02,-2.545694896246221139e-01,-6.087862476227973163e-03,-6.435574504177112021e-02,4.516813768675234098e-01,-9.425645188700195742e-01,5.877099699072434458e-01,-1.311861248173182615e+00,-5.252517862057068943e-01,1.492903988359491230e+00,1.870592188799862776e-01,-3.450034517694605674e-01,1.746996120995510715e+00,1.216279446949691145e+00,-1.424897387052998177e+00,3.941983330083428383e-01,-1.189210595485485911e-01,8.542085968238113391e-01,-6.113160299491083860e-01,1.167188023891836179e+00,-5.429452255383863113e-01,6.606577545724590106e-01,7.305618499072258354e-02,1.258184487028230492e-01,-6.422386651015911108e-01
8.360465432630842519e-01,7.374239017456373224e-01,2.024604637215340897e-01,-5.819221585512964756e-01,-2.169437366325399075e-01,1.801501458416801815e-01,-3.208219040267420996e-01,9.322159593790024790e-02,1.667450535652788446e+00,6.120567041739859437e-01,4.985340264643706165e-01,2.635060863441840984e-01,-4.788733415153336170e-01,-1.922172052625897853e-01,-2.291446714554775110e-01,1.843855387952971547e+00,-4.514407149961477961e-01,4.410936218289900346e-01,2.284421171330170558e-02,3.195861879545252027e-01,-9.774651776220225630e-01,6.171106955527565496e-01,-2.486877252534219762e-01,1.145043460261911950e-01,1.467877488418668275e+00,-5.710289481943947587e-01,3.096437238116503399e-01,-6.556372107908721159e-01,-4.638701108251918059e-01,-6.934854119732962729e-01,2.789116136767872955e-01,2.723587235819219021e+00,-4.488077374214181625e-01,-2.971936771123646071e-01,-4.936194755454494931e-01,-5.353341253391228349e-01,1.341325203025413471e+00,1.260005833698587985e+00,1.637112050582100631e+00,1.941687742649494508e+00,8.122296498897561001e-01,3.670630246175989875e-01,3.743127776685045149e-01,-1.303101266161191263e-03,4.521863218423174402e-01,6.169808670021962316e-01,3.041358470117104140e+00,-2.475543345884348434e-01,-1.340761134116937037e-02,1.134030296406381311e+00,3.686170758587848262e+00,1.416683379286344024e+00,5.813970479149531689e-01,-4.341695198349393436e-01,-9.051575896642672925e-01,1.762856899192029925e+00,8.525772282891229681e-01,-1.922904869374101877e-01,-5.515676020973856453e-01,1.842575008434004680e+00,9.266525193648504910e-01,1.334656731923236639e-02,-2.572152882368000659e-01,1.338200227797183839e+00,1.002137937367542087e+00,1.182972922390818082e-01,-3.383062211038357914e-01,1.149343983541815994e+00,3.499512313591994772e-01,-5.441543535371563545e-01,2.625431605896224596e+00,-4.933903101096054900e-01,3.593256841543243096e-01,1.817322865471197035e-01,-2.081203591101052353e-01,1.158388163499478374e+00,2.156556235070618555e-01,9.536039196439638488e-01,-9.867023160638753732e-01,-7.197930269380165003e-02,2.396050151789732019e-01,4.614740040801126320e-01,-1.554479618292623766e-01,1.417653160429216630e+00,9.243055035072069714e-01,-1.040454012013055651e+00,1.690992172387244252e-01,1.998798140870954532e+00,5.559724011557656276e-01,-2.100427995992094066e-01,2.233871423418144708e+00,-3.343054018709490371e-01,9.831157138692523390e-01,2.495744366216120502e-01,6.832272329081121587e-01,-1.118222215345621162e-01
1.002011269072402566e+00,1.737446986021343065e+00,2.155114862357055960e-01,-8.659971260806651472e-01,-1.177941381749764288e-01,1.050483482902691834e-01,1.959939326100418322e-02,1.636889719614182115e-01,1.970423519136872414e+00,-1.061843653664355236e-01,-7.511124186093354194e-01,1.155179977490517068e-01,-5.831020863011837640e-01,-1.014474302807616135e-01,-1.494472967254265594e-01,9.356548827475050789e-01,-5.244619561628156568e-01,8.471617249065865884e-02,-3.038394886974757902e-01,1.451828174217766332e-01,-9.284349241769178640e-01,2.152913601655799813e-01,-6.773854026607042389e-01,1.039623770607223108e-02,1.736290398940449231e+00,6.524629836417698003e-01,-3.814272228386850205e-02,-6.572444813377334993e-01,-1.769629636129136818e+00,-1.317826394304560278e+00,2.788224547442792467e-01,2.609954752417089185e+00,-4.358285825539274794e-01,1.019337912666967161e-01,-9.138634529821307861e-01,-2.394322140823983425e-01,2.290477725448408552e+00,5.030919836228937569e-01,1.366721404957521813e+00,4.727335084703689905e-01,7.035278701412944757e-01,6.691379035835428590e-01,2.139244387193376395e-01,1.323967167064717954e-01,9.297258092760434245e-01,9.354028487317435081e-01,2.798697458746016054e+00,5.238351391507749533e-01,1.707603979890814361e-01,5.986615580658520841e-01,3.760837054494271747e+00,2.007625614466157060e+00,5.580315952669047119e-01,7.537103843418896387e-02,1.212258982238538785e-01,1.077092072601921080e+00,-4.215931369368177695e-01,-4.418761832072469753e-01,-1.048264242310192218e+00,1.010798260371261525e+00,-4.898986474952755632e-01,4.321638021605493929e-01,3.674056193589079200e-01,3.441177271350345790e-01,1.721998416529509690e+00,1.048340631251981403e+00,-1.373883692891159081e-01,9.635807152573538925e-01,1.154327024272558677e-01,-1.362905837661942954e-02,1.931346465273780844e+00,-5.890760241643266948e-01,-3.614625858308865292e-01,-5.383080631390669835e-01,2.560070982877045154e-01,1.697066692915237818e-01,-1.708427228113869045e-01,-2.220682531293218798e-01,-1.787068491496289324e+00,-1.218406461569195853e-01,8.285036654091746389e-01,-2.078618175874340501e-01,-5.503082177728215729e-01,1.865639874497655448e+00,5.511417698962493006e-01,-1.067196669358224881e+00,3.423304348806710529e-01,6.424596824913226811e-01,1.052382660561612227e+00,-1.098333823155740685e+00,1.609809636101323882e+00,-8.924851867551721885e-01,1.611994278067582664e+00,4.384097031765607499e-01,-1.360540650561388176e+00,-3.377375281409630281e-01
7.232884553076269762e-01,-2.313768371252876710e-01,-6.846375307879646321e-01,-1.788553849215139269e-01,-5.540519321793125895e-01,9.230758612656999595e-01,5.680046657095172424e-01,2.029457007523566281e-01,5.113833690707801916e-01,8.787894950378528636e-01,1.942419219949969911e+00,2.071523396379173210e-01,-2.076388956793335239e-01,-1.226652700115470063e-02,-8.256966531171339163e-01,2.707557406360915575e+00,1.060800027396898160e-01,-3.879962173866081665e-01,2.190469046399003417e-01,-1.573789675307610270e-02,-3.760487280653809217e-01,1.213861427551419236e+00,-1.420085267941412210e-01,2.167369211000340634e-01,1.543815095291169559e+00,-1.272734815980233414e+00,8.999879060856247337e-02,-6.497189100544851215e-01,-1.186369406692560080e-01,-8.240060647991336307e-01,4.836097829586580854e-01,2.429004240785660240e+00,-3.635105135767979778e-03,1.113510218655778261e-01,-4.350559126324438641e-01,-1.019760795721323943e+00,1.159505747496938799e+00,1.164368106269234371e+00,2.436338638872928897e+00,2.115868450075089058e+00,1.002792908651371828e+00,6.497488806121815008e-02,7.964798259404802516e-02,1.598804740582565331e-01,-3.289885826331159224e-01,4.403511098511503352e-01,2.405053212227745707e+00,-3.349479622299727510e-01,2.506650911343629717e-01,2.968854495758266321e-01,4.845844807849212899e+00,2.051025472810063199e+00,9.378123410896734846e-01,-8.541339685934568049e-01,-1.199966212088563466e+00,2.068208107048795874e+00,1.484378562039580185e+00,-7.305839002266446836e-02,-6.974006017636127375e-01,3.337239794185880015e+00,9.404420173680645423e-01,-1.041218424878395776e+00,-7.292247865025800468e-01,8.342239131356796733e-01,1.469553912807818330e-01,-8.094189769405704116e-01,-9.260525134498462929e-01,6.462501866093832703e-01,-8.635684655231451456e-02,1.042681655802630281e-01,3.175522980995863165e+00,2.620062470987929992e-01,5.980284029087731268e-01,7.663899109237310991e-01,-1.477184971611217312e-01,1.309945949790581654e+00,-4.445735101400620781e-01,1.529564673125983321e+00,-4.942828384701247746e-01,-7.035387944516986458e-01,7.649342131132847999e-01,1.102439583214637642e+00,-1.970210262699068349e-01,1.289078444303326298e+00,1.384052561729710362e+00,-1.503658244794837007e+00,-1.845076635013160327e-01,2.039252430612230604e+00,6.876963612564521711e-01,-6.364577404029942986e-01,2.358982383060737931e+00,4.888807881572346803e-01,3.899341564585595554e-01,1.306767359436058207e-01,1.558575432952027606e+00,-7.039574981649745489e-01
7.127274713297377939e-01,1.092666820687740126e+00,-1.049425459719053461e-02,-9.856457102371425361e-01,-3.250709879720532769e-02,1.302018371692075238e-01,4.959458025642613510e-01,-1.970821604197973420e-01,5.057156657137487077e-01,7.406968111611592076e-02,2.568465707175624502e-01,1.237619193723634020e-01,-3.900415426220587567e-01,-5.237998523269495055e-02,-5.705502058537148535e-01,1.272397629383414275e+00,-3.481641275749643993e-01,-2.189662038387822640e-02,-2.406121150815227205e-01,-9.912337730978570960e-02,-5.065734876172137691e-01,3.835312207898605719e-01,-6.001612321082286927e-01,1.198511238974927506e-01,1.971664728039063785e+00,5.030202928746903002e-01,1.883782848375529229e-01,-6.612714211049739443e-01,-1.741527658888482044e+00,-1.617267667364000738e+00,1.030334818596433943e-01,2.450905544785435097e+00,-4.452516299530482335e-01,3.829436055697898467e-01,-7.746305060869520531e-01,-4.239984978003491500e-01,1.820420592689749650e+00,6.902229666821922960e-01,2.293030538146554331e+00,8.075110576777585480e-01,3.357681255642216978e-01,4.662043877938963909e-01,-4.448466266776578137e-02,-1.435907092028630427e-01,5.467073085906277718e-01,8.801870241252963689e-01,2.279273679906223204e+00,5.588277107377031400e-02,-1.917350387989570637e-02,5.074828428997737451e-01,3.615963637470633874e+00,2.118402280465336851e+00,1.598411549563427125e-01,-1.877934551238496785e-01,-2.550768560814499764e-01,1.566960413554315368e+00,3.598302113452582218e-01,1.965556435008050662e-02,-1.042669396661087600e+00,1.690555199140421294e+00,-3.414799095759402103e-01,-2.776595476689283637e-02,3.821007274383702024e-01,6.872145198489940654e-01,1.563499299701392786e+00,7.381645559446368132e-01,-7.099647677173155369e-01,4.073539203008482712e-01,3.454541873165732913e-01,7.183123158302886502e-01,1.656352600044315615e+00,-3.101656956167616053e-01,-1.160864727084311154e-02,-3.100180578387878860e-01,-1.321441606942289904e-01,3.996663594909012907e-01,-7.049651946578366912e-01,4.354988057375548394e-01,-1.603663341608263071e+00,-2.456664207808371969e-01,9.661810333606781764e-01,8.560284703413259533e-02,-3.934008332505607441e-01,2.016499569358161104e+00,1.052833366048617103e+00,-1.426688113576456196e+00,4.610946810255995842e-01,3.492356094606313688e-01,8.136896664148162150e-01,-4.072350851788294479e-01,1.301083677449068610e+00,-5.318809782006759246e-01,6.909213710359050076e-01,2.154306377248250137e-01,-3.795193533716834100e-02,-4.754522522428543674e-01
1.211448256666373124e+00,2.712113823177588312e+00,-4.586849207737502265e-01,-8.129918676256688848e-01,2.554826444902458804e-01,-1.470963244488981414e-01,1.829721865505400946e-01,2.523714927960203358e-01,3.841489732710296479e-01,-5.410104622096367777e-01,1.036389906248926240e-01,2.880770957050139414e-01,-2.904951529836621305e-01,8.608720184562296263e-01,-4.821981044620248791e-01,1.645475131237591482e+00,6.595916103033705458e-01,-8.632804898368224844e-01,-2.534201976511175070e-01,-3.299596650470556503e-01,-2.142174950409307943e-01,-1.602967925382519088e-01,-1.120690213821027736e+00,2.693892542933409295e-01,1.627729367081281353e+00,7.644774404777467947e-01,-1.496320087514066699e-01,-3.838528769978770128e-01,-8.574981155726306703e-01,-1.228531519709619824e+00,2.631766975355150917e-01,1.378144632581363771e+00,-1.816820979393874436e-01,5.610182180310713251e-02,-1.161943047143892960e+00,-8.227111298219249580e-01,2.087190233989143717e+00,3.897931209121903162e-01,1.282921706212708512e+00,-5.927630478504168909e-01,3.692489997737248286e-01,4.079984134044034594e-03,-2.701186022433348377e-01,6.634439873213814343e-01,2.723591347296984710e-01,1.214453191590032954e+00,2.378603747994060047e+00,6.372002062388588683e-01,1.357469629861022820e-01,1.370917981681245790e+00,4.139777629948883764e+00,1.373661541041519385e+00,5.195879184669358608e-01,-2.501755702367355338e-01,6.664010620858265010e-01,5.860733399038200453e-01,-7.222873930031089573e-01,5.595911722536989208e-02,-1.648310356540870103e+00,-9.488353772532920338e-02,-5.412676690498929855e-01,4.091877699436901050e-01,5.286648517028205152e-01,-1.485724017395279040e-01,8.990434463399123999e-01,1.153097026075913245e-01,-6.121874623561602835e-01,-4.806589462465925555e-01,-3.109048282524131679e-01,1.090527472263791209e+00,2.194992034725695262e+00,-5.555195815142214277e-01,-8.520691493179789466e-01,3.089073746797867948e-01,1.581997652446905100e-02,7.570667706542559827e-01,-3.556456649445272622e-01,2.632597593278730441e-01,-9.089265644272561673e-01,-4.530751894756397391e-01,1.549983718559475365e+00,-3.218746368104393185e-01,-1.188822532006256205e-01,1.152801986191751560e+00,7.979853228002259380e-01,-6.988172532468024389e-01,5.432210732382843910e-01,-4.365071682144894272e-01,7.502542200195188027e-01,-4.591918717704066011e-01,1.005894219988165084e+00,-1.414076913686981296e+00,1.383402541490768023e+00,2.072189755144993040e-02,-3.900695078365185586e-01,-1.989545296866319646e-01
8.770032775578480155e-01,1.619892619738095618e+00,-1.556438006248577616e-02,-7.548550192118996804e-01,2.292967617264778935e-01,1.898363534746061454e-02,5.315988886629394727e-01,-1.918589995030750284e-01,2.933720209383401389e-01,-2.393017215356965932e-01,-2.213671749016693502e-02,7.136459736799022346e-03,-4.156436678983231880e-01,3.393572077934047249e-01,-3.197901826624525712e-01,1.104401389260660782e+00,-2.346589370523752272e-01,-4.053650991398878856e-01,-1.136378157479282780e-01,-7.463800659968650164e-02,-5.558220076263151732e-01,-1.569960642153925834e-01,-8.547696863717846316e-01,2.733102950335295489e-01,1.699613214969345476e+00,6.698562853951700591e-01,1.289741516390952580e-01,-5.832604576532101071e-01,-1.314201724538991867e+00,-1.270169382105431177e+00,2.651225923152787933e-01,2.072475458994728736e+00,-2.393282473445877412e-01,1.798644924002173184e-01,-9.114623680279736462e-01,-5.756379864557656933e-01,1.779127751527146195e+00,6.226688131036169915e-01,1.648515164769976060e+00,9.726428061232450517e-02,3.540646843619668638e-01,3.738079647739571132e-01,-2.213030638077049250e-01,1.884581714561511800e-01,6.442147072289585719e-01,1.108352533679883845e+00,2.224165725549105854e+00,2.659355190885075437e-01,1.134890313519154037e-01,8.743403162014031782e-01,3.719127599728566658e+00,1.665660641238765116e+00,1.120858111247025057e-01,-2.127290394411868180e-01,1.727279207396801297e-01,1.040016758501738803e+00,-3.603854023955341823e-01,-5.493324476386410304e-03,-9.931811087113384673e-01,4.697413049021170739e-01,-1.680402879967957397e-01,1.593746061661488467e-02,3.331656856913285392e-01,2.334219376751732189e-01,1.248089741463726199e+00,5.263160657983673163e-01,-6.316228894892386148e-01,2.979390564629167959e-01,-1.659115878303037139e-01,9.183349841818754244e-01,1.779021118024476156e+00,-5.061202960742459123e-01,-3.203338445128861567e-01,1.872439440640891739e-01,-6.486645513808506069e-02,7.330263243853103461e-01,-4.851940054701450178e-01,6.174692396740877331e-02,-1.119275239553141565e+00,-4.525896975383549292e-01,8.616933730776598077e-01,-3.790432777332872205e-01,-2.493782535151509439e-01,1.708155356110241385e+00,6.071537319327526827e-01,-9.569012020347847924e-01,5.566391558878389656e-01,1.389451919038063865e-01,8.179410300984437665e-01,-2.376196415329120959e-01,9.922269833986822052e-01,-1.008487730948967265e+00,1.014864386634761306e+00,2.758278619290783773e-01,-3.787857210372037042e-01,-2.806923081424435584e-01
9.847069990982382226e-01,1.762979706836431237e+00,-1.530010078354452352e-01,-9.026748805329980474e-01,-1.240212741215502429e-01,1.924954540964665395e-01,3.256386374768941994e-01,1.744924576362799351e-01,1.259724931730501707e+00,-1.814115760012456613e-01,-2.553079599570783897e-01,1.629267417293802089e-01,-4.401947827073663388e-01,1.050657409110879320e-01,-4.564134419567311141e-01,1.229781812514296968e+00,-1.216131205998183529e-01,-2.863810264055448029e-01,-3.343963045862547445e-01,-1.092395445950760657e-01,-5.521379487630129201e-01,3.283527474883554675e-01,-7.667966108329375974e-01,5.334051725013483347e-02,1.867184253030117036e+00,6.854239593563624666e-01,-1.197553871418387816e-01,-6.038783317939054873e-01,-1.780584517101420072e+00,-1.548915368254552671e+00,2.450400407660309199e-01,2.288400563721195713e+00,-3.426204700620492649e-01,3.168841790977460215e-01,-9.827915546588614770e-01,-4.194111751073076322e-01,2.307716968318083595e+00,3.762102859421252443e-01,1.736722530308250079e+00,2.189238278476932642e-01,5.801435566274992794e-01,4.818438614164732847e-01,2.145708588223213184e-02,2.021112093734259152e-01,6.109784020251541881e-01,9.597469791521096028e-01,2.483720299370355100e+00,5.464723125958990124e-01,1.781406853430347881e-01,4.604641505165008031e-01,4.039799546972665745e+00,2.182330720105695843e+00,5.741179029923205723e-01,-3.344200506812722296e-02,2.149070108835987591e-01,1.095453642323845678e+00,-2.962185282945690723e-01,-2.613098744842251575e-01,-1.330929800066935176e+00,1.269878300216730871e+00,-7.567324328617280882e-01,2.345351325394776087e-01,4.406991313356679596e-01,1.289562935900049334e-01,1.525544341575892915e+00,7.947289532442858295e-01,-4.321640653539836618e-01,4.118370441718189889e-01,5.360875154163513567e-02,5.212546125843823264e-01,1.925886054804388570e+00,-3.702854633968905018e-01,-4.385280019262559059e-01,-4.268380399116644686e-01,2.093978661161003396e-01,1.353904487668092793e-01,-5.273429614751741212e-01,1.221470139130453880e-02,-1.698240643280525486e+00,-2.912970075434312411e-01,1.260133840761525015e+00,-6.384085429240415888e-02,-5.238063136876007775e-01,1.822503968362339632e+00,8.277157157848097357e-01,-1.228896154040229893e+00,3.482677453849771787e-01,1.633963875342744343e-01,1.042306350465584508e+00,-1.106035997386395353e+00,1.417991428848246027e+00,-7.982921952735998472e-01,1.340968238567383342e+00,2.888014150283315096e-01,-1.006575814296366556e+00,-5.135389472652868159e-01
8.747328516187120595e-01,1.209145263119736358e+00,2.178530231611637280e-01,-7.104620558106504724e-01,-6.843212615091073814e-02,1.339556621248859103e-01,5.709821419155780564e-02,-1.972945127734992976e-03,1.458347196324153661e+00,1.606378071578867806e-01,-1.471044147783485134e-01,1.013937444444492353e-01,-5.248745350674096644e-01,-8.745543048135846764e-02,-1.814876279244754809e-01,1.234299646277988938e+00,-5.487986527442356710e-01,1.495533192216061957e-01,-1.105909101490903379e-01,1.987651111187065112e-01,-9.135554896927283730e-01,2.559490336501223373e-01,-5.319208186224125834e-01,1.176309104824904278e-01,1.620494501167644152e+00,1.872863987364096205e-01,1.644446365751976169e-01,-6.634537007025841371e-01,-1.211963959638714838e+00,-1.056354466917655666e+00,2.867468246819162014e-01,2.607860170460480020e+00,-3.915054879765004769e-01,-2.552635820707033210e-02,-7.274308371214898150e-01,-4.017690494659637013e-01,1.773069531615081740e+00,8.437648835892752608e-01,1.545848785417893057e+00,1.000330585431270292e+00,6.678776786330499204e-01,5.348040107315961134e-01,1.742389211014860884e-01,4.865899634526385520e-02,7.410219731367593266e-01,8.510888439934990446e-01,2.737357380775217841e+00,1.360173130554895304e-01,9.447579558912710951e-02,8.114512799078184013e-01,3.675686208054889548e+00,1.724792270425979046e+00,4.109709151278604922e-01,-1.785660373307115800e-01,-3.000315893754971208e-01,1.361080583650282172e+00,8.342902401872320794e-02,-2.614256046190206462e-01,-7.545326002887028372e-01,1.217778004723271579e+00,1.793425206066207589e-01,1.261773607194928148e-01,9.141310913292534368e-02,7.199026791669440595e-01,1.371838127441711963e+00,6.226898762580890256e-01,-3.219823826550766155e-01,9.879138183196144452e-01,1.300959238991407363e-01,-1.963147325465058879e-02,2.112392544469996913e+00,-5.366842727851179884e-01,-2.330822532801415936e-02,-9.135838921596831086e-02,3.111207471678117953e-03,6.847749049857101422e-01,-1.007363277718936190e-01,2.367215296214624787e-01,-1.335856887244892821e+00,-1.903638393607848533e-01,5.127567084108723972e-01,-2.554307433572117203e-02,-3.445436050217724477e-01,1.719727829472195157e+00,6.529302962821212919e-01,-1.042246348222502617e+00,3.299518129909927988e-01,1.113162246763742758e+00,8.233259005145816545e-01,-5.341208295608849133e-01,1.690664674859632788e+00,-6.757208833641067391e-01,1.209095669262681527e+00,3.700285633120005135e-01,-3.874651407912555467e-01,-2.416572485557047234e-01
8.641485928223876511e-01,1.173070138392450668e+00,1.343815872066189132e-01,-7.327702223586075592e-01,-6.030913579445286443e-02,5.578380921162728878e-02,-1.106123682052824742e-01,1.906767545862092517e-02,1.249102943980634706e+00,2.933985258856877665e-01,2.790900126576267848e-01,2.279004836021804314e-01,-4.516251964932164187e-01,-9.893587422604890880e-03,-2.906093875579900399e-01,1.601317836247512227e+00,-3.199892458382966320e-01,2.007574902997704136e-01,-8.244957136790238839e-02,1.559642778389429552e-01,-8.051052249794231619e-01,3.755846648777566577e-01,-4.710794167888515682e-01,1.418292516906727585e-01,1.594784186359902600e+00,-6.846017157300771094e-02,2.441232125913886386e-01,-6.178752690789205415e-01,-8.285450722388149059e-01,-9.640542125276485574e-01,2.216986262830593912e-01,2.478592545446812068e+00,-4.373670190380437583e-01,-1.236953031491084820e-01,-6.578113113083434715e-01,-5.198053744193720238e-01,1.550332598777672377e+00,1.018517979607489465e+00,1.671730304018770541e+00,1.284831895210972297e+00,6.102620557431583936e-01,3.583818936194607674e-01,1.920931226055477281e-01,4.790902542328565050e-02,5.143192376825004297e-01,7.877934441090465034e-01,2.800445899190825649e+00,-5.408909655440483077e-02,-1.531576211741139670e-02,1.103145863269039184e+00,3.628906072114215231e+00,1.502047569457810150e+00,4.204763428438993422e-01,-3.247004163149119771e-01,-5.019660820649717303e-01,1.517964339180023048e+00,4.513297268469411705e-01,-1.045043837485179761e-01,-7.947516311136038070e-01,1.366089837996787848e+00,4.435869251011060888e-01,1.300210879353533855e-01,3.779088978711168251e-02,1.010516125006543309e+00,1.173340269779582723e+00,3.254254861303413349e-01,-4.289757845097544320e-01,7.760220080094657469e-01,2.728711258980353604e-01,-3.962345507715980819e-02,2.282256340680995255e+00,-5.251199675685171986e-01,8.375452732868110539e-02,7.024483489271321490e-02,-1.746507248288344805e-01,9.388857567422167483e-01,-3.111775479791467625e-02,6.831081249725796667e-01,-1.130295378783546356e+00,-1.289136898471154868e-01,5.366495877753088006e-01,1.899261254829353596e-01,-1.904937009812291693e-01,1.527156400533186131e+00,8.849306994355413680e-01,-1.031615105632546658e+00,3.303284580851897356e-01,1.253102419394789724e+00,6.254635961479717565e-01,-2.172746198274975449e-01,1.802740958484071676e+00,-6.124217811713024151e-01,1.003459443135008344e+00,2.195326516401345240e-01,3.140465812837427984e-01,-1.529851269105045874e-01
5.688848066806512227e-01,8.513104783949725363e-01,3.148028162600837176e-01,-7.666287049212745508e-01,3.750706982879070672e-01,2.052006251404475679e-02,9.229927130994239892e-01,-6.935437116954711323e-01,-3.563525675591079356e-01,-9.780549393085921639e-02,2.650128714103877625e-02,-2.287086795366060077e-01,-4.643061093452965915e-01,7.832155894387868300e-02,-2.440567076323140738e-01,6.605305563108028188e-01,-8.466566598863616289e-01,-1.458907403280463866e-01,1.339045642397241470e-02,3.866301153811058100e-02,-6.968431424336811730e-01,-3.315633520794168954e-01,-7.349764746026397066e-01,3.539734341817823982e-01,1.786236885701286248e+00,7.323774493230500449e-01,4.309516797265268151e-01,-7.086217750021224226e-01,-1.620031733313908706e+00,-1.353897075160326535e+00,2.058438136403045737e-01,2.425644524329050533e+00,-2.815554037740445881e-01,3.101369135633650909e-01,-7.327996094032737107e-01,-4.489865918681846813e-01,1.394435638214896800e+00,8.336380467162858299e-01,2.042922556196329342e+00,4.511730450353456101e-01,1.465967278997361567e-01,5.758184946513269509e-01,-3.289096101899448565e-01,-2.034216007322393049e-01,8.896157152476494856e-01,1.111012356663074740e+00,1.921419501718744094e+00,-1.112821933150835163e-01,2.315866432494159688e-02,6.565138705445312528e-01,3.230347657547188778e+00,1.746865561463516903e+00,-4.321657106555331085e-01,-2.358814828347449710e-01,-1.474894692154256892e-01,1.371311181115293820e+00,-8.869457147715903433e-02,1.298760816540198704e-01,-5.046971539577145283e-01,6.073395992702150803e-01,1.502324239207969425e-01,-3.169312365909662255e-01,2.753181120475141075e-01,5.527002437153545333e-01,1.482382062772952702e+00,7.854234493821955487e-01,-8.049291871418290389e-01,6.289753228254114648e-01,-5.904512247858943047e-02,1.137740091359812578e+00,1.277042633008069306e+00,-4.987159861805221528e-01,7.311915881474451151e-02,2.394860583425026945e-01,-2.692743189955127958e-01,8.507346189227656952e-01,-7.002453834516341180e-01,-2.174740614970438468e-02,-1.148851898672462291e+00,-4.927134476891351644e-01,3.560364097668980432e-01,-5.363272565255110536e-01,-2.439655409299704703e-01,2.132863195014538249e+00,4.935176011692495868e-01,-1.117481930029200266e+00,7.040490926100947400e-01,2.854706723335720397e-01,7.656998928659262127e-01,3.057431909367154810e-01,6.993098966079583922e-01,-8.177257609536178196e-01,5.186810504570227298e-01,4.004601974105221340e-01,-6.935134050298275010e-02,-2.834367050217931894e-01
6.676195277527270378e-01,5.430486641283854832e-01,2.186208219505790806e-01,-4.079402348344647877e-01,1.862823502712309676e-01,2.158018848611006346e-01,5.871534451503241936e-01,-4.333572908038254012e-01,1.846118047609502932e-01,2.454177451113678243e-01,4.349994334819836661e-01,-1.467769437212250450e-01,-4.616540997687844095e-01,8.145153116032455287e-02,-1.472208912600214692e-01,1.213497529304419675e+00,-7.290120790927177019e-01,-1.038497772546457115e-01,2.117791760228301956e-01,2.158911969638959150e-01,-8.515356583832408566e-01,-8.156979811736386754e-02,-5.300121083222569807e-01,3.724540751161425356e-01,1.464935443404379312e+00,-6.204925649930709969e-02,4.115248723122532648e-01,-6.881669912271823897e-01,-7.217198036684504547e-01,-7.857225892782427890e-01,3.838591428780615544e-01,2.474217734680820069e+00,-1.618686693489389539e-01,-4.033641966080775410e-02,-5.816801469677734815e-01,-6.400551305809564218e-01,1.118251228153212207e+00,1.121040298283111358e+00,1.714197214869895847e+00,1.078293457929160093e+00,5.141718363182625762e-01,4.333989339084167725e-01,-1.363295467597488986e-01,-1.188014198134007549e-02,6.559314367965247694e-01,9.295448026002723907e-01,2.277299668596310944e+00,-2.443134826628984291e-01,1.145289738284121089e-01,8.825801071979031409e-01,3.598850150468397402e+00,1.432870747806442635e+00,-3.354777308696238469e-02,-4.679768583088284029e-01,-5.319940293646708840e-01,1.472831321816876260e+00,2.442887277302651650e-01,-5.973063158589669852e-03,-2.820281017521004685e-01,9.218527023159261979e-01,8.906738485075568201e-01,-4.851592408595983841e-01,-2.175434273630628967e-01,7.506628946455464746e-01,9.137886112320746657e-01,1.774003991879677389e-01,-6.707792367482643403e-01,9.499949094925013160e-01,-2.129397239365353744e-01,4.902559936770369275e-01,2.050407128744294649e+00,-4.594436531363536580e-01,2.803586650301739258e-01,6.876151880266438976e-01,-2.591837395943489275e-01,1.341078317280594012e+00,-2.434166377257504510e-01,3.718781221291326267e-01,-6.390674261921014399e-01,-5.404811863842907682e-01,7.157582283717933702e-02,-1.936617105239047398e-01,-1.102678888556584136e-01,1.680743885779164337e+00,4.783254629813206149e-01,-9.318245800243959431e-01,4.341585334571206323e-01,1.272626008448622725e+00,6.591364314127704516e-01,2.543298739162252464e-01,1.307482258330015190e+00,-5.722257892481974473e-01,6.648457535404339591e-01,3.982966723515808383e-01,4.512729374568990037e-01,-1.841508547344794522e-01
8.671616861881711325e-01,1.273002448178874424e+00,1.675467888302621944e-01,-7.656102479565171093e-01,-1.202001550460073537e-01,3.002827359559822051e-01,4.709384143084047181e-01,-2.303797515622442449e-02,1.489876754760989241e+00,-7.899615521274519492e-02,-5.981606055005848077e-01,-5.237001991602535655e-02,-5.685752642116417288e-01,-1.646690593412561965e-01,-2.067390331380132285e-01,7.848366908686361665e-01,-7.178038931246093490e-01,-6.352991674661376265e-02,-2.201797830106826392e-01,1.191311796201322548e-01,-8.787730097414876429e-01,1.951200908491262376e-01,-6.571031038714180150e-01,6.531354647391979240e-02,1.795282613451430809e+00,6.608809542628018008e-01,-1.086584068486767807e-02,-7.185788263737248327e-01,-1.975462794088628238e+00,-1.422744762861070100e+00,3.346497803482043065e-01,2.700824545334937099e+00,-3.179060456524667733e-01,2.935423419940615952e-01,-8.758768703269412814e-01,-2.598450964563692733e-01,2.200821039415916669e+00,4.713036741357091164e-01,1.631167714189211804e+00,4.572872188176845265e-01,6.776726203903582491e-01,7.473246271628611881e-01,7.370774527363188611e-02,3.404188081883590539e-02,9.468353378280063293e-01,9.435206987032155324e-01,2.483140656955041603e+00,4.563379483820667604e-01,2.494561558491387721e-01,2.070119602177332152e-01,3.861181199035294664e+00,2.267901248563831462e+00,4.091695303857116883e-01,3.477947652294799408e-02,5.662724435987442906e-02,1.173574153253050145e+00,-3.800083854864695354e-01,-4.213065549790072639e-01,-8.860561644463459396e-01,1.266801290967316085e+00,-4.960093848609853362e-01,5.956961943895683342e-02,2.732378340765937441e-01,1.864488798786446688e-01,1.693521569803184024e+00,1.061373004023159483e+00,-3.022738636403625723e-01,1.035093031672793540e+00,-3.414488951384168219e-02,2.780919481795856574e-01,1.773148486385505151e+00,-4.240180792012490651e-01,-2.270114260647355664e-01,-4.319981627667142110e-01,2.693266671744459217e-01,1.459899079414032075e-01,-4.476165188069429202e-01,-3.426550560924845890e-01,-1.756229980274839342e+00,-3.260762129972136214e-01,7.569617974706368546e-01,-2.495488640135446468e-01,-6.184318910380692813e-01,2.077820428892793725e+00,4.935772549158312095e-01,-1.222221576806305832e+00,3.325176006119026084e-01,5.912643649452841155e-01,1.150844099744940507e+00,-1.109273408835844466e+00,1.432589623692882785e+00,-6.901019345955826667e-01,1.378133083038957318e+00,5.238850116332414153e-01,-1.367045952732799163e+00,-5.095535091899369151e-01
5.806342823359935679e-01,-2.735966988032602076e-01,-2.253123473294626478e-01,-3.352093917137486390e-01,-3.299970554452123506e-01,7.307609276363842277e-01,7.397601742830299809e-01,-1.677116471027376432e-01,4.023554752846104088e-01,7.095102606765641973e-01,1.269419822178503576e+00,-4.961881033481052583e-03,-3.415189294690710309e-01,-2.040668474193274573e-01,-5.832943962187936426e-01,1.915047269172123201e+00,-4.999572658224578081e-01,-1.204136188745021790e-01,1.893191792546355390e-01,1.089698527690934060e-01,-6.226671003835094753e-01,8.034245615761156367e-01,-2.074843950326769049e-01,2.320568303855248260e-01,1.638713121890463587e+00,-7.275906048431634021e-01,2.624478466301551904e-01,-7.413597194502922205e-01,-7.500118734982512692e-01,-9.924030468109981129e-01,4.093353902698958491e-01,2.714836464900763691e+00,-1.189541378174174824e-01,2.020702982252372826e-01,-4.384457071481154267e-01,-7.391666165018374590e-01,1.177574294727445459e+00,1.132497538376404878e+00,2.410528423518483176e+00,1.898496698689215778e+00,7.895949911972797164e-01,3.675905001034689978e-01,2.080196416408114368e-02,-1.063682959862773530e-01,1.781567973327165544e-01,5.821688434406004919e-01,2.270327479944669768e+00,-3.648379566734900048e-01,1.875172807804544317e-01,2.020577773643982278e-01,4.249171875000771870e+00,2.096953629479160863e+00,4.532066024507606650e-01,-6.337215009829233470e-01,-1.063172392059565041e+00,2.017931449143050227e+00,1.137099436425517585e+00,-8.281799142971324468e-02,-4.254516239006498335e-01,2.787912355332461622e+00,8.053073609023919666e-01,-9.255842668624540970e-01,-5.046644411802142516e-01,8.834586412788330012e-01,6.938141292062109944e-01,-1.598140572137730642e-01,-8.458996205004873925e-01,9.736707011822868241e-01,-9.594165760371566043e-03,2.505384154045331435e-01,2.506486957560873030e+00,5.125980071998798016e-02,6.184633954708688153e-01,5.044150429770046795e-01,-1.733845847170475962e-01,1.112870819790358290e+00,-5.291871165127123300e-01,9.779633953105391075e-01,-8.178868626551759613e-01,-6.136178190637155971e-01,4.111256115194121818e-01,6.237365050921572784e-01,-2.861452800637471761e-01,1.733793810565214422e+00,1.050885973991129152e+00,-1.487174575481131633e+00,5.307656662329468533e-02,1.778444450330121551e+00,7.602218704599397192e-01,-3.833927296393276896e-01,1.937096946200986824e+00,2.586371352413090463e-01,3.691055923749476109e-01,3.136065654687342219e-01,9.825838388985261851e-01,-6.171649653975626038e-01
8.768008761860635047e-01,1.864093158346683099e+00,-7.261925274399999575e-02,-9.971917713956860441e-01,1.952594031807174946e-01,-2.598548135948375304e-02,6.089233018557078658e-01,-1.669862781129718421e-01,3.013784522348122996e-01,-3.874528144384729034e-01,-2.118737225044444172e-01,5.540936018360460152e-02,-4.007291900987522970e-01,2.963810982280078998e-01,-4.622755247859535732e-01,9.669528405264453674e-01,-1.574685587899748995e-01,-4.185159964263115984e-01,-2.978527963501823028e-01,-2.099445554376157541e-01,-4.219397734276322254e-01,-7.814150709202266620e-02,-9.325096826240499848e-01,1.892643166247958697e-01,1.925541121167309910e+00,1.043059489237116999e+00,4.228432535993226216e-02,-5.834418426016604320e-01,-1.865670171176493142e+00,-1.659605539242711369e+00,1.566506016322813111e-01,2.060771002827644249e+00,-3.352583083821071841e-01,4.028390039327258698e-01,-1.017700830803665690e+00,-4.610519177460978280e-01,2.093273727693103492e+00,3.950711531784465991e-01,1.876863402601549824e+00,-1.749613991204306274e-01,2.366927315951489197e-01,4.328109156931943535e-01,-2.412415654109981711e-01,1.198097566414906417e-01,6.801807518602638325e-01,1.141063451194445966e+00,2.133780909828481676e+00,4.241677396664918498e-01,7.713530241503642471e-02,6.585293726414331861e-01,3.681369383237315773e+00,1.983509331911680551e+00,1.002299747036804467e-01,-6.030245355779889627e-02,3.769632036073170545e-01,1.016674678601143800e+00,-4.552724844921665071e-01,5.865389748222968325e-03,-1.279491594071883398e+00,6.262718362885767442e-01,-7.513767047633873597e-01,1.818749047948935993e-01,6.246850580344166515e-01,1.078933901107690385e-01,1.580221661043025749e+00,8.543589843884540347e-01,-6.609339996220671143e-01,8.062125238439410424e-02,2.979801372618572086e-03,1.138061000590712135e+00,1.484753353786144592e+00,-4.602421423235055764e-01,-4.775649027498535815e-01,-2.284281663058666811e-01,5.430615413213171760e-03,3.015335632080812234e-01,-7.404617343985777644e-01,-6.573914349705145543e-02,-1.544948049241583909e+00,-3.724141923492998441e-01,1.210883326275282501e+00,-3.912586130854348032e-01,-3.888889225217118661e-01,1.925895705460469509e+00,7.561796918137458912e-01,-1.150860082046182731e+00,6.150486544775723985e-01,-3.822419850066438585e-01,9.225741798269069260e-01,-4.955544182741172254e-01,8.473101208408824192e-01,-1.053143942884855688e+00,1.026657970463165537e+00,2.400570774610644997e-01,-7.460315046636141201e-01,-4.132055577668803936e-01
7.956228674319212324e-01,1.124012879161619294e+00,-5.603776071820556481e-01,-7.510434029484963636e-01,-6.234661539518388668e-02,3.550275258162011172e-01,8.162039142907780986e-01,-4.856014904434620416e-02,-2.178962101560245612e-01,1.838932309347013350e-02,9.695030854599560044e-01,1.542106959603211369e-01,-2.172474914681829516e-01,3.435291882864515700e-01,-8.350642881028272901e-01,1.824845889351098371e+00,2.462094660524139500e-01,-6.664155119225996238e-01,-1.362292124629022327e-01,-3.379972474605034694e-01,-1.105254728664268882e-01,4.672856134688052610e-01,-7.125956037842036128e-01,2.360800950742530657e-01,1.896473534028395580e+00,2.370892566043396599e-01,2.122304727597112972e-02,-5.648295732863135576e-01,-1.235404097747967000e+00,-1.541672395808025398e+00,2.292514893967824985e-01,1.942812851966043253e+00,-1.620485826859683898e-01,4.583662436213852831e-01,-8.512961271805142838e-01,-7.993556112822199911e-01,1.738817874689813525e+00,5.976674440363221041e-01,2.389901009617864780e+00,4.823525710438796299e-01,3.890165772192812343e-01,1.479372613842422635e-01,-2.762862205665105320e-01,1.669723000117976919e-01,6.819717013459275501e-02,9.074325708899001475e-01,1.986802926775314004e+00,1.358166983952609486e-01,1.207828783331067746e-01,4.606830318243212430e-01,4.264024675083774696e+00,2.114117242003914932e+00,3.801154847103307977e-01,-4.368489357736040635e-01,-1.399462616640911872e-01,1.433198857774836688e+00,3.777131106428945340e-01,1.442197206797986853e-01,-1.281304707030000545e+00,1.792630302864570258e+00,-3.238945731181958054e-01,-3.994779703375141988e-01,2.066107275123103826e-01,2.549857339154966707e-01,9.240058174087395493e-01,6.103829500467239377e-02,-9.981900733733324316e-01,-1.600358533580599207e-01,-4.299875051492486194e-02,1.191517137862442066e+00,2.064112206588126330e+00,-4.308057650578778208e-02,-1.324846980404184582e-01,2.168728412769419522e-01,-1.174318505950103925e-01,6.594838554239035311e-01,-9.092393297450613865e-01,7.253707407319753830e-01,-1.094139655947421685e+00,-6.039814560399494603e-01,1.369514335725747767e+00,2.606926487458406383e-01,-2.817168724961605641e-01,1.666671342815654544e+00,1.215652525812410012e+00,-1.404169083633421744e+00,3.502898811705837945e-01,1.141171795552410329e-01,8.030141473058203250e-01,-4.834127874052293050e-01,1.229039203604045616e+00,-4.312122871571070770e-01,5.499363583039836856e-01,7.126537490768186656e-02,4.313825304262599025e-01,-6.349524229148856280e-01
9.742628767611704044e-01,2.103889745703075853e+00,-3.598968506278487633e-01,-1.186030709248350856e+00,4.255185926952537168e-04,-1.169915588054525335e-01,1.030994064546542632e-01,1.626253446343972064e-01,5.539505039128524988e-01,-1.749113258620705047e-01,3.917266199587521869e-01,4.377217277188987232e-01,-2.663637880919706991e-01,3.595027773479274602e-01,-7.782899279141438642e-01,1.764703740848583724e+00,4.639256493437856066e-01,-2.918469887757187964e-01,-4.342135586779278245e-01,-3.581143560836036466e-01,-1.653737948280078474e-01,4.403861387524299342e-01,-8.162259180970607986e-01,8.273681905302984751e-02,2.001794395149909978e+00,6.615007352718796918e-01,-8.026074840992408754e-03,-4.825720217096179931e-01,-1.461071199837080004e+00,-1.706465995601904595e+00,3.732955764157441791e-05,1.860015066379446580e+00,-5.039813334704033032e-01,3.068452828653166486e-01,-9.840860842568720512e-01,-5.900956162032375829e-01,2.097530381699252544e+00,5.067107805631871909e-01,2.126200991417831254e+00,2.909952120562694367e-01,2.478017388375675645e-01,1.335621248726038823e-01,-5.895145436461496358e-02,1.795170396549707337e-01,2.093739422019292307e-01,9.553816794295839632e-01,2.439681856732886622e+00,3.195264092895555019e-01,-9.868212211969033809e-02,1.012734250454618845e+00,3.812587791697021888e+00,1.872157918520916731e+00,4.496305200894336052e-01,-1.943344625285467198e-01,1.328499015068833611e-01,1.268596719502596448e+00,1.910506095933513504e-01,1.490022503394520526e-01,-1.694763654093264904e+00,1.299093269243702942e+00,-7.589429297082590509e-01,4.350008017241832059e-01,6.748816760593209230e-01,5.303726496949410230e-01,1.403449172199500605e+00,4.793931240183189058e-01,-7.228783190777994250e-01,-3.744474813482038256e-01,4.234923020376429870e-01,8.930099199587473446e-01,1.894127746173449589e+00,-3.766208690454305730e-01,-4.553230149055384479e-01,-3.658312893174311409e-01,-1.383919120655836554e-01,3.441854099730580763e-01,-6.360152641774001747e-01,7.343118452388319728e-01,-1.564377289108517033e+00,-1.273910166576175118e-01,1.636058625516153331e+00,1.957374402258618695e-01,-2.704044618340585848e-01,1.592248041159714633e+00,1.363596019645996194e+00,-1.277661427129853200e+00,5.037880146046228580e-01,-2.641318739015923178e-01,6.921078576679160488e-01,-4.953037248681442239e-01,1.297908698858664334e+00,-8.923171175381174880e-01,9.137396862630816630e-01,-7.231336092390439063e-02,1.008820135664918183e-01,-3.816458323957336862e-01
6.308809589755015601e-01,1.009124343948080149e+00,-7.532258701854530059e-02,-1.123967767268533757e+00,1.458317376586647229e-02,7.002183933312589037e-03,4.401757279399638456e-01,-2.853596594338035919e-01,3.830316790505250424e-02,1.784129983361674165e-01,7.102844833299676308e-01,2.402873605317910610e-01,-2.989798921549842170e-01,-8.967837745443948960e-03,-7.555850871101480459e-01,1.551078326841127009e+00,-1.548778268773749467e-01,6.062850953302437174e-02,-2.580468355624040977e-01,-2.006215919332020314e-01,-3.271791499206800902e-01,4.975416842339157597e-01,-5.528603684832439358e-01,1.405509223184929213e-01,2.062237506611579452e+00,3.978856703445071141e-01,3.142119442088062709e-01,-6.289586974236494044e-01,-1.588112551092479174e+00,-1.704905413509161693e+00,-3.835538720179132444e-02,2.334981996913240376e+00,-5.437366079740818536e-01,4.007412360641423033e-01,-7.070274706002428466e-01,-4.996934993972558248e-01,1.598915967867960974e+00,8.388861313482867121e-01,2.638651190117077050e+00,1.060092289115989628e+00,1.482484218107638640e-01,3.125647141943940222e-01,-7.934985732377800027e-02,-2.539499808300020312e-01,3.365108923361412319e-01,8.340159801750403057e-01,2.218729007657275876e+00,-1.841238145059789499e-01,-1.885399075029110527e-01,7.267489758368239627e-01,3.432922455109686410e+00,1.997376062737657998e+00,2.475855695655393429e-02,-3.065492910446690478e-01,-4.551394990778609428e-01,1.802174606868125029e+00,7.998483795943406305e-01,2.620177746637674110e-01,-1.120307411930064889e+00,1.920622156967535243e+00,-2.214813372744114106e-01,-3.062581542433165382e-02,4.457829117276628228e-01,1.030181977394465598e+00,1.511842298639284543e+00,5.716653162291200907e-01,-9.100177795720741925e-01,8.757882369967806557e-02,5.993463921914533588e-01,8.949314642086204641e-01,1.601678520422131102e+00,-2.742811412269922644e-01,1.204940197650596206e-01,-2.649700956904611493e-01,-3.688723799714938023e-01,5.521194028765372686e-01,-8.011548904955745343e-01,8.941236143817213877e-01,-1.531334061355875908e+00,-1.598906414035131396e-01,1.053253562506164087e+00,2.846010341400637134e-01,-2.586155525674230793e-01,1.970742768767986153e+00,1.371001294279613258e+00,-1.527430846424119748e+00,5.347364258819130578e-01,2.670256421706264094e-01,6.052026724344787834e-01,9.092440600510565130e-03,1.265816279783118503e+00,-4.534809498734768685e-01,3.229123957835607905e-01,3.877286281135669532e-02,7.272128988002586336e-01,-4.263548485956676348e-01
9.572903239006906873e-01,5.388902051707562535e-01,-3.519999255451300990e-01,-3.223637231449583140e-01,-5.775414018580953268e-01,6.587016098014455423e-01,-1.272295462639579378e-01,4.881733299333627096e-01,1.879278320402066216e+00,7.351130501296845310e-01,1.003247249843634892e+00,3.310341714549309700e-01,-3.754743424672387642e-01,-1.130402738959443570e-01,-4.921141771147715671e-01,2.424477481160463910e+00,-1.318473927428448489e-02,-1.341747654484082286e-02,4.957479418417728295e-02,1.835424988961280590e-01,-7.407244675260713507e-01,1.102977241570825218e+00,-1.892854029829095786e-01,6.659673336665354604e-02,1.439266023221332569e+00,-1.018274996652066333e+00,-9.994256839807563741e-03,-6.280864148419983417e-01,-2.444311546888380260e-01,-6.826589943819523221e-01,4.681369702860089799e-01,2.591083454440428646e+00,-2.026781770708840080e-01,-1.721920099453694286e-01,-5.400953837826282244e-01,-7.614483860314539276e-01,1.564675068933152779e+00,1.073550668294206645e+00,1.737880805986768085e+00,1.973235496768796171e+00,1.165185046728673957e+00,2.244337268291820842e-01,3.894226137700123047e-01,2.721215785466676862e-01,3.206407485930162782e-02,4.721975690320739383e-01,2.999442582463427875e+00,-2.594807571282698594e-02,2.335704376104382196e-01,6.457187878033242567e-01,4.608188986099643003e+00,1.833421670312806562e+00,1.175214097181404904e+00,-5.688598929436287088e-01,-9.294261452594063666e-01,1.756080556294484118e+00,9.891619098449715430e-01,-3.649551159036493742e-01,-8.072984363902571125e-01,2.719756288168723390e+00,7.442333750733676201e-01,-3.407062833084290032e-01,-5.373928047967282406e-01,8.860128637345943137e-01,5.306084254806660017e-01,-3.644128052514491456e-01,-4.060136693118699958e-01,1.014321433775710934e+00,6.287969860163783453e-02,-6.047901755937554746e-01,3.239119547912577168e+00,-1.055490419025907345e-01,3.040082031674131713e-01,3.163411168968574549e-01,5.161177016981573218e-02,1.044373530079520052e+00,7.389159687012442079e-02,1.143387501381254445e+00,-8.580610564451006672e-01,-3.452983369260109181e-01,6.829604574113131710e-01,8.975436452401865939e-01,-2.837679866103197113e-01,1.197029590731629289e+00,1.128119138225338380e+00,-1.222845386086293340e+00,-1.792532091883263790e-01,2.182998104328670586e+00,7.564463608432016040e-01,-9.973504312630021573e-01,2.632439645061200650e+00,7.279544193541154229e-02,1.112195448302261802e+00,2.207161185315911767e-01,6.310292450350478699e-01,-4.593405074093681040e-01
7.879010282690078748e-01,1.208935201270249005e+00,3.002365455888530432e-01,-1.233096087351817083e+00,-3.458277818880559074e-01,9.056829734502475082e-02,-1.292466297128646580e-01,9.273279770094194907e-02,2.111223459609368192e+00,2.565576535481300380e-01,-4.095226831288867886e-01,2.956385284247052825e-01,-5.464504460934143104e-01,-5.449622230173919446e-01,-4.423428983092680400e-01,1.129510637321597066e+00,-6.445176618721266681e-01,6.446854235004798594e-01,-4.747206015462135942e-01,1.111665811237861901e-01,-8.636457804252126724e-01,7.931304560069423193e-01,-3.854521898822791393e-01,-1.614972274628723448e-01,2.076727449599208519e+00,5.120004929325239207e-01,1.136696474985451344e-01,-7.339361999660445335e-01,-2.237732839238275151e+00,-1.738117601466519169e+00,1.055233313855152844e-02,3.021320198133444990e+00,-7.598595664589804510e-01,2.985966861148087181e-01,-7.369812523812960814e-01,-4.383172198893814375e-02,2.256597632284333521e+00,6.535928257716671075e-01,2.158972536419437205e+00,1.352491947090208368e+00,5.710970072280545651e-01,7.457976212472494648e-01,4.233888817491212597e-01,-3.145550896491143833e-01,8.257848801495629720e-01,6.835320131893076745e-01,2.892656887319096093e+00,1.894921605212340210e-01,-8.279877089353716857e-02,3.692794817815728825e-01,3.422088035938611661e+00,2.395892529135966065e+00,4.955779585712428714e-01,1.013497545581507064e-01,-4.105696725710411554e-01,1.737751364227166029e+00,5.019418802170839689e-01,-3.174702895381747436e-01,-1.113260570724695198e+00,2.303122904626065726e+00,-6.367169697971659659e-01,4.943217145562314174e-01,5.077184211071515962e-01,1.057867827860261567e+00,2.159479959429620344e+00,1.330011753701037858e+00,-2.516502214795537373e-01,1.005823835711479042e+00,8.478499974131360473e-01,-2.178600909688682696e-01,1.687670917005987370e+00,-4.394223379878808844e-01,1.873368344729194057e-02,-1.143204374761620512e+00,6.748945380240799208e-02,-1.573293612452379975e-01,-3.954610731042015326e-01,3.209254886534078643e-01,-2.358315708773806030e+00,2.156224708181124772e-01,9.172973515882447693e-01,3.162361553299956052e-01,-6.498268100191096908e-01,2.219698660232884979e+00,1.131854481610639951e+00,-1.589050910095209712e+00,3.140740403222099797e-01,8.255748747671228793e-01,9.434354343080459948e-01,-1.047583822921459351e+00,1.909508995934485309e+00,-4.182502721475038765e-01,1.144868179404810560e+00,3.108018947773893981e-01,-7.482949505570561932e-01,-4.694028119040797309e-01
8.668673570149527663e-01,1.040047590968381286e+00,1.239396755521533638e-01,-5.583443744746533488e-01,-5.720754571766621666e-02,2.101155328458605420e-01,1.305125957007318704e-01,-1.322888427096106240e-02,1.216572450709139108e+00,2.322815860998595772e-01,1.410073103797441774e-01,7.857196319705081478e-02,-4.872408007376811678e-01,3.312388945423613840e-03,-1.951189025599158189e-01,1.415757161419257892e+00,-4.714298657857093344e-01,2.301960226522378750e-02,-1.009033146894822153e-04,2.002911560309266203e-01,-8.733469477675203096e-01,2.500683968705879612e-01,-5.099124800695240545e-01,1.852319766305289550e-01,1.521075980296314967e+00,-4.420104018856105960e-02,1.860227755201231126e-01,-6.489836222184158787e-01,-8.757161408075553322e-01,-8.885081906342346958e-01,3.523133677110585893e-01,2.515963181360888257e+00,-2.901060097503704305e-01,-8.640949669966191404e-02,-6.826871999664310131e-01,-5.354758469156193357e-01,1.584645416070627588e+00,9.393010053243926460e-01,1.529474743626638267e+00,1.087598799875757027e+00,7.109260298865711647e-01,4.407841619726945437e-01,1.201824943869716084e-01,1.165156781630170696e-01,6.119803142112502092e-01,8.362005161125809494e-01,2.679967287161446166e+00,4.838868012132668817e-02,1.303822313306293723e-01,8.727646617817148567e-01,3.813763253471407211e+00,1.602412677526006357e+00,4.308517375965346119e-01,-3.119331243938586740e-01,-3.994777891262453196e-01,1.382828607085427652e+00,1.820321410818595553e-01,-2.169427812169901770e-01,-6.615064819198251955e-01,1.228478082060800336e+00,4.554452013453591519e-01,-6.467933360831074063e-02,-7.919961943984889230e-02,7.098005897300277978e-01,1.090556095327798625e+00,3.288897272466174693e-01,-4.033849189496596099e-01,9.537110678305701361e-01,-1.134838821471285258e-02,2.166744674449661012e-02,2.301768681069741085e+00,-4.811058539821706503e-01,5.420689697540945207e-02,2.119945632788115819e-01,-4.690110833992191391e-02,9.395169158168148460e-01,-6.766239323774764225e-02,3.839589336793091112e-01,-1.037243056610956726e+00,-3.103238682590987452e-01,4.353303956909984063e-01,3.253369168120025245e-02,-2.559134499642535809e-01,1.574802215854581799e+00,6.448039458764479592e-01,-9.812209346156561818e-01,2.865812411216724920e-01,1.291014459047459484e+00,7.655710027828930286e-01,-3.965777755883410638e-01,1.721596308483409166e+00,-6.012727872474368240e-01,1.112490960845539112e+00,3.504430026238246620e-01,-5.542658886895177051e-02,-2.297169855812433159e-01
5.208450084682813008e-01,8.948975228593301079e-01,6.914308481098426773e-01,-1.103090376035551490e+00,3.237017997050372076e-01,-3.103902373687297822e-01,2.307101279938030269e-01,-6.800431161859118445e-01,3.541749765834497632e-01,1.612664230138474708e-01,-1.101900106238219990e-01,7.927358643133111671e-03,-5.275069156953092753e-01,-2.422365830105454587e-01,-1.909144190163947763e-01,7.340626977181751167e-01,-1.007943209600914658e+00,6.170105736225895976e-01,-1.293825595457560595e-01,1.910788801797482783e-01,-9.132778517617627934e-01,-9.431676310150655107e-02,-5.174509775912798926e-01,2.059372303874217047e-01,1.870755354499695766e+00,6.278142849316762364e-01,6.426745036776182474e-01,-7.278885261386194294e-01,-1.650644800134508650e+00,-1.369436013095576055e+00,-4.055308381240130267e-02,2.762613727239858097e+00,-6.822343054292966391e-01,1.058952571980774360e-01,-5.826743829791078966e-01,-2.123320193767318509e-01,1.303992309497819857e+00,1.118862222186016053e+00,2.140361738160784011e+00,1.222302097455204350e+00,5.885555523249308418e-02,6.338735334663549992e-01,8.881142240695210147e-03,-4.941358249880239972e-01,9.983237229445063310e-01,9.494097958986419394e-01,2.415680387971146814e+00,-3.884294241816593218e-01,-2.822809939718064487e-01,1.093554897897358158e+00,2.587805391767559637e+00,1.521734210311091573e+00,-4.909220360315753595e-01,-1.541401503796383243e-01,-5.356619814688734493e-01,1.741727817775947429e+00,4.654543210709620737e-01,1.824941020269690573e-01,-4.682554659894104243e-01,9.134924558533024097e-01,3.470046094650944823e-01,1.812502356392238223e-01,4.289019349965501604e-01,1.413788712047583385e+00,1.901860249301946526e+00,1.079632747521791725e+00,-6.129422846656992219e-01,8.574132249559344165e-01,6.349720054320996399e-01,5.116518616021130672e-01,1.181962802854737760e+00,-7.301166014899068690e-01,2.929456708563166201e-01,-2.324200596691844145e-01,-4.848308051668057672e-01,8.070075993661780522e-01,-3.785000291423626928e-01,3.821812718823044963e-01,-1.515370992071563672e+00,3.313715251047805177e-02,1.390951278964152049e-01,-2.873995575961681981e-01,-1.851528273395485202e-01,2.188907901108464671e+00,7.704342803399609751e-01,-1.182818015171561488e+00,7.653685808239127919e-01,7.068365534224640978e-01,5.199489478903900341e-01,6.290189452037866502e-01,1.070178693337025644e+00,-8.001129732382490367e-01,4.609245565457837368e-01,2.955498938367604467e-01,3.683498734702779775e-01,-3.265316721399835753e-02
9.702492257535787479e-01,1.444534739724455896e+00,-7.126524767483531919e-01,-6.605334146848358401e-01,-1.914091699234350963e-01,4.632288704249564737e-01,6.886292853775668465e-01,2.425774570024578636e-01,3.261567103493553943e-01,-6.424135612807582718e-02,7.801086386203073264e-01,2.066895230586570931e-01,-2.331370032420252980e-01,4.198971088284063624e-01,-8.048871485390698410e-01,1.933968872727037880e+00,4.381186709900223852e-01,-8.356581790798993659e-01,-1.815363861959848613e-01,-3.438996519753742542e-01,-1.226377506183274901e-01,5.510461910301676092e-01,-7.672574691945819314e-01,1.810784954111915035e-01,1.819676652062966804e+00,2.080222758180852172e-01,-1.926453732805352981e-01,-5.294419566651428211e-01,-1.172446363637493771e+00,-1.468723494625794324e+00,3.360304409670871739e-01,1.860124779708407505e+00,-8.237630562568179493e-02,4.087157747661536167e-01,-9.557307104990694357e-01,-8.286464327512068628e-01,2.028103209324939815e+00,4.263352562149444469e-01,2.082447045486335302e+00,2.507275209393460269e-01,6.040826562251626619e-01,1.310196295913283460e-01,-2.011950702650893152e-01,3.972068014289804605e-01,2.904139238667752254e-02,9.046898973534633903e-01,2.149200654680716305e+00,4.217771140311418199e-01,2.594391049191370202e-01,3.888555484434392251e-01,4.637246415583462955e+00,2.190695330069414748e+00,7.333511993564527653e-01,-3.804616573796812395e-01,6.823744240181289777e-02,1.200392703616894652e+00,9.063640627754637746e-02,-4.979845125211291440e-02,-1.467179314728854322e+00,1.750362663592224255e+00,-5.297909145844921230e-01,-2.911734658761389594e-01,1.709890352196918317e-01,-6.499043898588641177e-02,8.193009177614285488e-01,-2.437081730399526247e-03,-8.314373663602857567e-01,-1.390364325300821324e-01,-2.180437936340203775e-01,9.862917886241119314e-01,2.358461916113388845e+00,-2.337604153605066237e-02,-3.517712286238973696e-01,1.670054708572156210e-01,1.059831934037766404e-01,5.159876750941726486e-01,-7.849058975499049184e-01,5.676218576597129584e-01,-1.122310757296587580e+00,-6.436691284983522277e-01,1.574600834794511517e+00,2.882167170245879539e-01,-3.669254211425034828e-01,1.500602794148152563e+00,1.139674902940144285e+00,-1.319305129715622416e+00,2.145418786867848149e-01,1.333974274006318739e-01,9.445241671689568186e-01,-9.940919840164454957e-01,1.425595595265492399e+00,-4.925211309067011323e-01,9.420108408597781535e-01,1.028016512875102317e-01,-6.537807922987678988e-02,-6.940701576770602621e-01
9.277600114735676806e-01,1.847193142507351116e+00,-1.898580722723655079e-01,-1.132430371632686672e+00,-3.742287630316868535e-02,-9.343411761541381422e-02,7.298112004117895957e-03,1.195669142096987825e-01,8.213742359622817624e-01,-3.185230687948198414e-02,3.165958882285067055e-01,4.026472805234737606e-01,-3.241248881942200288e-01,1.965993521573795033e-01,-6.641507295810318290e-01,1.691373166880155710e+00,2.179222664521087149e-01,-7.187127161147185972e-02,-3.799588238583802013e-01,-2.185032759426387416e-01,-3.478750242023092021e-01,4.727085705532186877e-01,-7.009917660729303446e-01,6.712583406451282098e-02,1.942991620803871555e+00,5.057493264168156921e-01,7.100990605482297713e-02,-5.297027119241791704e-01,-1.408103346604701489e+00,-1.578075968156237074e+00,2.020647819055859662e-02,2.089170115883732581e+00,-5.412182943813054203e-01,2.173430623365297243e-01,-8.894130703799427717e-01,-5.196372612769923904e-01,1.989049404372703611e+00,6.393993551637772166e-01,2.071066465695885928e+00,6.219107758896180727e-01,3.244136656795955087e-01,2.251313726486132427e-01,4.344827674388810484e-02,8.703408720170871526e-02,3.176720238206355296e-01,8.911102196792021202e-01,2.565196112082617663e+00,2.078061477239495913e-01,-1.087424678220476754e-01,1.009160970444043182e+00,3.692934254162060448e+00,1.829046566697204224e+00,4.300039695071948831e-01,-1.945656341867808559e-01,-6.442083473135457039e-02,1.389407595076481039e+00,3.192578498186816049e-01,7.970528008982280532e-02,-1.474942366206030364e+00,1.421897434630980506e+00,-5.057807209197834331e-01,4.083115051601603485e-01,5.550351087696401287e-01,7.322395931238285804e-01,1.449346819337071546e+00,5.352525719955740779e-01,-6.298456180229312640e-01,-4.464556964362864644e-02,4.837656773331548976e-01,6.044247125858444036e-01,1.932640164402184002e+00,-4.216142778851077466e-01,-2.929023445634548750e-01,-3.741582999963245504e-01,-1.542467780373105724e-01,4.185744584072314534e-01,-4.930402486401143092e-01,7.325987365080118829e-01,-1.568296965129402087e+00,-6.541274591429535601e-02,1.357570689303454259e+00,2.245479334225804480e-01,-2.772883185021593477e-01,1.639452007445319381e+00,1.284113322119652789e+00,-1.267939932225661703e+00,4.656845365337556331e-01,1.276694051872300228e-01,6.761148349516200584e-01,-4.435610167267874937e-01,1.456287560287281124e+00,-7.954263281878012348e-01,9.227655511664758503e-01,1.063965380898479474e-03,1.333227970905564441e-01,-3.294511864740192197e-01
7.239368146013325234e-01,1.191285847819961941e+00,1.553973155742333079e-01,-1.104822553729173817e+00,-3.852776231575975874e-02,-3.342391897241597798e-02,1.428422157955730742e-01,-1.625690832243068262e-01,8.676329422306460204e-01,1.682943941262247667e-01,1.677748358111657567e-01,2.334808682309991723e-01,-4.224455101558393655e-01,-1.512343428565190440e-01,-5.127290478093524673e-01,1.320883329916250570e+00,-3.887208455883434666e-01,2.907554251720700922e-01,-2.908682598659900753e-01,-1.947760475544522280e-02,-6.187719800369980705e-01,4.475684739588443595e-01,-5.228055114867413700e-01,6.476414683455106180e-02,1.964370517408080552e+00,4.419389411079677199e-01,2.708615454258714861e-01,-6.565645237640465037e-01,-1.663324209010247356e+00,-1.558969224326260505e+00,1.386728248287089071e-02,2.558643962654629789e+00,-6.063626014205441006e-01,2.433674032189889758e-01,-7.198425333830829054e-01,-3.391224069325434187e-01,1.776881216983991596e+00,8.212646054039840493e-01,2.234919343869297137e+00,1.102453180009439260e+00,3.181551572242357628e-01,4.723519677116244098e-01,1.077339522183855675e-01,-2.224156534467517932e-01,5.952669269481045689e-01,8.232448094870035149e-01,2.533846915129618793e+00,-4.226267333207699151e-02,-1.420614727812199996e-01,7.743767396175683659e-01,3.351764709686913868e+00,1.943502909536635403e+00,1.604118604155124472e-01,-1.583101765324270438e-01,-3.923296015935908709e-01,1.672782986475535250e+00,5.397248171994626365e-01,3.016278367987459963e-02,-1.026930097897410299e+00,1.697956382934889374e+00,-2.109315631490399634e-01,2.214492015234771349e-01,4.331027995127741947e-01,1.040112033576270800e+00,1.698840776220134074e+00,8.243743807557871728e-01,-5.959876716156795595e-01,5.075098007787098853e-01,6.063180324421114653e-01,4.086275854162723098e-01,1.671424052735559274e+00,-4.434684133640811599e-01,5.051781444660756459e-02,-4.631071090539923274e-01,-2.182082036254817115e-01,4.309928304499461293e-01,-4.995382326687383134e-01,5.984369629540806645e-01,-1.702902001412777588e+00,-1.905791843522247619e-02,8.555513424631580044e-01,1.663255586320208368e-01,-3.445579001374402539e-01,1.976151443069924962e+00,1.133424048445350829e+00,-1.389233422772254478e+00,4.861631609939761622e-01,5.588727263593867844e-01,6.959543687265790091e-01,-2.560606513889864266e-01,1.475243167626123952e+00,-5.778676231053301304e-01,7.270107288813435487e-01,1.695051210297118249e-01,1.337863410477256321e-01,-3.287592653302565671e-01
7.080006853742208950e-01,1.131204467781591561e+00,4.115425360257282117e-01,-6.787949362783144425e-01,3.333153272860901462e-01,2.827592440767229265e-02,7.137874563341697343e-01,-5.208251377291426287e-01,3.247580963950720268e-01,-1.768923759169127863e-01,-4.310243292377530788e-01,-2.434264619184462464e-01,-5.551267453994341849e-01,6.497705745269334587e-02,-3.675183056299469175e-02,5.123728261449809196e-01,-9.312382954918463351e-01,-1.186251060026240756e-01,1.714890938735093295e-03,1.605296295371419490e-01,-9.007328803910253923e-01,-4.176920653300326691e-01,-7.699037311882769297e-01,3.113289484800709772e-01,1.655163984144699674e+00,7.729953884376077333e-01,3.206083521376620338e-01,-7.069292455693847455e-01,-1.592222777997295946e+00,-1.182339727088367098e+00,3.069904290899207466e-01,2.495282963639319007e+00,-2.560323964059978974e-01,1.678453440374431671e-01,-7.948801347699059328e-01,-3.773737470115495762e-01,1.599676646798652069e+00,7.518054817292852965e-01,1.584939621934559728e+00,2.941580037727374863e-01,3.376966117771754150e-01,6.670035345998616139e-01,-2.130096776419071469e-01,-5.773037492094627854e-02,1.063345545455611330e+00,1.136937220338422705e+00,2.160756782553849842e+00,1.090759526831191484e-01,1.280827167159918345e-01,6.942534502448511891e-01,3.329908629192607439e+00,1.684355594462879635e+00,-2.340587758496137649e-01,-1.251937787602080132e-01,2.488866472177964084e-02,1.131435427093453905e+00,-4.662458969868564784e-01,-9.534480034608212862e-02,-4.872176365748142612e-01,2.779334156180666149e-01,1.160387356977638784e-01,-1.302457701351261710e-01,2.380140004285912769e-01,3.703598090258554132e-01,1.517995541156729633e+00,8.974094593235711903e-01,-5.358466517122778550e-01,9.065858782953137851e-01,-2.033393023641609787e-01,7.879890972375471758e-01,1.438093170974313217e+00,-6.233140035130826373e-01,-8.622237318376139992e-02,1.749089199443620291e-01,-8.014977844304518872e-02,7.718890786768933809e-01,-4.383121074124738392e-01,-3.361709591251218487e-01,-1.194789412113155258e+00,-4.576530582699922522e-01,2.729151819724205397e-01,-6.769405813629616464e-01,-3.128050610598099301e-01,2.043731926459821935e+00,2.371698484803033136e-01,-9.338974242597880560e-01,6.368622876117335796e-01,4.573625932768343727e-01,8.818934517457837075e-01,-2.353830204418350114e-02,8.521320054391328114e-01,-9.793441922342750461e-01,9.586541322853689984e-01,5.134749983121202899e-01,-6.866996456349743205e-01,-2.201220547684035189e-01
5.603220966470229270e-01,9.042237714006599036e-01,5.112772447883686677e-01,-9.269095226846983948e-01,3.109950862553567674e-01,-6.074290236001900212e-02,7.092725001404147633e-01,-6.676339668359246859e-01,1.593386122286194473e-01,-6.005969327405949465e-02,-3.057024654669616148e-01,-1.833003034447214241e-01,-5.353486447736539589e-01,-1.350655004601275522e-01,-1.807013054866125068e-01,4.843267420878321072e-01,-1.039296362963205267e+00,1.692583684343367811e-01,-9.467799124773401687e-02,1.194386172855964323e-01,-8.458834987256321769e-01,-2.435112099254473916e-01,-6.681573520085966056e-01,2.502076196887372816e-01,1.868219884144272758e+00,8.531321754860464734e-01,4.509506158623900474e-01,-7.470314058867147944e-01,-1.933012570276596565e+00,-1.464109765225957815e+00,1.280190576350174469e-01,2.672018514733872863e+00,-4.443728075079726447e-01,3.064238484072658308e-01,-7.174975633466417202e-01,-2.561062145656903266e-01,1.547310841609106369e+00,8.231133109279127336e-01,2.042372178557156914e+00,6.275677203431329065e-01,1.561936680880181560e-01,7.182791842711853114e-01,-1.707738540560936880e-01,-3.367455883827263907e-01,1.066289772499662281e+00,1.062883995741580767e+00,2.115858599144635477e+00,-9.153349642013189347e-02,-4.250092171588849832e-02,6.198900787175137816e-01,3.005323130175311164e+00,1.849432950649082308e+00,-4.229792598764055001e-01,-9.189447697012892435e-02,-1.912090391248177645e-01,1.452773083994319370e+00,-5.086264302590148834e-02,3.947306430187610959e-02,-5.088792986251753359e-01,7.527018738360942152e-01,-1.869157237612079081e-03,-7.946626875579887450e-02,3.967537218522646514e-01,7.464563817651441724e-01,1.825053076106031069e+00,1.129176877424651337e+00,-6.455035577065940666e-01,8.532947751965815897e-01,1.925514548960304551e-01,8.527040145194089149e-01,1.132659283720326204e+00,-5.871255439940057386e-01,9.347701021022744583e-02,-1.405530564659826787e-01,-2.320756393276278695e-01,6.043705773668135439e-01,-6.230130454975920662e-01,-1.129054339657964423e-01,-1.506617816627624507e+00,-2.810170998267910170e-01,3.015376032635191383e-01,-5.199510866038166146e-01,-3.421853877988395576e-01,2.296379379642719876e+00,5.113170027731738232e-01,-1.193851315874053576e+00,7.131192238741793643e-01,3.661761244151630068e-01,8.003568776628650072e-01,1.685583235898125420e-01,8.288250715651678258e-01,-8.216772219164186764e-01,6.364896223520775109e-01,4.419384817368011698e-01,-3.573302552258639242e-01,-2.579272694861670656e-01
8.771513846581056040e-01,9.657223269899253282e-01,-2.884125776798553975e-01,-4.753272474371224576e-01,-1.410970005331790289e-01,4.393097687552359187e-01,5.071608261588366195e-01,6.597887941341573637e-02,6.904557596469622638e-01,1.759171275345294549e-01,5.841047622793504868e-01,7.546641310344984199e-02,-3.657529381717339323e-01,1.811131392566657228e-01,-4.630226471457643544e-01,1.696821613346686242e+00,-1.198396243799968452e-01,-4.282828681809999205e-01,6.556542432644439644e-03,-1.577093652189848899e-02,-5.488839295443426192e-01,4.025670201736409881e-01,-5.812704464313895869e-01,2.214504083363729170e-01,1.599817559167579617e+00,-9.531247256314570593e-02,3.099300282311451271e-02,-6.142531472583958596e-01,-8.770961184843617531e-01,-1.054663070227948030e+00,4.104344606419945141e-01,2.254094621219584482e+00,-1.137138840725547828e-01,1.325635645737701374e-01,-7.571034002346869185e-01,-7.257528313866027370e-01,1.666818812017207607e+00,7.647558347758374175e-01,1.803244380414239956e+00,8.212993296926686115e-01,7.228835395747406078e-01,2.977386070727885969e-01,-5.427107590407448390e-02,2.485233581189617569e-01,3.095773890183649568e-01,8.412653264423829436e-01,2.374495104733161721e+00,1.530519439141992954e-01,2.411807639408404813e-01,5.616540368340133815e-01,4.295692997182165129e+00,1.881087396570033432e+00,5.721367773435982462e-01,-4.168442220948447852e-01,-2.921943454147751806e-01,1.351015094384449888e+00,2.139822684557499688e-01,-1.531873235458792171e-01,-8.947999496696452670e-01,1.585554735707274787e+00,1.937262375541957682e-01,-3.663418890063729894e-01,-1.169046372477265394e-01,3.328485582656522945e-01,8.180307883702626626e-01,4.052914557125558703e-02,-6.423580349668208678e-01,5.544493119820734783e-01,-2.179657925888258130e-01,4.576435106501510197e-01,2.423989420357270497e+00,-2.061591718058080336e-01,-2.902435540813136372e-02,3.648788849568833648e-01,2.069311284464146750e-02,8.728666298426352999e-01,-4.027043505437653548e-01,4.955229044631096480e-01,-9.223432307203031089e-01,-5.661784258499202860e-01,8.402324688107529749e-01,1.833162519643019572e-01,-2.927631905004549617e-01,1.523132507315415163e+00,8.235892659687555906e-01,-1.139539728857576151e+00,2.016091506945584533e-01,9.557178835481359158e-01,8.562061111410820269e-01,-6.455811562702238326e-01,1.623058294297089477e+00,-4.314984725075419747e-01,9.630106979440674619e-01,2.749776781538415538e-01,6.631292301463935501e-02,-4.770995083459408370e-01
1.038341820577749042e+00,6.628203973066884025e-01,-6.787663525565800215e-01,-1.670212278078597734e-02,-5.429285550567954921e-01,1.072403104887363012e+00,7.865010547020032661e-01,4.813021404655170032e-01,1.410540212465424936e+00,2.535203172838977892e-01,5.874999315958502333e-01,-3.574485686958017716e-02,-3.878449465985295830e-01,1.403774725776497645e-01,-4.621350758845100271e-01,1.901718655843488648e+00,-5.232523191073296109e-02,-8.880101328171734476e-01,1.058479973346937997e-01,2.860864975369538377e-02,-5.946370222202288502e-01,7.368728530778068109e-01,-5.210926908737912866e-01,1.668324727973647115e-01,1.438898157356430785e+00,-4.999539545941768526e-01,-3.624876216050545441e-01,-6.521062204160612552e-01,-7.945598610124189332e-01,-8.781401411213165531e-01,7.711793420383432629e-01,2.359017325985552027e+00,2.422544295075483300e-01,2.077476774980504259e-01,-8.202148659978718559e-01,-8.460386324787925183e-01,2.026628387370256412e+00,4.967448476615302644e-01,1.525771615577404816e+00,7.286135567188405382e-01,1.295487743917853152e+00,3.721910693466261022e-01,1.340525234343740643e-02,5.804859093331398157e-01,1.817347665979697213e-01,7.285907532479303228e-01,2.401091006511930637e+00,5.507066198784356104e-01,6.716237546995428298e-01,-1.845410761130334976e-01,5.339532490677367349e+00,2.401259238359813253e+00,1.245107597220327378e+00,-4.387014104850704976e-01,-2.061789719208970417e-01,1.155140326483814706e+00,-6.820777869038424646e-02,-6.022264046987904074e-01,-9.088043405694371524e-01,2.238136410933829978e+00,4.875974239030772539e-02,-7.914698431154593150e-01,-5.432266914949499537e-01,-4.034689619276500272e-01,4.064925932034940681e-01,-2.454258217915233908e-01,-4.806283011497111124e-01,9.344809695528220050e-01,-7.857232407086858217e-01,1.289228720939725736e-01,3.079034089601409896e+00,1.280325935507760082e-01,-1.220190431042372375e-01,5.032708377710067849e-01,5.108299892064313008e-01,6.702365891080115379e-01,-4.003439201831116567e-01,1.686035464000888995e-01,-8.299471102345215012e-01,-9.384416022727110063e-01,1.008146889415825864e+00,3.831559444683071414e-01,-5.596279842252571690e-01,1.397481263976213306e+00,6.144635797128763510e-01,-1.205566371999894137e+00,-2.287805791026029101e-01,1.412917579500485799e+00,1.271458633623490542e+00,-1.793326018648210063e+00,2.080293181292989235e+00,-5.526699031628368175e-02,1.443658660667022531e+00,4.861351097305093294e-01,-7.617829741180963676e-01,-8.546321233618960900e-01
8.908425834070421434e-01,2.043882798081173124e+00,-1.376473860347279254e-01,-9.907761814601052652e-01,3.898764337170037009e-01,-2.596615917486681524e-01,4.198936638621854067e-01,-2.300325453828681865e-01,-2.764953636165803363e-01,-3.615567306725637753e-01,2.669332009095758407e-01,1.716710758697828632e-01,-3.043421330934181768e-01,5.791650143864920386e-01,-5.134884573760366555e-01,1.337547644727312690e+00,1.750733896959614788e-01,-4.727560967781477275e-01,-2.112512812259059181e-01,-2.749310021245792157e-01,-2.733622371805915496e-01,-2.140969587812174835e-01,-9.748207334037795047e-01,3.071388331821564011e-01,1.809258614781869223e+00,8.466197365829367660e-01,1.897198143931488890e-01,-4.876225831645933928e-01,-1.204698585124096333e+00,-1.432734016414627387e+00,8.665103103701748966e-02,1.703908173844132401e+00,-3.476337378051224669e-01,1.997799552587161132e-01,-9.722787951605085244e-01,-6.736273663072283036e-01,1.706188900851089096e+00,6.356258151241773735e-01,1.850464405623307051e+00,-1.049129821345093916e-01,6.384304548272878854e-02,1.477900501534847311e-01,-3.309857753745811260e-01,1.998078300445896849e-01,4.348746070496899430e-01,1.178777512443173636e+00,2.139533094525305934e+00,1.887034266185377285e-01,-7.325743590137424877e-02,1.283431297746715938e+00,3.509244607325059384e+00,1.435426672958745264e+00,-4.045489381174594001e-02,-2.710919906725420270e-01,2.777597117213278510e-01,1.037906028598207353e+00,-2.272586562745704253e-01,2.883310827262084430e-01,-1.297332767357371575e+00,2.118971722294638038e-01,-3.065032471302558958e-01,2.255200591020779521e-01,5.941607246267545106e-01,3.923483238987433563e-01,1.235446800842887827e+00,4.059432284846845040e-01,-8.261900330108520318e-01,-3.233021124572448279e-01,4.195074752455040662e-02,1.309208504209705026e+00,1.634799220873795811e+00,-5.608571195359064454e-01,-4.415944024651246580e-01,2.012161797898629478e-01,-2.846481281085842530e-01,8.187258852368065609e-01,-5.963285538215516990e-01,4.114083771033186787e-01,-1.064761385762153845e+00,-3.501395992553434922e-01,1.172498236477649503e+00,-3.446500816665530320e-01,-8.197903560686259361e-02,1.578703175103215450e+00,9.047093102943951637e-01,-9.414813987257444339e-01,7.298297772570891961e-01,-3.878175048655194690e-01,6.022148289847081282e-01,1.951941620188344939e-01,7.540246690935114016e-01,-1.215670851325335811e+00,7.769049233080977945e-01,3.637167817296138583e-02,1.889910333784758922e-01,-1.715749467680056373e-01
8.840856053369322565e-01,1.149933861033011873e+00,-5.507523927479770487e-01,-6.532335009027275818e-01,-2.137232798559478009e-01,5.014659221753009488e-01,7.326790552329238704e-01,1.350114795714155991e-01,4.308845638602440964e-01,3.197850431985235775e-02,6.771599914383448215e-01,1.343909316064436366e-01,-2.852528133848296066e-01,2.388956691151447043e-01,-7.321470299873127363e-01,1.757699341588562003e+00,1.505135174854970725e-01,-6.529131430448426032e-01,-1.523849552421158160e-01,-2.457464816700664634e-01,-2.602847486192984006e-01,5.636517789279095192e-01,-6.780702593800496114e-01,1.654278105076367467e-01,1.834815115250828965e+00,1.804122250989660392e-01,-1.151218916160025862e-01,-5.913383247578364310e-01,-1.321030016753686365e+00,-1.469353750566806394e+00,3.352110248173501006e-01,2.100481848353080938e+00,-1.192683113624420643e-01,4.234214313097975357e-01,-8.809155260810611621e-01,-7.299396447167421087e-01,1.964843446449421549e+00,4.963629978039562074e-01,2.148566264352662625e+00,4.824483571628918055e-01,6.210096290750380943e-01,2.593163756531376984e-01,-1.515932286111778549e-01,2.548565128663434765e-01,1.671617704794967074e-01,8.645717988849335178e-01,2.158915596495433853e+00,3.263234492619468408e-01,2.506708600015130628e-01,2.547966801264168746e-01,4.494746807420855639e+00,2.272506888092048705e+00,6.380184825470840426e-01,-3.482085712799449229e-01,-7.997731246513062331e-02,1.330452236531205923e+00,1.858538021360293668e-01,-9.671674444342306942e-02,-1.271479059675632461e+00,1.915788964709998599e+00,-4.239357637226111031e-01,-3.598653169925223327e-01,1.179872188816434853e-01,7.064205962232428249e-02,9.571912498435026784e-01,1.566930756759253862e-01,-7.931279572075041751e-01,1.427393777515845175e-01,-1.511018278881325894e-01,8.556810308980040691e-01,2.247287808625561656e+00,-3.133478751524032546e-02,-2.001201780002214714e-01,8.558263188741603578e-02,9.803979131224425936e-02,4.841787536213421617e-01,-7.800659323558492009e-01,4.887072061805761147e-01,-1.222724783583092778e+00,-6.099400760085643691e-01,1.353709177310374434e+00,2.730704234826362153e-01,-4.175244210905720288e-01,1.665334901546498214e+00,1.070683720605296818e+00,-1.386068685427972014e+00,2.101290171418184194e-01,3.478279550790790431e-01,9.710494759089719485e-01,-9.662529839955753541e-01,1.465127640461065361e+00,-3.827895843156202682e-01,8.838548899505062062e-01,1.883973951202956854e-01,-1.247719407568658734e-01,-7.042583845842356194e-01
7.329455988709455694e-01,9.614300386958567479e-01,-4.908271066653958209e-02,-9.114532694813373137e-01,-7.595558203075969406e-02,5.613581655278379601e-02,9.271328804843254057e-02,-9.476830124822999135e-02,5.847539441747080513e-01,3.636554651659322790e-01,7.935912552862908198e-01,3.047090674089862894e-01,-3.312877056362746875e-01,-7.046335193738154784e-03,-6.074725647576936227e-01,1.832298729504571844e+00,-1.182157182909496229e-01,1.606923403814837781e-01,-1.453608555294302329e-01,-3.949356211503701058e-02,-5.066548702790231173e-01,5.861081445127516165e-01,-4.389668106346440446e-01,1.417169272404662783e-01,1.817114640937209202e+00,-5.950009644635984724e-02,3.070505516261501366e-01,-6.093768243805721685e-01,-9.918188646394536789e-01,-1.281735453950679338e+00,7.318337827360565928e-02,2.381515284011283651e+00,-5.015064120155559024e-01,9.997019233358339640e-02,-6.242722722291992321e-01,-5.811604276822293080e-01,1.454103464648069277e+00,1.030724957349571591e+00,2.269657367355697009e+00,1.424509142475701262e+00,3.954491788917322559e-01,2.450798330772203382e-01,8.800243374442813515e-02,-1.104189758829209472e-01,2.684194637382970594e-01,7.385187929850036692e-01,2.550981573976260020e+00,-2.336069501195408571e-01,-1.419298292619541879e-01,9.908928263465451858e-01,3.581662085134533324e+00,1.695558262094956969e+00,2.837880780805930314e-01,-4.119717123908472334e-01,-6.507253252449769487e-01,1.797178553863240325e+00,9.041446476795297338e-01,1.384589710514468053e-01,-9.658622160641124887e-01,1.910667754481310654e+00,2.728771716364437605e-01,-7.908319416699421955e-03,1.604821395879857671e-01,1.184226338041780346e+00,1.203841759167341818e+00,2.517952095080761010e-01,-7.314999052093518195e-01,3.629967333534275253e-01,5.143992073753786975e-01,3.639009692215827707e-01,2.095713297804875808e+00,-3.431056505473603080e-01,2.041005748554809984e-01,-1.436063542123774961e-02,-3.488190773311466986e-01,8.702889799152802031e-01,-3.906876304383143927e-01,1.070958292664508704e+00,-1.225688593201495813e+00,-1.270288971823581026e-01,8.107224683946437915e-01,4.297772259426075880e-01,-1.632996684199434223e-01,1.650043684057167281e+00,1.285269810056206108e+00,-1.320926598270831365e+00,3.842565726738728094e-01,9.317421778502359420e-01,5.274033234856505548e-01,-1.095188481971870464e-02,1.673549255100868605e+00,-4.062249429886387597e-01,5.379310332668708616e-01,5.502119825408668952e-02,9.285363794441299223e-01,-2.850625934389008354e-01
7.802782073207771285e-01,1.483451241698784173e+00,-2.278015024088330676e-01,-1.094538249975574029e+00,3.645752900691705267e-02,1.628802383949184973e-02,4.776367122067733950e-01,-1.267358377627584576e-01,1.366749588200137921e-01,-6.591797472109880984e-02,4.774219234995688566e-01,2.413674929387063517e-01,-2.934011618130609733e-01,1.905465794920963574e-01,-7.421889401045917989e-01,1.506034511774082985e+00,6.524670980044838808e-02,-2.373848297937893315e-01,-3.145894399874532010e-01,-2.863741895255113579e-01,-2.461551174276413456e-01,3.719268019336284814e-01,-7.288621973729759729e-01,1.426943615002831678e-01,2.033413007551593932e+00,6.240763705813319184e-01,1.310417024426780985e-01,-5.754581047421069018e-01,-1.644147828957981394e+00,-1.735966496864064235e+00,3.137527482445878757e-02,2.100258833320091334e+00,-4.473275750969811781e-01,4.277287373483889543e-01,-8.713822696789536026e-01,-5.457452123100446917e-01,1.874295755318083900e+00,6.026876649058544588e-01,2.377383427279628592e+00,4.992696171744311906e-01,1.985679586291028698e-01,2.746441243185743231e-01,-1.488145774811567290e-01,-2.755130624113527604e-02,3.350489194667261583e-01,9.425111299128123843e-01,2.190096038662730393e+00,1.212277144275798468e-01,-7.545775130067595982e-02,7.065781114732463397e-01,3.688331196394888156e+00,2.030851329011126527e+00,1.798151762676697407e-01,-2.322455204395360573e-01,-7.321738943043049064e-02,1.464357818761012453e+00,3.337316485126777255e-01,1.781121638999433598e-01,-1.354081771459827888e+00,1.519347638832924119e+00,-5.560476881028656448e-01,8.053533896894837785e-02,5.450682533535065044e-01,5.921473053287913402e-01,1.457427770060747640e+00,5.735154138304466853e-01,-8.463488625671827803e-01,-1.063327977458391471e-01,3.659740498223866823e-01,1.043339969633205744e+00,1.663164814417283033e+00,-2.896077886526613465e-01,-1.930756848910674117e-01,-2.626572589061367813e-01,-1.984227903460057396e-01,4.101189882389305597e-01,-8.173385803465728072e-01,6.261044119856424839e-01,-1.533195922257234445e+00,-2.555288210044467379e-01,1.324698824166511191e+00,1.215427106533826934e-01,-3.081921600662458349e-01,1.862933986275838283e+00,1.250043657044181300e+00,-1.407785176778710401e+00,5.294360186379695188e-01,-1.032341781276577830e-01,7.310450088294916382e-01,-3.072477973015668717e-01,1.148079742560442318e+00,-6.782692833787585807e-01,6.214108153807895718e-01,4.913223926846749245e-02,2.054992392983633898e-01,-4.667067616664559715e-01
8.047926187468370518e-01,1.593277042962651491e+00,1.069113039653234870e-01,-8.057863533791745914e-01,4.825179511352105099e-01,-3.794298849194908674e-01,8.372040141914316447e-02,-3.732759489628203475e-01,-3.375803818318070526e-01,-5.362270324804158106e-03,6.767576716627916600e-01,1.964813428114865479e-01,-3.193679314143910153e-01,5.326525131218079467e-01,-3.349446740983402782e-01,1.609401635815845610e+00,4.267353804894846725e-03,-1.233607879432544185e-01,2.609056838168725273e-02,-4.523978737935293454e-02,-4.970229825284783742e-01,-2.583995782374574057e-01,-7.608327775851058128e-01,4.075294390309097681e-01,1.541155835283395170e+00,2.369586526870431087e-01,4.905707542766359897e-01,-4.929978360099935841e-01,-3.537461746836524368e-01,-8.918068660589757446e-01,9.560936352645407754e-02,1.819731715423636986e+00,-3.902461768643973317e-01,-1.919579608933354442e-01,-7.152353297672587873e-01,-7.788619599323436393e-01,1.055954969930508192e+00,1.166332411438821826e+00,1.711343490515473187e+00,6.899756089148235683e-01,9.230618012262720162e-02,3.891997091277432652e-02,-2.199475750223727766e-01,1.113753208882370532e-01,3.750464877998592739e-01,1.068182045953445458e+00,2.381747119800684764e+00,-2.906321211911664926e-01,-2.110442437850804653e-01,1.854496725059461060e+00,3.180532834013553245e+00,8.101584802835999355e-01,-1.875924077426215364e-01,-5.208009325847509086e-01,-2.680772414384187119e-01,1.321382846290621416e+00,2.952567872954384720e-01,4.147633509254580186e-01,-8.222500481458956401e-01,1.238931402988032726e-01,7.341246473856213317e-01,1.218570089911130694e-01,2.399145453797645045e-01,1.059795878695520832e+00,8.936228406690336357e-01,-1.510510347007226750e-02,-8.179260053967467581e-01,-1.811709055971955085e-02,1.411021640128231891e-01,8.774677538070738692e-01,1.942096048698570110e+00,-7.129575335067083186e-01,-3.725481498369880018e-02,6.990685913144342178e-01,-5.961658370271484264e-01,1.543731935925843457e+00,-1.586074855429951969e-01,9.078159835380744669e-01,-5.140002926003574002e-01,-2.553443692625100292e-01,5.351219985131172585e-01,-2.058385238658749228e-01,2.148654434714445394e-01,1.299663835431529080e+00,8.774408957006806231e-01,-7.132114849739172868e-01,7.282311991994041556e-01,5.031737106108788993e-01,2.589504364827818206e-01,9.680748411479320747e-01,1.022982718976408467e+00,-1.117973747258966588e+00,5.297507883462534428e-01,-4.304618198851140054e-03,1.242989260581722988e+00,1.522595747031376678e-01
9.206173406495193889e-01,1.459818164750979141e+00,-6.226990659894062752e-01,-7.370262495428477889e-01,-1.133425004337552666e-01,3.997987938687672105e-01,7.897621519068274143e-01,1.207141201162313660e-01,1.611586167495375754e-01,-1.416171460038546936e-01,6.363200021472100731e-01,1.521851030420534878e-01,-2.509872851477459310e-01,3.946135771148017168e-01,-7.842319924602378922e-01,1.719861082967166332e+00,3.168844816918647278e-01,-8.050761289069290338e-01,-2.071414630212121133e-01,-3.539642982107077951e-01,-1.314075380308562524e-01,4.336048082229955192e-01,-8.096971402585062538e-01,1.904900890567267358e-01,1.884254976793862779e+00,4.146741449394189538e-01,-1.484263873539974632e-01,-5.481035865640192517e-01,-1.400653571464684610e+00,-1.581159891103535386e+00,2.947095402002952724e-01,1.892032100932178995e+00,-1.150413470942469596e-01,4.806308904689837735e-01,-9.734204102870593900e-01,-7.619385826377182980e-01,2.045713044670959935e+00,3.887777059406937186e-01,2.147351563622183157e+00,1.234440838280950192e-01,4.986885596088941885e-01,1.965310895935403757e-01,-2.544090907224887954e-01,3.166357865228339175e-01,1.421090820639383523e-01,9.590196025243736822e-01,2.050595839329871328e+00,4.177473107889782544e-01,2.304282015771488834e-01,3.444154802889975997e-01,4.471130339628392569e+00,2.235664375009820404e+00,5.685810738262379038e-01,-3.202354898180987952e-01,1.388280855776452549e-01,1.186478672787487865e+00,-2.580402981272378327e-03,-1.360788961527800711e-02,-1.442643668419760550e+00,1.604831309077092483e+00,-6.426142324973200814e-01,-2.677542111563978033e-01,2.781226677728280139e-01,-7.839595438867086319e-02,9.838128300077295663e-01,1.828633470590937393e-01,-8.581652509074739754e-01,-1.463545631260537716e-01,-1.860968347894529362e-01,1.138706984482634965e+00,2.118638133998642648e+00,-6.057102839217015644e-02,-3.668462008766342208e-01,8.074779463716254269e-02,8.413614218724509153e-02,4.320073470071350008e-01,-8.809532733280178718e-01,4.298817643393055832e-01,-1.231104695206048927e+00,-6.316800244910601991e-01,1.548003588712747236e+00,1.528943429418240796e-01,-3.912784686129910372e-01,1.645145736089520749e+00,1.089190611491068328e+00,-1.345665908221326701e+00,3.032392540205397502e-01,-6.553817287743446407e-02,9.622831393778890074e-01,-9.039299000018221619e-01,1.242434663351118296e+00,-5.639346938655998009e-01,8.847158374832904126e-01,1.298642670567309865e-01,-1.935954487970301674e-01,-6.926060261596374001e-01
7.840006892165795049e-01,1.115225957326181794e+00,1.860607679357518252e-01,-6.641461950135885139e-01,1.474012117128098986e-01,6.118249898235700313e-02,3.407643940843738672e-01,-2.503671342978849856e-01,5.875325774125665923e-01,7.930594641946944745e-02,1.246918719609725335e-01,6.383211022280774194e-03,-4.641444786749447937e-01,1.019449756766752507e-01,-2.166573133391583861e-01,1.194245088416720169e+00,-5.157815506856011645e-01,-4.677626868860222664e-02,-5.228024393050527407e-03,1.198543611914842377e-01,-7.779247306816928775e-01,-5.811335071281120701e-03,-6.241162632754529982e-01,2.592779660673419362e-01,1.602998820686255099e+00,2.589334048784247000e-01,2.879369534308315881e-01,-6.428413827880548048e-01,-1.050375807570685494e+00,-1.033439237503037234e+00,2.736611464931627546e-01,2.390191892932793660e+00,-3.064437534183001022e-01,1.385711177851758902e-02,-7.162314501981646986e-01,-5.311712557422889613e-01,1.490155893098590312e+00,9.189716423180287475e-01,1.673526347636399514e+00,8.025105704554362784e-01,4.619339401384639499e-01,4.339133601627972459e-01,-5.375493315435314612e-02,3.192939260858229655e-02,6.808019653480495981e-01,9.585618416987207180e-01,2.429580360198063449e+00,-1.640919484479526347e-02,5.547340990528533411e-02,9.489621043708058590e-01,3.550992020416709583e+00,1.537567855294714514e+00,1.001493358832357128e-01,-2.988218382859346711e-01,-2.720871804580480280e-01,1.341812038647102634e+00,7.030811190058572357e-02,-4.156897127507410555e-02,-6.553392252056282619e-01,8.473499677005499331e-01,3.660785403157253426e-01,-7.947259207386321578e-02,8.988089907765643705e-02,6.885743802410011494e-01,1.203118417375587113e+00,4.465859297801588745e-01,-5.579110837243235199e-01,7.261621718580394402e-01,-7.212145890881933863e-03,4.595840262616082139e-01,1.940085316714943886e+00,-5.331426776467439455e-01,1.814800197177211805e-02,2.603830407570612016e-01,-1.715656917072844734e-01,9.688530858847519411e-01,-2.568658551343538932e-01,2.994707098797416700e-01,-1.023324770631677705e+00,-3.468559992095924249e-01,4.394203463785097408e-01,-1.902352930037136680e-01,-1.970726124511819055e-01,1.703388713668630761e+00,6.158836601936494848e-01,-9.726839554846797853e-01,4.749075374885609602e-01,8.570685943621074721e-01,7.078149013591357175e-01,-3.169544721017902855e-02,1.317941155277622567e+00,-7.658720808059474860e-01,8.965007644525566644e-01,3.216422012963317534e-01,4.596040057416359015e-02,-1.884867720837621885e-01
9.274072144828202635e-01,2.076480305838602103e+00,-1.642465950184906487e-01,-1.130493441559565104e+00,1.831003028949360623e-01,-2.266118188590241500e-01,1.669275252618882821e-01,-3.328106909307843725e-02,3.139642694878191920e-01,-2.403014946977269639e-01,2.290609098590197235e-01,3.198081218781827495e-01,-3.120971198263068347e-01,3.980461843300064362e-01,-6.079777668322796647e-01,1.500134110288350531e+00,2.425507911576361697e-01,-2.569373221171527555e-01,-3.449728422759898439e-01,-2.738926408709856375e-01,-2.865063576465267658e-01,1.310228134035665570e-01,-8.642818900250008873e-01,1.668607384312658926e-01,1.914071124632129806e+00,7.654522885539793986e-01,1.145972347328193947e-01,-4.976791859019592534e-01,-1.387316434498540030e+00,-1.570998771285047502e+00,1.913012440654876523e-02,1.869343668524701130e+00,-4.824140927564125603e-01,2.255014888550203045e-01,-9.603993193639968062e-01,-5.719817538795042289e-01,1.917537364118789611e+00,5.969928265435118231e-01,1.967894776879415719e+00,1.881475827413062740e-01,1.608398339403477872e-01,1.835516750899534311e-01,-1.358082237199370046e-01,1.430646958558713377e-01,3.838870150694055905e-01,1.048086523920344959e+00,2.371489350655672457e+00,2.371382520832939766e-01,-1.149445323334889607e-01,1.175219461902216711e+00,3.562912084620492692e+00,1.645280747224747264e+00,1.976472621506664140e-01,-1.962840072169202421e-01,1.663257739731078821e-01,1.188650114492488807e+00,1.167518495811326051e-02,1.935191479323407904e-01,-1.468657435229387298e+00,7.780764678361058451e-01,-5.231462571426395147e-01,4.096088058315155989e-01,6.565079418444377257e-01,5.605498018134600358e-01,1.416068153803678342e+00,5.371335691910660293e-01,-7.159035642089063289e-01,-2.532424053771242800e-01,3.183508525341773865e-01,9.788724349797989221e-01,1.732386789733753485e+00,-5.130028818490692810e-01,-4.235397500568827689e-01,-1.792764342764900098e-01,-2.152682445137825695e-01,5.421925742018115502e-01,-5.592810661039959719e-01,5.616293544432042761e-01,-1.400869476065596642e+00,-1.618220232621147281e-01,1.345452410878170024e+00,-7.001385234298726501e-02,-1.911564230814841447e-01,1.622081256478792533e+00,1.130082450955501638e+00,-1.114509257181985014e+00,6.221331511376356760e-01,-2.499748398579988429e-01,6.396149713136409787e-01,-1.501051453139891634e-01,1.081100427731301217e+00,-1.059104708403739270e+00,8.787929688406338480e-01,-4.277370040002725915e-03,9.690820037338231108e-02,-2.448743845194801261e-01
6.969314084433170242e-01,1.294269501345513440e+00,4.786763953807565697e-01,-9.936991065255841304e-01,3.114061670285940830e-01,-3.174273003123884718e-01,4.542774045143144201e-02,-4.375875482960623342e-01,4.907000335363242427e-01,8.574807227239650276e-02,7.188640831058246139e-03,1.131412666087715790e-01,-4.805253826685669249e-01,1.209591066018804451e-02,-2.025568023452032351e-01,1.057317801729653617e+00,-6.170716077028072233e-01,3.758101498913022365e-01,-1.149423919804067884e-01,1.350079927180607986e-01,-8.198329989891295355e-01,-9.740515036062419307e-02,-6.047102516507774084e-01,2.293903499942153146e-01,1.728955479348074142e+00,4.874736450816032352e-01,5.095692055252708519e-01,-6.376324290317336718e-01,-1.208245792836588173e+00,-1.173083147669485626e+00,3.469902357706261542e-02,2.456736627430206710e+00,-5.888902509443669775e-01,-4.178924583840867846e-02,-6.641563439582827133e-01,-3.795873581624952253e-01,1.362104039600918748e+00,1.076532795235239925e+00,1.837767415913742264e+00,1.001781332220021969e+00,1.697885180856670839e-01,4.471081713604023733e-01,8.070046383142057134e-03,-2.120669552258001023e-01,8.050617475160136705e-01,9.751061736631680965e-01,2.541003389708506255e+00,-2.368233260626166903e-01,-2.186943985633357235e-01,1.352565837462276654e+00,2.890101094787264291e+00,1.299658766965546164e+00,-2.279514949836268789e-01,-2.295686945818362912e-01,-3.758275698957697086e-01,1.516083550879470110e+00,3.012339627733655600e-01,1.593006475017067769e-01,-6.624485613198112244e-01,6.364566658685791856e-01,3.920274327820693072e-01,2.744018110580238590e-01,3.669678641336844294e-01,1.222064335966150495e+00,1.574799133036691945e+00,7.375054989290655838e-01,-5.658879347369143442e-01,6.244791445727040369e-01,4.518635514269924158e-01,4.558048879134214970e-01,1.558059144843195298e+00,-7.487474184071249983e-01,9.429318126754067386e-02,-5.167882213189201046e-03,-4.268657677786596993e-01,9.686977212421905570e-01,-2.026715193884236488e-01,4.922271522793155163e-01,-1.244647088317850203e+00,-2.489389024388272142e-02,3.331869704462590565e-01,-2.396220612301776520e-01,-9.389163678517994938e-02,1.827344068222226392e+00,7.763987380444631325e-01,-9.845197857226648530e-01,6.955346886697929554e-01,6.960103788110277856e-01,4.848388205644672544e-01,5.168940545363167605e-01,1.185198478144065426e+00,-9.446718555460734690e-01,6.873483352668618984e-01,2.115014954635242028e-01,4.186548290262807059e-01,2.988946687597238139e-02
7.493678097036525765e-01,1.131666556388629674e+00,6.473050754388527672e-02,-7.818958049766906448e-01,1.750882520920435392e-01,-5.708763234657887597e-02,2.253211318378577910e-01,-2.629283873711891206e-01,1.992122906083848566e-01,1.722627184011018275e-01,6.014158061995806825e-01,1.573013508857432075e-01,-3.625833292392335316e-01,1.955821879050665957e-01,-4.102655657711998805e-01,1.562368631456016344e+00,-2.221319299768767241e-01,-1.307899338537603373e-02,-2.779663722878187790e-02,4.898766405685393843e-03,-5.770851096261258029e-01,1.316789337822516781e-01,-5.913135833457050516e-01,2.758527450718968876e-01,1.664838632295839504e+00,1.134353643965196334e-01,3.725769645292232313e-01,-5.893648041477483890e-01,-8.023435241202528934e-01,-1.081647661786005576e+00,1.490498074999705991e-01,2.210908157901594784e+00,-3.882717733681397831e-01,-1.778688320211219143e-03,-6.691173697569312573e-01,-6.413691227576747700e-01,1.301423448908910041e+00,1.051284767487586924e+00,1.949524674677093117e+00,1.016765393037036391e+00,3.122240013969300176e-01,2.381252791081726328e-01,-7.560993149980148320e-02,-1.019986612038763230e-02,4.201465886842590258e-01,9.098957181009083017e-01,2.415097634220239264e+00,-2.114728173621311658e-01,-9.742925401850639766e-02,1.218207752750174455e+00,3.453382857227568881e+00,1.380698715160217249e+00,5.026770344224940068e-02,-4.301942483260399741e-01,-4.375761898013801332e-01,1.528628006049138843e+00,4.808490172101944071e-01,1.848076231470382746e-01,-7.927507161852750395e-01,1.049485868476711659e+00,4.792041898271746092e-01,-4.946790077661128437e-02,1.404601744302285127e-01,9.882005417502247591e-01,1.081605401219288387e+00,2.047106386147320434e-01,-7.372267092562313495e-01,3.568282080910257781e-01,2.152140601895747296e-01,5.988358312750422519e-01,1.987681412442539264e+00,-4.966191247634847428e-01,1.005607362132665550e-01,3.356862185628185502e-01,-3.848363396225449873e-01,1.139347758262584831e+00,-3.078287837921966918e-01,7.899016032384608144e-01,-9.076302203004065206e-01,-2.656617490701027595e-01,5.875290421679099095e-01,3.851930701294785375e-02,-4.987720219407343336e-02,1.571701060314714793e+00,9.477080451838836295e-01,-1.036470144907386981e+00,5.214503385607376362e-01,7.824143372318592693e-01,4.972911184136151186e-01,3.240153205184961860e-01,1.334765123996832559e+00,-7.111159187178971441e-01,5.959648434014521712e-01,1.237931733513595034e-01,8.066880282734132379e-01,-1.319420463058808002e-01
7.450721021580624104e-01,3.257790864004209697e-01,5.495919706975466168e-03,-6.260467420705898567e-01,-4.718558448526974924e-01,5.120550070438857349e-01,7.302673069565240871e-02,1.330018702249377294e-01,1.691854359787341444e+00,6.768771182341253301e-01,5.855606983608853122e-01,2.092190140238559537e-01,-4.543469398316052899e-01,-4.179501753252471419e-01,-4.603311798915193931e-01,1.805886658117995758e+00,-5.256438542445318607e-01,3.406029650707168011e-01,-6.746981975756462246e-02,2.148475898525165628e-01,-8.478035249792175154e-01,9.782001042061824192e-01,-1.709115110227209522e-01,1.495987011158211866e-02,1.707132132684862302e+00,-5.172349179652846463e-01,1.640610186432879813e-01,-7.324918479849620301e-01,-1.082823618414163747e+00,-1.092547322677400068e+00,2.918459693267514421e-01,2.942210201411914472e+00,-4.074496525531357549e-01,6.739646687200342989e-02,-5.092772282136364126e-01,-4.561037301878201888e-01,1.626093964407017145e+00,1.030855933289130943e+00,2.110700885959060358e+00,1.997419097960839274e+00,8.941959297416069985e-01,5.060370225345762751e-01,3.665778202018460941e-01,-1.245806590714516188e-01,3.985737617225535989e-01,5.181929362070385459e-01,2.822789935534500305e+00,-1.376222228062912167e-01,9.455064588422898431e-02,3.814378052502079841e-01,4.020466988025879651e+00,2.121988637578402059e+00,7.225294585222419297e-01,-3.582205150534518712e-01,-9.469158043165215588e-01,1.947150879615636709e+00,1.009161158439400463e+00,-3.026777438939517451e-01,-6.752152701933566981e-01,2.785326093090832789e+00,4.223439982831929118e-01,-2.517380752039589664e-01,-2.373658830643825268e-01,1.101760291177675377e+00,1.188737297882382471e+00,3.245188452445878502e-01,-4.385631136557104903e-01,1.200169177184900793e+00,3.902385573827276133e-01,-4.032369986214043855e-01,2.504287530896887048e+00,-1.791557307521584042e-01,4.235881563550807916e-01,-1.751290724426401713e-01,-2.502902518801035370e-02,6.674623712461469349e-01,-2.042490583974876928e-01,8.481643377177709997e-01,-1.403883076876076164e+00,-1.800976255113329871e-01,5.310075630063396668e-01,6.788086508100803496e-01,-4.268455056954382210e-01,1.761212712402812741e+00,1.102256220181713875e+00,-1.465140980045603225e+00,2.631625138019288990e-02,1.846871528335429780e+00,8.121072817624619411e-01,-8.187309502772919245e-01,2.299900027813480907e+00,6.272168326201266186e-02,8.765351897137501069e-01,3.159811931806469354e-01,3.168812832255514800e-01,-4.987560961098146395e-01
7.744063650965656853e-01,7.604153181821629026e-01,6.476988723719270813e-02,-5.659850641392814019e-01,-7.986721127963387901e-02,2.839797876252462272e-01,3.099520568731817249e-01,-1.061160491599446865e-01,8.963990993073212010e-01,3.087297903301994828e-01,3.876298937898144947e-01,5.419757970313434509e-02,-4.477042366504652704e-01,-4.195199004046405028e-02,-3.058050169360853054e-01,1.472255445239185390e+00,-4.906876105046690251e-01,1.982005387328789059e-03,2.178702795502723139e-02,1.526341415852651429e-01,-7.862680823888580361e-01,3.403624111055547630e-01,-4.617066694084102640e-01,2.004254690358792668e-01,1.594625525599099092e+00,-1.063960540694795509e-01,2.300597470263680000e-01,-6.713589490972372564e-01,-9.425019892252606279e-01,-9.866692143229935930e-01,3.270483770683755842e-01,2.548562014801164732e+00,-2.777893990375025490e-01,2.142351308620860095e-02,-6.347543401516899664e-01,-5.628212414147949483e-01,1.488516961025083685e+00,9.717035207385258389e-01,1.805307182392932974e+00,1.223260597992423593e+00,6.554869536429783761e-01,4.303887976980098617e-01,6.600062712320933778e-02,2.236702384225103257e-02,5.318275990504610640e-01,8.001169500096575460e-01,2.530852588178293949e+00,-6.472122082999194614e-02,1.105251581591587540e-01,7.231993040802721096e-01,3.826061260174305811e+00,1.729506794767018185e+00,3.522274622326211357e-01,-3.690866079767737284e-01,-5.277909687267565708e-01,1.541438746787910707e+00,4.017502817572755069e-01,-1.391934001629233086e-01,-6.266691513300407523e-01,1.545363947401795945e+00,4.721513945502381349e-01,-2.430073781574671465e-01,-1.086078081422482688e-01,7.705103566689418537e-01,1.070701896923001994e+00,2.826655358109207428e-01,-5.433365665621208151e-01,8.945278089743465832e-01,3.447404493299998512e-02,1.779822877880634646e-01,2.231519631499438550e+00,-3.687761689133559617e-01,1.781275892385404680e-01,2.356544333830080939e-01,-1.097262859492135062e-01,9.455397566893517514e-01,-2.373608757577985728e-01,5.115701645655826857e-01,-1.036635930942189976e+00,-3.641528057910425886e-01,4.532119884535024124e-01,1.315419300819549442e-01,-2.605519635197817707e-01,1.669105116846585801e+00,7.614914853387346749e-01,-1.124255628306700450e+00,2.830646971207377849e-01,1.274023398587821987e+00,7.508003191266034992e-01,-3.169290786270786420e-01,1.678047741068434462e+00,-4.339342559253759890e-01,8.774983210090823160e-01,3.276825199705043490e-01,2.038232482059473549e-01,-3.170051847578110316e-01
8.882446973386515232e-01,1.080988193323275448e+00,1.016850460168155362e-01,-6.531367820641230670e-01,-1.374770995602088153e-01,1.330957244706364451e-01,-1.748796138572472070e-01,1.000315539768517059e-01,1.443930476582515610e+00,3.786814019071149673e-01,3.482124001182495543e-01,2.453952134322472944e-01,-4.557170000027256918e-01,-3.917144793970921135e-02,-2.780111542950199910e-01,1.719385468098304282e+00,-3.061221063032946166e-01,2.130562758580680782e-01,-5.013642001724984143e-02,1.966329877174360086e-01,-8.446676314810100950e-01,4.728684846603365410e-01,-4.140445773018422426e-01,1.289854689763707263e-01,1.537603911612910768e+00,-2.473838203841861871e-01,2.172848169092523873e-01,-6.210987042051565599e-01,-6.839337335682300623e-01,-8.627663222540229437e-01,2.682243373109255979e-01,2.523022968663378496e+00,-4.095937415085715294e-01,-1.798363056516068537e-01,-6.272043218479694815e-01,-5.471169613389659236e-01,1.532996928291425531e+00,1.058003324319218397e+00,1.613391582567982097e+00,1.437362513525398011e+00,7.189006628995792125e-01,3.469846023069657615e-01,2.511400469825740278e-01,8.690450991286066684e-02,4.668764838116845617e-01,7.335176270931307307e-01,2.887111223364721813e+00,-5.950427536834503039e-02,2.093359704555818046e-02,1.084069089203525627e+00,3.751144969526712281e+00,1.497958632386452882e+00,5.458911449912885461e-01,-3.609135998648997368e-01,-5.887221602357153305e-01,1.549086827198042915e+00,5.269452303045891739e-01,-1.648067194429797544e-01,-7.573408985405609695e-01,1.524584542277648724e+00,5.597869989115864531e-01,8.542333060079393414e-02,-7.495395383748723606e-02,1.030237761824080334e+00,1.069587967016835117e+00,2.179048617110783681e-01,-3.847997298067530880e-01,8.789602207636918463e-01,2.421645814773538130e-01,-2.129001100985158379e-01,2.462608944721862869e+00,-4.942103143042007041e-01,1.292019986381533203e-01,1.222860586281637185e-01,-1.407189701172038565e-01,9.918766052769395491e-01,5.499004104630111911e-02,7.479195558075873995e-01,-1.066884452583611864e+00,-1.402290451808609062e-01,4.956021197122216781e-01,2.890569945216020509e-01,-1.933785920052458196e-01,1.451577256471601851e+00,8.878342065755703283e-01,-1.022113514083215824e+00,2.467116058542220824e-01,1.485937472142277116e+00,6.335071957925890729e-01,-3.183913122763879500e-01,1.971443910605857885e+00,-5.236045688984746205e-01,1.059780684983750998e+00,2.321083751207788093e-01,3.558198006053097662e-01,-1.637334778475389996e-01
9.090629184811691577e-01,1.215783268301121822e+00,-1.493525441831329917e-02,-7.560455390209502857e-01,-2.986718852533412627e-01,4.292990985357773570e-01,3.957721681016000970e-01,1.631497396044399861e-01,1.721661595038436854e+00,3.216347968091204379e-02,-3.756386000127203695e-01,5.072582707212049818e-02,-5.260030070256760393e-01,-1.987478826690229350e-01,-3.439838404203014455e-01,1.087257765381768548e+00,-5.222800805675478220e-01,-9.339716177381195139e-02,-2.595488276094164437e-01,7.041110349972480587e-02,-7.916869916735159718e-01,4.920896552695716020e-01,-5.835268780222784279e-01,2.657143655717647546e-03,1.827018446874428159e+00,4.523170998018424260e-01,-1.094230067379712013e-01,-7.058853500171330397e-01,-1.910210536092791234e+00,-1.460068529554849892e+00,3.442880678960701379e-01,2.702173579828737626e+00,-3.133836429784755406e-01,3.219306200361586878e-01,-8.680318431107360011e-01,-3.076480900168743760e-01,2.295129072168333728e+00,4.424774107597631012e-01,1.743016765446910865e+00,6.443475998704066843e-01,7.966992599373118322e-01,6.841969658707712787e-01,1.557587163983096268e-01,8.272096279942800501e-02,7.605613190380600130e-01,8.382968052901770273e-01,2.569900782833405728e+00,4.919500296492590463e-01,2.760071976929707183e-01,8.761903718630648097e-02,4.124175753305552306e+00,2.422260215481303991e+00,6.635625464272388863e-01,-5.319109951653411272e-03,-4.003636924617226533e-02,1.269748780930366694e+00,-1.630376343188252308e-01,-4.687414569994997615e-01,-1.032411664776748950e+00,1.771570214877411065e+00,-5.770031164191332662e-01,3.044984447990073395e-02,2.105363630275234044e-01,1.924284420812400476e-01,1.593916655375663405e+00,9.171306959432865558e-01,-3.060089856352859461e-01,9.759611067751612357e-01,2.888182820173407911e-02,1.354956631808484080e-01,2.011039431866951332e+00,-2.925948455912708024e-01,-2.088268612017444847e-01,-5.108956106537757558e-01,3.272754938680008108e-01,5.893406225151098798e-02,-4.646829506957757538e-01,-1.321872863534190312e-01,-1.810821811351418065e+00,-3.153469933481120591e-01,9.540153221183717003e-01,2.667499870842841847e-02,-6.639636111051638867e-01,1.997678333783909022e+00,6.925133121725346452e-01,-1.343661848494273947e+00,1.957056324465570041e-01,7.210969774322686376e-01,1.177704493776464245e+00,-1.389757852469865496e+00,1.690691415754750793e+00,-4.986193050609615263e-01,1.400595930641821862e+00,4.665339282171636626e-01,-1.259246894406677697e+00,-6.179765686426693660e-01
9.111966902477532937e-01,1.325086616785797089e+00,-2.316167348672431570e-01,-6.555528810586576105e-01,-8.533807179740010573e-02,3.214644183974273983e-01,5.123243796425974717e-01,6.179508831858801510e-02,7.758171750642206543e-01,-2.838640291787916659e-02,2.098699662888171003e-01,7.898013652529559114e-02,-3.934126036099157564e-01,1.873647024399443528e-01,-4.568627271560501413e-01,1.432690668967348202e+00,-1.309925828948595716e-01,-4.260710645569409372e-01,-1.298444954142992658e-01,-7.535930562181303305e-02,-5.275258068548884793e-01,2.929383430802089405e-01,-6.994539394221638284e-01,1.744357985268356892e-01,1.720524440002012545e+00,3.128837853920197754e-01,-2.547813266315521186e-02,-6.083951664541104032e-01,-1.298859100264965205e+00,-1.287751139542507417e+00,3.421250054004302266e-01,2.226813997849595772e+00,-1.893041390227617748e-01,2.394631262810947292e-01,-8.708691947370202913e-01,-6.043830474655290663e-01,1.929424099636676715e+00,5.761285149515511517e-01,1.781746642070607622e+00,4.504491191855822807e-01,6.193924172150707674e-01,3.772819534769185079e-01,-7.685535170387977622e-02,2.311367432781093467e-01,4.575309477058205343e-01,9.302018456110355826e-01,2.343957857780957887e+00,3.296331028605500313e-01,2.205374911328530918e-01,5.095835468518981060e-01,4.167219870357651956e+00,2.005139164926040607e+00,5.069552129009735619e-01,-2.508882708486594448e-01,-1.929546549365740438e-02,1.201867442820804932e+00,-7.775443013304988993e-02,-1.729181049795054381e-01,-1.074875932563182479e+00,1.331533670240186096e+00,-2.397317907510757296e-01,-1.386266580101753465e-01,1.457751694492269157e-01,1.833569542140100483e-01,1.121927520479402585e+00,3.770917784684451046e-01,-5.875045248754369176e-01,4.463175889974386745e-01,-1.502693885286214559e-01,6.052164628741758534e-01,2.140636973582751068e+00,-2.798712717992686283e-01,-2.284433408894955830e-01,6.601752041372761781e-02,9.332071560996450799e-02,5.667527546092551161e-01,-5.061016506966941053e-01,2.303236759094910435e-01,-1.228442628524496705e+00,-4.882372615273041783e-01,1.023072190367072754e+00,4.548587290087807711e-03,-3.843941741160084580e-01,1.674986968892199224e+00,7.877991861805664353e-01,-1.163535739072848685e+00,3.004920988796570547e-01,5.069169839455347493e-01,9.423183765795805078e-01,-7.896203840929909568e-01,1.427811164568097091e+00,-6.316952033203802053e-01,1.095907893150546597e+00,2.876582071397645879e-01,-4.206665141196131441e-01,-4.950832833286955559e-01
6.939990040856035547e-01,-5.027810572213132767e-01,-1.246100319865856842e-01,1.453308987752901515e-01,-4.209269375697625715e-01,1.028467648862615214e+00,7.746703880012244525e-01,-3.363081977038206993e-02,1.101977211181048855e+00,7.573494231463236970e-01,8.878417682642336661e-01,-2.209767321316085664e-01,-4.792156045314421853e-01,-2.493330073689186133e-01,-2.042641936059255148e-01,1.719063465387471012e+00,-8.444192239397063648e-01,-2.480309444611543956e-01,4.122259784405784555e-01,3.899943416650416550e-01,-1.003993242090240434e+00,6.423612778048991556e-01,-1.639800650889160494e-01,2.780298868769567333e-01,1.280668734062499148e+00,-1.038860600935537670e+00,1.453250559068069991e-01,-7.955538986945126512e-01,-3.974161584053758078e-01,-4.701817485538394292e-01,7.447829815262502207e-01,2.921843739991473843e+00,1.441962665382930386e-01,-2.951541678408056701e-02,-4.136079159816741235e-01,-7.633624421948301819e-01,1.183475153974773209e+00,1.147057889960208410e+00,1.726683970342675067e+00,1.885278787853674309e+00,1.227881926787139255e+00,5.272533955401108585e-01,1.042409151698241304e-01,1.267360574762582404e-01,3.998569253127217671e-01,5.811655395111534617e-01,2.444723132146395805e+00,-1.815801670222366160e-01,4.948236615929630378e-01,1.585976569231395406e-02,4.649587303568242902e+00,2.020466764931188486e+00,7.228349361500108206e-01,-6.380763868371097658e-01,-1.032274501114974097e+00,1.744037582182080826e+00,6.669278231258148892e-01,-4.678182578186733664e-01,-2.020353988943035528e-02,2.479861523907063159e+00,1.232313165049409021e+00,-1.159019725841355264e+00,-9.458113193143544706e-01,4.994341820234063922e-01,3.850793131365373156e-01,-3.023057506734693201e-01,-5.390614357075087515e-01,1.682906760195741480e+00,-5.619526058902382104e-01,-2.605076834630600802e-01,2.953127315393872632e+00,1.115392960444216985e-02,6.217460101602063638e-01,8.685205177339676563e-01,1.207532606326314345e-01,1.318446282027791572e+00,-1.533862228388371829e-01,4.845664955864654733e-01,-4.861251715537546758e-01,-8.473359667061375333e-01,-4.916091840676761748e-02,4.241835125868825829e-01,-3.610803926530820607e-01,1.576975610534568695e+00,4.732135806568071867e-01,-1.191367632282537503e+00,-1.632018190786723721e-01,2.503723605410692166e+00,9.783261405727312621e-01,-8.108983331681064444e-01,2.205803587938386379e+00,2.820402554456694633e-01,8.751601856224989762e-01,6.097436180217765678e-01,2.762061057773613215e-01,-6.041316976614704570e-01
9.415855813822436859e-01,8.695249622156351332e-01,-6.358034348577093486e-02,-8.494356618888943000e-02,-1.091431413970917752e-01,7.409219540838201112e-01,9.573719701031904172e-01,7.011144031685095923e-03,1.187024103868242975e+00,-9.120790329988306966e-02,-3.876155789298426080e-01,-3.535187021326868795e-01,-5.752269251057491317e-01,9.854273219914050363e-02,1.800327426721370916e-03,8.381981055620659760e-01,-7.736227209584318754e-01,-6.973743197747386269e-01,1.528090703630836100e-01,2.269928073777316979e-01,-9.630963055432799624e-01,-7.410121172079719987e-02,-7.166779575973912797e-01,2.731400240790988199e-01,1.386520771210638880e+00,2.210452293075826358e-01,-1.424404221165760098e-01,-7.249803196738675570e-01,-1.276603789760922592e+00,-8.488950780154473907e-01,7.570536314060519745e-01,2.533448481359266591e+00,1.885919181829239788e-01,1.632739566291651623e-01,-8.714890305217610766e-01,-5.751600969606949221e-01,1.965878967588287951e+00,4.790437910687129208e-01,1.123812142519989843e+00,1.647715768378927859e-01,1.036085176379225814e+00,6.945236440509524600e-01,-1.325820197409578460e-01,4.098218868952364646e-01,8.747107984545587911e-01,1.017073855284132966e+00,2.247619986752337429e+00,5.758487360908332020e-01,6.392929568505947291e-01,-2.610984133214200309e-02,4.586191937943463692e+00,2.139359049428307458e+00,5.938551930679022428e-01,-1.927296365781612231e-01,1.391159009270834801e-01,8.393084697294362906e-01,-8.360253022935387746e-01,-6.154499001843539707e-01,-4.963357136689955373e-01,8.701783428771943107e-01,7.596914058251004465e-02,-6.045171300841125639e-01,-3.111169125031940652e-01,-4.947038456748923396e-01,9.091218269832075372e-01,4.313370408816855628e-01,-3.247869501724958696e-01,1.323279862464682211e+00,-9.321680751904694029e-01,3.548691149554717983e-01,2.328801631666909788e+00,-2.720911484112726875e-01,-2.237009217961437035e-01,4.714655107623422214e-01,4.787476418486684704e-01,6.696392927211677337e-01,-3.285782084108990198e-01,-6.715107735140168899e-01,-9.364210059228202931e-01,-9.062031512325586791e-01,4.385106113215938572e-01,-4.547774762612133981e-01,-5.623730098184656079e-01,1.762136625316387040e+00,-4.299698830374543146e-02,-9.045794317699196174e-01,1.263531117241558088e-01,1.065930157519540344e+00,1.323003546431732236e+00,-1.297457065113789998e+00,1.419272360162145974e+00,-6.030900745997014312e-01,1.575838373035299389e+00,7.412855986599626856e-01,-1.564891875201019023e+00,-5.953103792758205337e-01
1.104276810064436898e+00,2.084301961135276215e+00,-2.305071767278153994e-01,-8.560820142799003829e-01,-8.622622200147840588e-02,9.278812570462843801e-02,7.133767274897723221e-02,3.181357917875112240e-01,1.360361790250540270e+00,-2.067661756386122984e-01,-1.582555498856274556e-01,2.695790104071051352e-01,-4.112471274612277683e-01,2.896493432213333996e-01,-4.313815952234608675e-01,1.482973999590179393e+00,1.483903341546479182e-01,-3.557304500098311673e-01,-3.166729483122130429e-01,-1.199170525221034400e-01,-5.196018093770253810e-01,2.903091193175506013e-01,-8.128507848568616856e-01,7.845807759742939869e-02,1.740725981265891287e+00,5.546494142794499149e-01,-1.496515275996279926e-01,-5.301325738124148534e-01,-1.354656245143760263e+00,-1.347786223564203967e+00,2.622759147185864670e-01,2.067913317246332205e+00,-3.277330997327387863e-01,1.344151362444472586e-01,-1.011490226560396222e+00,-5.334895026854162836e-01,2.258450024175771897e+00,4.327211316627899707e-01,1.488236018723559928e+00,1.597991502009931120e-01,6.176874068588372735e-01,3.245804970923873434e-01,4.747281385057579295e-02,3.761748936938965060e-01,4.830202194374705327e-01,9.753954965895150764e-01,2.641774679427714823e+00,5.767770887906455979e-01,1.614682777452851881e-01,8.239823410606126330e-01,4.110392656486606455e+00,1.874306758157649355e+00,7.043581958826051759e-01,-1.047870373212076434e-01,2.702590485699130074e-01,9.682167199716511519e-01,-3.426735900942096125e-01,-2.312104482769339886e-01,-1.431103523820962398e+00,9.646933987611343575e-01,-5.936841958666259078e-01,3.772906515286589268e-01,4.060551464951110967e-01,1.508612267262652296e-01,1.298702540885568357e+00,5.340754714970835648e-01,-3.852785884386596416e-01,2.474787905849244463e-01,1.647510930041042043e-03,4.178172297577247285e-01,2.189080069100386883e+00,-4.547465746978424095e-01,-5.445920552555612026e-01,-2.375757594097132885e-01,1.738347090446301646e-01,3.507125240208093242e-01,-3.132364569906838092e-01,1.811331958686187016e-01,-1.458593038197133041e+00,-2.618075802768681237e-01,1.314893496877282741e+00,-3.197940087283029920e-02,-3.952597167843808212e-01,1.519883509198633131e+00,8.472327209513413893e-01,-1.033370023623020106e+00,3.375967268137535227e-01,2.263810497459142201e-01,9.321763574339323455e-01,-1.000238460683371633e+00,1.513255791673708606e+00,-9.523795037733655544e-01,1.469091955093034141e+00,1.988222805442156904e-01,-7.929224289087293265e-01,-3.756839132301229567e-01
8.262559916875916732e-01,2.909234193308437577e-01,-3.354179132594430346e-01,-3.443290700821894923e-01,-4.612377072161759628e-01,6.284013369589365183e-01,1.141448055347377699e-01,2.554124419570637516e-01,1.238224865603563707e+00,7.485686361930197208e-01,1.241183645436963356e+00,2.599236199623528587e-01,-3.340976796325204057e-01,-8.910117405354406328e-02,-5.598869288342012140e-01,2.368003583867992479e+00,-8.344600925430334382e-02,-4.704258991803526857e-02,1.067635141206605964e-01,1.327033161626280655e-01,-6.495189939380635602e-01,1.005124388033901583e+00,-1.940206789171292634e-01,1.422233387525921045e-01,1.497839044724778690e+00,-9.770127272745234848e-01,1.193484554369700634e-01,-6.438687510623931631e-01,-2.731612201515807303e-01,-7.580036608632879647e-01,4.175603932930330164e-01,2.554242655241332649e+00,-1.909370430098679405e-01,-8.152779532306189680e-02,-4.894458974305103127e-01,-8.024247894015690274e-01,1.343245323553840631e+00,1.154069826062416038e+00,2.004072284462464992e+00,2.000756017921871521e+00,9.897793621150547949e-01,1.993586650334666088e-01,2.507535630278374672e-01,1.480525408699224499e-01,3.753641397054696682e-03,5.055084556026641085e-01,2.755860193475061948e+00,-2.096140860682486062e-01,1.698950360930538972e-01,6.353156557616363997e-01,4.442640344062207092e+00,1.812604900095780236e+00,9.027786093888382490e-01,-6.438117041135424934e-01,-1.020496434056526347e+00,1.880466444676908599e+00,1.143340187061712587e+00,-1.918061777580017391e-01,-6.999491294001095598e-01,2.715783804413387070e+00,8.553109266686887979e-01,-5.256779196164292900e-01,-5.248014932236350072e-01,9.817727264506126428e-01,5.149532179699479739e-01,-4.014037953425914074e-01,-6.060732030845598084e-01,8.858644424159493047e-01,8.265841339034851742e-02,-2.749402174936224075e-01,3.023934640719186273e+00,-6.318963894622503519e-02,4.318541258395167670e-01,4.559469017797576074e-01,-1.031289369319435406e-01,1.174596118411680656e+00,-1.122888086972508304e-01,1.240286660625408599e+00,-7.537305255066194531e-01,-4.170714541305418077e-01,6.045321713556323084e-01,8.507335676525935586e-01,-2.142915406574412984e-01,1.304475605901231461e+00,1.177579075130465558e+00,-1.290386382972392942e+00,-7.690225483592066924e-02,2.041841942157303080e+00,6.744249796016251741e-01,-6.273959873945333943e-01,2.390839661323063581e+00,1.214913808240509763e-01,7.758441453442261881e-01,1.901521283550121066e-01,1.015541660774947896e+00,-4.654157348506401948e-01
1.054918985989082403e+00,1.698337858247332743e+00,-1.923241592797729771e-01,-7.572448882358875366e-01,-9.123182495463068309e-02,-8.146503697085927254e-02,-5.470655867214835322e-01,3.420349756444293066e-01,1.271974934857016848e+00,3.182370439533239170e-01,7.859181414706022384e-01,5.309143549130189710e-01,-3.186229903512730610e-01,3.177618246707581418e-01,-4.745181219509522208e-01,2.330681750259415264e+00,3.981317574785582791e-01,4.523140782062962106e-02,-1.237988731780186313e-01,6.440628123553664153e-03,-5.484118773744600661e-01,5.642225803075855417e-01,-5.139989411034253664e-01,1.444806277080136758e-01,1.500179651326301489e+00,-3.748806683205486157e-01,1.571289247735800643e-01,-4.660956644854271635e-01,-1.237881782249385942e-01,-7.924749870315124234e-01,1.737189986261691022e-01,2.015418428370288506e+00,-4.550808614104043803e-01,-3.324041418530535030e-01,-7.051758931482543513e-01,-7.723032933089113428e-01,1.499861638059143631e+00,1.092865927674588233e+00,1.554751161903742851e+00,1.307436276154004595e+00,6.285542027292981837e-01,-1.896476333282398619e-02,2.397959290381463937e-01,3.214162266350483188e-01,6.797633091940347150e-02,7.433105862473796677e-01,3.031689235635314894e+00,-4.314848880611230064e-02,-1.013956321514275088e-01,1.669069741379095362e+00,3.861473976145608944e+00,1.114686574723917190e+00,7.360277661063655552e-01,-5.005432180670505993e-01,-4.922377320483568575e-01,1.452644470702967539e+00,6.756406688033125274e-01,4.203410684125352681e-02,-1.176999442458572798e+00,1.310519707140478385e+00,5.645531570277187994e-01,3.572685245579055868e-01,3.601430687954429444e-02,1.132816910591961879e+00,7.511589729540897320e-01,-2.345813333940759415e-01,-4.789030033369404138e-01,2.172544252074879445e-01,3.490777914912368551e-01,-1.095008828036324044e-01,2.784488407410967703e+00,-5.355425888492841846e-01,-7.313522652833735760e-02,2.925366922608165221e-01,-2.870564127610835126e-01,1.219612682842394769e+00,1.801421957875932178e-01,1.281785079524491611e+00,-8.031489635037598607e-01,-4.634569563504259415e-02,9.094973111615767269e-01,5.039075761201778914e-01,2.839149572435317737e-02,9.899519407289777417e-01,1.230436885736487351e+00,-8.759310190770948079e-01,2.732374777398084986e-01,1.232823065521661654e+00,3.924430380386157435e-01,-9.171388550962183972e-02,2.046134737889716337e+00,-7.227409491594026791e-01,1.050131433137549974e+00,-6.406075427399121613e-02,1.018356884386940608e+00,-1.654340289650035878e-02
7.075515637620461984e-01,1.328692147278940805e+00,2.427334143881604844e-01,-1.047358606623260524e+00,2.558484810773780094e-01,-2.993741667370150572e-01,3.975043366351499463e-02,-3.523338657259645346e-01,2.283379508439966621e-01,1.333320552733954223e-01,4.264354410426354214e-01,2.365478105062480130e-01,-3.793523837375789021e-01,1.159800267627399545e-01,-4.213676690356278343e-01,1.423458446208611505e+00,-2.789030795024731724e-01,2.575195585442090485e-01,-1.507403469954511355e-01,-8.498485162286205374e-03,-5.902476593366449142e-01,9.883368273224002465e-02,-5.986760161190007867e-01,2.253692167479615649e-01,1.796185259526259737e+00,3.596127395746310795e-01,4.741302764019790228e-01,-5.884186735217754594e-01,-1.061569412621993891e+00,-1.263796719780267530e+00,-2.015375195334773162e-02,2.267943371195157098e+00,-5.911271993739071196e-01,1.392604647833910192e-02,-6.702321736510626904e-01,-5.029167019825425688e-01,1.334772592300231597e+00,1.077396858890941056e+00,2.075022672223373110e+00,1.062982642013568402e+00,1.217147253848520627e-01,2.770878582634695997e-01,-2.491024710459259495e-02,-1.714335508135706454e-01,5.269715245961549277e-01,9.269225908518532453e-01,2.488229519938014001e+00,-2.826854117978713776e-01,-2.671912443778901580e-01,1.401740724235796653e+00,3.043154627647237209e+00,1.326172784618607325e+00,-1.319878701398101706e-01,-3.308203175731738721e-01,-4.349871904428260772e-01,1.614029855456418305e+00,5.686119178681425801e-01,2.851323126794962359e-01,-8.738613158580321727e-01,9.524180568287136106e-01,3.255654919552325444e-01,2.355434859963904670e-01,3.888481230138822742e-01,1.271870080698870975e+00,1.416341823847480974e+00,4.955753482977516278e-01,-7.196628867223571202e-01,2.719848714710324522e-01,5.402521631650979428e-01,6.105965744958055108e-01,1.684950346223283990e+00,-6.273988238074473811e-01,9.311496960106106779e-02,3.635340252634398917e-02,-5.017370300142308670e-01,1.001689256984832577e+00,-3.193965683281274059e-01,8.429618171091592949e-01,-1.180220592739888552e+00,-3.567292880922040554e-02,6.094255486555081314e-01,-2.187789983041837916e-03,-3.712395367024484694e-02,1.707054642335128491e+00,1.066754443086701309e+00,-1.087149660290410491e+00,6.637586798694703472e-01,5.648324217524067770e-01,4.030427194426529081e-01,5.478252825964824435e-01,1.237640527221010256e+00,-8.414542508916404984e-01,5.147859889669142985e-01,5.898486471166269896e-02,8.672716347847841956e-01,-3.113391883607619093e-02
7.874726119821787718e-01,4.479971235689523268e-01,-2.189975718538363786e-02,-4.686276831500754136e-01,-2.679851658139785209e-01,3.449057843220804109e-01,-8.827726542483987915e-02,7.970870438165733596e-02,1.228292065248650866e+00,7.011313987371265988e-01,9.664038750192813776e-01,2.499407793246347653e-01,-3.950792895426394891e-01,-1.181288833124803511e-01,-3.889057922345993679e-01,2.106342380014312621e+00,-2.936964770940042602e-01,2.293372930613707950e-01,1.009147586655941287e-01,2.305723170048613047e-01,-8.062213705111862527e-01,7.444184609715267520e-01,-2.161294356430187857e-01,1.666477927852955954e-01,1.471429202069511888e+00,-7.942339057331683216e-01,2.952604500913039720e-01,-6.478559953416177519e-01,-2.785963459513133289e-01,-6.908523515902134093e-01,3.213384556115227997e-01,2.614841668512212891e+00,-3.325893822654626408e-01,-2.151421287241674363e-01,-4.564050060796686070e-01,-6.914185661607282762e-01,1.201167704290534211e+00,1.290519792281547673e+00,1.868968439751794497e+00,2.030753507046905604e+00,8.262188460472770224e-01,2.548282178723723645e-01,2.758139058227465634e-01,2.918479041426037812e-02,2.206221217420327174e-01,5.741536040104171512e-01,2.854634138616531036e+00,-3.358211574238708641e-01,2.897572263667606840e-02,9.951408842220823558e-01,3.939082450169786309e+00,1.501870583548011062e+00,6.203610160809136520e-01,-5.837845318403693806e-01,-1.026245839820727701e+00,1.871497262880593482e+00,1.078487802377540827e+00,-1.087824570606925473e-01,-5.546679082477488087e-01,2.188217842655743706e+00,1.032499996572757039e+00,-2.880425532480134221e-01,-3.989009366533928791e-01,1.271838398057106190e+00,7.289047473939835875e-01,-1.887133869720446500e-01,-5.315297085126693410e-01,9.804200108522350687e-01,2.434879013636686296e-01,-3.362749756029579373e-01,2.769612690926117615e+00,-3.066280630515717531e-01,4.590408644009589256e-01,4.156441949960214544e-01,-2.513326285396352278e-01,1.294870408837274889e+00,5.250864213262423918e-02,1.179140082164231274e+00,-7.748217089515250233e-01,-2.415375598821606073e-01,3.332048379368492408e-01,6.315241667422191174e-01,-1.165267511699232261e-01,1.353646575757346149e+00,1.060225913730902247e+00,-1.139644471420687255e+00,9.983507059244017823e-02,2.031662313580866908e+00,5.364892853636051839e-01,-1.778443424170385034e-01,2.238541555565852548e+00,-1.238473879872900585e-01,7.528262013982356393e-01,1.955615936643976260e-01,1.089900262760584715e+00,-2.310118702976890481e-01
6.579807452216563934e-01,6.634262528414796023e-01,1.253714867605011662e-02,-7.258284412738343905e-01,3.885573136345535361e-03,1.965909202299936098e-01,4.744980990932797793e-01,-2.804742315567891886e-01,2.657833839113059593e-01,3.040386725671305745e-01,6.832244880977516033e-01,7.909880291121854090e-02,-3.714890603126406177e-01,-1.113026442267291832e-02,-4.888404728160058443e-01,1.520165564092033295e+00,-4.053607838436334987e-01,-5.136550052622215756e-03,-1.568960039274437668e-02,1.891865154098918214e-02,-5.893679982060016087e-01,3.559516112713245195e-01,-4.776601919107905103e-01,2.299612258450333124e-01,1.753243657482105533e+00,8.931614781257396496e-03,3.314903786120476648e-01,-6.640988817958886070e-01,-1.084589854202832937e+00,-1.215496408547123153e+00,1.950945524104688578e-01,2.454126202682576086e+00,-3.424251301257996150e-01,1.706427730004783649e-01,-6.153634195018043984e-01,-5.892383547231245799e-01,1.365124161034608985e+00,1.000904893796004780e+00,2.211010292412326272e+00,1.237491806983286757e+00,4.174526199231655132e-01,3.600096933442492042e-01,-5.178393535066300180e-02,-1.216078449428654035e-01,4.236056728641330871e-01,8.155933992166062296e-01,2.308321372488143730e+00,-2.252986233858911558e-01,-1.506181961016049564e-02,7.358864180671716992e-01,3.640218443280578864e+00,1.777550184913245568e+00,1.190171150842951886e-01,-4.180982852014684115e-01,-5.916586656515760989e-01,1.708983189430300698e+00,6.545173412143712177e-01,8.590551111821678743e-02,-7.060906836583531465e-01,1.695787956593906243e+00,3.785346626673572468e-01,-3.068221575621894459e-01,3.338739941577294895e-02,9.237564734402454736e-01,1.145694811850602512e+00,2.912852338066306834e-01,-7.764294393652222404e-01,5.744423996238618990e-01,2.110188801688131222e-01,5.612519872602235171e-01,1.969944496195351835e+00,-3.044841788196697152e-01,2.535500500044830519e-01,2.039852132812599028e-01,-2.863999123429531446e-01,9.426423398852519231e-01,-4.970914965142333997e-01,7.333209718840212332e-01,-1.082713827243231286e+00,-3.508633801798511920e-01,5.820104790613019885e-01,1.859642721142721333e-01,-2.048972047511056216e-01,1.788137909764439648e+00,9.909574720214380239e-01,-1.280397493473301118e+00,4.013606355643766221e-01,9.442318480198316211e-01,6.446539925350646127e-01,6.740342856593417586e-03,1.450069608857543990e+00,-3.869780705520456943e-01,5.038183674719768357e-01,2.130793635719869517e-01,6.591129832372542019e-01,-3.505061033494195621e-01
3.912429668386596671e-01,5.036290488765035045e-01,5.075471493047873928e-01,-9.797139042199477510e-01,4.311875880767420122e-01,-2.343854153338928437e-01,5.966119138136261046e-01,-8.912477058411704123e-01,-6.472064545049969198e-01,2.329509477986405896e-01,5.397598699542923706e-01,-6.070933701359396140e-02,-4.121845321201540457e-01,-7.623916882860586053e-02,-3.532444206622958327e-01,9.601928148418562570e-01,-8.776118294117560836e-01,3.629969423416941066e-01,2.426190526298255962e-02,7.786475467025416597e-02,-6.872856556596499411e-01,-1.448281072986434825e-01,-5.185719889984542474e-01,3.511729505762888337e-01,1.858920356959917974e+00,4.281289754510979040e-01,7.575423391851078270e-01,-7.125974412027715754e-01,-1.332975782017765898e+00,-1.329211966947992707e+00,-2.996617833696918476e-02,2.551765051412204333e+00,-5.462026648100288817e-01,1.823053845861699607e-01,-5.081622268898835504e-01,-4.342797304739715036e-01,9.189356664744779968e-01,1.256552664406193287e+00,2.468065251046771102e+00,1.282006522164762741e+00,-8.468546043687497082e-02,4.627061379389902918e-01,-2.171052690911129401e-01,-5.184343163387107323e-01,7.488554322823437470e-01,9.653540436882082076e-01,2.060394535272682237e+00,-6.386809010589233893e-01,-3.026847998094949754e-01,1.109341179340758821e+00,2.659159656501889568e+00,1.428382379722641371e+00,-7.026882869130953724e-01,-3.882824148517007856e-01,-7.013821453271112949e-01,1.887903478463651252e+00,7.521676814089598428e-01,4.313831552611355757e-01,-3.576110205756948268e-01,1.012158974714486792e+00,6.566588466072866836e-01,-2.305410036508769578e-01,2.843754470202257689e-01,1.439792236104890710e+00,1.546904372903661118e+00,6.744335093628367472e-01,-9.543040425761035728e-01,5.578581623294176506e-01,4.999627052951206574e-01,9.841635232698912050e-01,1.188580065983839029e+00,-5.733433612872689267e-01,4.693559141176276150e-01,2.267654321550805763e-01,-6.877971928836404958e-01,1.172288430341255960e+00,-6.060651865835950947e-01,6.948767848751432608e-01,-1.097040101028244008e+00,-1.948024454671353767e-01,1.108444288644979681e-01,-2.187583173190091324e-01,-2.581532027202182444e-02,2.123155531794744810e+00,8.911098948285138821e-01,-1.229813847608967725e+00,8.102311158718664696e-01,6.413634256134997935e-01,3.829567874051728049e-01,1.093552323766066037e+00,8.455216790647440694e-01,-6.474031346432245204e-01,-1.365224943806009339e-02,2.045469799990197179e-01,1.158076237961353838e+00,-7.498819455879612850e-02
1.077885353949532110e+00,1.667961289801045854e+00,-3.332976316165099651e-02,-7.300988961940672040e-01,-2.679907900485802297e-01,2.442928660050626144e-01,-1.046050208477047327e-01,3.825685620353715954e-01,2.091762406733728152e+00,4.886490058439710293e-02,-3.219582857754700878e-01,2.326891868657765261e-01,-5.128158955803678865e-01,-1.765238740332822354e-02,-2.663142553730809547e-01,1.428616962979825322e+00,-2.105482534658904559e-01,-3.679433636530500540e-02,-2.544416328290785012e-01,1.098077656271476410e-01,-8.251521450681029712e-01,4.782133482218677289e-01,-6.008891972076857435e-01,4.983851240470432709e-03,1.645145368399830055e+00,2.377187450378968059e-01,-1.221149516433675808e-01,-6.123525218637732026e-01,-1.317787550360605353e+00,-1.151496531028657788e+00,3.422417541369932592e-01,2.487789492077482567e+00,-3.593910382500059009e-01,1.090090282290337442e-02,-8.794118969869327840e-01,-4.107294835306397607e-01,2.226275795676611935e+00,5.717527399316892911e-01,1.358796787599630296e+00,7.119318388500415207e-01,8.678460589392144042e-01,4.968794336615499629e-01,2.737571039941282258e-01,2.826913401758998079e-01,6.308963800862725790e-01,8.269845511491888956e-01,2.912572973418190880e+00,5.024192091258903314e-01,2.149724377925178731e-01,6.611798476090219312e-01,4.120216505213771363e+00,1.952211163787981096e+00,8.598325583278558781e-01,-7.811103543919384329e-02,-3.137766819731924173e-02,1.142494045361164279e+00,-1.618462028909878336e-01,-4.541067853296335555e-01,-1.140412086777333300e+00,1.387028620117793931e+00,-2.971513537642681557e-01,3.266779327035405078e-01,1.684807973086095145e-01,3.647788594400924178e-01,1.357194256768562202e+00,6.225771327088820417e-01,-1.679030017182611134e-01,8.558692192480066296e-01,6.175226251421455509e-02,-1.862246759060405266e-01,2.386453598643616392e+00,-4.637108620053940755e-01,-3.189054871663147828e-01,-3.373850674734503174e-01,2.647922867517512602e-01,3.457801395908846054e-01,-7.048379785977865186e-02,1.336463892006986010e-01,-1.547502437184406165e+00,-1.775154641937665145e-01,9.566639725108491144e-01,1.037491468186697019e-01,-4.871421912398526954e-01,1.583160850631145644e+00,7.295413094859143355e-01,-1.064832765494732048e+00,1.758658177777573939e-01,9.442720583960486636e-01,9.983236782658848618e-01,-1.230052313680441101e+00,1.923927870204937829e+00,-7.119228871363714184e-01,1.620945178902531092e+00,3.459311394431890951e-01,-9.602000062240860778e-01,-3.760516734904697511e-01
6.298973884216486629e-01,7.370301313081955019e-01,3.840628536580890096e-01,-9.357163840017772571e-01,-1.106686068136170792e-01,2.777242008759005509e-01,6.444826512021286646e-01,-3.233154050354812847e-01,1.193451820634675808e+00,8.158179071929358428e-02,-5.260873487452228936e-01,-1.200821026562617633e-01,-5.869971629902330790e-01,-4.606972512732444014e-01,-2.699926942334058833e-01,5.547011658557542413e-01,-1.095766924115755270e+00,2.670566640558704741e-01,-2.384437601982516142e-01,1.540461991548001675e-01,-9.249291749990207201e-01,2.809531693915384709e-01,-5.149650559585863263e-01,3.994826839118306716e-02,1.988885167078489502e+00,7.318857819400043097e-01,1.927393182675859462e-01,-8.133351791358021110e-01,-2.399904567833931246e+00,-1.668332252100183766e+00,1.961123973022231015e-01,3.031208721111955828e+00,-4.662748627095194554e-01,4.616052763053400398e-01,-7.411473712044687190e-01,-9.848344913838724679e-02,2.036032329022561704e+00,5.957228204730222743e-01,2.124947360052712675e+00,8.761102083638733218e-01,4.973633525648517573e-01,9.016563879953785055e-01,8.010514729838859316e-02,-3.394068003029807601e-01,1.073263219400011126e+00,8.756198667304438965e-01,2.336933257419155918e+00,1.724840504703440414e-01,1.104153092682321757e-01,-1.448817820555803326e-02,3.457294884300221582e+00,2.483024438026508740e+00,7.748309548328252694e-02,6.531047808358692031e-02,-2.455565629369240166e-01,1.554368115727809085e+00,2.921060424167248870e-02,-3.086462412026822477e-01,-6.806940489256262383e-01,1.749337535868939142e+00,-4.698716837204097718e-01,-6.097800782644485773e-02,3.441972549529603853e-01,5.705868748886866459e-01,2.035839050192735478e+00,1.370530096793278529e+00,-4.291828354456327932e-01,1.206017158982801263e+00,2.895035022598459462e-01,3.651706588234520101e-01,1.353746285073458733e+00,-3.773671760888752669e-01,7.903811743028878178e-02,-6.763363554818837553e-01,1.097094318439995470e-01,2.819187632874964322e-02,-6.730498976730425742e-01,-2.567804585225755831e-01,-2.036595607539631203e+00,-2.194870221118904174e-01,5.545510824299043628e-01,-1.887533370671890531e-01,-6.722646144086033004e-01,2.468619968277268040e+00,6.274647869891841756e-01,-1.501853888157983263e+00,4.220174189464425685e-01,6.366254743694798046e-01,1.106287480908185739e+00,-8.320357451402971005e-01,1.333753510152240196e+00,-4.570748363374517176e-01,9.689372071139688014e-01,5.511816808576741611e-01,-1.089978469544823581e+00,-5.670635362486060593e-01
6.934182137053114259e-01,-3.496316385054539788e-01,1.170578699395399408e-01,-5.495272528648331711e-02,-4.090744167066843184e-01,7.913020605376033245e-01,3.477846351388950152e-01,-2.297634440429092290e-02,1.532371321845108714e+00,8.458091465663490904e-01,7.086414036824082441e-01,-8.972830599040867994e-02,-5.266519190583661691e-01,-3.926035629729354159e-01,-1.333045357994297464e-01,1.704397501603325482e+00,-9.304736646471614137e-01,1.725933948293781883e-01,3.226113144444001102e-01,4.811345028516388345e-01,-1.144328355337185688e+00,6.984181931271591370e-01,-8.098549368466678722e-02,2.007217798858995927e-01,1.310036856451002318e+00,-1.024793299248865752e+00,2.595958856231810885e-01,-7.956516947773601967e-01,-4.130498200323993174e-01,-4.609890958551968732e-01,6.061619602526348016e-01,3.074781466534907359e+00,-8.587495062285424585e-02,-1.719440156379600237e-01,-3.556810232039649966e-01,-6.205652404254901056e-01,1.159345456196179125e+00,1.288313883651243996e+00,1.689147295351949962e+00,2.212765321701283483e+00,1.163900074102203197e+00,5.618185321258735154e-01,2.874902046909940667e-01,-7.941369999736380692e-03,5.025727709399981924e-01,5.250542074978123974e-01,2.742575098889379781e+00,-2.979785465465929484e-01,3.218992978687188478e-01,3.324814322072224271e-01,4.248721055669647306e+00,1.833131694846447557e+00,6.731604163552796782e-01,-5.672208249808636804e-01,-1.174562907656370836e+00,1.877489830130953496e+00,8.668676448358036968e-01,-4.435788098484272357e-01,-1.528839989498331775e-02,2.461086943012693595e+00,1.319610841367693022e+00,-8.103418552924998020e-01,-8.219413200905479888e-01,9.486142047309479297e-01,6.427987635521685839e-01,-1.027750532611357848e-01,-3.986042578327476105e-01,1.797195592686026799e+00,-1.947074300969046656e-01,-6.050589517443993870e-01,2.874854192474168624e+00,-1.713430076049054507e-01,6.861370883727578862e-01,6.038912023265706752e-01,8.051008208294699320e-03,1.295739926723139313e+00,6.609945987564724845e-02,6.443034008759132014e-01,-6.877933712856849624e-01,-5.386435895910030025e-01,-1.742080503837077909e-01,4.882532627420069216e-01,-3.173820780255822149e-01,1.587859454429623174e+00,5.755752042810042823e-01,-1.167386872525285391e+00,-9.905434538281238099e-02,2.676766984238232894e+00,8.390064415649920448e-01,-6.093079756183341633e-01,2.368201667368913910e+00,1.972483760436737343e-01,9.073717833780812203e-01,5.556959003538490816e-01,4.282744649608426490e-01,-4.227644369695103821e-01
6.823806202685318567e-01,9.304281734491243183e-01,4.396432884316195389e-01,-7.523500871843101789e-01,1.978162846920452078e-01,-2.577392758406099604e-02,3.154083847795973727e-01,-4.201677113538886954e-01,6.425027918252129711e-01,1.359274682678488222e-01,-6.681109549848579521e-02,-4.844141066504781268e-02,-5.257287587248608007e-01,-8.022002412672263327e-02,-1.221642933715677004e-01,9.324752852133380010e-01,-8.348939815759794936e-01,2.301665685229509761e-01,-1.008720506409554324e-02,2.183035826054032513e-01,-9.290023620390508441e-01,-7.093486505425350419e-02,-5.580715614567329785e-01,2.427897566862851353e-01,1.649794488821912708e+00,3.519578036286043488e-01,4.225085963615038409e-01,-6.994590436158345526e-01,-1.264903144358136000e+00,-1.076964340469217074e+00,2.088850383126913401e-01,2.625079683064058589e+00,-4.160399249454057036e-01,1.439046215418171570e-02,-6.455026446737790469e-01,-3.862442659240798992e-01,1.409060772410601015e+00,1.011305295206129440e+00,1.748345329993767683e+00,1.005971095659538683e+00,3.828084343142290069e-01,5.710292822987808048e-01,-4.979584144502991611e-03,-1.645944322510811686e-01,8.793156932973341666e-01,9.486884265245834058e-01,2.455203875846781791e+00,-1.470139344281028437e-01,-2.433431906152348778e-02,9.418189142573232253e-01,3.209750321580691512e+00,1.537791497482273950e+00,-1.076884427691662816e-01,-2.322452079509081113e-01,-3.959180370089209755e-01,1.474437839446348653e+00,1.544575701458920092e-01,-3.270960546991047435e-02,-4.693724822221779780e-01,8.461823328769918495e-01,4.493314610012600907e-01,-3.003227582449724542e-02,1.381281474876836224e-01,9.301177280278207782e-01,1.458825386130786939e+00,7.119603023366778416e-01,-5.156818688606192858e-01,9.638676530716239199e-01,1.609688737394762981e-01,3.652922618528881560e-01,1.690450699910261756e+00,-6.212055819998891781e-01,1.555180244444257509e-01,1.091365016178031666e-01,-2.424063006531906317e-01,9.293311393367904572e-01,-2.392587809476500738e-01,2.192667113490526232e-01,-1.184723229280922663e+00,-2.313582192899977519e-01,1.937377617637219829e-01,-2.730262024945081523e-01,-2.185860189410215038e-01,1.905878149747953998e+00,5.560176328958266190e-01,-1.016869402167758896e+00,5.521723840372410042e-01,9.638577945422827087e-01,6.807961260057944219e-01,1.559033132874182992e-01,1.270995318432906807e+00,-7.561737408430707630e-01,8.054117867232453154e-01,3.838183930961752699e-01,2.232860855166372838e-02,-1.274278496285075057e-01
5.490729863796827148e-01,-9.122498406706791574e-02,-2.797497752065399856e-01,-3.371269457435567274e-01,-1.485032862472062121e-01,7.920157326250059082e-01,1.369460098577993667e+00,-3.761352121638454338e-01,-2.351784708844266714e-01,2.988683584815520211e-01,8.722807393564874223e-01,-2.579696459112316154e-01,-3.546480656059994296e-01,-5.392521343573035419e-02,-5.684876509059109129e-01,1.336458064892174225e+00,-6.318963216624966517e-01,-5.588412716015530579e-01,1.620941709039991074e-01,-2.946785912384718847e-02,-5.028276118983376897e-01,3.975545936474504938e-01,-4.810383310006571267e-01,3.110395861741203083e-01,1.758790040720171532e+00,-8.215736409811957852e-02,1.575437130698014998e-01,-7.636591556442836604e-01,-1.378258776199645430e+00,-1.302570528983722609e+00,4.720098196275052116e-01,2.561250294777624781e+00,4.860508288876425054e-02,5.204356770579143809e-01,-6.302344694697507022e-01,-7.004238804946869568e-01,1.434316329345925123e+00,7.671445545085117113e-01,2.431439264106465270e+00,9.779202499253168979e-01,6.314631848643992296e-01,5.041719558637243193e-01,-2.913498906659018894e-01,-6.338928479067738875e-02,3.988125626722224815e-01,8.244811946711222417e-01,1.773381721296762858e+00,-7.708821480270464099e-02,3.394658946671119670e-01,-2.231883156043593663e-01,4.331944473048923605e+00,2.416665961107016258e+00,1.929382308796663559e-01,-4.809056970868293424e-01,-5.365783196440399028e-01,1.665956195546421270e+00,4.384213502359067260e-01,-9.179253005939841392e-02,-4.985509503640387363e-01,2.223343672511771452e+00,2.313859566039843385e-01,-1.087841338706420746e+00,-2.855203250942915938e-01,1.984598742846412356e-01,8.818592692102831254e-01,1.714660733797631065e-01,-9.675417282273220954e-01,7.926959620875322354e-01,-3.793470652909876617e-01,9.701615462620980512e-01,2.009249147605862262e+00,1.019874214124453227e-01,3.385355417332635009e-01,4.801087781623910589e-01,-7.490981304259555773e-03,8.041219054904560348e-01,-9.551536677412162391e-01,3.012716761394377274e-01,-9.554410026334589912e-01,-8.950270149134124109e-01,6.006664810204441762e-01,1.304287972959412567e-01,-4.353275563451490804e-01,2.041120341914782976e+00,7.472081632195570755e-01,-1.508523073712401130e+00,2.058168352212638164e-01,9.398630028460056574e-01,1.019502781074677511e+00,-5.703414558019568315e-01,1.294130765056879628e+00,2.623378644405999216e-02,4.097851052674584826e-01,4.516908082658116497e-01,1.452675229819323233e-01,-8.000602685172235606e-01
7.949855988160439146e-01,1.115626513530067143e+00,1.751213220526092740e-01,-4.625683713340594805e-01,3.139517190600777385e-01,5.987290852926763218e-02,5.090677594015111662e-01,-3.600071612110334329e-01,1.599880691352713047e-01,-1.146157929785487917e-02,1.905579983540290345e-01,-1.150625923981345722e-01,-4.571876436040860359e-01,3.069291279212560397e-01,-1.015168058378513871e-01,1.135902953496939372e+00,-5.219639751901997693e-01,-2.834801945634547460e-01,1.481553614725000523e-01,1.415190251286873868e-01,-7.864952473829989188e-01,-3.098257927552792168e-01,-7.191913897764020680e-01,3.950702936536369947e-01,1.435743149870629676e+00,2.244509938987436504e-01,3.276860055829582397e-01,-6.196417880072393469e-01,-7.116465187418378191e-01,-7.954447792678507323e-01,3.804700616034398242e-01,2.204481158756379067e+00,-1.451176680889700865e-01,-7.954445956541317253e-02,-7.257972523244988761e-01,-6.685085665210205308e-01,1.282414335890588841e+00,9.745730293624025320e-01,1.447798852107852863e+00,5.536929959457141948e-01,4.467978147645363940e-01,3.667276977445626529e-01,-2.093770681747915696e-01,1.592865603653756401e-01,6.886676936542104333e-01,1.066469509522558257e+00,2.282116659108364587e+00,-3.793712458496983908e-02,1.271592783966520868e-01,1.105180525633511657e+00,3.601426763211558413e+00,1.273845481409066061e+00,-2.533775495435858227e-02,-3.993824868355879687e-01,-1.759375349418704770e-01,1.160546102514492750e+00,-1.717518449305213135e-01,8.681895626863292414e-03,-4.891815649742387029e-01,2.905438654469276738e-01,6.608907511008119684e-01,-2.554493536505714202e-01,-4.299768286968037867e-02,5.033286083292852764e-01,9.196176943620375521e-01,2.110297045465878707e-01,-6.206502585358805169e-01,6.911622085809424609e-01,-3.309050049435263707e-01,6.646473545375203296e-01,2.004240123798743944e+00,-5.815015241931602574e-01,-1.319241550716344913e-02,7.030883077206140364e-01,-2.096309065717972819e-01,1.303073693014313861e+00,-1.981096953132106264e-01,1.885072603208758357e-01,-6.096868394815380121e-01,-5.424870622433056733e-01,2.617857056819423156e-01,-4.150927284090822345e-01,-7.363615980432508534e-02,1.555160521988488531e+00,3.778965805544045597e-01,-7.476789605163096653e-01,5.275764241282052680e-01,8.561342509487406272e-01,6.687727364701627764e-01,2.405702765895755824e-01,1.106538770093895341e+00,-9.127418395480857427e-01,8.824923688518790943e-01,3.603774898943307714e-01,1.460960575338780820e-01,-9.902279327594099012e-02
5.368306928254301669e-01,-5.055497712751192418e-01,-3.270447444318902996e-01,-1.472588564614552009e-01,-3.174237183578901833e-01,9.912245598605020636e-01,1.302244577093907507e+00,-2.784013021688371836e-01,4.513836837003626368e-02,5.579618870055963464e-01,1.140652560297582552e+00,-2.483957415805804758e-01,-3.573508867008799994e-01,-1.701990817121281085e-01,-5.592345940059965104e-01,1.597084390720644009e+00,-6.813083820555267955e-01,-4.885492992473096652e-01,2.693221546318701476e-01,7.380813060252500168e-02,-5.933880613238212698e-01,6.364489215360105145e-01,-3.068711421337229628e-01,2.985946204853298647e-01,1.646742966475889913e+00,-5.449283690910358136e-01,1.571926373367513730e-01,-7.927631479036394424e-01,-1.055488009023211937e+00,-1.081967922518455527e+00,5.654294144412255196e-01,2.722195902780182308e+00,1.092459838360611557e-01,4.198588001486394661e-01,-5.101781286151803041e-01,-7.634676976510466062e-01,1.289040648221613239e+00,9.196684454861320246e-01,2.424048207607508054e+00,1.460862958422310065e+00,8.462059404085846559e-01,4.912870975532592777e-01,-1.756779835187412542e-01,-5.175848170815401661e-02,2.851644511400195925e-01,6.792730380980971372e-01,1.907662112504865615e+00,-1.923906489239993745e-01,4.001171079729449187e-01,-3.133155460577096152e-01,4.551236267348125253e+00,2.428587308118296928e+00,3.946289920353208691e-01,-5.986625725640741802e-01,-8.454244694932659954e-01,1.843363896703651639e+00,7.462495992594014860e-01,-1.864886531881514986e-01,-3.236701087837916546e-01,2.714354794806362214e+00,5.934776110982272757e-01,-1.290769683681317614e+00,-5.819166931842447710e-01,3.352400818598260668e-01,6.436700242679126438e-01,-8.600853617682308050e-02,-9.282058257410887858e-01,1.065992411407177709e+00,-4.161731571303493582e-01,6.163818930537843244e-01,2.368061353599913765e+00,2.047993189871996633e-01,5.494946920083311204e-01,6.363034893454579954e-01,1.336499969094230578e-02,9.765087243957615293e-01,-8.114463042116039082e-01,5.120840271643978259e-01,-7.862083914089572634e-01,-9.368515739270748544e-01,4.246141718816254795e-01,3.869420473909356284e-01,-4.291148829560371691e-01,1.929075200032732251e+00,7.809466476630393394e-01,-1.541530739526301597e+00,2.461770958372161422e-02,1.540149561839221359e+00,1.010657088290953576e+00,-6.845636149015077443e-01,1.658085731369237426e+00,3.162951091417300908e-01,3.974780901136208966e-01,4.847754162528719046e-01,4.147787422930382384e-01,-8.386323394742378756e-01
1.016380226708474055e+00,1.382160918405989314e+00,9.963041052428749100e-02,-6.501471152012103794e-01,-2.426795483904488071e-01,2.056017577996585299e-01,-2.478704346883850440e-01,2.997256528004959564e-01,2.081848844735084469e+00,2.445184366980359125e-01,-1.269632587731807649e-01,2.369606121395227138e-01,-5.251993494228813786e-01,-8.407134357015229320e-02,-1.869940740447486038e-01,1.539172847576890213e+00,-3.370170840109100174e-01,1.646142705717205112e-01,-1.439921117407415019e-01,2.284917854951481753e-01,-9.444984083030574240e-01,4.874388150672195885e-01,-4.757826817406450859e-01,4.295744373263979399e-02,1.535787996841397218e+00,-6.098325174856838310e-02,3.026159790908214409e-02,-6.282084820837761097e-01,-9.643776620432090718e-01,-9.172754546485797356e-01,3.409809311624334427e-01,2.594529105476840680e+00,-3.905127945205473794e-01,-1.561158605705681435e-01,-7.422101758061609988e-01,-4.403792427393015130e-01,1.916155264927377644e+00,8.304735777893046400e-01,1.338393245584065472e+00,1.148612674781374299e+00,8.846841028139353913e-01,4.692299907315218843e-01,3.386613862460240432e-01,2.058297332735987140e-01,6.158189907128928109e-01,7.582337510438061923e-01,3.023957372320410730e+00,2.559820120579784364e-01,1.463209901264569124e-01,8.812181169967545635e-01,3.949651603126185684e+00,1.700739381447900822e+00,7.813685345439743690e-01,-1.902389136415842119e-01,-3.281334069549587951e-01,1.319291732626388658e+00,1.303561288057418222e-01,-4.016327175886976741e-01,-8.922332236943815165e-01,1.436638518191043490e+00,1.936022088986099343e-01,2.579585693535834112e-01,-5.396573846075079783e-03,7.107183902830749300e-01,1.228743058333783056e+00,4.560701254109697511e-01,-1.653148312615546622e-01,1.044002833444766187e+00,1.369198910228182631e-01,-4.111526338664992508e-01,2.509530908003779537e+00,-5.213059200111189728e-01,-9.251163240404235155e-02,-1.375547961638659278e-01,1.173624046648789471e-01,6.623900551883863397e-01,1.184986958540256707e-01,3.702363147032181057e-01,-1.326430773540153707e+00,-1.240814420476299418e-01,6.345415767220085046e-01,1.900879172824122831e-01,-3.647844074459813957e-01,1.493140482990295004e+00,7.280122145427878610e-01,-9.936512757755344705e-01,1.675190335359598159e-01,1.400511069377156081e+00,8.449767659085657412e-01,-8.793256349454425802e-01,2.069098318760985489e+00,-6.224056551950828409e-01,1.479443412997666130e+00,3.377106925512301516e-01,-4.623012463225660285e-01,-2.408319418621940877e-01
8.354482520986626914e-01,7.809506935788286253e-01,-8.860941316951854996e-02,-4.399730822995625568e-01,-1.472525394433556456e-01,4.416904265732441992e-01,4.475954356418794244e-01,8.541190873080639623e-05,9.503019334360338632e-01,2.544559214308161343e-01,3.864228151144147860e-01,1.274203627273083617e-02,-4.383661158919792689e-01,2.658461961457855155e-02,-3.206192607298899988e-01,1.512826857454159457e+00,-4.052221527208542673e-01,-2.274392293733624171e-01,4.541960868217043840e-02,1.215033065951678648e-01,-7.443756540775969821e-01,3.634538254880961272e-01,-5.050552519429056808e-01,2.076873504879560295e-01,1.553544191510095152e+00,-1.377208867852758312e-01,1.002912465280516446e-01,-6.645855634535657863e-01,-9.252423567713133901e-01,-9.618576570311372365e-01,4.311953785091128255e-01,2.479742735559801847e+00,-1.494953651959244623e-01,6.616764791286396108e-02,-6.917052576192177504e-01,-6.265702797705443583e-01,1.610191683904181215e+00,8.496261429174388757e-01,1.710735057209440635e+00,1.025752033753470016e+00,7.774793917979240243e-01,4.222862058517471429e-01,2.603546408523720046e-02,1.575834678866251948e-01,4.811428497366199153e-01,8.138030261888034023e-01,2.471119290208092956e+00,8.976419611416751321e-02,2.419496259912430336e-01,5.341266423951772646e-01,4.144050514639664229e+00,1.858362905240243723e+00,5.143385148439543197e-01,-3.753538168359273897e-01,-4.058154709585113373e-01,1.410512430484286872e+00,2.207287788936007633e-01,-2.359073592716549594e-01,-6.834666064970459365e-01,1.578865273688365045e+00,3.632756540433405013e-01,-3.625290124658838153e-01,-1.874676922508107246e-01,4.637445954892500666e-01,9.286491191853699645e-01,1.835099227753977102e-01,-5.328021919140476514e-01,8.877225728566529028e-01,-1.855953372192714057e-01,2.224869017660553450e-01,2.380550436709363726e+00,-2.767029893304501775e-01,8.273769973267172673e-02,3.186371323989506399e-01,3.055860347966035673e-02,8.912671936191949307e-01,-2.826581438786641698e-01,3.773424807961195393e-01,-9.738640818986695757e-01,-5.104625161345874851e-01,5.689306102873858961e-01,1.243189651307949617e-01,-3.219785014919716581e-01,1.614932885174314547e+00,6.851949675442958743e-01,-1.113829643649599799e+00,1.939351960137872533e-01,1.240979056663607860e+00,8.728540264476933874e-01,-6.177966723601555632e-01,1.702517436676326934e+00,-3.990673390379507190e-01,1.014397985550474779e+00,3.727811918994629603e-01,-6.441804033261058771e-02,-4.255551410243288424e-01
8.273532876386494594e-01,1.176460471695221832e+00,1.356558978489837419e-01,-7.447956679586551498e-01,1.310874559791001814e-02,6.505048019002890314e-02,1.147188045426577041e-01,-8.942243245255969419e-02,9.643203524924510717e-01,1.765330027867151319e-01,1.848070115853696627e-01,1.384358454374094161e-01,-4.528094452154371452e-01,2.491183811703753803e-02,-2.931433951869449883e-01,1.402727698010470370e+00,-3.904084758041309611e-01,8.285318025171142797e-02,-8.403670800676635300e-02,1.116621245812161045e-01,-7.633242525252945665e-01,2.385575688673539085e-01,-5.488534233377271310e-01,1.746439522632189933e-01,1.645774154930839339e+00,1.387762314941488606e-01,2.402855340103874360e-01,-6.310278695693330997e-01,-1.041271436800371708e+00,-1.076070453844113040e+00,2.273582037239545717e-01,2.443663246151273505e+00,-3.935762207272489044e-01,-1.127911344272847227e-02,-7.032073993069146711e-01,-5.038816512906443279e-01,1.591057200392097304e+00,9.254934121306883643e-01,1.728719553530802644e+00,1.027406558714237583e+00,5.304634328225481532e-01,4.051180140112987105e-01,8.097846208377507127e-02,2.737506050647961486e-02,5.881792584599843110e-01,8.638792127529866249e-01,2.614990582912373185e+00,-3.825013339251635835e-03,1.494196022319535522e-02,9.690102046971135197e-01,3.607152664138549181e+00,1.600226513109330728e+00,2.882387946594461847e-01,-2.850108061664518577e-01,-3.665335926178014403e-01,1.442378578582748538e+00,2.737123258592604191e-01,-8.020173418600844151e-02,-7.908547093620083013e-01,1.204644483519731635e+00,2.883169285292184192e-01,5.635920392141380297e-02,1.104428322652425409e-01,8.356247587171392599e-01,1.247088562015428392e+00,4.390083563819007217e-01,-4.941840367071996254e-01,7.162209566074243527e-01,1.789270408595103612e-01,2.214712831537111737e-01,2.082089632517057254e+00,-5.070697619745402340e-01,2.854652352156322043e-02,6.938012097040469062e-02,-1.524923695046755401e-01,8.586164454678584246e-01,-1.896743799962073429e-01,4.907377401915096193e-01,-1.171281154271868630e+00,-2.158965869271967375e-01,5.693614156582947894e-01,3.219068698844199106e-02,-2.280105286533503084e-01,1.651819061609441253e+00,8.010101754821801201e-01,-1.055319823219905917e+00,3.962130294916728079e-01,9.842161076988927837e-01,6.901343665422219331e-01,-2.086524864455021611e-01,1.570724979907537566e+00,-6.712933874758358899e-01,9.568730797905363739e-01,2.597912921057755065e-01,1.189072285624634823e-01,-2.074660969703087110e-01
7.880595147547431178e-01,9.571565442349283526e-01,1.372756030761140833e-01,-7.879217455183178398e-01,-9.693727837575172313e-02,6.846483052792423640e-02,-9.012479316338556368e-02,-3.833252721147781955e-02,1.129518024653010766e+00,4.039278400227365728e-01,4.674293221948835342e-01,2.536645396083355708e-01,-4.282359864283193374e-01,-9.673053649401305853e-02,-3.747141532420573684e-01,1.680890315025901804e+00,-3.473615629992625187e-01,3.046520158572285641e-01,-8.780987834215950305e-02,1.422440175317606637e-01,-7.682835932676306268e-01,5.017130945566925515e-01,-3.929409602882082408e-01,1.273604834566761657e-01,1.663120365807754908e+00,-1.541813973052182651e-01,3.071981931886483830e-01,-6.370002426046248445e-01,-8.691516830492704848e-01,-1.037654938382337022e+00,1.649283842221520024e-01,2.556672509355879086e+00,-4.901963636823077897e-01,-7.564394612320812783e-02,-5.943814173707090420e-01,-5.089021420979091825e-01,1.461646226134382553e+00,1.091773536169341030e+00,1.903907612940793914e+00,1.530369636020128432e+00,5.628606275444617557e-01,3.533570536225959513e-01,2.099856110780938812e-01,-6.652151790171091650e-02,4.557119258293427788e-01,7.265114651357995612e-01,2.771981891166797940e+00,-1.866913514808521690e-01,-7.767550741878824494e-02,1.055379811902332987e+00,3.553463213401752974e+00,1.567419216336917165e+00,3.674796053534970519e-01,-3.616712531802771524e-01,-6.733535672625974300e-01,1.706623715372870054e+00,7.266954308682513908e-01,-3.851227559657618982e-02,-7.674578948162239511e-01,1.689932069368292655e+00,4.935288377043719477e-01,6.771797263662460153e-02,3.057437131574972447e-02,1.198680856657528437e+00,1.211744071407689693e+00,3.200775066943400970e-01,-5.065580758012815377e-01,7.649739848547639776e-01,4.210302130948108124e-01,-3.198225096427231851e-02,2.234416002005356727e+00,-4.676673478400482642e-01,2.184507614011985122e-01,1.585872922001316243e-02,-2.558543649303427481e-01,9.394668234259069273e-01,-1.069882601880990380e-01,8.643722939558822205e-01,-1.183583497990117861e+00,-8.672841558029875664e-02,5.233549475186549671e-01,3.253699580318074602e-01,-1.843859131326894829e-01,1.598596909088466633e+00,1.030966643789132275e+00,-1.156778272479273895e+00,3.275608087630953458e-01,1.324764243545261566e+00,5.736991280464437404e-01,-1.165439047191628164e-01,1.848166669964938613e+00,-4.673286914775895973e-01,8.134046409189976679e-01,1.811075559626497133e-01,6.007905362990111353e-01,-1.845323224662483441e-01
9.158837809100013327e-01,1.668816157217154483e+00,4.608337062774613413e-01,-1.063551584590845644e+00,7.536586004158014884e-02,-4.966592846319353716e-01,-9.876961180747043656e-01,5.726296419988999298e-02,1.681554925796757916e+00,4.199392917854231633e-01,2.454599022579000422e-01,5.445233638394507691e-01,-4.669980048996529298e-01,-2.793086608231350187e-02,-2.045320617677109376e-01,1.842941086868908007e+00,-1.794058942641026944e-01,8.262925447480776731e-01,-1.958597953382641421e-01,2.518897379082890020e-01,-9.303575315980623373e-01,3.816620810196478253e-01,-3.875035552298651265e-01,7.947325383524796172e-02,1.557841921748092995e+00,-1.493237499516801015e-01,4.865452196200492629e-01,-5.402240256611177127e-01,-4.115525353915425733e-01,-7.969673767167370082e-01,-4.481783198692168568e-02,2.454795694898149527e+00,-8.216115951085867231e-01,-5.057177515135256041e-01,-5.641337977720007890e-01,-4.282222858878302896e-01,1.325483476106190661e+00,1.368273110335058274e+00,1.523045278828788929e+00,1.791669269346455096e+00,4.152871741253321702e-01,2.145756246809546741e-01,4.480619346455503305e-01,-7.024464491778022179e-02,5.138033312890526449e-01,7.293070628254810783e-01,3.334641763329392550e+00,-3.351724667855326967e-01,-3.843520947252003217e-01,2.058981801772500120e+00,2.906466058734738844e+00,8.274813878754145868e-01,3.095049629200399832e-01,-3.279295713665614231e-01,-7.357968854710075224e-01,1.689857470863715072e+00,8.573486211689144154e-01,9.484200445006465974e-02,-8.634570199599800322e-01,1.005840854029278919e+00,8.138691204442703997e-01,7.927429350823836929e-01,2.442296397621777082e-01,1.878695768035103075e+00,1.365181160497267010e+00,3.572346361300728357e-01,-2.716376075066776474e-01,6.656143640591811739e-01,8.848386586978357338e-01,-5.205112890297405315e-01,2.295067131040996244e+00,-9.041730380924273280e-01,1.466951114310467985e-01,-1.079742255453405575e-01,-5.143179215852734520e-01,1.206215952978250794e+00,4.536537053136306397e-01,1.233053135588847438e+00,-1.162668716406082936e+00,4.028457949136499128e-01,3.697541948811393087e-01,3.206348556006216044e-01,7.414964579723976046e-02,1.274785879982943460e+00,1.146052555961219133e+00,-8.270128089552026829e-01,4.999226256815900715e-01,1.491797009495824167e+00,2.027892930792909443e-01,4.855165881636783198e-01,2.030717720541465265e+00,-9.044481396024850461e-01,9.775660672007165930e-01,-1.055030534127265884e-02,1.080805007693974140e+00,3.072399123470068716e-01
1.033888524341022963e+00,2.163987425879962068e+00,-3.194918368416257426e-01,-1.156754662908989761e+00,-1.353971694254521296e-01,5.893924964095206831e-02,2.231022601023711083e-01,2.782324538713515372e-01,1.148577164983273002e+00,-2.909804120777556014e-01,-1.559847283435047971e-01,3.343872170803565691e-01,-3.617704741989962725e-01,2.038030737789966462e-01,-6.760624552637470863e-01,1.412317544224649613e+00,2.377074359964480021e-01,-3.335124439887822145e-01,-5.114189450031504380e-01,-3.009472078040084098e-01,-3.085262563394007840e-01,4.611719709215971186e-01,-8.485937509072359886e-01,-8.195861394464404315e-03,2.046181687039865249e+00,8.971181718478430378e-01,-1.895940645699451810e-01,-5.410438607623131446e-01,-1.971822780068772207e+00,-1.840865806838177354e+00,9.906620955479158996e-02,2.078253274973296261e+00,-4.565209323923057338e-01,4.339089914394562153e-01,-1.079623113186782390e+00,-4.250144234718802871e-01,2.504955620417233852e+00,2.410863930353651652e-01,1.956391209985773205e+00,2.483380112714717036e-02,4.294172888698276624e-01,3.644844028435282324e-01,5.941084403265961544e-03,2.149361472913999260e-01,4.488156399361259985e-01,9.729120226636528423e-01,2.469965583577289792e+00,6.321922961396155838e-01,7.288371915160621328e-02,5.474615406201722712e-01,4.023525310293459611e+00,2.270486373934308855e+00,6.247625304945807478e-01,1.247151672293805857e-02,3.638421582811517396e-01,1.091960336646973673e+00,-2.211886958842768092e-01,-1.373672611006309663e-01,-1.727217283026608374e+00,1.380910547919233400e+00,-1.187043934101323917e+00,4.698162312538864960e-01,7.171679068534038137e-01,1.415678292450697207e-01,1.658184635895033621e+00,8.512030943161006391e-01,-5.197741886662406996e-01,-5.305889099613914084e-02,2.808426182014223116e-01,7.409021401839279708e-01,1.818680400865704927e+00,-3.413343780845906617e-01,-6.083543537163783599e-01,-6.899367499917711255e-01,1.696936442499910602e-01,-9.404878447775455452e-02,-6.899306670652856077e-01,2.046092125641547077e-01,-1.926974703823152613e+00,-1.709130650291541265e-01,1.704025659309672092e+00,5.743274912689341760e-02,-5.286965195891921709e-01,1.809570665118670707e+00,1.137241889100339298e+00,-1.348902955702592887e+00,4.095423941661765488e-01,-3.331931910988743528e-01,9.967436394521056453e-01,-1.161469798741446846e+00,1.347066846583961475e+00,-8.833666179308712341e-01,1.285597517028427061e+00,1.176476492153099296e-01,-9.058403355366839715e-01,-5.547672361255192586e-01
5.541640672034620074e-01,2.491772949348138866e-01,9.486026309706026283e-02,-7.672845406607771146e-01,-1.467874823879811996e-01,3.308629723243473042e-01,5.412317592342952288e-01,-3.197714120245869207e-01,5.008333384702117197e-01,4.731588658773000500e-01,6.657680649727351074e-01,4.909509582496831420e-02,-4.068166439912749843e-01,-2.919297303752722561e-01,-5.246271743639353557e-01,1.436444338673904753e+00,-6.598079059831845061e-01,2.100407494171759870e-01,-4.134274548743405164e-02,8.093117548685277440e-02,-6.761329126872088757e-01,5.836582609380314146e-01,-3.266990472938052226e-01,1.531121681456311945e-01,1.858697567525462224e+00,-6.976793771146952428e-02,3.583585814443095430e-01,-7.437004285367962986e-01,-1.394579197227723055e+00,-1.349762061811350389e+00,1.726189018306940604e-01,2.780400232611393019e+00,-4.071333897162329740e-01,2.811523044146383987e-01,-5.305884340851433345e-01,-4.616417212213547172e-01,1.403672519157910026e+00,1.022344482136520627e+00,2.462531462743116961e+00,1.608186020563801222e+00,4.778589299917462840e-01,5.093800059437809669e-01,4.953498496151718944e-02,-3.122184520892914428e-01,4.952538669153150330e-01,7.018902174811546546e-01,2.325604293461866146e+00,-3.055759742666809275e-01,-1.843782033871475823e-02,3.995963116164180651e-01,3.607289424028143898e+00,2.083596370805677278e+00,1.318685488176037646e-01,-3.690117961724589390e-01,-8.140628997827946689e-01,1.955919799660608804e+00,9.155010787761179714e-01,5.183023340515846566e-03,-5.958917776899452790e-01,2.308347344792289757e+00,3.268485364084446898e-01,-4.073201356095074166e-01,-1.030056810156818048e-02,1.077824730908274464e+00,1.348251544637392385e+00,4.926953702965461979e-01,-7.548739783053863839e-01,8.579730965386972441e-01,3.802638665833948384e-01,3.796799322703917623e-01,1.881773912445724228e+00,-2.053253731265885507e-01,4.460607457741939119e-01,-5.045350090794112341e-02,-2.495755802586304695e-01,7.389607711123197253e-01,-5.918481579086347644e-01,7.338752214944932462e-01,-1.355217835158391448e+00,-2.922893814792033584e-01,4.936324218915125184e-01,3.411760794393364771e-01,-3.383685670534410939e-01,2.030661758803162797e+00,1.067651854954459800e+00,-1.512835537132832142e+00,3.248983258026640897e-01,1.178197466559618656e+00,7.249642143662078375e-01,-1.854754683492002842e-01,1.615057405058495377e+00,-1.089008813659427810e-01,4.105909056334757778e-01,2.843819265607607227e-01,5.803475314844093180e-01,-4.790579773198209157e-01
5.251262144642343532e-01,3.861499339123154462e-01,3.258037030241168197e-01,-9.144443147382440573e-01,-5.307144577576033972e-02,1.543570077052772160e-01,4.295602168822554301e-01,-4.250891464408438347e-01,6.223336367642804401e-01,4.077406188547716415e-01,3.366736480705975754e-01,3.684292307925049470e-02,-4.664603819001529317e-01,-3.785780877457389226e-01,-4.208493285338171797e-01,1.155884515562749737e+00,-8.554503617168363050e-01,4.295597686884845556e-01,-1.034423615291522602e-01,1.377861225424875935e-01,-7.922505461192541620e-01,4.436245279406795250e-01,-3.473597520622707657e-01,1.278637436874476563e-01,1.908775853014795798e+00,1.725530545303450847e-01,4.415282465182435168e-01,-7.638070314953286921e-01,-1.633048347279664858e+00,-1.423361672218825147e+00,8.961282610850976327e-02,2.891898757327776348e+00,-5.342139101635309251e-01,2.634604312325878883e-01,-5.355533769391290777e-01,-3.148904545141515965e-01,1.439337661472635865e+00,1.032997924813974455e+00,2.415881188539783508e+00,1.573291306908833231e+00,3.680501206166832961e-01,6.140138498709968307e-01,8.780003339756166370e-02,-4.294376633110965624e-01,7.046265900407726601e-01,7.477745631052311603e-01,2.389392921425486538e+00,-3.225582030293740465e-01,-1.047600755418758439e-01,5.084951981360847917e-01,3.260120325085307691e+00,2.022077527741816372e+00,-4.448825623980240396e-02,-2.533940500701037379e-01,-7.628907720673663295e-01,1.945421613724518828e+00,8.157257381435525367e-01,1.468521790220020384e-02,-5.500937427420005132e-01,2.042803917680707126e+00,2.530060632677002541e-01,-1.975589972894203628e-01,1.495263004702084564e-01,1.222532236850712106e+00,1.641248653246498934e+00,8.005258464471417534e-01,-6.712364009243745322e-01,9.583986263715459364e-01,5.365454634650098642e-01,3.345740365190437160e-01,1.612388620211081758e+00,-3.571254332222000283e-01,4.278007140217557347e-01,-2.547717730548045845e-01,-2.904908537021587689e-01,6.387358618989478209e-01,-5.443452479101096309e-01,5.835833788950551826e-01,-1.554396549670765904e+00,-1.427274121239608951e-01,3.770101741044509791e-01,1.784084880866071421e-01,-3.526539346513928308e-01,2.173131681623944544e+00,9.926237521188239210e-01,-1.483159648803229924e+00,4.428326043407212476e-01,1.071936760660673338e+00,7.023008519657988336e-01,-4.134151485032183659e-02,1.502741984310302703e+00,-2.656823547420928966e-01,4.457933395775189878e-01,3.157156911444756742e-01,3.905857675761487680e-01,-3.774741354142172600e-01
9.217012376733604295e-01,2.366637849897551327e+00,-3.713397238065865302e-01,-1.512947329703645760e+00,4.677628939647258954e-02,-2.276279814766831167e-01,2.941426034619665786e-01,6.771218533643225124e-02,3.015611669165848552e-01,-3.964235686377646228e-01,1.495361115979917943e-01,4.495909800635160547e-01,-2.474272892943905067e-01,3.211529330009351701e-01,-9.418700870527995095e-01,1.478396748167668528e+00,4.843571899446434403e-01,-3.059166453468272762e-01,-6.451161758287383696e-01,-5.340680514001127088e-01,9.150124541979720583e-03,4.228272610884414306e-01,-9.405752933589384135e-01,1.512178331861785407e-02,2.303500380159272609e+00,1.222245001288316368e+00,-4.976495467635544401e-02,-4.909570034533007332e-01,-2.203958617746390125e+00,-2.223318017744638109e+00,-1.611198202706455307e-01,1.833014203315654012e+00,-6.290874000026547286e-01,6.131948040192339855e-01,-1.108565791086440822e+00,-4.384199050658119101e-01,2.408402504924833210e+00,2.463888209288996878e-01,2.469150416103314427e+00,-1.081151370486694852e-01,4.266881917518894340e-03,2.208947425103146012e-01,-1.503474098355205846e-01,3.687812470065519876e-02,3.041864188989988338e-01,1.039676306758732238e+00,2.225167444159108054e+00,4.566418463484124279e-01,-1.758823518084903781e-01,7.716518405328289809e-01,3.628252436142343385e+00,2.227655180134109791e+00,2.731347662001422649e-01,-6.777653897565849572e-03,3.985295347869539651e-01,1.248010039606522126e+00,5.132103194720338823e-02,2.322510867993890782e-01,-1.990300308667428686e+00,1.345460832690324349e+00,-1.456519059749971978e+00,6.077352760001095699e-01,1.078229402010317139e+00,4.002873097187552021e-01,1.862137614952317666e+00,9.387790789658977397e-01,-8.197149685296261090e-01,-6.788796917822653709e-01,6.340392214866803489e-01,1.319311607404100029e+00,1.373690368557453523e+00,-3.465811871011590939e-01,-6.259536870165206546e-01,-8.410136300615314031e-01,-1.139961833391785889e-01,-1.489661276419609326e-01,-1.016194542015318225e+00,5.376907321308662668e-01,-2.069723735525780484e+00,-4.470262286899046034e-02,2.005165536787891334e+00,8.244464472606256866e-02,-4.150382664421666257e-01,1.930786076065799550e+00,1.513657659627350549e+00,-1.512120652038541291e+00,6.536525842245904938e-01,-1.022704872129847287e+00,7.921948692298279582e-01,-6.280349133754974389e-01,9.589211595210546113e-01,-9.957567339728945477e-01,8.196593906000531060e-01,-1.122203580988233584e-01,-2.872474323202655055e-01,-5.197444524505703267e-01
7.422500315565638829e-01,8.459503307137896666e-01,2.872374718257625359e-02,-5.897481511663965614e-01,6.657663305629595019e-02,2.025582424775716206e-01,4.734783831740769777e-01,-2.375320655933354785e-01,3.706310653184189396e-01,1.929212058021437526e-01,4.820182331192974234e-01,1.383175198352683266e-02,-4.071059595702525291e-01,1.045736224577972634e-01,-3.438704603704189622e-01,1.417857247792715825e+00,-4.182799894283967812e-01,-1.459690329637201855e-01,4.304843425009933361e-02,6.962751841066787406e-02,-6.703509372335173522e-01,1.586960733976932603e-01,-5.616567898860261865e-01,2.752781245618433070e-01,1.616253182008787759e+00,4.477159742989931385e-02,2.770017343829623835e-01,-6.461864165959514406e-01,-9.290348871926843444e-01,-1.037676305719210212e+00,2.986067136876301986e-01,2.367402631311370964e+00,-2.420320460279945518e-01,7.255853005157905655e-02,-6.695277847401774896e-01,-6.274553902657222793e-01,1.396092700933874831e+00,9.570518427686544038e-01,1.874680686430881815e+00,9.739476133457914964e-01,4.992911756431803738e-01,3.651979115507896778e-01,-8.536802956264306907e-02,3.022890426515831286e-02,5.043029699816722333e-01,8.926721754021043065e-01,2.335191622134535905e+00,-9.741306694656891307e-02,8.036621677810885933e-02,8.160067986366874582e-01,3.742123660460047407e+00,1.637041956106516150e+00,1.652278449871998345e-01,-4.057906288557855956e-01,-4.187106163531570946e-01,1.474484832981061810e+00,3.123115178740110132e-01,-1.270729679600374196e-04,-6.518960980547672257e-01,1.240416304545046478e+00,4.517794356203006512e-01,-2.959342239764881088e-01,-3.047547851866660301e-02,6.951079649737258448e-01,1.024037712445450943e+00,2.337520112335136901e-01,-6.816929352375409312e-01,6.530869693428168477e-01,-3.580645703585085687e-02,5.298933987895962927e-01,2.073609478035797871e+00,-3.815321742791115689e-01,1.273628294401254191e-01,3.812475116764452165e-01,-1.977612109516766192e-01,1.041645020813906086e+00,-3.627489254563449061e-01,5.042735377930469554e-01,-9.126065489013891474e-01,-4.419741447987708960e-01,5.003396037833024446e-01,-4.182580099990368394e-03,-1.859710023342685536e-01,1.670140049555507877e+00,7.509024491231652831e-01,-1.081965488403047404e+00,3.965382111413979782e-01,9.640655151055192995e-01,6.963851122054153242e-01,-5.434616945512105168e-02,1.398090987278746811e+00,-5.548811666066835180e-01,7.271688506906586191e-01,2.831654695183449810e-01,3.617150694085745077e-01,-2.894585273792503188e-01
6.546508132338713093e-01,1.098845870478200260e+00,2.827667375655391613e-01,-8.305079306812874762e-01,3.351597010679235877e-01,-8.509744384814121876e-02,5.916273132792408962e-01,-5.343930505880003512e-01,-6.363561552040308822e-02,-5.029541830152886583e-02,9.575087056402453722e-02,-7.227338236992600362e-02,-4.452480586574114052e-01,1.230040159552124451e-01,-2.690204436627439133e-01,9.138810051616094166e-01,-6.323637867876288343e-01,-4.539225651068788669e-02,-3.833199097172644565e-02,3.417600825037793444e-02,-6.813929559441956885e-01,-2.166488713843964797e-01,-7.111766431875505834e-01,3.117199345654894094e-01,1.752431301198822622e+00,6.103723815148938137e-01,4.138438871102084748e-01,-6.586760287243395018e-01,-1.385912510060037128e+00,-1.276283457461779181e+00,1.575360510331027530e-01,2.344708556967310731e+00,-3.644177312830688686e-01,1.770029411825797538e-01,-7.335544504576573255e-01,-4.759175938297435238e-01,1.411419786732524217e+00,8.930883691336057861e-01,1.945896630257454962e+00,5.857855329973176151e-01,1.760052479894179123e-01,4.715911045095553811e-01,-2.189676216687272969e-01,-1.371014495332931182e-01,7.797130612415077433e-01,1.063304430745850127e+00,2.148325004017681117e+00,-1.143005018968020203e-01,-4.662465091275326545e-02,9.348989124179580834e-01,3.216761138523267949e+00,1.572315159580768285e+00,-2.820967150280111468e-01,-2.580508812980417677e-01,-1.885155729058335949e-01,1.381029271035470130e+00,3.679867699089395261e-02,1.456642774727194001e-01,-6.423184143418785297e-01,6.182141475444136169e-01,2.056782978802228490e-01,-1.009514815229239082e-01,3.016828041684743722e-01,7.282890967774413582e-01,1.428322244266191365e+00,6.706292571914890255e-01,-7.335862404131575643e-01,5.246100620404310355e-01,8.521646525098892921e-02,9.196264125084343544e-01,1.469722821585671468e+00,-5.635017228104515219e-01,2.883481892679407022e-02,1.959491885862594818e-01,-3.098184869305345424e-01,9.088408326733011799e-01,-5.201569306256983438e-01,2.149148112871144822e-01,-1.130355933740680996e+00,-3.504119744503580436e-01,4.464530761852091856e-01,-3.894248481023351860e-01,-1.754914879025137042e-01,1.941131281294298461e+00,6.343597904649704855e-01,-1.052897183370830048e+00,6.771859174612431254e-01,3.893909185659834016e-01,6.623809243973158845e-01,3.280857706083957770e-01,8.977693353548306110e-01,-8.737449019409443407e-01,6.092850547740591427e-01,2.986374344658769830e-01,1.409054749108957783e-01,-1.836082494466699799e-01
6.752059956664713258e-01,1.148799499500324117e+00,2.266292678183620679e-01,-1.186912376393660207e+00,9.445284422055898188e-02,-3.675824801335579317e-01,-3.807249356332728651e-01,-2.315441421713929915e-01,5.161017985586220380e-01,4.608895063379057633e-01,8.709937342937117410e-01,4.802175094819852164e-01,-3.259563455982027458e-01,-3.687029593556982732e-02,-5.819290867812557666e-01,1.920187420114753962e+00,-1.056918941781993526e-01,6.242249557164314400e-01,-2.036092531416595075e-01,4.506085451035750367e-03,-5.554038617204885009e-01,5.276176250871386086e-01,-3.771325571948417332e-01,1.348973717717350251e-01,1.847785047817514847e+00,-5.446507802954971694e-02,5.707113459608974537e-01,-5.729213671584377776e-01,-7.831311388199085899e-01,-1.240464828213787118e+00,-1.619738703039165229e-01,2.378844979534683990e+00,-7.886616920678051201e-01,-1.009538728416310427e-01,-5.234650889021636999e-01,-5.112943213819591826e-01,1.170436165220583469e+00,1.325603036606570750e+00,2.350579657545175838e+00,1.813836207822224544e+00,1.336221324347887651e-01,1.536975649740671690e-01,1.922232719341243623e-01,-3.029742354384222236e-01,2.839056995925958171e-01,7.173493848335941170e-01,2.780572574554649901e+00,-5.521242644116389764e-01,-4.549786210031054323e-01,1.643556114561912418e+00,2.918143287124714824e+00,1.228009525570181282e+00,1.004361081569349334e-02,-4.391841959261476580e-01,-8.770244377178985085e-01,2.012498185273253526e+00,1.290687195012379274e+00,3.845619343375491495e-01,-9.394088860880281944e-01,1.665683795937029643e+00,5.765180231492829099e-01,3.668467769865229045e-01,3.392892971201817431e-01,1.883762631637639462e+00,1.390459728805089723e+00,3.139078087829375030e-01,-7.354733360702870870e-01,2.317326190973756361e-01,9.950164114072709287e-01,2.206760303660670886e-01,1.919112631839786642e+00,-5.955350364223834791e-01,3.367107232775606307e-01,-1.066895534741712226e-01,-6.874127782057841696e-01,1.103043777821268945e+00,-1.736011260861034800e-01,1.496838698193561301e+00,-1.238418593290044667e+00,2.282178791976708920e-01,6.301953753551433612e-01,4.811309857002005197e-01,5.256388799341260576e-02,1.581589453414245394e+00,1.499659911639541932e+00,-1.236627341623513621e+00,5.804139812417723476e-01,1.000025116636200417e+00,1.827185397392883104e-01,7.182102262636256285e-01,1.674164980086188415e+00,-5.836344103329363930e-01,3.049538815042848183e-01,-1.181945232061470397e-01,1.672816148313413409e+00,3.670091965705568615e-02
9.084947630214814662e-01,8.879596287385989051e-01,-2.260651615437102580e-01,-6.431729959661639517e-01,-4.327675013609963428e-01,4.445899515291220627e-01,-6.057255713071030279e-03,3.254403648098997404e-01,1.642714586669324017e+00,4.699739942905627466e-01,5.976835381903089495e-01,3.090282135322237611e-01,-3.939410116156296660e-01,-1.324269881451863307e-01,-5.349913372687178370e-01,1.996753672054494277e+00,-9.953126576273396697e-02,4.150528066635958413e-02,-1.338370679524902018e-01,7.082431778689389501e-02,-6.629429706850697990e-01,9.149126378008772820e-01,-3.420984369686375093e-01,2.795188759903480258e-02,1.680097015638136737e+00,-3.893741456736368178e-01,9.338618345787114139e-03,-6.362262668558832379e-01,-9.277446322653772892e-01,-1.103345688016436732e+00,3.067807738179769705e-01,2.571867392360206228e+00,-3.469113344714752079e-01,4.639051657483286850e-02,-6.600520194638754834e-01,-5.796491430439723036e-01,1.809266896761394738e+00,8.657328391475087592e-01,1.921937577810583830e+00,1.522345786107759169e+00,8.857623152701317171e-01,3.393640642421225095e-01,2.955138922099136978e-01,1.244513388642491114e-01,2.425537157926866971e-01,6.059017811422509059e-01,2.827369297964524186e+00,8.807946382567856392e-02,1.329231706781483224e-01,5.681872063445927434e-01,4.252736574829199867e+00,2.016275445116406662e+00,8.919339012149043455e-01,-3.602780065284228450e-01,-6.275374650627467688e-01,1.666758611369119958e+00,7.250044779169512177e-01,-2.760559821817915038e-01,-1.003919849262320252e+00,2.417216816097472964e+00,1.695010014382107300e-01,-8.965202849674264174e-02,-1.203074474209576972e-01,8.064439279818903517e-01,1.026408460498904107e+00,1.536238628068977985e-01,-4.461529544181666029e-01,7.924063946410851988e-01,2.514148594277902937e-01,-2.170586937512726244e-01,2.652773087735909474e+00,-1.948640438275050235e-01,1.206462433095066289e-01,-1.006825220716169589e-01,4.075276513552077151e-02,6.479222250570026986e-01,-1.953902428398942570e-01,8.503194035359464831e-01,-1.302220343740727815e+00,-2.290563611140779832e-01,8.930650140131597414e-01,6.352573279886561952e-01,-3.804752375118234387e-01,1.520669800942348271e+00,1.145742028758506947e+00,-1.332991090745192952e+00,3.757661203273965356e-02,1.453805087351660585e+00,8.161510253020476391e-01,-9.555237210569977879e-01,2.217517049075677704e+00,-1.705069849041158658e-01,1.068600738698789021e+00,2.115243863152199422e-01,1.947265602998378142e-01,-4.836408604803394962e-01
7.710284712386074046e-01,1.524952670054152470e+00,2.625512158961764153e-01,-1.132529386165827656e+00,2.152387047256251740e-01,-4.185353035009911626e-01,-3.077950761312324146e-01,-2.215717681303716324e-01,5.557807438875357331e-01,2.054184736577876202e-01,4.649885708750861602e-01,3.879412365527344919e-01,-3.728947724593174584e-01,1.115923202573031320e-01,-4.316846227378100531e-01,1.635495840109135957e+00,-1.306899927571090747e-01,4.286525554750861833e-01,-2.060915218669832349e-01,9.606342647218608921e-03,-6.079715176310827029e-01,2.201734191618881231e-01,-5.514160648475717741e-01,1.741755325265594567e-01,1.775175661036683339e+00,2.422255276513855249e-01,4.847993259457203941e-01,-5.516620774873536304e-01,-8.721861914987403264e-01,-1.197078755268889294e+00,-8.435948297773249172e-02,2.247208877513175995e+00,-7.023161696155759692e-01,-1.196704636078985695e-01,-6.513823348761265120e-01,-4.969366887009150080e-01,1.336062379233217579e+00,1.160658352622852885e+00,2.003547504774908727e+00,1.267710396220576907e+00,1.406713886476327335e-01,2.021228058345509726e-01,1.051597783639857536e-01,-1.512583808844635835e-01,4.529471570639188593e-01,8.679438644893419097e-01,2.731254822570984953e+00,-3.179241816902998452e-01,-3.561611729743651700e-01,1.673442633057178330e+00,2.961196849385370200e+00,1.159614528737936023e+00,-1.484753647259506870e-02,-3.399984349845101006e-01,-5.172138941253685562e-01,1.665739779067147541e+00,7.344055106813578426e-01,2.997506511049199407e-01,-9.740437617460521169e-01,1.000580765842537190e+00,4.006908867218639259e-01,4.632848816291746941e-01,4.213946982774142702e-01,1.513179764174485964e+00,1.418321470426348485e+00,4.353083382806481327e-01,-6.367894753691764054e-01,2.249580311407368138e-01,7.333683220448001805e-01,3.536178611316333487e-01,1.834844412125522517e+00,-7.059507136632638957e-01,8.638449346279920837e-02,-5.020675519813552756e-02,-5.571415481075834286e-01,1.046271258444787300e+00,-1.326162399518028279e-01,1.078178337191428415e+00,-1.204825983039882420e+00,1.383496828325707639e-01,6.499078732725002139e-01,1.459013161730387531e-01,2.391759645983015936e-02,1.558363723752399066e+00,1.207792854119835724e+00,-1.041399750245010525e+00,6.458834921178302491e-01,7.106361983234396051e-01,2.930034804694461870e-01,5.993893544591784028e-01,1.446508459735380114e+00,-8.806620013854803419e-01,5.842614361944129531e-01,-3.194291765190676591e-02,1.084239269334743572e+00,7.813471331612253934e-02
8.001068597084144418e-01,4.186098868920616889e-01,-3.562773383645523317e-02,-3.402244770393245132e-01,-2.356141169887294717e-01,4.455199644055520269e-01,1.252988328533673479e-01,4.564968592384910373e-02,1.149211468743977393e+00,6.019453338851080693e-01,8.155799572131186004e-01,1.232746064759178140e-01,-4.219518940166562260e-01,-7.093795710328247572e-02,-3.085016832399056219e-01,1.921930175524484419e+00,-3.949652494887472276e-01,4.769673008441924211e-02,1.581969398435875140e-01,2.485422823854715468e-01,-8.439324309207524299e-01,5.931960312343044217e-01,-2.835429657132916836e-01,2.100149996180571965e-01,1.416615384221437290e+00,-7.073867938779088149e-01,2.397974818442031308e-01,-6.648313970567959474e-01,-3.420599001190656185e-01,-6.481317542672256904e-01,4.239026756274886232e-01,2.601191015620813562e+00,-2.078546757279234880e-01,-1.750423347046641820e-01,-5.010841470496301131e-01,-7.066603929944343943e-01,1.251821219193497647e+00,1.197138602826652187e+00,1.731548416327090001e+00,1.768522440168393661e+00,8.824929116384190309e-01,3.160907680725993929e-01,1.915117948831280281e-01,1.023599116249331864e-01,3.114491421176601715e-01,6.422024552669705066e-01,2.731226744072465795e+00,-2.231821339097406487e-01,1.485536375808714782e-01,8.270690698744684877e-01,4.079297674098472548e+00,1.570728867522370287e+00,6.069958246257836088e-01,-5.605545477462742232e-01,-8.796413792055526315e-01,1.713486638805335360e+00,7.872655831317573183e-01,-1.889332756639565680e-01,-4.754729883559342674e-01,1.969315794851497659e+00,9.923152410513608190e-01,-4.230286986989785225e-01,-4.574145189608956885e-01,9.788144522051719365e-01,6.732483657029137980e-01,-1.675468491905870994e-01,-5.167007144242898864e-01,1.074361560975056751e+00,-9.679095032759828243e-03,-2.230137979099461321e-01,2.748470530653141175e+00,-2.859239434325764884e-01,3.899880726327731861e-01,5.329974756771063138e-01,-1.437524917162206484e-01,1.282728556362524586e+00,5.979892614907944548e-03,8.940152979452979931e-01,-6.999048695421936639e-01,-3.979802620617545195e-01,2.820945727837451678e-01,4.545183058098770101e-01,-1.663727329126292176e-01,1.391767257472341424e+00,8.462237149224489663e-01,-1.078104246448839731e+00,8.899717320594893732e-02,1.965857894870950640e+00,6.551728302751689270e-01,-3.125192998806445299e-01,2.111271758442210711e+00,-1.696050091073043053e-01,8.567644851175846288e-01,2.983454191187622229e-01,7.377968473612885880e-01,-2.866752155336625973e-01
8.592818379437384690e-01,1.234165446949180067e+00,2.530119734361216954e-01,-7.900986279916397681e-01,-7.832494930305732017e-02,1.035411924586608357e-01,3.926704948011139340e-02,-1.373652135606850955e-02,1.511796522057721415e+00,1.512254412458466091e-01,-2.189842444219654571e-01,1.165932797182807068e-01,-5.327501096777363943e-01,-1.405253636475957135e-01,-2.004290202980316682e-01,1.176489147693543735e+00,-5.815727036077360523e-01,2.192253759919513545e-01,-1.595365482518457667e-01,1.892227673764287355e-01,-9.142033350730536245e-01,2.848097274366087062e-01,-5.270970931842005047e-01,8.748660041979129665e-02,1.681944550253858361e+00,2.721247130256523872e-01,1.696420212408353834e-01,-6.729047804166109481e-01,-1.367564138137413510e+00,-1.150969387930239396e+00,2.441397285606133893e-01,2.656970648662609680e+00,-4.452517208389668024e-01,1.672210484116634643e-02,-7.339677766699272965e-01,-3.454044973637731553e-01,1.832232626445189361e+00,8.169468562501596143e-01,1.614078491765408074e+00,1.009405866374553762e+00,6.326671313559214527e-01,5.703605699300252629e-01,1.951171416141175841e-01,-6.212000260298160270e-03,7.783032058465370051e-01,8.460097166386856271e-01,2.745783008657503466e+00,1.428596895023906133e-01,6.405426854307347262e-02,7.732197258348949553e-01,3.600558063338744397e+00,1.793843465664368919e+00,3.855274915248921297e-01,-1.317397810647721323e-01,-2.925665657293620714e-01,1.394021380990574377e+00,1.038915548076030093e-01,-2.595221644872184319e-01,-7.929428261991633420e-01,1.284779562835395073e+00,6.667056367376786308e-02,1.897319821677201368e-01,1.665392992797896932e-01,7.624439272316920757e-01,1.498783150667913677e+00,7.441885174415941995e-01,-3.124705747600641792e-01,9.866155353935770478e-01,2.227683339658535211e-01,-1.900253586893269064e-02,2.014934791466160391e+00,-5.443592868207807189e-01,-2.792496665624007168e-02,-2.302458852800705336e-01,3.327635352017105363e-03,5.760995363342772402e-01,-1.413379096010205782e-01,2.175606737915050659e-01,-1.473441030986359257e+00,-1.333114854809408500e-01,5.504906478903224265e-01,-2.079103154925118768e-02,-3.795773016537139499e-01,1.798976886082509052e+00,6.937473469345403210e-01,-1.099251815621833606e+00,3.509341609766484238e-01,1.038029375430275847e+00,8.352121409250933270e-01,-5.644041205572993825e-01,1.677838829163765144e+00,-6.756858372373014676e-01,1.199166307265842502e+00,3.666257541281401355e-01,-4.565686009691486968e-01,-2.563544157342889651e-01
1.063751427971194374e+00,6.302912487457359436e-01,-4.187378942168407669e-01,3.200810845426615980e-02,-4.677018940545862868e-01,7.754216184939966006e-01,4.904821481330229327e-02,5.126187681634267745e-01,1.755857881056133607e+00,5.919530540169333221e-01,9.024776717298155226e-01,1.647855508724796469e-01,-4.017523188095514786e-01,1.370212353257608262e-01,-2.837246953662386773e-01,2.341955963320693002e+00,-1.228938835783938144e-02,-3.953915977726318309e-01,2.385340304270205936e-01,2.508234571350510533e-01,-8.213341166057558373e-01,7.655047514694277577e-01,-3.192510252766929124e-01,2.016968450016644043e-01,1.163733430687807102e+00,-1.099323737193138806e+00,-9.154154033635084065e-02,-6.010552860791280594e-01,1.785222400764354678e-01,-3.119320658132631596e-01,7.014008307199199876e-01,2.390947740331194726e+00,7.005950739395006011e-02,-3.171627060323902181e-01,-6.003984457049342804e-01,-9.259491466367669732e-01,1.483381596519469658e+00,1.039677096407047863e+00,1.235628248399926132e+00,1.555920121597366368e+00,1.323790867016715334e+00,1.848346885658208039e-01,2.530805798068362922e-01,5.568112490871661713e-01,7.576131021501025797e-02,5.975958167569901391e-01,2.913563268891817160e+00,1.273468938576828302e-01,4.433630195528494577e-01,7.084792076464899724e-01,4.918599818291912840e+00,1.596640110927748823e+00,1.236571931185208140e+00,-6.465872851274526711e-01,-7.041883437960765324e-01,1.390706872675355310e+00,4.781045325694496251e-01,-4.736826632423430938e-01,-6.327044676038257043e-01,2.030047537872672780e+00,1.022132327954176745e+00,-5.479889627324595613e-01,-7.753879817348714454e-01,4.293121433539484055e-01,1.263591108950365971e-01,-6.581699910080951454e-01,-3.503078310482640179e-01,1.117909308953604075e+00,-4.937309806747176566e-01,-5.326785110702829673e-01,3.499865410735304661e+00,-1.466492596646881419e-01,1.637649807170639127e-01,8.416828636607074365e-01,1.778798522318478792e-01,1.361618226627540729e+00,2.352393590413632274e-01,8.217082837797715644e-01,-3.684737489773510788e-01,-6.396265942545873440e-01,5.034134623859582991e-01,6.068979636907222419e-01,-2.145473380098792959e-01,9.546393290326102843e-01,7.109252414099350714e-01,-8.934319835632635876e-01,-2.202984525371747826e-01,2.290764134869155200e+00,8.373127738699313038e-01,-1.030829385500672268e+00,2.511316674337435551e+00,-1.098852234164406361e-01,1.366112889756414095e+00,3.435533582228617044e-01,3.369318952636046749e-01,-4.036490297593686716e-01
9.435629599668737821e-01,1.649107918714425747e+00,-2.867433035192771817e-01,-8.171028924916267089e-01,-2.630456290499058603e-03,1.255906265521399834e-01,3.493740093176586070e-01,8.073442073535697094e-02,5.729241675684253465e-01,-9.418496957192343255e-02,3.409165811119719280e-01,2.105023519629787843e-01,-3.346647210502211034e-01,3.220203903183531668e-01,-5.583681317363320407e-01,1.596991039753864472e+00,1.338963887039502643e-01,-4.179122818301095887e-01,-2.071483457487578450e-01,-1.812812874451229239e-01,-3.810753992405900292e-01,2.802918927063811627e-01,-7.635736172406618616e-01,1.761929427643729729e-01,1.777310143393596942e+00,4.075596789344715365e-01,4.329828875270086419e-03,-5.443168767338886216e-01,-1.209079199541071459e+00,-1.366663537236519010e+00,2.251953489343227477e-01,2.014372926982144207e+00,-2.826138684811246304e-01,2.147612271583107801e-01,-9.093971852597965144e-01,-6.481761319567557189e-01,1.911270964753484014e+00,5.915795551578501010e-01,1.854340030305358100e+00,3.609914196018583210e-01,4.623699939796806491e-01,2.385900803312572815e-01,-1.014430215390873524e-01,2.482768915175723179e-01,3.369056841448876405e-01,9.614016463843350069e-01,2.368323983867548943e+00,2.960284242467335902e-01,9.504641145404620073e-02,8.121625486361129242e-01,4.022704537684854031e+00,1.833803453648725323e+00,4.549616170964304596e-01,-2.720667643465232710e-01,4.196483217819346745e-02,1.194433145510674255e+00,6.366799367411024591e-03,-1.376931013068763421e-02,-1.281091135012117244e+00,1.165573013011481418e+00,-3.226864860532436818e-01,6.062800857692018930e-02,3.149041729690920111e-01,3.200007611547378006e-01,1.133911470319213244e+00,3.173835270278130283e-01,-6.606676232174292229e-01,8.960307915725873595e-02,1.444681932469454866e-02,7.522387199336628694e-01,2.088660767807068108e+00,-3.420688517376515025e-01,-3.170414597595614947e-01,3.292143007440960500e-02,-3.346451408453682969e-02,6.075793156854504273e-01,-5.135396367811013718e-01,4.596244428563202034e-01,-1.222085045131588110e+00,-3.790091837432006949e-01,1.214195305521013957e+00,4.465934031302863649e-02,-2.813614078082574133e-01,1.567389135785816734e+00,9.780012295807912759e-01,-1.134758649067007852e+00,3.971117874168416662e-01,2.296367774375009940e-01,8.011317772666723958e-01,-5.518245793566001201e-01,1.342200992086717504e+00,-7.788724282623017414e-01,1.006533333771668204e+00,1.345713812974832779e-01,-9.767821845410304404e-02,-4.019552546960944439e-01
6.661569207954972649e-01,8.751375273347229422e-01,3.798306465509433960e-01,-9.204375793447968634e-01,3.724619105239763972e-02,-2.777331392611465111e-02,1.192717560638791308e-01,-3.043218887127649430e-01,9.030779684823776465e-01,2.891015747606434649e-01,1.156076114002140831e-01,1.134550683237718904e-01,-4.908285546138633770e-01,-2.229120427041601515e-01,-2.910278705833397872e-01,1.182612534739831522e+00,-7.089264434381741253e-01,4.336088974046581335e-01,-1.241946700381932889e-01,1.718052881404587562e-01,-8.561602583821902313e-01,2.770727949415591751e-01,-4.399897479070039030e-01,1.360777231015648236e-01,1.784597514857543699e+00,2.338325916513818437e-01,4.125549167462724265e-01,-6.999512390506623660e-01,-1.373933185394528911e+00,-1.243830565189669279e+00,9.662144980681425244e-02,2.725261879032364387e+00,-5.611261782368659468e-01,6.383531645774667695e-02,-6.026098184342855157e-01,-3.352800489122438332e-01,1.487905717980114728e+00,1.037934648872878451e+00,2.025422468024841383e+00,1.366308949288439711e+00,3.854370931770293995e-01,5.419291218017749934e-01,1.343059695470702475e-01,-2.686754972923922069e-01,7.430081497464161577e-01,8.159146096825719008e-01,2.597449548709061418e+00,-2.141311166979186498e-01,-1.238210301752901560e-01,9.014800049886843025e-01,3.193683316621203971e+00,1.694593463107385567e+00,2.876127708038506148e-02,-2.243056854466826122e-01,-5.849782465902557682e-01,1.715310661136433934e+00,5.555352845999503852e-01,-8.826875047842352995e-03,-6.362549119380909168e-01,1.464658391105723823e+00,3.131238096991769138e-01,8.782611185426603129e-02,2.077742731353687256e-01,1.204345825831441674e+00,1.585364414557612900e+00,7.502896627205430935e-01,-5.239285030654848851e-01,8.920297440240220199e-01,4.916781527319383782e-01,1.853596820699524583e-01,1.740135668449878992e+00,-5.453864690777038282e-01,2.410414204622421397e-01,-1.871648939104525733e-01,-2.818056531187084768e-01,7.543077257311583406e-01,-2.770355447104708713e-01,5.365493014687110485e-01,-1.438470748619126827e+00,-5.435258322462138691e-02,3.763854719263383664e-01,4.862902195184511112e-02,-2.618512734932603170e-01,1.942432763401100937e+00,8.833731188294621228e-01,-1.225828954737186560e+00,4.876692856665810205e-01,1.043654578557807300e+00,6.339633294140067932e-01,3.180784536806285923e-02,1.522996036630153815e+00,-5.645398170525921522e-01,7.120226276432802814e-01,2.806386140155847086e-01,2.730982236751228753e-01,-1.887067127270779243e-01
1.088301486715705702e+00,1.708542290353946891e+00,-2.927582372464882510e-01,-5.884076036099804563e-01,-1.985389197132381156e-01,4.326848261019672348e-01,4.523159569669786828e-01,3.224734797333170810e-01,1.461337037508768866e+00,-2.039140175872209693e-01,-2.880826836338969410e-01,6.169406414832638574e-02,-4.613184802828438347e-01,2.065234702447020787e-01,-3.474336079819448364e-01,1.280480173193418114e+00,-9.885428316075250965e-02,-5.812057303623140436e-01,-2.079466166251807968e-01,-4.975839354949738308e-02,-6.194633311639657913e-01,2.807328618760294159e-01,-7.961039105172521557e-01,9.957027816005406540e-02,1.671452578211371165e+00,4.845228156713740630e-01,-2.692218742867560355e-01,-6.007769701224714431e-01,-1.503774924664827317e+00,-1.287246422454109585e+00,4.654626424639635163e-01,2.232938856446818221e+00,-1.122870339286440589e-01,2.427481549578457132e-01,-1.018851870708545215e+00,-5.373606233965942947e-01,2.356907406901565416e+00,3.047545950525349934e-01,1.394698573420741106e+00,4.266531314969745914e-02,8.407448172503093620e-01,4.781194910699894107e-01,-4.637586588424530420e-03,4.398076760722737233e-01,5.863259394995540275e-01,9.741488072849470159e-01,2.484520806353716971e+00,7.228654586164519058e-01,4.011089900414024356e-01,3.009395545889259060e-01,4.494617199883167658e+00,2.193756862629526072e+00,8.198174249830423310e-01,-8.680907362507653269e-02,3.195807297207202691e-01,8.752037334287241510e-01,-5.952483525272144194e-01,-4.507972252558835047e-01,-1.238587414358975680e+00,1.146151724100483715e+00,-6.198803217744295324e-01,1.837344106912985886e-02,1.804637269684377376e-01,-2.721388160622093544e-01,1.191925073998240769e+00,5.456881476062750425e-01,-3.440927371375991362e-01,5.956849477671177784e-01,-3.699728420401637297e-01,4.071868202570588791e-01,2.281736292097415575e+00,-2.990556402796440971e-01,-5.181842382818399040e-01,-1.219076375519730637e-01,4.079968805911452501e-01,2.550233775420744919e-01,-4.131018882589345131e-01,-2.074756302834213084e-01,-1.417380531450305181e+00,-5.289364326921843773e-01,1.201085358425781013e+00,-1.225807014834671138e-01,-5.587564249021781393e-01,1.644628169370823123e+00,5.707765580876733580e-01,-1.078562660943937157e+00,1.909902499131554687e-01,4.121164621618531587e-01,1.189456142978629227e+00,-1.449909675012652110e+00,1.535171336558888155e+00,-7.664650678108405613e-01,1.612587975414382147e+00,4.065116293106315060e-01,-1.352315893793489598e+00,-5.826382971196337746e-01
8.361234408005296936e-01,7.266687701452808623e-01,9.911149349078042514e-02,-3.982575295267155591e-01,-9.395791139437033312e-02,2.950786829050501270e-01,9.951870011037317054e-02,-1.840326406388919506e-02,1.154047515440014937e+00,4.182094958506736848e-01,4.589967799043416785e-01,7.590497260297666970e-02,-4.682968898386226653e-01,-3.964227837673375832e-03,-1.815533430151064498e-01,1.640991089577846118e+00,-4.777586760019186252e-01,4.568617625856480347e-02,1.267255503909696102e-01,2.672469259098931849e-01,-9.111651638202287184e-01,3.292141791768518622e-01,-4.018586902324569610e-01,2.302509142645208784e-01,1.401668427052692456e+00,-4.120301368095423133e-01,2.512575600534748821e-01,-6.539774307656026631e-01,-4.758605637204651462e-01,-6.585445702703593973e-01,4.101298058278439185e-01,2.546466088418732454e+00,-2.313678919136443191e-01,-2.034167509783653682e-01,-5.747563350042654839e-01,-6.389709041735205375e-01,1.330745915277969038e+00,1.126799988220493098e+00,1.525456899440572833e+00,1.435057241672332395e+00,7.987229525236196892e-01,3.713421756998230294e-01,1.471559833231258496e-01,1.274270521165618009e-01,4.942434561889418876e-01,7.590029432815569299e-01,2.725189349417496132e+00,-1.228535507799919935e-01,1.393956310659022479e-01,9.575405822507720988e-01,3.893567712452098650e+00,1.454912966889895465e+00,4.741472863065988586e-01,-4.604447847662873627e-01,-6.519471859224403865e-01,1.515811914464172849e+00,4.421425142362198635e-01,-1.961552472384694157e-01,-4.814227672618778264e-01,1.412265652663337256e+00,8.776617837154432333e-01,-2.510673213167332052e-01,-3.155400637449622403e-01,8.722128166664356863e-01,8.230827574791177437e-01,3.175382652408142992e-02,-4.414719855963938899e-01,1.067808523212170346e+00,-6.347109836191291987e-02,-1.322245710819238695e-01,2.552281264233714264e+00,-4.366980232790795280e-01,2.389619195396639473e-01,4.880163780820496733e-01,-1.239294088804658855e-01,1.236736655989969957e+00,5.200685512081826278e-02,6.230147671050104696e-01,-7.515940070386646354e-01,-3.662653609046268577e-01,2.397188358449918177e-01,1.794705182955788625e-01,-1.619169126737822761e-01,1.431410765450095823e+00,6.636628690366036532e-01,-9.400032384246177486e-01,2.072290815691722743e-01,1.716051987211233865e+00,6.742105460221571311e-01,-2.296682305938030910e-01,1.897170553094412515e+00,-4.395899705474145547e-01,9.973484227417183101e-01,3.402922767112724900e-01,3.963595518815247742e-01,-1.897427360917214867e-01
1.185969834364715592e+00,2.129018362959407717e+00,1.437307880519003711e-01,-1.023293331703932108e+00,-3.269868016918427434e-01,-1.137884232010635821e-01,-9.486743526004959293e-01,6.106454497533387871e-01,2.900948505747828143e+00,2.055036654541367580e-01,-3.868917331043807972e-01,5.748334662164497066e-01,-5.288512068399512378e-01,-1.113068592250288230e-01,-2.534384525060790483e-01,1.763336797765227892e+00,-9.033478228665514642e-04,5.073466010926166447e-01,-4.216782071181831570e-01,1.812345907380832066e-01,-9.259396430394105648e-01,7.181780798465438043e-01,-4.817347980749732139e-01,-1.354996771689134516e-01,1.649278691585392531e+00,9.067549984070413793e-02,-4.098942409251132846e-02,-5.485315542275817080e-01,-1.058052678189719709e+00,-1.070895141486573054e+00,1.361442214508970516e-01,2.538208279414160273e+00,-6.988567776926510877e-01,-2.823067861518278598e-01,-8.243342207452731829e-01,-3.030357384862404913e-01,2.242843523031880171e+00,7.769118352277321060e-01,1.234002907875487942e+00,1.223182574652478483e+00,8.440121329731979927e-01,3.942673600732528594e-01,6.013134908749352414e-01,2.291571805202313739e-01,5.724937585631690862e-01,6.995453862760916408e-01,3.496124505260190585e+00,3.871406487383304285e-01,-4.747024258116296080e-02,1.303855996716509091e+00,3.726089326479030017e+00,1.578670790964191273e+00,1.021444524533856590e+00,-3.523541497380361376e-02,-2.322312553925162670e-01,1.304899548738067905e+00,2.264955016682783373e-01,-4.092814931928587807e-01,-1.337614498701013233e+00,1.454907862387559980e+00,-1.741752839784581897e-01,9.470008756275214434e-01,3.326712499409003598e-01,1.036019711505143048e+00,1.551079210957324150e+00,6.747033603966634541e-01,5.420170207054797462e-02,8.168571794717367496e-01,6.299859433428794953e-01,-8.036809396435882213e-01,2.559187959154727299e+00,-7.081026399093397483e-01,-3.104387864790913998e-01,-6.838456021839338650e-01,1.057274847880297214e-01,3.685750473549762596e-01,3.558747478696612787e-01,6.169236984267290058e-01,-1.751114458674599028e+00,3.149593486676438570e-01,9.842051277288457189e-01,3.867646243710638476e-01,-3.671632130364173019e-01,1.356779924385293823e+00,1.044623123307436341e+00,-9.869945231820002052e-01,1.953040179120960063e-01,1.235972363632419357e+00,7.336891471148392352e-01,-1.034718865446963676e+00,2.355082463789394343e+00,-8.432460716123102440e-01,1.758837081421743553e+00,1.531348402480423865e-01,-5.324946249587025893e-01,-8.858886491296624754e-02
9.144877540382134740e-01,6.397002086482557193e-01,-4.981349023040902435e-01,-3.761707153660115988e-01,-4.143231831623041539e-01,5.556137871418076468e-01,6.109235380778155200e-02,3.527008315517975445e-01,1.078319419310651117e+00,6.298372025873130164e-01,1.347314646105839619e+00,3.424010969053962739e-01,-2.751938266195329552e-01,1.169359735588978016e-01,-6.412902369593125318e-01,2.544553023265582858e+00,2.325705812547558815e-01,-2.354953451342240989e-01,6.772292787315456475e-02,1.826424118393317475e-02,-4.914424903698846325e-01,9.688117840053790397e-01,-3.013484000399130336e-01,1.629013929339223066e-01,1.491765888343584257e+00,-9.139525742699655675e-01,4.944272244788193438e-02,-5.732751879364309522e-01,-1.246087918886137347e-01,-7.728010662926290131e-01,4.014618823953733928e-01,2.278561478168343424e+00,-1.650309861186678440e-01,-9.557508015024157588e-02,-5.737326516302521107e-01,-9.052151756926558601e-01,1.402974756000811452e+00,1.081544730645780161e+00,1.944361641257336792e+00,1.730118890310853974e+00,9.403359044285636292e-01,5.526938635699635283e-02,1.874392352914607818e-01,2.914229586797768001e-01,-1.400988410730527045e-01,5.598060872351136030e-01,2.736072176940888223e+00,-1.162977814818162425e-01,1.611511973998954184e-01,8.133289514236036188e-01,4.552270501920925305e+00,1.702878343366053038e+00,9.729090432987935744e-01,-6.750832783905338363e-01,-8.492607115280085273e-01,1.738557603713313471e+00,1.038313558776950085e+00,-1.182691864553400973e-01,-9.207101151088566970e-01,2.490812469043898858e+00,7.313543848671633096e-01,-4.292452522420503458e-01,-4.396897389969069980e-01,8.542361584560594912e-01,3.862344602732759036e-01,-5.575431284937001353e-01,-6.580573454108264997e-01,5.493452199747497211e-01,3.053819867551253037e-02,-1.015014419313710059e-01,3.106983804439044317e+00,-6.979438353927286398e-02,2.612856940948910522e-01,5.368120329685928116e-01,-1.145482652525306039e-01,1.212108240499347955e+00,-1.253892507877318319e-01,1.332112479230628477e+00,-6.511988069295102655e-01,-4.403591222037952502e-01,8.479760842564429968e-01,8.498350039560829128e-01,-1.482520039862088856e-01,1.132651821210059140e+00,1.260360738683043103e+00,-1.213771827339387155e+00,-4.848387579011359527e-02,1.764276772559774109e+00,6.296458684584756993e-01,-6.081629786249760361e-01,2.313980959596916076e+00,-2.361613516799360157e-02,8.192839688762196815e-01,8.653934480784519767e-02,1.105054984332793255e+00,-4.392297045831869973e-01
8.628861434108479056e-01,9.502994850201862409e-01,-1.597694233477781056e-01,-4.185488077176681143e-01,1.704567047296663695e-02,2.229058321019753708e-01,2.074682370602400350e-01,-2.464081223348908722e-02,4.742293079199025874e-01,3.123766848201152135e-01,8.803908048074862158e-01,1.473081501517414238e-01,-3.444246093967834321e-01,2.951548807327175061e-01,-3.677890023850644008e-01,1.932816931290979978e+00,-5.991087246036952418e-02,-2.595481125394475952e-01,1.345393953273537890e-01,7.183648668244325963e-02,-6.123863072593571655e-01,2.706485311243668201e-01,-5.249579106174294685e-01,3.144987425712255646e-01,1.420016894040508237e+00,-3.954758914682319770e-01,2.382783469385128527e-01,-5.677399727639854676e-01,-2.139018292580743275e-01,-7.018922611027396119e-01,3.698484444548577055e-01,2.140494961958707698e+00,-1.646673248680369794e-01,-1.637154492683833285e-01,-6.361123014669579634e-01,-8.427090822671274850e-01,1.224985924568045448e+00,1.106096647923725307e+00,1.659617898005183667e+00,1.160373706510378522e+00,6.419570237328882101e-01,1.315637200824477659e-01,-3.134101027076283824e-02,2.498187509987129795e-01,2.190675941557358453e-01,8.288804777280378566e-01,2.527316042021320541e+00,-1.465851804238253731e-01,9.604258894266813618e-02,1.169982092127337836e+00,4.002680448220035103e+00,1.301641884196461874e+00,4.251228560524553113e-01,-5.939257401816844251e-01,-5.371620752328474246e-01,1.445552526483671496e+00,4.833656140748472385e-01,2.491996014832678630e-02,-6.997121224072373469e-01,1.222891304018954184e+00,8.425716334535483520e-01,-3.096249228737357750e-01,-2.476540906043740164e-01,7.733708106386374403e-01,5.595696510685692626e-01,-2.946584998017984791e-01,-6.732925656885238030e-01,5.172949884953370603e-01,-1.370621899519560705e-01,3.127927014094906144e-01,2.596552349978786811e+00,-3.746235287113813262e-01,1.307892185039559729e-01,7.473728675220954187e-01,-2.498029305726363059e-01,1.419603544512583415e+00,-9.623686239508116858e-02,8.885174428767829147e-01,-4.858408206716292588e-01,-4.742612725935945739e-01,5.226604621419579377e-01,2.140662008205810318e-01,-1.520302673447437858e-02,1.236434917566239466e+00,8.456913923087751028e-01,-9.003713572503293516e-01,2.801245610963660204e-01,1.319625763454270739e+00,5.494945170478588992e-01,3.594543606849470718e-02,1.682050972650377840e+00,-5.366571662219359329e-01,7.932508670640188164e-01,1.674570947840920143e-01,8.876642935099741116e-01,-1.801089712197243009e-01
7.291614638914916124e-01,3.989001266033455062e-01,1.103072817984192405e-01,-3.611798476091624965e-01,-8.323714533132761662e-02,3.878773765948315688e-01,3.586977058502660576e-01,-1.685663144744647401e-01,8.349701068188835063e-01,4.593976644425289413e-01,5.641771159903892219e-01,-2.446195284568640493e-02,-4.624421053579724772e-01,-7.127051854013088938e-02,-2.139337957362824894e-01,1.534123920162648425e+00,-6.349084690434929623e-01,1.525030198067721388e-02,1.782932371302773100e-01,2.630008317681478691e-01,-8.948208014243366204e-01,3.173853305271842618e-01,-3.703780720157355266e-01,2.632695202774914534e-01,1.449387045058664780e+00,-4.104812881106294498e-01,3.048585786949776777e-01,-6.982743514113401995e-01,-6.121040738095457900e-01,-7.293774619019973704e-01,4.213949782564571089e-01,2.634390625861779966e+00,-1.874586811192203162e-01,-9.107222130065806276e-02,-5.300754206951929781e-01,-6.345336929350945399e-01,1.235518433401259220e+00,1.143198666278149034e+00,1.726328601882433755e+00,1.495144331990546638e+00,7.555263567049297357e-01,4.276314378801256422e-01,7.009545984365890547e-02,2.388099951489387751e-02,5.189423041965385286e-01,7.557601523764010398e-01,2.537605124161582903e+00,-2.127987690947582278e-01,1.576519184167512466e-01,7.439150495120543383e-01,3.878168212547074667e+00,1.595271913943107078e+00,3.371474227944358248e-01,-4.873809465275009689e-01,-7.379619083076759400e-01,1.621733634305144278e+00,5.279195644275023191e-01,-1.608273581104852357e-01,-3.517298417047683978e-01,1.590011990172536915e+00,9.126639667587492788e-01,-4.706071298912691825e-01,-3.648997061822700783e-01,8.563745319579593174e-01,8.397830656623452850e-01,6.426028958702278970e-02,-5.505730445208775192e-01,1.129884473551392654e+00,-1.021738939240909305e-01,3.524124743046236352e-02,2.415496849164678661e+00,-3.497633830796574861e-01,3.612562800286531761e-01,5.365744033534244339e-01,-1.515596989575150877e-01,1.237811286418895484e+00,-1.145310114925434664e-01,5.830661860378901773e-01,-7.473191241467707080e-01,-4.616485606665121644e-01,1.536056647103024586e-01,1.610003782323591870e-01,-1.919832243110805581e-01,1.586509149483435355e+00,6.461274967284078574e-01,-1.047840868789916335e+00,2.193154841265691213e-01,1.711037293136027593e+00,7.073625114612509535e-01,-1.610767269503722843e-01,1.785132073960142840e+00,-3.053530724955526576e-01,8.060491368432654014e-01,3.872068972482483606e-01,4.677699404620379031e-01,-2.757137249918922839e-01
1.126254493491208208e+00,1.961344634476409610e+00,-2.384698499716441100e-01,-8.095292850555484421e-01,-1.997444172130457551e-01,1.368922624184613079e-01,-1.391329878158039102e-01,4.333159108457577124e-01,1.686997936521774655e+00,-3.338176577305085324e-02,-1.148437470524737991e-02,3.511280330240058589e-01,-4.118759582799713104e-01,2.136142776496285367e-01,-4.334005333623652811e-01,1.714661652700025352e+00,1.859944768776791713e-01,-2.200304493696961516e-01,-2.950137813244668727e-01,-5.585860555000046052e-02,-5.792464470526217379e-01,4.838136670552215524e-01,-6.945243356235791810e-01,4.061349989933454863e-02,1.680838356047738458e+00,2.634333747792141356e-01,-1.441274714737018348e-01,-5.299995772186210097e-01,-1.117940802004249390e+00,-1.212922920800499682e+00,2.740318795646620731e-01,2.155711739974783381e+00,-3.594052546774725299e-01,2.208992828408561093e-02,-9.387313603867724066e-01,-5.530148610498036854e-01,2.193016357799331129e+00,5.503845458085874220e-01,1.459680670400278713e+00,5.225183243041721104e-01,7.377572495144615328e-01,2.889853358393212890e-01,1.784707235746763598e-01,3.822257871831514775e-01,3.942525529084558444e-01,8.670930806607550778e-01,2.836193984209621988e+00,4.996699383988547072e-01,1.457641310135147361e-01,9.000154789533976185e-01,4.174886512853190013e+00,1.812770001109633267e+00,8.667610163252581490e-01,-1.631224050186652064e-01,6.507741034564806792e-02,1.094637375928875223e+00,-9.350330572578130495e-02,-2.766799386393463678e-01,-1.391868444410701899e+00,1.265266922679334494e+00,-3.826379953366835229e-01,3.916978597861172640e-01,2.754976031669240655e-01,3.499414307813809577e-01,1.195902913687469038e+00,3.900396474210733877e-01,-3.198027250694681634e-01,3.751218857061565659e-01,9.294399455395463416e-02,9.834126787090996524e-02,2.438316072823997871e+00,-4.397134882143232670e-01,-4.351111113084734083e-01,-2.226993986287372496e-01,1.594270264852192809e-01,4.441636075330710476e-01,-1.504449241957358796e-01,4.038017107861145982e-01,-1.406151851813572051e+00,-1.882888895978951371e-01,1.245269985758727715e+00,1.789846645424847948e-01,-3.695474925809119071e-01,1.401999738526333861e+00,9.401322394542445116e-01,-1.038924756457758836e+00,2.343543399026381813e-01,6.098480731305077063e-01,8.769352166266117798e-01,-1.044940976821463696e+00,1.810797677983463805e+00,-8.151553172438724681e-01,1.497161138122500290e+00,1.728249589874515935e-01,-5.589929787416969553e-01,-3.457603028897719422e-01
7.170208550981380657e-01,6.425529709798405431e-02,-3.083511197948627380e-01,-2.545701424688940340e-01,-3.180244219810912099e-01,7.114226060563009213e-01,6.081865075437982160e-01,-7.809237307110472592e-03,6.069391402922974521e-01,6.082466688550107747e-01,1.171562687339021247e+00,3.339759348704028630e-02,-3.423128505937113042e-01,-4.364620468694815902e-02,-5.215002363199869873e-01,2.006717621033071719e+00,-3.131209556240945324e-01,-2.724731056576942256e-01,1.939676266256407933e-01,1.039724673562829049e-01,-6.221546819910724890e-01,7.257989974118518317e-01,-2.921672313778772567e-01,2.442998008824758815e-01,1.525163752225517255e+00,-7.390220118434366325e-01,1.599948346012355083e-01,-6.884753213225681678e-01,-5.216697535217659221e-01,-8.461889776600990398e-01,4.790089656766740034e-01,2.540316745448287783e+00,-5.294709493058943894e-02,8.956382193704602590e-02,-5.154319338445929599e-01,-8.110656100170435812e-01,1.271874475261788762e+00,1.069389880946344240e+00,2.099728382947608551e+00,1.655953313445030162e+00,8.808826547080860214e-01,2.928301029733323957e-01,2.704537549498120877e-02,9.599088830252415494e-02,1.402189062945810583e-01,6.288853511871091984e-01,2.375937366771805337e+00,-2.051194449099880412e-01,2.541310426071614614e-01,3.643491784841395020e-01,4.424567073149963115e+00,1.945212548827035315e+00,6.197331942563741869e-01,-6.353290988041975229e-01,-8.824817133582121276e-01,1.791536291513268653e+00,8.810577828313482796e-01,-1.486472910906310729e-01,-5.303585559692586271e-01,2.448136298042859149e+00,7.966498348254422712e-01,-8.172465442358893828e-01,-5.265838875157581311e-01,6.900083701279512427e-01,5.343864713229374841e-01,-2.974188039893238544e-01,-7.523366812963612205e-01,8.985836145613130821e-01,-1.755098349911749789e-01,1.784263792703999485e-01,2.717513129649031356e+00,-7.349839142805902892e-03,4.387092056848037047e-01,6.236357294828210884e-01,-8.900812915954731119e-02,1.178813446616521432e+00,-3.749972304237383369e-01,9.061501374155016553e-01,-6.751077163209049381e-01,-6.491244510634598397e-01,4.980669115724150053e-01,5.599627194481401338e-01,-2.516511112575308129e-01,1.519169319638510540e+00,9.541481029882117326e-01,-1.308610886169321752e+00,1.939099531686455657e-02,1.752173301279761120e+00,7.777157321244689836e-01,-5.126634685102877675e-01,1.983330803821182542e+00,9.237104230949400030e-02,6.197173227294188180e-01,3.034764871198499803e-01,7.970897127589871012e-01,-5.582509813116816044e-01
9.343995525529166235e-01,5.175408505042460305e-01,-3.294670382693293820e-01,-1.494397042009477650e-01,-4.419114701540329260e-01,8.307650774415580308e-01,4.920788108890416512e-01,2.991363588450927646e-01,1.507229607565978569e+00,4.097759679689628176e-01,5.195941878498321342e-01,1.092295817034849570e-03,-4.430828855953677370e-01,-3.383597465305657193e-02,-3.359537079978746066e-01,1.791956615146635734e+00,-3.281487964761409803e-01,-4.177662754816217627e-01,1.197150332733528666e-01,1.763108432901282774e-01,-7.896950940871315661e-01,6.765552065557784989e-01,-3.977953937288463693e-01,1.591768775619800125e-01,1.428468272854371612e+00,-5.574427961149496236e-01,-1.149612446924618558e-01,-6.839409302371598498e-01,-7.172723004363428245e-01,-7.819505802392745508e-01,6.405584088090994221e-01,2.579007100623421866e+00,3.745369949288407385e-02,4.569902957352782458e-02,-6.795788594287741624e-01,-7.193108607989204817e-01,1.756760057696574950e+00,7.759733620434826618e-01,1.559766606710196291e+00,1.201615027538675218e+00,1.167003470228385797e+00,4.303092113413959918e-01,1.343320679900482095e-01,3.482333265024871172e-01,3.349459321820740798e-01,6.823400385651057221e-01,2.588476271385693028e+00,2.548863425794584137e-01,4.729448264860782736e-01,1.596830005728628876e-01,4.781296644016571840e+00,2.113274425007543922e+00,9.884199803549509333e-01,-4.363479941513426219e-01,-4.927174712699081693e-01,1.387906277428033519e+00,2.362246529468663425e-01,-5.030508868661295319e-01,-6.696757264799705345e-01,2.149593045202697006e+00,4.205683615341771486e-01,-6.128255827785570320e-01,-5.135269139752188794e-01,1.730868189851211270e-01,6.141393764258947785e-01,-9.027779813824426958e-02,-4.208566629379248969e-01,1.157094216433537603e+00,-4.521304137178888682e-01,-1.343831218660836990e-01,2.907170386585952393e+00,-6.745242582510957430e-02,1.053792549794064365e-01,4.250483555483046683e-01,2.877910728148614927e-01,8.491275561854346732e-01,-1.958658257792963986e-01,3.540186469204154029e-01,-8.714612912691857005e-01,-6.853397121645562473e-01,6.293191430927730368e-01,3.781319381860964723e-01,-4.491241219152857234e-01,1.466230799569172349e+00,6.394362892518177244e-01,-1.161293913054862736e+00,-1.119453994914124118e-01,1.727491602515912383e+00,1.065546647937741787e+00,-1.274164950232044013e+00,2.136044281170386139e+00,-9.126661239256689262e-02,1.276865454875123707e+00,4.674210204241378008e-01,-3.411986401162711569e-01,-6.251104679886960724e-01
7.234878233445216633e-01,1.368269663009297865e+00,-1.590654963590817927e-02,-9.611775548960042048e-01,2.717713879499890628e-01,-1.442019431675868879e-01,4.353706898596920727e-01,-3.540144284609254011e-01,-2.468473133666126973e-01,-3.305216578278241668e-02,5.505074284247378769e-01,1.506231381614391851e-01,-3.170629000849991552e-01,2.934333011848530570e-01,-5.434075735858789891e-01,1.418942629915456610e+00,-1.053973140668536257e-01,-1.654585818782808859e-01,-1.352050376733033576e-01,-1.622849208936361920e-01,-3.820375469640671096e-01,3.253909047751230021e-02,-7.332281683167279906e-01,2.823544272153055701e-01,1.839103162775415523e+00,5.012618401357314957e-01,3.441117110100328502e-01,-5.688233905571771221e-01,-1.178793697235092752e+00,-1.396873492594998822e+00,5.705360538044726426e-02,2.046116416000907101e+00,-4.143576830626101160e-01,2.034935073732287436e-01,-7.759676451574634148e-01,-6.205366985929350321e-01,1.448565674344443277e+00,8.713504261053697242e-01,2.165611954776366588e+00,6.009577197210427268e-01,1.049525893191466941e-01,2.251678068290281221e-01,-2.233674059736138195e-01,-4.439765947162539750e-02,4.196983864444799872e-01,1.012755210598975886e+00,2.176189276841887121e+00,-1.197258825290354878e-01,-1.383758223717385660e-01,1.127293869155357342e+00,3.377590071774327019e+00,1.536697504968461025e+00,-1.095228305329139507e-01,-3.558068716961179101e-01,-1.950027147510209891e-01,1.448066618924452209e+00,3.264059060838970794e-01,3.047830657581840352e-01,-1.014381268119252555e+00,9.046185966872650752e-01,4.754756199947327011e-02,7.208454347366166637e-03,4.036862699115648656e-01,8.133678485008420944e-01,1.264478803121773742e+00,3.866099680118239013e-01,-8.771660432898864546e-01,1.402835635336052711e-03,2.560005216483843271e-01,1.059383839528285076e+00,1.654367271891202806e+00,-4.669797449179733939e-01,-5.638930232909970808e-02,1.765896637030473504e-01,-4.010672673934893573e-01,9.158590485300595052e-01,-6.001874051504989538e-01,6.826637715680106133e-01,-1.094770130720622792e+00,-2.890211087484567676e-01,8.769203056474238478e-01,-8.756842483834537116e-02,-8.914517771224891862e-02,1.725097738840977168e+00,1.035802380177364812e+00,-1.137519154193048276e+00,6.529701508632419493e-01,1.519224220608021980e-01,5.339575259659146145e-01,3.475593585485969306e-01,9.935391449342264591e-01,-8.398787712893502899e-01,4.816833868409866604e-01,6.582578002730349320e-02,6.655964153379423376e-01,-2.108660500341125732e-01
7.713672459592082475e-01,1.481727188978512633e+00,-1.098165984971562342e-01,-9.553130185503319050e-01,2.311424570738115358e-01,-9.810437241457781177e-02,4.602928717887275201e-01,-2.694880738545869514e-01,-1.780628084435038616e-01,-8.670316953044318597e-02,5.242277462453502901e-01,1.664276434400331350e-01,-3.054129188077250867e-01,3.360587407213301847e-01,-5.805282276579047940e-01,1.456416957306975402e+00,-4.584442129394017407e-03,-2.712353894784906849e-01,-1.668612651954760051e-01,-2.063587481339620444e-01,-3.304697708371788778e-01,6.943913605593271532e-02,-7.710663296442414882e-01,2.654191701700122641e-01,1.853081887605438238e+00,5.410741302711421508e-01,2.600048578195952587e-01,-5.544722774489639905e-01,-1.227298991822832086e+00,-1.442089088387114915e+00,8.002180200191821857e-02,1.985309615329049482e+00,-3.814766296515916810e-01,2.422931887509676419e-01,-8.276353752892189330e-01,-6.383833475288706039e-01,1.570509944511092826e+00,7.765631819384577472e-01,2.137579737916452505e+00,4.602126138270017375e-01,1.448355816467018498e-01,2.103111198129246628e-01,-2.321284977133702965e-01,2.642271156024601081e-02,3.816776460784734315e-01,1.022120966802645192e+00,2.166653644038004423e+00,-1.084713144992870137e-02,-9.235858670012216110e-02,1.051226547854041016e+00,3.524653022300188177e+00,1.621172744656212750e+00,-8.140174985813819486e-03,-3.345711521868567351e-01,-9.427051483697684864e-02,1.371770653739842416e+00,2.300015727469908733e-01,2.648121195890866808e-01,-1.123975841782706375e+00,9.300634670831768869e-01,-1.074739416687187366e-01,2.042290035547594806e-02,4.273913158464077711e-01,6.621928610587828334e-01,1.243233505191535748e+00,3.757590487990501993e-01,-8.661952648206187044e-01,-7.073192402468175821e-02,1.984522499390686257e-01,1.093659518274868070e+00,1.705337523770114272e+00,-4.276681265065481741e-01,-1.479316871682008205e-01,1.386783831970558600e-01,-3.265896832641032033e-01,8.226975187647402876e-01,-6.381153402184749357e-01,6.306065002560061750e-01,-1.133612498636087595e+00,-3.236416736329521537e-01,1.018752604529578498e+00,-7.531209906506530771e-02,-1.301736915683745777e-01,1.700331627237988474e+00,1.047130294150817820e+00,-1.150507906778180933e+00,6.189936004761391608e-01,4.394761270177305335e-02,5.941492312006803056e-01,1.607921799924974526e-01,1.004339066093988375e+00,-8.511252809462794833e-01,5.699624539318386418e-01,6.188324955699836538e-02,4.996786857138877935e-01,-2.682897148923439334e-01
5.610186394998246673e-01,6.527742399573015497e-01,4.782265143639428118e-01,-8.582200318962097674e-01,2.314131274203353739e-01,-1.634105050754688926e-01,1.448804445861761880e-01,-5.441916158272888104e-01,2.790834362349466913e-01,3.787555472379181554e-01,4.609737858446527059e-01,7.678432842679440429e-02,-4.541521045607475049e-01,-1.246332216298518397e-01,-2.534927579237200579e-01,1.260568121048219581e+00,-7.541332915677483317e-01,4.849500268545122728e-01,2.397273656696696092e-02,2.049241855940746315e-01,-8.487689714967088239e-01,8.662001167374244748e-02,-4.135046325009986701e-01,2.649221692014849250e-01,1.687573328883639645e+00,6.389866449304448803e-02,6.362533619676342678e-01,-6.867698139517877109e-01,-9.514909966263510599e-01,-1.040090378965592643e+00,6.130929570937213025e-02,2.629417554215770725e+00,-5.543112610375993121e-01,-6.450311907630196240e-02,-4.881526715402878525e-01,-4.486637772599540996e-01,1.030852003420933194e+00,1.312971493593640737e+00,2.089493279446000162e+00,1.574580659311943354e+00,2.244388318778025582e-01,4.286430892570475826e-01,3.247999351100464005e-02,-3.433141437230076143e-01,6.827711973488009845e-01,8.427013668237399724e-01,2.496909091021434435e+00,-5.307846862029730328e-01,-2.369756873348508042e-01,1.258564083578079362e+00,2.913112777061062975e+00,1.305010907979205381e+00,-2.691507291635735211e-01,-3.974454022778245443e-01,-7.964929658144028757e-01,1.840691146890614416e+00,7.920550922147807649e-01,2.143356281810333830e-01,-3.935316904026155971e-01,1.182114257692804982e+00,8.418726188483128814e-01,-5.254366428158763203e-02,1.009290710654465878e-01,1.508609575250475565e+00,1.378502700142641313e+00,4.948011322114440613e-01,-6.854824815063862431e-01,8.134074210479571576e-01,4.975239694705531068e-01,3.408539001279073943e-01,1.705091861153299915e+00,-6.200595905726825618e-01,4.376138632383685945e-01,2.088455789260503237e-01,-5.514883002345261076e-01,1.224271033207355863e+00,-2.113253791379196000e-01,8.088228770188150563e-01,-1.042279920534450399e+00,-8.469654653250574539e-02,7.797917813004839882e-02,-2.860106161267084168e-04,-3.570888493378765460e-02,1.835659371539667628e+00,8.801768111532903838e-01,-1.099969845375724287e+00,6.065068254258678682e-01,1.198737027509205744e+00,3.954959576940249577e-01,7.290224333839243620e-01,1.368404067926793477e+00,-5.984280142217900389e-01,3.743417315158916181e-01,2.143860412329724463e-01,1.033353143527527829e+00,-6.884081006704900751e-03
5.070290596732065502e-01,2.993860525998731648e-01,-4.618885383211263074e-02,-7.853890020962494001e-01,8.852250386137086591e-03,2.660220742236529823e-01,7.777112150490168574e-01,-4.631189029005964297e-01,-2.869726964848824391e-01,3.667124211523031807e-01,9.792364457357460861e-01,2.842311541306807854e-02,-3.167789995431795069e-01,-7.525619003892453085e-02,-6.528796024781995389e-01,1.514809550686985418e+00,-4.610148158765263737e-01,-3.359767523012549550e-02,-6.128599603562399911e-03,-6.890169836875015275e-02,-4.493170000239074535e-01,4.354512953712262879e-01,-4.370399765502769318e-01,2.543118512565480938e-01,1.898569727584742406e+00,3.074538357259420929e-02,4.084438560037726984e-01,-6.996456926578473734e-01,-1.294648172956660348e+00,-1.425995862228172317e+00,1.325345738449750788e-01,2.495105758765417292e+00,-3.430040544284025938e-01,3.670478885823005299e-01,-5.633188609955068760e-01,-6.016851954277351311e-01,1.248388058742069040e+00,1.018488188119570204e+00,2.648086990899596760e+00,1.349790196365797446e+00,2.792397883476707698e-01,3.653470801476608187e-01,-1.594313408647038410e-01,-2.885069998507983069e-01,3.481653466613245929e-01,7.924488358914331121e-01,2.042978268891359139e+00,-3.807249621871734435e-01,-6.119151507400584500e-02,5.061995912560413036e-01,3.586141905719098855e+00,1.985180603266003985e+00,-6.641149143506602792e-02,-4.707115715398551004e-01,-7.276660130883607636e-01,1.924143687403879754e+00,9.242597310649661724e-01,2.230095625097944512e-01,-6.723410861038313646e-01,2.081447109043325305e+00,3.210321417033322744e-01,-5.400761276835078784e-01,5.793119630494748817e-02,9.962601704889373355e-01,1.195784561181383321e+00,3.091850979893326912e-01,-9.976422591835869547e-01,4.500951439675350274e-01,2.984686094704400161e-01,8.784238630538218073e-01,1.753022184289122709e+00,-1.574293975644442400e-01,4.093484996843269053e-01,1.880115818402907091e-01,-3.879395648738181435e-01,9.002128547022627547e-01,-7.977827573430225083e-01,8.622034862013859824e-01,-1.140690439692994218e+00,-4.201085590213640142e-01,6.275475166060082710e-01,2.697217244816367265e-01,-2.220823571624546133e-01,1.986256898101403934e+00,1.152362426217118152e+00,-1.502746304711795933e+00,4.416622952333977281e-01,7.888226722226432397e-01,6.298511897776722934e-01,1.586452870862301023e-01,1.293001161353545037e+00,-1.884511146545306826e-01,1.375437749901694540e-01,1.817022138416516386e-01,9.762231273912729268e-01,-4.787025203458233902e-01
3.933539125425232208e-01,-5.983652369901989454e-01,3.365403310731063802e-01,-6.221832804833603570e-01,-3.601072609150039461e-01,6.110471975335014516e-01,6.445210262259335465e-01,-4.166180648872537806e-01,1.003814112594881403e+00,8.072596687505191326e-01,5.657225878365879090e-01,-1.010888565888066748e-01,-5.182723630739092258e-01,-7.529136701456150549e-01,-3.943552004265801214e-01,1.224929375646618857e+00,-1.262203977975840941e+00,5.640314406815806203e-01,5.866558641273066782e-02,3.267859570652806855e-01,-9.983024364832060460e-01,8.165573899401407099e-01,-4.513075022731360963e-02,8.674832670904382426e-02,1.845198963173079632e+00,-3.837398874248793557e-01,4.426705281895003674e-01,-8.951322100744499854e-01,-1.613166270729466500e+00,-1.272428010826221811e+00,2.574251685324671080e-01,3.390097091974404009e+00,-4.163659656160653144e-01,3.064524499237128996e-01,-3.355588331341325947e-01,-2.862537495591349068e-01,1.306363266688404412e+00,1.171740319888771698e+00,2.595908991429418222e+00,2.306524297957403213e+00,7.025422706569602882e-01,7.927228038377363006e-01,2.297406576550771184e-01,-5.653605415934037648e-01,7.060767060028543263e-01,5.224551035807456500e-01,2.415684710760794829e+00,-4.790482944677636468e-01,5.540054864330375139e-02,-8.433243371621301776e-02,3.586057431361157732e+00,2.400931749261784542e+00,1.524297625320809590e-01,-3.418058180903195686e-01,-1.249203401973669969e+00,2.295636909313005791e+00,1.231527201651426928e+00,-2.149150257801066277e-01,-1.466083624555933884e-01,3.067800273801439825e+00,6.198862024089967226e-01,-6.941700118748856951e-01,-2.985345451607849254e-01,1.307061508558835516e+00,1.503425769068517770e+00,6.987423769516007965e-01,-6.299261443430922425e-01,1.620726735241112770e+00,4.493862278279593392e-01,-1.112685761159138975e-01,1.901040212158608744e+00,-1.048436383855066156e-01,8.385476741981301441e-01,-1.949519663755057974e-01,-1.653642371393919952e-01,6.550509994495586907e-01,-5.442056141218629683e-01,6.178092390569601688e-01,-1.539612523009607159e+00,-2.828392473974756793e-01,2.539640177819380007e-02,4.876365658980931772e-01,-5.084936084124034306e-01,2.331762108263169431e+00,9.419201847107845360e-01,-1.718509709691215193e+00,1.564127997933906777e-01,1.942856632965192398e+00,8.581200961095950541e-01,-4.206199055315030244e-01,1.953636267246784186e+00,3.348715817275772499e-01,3.613887635967087952e-01,5.065512861407224232e-01,4.124769111377592501e-01,-6.041500407267335060e-01
6.427788501733907589e-01,6.003603447287663153e-01,3.505533692921973254e-01,-8.429006421813887151e-01,-5.502074261254454035e-02,2.624646590832310777e-02,-3.961054254947987685e-02,-2.508526860692104066e-01,1.000351117303026838e+00,5.247052015150845961e-01,4.636040176887123998e-01,1.886268389706301785e-01,-4.641399777113217606e-01,-2.824073348772380143e-01,-3.286246621679527746e-01,1.500208657186769212e+00,-6.587049893872767292e-01,5.603637119289184287e-01,-5.360542593039363535e-02,2.271919742158647337e-01,-8.788392794540172970e-01,4.813345697654025090e-01,-2.915138852823463411e-01,1.330326590551807742e-01,1.712906396652853047e+00,-1.633811218373212859e-01,4.744089234949423473e-01,-6.998508848707702956e-01,-1.009980623287561219e+00,-1.070863081632714486e+00,1.019593503350830210e-01,2.790578564861629918e+00,-5.765767609763786661e-01,-5.515726559145628372e-02,-4.838921906548415697e-01,-4.081814873462439319e-01,1.278421450711691776e+00,1.237312395817721011e+00,2.093509665609491144e+00,1.846101382946816249e+00,4.716038778387932062e-01,4.602210779728832524e-01,2.310835321531435893e-01,-2.924441325125624602e-01,5.852668843326597203e-01,6.908586289986721196e-01,2.733706378386515645e+00,-4.018897017296529928e-01,-1.645657007211259182e-01,1.016706350607866183e+00,3.238480799696947798e+00,1.577132143239071915e+00,1.305808694710194617e-01,-3.574880456521735694e-01,-8.964623915470510962e-01,1.926318687484722236e+00,9.532355677765882440e-01,1.769042553831649822e-02,-5.348993368084817845e-01,1.838331687274507242e+00,6.768419619053733793e-01,-1.577344880081960055e-03,1.769817407957999245e-02,1.492056850349697594e+00,1.386842194081648882e+00,4.859875890012690380e-01,-5.415372513920236885e-01,9.779605460895890445e-01,5.879933154773074877e-01,-7.027769286432689055e-02,2.010382705511188028e+00,-4.986082962497676574e-01,4.408130162928743379e-01,-4.788793703006249958e-02,-3.754146712323407353e-01,9.794093778338187617e-01,-1.398012227346392411e-01,8.960324904335538188e-01,-1.265361220954626109e+00,-1.353851467759475957e-02,2.520136012391979152e-01,3.107840090879704364e-01,-1.792147457609208627e-01,1.799236025044950837e+00,1.026177689458762421e+00,-1.245265669171629952e+00,3.914050483657791069e-01,1.496275414550874761e+00,5.150429998814058941e-01,1.570137344244549316e-01,1.805848848247094018e+00,-3.619214200958054684e-01,5.913929523417360556e-01,2.251618503887627964e-01,8.025061943868412317e-01,-1.486882757604086058e-01
6.981699870990103474e-01,-1.802128082447379542e-01,-6.909662746304855441e-01,-1.252245407126325594e-01,-4.858507561681766340e-01,1.127425511798029412e+00,1.255592343190947258e+00,4.955253161409051144e-02,2.645474604283667430e-01,4.889345531529585287e-01,1.300100012719139331e+00,-1.129159862471264542e-01,-2.821867515636255486e-01,-1.232400801404677504e-02,-7.417645440983376970e-01,1.964054990096891995e+00,-2.205250923086884696e-01,-7.874461774889923715e-01,1.809108277224280026e-01,-8.023094247397088985e-02,-3.805037586837737296e-01,8.772363818665714907e-01,-3.720843312269530578e-01,2.415099231420167192e-01,1.668630962862197142e+00,-6.130555114555235052e-01,-8.974253116422645227e-02,-7.233764652940092299e-01,-9.785703114913804068e-01,-1.159277467034614872e+00,6.156621188438946568e-01,2.480978304901339637e+00,1.911726751738903607e-01,4.789050308689623559e-01,-6.316883711694335490e-01,-8.855879374718669261e-01,1.580009650995412018e+00,7.119392837171681920e-01,2.389640170470408886e+00,1.221545344206200534e+00,9.876120702736999046e-01,3.480467930203101634e-01,-1.616631399211913567e-01,1.875960122402835495e-01,2.154934087376630947e-02,6.493943221074611749e-01,1.954600041114745057e+00,6.474792163741911744e-02,5.006872521317323743e-01,-4.214266944163814754e-01,5.050155114819562918e+00,2.601102270983528086e+00,7.887309089564983333e-01,-6.126579528008599951e-01,-6.588419114122127107e-01,1.698193700790905813e+00,6.680139328993176528e-01,-2.600127033065661175e-01,-7.045891133253229244e-01,2.968800463902473652e+00,2.471108966669736950e-01,-1.245876843353387775e+00,-5.637736665074141174e-01,1.377505339889950609e-02,4.494706685068117213e-01,-3.035464478804938970e-01,-9.270034906239226213e-01,7.551386809850394455e-01,-5.176625876392514369e-01,6.385974984989497560e-01,2.689236342409417446e+00,3.529317597084096758e-01,3.225772083074965879e-01,5.861050952075665954e-01,1.785036927747836177e-01,8.027306905459352659e-01,-8.686780533919200575e-01,6.105645564746220444e-01,-8.092098086543020319e-01,-1.007010684984110505e+00,9.013312654869665153e-01,5.933187276688114409e-01,-4.906028809204486807e-01,1.725182334687890062e+00,9.590208882824634573e-01,-1.588355447652135100e+00,-1.207858821656056514e-01,1.344972580811057750e+00,1.107834997552321843e+00,-1.185038189160292132e+00,1.830610446691423476e+00,3.529007844139842032e-01,6.024059583673511131e-01,3.928693418888111744e-01,2.508984934646927845e-01,-9.883163184916451405e-01
8.060805920785474310e-01,1.029413432948169449e+00,-3.034057219817565265e-01,-7.701179724379286773e-01,-1.166678751320162633e-01,2.009505626424331060e-01,2.474484872702651106e-01,2.296056171548055413e-02,4.172762292378385252e-01,3.012161801902797920e-01,9.879063197920785466e-01,2.963733273494753018e-01,-2.748634894571604925e-01,1.674275079714316883e-01,-6.879709720791368222e-01,2.023639027448718153e+00,1.270694493942770009e-01,-1.718465179099760709e-01,-1.042207108314726766e-01,-1.302975265817638006e-01,-3.641116028665016824e-01,6.108504773030074553e-01,-5.086858612569589155e-01,1.812204196262007516e-01,1.763097389751347110e+00,-1.464320165011256114e-01,1.759110307862024047e-01,-5.704592180652229283e-01,-8.145674326865416370e-01,-1.235336009258764411e+00,1.718766115434530173e-01,2.170768983639468797e+00,-3.430795373771535761e-01,1.362617813027015012e-01,-6.889755592270200291e-01,-7.332440658111389897e-01,1.509917590822357214e+00,9.269646871093681906e-01,2.213787877270327886e+00,1.184863225514681817e+00,4.823553470791729358e-01,1.380029336516871430e-01,-3.514129719712322242e-03,7.666319792177744841e-02,9.683895717038792927e-02,7.619438178113919768e-01,2.441680703596189161e+00,-1.062436239237141977e-01,-2.399080141673455568e-02,8.954471069495005819e-01,3.959877157506443091e+00,1.747025659214736404e+00,4.513650564255394793e-01,-4.866192570945817586e-01,-5.242104122992843340e-01,1.658442724306468108e+00,7.778390203616665222e-01,1.181458190031842437e-01,-1.084034743558444092e+00,1.912279266904084452e+00,2.093737595939521301e-01,-1.649280115258824897e-01,7.069380021859997254e-02,8.671073639143540568e-01,9.257644015934178849e-01,-1.186774016998637382e-02,-8.016362080685318636e-01,1.758618777003978506e-01,2.643983260638966826e-01,5.272781715293108906e-01,2.312803598228263535e+00,-2.229391162874749532e-01,9.203967359766163092e-02,1.949630396170347335e-01,-2.600004232703714835e-01,9.206839621314123479e-01,-4.616967983582316859e-01,1.073225592121722638e+00,-1.029812002742933164e+00,-3.142454010352080385e-01,1.007546581361449256e+00,4.663011102812082975e-01,-1.597260856863540746e-01,1.495559664122075416e+00,1.282391213484107562e+00,-1.288694841320376261e+00,3.034231889622787115e-01,8.277585840481928026e-01,5.919347406332772232e-01,-2.082808502534534145e-01,1.663491466715629530e+00,-3.821709496116588167e-01,5.980995168947920160e-01,3.411627584256138324e-02,8.972313178264563760e-01,-3.835787108889807118e-01
7.875153848016664959e-01,4.000343217140569507e-01,2.260208946607549230e-01,-4.483480109790841661e-01,-3.558444798288047384e-01,5.265860236978854303e-01,1.682858953519695833e-01,5.455861173513246176e-02,1.917432319395580009e+00,5.206386299938211559e-01,3.408120330298108902e-02,6.243492843663017711e-03,-5.751473426156861191e-01,-4.121457210337237109e-01,-1.437540821326432350e-01,1.336116260970947600e+00,-8.758065603973614888e-01,2.861991609442268714e-01,2.569536833498540368e-02,3.779920739358894610e-01,-1.112612677454613230e+00,6.045082418861250639e-01,-2.602869195543976999e-01,6.992185515099134940e-02,1.542131715649155632e+00,-3.356627097573612883e-01,1.501189584984850278e-01,-7.706273651453802165e-01,-1.138881577841230897e+00,-8.863605843430896192e-01,4.398044834082550647e-01,3.041526350163870518e+00,-2.959867861017468904e-01,-2.700812619339981735e-02,-5.544548453299675828e-01,-3.782659152787618551e-01,1.674985811144332315e+00,9.718409558503718904e-01,1.643174932140035516e+00,1.666863518727033977e+00,9.936822691433072618e-01,6.808858295697064467e-01,3.321012435287895581e-01,-4.287428755247942036e-02,7.337381247860540467e-01,6.424090061372835780e-01,2.825906364545000216e+00,1.679698479280279655e-02,2.366856716831181040e-01,3.373245902166424059e-01,3.981702038209703698e+00,2.023403833879394043e+00,6.382293643312602072e-01,-2.543077556009962770e-01,-7.271516724317161895e-01,1.652299530888497126e+00,4.438796486702925037e-01,-4.856030570418823356e-01,-4.179786085571124410e-01,2.107157786062638927e+00,5.189051561264798051e-01,-2.638264884944119260e-01,-3.123893549230158939e-01,8.079592934500872126e-01,1.233618735653086551e+00,5.123787879859557082e-01,-2.471416812901444660e-01,1.585427768943397098e+00,6.078032351806195166e-02,-4.928402328074203975e-01,2.429662619878440566e+00,-3.327982842552729692e-01,3.206297361056860695e-01,-4.537646746508175455e-02,1.261187909582399680e-01,7.073809911661518290e-01,-4.074275599364890477e-02,2.851011064943148599e-01,-1.316645260040184784e+00,-2.890791067694265526e-01,2.084216227207995042e-01,2.679175299144314071e-01,-4.762975199100765167e-01,1.812042720305215848e+00,6.098701544027442800e-01,-1.221661861716759390e+00,5.979645441288625185e-02,1.932022888470002364e+00,9.541893413938640212e-01,-9.021898358150968189e-01,2.148537034980028793e+00,-1.624237391095223471e-01,1.192932859332881179e+00,5.317329541303519314e-01,-3.823226475294976834e-01,-4.204586136775239624e-01
7.381065852716588438e-01,8.428318679545754311e-01,7.712813725817874166e-02,-8.779323958360628621e-01,-1.175487496704501339e-01,-1.154718107720426046e-02,-2.508404415844844304e-01,-4.371383706562419202e-02,9.281227263311335740e-01,5.732705272368430194e-01,9.060239908481717563e-01,3.939127533606031628e-01,-3.542942456756786873e-01,-9.579080080082867654e-02,-5.261357140711010461e-01,2.030077681562277636e+00,-1.619680478553572056e-01,4.380864152116608068e-01,-9.380100608679502183e-02,9.086956821310446242e-02,-6.514883522772932922e-01,6.936912875334919626e-01,-2.970319309044167078e-01,1.234305639091449330e-01,1.704979399647214011e+00,-3.859778106862732372e-01,4.078075678405492788e-01,-6.084929239002736523e-01,-6.205037856660204909e-01,-1.039206050134650061e+00,5.621477117352435826e-02,2.501350018389287833e+00,-5.868333770333513666e-01,-1.211340156345103169e-01,-5.058450501833107182e-01,-5.812600444692531676e-01,1.255421111749130514e+00,1.268800766427180093e+00,2.162047370211962694e+00,1.912576902842127335e+00,4.738653340824908744e-01,2.076456012701940468e-01,2.503684735038959608e-01,-1.470277115749989982e-01,2.376145598747178844e-01,6.346577205390899756e-01,2.827713584730790597e+00,-4.142851175403453601e-01,-2.226397887777576967e-01,1.278165316981181743e+00,3.442346806426031414e+00,1.434829914408309204e+00,3.479150726285158424e-01,-4.862752588681110710e-01,-9.335274133659604567e-01,1.955464386469653704e+00,1.204403370781554905e+00,1.332018420336373299e-01,-8.189088664683465968e-01,2.022767193999011504e+00,6.921695825221305665e-01,8.117970674816304966e-02,1.878528628394462649e-02,1.574243591068649639e+00,1.116079559012918443e+00,1.098598999471451232e-01,-6.318486735252243358e-01,5.646971972678537233e-01,6.731787000704767543e-01,-5.494282232147301714e-02,2.322864746685456172e+00,-4.329619666814899515e-01,3.738726157805895567e-01,5.752021961432216002e-02,-4.524882385582882915e-01,1.108256958546545823e+00,-9.772512041826036944e-02,1.350075391395191060e+00,-1.099099443552423949e+00,2.259200696242164019e-02,5.664531940794583775e-01,5.949206578244169430e-01,-6.168772283768492182e-02,1.494919577034007352e+00,1.337676216927743411e+00,-1.237671967470981738e+00,3.337901810194309760e-01,1.448746176602047520e+00,3.766470582140191703e-01,1.915580119136841009e-01,1.974372339310717095e+00,-3.396493606629680251e-01,5.380515708358779570e-01,2.232850221849158601e-02,1.334156592406449127e+00,-1.278792368640815358e-01
7.533446477830426646e-01,1.869635492281406908e+00,2.866850398745156570e-01,-1.196609066642663421e+00,4.765177146841658717e-01,-4.970403068455940265e-01,1.865933768315773678e-01,-4.567711032202053101e-01,-9.272731087023999841e-02,-2.375690789627809274e-01,1.037902806747043050e-02,1.721514298179374070e-01,-3.917772928874840854e-01,3.031450079868595604e-01,-3.754063354166209399e-01,1.039151327686353987e+00,-2.414969164656765033e-01,6.990946026615976749e-02,-2.484154848067667842e-01,-1.175063320883769080e-01,-5.088578184457941411e-01,-2.753741625504516621e-01,-8.509820610164462451e-01,2.630932376380795690e-01,1.878037762596727500e+00,9.456201319569569330e-01,4.336703664112314671e-01,-5.526643105860080674e-01,-1.426216304470127039e+00,-1.470539692522447206e+00,-6.992728685386717657e-02,2.043285271356051869e+00,-5.948800903540432117e-01,1.240173803946209574e-01,-8.456160981664402332e-01,-4.457356757576040884e-01,1.543590993862104632e+00,8.466564017877969972e-01,1.952288402942210066e+00,3.286103655971334137e-01,-8.903764088301391322e-02,3.097329941865604730e-01,-1.970158421286926087e-01,-1.150352350233462967e-01,7.040507536694496915e-01,1.139959469999641151e+00,2.297834215456530771e+00,-6.674263865048721267e-02,-2.725406825279183542e-01,1.469451216232119606e+00,2.871056298611303070e+00,1.306230073166576355e+00,-3.500262075720036448e-01,-1.795967454455459633e-01,3.051684423472950103e-02,1.287183996393685970e+00,1.776351215408999984e-02,3.461833158972524860e-01,-1.055727763116882878e+00,1.920101865361998339e-01,-1.131350158485370516e-01,4.382389569104228055e-01,7.071604382708949199e-01,9.446483339989159012e-01,1.645702351597523094e+00,7.885468682159919585e-01,-7.364086925388348970e-01,-1.161736057214091122e-02,4.362863805684405460e-01,1.059211852974881296e+00,1.288401198616987209e+00,-7.574545053113606041e-01,-2.203099806273344785e-01,-7.031813441354123340e-02,-4.623902280739991544e-01,8.097672390368494399e-01,-4.731139273357958253e-01,4.434830944215285009e-01,-1.317043182707849480e+00,-6.161818416845571411e-02,7.980677551244492740e-01,-4.058028619612295551e-01,-5.910184233449689017e-02,1.816739802782926905e+00,9.020437402590210096e-01,-9.797602230073116925e-01,8.690750068547710150e-01,-1.717085566014628917e-01,4.695408534110713239e-01,6.045602731604264868e-01,7.572268656061668102e-01,-1.242335562700026319e+00,6.283803816709101486e-01,6.823104344325134352e-02,3.477555146252195861e-01,6.506872370166560948e-03
8.319947118544733788e-01,1.285152813970964703e+00,2.601865549283134404e-01,-8.466350928516841456e-01,-9.975889861754252963e-02,2.816335768329396028e-01,5.607461334265770869e-01,-9.589627811370846078e-02,1.518558113618154959e+00,-1.518646462472196534e-01,-8.367142570428742765e-01,-1.074331784604280193e-01,-6.051619340868918950e-01,-2.466278784679344360e-01,-1.787198761533450586e-01,5.358006441462114244e-01,-8.754130937711577243e-01,-1.035528162041150779e-02,-2.722888575775261333e-01,1.240204985165326013e-01,-9.193844011400678085e-01,1.342632867353009685e-01,-6.843949437260330448e-01,3.997211772585937406e-02,1.876980399528734411e+00,8.823419864951977942e-01,-9.083481626865674841e-03,-7.507212130053934063e-01,-2.308659782840459140e+00,-1.568815910160268334e+00,3.067739702074429031e-01,2.800924670628263780e+00,-3.563260057092025312e-01,3.885228926829349949e-01,-9.045495177999722802e-01,-1.522302870193150137e-01,2.313650299866070625e+00,3.863146723532870364e-01,1.680204089041080984e+00,3.377473291914880882e-01,6.262087259169362152e-01,8.598113604535029264e-01,6.135734349042584745e-02,-4.742960547635176327e-02,1.093487474293898476e+00,9.788143267268863967e-01,2.423891573995395898e+00,5.107575475884581495e-01,2.491833601327821945e-01,5.877334190318339591e-02,3.748803885638932520e+00,2.413648121281024572e+00,3.137197969533505049e-01,1.377689836796174849e-01,1.428146239839511722e-01,1.153836096812904000e+00,-5.063065082447142373e-01,-4.534040056432913079e-01,-8.811384255157453937e-01,1.227861146938973969e+00,-7.000737634689677691e-01,1.035506521174190397e-01,3.839771294527225542e-01,1.283845155034082364e-01,1.918585150861891853e+00,1.321890838231375653e+00,-2.765462000423516420e-01,1.107395917350748160e+00,4.883444021075392105e-03,3.473539074766929802e-01,1.545079745843565000e+00,-4.443715345214189760e-01,-2.588014455537582803e-01,-6.195204232037424541e-01,3.135378278329095103e-01,-4.657873125640055179e-02,-5.438381721922843637e-01,-5.509454397837503237e-01,-1.967483262721466453e+00,-3.003329874330222804e-01,7.567594909544722581e-01,-3.657905429024394528e-01,-7.039803891839343519e-01,2.264333964838511015e+00,4.308771623500811110e-01,-1.285276691422360340e+00,3.832473493257286257e-01,4.211582306875762960e-01,1.229146043625317208e+00,-1.189144399477297442e+00,1.313606034089455754e+00,-7.279997946210962079e-01,1.400680924172281738e+00,5.824606886333911770e-01,-1.681186529164870658e+00,-5.509789968140152983e-01
6.096504331756500417e-01,1.189459628169555305e+00,3.544338301373837763e-01,-8.673282671055121407e-01,5.102920347435505599e-01,-1.881743371866637649e-01,7.729449129239307492e-01,-7.158072454593004119e-01,-4.970554896650902776e-01,-2.049236342322897364e-01,-1.770551672755088513e-02,-1.645169085679727972e-01,-4.478489851995528515e-01,2.144695131251935227e-01,-2.274548045675567620e-01,6.688189689669276072e-01,-7.117103687350478936e-01,-1.332431103711302356e-01,-2.335591947715189021e-02,-1.591661110215851493e-03,-6.512203954763730041e-01,-4.833809351913723740e-01,-8.227224107637132189e-01,3.803017979814213856e-01,1.776973934237448427e+00,8.726290673889369742e-01,4.761914860172685726e-01,-6.571034151964731951e-01,-1.514550578962425398e+00,-1.341045212722824287e+00,1.338644444312832582e-01,2.249938443722130366e+00,-3.447227064985014522e-01,2.340204444879818158e-01,-7.752033884675881836e-01,-4.679706333516193140e-01,1.358862452329741011e+00,8.561594928086825318e-01,1.951120497253588937e+00,2.811009241785007440e-01,1.424798060649368203e-02,4.916714457874373778e-01,-3.621819304447623789e-01,-1.674782146623721713e-01,8.856992447738456509e-01,1.183277627639456542e+00,1.956940687389191691e+00,-1.187903145317604769e-01,-6.704236977642603901e-02,9.835247802202722323e-01,3.038040072462976138e+00,1.503643669978444342e+00,-5.327342325151865898e-01,-2.309987499344016704e-01,-3.380281290063275046e-02,1.276211392288986390e+00,-1.747467202652983609e-01,2.394389915635870281e-01,-6.012288979793753985e-01,1.868485787392710762e-01,1.479081295052123157e-01,-1.173581157902621880e-01,4.117901778129409163e-01,6.292926351715119049e-01,1.503198336661422330e+00,7.785812505067972733e-01,-8.139631392267947518e-01,4.115066488566039848e-01,5.824296520023725110e-03,1.241661168613909627e+00,1.199650953121474295e+00,-6.278425687787538845e-01,-3.303139588037372343e-02,2.704026426846227737e-01,-3.661385459586303792e-01,9.405332823365769590e-01,-6.316583881670312373e-01,3.863875091887941648e-02,-1.090052947642485615e+00,-4.101228243824407982e-01,4.046685996568427091e-01,-6.378303204212008026e-01,-1.400842122244239929e-01,2.032897473463849636e+00,5.147893140126347244e-01,-9.921778433182901757e-01,8.208217785888320961e-01,6.627049109759852730e-02,6.511972404875768783e-01,5.698519171738731792e-01,5.632551181125529105e-01,-1.047432876875405316e+00,5.203358909684011602e-01,3.165593192005483614e-01,7.059299475320750250e-02,-1.414881104575749782e-01
7.318803759294707501e-01,1.448439355972073184e-01,6.426417028917219554e-02,-2.573484914984240368e-01,-2.582079858749692924e-01,6.028022677968675191e-01,4.199124161685089396e-01,-6.701769508670726849e-02,1.189872146568266231e+00,5.661023422700277585e-01,5.379866699590786228e-01,-5.959713903788319000e-02,-4.910319642120985484e-01,-2.156649230339564016e-01,-2.116868987707628547e-01,1.554391615350494416e+00,-7.402837390302470233e-01,1.938996263688487487e-02,1.943466602175266122e-01,3.189689811814964138e-01,-9.682804798767983279e-01,5.077340969894832412e-01,-2.786198480263478716e-01,2.106056157620107006e-01,1.440543975600884652e+00,-5.695587919836013757e-01,2.186560557589349030e-01,-7.434050004457591898e-01,-7.020689023881490076e-01,-7.175853659906097359e-01,5.064807540823405008e-01,2.820952739845483670e+00,-1.323860391337147446e-01,-4.737164291658263471e-02,-5.027502018379680360e-01,-6.027904046944951855e-01,1.341567324088347668e+00,1.098103439303734996e+00,1.734609833115043909e+00,1.666211183808784302e+00,9.441284831528575783e-01,5.162385387977982409e-01,1.523023570970541973e-01,2.747447444243040354e-02,5.269346067127341771e-01,6.697557298720814289e-01,2.587756873297435867e+00,-1.489704617654191710e-01,2.644216332982358697e-01,4.285735678504947743e-01,4.121455035833701430e+00,1.841106426046236866e+00,5.294883765610193249e-01,-4.694305710687500244e-01,-8.272946052578364906e-01,1.681355106952682865e+00,5.747720662959854288e-01,-3.241215291854984137e-01,-2.944461972792047355e-01,2.019748353611024339e+00,8.812706345936448527e-01,-6.040825271323764234e-01,-5.041356620201954408e-01,7.592027960808640508e-01,8.236569837102676317e-01,7.954411732977778593e-02,-4.763502007883849698e-01,1.384537877922201510e+00,-1.646487020802149259e-01,-1.821112938816764615e-01,2.567312337556516777e+00,-2.352173430273932220e-01,4.274651016678162607e-01,4.571262018535751093e-01,-7.987830143377810943e-03,1.107327728766826391e+00,-1.189504351243443891e-01,5.036028544547141994e-01,-8.410998460407930200e-01,-5.149770745560404706e-01,1.336486815999440303e-01,2.857527946427710352e-01,-3.159643278842869107e-01,1.647184635931972840e+00,6.173998948508129248e-01,-1.152293133974992445e+00,6.868448536644380931e-02,1.980114152594242949e+00,8.436744992091711470e-01,-5.417335345560964077e-01,2.006767072202334301e+00,-9.010676113758964156e-02,9.116663630379625571e-01,4.764734147290675681e-01,2.171148610089734809e-01,-4.131214644248316081e-01
5.956874662801336928e-01,3.912407306802254681e-01,4.877279682333355293e-01,-7.767922348731229887e-01,-2.929310674046790158e-02,9.729831590591597745e-03,-1.050084707412632379e-01,-3.298303005458932957e-01,1.043261557635959180e+00,6.362555196353284481e-01,4.861976749767536465e-01,1.534141999739059847e-01,-4.963654721582716478e-01,-3.554622790298775370e-01,-2.299166984942474512e-01,1.470898020546632656e+00,-8.303162645550408172e-01,7.083514386552642872e-01,2.564790783583763972e-02,3.344673229588316365e-01,-1.006932355840879811e+00,4.425030853267971631e-01,-2.134016378972504735e-01,1.580979960070307000e-01,1.633806888181075445e+00,-3.157151092213884569e-01,5.767393482734662902e-01,-7.254352830015056153e-01,-8.440403192213066230e-01,-9.123582853627291156e-01,1.171744116310047545e-01,2.910907371201650218e+00,-5.904748248574693825e-01,-1.605159695668053055e-01,-3.960051272209994533e-01,-3.951478827563128515e-01,1.093732291276486635e+00,1.393204675701350315e+00,2.037864545539191052e+00,2.102290745577152453e+00,4.944781237091223636e-01,4.906826944752349373e-01,2.745425540531005182e-01,-3.557895111940324595e-01,6.455815380138392179e-01,6.590488425306040288e-01,2.801526614347286781e+00,-5.442074775785978868e-01,-1.905521405735763341e-01,1.115566454090771709e+00,3.102757641760171214e+00,1.434282162747008371e+00,5.453509876110318455e-02,-4.020118671808546873e-01,-1.068901062817557701e+00,2.017784972113011221e+00,1.071424569497120727e+00,1.772030804789660741e-02,-3.236394261919012250e-01,1.813233069153622701e+00,9.905649163625126485e-01,-5.191085399905159825e-02,-9.891738539578805167e-02,1.685185647561620037e+00,1.348647738037761279e+00,4.469199207231676074e-01,-5.087185811735055463e-01,1.186768408611957426e+00,6.076954657883963939e-01,-2.363145750243633714e-01,2.047466639112704989e+00,-5.541887592012143537e-01,5.875514038908732362e-01,6.424455875264961646e-02,-4.449225591877812302e-01,1.159523017948869361e+00,-9.357470556428937325e-03,9.489357562980340610e-01,-1.149413340797201144e+00,1.338135936656414948e-02,-1.567366994827135152e-02,3.065535856166825557e-01,-1.240291137501809970e-01,1.786352900831894575e+00,9.528798703544220094e-01,-1.187249421264706895e+00,3.916761034408531295e-01,1.808554182463156579e+00,4.477593203592149518e-01,3.574816197512579730e-01,1.877507968189981336e+00,-3.189588724239507123e-01,5.368574660197369397e-01,2.624639229914705885e-01,9.932786044152872584e-01,-6.138786778507637765e-02
9.744792767804537625e-01,9.382532890551775751e-01,-4.777695135195909049e-01,-2.722239788787662595e-01,-3.570765188615108721e-01,8.630683774163876443e-01,9.417940663733264106e-01,2.608648885548217056e-01,1.159236654928629040e+00,-1.075558572993023931e-02,1.109950621780322888e-01,-1.193505808084274200e-01,-4.340306252009170085e-01,1.118457019066186886e-01,-4.196573725718339420e-01,1.373081289023337703e+00,-2.585445991393751086e-01,-8.218613431684631543e-01,-2.427200675892745435e-02,-2.668632797940109075e-02,-5.947249349715804101e-01,4.507799106241241471e-01,-6.721665614383991461e-01,1.577461113221593492e-01,1.622706958896996898e+00,1.163167553595818304e-01,-3.087689213526457754e-01,-6.757135048318191339e-01,-1.428795319574162725e+00,-1.210118592785972114e+00,6.469354786231893417e-01,2.382479710749144441e+00,1.283604281615975951e-01,3.849543341952092468e-01,-9.203303255327139887e-01,-6.576174336945408427e-01,2.203643746449920560e+00,3.278465536979754402e-01,1.618647911609296663e+00,2.788101621836233113e-01,1.032290645590456801e+00,5.242852101997466097e-01,-9.365495502523540905e-02,4.287207467784988624e-01,4.675465441840882530e-01,8.826209064234507018e-01,2.219333826428369516e+00,6.409372687675817248e-01,5.937062652306769328e-01,-2.483001009560388272e-01,4.940700201573017480e+00,2.520229331555303265e+00,9.032946930362572013e-01,-2.350619726959962408e-01,8.480057631165205390e-02,1.037807028863099168e+00,-4.044395390931910805e-01,-5.355465622166162287e-01,-9.805940293564442412e-01,1.787756286256143801e+00,-3.985292178925231577e-01,-5.886952175194738457e-01,-1.839640159591281188e-01,-4.934209346481631675e-01,8.801237398388150890e-01,2.788262034198465411e-01,-4.952340348704133421e-01,8.353857650237297428e-01,-6.737256235836895923e-01,4.886333876914650820e-01,2.481119409234909590e+00,1.489438627950701033e-03,-2.736779877356955160e-01,1.764441746705039948e-01,4.995933138867356682e-01,3.556187867758520138e-01,-6.177683458746907608e-01,-2.152026754609281944e-01,-1.196130309076915532e+00,-8.559094066128039024e-01,1.069965336815676515e+00,3.185474878699351420e-02,-6.421873896902627887e-01,1.729197268226468021e+00,5.108550574901008501e-01,-1.251854694720485162e+00,-8.276246851635082891e-05,7.809623798533907868e-01,1.335559450538454263e+00,-1.680924253819514824e+00,1.631960297666465998e+00,-3.243109956428357754e-01,1.418125540885373459e+00,5.297257852902128583e-01,-1.246384005214308477e+00,-8.422770276556642566e-01
1.122458081150934817e+00,1.899843243684995908e+00,-2.767632406077899510e-01,-9.823326288196145839e-01,-3.942636847574441661e-01,1.238213544778847264e-01,-4.477459295295394548e-01,5.922142795769437251e-01,2.107901724939682531e+00,1.755269460126646641e-01,1.834440309644078393e-01,5.516125411954144742e-01,-3.837349759308694708e-01,3.641956624668545028e-02,-5.913790056776794257e-01,2.030452266218339741e+00,3.175317827044607522e-01,6.348541275771041326e-02,-4.134719532690599997e-01,-7.275848337064527716e-02,-5.414647653936901506e-01,8.929006577278952861e-01,-5.358400474115592171e-01,-8.667169938352872749e-02,1.797502763525447689e+00,6.331280134929317960e-02,-1.463858867438747324e-01,-5.293142012098446259e-01,-1.157200296577236331e+00,-1.335251842616415274e+00,1.540795624317717327e-01,2.295295318754057234e+00,-5.359644816801603096e-01,2.022389089476506197e-02,-8.721465762790399090e-01,-4.925384377266571745e-01,2.259200112968617447e+00,6.212331142472606871e-01,1.710179945153519121e+00,1.013566310614514299e+00,7.750483385529089997e-01,2.535891240685127501e-01,3.779036243642004966e-01,2.732690616249088822e-01,2.447891136937910828e-01,6.979903090579674396e-01,3.073187631938098630e+00,4.073759367575127688e-01,2.761270191796774687e-02,9.163106651511624401e-01,4.143693733262308498e+00,1.930869610375179457e+00,1.054785514943094915e+00,-1.618416243250555553e-01,-1.904319028376955658e-01,1.376697403699300937e+00,3.880448462651527319e-01,-2.702002545667582800e-01,-1.551033979441184041e+00,1.959543636140314016e+00,-4.531564585745199158e-01,5.565966846299281734e-01,3.197571969673697057e-01,7.196844007554743516e-01,1.317838695102630409e+00,4.076210040842248583e-01,-2.868306337720035182e-01,3.554267379967818719e-01,4.827894324747563637e-01,-2.190655349025738552e-01,2.560271209207862331e+00,-3.810696833572086994e-01,-3.189545874331831676e-01,-5.438150507661199118e-01,1.109804433309645316e-01,2.905314840966889411e-01,-1.108843631275350794e-01,7.944947982502779116e-01,-1.666325136028270482e+00,4.242639466855235852e-02,1.397875541129585786e+00,5.660118536523963684e-01,-4.028165258638107260e-01,1.399822464565982472e+00,1.299513036869986315e+00,-1.241302145668473633e+00,1.435909639813866823e-01,8.204480628329946512e-01,8.034598927873616292e-01,-1.174676911408890412e+00,2.171412734516828813e+00,-5.981146220446176276e-01,1.430322892880949492e+00,5.831398444311544638e-02,-2.434284405199935164e-01,-3.785997118727021937e-01
1.059073408240515102e+00,2.178291449087752962e+00,-1.865595002685337400e-01,-1.008168390910181955e+00,-1.814476986869738295e-02,-8.139349604480705658e-03,1.331838902075212216e-01,2.211910573901090249e-01,1.155272390194723053e+00,-2.907249160693979873e-01,-2.353417729676433034e-01,2.716170514445118700e-01,-4.029967345458195238e-01,2.804871519766385934e-01,-4.831123146750566644e-01,1.346256676571949473e+00,1.289792722923966406e-01,-3.175099016757955139e-01,-3.894613426317481419e-01,-1.823508106933999506e-01,-4.572071690535560728e-01,2.330825484821315574e-01,-8.622602313068039592e-01,6.901043441807028223e-02,1.859150955611909684e+00,7.914499920375835940e-01,-1.130541663355574544e-01,-5.325564986945434676e-01,-1.619335642341206416e+00,-1.540460786598570886e+00,1.721726531464534138e-01,2.051280393224707232e+00,-4.011391526065694046e-01,2.361070377342971427e-01,-1.042964112225563289e+00,-4.707862174867142313e-01,2.308812994015161379e+00,3.776840651218902334e-01,1.643008126300773641e+00,3.101220311262897766e-02,4.669127009411915274e-01,3.510149777509348201e-01,-2.571511713012387262e-03,2.848232538093447563e-01,5.359151617811659385e-01,1.020596567731942406e+00,2.545334293214632115e+00,5.706311271610569058e-01,9.142929222573090153e-02,8.116104323359587536e-01,3.928487649845350482e+00,1.939972293284789817e+00,5.512096201221252656e-01,-4.284592524302216487e-02,3.472000143077613732e-01,9.853395719346540460e-01,-3.624208636012248297e-01,-1.494206766642676154e-01,-1.510151012031958118e+00,9.001957954900501324e-01,-8.007480621181091163e-01,4.592807793909584602e-01,5.820622424477737145e-01,1.814063516948256627e-01,1.495284163890922002e+00,7.208777717212182523e-01,-4.458755018506412870e-01,1.105528301457294749e-01,1.218889067677862426e-01,6.188676541269315656e-01,1.926863246663473639e+00,-4.777435806898295834e-01,-5.823190222739897948e-01,-3.964805072738538660e-01,1.243509170789377644e-01,2.164827147412304864e-01,-4.537813584881920104e-01,1.391141008039542548e-01,-1.627733772822965497e+00,-2.064446640038012648e-01,1.404179567038753351e+00,-1.051852562584241479e-01,-4.137964152116324623e-01,1.659541903796809326e+00,9.084150447785157567e-01,-1.106346546199618697e+00,4.401435407804114575e-01,-8.138014049868624866e-02,9.222483203906008953e-01,-9.017424981611222856e-01,1.329196611349948931e+00,-1.024227824871335679e+00,1.368154553669775453e+00,1.690256302531120136e-01,-8.283059657832005929e-01,-3.839375030182667903e-01
6.516967039975538611e-01,1.140912782132773140e+00,4.219582599455594663e-01,-1.178465774323725235e+00,3.269649802521548687e-02,-6.301060753403281423e-02,3.092401390846820641e-01,-3.420182914409879982e-01,9.840447934420328835e-01,4.534962063883438144e-02,-3.757128485923403871e-01,7.092296909929164672e-02,-5.282120300949703084e-01,-3.254434976663816426e-01,-3.518507412421100211e-01,7.540055606254899567e-01,-8.204470950715849753e-01,4.247709626486005918e-01,-3.298336347448732608e-01,6.830134867297202317e-02,-8.016693473338021292e-01,2.382432681279824382e-01,-5.617986249879716176e-01,4.257568458540167411e-02,2.041428711281587205e+00,8.192189597506432941e-01,3.083167689867446493e-01,-7.338669243552998767e-01,-2.210508809090747651e+00,-1.711544266457508678e+00,7.380857588728195751e-03,2.808717709465920365e+00,-6.503682480318975223e-01,3.540158792323256365e-01,-7.476108648299207848e-01,-1.248295061340295442e-01,1.919407235861134708e+00,7.135467260044094928e-01,2.194717733870811482e+00,9.092971458607280733e-01,2.609936553059201692e-01,7.273577308590386536e-01,9.237000760102891117e-02,-3.728455092596897891e-01,9.580549105577418345e-01,9.025890613968183818e-01,2.449795027355333499e+00,3.745983661092619488e-02,-1.156753780569624995e-01,5.268821119766490257e-01,3.097403344492326127e+00,2.132972126262911328e+00,-5.758663482757270247e-02,3.195910089359038642e-02,-2.538312327547057601e-01,1.604244023000220620e+00,2.266692769115654371e-01,-7.196494084199177299e-02,-8.744981359132557586e-01,1.468140960000528406e+00,-4.332722310294434553e-01,2.694328545689571586e-01,5.646901234409708037e-01,9.352754865661967454e-01,2.093734856719576154e+00,1.316985927767020836e+00,-4.945779703983722575e-01,8.098610191072136422e-01,6.010387594172026393e-01,4.506626606647125000e-01,1.262066578622068169e+00,-5.324803458855308369e-01,2.766168460990463263e-02,-7.220629698296867627e-01,-1.277361999142502258e-01,1.641200978674600686e-01,-5.876131889238981332e-01,1.116137909332386990e-01,-2.014173286577355171e+00,6.390364813342042094e-03,6.769603334686362661e-01,-1.383766574770067259e-01,-4.902342269299959643e-01,2.318814651675725536e+00,8.762962450443626539e-01,-1.425568468435297609e+00,5.821401169559226041e-01,3.964754073018312841e-01,8.470002872830288965e-01,-3.477167849158306900e-01,1.254552104145878255e+00,-6.762855860395242669e-01,8.190618391675610344e-01,3.413160309469741027e-01,-5.218056040085701230e-01,-3.558160885254976202e-01
6.719584929218455072e-01,3.643588813522213865e-01,5.223733604307752021e-01,-6.621465348888802005e-01,-1.622787547865263691e-01,1.234937813488792835e-01,-2.560345647344485775e-01,-1.651745521130608407e-01,1.652638588023006339e+00,7.080620488244231403e-01,2.946585277657571833e-01,1.532505680541196291e-01,-5.574147926121000296e-01,-4.535521692402331162e-01,-1.158800498379580768e-01,1.480003624692929343e+00,-9.190543768307222194e-01,7.753134834836242772e-01,4.219717447291592566e-02,4.503632408083941829e-01,-1.171891335541276113e+00,5.411557525475948482e-01,-1.467393032426878019e-01,1.042616746998752814e-01,1.534951693532065287e+00,-4.751363532674015011e-01,4.915803725025397197e-01,-7.459742333682302107e-01,-7.732466146266187002e-01,-7.598485969470946122e-01,2.133909938590256294e-01,3.063827010157744724e+00,-5.616151091583940769e-01,-2.596695800249781416e-01,-3.851023494299782857e-01,-3.528412985579649219e-01,1.207220087060622671e+00,1.382529141383932458e+00,1.791943214423975750e+00,2.233919052802771255e+00,7.174343185050144900e-01,5.653215085865396228e-01,4.143244485357757134e-01,-2.801446315324521152e-01,7.114298508566899715e-01,5.970599552628358397e-01,3.012730127810243186e+00,-4.397173126008107613e-01,-9.534201678797050994e-02,1.028741782637830005e+00,3.275702040889891364e+00,1.477532318795087285e+00,2.884871120367768493e-01,-3.622827246191843154e-01,-1.100279282413189952e+00,1.968208572585579352e+00,9.884027275619263753e-01,-1.839170573712282097e-01,-2.590089028262573256e-01,1.927990340728107599e+00,1.056392941688427678e+00,-1.852207869807348528e-02,-2.341992019959220628e-01,1.625853694040829467e+00,1.317198348618060288e+00,4.551336068231141563e-01,-3.159578154523303706e-01,1.497582216728627902e+00,5.328718620522409077e-01,-6.258785702293903075e-01,2.284682630909511403e+00,-5.656426087752645104e-01,5.823892556688726740e-01,1.636603795012550600e-02,-2.949707310225744838e-01,1.110638859915669574e+00,1.860847337692423387e-01,8.305801596571461554e-01,-1.181843285151979561e+00,3.038448695575124425e-02,-1.110902598976355460e-01,3.578531617510561924e-01,-1.998192441269072694e-01,1.724984066165941243e+00,8.322625667133689564e-01,-1.134833411473765485e+00,2.564110001906038105e-01,2.165948085640553078e+00,5.438337877415346799e-01,2.339345212352600401e-02,2.155377883360896529e+00,-2.582253671287623176e-01,8.128086846097867246e-01,3.540630879876365267e-01,6.614756955862834964e-01,-7.323191114667199075e-02
5.903464975336987219e-01,3.189778292937756055e-01,4.551615641053345651e-02,-5.662990958942960562e-01,5.598031363506159042e-03,3.440585282891893693e-01,7.161835718442377541e-01,-3.900731983512122358e-01,1.120197045025080884e-01,3.497994726921742070e-01,7.029866009363303636e-01,-6.527413627552525188e-02,-3.965109849137428699e-01,-6.441893185549274481e-02,-4.214792884113632288e-01,1.385637264271892377e+00,-6.205488464004869087e-01,-7.482500747755452264e-02,9.483290990243567475e-02,8.294695072732236052e-02,-6.638111123539420788e-01,2.875250470039641959e-01,-4.441884621718107384e-01,2.808417648068454731e-01,1.697227268142977641e+00,-7.377711043651549727e-02,3.583554293323755191e-01,-7.129500069776996130e-01,-1.083456067683750801e+00,-1.133067394232984526e+00,2.892467111910668742e-01,2.563952657811232605e+00,-2.324576309592615575e-01,2.035514484578375694e-01,-5.677717209462872505e-01,-6.040353898323144177e-01,1.258196958401698984e+00,1.030381578550938926e+00,2.213303692538290957e+00,1.280434751256774639e+00,4.788973789357567901e-01,4.372175429393704293e-01,-1.102677162552004181e-01,-1.498557520409109500e-01,4.926122499166195046e-01,8.184771188553825461e-01,2.176566216842695578e+00,-2.708199118549918238e-01,7.406523178831220244e-02,5.274113230026478139e-01,3.719153916934378135e+00,1.853981372229645430e+00,5.081167650001683356e-02,-4.548148237644707992e-01,-6.609510645209781821e-01,1.730260791551758270e+00,6.140370750314994019e-01,3.550957578952804172e-02,-4.831951267805483230e-01,1.740813409232283115e+00,5.432002192183512657e-01,-5.668149046130981361e-01,-1.254919825176903925e-01,8.183590885081023503e-01,1.061711007869098999e+00,2.606833796780286816e-01,-8.075595404222034590e-01,7.889505834736164624e-01,2.898771037063366252e-02,6.010467221428985596e-01,1.963541705007139537e+00,-2.423452039479248588e-01,3.644510980365334718e-01,3.704461518624707628e-01,-2.513090684973989242e-01,1.026476180164050955e+00,-5.468282086092921546e-01,5.881997764693230879e-01,-9.634378352968970827e-01,-5.009338547954170773e-01,3.820184933423884099e-01,1.119443772424218164e-01,-2.341419461566988658e-01,1.871073728530053160e+00,8.283620844555803497e-01,-1.287708498565116821e+00,3.659457117145371030e-01,1.117325766416186861e+00,7.147369796506648498e-01,5.333114304861830135e-04,1.402546898979786461e+00,-2.729896067190372699e-01,4.463614136835640789e-01,3.224542104565222833e-01,5.872477830948532596e-01,-4.117922685743407030e-01
6.946877413729422024e-01,6.846105228123718911e-01,2.031403802517863233e-01,-5.700153244623162863e-01,6.236031571027393638e-02,2.418132670128314843e-01,5.442111706944361416e-01,-3.225105546832065517e-01,5.660084758217138745e-01,1.974806612858422961e-01,1.926129661007029148e-01,-9.174418518815205537e-02,-4.832431633239362978e-01,-4.924953421236742679e-02,-2.185431521559647317e-01,1.121430752092836380e+00,-7.302019630584074550e-01,-2.415862813362003314e-02,5.673614358092996662e-02,1.725899896216528950e-01,-8.365366039367210238e-01,8.754044594286941594e-02,-5.293866573403220865e-01,2.575851217893547762e-01,1.618631540330573104e+00,1.372102505760944835e-01,3.049444904545240975e-01,-7.067721267915212380e-01,-1.167635945899408778e+00,-1.046928893838801944e+00,3.286784516632872410e-01,2.590367220960230643e+00,-2.521702693825290109e-01,9.702125508323083958e-02,-6.465725827529308356e-01,-5.039548699446837476e-01,1.437384019051086703e+00,9.436098343853059900e-01,1.819070187560356988e+00,1.009487507077954982e+00,5.380197847664318633e-01,5.323925955969910362e-01,-5.118436853026762934e-02,-6.155794014099850997e-02,7.174982441755718421e-01,8.987602348287661025e-01,2.339060722124171487e+00,-8.283055301291289418e-02,1.181862784034625885e-01,6.410951121822759946e-01,3.636571573228263965e+00,1.746073947356034273e+00,8.798047346344101127e-02,-3.173737313100620239e-01,-4.291184238679918717e-01,1.479903557701757633e+00,1.952153751088899492e-01,-1.049530815938192613e-01,-4.815723204651892742e-01,1.220513027122477778e+00,4.440590668518773487e-01,-3.211735958529547963e-01,-4.686193935493090934e-02,6.772027649447064368e-01,1.204829333489767063e+00,4.752464847052438879e-01,-5.886918508736919131e-01,9.614624008513054099e-01,-5.558093326888883384e-02,4.192344212286659433e-01,1.928897258359052680e+00,-4.192590323167214583e-01,1.811953915347990773e-01,2.687625592750546577e-01,-1.305518945739500003e-01,9.343707461493946376e-01,-3.517245857698230727e-01,2.437930795653044935e-01,-1.053567328731313868e+00,-4.340118691289747144e-01,3.044864765017375463e-01,-1.308198846050240838e-01,-2.759657322791854717e-01,1.851268658559568347e+00,5.764280345405885519e-01,-1.100764850050201860e+00,4.009381180168114511e-01,1.075674664362758381e+00,7.902921666580259297e-01,-1.449159143072270006e-01,1.378748691388657077e+00,-5.356648526987564107e-01,7.991460309391494876e-01,4.123610929867655983e-01,8.215886363902358269e-03,-3.072200558313659680e-01
9.670887951602189503e-01,1.128477688938917201e+00,-4.059520408129321800e-01,-4.208209833808446154e-01,-2.292153037244551994e-01,5.672446516186311349e-01,5.867373079624511600e-01,2.162695422777904941e-01,9.553122018598771970e-01,6.688755924731787372e-02,3.868659554838605463e-01,5.135257479207099018e-02,-3.813453331094016630e-01,2.102556789655980474e-01,-4.612840959869596857e-01,1.643057609038047318e+00,-5.606744880718911306e-02,-6.102656888864287366e-01,-3.692632331642705518e-02,-4.653723506827078110e-02,-5.346906848778316679e-01,4.332522768643132238e-01,-6.465199781382647837e-01,1.844015978699522218e-01,1.601768616777481613e+00,3.619690906383261908e-03,-1.395449546550519837e-01,-6.109729837777354566e-01,-1.040400317087460724e+00,-1.111270892827888046e+00,4.937172467333368897e-01,2.225666349593865334e+00,-3.048813657916221720e-02,2.028891993832125373e-01,-8.543531059277338358e-01,-7.173327707314697266e-01,1.933798372646696517e+00,5.651312222077058411e-01,1.668777745339198093e+00,5.368902354885354278e-01,8.499215248129123879e-01,3.420869231553350653e-01,-5.467207156489248265e-02,3.781515461474478923e-01,3.311172337345738015e-01,8.654951440791005535e-01,2.369033329984446823e+00,3.975871413614733840e-01,3.724839188275128610e-01,3.304756939160976570e-01,4.584164009776773518e+00,2.085564109423436285e+00,7.684259552685955841e-01,-3.389651925802845689e-01,-8.190299073283285880e-02,1.171218336188837306e+00,-7.044049161947230075e-02,-3.027762446959944009e-01,-1.025930812799225933e+00,1.593491299442306719e+00,-9.677217776412158634e-02,-3.625885060371024649e-01,-1.045724853925420472e-01,-1.525959065973059303e-02,8.208048644927865567e-01,1.007131785236961008e-01,-5.609362376179698462e-01,5.734457736691007668e-01,-3.865967877767734207e-01,4.511530975086694983e-01,2.504312075877419108e+00,-1.460212688138310400e-01,-2.000211007800571372e-01,2.729163721319342040e-01,2.206136600918354729e-01,6.574243298306380323e-01,-4.469887841468929146e-01,2.492867747565327141e-01,-1.029364056155070761e+00,-6.514482634577933862e-01,1.022771086454019596e+00,1.400387130754312814e-01,-4.153412180267718190e-01,1.528019167587375993e+00,7.344148658620706094e-01,-1.147295815717436440e+00,1.201248780037738606e-01,8.244243346733755029e-01,1.030966471583059985e+00,-1.091494511105892018e+00,1.652966264913505512e+00,-4.521018824830306815e-01,1.211673193619260847e+00,3.378448511063476545e-01,-4.647778519497194893e-01,-5.980020409231960876e-01
6.021406820797914339e-01,6.201963325352171097e-01,5.178260926570967815e-01,-4.461515745638969244e-01,4.527124594738209384e-01,-3.430308245052321459e-02,5.627518152674113594e-01,-7.007203196931915956e-01,-1.208989209182201874e-01,1.505384929449889442e-01,2.017986525677425425e-01,-2.433384865070805647e-01,-5.160663993297163188e-01,1.231743628511031280e-01,5.147379120646866646e-02,8.751427136198526302e-01,-9.827585777084655305e-01,4.053682203546249418e-02,2.751282943582205043e-01,3.070617052492596311e-01,-9.916817831397388705e-01,-4.775765802275427907e-01,-5.963050213613072525e-01,4.615627942637895442e-01,1.398736958372024386e+00,1.445174614797931079e-01,6.071247373457095975e-01,-6.959361637372885045e-01,-6.750154264307238750e-01,-6.720645187289020495e-01,3.348537094501290445e-01,2.474346232120971489e+00,-2.182259183065751729e-01,-1.541947904335516095e-01,-5.528817946764025271e-01,-5.811698955977261383e-01,8.899378344682358222e-01,1.257376886051825071e+00,1.558738996651585662e+00,9.731206919040102932e-01,3.238822523739593451e-01,4.833515294947514640e-01,-2.121735561963397076e-01,-1.062810135655978400e-01,8.873931809069878218e-01,1.051342314742558237e+00,2.234273635316850637e+00,-3.841675639705300904e-01,1.613037263652342124e-02,1.210663188624016895e+00,3.125728346915382705e+00,1.087631132421145397e+00,-4.115763830733880635e-01,-4.463662649145742067e-01,-4.927111155083673255e-01,1.404840622285682405e+00,7.436049787749854367e-02,1.068660744523264872e-01,-5.031251464397556994e-02,2.127990278613052233e-01,1.146896601961926221e+00,-3.887477303412298912e-01,-1.420919755779944949e-01,9.198369884151689213e-01,1.031676489940367425e+00,3.236915333549418294e-01,-6.623591543168250162e-01,1.027350369873812896e+00,-2.081345288407387972e-01,6.030263452029184235e-01,1.756599321381473455e+00,-6.875536472785066522e-01,3.110749869027775727e-01,8.265503917554846147e-01,-4.182795515742905867e-01,1.566035845891674549e+00,-1.351382477361827150e-01,2.233669942073219783e-01,-5.110977814448585121e-01,-4.854464295629027371e-01,-2.676826028448280326e-01,-5.256069020525817592e-01,1.578486308699444951e-02,1.733620556581974670e+00,2.556925269118409672e-01,-7.323961114141634976e-01,6.407005361497597473e-01,1.203530278682098498e+00,5.324726727047714991e-01,8.073465376117767711e-01,1.006726888594109859e+00,-8.447968248132345925e-01,5.826500554703568646e-01,4.364756230204320242e-01,5.381733815148630473e-01,4.357414950556748323e-02
5.677421045942192546e-01,-3.225765145741288364e-02,-1.045773450616113293e-01,-3.376456705165754579e-01,-1.391704431133224396e-01,7.606591088729741656e-01,1.288226444009110683e+00,-3.822817614125343377e-01,1.209485411000922328e-01,2.624998142543897295e-01,5.070127366931858059e-01,-3.093054751329441521e-01,-4.351022381630630376e-01,-1.503263741698740996e-01,-4.130753469382795195e-01,1.088017401472865409e+00,-8.497156202355233834e-01,-4.289410095972024384e-01,1.492553618279097161e-01,7.578462604973916494e-02,-6.796164087007044996e-01,3.015131150012604344e-01,-4.804878742073677711e-01,2.821158073055166637e-01,1.725095711115191222e+00,2.734477855740504587e-02,1.586972657369441209e-01,-7.945196590590073438e-01,-1.523635978265829971e+00,-1.260157279696114463e+00,4.960572512308795146e-01,2.714251550847984973e+00,1.578739721855798583e-02,4.705810883301605463e-01,-6.388931959624234436e-01,-5.834104219939761915e-01,1.523739057496929172e+00,7.446410817245407987e-01,2.235900202085944422e+00,9.452844400074422726e-01,6.846966316450486811e-01,6.340437637468949728e-01,-2.225141705168273143e-01,-8.663574901638403103e-02,6.056655988110759559e-01,8.456043941824493704e-01,1.881552017572986291e+00,-7.156223709626360896e-03,3.649932777039718856e-01,-2.456403282243297959e-01,4.220223060747585464e+00,2.415919176807902247e+00,1.794422973577048941e-01,-3.766003502222787791e-01,-4.775411536866344120e-01,1.588854955184658246e+00,2.420088774834409651e-01,-2.100452829758477635e-01,-4.014296307899822835e-01,2.031776542099660521e+00,2.109919150802641308e-01,-9.758571219539358133e-01,-2.662285300463007598e-01,1.809522516847714146e-01,1.048186105393737799e+00,3.921539702103297165e-01,-8.109310154053308572e-01,1.052712358804414272e+00,-3.896998204439594549e-01,7.797404032679060570e-01,1.934733665580009365e+00,-1.146791397962643178e-03,3.082541473106141794e-01,3.579800062865067245e-01,7.032903502455607747e-02,7.129850578074763412e-01,-8.393588314402599115e-01,5.052547081697722486e-02,-1.080465866643923079e+00,-8.346097243251759945e-01,4.477555805034285630e-01,-1.186726554267125699e-02,-4.973012415881311599e-01,2.122489148684671978e+00,5.658547434317766633e-01,-1.442882257280111880e+00,2.161698211681080395e-01,1.033090855586133561e+00,1.087718923214910927e+00,-6.727746817842245042e-01,1.315139639667967320e+00,-6.168608378450307628e-02,5.986178204911521972e-01,5.530152889267604399e-01,-2.533963438638520693e-01,-7.529004496787361500e-01
6.765753285417700491e-01,5.677568578969601765e-01,1.031776183512363859e-02,-6.765708422051073256e-01,-1.460092336415227399e-01,4.138636424447981743e-01,6.624113448757036338e-01,-1.999866700814466880e-01,6.950693996484360593e-01,2.484586054224713902e-01,3.130878118125834941e-01,-2.743371622642951091e-02,-4.409869686640986997e-01,-1.747160798642845014e-01,-4.416362222969495432e-01,1.248953319041327781e+00,-6.167930270041916962e-01,-6.254846624515249254e-02,-6.467283231767972929e-02,5.773027587811056099e-02,-6.877473829332980682e-01,4.317984299792966274e-01,-4.757208712427501984e-01,1.544043195191708018e-01,1.810542525051693552e+00,1.548150818409867457e-01,1.771446052939286142e-01,-7.281900065470858774e-01,-1.543707111946103439e+00,-1.355853914534032922e+00,2.898364450255992431e-01,2.672981854816199654e+00,-2.795190616800183325e-01,3.242371210967460726e-01,-6.755658712997952842e-01,-4.617363407392839347e-01,1.688133512393434232e+00,7.792101874316069710e-01,2.163417505248788952e+00,1.079003125262615992e+00,5.849573690219904698e-01,5.626222460660044167e-01,-9.566671442763734212e-03,-1.178398043635533604e-01,5.941398383246236925e-01,8.058624050890756951e-01,2.280061779358339091e+00,1.097039912788930205e-02,1.463529042859149643e-01,2.335285978876496249e-01,3.876229907768269811e+00,2.198539490963070442e+00,2.717068851043442645e-01,-2.657930168738759091e-01,-4.533208923056746276e-01,1.620075418796393940e+00,3.850158420384326430e-01,-1.550502292862541431e-01,-7.086322372604022535e-01,1.941278583815362335e+00,2.366725583788656384e-02,-3.758809461768379823e-01,2.810328888536212794e-02,5.869869176390831722e-01,1.336364152443220155e+00,5.785367568549677486e-01,-6.471937604742060701e-01,8.632723051906390221e-01,8.085526399223413874e-02,4.630271111274622542e-01,1.913151772803822537e+00,-2.114047438155128300e-01,1.779095449172364840e-01,-5.754335031034313319e-02,-2.287748942595001916e-02,5.619622477231308588e-01,-6.068292826629502201e-01,3.150120315264303139e-01,-1.389124929838672307e+00,-4.273187602209652658e-01,6.423233409990846132e-01,1.214970329333113358e-01,-4.432593601063033462e-01,2.009922108003257879e+00,8.305830359794877937e-01,-1.404790487669608456e+00,2.937331946768421687e-01,9.233682142093843082e-01,9.213114171639293914e-01,-5.906988135432074127e-01,1.507340686842629784e+00,-2.834978804570945643e-01,7.506234474354961383e-01,3.816692362023973439e-01,-1.385761571837996753e-01,-5.532884174298214885e-01
8.443928963648813513e-01,5.479553133293891820e-01,-1.977217961645479916e-01,-2.616195380649921076e-01,-2.404165535830755096e-01,6.313076343356769371e-01,5.545674708468972813e-01,6.382343659286460191e-02,9.918159423785943840e-01,3.413929417859610238e-01,5.465581031880404339e-01,-3.185794723043905430e-02,-4.294356437875377908e-01,2.413270391617796523e-02,-3.249626841743675221e-01,1.638036230914363012e+00,-3.999345240479396102e-01,-3.518211045819248373e-01,1.307508953473152380e-01,1.482387939081037664e-01,-7.532276815315286367e-01,4.543416181659367670e-01,-4.541257992223137196e-01,2.264865240944032854e-01,1.474275987317646752e+00,-3.698196109468162018e-01,4.460214744657041430e-02,-6.778710228216580091e-01,-7.539251970837963501e-01,-8.396619359058123955e-01,5.397427916912878043e-01,2.505039833956570039e+00,-2.938304054450452396e-02,5.648164645262832018e-02,-6.609728818057968303e-01,-7.067351860424420096e-01,1.568350340630205064e+00,8.628977128125854268e-01,1.677248429297573784e+00,1.124508116284070436e+00,9.270782357664685280e-01,4.093060237067188134e-01,2.505452395336997887e-02,2.305671713265972089e-01,3.993270704018131445e-01,7.653161492318195647e-01,2.448432506188150004e+00,9.922027995580162685e-02,3.477905606154026996e-01,3.743758145799240267e-01,4.417769582541050788e+00,1.928996651853755351e+00,6.551917242033374889e-01,-4.507347990068089061e-01,-4.873330138502106057e-01,1.423930516885201225e+00,2.618470824409453446e-01,-3.132608854287248223e-01,-6.005809449757000262e-01,1.799107819242512285e+00,5.046846697104134805e-01,-5.764904853390691031e-01,-3.846592782945031930e-01,3.424191219942346320e-01,7.137469118220318709e-01,-1.224363972223879715e-02,-5.412343046218821563e-01,1.002313573537270130e+00,-3.571169191233183882e-01,1.446804539985711013e-01,2.606782466989847613e+00,-1.675969651075005229e-01,1.458189809160334582e-01,4.907222437447749108e-01,1.021148742033554241e-01,9.777661657263199135e-01,-2.694699692975023320e-01,3.939807525620356299e-01,-8.169104312840712590e-01,-6.450331552621008102e-01,5.253092061753377173e-01,2.159698007711161050e-01,-3.415835375013971387e-01,1.543816480452180118e+00,6.409804536592592639e-01,-1.121565428865046510e+00,7.248143404478876728e-02,1.487725004825242614e+00,9.320680641576943870e-01,-7.844488202047016356e-01,1.837478332988983443e+00,-2.387951132283473998e-01,1.039158311009537039e+00,4.188656826862735549e-01,-4.566045964353890318e-02,-5.078020343118964108e-01
1.126666459511408203e+00,1.583484351267441692e+00,-6.882281160424134070e-01,-5.894423355523951136e-01,-3.853502541934749059e-01,4.553205699051080524e-01,8.433503914990486683e-02,5.843670779798501025e-01,1.300252187672005233e+00,1.568582512451920374e-01,7.811415545427620177e-01,4.058100581737293377e-01,-2.701859660314773204e-01,3.424111188473337175e-01,-7.096650282688431455e-01,2.325745862920995499e+00,5.771500460677470024e-01,-5.744896778049725095e-01,-1.875754920377882828e-01,-1.940804332397237375e-01,-3.030268103856768036e-01,8.299354272089315421e-01,-6.124907942686795836e-01,8.426669989342604195e-02,1.644244961229857527e+00,-2.408520884655952210e-01,-2.497116095226150911e-01,-4.962370401983922097e-01,-6.806125507613163261e-01,-1.140349943946951994e+00,3.750138229648809496e-01,1.960949582775478817e+00,-1.631841480501346198e-01,9.323349290909424547e-02,-8.895944821685748405e-01,-8.361453384672570266e-01,2.050031240062249793e+00,5.845027119282339978e-01,1.735570644568278365e+00,7.408100814157561054e-01,8.822428441493185280e-01,6.362819090780497122e-02,1.035029352236929573e-01,5.244825588409486317e-01,-6.650838010641846321e-02,7.447449210970924494e-01,2.679957442357562059e+00,4.276839303589300423e-01,2.479595687378735036e-01,6.979051103809240653e-01,4.760765991600318436e+00,1.952538580516157252e+00,1.144519813833763333e+00,-4.171876453300303322e-01,-1.439495759909417139e-01,1.248431143917196451e+00,3.043464792352381654e-01,-2.164685413017769511e-01,-1.485775354000373749e+00,1.971122079762605894e+00,-2.163725104363767027e-01,-3.731888866447491404e-02,-9.825794321970237472e-03,2.217611756195278505e-01,6.611887989519026343e-01,-2.140247886582095083e-01,-5.571200548876885650e-01,1.136317003156607219e-01,-8.289334660334315985e-02,2.358149675973337800e-01,2.899971660961303321e+00,-1.143417912252727153e-01,-3.148063245954304534e-01,1.354938193738859098e-01,1.560800334141623225e-01,6.482349333174743933e-01,-3.090216846115497185e-01,8.519424537359919780e-01,-1.054159835977747095e+00,-4.370132535116746930e-01,1.485386416257764131e+00,5.851690180470097147e-01,-3.200483201366840502e-01,1.169986375106942589e+00,1.213636539627719335e+00,-1.182267560543400542e+00,2.660522363293921222e-02,8.089614607989787931e-01,8.615094076186913252e-01,-1.198538711081173824e+00,2.027301110709267995e+00,-4.338418644580363526e-01,1.266504894908310419e+00,6.297110431419364329e-02,6.653303241002847535e-02,-5.510952413652437931e-01
8.770159856146352295e-01,1.752915669929816289e+00,-3.106402868173301357e-01,-8.496323147922852925e-01,2.360604438947956907e-01,2.584321549112525429e-02,7.012717168941535739e-01,-1.648180898473791123e-01,-2.592037066889709696e-01,-3.178536633836752667e-01,3.693261403054851066e-01,9.146116039619978100e-02,-2.921173668581364402e-01,5.215152275414244309e-01,-5.895906668469476086e-01,1.371601449788553584e+00,1.512636349172290506e-01,-6.696020587947716374e-01,-1.765475552232292356e-01,-3.021278950679366360e-01,-2.269315014349936876e-01,-5.509874988898122439e-02,-9.395459787654121264e-01,2.935503834956907920e-01,1.830716785625006615e+00,7.395629384793018790e-01,6.686246155244753020e-02,-5.250046508871555329e-01,-1.335829839687293852e+00,-1.493073548425714270e+00,1.969999533765759980e-01,1.778191716825330282e+00,-2.091871424828420367e-01,3.454071111630462876e-01,-9.803420581966511005e-01,-7.106081991778266937e-01,1.817335994240054653e+00,5.168029357600512075e-01,1.960099359011215236e+00,-1.206895672433165867e-01,2.161050872418301405e-01,1.991264295357363379e-01,-3.621858100433463235e-01,2.404598070782347219e-01,3.718188297675952825e-01,1.131156798109766104e+00,2.005487201856452462e+00,2.867147589042874922e-01,7.899893759373650959e-02,8.430764595764872471e-01,3.886695261505318744e+00,1.773536055765140507e+00,1.225087762400385860e-01,-2.866866690335963530e-01,2.684027579051986301e-01,1.055313555831285832e+00,-2.391474723756819021e-01,1.696205044541124474e-01,-1.289776310632345879e+00,6.485311383827347953e-01,-4.359841965929496244e-01,-5.220130343325202205e-02,4.568797162535742640e-01,1.125248141450315709e-01,1.133074731310501404e+00,3.455426891816453794e-01,-8.664486030903100211e-01,-2.249582448432144721e-01,-1.415252232323646608e-01,1.352816494735555430e+00,1.749936658831702463e+00,-3.573406314363939407e-01,-4.136652269681978522e-01,2.172990839211142722e-01,-1.274859026573794130e-01,6.802327371974419279e-01,-7.632388779684734503e-01,3.014809201423568341e-01,-1.092585491289371991e+00,-5.324757593733873140e-01,1.268016614015417876e+00,-2.477725563064352987e-01,-2.133672072733709957e-01,1.657628550179537585e+00,8.869256849277249444e-01,-1.086926060701521202e+00,5.865628615222611142e-01,-3.209281054172050673e-01,7.778480950931317972e-01,-2.090460072401618408e-01,8.340166213828265063e-01,-9.777562250244051789e-01,7.967629501424966509e-01,1.160821122200829114e-01,-5.119532413141039684e-02,-3.950632484819604495e-01
8.083751100411474821e-01,1.510290315824106555e+00,1.683752699588858537e-01,-1.145496131316301680e+00,-4.801116356445755268e-02,-1.873988170591600610e-02,1.966928188624695040e-01,-8.017695552157633188e-02,1.170654136647651056e+00,-3.941292603201310141e-02,-2.943378460705475264e-01,1.849039977269571478e-01,-4.763764863409092332e-01,-1.445074306122313135e-01,-4.419804454893921375e-01,1.039963601090330148e+00,-4.355467909120386283e-01,1.894512791427850895e-01,-3.832944562964674673e-01,-3.348387915958368072e-02,-6.611497338440572857e-01,3.432284919659663314e-01,-6.406426410283754258e-01,1.773004764002567013e-02,2.005048773931093375e+00,7.702159602717287834e-01,1.291609615638147079e-01,-6.614311023739913864e-01,-2.030593379373298646e+00,-1.689557776182579518e+00,5.299960118508584284e-02,2.563820760095123941e+00,-5.851815181229547136e-01,3.270633628688746075e-01,-8.515550943436311915e-01,-2.379951793913758218e-01,2.112495088210866179e+00,5.787298012141643966e-01,2.045245944491348666e+00,6.693092729662717399e-01,3.644381559826936345e-01,5.884776985987124620e-01,1.016865603088374648e-01,-1.424787160454032975e-01,7.674046822646078958e-01,9.069355386777229189e-01,2.531070058241611243e+00,2.422994129351736525e-01,-4.651678642163774302e-02,5.873143115754306809e-01,3.443087678874319657e+00,2.130307287278860873e+00,2.370254105989267335e-01,1.291962313962996545e-02,-7.038259501189375600e-02,1.425544471049793094e+00,9.275113838279369638e-02,-1.195064614073807069e-01,-1.159917149230097477e+00,1.445803885212656459e+00,-6.252574961442516344e-01,3.644387289108961259e-01,5.780547487502419868e-01,6.941492457894505863e-01,1.900141821394922825e+00,1.107828250332274500e+00,-4.637254261538442668e-01,5.532446556520338454e-01,4.908337238197791330e-01,4.430098818594495613e-01,1.545460257245194313e+00,-4.816502543250411605e-01,-1.860696059042512562e-01,-6.888154538369620772e-01,-1.802253808319993766e-02,1.154196778452856176e-01,-5.450705437356262451e-01,1.813151475940280588e-01,-1.948370974322244376e+00,-3.561214968251108504e-02,1.005602564916974861e+00,-3.573470397137509802e-02,-4.900377740319848408e-01,2.082959867476478877e+00,9.632250568532835233e-01,-1.365584188075256167e+00,4.940656437583076932e-01,2.553541445626908990e-01,8.848758759155356257e-01,-6.482976837313856322e-01,1.371073802013289100e+00,-7.435857091026966126e-01,1.030355195184448069e+00,2.614617682476791383e-01,-6.288876815500865636e-01,-3.986605797691754605e-01
9.397502380123499144e-01,1.781568621390346330e+00,-1.926287385399543250e-01,-8.061472714160314856e-01,1.192105534544050244e-01,1.074325561468212342e-01,5.774422058712800343e-01,-3.930222392776785978e-02,4.335254972079413127e-01,-3.084119040696103875e-01,-4.070899940284000706e-02,6.044716277614783223e-02,-3.868479898554601504e-01,3.615773241881441447e-01,-4.411120980371651124e-01,1.187767879080002364e+00,-5.246555981330974783e-02,-5.444399286335490640e-01,-2.088006129045594794e-01,-1.755322017747280583e-01,-4.359975862098048882e-01,-7.038821211162227254e-03,-8.969208159902166688e-01,2.136695345891509723e-01,1.788369664289619410e+00,7.581998986615212655e-01,-2.096616057764055796e-02,-5.664448174304688166e-01,-1.514087747559455188e+00,-1.443180968630853434e+00,2.687050784821313210e-01,2.007285891273658862e+00,-2.210890805373708079e-01,3.014095028919736574e-01,-9.966629895571037512e-01,-5.774070269470767958e-01,2.033239515536768849e+00,4.396808083775555764e-01,1.717788727219531131e+00,-8.612030449453844660e-02,4.049196474557795744e-01,3.607710415501338419e-01,-2.167516916526205928e-01,2.619642995355362380e-01,5.603050636440516374e-01,1.097501799214380291e+00,2.203227527636578031e+00,4.454213577521613510e-01,1.696653215883095478e-01,6.726598858684981197e-01,3.960952797417910620e+00,1.908586697281679845e+00,2.963890946428177631e-01,-1.576205494959357079e-01,3.152462137386575769e-01,9.757871181210243661e-01,-4.370819424597346403e-01,-6.573914779162778887e-02,-1.232333121609412663e+00,6.997415851164178191e-01,-5.320554651733271356e-01,5.361602709926294175e-02,4.171368594228372917e-01,1.708137406316212470e-02,1.286720638189228882e+00,5.660157170879938082e-01,-6.309842425854296222e-01,1.478601626050521922e-01,-1.755764425514811655e-01,9.829458370696351199e-01,1.820916823043415400e+00,-4.037051487619003343e-01,-4.589522665931843881e-01,8.173346227107483597e-03,6.131486715615032390e-02,4.776599395581501151e-01,-6.130936216291200669e-01,1.702860762672608885e-02,-1.298385876392361249e+00,-4.757184524770952661e-01,1.173291071018221832e+00,-2.910367874390849541e-01,-3.535971094864913122e-01,1.726185367354785782e+00,7.126666593824326768e-01,-1.066294878751419928e+00,4.915466739822872411e-01,-8.884052820070698075e-02,9.310427171842124983e-01,-6.130795265064730160e-01,1.035597378494154785e+00,-9.693912048094300848e-01,1.122468374134024005e+00,2.511272040242467085e-01,-6.511023332437682054e-01,-4.226931249695151660e-01
7.562903104177844948e-01,1.006159432222798245e+00,2.825856247331742788e-01,-7.987335540030393588e-01,1.007525472292428032e-01,-1.897275878691849216e-01,-3.309602791606564565e-01,-1.783479264287515242e-01,8.017177678373087479e-01,4.750954218375799121e-01,6.942650094594924326e-01,3.125387070802149170e-01,-4.056582354109886657e-01,2.299642861585178555e-02,-2.983256931481103047e-01,1.819511938556801045e+00,-3.022846144202846475e-01,4.637181681860773619e-01,4.070622005500762475e-03,1.950426189291267209e-01,-7.997697153280598492e-01,3.193372228507788124e-01,-3.768401522702027329e-01,2.191056803681379339e-01,1.541364099994771086e+00,-3.073002324351825076e-01,5.202942919813144940e-01,-5.922023516335186422e-01,-3.625208937614785576e-01,-7.874573124718663442e-01,8.960457821769107767e-02,2.426094569231840747e+00,-5.638554580282860718e-01,-3.101226391869423282e-01,-5.017200734820150831e-01,-5.939357082842570135e-01,1.065672997611864181e+00,1.382734042325570289e+00,1.819951402101842142e+00,1.750320908586116886e+00,4.095321476670589211e-01,2.083887140953913364e-01,1.949164930446402599e-01,-9.877631349641359526e-02,4.047894086882231068e-01,7.495440359350704629e-01,2.858408840241381199e+00,-4.644434941780026804e-01,-2.426582877984023168e-01,1.633915488381013414e+00,3.188172855924560345e+00,1.036098132551049211e+00,1.433381350449496883e-01,-4.985772094517019193e-01,-8.460466886852930912e-01,1.780814852197831311e+00,9.355237007649290781e-01,1.702065856633915020e-01,-6.157329618587632503e-01,1.257447768747206762e+00,1.010137944659349696e+00,1.582950077124367638e-01,-7.227797373186135854e-03,1.605997828757261381e+00,1.053884907141235283e+00,9.113453827998049817e-02,-5.652400084648260270e-01,6.589077727428621634e-01,5.310602576869704050e-01,-5.159448993250487225e-02,2.264429485841108480e+00,-6.460463234364388629e-01,3.383799453080137409e-01,3.218883176038832561e-01,-5.331847014224870840e-01,1.403216977671895238e+00,1.167631661210887795e-01,1.191225138102457226e+00,-8.340731322405300352e-01,1.472318988269505358e-02,2.595860816739997690e-01,2.915838000810612729e-01,7.380871187055670912e-02,1.389712909289286813e+00,1.058161065594579897e+00,-9.476617774723877785e-01,4.592590190335626987e-01,1.501174827141894319e+00,2.812256276697219226e-01,5.868833643678468270e-01,1.790488205078537787e+00,-6.233705110885994216e-01,6.130552570171197146e-01,7.006208943550304435e-02,1.339611968625186389e+00,9.870746964886456531e-02
7.972744844545649467e-01,8.463725073633298068e-01,6.173347343469873238e-03,-7.146202912652991346e-01,-1.786765225853138295e-01,1.992432295187936409e-01,2.850300162853591779e-03,2.705540781800302996e-02,1.113218445069722007e+00,4.431352095333378482e-01,6.159278644801429170e-01,2.511142047514938191e-01,-4.015087049391506957e-01,-8.631199998230516812e-02,-4.422481298193092769e-01,1.805599497307234680e+00,-2.693357669736093363e-01,1.884995132948402152e-01,-6.789607401306478607e-02,1.099578361937048609e-01,-7.086355695622479356e-01,6.128677071487405037e-01,-3.724659414576635408e-01,1.247766199149233785e-01,1.660533466138054193e+00,-2.683379094080911020e-01,2.431573536239857170e-01,-6.376847585581136846e-01,-8.271414498389461079e-01,-1.040216543157874263e+00,2.136392199853409946e-01,2.537370342252598832e+00,-4.210826369566853522e-01,-2.971179050984557035e-02,-5.953482985340406985e-01,-5.664793287391868271e-01,1.488806289889601286e+00,1.055568555032470268e+00,1.961858266171259801e+00,1.552647493991117233e+00,6.393801454598886380e-01,3.258581888000879334e-01,1.979774272771409049e-01,-1.813780145568895386e-02,3.565205051183345519e-01,6.914110887317701515e-01,2.727375666749339622e+00,-1.547850369738140719e-01,-1.562207028025303091e-02,9.073262822133385530e-01,3.771188658982088882e+00,1.683536385534566415e+00,4.828129017059232253e-01,-4.035218724722298145e-01,-6.986758890927634580e-01,1.724795276825756174e+00,7.782937111695098498e-01,-7.058765653931339812e-02,-8.003939393418337822e-01,1.926172735092613220e+00,4.692843492185730936e-01,-6.101819257922230788e-02,-5.063653027409054097e-02,1.090797760335580957e+00,1.092826367296498624e+00,2.006485213490315500e-01,-5.447925353834830453e-01,7.429648102999630854e-01,3.417960032282790217e-01,-1.557673706371992539e-02,2.361771774717972505e+00,-3.598486497605671852e-01,2.304504585212855949e-01,6.853135972554408317e-02,-2.025064936720006037e-01,9.241387263476710245e-01,-1.674099905326848770e-01,9.084418049462276157e-01,-1.140144599349951049e+00,-1.718693129206854131e-01,6.081698738995997555e-01,4.265606547207280719e-01,-2.156235952955264656e-01,1.567953693887519817e+00,1.075339544761602539e+00,-1.215523171963726501e+00,2.466343803286038527e-01,1.374880718274909874e+00,6.234786314511733263e-01,-2.818189477094587003e-01,1.923171686254730339e+00,-3.457460044738728255e-01,8.058236051934578592e-01,1.815998451768099375e-01,6.159820808360553235e-01,-2.798183532330245082e-01
9.292811333978232557e-01,1.818070041083714283e+00,-2.809431764191631653e-01,-8.790678265176048445e-01,1.858917243594647717e-01,-1.110776890672671713e-01,2.153450570417581311e-01,-2.499731902650473292e-02,6.807737743438679878e-02,-1.062149042571530477e-01,6.381680527774846734e-01,2.926161948090235665e-01,-2.681665908760719752e-01,5.186407771375556308e-01,-5.951217733746720917e-01,1.788319186979517639e+00,3.399629713976878853e-01,-4.099657472823765580e-01,-1.678270803488778051e-01,-2.384825778430171850e-01,-2.691116383492259678e-01,1.318203340784435684e-01,-8.115849242537984676e-01,2.628432480405784588e-01,1.731882768588946853e+00,3.648309253794920215e-01,1.486720162443334603e-01,-4.771755089351709112e-01,-8.207658880894368458e-01,-1.261351729216920514e+00,1.310024799857506805e-01,1.759084228512239445e+00,-3.335028588381734327e-01,8.864423745048990999e-02,-8.803576870725869918e-01,-7.685686779796465640e-01,1.623576717148546011e+00,7.672776263373426442e-01,1.881271637791312124e+00,3.785442826120232196e-01,2.628077058041657366e-01,4.735387342111069264e-02,-1.828885066951096983e-01,2.562303502172545433e-01,2.013756236730551707e-01,1.011404870367178299e+00,2.345889491645905434e+00,1.013120984083106801e-01,-5.647323641275973916e-02,1.301677880094678219e+00,3.772088618382562153e+00,1.422738781075467696e+00,2.608824450668849604e-01,-3.994080578882267529e-01,-1.089813375192000278e-02,1.221283100798838506e+00,1.662198385218613406e-01,2.329096777395941731e-01,-1.299064893940253818e+00,7.877675167575567405e-01,-4.407364266272809084e-02,1.417378360939987036e-01,3.660146373427010102e-01,5.767344909024586519e-01,9.756132489103798155e-01,7.944168777735111098e-02,-7.976331514888979068e-01,-2.392069906927498657e-01,1.049507636844652925e-01,9.431146458245580622e-01,2.073741438318214225e+00,-4.494430848035835258e-01,-2.941719422431794961e-01,2.887362023343710282e-01,-2.827362250075846628e-01,9.549710069461330164e-01,-4.419936327742448046e-01,7.891997274846067612e-01,-9.316942820853092444e-01,-3.245647670189868439e-01,1.180725728099872640e+00,2.931867259249905378e-02,-5.205183046482755871e-02,1.372601748877657402e+00,1.095384971042834499e+00,-9.935248490720700598e-01,5.376049335402521834e-01,1.211426423506293260e-01,5.466788407060956256e-01,4.526398571887835232e-02,1.190682933272475097e+00,-9.453162679247431033e-01,7.777511299380781562e-01,-2.322903062718634226e-02,5.906818519042615900e-01,-2.026238232539936401e-01
6.429881900860334731e-01,1.100179336592503443e+00,-1.264579571761594856e-01,-1.098183029427396651e+00,1.344835942232600057e-01,-1.411085638950353438e-01,2.867744156155040969e-01,-3.145649090763844025e-01,-3.315459352028502504e-01,2.264474930836071487e-01,1.080866831240286041e+00,3.280705756124350225e-01,-2.307217029502671157e-01,1.820966637765357721e-01,-7.890797833605105449e-01,1.850442815099773375e+00,8.189308722936028406e-02,3.242141948900703619e-02,-1.847066971542974390e-01,-2.340918396387494660e-01,-2.329627372435972843e-01,4.276799898532095412e-01,-5.634914407544702186e-01,2.226567879899513380e-01,1.963430396166381708e+00,2.021347076513422270e-01,4.189124191973355726e-01,-5.622514601394004163e-01,-1.070419520677792447e+00,-1.512671665257161235e+00,-7.802997574056136365e-02,2.095670662530519479e+00,-5.473617922044200501e-01,2.384210484478174741e-01,-6.613904460433428500e-01,-6.593937797334856743e-01,1.306331232107732276e+00,1.029862593244442071e+00,2.610977122512626813e+00,1.166326981231546434e+00,5.090153405205599668e-02,1.049841095034800831e-01,-1.270985922883132169e-01,-1.920913753677924163e-01,1.472303785733575232e-01,8.441121924645788033e-01,2.245873584980871307e+00,-3.643334871881495074e-01,-2.902883902575007502e-01,1.173142915716039791e+00,3.334042973799994591e+00,1.599287117866213137e+00,-4.857082073777030384e-02,-4.706966397518149159e-01,-5.604240297419886829e-01,1.834879202899726280e+00,9.968390497337529244e-01,4.523062634447990726e-01,-1.115604315736746566e+00,1.673433167123004273e+00,1.410075886263521261e-01,-1.519407862389671182e-02,3.903813891768384003e-01,1.252365144348711379e+00,1.236218564210166626e+00,2.189283083638193239e-01,-1.019638279588867213e+00,-1.707009263449783543e-01,6.246536242810764028e-01,9.690653610640600490e-01,1.755997662844719809e+00,-3.382841097748495729e-01,1.675759373798970664e-01,6.037689295862432026e-02,-5.740988615153382879e-01,9.445056319596119021e-01,-6.738746245753016728e-01,1.262491373633328529e+00,-1.166590242992309179e+00,-1.449860072561148239e-01,1.005956657096703566e+00,3.482351860459040882e-01,-3.623113071719363809e-02,1.703113675747996547e+00,1.481300087501129070e+00,-1.376617660999138071e+00,5.956872667202268712e-01,3.355073491531960217e-01,3.726393700250641983e-01,4.905800283659090266e-01,1.245719869957523152e+00,-5.410367337532004939e-01,1.489091431710505287e-01,-1.047874184584495216e-01,1.427880781844889313e+00,-2.535721230249281533e-01
6.331102613060652917e-01,6.328759394054239706e-02,5.646861598645344094e-01,-5.180089373348969461e-01,-2.669611301279033455e-01,4.165393842951071735e-01,1.506428683279122938e-01,-2.067112736145996221e-01,1.876280750899451233e+00,6.358729661496677066e-01,-1.138469438090156660e-01,-7.962291888749373214e-02,-6.477425489701190697e-01,-6.349539589736503675e-01,-9.784909764761540174e-03,1.035276503604917409e+00,-1.306785796930311383e+00,6.471528476085776083e-01,6.740933522184816562e-02,5.233369669808809466e-01,-1.316045896546995220e+00,4.983742709011353411e-01,-1.543061818863942780e-01,7.808620163001922521e-02,1.565995481715990678e+00,-3.000348056034177757e-01,3.670707809768626317e-01,-8.450502462711845242e-01,-1.292121938783408641e+00,-8.721462433188948982e-01,3.664308649385027428e-01,3.339497556802291545e+00,-4.194254724805273060e-01,-6.088902708242621697e-02,-4.282419604760259735e-01,-2.254362415336976788e-01,1.459168624050097396e+00,1.160191545107312372e+00,1.746372268920881599e+00,2.010515687935731766e+00,8.852032706474934898e-01,8.347993091012849698e-01,3.793869898892234804e-01,-3.055238185182755362e-01,9.672807421208470258e-01,6.232188396557764021e-01,2.841958054085064855e+00,-2.250742866633423656e-01,1.249572920623011618e-01,3.808927546274583631e-01,3.519151482041578127e+00,1.948189059139928903e+00,3.291666900039026955e-01,-2.185596285125003813e-01,-9.576160775219166865e-01,1.860443999149848704e+00,6.202472160218648334e-01,-4.415837039808984121e-01,-1.024090255855064635e-01,2.090231613825357826e+00,7.768644583146491200e-01,-2.650023168889782399e-01,-3.112311564364649286e-01,1.178737346424844956e+00,1.485946128268463617e+00,7.693479954808122301e-01,-2.240964258668640685e-01,1.909361142172836256e+00,2.567493430039918811e-01,-6.104156295183399417e-01,2.140567981474057913e+00,-4.469733109484935740e-01,5.593837117649276269e-01,-1.285346519305975710e-01,-1.347580902635085731e-02,7.759174480517700978e-01,6.553039299689533692e-03,2.468481689497933340e-01,-1.414484039756321643e+00,-1.637102389716087458e-01,-1.930180657539944944e-01,1.697743894822411059e-01,-4.582479966280569861e-01,2.039764852755359126e+00,5.234762889492119431e-01,-1.252885571645030227e+00,1.629200451877861888e-01,2.164918013947910946e+00,8.754488457902246390e-01,-5.338365632212007661e-01,2.087211086517968273e+00,-1.253142603306477976e-01,1.006504148544488997e+00,6.075573814544638074e-01,-2.399248696661176461e-01,-3.127352563486328618e-01
8.343720896247809327e-01,1.771493752561567714e+00,2.989780075697290873e-01,-1.024128451538187434e+00,2.292595452757450469e-01,-1.068232370654469410e-01,4.719812254354583958e-01,-2.749018206088487126e-01,7.828421698732299649e-01,-3.595583938813419200e-01,-7.250269881527322546e-01,-3.744550597616252974e-02,-5.356598351500114763e-01,6.196165707498186431e-02,-2.068019874075794073e-01,5.460818803867395488e-01,-6.224434387092453447e-01,-7.446931545975753186e-02,-2.944436951556316795e-01,-3.619568698178317334e-03,-7.447510192923471051e-01,-2.187891404685845531e-01,-8.685237980432995997e-01,1.496101356686954653e-01,1.887912097588172688e+00,1.161791614420597973e+00,1.393878275063274441e-01,-6.565029106348594379e-01,-2.094981343621899139e+00,-1.585788921671118734e+00,1.558873619281689327e-01,2.402190328631513161e+00,-4.365741898653501818e-01,3.126764123216794200e-01,-9.635076696474351721e-01,-2.450129628518383784e-01,2.106576364735394780e+00,4.630605982080211458e-01,1.673562313875379681e+00,-1.585964946494500261e-02,2.727780670261966134e-01,6.637226684982182601e-01,-1.146379807838091985e-01,-2.706427473425156160e-02,1.036150295159917523e+00,1.144312952778699266e+00,2.303474718182120018e+00,3.972823841220208263e-01,5.857696225207676549e-02,6.528673802860155417e-01,3.343981385408871354e+00,1.947627523878860734e+00,-3.137762959698675580e-02,8.238329018391299385e-02,3.230015191833598420e-01,1.028960504358328087e+00,-5.935683348061128184e-01,-1.326428892194044251e-01,-1.012238703456910915e+00,4.223139742782875405e-01,-6.410187467130459282e-01,3.254293244235720861e-01,6.338788674782227517e-01,2.748717145268577688e-01,1.894176391469689413e+00,1.234395773890641257e+00,-4.425049137238862285e-01,5.734481984514949726e-01,9.041215481141953725e-02,8.012908237068444572e-01,1.292359309543058332e+00,-6.382471774778839535e-01,-3.957193660509819022e-01,-4.243207481508682877e-01,4.263373482340483689e-02,2.222610721563768044e-01,-5.537794202019518108e-01,-3.745319833099167717e-01,-1.746464830974181703e+00,-2.298556339000124848e-01,8.315939994648158251e-01,-5.866519151177360669e-01,-4.593284078626999056e-01,2.118789664453806232e+00,5.006575516815257032e-01,-1.085710739981257111e+00,6.593880049759723860e-01,-1.115046350633603911e-01,9.697213045269156284e-01,-4.746880002335521209e-01,8.869544422151998120e-01,-1.127795488865908968e+00,1.188298425370035938e+00,4.000385270352270761e-01,-1.165298165270848507e+00,-3.045206553448047693e-01
8.425210374294989091e-01,4.521518168296372875e-01,-1.386502863221275583e-01,-1.139315226928637736e-01,-2.361227730122494317e-01,8.132363606711814352e-01,9.034561338330509006e-01,1.034676970882678071e-03,1.078107722447722683e+00,1.857875814521024183e-01,1.131544513509715189e-01,-2.565428629629989410e-01,-5.123636615820608142e-01,-2.847184812674278392e-02,-1.720396164936503214e-01,1.188852830566872409e+00,-7.089358341055986834e-01,-5.351685077641900046e-01,1.738197602472299763e-01,2.101197557050316078e-01,-8.831125521332533479e-01,2.544081330422930387e-01,-5.346542345323987977e-01,2.455857751517871446e-01,1.448077975987854371e+00,-1.340263874288827317e-01,-5.549530253016479731e-02,-7.409428280542312839e-01,-1.116185253510288966e+00,-8.709746589645531722e-01,6.877871233947624452e-01,2.636845601708979636e+00,1.220587105903664926e-01,1.789033289708893970e-01,-7.337518053199272305e-01,-6.246931837509539509e-01,1.761819306328542556e+00,6.622529350965180583e-01,1.495376213309288715e+00,7.396281287691435224e-01,1.034775204960627137e+00,6.158702641559085089e-01,-5.822248433021678937e-02,2.712806104078339109e-01,6.566581001547016072e-01,8.571004054023630969e-01,2.278805654456078411e+00,3.191846812100003761e-01,5.442946190992192790e-01,-5.000651722157012369e-02,4.585656187662880079e+00,2.194842043105669660e+00,6.313839933124920645e-01,-3.264188926074189645e-01,-2.496396531146448661e-01,1.204011076891578158e+00,-2.318847799360722606e-01,-5.125835971921824941e-01,-4.596239049467394366e-01,1.579995089577531431e+00,2.980168623942891504e-01,-7.469299213265566673e-01,-4.264853518579221348e-01,-1.212934508237990539e-01,8.151262457960459784e-01,2.343238293980685616e-01,-4.538932076185686060e-01,1.297651819869159784e+00,-6.890128932702750397e-01,2.426199112932297397e-01,2.459432297572694104e+00,-1.362681634825810839e-01,4.588107709267914835e-02,4.740615129513021664e-01,3.335416166603396015e-01,7.745978249983815900e-01,-3.776901721233927312e-01,-1.940179547053233478e-01,-9.107839103002319803e-01,-8.417619478068296690e-01,4.269965104711138104e-01,-8.403626006222320033e-02,-5.147619372557399320e-01,1.752218633835834094e+00,2.741987066670826811e-01,-1.102792705202043644e+00,4.748637883189010811e-02,1.382291075183890605e+00,1.197003290876262671e+00,-1.154521358469485559e+00,1.659872177422231809e+00,-2.751103046438192479e-01,1.259373565638870707e+00,6.396991763169730394e-01,-8.740946597150842656e-01,-6.442514184210372807e-01
7.716618174974478883e-01,7.901312154380870645e-01,1.508820328615559370e-01,-8.586229080868162944e-01,-2.572331690868766563e-01,9.404894339676894699e-02,-3.271058813450871683e-01,6.761045191091119566e-02,1.513962887849008343e+00,6.152306640714728658e-01,6.137611016854275237e-01,3.764983378365115985e-01,-4.255291840758250732e-01,-2.712360112848452576e-01,-4.455752770423110354e-01,1.905284651935389872e+00,-3.335172228283230789e-01,5.577894785104334785e-01,-1.347065573749484380e-01,1.833035407289963781e-01,-8.052066580637100568e-01,8.102057780722885516e-01,-2.341170167272196290e-01,3.894550216808120857e-02,1.706636077584298583e+00,-3.930590689262032367e-01,3.271431564122241897e-01,-6.529794921641539629e-01,-8.318372268827611826e-01,-1.050239654364779618e+00,1.055856939616389711e-01,2.730633182332634412e+00,-6.063087914324809535e-01,-1.161159728490896159e-01,-5.084694721168120379e-01,-4.604405562937141649e-01,1.453809501362674172e+00,1.195930245021706861e+00,2.050356618740074577e+00,2.007585787431479751e+00,6.380825206718463427e-01,3.520565994393136111e-01,3.835416799732354054e-01,-1.599453853290265792e-01,3.704519580205057894e-01,5.786467763036038381e-01,2.979330741357557599e+00,-2.936414212584755878e-01,-1.489010953300341500e-01,1.054333558214246791e+00,3.532248456364323275e+00,1.632441979284651401e+00,5.133213090786852284e-01,-3.783933526561552019e-01,-9.367200719439081613e-01,1.947602842653237021e+00,1.118697883746278876e+00,-6.572727505104056234e-02,-7.872401955698711262e-01,2.243012968722446931e+00,5.687603661690007195e-01,1.391531669179418840e-01,-1.535586738172370347e-02,1.513522693896119709e+00,1.267965734436666603e+00,3.080403915304298357e-01,-4.548135357259363021e-01,8.784460221880190378e-01,6.854038308206030772e-01,-3.662484797264893288e-01,2.376328800335945957e+00,-4.272934663659522236e-01,3.675868222161524645e-01,-1.714371290829570793e-01,-2.893623657992407949e-01,8.858361773459717536e-01,-2.155662904197402918e-02,1.149605792507052415e+00,-1.327976496535966611e+00,7.404789050142801532e-02,5.227451495420396554e-01,6.216665969274086656e-01,-2.059967591921621766e-01,1.592347521235659702e+00,1.248561568527505994e+00,-1.289594132789218639e+00,2.326212738508129929e-01,1.652830017052910438e+00,5.193947657770844328e-01,-2.015803126350227958e-01,2.177231828059663865e+00,-2.593949999272416873e-01,7.703107334076895185e-01,1.303952003315715924e-01,8.558712759032882644e-01,-1.965613623932538356e-01
8.558598315750335361e-01,5.537947951620778575e-01,2.045067996598863569e-03,-3.720377575126981862e-01,-3.408269644465838355e-01,5.567905343163934706e-01,2.094591966521564541e-01,1.461363016481068422e-01,1.655743420004800903e+00,4.689709213073132155e-01,3.057989749868019747e-01,5.418248561625990667e-02,-5.007265552705474354e-01,-1.993384062423398939e-01,-2.396244748615565801e-01,1.598855473399067417e+00,-5.629550943765837534e-01,2.444864686730602310e-02,5.558651027469973388e-02,2.738832982271752203e-01,-9.439645332854200710e-01,6.072459762797748350e-01,-3.315088901861330539e-01,1.195298815178016671e-01,1.490532712138519678e+00,-4.290048898116745058e-01,7.952114265002473148e-02,-7.088058735007179978e-01,-8.552870021925540467e-01,-8.235961895223404827e-01,4.784764877513802972e-01,2.769985432520586155e+00,-1.971712093912048602e-01,-4.407064448760381059e-02,-6.030356835348256173e-01,-5.449114549514632033e-01,1.645634522182957582e+00,9.405242804891835728e-01,1.610755520622875636e+00,1.487204062479732691e+00,1.001414477080117882e+00,5.142400480383292338e-01,2.455251957072814850e-01,1.217388774722720501e-01,5.248435637603530157e-01,6.692880393907965075e-01,2.756025094887107230e+00,6.511495715876261525e-02,2.734999391540210989e-01,4.429729805128531650e-01,4.218482982702077777e+00,1.927754154413731991e+00,7.413819485393697839e-01,-3.564630586380790334e-01,-6.402728140121548561e-01,1.551483600734749890e+00,4.153240855144681998e-01,-4.183860517675378476e-01,-5.602234341694226627e-01,2.013854732486223931e+00,5.352126726716363025e-01,-3.323377972308188544e-01,-3.546202822047738179e-01,6.490323855755957272e-01,9.547777746306833624e-01,2.084412630959027180e-01,-3.443655344415894048e-01,1.292405068382850519e+00,-8.571735972504618273e-02,-3.162799270219653902e-01,2.625168245932142153e+00,-2.693508659947212447e-01,2.233572079093477103e-01,1.847427484767051598e-01,1.161051266679424959e-01,8.487387883117414322e-01,-6.609653001413878792e-02,4.324294117249860014e-01,-1.077462730611042918e+00,-4.031001370977222442e-01,3.978931462125305796e-01,3.240993078625480361e-01,-3.960153090484437310e-01,1.601088088380633101e+00,6.820012351173386778e-01,-1.154480909699220348e+00,3.355929415420283446e-02,1.802777344371764956e+00,9.146826374996981368e-01,-8.861191031949593455e-01,2.118956749799338901e+00,-1.989397955328885970e-01,1.177948417845664730e+00,4.435789816013308573e-01,-1.610200576285539253e-01,-4.335565722072877159e-01
5.631507675577258620e-01,8.843587375465218337e-01,4.082120461459087801e-01,-9.964301065787325440e-01,3.259947537076710034e-01,-3.235084575130925955e-01,9.026719653888426453e-02,-5.745251037369063507e-01,-7.058189839977091484e-02,3.104125600932817752e-01,6.369172527348883062e-01,1.693352251294168442e-01,-3.884786002843266250e-01,1.144655226141252924e-02,-3.693381506414602500e-01,1.392929568524376105e+00,-5.218478724121886625e-01,4.467823448560627186e-01,-3.128952177728588219e-02,8.734468736943717948e-02,-6.823341333366722550e-01,5.392486356219988730e-02,-4.813607302187061787e-01,2.859338535087424527e-01,1.755116872367107561e+00,1.670824471604757389e-01,6.757104850985851119e-01,-6.329525069902778300e-01,-8.943381711200000250e-01,-1.139732688154736273e+00,-4.415561038420506845e-02,2.418677396383297928e+00,-6.173310273770736822e-01,-4.746917172542078345e-02,-5.208106301485665446e-01,-5.052459112094420668e-01,9.823526756762305245e-01,1.322737322275385097e+00,2.220047745075123924e+00,1.462591814730425765e+00,5.106629713926369440e-02,2.987577133253821460e-01,-3.474455621869846494e-02,-3.434567981737083331e-01,5.609409344130703579e-01,8.830816533479383112e-01,2.439041178073007909e+00,-5.823820993806070323e-01,-3.471691752719574531e-01,1.489370943951069837e+00,2.786479872305087646e+00,1.176422693674855413e+00,-3.662615750555191507e-01,-4.330800517864396570e-01,-7.413022553722602437e-01,1.847065854912572913e+00,8.780017967663269474e-01,3.894251871641833951e-01,-5.655237428212671613e-01,1.042348634965448717e+00,7.631377036361186583e-01,6.077281679033741391e-02,2.523249051081145611e-01,1.605039772569597289e+00,1.373454792778144418e+00,4.265667111315420423e-01,-8.052471914166133837e-01,4.519411248907408973e-01,6.208148715398034145e-01,5.772246409549850465e-01,1.612797170192574292e+00,-6.482350967718342183e-01,3.739769398267088207e-01,2.177198278834854839e-01,-6.832536243222144812e-01,1.274575994080550556e+00,-2.845270183678119125e-01,1.014701799958221518e+00,-1.011473350788590464e+00,-2.739354123985926481e-02,2.556037969273428079e-01,2.056678264583987337e-02,6.141096339261520320e-02,1.767988124407124939e+00,1.055953421223783550e+00,-1.097292784309382485e+00,7.091225105211091950e-01,8.905069812096164661e-01,2.692671569482167904e-01,9.885627301697463842e-01,1.224108972058763900e+00,-7.125519731832968828e-01,2.234696734248963201e-01,7.541985472731255191e-02,1.373824314578417471e+00,5.352368337530416520e-02
8.077984013728448653e-01,1.024954189453109343e+00,-7.947594104238214774e-02,-7.598691421897854070e-01,-1.052318437657371875e-01,1.725317590071924756e-01,1.655967072068582624e-01,-1.002080711512393779e-02,8.078356941255018242e-01,2.869336230620729289e-01,5.877832725730811614e-01,2.249739171760136158e-01,-3.712974557597070735e-01,3.293526396752811947e-02,-5.006621579356623775e-01,1.728438375499417479e+00,-1.658701031859337871e-01,4.594161549794001376e-03,-1.031700771766120572e-01,7.200046445206213785e-03,-5.854062094749654666e-01,5.024622204285122962e-01,-4.881590799756251320e-01,1.527049740365952202e-01,1.719729491339991645e+00,-4.957201137107743877e-02,1.996613653262908072e-01,-6.150957805308224779e-01,-9.714829564146166829e-01,-1.171906282070674044e+00,2.005043745002369759e-01,2.379454788834602041e+00,-3.822032101756815958e-01,7.464257430655578396e-02,-6.781695375984094776e-01,-5.946018254474275677e-01,1.573913428309768880e+00,9.296460900552828699e-01,2.008469594347768172e+00,1.206922648845870638e+00,5.433711172603109540e-01,2.978938078501403020e-01,7.866591664041364118e-02,2.547298825892499105e-02,3.438035049508021967e-01,7.767524956911878720e-01,2.561393330925088030e+00,-6.098723090648799916e-02,5.553136887339049643e-04,8.615698124414774561e-01,3.807185927222526356e+00,1.741957775784916063e+00,4.126229323757503176e-01,-3.767976430562934298e-01,-4.997962690798003482e-01,1.603074787373402810e+00,5.918999238040019151e-01,-1.383271828104525036e-02,-9.273432359100545197e-01,1.724456324408874197e+00,2.386801953576101476e-01,-6.524451545990511692e-02,6.949774250613460769e-02,8.848458848010131161e-01,1.115690494988937687e+00,2.398173529207457966e-01,-6.277159742699891520e-01,5.152814876227390650e-01,2.603684874715212483e-01,2.928902397839506233e-01,2.220523276833834991e+00,-3.392575678242212844e-01,9.739878842383817292e-02,7.044161505466907391e-02,-1.858367879722013227e-01,8.412736014356254621e-01,-3.254082654205553982e-01,7.978628345015212897e-01,-1.160640666323730308e+00,-2.458286305898011448e-01,7.823923715683276381e-01,3.089648796737105574e-01,-2.263895813696567005e-01,1.604613415618058703e+00,1.068381863710853974e+00,-1.220837143726082541e+00,3.145330091689940710e-01,9.897668280874624136e-01,6.616911890928274254e-01,-2.893616495728232874e-01,1.695086277772031691e+00,-4.560188497193877200e-01,7.834203186229804494e-01,1.593566240505394638e-01,4.846252695743760164e-01,-3.258488445659182275e-01
6.897456702603212975e-01,5.243163709148483953e-01,2.421871998321901143e-01,-7.619040020584036954e-01,-2.861897634499679932e-01,4.003023772375040590e-01,3.603855006079368373e-01,-1.045852460813704171e-01,1.522838963484985264e+00,3.686956406795527386e-01,-6.983828561875798924e-02,1.609208276180590369e-02,-5.446033204463264221e-01,-4.635014808758114446e-01,-3.144446672324637815e-01,1.100720102190407168e+00,-8.849584328184865178e-01,3.240292295416432600e-01,-1.445552852337950722e-01,2.182077404101594453e-01,-9.403502852307241699e-01,5.910997933655286474e-01,-3.437998605514158701e-01,2.634175388596318723e-02,1.829619178919463796e+00,1.306929745281935062e-01,1.783485254690232169e-01,-7.842777243521973363e-01,-1.773586075404702367e+00,-1.356474134174572743e+00,2.624607162693753382e-01,3.031186597845046737e+00,-4.313176446565594180e-01,2.517145810702650643e-01,-6.259514464487887508e-01,-2.503588757076922189e-01,1.846702715236163694e+00,8.073344525167027719e-01,2.055391610418693116e+00,1.419727622027522340e+00,7.176628459583531683e-01,7.439014336404434768e-01,2.338199812919548592e-01,-2.341095516054818582e-01,7.977460062666037466e-01,7.059714608504663591e-01,2.595930281370894210e+00,3.717652533029426609e-02,1.208665999229373844e-01,1.615923055826097854e-01,3.722135302300734860e+00,2.304552428368037198e+00,3.924167424085024392e-01,-1.223164276818084206e-01,-5.791849928718660889e-01,1.723027360298610811e+00,4.509324625582946666e-01,-3.435596443196062277e-01,-6.325034688763729873e-01,2.204210603183919481e+00,-1.361016085860908276e-02,-1.503489282464863241e-01,4.257346146242992763e-02,8.118160770374516222e-01,1.642785958831733062e+00,8.992342221565112759e-01,-3.933676115045193766e-01,1.290071646272757278e+00,3.109955517570346939e-01,-6.361082106560655980e-02,1.912840279567104229e+00,-3.017184559452307235e-01,2.474724121143500599e-01,-4.356827817886926857e-01,6.919865318954494804e-02,3.347727095800571151e-01,-4.093935807488683909e-01,2.091476023571010590e-01,-1.735514016720726804e+00,-2.016801047794470891e-01,4.844705474642272414e-01,1.943205982584227942e-01,-5.675674607769636282e-01,2.138700940033494646e+00,7.949766551726885622e-01,-1.459955380125185442e+00,2.236579657378634789e-01,1.279148843948613390e+00,9.853491051127878375e-01,-8.554836528040810073e-01,1.814888617875451970e+00,-2.165169073500143315e-01,9.747315622778455202e-01,4.717306909479664911e-01,-5.077230997249386757e-01,-5.245297625706903943e-01
7.358599737244760908e-01,1.099619368689153553e+00,-5.504042689443038039e-02,-8.245103431132211336e-01,1.697272644328577385e-01,-1.241124231572037218e-01,8.306511264625077162e-02,-2.336235852084467546e-01,-4.933005664217360309e-02,2.996739667670518248e-01,1.063530050021169959e+00,2.947844383263090728e-01,-2.764267562791056232e-01,2.769937440559022690e-01,-5.590063519557177951e-01,1.954201507759451673e+00,4.390093792247207194e-02,1.539135821040647778e-02,-1.631795809146861093e-02,-6.640431307890548585e-02,-4.298231722142599187e-01,2.836318177530441353e-01,-5.347253079733461645e-01,2.932948822711536896e-01,1.668152250004306225e+00,-1.269657152018759672e-01,4.383805670551949030e-01,-5.412102206263136317e-01,-4.598577508699766003e-01,-1.037268899378211318e+00,7.311799511279928887e-02,2.065125068468390168e+00,-4.359398167415190484e-01,-6.562179449278277010e-02,-6.083607738023382172e-01,-7.642371523641435793e-01,1.103486519529411014e+00,1.202569753222338944e+00,2.131084127494105029e+00,1.284406343833873976e+00,2.428822933193979239e-01,5.201134381399541429e-02,-6.732534064117708106e-02,-1.424134670271179348e-02,1.652050706040479877e-01,8.428775860242423423e-01,2.452930381741606158e+00,-3.922015144354043525e-01,-2.094522597799047814e-01,1.473980859867501270e+00,3.432750744339602811e+00,1.204635190188093175e+00,6.977559827859891595e-02,-5.756033816856211960e-01,-6.307360999184045136e-01,1.697582633461997448e+00,8.708850326369519390e-01,3.535239103277572070e-01,-8.759212695755854705e-01,1.265201247635183712e+00,6.823346770904723524e-01,-5.294254381708546342e-02,1.080213362438493113e-01,1.262064626636534959e+00,8.913161604391588444e-01,-9.155155495902972396e-02,-8.687490478449320097e-01,9.304671751573201366e-02,3.735818007821158360e-01,6.229058960789795041e-01,2.144905231978502691e+00,-4.579565361964493819e-01,1.985872569296033285e-01,4.687738405101810057e-01,-5.600081664658472791e-01,1.355200376699461806e+00,-2.846840210590239062e-01,1.257322135326411683e+00,-7.321327863488077403e-01,-2.086054307901732130e-01,6.719980478645406485e-01,2.805724609605841358e-01,9.276658333732951123e-02,1.392868629010712178e+00,1.222221712037068642e+00,-1.062050253051460613e+00,5.191070271773566835e-01,8.642668476526573773e-01,3.070023840867482923e-01,6.104340160096186629e-01,1.437992306147270805e+00,-6.282248148303002377e-01,3.669198491282646968e-01,-4.182953001251077385e-02,1.518520897368936140e+00,-7.203506301432865966e-02
8.245444525405101199e-01,1.414787682298470628e+00,-4.766062649897939707e-01,-7.649939228305231431e-01,9.292593266702085797e-02,2.894607203322555611e-01,1.017604815824791231e+00,-1.491480367753373615e-01,-3.625914611772285134e-01,-2.641072292277506506e-01,5.227881267911828056e-01,1.756665476946825399e-02,-2.673132146224820316e-01,4.401149697914459313e-01,-7.106334006841236173e-01,1.396346046617668479e+00,1.182202892186064447e-01,-8.331478596460193398e-01,-1.606095211081092766e-01,-3.550451049037980367e-01,-1.447722442238729146e-01,1.244442793877755249e-01,-8.956616795769538619e-01,2.765696958911366687e-01,1.906619288094105302e+00,6.702250188239662343e-01,-2.496613958167162584e-02,-5.683313208582765341e-01,-1.548040395217603837e+00,-1.630603127157710608e+00,2.653537287314490234e-01,1.864828465868378249e+00,-1.031889873774558819e-01,5.376675072067949035e-01,-9.772680148839580916e-01,-7.324681052519080859e-01,1.908153447546542480e+00,4.060542387969516276e-01,2.192254275110721018e+00,-1.007505105050179317e-01,3.078432329845600113e-01,2.520578391817825392e-01,-4.087607887229262049e-01,2.209845030453897463e-01,2.993486664463990143e-01,1.078756389049876363e+00,1.825075735454451564e+00,3.384194591492297732e-01,1.929708035727965010e-01,3.830238354448013971e-01,4.193979583680230050e+00,2.149652549564192050e+00,2.214992156812320978e-01,-3.014247418811268897e-01,2.270234172685918761e-01,1.136838478090135940e+00,-1.683877949107036587e-01,9.994248231481317468e-02,-1.295194470632273109e+00,1.167156661829674924e+00,-6.043756673802493928e-01,-3.365204613151544510e-01,3.642627132970659432e-01,-1.044994428263182895e-01,1.088880405437349541e+00,3.264127082570648097e-01,-9.563890684918164853e-01,-1.779184386328768186e-01,-2.510908868918376724e-01,1.469925923410224211e+00,1.776210271545088260e+00,-1.380879807989839336e-01,-3.528323386969922093e-01,1.831721078182856344e-01,-1.280122986366287463e-02,5.113494420508870597e-01,-1.000370123525825106e+00,2.406524693215110755e-01,-1.174501209927635292e+00,-6.933604254957892454e-01,1.386534692684518788e+00,-1.295098155588534361e-01,-3.449545877276104511e-01,1.796387485325814160e+00,9.334988005994360183e-01,-1.292546973006427846e+00,4.724399951463178482e-01,-3.244047614119771605e-01,9.328470181501751224e-01,-5.459583373205902923e-01,8.687155774955734877e-01,-7.127335502213560936e-01,7.193715190974920848e-01,1.735666349812902132e-01,-1.980138651744116074e-01,-6.328404462019414645e-01
7.121735640846637017e-01,9.147825571655550103e-01,3.692407645094540336e-01,-6.000712874365619065e-01,2.605865810447846043e-01,-2.212134870405463305e-02,3.028661140903284865e-01,-4.162351159882359819e-01,4.229578946939192008e-01,1.635537465650252209e-01,1.673344317538477677e-01,-5.362559000192512748e-02,-4.926326705208632917e-01,7.576327706783314575e-02,-9.123770965694555368e-02,1.115862153271581114e+00,-7.123225626951430467e-01,9.767204616520316907e-02,1.033604937673046065e-01,2.282855363911114877e-01,-9.037422164892856546e-01,-1.580620133416308359e-01,-5.728255920357857578e-01,3.255109131550978363e-01,1.505956525729712059e+00,1.461369616501180524e-01,4.501900674455899809e-01,-6.624933649519079149e-01,-8.252345574032439179e-01,-8.434347105699024905e-01,2.736205584185602002e-01,2.463212278027947733e+00,-3.201135320406428564e-01,-1.143272002253675201e-01,-6.194506371346973905e-01,-5.352540632816731314e-01,1.206708482876985400e+00,1.120920208218027181e+00,1.610311708185457658e+00,1.015611735183899800e+00,4.117971265324145147e-01,4.457319049871611427e-01,-6.059936791058073702e-02,-4.848835820486062376e-02,7.622376021367958110e-01,9.654111270680827417e-01,2.445385886717222679e+00,-2.171273575917673226e-01,-1.809456814870213925e-03,1.154643947135149507e+00,3.303052898311504393e+00,1.282221402444519764e+00,-9.551327049680785608e-02,-3.660146886591061910e-01,-4.385631688685248664e-01,1.420924524901843178e+00,1.689021975669682818e-01,2.424296921870880417e-02,-3.905846070923452706e-01,6.259562732294341458e-01,7.706652428351453699e-01,-1.390820543727478154e-01,-1.306063355408596666e-02,9.223713716731198886e-01,1.148148012191584355e+00,3.894175632418437338e-01,-5.658965715356282233e-01,8.909602187297652742e-01,-1.830947854028285027e-03,3.915609236252339809e-01,1.904620237796973425e+00,-6.333512369880252013e-01,1.783220711314188467e-01,4.649892610255665915e-01,-3.087823605292214779e-01,1.251956629562037682e+00,-1.244629873361978722e-01,3.582554007780406335e-01,-8.200800460424294558e-01,-3.302692789960318120e-01,1.003454228739355525e-01,-2.742871395068250950e-01,-8.433065639414683012e-02,1.683124458969321946e+00,5.065851082227030844e-01,-8.611822403558719863e-01,5.388427068316583579e-01,1.117688120693364873e+00,5.861127559496628336e-01,3.722598204957663914e-01,1.277496549677003213e+00,-7.915632698577532711e-01,7.690864212452830362e-01,3.486237013223248971e-01,3.591237685667541535e-01,-4.211912990218608099e-02
7.172236795617106253e-01,7.966269273103578907e-01,-2.263537182050643151e-02,-6.550877002051299636e-01,7.264503233853321362e-02,8.547526067919705706e-02,2.403032577683027471e-01,-2.259579221158154183e-01,1.870129829876575611e-01,3.616457556996460765e-01,9.342766672945042039e-01,1.702470429948752251e-01,-3.327271819522504837e-01,1.510414651178541012e-01,-4.637242386892940216e-01,1.811874401249176092e+00,-1.948382239156321583e-01,-1.319760308504622226e-02,5.709966255971894028e-02,3.387079702007643467e-02,-5.687275502224820034e-01,3.120108163993750017e-01,-4.739543079515628476e-01,2.870522172544584527e-01,1.607678447980045888e+00,-2.306981226695989651e-01,3.888795143913439389e-01,-6.014277627389066350e-01,-5.408043614973137014e-01,-9.561269561995825450e-01,1.984158667983273727e-01,2.265785730631630024e+00,-3.341097940125828947e-01,-4.088813319245779287e-02,-5.781170997308502368e-01,-7.278008203567740697e-01,1.144435747178839780e+00,1.172298995830487023e+00,2.044174166896278955e+00,1.358164012964322875e+00,4.176131517592437392e-01,1.842083197025612407e-01,-3.851954529275758432e-02,-1.128444329742588070e-02,2.720574860037401899e-01,8.089769202928878133e-01,2.437351028855275104e+00,-3.366380625787191438e-01,-7.234284462237351720e-02,1.160810074473852760e+00,3.617750264208097200e+00,1.387733979556955877e+00,1.552105384825468448e-01,-5.540687943521758196e-01,-6.783475289404795605e-01,1.690616680628644231e+00,7.736688728322509423e-01,1.817245324850232657e-01,-6.908842187990003048e-01,1.445567942196692268e+00,7.458908255343571492e-01,-2.498836353204824112e-01,-6.583089058169232233e-02,1.097958708022686025e+00,8.634600522937190270e-01,-4.672027957340046944e-02,-7.885548150226165953e-01,4.411093542889372721e-01,1.950586284925696634e-01,4.656351992067399026e-01,2.226536721243619787e+00,-3.868198857250160216e-01,2.708019423540246051e-01,5.004232185171688663e-01,-4.160359000336409929e-01,1.302880688021874178e+00,-2.738762152233222280e-01,1.026364542385199474e+00,-7.381459983879161690e-01,-3.243772390315767806e-01,5.073489885432120872e-01,2.524093574713457411e-01,-1.679406014371143119e-02,1.484266164418008849e+00,1.035633924395102046e+00,-1.089786511813781722e+00,4.084241121837534072e-01,1.140453897330143018e+00,4.590038999541225517e-01,3.279380823689579949e-01,1.542231270097227602e+00,-4.783382357437473420e-01,4.811004322799437016e-01,1.097626763196886124e-01,1.169227003615249005e+00,-1.752460731155743023e-01
7.877672059858138454e-01,4.853387727689417175e-01,4.121978420317737313e-02,-3.546700918278954950e-01,-1.873303495896526116e-01,4.837196912925065817e-01,3.647662529008842136e-01,-3.837381785729167966e-02,1.141706644561446105e+00,4.210218511863069724e-01,4.161605528186581027e-01,-1.640449044764547004e-02,-4.789964523966612209e-01,-1.072766835873172064e-01,-2.271013422239838153e-01,1.515237816257074543e+00,-6.053946276150575789e-01,-4.373171673233532120e-02,1.234831268121252545e-01,2.510005405486019914e-01,-8.998254147077746623e-01,4.118955924451495609e-01,-3.823729267541530197e-01,2.076122299801743676e-01,1.475646117885549113e+00,-3.626995055128547918e-01,1.830211988417365654e-01,-7.042014548440687083e-01,-7.761253201700515358e-01,-7.986005238869346989e-01,4.618809162642678601e-01,2.672844316417717803e+00,-1.640978632133494042e-01,-3.563808549423047589e-02,-5.854011006495802860e-01,-5.980238107213802223e-01,1.452018090911035841e+00,1.008090732499951070e+00,1.670778761930070688e+00,1.388526425360523398e+00,8.607807561840865596e-01,4.769359856874877401e-01,1.146769910464322945e-01,8.375941786906444808e-02,5.353347228821058179e-01,7.407772893969762906e-01,2.581668350331384865e+00,-4.912899128742626020e-02,2.351086533837007941e-01,5.528128028773203750e-01,4.067544217026982878e+00,1.785221567141386689e+00,5.075980085018465537e-01,-4.165771870443338853e-01,-6.352063426062658502e-01,1.546883853490197414e+00,3.986323844810444328e-01,-2.838559125255371018e-01,-4.573333481041251258e-01,1.731891535616982614e+00,6.814817497480699648e-01,-4.366626382760571135e-01,-3.474090283720722150e-01,6.725577082662947959e-01,8.938856626839597475e-01,1.480407202860923588e-01,-4.709906805588354173e-01,1.182199961390565601e+00,-1.491912742356204524e-01,-4.796116030790736895e-02,2.476664926712278447e+00,-2.995353638585186995e-01,2.657218703305087026e-01,3.864841278277835190e-01,-5.019583310291217404e-03,1.031758517536764508e+00,-1.383376264069097750e-01,4.434019385141132474e-01,-9.001901087469070806e-01,-4.758947007131912876e-01,2.920460143961668420e-01,1.886172785789958228e-01,-3.017656966275015229e-01,1.616181309278361455e+00,6.288486696775388296e-01,-1.097369978063509333e+00,1.425782557399186135e-01,1.669878828806431237e+00,8.342950444682430966e-01,-5.276066810944195495e-01,1.875797126386296698e+00,-2.751230706759589806e-01,9.854939890484539777e-01,4.282886258668422430e-01,8.977899371917177906e-02,-3.736346834153359553e-01
9.547102758512481246e-01,1.328562902168288984e+00,-2.213774653560005024e-01,-5.911629612474271767e-01,-1.811474631665848933e-01,4.714491875093587137e-01,6.202961783046578859e-01,1.439362239425169276e-01,1.161227142454170469e+00,-9.873523727834895847e-02,-1.330747808716352121e-01,-6.904513321387778513e-03,-4.569187627705009747e-01,9.544415409007589446e-02,-3.780550598773021465e-01,1.209851211945404570e+00,-2.851146786538602540e-01,-4.899636697046857448e-01,-1.568986111366166836e-01,-2.905492251738273773e-02,-6.289205026537734167e-01,2.999178933420109106e-01,-7.193244140227090799e-01,1.252887867861849081e-01,1.724125309583114829e+00,4.307011747221742848e-01,-1.549311800270472272e-01,-6.486026272921082692e-01,-1.590713489994829200e+00,-1.339282267512826419e+00,4.353423050521093574e-01,2.366879081667159657e+00,-1.261094057511527866e-01,3.152206035315597843e-01,-9.310075595636932988e-01,-5.149138830012163215e-01,2.184032372231085706e+00,4.030021320567201970e-01,1.641323687298826162e+00,2.699309660106262720e-01,7.676071337826678720e-01,5.274424724040664980e-01,-4.261580468673006883e-02,2.768953283830968837e-01,6.082186118542773912e-01,9.415415388809190711e-01,2.353114765229824101e+00,5.420119856447974671e-01,3.596391707533425630e-01,1.808160842889477982e-01,4.358448521843905077e+00,2.266055025160764735e+00,6.411830526582298351e-01,-1.298967930248968172e-01,1.304189483312701014e-01,1.070594253999781253e+00,-3.688567636378734527e-01,-3.776789383390487531e-01,-1.070162496094736237e+00,1.381406113343246922e+00,-4.834464288924671393e-01,-1.611853638569470948e-01,1.315087852344998809e-01,-1.125412873922084778e-01,1.238917236352282902e+00,5.803156289686124403e-01,-4.533846290193742079e-01,6.836841295934442675e-01,-2.985312138855003572e-01,4.995617626186660276e-01,2.133236895476354089e+00,-2.428747977849346484e-01,-3.241180095434879616e-01,-9.369482741116563762e-02,3.118691590333266261e-01,3.086237327268590569e-01,-5.330152830824749222e-01,-1.348671999924633269e-01,-1.418455009110900278e+00,-5.528864028228284155e-01,1.047070569159435083e+00,-9.058570708055613263e-02,-5.537976819153689334e-01,1.798804815417614389e+00,6.083635017348696383e-01,-1.195280309941040287e+00,2.198132992198140734e-01,5.044848120224686427e-01,1.155761011774965930e+00,-1.249965294560150708e+00,1.470541281636245312e+00,-6.105910393076938725e-01,1.353890425032904243e+00,4.274900763941382742e-01,-1.094982161452978886e+00,-6.182447473217151934e-01
9.988867424533430794e-01,2.206309204158082959e+00,-3.898483879879963698e-01,-1.212997544471863032e+00,-3.967604549637743228e-02,-3.442659923200735994e-02,2.693267406439302514e-01,1.950018852667117497e-01,6.793868302329530984e-01,-3.120048914432329568e-01,1.077969498111887581e-01,3.726023943177308451e-01,-2.958212531587943173e-01,3.264411225352030765e-01,-7.768419426679908923e-01,1.540143864781579497e+00,3.986570692598347398e-01,-4.030977682088970893e-01,-5.029721603554031528e-01,-3.932675679794649937e-01,-1.607166277599939019e-01,4.146769109587725710e-01,-8.883999392092463143e-01,4.413191389639722906e-02,2.079509875416370335e+00,9.103998350362977332e-01,-1.236015883448371711e-01,-5.048745370283622691e-01,-1.846072052014011922e+00,-1.880981356543982130e+00,3.308693883147673098e-02,1.901425680819733177e+00,-4.676681692312595340e-01,4.522619982417626083e-01,-1.075446415913533071e+00,-5.115881066417139467e-01,2.361854165658404447e+00,2.957008090237845943e-01,2.110890690083579102e+00,-1.625708928257063590e-02,2.796960920023049968e-01,2.436601748437686732e-01,-8.992397343356957340e-02,2.013229314934792957e-01,3.216445923658701189e-01,1.003548156905284205e+00,2.351968298219591524e+00,5.245380397445733589e-01,-7.951853638237679767e-03,7.163782127386957299e-01,3.935283117980674206e+00,2.145428106659700518e+00,4.954735947474491753e-01,-6.896420690717042223e-02,3.477620340196369009e-01,1.136390123942284225e+00,-9.256969987002022782e-02,3.809541197787949529e-02,-1.789712969886882998e+00,1.293833498939536142e+00,-1.133754175463031588e+00,4.438393704433589715e-01,7.739527496715589150e-01,2.296763914934243922e-01,1.571221024305723191e+00,7.120996718104146694e-01,-6.757463141166702991e-01,-3.398375062414976666e-01,3.304765227208022460e-01,9.964909282482669051e-01,1.755102816245510011e+00,-3.325171180310779184e-01,-5.952810672668245040e-01,-5.631959168292419715e-01,2.660028205999558082e-02,4.475357332774021479e-02,-7.788238012902233276e-01,4.121779114537566513e-01,-1.795805117592638833e+00,-1.843952784164781256e-01,1.782608994253659151e+00,7.816209660057467368e-02,-4.205817986479382653e-01,1.751083361294544005e+00,1.268245410544052820e+00,-1.348973240588345890e+00,4.921526085938253692e-01,-5.261263613690265739e-01,8.740694685021899168e-01,-8.530957350743288981e-01,1.197734662064325661e+00,-9.245709317631309876e-01,1.068502096809097468e+00,1.005607174097189471e-02,-4.809880566153917347e-01,-5.131737269934242285e-01
1.022770242292846854e+00,8.688458562440912747e-01,-3.186578934131477081e-01,-2.457223801415560627e-01,-4.613864998748986590e-01,7.715292689067255738e-01,3.766853755059029196e-01,4.146993134669575976e-01,1.844938655370125247e+00,2.769829254559880161e-01,2.028686836556634343e-01,4.398270167704814576e-02,-4.733064937019272889e-01,-2.487674173081577678e-02,-3.081307962079195550e-01,1.682759208146676011e+00,-2.746392238559046128e-01,-4.158102347937211452e-01,1.092507412072633161e-02,1.562306767648703743e-01,-8.067325123279345256e-01,6.581018716806603663e-01,-4.718392158646490531e-01,9.798529436591059405e-02,1.470243357890683056e+00,-3.379599991982331075e-01,-2.140804620014656601e-01,-6.672968262605742940e-01,-9.338188296679059697e-01,-8.822147341872446091e-01,6.234227190727603674e-01,2.558064718232952117e+00,-9.721301191301157107e-03,6.357404352357079458e-02,-7.755064575535215443e-01,-6.388704896843507841e-01,2.016780547321377348e+00,6.239083731325482107e-01,1.418616558128324323e+00,9.547596328237248908e-01,1.186014589071106906e+00,4.755871798160197228e-01,1.817379291878906122e-01,4.081354177073717726e-01,4.204865394521228317e-01,7.216845627093226856e-01,2.684162680564610604e+00,4.500449093602905126e-01,4.900013049653539898e-01,1.490794179401696562e-01,4.794754158285758905e+00,2.185922322788341532e+00,1.085515356046934610e+00,-3.085502693223766135e-01,-2.798518655853030612e-01,1.233043336990626182e+00,-1.072072414299363174e-02,-5.895358253665008430e-01,-8.425030012889948017e-01,1.989744660371859819e+00,1.087586632541337195e-01,-3.870224193546448754e-01,-3.614799909529479160e-01,3.257094548578243209e-02,7.854669047894113909e-01,1.071961289670652351e-01,-2.998475765637905743e-01,1.127049008418203657e+00,-4.257751410342265341e-01,-1.908249201035147058e-01,2.852932141251508735e+00,-1.297177886617834064e-01,-8.295120083126926447e-02,1.936510584165612170e-01,4.011355514196484617e-01,6.147125325045657007e-01,-1.691139187476098926e-01,1.652467104822450406e-01,-1.088496930441251953e+00,-6.083111778193384112e-01,7.921899886381694733e-01,2.988559547808916639e-01,-5.290664055812098754e-01,1.488712846799764788e+00,6.038900896095950044e-01,-1.137877587846762184e+00,-1.012875307311858486e-01,1.513510376689724879e+00,1.149669121174529796e+00,-1.529737245573058235e+00,2.132154733181458095e+00,-2.401538518740503614e-01,1.514337337060506439e+00,4.800363839570138125e-01,-7.928208670264131896e-01,-6.308031620338835355e-01
8.407920901356403798e-01,8.738212494706469879e-01,-2.016025793337958283e-01,-3.162174447667648880e-01,-3.481966195534758057e-03,5.190408687434757695e-01,8.826779899885119907e-01,-1.171158996003895530e-01,3.888768959402402747e-01,2.386099751536141511e-03,2.965626101423508021e-01,-1.641938063853757290e-01,-4.216559575634201140e-01,2.353016547994404295e-01,-2.986196458909123885e-01,1.269593839315984463e+00,-3.970578652666203467e-01,-6.417699106095210437e-01,1.089191958461258602e-01,3.129700501917002248e-02,-6.391457062387746468e-01,5.366820085575474408e-02,-6.961248936029942325e-01,3.152953002469360833e-01,1.532074174338479811e+00,1.328996795050561841e-01,2.865560693811372572e-02,-6.551687881122721935e-01,-1.042169798206395548e+00,-1.008131712499270582e+00,5.334810862552201716e-01,2.264894392771310105e+00,4.736282556547383171e-02,2.012884087715284820e-01,-8.059587816861486509e-01,-7.127750720625244396e-01,1.660246506078792317e+00,6.648877518778226747e-01,1.630040504240696686e+00,4.095045294316653761e-01,7.158519384542800790e-01,4.270477210723099271e-01,-2.221915612177277066e-01,2.818163641074883374e-01,5.335689880901272053e-01,9.814201943184470700e-01,2.124491935621803496e+00,2.522788558693818683e-01,3.795126672804287615e-01,3.535448133138316407e-01,4.320540843499683703e+00,1.928986025921634262e+00,3.810444265132243435e-01,-3.689996195791078182e-01,-7.894748836602860642e-02,1.132439706056927342e+00,-2.431091431087558652e-01,-2.195229686724871065e-01,-6.855787240422717144e-01,1.094842782577248874e+00,1.859597224729975795e-01,-5.730448895655461117e-01,-1.636421926688024775e-01,-3.867717754409205622e-02,8.174862973928372911e-01,1.641830313385864437e-01,-6.493694491513477551e-01,7.217181786716082570e-01,-5.716014250059533452e-01,7.195513347998632181e-01,2.225441826587938543e+00,-2.279763400882666990e-01,-9.309045002665579382e-02,5.544940725906576384e-01,1.178822745740451122e-01,8.943703048752631446e-01,-4.995584704827134015e-01,1.210462418908303528e-02,-8.106854622825597767e-01,-7.885276162477297124e-01,6.506171170723291652e-01,-1.910078559039041779e-01,-3.425079385064584425e-01,1.662463987130982757e+00,4.470975695405945416e-01,-1.031219002687650654e+00,2.658821735863409752e-01,7.967849518617400317e-01,1.001121998560252635e+00,-6.501405483228749338e-01,1.295043878398818737e+00,-5.552141632304601337e-01,1.030320760823641768e+00,4.472876324850789120e-01,-4.217640639562208471e-01,-5.133505243446558897e-01
1.140576977315054696e+00,1.815737909562676666e+00,-8.013112486525240108e-01,-4.347892482313737150e-01,-1.149647429011299987e-01,4.914011636882525402e-01,6.759027995834973046e-01,3.817579758895044417e-01,4.440974727927090582e-01,-2.513472533470365589e-01,5.855679490848426649e-01,1.483634994882071789e-01,-2.536789456144561417e-01,6.788591191072635977e-01,-6.404001795629000737e-01,1.918657913918723867e+00,5.803130133561775761e-01,-1.155478877724914533e+00,-9.771859747395042484e-02,-3.182460742390686992e-01,-1.662288050542202189e-01,2.916795466775614631e-01,-9.207747935503595160e-01,2.550343253655364406e-01,1.599851683925537227e+00,2.180244157616111622e-01,-3.252975949857321858e-01,-4.728748142894914075e-01,-8.309190769404214416e-01,-1.188443770618052842e+00,5.056709859366859128e-01,1.614724454871713899e+00,1.028360323324312708e-01,2.563968423366228544e-01,-1.065644401066752289e+00,-9.526216325691558851e-01,2.099956916567593534e+00,3.304926068036198039e-01,1.560810692502028862e+00,-2.181856484261643914e-01,7.467736503070576681e-01,6.513490644671521279e-02,-2.701880404137854130e-01,7.060038929780483308e-01,4.863566901254262609e-02,1.021901319943994135e+00,2.185951760409188260e+00,6.572201755920619171e-01,4.210656644179757713e-01,5.439105748127182061e-01,4.919367356080788234e+00,1.961745818387403695e+00,8.881663144705717050e-01,-3.963763672034680274e-01,3.724783126783266507e-01,8.029645094040781528e-01,-4.311921604266029107e-01,-1.652929802002824355e-01,-1.481725246301005106e+00,1.071871017933442527e+00,-4.523443656801411361e-01,-2.788200960892217584e-01,6.610936362964188462e-02,-4.827677733660306059e-01,5.263059563937199092e-01,-2.134722676404081643e-01,-7.157225119861448936e-01,-1.534154831121766760e-01,-6.354442383164564667e-01,9.840674741408536041e-01,2.621436288592706276e+00,-1.053378201844605844e-01,-5.988247939856876645e-01,4.942813099631231388e-01,2.521737625456956788e-01,6.904369955062441555e-01,-5.886412130348011029e-01,2.954916125045317643e-01,-7.963271747671960554e-01,-8.150170866284658366e-01,1.571109191783219616e+00,5.369128181903373709e-02,-3.172982805496700753e-01,1.225199279050351864e+00,8.318306291724508750e-01,-1.004155936906736324e+00,1.808688853896992521e-01,1.066312935290701924e-01,1.015150969498266553e+00,-1.137186075701959620e+00,1.370027837619834488e+00,-7.532787315565094843e-01,1.299751941935788357e+00,1.640643320743986611e-01,-4.487068744899712081e-01,-6.187367042422208252e-01
7.728507437564777760e-01,7.139285865323043989e-01,-2.054400537895720302e-01,-8.672266538563462301e-01,-4.044312856615522311e-01,3.121640863559639323e-01,-3.299346580794987327e-02,1.773723784972843776e-01,1.233800537738429126e+00,5.911999397076461715e-01,9.428158356342979385e-01,4.086032782009380027e-01,-3.268329681244847573e-01,-2.105480631594406349e-01,-7.256648093288594614e-01,2.139694356982821510e+00,-4.548438586678632545e-02,2.477306118985161953e-01,-1.956883149022594637e-01,-1.587813670160340834e-02,-5.206897990349218519e-01,1.064707887783672646e+00,-2.625417738242317167e-01,1.187878621567486914e-02,1.854144741254644568e+00,-3.967468192357538337e-01,1.647338844957689785e-01,-6.383361911893271623e-01,-1.024972262511827825e+00,-1.314740819691337936e+00,1.189349874340169810e-01,2.592354508781356870e+00,-5.108296870903660247e-01,1.357526016799535384e-01,-5.767438446151047504e-01,-5.595975245120912156e-01,1.636502885542062913e+00,9.975062495938479268e-01,2.388553115788636827e+00,1.847727622765707789e+00,6.592738388437670016e-01,2.732946285433934253e-01,2.886641566878444531e-01,-1.004619336477578645e-01,1.203607469404104346e-01,5.434101090155256664e-01,2.753962552074567416e+00,-1.741319251172866456e-01,-6.812913055077514379e-02,6.685415093396553932e-01,3.947241456898239687e+00,2.025248000039796548e+00,6.872598616586559350e-01,-4.150235860654341580e-01,-8.638583102303469818e-01,1.984846547265356476e+00,1.216334098007427977e+00,-4.489605269096049595e-02,-1.058895483438333507e+00,2.794566545735078567e+00,1.802508742936642927e-01,-6.522057681524559558e-02,1.192056461286817096e-02,1.223607728546299178e+00,1.167004847658321243e+00,1.832130335759613038e-01,-6.358045129468835599e-01,5.593284086304461944e-01,6.227418568379994301e-01,-5.353229323316410770e-02,2.434585943185479273e+00,-1.573262050104934917e-01,2.999624286767631487e-01,-2.397680404258269171e-01,-1.949023469442813239e-01,6.554240605386948415e-01,-3.620615052617542906e-01,1.249021575889571523e+00,-1.424346385375987900e+00,-8.180557881335093207e-02,9.569493276007052796e-01,8.302548472823558789e-01,-3.095512227067132582e-01,1.636435065342505268e+00,1.486552254585975508e+00,-1.534146056003646841e+00,1.343507952045703557e-01,1.336551773701574852e+00,6.396236683521374644e-01,-5.724378574571998834e-01,2.162920311045215094e+00,-4.514732103827412413e-02,6.556568831319394830e-01,6.356925649513192611e-02,8.514753633326401783e-01,-4.699768843932365936e-01
6.930167386500567517e-01,8.801897446722550811e-01,-4.079865242662795155e-01,-5.772885625894910167e-01,2.034443725078880494e-01,2.511692452549775245e-01,9.725435179854231560e-01,-3.559354153259423614e-01,-9.240036365461128387e-01,3.301251285626469190e-02,1.166000477684814962e+00,5.030270253093049870e-03,-2.147703630993047785e-01,4.851001639339906357e-01,-6.823971025408281932e-01,1.718686225299018488e+00,7.147320601070417112e-02,-7.143212210883216340e-01,8.151030450023000196e-02,-2.570323766805546195e-01,-1.771211332739678901e-01,8.843945099341410376e-02,-7.387571590794288490e-01,4.178041381270984900e-01,1.721404309539811051e+00,1.299709033296483074e-01,2.448648803729356893e-01,-5.653364589884686264e-01,-7.950834225777758668e-01,-1.242167248597951135e+00,2.726152203742260305e-01,1.842897694663567343e+00,-6.676979568057481162e-02,3.104689738311720570e-01,-7.549537117616971216e-01,-9.207657236509800835e-01,1.254240895649137988e+00,8.503213020212854190e-01,2.288283248733437691e+00,5.083378636976656484e-01,2.536072695482222694e-01,8.560345542657682438e-02,-4.441116961248182116e-01,1.391939450452983340e-01,1.177432705352843278e-01,1.001531664905350949e+00,1.810203621117286721e+00,-1.330800502341236424e-01,8.258271890342519517e-02,7.790478821510627983e-01,4.005609692137150901e+00,1.678660111752845907e+00,1.444475668887562625e-02,-5.999575424981014038e-01,-2.547617712361597286e-01,1.428020473515247302e+00,3.725393401939723903e-01,3.200081879655507500e-01,-9.113428859290533257e-01,1.201610926494866227e+00,2.785510941051055900e-01,-6.272633866964747451e-01,4.120499604612587463e-02,3.877487377828641724e-01,6.683597126212745820e-01,-1.801864898368594758e-01,-1.133532635289912882e+00,-1.238736561105850953e-01,-2.374635508729902589e-01,1.410208484152679409e+00,1.996909306487066438e+00,-1.532752679091672343e-01,3.057352257561071068e-02,7.582264230188696663e-01,-3.384239649667566963e-01,1.199764455259584972e+00,-8.212661281692493764e-01,7.687627100203222597e-01,-5.829250609615568290e-01,-7.414143660959291449e-01,9.355984242992050337e-01,2.305082091135363109e-02,-5.789965198079405351e-02,1.572175170386259646e+00,9.959679684701769897e-01,-1.173189565735676787e+00,4.895443986830716465e-01,2.701675386547862656e-01,6.206715387280571372e-01,2.286217169346627665e-01,9.519369875937500058e-01,-5.473693578029644735e-01,2.877970278448327424e-01,9.319203904141382111e-02,9.683640145441307912e-01,-4.365148639910217399e-01
7.949076121045154375e-01,1.362204583884981890e+00,1.094607741170588316e-01,-8.473717310385407986e-01,1.290861211091491878e-01,5.940919433211633294e-02,5.098848583046505789e-01,-2.332038367138727086e-01,5.478292808553143489e-01,-1.165800956678157141e-01,-1.159885846755742134e-01,4.006595280605734777e-03,-4.563469016755338226e-01,9.402254104641651067e-02,-3.297047206946434050e-01,9.934575480981358009e-01,-4.609431378628379150e-01,-1.545502620398562788e-01,-1.637816776585416800e-01,-1.438180215147465829e-02,-6.498916138914768714e-01,6.606310395042336303e-03,-7.365937041754372361e-01,1.968075330124395006e-01,1.801685176684661327e+00,6.657859276229070034e-01,1.723614796090149059e-01,-6.458325266582715107e-01,-1.610931867109889559e+00,-1.400203071939898125e+00,2.114457161508065952e-01,2.353900079226241893e+00,-3.430908224652950422e-01,2.518718872334140824e-01,-8.458249404179735143e-01,-4.333407397479349110e-01,1.825906783624333674e+00,6.483993454782762678e-01,1.837581707767793393e+00,4.029361569430057743e-01,3.689720429409424907e-01,5.083945445137829644e-01,-1.150673187886203791e-01,6.431565479239273464e-03,7.433946224116223522e-01,1.023106314233625413e+00,2.283366941000751993e+00,1.950231307835296191e-01,7.259228192707495309e-02,6.705261815300639361e-01,3.587550610574898879e+00,1.876957019689361017e+00,8.958522221155840182e-02,-1.419104868077067927e-01,3.306674660716102387e-03,1.241684518836314366e+00,-1.548285536595321865e-01,-6.069650523763577693e-02,-9.183232972195678467e-01,8.983929056727157914e-01,-2.351026154899925336e-01,2.750995858738827793e-02,3.552502000965397366e-01,4.262312551344284994e-01,1.494543907214222589e+00,7.654970882199484405e-01,-5.855648994765604298e-01,5.295033375513844565e-01,4.362645465006667611e-02,7.385409321857323572e-01,1.649032882178435688e+00,-4.761264457163107977e-01,-1.773723486360579971e-01,-9.118910380524544723e-02,-5.523164166040239742e-02,5.405485441734766416e-01,-5.320503150057317443e-01,5.737818235128860911e-02,-1.402173383412487206e+00,-3.400253800711794949e-01,7.796899220398940678e-01,-2.766134668502702731e-01,-3.526267696244016481e-01,1.922887266696668096e+00,6.766490827697458910e-01,-1.134048590825714742e+00,5.277233271777633794e-01,2.971603775351029375e-01,8.607939807529922938e-01,-3.467623571618960732e-01,1.115916244526401480e+00,-8.357393006602615859e-01,9.548103148725374245e-01,3.241594858584453953e-01,-4.616697136490670039e-01,-3.443709965504788140e-01
9.578109021130642997e-01,4.671915437994110798e-01,-5.684810840774109364e-01,9.364784598980491204e-02,-4.521008100167712151e-01,1.224888448551621156e+00,1.314562128670063945e+00,2.581900289689154637e-01,1.150223181303770437e+00,5.185016529393213225e-02,1.529437098949426033e-01,-3.326658848112634126e-01,-4.671101900543018215e-01,8.342978291633268428e-02,-3.195321683777043731e-01,1.292476279845165443e+00,-4.682463739211932263e-01,-1.088196487374424981e+00,1.617500815797720815e-01,6.569062359537675144e-02,-6.961654909333258034e-01,4.252309632630661418e-01,-6.320604334791529721e-01,2.232018111286160067e-01,1.469265400465713078e+00,-1.251077385735586134e-01,-3.964621581323678479e-01,-7.349785755577757929e-01,-1.311308734919210295e+00,-1.002809335618178865e+00,8.882248779534752670e-01,2.497489185701054826e+00,3.943579720580158710e-01,4.156387955582875882e-01,-8.877364222498695945e-01,-7.432389019855830670e-01,2.154067262042794084e+00,2.929879094209389967e-01,1.476896072965970585e+00,2.588330753921480598e-01,1.285095568925869403e+00,6.144352709463654083e-01,-1.617327663256902248e-01,5.339975423653744446e-01,4.991695852848128112e-01,8.683001403369703386e-01,2.065883611616853965e+00,7.108016415801334809e-01,8.422817819750144652e-01,-6.694847238323503591e-01,5.372881159757946001e+00,2.704130149534306859e+00,1.026245468629375823e+00,-3.065865544816275268e-01,4.900857256546459206e-02,9.629136381974894299e-01,-5.809059819868341856e-01,-7.253367808812895001e-01,-7.056982449294542104e-01,1.932411758532025292e+00,-1.894225673221500983e-01,-1.040501567613845602e+00,-5.277746215397037810e-01,-8.724039653082985568e-01,5.896777490092703911e-01,9.468824575120532439e-02,-4.856387862359363705e-01,1.188128245673688355e+00,-1.118567685354337593e+00,4.523161132158269870e-01,2.712194352179125190e+00,1.633888065642205567e-01,-1.861238214793247692e-01,4.994250349283079204e-01,6.850499045019010635e-01,4.613978741345039492e-01,-6.459129124175866377e-01,-4.897784461242881138e-01,-9.427323519567953891e-01,-1.175056570268688816e+00,8.637374688506305187e-01,-2.399862622424531189e-02,-7.296184035887268715e-01,1.737586741055868966e+00,2.193469656074047425e-01,-1.228839051761922097e+00,-1.693618623027205450e-01,1.135124854621403223e+00,1.531720409444200737e+00,-1.995866849506205076e+00,1.696580046261695340e+00,-1.088895574047549775e-01,1.510915878459624828e+00,7.224578993740060628e-01,-1.555552556898164740e+00,-1.005678312831129073e+00
6.388526311107960431e-01,1.212293842807802280e+00,1.628446936494033492e-01,-1.076796026828056085e+00,3.100849635406958682e-01,-3.141938102363289187e-01,1.805550583672837772e-01,-4.567026326101206735e-01,-2.535654071607416071e-01,1.497630052414201107e-01,7.161187600900154049e-01,2.389709685855218035e-01,-3.172676465526571010e-01,1.794484848090517892e-01,-5.385462330254933150e-01,1.523362859035730210e+00,-1.884629861992810074e-01,1.831558232197574299e-01,-1.289063795421312997e-01,-9.316324315571031245e-02,-4.499348673096786877e-01,1.017855737268460459e-01,-6.065526678499113533e-01,2.716866993012223008e-01,1.850757559135584485e+00,3.430579910941545796e-01,5.347437348574104465e-01,-5.769386580472649628e-01,-1.015918299295548666e+00,-1.336412731159485112e+00,-6.752182082623203740e-02,2.164594217031582168e+00,-5.807200496824558300e-01,8.454989708752040645e-02,-6.471851855844505952e-01,-5.767068042446241716e-01,1.195458293816659134e+00,1.121684973982111089e+00,2.306175958802024972e+00,1.081542881726220040e+00,-4.172332075524920469e-04,1.958901636393011736e-01,-1.236875746914350011e-01,-2.209295603303561006e-01,4.079482077893819003e-01,9.346007529039238593e-01,2.323079220500687825e+00,-4.014622209759668436e-01,-3.201218998262351789e-01,1.422979681155840614e+00,3.005443996997275047e+00,1.314024517105917500e+00,-2.575093417698427478e-01,-4.126377008513484324e-01,-4.980554690863238654e-01,1.710237518806359436e+00,7.409315674608207836e-01,4.342870082320949843e-01,-8.918663434798742573e-01,1.038178846559325130e+00,3.657686125868992999e-01,1.150866847601608178e-01,4.058956540454922157e-01,1.334676060457289815e+00,1.341735608685021619e+00,3.794013996216292761e-01,-8.936683377967351571e-01,5.808278489127083333e-02,5.736876899245676453e-01,8.701526132916594936e-01,1.607079349803495205e+00,-5.616829894947279467e-01,1.584204809197038433e-01,1.438100894926268580e-01,-6.190681748969835141e-01,1.096272012107959881e+00,-4.690846113119936933e-01,1.022188618330312160e+00,-1.085163746791840689e+00,-8.638158862168093810e-02,6.678626844089263770e-01,4.775739245274845945e-02,2.813731915013001350e-02,1.718199177525092436e+00,1.195391956209554518e+00,-1.154718250987704087e+00,7.151697904637728254e-01,4.222493013272838880e-01,3.244414592445513668e-01,7.802394286325446959e-01,1.105998288348279512e+00,-7.870439063342340447e-01,2.601735228563004654e-01,-1.562843855884155086e-02,1.251881183921866425e+00,-5.335619700217547612e-02
5.483918938253343756e-01,1.909471769823458676e-01,-1.035026121789503484e-01,-6.196768655683896343e-01,-8.284000307826068499e-02,4.581919208812839095e-01,9.020959810437554349e-01,-3.783809798129234570e-01,-5.515268514807813993e-02,3.620062965687904644e-01,8.653104021281836644e-01,-5.622589474799052911e-02,-3.500446698952752733e-01,-1.018596860388385206e-01,-5.889938488356945001e-01,1.455122566154140706e+00,-5.407484519815916046e-01,-1.687582956164703774e-01,4.327056218974612706e-02,-2.047022862597069198e-02,-5.203125512719553036e-01,4.550376503048785271e-01,-4.325889147476482122e-01,2.501320897941904930e-01,1.828118223530501352e+00,-4.060553405902488783e-02,3.000846210555579985e-01,-7.252654451255792223e-01,-1.313502653475661308e+00,-1.347154508393169747e+00,2.645038209986242950e-01,2.565439330215974589e+00,-2.189678853938484826e-01,3.836506902285922727e-01,-5.852111135304468581e-01,-6.117754779805540943e-01,1.356580277203053964e+00,9.301843373342696397e-01,2.497208635186818348e+00,1.266793395720256621e+00,4.579635245620921058e-01,4.354416432878978060e-01,-1.512426327861033371e-01,-1.945669172598510910e-01,3.911469081959432215e-01,7.842169129447902343e-01,2.034582087685214535e+00,-2.445847533726243084e-01,9.111647062517708173e-02,2.551365470617843467e-01,3.866002305089683677e+00,2.135727358278023846e+00,9.153447360677380296e-02,-4.527001301092183905e-01,-6.684617340200496027e-01,1.822587334252066205e+00,7.372311279502090642e-01,5.778234849660190964e-02,-6.081782770326364940e-01,2.154262895214908990e+00,2.958275666176026220e-01,-6.818178203261691106e-01,-7.980770843743691112e-02,7.290679388086279689e-01,1.103581214836490521e+00,2.846494050921253294e-01,-9.194212930482504875e-01,6.536749124908387554e-01,7.264778571053795431e-02,7.773813553424092637e-01,1.901019638217577912e+00,-8.625099338342817612e-02,3.763931038201351331e-01,2.449628745261459017e-01,-2.181683146473357704e-01,8.398818067412923138e-01,-7.820381861046001859e-01,6.425414626471427360e-01,-1.110466633214374665e+00,-5.529640903046375566e-01,5.972891768254112721e-01,2.393129359243943155e-01,-3.165263560054932257e-01,1.987062680385200064e+00,9.891014081135840463e-01,-1.487807641515639601e+00,3.278350080403727995e-01,9.369160494666886052e-01,7.839310086443496139e-01,-1.842399122910504672e-01,1.382102887886071940e+00,-1.117465804866774604e-01,3.214657727218567240e-01,2.941323245953725851e-01,5.905693720236977473e-01,-5.805343642599098963e-01
1.008990918155305838e+00,1.689740785409704849e+00,-3.862508384465990208e-01,-7.242950529616394295e-01,-1.042193466566183335e-01,3.004329871608532043e-01,4.858229197900174046e-01,2.028135038546512448e-01,8.304398094289950905e-01,-1.730070174453584853e-01,1.482171583189883513e-01,1.498314604256845706e-01,-3.603515565035772528e-01,3.126967393985193855e-01,-5.398131440167057704e-01,1.507320862150088425e+00,1.217562513756930698e-01,-5.933688419422309401e-01,-2.236753572979288118e-01,-1.871868459592555545e-01,-3.970481418369873339e-01,3.150589254760322588e-01,-8.047043652085374976e-01,1.449606074672021294e-01,1.770292113797910849e+00,4.709275864341453399e-01,-1.556670051913241204e-01,-5.597518311366281862e-01,-1.387795910785312170e+00,-1.406592324891301038e+00,3.306248365605993222e-01,2.043337334369537128e+00,-1.787203941243856731e-01,2.963074386624269807e-01,-9.852015210338794793e-01,-6.329585296738386990e-01,2.150857958434672312e+00,4.063947745103519971e-01,1.736061510453135170e+00,1.289043882214437886e-01,6.130722420418570628e-01,3.139175934422254732e-01,-1.036759215224288821e-01,3.553913894546630869e-01,3.813182187779096677e-01,9.744997741497256616e-01,2.339148687365281809e+00,5.194551684154623539e-01,2.472915939141314690e-01,5.079237120271402617e-01,4.326383030012372899e+00,2.076116332627619521e+00,6.383641539292690403e-01,-2.008423354170278119e-01,2.105552045723553256e-01,1.042801208951035896e+00,-2.613161413609603745e-01,-1.840708492889390757e-01,-1.343719290677868106e+00,1.236779609383383827e+00,-5.659668704379290372e-01,-6.429029473439984432e-03,2.797181634745528056e-01,-3.381925174513278343e-02,1.129575564813954047e+00,3.828279402033423207e-01,-5.815576721360292689e-01,1.919218576057039050e-01,-1.832902218280000051e-01,7.287554890592693457e-01,2.167277851382390264e+00,-2.606663749950802744e-01,-4.411218111031725564e-01,-3.630914155458739301e-02,1.769547440084289769e-01,4.019948355923456118e-01,-5.696252745445081755e-01,1.824386218779249225e-01,-1.318272882097581089e+00,-4.936640670231405847e-01,1.333227366117166746e+00,-7.561127468209416502e-04,-4.201433374264488263e-01,1.608374972610481901e+00,8.543858633127277002e-01,-1.160494103266674015e+00,2.985290491628364018e-01,1.748122965433825948e-01,9.971377381820840657e-01,-1.012458738651353496e+00,1.382242548760334255e+00,-7.468858879293424069e-01,1.235522375474617629e+00,2.304964614882281382e-01,-6.464208027321496353e-01,-5.449057502671639241e-01
1.135505609384003023e+00,1.879365935426597023e+00,-7.841797196365510869e-01,-6.743201523712206713e-01,-1.694630801217106020e-01,1.930019080004151955e-01,-2.364976818948277826e-02,5.007450638062362902e-01,6.077532187392460372e-01,9.027015727160192515e-02,1.191194738302880474e+00,5.228549888281330826e-01,-1.614922996342139649e-01,6.442871045997572432e-01,-8.183402582799760294e-01,2.615125132850298684e+00,9.484783817120792104e-01,-6.800607826735118877e-01,-1.651574096567228755e-01,-3.289729903684691648e-01,-7.984272134054870573e-02,6.729119315530849299e-01,-7.131645846561546209e-01,1.883815363149036193e-01,1.617278446444253781e+00,-2.489401062812268417e-01,-1.310878199834842606e-01,-3.960705071781372433e-01,-2.395413687263974190e-01,-1.074717234128693022e+00,2.639546718077839249e-01,1.558466241075066261e+00,-1.962873070947915854e-01,-8.264277139155284946e-03,-8.978212001799814601e-01,-1.018311076893863465e+00,1.772147698806965765e+00,7.241065807468671789e-01,1.801448242350978113e+00,6.268268673784406220e-01,6.336025131646995101e-01,-2.074137150994043721e-01,-3.319074814167818216e-02,5.855722273154861934e-01,-2.957274694839774343e-01,8.212853563052404660e-01,2.599101967141368874e+00,2.576265529017455203e-01,8.597540917072042654e-02,1.246125262701980319e+00,4.565962450316525256e+00,1.514240648774878295e+00,9.579879312810779535e-01,-5.731949436793213337e-01,-1.257269366816439748e-01,1.231969651605856031e+00,4.504830116723540501e-01,9.393772052281415541e-02,-1.616860406298249675e+00,1.531973508318972055e+00,-1.045951979882075999e-02,5.195566561779979553e-02,8.809605522791180698e-02,4.167717676404011362e-01,4.338121367575099585e-01,-5.409593430389207924e-01,-7.616716866202621894e-01,-4.213661794004402994e-01,-1.231574775953498541e-02,5.781521251901701186e-01,2.897889272906227554e+00,-1.991251842854276366e-01,-3.588473665832612736e-01,4.409908906336572620e-01,-1.164535274145597488e-01,1.014392561250091029e+00,-2.953504421224336651e-01,1.253650571385637402e+00,-7.098384497987134667e-01,-4.114749437683794531e-01,1.591579826191477309e+00,5.825759668390759760e-01,-5.593026178004925630e-02,9.113325737798687598e-01,1.401219886841714057e+00,-1.034320916866828144e+00,1.885677750548967191e-01,5.241001088186624246e-01,5.800281971912629730e-01,-5.637912910538429578e-01,1.805965573614185971e+00,-6.457668198447477081e-01,9.989630774705076099e-01,-1.564636446465995645e-01,8.606910772503784113e-01,-3.593608744288451784e-01
8.799877144000964879e-01,1.625315934938873941e+00,1.855446617899070838e-01,-9.341088328498255988e-01,6.041262182367300448e-02,3.290128555130944488e-03,2.668183646269114417e-01,-8.749223306794853827e-02,1.117753888708343801e+00,-1.532290476784539945e-01,-4.404949918564279865e-01,7.305028390644349723e-02,-5.091204525417563076e-01,1.798653042101331506e-02,-2.637831058224626712e-01,9.257377361323958498e-01,-4.740995030706706137e-01,-1.423519733395495201e-02,-2.633906805333035006e-01,3.177304997820721427e-02,-7.502072235096750585e-01,6.435331591956938713e-02,-7.367444506584091002e-01,1.090021862029033894e-01,1.814493393653605180e+00,7.629295452462656613e-01,1.001312911302740805e-01,-6.432196929053780599e-01,-1.758814735937316742e+00,-1.429656073554849804e+00,1.927868546450474674e-01,2.441465591406438040e+00,-4.306220215777840088e-01,2.025826353218810605e-01,-8.921501311962584113e-01,-3.216493258247163922e-01,2.049060358923024960e+00,5.719552279176187692e-01,1.665425404693118505e+00,3.782706479862463222e-01,4.450666457852512359e-01,5.769007418917144747e-01,1.967296898900790930e-02,3.233815993290360680e-02,8.461556781021721818e-01,1.006801351190806493e+00,2.501848193594736980e+00,3.363265171900327588e-01,7.097224508894817152e-02,6.972271140754733310e-01,3.559173380792942432e+00,1.915368581726324182e+00,2.339175770909994456e-01,-1.880345938811461837e-02,9.467289482877327966e-02,1.165259212559047075e+00,-2.838982060053687473e-01,-1.862192814069729419e-01,-1.023656100167878336e+00,8.675493921940761188e-01,-4.223412703586091332e-01,2.856502968818986354e-01,4.491749234893330778e-01,4.307719170145730136e-01,1.679016458675924195e+00,9.637685727657226975e-01,-4.002281678664609266e-01,6.452685166095213365e-01,1.455573685553152863e-01,4.697204005895410095e-01,1.672732033327952728e+00,-5.610894663087938605e-01,-2.882935417839434522e-01,-3.571612217625955710e-01,4.881575754938564937e-02,3.370724004905812365e-01,-3.988687402550242789e-01,-6.328767042900862450e-02,-1.636046973580308705e+00,-1.954997785267751920e-01,8.403372949218106402e-01,-2.797427622681742942e-01,-4.308752882006338658e-01,1.929120752696907415e+00,6.533128054693256859e-01,-1.110865292745199850e+00,4.990741060878799984e-01,3.181093385522095751e-01,9.201847606315070038e-01,-6.063088781837849828e-01,1.263706571310474036e+00,-9.237805729586829884e-01,1.218225840392669790e+00,3.482329028614661315e-01,-8.495967016058370014e-01,-3.160730690241103091e-01
7.761967023613770555e-01,1.207230241723556752e+00,4.044288072891595587e-02,-8.144788096078110495e-01,7.059087800741242757e-03,2.797286956445623751e-01,8.040528921631855397e-01,-2.082855687687032442e-01,6.765637287748955675e-01,-1.749313175740289938e-01,-3.136039218171334242e-01,-1.038403807356734765e-01,-4.854036551443804415e-01,-2.356999636047064917e-02,-3.627249907403826135e-01,7.810642505325985363e-01,-6.045062214520757760e-01,-2.825828479958872874e-01,-2.041630209676796870e-01,-3.760373179698333485e-02,-6.504049714553349348e-01,8.695849038870784309e-02,-7.482757512840156888e-01,1.482763928480617110e-01,1.898452959903202952e+00,8.160659191678777402e-01,4.030467518245006708e-02,-7.019226706599520638e-01,-2.062984596013620386e+00,-1.599926455585412466e+00,2.820389265885974717e-01,2.499405092968259634e+00,-2.648199403521889761e-01,4.635016030842402102e-01,-9.020236253625968370e-01,-3.537161682411537611e-01,2.085848849637280900e+00,4.328554944298112495e-01,1.934490945161586817e+00,2.222609575894081146e-01,4.654824787008481346e-01,6.616963468397942805e-01,-1.408920528287924134e-01,-1.037768420957917159e-02,8.367593962300248212e-01,1.022147323373191252e+00,2.140407705101337044e+00,3.785376912998136278e-01,2.119805782858153742e-01,1.552763657735252156e-01,3.827790525621171724e+00,2.314729796396505002e+00,1.766738413560750010e-01,-3.504817962411954646e-02,1.241958391792116201e-01,1.197929433352765471e+00,-3.403102022184483211e-01,-2.161981889443621019e-01,-9.492378951437030477e-01,1.202254036987912222e+00,-5.997325475888508617e-01,-1.217739886554733975e-01,3.659939817728822264e-01,9.261874409126813479e-02,1.638590950662766499e+00,9.844023574777075458e-01,-5.662387478575328092e-01,6.732676560532853127e-01,-8.111556335110095550e-02,8.194368477813318563e-01,1.543637005738913048e+00,-3.318147191116896377e-01,-2.287565384285726866e-01,-2.932546423841282390e-01,1.507720731280069448e-01,1.967853689998432243e-01,-7.512344809528253009e-01,-2.685729002400680798e-01,-1.659538415329582683e+00,-4.598326079317370807e-01,9.019614553160733017e-01,-3.135322811525045328e-01,-5.612537038630383002e-01,2.155689927725459754e+00,5.942985534752067700e-01,-1.306719693180129926e+00,4.474486892912896696e-01,1.590774043077890498e-01,1.104147874889318315e+00,-8.359762344126775435e-01,1.083867770632093386e+00,-6.986999680094596599e-01,1.055342225452606586e+00,4.489768336116949921e-01,-1.060153601573395665e+00,-5.764505641554287241e-01
9.688996961380786921e-01,1.604173067248945816e+00,-5.051102979612082100e-01,-6.743551654448309840e-01,-3.386789595145642262e-02,3.250495728338844703e-01,6.841604330292281322e-01,1.154253286044186200e-01,3.120619031533675147e-01,-1.979321414795397194e-01,4.232279711719114101e-01,1.164058321584016398e-01,-2.990603712472736930e-01,4.402199407432929590e-01,-6.251580236292834103e-01,1.598198353507502834e+00,2.335853136196957558e-01,-7.792159757572665324e-01,-1.654071744064755378e-01,-2.702108276570759915e-01,-2.572860314236966595e-01,2.533411428710789504e-01,-8.486323407502374128e-01,2.193317676223862089e-01,1.771224312478290708e+00,4.445946851410042533e-01,-1.288751177351384059e-01,-5.402026384085715227e-01,-1.263838004745122312e+00,-1.413306672638166228e+00,3.385919007979547590e-01,1.882052797333083394e+00,-9.913533569509397347e-02,3.503529956051562033e-01,-9.849497186079010369e-01,-7.491786352067301147e-01,2.014508953311609396e+00,4.232774725908720059e-01,1.865377665384848394e+00,2.701366137600513806e-02,5.299858264169624578e-01,2.198672062160331175e-01,-2.397979231926635757e-01,3.795537760661279458e-01,2.596299077488432028e-01,1.011544432778773928e+00,2.141607498880718996e+00,4.526171864055929528e-01,2.499984955285814991e-01,5.181160796239148159e-01,4.389745855938858909e+00,2.036676030884534860e+00,5.418392219522656372e-01,-2.984093380091017988e-01,2.146946539175733637e-01,1.048464623119115924e+00,-2.139975213768587903e-01,-6.224530964949688550e-02,-1.345255517977681059e+00,1.188057807625172213e+00,-4.984281641709144006e-01,-1.807739020771941540e-01,2.486795759826372354e-01,-1.044328866444219628e-01,9.594771938262260935e-01,1.968621002691340327e-01,-7.500657665441117228e-01,-2.055758923106443259e-02,-2.850976047475002328e-01,1.025400980203372558e+00,2.151877862744320691e+00,-1.893430044372064192e-01,-4.212308658570711462e-01,1.822053246187202158e-01,1.000335372130080752e-01,5.472457921360347477e-01,-7.032569235102085203e-01,2.841236583665303073e-01,-1.122054712073531579e+00,-6.216795562973895795e-01,1.384497661797409851e+00,-9.755534242202879014e-03,-3.483725889713306101e-01,1.566243309209476076e+00,8.983455350024965869e-01,-1.165228159570832478e+00,3.346549620769732059e-01,2.683414018832463999e-02,9.489362842455562053e-01,-8.217903401724382384e-01,1.219474509543561069e+00,-7.279908759623676673e-01,1.042330184339891108e+00,1.810097960402199946e-01,-3.496376483761776122e-01,-5.722507385625702492e-01
6.269113057274602330e-01,4.225231905253673537e-01,1.601206058363288109e-01,-5.602711728146053671e-01,-5.689744168855329076e-02,4.925261133416869996e-01,9.629407531760463268e-01,-3.686181057523892912e-01,5.973291153458992753e-01,1.277573431875796972e-01,-4.615212012826913623e-02,-2.487021755014752755e-01,-5.202374342395098550e-01,-2.216977721939343282e-01,-2.648071406753033097e-01,7.924539237704117944e-01,-9.732057645581746463e-01,-1.471171181260596816e-01,8.696882778945515258e-03,1.421516570753584285e-01,-8.360350157837197482e-01,1.573826088728930706e-01,-5.392321160283095605e-01,2.068375858918690968e-01,1.770426910023437994e+00,3.696658396130278468e-01,1.857744375296606354e-01,-7.892400135143853301e-01,-1.800694276721363618e+00,-1.338478171318856713e+00,3.899839248688973803e-01,2.800851253955063402e+00,-1.745343873316769490e-01,3.913564891517102295e-01,-7.001845715096612910e-01,-3.838166570365137420e-01,1.716774517591010296e+00,6.952410989890052129e-01,2.018737322047905902e+00,8.064109109434112188e-01,6.012390461187108182e-01,7.438448305568285956e-01,-1.069222154958082427e-01,-1.442132347003819981e-01,8.634957574364576782e-01,9.058928000149095716e-01,2.107664663197219124e+00,9.400198573792993562e-02,2.636236276927645394e-01,-1.452854619407728531e-02,3.841802152964759465e+00,2.302218759740929155e+00,1.022855180076116532e-01,-1.811058038998062114e-01,-3.058533654876520180e-01,1.470582566454908147e+00,2.729649417028578995e-03,-2.596567608843483033e-01,-4.808042819052308348e-01,1.600850564080002147e+00,-2.887527661102756715e-03,-5.297918799590217720e-01,-7.434966015911585735e-03,3.134843860506025259e-01,1.440081991074448453e+00,8.011531904159733264e-01,-6.017088201298935735e-01,1.140923331245048189e+00,-1.721456683554388745e-01,5.878252375184653822e-01,1.694315379171144498e+00,-2.434705333203117383e-01,1.578376243422206504e-01,1.768305229530364731e-03,8.522077002269080881e-02,5.057869181624095045e-01,-6.746085856957675375e-01,-1.638082838696433008e-01,-1.399396024751106138e+00,-5.761998171554794101e-01,4.169129282011303506e-01,-2.036657123131427882e-01,-5.314961101747190941e-01,2.208703802341712930e+00,4.801193803973934360e-01,-1.346060338365224318e+00,3.393583793487232048e-01,8.624019336127385360e-01,1.077144624012441376e+00,-6.568062423964421415e-01,1.269806890926784559e+00,-3.573263320469126092e-01,8.390753032265718669e-01,5.702469392259612579e-01,-6.804519237641610818e-01,-5.937786898498508270e-01
6.649195600670819717e-01,6.665297451495416636e-01,1.152898949283350932e-01,-8.703053288451094716e-01,-1.215402138516691877e-01,1.276093511731658803e-01,1.316053220299323034e-01,-1.711295076364898748e-01,8.025543142933437846e-01,4.588497623533075997e-01,6.319823941944977541e-01,2.194077915585422589e-01,-3.980062556201769963e-01,-2.006425572678207647e-01,-5.055014320250934556e-01,1.636127096214625043e+00,-4.304852808077792581e-01,3.332449196151801574e-01,-1.097683284968027084e-01,8.064634540136028651e-02,-6.780847185206891892e-01,6.019501762287717828e-01,-3.467799535140766443e-01,1.190022061497194028e-01,1.809456558847738261e+00,-1.022289541075234731e-01,3.583801110951474467e-01,-6.765573338425179273e-01,-1.140941659317570744e+00,-1.253098097209355055e+00,1.019194651521147521e-01,2.647762231670766742e+00,-5.192384857533074438e-01,1.027662651171808578e-01,-5.553462337514596392e-01,-4.749408746202320453e-01,1.426011826325548792e+00,1.082854014919479413e+00,2.272663332390419288e+00,1.644267770370992032e+00,4.617595258455145513e-01,3.949595174102586426e-01,1.550859812618716194e-01,-2.281514929856788831e-01,4.294324621160943711e-01,6.949947579590025626e-01,2.587519420483963550e+00,-2.906999812185669940e-01,-1.180374962001252553e-01,8.180808005744928391e-01,3.491500166104694269e+00,1.798235348994414506e+00,2.352202690329414925e-01,-3.666801738668611366e-01,-7.825034253162177489e-01,1.896420940882018957e+00,9.453572417907675218e-01,4.218663464913929850e-02,-7.553736825113308573e-01,2.073571469227391884e+00,3.759398118627506058e-01,-8.150604565219875253e-02,7.912862199001244323e-02,1.269727181486269174e+00,1.332880089040234139e+00,4.187407250419998839e-01,-6.533032014536186427e-01,7.111772314092099645e-01,5.386830259152314282e-01,1.730825588142669846e-01,2.026403209409903372e+00,-3.503177718138668628e-01,3.417657199094359388e-01,-9.787891938779355594e-02,-3.125609869999112500e-01,8.202186233313049080e-01,-3.559518673939655597e-01,9.334904841403071085e-01,-1.329912440272019047e+00,-1.070542805183555268e-01,5.733955576576439395e-01,4.040943981684332331e-01,-2.367166424353269738e-01,1.808279473367267354e+00,1.170194599482754505e+00,-1.372109779291878162e+00,3.523884171905044549e-01,1.198898275075024999e+00,5.886124605510714147e-01,-7.107910633106040432e-02,1.751342175914197385e+00,-2.921196224701324562e-01,5.489555000231405302e-01,1.694069523968176061e-01,7.551285110811964962e-01,-3.060754688731551765e-01
1.036519114209489612e+00,1.770423773429588898e+00,-8.343247597512407077e-02,-1.189272858535119770e+00,-4.539446229783062892e-01,4.102702544518491146e-02,-5.898860778887948797e-01,5.299706910205215227e-01,2.385511366506498199e+00,2.811677478977875344e-01,3.297218143257452105e-02,6.010329055583221169e-01,-4.266738025444771210e-01,-2.203054182747836154e-01,-6.059203162000463827e-01,1.898147086407464101e+00,1.052549252606764241e-01,4.292886392233213888e-01,-5.164148182169612245e-01,-2.077355541513797171e-02,-6.349784006547347648e-01,1.040945691867707579e+00,-4.249068864101766541e-01,-1.826274903688924478e-01,1.942364696209211372e+00,1.470195785338941075e-01,-5.946319903698710219e-02,-5.811443749662563718e-01,-1.508278137983681155e+00,-1.519988867009753442e+00,2.477173595647913507e-02,2.572211213444616007e+00,-7.306083090166944904e-01,7.396496725126006089e-02,-8.089012524461367537e-01,-3.047712521724082468e-01,2.310194378263893178e+00,6.698891291545139293e-01,1.927578014431702069e+00,1.340445073349339822e+00,7.080962198412743547e-01,3.818827006972686511e-01,5.113854928015418855e-01,4.047347363086731958e-02,3.704231851311260981e-01,6.203981289871427496e-01,3.187606005917631879e+00,3.039224797893216312e-01,-9.442873595971194856e-02,8.473851466309171299e-01,3.835620643509949357e+00,2.074218641783781347e+00,9.678403342407883025e-01,-5.852121885799904666e-02,-3.569411940771550218e-01,1.604956369318313980e+00,6.367071112169846447e-01,-2.732055171587923770e-01,-1.526678749738732188e+00,2.311508834980430471e+00,-5.630804143121567185e-01,7.150488020697071123e-01,4.480087652937744247e-01,1.050309783366644156e+00,1.682131242692872064e+00,7.381709277568846428e-01,-2.290060797782326185e-01,5.235994662135469158e-01,8.362261289972806599e-01,-4.084581444265173999e-01,2.331780658155079955e+00,-4.201381201959394351e-01,-1.900630556207690836e-01,-9.304478703960439301e-01,5.963964605319484191e-02,6.841163070404698843e-02,-1.340291567307791420e-01,8.462821860656637440e-01,-2.037848925303417325e+00,2.642452517728260952e-01,1.333598027195015856e+00,6.601774380034861611e-01,-4.808691640536519873e-01,1.632845218858852698e+00,1.431143703851229798e+00,-1.416870125010430970e+00,1.769124763431321468e-01,8.928299407643398578e-01,7.855174649419104371e-01,-1.163585094673967202e+00,2.267341445883596762e+00,-5.013421662806339940e-01,1.345515004493694544e+00,6.253166586167152596e-02,-2.559715266817127466e-01,-3.776826285545324957e-01
