1.096241944750607100e+00,1.855084829960551573e+00,2.487054180653510693e-01,-7.713531917502982616e-01,-1.150843139825388634e-01,-1.882407369051308788e-02,-4.507402990254924524e-01,3.097895998323486610e-01,2.280756990761036995e+00,6.177083250515744139e-02,-5.292434164321253576e-01,2.658696388944433719e-01,-5.736410748440784468e-01,-1.310112069837941762e-02,-5.985950089275732244e-02,1.326423623934603668e+00,-3.418683496788089693e-01,2.403000089271850603e-01,-2.229673854890724116e-01,2.485642831471930325e-01,-1.019728481491176675e+00,2.654303342973545199e-01,-5.914744943723023729e-01,3.032102126928387653e-02,1.522362365389792194e+00,2.354858717416620506e-01,3.148629470108429973e-02,-5.965615411564723081e-01,-1.059103910314542096e+00,-9.218268699674603273e-01,2.905636175159037049e-01,2.520625804454424301e+00,-4.760710959754446137e-01,-2.397168041138025285e-01,-8.274257136458997852e-01,-3.538094609475645469e-01,2.042945228773982880e+00,7.683784894955753009e-01,1.076215453052749238e+00,8.501101126763156435e-01,8.031832696387085635e-01,4.980530880542196615e-01,3.573411703444013821e-01,2.488093402465953452e-01,7.840075062178414322e-01,8.604476428731533399e-01,3.140416565014261252e+00,3.756944641767483439e-01,9.575209343678617313e-02,1.140600502581353481e+00,3.716935381185800580e+00,1.517932923731589723e+00,7.086227565538701922e-01,-6.860535788109645150e-02,-9.139319575819571106e-02,1.113171130899236916e+00,-1.910947684521119294e-01,-4.118403075159089433e-01,-9.787172973140203514e-01,8.534451484051780445e-01,4.926317249295072975e-02,5.808135966725065380e-01,1.887491072861618713e-01,6.884820095043050481e-01,1.417953269328948496e+00,6.710590977527339795e-01,-3.356638696585390047e-02,1.000257134034163276e+00,1.787069150830893072e-01,-4.338336995691980391e-01,2.357798763310201107e+00,-7.237131649295591718e-01,-2.855322313576200699e-01,-2.664325861744860635e-01,1.284029639917688703e-01,5.925878429949369419e-01,2.498749789096652019e-01,1.682587516311926379e-01,-1.431576758251597026e+00,2.864062855210403047e-03,6.430117802662801418e-01,-4.101279739916166567e-02,-3.449070986801200389e-01,1.472709688997731359e+00,6.027860319461519900e-01,-8.286269167202451325e-01,2.874696424695328267e-01,1.158823802584756812e+00,8.265894477023500997e-01,-8.072039322523927307e-01,1.935088851411330912e+00,-9.475146867678999607e-01,1.690817332605550227e+00,3.384660556520059926e-01,-7.873610821911021240e-01,-9.175797040591948672e-02
8.990405335083536675e-01,1.754564886123706646e+00,5.438695902143110550e-02,-9.393883679930739028e-01,1.260735584495585870e-01,-4.861347888237943504e-02,2.945775121777494676e-01,-8.721085525486310663e-02,7.644459780878867239e-01,-2.013868007686452077e-01,-2.037424885579510181e-01,1.189716553479994166e-01,-4.428879294951887369e-01,1.858586153838730493e-01,-3.541111706403152759e-01,1.101050144817182108e+00,-2.426290501141823153e-01,-1.659684658086427178e-01,-2.523871239197210126e-01,-6.489968541651250367e-02,-5.980487365361106811e-01,2.751370554410381697e-02,-7.989396278600320311e-01,1.577154130119029496e-01,1.809018414801495389e+00,7.490698083692449716e-01,1.017713822272883900e-01,-5.930275408570684359e-01,-1.570521921955430944e+00,-1.424831505925101549e+00,1.710004224953815821e-01,2.216885827018777899e+00,-3.981870471233144859e-01,1.995467760313600070e-01,-9.189759377811437258e-01,-4.377536556958425140e-01,1.971015379326886308e+00,5.808502191347182375e-01,1.715652723458109374e+00,2.523125026043050445e-01,3.631008964339316192e-01,4.376891365141297729e-01,-6.904793287897258158e-02,1.038988616573801316e-01,6.933023271462132042e-01,1.042227848075308660e+00,2.416066959050080509e+00,3.109591398627773451e-01,4.086986631880309973e-02,8.533798977915536543e-01,3.605451871086812865e+00,1.793882647673722186e+00,2.091691754867863740e-01,-9.973328052342242400e-02,1.435773034393365011e-01,1.128241861130012014e+00,-2.504900128174963880e-01,-6.277846036889428438e-02,-1.131605663121691752e+00,7.403073498259392649e-01,-4.006844293241138555e-01,2.652034331909992049e-01,4.754965038167273672e-01,4.030089512536513263e-01,1.519479947096175287e+00,7.662818172447765086e-01,-5.184183218466453802e-01,3.527372627100854863e-01,1.096341811853723813e-01,6.850246260531236420e-01,1.718054544785239779e+00,-5.409995444927500063e-01,-3.409117374174474580e-01,-1.963883991955420460e-01,-3.058075429501876108e-02,4.679753565697427065e-01,-4.494078294621225989e-01,1.017210297796479757e-01,-1.466737539658057532e+00,-2.448491686634947651e-01,9.734431838061980979e-01,-2.574450269357410059e-01,-3.358556892322849263e-01,1.799763962585906096e+00,7.497950191234293849e-01,-1.069830986098620373e+00,5.391083795380243737e-01,1.365578701074838808e-01,8.357980456280523773e-01,-4.326324578435695734e-01,1.162294179720865905e+00,-9.852445970107847062e-01,1.111459101231874191e+00,2.495672691710604796e-01,-5.458997627037354139e-01,-2.902906636573945320e-01
9.685440554104141064e-01,1.151678511972751062e+00,2.818107426688096218e-01,-6.375614306305531498e-01,-2.837279297827958180e-01,1.937040294914121052e-01,-4.047186975605015502e-01,2.638890377644469432e-01,2.379082657110640930e+00,4.043590261245441630e-01,-1.855604807920832600e-01,2.345839467072580731e-01,-5.789268366444579872e-01,-2.594119058560769298e-01,-8.832659932275493953e-02,1.498289656486398558e+00,-5.615612875285787009e-01,4.369181956309710069e-01,-1.095888284199698359e-01,3.642705066370015010e-01,-1.121239488761540448e+00,5.493647450568055479e-01,-3.480800225169405904e-01,1.453651051665566518e-02,1.493586293192369796e+00,-2.211517128822279299e-01,1.238077216785976042e-01,-6.707129197760818284e-01,-9.092895856955609535e-01,-8.051268844833429084e-01,3.313939708257434558e-01,2.827765177697540100e+00,-4.650468601147604852e-01,-2.562017083520146676e-01,-6.400167701118387731e-01,-3.590955467282590519e-01,1.803134985214578601e+00,9.824412857536837240e-01,1.310991548732806766e+00,1.533246491873960338e+00,9.419010254705176832e-01,5.494625188451969233e-01,4.636505306312168617e-01,9.317967612505599628e-02,7.113267842158521592e-01,6.810285330487912958e-01,3.184559376672442710e+00,1.211597623726337336e-01,1.029676420998350689e-01,9.266612578144481915e-01,3.780933992705971303e+00,1.637564817423353913e+00,7.597114201748772500e-01,-1.885398400773475036e-01,-5.520910661621197812e-01,1.473140554702067950e+00,3.187892019653596476e-01,-4.514455454749305430e-01,-6.965658632772743220e-01,1.593953854909140322e+00,4.449200340739154491e-01,2.805426910788534345e-01,-9.887265457239002853e-02,9.867450003756590426e-01,1.303815270801780946e+00,5.230397250084743987e-01,-7.022780681107687606e-02,1.349821512328804207e+00,2.666365153192836734e-01,-7.283397534599964640e-01,2.540613174087368087e+00,-5.800039344809077013e-01,7.959248626984639918e-02,-1.879671268697720443e-01,7.525891830788709880e-02,7.307866735628195665e-01,2.755762412573647402e-01,4.290169965294473586e-01,-1.361127312686248647e+00,-1.527749869830802298e-02,3.700566587066526081e-01,2.530532291570462000e-01,-3.607228512744884430e-01,1.535584780544142713e+00,6.980934975614986326e-01,-9.959897946593759821e-01,1.383265372529767501e-01,1.794932750747046279e+00,7.997594561312785233e-01,-7.925561488694818912e-01,2.252233920503770026e+00,-5.269667259233060674e-01,1.470137598426679570e+00,3.860008462425957854e-01,-3.601993286969523700e-01,-1.698170290852712150e-01
1.229875740513850069e+00,1.689195565284038025e+00,-5.254653835333771283e-01,-2.319304785407376723e-01,-2.650369998420945006e-01,5.941055628437514891e-01,3.280517293173093041e-01,5.513725701591877248e-01,1.570165567683219354e+00,-9.094247186046375275e-02,9.577909050481087094e-02,9.938270083455512383e-02,-4.157320014510533790e-01,4.333984225749309416e-01,-2.982585927295331452e-01,1.759015770049580762e+00,1.970558834572670448e-01,-8.510986924147552202e-01,-2.419075701683790630e-02,-3.410151360508685559e-03,-6.125681422116525665e-01,3.283134782767272997e-01,-7.700827956575310163e-01,1.811411059827298387e-01,1.371927610783476359e+00,-5.204839078818867398e-02,-3.584076787372278972e-01,-5.355472469207913644e-01,-6.702229421486487482e-01,-8.124322587097017045e-01,6.605517658119084423e-01,2.007268288029268710e+00,1.014285813746489406e-01,-1.442305798551174467e-02,-9.886104843012958332e-01,-8.094969869560113551e-01,2.165888455514149324e+00,4.319838434910652225e-01,1.028825975420567307e+00,1.444077558080723023e-01,1.103612462585166654e+00,2.668034467061353165e-01,8.874003195296700786e-03,7.527610075089934405e-01,3.191893932218831109e-01,9.268573146305680854e-01,2.622792486646274845e+00,7.338790008058418968e-01,5.394184953372372915e-01,5.299670350538994157e-01,4.962633483562813197e+00,1.875977113466964941e+00,1.145532413729480226e+00,-3.093365494909451341e-01,2.353986764359075057e-01,7.487155646959245958e-01,-5.822331822573857396e-01,-5.156709545353092006e-01,-1.171521461544487108e+00,1.050731054868704772e+00,-1.160256863033562180e-01,-1.715552527266806515e-01,-1.930224293657868684e-01,-4.062768658874061911e-01,5.581945101135739051e-01,-9.638865743707364375e-02,-3.130918430310262179e-01,5.981792707813663457e-01,-7.192737303026673912e-01,1.758778770005954561e-01,2.939663904378051473e+00,-2.483482584654583547e-01,-5.186930000906696536e-01,4.393613422069139185e-01,4.471249367859061463e-01,7.193591309804822087e-01,-1.173858019403337116e-01,2.511786472633992240e-02,-8.228149994259658095e-01,-7.159177223932704504e-01,1.128953190971753617e+00,2.767730263492318432e-02,-4.069557308859467204e-01,1.162833887338820871e+00,4.929513576600305091e-01,-8.259855360904131416e-01,6.472748265575978266e-03,9.090569375913830630e-01,1.125125437858117472e+00,-1.487165240246797637e+00,1.830360666552332205e+00,-7.136110523773628866e-01,1.771788971934458168e+00,3.768637850346383544e-01,-9.983302049218893970e-01,-5.163984765238573971e-01
1.009507819628988612e+00,1.764515297981885666e+00,2.044945380610373176e-02,-6.746235165508258635e-01,1.195104877487418865e-01,-2.946065631977523580e-02,1.053701263550116396e-02,6.425262183314697784e-02,1.006756954063992904e+00,-6.490679673717145159e-02,1.233864230791553718e-02,1.689784341293015246e-01,-4.417207741800837639e-01,3.255652618079072358e-01,-2.152837810170138422e-01,1.443835566375769819e+00,-1.027555507314966698e-01,-2.014383884632710564e-01,-8.968995584856731540e-02,5.682358692329592814e-02,-7.079904596990868049e-01,6.342430908899021613e-03,-7.418100997667966823e-01,2.226379955322272675e-01,1.514858607724617112e+00,2.787798159838014156e-01,1.124705829156840975e-01,-5.435029799351340785e-01,-7.894218890418439605e-01,-9.325925809926927101e-01,2.997938716088827116e-01,2.104369926390996959e+00,-2.967523495966979952e-01,-1.290810220979163869e-01,-8.498427341752637920e-01,-6.125568135954497784e-01,1.722694926385530900e+00,7.968259899626634057e-01,1.310916221901059053e+00,4.880016582681190318e-01,5.605170129161914927e-01,2.853102517124219695e-01,9.271302691342520053e-03,3.126570839376265343e-01,5.574198985435331322e-01,9.958430539217182353e-01,2.661631810803013032e+00,2.368727077168023554e-01,8.980892590017808264e-02,1.241164583560677048e+00,3.778851776858581868e+00,1.354409504113925022e+00,4.101763852453616521e-01,-2.730261268689293530e-01,-4.096809230227704823e-03,1.057351515412233045e+00,-1.958858578282488550e-01,-1.081160246346604265e-01,-9.764332255980245900e-01,5.044510446877148446e-01,1.931178501462254282e-01,2.274755522856833911e-01,1.670960887807726725e-01,4.983427404814601003e-01,1.058201093186532216e+00,2.881295683537585806e-01,-4.174118549902819941e-01,4.779068217027874765e-01,-8.105679151399980409e-02,3.209763548478307138e-01,2.242966689973250993e+00,-6.166400549350044002e-01,-2.875037914419403817e-01,2.587462841008425496e-01,-6.500861924147602333e-02,9.480540250941997815e-01,-4.811119424960813573e-02,3.270807388950817129e-01,-9.612772292581486244e-01,-2.898359599352213212e-01,7.376250231726935169e-01,-1.696289899237169996e-01,-1.572803071042064016e-01,1.378914574050848163e+00,6.419290305286620146e-01,-7.794625425801304797e-01,4.275976517039041247e-01,7.117265256046898525e-01,7.027506256158959630e-01,-2.773659880574890768e-01,1.454164294816385539e+00,-1.011146568265390844e+00,1.263358517296568229e+00,2.292910034063049551e-01,-1.613728556621009669e-01,-1.079745778637342668e-01
1.328074528239458152e+00,1.626502839136237499e+00,-6.183807608421421076e-01,-3.026167231194620277e-01,-6.519496752079982915e-01,7.127572578821924631e-01,-2.083948924774856049e-01,9.606925481988478621e-01,2.659539350871884089e+00,2.377754405545631222e-01,2.440017014028999509e-01,3.716597720203837496e-01,-4.176779617831045677e-01,1.754083187551199741e-01,-4.151641478614870318e-01,2.267715569329480374e+00,3.799665159357711874e-01,-5.099981213435049732e-01,-1.462824616917089704e-01,6.122891773092936640e-02,-6.790393722447928271e-01,9.611703485327758312e-01,-5.190833859445216358e-01,-2.122750625107341915e-02,1.398731957574719464e+00,-5.148593682091046064e-01,-4.761408538194191742e-01,-5.355753211741183240e-01,-5.452761870020172985e-01,-7.854483388820214795e-01,6.235271717380495016e-01,2.254921756518243559e+00,-5.779944003457349044e-02,-1.261446203309878333e-01,-9.072022674917147311e-01,-7.468274900504145997e-01,2.358301132390362653e+00,5.014765561595647680e-01,1.082294858753963807e+00,8.549850870475750320e-01,1.391821823640465361e+00,2.422491794402922838e-01,3.815914063391995237e-01,7.499592445370396598e-01,1.221175790900760894e-01,6.523292785803407323e-01,3.123135214298560669e+00,7.411807903300507983e-01,5.030157399796910678e-01,4.904071432037875322e-01,5.192759465873627356e+00,2.043227894623409036e+00,1.671138430976068179e+00,-3.033423391964435445e-01,-9.883152409522755200e-02,1.025726374971338339e+00,-5.833063915060532345e-02,-6.975688619861303286e-01,-1.354382303636953111e+00,2.038892307856838837e+00,-1.282109545864468514e-01,4.474914686520667373e-02,-2.981047988913562152e-01,-5.124828529510838671e-02,5.804123665858179626e-01,-1.747670317803061701e-01,-1.029211955818721824e-01,8.014255781389940658e-01,-3.517576836178568644e-01,-5.810294659880085311e-01,3.417736391451607236e+00,-1.595711297770638082e-01,-4.057976178148469670e-01,6.027851946024578855e-02,5.404651464271533756e-01,5.213809252644820980e-01,1.289325330145509318e-01,4.541907920530560694e-01,-1.104914270778502905e+00,-4.449150555782266925e-01,1.288718827795679367e+00,6.008378831635038386e-01,-5.023789332661019458e-01,1.022204739367660542e+00,8.521099143225002726e-01,-1.009086762504966206e+00,-2.643428476779560721e-01,1.516689204381316269e+00,1.119689575249683822e+00,-2.003069667131756937e+00,2.578206901044735488e+00,-3.781993956705620441e-01,1.969578939281003471e+00,2.968972875486121654e-01,-8.636032357619469746e-01,-5.784008354025477194e-01
1.178398950953969848e+00,1.763015567221341229e+00,5.033622956858670172e-02,-4.298553089351392353e-01,-1.869755753403766763e-01,3.419851147415087778e-01,-3.149425582352760600e-04,4.024005658541432995e-01,2.308443016900252776e+00,-9.654257828427234567e-02,-7.207725042083692468e-01,4.249909340449062323e-02,-6.046453809821635828e-01,9.189296355649757830e-02,3.208358076614348242e-02,1.140060583823651497e+00,-4.082620404377804157e-01,-2.523433222101167939e-01,-1.101391145364157137e-01,2.542452983399700051e-01,-1.042278984643555173e+00,1.356485752432396996e-01,-7.027590608242132442e-01,8.688820484941967015e-02,1.396421103116284534e+00,2.626426758719003218e-01,-2.007435556832012080e-01,-6.224927375145669073e-01,-1.125820971314029695e+00,-8.238224359748673731e-01,5.639711342856595921e-01,2.470872017222609518e+00,-1.529776932546102752e-01,-1.322831349021574843e-01,-9.376826384099010703e-01,-4.422854207252620573e-01,2.254439235440267364e+00,5.091282029268582310e-01,7.921485235643306311e-01,3.396050997631865354e-01,1.058753446645478213e+00,5.876960310535402909e-01,2.201448935333031320e-01,4.955909599962808887e-01,8.455260021980262053e-01,9.430566846753569710e-01,2.922187204534707039e+00,7.007066896287246216e-01,4.242857908751461737e-01,6.404382936399306558e-01,4.311976203231819404e+00,1.800197509795478990e+00,9.132129518616689534e-01,-4.819826031924917542e-02,2.047689649741619711e-01,7.793932038587823019e-01,-7.542556625517383706e-01,-6.603763908670802207e-01,-9.124803005738677530e-01,7.052833615110634113e-01,-1.093957696314793171e-01,2.282577452192774969e-01,-1.957723233490776815e-02,-5.331871587127223755e-02,1.170555502225708144e+00,5.789767908598861812e-01,1.166939761629048888e-02,1.181521535221872643e+00,-4.178950138090573585e-01,-2.890496718986925728e-01,2.539038449706811029e+00,-5.662797561167101090e-01,-4.573335679344401883e-01,-2.212583108737734006e-02,4.542072907453484909e-01,5.025265736544518580e-01,1.417800843129647936e-01,-3.657308640507461739e-01,-1.269177665788581599e+00,-3.822045343291730068e-01,6.869269428329135563e-01,-2.498477613797483454e-01,-5.022124466619150018e-01,1.471607600239647207e+00,2.277679505641471147e-01,-7.572450904957080953e-01,1.373434379700517738e-01,1.116556664442915014e+00,1.145294555580222751e+00,-1.393951108471924938e+00,1.849901426265308402e+00,-9.127277850477194532e-01,1.996319583566089850e+00,5.450522162016679939e-01,-1.584760910474448670e+00,-3.147942995476953887e-01
1.036231025128266037e+00,6.309233402018920023e-01,-3.942228740114734342e-01,-7.885246145228430592e-02,-5.417570748110295265e-01,8.621004206239299972e-01,2.446115559707526810e-01,5.008672034001231399e-01,1.925140328524624245e+00,4.852147636178266721e-01,5.641801894376305970e-01,9.601085649007456979e-02,-4.441254317160499010e-01,-1.103226969961439152e-02,-3.131032565861084915e-01,2.030906417221070015e+00,-1.804576985744531792e-01,-3.971174835122565083e-01,1.242511286201042342e-01,2.172769759209973173e-01,-8.307055598321801959e-01,8.086081877163884268e-01,-3.526954177832352100e-01,1.243386218358398798e-01,1.329521289784323157e+00,-7.821852437800727031e-01,-1.850393416353038056e-01,-6.537622799231580517e-01,-4.347583426936250106e-01,-6.151212014198641498e-01,6.868419158087053500e-01,2.554433572931949836e+00,4.461475584418633789e-02,-9.458114377884008217e-02,-6.739232388946886365e-01,-7.672445006801890122e-01,1.793774549382322503e+00,8.130718916647199368e-01,1.367805695568333979e+00,1.341803662729893487e+00,1.321836231553624064e+00,3.645881119251377367e-01,2.506005172235729606e-01,4.704649703466802779e-01,2.409560578196582314e-01,6.185911603427288741e-01,2.810678230927033727e+00,3.053015618307095003e-01,5.020326738916934817e-01,2.874430947594291963e-01,4.950545461668449221e+00,2.010418242408301914e+00,1.234838932506968412e+00,-4.712173260203803560e-01,-5.403853878435809222e-01,1.356900601941219087e+00,2.831214629325576326e-01,-5.883134624020767145e-01,-7.246877492195706871e-01,2.230549881038712989e+00,5.367988262932753551e-01,-5.252772582899498666e-01,-6.161195542143630410e-01,2.063865748821335222e-01,4.608550824019755909e-01,-2.638349210363571951e-01,-3.077129453460460962e-01,1.210760445142497810e+00,-4.635363172281882216e-01,-4.373887141592587291e-01,3.225386190016032995e+00,-8.086782161342676023e-02,7.633134021426203619e-02,4.673812303095618015e-01,3.406165048027823827e-01,9.212740787981323898e-01,1.124870497105445732e-02,4.818421405221974263e-01,-7.847347178597929851e-01,-6.400149398386481003e-01,6.554039493687761064e-01,5.216308199825550052e-01,-4.254744206191533040e-01,1.259409141569070023e+00,6.711690603573647884e-01,-1.080184901629060557e+00,-2.211429909752724021e-01,1.998466637736774132e+00,1.046046359576781715e+00,-1.433092726705300191e+00,2.411869806132986405e+00,-7.110249766203069477e-02,1.459668332957785974e+00,4.403141832576745740e-01,-3.040139201993171669e-01,-5.829056874046051329e-01
8.227655050919051583e-01,1.153335170706683677e+00,-1.408756504015397648e-01,-5.738245411102828042e-01,2.081675126875892068e-01,-2.969579743660166748e-02,1.464009233305841595e-01,-1.674193084457947511e-01,-7.672072349613989761e-02,2.453258293744045027e-01,1.082177642929643246e+00,2.197115758893832538e-01,-2.807284778843893158e-01,4.509438221945661907e-01,-4.448217173367040589e-01,2.009191118508673934e+00,1.098583913437438109e-01,-2.380252905916955819e-01,1.128255169573652850e-01,-2.521866522658903348e-02,-4.674808402998102408e-01,1.252302067290740617e-01,-5.980891201885931707e-01,3.757228876818711205e-01,1.469456281523972452e+00,-2.712584095903392556e-01,3.720605675177767191e-01,-5.135361113021099655e-01,-8.436776343395901989e-02,-7.576353162755918857e-01,2.321678132906088154e-01,1.915813367886498586e+00,-2.534615861647338542e-01,-1.885012476486723765e-01,-6.372086435556855166e-01,-9.016939822995595488e-01,1.035989501570030447e+00,1.202891976570242605e+00,1.798303082245276574e+00,1.082606127816775565e+00,3.802095793811585134e-01,-1.006772292886531917e-02,-1.324979444724259103e-01,1.982197101162803676e-01,1.330867801968891317e-01,8.974819218468071957e-01,2.439346592288608839e+00,-3.022875525406507613e-01,-7.175695281537271264e-02,1.545901028180141745e+00,3.694240954912729968e+00,1.027860814264702771e+00,1.753967568880222816e-01,-6.561864734339255545e-01,-5.248036950302449322e-01,1.480244358880469235e+00,6.050282375304488758e-01,2.803457760508345498e-01,-7.827258269675553271e-01,8.975953875812764382e-01,9.105413865338660706e-01,-1.919191575411925421e-01,-8.476561611580284150e-02,9.923380702220880867e-01,5.605707955653177477e-01,-3.667527361837202848e-01,-8.306539637859837732e-01,1.434683845226790710e-01,1.815185987492486802e-02,6.115774696593765380e-01,2.412806870831300632e+00,-4.669933795253449760e-01,1.193393561726960178e-01,8.412069630708467471e-01,-4.809874627739760267e-01,1.599395685441897808e+00,-1.444477088051930869e-01,1.134455954162811420e+00,-3.708984618525215105e-01,-3.960467872619033991e-01,5.769591330329334466e-01,1.637108131964508106e-01,1.539630992933276321e-01,1.172110769616862669e+00,9.948543410380297214e-01,-8.449639796280700166e-01,4.583686028076561780e-01,1.011463642132218066e+00,3.406743415713948675e-01,5.684336201479565087e-01,1.438516648731191783e+00,-7.121942034377959363e-01,5.379468395861247698e-01,1.503592222164673586e-02,1.421742626066218040e+00,-3.440632861789955088e-02
9.652749007392512626e-01,1.555898047172461052e+00,2.209337266764629937e-02,-8.601293662124923634e-01,-7.391143862949375865e-02,-1.103419791645421921e-01,-4.704172789348516903e-01,1.973706590114953641e-01,1.377177243034985787e+00,3.071908522586918044e-01,4.749314976839985047e-01,4.464336773349381060e-01,-3.885403983879298084e-01,1.197413058749599024e-01,-3.992497463084956344e-01,1.973652599323290957e+00,6.458024835401282582e-02,2.482407628033930780e-01,-1.680246300341635968e-01,7.440497003600098080e-02,-6.786802716972309968e-01,5.081491471536426774e-01,-4.838177299304413093e-01,1.052969002495356132e-01,1.597045594537350954e+00,-1.598116961758018206e-01,2.222813552094118628e-01,-5.335822502938827316e-01,-5.468299950382498054e-01,-9.426771193795415726e-01,1.261590434111821146e-01,2.265392417534699110e+00,-5.410485019375872451e-01,-2.411596039323148366e-01,-6.839273268979875198e-01,-5.934608253607067674e-01,1.565058284108479247e+00,1.066154801654810580e+00,1.647348507274706719e+00,1.351763762416984926e+00,5.686434841499240500e-01,1.691802258927896374e-01,2.688987374883871628e-01,1.383327755709380102e-01,3.054938856205117736e-01,7.531087182249800449e-01,3.000027402053563552e+00,-6.329181216531912235e-02,-1.302532847746736833e-01,1.483680871589012407e+00,3.611024045200818211e+00,1.282271758795876737e+00,5.654278275176767288e-01,-3.731332038423663677e-01,-5.064589775740728772e-01,1.524658645684546343e+00,6.284367810446918057e-01,-4.814546231387800690e-03,-1.057076328164571866e+00,1.353743134788699898e+00,4.326297801340842630e-01,3.970954861649018675e-01,1.349776253050774533e-01,1.206244199181869536e+00,1.085872846835429062e+00,1.403540780665171461e-01,-4.243667471608707498e-01,4.537549577539394807e-01,4.691141546019804709e-01,-1.350857088695347485e-01,2.470362155975989182e+00,-5.817394084723921388e-01,-8.549937539751792381e-03,3.392759788771837481e-02,-2.678777075709384836e-01,1.011518650100144523e+00,1.029632554239201525e-01,1.048429293093142700e+00,-1.090692989764920462e+00,3.140116879723575671e-02,7.669971674376596660e-01,3.800528366978559447e-01,-7.712236233220076675e-02,1.276628707524372075e+00,1.141081505525521234e+00,-9.753590139789579672e-01,3.361311538612229421e-01,1.190993363180500753e+00,4.656831076117343704e-01,-1.129171661430774520e-01,1.952418260630901292e+00,-7.107914834239552615e-01,1.028924368192817518e+00,3.518681460634046076e-02,7.022074320761018118e-01,-4.160089716682380256e-02
1.034076075634512870e+00,1.396836991422060414e+00,1.009216426765883329e-01,-5.852746126076275868e-01,-1.963563228991598297e-01,1.655422246310712386e-01,-3.261585187802935049e-01,2.991456127690732547e-01,2.010007861573867238e+00,2.754689255749284138e-01,-1.324765569905422824e-02,2.525043670671477392e-01,-5.135663042415392621e-01,-8.473877127669740550e-03,-1.505571465528752761e-01,1.646022935436474155e+00,-2.800023170727583000e-01,1.523602948150402647e-01,-8.454610826376431076e-02,2.527650212835917398e-01,-9.557929769580721935e-01,4.335914560793837080e-01,-4.722280931102628143e-01,8.458875331339674175e-02,1.446796554122397716e+00,-1.870366865773012144e-01,7.012885140010814700e-02,-6.052639135625875744e-01,-6.857701750686585607e-01,-7.634257364487060382e-01,3.595822273069047559e-01,2.518289005884146725e+00,-3.676007807109787917e-01,-2.641760653640248813e-01,-7.152075755623779063e-01,-5.103566900769936909e-01,1.779051651573427373e+00,9.262398491387182631e-01,1.239654839279712206e+00,1.207568582006334212e+00,8.906528955044112905e-01,3.971027079708890350e-01,3.324793641543481448e-01,2.560508898901296959e-01,5.636369820921300899e-01,7.616870031004909780e-01,3.066479512911373551e+00,1.899057295271362189e-01,1.314076884043967608e-01,1.073479387039446564e+00,3.935312445935512660e+00,1.501160714543454677e+00,7.746049646565666968e-01,-2.632195434481998664e-01,-3.784513341388617835e-01,1.305592620703869500e+00,1.682242866485389454e-01,-3.607883055895172442e-01,-8.350118911015651513e-01,1.280287724143859496e+00,4.188686389369216112e-01,2.465762736888641449e-01,-8.152093051771039378e-02,7.819850176773421868e-01,1.075079850630643374e+00,2.864229774633200165e-01,-1.729004693331092080e-01,1.021193508890592128e+00,9.225965096256696918e-02,-4.511881516268649861e-01,2.628640394559275340e+00,-5.633055085857936461e-01,-6.623609097155390424e-02,4.876461513943058934e-02,5.463442534307628995e-02,8.685691150111076730e-01,2.308023306119091900e-01,4.803640231764542134e-01,-1.124548171527339990e+00,-1.359146625436654099e-01,5.460635958656883115e-01,1.931241940940760238e-01,-2.703310456378007487e-01,1.354288127504567285e+00,7.072303791990228738e-01,-8.863551215342221345e-01,1.725968133380023084e-01,1.528790649033501703e+00,7.603415531401807037e-01,-6.997758001621523505e-01,2.095515862523516848e+00,-6.632624072172680352e-01,1.461517252743930406e+00,3.084131606042301854e-01,-2.239001386505833358e-01,-1.526233827982045876e-01
8.861677097747239218e-01,1.105997046295022157e+00,8.106092122319212556e-02,-5.965268863371323560e-01,-2.312692709914715428e-02,3.594158283639170559e-02,-2.340493560063870437e-01,4.166869361921948789e-02,1.102198140720934694e+00,4.034452855061574916e-01,6.086832995485147446e-01,2.719465551274966031e-01,-4.120538842533438828e-01,1.125664839606593665e-01,-2.734642185188991270e-01,1.891578777673833311e+00,-1.774933656897086931e-01,1.647824813472751337e-01,3.368176000715313728e-02,1.861888373207263303e-01,-7.932423433426818438e-01,3.653918215214474463e-01,-4.310056908065154624e-01,2.114565396157809252e-01,1.441790521521365775e+00,-3.879166711861164463e-01,3.070260975705961792e-01,-5.780950770660922000e-01,-2.841558652215980807e-01,-6.892940542317560482e-01,2.605874061521444296e-01,2.347819811422586778e+00,-3.839254648378276902e-01,-3.032050418066846720e-01,-5.893991542047471999e-01,-6.732493812763341579e-01,1.282411774332048005e+00,1.206908622421299260e+00,1.565722007888339151e+00,1.484467466632429788e+00,6.467325816355340429e-01,2.055331337283297366e-01,1.893950485646365700e-01,1.357438078609916610e-01,3.530001267687078448e-01,7.582267895408787428e-01,2.870354077322471831e+00,-2.001778778106912959e-01,-3.655377023783278057e-02,1.401955036203992311e+00,3.675676179314664616e+00,1.185771175906368491e+00,4.547692358467935181e-01,-4.904203739796421657e-01,-6.585051886106544350e-01,1.552625101636454508e+00,6.272266567583106855e-01,-2.599073373081639549e-02,-6.997275559736112482e-01,1.266531049329008285e+00,8.752216203742271272e-01,4.918387570817298049e-02,-1.430358424271069850e-01,1.160333015238105947e+00,8.413708210223055373e-01,-5.168053511320330751e-02,-4.733805783865296379e-01,7.213538156662635537e-01,2.035975028930904762e-01,-1.258597303383591770e-01,2.562098223253415519e+00,-5.460277323293442064e-01,1.736483801333328358e-01,4.240074225246749373e-01,-2.920122271915193690e-01,1.322283788353439293e+00,1.469690983937021467e-01,9.705138338781107432e-01,-7.471329941101741978e-01,-1.670878328862344109e-01,4.055456039840202309e-01,2.858483404145066853e-01,-2.224570844237949707e-02,1.261485735564480848e+00,9.111386786321963305e-01,-8.854640931672281834e-01,3.005555953786013812e-01,1.548745679976441858e+00,4.691362951244314461e-01,7.297305219686228694e-02,1.913658904842227892e+00,-5.986679504515008965e-01,9.236613141038556574e-01,1.500985641158692485e-01,8.542034421278927869e-01,-3.115802504870812673e-02
8.380139053509308988e-01,7.408693961470500522e-01,2.162252825781449395e-01,-5.250284580551911606e-01,-1.860014168644594235e-01,2.343110540535623398e-01,-1.593297810590774133e-01,5.286424287157641400e-02,1.618430726029239652e+00,5.191288037664943955e-01,3.302383964153783324e-01,1.683055285221320141e-01,-5.052438690922461673e-01,-1.764186915206198969e-01,-1.704344530281023395e-01,1.654830224923953264e+00,-5.513882429687032571e-01,3.318754681516956628e-01,4.246298923981136481e-02,3.282615090984306039e-01,-1.008310303919669915e+00,4.962395796432083062e-01,-3.063139263379069943e-01,1.362004386285166346e-01,1.455980745364541917e+00,-4.430789816093751998e-01,2.717534923220835119e-01,-6.729738252845115509e-01,-5.984137732390535369e-01,-7.094726018631281050e-01,3.360228306354823835e-01,2.732099913920208678e+00,-3.789350255477458851e-01,-2.445227654640462212e-01,-5.353683478658948225e-01,-5.167696131833202644e-01,1.410650050440226844e+00,1.170888405701103752e+00,1.557280867518513912e+00,1.721504129789639626e+00,8.301519767052955023e-01,4.345271712637964190e-01,3.130835489284183315e-01,2.820794516676355945e-02,5.506910523926400458e-01,6.751923510934725314e-01,2.943524393633188296e+00,-1.536719663684175119e-01,6.312595292519722345e-02,9.914475533300439736e-01,3.745254095030481345e+00,1.497544606929415822e+00,5.456102977790134867e-01,-3.887598911927891421e-01,-7.749544338646343622e-01,1.646406313295625701e+00,6.182458684098091073e-01,-2.505039002875713017e-01,-5.080764740965719728e-01,1.672341806114822971e+00,8.342094831951001321e-01,-5.428316222241114097e-02,-2.568945434240446080e-01,1.125443097994624608e+00,1.029248662854514551e+00,2.049804372236707084e-01,-3.221646021795045445e-01,1.217374100247703206e+00,1.951878632714726947e-01,-4.424074583823247586e-01,2.545346091238350539e+00,-4.885834872496262471e-01,2.962692330721352629e-01,2.050824511986804322e-01,-1.259639193246019084e-01,1.094984667401126988e+00,1.576445477750905710e-01,7.082966513447204182e-01,-9.968948754799291656e-01,-1.657818048009273848e-01,2.157810225453599684e-01,3.090227319310233089e-01,-2.098992600632336447e-01,1.490514849823726395e+00,7.684875183212258598e-01,-1.014012865702941024e+00,1.799380438878974975e-01,1.891473739902903350e+00,6.539131194713905249e-01,-3.182092154320761423e-01,2.110545714655359895e+00,-3.849312514674168018e-01,1.060649007016198464e+00,3.294599451830442782e-01,3.625677831293547815e-01,-1.572977526078173094e-01
9.883636543074567626e-01,1.203207089622331694e+00,-3.531173127419959812e-01,-4.931476128193774122e-01,-2.623454569150640014e-01,4.859257424986512808e-01,3.528125650662530255e-01,2.795801145832502166e-01,1.202469896405816696e+00,1.375044581923881570e-01,3.885165007289186345e-01,1.447255161506365018e-01,-3.875882802555045692e-01,1.610956357175499232e-01,-4.591573511494815296e-01,1.747352211882610362e+00,-1.711595003796545500e-02,-4.406544705614302004e-01,-7.680653441506717083e-02,-1.644397098709506760e-02,-5.731272983580748548e-01,5.258458167673339956e-01,-5.933238964381547520e-01,1.415302720990152530e-01,1.601856048585339698e+00,-7.158217659136723032e-02,-1.122260916586773349e-01,-5.997484075014860583e-01,-9.631830519797763834e-01,-1.081886049888758361e+00,4.398601704342877117e-01,2.268233612992368364e+00,-1.253615759348241931e-01,1.208619854212721195e-01,-8.251032797393025309e-01,-6.846416200647780226e-01,1.926041781110974238e+00,6.361949076748191212e-01,1.650813173187516858e+00,7.335452750075228678e-01,8.572892918938477269e-01,3.205625052263484931e-01,4.807580046452049338e-02,3.508179205455625449e-01,3.117204393425795361e-01,8.147423176566187530e-01,2.538667721729106930e+00,3.492922089202723512e-01,3.012034510005104360e-01,4.875257892081681366e-01,4.481473805814710332e+00,1.996498038634445082e+00,8.218063856004107492e-01,-3.332671942477256621e-01,-1.727943931065286931e-01,1.244208681374544545e+00,7.553460699482605900e-02,-2.976965000086566615e-01,-1.060445599897732682e+00,1.676195297986375454e+00,-3.760044571095985666e-02,-2.103077089364964736e-01,-8.035231773557895141e-02,1.933492512629648719e-01,8.707363151723481742e-01,1.092824540127637911e-01,-4.979616561407643194e-01,5.950086684309795482e-01,-2.198312489041006068e-01,2.497949169609715026e-01,2.567155224100716282e+00,-2.025980988128239790e-01,-1.704550066606386194e-01,1.750305464439509961e-01,1.761126487914813632e-01,6.673706804030127282e-01,-3.253855285160721644e-01,4.000436877271045799e-01,-1.087909171000735586e+00,-5.136844164765176357e-01,1.010739141355926574e+00,2.430226508553502973e-01,-3.869129208556656985e-01,1.472416729918670342e+00,8.291005003839054810e-01,-1.140719872766935872e+00,1.117843106088353688e-01,9.572019925544908991e-01,9.585938556624197249e-01,-1.046301274442655638e+00,1.802306312183478587e+00,-4.544637279722288925e-01,1.238467962261082356e+00,2.896213713998290196e-01,-3.242113698126041221e-01,-5.260434397492567138e-01
9.811573485550577622e-01,8.673239052751966494e-01,6.875861372503672131e-02,-3.343509988913093700e-01,-3.535623522726930590e-01,5.136177576084514085e-01,-9.987917356175712857e-03,2.957610086298421703e-01,2.171992901384064201e+00,3.891177101280385853e-01,-3.689169110563322862e-02,7.534694517817147608e-02,-5.614034212727269102e-01,-1.733994534251465658e-01,-8.969138781076313460e-02,1.522648718229227427e+00,-5.648445904114957061e-01,4.846028772397487083e-02,3.022788805218031699e-02,3.510387095109297473e-01,-1.078836052021302283e+00,5.303332639819813288e-01,-3.758105764837139651e-01,8.647879037226015309e-02,1.389895304492605677e+00,-3.801261239609139420e-01,-3.442631423107717081e-03,-6.903675434047304993e-01,-7.937337127270349679e-01,-6.908032192075960198e-01,5.355067788904283033e-01,2.771907245731840774e+00,-1.973288595885699381e-01,-1.751224227876543860e-01,-6.626870607212652642e-01,-5.000113996875981126e-01,1.805073651161694270e+00,8.814008451847218373e-01,1.240674237686398840e+00,1.338464979020164369e+00,1.123524815523330833e+00,5.521130646504039952e-01,3.363441274012521909e-01,2.506987282666339190e-01,6.367344780119541525e-01,6.983145215989648991e-01,2.964760168452284184e+00,2.372647918022219304e-01,3.297168133682446545e-01,5.590685235101635620e-01,4.266541014623339123e+00,1.822752686039298631e+00,8.948078170571763801e-01,-2.735602618765651806e-01,-4.846772768509192142e-01,1.348937187134765292e+00,1.236312577862329343e-01,-5.654773784431442740e-01,-5.932521358110942611e-01,1.691217464605928811e+00,4.991351302820438152e-01,-1.284778645855267354e-01,-3.491365833796430396e-01,5.343261430037704596e-01,9.781847331701709614e-01,2.770166868936659865e-01,-1.379001631995059318e-01,1.435657066312612251e+00,-1.682888226215848160e-01,-5.754945765538065361e-01,2.754866091258119098e+00,-3.905327825629210103e-01,7.024580095907904942e-02,1.331446205595209764e-01,2.397059973622816531e-01,8.044314295443499852e-01,1.573484505852515425e-01,2.330587123449391340e-01,-1.102846630420866614e+00,-3.477338816864229964e-01,3.707848707439307390e-01,2.177686122603755270e-01,-4.230687332686638435e-01,1.491999796143853807e+00,5.139511547285897652e-01,-9.883938800027916027e-01,7.700373065862020638e-04,1.886661997294899473e+00,9.724488601268469479e-01,-1.093819687609588698e+00,2.228328934179435450e+00,-3.714568007945781014e-01,1.522683250506247976e+00,4.986601287148956785e-01,-5.835338977960771167e-01,-3.532396749038855810e-01
9.998122068508119575e-01,1.169929083523078894e+00,-1.594073617834235179e-01,-2.625812679638733216e-01,-5.145555752511560277e-02,3.697336741292915896e-01,2.546368920981100792e-01,1.433046251771497304e-01,1.035777130465477924e+00,1.517704336786200869e-01,3.711593124948110445e-01,4.339193050048380240e-02,-4.326486103176760967e-01,3.029889625861643121e-01,-1.866705934550790535e-01,1.677148520946884380e+00,-1.689644916363361449e-01,-4.309954187476637832e-01,1.319996383616428570e-01,1.494870698422109401e-01,-7.679414160117334909e-01,1.580699957212379214e-01,-6.128249995644208248e-01,2.843480698203783574e-01,1.317011995929887824e+00,-2.573018676119941950e-01,4.111735251281226078e-02,-5.833367023550930508e-01,-3.685738451484654732e-01,-6.162983344810821773e-01,5.394425840534022853e-01,2.194169360015640891e+00,-3.478882734109883801e-02,-1.780412215870236792e-01,-7.514708694460339178e-01,-7.845067864576524830e-01,1.545873555116061615e+00,8.834833230431459183e-01,1.230857296035694048e+00,7.688702484631186884e-01,8.721832992368174775e-01,2.701815632419111157e-01,8.408203900010721710e-04,4.395208520347351211e-01,4.110588462388486963e-01,8.919700151938674271e-01,2.603448140535969735e+00,1.954115641334518427e-01,3.080945111838994110e-01,9.288492491908082460e-01,4.303018573138630565e+00,1.450023745596773717e+00,6.507051041324256602e-01,-4.556408387977266550e-01,-2.353289154680327511e-01,1.115938066983328536e+00,-7.733755135497577538e-02,-2.602322380025676729e-01,-7.048830011558621100e-01,9.339093356867232965e-01,6.192800765222804538e-01,-2.737767810229284615e-01,-2.976418841416070826e-01,2.965076422710387072e-01,5.797442499664191562e-01,-1.455718855870998807e-01,-4.422002062448479043e-01,7.907508356778899516e-01,-4.590160636199045463e-01,1.393508447621946700e-01,2.713369571137522751e+00,-4.017684293379693017e-01,-9.411691939623410830e-02,6.930740540905044877e-01,5.345800743300509195e-02,1.213919544536077311e+00,7.255965083879878375e-03,3.672476523014670535e-01,-5.645971671826131022e-01,-5.862841538177385736e-01,5.330306890894184191e-01,6.372947950883944834e-04,-1.735403548706245525e-01,1.234597523017387566e+00,5.060582134058791981e-01,-7.724625266732787487e-01,1.809943825344714485e-01,1.328822407465306110e+00,8.037202234699810655e-01,-5.262743262626996543e-01,1.729165814508071275e+00,-6.582360861432110521e-01,1.271300859359657753e+00,3.458638410985914180e-01,-4.031539090394997693e-02,-2.529975707269342400e-01
7.001396222673013092e-01,2.311801477414764383e-01,8.198381716234230954e-01,4.858407714638679487e-02,3.061304700489326791e-01,2.294929401935874580e-01,3.349332203228773674e-01,-5.509864866070606215e-01,1.041430884068299090e+00,3.687807694280681448e-01,-2.860730767306297051e-01,-4.326070873354771473e-01,-7.190801236185234702e-01,-1.000993355155807701e-01,5.595027157363571257e-01,6.686391758642296068e-01,-1.534496952155746552e+00,2.269328080933589731e-01,5.247518434194696768e-01,7.490365067064566063e-01,-1.586038897276885962e+00,-5.630961535306298060e-01,-4.163117032105953519e-01,4.644777191870395061e-01,9.691000497199309116e-01,-3.598451536871515866e-01,5.732756810175585471e-01,-7.847970032648753369e-01,-2.058362306983783085e-01,1.229810039099543673e-02,6.643411143499593496e-01,2.921475212114483355e+00,-4.707209696262162901e-02,-5.408574825356839977e-01,-4.264704362319210462e-01,-5.163445708651072108e-01,8.015013662981891329e-01,1.437980634029909055e+00,7.631380547755715060e-01,1.378039473092478762e+00,8.542569704786739937e-01,7.181641950343822245e-01,4.147716217945349171e-02,4.015938369542303155e-02,1.211064709177396947e+00,9.621171304519429146e-01,2.657684957635805922e+00,-3.184004729370291109e-01,2.766877810226269219e-01,1.138659052958451490e+00,3.355554655150440713e+00,8.950272798419693920e-01,-1.098828764219962340e-01,-4.407098428381224231e-01,-6.876955943689430084e-01,1.265054575931869874e+00,-2.187306861835099925e-01,-3.566570191345669327e-01,5.408472157594852447e-01,2.632723595450703336e-02,1.855282974048974687e+00,-5.310214671955775234e-01,-6.848308871811558118e-01,8.433470307522642484e-01,7.929357570810584566e-01,2.402045730018744218e-01,-2.046088950784928917e-01,2.078598452588094059e+00,-6.137776510698650378e-01,-3.369296496510547634e-01,2.298763924106719703e+00,-8.209738804333082118e-01,4.691411394165319604e-01,1.125079294803301710e+00,-1.540794050516012259e-01,1.851732097074027195e+00,4.817626943106230741e-01,-1.990697674960689723e-01,-2.129987438846419057e-01,-5.705370627731750632e-01,-1.006330140169089393e+00,-6.477166308634345615e-01,-4.759645224450204104e-02,1.568669033724365836e+00,-3.607418745209208799e-01,-3.989062490169386077e-01,3.794336984392744916e-01,2.396705620638925893e+00,6.947175898418788131e-01,4.390677424761884606e-01,1.530771302180391702e+00,-7.532818508512023614e-01,1.154106795777993799e+00,7.781980969360835498e-01,-9.231942106620719124e-02,1.632056096782700250e-01
9.147845091429620545e-01,1.812394400768264635e+00,1.744013572687021507e-01,-9.587760658227331145e-01,2.473584117415046912e-01,-4.005097767986390278e-01,-3.936929252005880175e-01,-7.302818960486440192e-02,7.124005874805414695e-01,1.046426482463096164e-01,3.859232962524997701e-01,3.833997577487791575e-01,-3.791529913893491033e-01,3.103076681970361461e-01,-3.224471486353774896e-01,1.722519221589617233e+00,3.194312966178053381e-02,2.115534352256477346e-01,-1.426775759631871976e-01,3.191903306627164733e-02,-6.354016020711333868e-01,8.031133663742190398e-02,-6.434726051154067150e-01,2.213125840431688363e-01,1.593368113354577176e+00,1.685623179739517141e-01,3.830465385669694633e-01,-4.990206757632181245e-01,-5.203370946048935242e-01,-9.492175275602734441e-01,3.925067948273716634e-02,2.051504534425570903e+00,-5.744107966362808071e-01,-2.714768357895079309e-01,-7.206028520559732975e-01,-6.097948575932585769e-01,1.370884754410788720e+00,1.120645323631255685e+00,1.602852697673617488e+00,9.985197688068564448e-01,2.711227863776681790e-01,1.194902941697024712e-01,8.502612449072853573e-02,9.679251390797345700e-02,4.186959006903102076e-01,9.293610475760260003e-01,2.816108206080365495e+00,-1.601698058549541892e-01,-2.472381644101184217e-01,1.846973735838035147e+00,3.195859095237456593e+00,9.476497577215212686e-01,1.537268373052289583e-01,-3.759927321276925749e-01,-3.344358977238329200e-01,1.393664761353541115e+00,4.162265325531097071e-01,2.160722787077174745e-01,-1.002885304650192877e+00,5.538583596909929518e-01,5.117365254764392191e-01,4.934649871218821371e-01,3.176080129741395419e-01,1.256846632442685019e+00,1.151937576964656040e+00,2.110384902637882643e-01,-5.406908987621108498e-01,2.016257737289406937e-01,4.506515666637469497e-01,2.800984930686024055e-01,2.114920949106684045e+00,-7.659609187940761288e-01,-8.439906742989820854e-02,2.102358161585233809e-01,-4.612817844129649125e-01,1.215534083336523130e+00,6.256760406962480481e-02,9.657588503193788032e-01,-9.298855899684637105e-01,3.428100042168724659e-02,6.574838842467198852e-01,3.729064930858599913e-02,8.230653089956385671e-02,1.292361046696678173e+00,1.023499349605889064e+00,-7.974646730594618926e-01,5.967958670544428745e-01,7.690328816365494813e-01,3.160017719229135658e-01,4.967292356329633951e-01,1.483565688785344783e+00,-1.054522948175704578e+00,8.575649691224357385e-01,-1.232505813710627063e-02,9.005641407652704711e-01,1.515308775369775818e-01
1.184905938100847766e+00,1.947927386575816655e+00,-5.707181835032716366e-01,-4.675805343178464080e-01,-1.107634596345861283e-01,3.752311469496280028e-01,3.718569451797886227e-01,4.243603671229272956e-01,9.901208716826234157e-01,-2.239821603725967447e-01,2.394324367573142098e-01,1.735885761879326639e-01,-3.401165771787471037e-01,5.686277102803297678e-01,-4.571305214651801840e-01,1.776503151707058414e+00,4.014882713430567018e-01,-8.875363725885496713e-01,-1.196007759596359743e-01,-1.724488700541924602e-01,-3.901441527452914060e-01,2.378636994399966897e-01,-8.781201428778440121e-01,2.072428081690754209e-01,1.528156259571051168e+00,2.281029531780877639e-01,-2.861376969483800936e-01,-4.873886301786601316e-01,-8.139780396505940097e-01,-1.058347659026740217e+00,4.956874812578646594e-01,1.779785417751984955e+00,1.418653035806849427e-03,9.440909448182976949e-02,-1.041755159060923974e+00,-8.294472527111172999e-01,2.134780884519710042e+00,4.005913983397309530e-01,1.296222488377913873e+00,-7.748503081351132415e-02,8.103966784813060320e-01,1.578471716498993649e-01,-1.184842661573351635e-01,6.800585791181094075e-01,2.346516509053507005e-01,1.007029827085110352e+00,2.452708346765076541e+00,6.679512394221205351e-01,3.853979602629493129e-01,7.239564986198745444e-01,4.710591309389042358e+00,1.808337863669733370e+00,9.116104054803464418e-01,-3.089336365472380441e-01,3.458974276431051598e-01,7.708174021064505554e-01,-5.134607712022952741e-01,-2.705867066823082201e-01,-1.382986503595395433e+00,8.634211712095445357e-01,-3.380264561817423186e-01,-4.097359025768737562e-02,7.725517697464302780e-02,-3.083642395134776892e-01,6.831236724310486563e-01,-3.749395521419596200e-02,-5.012566090776238159e-01,1.308112534622080103e-01,-5.325693494739655032e-01,6.068681063590155578e-01,2.637258982437365784e+00,-2.788972620748191300e-01,-5.990122962289313735e-01,3.609389072134496224e-01,2.745400997131127174e-01,6.837194010671518996e-01,-3.231807309652286464e-01,1.893207121083878008e-01,-8.953246319025300881e-01,-6.456201097423811541e-01,1.362845333039717000e+00,-1.831166612548765227e-02,-3.225370154547293478e-01,1.212276185842210641e+00,7.034587015441411406e-01,-8.841420230929981638e-01,1.889571036775768986e-01,3.593082679223834619e-01,9.963604693920925515e-01,-1.136731349261329793e+00,1.518642277629316695e+00,-8.687651472834940769e-01,1.516420535810084846e+00,2.222325993773925090e-01,-6.695554210506151627e-01,-4.746163978862448785e-01
1.292245641750166874e+00,2.005010224309832001e+00,-5.284451898530365677e-01,-2.451379606712716930e-01,-1.687506475379975113e-01,5.299669925605505760e-01,3.900621513584431876e-01,5.514120363860434137e-01,1.507889385264387760e+00,-2.935272908308759199e-01,-1.530856968840726418e-01,5.697725918736423756e-02,-4.304557383736861143e-01,5.583621319342978451e-01,-2.402346091358670277e-01,1.579580669873824617e+00,2.363071477057259728e-01,-1.002579500588858252e+00,-5.437577898976628243e-02,-4.180518496209435081e-02,-5.943771902680513586e-01,1.234390069974013460e-01,-9.106264572314699546e-01,2.050344454231830538e-01,1.362613278710417708e+00,2.082994496120572359e-01,-4.191767200494438406e-01,-5.110737422482398706e-01,-7.810829142819903925e-01,-8.488273353791787601e-01,6.823531315391988539e-01,1.872157136901801744e+00,1.422434250043751458e-01,7.171990592697435885e-03,-1.093183792134444499e+00,-8.025937029834012693e-01,2.300037877757942439e+00,2.953110863183980861e-01,8.543277827720632267e-01,-2.808353199910462727e-01,1.060307094549460150e+00,2.789283176597638914e-01,-7.160140793739216969e-02,8.479592062434123667e-01,4.085306783341715597e-01,1.040741147873657679e+00,2.556549764134419700e+00,8.983901795619217978e-01,5.834149678217322998e-01,5.614247481908016812e-01,4.971220636329796605e+00,1.846511064457005746e+00,1.106252373038572268e+00,-2.359983421157499373e-01,5.116762057905495098e-01,5.145391305214808142e-01,-9.498113136060525319e-01,-5.347522008062236543e-01,-1.259648264734940515e+00,5.991698176865205561e-01,-3.159303396628836413e-01,-7.864434503626624440e-02,-7.878132140671245676e-02,-6.596211532651193865e-01,6.060917892532224904e-01,2.224034713949274433e-03,-2.810064427319016733e-01,4.929434633414039868e-01,-8.600158720840279658e-01,3.500404575173797772e-01,2.831215839174971993e+00,-3.163476029936911904e-01,-7.157243307760492446e-01,4.406845050736388769e-01,5.170236435047540491e-01,6.446805933910730868e-01,-1.423628863980261894e-01,-2.307253114327704191e-01,-8.358210288448542080e-01,-7.650429324914204132e-01,1.219230153163137764e+00,-1.950862958862504271e-01,-4.231490444216743363e-01,1.160086577927413209e+00,3.480596669992598313e-01,-7.193059763978670862e-01,7.640647038310313666e-02,5.897730899718962583e-01,1.188477335796405132e+00,-1.545347847404779928e+00,1.626163761801515673e+00,-9.356320310025945108e-01,1.923824606652559055e+00,4.040001019654816949e-01,-1.363990196225504548e+00,-4.973143110203900874e-01
9.173544992496497352e-01,4.045627960285267388e-01,-1.984162762263776969e-01,7.273183373939662300e-02,-1.638950618673589710e-01,5.431454254777094981e-01,9.116642224858101384e-02,1.452163227813156876e-01,9.630228566699728932e-01,6.488151321244327585e-01,1.172232196149051164e+00,8.253608769891732089e-02,-3.841994329304572187e-01,2.430212569203802908e-01,-1.766059429687911464e-01,2.274881064497254801e+00,-1.729809476817592007e-01,-2.831027264614868755e-01,4.133985913952440416e-01,3.159102339601527198e-01,-8.627814867747889416e-01,4.186722087782768775e-01,-3.152984676560127708e-01,3.685547051692560361e-01,1.052715360262199695e+00,-1.180788913175208732e+00,2.202905511954838524e-01,-5.954178709648491052e-01,5.966599621929271624e-01,-8.050899425454161040e-02,6.403743251330927810e-01,2.303870281478785476e+00,5.247926336817643200e-02,-4.748225227593729225e-01,-4.687651303959735616e-01,-1.013250685647135718e+00,9.229747247678271593e-01,1.372575785512667235e+00,1.273737291377708969e+00,1.733319030828597729e+00,1.072911926716637820e+00,9.592161768300710989e-02,1.120521818059309754e-01,4.261628612211019740e-01,1.083016133317782348e-01,6.721055662078512238e-01,2.773123816627113047e+00,-2.607825054103695694e-01,2.857021340239743190e-01,1.177587944336277559e+00,4.435357009398567918e+00,1.085324355717078193e+00,7.653904011230441284e-01,-8.135299852600779147e-01,-9.126178635948949402e-01,1.508151689057038780e+00,6.676920578240934656e-01,-1.939525968415699575e-01,-2.886034222906221913e-01,1.490793695412235831e+00,1.651076931965725247e+00,-6.685869996461156761e-01,-8.488883276759799923e-01,8.111149525785381620e-01,-2.302062643434998890e-02,-8.464878856434268073e-01,-5.257110211047187898e-01,1.066452742980605661e+00,-4.768276374413921159e-01,-3.063734940345578250e-01,3.321839581074190306e+00,-3.032720717321336079e-01,3.882047972439900407e-01,1.289851640325228477e+00,-1.653011533149934542e-01,1.917848025225829200e+00,3.197150093509644742e-01,1.040265343456995284e+00,7.135999717947516530e-02,-6.520372977879052012e-01,6.557333988014657500e-02,4.272056434349526532e-01,6.018775060058245696e-02,8.908097099017028286e-01,6.279271236368273446e-01,-7.059222492245462721e-01,-1.281603717761981009e-02,2.406650580952151230e+00,5.467876775086011332e-01,-9.416675881613567611e-02,2.219775892530373440e+00,-2.377863505814121758e-01,9.635691469457816627e-01,2.924287412197584257e-01,1.154958131817586331e+00,-1.394317513720093882e-01
7.990773134845258197e-01,1.160874259992082269e+00,2.807593965321093510e-01,-7.950634944999780407e-01,3.041897258211591348e-02,3.492768665244339044e-02,1.233571487002795286e-01,-1.527793350756572743e-01,1.113603218936120687e+00,1.458621012439355047e-01,-7.691442275738963330e-02,8.655118233733563593e-02,-5.076250392800288891e-01,-8.063449087695569173e-02,-2.119196327709615968e-01,1.163094914486363374e+00,-5.936406978144792568e-01,2.016925417567183576e-01,-1.119072866584941983e-01,1.683122522549073685e-01,-8.695456238791980930e-01,1.727650970197810443e-01,-5.459550106250163903e-01,1.494785807078305995e-01,1.679267003744753461e+00,2.857915774933909581e-01,2.647839787215323648e-01,-6.669696688178099464e-01,-1.277927057675978029e+00,-1.134264552615628752e+00,2.126122455153147961e-01,2.586661813543941424e+00,-4.409309500806303239e-01,1.498751176068741087e-02,-7.046663629889398095e-01,-3.899404276584276796e-01,1.657406675511662320e+00,8.971890548256462594e-01,1.700204502962282316e+00,1.006938452171003195e+00,5.148857059159803740e-01,5.250889540759143825e-01,1.096365349872040901e-01,-5.305392718037081623e-02,7.581508399990184444e-01,8.823133531138641628e-01,2.631080099925866556e+00,1.994832603848023175e-02,1.046505574554848494e-02,8.882000180075513285e-01,3.462189850603805574e+00,1.669650223368956521e+00,2.074622569526321791e-01,-1.924107736247900324e-01,-3.348223179960676532e-01,1.434893015653808668e+00,1.709410996653569770e-01,-1.353585556708840620e-01,-7.206654682204732820e-01,1.134667570535656145e+00,2.068107942349997619e-01,1.192911795889454174e-01,1.714646465314932089e-01,8.481303122803404149e-01,1.448719525645753681e+00,6.765206528100267125e-01,-4.214614097824432859e-01,8.841928329412597209e-01,2.234528170482452114e-01,1.658369815986613371e-01,1.914066614379140940e+00,-5.640007768335570937e-01,3.201879591030638156e-02,-8.400477148821103301e-02,-1.175313885529966212e-01,7.333779559726133490e-01,-1.903354099435033975e-01,3.002075184187528167e-01,-1.338162367392382368e+00,-1.637407403750989476e-01,4.724006169194567839e-01,-7.802030689155942111e-02,-2.929052657656563419e-01,1.799941279655951965e+00,7.022276962705579217e-01,-1.072232165546118665e+00,4.329065073336579861e-01,9.667556707290605456e-01,7.449025578809572723e-01,-2.510586789047603018e-01,1.522161591714011886e+00,-7.100472820752836700e-01,1.014371783782134440e+00,3.324771658139045183e-01,-1.603212948423786699e-01,-2.016984564050454121e-01
8.123182064688208026e-01,1.349665138015663013e+00,1.509922149445663275e-01,-6.554460677747242503e-01,3.434078807256421562e-01,-1.544782716801617051e-01,1.993536589872012266e-01,-3.111421161346485942e-01,1.050682738384414172e-01,4.150008643175392975e-02,4.241903790110239658e-01,8.118537885943338805e-02,-3.958511129147780916e-01,3.667349938222375649e-01,-2.235607673798077899e-01,1.425814177115181991e+00,-2.544343037867921042e-01,-1.251020214842529787e-01,6.410722550744105130e-02,6.778611473310688917e-02,-6.684294558646031170e-01,-1.954005606705166986e-01,-6.990439422825522886e-01,3.664685662010337963e-01,1.494656374210219019e+00,1.740970729416860818e-01,3.988403876761158484e-01,-5.595269692390484328e-01,-5.324588363612027253e-01,-8.413388263144756518e-01,2.266342098239570724e-01,2.067943598652834059e+00,-3.041131097576023623e-01,-1.576775134108606147e-01,-7.058410155327812241e-01,-6.988676596934124685e-01,1.201194951638882014e+00,1.085114526079742792e+00,1.580151388802086387e+00,7.391842932808545541e-01,3.093941187740805177e-01,2.113117173221212286e-01,-1.491497084896924452e-01,1.231784209531064239e-01,5.226983363729492682e-01,1.026160814434628588e+00,2.420742411836053876e+00,-1.660604731525607003e-01,-5.419989039871968284e-02,1.481386329693440418e+00,3.395983827631078533e+00,1.062812235945602035e+00,-3.757135597659483350e-02,-4.485753142944725602e-01,-2.748602859923304775e-01,1.285789143748254482e+00,1.370707456321404727e-01,1.801148814004035759e-01,-6.742630419881476822e-01,3.433203391499441981e-01,6.956266807373004957e-01,-1.532576002239993684e-02,9.155656240559854886e-02,8.535396300428772509e-01,9.365295638275987766e-01,1.141902182531464582e-01,-6.748797383396010208e-01,3.885594974000213808e-01,-2.333904714873630964e-02,6.378073010176245061e-01,2.027762222960376448e+00,-6.475418370865387852e-01,-5.254752549878366485e-03,6.231121495738546345e-01,-3.904257312268964442e-01,1.384615027668606224e+00,-1.305089880845977102e-01,6.004891529480343992e-01,-6.240153451550303210e-01,-3.420397646114171075e-01,4.056103551014598185e-01,-2.337951154938452403e-01,5.321618117694754124e-02,1.418663930254729699e+00,6.739909841027713622e-01,-7.559688499617673862e-01,5.933571660232239697e-01,7.785916586243954995e-01,4.619770191953077032e-01,5.333509378942600243e-01,1.178644170833936800e+00,-9.733007189527863590e-01,7.432732040171403654e-01,1.711850585290047855e-01,6.957146311297823793e-01,2.657680273461504594e-02
7.155416274830205259e-01,1.258076079557663984e-01,6.810038586601287192e-02,-4.354285138297152580e-01,-3.591357360830372825e-01,4.889779928916802021e-01,6.006572666307180564e-02,2.460834758897781360e-02,1.414838955610776328e+00,7.719593327565142937e-01,8.139545611940830483e-01,1.515256690681932583e-01,-4.496013328978309409e-01,-3.230761749304292829e-01,-3.465644139313579508e-01,1.900990146670079373e+00,-5.804635926530445911e-01,3.242110224595773360e-01,1.102142301948341174e-01,3.055965246881590103e-01,-9.224942263032034351e-01,8.171665868547586253e-01,-1.365256412433789035e-01,1.277003791305888758e-01,1.517531620338017584e+00,-7.880540711688970301e-01,2.921728347026333883e-01,-7.225975999404622430e-01,-5.705551342083705624e-01,-7.629123116541747240e-01,3.593446565976882168e-01,2.881580118166627624e+00,-3.244123237133125226e-01,-1.198747752535402333e-01,-4.150178891804998660e-01,-5.820182094724090094e-01,1.265113265035841650e+00,1.258623801839754419e+00,1.957851243102274541e+00,2.172587423241795435e+00,9.050294773064677667e-01,4.220712092606221932e-01,3.188021632488924340e-01,-8.530368240504111743e-02,3.595253844461958059e-01,5.280983931778080454e-01,2.819708212382961765e+00,-3.320725988714919308e-01,8.947797030291633480e-02,6.547868833349614892e-01,3.957574315821004607e+00,1.763998776099185761e+00,6.121433979721057073e-01,-5.176526038808297869e-01,-1.111414477209048401e+00,1.966271035792965804e+00,1.094751537015774989e+00,-2.273160195037312314e-01,-4.090271742700394286e-01,2.499477193901485261e+00,9.749091664798392731e-01,-4.152718173547438330e-01,-4.576755363523542508e-01,1.240514989760460818e+00,8.840759128195904148e-01,1.411633008948631751e-02,-4.833090460863052606e-01,1.287829297032004439e+00,2.416155984848321892e-01,-4.434713889379575669e-01,2.672435773443523122e+00,-2.410306812558956902e-01,5.673075728067740187e-01,2.653228986015779833e-01,-1.596008524687495822e-01,1.123591470829430783e+00,-2.408911991062939739e-02,9.908432425132460697e-01,-9.615851739211929150e-01,-2.665970917184940503e-01,2.077230603516660445e-01,6.297948367441543738e-01,-2.511317398585131699e-01,1.573247680157638717e+00,9.759370764930231923e-01,-1.271666149719836936e+00,4.215018523522562344e-02,2.189633883697624572e+00,6.666644218835983127e-01,-3.971497942265549419e-01,2.295490192540363239e+00,4.606056140048786496e-02,7.615725738656978772e-01,3.195840355350110240e-01,7.892509648649919107e-01,-3.457602199372057927e-01
9.950231480655776783e-01,9.015888809779947222e-01,-5.584550212117275203e-01,-7.491869952624585771e-02,-1.329836678595904820e-01,5.752349760247228438e-01,4.482871214639915225e-01,2.248171747818520361e-01,4.677700940491372750e-01,2.901770005314650014e-01,1.155951649616680621e+00,9.897099716178148210e-02,-2.854807905392894307e-01,5.034933181785948841e-01,-4.343865299386802103e-01,2.249819917363805377e+00,2.390289050167436202e-01,-7.786354288603357654e-01,2.491303978273197717e-01,3.265138171558504276e-03,-4.815656157745225041e-01,3.747353316277299284e-01,-5.758024724720534060e-01,3.646639315172894302e-01,1.263623346262487290e+00,-6.891490559684746442e-01,-6.718417284052702332e-03,-5.305349208795401283e-01,1.408907709795499397e-01,-5.152870478296831536e-01,6.077329890055058748e-01,1.916979709637860463e+00,1.406774043001832175e-01,-1.487002054303379062e-01,-7.082576282901987819e-01,-1.082382886127407406e+00,1.322148947602892921e+00,9.584422857506312843e-01,1.468560269797565043e+00,9.068542531000620688e-01,9.253075367705995147e-01,9.165226601539566698e-03,-1.176889609649799245e-01,5.790240771590293711e-01,-3.035179821973710279e-02,8.192874035009062306e-01,2.424809462691655870e+00,7.955914935535146615e-02,3.602211676532529605e-01,9.038828238704751383e-01,4.745235642733798720e+00,1.433748840967987714e+00,8.113369659723059790e-01,-7.221095657964454739e-01,-4.058885772755349008e-01,1.231382958582857512e+00,2.774865147914470365e-01,-1.222228889730935936e-01,-7.862925911764132580e-01,1.367042696063264007e+00,8.517401455665257748e-01,-6.452449954643945107e-01,-5.315459868928512632e-01,2.232989849122727355e-01,4.385111510150285774e-02,-7.591807423956595802e-01,-7.071876713771881873e-01,4.393168625639214397e-01,-6.240564733850523238e-01,3.718476101162894176e-01,3.097857230968665831e+00,-1.509396223728526054e-01,4.065612223097994637e-03,1.123762691254424961e+00,-2.690482644679207530e-02,1.517977372579129902e+00,-1.247959414655366306e-01,8.332830986422009589e-01,-1.351375207552878432e-01,-8.145734208174149060e-01,7.312133883896889675e-01,3.159050481782376130e-01,-5.216672100833913417e-02,9.687231444157362592e-01,7.561338185282624469e-01,-8.375353656754896958e-01,5.475993109784799140e-02,1.429140979486726248e+00,7.151253284191222415e-01,-4.542623364935761687e-01,1.825687121010715286e+00,-3.978578034519990592e-01,9.930096373513170871e-01,2.054351341554490062e-01,7.081740383909227443e-01,-3.706203686523100727e-01
8.853909629594356456e-01,1.203205277993106614e+00,-8.082364362950704428e-02,-4.128752475045953108e-01,2.148887998353429252e-01,6.258594443171539012e-02,2.230149342357203301e-01,-1.320186706097893070e-01,1.869761752597426385e-01,1.512139609104930782e-01,7.469255415408249110e-01,9.746405458586050730e-02,-3.525540035895988189e-01,4.612457759556804482e-01,-2.644746332180263337e-01,1.776110446288984512e+00,-5.564567406420206641e-02,-3.460437997031510227e-01,1.698226029976000473e-01,6.796551225442092059e-02,-6.198770812898591887e-01,-4.107941893463118443e-02,-6.516365771349063030e-01,3.946274762901380573e-01,1.351781675297493379e+00,-2.099955659073426684e-01,2.929946640465068697e-01,-5.348570079015613210e-01,-1.067383849885807923e-01,-6.182474215876549994e-01,3.685335334638114024e-01,1.970317747978131973e+00,-1.398631220030566447e-01,-2.347317660112616666e-01,-6.847914188328041440e-01,-8.748701316247028403e-01,1.141997296474971391e+00,1.114429089646324922e+00,1.469460368249604798e+00,8.473397678590411930e-01,5.233898709980044917e-01,9.517290208889556125e-02,-1.391727981789272484e-01,3.095318133407931049e-01,3.036244214142915787e-01,9.571211250359683564e-01,2.457406623474312823e+00,-1.332121293576520316e-01,7.417034383366596928e-02,1.424432749491628236e+00,3.835350722517821609e+00,1.044005847952408583e+00,2.430051977999008184e-01,-5.918360804060773805e-01,-3.601772751312904419e-01,1.260874813613937384e+00,2.142226162165116188e-01,1.047934755468840073e-01,-6.648889878070087800e-01,5.791179232767178497e-01,9.154359807291675422e-01,-2.345519590347033834e-01,-1.752734847574375920e-01,6.986039500823567616e-01,5.293898881663557932e-01,-2.974228175274478136e-01,-6.872516353413100632e-01,4.001421694597080414e-01,-2.548079304396640987e-01,5.096569367328291911e-01,2.473542201044548694e+00,-5.124989090123361901e-01,2.090796447154809334e-02,9.225819231303804546e-01,-3.128615238380080821e-01,1.577631983120879600e+00,-4.339265894438343318e-02,7.563090195701296370e-01,-3.171170693921435690e-01,-5.066564017318697655e-01,4.436697052542666886e-01,-4.622774769985713017e-02,8.450603518466270891e-02,1.169949625524877135e+00,6.840317481327080618e-01,-7.063503664039897378e-01,4.146966250137858467e-01,1.100706259569673939e+00,4.865854459575971735e-01,3.296586027036499389e-01,1.420440943853840343e+00,-8.066893244285886500e-01,8.162228873057850720e-01,1.642500737552373691e-01,8.685126391553967817e-01,-4.222939029811878520e-02
8.317003070518446117e-01,1.169670259065042295e+00,1.843452128651160149e-01,-8.231220689794448431e-01,-4.416246852979080484e-02,-1.962554960629625533e-02,-1.783945988543392258e-01,-2.075371535095803938e-02,1.214083345209561848e+00,3.241758342077525334e-01,3.111975669362729846e-01,2.676746080442161113e-01,-4.456232865942146293e-01,-4.943247886270520086e-02,-3.199933050512935306e-01,1.612012508573588576e+00,-3.281597320707974053e-01,3.145550721614423506e-01,-1.145427104064997148e-01,1.488749648871757758e-01,-7.952287191757888563e-01,4.057552145595046955e-01,-4.463916691126057490e-01,1.264318163041612264e-01,1.644099754370874189e+00,-4.550919477726794032e-02,2.991674962926913484e-01,-6.188558201710995244e-01,-8.733102551520893764e-01,-1.020584616837471925e+00,1.535520906126374152e-01,2.506479616322069059e+00,-5.139326248375585271e-01,-1.206273056717268588e-01,-6.338486704000469985e-01,-4.868096037097544015e-01,1.513127148920278886e+00,1.064594203400739403e+00,1.772060628262815740e+00,1.391375001783333509e+00,5.395019888619725368e-01,3.537628780866867717e-01,2.148206044599509923e-01,-2.827931333578750928e-02,5.133319356599779226e-01,7.712429792845855170e-01,2.824060937293003892e+00,-1.279914901955746531e-01,-9.041299890640959458e-02,1.175436524341833433e+00,3.482576777848245264e+00,1.476479093056122682e+00,3.537447947199095499e-01,-3.189570267481219301e-01,-5.659611028290696400e-01,1.604739568281422502e+00,5.793426702034566445e-01,-4.589259191099306218e-02,-8.085746106759273966e-01,1.427175257680484144e+00,4.451170211771741103e-01,1.978250388793086900e-01,9.970974499755359821e-02,1.170968865528820846e+00,1.261088134279752859e+00,3.810478857330386049e-01,-4.500806269090692480e-01,7.372086927654792898e-01,4.166850333699835263e-01,-4.322293777530344938e-02,2.199825870994632560e+00,-5.507909588920255617e-01,1.279802311209540244e-01,-1.212593477659204555e-02,-2.461278150458948155e-01,9.276688393527431353e-01,-4.094094698757805295e-02,7.836393413865077040e-01,-1.200339025746230082e+00,-4.485203578050367401e-02,5.329049245763675113e-01,2.297294574158000313e-01,-1.696585879582743206e-01,1.565420480128392633e+00,9.726902909379149254e-01,-1.072910108096343240e+00,3.709688770251590162e-01,1.230682352832947357e+00,5.655985102097083050e-01,-9.344554389143483464e-02,1.798673971465741594e+00,-6.090105790703177480e-01,9.152358982714448032e-01,1.792406864820661472e-01,4.687713934523614068e-01,-1.198576467297886028e-01
7.332987777300595811e-01,2.367333618230398340e-01,1.466428078722559203e-02,-4.515384014761792963e-01,-3.249660794850345868e-01,4.636334839658149409e-01,9.271988161715105647e-02,2.808374050545876799e-02,1.283684198738261006e+00,7.098126709655845357e-01,8.395907937723366965e-01,1.605825969184930258e-01,-4.283909601319409455e-01,-2.467025729137125589e-01,-3.777280693611101969e-01,1.920194699007513162e+00,-4.895341106126831487e-01,2.386080682386528817e-01,9.754787481320378872e-02,2.561599850175687587e-01,-8.574028754354274806e-01,7.758396935694253926e-01,-1.877828405116703792e-01,1.430664293574927526e-01,1.528776940041636223e+00,-7.238489216086299027e-01,2.728916277234036958e-01,-7.018151238630989663e-01,-5.646885311693706777e-01,-7.941351272935828209e-01,3.517815286703419586e-01,2.780850938046679044e+00,-3.084410488370479819e-01,-9.922879276352172817e-02,-4.504549749430045713e-01,-6.141538585411360218e-01,1.285941647818976463e+00,1.219039093516694372e+00,1.959959168858772305e+00,2.033403125797601518e+00,8.654178486925006020e-01,3.816287405348000039e-01,2.716339991748118465e-01,-4.650235143344295941e-02,3.243253787820602474e-01,5.620834507446197392e-01,2.769218438275676153e+00,-2.978528499279875508e-01,8.878226383491395757e-02,6.894686370608240633e-01,3.982117087532441424e+00,1.745529903937414584e+00,5.999233098739824577e-01,-5.225381158519943892e-01,-1.030968758072492220e+00,1.909315849240619478e+00,1.032075378198555882e+00,-1.908748259568742722e-01,-4.803310259127148152e-01,2.393493855082967414e+00,9.051754202955241135e-01,-4.013924345467090871e-01,-4.125211162828565925e-01,1.169351806241938796e+00,8.567753910712916365e-01,-1.605387029631533125e-02,-5.206239841573315763e-01,1.156918769212004428e+00,2.095382564910775181e-01,-3.228085983330145625e-01,2.652330405023311855e+00,-2.387305807612931097e-01,5.036016182222505799e-01,2.945712488016033470e-01,-1.654602325009507657e-01,1.123768762224029327e+00,-6.622977586841832798e-02,9.893882565237741566e-01,-9.337490596796386155e-01,-2.919423694278857062e-01,2.945771122472953252e-01,5.980792804690843179e-01,-2.337193997284080504e-01,1.544111927981369536e+00,9.913101222911540056e-01,-1.253835266103756396e+00,6.882632214286274475e-02,2.037275170602964813e+00,6.604743626191148520e-01,-3.750294866487556833e-01,2.216088845690816989e+00,-1.285645112901501186e-02,7.544670663823067613e-01,2.904935734236711586e-01,7.964348040217046343e-01,-3.473699424147286274e-01
1.020292150050001734e+00,1.249274933691568279e+00,-5.272811875084244537e-01,-3.402302470235329390e-01,-1.605310319813703090e-01,4.957887847575433993e-01,4.606210605195489860e-01,2.653792477857745413e-01,6.998973263666334876e-01,9.678045749708935608e-02,7.326557155748729677e-01,1.328912015580470951e-01,-3.138615433260805720e-01,4.202177086355037283e-01,-4.974055238274304735e-01,1.973007695391196137e+00,2.257272326288179420e-01,-7.272712594737130720e-01,3.723011619069476613e-02,-8.706640911588892084e-02,-4.333865590817060909e-01,3.986565408077260564e-01,-6.697146521847092693e-01,2.565634851037064124e-01,1.481863350086397801e+00,-2.173030132980247886e-01,-1.080842137569128225e-01,-5.407726103524475025e-01,-5.176327967069163094e-01,-9.037738124633335479e-01,5.038672008396187785e-01,1.968902388576402540e+00,1.707566078033195822e-02,5.164597259940288676e-02,-8.372419202373727609e-01,-8.971902557544493284e-01,1.724262391865699406e+00,6.937896384769185465e-01,1.576820655564981077e+00,5.690105524586264174e-01,8.303453613905216191e-01,1.357493577174508914e-01,-9.750744228304800143e-02,5.097220699167877012e-01,1.203965251693348559e-01,8.718969421466158387e-01,2.404099983601982959e+00,3.050754197406603807e-01,3.347124649874481106e-01,6.875738885879753015e-01,4.646639244613792741e+00,1.755816753500531346e+00,8.048925489477485318e-01,-4.961670714476342781e-01,-1.314136027623593606e-01,1.141052683552843172e+00,4.237245229051167517e-02,-1.779487528774877370e-01,-1.060890005064065722e+00,1.388340126163296384e+00,2.014623687369813676e-01,-3.770366715430956139e-01,-1.969307170903975279e-01,6.881904663102123010e-02,4.893964173296216913e-01,-2.883331476927882830e-01,-6.407810584945416998e-01,3.323391024401655680e-01,-4.508681030802036416e-01,4.953392778905235105e-01,2.752611532370866865e+00,-1.706427468821690441e-01,-2.048475176643932971e-01,6.073866839178169164e-01,9.642703484925767288e-02,1.003064615855431940e+00,-3.184749453212302184e-01,5.545945804239034160e-01,-6.593265859749478652e-01,-6.875489462379720251e-01,1.038355659121735997e+00,2.174802664568270538e-01,-2.319178033605079348e-01,1.227428564653806120e+00,8.138267646500535468e-01,-9.923316945463812599e-01,1.253530362775107099e-01,9.042644506349837297e-01,8.627766381464262446e-01,-7.955503007330346765e-01,1.683867574699678737e+00,-5.198749716107023966e-01,1.136144429440594017e+00,2.169681267196938712e-01,7.533625540319988101e-02,-4.762319592517828548e-01
7.408068324708568797e-01,2.267531760964354159e-01,8.462291603426340403e-02,-2.968819152952850704e-02,4.054908393805636835e-03,5.829934814349533312e-01,7.380330621952250203e-01,-2.593227204014573739e-01,5.733763786971739496e-01,3.454119605473134347e-01,4.484957107267369958e-01,-2.694261515047897682e-01,-5.005539516019495982e-01,5.685996711608728993e-02,-3.627014609288287117e-02,1.295302148392462493e+00,-8.157806963550098267e-01,-3.319626947149522112e-01,3.667294138443173979e-01,3.311025294353991955e-01,-9.830762034133437854e-01,9.810931915618936738e-03,-4.636671027567615955e-01,3.901442526240497810e-01,1.261884224841399949e+00,-4.222772240540778044e-01,2.536610439262183547e-01,-7.228153943590059916e-01,-4.625880144433762720e-01,-4.957183154662774260e-01,6.432269883601766658e-01,2.578699368402099346e+00,8.373411365377986249e-02,-1.029926654599394309e-01,-5.618575356364434725e-01,-7.348780000930102974e-01,1.158176599914316984e+00,1.083073755412269579e+00,1.426599726468219975e+00,1.136420563731618261e+00,8.798893145697832541e-01,4.862874824818846919e-01,-9.788179111958741907e-02,1.821456574547278828e-01,6.321354369763432235e-01,8.676411055742913048e-01,2.317693681043573317e+00,-1.028225492382841277e-01,3.770855320341039985e-01,5.501610560119722937e-01,4.145357259077294465e+00,1.570085342248252580e+00,2.942942008871285431e-01,-5.337236182730260570e-01,-5.715961467696681897e-01,1.362889114887730235e+00,8.041128619902637720e-02,-2.733405803424998615e-01,-9.618489037870425751e-02,1.136454075328792612e+00,1.103730737617135693e+00,-8.107540331979133930e-01,-5.929287701179656311e-01,3.926622723402023452e-01,5.678433393145859709e-01,-7.828770311525995451e-02,-5.525488770316536735e-01,1.331810085422545198e+00,-6.284323618665196287e-01,2.074464194036611253e-01,2.496078355655345860e+00,-3.178872150845948319e-01,3.138634241396541791e-01,9.614660496664113598e-01,-1.593618200754168268e-02,1.431451804918046244e+00,-1.188733129227979024e-01,1.719009371187810165e-01,-3.961138245526645285e-01,-7.918642799222993522e-01,-6.901286876989531915e-02,-1.401525082902094210e-01,-2.018125969170697920e-01,1.552066485267882934e+00,2.277118272061772197e-01,-8.624692044512293210e-01,1.861152981929846129e-01,1.780476114950564348e+00,8.547186433699240915e-01,-2.362167880057121361e-01,1.588181746989498766e+00,-3.616313839908151806e-01,9.326539161784561660e-01,5.664243261644971161e-01,8.890711475857449031e-02,-3.210460372523367134e-01
1.030597535360808781e+00,9.184748221402363466e-01,-6.434319042685974210e-01,-1.789537405596841602e-02,-2.667908400711908601e-01,8.814881278101815987e-01,9.228892357169438121e-01,2.902396514592892607e-01,7.585057531633014882e-01,4.291765771364675075e-02,5.739749624825150054e-01,-1.083378575092902585e-01,-3.614930753235793826e-01,3.933448967344249647e-01,-4.043522534639887311e-01,1.747210198670679837e+00,8.645395861904769941e-03,-1.074100303576485782e+00,1.614992211668939415e-01,-3.413930717989589053e-02,-5.134735001617708461e-01,3.414919709491094357e-01,-6.965826997220803118e-01,2.953657495723743809e-01,1.388976775474576320e+00,-2.563357716816531684e-01,-2.758242521470806174e-01,-6.050700700120124065e-01,-6.620898037886613352e-01,-8.294394947720200584e-01,7.526092539147148930e-01,2.077292400098379677e+00,2.954247090992991320e-01,1.784123380814519599e-01,-8.799421821639257235e-01,-9.316139295893246519e-01,1.866364739026783459e+00,5.065985194630934219e-01,1.419133300170489553e+00,2.993975855349891857e-01,1.082280040153560163e+00,2.850609628504314763e-01,-1.919917762928495253e-01,6.384254065119222554e-01,2.212284182047387637e-01,9.017517504365845094e-01,2.195033865146175156e+00,5.239640434801857705e-01,6.307356180865993922e-01,1.080057479547408272e-01,5.141631395803488047e+00,2.101814679926022222e+00,9.521841067528655778e-01,-4.770765801899746750e-01,7.652518081103232284e-03,9.581716241685062085e-01,-3.431400236781311230e-01,-4.259940040979045550e-01,-8.864109192096182310e-01,1.476367867524437161e+00,1.263405603316141712e-01,-7.833612784453626299e-01,-4.402997837139825954e-01,-5.124916115917846904e-01,3.234011257755564639e-01,-3.097547768911823596e-01,-6.023104907742039549e-01,6.568998713707747683e-01,-9.430979949270127394e-01,5.543362577833317317e-01,2.874380704199003489e+00,6.097888830951359029e-03,-2.399309998850703285e-01,7.845371154919991152e-01,3.840493366326678260e-01,9.002784093097253582e-01,-4.434543825939891715e-01,7.141626059381134262e-02,-5.698560892979525061e-01,-1.030175659331542981e+00,9.645690468189547229e-01,7.183067562449810262e-02,-4.107908821818750389e-01,1.330200463399631605e+00,4.727782097940485539e-01,-1.006609581578499668e+00,-3.455780195108532071e-02,1.021920492041305195e+00,1.169379905099415806e+00,-1.331610773756313204e+00,1.658429224776504896e+00,-3.631209145908772529e-01,1.338329964070051004e+00,4.476799017454134444e-01,-6.202613958491203228e-01,-7.145653097956948807e-01
7.529444781719893953e-01,7.124915368321946829e-01,-8.564756824825690840e-02,-3.659655039208963290e-01,1.823265229670181786e-01,1.390708192240721341e-01,3.227836770005069189e-01,-2.598114451293011551e-01,-1.327491471033731552e-01,3.689952018992650462e-01,1.159399000424612636e+00,8.381766027261282337e-02,-3.131368471377898310e-01,3.660996814279252054e-01,-3.499575877197599882e-01,1.940810752717738952e+00,-1.338434856895077962e-01,-2.507112574378865255e-01,2.588447155899255558e-01,8.551522985642813490e-02,-5.910694308703313693e-01,9.862244147115667436e-02,-5.126283526702152260e-01,4.271316623995843886e-01,1.365490771767980061e+00,-4.900630109944204560e-01,4.209214464077501994e-01,-5.681284138976818721e-01,4.799993259089951891e-02,-5.814336353361319043e-01,3.449378642155951358e-01,2.074020950852225376e+00,-1.420794290135496407e-01,-2.178320501844151491e-01,-5.470994098168697750e-01,-9.289760669652409319e-01,8.589252062366723450e-01,1.304750500223148535e+00,1.765395578135903421e+00,1.286289097273238369e+00,4.926182815578436514e-01,6.094954195923474316e-02,-1.475563093511756407e-01,1.678954911799649397e-01,1.861195731894110250e-01,8.624250972921004843e-01,2.375099751396837711e+00,-4.013731263958303930e-01,1.707462896402280050e-02,1.378276199124069512e+00,3.781366615678476872e+00,1.047805115521393660e+00,1.434699527675593334e-01,-7.279131708804296164e-01,-6.939429516450207336e-01,1.551724804145210301e+00,6.553686740629416363e-01,2.118004566180201886e-01,-4.885887580860673873e-01,1.015934053888091437e+00,1.228467814894253829e+00,-4.778988558922055985e-01,-3.264125925043658283e-01,9.733688806496950674e-01,4.136061006305761234e-01,-4.690610015299492286e-01,-8.358648817498812722e-01,4.511526475591636220e-01,-1.567112634728520804e-01,5.196385375246389549e-01,2.506231820085366380e+00,-4.089066557544966951e-01,2.974394846123749048e-01,1.064619116739113469e+00,-4.613602506066620257e-01,1.769136765377435694e+00,-1.115419387153991360e-01,1.061359032408491831e+00,-1.846588907767304777e-01,-5.339954469680338045e-01,2.855097330035579750e-01,1.471165668914864444e-01,1.476908267439492883e-01,1.206647402547448511e+00,8.291995765609432301e-01,-8.313423246732325467e-01,3.863628320472558553e-01,1.385422787837481629e+00,3.823977027263600892e-01,5.917385528312242293e-01,1.496685500707256811e+00,-5.446149804062506705e-01,4.807945362570594794e-01,1.305036189744293584e-01,1.462292013533803337e+00,-6.841714655868491590e-02
8.582160235459161957e-01,5.767552920774605685e-01,1.829187801959457071e-01,-2.591707338418062778e-01,-1.457534473348031656e-01,3.532413718541089764e-01,-3.505781185048967297e-02,3.357525373787924317e-02,1.487664966869826078e+00,5.391888880870500111e-01,4.245247468401895929e-01,5.754463490806351056e-02,-5.141303463256786666e-01,-7.213012364612421401e-02,-5.350018653270760538e-02,1.680412968761096471e+00,-6.003251460499579029e-01,1.475603330286252013e-01,2.087139121213212323e-01,4.004805334129972194e-01,-1.076051855741472885e+00,3.529462056917599400e-01,-3.155507106809896101e-01,2.310579475889833478e-01,1.265742121918929985e+00,-6.508676014212460004e-01,2.699953792039601064e-01,-6.727303093399350509e-01,-2.316790498196557024e-01,-4.227446431125664317e-01,4.879329461099638499e-01,2.672531020322240547e+00,-2.035613065716361803e-01,-3.537332165683513829e-01,-5.074030928007149388e-01,-6.412178892558071386e-01,1.238076539274122423e+00,1.242154927292996147e+00,1.324880316643012312e+00,1.680265237404563017e+00,9.495721528026201952e-01,4.022201615923972073e-01,2.450751662315260315e-01,1.577672565821132966e-01,5.363434589147774156e-01,7.035550132375130161e-01,2.889850381610285623e+00,-1.674531308647718708e-01,1.819518288786550475e-01,1.015257297677027992e+00,3.935132762671712747e+00,1.337815472036735009e+00,5.711543065016784215e-01,-4.967200511382199313e-01,-7.911217378348657236e-01,1.537224724412646681e+00,4.815405700700038372e-01,-2.989862106516310014e-01,-3.013523576384082858e-01,1.431188320008280446e+00,1.179555269369721549e+00,-2.867168547298198922e-01,-4.999914569205139436e-01,9.602957852376367009e-01,7.098362466647922808e-01,-6.436107827593767761e-02,-3.225558395115774024e-01,1.355548229676051264e+00,-1.251590209706785473e-01,-4.575404121272097502e-01,2.765968095318580122e+00,-4.766982267660186956e-01,3.335450230652169945e-01,6.057116149201684507e-01,-9.583470148431126601e-02,1.390007873639259817e+00,2.701801295382583734e-01,6.292428667740003201e-01,-6.194767248883057409e-01,-3.596103942600839543e-01,4.994984076725272892e-03,2.164742957513082766e-01,-1.417692120016866841e-01,1.335791665855845078e+00,5.470499032509190673e-01,-8.438326407135747775e-01,1.231817624406931211e-01,2.152886068345110537e+00,6.655269047694283291e-01,-2.546246566947242829e-01,2.111161190096855655e+00,-3.797701009504207414e-01,1.112342225502738424e+00,4.048397241449757655e-01,4.080820724724347204e-01,-1.259132927016505810e-01
1.100463252557055016e+00,1.049646225563025670e+00,-5.329314544141129373e-01,2.027907420469485800e-01,-1.264711640841019169e-01,8.825646455594078343e-01,9.941085183984490481e-01,2.463615979831143554e-01,7.928185007977656129e-01,-1.044821469369368316e-01,2.515311408896772072e-01,-2.662441075408896740e-01,-4.327411564486889906e-01,5.247537808778571788e-01,-1.420011179408421365e-01,1.480279363989664088e+00,-1.536130820140696185e-01,-1.235830837848511887e+00,2.887471996286591347e-01,8.037263890967935587e-02,-6.855019676879414714e-01,-2.722138067521107097e-02,-8.055945048155985777e-01,3.889789062533739461e-01,1.177584014451143801e+00,-1.889059224221184830e-01,-2.911707292861215324e-01,-6.030520854350478466e-01,-4.599726840404340100e-01,-5.449153233657491047e-01,9.076720118132386439e-01,2.015565733058520603e+00,4.466016791726412083e-01,3.543304850738282497e-02,-9.254505487657527230e-01,-9.651717898508627158e-01,1.821210151190398641e+00,4.918109366499793800e-01,9.450620407871137552e-01,-4.321989384684465918e-02,1.168963376444499769e+00,3.375698565811579566e-01,-2.671246986559858150e-01,7.987898808793781891e-01,4.122033403801954599e-01,1.028709371456662636e+00,2.181424551437699755e+00,6.423684720900157963e-01,7.623957749993623967e-01,2.104960783601935725e-01,5.185380374169948681e+00,1.871063853624086004e+00,9.018476642897916840e-01,-4.636541386359634420e-01,2.138712501507870067e-01,6.485591311783046597e-01,-8.405720473689936023e-01,-5.349562529087027452e-01,-6.805459857744353691e-01,7.434683912015778162e-01,3.360123543217814479e-01,-8.320008418023783214e-01,-5.601066695306837762e-01,-8.010700815388985818e-01,1.751036911802228424e-01,-3.484511800525605940e-01,-4.808876003581323832e-01,8.664496839387216820e-01,-1.319492136069939869e+00,5.397547716629530479e-01,2.934983565401575234e+00,-1.278840528915240193e-01,-3.553348787323747371e-01,1.092622299987157541e+00,4.775002967295360889e-01,1.101954457876412663e+00,-2.571395085625848287e-01,-3.175019196263920707e-01,-2.897525023659021093e-01,-1.181893187946628565e+00,7.037830660595777443e-01,-2.778960429794790632e-01,-3.718826627865920997e-01,1.225126805620177839e+00,4.993916338895110218e-02,-7.077462584678221313e-01,-6.535669000817312391e-03,1.101174764286942498e+00,1.234606236373675170e+00,-1.292513097352053997e+00,1.511316402251621671e+00,-6.025172883299780846e-01,1.595075093759342533e+00,5.896807284701194307e-01,-1.025747126218292671e+00,-6.036804909837556465e-01
1.000630312129684008e+00,1.425070744708840875e+00,-4.575821284743610828e-01,-4.777359154918171535e-01,2.415426454122698852e-02,1.269170954641981597e-01,2.678257376401121936e-02,1.858018336649394087e-01,3.088188643627538532e-01,2.266691889136588645e-01,1.209594605686486357e+00,3.434870491366571743e-01,-2.305821284033828245e-01,5.858733735079584282e-01,-5.523491757713600014e-01,2.387495648197777154e+00,5.102619381045236935e-01,-4.917363614474342670e-01,6.845588525102308530e-02,-1.097808267038729579e-01,-3.419618438250471848e-01,3.582002013389621320e-01,-6.280116135518544196e-01,3.233363850274467710e-01,1.414246671904729524e+00,-4.512647404194087830e-01,1.349128897953555672e-01,-4.509646830666631523e-01,1.283676481791058421e-01,-7.046470511584698171e-01,3.245540678566314896e-01,1.727412820934590254e+00,-1.544911600541351016e-01,-2.142678778116187677e-01,-7.288945410023958127e-01,-1.027232655340285294e+00,1.278505390097762540e+00,1.052945985022865516e+00,1.639633079810065786e+00,9.455927589533472677e-01,5.959974247087904686e-01,-1.398309889288841812e-01,-7.289271652779948096e-02,4.616324246951045152e-01,-1.028428351107324445e-01,8.474983843497059244e-01,2.571433729688590297e+00,-6.215229935484091472e-02,5.166791987373388351e-02,1.485281829400183273e+00,4.208998036005644927e+00,1.122167027027682895e+00,6.140111316900176419e-01,-6.875000927270081830e-01,-3.946541843373770897e-01,1.329047897007546108e+00,5.232137583318317020e-01,1.549656148682407586e-01,-1.070823469023606700e+00,1.115605021661752350e+00,7.228923890973142363e-01,-1.570185935289767354e-01,-1.579882510841986165e-01,7.066591641635996401e-01,3.041694178813512117e-01,-6.349458340787117461e-01,-7.645626323962846360e-01,-2.452993662492419791e-02,-1.260589615910203964e-01,4.727247606989388173e-01,2.842156956876425333e+00,-3.496927661643257079e-01,-7.010228375970427306e-02,8.627247857695194977e-01,-3.015204544913352436e-01,1.513628637387848030e+00,-8.099309792570863475e-02,1.224011187248474908e+00,-3.145069786850250848e-01,-4.647616287913517441e-01,9.292012296513363356e-01,3.716694044051147561e-01,1.083724192287865984e-01,9.105964745362612467e-01,1.099402585737959903e+00,-8.262268871881141008e-01,2.761566757627059721e-01,1.029666856462113422e+00,4.313262955738217386e-01,6.609278616062286282e-02,1.708595163372446324e+00,-6.649214102097691370e-01,8.124147465549880209e-01,-4.287377761275917853e-02,1.252916386139948379e+00,-1.416767805498120314e-01
7.362046115020743908e-01,3.654169655560519647e-01,-1.565070399301555781e-01,-3.954312944259840146e-01,-2.169411585622560423e-01,5.508705603214090196e-01,5.521209900181555108e-01,-6.250685425540178364e-02,7.051451789393874403e-01,4.430191472711127454e-01,7.794432163549346315e-01,1.627094001837180171e-02,-3.918163096686799740e-01,-4.971100696990166101e-02,-4.348844106944111387e-01,1.709654374228008589e+00,-4.145363332065543638e-01,-1.914165696499476876e-01,1.073502904510511557e-01,1.103742624933238270e-01,-6.826475070880396734e-01,5.443469400787493973e-01,-3.853853976252673563e-01,2.222155975107273085e-01,1.581391138717234357e+00,-3.958644467644034659e-01,1.690295628669631067e-01,-6.891019307511685454e-01,-8.116318867173292206e-01,-9.613296775902748781e-01,4.198499141981972826e-01,2.552096833943711562e+00,-1.362526376308956233e-01,1.100161368621139640e-01,-5.873490929310618558e-01,-6.873908464971841825e-01,1.417792230061762027e+00,9.755473190036536568e-01,1.993764652486129441e+00,1.386515327452611412e+00,7.782282920630307910e-01,3.804441870863883302e-01,2.141641499105143356e-02,5.980258509880476830e-02,3.364326871723450907e-01,7.188065529960614430e-01,2.393653682781570868e+00,-1.041992197225894423e-01,2.135836272418404069e-01,4.314990527819692057e-01,4.190154739364844616e+00,1.928665170291157027e+00,4.933756483233801005e-01,-4.937674833872823799e-01,-6.788521014757475935e-01,1.658477613472757461e+00,6.097547282627224785e-01,-1.603549534718981817e-01,-5.870480180069281850e-01,2.060671558732835251e+00,5.638857621933665021e-01,-5.889767016147207102e-01,-3.205471535133578298e-01,6.465776532999750748e-01,8.075419715425640188e-01,1.122304883218833149e-02,-6.686469524090880023e-01,8.957278765908021079e-01,-1.125561698643005593e-01,2.385882726919101859e-01,2.451772249240461221e+00,-1.446011424062574324e-01,3.001436051174135033e-01,4.173469896005977953e-01,-6.507161541954184503e-02,1.007808626593394541e+00,-3.740523809820053835e-01,6.546904130447404047e-01,-8.833296283761340462e-01,-5.518768892435781392e-01,5.120623730904979576e-01,3.390176518627813218e-01,-2.914835287018447407e-01,1.637778332462031639e+00,8.482073079527289172e-01,-1.255942321973665843e+00,1.376314854050503522e-01,1.462146453297135995e+00,8.106255207369588156e-01,-4.963895517501866195e-01,1.802060410362098075e+00,-1.362265832008065503e-01,7.423177442237061108e-01,3.349528945164207405e-01,4.145749458578706914e-01,-4.935128150986828333e-01
1.188242305448187874e+00,1.769819426476612279e+00,-1.753070175597816194e-01,-4.888414993240388640e-01,-2.394698497154267303e-01,2.912105423318461228e-01,-1.880050535548576929e-01,5.068794099996901670e-01,2.051196552674371176e+00,6.024672228323371681e-02,-9.946135383759763249e-02,2.471518683344633149e-01,-4.801846359745249315e-01,2.104015291502057683e-01,-2.027392559509210435e-01,1.711967531770912210e+00,1.561798838058253702e-02,-2.639109081737014417e-01,-1.200820774261802393e-01,1.313425438805737866e-01,-8.111567892940877433e-01,3.978227610714813456e-01,-6.357141399536597737e-01,9.030176629035840952e-02,1.417320737976729861e+00,-5.682229279418265361e-02,-1.679189581348697058e-01,-5.511213080442334267e-01,-7.021434096883194531e-01,-8.005882966090304143e-01,4.725711383681591160e-01,2.253801901626661053e+00,-2.040392514106052491e-01,-1.901149163458915603e-01,-8.820047612763176614e-01,-6.146294127206454183e-01,2.070726136889877278e+00,6.564586193829728966e-01,1.039492271952561220e+00,6.514664467915591839e-01,1.000167757597154372e+00,3.294354460562118891e-01,2.401721370991222737e-01,5.264811695722217966e-01,4.682997700118565754e-01,8.440678598357375106e-01,2.980410220164408042e+00,5.205929855245285953e-01,2.998531729542385227e-01,9.209759885625156128e-01,4.385937909437893190e+00,1.636408891778322827e+00,1.021245449775058489e+00,-2.311482495792303027e-01,-1.410847629709821582e-02,9.816031374194553738e-01,-2.544879142453123633e-01,-4.637253147304719603e-01,-1.098866672949147194e+00,1.078303049751660359e+00,6.241951029465289680e-02,2.316253982728820326e-01,-5.308874276634689693e-02,2.393472801584230480e-01,9.066107356776744730e-01,1.736193063087443922e-01,-1.560663783309659824e-01,7.905800714640911497e-01,-2.199531661522081127e-01,-2.607429716687252874e-01,2.795699448670079690e+00,-4.786764395817426632e-01,-3.701769447398554624e-01,1.118409342171322873e-01,2.673435037774922751e-01,7.204683703722742916e-01,1.481308853384026292e-01,2.531233815539965515e-01,-1.076220547464465715e+00,-3.171622052396276814e-01,8.975884338077981806e-01,1.142104351185813382e-01,-3.433765220994520750e-01,1.219563266530451440e+00,6.265126284554316527e-01,-8.191522278045125782e-01,1.005600577536819307e-01,1.183970288923846592e+00,9.282579117165277172e-01,-1.148365744744516359e+00,2.026215161809053367e+00,-7.821536349616917683e-01,1.739312997760948054e+00,3.164765081862684903e-01,-7.173970836122545158e-01,-2.799315230218268891e-01
9.434510794494158636e-01,4.041090956957326119e-01,-3.545106004460591431e-01,3.472947725041231060e-01,-1.173555107479931914e-01,9.436237015081681001e-01,1.027329765039268983e+00,4.460379943706753447e-02,6.244509232868584725e-01,1.816447471491282051e-01,5.338961792376553106e-01,-3.508771558200809992e-01,-4.555328670257831059e-01,3.564728110330340760e-01,-5.665099369596826584e-02,1.511635794450484349e+00,-4.697027812338379071e-01,-1.001958669731100926e+00,4.652791041954018603e-01,2.408132833322075561e-01,-8.467945385030543060e-01,-1.874849978593662314e-04,-6.122375443497205527e-01,4.491673259530254425e-01,1.077723912693123065e+00,-5.691582201155537257e-01,-7.860778213935290526e-02,-6.680394539990677227e-01,-1.667827450217844731e-01,-3.101181520929106039e-01,9.320474621745362676e-01,2.261698175081914730e+00,4.498746228634429856e-01,-7.594190410370510458e-02,-7.192420640998541392e-01,-9.813857528098308691e-01,1.395793673101319632e+00,8.095096390712686052e-01,1.062586904535954169e+00,5.629389853400232901e-01,1.193428087265760551e+00,3.757615101624749432e-01,-2.280119919463248768e-01,6.219985050183374220e-01,4.334988202717611760e-01,9.291538294102472673e-01,2.187873410939540797e+00,2.891900557793566362e-01,7.142732846605039931e-01,2.521026593316312292e-01,4.998305014351674735e+00,1.719234354585680968e+00,7.311233333069289131e-01,-6.085866901945929941e-01,-2.255121397776522485e-01,9.509058867493268563e-01,-4.266859673691622001e-01,-4.827744625008842938e-01,-2.576103348840971252e-01,1.002859161260364118e+00,9.530372186138079682e-01,-1.101827387009235659e+00,-8.331896533094410584e-01,-4.110868159146437995e-01,4.456083965745172293e-02,-5.024348579488764344e-01,-5.364117276377510235e-01,1.212757464851600631e+00,-1.270094226755189792e+00,3.423327302959638385e-01,2.996773742977632438e+00,-1.185710289784044635e-01,2.550076442137172439e-02,1.348478039068196077e+00,3.086915984721351758e-01,1.456430356081908295e+00,-1.488282006756646014e-01,-9.772177860821340545e-02,-4.571501340988137763e-02,-1.195748554305414046e+00,2.267511526057631177e-01,-1.780993157481194911e-01,-2.742869279821598671e-01,1.256109010593549291e+00,1.302097949923308740e-02,-7.188419980255843500e-01,-3.278923016102974763e-02,1.708179094827075195e+00,1.104372658986555011e+00,-8.882625342095298304e-01,1.640777580477478903e+00,-3.576882396943962816e-01,1.307805175928947516e+00,6.415232132389678821e-01,-4.440002965964242043e-01,-5.269304375249714845e-01
8.502684390516749291e-01,3.472677352746160739e-01,-3.159166787593377101e-01,-3.137820773221500215e-02,-2.097393618671912208e-01,7.070215978999967454e-01,5.829728351420155885e-01,6.333584843683723320e-02,6.862135698717100052e-01,4.569308530428671800e-01,9.717756803101280649e-01,-4.478484205240196303e-02,-3.769750331009822375e-01,1.763757995542979962e-01,-3.194570902391324907e-01,1.940175784201212839e+00,-2.656656381977525183e-01,-5.094205164061149649e-01,3.018953911324850914e-01,1.686335452207866070e-01,-7.150095014965575091e-01,4.296960137330930740e-01,-4.184985078850873008e-01,3.302889564140751855e-01,1.294313565029038715e+00,-7.474479466428158858e-01,9.007270511194979956e-02,-6.460393642200832343e-01,-1.613875990476539846e-01,-5.328612790245916830e-01,6.345832521200622800e-01,2.351874883691802864e+00,1.085393845081896180e-01,-8.988476503454867483e-02,-5.877387392051147685e-01,-9.137028615662459163e-01,1.258788173985821102e+00,1.040093722450982749e+00,1.590375450179959849e+00,1.284530934631210597e+00,9.962541732437485420e-01,2.493169097282097180e-01,-3.486084215816843968e-02,3.487382356742297351e-01,2.041393787145859839e-01,7.420203290659421747e-01,2.418841606698345359e+00,-4.567927902264400097e-02,3.855178819467129370e-01,5.649231957990102915e-01,4.591548938802286983e+00,1.659837105052929918e+00,6.938700940200311917e-01,-6.597080320876089754e-01,-6.476269880186975580e-01,1.445541911741964558e+00,4.144321799855470445e-01,-2.422996530053191100e-01,-4.537606768540952129e-01,1.739116216322106334e+00,9.850489816183580771e-01,-8.147285676254099052e-01,-6.483779609983886250e-01,3.771292667266661347e-01,2.693700555132118035e-01,-4.828817082009613237e-01,-6.375554027020651215e-01,9.565861048282837675e-01,-5.554715719185586709e-01,1.465682817025792395e-01,2.931666800436962816e+00,-1.224745822511955073e-01,2.588163366703519208e-01,9.724402402974045012e-01,8.249077880979657773e-03,1.414214115659126580e+00,-1.497953511170967145e-01,6.494198526317311870e-01,-3.291167742561089682e-01,-7.957341377861497644e-01,3.778084291512524007e-01,3.029564766163650447e-01,-1.778611681132248323e-01,1.273548876896182014e+00,6.224841750959091424e-01,-9.822199067471406586e-01,1.239003743056410478e-02,1.807032465288766154e+00,8.114766167791789275e-01,-5.249319906394119828e-01,1.914477303444921175e+00,-1.635845550605713461e-01,9.207154469632430338e-01,3.771097916977228515e-01,5.049418244483754314e-01,-4.410055878384717687e-01
6.819312184509788155e-01,3.971855654922629153e-02,1.044537924428905334e-01,-5.137158097261005363e-01,-3.920958453378259878e-01,4.219530169986958068e-01,-1.174297604130171147e-01,2.818642477510012456e-02,1.471124993407955772e+00,9.072718249494533538e-01,9.902686333135770624e-01,2.454059132251863451e-01,-4.310380842394487266e-01,-3.924181628169100544e-01,-4.000457666804135837e-01,2.069622678377012193e+00,-5.448385744011006171e-01,5.138512936724450864e-01,9.239611964252758547e-02,3.189179234027975096e-01,-9.193253225707114229e-01,9.572437031182398082e-01,-4.465947741423426098e-02,9.942318991561001351e-02,1.543787448222100567e+00,-9.350934331581464143e-01,3.693085123426528282e-01,-7.192026798124898646e-01,-4.617296979071837670e-01,-7.547246583625222272e-01,2.812657761869081230e-01,2.936398917331884739e+00,-4.258807425450443773e-01,-1.743448680319854005e-01,-3.426928695613363218e-01,-5.736551313240715322e-01,1.155443991575224150e+00,1.389204643709407883e+00,2.088044659836161721e+00,2.500280098051493205e+00,8.711301912546933757e-01,3.765188200696464316e-01,4.004505835266904401e-01,-1.716288574499827968e-01,2.829716784621782999e-01,4.506445669625016026e-01,2.930504788983161912e+00,-4.819187805739173491e-01,-1.475720161221752424e-02,7.976609063119167731e-01,3.821975853969676873e+00,1.684692383741776434e+00,6.073265871534458960e-01,-5.625162356010733333e-01,-1.310554589203670517e+00,2.149277699469843927e+00,1.410256510624134929e+00,-1.575426730723678004e-01,-4.059679733858603257e-01,2.739855392227148023e+00,1.113441998985936321e+00,-3.493074477441169279e-01,-4.609322913154840773e-01,1.547909259427225237e+00,9.023845958564342684e-01,-3.574140399985770156e-02,-5.009962185071870078e-01,1.272721359137174435e+00,4.588729699201518630e-01,-5.833840316854284058e-01,2.714257743886929752e+00,-2.533065583877979754e-01,6.890197480289904641e-01,2.102575736778662108e-01,-2.726551842892994681e-01,1.192057942302090723e+00,3.763127423481760214e-02,1.268776761340388859e+00,-9.822763309020601241e-01,-1.391073487480182225e-01,1.728890588116678284e-01,8.024848129717940814e-01,-1.953439475603317432e-01,1.541308314036827332e+00,1.149917226321216734e+00,-1.325604738035616625e+00,3.966057030579095422e-02,2.359091728343223338e+00,5.485034283593508420e-01,-2.314866384846432645e-01,2.436612913940037206e+00,1.315986058569628137e-01,6.338382311095307475e-01,2.431175601246769458e-01,1.177208177966509339e+00,-2.893347414078046853e-01
1.121644140590686956e+00,1.525716992224831259e+00,-4.424894899673330606e-01,-3.452011336804451380e-01,-1.494506835114063903e-01,3.603379616552332410e-01,8.983708552323366181e-02,3.944462052137655550e-01,1.119887320946064246e+00,1.164924094575050528e-01,6.103938859138653417e-01,2.339467896491918553e-01,-3.436859259758788254e-01,4.578272157354497662e-01,-3.867065076493967357e-01,2.079897379349806563e+00,3.038802058930062944e-01,-5.863721094946228174e-01,2.618417790558693475e-02,-8.712654688787214996e-03,-5.418009448843383868e-01,3.775100225765788964e-01,-6.593040101531688624e-01,2.339967800463898517e-01,1.368228017986547362e+00,-3.144488247525490943e-01,-1.018971730602492853e-01,-5.019987094695208540e-01,-2.348248830832897482e-01,-7.072851165074396373e-01,4.975765669767615029e-01,1.937410825135497117e+00,-4.965474684937948302e-02,-1.625049562756256116e-01,-8.343089275497292956e-01,-8.926464678554966170e-01,1.714941499226141808e+00,7.806146693749465015e-01,1.284459002550147222e+00,6.610594050015491385e-01,8.936347942389556431e-01,8.581760303463376038e-02,2.614634181954016146e-02,5.949325436432677527e-01,1.347999339656441031e-01,8.580882474419188055e-01,2.683856840294892798e+00,3.192984468615957527e-01,2.909070205810985743e-01,1.032051783349936303e+00,4.562002983317279714e+00,1.474627129606307596e+00,9.159808780922317206e-01,-4.914429049782938486e-01,-1.369168950618552261e-01,1.067427000857453567e+00,9.853465505725800266e-03,-2.182027765104646300e-01,-1.078587439442766360e+00,1.129435912828365751e+00,3.721294616163794977e-01,-1.308454224597702942e-01,-2.092228181351339644e-01,2.229510119451009742e-01,4.466200251554151013e-01,-3.513523842155483745e-01,-4.822542846681244777e-01,3.929728710957928195e-01,-3.874333114796021937e-01,1.784448759137893248e-01,2.940691822610947526e+00,-3.231319698054962997e-01,-2.604069047370728973e-01,6.239134572719320371e-01,7.976880486986619168e-02,1.127376396908196021e+00,-1.995692660460268719e-02,6.378000247938495626e-01,-5.846625655206054706e-01,-5.474367182665799136e-01,9.608756990171900547e-01,2.296592635922694581e-01,-1.535603336716679646e-01,1.025077718157551221e+00,7.828463489221292315e-01,-8.132376905587015425e-01,1.164502163068370788e-01,1.114597493082701396e+00,7.720878289096739788e-01,-7.322328468092593745e-01,1.863871139896315920e+00,-6.677741979281079931e-01,1.337086281135939636e+00,1.827898392841175446e-01,1.171818216278103369e-01,-3.036853824611798203e-01
9.527968074662627185e-01,1.109778903400867378e+00,2.849816459553157211e-01,-2.567142657036768361e-01,8.773069587605804298e-02,1.840051933434315168e-01,3.517846519165651609e-02,-3.267282213836997240e-02,1.367580152835913054e+00,1.886764656488757463e-01,-8.294052644353860915e-02,-5.026410875012526924e-02,-5.666789591826262296e-01,1.421752295990184600e-01,1.374989338165919506e-01,1.279291229313127776e+00,-6.364614588459828193e-01,-5.131151719973121861e-02,1.965717358726445929e-01,3.931971845084095696e-01,-1.125686071631060825e+00,-1.151083522878930676e-01,-5.585874275659948873e-01,3.001042564698662707e-01,1.195354095535054562e+00,-1.977851019201230243e-01,2.262640664477529873e-01,-6.369985392508400457e-01,-3.476877270078004845e-01,-3.928005901877682504e-01,5.319356154607973730e-01,2.467254321573600695e+00,-1.402836175769480720e-01,-3.867547389439491279e-01,-6.641313709759955053e-01,-6.141089219275843725e-01,1.379764817073069416e+00,1.073177424390000301e+00,9.256159039132063615e-01,9.688817641907305767e-01,8.560523282760423847e-01,4.448924274986001404e-01,1.054965926237943219e-01,3.042598593046815236e-01,7.691949726593989567e-01,9.241780823335775663e-01,2.800625664124188674e+00,6.639295685730021990e-02,2.412023700366671131e-01,1.179969064131384027e+00,3.823725140487067353e+00,1.155586998459247283e+00,4.155040243988872284e-01,-3.730774249999971315e-01,-3.332395915065964331e-01,1.114379656323857937e+00,-1.989322417553101019e-01,-3.241569488429338897e-01,-3.408323252796521818e-01,4.406915477834076889e-01,9.838965950284112028e-01,-1.087371020728734594e-01,-3.265984818734447570e-01,5.887597096885325287e-01,7.964746076170478029e-01,1.234132716273588226e-01,-2.361064968067504433e-01,1.265844163122898935e+00,-3.870219195024071634e-01,-1.996369798671528972e-01,2.545199374570050743e+00,-6.709662576779519272e-01,2.346984348909651741e-02,6.819692545702474851e-01,-1.400902924835521757e-02,1.366575232285176300e+00,3.118702386689708450e-01,1.418512893123655694e-01,-5.682080147401100678e-01,-4.297666664161985950e-01,3.642663914398602820e-03,-2.600592068328110296e-01,-1.272867163192523132e-01,1.321835765111252448e+00,1.995247156101160879e-01,-5.750785643473206310e-01,2.844141520666812473e-01,1.685609635799860673e+00,7.365243290809064813e-01,-1.986708727154942455e-01,1.719326162975400418e+00,-8.308208177147737850e-01,1.380229029661465656e+00,4.795361213980103288e-01,-1.980408774299965979e-01,-1.046927435609662504e-02
9.722723049951690344e-01,9.622613563962865157e-01,-5.560213968126254125e-02,-5.478107908618807809e-01,-4.544483066225530887e-01,4.856014522295442615e-01,-7.623536261687624549e-02,3.798889026691297244e-01,2.191145602703604922e+00,4.129467372639767930e-01,1.116093967378327667e-01,2.171220294057937539e-01,-5.033280388513180492e-01,-2.244035929760965220e-01,-3.066018863128084360e-01,1.701476812706115282e+00,-3.592969249817830613e-01,1.099618259115390795e-01,-1.178613456967719797e-01,2.204917437554939352e-01,-9.069153836804186852e-01,7.894423070754943428e-01,-3.521117863308491636e-01,-5.937289578341609086e-04,1.578886257962451189e+00,-3.093372635368762391e-01,-4.817217017390079681e-02,-6.734640597013425989e-01,-1.037363854692199716e+00,-9.743243237333735207e-01,4.081716006438711464e-01,2.748812808415162401e+00,-3.166114791836757147e-01,-3.692858208741947590e-02,-6.883511303715806884e-01,-4.652946047600301505e-01,1.960054221480443726e+00,8.023493422639124129e-01,1.560491284574410553e+00,1.416258893254455531e+00,1.044114429661258114e+00,5.046859018674737518e-01,3.807383897201051526e-01,1.766005594018030811e-01,4.958083730179300708e-01,6.352657040045535108e-01,2.973348317529657781e+00,2.480633601440600522e-01,2.402697216659632207e-01,4.785554866646452576e-01,4.270414900725571172e+00,2.033254139193245713e+00,9.707154140375844342e-01,-2.380597046834679320e-01,-5.094982478577937401e-01,1.492576961013103443e+00,3.722427646998053286e-01,-4.957082374462318253e-01,-8.670825106037454155e-01,2.148056832512696523e+00,1.630339415870507291e-01,-5.876348710372847339e-03,-1.730626096349630605e-01,6.447139670197411521e-01,1.137876414750646603e+00,3.616976205108184406e-01,-2.115057276882854054e-01,1.179341361690022794e+00,1.053503102393985313e-01,-5.046802137629279317e-01,2.678228413820291642e+00,-3.001721265194631783e-01,4.593163531880159467e-02,-1.765737505445927058e-01,2.142804624479861531e-01,5.502914142858122970e-01,-1.225526799467929751e-02,4.558509291497367388e-01,-1.388122002515208120e+00,-2.245367727854939155e-01,6.982078246045395620e-01,4.419878316508494831e-01,-4.788291547985988883e-01,1.566925427383447866e+00,8.380193271427259782e-01,-1.206303356831205154e+00,-5.548733964026830723e-03,1.644269096265780439e+00,9.582285990750867288e-01,-1.226953111664045970e+00,2.292261314854735055e+00,-2.716698326734985902e-01,1.411738325588844933e+00,3.776320002788444707e-01,-4.502865289395897030e-01,-4.525828640515869861e-01
1.268902495726553337e+00,2.259430168393180338e+00,-7.910880656676322342e-02,-1.041636976630416989e+00,-4.434048138956853680e-01,-1.081929591973027627e-01,-1.190985449336187330e+00,8.313909168315215537e-01,3.020240939875645125e+00,3.157907521273078943e-01,-4.832623698200477769e-04,7.694978582138355394e-01,-4.458257753954192326e-01,-1.786804898651646323e-02,-4.185845393326530495e-01,2.262461937828091685e+00,3.947991489428097078e-01,4.721639826544526963e-01,-4.575701188724610180e-01,9.768497619229715712e-02,-7.720505860382470553e-01,9.903314624066985594e-01,-4.324970594475342489e-01,-1.714202474707035295e-01,1.635868279591978558e+00,-1.902348589490252262e-01,-1.047867577823938523e-01,-4.823046905820119745e-01,-7.105983675638060104e-01,-1.020281025101001049e+00,1.041900004389602341e-01,2.370012323910362984e+00,-7.240888617181933107e-01,-3.589152394385752842e-01,-8.159208507382539333e-01,-4.319794512135187725e-01,2.232799091140837522e+00,8.291734152275285208e-01,1.295355802784895483e+00,1.425509045162380195e+00,9.048592299501337921e-01,1.973948918545368469e-01,6.791075991052373251e-01,3.377268816636057047e-01,2.698787125388659169e-01,6.039012117987605510e-01,3.650052693470339449e+00,3.628180799298044157e-01,-9.278359801895176562e-02,1.491302857123121495e+00,3.929386580785873218e+00,1.491847648335435483e+00,1.275648454148601285e+00,-1.451968241558465600e-01,-3.413778461566304157e-01,1.386490602006382300e+00,5.255101777054873580e-01,-3.537220563393758122e-01,-1.558383388691355398e+00,1.781092567618572930e+00,-1.229922189028353763e-01,1.019119021224388577e+00,2.890537392140470896e-01,1.167358365015314092e+00,1.325116346134467271e+00,3.519812080222619044e-01,1.722758690198133991e-02,5.587782717589835357e-01,7.448369053592461819e-01,-9.320484484045290507e-01,2.896627212574498511e+00,-6.366609814136938716e-01,-3.212725560734102648e-01,-6.393106550658955722e-01,5.877957162916287726e-02,4.597350611929731934e-01,4.368068165950892978e-01,1.046026719388172488e+00,-1.645483543727898512e+00,3.771565998487437232e-01,1.223892213706755605e+00,7.080916665861034520e-01,-2.885909582195387291e-01,1.095532850531819147e+00,1.335572378871079158e+00,-1.010004434724539379e+00,9.739709322315168172e-02,1.346466336013122156e+00,6.241136271294756011e-01,-1.083623880635016468e+00,2.622284263090812750e+00,-7.502714134161857507e-01,1.739950029979802526e+00,-9.479051097179114205e-03,-7.439247426711059763e-02,-8.329202052042206095e-02
9.845594167651821049e-01,1.621002765264187850e+00,3.076845669670588701e-02,-9.840346876904456641e-01,-2.672010254249592709e-01,9.216907484722147714e-02,-2.288946475677853809e-01,2.988535859381921678e-01,1.959223420415152628e+00,1.395310248636959238e-01,-1.642734554116151435e-01,3.499489808858314288e-01,-4.771112490767521197e-01,-1.309402056255372648e-01,-4.105881381657601747e-01,1.507664773020002569e+00,-1.828488916517649054e-01,2.238439288603227828e-01,-3.591213708249286207e-01,5.099998907271442034e-02,-7.418360519905947692e-01,6.341370765607781124e-01,-5.291763392952155698e-01,-4.961060013250281897e-02,1.819113926469401177e+00,2.933270013855616143e-01,-6.076067537118229334e-03,-6.161819187003096943e-01,-1.500419876874764968e+00,-1.372210200809324654e+00,1.560196825239985319e-01,2.554574356464699214e+00,-5.545494205824332834e-01,7.923253140331223965e-02,-8.235691576366385158e-01,-3.332931778735573891e-01,2.169064056324893297e+00,6.562191182082665053e-01,1.721464908991406695e+00,9.951603581464643078e-01,6.837021066250171808e-01,4.755114747402385267e-01,3.247801147290040324e-01,7.582779939794362378e-02,5.769208810641247576e-01,7.654937717262926267e-01,2.934500045631712961e+00,3.219916517543894852e-01,2.554103757330050684e-02,7.573608406119143321e-01,3.807829047570560732e+00,1.985876025361521524e+00,7.197434842070433714e-01,-6.659207864075011862e-02,-2.052823672734318539e-01,1.404195128396208192e+00,2.285707684843827081e-01,-2.949785416246316072e-01,-1.233888777572835993e+00,1.715699463220020426e+00,-3.822371531358633723e-01,4.666826788826197170e-01,3.424459317091225197e-01,7.538475729065161612e-01,1.589288101758498328e+00,7.604149722959320234e-01,-2.613764990694412704e-01,6.972073478077522868e-01,4.563886053179443958e-01,-1.451679868739912393e-01,2.171071416352725603e+00,-4.700141819525269771e-01,-2.015812008335746142e-01,-5.976420716719221815e-01,9.226402257888947911e-02,2.504286919093509090e-01,-1.742918958459515610e-01,4.340100944069722466e-01,-1.780021789662075138e+00,2.598001789898823910e-02,1.037986468290201136e+00,2.712774430255764369e-01,-4.610289837953161496e-01,1.710404283475633891e+00,1.029499631429790396e+00,-1.245670632514708887e+00,2.599243722013492297e-01,8.306715253799102916e-01,8.647049341274172241e-01,-9.865487822305458732e-01,1.925020777724409493e+00,-6.389108268428953519e-01,1.351559656227324213e+00,2.240071031092274456e-01,-5.419431088011312792e-01,-3.518635386771741813e-01
8.079057461245403582e-01,8.479553205793153303e-01,-1.458002906515153962e-01,-5.256179492316610524e-01,-2.484807523491307235e-02,2.075861617488456989e-01,1.928592665318141774e-01,-5.390531316073120249e-02,4.557252457365247311e-01,3.781420745936847072e-01,9.586560319979766653e-01,1.896316954098213048e-01,-3.307516259873659603e-01,2.000640254631361747e-01,-4.510040380834598461e-01,1.963932489003996196e+00,-7.730743496593700526e-02,-1.397035337343744965e-01,8.338819922638926463e-02,4.669083502129524332e-02,-5.768171624357484317e-01,3.959213897071057753e-01,-4.699008786084121203e-01,2.751637714074498531e-01,1.519031716374697361e+00,-3.888426107907344553e-01,2.743246319692443369e-01,-5.837614232266122860e-01,-3.619608971590890789e-01,-8.338049568434475756e-01,2.950176398324909077e-01,2.220897340100483230e+00,-2.457678464559122089e-01,-9.676643976623017229e-02,-6.039308688270781378e-01,-7.941582093068030312e-01,1.227914443239913611e+00,1.126157107101299459e+00,1.872092611991342137e+00,1.329190099936959690e+00,5.861835738642678928e-01,1.476691275627162181e-01,2.585611318376604406e-03,1.380476534142419109e-01,1.944154807790726136e-01,7.799134443270044903e-01,2.524440349687282481e+00,-2.202556703592928877e-01,2.924035334388959406e-02,1.110536347329587281e+00,3.908779124351661860e+00,1.406151975796492870e+00,3.896156824505508376e-01,-5.810701493868823952e-01,-6.407554330518703267e-01,1.596329846599899405e+00,6.901680302222650276e-01,6.975863976369728325e-02,-7.362387977969517827e-01,1.512309002297366645e+00,7.670909580543749939e-01,-2.885205186665898980e-01,-1.864503748217881673e-01,9.300293160869381737e-01,6.828584521874756508e-01,-2.093164265362854604e-01,-7.164362033467286395e-01,4.893345309784319919e-01,4.371797348659710314e-02,3.133995506253585139e-01,2.501697403533794883e+00,-3.374804421281067945e-01,2.069772208613925302e-01,5.887626634956650840e-01,-2.997389157464213083e-01,1.322254189375682731e+00,-1.794366767982771005e-01,1.009661002292495890e+00,-6.391770755104837498e-01,-3.951395591865506374e-01,5.709448700866953663e-01,3.250649863146851670e-01,-4.070887476287515794e-02,1.336514170176655192e+00,9.937987187635737296e-01,-1.034225037146190296e+00,2.890774570599951576e-01,1.298118345894561765e+00,5.244434889658460275e-01,5.867123689508907391e-02,1.715967825513861067e+00,-4.381922842384392558e-01,6.663691196138172845e-01,1.300405017444460631e-01,1.026581257673290004e+00,-2.172309239782434509e-01
7.828044963575488957e-01,9.201260156368804566e-01,3.144736978727616372e-01,-5.323968631790748640e-01,1.106406071725909851e-01,1.170742643709191677e-01,2.449164965941371119e-01,-2.430264580963969190e-01,8.994495304438016037e-01,1.943039782133663684e-01,3.543665476042789919e-02,-4.180315241228621526e-02,-5.236465097113791600e-01,2.489699617510762741e-03,-6.745857789326398235e-02,1.150890429574412899e+00,-7.153773186923362282e-01,8.127551192240622946e-02,7.967887002987691925e-02,2.682193387033703358e-01,-9.693732075314542840e-01,-1.366819274464092793e-02,-5.360298370563247872e-01,2.622066806410917050e-01,1.479113816550573723e+00,6.280960212007617727e-02,3.257707814891121489e-01,-6.761985312672984527e-01,-8.789782727731895173e-01,-8.173845171287189570e-01,3.484388669853199505e-01,2.560409709841759085e+00,-2.845627838356203365e-01,-1.180815625018458437e-01,-6.427821186983396773e-01,-5.047679846372578050e-01,1.392714023016343283e+00,1.033502151532019298e+00,1.488169647542371576e+00,1.044467136365852422e+00,5.966319983430732332e-01,5.020596966510373349e-01,3.655811559949959100e-02,2.694311115641780108e-02,7.737486202857724038e-01,9.118535176787495589e-01,2.569228997519124036e+00,-7.150121583683363702e-02,9.690472811852299251e-02,9.686851592532692568e-01,3.541950475416574040e+00,1.444733093265949675e+00,1.465028788429096063e-01,-3.164410633921544425e-01,-4.125932329753997374e-01,1.372241842809787338e+00,8.947693151696395342e-02,-1.485953442127326274e-01,-4.336765279727813338e-01,8.482949876118226484e-01,6.612321240169831693e-01,-1.282209576117174787e-01,-8.441027600063229219e-02,7.804349946208537503e-01,1.142469964869749166e+00,4.149750412163729640e-01,-4.372570755764494388e-01,1.063102209823434841e+00,-6.557414673959385820e-02,1.504447774909266622e-01,2.085465913987436082e+00,-5.818445239824729942e-01,1.302850583685308261e-01,3.547135916836153813e-01,-1.439124893077728118e-01,1.100504718223350054e+00,-5.910251425352347487e-02,2.491319259873406300e-01,-9.244778286729340433e-01,-3.406291384449563475e-01,1.596678947349620126e-01,-1.939850338440319288e-01,-1.920772036177159081e-01,1.665395791123405633e+00,4.653535172699913014e-01,-8.881549044149846805e-01,4.082632491332329749e-01,1.284494317654521822e+00,7.128665115567867083e-01,-3.907799834178976583e-02,1.493309726358505785e+00,-7.066158945104739075e-01,9.961749499718535183e-01,4.111231795881364892e-01,3.433127221983356403e-03,-1.279575901204682009e-01
1.130361221005535155e+00,1.555021695999418752e+00,-3.433330903180637494e-01,-5.676644778317980755e-01,-4.084215408688308124e-01,4.848459560366731869e-01,5.899455658440372341e-02,5.450519475286299542e-01,2.009733049560581186e+00,9.139345558463676800e-02,1.096799885794119689e-02,2.465558991158994795e-01,-4.433101094259336294e-01,8.205388557542384054e-02,-4.082225615194605139e-01,1.738612137629992116e+00,4.253990291648795941e-02,-3.393909245418328391e-01,-2.099465346846931535e-01,2.061970649003814701e-02,-6.686836002122131806e-01,6.686826045624018056e-01,-5.953905200322112679e-01,1.616838479436014109e-02,1.612671900171963379e+00,6.104544963382432798e-03,-2.696743824317034965e-01,-5.893135250720109575e-01,-1.134576906222349413e+00,-1.121636086451309078e+00,4.487225928128452113e-01,2.353244105596702163e+00,-1.991479139220922456e-01,7.561902870511537367e-02,-9.047684544300096388e-01,-5.706379876945455454e-01,2.278283562471285606e+00,4.896087291618382298e-01,1.417001921459424496e+00,6.694928174355927464e-01,1.017412229634823362e+00,3.904181636925192489e-01,2.274261474469370103e-01,4.410590774121299074e-01,3.881272793102213403e-01,7.777679810222120071e-01,2.824170796601761957e+00,5.929887763279180213e-01,3.446558027468517582e-01,4.453650191463218166e-01,4.599667312791764218e+00,2.115174806240802230e+00,1.115744524230567913e+00,-1.825957013991914568e-01,-2.921629982295109729e-02,1.118616539996559744e+00,-1.086950777879113761e-01,-4.995989748796110241e-01,-1.253936979981747690e+00,1.742523934146374520e+00,-3.385096842249972759e-01,8.924440234638630898e-02,9.026075540564580668e-03,1.017210207903999075e-01,1.045021094819792884e+00,3.048232326377625645e-01,-2.538881592494423023e-01,7.214263602013009091e-01,-1.422782950377736166e-01,-1.127345502493183327e-01,2.695298753535179337e+00,-2.589646244704706390e-01,-3.475467409677879815e-01,-1.627933507389177914e-01,3.675476760069427695e-01,3.662215711437157850e-01,-1.687760118030860179e-01,2.463216207000118452e-01,-1.384125546390171158e+00,-3.674185224752770096e-01,1.174947589310523011e+00,2.933630725912970139e-01,-5.159556351861218637e-01,1.442154495310921769e+00,8.187477898895364481e-01,-1.129781446137543055e+00,1.964775963212972432e-02,9.913379761346075014e-01,1.078355957415794375e+00,-1.537062530668518168e+00,2.054155347770810991e+00,-5.248230558982911464e-01,1.632531743331701257e+00,3.198925137534437968e-01,-8.916137654501996579e-01,-5.439125933392617851e-01
1.009891760697228413e+00,9.177977303383825225e-01,-7.699034451071268270e-01,-1.198458905648236428e-02,-1.564843080417381294e-01,7.367342025424596930e-01,7.888396729233060345e-01,2.443841597862914661e-01,1.783877545598434589e-01,1.528302865067060479e-01,1.195620101726390772e+00,2.132656046015377060e-02,-2.457817901771976454e-01,6.071515547753594255e-01,-5.360601033991345687e-01,2.208787707295640335e+00,3.484361053763668781e-01,-1.115564125741035362e+00,2.425675264540841924e-01,-1.182174077823099079e-01,-3.257260781419762941e-01,3.563029555051867581e-01,-6.779628731554298016e-01,3.890625990190313965e-01,1.320624735577740516e+00,-5.485426767675103399e-01,-1.402174993467208142e-01,-5.263792655273041854e-01,-5.258379581901451161e-02,-6.644284088367656826e-01,6.775575456427883614e-01,1.784165929848986476e+00,2.828771524615543709e-01,3.778669107141313654e-02,-8.032002782628318016e-01,-1.148328213860421831e+00,1.481329499662226823e+00,7.511513480396746489e-01,1.553346682925344835e+00,5.240571220387937323e-01,9.390672683494971640e-01,3.426413066777822536e-03,-2.615281184363949518e-01,6.735823509879254045e-01,-9.250820775881984925e-02,8.794244768846014582e-01,2.176157204070995999e+00,2.510849580598750741e-01,4.853798920419298835e-01,5.882606188065114816e-01,5.052309635346615480e+00,1.692473643165765429e+00,8.633418416879372614e-01,-7.113303412633773526e-01,-1.959754836923905397e-01,1.096240319133748198e+00,5.675330386253751858e-02,-1.475728326323776929e-01,-9.142267269589042789e-01,1.410617038311687388e+00,5.465377929029775483e-01,-8.300752352210007956e-01,-5.104505431328518750e-01,-1.900033389558996033e-01,-2.921617079558980201e-02,-7.858418884942304228e-01,-8.113903518128077197e-01,2.658228509255712302e-01,-8.520490459093416069e-01,7.079756117971593987e-01,3.059340265110507495e+00,-9.433700083427698502e-04,-1.271351007341788852e-01,1.163860875034107289e+00,9.946261641530142195e-02,1.362755520060534131e+00,-3.765306802815384657e-01,6.459133718705923899e-01,-1.446891835679267047e-01,-1.019004529312892204e+00,9.731228845441020070e-01,2.538831755054428152e-01,-1.414871153059816256e-01,1.029613765821367322e+00,7.244459893179324705e-01,-9.159298250019185517e-01,2.480395182466715864e-02,1.088713170348863724e+00,8.684499313048008595e-01,-7.324490510256460585e-01,1.651504623932626981e+00,-3.682888766922244317e-01,1.004947480128902892e+00,2.343537156122373344e-01,4.118135306632657588e-01,-5.565747304857464606e-01
8.748731241440558248e-01,6.883735670198050105e-01,-1.965008421596601829e-01,-2.700396872282664895e-01,-1.347920398191099212e-01,4.165643303824012600e-01,2.109020048756869437e-01,7.768922386596449625e-02,8.088495260134171971e-01,4.497865305543423675e-01,9.227271177029496840e-01,1.214359576565121890e-01,-3.691646330127441034e-01,1.865593602689309405e-01,-3.367592802456164103e-01,2.020091920233652250e+00,-1.427756332041758558e-01,-2.486857928460733391e-01,1.906953442070385696e-01,1.519523108548010704e-01,-7.043511527515126103e-01,4.344695558455360929e-01,-4.220452341384918205e-01,2.855708673897143224e-01,1.351549583857054593e+00,-6.475994221053363864e-01,1.801935027000600154e-01,-6.013963664068324722e-01,-1.243782909235592316e-01,-5.851022408798951524e-01,4.684442360072953448e-01,2.294900614211822010e+00,-9.762449867197939279e-02,-1.938104344963718639e-01,-5.856053807984630266e-01,-8.506778564369801288e-01,1.240300577652084124e+00,1.129125997131217085e+00,1.602611131195201155e+00,1.393417700028772410e+00,8.422619895829266401e-01,1.802760736169484179e-01,5.581396370007676855e-02,2.800993766303214727e-01,1.988920129105227752e-01,7.389213704695973828e-01,2.615083814419939312e+00,-1.302170451205444668e-01,1.935995066597060998e-01,9.730378768191576544e-01,4.233971763928861876e+00,1.421962709710508532e+00,6.172400175503223174e-01,-6.220312271248351621e-01,-6.723706008316331362e-01,1.505544687931488657e+00,5.651086991209866017e-01,-1.190858218495488979e-01,-5.944582599120049604e-01,1.570700041579279560e+00,9.677505920218336666e-01,-4.517174550906977171e-01,-4.438464386764742198e-01,7.339510369146790003e-01,4.485954331475630052e-01,-3.841226212802950624e-01,-5.966226061363300026e-01,7.796792923102371375e-01,-2.227748021244058130e-01,4.705407904608505110e-02,2.830493871165728148e+00,-2.875684840108809759e-01,2.240730152868604663e-01,7.824133563343269593e-01,-1.449024138785225124e-01,1.421471392223099484e+00,-1.994885732818457713e-02,8.806766261986742617e-01,-4.545482010042420917e-01,-5.304302738738626566e-01,4.318472467083894761e-01,3.471431573137187532e-01,-8.149175581039824756e-02,1.211428948083509205e+00,8.013074227829413143e-01,-9.384076853582151712e-01,1.274292224749355995e-01,1.698344604999995289e+00,6.325458031056931940e-01,-2.349216396450272692e-01,1.936126754759707858e+00,-3.377270668647837648e-01,8.902964496547373097e-01,2.426195324684880528e-01,7.883385828800490991e-01,-2.603876473151469639e-01
8.430806404492861006e-01,1.117192048326979714e+00,-7.277580763046662127e-02,-3.768054483361112372e-01,2.561122665790239172e-01,1.384005802351521708e-01,5.018057252302104976e-01,-2.365985901474527420e-01,-2.394686004590984574e-02,4.959935507173715563e-02,6.079944395098928478e-01,-3.030933378897442132e-02,-3.707607096509411004e-01,4.559707105751345524e-01,-2.414461085915438066e-01,1.529942927211504378e+00,-1.980439729204556132e-01,-4.758024987774937542e-01,1.867382458531755551e-01,5.104723758014284574e-02,-6.173748078996122990e-01,-1.664977471675765930e-01,-7.126717041855166190e-01,4.233875634550466893e-01,1.389576287663275345e+00,-2.607038040117284211e-02,2.700867320816480177e-01,-5.669104922717682626e-01,-3.594258353478220203e-01,-7.151537203278623966e-01,4.116750836620184373e-01,1.997412754160214687e+00,-6.523270803120820305e-02,-1.078162974407649299e-01,-7.239375241497533198e-01,-8.452855262183571750e-01,1.204830417659944253e+00,1.004711404434231570e+00,1.505180021912990496e+00,6.042840583830233481e-01,4.964556989648460372e-01,1.848020369512923533e-01,-2.423770246316864219e-01,2.892444477806862535e-01,4.110912290363280541e-01,1.023430196161318806e+00,2.263535389207550264e+00,-6.008262627183064142e-02,1.478305934587935966e-01,1.183780282121878358e+00,3.874149637222696008e+00,1.209864250129986329e+00,1.387730169443254780e-01,-5.416513888890065465e-01,-2.334669749429772179e-01,1.181664555571428021e+00,2.484730673388946265e-03,7.472291190564467334e-02,-6.109983425165406157e-01,4.799651997526963587e-01,7.636132118124816515e-01,-3.675448717413292155e-01,-1.504472165946669771e-01,4.658474280128296341e-01,6.015358418299806553e-01,-1.623878107293093009e-01,-7.284528327970323236e-01,4.435227073435455414e-01,-4.024954375133449891e-01,7.281958707182680790e-01,2.292633284837074736e+00,-4.695120644847627367e-01,-1.636763877991570526e-02,9.216517714576513143e-01,-2.423875573042449383e-01,1.469001689280905243e+00,-2.063700138552712338e-01,4.871751669856056455e-01,-3.705405710866571667e-01,-6.296040493237731184e-01,4.352684719674319580e-01,-2.127915597573926676e-01,8.256364575258245964e-03,1.328758407704709432e+00,5.451328077111385895e-01,-7.442843643591103842e-01,4.463984324944963999e-01,9.043530804102677401e-01,6.029628517310239300e-01,2.398535542456537439e-01,1.217473919090541923e+00,-8.187091619807169707e-01,8.064140601016820398e-01,2.515176255128633853e-01,5.521728067051667743e-01,-1.340758899914875069e-01
7.976220896775479963e-01,1.602086143795580231e-01,-1.033957641641664316e-01,-1.504612219955979713e-01,-3.348081935519537367e-01,6.993256232030848896e-01,3.843853381267038349e-01,7.442389985642303141e-02,1.252016685969505216e+00,6.106946887226184506e-01,7.424065371937065283e-01,-1.088928733382746317e-02,-4.524905612251892140e-01,-1.289849434251888471e-01,-2.643444913534148677e-01,1.812510588035778358e+00,-5.415670787128629149e-01,-1.206588277264179221e-01,2.284189561306696481e-01,2.906276053628602529e-01,-9.029481354393504855e-01,6.175911055877419953e-01,-2.675125730642762822e-01,2.173481493311508472e-01,1.370791398064904021e+00,-7.747557835218226163e-01,1.397509867833573449e-01,-7.118170726308099550e-01,-4.414735875968046619e-01,-6.105361069424919407e-01,5.695637763094824058e-01,2.712388566492833775e+00,-5.388970147697269564e-02,-9.528157550024479727e-02,-5.094647828736339479e-01,-7.153643455187023159e-01,1.339429018001675020e+00,1.097899985262563938e+00,1.671296162339162006e+00,1.694112322838476459e+00,1.054643393624903336e+00,4.163879329174444699e-01,1.632700769514245920e-01,1.581945961358358077e-01,3.634249568383136619e-01,6.318070543765236247e-01,2.630970791117327234e+00,-1.084147820092800085e-01,3.228824080831261822e-01,4.451641732841441490e-01,4.385518287137137428e+00,1.813979478504104126e+00,7.216522859725789107e-01,-5.501140401313606709e-01,-8.465029960527101771e-01,1.650606536772769584e+00,6.225779125510728651e-01,-3.515067660141291128e-01,-3.626603488757442206e-01,2.144788307863326082e+00,9.559587421586488443e-01,-6.749619298885680685e-01,-6.205538873255985743e-01,6.715579450239133052e-01,5.863448657340477599e-01,-1.748223115377133263e-01,-4.856441809808107468e-01,1.308756048795031157e+00,-2.690321074941215418e-01,-2.447339309616761716e-01,2.842448285091000670e+00,-1.622309446758628260e-01,4.026947382051830338e-01,6.041907323470170343e-01,3.217754381098257566e-02,1.201193839735186453e+00,-6.582014309690981113e-02,6.376034739852659561e-01,-6.782597194031889654e-01,-5.862487749295641759e-01,2.310711897503340828e-01,4.183592762055191039e-01,-2.881445167445501054e-01,1.467825561509448651e+00,6.713127305013172341e-01,-1.120716248908423696e+00,-3.004568180814354283e-02,2.102884152933634176e+00,8.425250198949586489e-01,-6.696512048175672360e-01,2.154143748572325823e+00,-2.274010870034343101e-02,9.687490302787140628e-01,4.383429368910810031e-01,3.421825051640835502e-01,-4.454078010379535213e-01
1.074187895742491516e+00,1.425596404755987479e+00,-4.689679085843095341e-01,-5.117946226064096216e-01,-1.743737533730476685e-01,1.136110994473988889e-01,-4.671803256798481851e-01,4.410604360314521744e-01,9.979527107871160041e-01,4.827018755806934402e-01,1.385297098680221106e+00,5.596508458227155147e-01,-2.273324704683958863e-01,4.625395732442399988e-01,-5.876733261304317724e-01,2.809541400292516755e+00,6.658778531635054510e-01,-1.996699296118387978e-01,2.477250922160356000e-02,-3.390563023799026549e-02,-4.142531678511990889e-01,7.253817049901474245e-01,-4.482994670807602389e-01,2.177099439236465095e-01,1.363236379738967052e+00,-8.539902392841325351e-01,1.240509833949177132e-01,-4.296240594572626748e-01,4.534006675295421118e-01,-5.553253414480985306e-01,2.835665896652417306e-01,1.842555862768713082e+00,-2.851576300156296595e-01,-4.067176046430044933e-01,-6.395641934099854931e-01,-1.023338065056865531e+00,1.265550690573883807e+00,1.215011054169562454e+00,1.594330638488891116e+00,1.520698185206999398e+00,7.615894034752970221e-01,-2.177665403533436961e-01,1.915273824579042938e-01,4.718263512617179023e-01,-2.605702986166429369e-01,6.645791947886326989e-01,2.980568865564869441e+00,-1.489202489405104801e-01,-2.627244410202654590e-02,1.701191900299162896e+00,4.252680006002282909e+00,1.010372222920028928e+00,9.228737850947442700e-01,-7.382096112157227052e-01,-6.859904655734012646e-01,1.528255446796656924e+00,9.448021593588048495e-01,9.141473707398664605e-02,-1.138154311468005941e+00,1.606752803887847136e+00,9.345157284544760579e-01,3.910868317743787514e-02,-2.628715181506596776e-01,1.097210609236384249e+00,2.337699015803045288e-01,-7.991641790321495353e-01,-6.192633792637731727e-01,9.284021169197043122e-02,1.508770454544855755e-01,-1.000834732329440868e-01,3.228628667831773491e+00,-3.657032549834330348e-01,4.247833957011747097e-02,7.355281949745321457e-01,-3.303409595060426973e-01,1.570948247680775900e+00,2.119765172625983074e-01,1.641652322509429940e+00,-3.533009767690078462e-01,-2.388533450928831403e-01,9.309521922841317298e-01,7.561722875747294292e-01,1.453056263222283206e-01,7.012912404059095106e-01,1.341307977183850308e+00,-8.472587972044648419e-01,1.263186919636353212e-01,1.555137790210982418e+00,3.171300795199415434e-01,-4.334738783571118192e-02,2.233167808519179953e+00,-5.033030851578275122e-01,9.119165265477757742e-01,-1.371179519179466788e-01,1.608915623052663113e+00,-6.511285539067263040e-02
1.119902511729811145e+00,1.895433627278726885e+00,-2.881617230751039593e-01,-7.863379358318635104e-01,-1.165432673142796777e-01,-1.070082870900572192e-01,-6.487596569319369344e-01,4.523760827224625469e-01,1.349481338223369686e+00,2.882274154457125093e-01,8.370831415148329846e-01,6.096111398726410391e-01,-2.906848250887335006e-01,3.942196219301047910e-01,-5.278968600027797997e-01,2.478278011558141980e+00,5.883986184817331377e-01,-1.209717291136883088e-02,-1.653881956473242654e-01,-4.541642077359472202e-02,-4.768623443620366720e-01,6.217404838072181361e-01,-5.438182560769629914e-01,1.264119330773283423e-01,1.501110780916647514e+00,-3.865330308152575278e-01,9.851127553818289639e-02,-4.282572770374065696e-01,-4.271924591011311279e-02,-8.006707030729075525e-01,1.614762937032934165e-01,1.901222743060540177e+00,-4.628054075208882789e-01,-3.536480726024781585e-01,-7.455356452035037940e-01,-8.133439572672271911e-01,1.572416706492514749e+00,1.053354399847353129e+00,1.516997493881944825e+00,1.237153434415937836e+00,6.421753001180473541e-01,-9.376226091674649821e-02,2.564009700396676084e-01,4.016352638400291220e-01,-2.519779841086655647e-02,7.402947170291157564e-01,3.090616900027591818e+00,2.074542168827472888e-02,-1.075645374358250445e-01,1.755578131509574202e+00,3.951004067564277022e+00,1.082460902918743750e+00,8.461498160727851658e-01,-5.078100852988242098e-01,-4.295882438837869688e-01,1.400782339714871982e+00,6.666074525337131185e-01,5.012652434777842281e-02,-1.324800131368850220e+00,1.303133172047041377e+00,4.796135646056048918e-01,4.481892998762200264e-01,7.516176681771929990e-02,1.098308046978269115e+00,6.958610955336216319e-01,-3.140888664105241368e-01,-4.704358342603120469e-01,6.779761729325761710e-02,3.658877011977363924e-01,-1.189405314874379949e-01,2.886436928954618342e+00,-5.321747219470314150e-01,-1.610927189565142248e-01,2.746677111288764461e-01,-2.722262219781647619e-01,1.200273926472275710e+00,2.075761121175721535e-01,1.367990949590797811e+00,-7.968605928888887746e-01,-2.126349154908135919e-02,1.065454345386037671e+00,5.683308794014023668e-01,4.542607907336465578e-02,8.829372570521949459e-01,1.312939184809614801e+00,-8.553550102873579419e-01,2.539334459543363121e-01,1.152446424785665169e+00,3.751514795331656327e-01,-1.652310711074924110e-01,2.099925794231076281e+00,-7.668259201466300912e-01,1.116015144501180778e+00,-1.258650551694385777e-01,1.048152378603729007e+00,-1.096008097993567132e-02
7.847420850637192302e-01,3.916078318584678142e-01,7.416172073816486299e-02,-3.019081755009380141e-01,-1.751239883503530881e-01,4.225240839868210085e-01,1.573313767469361746e-01,-2.864655550910201465e-02,1.152188899227460483e+00,5.712502263106512546e-01,6.613109910005998682e-01,5.294886465820044380e-02,-4.614046785023039332e-01,-8.791695614612174414e-02,-2.040152601813507438e-01,1.751131868666938596e+00,-5.474977500058781921e-01,7.759886210145988672e-02,1.954276976725364823e-01,3.096196060665706851e-01,-9.376085249667525101e-01,4.580907283730164536e-01,-2.984457996028916371e-01,2.350704439553852887e-01,1.372846051573130222e+00,-6.488753343479378710e-01,2.775758342719376048e-01,-6.833706611069341186e-01,-3.626071103760954983e-01,-5.856813463398836683e-01,4.502450635155651470e-01,2.655176712467331779e+00,-1.933804080635208589e-01,-2.078628537291823952e-01,-4.939215413175183089e-01,-6.715681949149205909e-01,1.213179454297493631e+00,1.216674801940536454e+00,1.624100390638784530e+00,1.718693202514357532e+00,8.785199033596581275e-01,3.770687722152113452e-01,1.764461653129100194e-01,8.560800592970252421e-02,4.321103318884511602e-01,6.801596835076426650e-01,2.720205888512858383e+00,-2.282854148986246390e-01,1.649045911238264384e-01,8.420752034350345028e-01,3.986854324293092500e+00,1.512121490930443679e+00,5.184140593330273106e-01,-5.352092998903388299e-01,-8.525085309993901683e-01,1.662327487545378624e+00,6.606519563600641298e-01,-2.158497766395665873e-01,-3.547166256879530910e-01,1.751151782065861529e+00,1.072275946730931739e+00,-4.323333687176775242e-01,-4.756101112506629924e-01,9.584098889378404040e-01,7.116409590811846320e-01,-9.165735715404410566e-02,-4.747949697915155864e-01,1.206654501593707352e+00,-7.471248021245943671e-02,-2.378309974172242436e-01,2.676316173402806253e+00,-3.485180800660773182e-01,3.986710561949234344e-01,5.787477025749809822e-01,-1.376377730136609800e-01,1.325874670735553318e+00,5.308949535404844378e-02,7.449198677224457832e-01,-6.687389678131596682e-01,-4.144948642794368254e-01,1.302101204836281223e-01,3.184042689883953003e-01,-1.642176584057236099e-01,1.433237781059133908e+00,6.994419563170051202e-01,-1.008258319456426966e+00,1.243898056719790757e-01,2.007761168372613980e+00,6.702393101848875823e-01,-2.415042382627149986e-01,2.038903857989306623e+00,-2.359147500128285502e-01,8.963520873194863459e-01,3.621885224498240241e-01,6.042147262061715596e-01,-2.408389031139339664e-01
1.089645643724993285e+00,9.383782093204352526e-01,-2.342276173807385509e-01,-5.536277095928276992e-02,-3.215190276500139999e-01,6.012166412415063110e-01,-1.074192796704287467e-03,4.310144850729501487e-01,1.814866335395001418e+00,4.098051949795267213e-01,4.804299000109824580e-01,1.152919282177791716e-01,-4.626468621031604722e-01,1.671484153816231166e-01,-1.377166423026291997e-01,2.006262062942081315e+00,-1.482875228642506205e-01,-3.380874279747726474e-01,1.933697254240115126e-01,2.868067534027199939e-01,-9.194742801649757880e-01,4.940282887218047092e-01,-4.293425576696183188e-01,2.104192194756493994e-01,1.162954188836771596e+00,-7.687898070151073515e-01,-6.395083090356629141e-02,-5.991331903567136408e-01,-1.614753831116155780e-02,-3.410578792619025634e-01,6.714306067923607735e-01,2.381435352099383174e+00,1.735359946072834170e-02,-3.453976915720504137e-01,-6.687263554999222093e-01,-8.214747755258601236e-01,1.573277411606155862e+00,9.740551361131455366e-01,1.032032443684300471e+00,1.246447469686615905e+00,1.227848576438882677e+00,2.698730972371791159e-01,2.271174472888456974e-01,5.488237523730454814e-01,3.026344162824012307e-01,7.133568220988955044e-01,2.928068444751254162e+00,2.202661093128676084e-01,4.182089727479857411e-01,8.394880192721032586e-01,4.667489248188561923e+00,1.487812740428035685e+00,1.077424359359443473e+00,-5.211075051275948500e-01,-4.838222895092086917e-01,1.207555920569758801e+00,1.328888052290947974e-01,-4.879084230708971015e-01,-6.227120026161780952e-01,1.466942868228625851e+00,8.930574571863899580e-01,-3.396797429599191509e-01,-6.087137283800898579e-01,3.628232359885375513e-01,3.438248386153601732e-01,-3.887498180117806568e-01,-2.532897655028322204e-01,1.154244873342571420e+00,-5.055173907025070079e-01,-4.734599047197685096e-01,3.253999006859192633e+00,-3.206254014885425163e-01,2.221548034354435541e-02,7.396369448039989969e-01,1.942690737119661115e-01,1.283414907756108558e+00,2.902959956651616769e-01,5.240991327313221371e-01,-4.762769613276361946e-01,-5.731600333630523236e-01,4.317944437015587833e-01,3.148808280791440817e-01,-2.220223595820941809e-01,1.033750264282007336e+00,5.192494405682068770e-01,-7.635681739290454129e-01,-8.781966201432361840e-02,2.045782000659455147e+00,8.574586966459331050e-01,-9.387546794479884049e-01,2.295405459014333793e+00,-3.900387243093917933e-01,1.512934519851107940e+00,3.964727992022391012e-01,-4.763356467835971886e-02,-2.947656083461370202e-01
1.168469341235870429e+00,7.805409770019978710e-01,-7.371391231584283332e-01,3.530025070661262365e-01,-4.362176523845319731e-01,1.141004445383987820e+00,7.969778417780333246e-01,5.509679015651539613e-01,1.374473396322147600e+00,1.798447869181519776e-01,5.914312031812583026e-01,-1.401536183435084792e-01,-4.052701768404664562e-01,4.123735645952656959e-01,-2.407764502366240844e-01,1.970595123488733336e+00,1.940992768243005040e-02,-1.201106285324208489e+00,3.158560378858956685e-01,1.238653538833396905e-01,-6.944192226991717787e-01,4.371143863644155747e-01,-6.134126844296976522e-01,3.048425870891242062e-01,1.104622527525560116e+00,-7.289911578468881714e-01,-4.122678922652981415e-01,-6.044397892042003839e-01,-1.370796486597718467e-01,-3.898098138073333718e-01,9.947741626245601987e-01,2.131682369842517577e+00,4.885915378409066423e-01,-4.616693442194313990e-02,-8.448616736542826633e-01,-1.048152781324658278e+00,1.852950431254964281e+00,5.614619836528169650e-01,9.615001041197515086e-01,4.698880117842196835e-01,1.475632556164287568e+00,2.686886088502515868e-01,-7.094914096106497148e-02,8.893508306536050956e-01,1.625198877087752902e-01,8.204017555870386502e-01,2.430316010204124133e+00,6.362350477430587237e-01,8.419310835368281065e-01,6.570526361956485761e-02,5.619933388290850651e+00,2.004162304686517349e+00,1.351193581286601386e+00,-5.695228163622182427e-01,-7.338463214404877810e-02,8.282789533005623372e-01,-4.587826838743740421e-01,-6.863787541596617636e-01,-7.192158970503204074e-01,1.538696288642313004e+00,5.070576767207408686e-01,-9.456164932996536931e-01,-8.336048266034077336e-01,-7.117829849094065020e-01,-9.182737270268437335e-02,-6.674829699466797717e-01,-4.021227310731754767e-01,1.033546159574203482e+00,-1.290550358198365499e+00,6.331363821186236640e-02,3.475721162100956718e+00,4.732346666319570128e-02,-2.230067920651732094e-01,1.105934689604869181e+00,5.789955218250512070e-01,1.127299624730931704e+00,-1.077987726526268841e-01,1.409234371522605223e-02,-2.324581976440864839e-01,-1.177999966133429499e+00,7.759951709067332004e-01,1.719749264717709281e-01,-4.176245890358503132e-01,1.028319769955970298e+00,2.455652129937522243e-01,-8.137205070837855159e-01,-2.858151955681240142e-01,1.692473963912280333e+00,1.264037292488581432e+00,-1.710319940974774910e+00,2.074930591019498394e+00,-2.417759794243015126e-01,1.696517132559406393e+00,5.628876389409331882e-01,-8.127998638238409512e-01,-7.175427072085239777e-01
1.010910433181695822e+00,9.553541895933715944e-01,4.935175600242591720e-02,-4.255691582511200721e-02,-5.289539744940688348e-03,3.145816369656807554e-01,-6.360924331958095479e-02,1.279068348225644025e-01,1.308481654885093270e+00,3.719883297317305715e-01,4.604466944745927437e-01,3.687144095958963530e-02,-4.879408238487479843e-01,2.795360756071522124e-01,5.642611684738541022e-02,1.809251150116424345e+00,-3.350501755717306129e-01,-2.037258672006769522e-01,3.216683848108186083e-01,3.822842676757154945e-01,-1.034614879923385411e+00,6.941427671689170964e-02,-4.776893110554257804e-01,3.489010210036171955e-01,1.032336280257196481e+00,-7.101800817334007476e-01,1.965383883477238303e-01,-5.863746513548282469e-01,3.092879183206678206e-01,-1.030104192566128063e-01,6.218867056213146505e-01,2.301057925027816697e+00,-2.166863836560584122e-02,-5.410149457720896393e-01,-5.948654265022488286e-01,-8.464419085305743273e-01,1.159858035915011687e+00,1.229541757677399039e+00,8.739018752095402132e-01,1.252810884046654305e+00,1.009909187216800452e+00,2.311791442998830937e-01,1.262782654895115431e-01,4.711397517589068773e-01,4.459513526011154028e-01,8.280149494642966568e-01,2.883442591893080831e+00,-3.714870511089417293e-02,2.837285363893942147e-01,1.348362186859624057e+00,4.160584692282515817e+00,9.570681696488165802e-01,6.550579960151449166e-01,-5.977154468956376032e-01,-5.430525863267692266e-01,1.183999377579407319e+00,9.087188412820979000e-02,-2.909681436044130876e-01,-3.286047924191401459e-01,6.871227696944617325e-01,1.394285284262915203e+00,-2.986164936674232107e-01,-6.103470409129112539e-01,6.500559066668391006e-01,2.981544477635986734e-01,-4.382878222281858527e-01,-3.056897802871930692e-01,1.165089601445056466e+00,-5.131056215521204722e-01,-3.425339592673908307e-01,3.053302090867585417e+00,-5.630672702151637843e-01,1.215895706619156830e-01,1.079533013122806251e+00,-6.695308168554425787e-02,1.734890144653590038e+00,4.617557689446671332e-01,5.561896020449933475e-01,-1.353307680275099845e-01,-5.360734366501549442e-01,1.135974369279946217e-02,2.247459141659727266e-02,1.211675184511462611e-02,9.665330309176526358e-01,3.292248070431060825e-01,-4.971700569801327241e-01,1.328785682163792781e-01,2.091340851434265069e+00,6.216180153361748895e-01,-1.395462549538226127e-01,2.001278019576758105e+00,-6.599574035638120506e-01,1.320147837007021874e+00,3.842458966967599032e-01,4.129468381713937153e-01,7.642610392109172590e-03
9.588328978038302974e-01,1.066558249883613252e+00,-9.727690950033360262e-02,-2.111504170370774314e-01,-9.137047089746751227e-02,6.521122575592104287e-01,8.974454889005742952e-01,3.051047356753688877e-02,1.142540143878559178e+00,-1.516553223920774351e-01,-3.939162870323267840e-01,-2.848125912331094245e-01,-5.506290585288854400e-01,1.358607830112315007e-01,-7.112294385738943125e-02,8.715989485556755456e-01,-6.492253526840086053e-01,-6.891014497332651478e-01,7.258632507907322728e-02,1.548840915931327111e-01,-8.775763718113358536e-01,-5.173088392929969803e-02,-7.585893265047334300e-01,2.480301305582968130e-01,1.464298326063764977e+00,3.484194242479419223e-01,-1.561047499289151819e-01,-6.996649690616688622e-01,-1.379762482143729763e+00,-9.752466505820194254e-01,6.838978721596757904e-01,2.452621800801570551e+00,1.239027565282287413e-01,2.046670959650933597e-01,-9.137137933821788405e-01,-5.596622721869363160e-01,2.046100459370745472e+00,4.271425804966362816e-01,1.200930972699523869e+00,6.854150600957098494e-02,9.518972024613185923e-01,6.567625998844512925e-01,-1.382693637123015296e-01,4.013378922691258621e-01,8.381818102471414456e-01,1.034137169704184789e+00,2.248681830814490024e+00,6.072372833536826553e-01,5.810223088829846727e-01,4.095303641767011893e-02,4.521952447947938047e+00,2.152383066742167728e+00,5.816838035613429714e-01,-1.590510600643871564e-01,2.137427230264166145e-01,8.297822007480267770e-01,-8.268606589037862387e-01,-5.570956887405832392e-01,-6.530808110524576326e-01,8.506659296346947841e-01,-1.061514245767305742e-01,-4.736094759807767951e-01,-1.711965090800329770e-01,-4.687096617716660640e-01,1.001703105281935402e+00,4.944528556593685842e-01,-3.511593012398233626e-01,1.136720077895845726e+00,-8.194242884368241331e-01,4.481901400211851794e-01,2.242781113269026516e+00,-2.878749032231113780e-01,-3.004615624392885098e-01,3.435485772501042367e-01,4.513558608184046195e-01,5.708441952484175630e-01,-3.857871602583256010e-01,-6.134742059009399284e-01,-1.049075861078578642e+00,-8.357540663595059982e-01,6.026727378207091812e-01,-4.368259134174423131e-01,-5.598577336719060549e-01,1.771352645180812369e+00,7.015882690029695556e-02,-9.409605815190162925e-01,1.746550678100131093e-01,8.367663815218626677e-01,1.295477888780311782e+00,-1.282509811658049559e+00,1.363419428822743695e+00,-6.722985992711834058e-01,1.556471343481995451e+00,6.727041642407340927e-01,-1.542077441940785221e+00,-5.904615655606959557e-01
1.042816591991668318e+00,1.663964644076822763e+00,1.039686546555683017e-01,-3.982913293089581086e-01,1.517638327921078667e-01,1.740213726789269777e-01,3.318976663544442873e-01,1.716325062879324459e-02,1.156621242161016472e+00,-2.166136213163988022e-01,-4.514208055338336245e-01,-9.581770434411873705e-02,-5.454903605797892796e-01,3.249694799717933180e-01,3.995752885514575192e-02,9.946855880472207367e-01,-4.446249703076179949e-01,-4.325527194535203623e-01,3.082516648469025428e-02,1.829171525789006769e-01,-9.155074059375504225e-01,-2.880893848715676553e-01,-8.287759059474140155e-01,2.814468428218876994e-01,1.365960559164103527e+00,4.124738508678553184e-01,1.302270882253675488e-02,-6.009522898923471690e-01,-9.292504718746795733e-01,-7.756422951108923325e-01,5.239066177051705520e-01,2.213962320612132828e+00,-7.691371537048269369e-02,-1.128990333582028105e-01,-9.117468208156257470e-01,-5.766063342690405102e-01,1.841247871228002930e+00,6.450363653290929200e-01,9.232822260908415402e-01,8.718945792286914021e-02,7.439213482065827332e-01,4.806652201539668434e-01,-7.537546216275668731e-02,4.345479355507444463e-01,8.386437761886604836e-01,1.104938687032402278e+00,2.536758261611194776e+00,4.642727847128162999e-01,3.383235700626335274e-01,9.044233611200080958e-01,4.005069151731874832e+00,1.476964176088029213e+00,4.173675409196688224e-01,-1.866875860627726924e-01,2.387471225142662190e-01,7.523666746189193733e-01,-7.971594238155178536e-01,-3.530018750579987374e-01,-7.272261741639727273e-01,7.115196135853807391e-02,1.876128533281906929e-01,1.253609811763736759e-02,9.129674758274333030e-03,-2.008477756672788495e-02,1.014703431573956038e+00,4.177327686285504660e-01,-2.770387126051592208e-01,8.817051188675146811e-01,-5.611588497593058555e-01,3.263693707850685022e-01,2.231034687191895127e+00,-6.280736700836275777e-01,-3.895928536161371025e-01,4.295547395803884783e-01,1.869382103563908548e-01,9.062418746888951659e-01,-2.273459974923558446e-02,-3.180656629251609191e-01,-8.672155898033947485e-01,-5.451374163061010192e-01,5.011731019841193513e-01,-5.371806787418356155e-01,-2.864048172987041507e-01,1.476990869782369931e+00,1.334734252170747260e-01,-6.262945586461236003e-01,3.775442037507875659e-01,7.819968442382561058e-01,9.620171182587764491e-01,-6.110400217118494570e-01,1.310569382693551166e+00,-1.095198509060336223e+00,1.577446498111815920e+00,4.922296259097898030e-01,-1.012580334620866829e+00,-1.837184853454102429e-01
9.610523484963477969e-01,1.976754217515469758e+00,1.999335157428294707e-01,-7.716697856424242774e-01,4.163499674638439507e-01,-3.488438287092670564e-01,-5.973826912794727440e-02,-1.757474245600477158e-01,4.565541898639057794e-01,-1.737286531340646312e-01,1.791458877659157789e-02,1.598558509854911547e-01,-4.300536271701417279e-01,4.878873346144773082e-01,-1.324206467335687365e-01,1.317054063790719765e+00,-1.147139951966590354e-01,-1.302551087290090004e-01,-5.029827678406106894e-02,5.099423481711404943e-02,-6.975200854272960438e-01,-3.504820920521285466e-01,-8.404925396155342732e-01,3.285730220992071349e-01,1.476517541373459697e+00,4.597568069925581091e-01,3.124713478064840566e-01,-5.031411119938048460e-01,-5.986910610289541967e-01,-8.545540084398374203e-01,1.955814114247010072e-01,1.921058968958634594e+00,-3.704814929372268195e-01,-2.430439001013639522e-01,-8.375079851589786184e-01,-6.402040271351598921e-01,1.444440194090320650e+00,9.506460889823828975e-01,1.255519966219414529e+00,3.492995125039619619e-01,2.868864033205447139e-01,2.011808817999428678e-01,-1.089359258455782214e-01,2.563323746976282624e-01,6.260343498922880112e-01,1.122118732019144138e+00,2.588297162874244606e+00,5.770949870087574429e-02,-6.990748331687011985e-02,1.730131802493734661e+00,3.317073937966092956e+00,9.169355112147729026e-01,3.442777866934704223e-02,-3.166572357647843838e-01,4.140103302566133792e-02,1.007959717411345713e+00,-2.463621116791427923e-01,1.269528004713361691e-01,-8.885552018618920744e-01,-2.054008021250561811e-01,4.339332428844348000e-01,3.612011521293994054e-01,2.981461241989883382e-01,7.237683849660756508e-01,1.076754751853011172e+00,2.775968667591183769e-01,-5.104096846809502708e-01,2.669279025722948173e-01,-1.458110309436629753e-02,5.791707728462599514e-01,1.991397140452716874e+00,-8.247384271062392358e-01,-2.917491818088099875e-01,4.611799733660503220e-01,-3.122293093716042023e-01,1.249753804954838010e+00,1.786534289920671537e-02,4.047246749145659850e-01,-7.483274029712203568e-01,-2.208783999746730675e-01,5.611015030216273125e-01,-4.133873455886492576e-01,5.010844896918426050e-02,1.320006955668613369e+00,5.852932605434992830e-01,-5.829185100527896068e-01,6.651131250985919952e-01,4.862509493821351447e-01,4.795025618389409106e-01,4.215254950680485391e-01,1.117088064694435223e+00,-1.314392972386430269e+00,1.069044632850571164e+00,1.486856003726153841e-01,2.604518529115028569e-01,1.434943444030805093e-01
8.082049694508435245e-01,1.008393915954487241e+00,1.564751556657442144e-01,-3.014778679842049502e-01,3.251652732344430530e-01,1.454627563832169290e-01,5.901250234076729217e-01,-3.640952255322960074e-01,1.199820421717555652e-01,9.525964564312261462e-04,2.234422319923973776e-01,-1.861261944837342419e-01,-4.675220747815225231e-01,3.547119100189251029e-01,-2.869873619709967238e-02,1.136611550893076528e+00,-5.660585176701176113e-01,-3.916411045991067263e-01,2.435501188048339039e-01,1.888846361401193552e-01,-8.354566464762183120e-01,-3.852002336560216289e-01,-7.214116832505282906e-01,4.450118884118745566e-01,1.326020420236483588e+00,1.052539101209840899e-01,3.169838984516873959e-01,-6.241411911608006902e-01,-5.216692353308356456e-01,-6.325552160903635812e-01,4.766266921389203937e-01,2.187444762735584192e+00,-3.853233773713554688e-02,-1.363294349555022045e-01,-7.112992161436234584e-01,-7.330656734311138401e-01,1.200453473465993959e+00,1.004862566907745558e+00,1.306825241460211728e+00,5.280854329579568462e-01,5.311774382869113298e-01,3.613020513713965931e-01,-2.433416751963562441e-01,2.352484440742130811e-01,6.907855585148641175e-01,1.079991843253136796e+00,2.253241820878241874e+00,-3.247924741401327087e-02,2.075678140889778145e-01,1.086926794116587436e+00,3.729372792650794910e+00,1.206557754711637509e+00,2.875699301272183206e-03,-4.538241010697288691e-01,-1.815077644836989301e-01,1.093581638152337110e+00,-2.646589181191653095e-01,-3.739921862763870286e-02,-3.652905563434454828e-01,1.716160388311800400e-01,8.462557810269897285e-01,-3.968248847634694432e-01,-1.898162051213085622e-01,3.887741877916781053e-01,7.427649071427759875e-01,6.942649611688217481e-02,-6.102753673344987195e-01,7.967340209429872866e-01,-5.260520568139657183e-01,6.409600563109730809e-01,2.135316858964371178e+00,-5.683180253713516761e-01,6.941083158242253304e-03,9.216135032867167620e-01,-1.746040791998179631e-01,1.453537072413795705e+00,-1.350708094369444667e-01,1.181038985234603156e-01,-4.070909543192997582e-01,-6.598675400767358701e-01,1.383657624933907204e-01,-4.697012273521053438e-01,-4.907971753227630130e-02,1.477061943801545985e+00,2.379430248277598636e-01,-6.558606640325339576e-01,4.847102257625329758e-01,1.018780638266729932e+00,6.930031652390665764e-01,2.374608587481878419e-01,1.117547232520873512e+00,-8.994623736936897540e-01,9.300932178946321738e-01,4.161126721766144065e-01,1.240349777959212085e-01,-9.318945922644583657e-02
1.356245918161944175e+00,1.367487422415150311e+00,-6.838169160651358380e-03,-2.621807486265315124e-02,-6.560455379790831598e-01,7.303718723206555907e-01,-5.428922793107364697e-01,9.232996476669897978e-01,3.854324838982839729e+00,3.776715018026612913e-01,-6.237121185031486714e-01,1.611340101055543372e-01,-6.887989866513142267e-01,-1.679149304031591350e-01,2.036259769752106763e-01,1.684718982937483123e+00,-4.406529657359543051e-01,-2.357027277788933950e-02,2.223807427974099776e-02,5.623726316520333279e-01,-1.401287782339257548e+00,6.877540225227001258e-01,-3.623135823966595059e-01,-4.306797969383649449e-02,1.062355206491029769e+00,-6.841885806346498233e-01,-3.705647599646406665e-01,-6.548248094914436157e-01,-4.193742476476738368e-01,-2.347423815677756043e-01,8.204372196814136986e-01,2.848649005125992062e+00,-6.599565773444870942e-02,-5.090996678963857214e-01,-7.752830560202195187e-01,-4.889900039531472897e-01,2.277556261633711721e+00,7.125527250688301617e-01,3.061196428822794413e-01,1.236372490574159766e+00,1.731833707719114379e+00,6.106880751859476986e-01,6.632219983819699349e-01,7.028399662770227208e-01,7.126388898487551193e-01,6.249400823639479352e-01,3.584104574912661434e+00,7.406279808173595880e-01,6.255481841425347689e-01,5.576879846457037937e-01,4.915435512458107503e+00,1.777534047567347342e+00,1.681388224293434597e+00,-1.562097389316797480e-01,-2.536142313619880184e-01,9.146560306553896957e-01,-4.269276381576397883e-01,-1.106380560799597568e+00,-6.933546877754199755e-01,1.534461021105423928e+00,4.872469713735307906e-01,1.535431329554845514e-01,-6.128008810390325189e-01,1.041966475082468646e-01,7.459180959843838554e-01,1.552227130821953738e-01,4.203299888144524932e-01,1.948591852241163824e+00,-5.184996679099961314e-01,-1.513010072137400686e+00,3.546101503878266392e+00,-4.823450601900202139e-01,-2.409732999083620819e-01,9.010705153575923609e-02,7.125042346190296749e-01,6.838371437405201814e-01,7.604426193171094361e-01,-1.298595063442271602e-01,-1.074012819781583028e+00,-3.323392126723175299e-01,3.935209807308305274e-01,2.689296967573131525e-01,-5.737435172828218022e-01,1.078986424621870999e+00,1.697336921036436408e-01,-6.672428275099643313e-01,-3.461177980144755639e-01,2.529289737635527224e+00,1.230995044838638197e+00,-2.104061529343506987e+00,2.908676280169806283e+00,-4.761002001235136172e-01,2.505646318009961515e+00,6.660894550148191984e-01,-1.651010414506880464e+00,-3.291540029924461264e-01
1.275084719392230337e+00,2.043185439715195173e+00,-2.575390175246553559e-01,-5.422674661322068879e-01,-2.879139007054863919e-01,2.769879893685384675e-01,-2.898112442088522367e-01,6.508744766887029076e-01,2.279753252782743544e+00,-1.546603081955674752e-02,-2.008506203916619604e-01,3.178380469716987067e-01,-4.733536547984738552e-01,2.585220694993028978e-01,-2.378801490893720783e-01,1.773347169620544950e+00,1.746946250027468506e-01,-3.199248362438775750e-01,-1.996455733989408732e-01,8.236678174662273588e-02,-7.637566278606068293e-01,4.551249740225499774e-01,-6.850576073644862873e-01,4.422489067875265412e-02,1.442003770317847655e+00,2.367250287738194292e-02,-2.708068439934947502e-01,-5.207278244945335866e-01,-7.635752657975932722e-01,-8.625647595890642005e-01,4.663255864605692080e-01,2.174766895401003097e+00,-2.196694294617261289e-01,-1.807970050459030142e-01,-9.560030698285685302e-01,-6.079241291735887343e-01,2.260395474577297836e+00,5.438286739176421136e-01,9.609542617856594582e-01,4.915242814063662813e-01,1.037551112656353469e+00,3.037826868840419192e-01,2.753271581695835302e-01,6.146219025140642334e-01,4.340941248289765797e-01,8.521140390176925594e-01,3.058046398775699615e+00,6.687582546630898017e-01,3.189490547281034760e-01,9.276931624131826704e-01,4.497836676351071539e+00,1.688474171339402696e+00,1.167997777136941639e+00,-1.766670098091867591e-01,1.261028372556776134e-01,8.777493966891574129e-01,-3.720128200770260740e-01,-5.134461069909898034e-01,-1.287501283235674698e+00,1.058376592806092642e+00,-1.620519846223830440e-01,3.759236995310227814e-01,3.211961869556242966e-02,1.229864565324435555e-01,9.402185261024120777e-01,2.056438252325061278e-01,-9.520827069005421972e-02,6.828637658998900628e-01,-2.092604627399009543e-01,-2.970689812661900797e-01,2.857780247064828583e+00,-4.823886774528605148e-01,-5.171103414587706615e-01,-1.568293254284688909e-02,3.493692356347080086e-01,5.762456293663094087e-01,1.632795626191955729e-01,2.178514950921724980e-01,-1.183563734339115214e+00,-2.787148997063379485e-01,1.098444880518918199e+00,1.397404260076268723e-01,-3.852108069680942881e-01,1.163333798948199771e+00,6.716310250827933759e-01,-8.130700105984360881e-01,7.380624057582990671e-02,1.037837523973659026e+00,9.750117322057789693e-01,-1.371436582043706220e+00,2.079000300778520938e+00,-8.537385119209049966e-01,1.901661226660152693e+00,2.861749515185581516e-01,-9.350623977309526769e-01,-3.042870816639482445e-01
7.029433646427738491e-01,4.320298988168155274e-01,1.200091096449377309e-02,-3.982963696273980059e-01,-8.339999554639064561e-02,5.207590696572292899e-01,7.894184521194401727e-01,-2.326261075417521140e-01,5.898505024101462491e-01,2.421858431400815415e-01,3.272900596210161495e-01,-1.606481961801355385e-01,-4.656882013457765424e-01,-6.666039205429587222e-02,-2.827610179413688196e-01,1.208416025607207622e+00,-7.083425380798977766e-01,-2.470187306913657066e-01,1.088662168051585388e-01,1.493076225578891247e-01,-7.888352100348712259e-01,2.325810008686729213e-01,-5.006216167775302539e-01,2.559960882744482524e-01,1.602079330738676033e+00,-1.608429358301086826e-02,1.773859159322036527e-01,-7.310595247682889486e-01,-1.188921799417810510e+00,-1.047152035423467131e+00,4.541623015824194365e-01,2.621385142702611581e+00,-9.704154113357946199e-02,2.008235722058980266e-01,-6.556404503263232320e-01,-5.726994028590841612e-01,1.522761969070657972e+00,8.432432747583890054e-01,1.869279644001162977e+00,9.874950849180030854e-01,7.075321841622018715e-01,5.516000894729808923e-01,-8.222511159230584676e-02,1.973219841502731747e-02,6.270046866304882505e-01,8.540066963321694127e-01,2.229622895153182682e+00,1.632151543570796448e-02,2.763952942443481109e-01,2.674587075568044536e-01,4.043512428664023162e+00,2.016415041820292409e+00,2.777606750912672284e-01,-3.567153836576650860e-01,-4.351287090296007132e-01,1.470086194378927624e+00,1.716462580713170594e-01,-2.212632802838273571e-01,-4.744008066465554840e-01,1.592295076419307565e+00,3.757766542770339946e-01,-5.947641802427747759e-01,-2.126376025874368303e-01,3.921173692371299757e-01,1.033193982268086231e+00,3.423294922732014745e-01,-6.221111816301327924e-01,1.041638360911904870e+00,-2.722593056726861915e-01,4.409594560917651229e-01,2.112405108467560133e+00,-2.278624352423937460e-01,1.967040591839748775e-01,3.525631263959698170e-01,2.113075863513227959e-02,8.606402280603890897e-01,-4.711886922183258219e-01,1.641236040680322250e-01,-1.006214103319864828e+00,-6.265762091696643887e-01,3.923131604823477669e-01,-3.057731119993573055e-02,-3.780263877456323529e-01,1.862343082874907463e+00,5.479177692492058771e-01,-1.199476963551415309e+00,2.495285398882724770e-01,1.180566835529513137e+00,9.456132433989752339e-01,-5.238071511604329711e-01,1.479795882022388209e+00,-3.203059241499235377e-01,8.425639590835447557e-01,4.808759939661535476e-01,-1.807752451605668664e-01,-5.041725441789726148e-01
6.332288076729962745e-01,-6.145864567227832254e-02,8.016472200561382266e-02,-1.648191255182087644e-01,-8.508318065963192678e-02,5.894676881493454701e-01,7.104703227418958100e-01,-3.088268663778477308e-01,4.877737510044904967e-01,5.260856870402264018e-01,7.289847300004347330e-01,-1.897387628337193766e-01,-4.616607994311168750e-01,-1.028397474201231399e-01,-1.955724003048648352e-01,1.452248801441223369e+00,-8.234478609627589041e-01,-1.289842387575048099e-01,3.190259597779612211e-01,2.972414845174549125e-01,-9.136625802386014739e-01,2.691697456527493149e-01,-3.312370765743890555e-01,3.378508824760762530e-01,1.400599905243610444e+00,-5.439831769976074538e-01,3.360275196733972236e-01,-7.492753458317049642e-01,-5.772278537636486018e-01,-6.573721707379239776e-01,5.288889401304381899e-01,2.714015097545872113e+00,-3.548375662130448527e-02,-1.769276358156646189e-02,-4.696326806125145081e-01,-6.960164892319627983e-01,1.073735007155697474e+00,1.180378019285872604e+00,1.819174439727445858e+00,1.550295140292485829e+00,8.072963016897158894e-01,4.780770913900477259e-01,-3.570317374420270418e-02,-6.890327506497477550e-03,5.270417893216681193e-01,7.531685797155884821e-01,2.317086717779901051e+00,-2.935459567090862865e-01,2.612328674793767402e-01,4.728120361552344830e-01,4.022876730436081516e+00,1.708619530454892121e+00,2.515176520188535658e-01,-5.704636309875108502e-01,-8.420367594923180432e-01,1.679174554445943990e+00,5.496676905445119221e-01,-1.770639307250520267e-01,-1.138278336460475382e-01,1.730535530498279240e+00,1.108653100147645398e+00,-8.466893792308757272e-01,-5.654169245447756564e-01,7.205687589630963563e-01,6.786215902913736997e-01,-4.958983045236564635e-02,-6.565354374710271612e-01,1.292723498360700551e+00,-3.273107305395058786e-01,1.762724646216000390e-01,2.422226468979952863e+00,-2.255518125083550152e-01,5.104452961911193354e-01,7.843530356669062842e-01,-1.349493281161363578e-01,1.364751322425830082e+00,-2.383894465460560108e-01,4.895026288582806639e-01,-5.603715973224502322e-01,-6.779328383305923689e-01,-2.911159900534088241e-02,1.203715633683214437e-01,-2.107890594748892399e-01,1.671777489798949023e+00,5.143665195707557425e-01,-1.092345402224595530e+00,1.727506754976151360e-01,1.872772269845218940e+00,7.752463115601090360e-01,-1.371092036199768605e-01,1.706049855861463627e+00,-1.245980934820706265e-01,6.543697163766395430e-01,4.867315766896207485e-01,5.196745916787992581e-01,-3.800941991747540660e-01
7.334587795262055288e-01,1.985351744947095876e-01,-5.559012196009469609e-01,-4.762442964029809933e-01,-4.543641121142795725e-01,6.787854078204542674e-01,4.575226105293654921e-01,1.545261381279073032e-01,5.594478347127392892e-01,6.864380737196630333e-01,1.574822858189735886e+00,2.663474380419578180e-01,-2.301184464522236794e-01,-2.636913638155494177e-02,-8.381748635878897291e-01,2.448240873142863094e+00,1.038905759001871876e-01,-2.503248212789486171e-01,4.005650244258169429e-02,-8.373765406335417771e-02,-3.462872159166872632e-01,1.103151021272473997e+00,-2.497622510981285515e-01,1.561434659690276727e-01,1.711577482557766539e+00,-8.107801548608641884e-01,1.020534783742700902e-01,-6.354976185490499585e-01,-5.677143875735438661e-01,-1.108615806725890218e+00,3.286997135159924754e-01,2.404680310681833522e+00,-1.774835164739669846e-01,1.990365242933270495e-01,-5.311717578310194421e-01,-8.608340577472587407e-01,1.378705437870199724e+00,1.031365486886221872e+00,2.489397488756038612e+00,1.829311595968735382e+00,8.015897987302703642e-01,1.280557814818710782e-01,8.182743702505594630e-02,6.796880041059676081e-02,-1.730936248868940597e-01,5.256481276019153714e-01,2.419303528947579718e+00,-2.364258501585699834e-01,1.314590281119943083e-01,3.936104804587751138e-01,4.514858375716394256e+00,2.093464541485529740e+00,7.835396617971351896e-01,-6.762205295913321645e-01,-9.723991763333088567e-01,1.989617684182726220e+00,1.305345027105406341e+00,-1.487145182186304371e-02,-9.067678036084183546e-01,3.053882477747136726e+00,5.120606793126092349e-01,-6.904567470343815350e-01,-3.730428238195697688e-01,8.766345834312856411e-01,5.562252251548993609e-01,-4.056447015036303005e-01,-8.844362364108339092e-01,4.682186378945739635e-01,1.507617757647184698e-01,2.504736342481566069e-01,2.789858460163926690e+00,1.271485950866217407e-01,4.235895020951722101e-01,3.791457017077755065e-01,-1.679337909292240028e-01,1.008083299739594096e+00,-5.322483036272730450e-01,1.375739627100663665e+00,-8.686724901138636046e-01,-5.122981699974373804e-01,9.438140525661491420e-01,9.414210174637387407e-01,-2.469874296706949246e-01,1.461619701989930187e+00,1.438346176392563347e+00,-1.540776732832441986e+00,-1.916611550300989508e-02,1.534552427449445755e+00,6.877735423138501281e-01,-5.989167407160331802e-01,2.139306179138058539e+00,2.408084957152581973e-01,4.414346050192249349e-01,8.742484571846143027e-02,1.249113141510581393e+00,-6.522453468095816831e-01
9.417754866630968502e-01,2.016271098282770957e+00,-1.431370491209362772e-01,-1.087592032269516507e+00,1.734652496800725974e-01,-2.972857646287197508e-01,-1.108241912990200473e-01,1.791606969227044210e-02,4.082207311173009501e-01,-6.892377170397509523e-02,4.965517396741878642e-01,4.238982868438693208e-01,-2.906393202297458678e-01,4.163018424480267043e-01,-5.944913637111322036e-01,1.799439031239519649e+00,3.436765879260494372e-01,-1.104061960218565425e-01,-2.841985751062673371e-01,-2.141588943900920583e-01,-3.227734539709943284e-01,2.206599758667997235e-01,-7.667363954680492810e-01,1.808541407877466978e-01,1.805679513142780079e+00,4.381993492801678491e-01,2.012592964954581509e-01,-4.686997717876845160e-01,-9.272051878226087451e-01,-1.342814520920247778e+00,-3.681731730775794631e-05,1.846428765276626027e+00,-5.284868181573255663e-01,2.795866662223250865e-02,-8.655590529528098820e-01,-6.500357356367594264e-01,1.686788495842775459e+00,8.181200891365032479e-01,1.908469836616960347e+00,5.673153621147101200e-01,1.956342025228430814e-01,6.455659911755712299e-02,-4.358502015056084367e-02,1.570095048313518427e-01,2.526786892924884897e-01,9.689924727867766929e-01,2.563292704655513177e+00,5.729945189209124934e-02,-1.962057523527658831e-01,1.505787808720037813e+00,3.493739590616625090e+00,1.350953478702861199e+00,2.539433685002971397e-01,-3.204746662839854099e-01,-7.137570868279635716e-02,1.316383336076057287e+00,3.150273313439221901e-01,2.573553083038152556e-01,-1.394290703819723642e+00,8.394801909859602729e-01,-1.212003850528520499e-01,4.520980221846695457e-01,5.253648598850897411e-01,8.856109893555534907e-01,1.220775518996956466e+00,2.708164212122947667e-01,-7.021626779427921905e-01,-2.388217581532877665e-01,4.264751668172277466e-01,7.270786444686273553e-01,1.984724621947751011e+00,-5.666356679374571215e-01,-2.924468361934035587e-01,-3.555851709010932060e-03,-3.506289332215906107e-01,8.409821557672624293e-01,-3.306483659383634421e-01,9.192206335579615750e-01,-1.172682014453201749e+00,-7.050000389171678927e-02,1.204521626769925469e+00,1.067066129239210986e-01,-4.566558193266478938e-02,1.401121819149092396e+00,1.237081599729988657e+00,-1.022090437253500905e+00,5.878485087044530433e-01,1.296939743640611598e-01,4.589979445347205922e-01,1.194261536028807247e-01,1.305033462332592986e+00,-1.013644590200858175e+00,8.101621400562237785e-01,-8.983641125649605153e-02,6.540156371864722651e-01,-9.985326653308751466e-02
8.674909257797428497e-01,1.057865865653447868e-01,2.496655768763707539e-01,8.289762242499720823e-02,-3.294116319025061079e-01,7.257864815086322308e-01,1.629621823756853827e-01,1.043415081523691446e-01,2.071272441434397482e+00,6.490891959499472952e-01,1.365461132462018057e-01,-1.537224628512105784e-01,-6.292141913443232148e-01,-2.798120932788792925e-01,1.655623269612472859e-01,1.448974884197629320e+00,-1.011889121229539557e+00,9.832293279165579825e-02,3.506878828438893536e-01,6.116071143147593370e-01,-1.368680017670660387e+00,3.914550665629760728e-01,-2.085030481205695785e-01,2.166948281227846773e-01,1.102640942303339200e+00,-8.806855470322978441e-01,1.593937842325828802e-01,-7.714161535656427482e-01,-2.798502894012528941e-01,-1.940323818503995046e-01,7.410778368516219849e-01,3.023697596107828289e+00,-9.780443244801484415e-03,-3.745623827220835866e-01,-4.597124066662141573e-01,-5.837563382635755360e-01,1.327113017456734712e+00,1.195301671405542221e+00,1.039453846962095085e+00,1.807722940341549567e+00,1.317879333400410635e+00,6.323974257984976699e-01,3.297861935865789018e-01,2.169635555722547182e-01,7.372653135292556170e-01,6.416259781998719935e-01,2.940792185502451694e+00,-3.265097590055151405e-02,4.482696554099420139e-01,5.162602922882918444e-01,4.304609221907854888e+00,1.600713845177488270e+00,7.899748369460849462e-01,-4.567700957371102488e-01,-8.577191039285303464e-01,1.471240140302737309e+00,2.476578417540292176e-01,-6.503950742682862440e-01,3.671249799746456599e-02,1.667560155197147065e+00,1.345320354282218966e+00,-5.965969497550116518e-01,-8.457704459937962493e-01,6.476994206710000590e-01,6.152015133173429628e-01,-2.004454571744002100e-02,-1.172358561953823486e-01,2.029801817585502377e+00,-4.844298738152743589e-01,-8.464488991786820460e-01,3.005382665172760426e+00,-3.824408210304885980e-01,4.330246014791972464e-01,6.949334451029105519e-01,1.914627099461063131e-01,1.332475522843043159e+00,3.855079980489052871e-01,1.938901332678272804e-01,-5.858228351761538555e-01,-5.587267838464480274e-01,-3.181465319195044827e-01,1.566731516233103860e-01,-3.284923258389852441e-01,1.428402484807913098e+00,1.641895945054472339e-01,-8.267194704360892876e-01,-9.953348696019370667e-02,2.735160221949937576e+00,9.402398690929965053e-01,-8.053255313755429690e-01,2.363330616820768171e+00,-1.488256335967759192e-01,1.418122427430026367e+00,6.878489226191897288e-01,-2.808892307337432781e-01,-2.761958290939973137e-01
8.523853027598551346e-01,8.940817764891304531e-01,4.486199718933892022e-01,-7.121149684924592549e-01,-2.386682951544737419e-01,1.069154180352410166e-01,-4.501773368238200512e-01,9.968068372453373072e-02,2.240870028414902571e+00,5.342792189930464231e-01,-9.074384281451286505e-02,2.317202326549523683e-01,-5.897137825753291374e-01,-3.883367568465775355e-01,-7.705508982325959266e-02,1.451976583699438272e+00,-7.437168235453033294e-01,6.861994663809828365e-01,-8.609339610312760627e-02,4.224532679033687343e-01,-1.185159152524206005e+00,5.608447629671857726e-01,-2.513918749591524948e-01,2.065265045582989623e-02,1.530912440565993515e+00,-2.828864924858682794e-01,2.891363419173449412e-01,-7.049972121435019723e-01,-9.186090269844338074e-01,-8.102348076993011183e-01,2.470184005718371600e-01,2.978370187588371021e+00,-5.687510691872494917e-01,-2.790283469052272092e-01,-5.328953101262321468e-01,-3.002795213425087373e-01,1.596260694803502522e+00,1.154965749563674704e+00,1.490986559556990665e+00,1.871678603659169271e+00,8.382686037579926142e-01,5.842637362032944148e-01,4.961962378326911782e-01,-9.565213591236949864e-02,7.604732737748849392e-01,6.364634696989388551e-01,3.194022756995554158e+00,-1.092948727851120461e-01,-1.543663787490671957e-02,1.017300507574597557e+00,3.474346628178819785e+00,1.559026025730906984e+00,5.627980835676428262e-01,-2.175589285190833166e-01,-7.852762269887119118e-01,1.694371862359736136e+00,6.075871008339008839e-01,-3.545155291212009896e-01,-5.319694141511883689e-01,1.725705766646906447e+00,6.615778855807943337e-01,2.671953652637131249e-01,-1.017111082713466064e-01,1.336278446358294847e+00,1.413990415405343315e+00,5.927729273458710590e-01,-1.181678467894976547e-01,1.452747230190363670e+00,4.722093466820672103e-01,-7.794727093397113560e-01,2.393363027807679178e+00,-6.227610624188606447e-01,2.817469871121063840e-01,-2.175711299282492572e-01,-8.238794434597335181e-02,8.304851454919985887e-01,2.854224595951264098e-01,5.901168249843773417e-01,-1.386816253668573307e+00,8.895001924621648293e-02,1.589960217796391184e-01,2.980178433455735743e-01,-3.063363057725396743e-01,1.640212939620670385e+00,7.685589939629687839e-01,-1.056282188655030208e+00,2.026112881227706275e-01,1.960867455202330856e+00,6.825859983094336725e-01,-4.590085024088100818e-01,2.249845749543635698e+00,-4.476170265541938864e-01,1.239402892994682315e+00,3.700371958327446920e-01,7.751385494836393608e-03,-9.618032857955099990e-02
8.234350450629218665e-01,6.953067057589477074e-01,1.574703485684734727e-01,-4.092228302409514074e-01,-1.112523150199006966e-01,3.293500815127461956e-01,1.642664184279676587e-01,-3.928360259447275654e-02,1.272119950435836477e+00,3.857724244321454332e-01,2.726356576798774634e-01,2.435538508862518381e-02,-5.044429812026097748e-01,-7.825832953463709996e-02,-1.402783723610089295e-01,1.471149642685231518e+00,-6.111625961454284495e-01,7.197909550901920861e-02,1.061419178831603805e-01,2.941134070044979509e-01,-9.700638025480088356e-01,3.069056617473371329e-01,-4.060466215922933220e-01,2.079440118875385823e-01,1.432167907994296829e+00,-3.059085889031180061e-01,2.305187586290573520e-01,-6.833713838972252930e-01,-6.848931170464760410e-01,-7.214295447747202106e-01,4.238399961328987442e-01,2.647364152307704277e+00,-2.335485435739196314e-01,-1.501736236390704415e-01,-5.904674792353584722e-01,-5.656273855192001099e-01,1.424799699650926676e+00,1.063012778174223127e+00,1.513171450359814152e+00,1.374814536419704192e+00,8.188886939625988903e-01,4.657056512887060573e-01,1.568218628188149943e-01,9.194357073317051265e-02,6.038257686990758932e-01,7.705682720997080182e-01,2.707294162394151549e+00,-6.292185045928322396e-02,1.729658208241297568e-01,8.080187591976140116e-01,3.880683851199479228e+00,1.579232108783412247e+00,4.591332741130366712e-01,-3.893429089827977196e-01,-6.016409923564813855e-01,1.490767296348409543e+00,3.334038837197271787e-01,-2.645131284918300629e-01,-4.512274432909978428e-01,1.424448056425224429e+00,7.602469601799080046e-01,-2.495454291409304193e-01,-2.866345340605008785e-01,7.945939802725496826e-01,9.498368479999330649e-01,1.960283262533077664e-01,-3.933704650677385950e-01,1.190112007136565175e+00,-7.984085790596368026e-02,-1.499977966104792948e-01,2.453762948297617541e+00,-4.376361062887702547e-01,2.227604617754411209e-01,3.733851811742529003e-01,-5.515083289286336343e-02,1.102045355034069862e+00,1.316490668658604202e-02,4.450572755962854954e-01,-8.848501148098676383e-01,-3.693796152913482178e-01,2.142897748461979335e-01,1.089055119614833200e-01,-2.401583712323412667e-01,1.549450131137960707e+00,5.845096369249169754e-01,-9.763131304035382874e-01,2.058836141487431493e-01,1.682273106440282273e+00,7.582919889329504670e-01,-3.660435383235581819e-01,1.868126000227571915e+00,-4.364802596422443504e-01,1.063047479333129708e+00,4.078269674652508781e-01,1.074009053980352346e-01,-2.346969439687156544e-01
9.483780952563907185e-01,9.781183951254528441e-01,2.863837019743799006e-01,-3.829168932316268092e-01,-8.870535546870382537e-02,1.091012635034424583e-01,-4.618660249536709617e-01,1.315149303138842818e-01,1.804944964757610792e+00,5.235021739304032140e-01,3.083084397013932110e-01,2.083285980086939659e-01,-5.267647685621347220e-01,-1.606529200692526083e-02,1.050261491740323017e-02,1.788515557945836942e+00,-4.622263623249711073e-01,3.429058428135247083e-01,1.422649913393176924e-01,4.327815160537745731e-01,-1.129496195427274863e+00,3.200383631999679790e-01,-3.299398781754072640e-01,1.984897255729634324e-01,1.216859364267933064e+00,-6.404471656335014584e-01,3.096710298926401705e-01,-6.178339262715735192e-01,-2.225745684266655644e-02,-3.212830360894574078e-01,4.024753520788552086e-01,2.591601086378513941e+00,-3.437707077685767110e-01,-5.465775038783002859e-01,-5.186484499593806419e-01,-6.147965031634986532e-01,1.235546635027212403e+00,1.328347174194524305e+00,1.118748521006893260e+00,1.740401424476740511e+00,9.073647932344097722e-01,3.250684985858785514e-01,3.594225314114327663e-01,1.983473234979677424e-01,5.400661623829059454e-01,7.066696674753926155e-01,3.163792400409739969e+00,-1.809810552543132667e-01,6.089812340233635712e-02,1.461877291040838189e+00,3.710024473114784893e+00,1.021738759060418111e+00,6.067461598543519852e-01,-4.722224098951319782e-01,-7.724611644068093419e-01,1.488697189751027494e+00,4.968965734195693318e-01,-2.598296088442308971e-01,-4.041786284281233543e-01,1.120549767360232263e+00,1.261459405989566296e+00,6.874683175501977717e-02,-3.923163611510925852e-01,1.209089455933355151e+00,7.631206570179316362e-01,-6.206097029315593705e-02,-1.996245118646061134e-01,1.274798979312346425e+00,6.483210811687079023e-02,-6.878095349706581096e-01,2.837199953171515077e+00,-6.655623494558071673e-01,2.518921838336868335e-01,5.316921744221131396e-01,-1.788671690417051319e-01,1.475266776406171765e+00,5.289361712965430229e-01,7.847892262012078346e-01,-6.228931202442575810e-01,-1.424193229403536154e-01,3.670949583963523111e-03,2.269776193621184934e-01,-3.762470574231041587e-02,1.157973951199596341e+00,6.082169797113152754e-01,-6.883566905085324317e-01,1.826682264229712582e-01,2.192368563698800621e+00,5.180615892761327723e-01,-6.902996128246835505e-02,2.216996735177556133e+00,-5.928902803860646165e-01,1.244172084214061780e+00,3.104180822796812622e-01,5.556115863716595271e-01,8.182370752589851470e-02
1.079987354260799837e+00,2.058335247999118600e+00,5.802834289209166108e-02,-9.182876342722736673e-01,-1.868281773041102767e-03,-1.880733378266439826e-01,-4.636673756335196184e-01,2.656702717410058812e-01,1.606716406992338086e+00,2.094271859551893877e-02,-5.151380895397644766e-02,4.047711343004376516e-01,-4.421897981487243889e-01,2.138993636526925202e-01,-2.912572322835075833e-01,1.659002670198121310e+00,6.733608868355978050e-02,1.154291417288455246e-01,-2.630158589946687275e-01,4.978134156697653495e-02,-7.140235808712871446e-01,2.822708237627268857e-01,-6.635997902628814060e-01,8.354937057908773390e-02,1.609103205623489519e+00,2.535244340897007675e-01,9.259280881536925689e-02,-5.131325895219177591e-01,-8.491311470658601257e-01,-1.038585573497465386e+00,1.542149445691058940e-01,2.171668322671903351e+00,-5.239884644120021973e-01,-2.030980770329611773e-01,-8.475337939782358054e-01,-5.081941492613969436e-01,1.888397192005552228e+00,8.206663812296932647e-01,1.354896021471395873e+00,7.713422456139897854e-01,5.637372198281073166e-01,2.520007537771776773e-01,2.306260609305318399e-01,2.616060574861702182e-01,4.983175217713204930e-01,8.912139500303188910e-01,3.001309561972133277e+00,2.435643418435735341e-01,-5.445748950508248754e-02,1.450816692849163481e+00,3.631305447355330340e+00,1.336218729513741543e+00,5.910454599875706316e-01,-1.959581610859099099e-01,-9.076689187638997680e-02,1.183442858873624992e+00,6.230133707073615135e-02,-1.183505010163928006e-01,-1.217742125323142632e+00,8.057665869541105197e-01,2.606630969173875934e-02,6.226145567496602640e-01,3.323406347996643584e-01,8.376755751475252199e-01,1.276063052628103378e+00,4.162230055522612160e-01,-2.845138696197923034e-01,4.136878642645616666e-01,3.249148132241196363e-01,-3.695947567336932416e-02,2.312842656523866669e+00,-6.923687031137624182e-01,-3.193857374223307843e-01,-1.374874616260488291e-01,-9.450083788098817550e-02,7.549745841796282608e-01,1.023533797486558816e-01,5.986060802491236510e-01,-1.274430738941228825e+00,2.545917420439652856e-02,9.201843632529163042e-01,8.021476466537516559e-02,-1.730685308666048972e-01,1.325128156198963847e+00,9.243220743571793907e-01,-8.565707505992156134e-01,4.021660884412166515e-01,7.738515461990040922e-01,6.166894390230956979e-01,-3.901235527663655112e-01,1.755503877643540100e+00,-1.017617861433228077e+00,1.369502281264918242e+00,1.069366056948569677e-01,-6.540967544775508347e-02,-3.839161217426306782e-02
1.075305070541256347e+00,1.241278657230475480e+00,-1.012615379181657504e-01,-3.496222734388028663e-01,-2.054992834033298466e-01,2.307512805204380846e-01,-4.298549371552217724e-01,3.886048440243760616e-01,1.748765041824719590e+00,4.557608913574773268e-01,6.053687364013718986e-01,3.277360346856978968e-01,-4.249857295978994864e-01,1.915808661590662765e-01,-2.034255027355860723e-01,2.186519151575721409e+00,2.534464097106770009e-02,-5.128918890086486826e-03,8.677061656479206908e-02,2.498466367355036133e-01,-8.626915128527435916e-01,5.167515445627836046e-01,-4.068229026842256069e-01,1.814901191909072953e-01,1.239298386135219809e+00,-7.237250412313400716e-01,1.055592040418203703e-01,-5.418559373675979618e-01,1.249214917892593757e-01,-3.939674515887621187e-01,4.420930604605269321e-01,2.287665645815888826e+00,-2.414192868805622727e-01,-4.742677488509449701e-01,-6.251216445803470245e-01,-7.845421577756258591e-01,1.423100374715584815e+00,1.159386289326747921e+00,1.159068687337852843e+00,1.493504697827664041e+00,9.870416871569609452e-01,1.390031453148187213e-01,3.110735855361035362e-01,4.235866622756979671e-01,2.305396641630331200e-01,6.935506140805816067e-01,3.121106250218476319e+00,7.526095043545871777e-03,1.408114526236378117e-01,1.395772560507481330e+00,4.178094236699909203e+00,1.142090163108964163e+00,9.157735755552679491e-01,-5.374239310919491919e-01,-6.128115576008706933e-01,1.371112343936956135e+00,4.741843182918594746e-01,-2.556270166210204975e-01,-7.583990123133144134e-01,1.333550010030408739e+00,9.901882027573996048e-01,3.863011856593595583e-02,-3.854296727802339895e-01,9.112905763332019848e-01,5.031147174022856383e-01,-3.589371690674569848e-01,-2.839470312842206079e-01,8.733562107230928850e-01,-5.563391780729940589e-02,-5.291859073714324513e-01,3.125015103617948320e+00,-5.012434992563012948e-01,6.018917716841230836e-02,5.902705348186113588e-01,-8.028746272393846861e-02,1.398333889147928666e+00,4.192687490093178204e-01,9.542316173274636437e-01,-5.459251710888608500e-01,-2.546299124951845738e-01,4.652851698726850893e-01,4.235475506885127417e-01,-4.860496581163295526e-02,9.423913709356392943e-01,8.105118196161115174e-01,-7.329910973155218112e-01,7.202888367861892682e-02,1.946377095620919651e+00,5.671891931753285654e-01,-4.066044652943418547e-01,2.301997401451777669e+00,-5.521791716097074199e-01,1.324798622467814990e+00,1.907110866368832147e-01,5.947791144523087992e-01,-5.740321742863868648e-02
9.053761032683909082e-01,1.211569200973600768e+00,-2.280744899838009765e-01,-6.466378919139716963e-01,-7.223321874302340850e-02,1.300433023948731059e-01,-8.027438441635725841e-03,1.145022285022124775e-01,7.178352504284104540e-01,3.087099596814525948e-01,8.837643451249251880e-01,3.190774616687523935e-01,-3.120798405510269991e-01,2.542976029738406862e-01,-5.173903799067669507e-01,2.089075682714192084e+00,1.512011456749602356e-01,-1.403279821597447352e-01,-3.332031370170181889e-02,-2.197600195681253393e-02,-5.029932040055774545e-01,4.908577547930623730e-01,-5.160158860013752680e-01,2.110124279257492852e-01,1.569028920804906857e+00,-2.994852100144430596e-01,1.822218311277955249e-01,-5.378557923723892298e-01,-4.104188975115879989e-01,-9.249727557660725186e-01,2.421578507120037693e-01,2.114949028166843714e+00,-3.150122936918315908e-01,-1.038884758003682518e-01,-6.796494610395685809e-01,-7.807762912002247369e-01,1.425343496899105444e+00,1.028912665325502740e+00,1.823524414764617685e+00,1.208450207033644253e+00,5.887852478779662668e-01,9.008293221303959042e-02,6.455338756458542382e-02,2.144782975876498021e-01,1.278520615746015499e-01,7.769193413916362090e-01,2.653626437347011979e+00,-8.967060322820799567e-02,-1.615064043007180539e-03,1.210380187260803542e+00,3.960006689415741743e+00,1.417650649139535979e+00,5.429857089340515142e-01,-5.233032110410740234e-01,-5.130199794017659132e-01,1.519790408168039786e+00,6.411140853968921860e-01,5.530016066248819029e-02,-9.911515312400576150e-01,1.510321214289445102e+00,5.157954584525142883e-01,-5.330949297021578270e-02,-4.710538595564189857e-02,9.040543912679926963e-01,7.504854709316248762e-01,-1.722306001312776669e-01,-6.553095753897465459e-01,3.057099925004660990e-01,1.516818369621079632e-01,2.547833648038851373e-01,2.559177639485786582e+00,-3.645153230844314640e-01,4.866111114419738315e-02,4.015788108320005323e-01,-2.548107534154178122e-01,1.166534536496280694e+00,-1.447161382465225188e-01,1.067922391491462397e+00,-7.866767950821589306e-01,-2.879725408325748415e-01,8.253457790170590780e-01,3.973151912771659688e-01,-6.093317997216604609e-02,1.254614596826045592e+00,1.120179379457127977e+00,-1.036134395010938958e+00,2.799387592753732057e-01,1.115543261912426365e+00,5.252094229410312343e-01,-1.166681778719578788e-01,1.794584262021095000e+00,-5.341560750229873422e-01,8.132618200587083956e-01,5.108880694296361047e-02,9.083861891252549281e-01,-2.106111764980661827e-01
1.032266122607239156e+00,1.008059963475100407e+00,-3.016195606361121717e-02,-1.744380982415220105e-01,-1.237254453322761544e-01,2.689501732432983405e-01,-3.258753996752111193e-01,2.683344069041682101e-01,1.530773928056210487e+00,5.048637547679631910e-01,6.861346772007035355e-01,2.190697672805916596e-01,-4.421737337338936813e-01,2.259485725892443342e-01,-8.796838333852186054e-02,2.132621460057689156e+00,-1.230408793201533124e-01,-4.652906974052816585e-02,2.338464530409008479e-01,3.353869521398031850e-01,-9.522452558464110650e-01,3.578695663209219835e-01,-3.877030967504753733e-01,2.704027573221218228e-01,1.104318801404507555e+00,-8.722064821492863107e-01,1.900339489320057307e-01,-5.589048853393592253e-01,3.888339638880720095e-01,-1.719591802541087233e-01,5.239960246261174959e-01,2.302187896555186075e+00,-1.457394343553340965e-01,-5.669983967884981713e-01,-5.604560483704131846e-01,-8.503485769734351329e-01,1.185134498593702901e+00,1.289114901058639795e+00,1.043004968215899941e+00,1.564933789994152447e+00,1.013440184263035615e+00,1.394600927330416629e-01,2.520482402966632285e-01,4.356843336731234251e-01,2.702738835525806960e-01,7.164307909656760787e-01,3.057699896363987868e+00,-1.061004817495269648e-01,1.808989549023085064e-01,1.463207792631874504e+00,4.156197756087428807e+00,9.656142710932467121e-01,8.053244947267161891e-01,-6.278681236292338319e-01,-7.048369023677651946e-01,1.363046004494660624e+00,4.509583557496111839e-01,-2.422317642630819057e-01,-5.033077154864906699e-01,1.118790423930659639e+00,1.358952812278240607e+00,-1.518703570874594955e-01,-5.649254402007538589e-01,9.211861668983742923e-01,3.164893604254072068e-01,-5.151759796027313154e-01,-3.100714225384511025e-01,1.029379317583622111e+00,-2.339801663471753890e-01,-5.244998697751610539e-01,3.188758518469998471e+00,-5.274688293465341626e-01,1.715277870916351866e-01,9.060202698129418142e-01,-1.327665812905570453e-01,1.682876861699303062e+00,5.038412750152574393e-01,9.216276384822135181e-01,-2.527814555771175087e-01,-3.698028957310606213e-01,1.822441928833720137e-01,3.214082898970821445e-01,3.364529004528404865e-02,8.843795258498523548e-01,6.340095168537038806e-01,-6.093353573210071872e-01,7.909091811973473218e-02,2.188055554194836994e+00,5.249278406607044145e-01,-1.692959166927286430e-01,2.249241903155980271e+00,-5.443924995931894717e-01,1.257453558606542732e+00,2.531020286288852006e-01,7.664090304617747762e-01,1.128089940069576524e-02
1.097071353030613761e+00,1.883973994161901366e+00,-1.023002374714316043e-01,-7.294917809986244395e-01,-7.375468756948645732e-02,3.463240412493928666e-02,-2.200710862800920320e-01,3.162713339860163675e-01,1.525187577242661963e+00,1.713055091527884710e-02,5.014046451104053892e-02,3.163784106068183166e-01,-4.277676158363987180e-01,2.609234682760378510e-01,-3.100812930441845250e-01,1.701860126742669399e+00,8.936197169586046485e-02,-1.382179270198874432e-01,-1.865465191903328546e-01,3.293304647165646443e-02,-6.761575636065435546e-01,3.103820051383210377e-01,-6.758030115234157087e-01,1.164157986750508078e-01,1.553123661646297116e+00,1.419273372842937697e-01,-9.608302318738548564e-03,-5.247436876441188280e-01,-7.927274230444363301e-01,-9.829364989896860472e-01,2.855747501922140108e-01,2.139518831241791652e+00,-3.541377346751574673e-01,-1.403032759051313083e-01,-8.674551091341787812e-01,-5.971631362889978645e-01,1.922796449830018073e+00,7.386659953142161728e-01,1.321774922514565631e+00,6.541979036657029623e-01,6.974233962498862516e-01,2.522297631508048088e-01,1.620069964846000965e-01,3.698339130368046290e-01,4.337661503564799181e-01,8.905140051512669963e-01,2.873374192769835744e+00,3.368515906284293981e-01,9.729803011077842179e-02,1.186431630511041613e+00,3.980416988026899805e+00,1.490689062130981402e+00,7.166363177711784216e-01,-2.453339438801014349e-01,-4.621660731869720040e-02,1.108498722610610221e+00,-5.063714990926382331e-02,-2.052242386531480112e-01,-1.181443283728890847e+00,9.344202198289177641e-01,2.247975557987366702e-02,3.667727095012119909e-01,1.742985581736564704e-01,5.351029727741644093e-01,1.070327017406485393e+00,2.585028847176465971e-01,-3.217142765198817145e-01,4.622020478688048661e-01,5.582899497136891570e-02,4.193582248933042100e-02,2.472701309005236769e+00,-5.539533704993592211e-01,-3.339775414165714884e-01,3.744017152677012183e-02,2.871807616898569560e-02,7.677897674257101457e-01,1.925557205428163332e-02,4.829727357005625388e-01,-1.137099966305021415e+00,-1.832680504528384768e-01,9.587556993145401885e-01,8.876752777846969034e-02,-2.287366045531747105e-01,1.295655583019685197e+00,8.299595814367152213e-01,-8.720370358023344926e-01,2.957366089450766400e-01,8.326471030947795171e-01,7.409140676254704072e-01,-6.443906611795515715e-01,1.772105361964682491e+00,-8.976285313600276261e-01,1.419876445358796424e+00,1.748982369572120166e-01,-2.328390820030625252e-01,-1.760517518124660452e-01
9.287252058498325358e-01,1.311266342806786556e+00,-5.116123306054414649e-02,-6.275603343638871401e-01,1.217214865681187641e-03,2.897633182091563508e-02,-1.531799194352707061e-01,8.347684818475328838e-02,9.249589513113674055e-01,2.847646555098954924e-01,6.395638851676406222e-01,2.916041360089688395e-01,-3.723693856442720218e-01,2.376688083846037469e-01,-3.519900115833785037e-01,1.932997292069646100e+00,4.434403710113443697e-03,-1.626720157202456163e-02,-7.491191878407979510e-03,8.274898898032741201e-02,-6.608880573961178895e-01,3.350487802093496947e-01,-5.242897671310059460e-01,2.220421263783242116e-01,1.481766824210930533e+00,-2.609031804966373547e-01,2.345605657884742568e-01,-5.432923581980551031e-01,-3.356284933078300670e-01,-7.843237118779601280e-01,2.555841782169133714e-01,2.175437289444420941e+00,-3.464116174401178361e-01,-2.330574293082662840e-01,-6.685507578382046123e-01,-7.245839111890297612e-01,1.384009498214716860e+00,1.091386423723309296e+00,1.586423257368470452e+00,1.207624219655203390e+00,6.014336099540020797e-01,1.435992053703945004e-01,1.113234872549861698e-01,2.172127779325175867e-01,2.801060639781567385e-01,8.109931254146890423e-01,2.775252284125431235e+00,-9.484076591867429684e-02,-1.551565055251692693e-02,1.386117510762745475e+00,3.787533297836818580e+00,1.230915179582140029e+00,4.826001247512467507e-01,-4.828475798186093737e-01,-4.902035919992016044e-01,1.441860256911823512e+00,4.973112155755864960e-01,1.077864613031355445e-02,-8.681787509650965573e-01,1.160039469593939554e+00,6.670326092787954853e-01,6.774870768899171614e-02,-5.501084999924774066e-02,9.755547703918169278e-01,8.063521170852734343e-01,-8.663514137861938469e-02,-5.333047590141535288e-01,4.838456673315504331e-01,1.371177344838955536e-01,8.861513775052365371e-02,2.538746373291902447e+00,-5.106600153960620947e-01,3.702217062396633007e-02,4.281462548032707316e-01,-2.617798938889419613e-01,1.252527724188808422e+00,4.000386172404463148e-02,9.412275025023254527e-01,-7.484870886812068358e-01,-2.234430904020591746e-01,6.206312232705588627e-01,2.520522190839984411e-01,-2.703001745360805730e-02,1.226816562702357949e+00,9.528287325438995481e-01,-8.876111044362664515e-01,3.233947360914897207e-01,1.247779547741712847e+00,4.973606255913106677e-01,-8.787708315134423742e-04,1.793791709442337901e+00,-6.773673951759818790e-01,9.421820066675250516e-01,1.046204766161431821e-01,7.757566251612806330e-01,-7.783201418707241803e-02
7.977566691312580893e-01,5.300740729163181397e-01,9.290292432629808361e-02,-2.320764940893288997e-01,4.923923820872935786e-03,3.092776398029816187e-01,1.933126473340570084e-01,-1.290814623685001272e-01,7.630910686533413090e-01,4.743293288882666214e-01,7.163272809003307096e-01,9.748360355774490782e-03,-4.440922963682131797e-01,1.051505131922545050e-01,-1.319215703016067276e-01,1.727893984839714348e+00,-4.887277832411178746e-01,-5.108947635580157742e-02,2.784629098733067964e-01,3.013782440467641655e-01,-9.138278128456239768e-01,1.932441225360753134e-01,-3.940762112493463865e-01,3.384100635019017256e-01,1.268418001792407157e+00,-6.118367164835673000e-01,3.437875986256215266e-01,-6.442739919568344353e-01,-8.637357152315816577e-02,-4.321595362804632190e-01,4.713682079295166139e-01,2.452801346889780021e+00,-1.304485573469704174e-01,-3.033392206536863478e-01,-5.097257983882186316e-01,-7.706953444354111005e-01,1.033887233438274489e+00,1.282781942042566126e+00,1.467925461913748730e+00,1.509496833054364107e+00,7.857834985856433363e-01,2.868241355849865948e-01,5.718727288869782099e-02,1.658945634224899823e-01,4.267882051940805610e-01,7.803202009920870985e-01,2.634473449518276222e+00,-2.753691867460086318e-01,1.508873599414206068e-01,1.116592281877727411e+00,3.896215575246496421e+00,1.213590434736613544e+00,3.649487319974429322e-01,-6.071451091641641984e-01,-7.614980395548689440e-01,1.527085598711089620e+00,5.055824760321510070e-01,-1.090156478244166671e-01,-2.860139476537629788e-01,1.208740899218579967e+00,1.282647171786468254e+00,-4.547285610826498070e-01,-4.924140013091239387e-01,9.156129862603954450e-01,5.420197994058959523e-01,-2.523208776175159818e-01,-5.368630650588273046e-01,1.066372517112496698e+00,-2.271019105449957332e-01,-4.251608697563524775e-02,2.664680360610501619e+00,-4.416338295457084007e-01,3.485953361319475419e-01,8.829856403801308318e-01,-2.333676038093890348e-01,1.601245108735577238e+00,1.158133654216570441e-01,7.372716472531856136e-01,-3.689591094518982484e-01,-4.920998023168805524e-01,2.942688329738285535e-02,1.362524895045864048e-01,-2.300300629058138480e-02,1.295400099285444639e+00,5.774634308085064838e-01,-8.127683796782940728e-01,2.242175598563793948e-01,1.904267740043751544e+00,5.707080426134907292e-01,1.098492827975597330e-01,1.830001174299265010e+00,-4.315874282410333551e-01,8.487867190187126099e-01,3.362078747136824641e-01,8.049177466451222784e-01,-1.080927458062951874e-01
1.108130948070210620e+00,1.177633923922493109e+00,-5.778099867870590822e-01,8.108721013184039261e-02,-1.153057256988422735e-01,7.498907070456388713e-01,7.904782983755038739e-01,2.843308833315111306e-01,7.117885267063206456e-01,-4.818213655786215965e-02,4.838617966789842129e-01,-1.235681609481907861e-01,-3.783675724459987788e-01,5.748636812174220401e-01,-2.484961044723207058e-01,1.731242176384166109e+00,5.994787030872178457e-02,-1.142688591564327893e+00,2.397864598847023743e-01,1.960075568213851677e-02,-5.825233363156417932e-01,7.721785191429897388e-02,-7.823733338568862328e-01,3.739770000866420308e-01,1.216445033607815862e+00,-2.659090675783616353e-01,-2.409521664704286914e-01,-5.585949258080147306e-01,-2.948246856329370669e-01,-5.696165028756898785e-01,8.032068643109953054e-01,1.906642902415645491e+00,3.457482799395911743e-01,-1.690919390124687172e-02,-9.032307374130944533e-01,-1.007868028156985840e+00,1.740963355246322397e+00,5.811513525808402747e-01,1.065526250143901343e+00,1.162379404531916904e-01,1.076938904831068911e+00,2.097937726096923416e-01,-2.307626406109390960e-01,7.776160738604330769e-01,2.605410569565124179e-01,9.902985068863544571e-01,2.266630508941266164e+00,5.354772610333106142e-01,6.365217611099843742e-01,4.697534562390424107e-01,5.071015120459691161e+00,1.724251185257122065e+00,9.041378973995358725e-01,-5.206947839457136684e-01,1.190856705244438540e-01,7.565178861528492060e-01,-5.808527558095402110e-01,-4.029034263728811238e-01,-8.111856947664869422e-01,8.328581990408703284e-01,3.859916715082415961e-01,-6.959950312404852291e-01,-4.872628557792703097e-01,-5.486592868118046473e-01,1.473820977203115223e-01,-4.638230552485396174e-01,-5.408378427702242863e-01,6.335008575735929792e-01,-1.108800302992390296e+00,5.323760492318675430e-01,2.981280513723369552e+00,-1.526417185966422729e-01,-3.326579568975038259e-01,1.067352393565737412e+00,3.408712805887252895e-01,1.184214693221121273e+00,-2.201433244171861203e-01,1.629542875799550039e-02,-2.688424453797553237e-01,-1.055935393608291584e+00,8.140961900703043153e-01,-1.186316614503781230e-01,-2.735325345557720889e-01,1.112430581362036319e+00,2.823246883361346660e-01,-7.242378634788282366e-01,2.821315013739700284e-02,1.066982233307796291e+00,1.080227494418067868e+00,-1.077269163789912332e+00,1.575931904333871980e+00,-6.155357406752217653e-01,1.467926356693213918e+00,4.458298349854645237e-01,-5.685405925439319663e-01,-5.254019648538923448e-01
1.002752460777730725e+00,4.585410091184667358e-01,-7.889639189567112521e-01,3.923555379564811485e-01,-1.380632093507067615e-01,8.615106756605879212e-01,7.163706162063367966e-01,2.298478612225887119e-01,2.841499651534795667e-02,4.277664806314538382e-01,1.703491827897153588e+00,-2.937305095306307068e-02,-2.279320780514315081e-01,7.087709187237901665e-01,-3.975772992529514882e-01,2.578982506899463623e+00,3.378268504196870192e-01,-1.168771150533448377e+00,5.456210985405870462e-01,4.642976264965633509e-02,-4.498647571524686528e-01,3.193113846541696943e-01,-5.392173200137059252e-01,5.301345336721797752e-01,9.765750174754153079e-01,-1.235608260713607409e+00,-1.888216014087798489e-02,-5.147529706285005613e-01,9.006465988090903707e-01,-6.323456457610188153e-02,8.512892138144322329e-01,1.743702906292669441e+00,4.636040039850296002e-01,-2.847228946670251060e-01,-6.250644684539499174e-01,-1.394008659827076890e+00,9.486693113320996407e-01,1.119325254938321246e+00,1.298268008638908677e+00,1.005378947561774705e+00,1.129360885146844629e+00,-1.524785790106651384e-01,-2.535106492196176897e-01,8.002404259489741545e-01,-2.694456865949115265e-01,8.002012312662486471e-01,2.271211189206380432e+00,-2.865129425951284947e-02,5.466687182379674770e-01,8.970540395730225436e-01,5.220206430734185332e+00,1.224113897539973683e+00,9.270857778113645864e-01,-1.011531230694501460e+00,-5.693771192022142325e-01,1.185609232263113766e+00,3.279589783979252049e-01,-1.262041072930849550e-01,-5.070816320521986942e-01,1.341297970579905297e+00,1.483445961856159068e+00,-1.177416586512094909e+00,-1.009954491395713472e+00,3.942558423620012853e-03,-6.596072548056099993e-01,-1.436240581956337525e+00,-8.398609443451896528e-01,5.040276245611385875e-01,-1.125730167833199458e+00,4.258662622568723521e-01,3.602510492802209363e+00,3.240101538255102387e-03,1.495834929850642370e-01,1.883710399510380107e+00,-3.236557541456906023e-02,2.082173227052680708e+00,-3.255020897442617578e-02,9.823716695348269079e-01,5.914966298497921215e-01,-1.188958591203274517e+00,5.033170918357188217e-01,3.780296504752356235e-01,9.666378899795691204e-02,6.409052458929884732e-01,5.872456254895006555e-01,-6.594485289934284289e-01,-1.008635449978889098e-01,1.913293961708486091e+00,6.844819683682880074e-01,-3.288111392799708543e-01,1.911911669997597318e+00,-2.123430946526258523e-01,8.998603700457032950e-01,2.468012130655797276e-01,1.184458332924503532e+00,-3.938783648704954898e-01
8.048985092737341862e-01,2.194837864306377062e-01,-2.923321976278960704e-02,1.038149736333360273e-02,-1.926606891379541442e-01,7.928265251115635959e-01,8.032298736983395360e-01,-7.074517729970207502e-02,1.044932753823237803e+00,3.334730159779268899e-01,2.669679536951640730e-01,-2.788754233355391077e-01,-5.275334815212820994e-01,-4.562998959537370447e-02,-6.789977112206402321e-02,1.270632846767040691e+00,-8.204523526642366615e-01,-4.165402644936092025e-01,3.007650344384065755e-01,3.252502178036768554e-01,-1.001167033251138871e+00,2.044701276821272173e-01,-4.465534151231326243e-01,3.013274779530491498e-01,1.308078966388397379e+00,-4.061974027877118254e-01,6.812466499506644735e-02,-7.500849796515982604e-01,-7.371331458053999031e-01,-6.057569531529809481e-01,7.218722857625541334e-01,2.697119867857642461e+00,1.361952313758209576e-01,7.442565568197972992e-03,-6.226861938137839836e-01,-6.764275163748010300e-01,1.473559357119403668e+00,8.861311537621624490e-01,1.396685842956598922e+00,1.055621763902922616e+00,1.071038362815470046e+00,5.845974960552654531e-01,-2.368315105151654054e-02,2.478072911268518475e-01,6.519374846754950603e-01,8.181611883946613428e-01,2.363150468643079982e+00,1.248555415076799957e-01,5.147477188477074250e-01,1.602234695862778113e-01,4.477822564687367723e+00,1.930556849170448119e+00,5.673283316378944230e-01,-4.371795975780241594e-01,-4.739075168829816054e-01,1.300785782678535840e+00,-5.699918252582181211e-02,-4.809126678903941077e-01,-2.130898642464212900e-01,1.504655751144140297e+00,7.756637890467182883e-01,-8.368811965088287508e-01,-6.144948717085150225e-01,1.140358639039473765e-01,6.398431579192940255e-01,4.270058482504168751e-02,-4.432237550385824121e-01,1.477114973535807119e+00,-7.092150244935815362e-01,5.862593801517562708e-02,2.605065481684359252e+00,-1.967644741124499053e-01,2.222326652622146348e-01,7.339877343851508584e-01,2.208712398957664580e-01,1.106096284974010580e+00,-1.846062440182834885e-01,-3.643571700062719909e-02,-6.375454175896798636e-01,-8.394928309353314466e-01,1.131967683555732407e-01,-5.754294916841889984e-02,-3.938027740384225650e-01,1.634267301666582961e+00,2.060691314031445343e-01,-9.854452270151237148e-01,3.694761533063234404e-02,1.797223318243909462e+00,1.072137966983997881e+00,-8.428569984084661737e-01,1.764241478441445521e+00,-2.299363208465294295e-01,1.173525479460745924e+00,6.508977029103417689e-01,-4.789228481559720252e-01,-5.129277585209168766e-01
7.014119640010129109e-01,-2.603186307278571032e-02,4.368299078036138039e-01,-1.120271040241405114e-02,-4.167029268725452873e-02,5.005166480773730608e-01,3.486139008008700690e-01,-2.833057995782544691e-01,1.217861693772508414e+00,5.943860288417401883e-01,2.574317912580676437e-01,-2.488757501497903535e-01,-6.081628188263740187e-01,-2.134597244144443851e-01,1.882232387195763579e-01,1.222826137832992988e+00,-1.179571832530331932e+00,1.672602974470708270e-01,4.198662589505399723e-01,5.903503635801562455e-01,-1.328507083309712122e+00,6.674321868170401961e-02,-2.628319890967976691e-01,3.392045664445522135e-01,1.145638461359395288e+00,-6.869302666810815916e-01,4.124886222136170399e-01,-7.797088864975523226e-01,-2.864016356194756252e-01,-2.356022171001538323e-01,6.278385304105953413e-01,2.951450268072543182e+00,-6.237596672915812768e-02,-3.497927953372070298e-01,-3.998072983377640166e-01,-5.896899933471914101e-01,9.754460915394171927e-01,1.357444341758636597e+00,1.244781723472477175e+00,1.763531606153802667e+00,9.906096915545316017e-01,6.122165179693751513e-01,1.467160104830454448e-01,2.972293536574792394e-02,8.237000206349582854e-01,7.503905083249889918e-01,2.680865191262781000e+00,-3.078102209691230828e-01,2.926445734180034841e-01,7.590935313742901425e-01,3.814906351052870459e+00,1.351148487579928226e+00,2.801395888397572032e-01,-5.165949815295393099e-01,-9.160297295121625494e-01,1.564059194800037744e+00,3.308042676354366884e-01,-3.752478038499726942e-01,2.297193607746410571e-01,1.229520702235027629e+00,1.572904240608687054e+00,-6.705317754723969514e-01,-7.402150659288219137e-01,8.859440365823326724e-01,6.933736430734011025e-01,3.573969830235462775e-02,-3.268420089542052320e-01,1.870288224751420536e+00,-4.060749604075205577e-01,-4.219995002243170923e-01,2.590932042247874101e+00,-4.885798482400058873e-01,5.621308624429453005e-01,8.840465476017662638e-01,-8.611772267320526308e-02,1.586281122017393130e+00,2.554845169451671061e-01,2.554440973218270461e-01,-4.290751077272219050e-01,-5.624631714292285256e-01,-5.492919757666159253e-01,-7.159068084000147492e-02,-1.679275460024343691e-01,1.556978780381198080e+00,1.344520509468842828e-01,-7.822752019716441296e-01,1.480621620327716159e-01,2.485419718544367385e+00,7.532899316318404370e-01,-6.178294244054016726e-02,1.927970039793746926e+00,-2.892114655773959098e-01,1.009722990877800930e+00,6.448399190613275378e-01,2.203628160983927553e-01,-1.302429995453733280e-01
1.094374281290854123e+00,4.331669863152795008e-01,-5.056489059300093292e-01,5.048604229298991886e-01,-4.057479169749169112e-01,1.223972683344174417e+00,9.210826572588646233e-01,3.994943441488104652e-01,1.496999463845543055e+00,2.380883153015586895e-01,3.429426390239854738e-01,-3.200502806523364829e-01,-5.009382414574486964e-01,2.584782937219785581e-01,-2.527982013991436627e-02,1.640505205834886127e+00,-4.146375070967422971e-01,-1.087203367342453264e+00,4.330044818198112710e-01,3.024449506493742668e-01,-9.448194213724268042e-01,2.800030221454068435e-01,-5.512658311926713628e-01,3.394154525496600461e-01,1.006188887166808321e+00,-7.671831118884024914e-01,-3.318033321464458618e-01,-6.822804381589991918e-01,-1.911095573264747216e-01,-2.312912880615793920e-01,1.090115969892106129e+00,2.396404346207350766e+00,5.435142320959731599e-01,-9.496288146922068907e-02,-7.698030096071951656e-01,-9.611600202857337738e-01,1.738665651955178859e+00,6.423667084529995908e-01,8.111030165654753432e-01,5.953346724958261671e-01,1.559948597892949929e+00,4.488030412716094153e-01,-5.583224968400703203e-02,8.048238512354444207e-01,4.105980753138170902e-01,8.283493267321241360e-01,2.417553556707188633e+00,5.754420159358987208e-01,9.156358614546868946e-01,-8.146129112291877750e-02,5.514698157057967620e+00,2.004754774105918180e+00,1.224314826320616501e+00,-5.397806643180358410e-01,-1.669486263815327942e-01,8.379769606586962016e-01,-5.809958256088215700e-01,-8.058226266001049520e-01,-3.588027946892303754e-01,1.414613362433865706e+00,7.672492739915741655e-01,-1.103267292929371868e+00,-9.934304533937419190e-01,-7.145468372443689598e-01,-3.774421012205908532e-02,-5.291388336746101206e-01,-3.056002011045420019e-01,1.496752807351245496e+00,-1.430821134300332531e+00,-9.955621863148078621e-02,3.401383662202348113e+00,-5.787087264513990359e-03,-8.035290230154133739e-02,1.197915295745455300e+00,6.246797884453901828e-01,1.207902771124668151e+00,-1.759152329627017286e-02,-2.734408302485915598e-01,-1.827147448726362811e-01,-1.243088819039278370e+00,3.672243944990343789e-01,-8.099392333103694330e-03,-4.622518409721708132e-01,1.170045731667886724e+00,-5.733300178509836975e-02,-7.511743216792796662e-01,-2.954517643583349229e-01,2.028658901372400791e+00,1.338972901459017928e+00,-1.675995326696062326e+00,2.061573421685102492e+00,-1.957878251716123619e-01,1.744848546155516544e+00,7.464943294699855070e-01,-1.074304622602330950e+00,-6.924693138974471474e-01
8.860145229518230359e-01,1.087609500950369013e+00,-8.068601556533616659e-02,-5.080053060652447439e-01,-1.926807002846177286e-02,2.140733380834149990e-01,1.890045941977106791e-01,1.054334155363162440e-02,7.912655581403025273e-01,2.282677029324232110e-01,5.324242524548377098e-01,1.314725329273911392e-01,-3.969124631420044014e-01,1.987524336098226985e-01,-3.228970289887360678e-01,1.709662731260291224e+00,-1.756304098453683182e-01,-1.886728309420852290e-01,4.371030793814537768e-02,8.936583720182281199e-02,-6.823776384825215313e-01,2.659210491644365404e-01,-5.524348088267957424e-01,2.486330787302157841e-01,1.491668299429368627e+00,-1.742525817749025763e-01,1.774131005931995075e-01,-5.921624801648338599e-01,-5.656433623422878476e-01,-8.404546157311209020e-01,3.551223856599371453e-01,2.255873547117814404e+00,-2.171912538611427967e-01,-9.556046623566227805e-02,-6.926540298358608849e-01,-7.104846776136833908e-01,1.455188199401385774e+00,9.732584203161405156e-01,1.610289788491040763e+00,1.020574058459793321e+00,6.608619063451306452e-01,2.559783192393246809e-01,1.943048163922973456e-02,2.180472713110720995e-01,3.750937940014879013e-01,8.483671386895562661e-01,2.574261312197033913e+00,-3.434536713188905688e-03,1.189986103450611232e-01,1.015820711228198281e+00,3.961627647780827211e+00,1.476541207343208928e+00,4.533777787102501455e-01,-4.496865606061345444e-01,-4.028790323811720087e-01,1.374548811854775288e+00,2.934287054918298665e-01,-8.139840052447845642e-02,-7.644876188373403991e-01,1.207806720109596332e+00,5.529664621984072825e-01,-1.706218969743749092e-01,-1.237192489993879929e-01,6.724250034407232013e-01,8.117105036934710860e-01,-5.430822701052440138e-04,-5.616573507816685629e-01,6.288647731195465829e-01,-8.917574624689536544e-02,2.455689056212195243e-01,2.449447888335875678e+00,-4.094193393494766076e-01,3.449023505973600190e-02,4.686402289507800578e-01,-1.348353268172102215e-01,1.142004932987858989e+00,-1.252229093502030821e-01,6.400312858164736163e-01,-7.718929293725076413e-01,-4.078803459209439097e-01,5.833774509715499157e-01,1.262205534667667495e-01,-1.393092517453464740e-01,1.386492042235963673e+00,7.788543671159113835e-01,-9.487830772232637155e-01,2.876249276422527257e-01,1.182513047392770522e+00,6.677835306293484763e-01,-2.238226241191499655e-01,1.667515337727666358e+00,-5.951507409087637424e-01,9.627483447509226355e-01,2.336597708938547013e-01,3.917679120179786145e-01,-2.271999398969331285e-01
8.802499836623315366e-01,3.557869941508330358e-01,-2.294975877971143774e-01,5.496021322574484724e-02,-1.567703075005954516e-01,6.144848570466332482e-01,3.389654445519366122e-01,7.753585478560379163e-02,7.859365135748351827e-01,5.549943186490193803e-01,1.070951531837872839e+00,-1.665069458838638883e-03,-3.870887863199322099e-01,2.260062832240550268e-01,-2.109697361615257283e-01,2.088780446344210784e+00,-2.499148497623949194e-01,-3.981338638514745343e-01,3.890167299407870094e-01,2.650877329481526878e-01,-8.156105809418923158e-01,3.708157186115195736e-01,-3.691385651639346177e-01,3.709188008104082890e-01,1.136614722093850727e+00,-9.867794421413673689e-01,1.781222779560380498e-01,-6.209867415912568855e-01,2.896178628640331265e-01,-2.466898656957106084e-01,6.526687644586389725e-01,2.322369920151957867e+00,9.618758749171685274e-02,-3.169317068043354668e-01,-5.168072085970453200e-01,-9.763546328923611295e-01,1.035654282616313759e+00,1.239304685408773476e+00,1.382551680254785920e+00,1.512501739362599018e+00,1.034830026640167544e+00,1.699021469616174840e-01,2.737106004422557026e-02,3.950279102510309004e-01,1.732110920304722468e-01,7.186188773370748573e-01,2.594138013026169087e+00,-1.768340512100761153e-01,3.388093379980181008e-01,9.187796689483384016e-01,4.488987045340760318e+00,1.305999542578111239e+00,6.987765134241885612e-01,-7.536294004434208604e-01,-7.903098205188733294e-01,1.462149428061051637e+00,5.196459705670721796e-01,-2.124801925386634593e-01,-3.153187827840917556e-01,1.518352444912072885e+00,1.407865239827340353e+00,-7.619109477666622388e-01,-7.805988165774643273e-01,6.036250643073536315e-01,8.505404240890590550e-02,-6.959248543391118869e-01,-5.787449076705352136e-01,1.042900206953908171e+00,-5.535145470830277192e-01,-8.526735235032190108e-02,3.138385393044375249e+00,-2.360778763498910526e-01,3.386408407675972065e-01,1.204547511802336990e+00,-9.508048997379278666e-02,1.739546630840488328e+00,1.215299098781996157e-01,8.335019907901231040e-01,-5.751376021081933132e-02,-7.399867430547165670e-01,1.514641000639963542e-01,3.279061301415465701e-01,-3.216298060602246212e-02,1.058657082684392403e+00,5.770094833813494972e-01,-7.982856010352314957e-01,1.015354107529581329e-02,2.155469492064389314e+00,6.613987476158872392e-01,-2.370470404154346455e-01,2.049342969237637480e+00,-2.232599659683236482e-01,9.390598605563569290e-01,3.463378730156388974e-01,8.657555920473045674e-01,-2.577065655987905157e-01
1.016674723252993573e+00,1.435245588205513290e+00,-3.733207366418412471e-02,-8.720348066904133333e-01,-3.481590509558865065e-01,3.419968496820771642e-02,-7.221849731853446919e-01,4.506338050597317180e-01,2.106704662121280158e+00,5.107603687897884770e-01,5.083431225528612929e-01,5.733763960905294832e-01,-4.049191107765837683e-01,-8.388439461782974671e-02,-4.603600328230833538e-01,2.221211402353857167e+00,1.065993672571697304e-01,4.360755385412919960e-01,-2.381693205001241265e-01,1.279608254791276822e-01,-7.445617793582355315e-01,9.152955601421794984e-01,-3.200438987849822947e-01,-2.886124939277995294e-02,1.622122382236176552e+00,-4.334326009536908497e-01,1.216157275547162797e-01,-5.545115091306549449e-01,-5.672408329849794040e-01,-9.495161670797638287e-01,1.347232982716576322e-01,2.480657730869761490e+00,-6.106869725647181557e-01,-2.678754546137162573e-01,-6.371024083633436419e-01,-5.323840025074546567e-01,1.733373057657006555e+00,1.068144389073226730e+00,1.686538369649341007e+00,1.773819744442195034e+00,7.892404535157817591e-01,2.051163159364809141e-01,4.987462136081459718e-01,1.296172871255179548e-01,2.214310217780239287e-01,5.782080291813385120e-01,3.279413467417116479e+00,-2.090900167113492886e-02,-1.075614199041332458e-01,1.316741704835649784e+00,3.818173077886016120e+00,1.492653219698596656e+00,9.131006863290176412e-01,-3.462863505289647259e-01,-7.017876171944481545e-01,1.689868004598773066e+00,9.053464919138906053e-01,-1.711544592896939720e-01,-1.140932554064577387e+00,2.046154184859894976e+00,3.731992263103992569e-01,4.715175360614189959e-01,4.472299274675240605e-02,1.344393209519464172e+00,1.125160521041981276e+00,1.427673476633234129e-01,-2.789009775391909640e-01,6.647878317623517885e-01,6.477280015973692073e-01,-6.125000654718434356e-01,2.753637275866605894e+00,-4.911744388817512741e-01,6.715227962333450429e-02,-2.322416921489527664e-01,-1.527441917386219705e-01,8.202078187762507078e-01,2.167897882034464652e-01,1.216746670654870854e+00,-1.313440845850635252e+00,1.600110809006433099e-01,8.552207577723489607e-01,7.204288075226350507e-01,-1.906915390165927482e-01,1.250560689510803458e+00,1.316730118907501579e+00,-1.124640725890212911e+00,1.390368075249129864e-01,1.587181032666647562e+00,5.291600417928686850e-01,-5.576763416296695031e-01,2.422254739567442527e+00,-4.547677024694416481e-01,1.183275039653208571e+00,3.365470681213120208e-02,6.245225321406902008e-01,-1.366838985965130870e-01
8.763072297998653060e-01,8.877871300876337690e-01,2.231911186907165057e-01,-3.325440782744546464e-01,2.879112171693218314e-03,2.634090835595287450e-01,1.556498876471065496e-01,-6.389307677599630197e-02,1.253039050886675332e+00,2.660885286427844276e-01,7.812072757562243952e-02,-3.596659774572885659e-02,-5.363163741715770705e-01,3.490973896386186104e-02,-1.669808455741939035e-03,1.329342769402560132e+00,-6.470048370980518992e-01,-1.377163610266406157e-02,1.538086099828570863e-01,3.359954518954513247e-01,-1.040806001513795875e+00,6.766185496131771338e-02,-4.960035840544059216e-01,2.618704341133759605e-01,1.325048921976434979e+00,-2.111106258083840503e-01,2.297717916366894264e-01,-6.651497501200577256e-01,-5.646752205219184306e-01,-5.810915889406238488e-01,4.804397749224439407e-01,2.555992081163425578e+00,-1.758733632567569538e-01,-2.418937641442063247e-01,-6.341628727416173117e-01,-5.858492716354987140e-01,1.406587926884838691e+00,1.050374134573133222e+00,1.237277053055019671e+00,1.123857345671056773e+00,8.211832644133779668e-01,4.682792840061973383e-01,1.064033396045215157e-01,1.896504049909203959e-01,7.038850073926277151e-01,8.622450107115068318e-01,2.709877442740233455e+00,8.367202501337371590e-03,2.147753609630648208e-01,9.569282986988740802e-01,3.847624054958005413e+00,1.393281431396000691e+00,4.056592862845423975e-01,-3.739988524695123662e-01,-4.443896274846768080e-01,1.291586682693373733e+00,3.410214959245788657e-02,-2.895904997235156375e-01,-3.878421538148186243e-01,9.076006374487061157e-01,8.438181405596424378e-01,-2.036760593308253320e-01,-2.955073452340497564e-01,6.555085423551362256e-01,8.887857956097885426e-01,1.846194613405817975e-01,-3.309500952893357772e-01,1.222314459485444482e+00,-2.549721433095934464e-01,-1.181135918387554717e-01,2.454410717082825322e+00,-5.473335277972846136e-01,1.177478868048020128e-01,5.296744527942470748e-01,-3.026746340288561515e-02,1.218294320225365768e+00,1.251013738108363582e-01,2.511440961982968068e-01,-7.345647952354101839e-01,-4.212587980845650670e-01,1.095828710496421499e-01,-1.086193397011073758e-01,-1.931426979559321411e-01,1.467538533089815189e+00,3.723884825917821995e-01,-7.844235312392802140e-01,2.581414888656156092e-01,1.633072887677078366e+00,7.626623240455361330e-01,-2.793937594605286900e-01,1.743792648257417532e+00,-6.393380751895324510e-01,1.205956248258102770e+00,4.550671128906981222e-01,-8.456036378594303238e-02,-1.370942802995430698e-01
7.813962406305531294e-01,5.369625569905205342e-01,1.183345937148017474e-01,-7.514296315328072851e-03,1.645559927898114227e-01,5.600005149224365208e-01,1.032903709786277879e+00,-3.554443356050289160e-01,3.548528463480292716e-01,1.410645037155847104e-02,-1.048892672403989312e-02,-4.378655879235379134e-01,-5.449841544118454451e-01,1.952210480448182683e-01,8.201408434609680498e-02,8.396310081546778381e-01,-9.223041826928821685e-01,-6.041904241514046703e-01,3.514549903897045691e-01,2.903054234421039714e-01,-9.883767333391293430e-01,-3.677272126277998376e-01,-6.835593710928803413e-01,4.452693472172125633e-01,1.267966211743323690e+00,5.074667589399441125e-02,1.696125506316240317e-01,-7.237603995927190947e-01,-8.027637496800775763e-01,-5.980565689361890813e-01,7.112210002455461311e-01,2.456058429675722632e+00,1.937440648552535838e-01,1.188646837012180546e-02,-7.173760550855156071e-01,-6.909041173336960551e-01,1.365517787626557622e+00,8.355972018498207810e-01,1.209638583652921540e+00,4.222861322845872234e-01,8.104925052584882605e-01,5.900823747501389160e-01,-2.747512721671141467e-01,2.777808735491655856e-01,8.590103277677854088e-01,1.065377202831192305e+00,2.090446891475427726e+00,1.558406907799995689e-01,4.935684426736554609e-01,4.015578866415882020e-01,4.163860047193779224e+00,1.651626407383266715e+00,1.484235273473442640e-01,-3.960310999689907185e-01,-1.310855264658271069e-01,1.003328097228589622e+00,-5.652701236302831722e-01,-3.327402492056391048e-01,-1.295370928746397698e-01,4.597786898699176561e-01,7.613989920842932912e-01,-7.999632355826495900e-01,-4.406050992947539990e-01,-1.011848275147326781e-01,6.961305983662584573e-01,1.711686101167465279e-01,-5.285321987840505553e-01,1.281222882634273308e+00,-9.295835377640306874e-01,5.733456187274530436e-01,2.208215943451074637e+00,-3.841690241841535514e-01,4.743646125929025514e-02,9.674262346115417577e-01,1.296940615008461695e-01,1.261978290368820588e+00,-2.592112225854866780e-01,-3.909944646795356915e-01,-4.515963928528494709e-01,-9.485126497104994225e-01,-6.821953698319838111e-03,-5.739557789485583150e-01,-2.836897564606707389e-01,1.684085046505791494e+00,-9.641244265221127208e-02,-7.447114337523306205e-01,3.017965009148129707e-01,1.258624366501963632e+00,1.029219881734486641e+00,-3.690485678411539738e-01,1.171321085643962645e+00,-6.563087810490295659e-01,1.127867658895956637e+00,6.863416244767990282e-01,-6.482525656654301027e-01,-3.580583017601052243e-01
9.910588614803419460e-01,1.589361207601021508e+00,-5.657556790044028505e-02,-3.513117715625446724e-01,2.332627564328329517e-01,2.548546672751553777e-01,7.251403815443652201e-01,-1.062996330349115504e-01,5.031983007241709327e-01,-3.386599088341668562e-01,-2.709466066692183817e-01,-1.953538888748141966e-01,-4.850037781574303986e-01,4.669199123499164217e-01,-6.748791226480410632e-02,9.431346536938701730e-01,-3.657898630050138156e-01,-7.440244687022814496e-01,7.000177389315437315e-02,5.314961950425008824e-02,-7.312616972402741222e-01,-4.054841012635659325e-01,-9.334900548300656409e-01,3.618343860304235049e-01,1.421357954103858567e+00,5.508461947082630150e-01,-1.042827203036869599e-02,-5.941575033210956258e-01,-1.028557173140149716e+00,-9.022402683334451723e-01,5.521981622907317089e-01,2.036049374553579039e+00,5.117394348152959349e-02,5.946985193144088688e-02,-9.645614144104586174e-01,-6.753577672618615857e-01,1.811421536200648275e+00,5.393687691100448323e-01,1.101006789471159264e+00,-2.440959517608034535e-01,6.384634117192605762e-01,4.350830188772024654e-01,-2.866235703904946308e-01,4.636371125621494560e-01,7.633830488400915604e-01,1.190428412056721452e+00,2.197806892695993053e+00,4.913312639682467786e-01,3.953878534585972271e-01,7.221931918793409455e-01,4.140083607723438419e+00,1.599262308609768812e+00,2.855610126064033194e-01,-2.358227729765228209e-01,3.758216458715046837e-01,6.838136410907366125e-01,-9.143545906618640862e-01,-2.525265236904339350e-01,-7.686176861636834223e-01,-1.101152713725217502e-02,4.791807014471946569e-02,-2.272489271271467826e-01,3.386130745642001311e-02,-2.977448995316447355e-01,9.087271558639467006e-01,3.346700088646184512e-01,-4.811291893787486562e-01,6.298226340629887732e-01,-7.551336821549560208e-01,8.095391299145789921e-01,2.089652393488831361e+00,-5.078454729905665932e-01,-4.397680669383818297e-01,5.990556162482464364e-01,1.795703603521835445e-01,9.139331161314487861e-01,-3.049134279574383100e-01,-4.001948993310088243e-01,-7.538719555551087748e-01,-7.558158919353519245e-01,6.408298681208162151e-01,-6.417566262657770082e-01,-2.852403558557464747e-01,1.543526633778785628e+00,1.209375266973110596e-01,-6.817251671629784848e-01,4.304157440835683635e-01,4.094366805572955403e-01,1.011696314529223928e+00,-5.539667241158378053e-01,1.003730545394780238e+00,-1.091015714574737672e+00,1.396146301934686029e+00,4.849377458695890986e-01,-9.812326184725401745e-01,-3.022317951861416274e-01
8.902136228174728494e-01,4.468351993328157357e-01,3.702746511464874435e-01,-2.558223940239012784e-01,-3.271569451553502095e-01,3.887473845966559205e-01,-4.021790703089888619e-01,1.857693051424397779e-01,2.380709886315893087e+00,7.463492346372601061e-01,1.934129708174427142e-01,1.247396509384618990e-01,-6.058383511766890495e-01,-3.441386297656458537e-01,7.782828946054987096e-02,1.696102904977142112e+00,-8.136004216605527972e-01,5.249309107967544685e-01,1.819180015087160374e-01,5.898814647158546753e-01,-1.341956633728709658e+00,5.779616973950920666e-01,-1.354751433303733044e-01,1.148659409506642970e-01,1.209942198275422154e+00,-8.810442023378354248e-01,2.705937693450308767e-01,-7.197233025144017526e-01,-2.197940621128635641e-01,-2.887620611914063495e-01,5.003961811886263877e-01,3.019160126605398897e+00,-3.204202210020220543e-01,-5.051560397674919045e-01,-4.188458885529462439e-01,-4.938585669782495913e-01,1.309441605926506824e+00,1.346373105622748145e+00,1.164336408344633256e+00,2.174998715321284415e+00,1.159683585494544866e+00,5.304613665238571141e-01,5.213534588503978551e-01,8.967134973751735016e-02,6.565099638586935349e-01,5.593613081912547358e-01,3.271594260463366766e+00,-1.876607388391093867e-01,1.740137387103589672e-01,1.005689209436349429e+00,3.879530992339066398e+00,1.361471073580840629e+00,7.815405226073349754e-01,-4.260254174856570319e-01,-1.018771327776792024e+00,1.675020573778277511e+00,6.538749496461719879e-01,-5.000152113328291126e-01,-1.787953480200865641e-01,1.784798515171100997e+00,1.332295944415330391e+00,-1.214174424657351314e-01,-6.085333458810084917e-01,1.236866431071394823e+00,8.531184634735056171e-01,7.656764258086545816e-02,-6.136701902005980980e-02,1.823133067776034899e+00,6.602846900401682095e-02,-1.107127420900988479e+00,2.958453750884535882e+00,-5.451757719266574487e-01,4.597331383435376284e-01,3.613177756925287643e-01,-1.628925959587865235e-02,1.302098014122924807e+00,5.613966446745752847e-01,6.525387410238433494e-01,-8.177053842922217264e-01,-1.565430536354336377e-01,-2.072847664028220072e-01,3.860903423294352876e-01,-2.215690822562356721e-01,1.344216808382331596e+00,5.289418653664964554e-01,-8.598674371038136366e-01,-9.905467634301112767e-03,2.733118194126306744e+00,6.914513788743136269e-01,-5.041371807493603141e-01,2.554970142918918441e+00,-2.441516978248133296e-01,1.339769856620345090e+00,4.807650736511442924e-01,2.281901392123707462e-01,-7.662358997458929011e-02
8.762845531264035204e-01,1.118203715425881928e+00,3.923148997853358466e-01,-5.378366943449826021e-01,1.079605781992380026e-01,-8.399332522165015025e-02,-3.435090285038179814e-01,-8.472796287594480669e-02,1.312585373386742527e+00,3.738232681993149953e-01,2.173822488530910979e-01,1.660790333674231345e-01,-5.169532648060836122e-01,5.025892842833655505e-02,3.179908966789435354e-03,1.551369600757598777e+00,-5.184209227635299122e-01,3.530812154325781993e-01,1.048673600376289483e-01,3.671833296298528948e-01,-1.063196022792633588e+00,8.223481041129443447e-02,-4.345803273566232749e-01,2.470578008617340393e-01,1.312406430441810157e+00,-3.099558556694034794e-01,4.165010933551571704e-01,-6.113429013166131742e-01,-2.367341625366262692e-01,-4.817655684230144342e-01,2.971096960833303768e-01,2.499178178295508701e+00,-4.087598626218341691e-01,-4.662854447285162407e-01,-5.531359009965055584e-01,-5.711361805856438600e-01,1.176503024902347594e+00,1.311574900173358538e+00,1.242854718295471672e+00,1.491351339994566594e+00,6.544248704426787189e-01,3.340360598954542626e-01,2.291512631357980889e-01,9.473710186453641879e-02,6.385755474244192431e-01,8.198411120666425633e-01,2.982449991474573903e+00,-2.397085865334702137e-01,-4.122804202780962213e-02,1.581547495237883627e+00,3.382496432424463961e+00,9.444422557600266055e-01,2.864537805928401570e-01,-4.276889939486873127e-01,-6.474855506259360460e-01,1.456832037213133368e+00,3.950022642724645427e-01,-9.636765507889907822e-02,-4.204182215908831566e-01,7.373699576581060899e-01,1.141456545617034246e+00,1.444914580990613873e-01,-1.828276759946700081e-01,1.250980862132790472e+00,9.488275809347587186e-01,1.217589362748542903e-01,-3.106361333617054243e-01,1.071488850463657938e+00,1.422708272971645038e-01,-3.277695476909754380e-01,2.456749591704147306e+00,-7.541771380680473147e-01,2.058225579597466881e-01,4.928229811794212489e-01,-3.047311749751941967e-01,1.460776480701864388e+00,3.807520631038507353e-01,7.042523309852430913e-01,-6.831125185270334743e-01,-1.118741903933420101e-01,8.681697879649230565e-03,1.267693969342045812e-02,1.311081394454571836e-02,1.296308203352002142e+00,5.964819197312237753e-01,-6.796972727582479834e-01,3.790200838071842715e-01,1.768894802877223782e+00,4.506195119662338433e-01,2.843237161496289800e-01,1.851159287232718054e+00,-7.831290126660743756e-01,1.066964401290737552e+00,2.754093523743835203e-01,6.177133977613582516e-01,1.492979271993404300e-01
1.042010285237173761e+00,1.285623391949836769e+00,2.932856551133665168e-01,-3.405460091214895790e-01,-1.443605682735898954e-01,3.711362281408821517e-01,8.170072724599841685e-02,1.859873184032878046e-01,2.243840603159257263e+00,5.788735382352255820e-02,-7.459775954777467799e-01,-8.840369179364826469e-02,-6.671830992569578456e-01,-9.061980676575283333e-02,1.748330906945125829e-01,9.313666092573218425e-01,-8.142186364855806824e-01,-3.363350505598772244e-02,1.089049169649595333e-02,4.145220147298326885e-01,-1.244131647030035648e+00,5.301753589030139269e-02,-5.819133254922244092e-01,1.269938729997268090e-01,1.338123741880360207e+00,1.312968881164368606e-01,-3.087281816430054171e-02,-6.988653005347646996e-01,-1.103685474140503109e+00,-6.894272923599220615e-01,5.876060147807734557e-01,2.743903626349648128e+00,-1.613209308201423720e-01,-1.852000907697854970e-01,-7.996875504771794319e-01,-3.727559659950487325e-01,1.994866320205570753e+00,7.020844270909760709e-01,8.280375927233440958e-01,6.927435472089277235e-01,1.060908318466727174e+00,7.160270479942107968e-01,2.422187003413815432e-01,3.188719526079234479e-01,1.012918898478680552e+00,9.075530491882757289e-01,2.901624603473461406e+00,4.795036696076021565e-01,4.050992819070812767e-01,5.909574671462942685e-01,4.075697095976108741e+00,1.741162207918339089e+00,7.036061342982802280e-01,-7.978053943271834481e-02,-5.238228763708646651e-02,9.552196139313968715e-01,-6.006958539274731557e-01,-6.687383274873373029e-01,-5.323469027372522699e-01,7.577877074897236831e-01,2.734141584076913434e-01,5.363583753932596454e-02,-1.755847534527272824e-01,1.806749378815761253e-01,1.218682608942010193e+00,6.532666131635398443e-01,2.154131699302652692e-02,1.565893036038775055e+00,-4.025759315019694085e-01,-4.272918856025088585e-01,2.434097570868621663e+00,-6.059776803299106174e-01,-1.949691462627415328e-01,8.259267702975875425e-02,3.700205515761931241e-01,6.738253560860952840e-01,2.060139945373279935e-01,-4.124642446456524558e-01,-1.193268352740722626e+00,-3.867210169033952760e-01,2.511159857272613483e-01,-3.140374115533692834e-01,-4.826005907043119381e-01,1.615571016760605882e+00,7.667010964884901636e-02,-7.576427454026674058e-01,1.568143958966733420e-01,1.508874003124717644e+00,1.109206165752053774e+00,-1.128584451160436819e+00,1.856034285115979676e+00,-7.891574851089393494e-01,1.841264375263469422e+00,6.565012121762741071e-01,-1.433446834153952798e+00,-2.576941981459554554e-01
8.780167740286968225e-01,1.048282271822043032e+00,2.807853374644148636e-01,-6.361659128494956406e-01,-1.449789188150067409e-01,1.905777088273818420e-01,-6.260305755073308775e-02,4.850715670630403875e-02,1.767786980605555058e+00,2.883342385937401331e-01,-1.517629148666039263e-01,1.070020405752310222e-01,-5.579953239390736952e-01,-1.878307377398688582e-01,-1.137502619491576050e-01,1.287515587395899663e+00,-6.495242574207651387e-01,2.762225402538815988e-01,-6.926120394418851245e-02,2.973552416922713992e-01,-1.034871267328077993e+00,3.455451542249479702e-01,-4.361656673924526606e-01,9.486925238240079272e-02,1.550469931226094111e+00,-1.196669212347994254e-02,1.793406765609315001e-01,-6.859255951686045183e-01,-1.082069387262136972e+00,-9.205668798111431572e-01,3.261044963324944979e-01,2.750018356175360168e+00,-3.983412904003879040e-01,-1.175358686596486568e-01,-6.632499782093945750e-01,-3.819165954733581003e-01,1.721297780646965148e+00,9.339302948316707820e-01,1.462273613561302810e+00,1.269276292830464614e+00,7.860250826139196789e-01,5.702239967205439131e-01,2.768696771518583399e-01,3.628216043320703355e-02,7.619742021108982799e-01,7.799563596506359220e-01,2.880812412189221128e+00,8.635047656309401132e-02,1.118600414501158130e-01,8.120522635360251096e-01,3.700186673066775178e+00,1.693489972643839714e+00,5.029434854782729447e-01,-1.979896950963521973e-01,-4.513922108469727856e-01,1.435744277757514675e+00,1.941563062041509746e-01,-3.432670240877487844e-01,-6.335722752340074981e-01,1.381657685166645333e+00,3.757870711988270385e-01,1.067278823666826248e-01,-3.872157745337886231e-02,8.385105711252358596e-01,1.329047238733496394e+00,5.805055514288346430e-01,-2.322339622127372882e-01,1.221047778409727114e+00,1.486303698438171117e-01,-3.043239978549252545e-01,2.266546060936275975e+00,-5.456049114051624294e-01,7.792831287994514411e-02,-7.440822756682793915e-02,2.305632811939471727e-02,7.502043871436853140e-01,4.493443939798996700e-02,2.835027973225341391e-01,-1.304312386748857744e+00,-1.541989654819863886e-01,3.558627611890859965e-01,6.196755455412339408e-02,-3.505990016521619013e-01,1.680872683417479641e+00,6.197695563969842780e-01,-1.024997489904825310e+00,2.510443447376186632e-01,1.470275439182816557e+00,8.197007272141447753e-01,-5.917263914007855341e-01,1.900750170217562429e+00,-5.762485163585504555e-01,1.272453285805583700e+00,4.113668993941113627e-01,-3.559693793276813012e-01,-2.168330247292266366e-01
7.858006801383234929e-01,1.113859716037414627e+00,-4.387107571290226882e-01,-7.769003125558819889e-01,5.903382759693293069e-03,1.515682622371582744e-01,4.293209578138988958e-01,-6.840792140585218173e-02,-1.996235022227931255e-01,2.006523651116043361e-01,1.236782352216399872e+00,2.865252888347654681e-01,-1.992227731870268581e-01,3.644639272980227385e-01,-7.929335399407222429e-01,2.105288782269664871e+00,3.212111786715703965e-01,-3.965854367811987302e-01,-7.862197181035862625e-02,-2.587500420460883133e-01,-1.715793722799333065e-01,4.896491107861109526e-01,-6.099406667963742645e-01,2.628911493597889670e-01,1.786704982414243803e+00,-6.434032989919782897e-02,1.978736316737090550e-01,-5.275079518633473130e-01,-7.137026321663251238e-01,-1.288620385921813938e+00,1.477075662930404376e-01,1.913703940025955896e+00,-2.812409802096135225e-01,1.997268738786617814e-01,-7.280395997096154037e-01,-8.575549571670733062e-01,1.404352899848758884e+00,9.085409951236883552e-01,2.335108284474501250e+00,9.390348850247300927e-01,3.333827442408816011e-01,9.924897651142738919e-03,-1.739058249168723425e-01,1.230593581453505725e-01,-3.412504403993299462e-02,8.400955514061710927e-01,2.220659369644069514e+00,-1.418827199677957784e-01,-4.828679698100367401e-02,9.906217561921422110e-01,3.976705054219016766e+00,1.661256040461051686e+00,3.179841915316564682e-01,-5.688817704165001210e-01,-4.278317596296090652e-01,1.604817202694506895e+00,7.548053929491673752e-01,2.864219850261195965e-01,-1.169802008753364930e+00,1.702779212645274320e+00,1.880071751582852169e-01,-2.619572844255412813e-01,1.262242897688803100e-01,7.679717706489349593e-01,7.818287275411547332e-01,-1.790583882238766522e-01,-9.908887943415268795e-01,-1.744405949237607389e-01,1.773239477453974478e-01,9.306876255075560156e-01,2.235856801267685157e+00,-1.839018825370644095e-01,3.607963218592746824e-02,3.973013380678626083e-01,-3.578813833572341285e-01,1.049517192666916454e+00,-6.193932840292457609e-01,1.170513019697935864e+00,-8.444272086892847806e-01,-4.252396378379719177e-01,1.142396534675905295e+00,4.069429597930726006e-01,-6.520870752144963811e-02,1.434526290472813548e+00,1.347056310641012500e+00,-1.266055191811269243e+00,3.909674055021565842e-01,4.971414505993989597e-01,5.212043909278643028e-01,4.055248767879349181e-02,1.408542932621279054e+00,-4.620805216174369012e-01,4.067378017058642659e-01,-5.272447000190466637e-02,1.191092455223885738e+00,-3.842546062605109447e-01
1.101956196698197221e+00,3.828009889837437063e-01,8.428809600861564277e-03,1.405042079498410867e-01,-7.078445167228886170e-01,9.574146378747152575e-01,-1.894168757630397271e-01,6.449426462954194195e-01,3.254714732454348614e+00,7.231925767537771277e-01,-1.646140702657411525e-02,2.997906396715806221e-02,-6.488628296281500063e-01,-3.619250390828952502e-01,1.126934010667950403e-01,1.802495614158390325e+00,-7.256775684117714453e-01,6.550407511325770371e-02,2.209401648032815468e-01,6.244079834132827411e-01,-1.403168722331797458e+00,8.521627171481960250e-01,-1.356912358436251909e-01,3.535682655946528752e-02,1.067373632384892801e+00,-1.122175321508064982e+00,-1.667808532907867070e-01,-7.449245503555550485e-01,-2.602348748616738483e-01,-1.636319858541301908e-01,8.462926369448080521e-01,3.094811252234857868e+00,5.479510383513908067e-03,-4.286687619407238414e-01,-5.431269386985970726e-01,-5.652345845015144254e-01,1.806746460347152583e+00,9.935597831946596514e-01,7.818273991093456221e-01,1.897613445656539888e+00,1.719742275767856210e+00,6.311761542592815299e-01,6.021304114670295027e-01,4.563699947167726423e-01,5.992666158917360208e-01,4.889925018983453664e-01,3.343893173722232603e+00,3.207332959548664375e-01,6.062389141337187759e-01,2.921025774996304225e-01,4.889386576157138009e+00,1.886213123933792257e+00,1.473794724267114997e+00,-3.692432070371812758e-01,-7.856003170354849408e-01,1.366843445788476386e+00,1.911082042630526667e-01,-9.855313625237697162e-01,-2.838028062982690392e-01,2.247171710622924312e+00,1.015297383902586725e+00,-3.987680812159433152e-01,-9.296618950258354053e-01,4.183297871768771881e-01,5.507496407950578377e-01,-8.106125297120381212e-02,1.696712837139232599e-01,2.173899928669882353e+00,-4.940322006203708982e-01,-1.440186609907485371e+00,3.549564398600603354e+00,-2.720225853160931351e-01,2.447310993595643858e-01,3.812618062280159759e-01,5.266594021047834584e-01,9.820855926489970855e-01,5.859481754585020852e-01,1.931710870355453080e-01,-8.365942364333202041e-01,-4.822584781041320268e-01,3.692272490522641171e-02,4.971232604593943116e-01,-5.211267213271646437e-01,1.231453381112619816e+00,2.748467774844717271e-01,-8.862924280493351681e-01,-4.091266911078563218e-01,3.031133417216603121e+00,1.144642856222235938e+00,-1.748062217703868049e+00,2.966541479176383334e+00,3.637458301267104677e-03,1.957330047671151263e+00,7.000003171959967574e-01,-8.668340165396370978e-01,-4.342813307237744502e-01
1.064785324669884625e+00,6.335856649008310137e-01,-2.214220804760672623e-01,4.494416312629290200e-02,-5.042981847487367775e-01,8.978436409593182344e-01,2.758237381355364559e-01,4.715057473041904812e-01,2.223878024441337864e+00,4.150680478432279275e-01,1.510356719705346906e-01,-3.863186678981436750e-02,-5.415080482513922044e-01,-6.370817201977192756e-02,-8.418254525110208109e-02,1.704847273278809139e+00,-4.643212756151923748e-01,-3.801729539506334965e-01,1.815043895909187743e-01,3.562080736492260202e-01,-1.051069339395053426e+00,6.046691693576087268e-01,-3.806171772785478247e-01,1.392059791883891451e-01,1.218039207230311671e+00,-6.928017845370649797e-01,-2.017122011348088384e-01,-6.925562436381156317e-01,-5.037013732360293705e-01,-4.704106384263001539e-01,7.933777041774627836e-01,2.692378318304613050e+00,1.068074099609607752e-01,-1.646651236337519086e-01,-6.907624538806383940e-01,-6.858455909597650502e-01,1.852020729652522846e+00,7.777584247163771280e-01,1.043785429954910304e+00,1.197293797581903574e+00,1.429911827368687494e+00,5.146260578721263412e-01,2.700446448381587095e-01,5.089763562155216192e-01,4.901529955285595652e-01,6.759104714500694389e-01,2.860847037466826670e+00,4.135801152010438742e-01,6.061131301349739209e-01,2.124886396451465265e-01,4.933726626567343843e+00,1.984317032652352708e+00,1.216886963880056793e+00,-3.847656733033866794e-01,-4.289020106366132068e-01,1.185606907763432361e+00,-7.179983741512774298e-02,-7.537795770836198672e-01,-5.297844966636000574e-01,1.869564594161469806e+00,6.048213511843545387e-01,-5.253623188760894180e-01,-6.873033190220064759e-01,3.404670012474875218e-02,5.231651564535855226e-01,-1.012296286752802921e-01,-1.391003783570740615e-01,1.558800059591107345e+00,-6.612396999214876780e-01,-5.962798176302166464e-01,3.198669592503396331e+00,-1.804944159239303958e-01,3.097515226627074736e-02,5.018344802745137168e-01,4.680196293244706096e-01,9.105363872761644828e-01,1.484672643753059407e-01,8.885227474103718492e-02,-7.761451932401212117e-01,-6.907433836025926865e-01,4.100402984940614282e-01,2.754614018742370662e-01,-4.871862373800570634e-01,1.315190136852468772e+00,3.347160961678422586e-01,-9.369526852852837484e-01,-2.276677409029223553e-01,2.146300751221970060e+00,1.162934417561609868e+00,-1.562970952631378196e+00,2.381807071158376310e+00,-1.818447117915146238e-01,1.708328153693539075e+00,6.069393995516196849e-01,-8.361643178869682114e-01,-5.421605771934228102e-01
8.271399354137741744e-01,7.855352153958594652e-01,-2.537436191333273805e-01,-5.036318617179867951e-01,-1.213173707657878020e-01,2.801930937375133324e-01,1.418239486747954747e-01,4.584099092559398847e-02,5.514541868772914190e-01,4.627136509926691454e-01,1.140071458581096264e+00,2.517181630802537984e-01,-3.004557539016495249e-01,1.904452689089481399e-01,-5.302427063131684992e-01,2.173148745859429631e+00,4.445028835204117845e-02,-1.555543141044131161e-01,7.840435648394389334e-02,2.329191869237534976e-02,-5.249192943241535181e-01,5.669692051279948686e-01,-4.178856454424728084e-01,2.496229177845676883e-01,1.520789689630435815e+00,-5.536728648033587552e-01,2.329419900192478965e-01,-5.737018584413053901e-01,-2.575694506060958178e-01,-8.228442218600993119e-01,3.029790992110081849e-01,2.211467143584341155e+00,-2.378504110632354285e-01,-9.995762018931425574e-02,-5.853130446266089359e-01,-8.405877029070139006e-01,1.236615009982221736e+00,1.140442038447243123e+00,1.937847776046489834e+00,1.476790444714281225e+00,6.541816835012856934e-01,9.337302145722498059e-02,4.736610156688614293e-02,1.677965933717678326e-01,6.655700431086819524e-02,7.135159040169314348e-01,2.576315478885956800e+00,-2.301046942954479979e-01,3.828233569341919773e-02,1.075970232901604762e+00,4.056979696523166368e+00,1.456687153451746708e+00,5.297083893650685882e-01,-6.285600237126789391e-01,-7.282083381805697364e-01,1.668188893982712528e+00,8.527209076241605290e-01,5.809199742045428883e-02,-7.992932820308239483e-01,1.803375369773291936e+00,7.848476293746254884e-01,-3.250131253948536081e-01,-2.480870839824889373e-01,9.641499018398093090e-01,5.850903883195741617e-01,-3.400011568055185673e-01,-7.312235089220531226e-01,4.513416915884432834e-01,7.674487807999180733e-02,2.258159728162323354e-01,2.666275261213078007e+00,-2.616996990927286659e-01,2.404532983837514570e-01,5.908384648382549731e-01,-2.884140397552087398e-01,1.325813756313295677e+00,-1.728382073835283694e-01,1.174700901367337291e+00,-6.206597693299824581e-01,-3.943208220854697021e-01,6.591058909356971585e-01,4.991774587574548394e-01,-4.389893950709211623e-02,1.264041330511750827e+00,1.115488858319613641e+00,-1.091857214476634752e+00,2.086813722463757848e-01,1.415889356563619916e+00,5.163485378718395413e-01,-5.125883372098155588e-02,1.875179574837463781e+00,-3.176324604276536401e-01,6.528369841231014270e-01,8.811739953466138364e-02,1.177231908792915727e+00,-2.650833374484820593e-01
1.145988273713412386e+00,1.259710997753659134e+00,-3.357606181944741697e-01,-2.530551885015409619e-01,-4.359080161073718984e-01,6.787908919625993409e-01,1.699847335263391934e-01,5.538967836439012693e-01,2.107361186257977081e+00,1.743626365504955533e-01,3.540117768357248229e-02,1.111759384627111907e-01,-4.842589057166395983e-01,9.182328758887717268e-02,-2.460438202609644409e-01,1.728419321155793220e+00,-1.189359070904425775e-01,-4.602570258500394695e-01,-2.776147066064206873e-02,1.554097036144820865e-01,-8.229736404990388721e-01,5.862974537057875635e-01,-5.485642355003905735e-01,8.598948501531375466e-02,1.400355145360920428e+00,-2.791129963318891294e-01,-2.852870850900705024e-01,-6.176524706634572981e-01,-7.994107960621752440e-01,-7.946065424085194673e-01,6.382543541330230052e-01,2.423714792993472145e+00,-1.614741765671051654e-02,-4.665292089046560453e-02,-8.486262833719073750e-01,-6.560590611203598321e-01,2.130366862055004695e+00,5.713474652681955757e-01,1.146756568033233226e+00,7.536108397329476238e-01,1.226868607806853584e+00,4.225870102669555539e-01,2.192139065090477068e-01,5.522201326902993479e-01,4.237263210884879561e-01,7.651817599415174920e-01,2.831115563822282688e+00,5.872614283620224418e-01,5.019098529923513574e-01,3.607164252782905089e-01,4.836747512427673534e+00,2.027441230510692805e+00,1.205196723761603250e+00,-2.723026976947127142e-01,-1.103367453313746083e-01,1.044139089875573134e+00,-2.274260074357161709e-01,-6.347540367834555441e-01,-9.695639599520453622e-01,1.649096827180163150e+00,4.991624242664971511e-02,-1.793570944073650530e-01,-3.067628271758556791e-01,-5.662507450866405279e-02,7.468678709410070393e-01,7.626570622737827154e-02,-1.877669019852972743e-01,1.049586538882470554e+00,-4.741248888772129355e-01,-2.915078662264624088e-01,2.972505387214338768e+00,-2.308412462747584937e-01,-2.580362114368096038e-01,1.959898119900018165e-01,4.540841988329057388e-01,6.233434322371236291e-01,-9.111880554542983734e-03,1.099101480429429123e-01,-1.052202978664950717e+00,-5.587769933624797680e-01,8.793355950230554718e-01,2.332295302068483622e-01,-4.985784548382119485e-01,1.324033545761074127e+00,5.475116792649510344e-01,-9.826089010820007186e-01,-9.706430604193194700e-02,1.443658673392755443e+00,1.141334507839717460e+00,-1.607522941106616310e+00,2.170605792512533938e+00,-4.370794907811146324e-01,1.749374394250470921e+00,4.536628776241605765e-01,-9.743395081908825528e-01,-5.414666008032370526e-01
9.991920221145482728e-01,9.686009844756885423e-01,-3.924296508794544169e-01,-3.103961760557237270e-01,-2.589352921834775501e-01,4.193959219132589178e-01,-3.994062029079281650e-02,3.416157798832137882e-01,1.122117234958782017e+00,4.748379435409459948e-01,1.074791224836229908e+00,2.991730473462563822e-01,-3.180867422392240629e-01,2.689575979090751967e-01,-4.550298874830428497e-01,2.385995128971405421e+00,2.157494026221811745e-01,-2.993910042177215791e-01,1.108515248095087724e-01,7.657519742752354197e-02,-5.908404523524635188e-01,6.621880584176895734e-01,-4.177974703748478791e-01,2.223998406128162852e-01,1.350388727012461709e+00,-7.871158288672914782e-01,5.697644083775625645e-02,-5.391167880065409479e-01,6.198561937361368734e-02,-5.806875910949247377e-01,4.521777647464535477e-01,2.148203823864549555e+00,-1.247820959681706088e-01,-2.487932623236253638e-01,-6.317772594466589675e-01,-9.223584194597658215e-01,1.382948463523592464e+00,1.081871354466809265e+00,1.558128608186061914e+00,1.426159347595328697e+00,9.318420654098815703e-01,4.377029110653635202e-02,1.486245736804248652e-01,4.201349416521821256e-01,-1.188584016987198622e-02,6.758468417821441587e-01,2.796654993691992885e+00,-2.883954917628180764e-02,1.865381913208178921e-01,1.092702801607652985e+00,4.459423792968383538e+00,1.406259271032677116e+00,9.114679055022915088e-01,-6.481471865414698552e-01,-6.463436351937146274e-01,1.479179201916884345e+00,6.657536660076297519e-01,-1.409412338746021676e-01,-8.655412249339468067e-01,1.778218466653002761e+00,8.466417925899663022e-01,-2.932721380598460881e-01,-4.235153043090652547e-01,7.332606629702265177e-01,3.273878378861433402e-01,-5.650454721486675158e-01,-5.537573602777200454e-01,5.711870201667231806e-01,-1.449230418158862221e-01,-1.082060784184142310e-01,3.117025592692843183e+00,-2.477808856616995625e-01,1.111720858550048346e-01,7.104579928394160193e-01,-1.008597789651526633e-01,1.370229164913783215e+00,6.688958965960328795e-02,1.120003307350583288e+00,-4.702219287902411615e-01,-4.570968315412464178e-01,7.191239618583252780e-01,5.784457626611829717e-01,-6.895219301182065053e-02,9.964010933161684402e-01,1.009013204396861374e+00,-9.428354168795254342e-01,3.124610884812234479e-02,1.704710729024530247e+00,6.046823607289857350e-01,-4.614352646320660778e-01,2.178156035579018379e+00,-3.241035331591160529e-01,1.025844784165553580e+00,1.255350017602201440e-01,8.912032424077733772e-01,-2.736924336896011112e-01
7.864287396126654617e-01,7.199594110646692080e-01,3.537911075943265815e-01,-6.427345541647560001e-01,-2.225143667919081691e-01,3.092948321377537169e-01,9.778499434620668840e-02,-3.200713802738421043e-02,1.834961406317918708e+00,3.639291495356642425e-01,-2.271368055466073677e-01,2.702505627014209488e-02,-5.930865127346783838e-01,-3.826704963312811403e-01,-1.165448894564585780e-01,1.117028447786921452e+00,-8.983585145228376589e-01,3.761505821156669316e-01,-7.198680632045798000e-02,3.413278266443096620e-01,-1.104218995370885859e+00,4.344431579121160181e-01,-3.570181444446139940e-01,5.905974004188013771e-02,1.629722476484691374e+00,6.611773903436084232e-03,1.969868836086408614e-01,-7.551444419201363001e-01,-1.385660893162447449e+00,-1.037936847933460971e+00,3.311783712435322768e-01,2.989202438616112456e+00,-4.103257083280809070e-01,1.526065376160068432e-03,-6.169035112983360936e-01,-2.819127145883289498e-01,1.758269930104866319e+00,9.136102670775365642e-01,1.637385929364030712e+00,1.428181939748155216e+00,8.150433019451110983e-01,7.124564760614673364e-01,3.022443566754983713e-01,-1.050593822933871407e-01,8.649715103432105145e-01,7.322010917851293765e-01,2.813254927975507247e+00,5.306692540937456293e-02,1.392490570156526553e-01,4.940047276432730228e-01,3.679730230918641265e+00,1.954771618271404554e+00,4.564650011534555629e-01,-1.460767554478397678e-01,-5.565212612452701268e-01,1.571005488578120390e+00,2.810307173151761484e-01,-4.100110158785632564e-01,-5.170752444972925854e-01,1.735111802781109880e+00,3.023463340167030777e-01,-2.070909013919450259e-02,-6.555700866051746012e-02,8.554613176345773340e-01,1.494085658657763549e+00,7.729526048373794866e-01,-2.320503560479131866e-01,1.447702150568415558e+00,1.975898695501820124e-01,-3.429575782235472214e-01,2.128867534087242053e+00,-4.681425554628603769e-01,2.011566489263763580e-01,-2.342066622385071961e-01,7.208155802955308611e-02,5.832621159742525929e-01,-7.698719941888443330e-02,1.669782380325101068e-01,-1.498913709879472478e+00,-1.662108194849147291e-01,2.679063727080903679e-01,8.771855215006914286e-02,-4.675268435949735402e-01,1.911314253079145153e+00,6.005272910148933274e-01,-1.188912503632208129e+00,2.159879762175400675e-01,1.564878579742852827e+00,9.180513169590449607e-01,-7.386680084234370502e-01,1.924724397180621382e+00,-3.965091891003661995e-01,1.202740801454628805e+00,5.010547050184970264e-01,-5.338581554691470554e-01,-3.330711385414811820e-01
1.060360976067964200e+00,1.302798279358816202e+00,-5.595849037468220155e-01,-2.596559415493314704e-01,-1.004744559847839808e-01,3.972022662977192642e-01,2.313691049970187374e-01,3.042427616698847870e-01,5.910067277719779355e-01,1.944092656833635857e-01,1.046524519033418921e+00,2.239867851347692729e-01,-2.706755569016070506e-01,5.633280615548893477e-01,-4.817744931076446413e-01,2.294719358722334235e+00,4.211888877153304178e-01,-7.126071887640760272e-01,1.250871731896118222e-01,-6.430572277158369543e-02,-4.146389151092109704e-01,3.810863102286802251e-01,-6.398121650838406449e-01,3.170844510829318175e-01,1.334413045485125737e+00,-5.105474229363965444e-01,-3.014066434952319962e-02,-4.837344915938675549e-01,5.898701528666761007e-02,-6.309025050686063452e-01,5.047536524108383604e-01,1.802683871285843287e+00,2.340767650805553046e-02,-1.637948727208298760e-01,-7.756949045454204494e-01,-1.043059508906113653e+00,1.457554627721045826e+00,8.997944969096323131e-01,1.449487147893918415e+00,7.716965724169370100e-01,8.315968856975840540e-01,-4.457215570258105108e-02,-7.910121152897008068e-02,5.982692727827938484e-01,-4.873006562412618425e-02,8.469287283410886769e-01,2.530563025808658661e+00,1.499415785423305891e-01,2.684141653133538252e-01,1.109667383109945948e+00,4.615657195177363725e+00,1.362139703522713408e+00,8.314241455126814007e-01,-6.539932878636491864e-01,-2.770791555920419924e-01,1.170873232884804827e+00,2.356275413264991014e-01,-6.946085405985306938e-02,-1.013901336685379961e+00,1.211606793079259115e+00,6.275660516187853144e-01,-3.551337306120195270e-01,-3.250957795094790992e-01,2.936482745957912921e-01,1.872536122588418506e-01,-6.554377681169001324e-01,-6.701131051802525773e-01,2.174652738581310807e-01,-4.488927897461938432e-01,3.844152721242600212e-01,3.023426475552222659e+00,-2.390099047723547310e-01,-1.407690491417430967e-01,9.258212869304083270e-01,-5.575548714692611652e-02,1.396848652547265646e+00,-9.588173987802389719e-02,8.990838264456915141e-01,-2.927375143705355232e-01,-6.613616462335030199e-01,9.320087736069041506e-01,3.188736954088596809e-01,-3.340084593410047598e-02,9.251255711622430322e-01,8.802798088980936519e-01,-8.187619882791262738e-01,1.243284868190751569e-01,1.162929066207051054e+00,6.594759397756624342e-01,-4.357074552535482037e-01,1.799983874401266615e+00,-5.675859933083620135e-01,1.066350030278862659e+00,1.094106557901631249e-01,6.803103814220319290e-01,-3.019440244563625919e-01
1.237217128448178105e+00,1.551991129333120112e+00,-2.158232470870961178e-02,-3.730017985596046914e-01,-4.755210719200889669e-01,4.776545572944597140e-01,-3.929137789170230044e-01,6.900981303357018870e-01,3.061485238358176986e+00,2.300888911506787371e-01,-4.675205481617922820e-01,2.218932741884477033e-01,-6.019799404539039056e-01,-8.873589659899046300e-02,-2.289257247499920656e-02,1.605084609869768641e+00,-2.965352261575098791e-01,-9.365956804113936829e-03,-1.174027350037283590e-01,3.472972339993495305e-01,-1.125679382728765887e+00,6.049074463734925855e-01,-4.713877605671926707e-01,-2.649310607002419715e-02,1.333240719871929825e+00,-2.665020978621358005e-01,-2.520432924584714574e-01,-6.260556390447409303e-01,-8.039652795502667537e-01,-6.559435896927240384e-01,5.833029906670224030e-01,2.663289157405111851e+00,-2.212612741840131181e-01,-2.864084617908734254e-01,-8.236349395928450612e-01,-4.561217243642175512e-01,2.251472756821963905e+00,6.591061543913347975e-01,7.905117518822479816e-01,1.012760192929153424e+00,1.323175573073147149e+00,5.383225616274623926e-01,4.964929589832493551e-01,5.123415672736688631e-01,6.560577310273369989e-01,7.133458215257306723e-01,3.303756516457506898e+00,6.230277999065065853e-01,4.159667776176380061e-01,6.600789935555709809e-01,4.528239118982803291e+00,1.825646904944951299e+00,1.311737674976812817e+00,-1.236449544639150466e-01,-1.571444183093848868e-01,1.026306501383351222e+00,-2.770016336244737198e-01,-7.908745277131294937e-01,-9.267646224686467704e-01,1.461223529804401400e+00,1.288251264236832949e-01,2.739548370992715975e-01,-2.362077405063694735e-01,2.637346918026374776e-01,1.028103223405012923e+00,3.579591992462163308e-01,1.520056824909895576e-01,1.411025311440431640e+00,-2.155185880960004963e-01,-9.188236539366212430e-01,3.024920857998215418e+00,-4.869726799814715901e-01,-2.835512067191217622e-01,-1.187747083595945274e-01,4.891198038731968678e-01,5.371208477006199633e-01,3.976491268072722129e-01,3.829697471073822967e-02,-1.293927200475070372e+00,-2.326745414218653052e-01,6.726392085945451793e-01,2.140183218478169114e-01,-5.184062431320827224e-01,1.285892206823974870e+00,4.599190336116099065e-01,-8.437098236366455950e-01,-1.001142066295501176e-01,1.794354440865640665e+00,1.099534367123185863e+00,-1.675510955293510351e+00,2.472220597257448915e+00,-5.996341228618038421e-01,2.097095312348457696e+00,4.956908485513435991e-01,-1.279279901249056550e+00,-3.312040920978779335e-01
1.050760426708981177e+00,1.155506845735486898e+00,8.682522919877820600e-02,-5.684708928689106155e-01,-4.992408785490153322e-01,4.367847423890247605e-01,-3.216129042983427166e-01,4.925500266014963824e-01,2.797550858651846717e+00,3.957388112534415137e-01,-2.638197338265408365e-01,2.424619216845394776e-01,-5.817310741528972651e-01,-3.139570782700106255e-01,-1.608835848335842811e-01,1.573381031009337683e+00,-4.713090502836041473e-01,2.753892097821323826e-01,-1.669439980391122513e-01,3.271732951519506494e-01,-1.086297685070106267e+00,7.797943091659442771e-01,-3.382852176725355542e-01,-6.637849827054309593e-02,1.529121368812106141e+00,-2.596316861103676876e-01,-9.092585715903286903e-02,-6.831694925366855742e-01,-1.104370322856322195e+00,-9.018849547114931031e-01,4.258473312805141076e-01,2.881404286218410160e+00,-3.800910862159571080e-01,-1.422861503905540892e-01,-7.097809720599256300e-01,-3.512319826786446386e-01,2.116652262432051845e+00,7.747241594488711858e-01,1.291714487130821265e+00,1.431703080722162902e+00,1.152108551860094199e+00,6.004106951944410131e-01,5.211786011967854959e-01,2.050417362507799268e-01,6.556327834943326271e-01,6.252291930012406906e-01,3.212535122593702663e+00,3.625586768629846524e-01,2.581924654628888205e-01,5.347668233761114776e-01,4.213149696439317360e+00,1.999751673725602030e+00,1.086783032269183380e+00,-1.261187024240719434e-01,-4.484444560481739561e-01,1.399918210424774934e+00,2.015312800521023018e-01,-6.489033668682360201e-01,-8.575900968941004843e-01,2.008658464249755138e+00,1.178128731433898263e-01,2.163325318532474673e-01,-1.474193008080767198e-01,6.614150465108494803e-01,1.286407340260815380e+00,5.450055184441777723e-01,9.119217794831158130e-03,1.420707670764360220e+00,1.464028192729944777e-01,-8.430373950992868792e-01,2.728194162240789478e+00,-4.203855133134785649e-01,-2.808864586253616291e-02,-3.569453901531897122e-01,3.180659485431232003e-01,4.345756704228879164e-01,1.946252550249525926e-01,2.790013969705653074e-01,-1.541647443853337407e+00,-1.004127398394691340e-01,6.175093276255169128e-01,3.823090412737855104e-01,-5.396124040848996328e-01,1.559178605263774164e+00,7.136397751700911396e-01,-1.119851201467416901e+00,-3.666591783678802008e-02,1.800990271647790131e+00,1.014325684087108881e+00,-1.430479667146085099e+00,2.448897839362952578e+00,-3.722892726166028843e-01,1.703311185014602991e+00,4.457020009793303261e-01,-8.581712881987275665e-01,-3.840338682538655957e-01
1.030786431150144233e+00,1.401098819747387036e+00,4.003766490937780698e-01,-6.862305604938283565e-01,-2.559990210555380119e-01,9.272350380508886936e-02,-5.831501074451290734e-01,3.143564062220894906e-01,2.714406143568010243e+00,3.321323232464375996e-01,-4.953485776878629454e-01,2.532796821388236252e-01,-6.316372718763711980e-01,-2.733402897311549284e-01,2.468439142450273849e-02,1.362845068084591826e+00,-6.172749472352330180e-01,5.365271937201615549e-01,-1.563732366203502422e-01,4.208338043934428119e-01,-1.230065205002237594e+00,4.616442326773454452e-01,-3.830256783297554812e-01,-1.719874077619162889e-02,1.463878398310700435e+00,-9.550455524864867596e-02,1.071802505429421404e-01,-6.642688699708417799e-01,-9.683270114319671995e-01,-7.700573434280674201e-01,3.230940465046333587e-01,2.861001345783929839e+00,-5.216451725811757090e-01,-3.345431717832854646e-01,-6.786537100501498498e-01,-2.785714021080290537e-01,1.913006650006612519e+00,9.505273392017128398e-01,1.095364519145368476e+00,1.434309462107642208e+00,9.611576675542057302e-01,6.028382304848132200e-01,5.311786204799475719e-01,1.211474429765633937e-01,8.440587969213968478e-01,7.138518262158719541e-01,3.330524436080866124e+00,2.124877180989064862e-01,9.389283201622745934e-02,1.045054492485976372e+00,3.671459046237020019e+00,1.553986748102045734e+00,7.822435561184560848e-01,-9.698464042673243801e-02,-4.419946060720540415e-01,1.357919904538710920e+00,1.267446068417641125e-01,-5.230192680118789239e-01,-7.172425471513725892e-01,1.318291420182786666e+00,3.808622545798532322e-01,4.902321640437403705e-01,-2.182738735812708719e-02,9.859130885268871936e-01,1.434011257769953529e+00,6.788243669162878913e-01,7.433446485240824408e-02,1.445387956724720979e+00,2.956016682402192175e-01,-8.861508604312631210e-01,2.509007198140298378e+00,-7.063920785891526499e-01,-1.987302622215526837e-02,-3.075177657526272368e-01,1.243651838105372526e-01,6.601887223416503803e-01,4.158660384992616810e-01,2.763604733620863563e-01,-1.460947935261176944e+00,8.249845560428598068e-02,3.306372739176479669e-01,1.409134108351093873e-01,-3.791297802794952876e-01,1.524373280643924078e+00,5.935434152994177870e-01,-8.959901678014297044e-01,1.677585034856284851e-01,1.782929359322785512e+00,8.175766794721354147e-01,-8.521249788707641049e-01,2.272013831157822406e+00,-6.878544955468729460e-01,1.673766464085407080e+00,4.182999799722404433e-01,-6.552189720323651212e-01,-8.475215827815035796e-02
1.121639098847608373e+00,5.022557177941355810e-01,-3.386809132702564007e-01,1.597676205104650027e-01,-5.671317686374178768e-01,7.536355802529401959e-01,-4.202315117982630688e-01,6.722061114236955737e-01,2.301253045532997810e+00,8.768132731072991737e-01,1.106859888443764373e+00,2.942175132397623072e-01,-4.221709288525589132e-01,7.123896257162486145e-02,-1.774094824029039952e-01,2.714273642123329555e+00,2.120825466560377626e-02,-1.247474775969817373e-01,3.315112880761306724e-01,4.211678039898363313e-01,-9.999650820386525307e-01,9.458622324882647314e-01,-1.352604821565297488e-01,1.819305277377804009e-01,9.577994179396281949e-01,-1.634347341268859610e+00,-1.937998078056699103e-02,-5.842674982872956280e-01,8.111494641140972739e-01,8.996396097685432913e-02,7.358562987002124078e-01,2.494900015612784738e+00,1.802677262733221042e-02,-6.449970158207898319e-01,-4.578888816138578788e-01,-9.841953532386891190e-01,1.244330313066956517e+00,1.336431799482940441e+00,1.000126279931083051e+00,2.174958650478251432e+00,1.514866416544756955e+00,9.519378988689197740e-02,4.758444568218098136e-01,6.033359675574163639e-01,-3.046930832717764659e-02,4.482652604160372034e-01,3.312480875162367333e+00,-5.576340606346071038e-02,3.932440491773586677e-01,1.080299751811716558e+00,4.909030719492665895e+00,1.239995933811371742e+00,1.447252300281082871e+00,-7.773638150653496837e-01,-1.057684609047806701e+00,1.543585707077967717e+00,8.352220763478861443e-01,-5.268926014078458842e-01,-4.653064141752363825e-01,2.196660189112764172e+00,1.611421668924948758e+00,-4.690344326411271525e-01,-1.039432489099257451e+00,8.459369387586959110e-01,-1.262003460617155959e-01,-9.760830449530026875e-01,-1.967272420177132441e-01,1.380434487212315986e+00,-3.844854615882152271e-01,-1.143140579202938989e+00,3.968440891131448822e+00,-2.329269785449820662e-01,3.527580678293322780e-01,1.026288535139622482e+00,9.368072000688147660e-02,1.719923344213982075e+00,6.716554113457076092e-01,1.204740460382020206e+00,-1.057975149424272843e-01,-4.964533121268669413e-01,2.209799146098301859e-01,8.678646955957745046e-01,-7.722182206305278074e-02,6.452086535292218539e-01,7.625471909577605789e-01,-7.424044975054802098e-01,-3.509704121689750100e-01,3.054494616668611329e+00,6.621227676365665227e-01,-8.825364163742845935e-01,2.993446361042929826e+00,-2.374223039020961767e-03,1.451106809242829421e+00,3.015472089976483083e-01,8.459552159028287388e-01,-2.151199832881132978e-01
7.756635305078037890e-01,7.223580853845561478e-01,2.625934994683985779e-02,-4.237349277690407034e-01,5.531326372290411297e-02,2.048402589823958841e-01,2.535586868973953023e-01,-1.724181342659893423e-01,4.689855768755963883e-01,3.676031518180891133e-01,7.589325584734785135e-01,6.694058850829884277e-02,-3.946472301791720816e-01,1.594879488009937063e-01,-2.763588205265594677e-01,1.719604775079415449e+00,-3.413935231169852313e-01,-9.029728478873164099e-02,1.699531989037648960e-01,1.630663847653576193e-01,-7.429663071858692014e-01,1.998875161821756230e-01,-4.689757493621935502e-01,3.215571003645734116e-01,1.425593506133148836e+00,-3.680175982770274024e-01,3.411703332122614230e-01,-6.196437463402129087e-01,-3.361363014097598079e-01,-6.907885403025082471e-01,3.569168979247278051e-01,2.330437428417897916e+00,-2.044041730091487041e-01,-1.648376737013967364e-01,-5.710984529216519556e-01,-7.525755337346957674e-01,1.127145250952400035e+00,1.186277272283121409e+00,1.697339240511793967e+00,1.317953091557264367e+00,6.096352317908801943e-01,2.444022457421341499e-01,-1.415272585705659725e-02,1.120786108511938328e-01,3.742721167964191409e-01,8.231974612695458493e-01,2.512212458840375362e+00,-2.535293793420086428e-01,6.829537972819646474e-02,1.118729773899115987e+00,3.792055232773762885e+00,1.306940923931388499e+00,2.637506221451196842e-01,-5.643327270524657324e-01,-6.464282887103625086e-01,1.539565210486024238e+00,5.282483160821501711e-01,1.607620208689845842e-02,-4.983434540641317745e-01,1.219235205855401905e+00,9.698317561239578888e-01,-3.534252093847066734e-01,-2.704066398001438998e-01,9.120449731394649762e-01,6.969236459284511298e-01,-1.348945921168296369e-01,-6.506460565077238911e-01,7.485432762258550365e-01,-8.215502318747841537e-02,2.508765660018527077e-01,2.435906092966602099e+00,-4.214712731333130069e-01,2.598298753490334012e-01,7.092349762141578751e-01,-2.908785586679039081e-01,1.435001912479097363e+00,-8.566245277802847502e-02,7.952116341518378206e-01,-5.436532829763410790e-01,-4.408101617268120886e-01,2.835122374731553485e-01,1.336779557201586699e-01,-3.162379083338073826e-02,1.387679722333949650e+00,7.500903937653645714e-01,-9.214620612780208830e-01,3.217191512024874522e-01,1.460626169179423117e+00,5.463018619314715663e-01,1.742514898657703815e-01,1.640549154976863599e+00,-5.002929334591282862e-01,7.172353636779267294e-01,2.424991430568965156e-01,8.628182312265728626e-01,-1.482558281279244827e-01
7.390601064751696203e-01,6.064063962417652887e-01,-2.591393636562349875e-02,-4.477391277418137916e-01,2.296776896706873017e-02,2.338119640279790468e-01,2.932357688044748278e-01,-1.862270397133498068e-01,3.492910110484467312e-01,4.252267475472131242e-01,9.261515891946485723e-01,9.012928317374227505e-02,-3.647939102168444858e-01,1.368715036991208778e-01,-3.587477140280297960e-01,1.815108225549750598e+00,-2.993152002190959116e-01,-8.339600582491275838e-02,1.653354774926651671e-01,1.277077719379068332e-01,-6.800627826857259528e-01,2.954192236154061790e-01,-4.330104137392510877e-01,3.162136798509634916e-01,1.471408188360095570e+00,-4.300817902990369812e-01,3.568339051730619049e-01,-6.228220870332410453e-01,-3.431828126404645740e-01,-7.476125198906879987e-01,3.293890700960464546e-01,2.335257395418148807e+00,-2.165109354274606379e-01,-1.186617943812032783e-01,-5.447038042186816975e-01,-7.727951039357024987e-01,1.086870569162689648e+00,1.209827160290095627e+00,1.856442490683043900e+00,1.429920793198198758e+00,5.853528282563771334e-01,2.165920198447815470e-01,-2.039300759576362365e-02,6.848228966570911458e-02,2.962974720163989995e-01,7.870307752134808599e-01,2.470401796336061384e+00,-3.160082713573179602e-01,4.269283962255101400e-02,1.071098367474685675e+00,3.808657318314635276e+00,1.366439944174920651e+00,2.593344848446623718e-01,-6.004151901472555286e-01,-7.317719267784292825e-01,1.641992466078146640e+00,6.946083405115502929e-01,6.326594114034442273e-02,-5.199625428214487144e-01,1.444290995540059575e+00,9.700817565615256211e-01,-4.141359561217536345e-01,-2.778574714756062436e-01,9.812221241443250808e-01,6.797159804650687587e-01,-1.824394698128417591e-01,-7.209880130695534017e-01,6.846291951759977401e-01,-1.688645532797685561e-02,2.987020220807627968e-01,2.435665991936203145e+00,-3.587855528571389785e-01,3.226433535566670674e-01,6.975066474999235266e-01,-3.315080045864183256e-01,1.432540519269037915e+00,-1.596995613996967101e-01,9.260560704753013628e-01,-5.558915104613689762e-01,-4.413336338377036316e-01,3.316609536083249821e-01,2.368198093007713445e-01,-2.763995027145244032e-02,1.409128627460551231e+00,8.628404586224390771e-01,-1.006997909974912897e+00,3.085742235826274826e-01,1.464383901382671160e+00,5.214866288230213254e-01,2.039326823660937982e-01,1.664102867411667130e+00,-4.014733598553418270e-01,5.957183539084910384e-01,2.049433784960447980e-01,1.054758659141475041e+00,-1.903818718061452420e-01
9.522936976359575034e-01,1.124159811902473827e+00,4.713644863108888694e-02,-3.791960379023464056e-01,-7.775582876410327970e-02,3.476220913370715038e-01,2.545144437613845456e-01,7.787908073811655729e-02,1.360422362882274250e+00,1.281937069528157891e-01,-3.334957761997059400e-02,-1.257190745075423277e-02,-5.156116261433391079e-01,8.901025899210408820e-02,-1.007427570803549610e-01,1.328656030817120914e+00,-4.760288352650156041e-01,-2.119463297885436914e-01,5.335752851466985663e-02,2.249275231537381237e-01,-9.195808401030399759e-01,1.451912739386643225e-01,-5.841994858157147918e-01,2.118187712685618285e-01,1.413804954115926771e+00,-2.885893041793243657e-02,5.770625422614907019e-02,-6.465106423152886528e-01,-8.283668457633612814e-01,-7.736325943508797209e-01,4.987116527399681476e-01,2.460539530633723437e+00,-1.347829385578258599e-01,-9.910070911372223512e-02,-7.535927590636112283e-01,-5.808225445791463937e-01,1.709117763677370228e+00,8.139139463690845400e-01,1.256832869930556651e+00,7.912822469509617207e-01,8.617471346316198932e-01,4.728595820096406777e-01,7.728518254236067808e-02,2.888191839415815143e-01,6.613532601073350836e-01,8.909147291261292345e-01,2.648218134237258159e+00,2.462559927103823432e-01,2.959997099928455833e-01,7.282142842039300845e-01,4.101794596378348423e+00,1.652003715950662865e+00,5.700399123568288262e-01,-2.907718397451125036e-01,-2.081294731154476607e-01,1.149810296986077507e+00,-1.766135313405647889e-01,-3.642110914386743614e-01,-6.420013359987495338e-01,1.000537234820813914e+00,4.052138134680959292e-01,-1.585390641045670290e-01,-1.800132477868713332e-01,3.343943994096550965e-01,9.494219365918720177e-01,2.702641176457238892e-01,-3.226412149064240564e-01,1.056670224804698410e+00,-3.268672918128212590e-01,1.631129438503720053e-02,2.446888483189963548e+00,-4.579995444911836855e-01,-8.088252270293939949e-02,3.505276035350898267e-01,1.288227072679193896e-01,9.263848405054810886e-01,-2.776895082641211987e-02,9.468680984274424617e-02,-9.247753799016509291e-01,-4.752807417085170849e-01,4.424432493206027495e-01,-1.047958294736160978e-01,-3.142077742304282828e-01,1.505299462121367782e+00,4.149060694505447011e-01,-8.679373884441741183e-01,2.135970006016120193e-01,1.298014965534398657e+00,9.119798896853932302e-01,-6.914039496928718886e-01,1.708553686034401498e+00,-6.621341675168743723e-01,1.361031581637513144e+00,4.524465086836634842e-01,-5.105350562556256744e-01,-2.869117263787760441e-01
9.883954906383762840e-01,1.398965344262259158e+00,-3.214313920036908634e-01,-3.871386374897266003e-01,8.098851504603492291e-02,2.244383517358657099e-01,3.277522806654076248e-01,7.644461024445881048e-02,3.804973816438616541e-01,4.300405097292644974e-02,6.914226292872964752e-01,1.221443207617280285e-01,-3.266665014007247292e-01,5.267712726700852777e-01,-3.685729695214337576e-01,1.859496993953751343e+00,1.580104689502264681e-01,-6.046256520195074646e-01,9.331987770117786130e-02,-3.661999251109012560e-02,-4.975625056851405992e-01,9.245897232450128733e-02,-7.236988665297409140e-01,3.431015457114175993e-01,1.401561197627761324e+00,-1.312719067678010387e-01,7.583561934989020703e-02,-5.134921848364480956e-01,-2.797818814588579617e-01,-7.532715568882543122e-01,4.350249515113530085e-01,1.867445963128771425e+00,-5.016820494872500924e-02,-1.082813607780447884e-01,-8.030069887273267870e-01,-9.078683350160398069e-01,1.458530230560895813e+00,8.697094910176594862e-01,1.443864097782257438e+00,5.404555147465168741e-01,6.446034086755482173e-01,8.271027909770228836e-02,-1.540658686685208445e-01,4.651857765961278646e-01,2.124009638350390916e-01,9.623230773926723103e-01,2.417789436062858677e+00,1.360895456656807945e-01,2.045476020376096049e-01,1.145930447605060687e+00,4.235272318344315501e+00,1.327218789500207219e+00,5.098488281119437637e-01,-5.354494116175462226e-01,-1.386530048385645753e-01,1.103855100131892142e+00,4.865229999820919193e-03,-1.583538990592862905e-02,-9.195930757685307766e-01,7.614637801427600605e-01,5.125509330033092281e-01,-2.472904051043720020e-01,-1.372382614434899950e-01,3.114147384768718996e-01,4.899956032151360219e-01,-3.061117118558831507e-01,-6.636106384984897799e-01,2.668813158551641695e-01,-3.986126971187409218e-01,5.813487689600564945e-01,2.598685625075697114e+00,-3.806849846663130643e-01,-1.783348740088366302e-01,8.020223344205035243e-01,-1.076885967720160875e-01,1.308593366762772492e+00,-1.690548050040942274e-01,6.136422726041513842e-01,-4.477244854995139356e-01,-6.070572165234592310e-01,7.924027517505378704e-01,1.104164594070425331e-02,-4.726484505271366654e-02,1.148435042269656758e+00,7.176414602437899415e-01,-7.825524479722636428e-01,3.068623999323385476e-01,8.674398324108929526e-01,6.645986181720580088e-01,-1.968584472043965750e-01,1.472120478666871790e+00,-7.749312779723567246e-01,1.023013393815974448e+00,1.726373132883873007e-01,4.227278482874868848e-01,-2.246095156355074340e-01
7.688172368300403292e-01,1.546498766009636316e+00,5.471922996965952191e-01,-7.031112275046889071e-01,6.743488694687412854e-01,-5.048420558191668572e-01,4.987375084352813071e-02,-5.939680891475306312e-01,-1.201183263831460124e-01,-7.633426550546693057e-02,7.963487376843142451e-02,-7.056770845077137144e-03,-4.748985819368464756e-01,4.313407785805134509e-01,6.126866181608342510e-02,1.034376925499533417e+00,-5.431509067237942912e-01,9.360621097778087929e-02,1.362553546577176533e-01,2.060874900239978991e-01,-8.791224398133561380e-01,-6.943465391178571533e-01,-7.815889127756332488e-01,4.674683258164150645e-01,1.375505206198989416e+00,4.065943509883806484e-01,6.357343929805144844e-01,-5.565355018216403549e-01,-3.926716324026777727e-01,-6.390281657401264415e-01,1.673253886468496765e-01,2.057792605155734922e+00,-3.930451073033454645e-01,-3.662305910511933771e-01,-6.742702024487670087e-01,-6.220087709423901545e-01,9.291041238502784072e-01,1.272628019612471295e+00,1.282725741190585467e+00,6.234812024214712034e-01,9.959114403916130565e-02,2.606649003196850889e-01,-2.021210337480326968e-01,3.953974730193308973e-02,8.187567280432113126e-01,1.174699880823870224e+00,2.460009863169222211e+00,-3.222538911288668761e-01,-1.847251917228163176e-01,1.991180224317075087e+00,2.791815189538497055e+00,5.515160590216756642e-01,-4.620870321686132431e-01,-4.146615609252903845e-01,-2.161781540327454010e-01,1.167338278068953183e+00,-1.011960249688254598e-01,2.989367869944745681e-01,-3.983619288185825669e-01,-6.254499819632093338e-01,1.054095496701353607e+00,1.880154543797153410e-01,1.834856911157459469e-01,1.097518620474271289e+00,1.072376515245867967e+00,2.819787850379691374e-01,-6.067019988026591815e-01,5.073694518870645043e-01,-3.861164392231032638e-03,6.722621082952983107e-01,1.726050253879532814e+00,-9.797239545522458126e-01,5.392262768982011845e-03,7.939900772874268764e-01,-5.832284980248821915e-01,1.692451375828242899e+00,1.007283058666407771e-01,4.282581456803726816e-01,-4.483772736216384835e-01,-2.304093411846809270e-01,-3.336805062937575617e-02,-6.464281220610192946e-01,2.288440094529814450e-01,1.419640373113974174e+00,3.812711756508452843e-01,-4.492069129160927154e-01,8.439076520494936950e-01,7.543540595370625823e-01,2.839306756619400796e-01,1.218897135478164806e+00,8.648050856451995339e-01,-1.363437732471883157e+00,7.212343315171662050e-01,2.112740625918676507e-01,7.865620802438133552e-01,3.610421697305935540e-01
1.043112411829276276e+00,6.697178930274578779e-01,-2.343772628043405137e-01,2.012562410939833235e-03,-4.605979978455111978e-01,8.785614016236058532e-01,3.825929004450494553e-01,4.138531088259899682e-01,2.032739899213947155e+00,3.468367495386699417e-01,1.296216705532654556e-01,-6.421428666244466399e-02,-5.306300102161422005e-01,-3.587161136184531529e-02,-1.153993953800903638e-01,1.624399029361061730e+00,-4.624147272796834129e-01,-4.372264323820101994e-01,1.613303327262826381e-01,3.093570570848135359e-01,-9.973420357089617383e-01,5.470924951873248343e-01,-4.275663696354207177e-01,1.517212433339445998e-01,1.269865208022368908e+00,-5.612130898699809745e-01,-2.001559000158669444e-01,-6.925339622357404856e-01,-6.344562782617051422e-01,-5.664754982249011750e-01,7.716484903015853325e-01,2.650207815760585728e+00,1.102954942071145417e-01,-9.155722533967988741e-02,-7.200477406356889931e-01,-6.784376581804366646e-01,1.879539780489343226e+00,7.243416599560739133e-01,1.116955847000202340e+00,1.055596263285478065e+00,1.357945295244391559e+00,5.223842647284091534e-01,2.072601347818890938e-01,4.884360163417343914e-01,5.072373194498394078e-01,7.163455041844739579e-01,2.756547624061207014e+00,4.329683278275872627e-01,5.997643174122826437e-01,1.632959896828524715e-01,4.899928105963528679e+00,2.037690024335766736e+00,1.136769196886189270e+00,-3.633932551288584500e-01,-3.535142787071893777e-01,1.159695517895578565e+00,-1.349908981893798154e-01,-7.135771358764868566e-01,-5.681775406351339264e-01,1.802165944098495842e+00,4.857703847540741915e-01,-5.386451435324577375e-01,-6.140280425498985117e-01,-3.389917741056258649e-02,5.803786668213480882e-01,-3.642650653104373415e-02,-1.933071103014206704e-01,1.465888401518908424e+00,-6.704290066976710261e-01,-4.242796409709312933e-01,3.069312427543296362e+00,-1.691712923800197388e-01,-6.352834576678373368e-03,4.736676269919245508e-01,4.603840027632261078e-01,8.519601270460340769e-01,4.182481705251167581e-02,2.769362112465911796e-02,-8.211012256953956756e-01,-7.173696728093195141e-01,4.716848599480127913e-01,2.101489411116147787e-01,-5.002549868017390766e-01,1.383194730891244451e+00,3.366681306237687687e-01,-9.674885894899228900e-01,-1.787280015765503882e-01,1.946537818677802623e+00,1.180256169395780708e+00,-1.533997109310836660e+00,2.244524154774625746e+00,-2.198436050717691714e-01,1.654988566587605403e+00,6.025884477247198667e-01,-8.891485728330985605e-01,-5.703835442153875057e-01
1.120546990641889229e+00,1.313904067455462732e+00,-1.375735750542462221e-01,-8.388392046303105865e-02,-1.521334726049218822e-01,6.109588021193549379e-01,4.642518948408368984e-01,2.884223390577544954e-01,1.672678785241082711e+00,-6.111406242950975787e-02,-3.306249963358485755e-01,-1.470597114184883925e-01,-5.559505333032870311e-01,2.396846008066068623e-01,2.628429327041736929e-02,1.219494860415185400e+00,-4.254286599577684624e-01,-6.481432029553315655e-01,1.180559058227874658e-01,2.415830384205190917e-01,-9.676248770311042247e-01,2.052268466449702622e-02,-7.176506506479498615e-01,2.374303338651769235e-01,1.250836834353028948e+00,5.443590107820264756e-03,-2.071593532870311394e-01,-6.365212971683070764e-01,-7.881862062230375887e-01,-6.172284628184483424e-01,7.519580365783831155e-01,2.349632064424548528e+00,1.350605972733094351e-01,-9.409281863874935370e-02,-8.966872091530319056e-01,-6.608698801809084200e-01,1.994558018264348531e+00,5.518957186486033173e-01,8.035030389188493327e-01,2.491893483329896686e-01,1.143702202776280874e+00,5.207905396579337598e-01,1.383494594254151139e-02,6.086965341164395360e-01,7.155616027379251287e-01,9.753513864854789217e-01,2.602112709610580943e+00,6.354611414078150666e-01,5.958259844641315972e-01,4.292345677670655890e-01,4.671880251786565630e+00,1.801866257232351831e+00,8.751267554052161168e-01,-2.416615609211006932e-01,1.513899145724635353e-01,7.363906001604122453e-01,-8.016770784718817433e-01,-6.380096689065239968e-01,-6.781450298140277999e-01,6.909615275039527882e-01,2.250531966199471323e-01,-3.046631685464891715e-01,-3.359885697537897675e-01,-3.618510983855957042e-01,7.110730041067180318e-01,1.712268802597471107e-01,-1.782222803697443014e-01,1.195983398817369370e+00,-8.660973583194272463e-01,4.369844871937644815e-03,2.726112195370976821e+00,-3.887850413960499685e-01,-3.489567335348902621e-01,5.370447788276099255e-01,4.671183566283291233e-01,8.353389471484310436e-01,1.593353372715256011e-02,-4.010767624558989608e-01,-7.800761799383862938e-01,-7.597963688691663497e-01,5.430142153081367606e-01,-3.020119115911453211e-01,-4.425545070872949349e-01,1.381092157034757184e+00,5.660125844454511057e-02,-7.036156358839000813e-01,6.272722046204737278e-02,1.266633156644522584e+00,1.192596854911461390e+00,-1.311212408225103099e+00,1.718447973817004204e+00,-7.492526321395036604e-01,1.824195694726829853e+00,6.180466173912881889e-01,-1.358529993166925021e+00,-4.234360442339966668e-01
9.510525050522891100e-01,1.695589131183252718e+00,9.325551117769491360e-02,-1.131306405750547528e+00,-1.428341384698482708e-01,-2.512115055594557611e-01,-7.247139152468276002e-01,2.496327926118998564e-01,1.666006647546943498e+00,3.582095381538735746e-01,4.057907040783214625e-01,5.984444106233872684e-01,-3.877237023465620602e-01,-2.603295475627338817e-02,-4.988160411300532893e-01,2.019667312498773626e+00,1.073444563478919700e-01,5.370569102143905038e-01,-3.323639043562749973e-01,4.134237536922257678e-02,-6.561753979334992160e-01,7.114498120155809957e-01,-4.238509855807410798e-01,-7.858810312534825204e-03,1.763185168222474619e+00,-5.260260504596094705e-02,2.480647160807737950e-01,-5.337308269792986337e-01,-8.194165717021373307e-01,-1.169449899645433000e+00,-3.846314755364615978e-02,2.373982672241875314e+00,-7.561870111860817811e-01,-1.975203777174847075e-01,-6.764987592064855004e-01,-4.586791972470657397e-01,1.698358163397645226e+00,1.062450438728693713e+00,1.854751153289641685e+00,1.561790999033434657e+00,4.792783396671235763e-01,1.932603641758436908e-01,4.035043925972602863e-01,-6.988180066590951589e-03,3.080275612555516407e-01,6.833790860480994933e-01,3.159664127228224206e+00,-9.827884069137797496e-02,-2.787367354678463860e-01,1.542115139795077194e+00,3.379219249749750187e+00,1.378740081476830470e+00,5.788268839653158970e-01,-2.790912639895196667e-01,-5.818981436667777229e-01,1.692279001853075560e+00,8.730470584446525795e-01,3.440360603730957534e-02,-1.237086049838767021e+00,1.670163838781869359e+00,1.916207218354972208e-01,6.787581988246920162e-01,3.449008056974791625e-01,1.504826977629828644e+00,1.398329751722172443e+00,3.819507667503568293e-01,-3.825701563188984022e-01,3.802413893778265885e-01,8.639633561349405744e-01,-2.752769642798016392e-01,2.323928460208138702e+00,-6.197904344918567787e-01,3.862165420727328713e-03,-3.815459473199900309e-01,-3.237161711129035724e-01,7.624638955666180884e-01,8.378076263754880015e-02,1.223331492012361910e+00,-1.461948754751008828e+00,2.898471357086739308e-01,9.206150401352859447e-01,5.437591945090753942e-01,-1.236099251834726909e-01,1.387996997265443344e+00,1.397779669989015261e+00,-1.133577994998514304e+00,3.704630258487442984e-01,1.092638540003522118e+00,4.108931424741245064e-01,-1.437496476757618158e-01,2.069193121928884160e+00,-6.873562520214869798e-01,9.887165391158173611e-01,-5.447873600873470723e-02,7.677758183595102537e-01,-2.946449267748951772e-02
8.270733641508509759e-01,8.990077532899835022e-01,3.973585920696430795e-01,-6.313104837096238375e-01,-7.386809496402441111e-02,4.208260492532311936e-02,-3.168337724460218996e-01,-3.135597282823122944e-02,1.648067548647141223e+00,4.777365611959819569e-01,1.493011000602414429e-01,1.859339129204498064e-01,-5.386996780958761555e-01,-1.884875775973194334e-01,-8.129565305901753636e-02,1.511911179618250944e+00,-6.429494685484951066e-01,5.077232962346155398e-01,1.482016768595572492e-02,3.737353672770072355e-01,-1.088633783642608099e+00,3.541750613771452727e-01,-3.274732928162953915e-01,1.387828682642532618e-01,1.455733555063769558e+00,-3.072726504222837440e-01,3.673589363595127777e-01,-6.681679070208121907e-01,-6.234643915457911412e-01,-6.946901075097401401e-01,2.617918225032160873e-01,2.753300105333156278e+00,-4.834986669680220173e-01,-3.224117532129265329e-01,-5.276573495088158205e-01,-4.425057583975728903e-01,1.357780976955143437e+00,1.237725667957625175e+00,1.478966144800041072e+00,1.721484801088338568e+00,7.222915651032493223e-01,4.599739528937802358e-01,3.384237147833741299e-01,-3.922385115637121167e-02,6.735152494266080092e-01,7.167721270626694618e-01,3.022875020530324974e+00,-2.126280799182906911e-01,-3.405959953967037379e-02,1.228467073343982197e+00,3.433677966179792929e+00,1.313275482518255544e+00,3.908047540439816281e-01,-3.397292777373159822e-01,-7.582139705418009523e-01,1.634127450394163183e+00,5.773541818847589546e-01,-1.968647939359008392e-01,-4.658802103794352778e-01,1.354817370177069602e+00,8.916040094237402958e-01,1.356706179713336180e-01,-1.474416847164185251e-01,1.307089243016177349e+00,1.183284785203190914e+00,3.511456725274461066e-01,-2.698293592668639107e-01,1.238097362995530970e+00,3.234839365759273333e-01,-4.829306863510012260e-01,2.386129003793186598e+00,-6.427275704663863998e-01,2.877751253628780814e-01,1.378859744149903976e-01,-2.136892438472257072e-01,1.135322243155647115e+00,2.573906014101040030e-01,6.843474027161743356e-01,-1.045599029542364944e+00,-3.459052263596523735e-02,9.653456130455517759e-02,1.879021776334489635e-01,-1.541697660703446882e-01,1.514859792130001992e+00,7.254557037357920457e-01,-9.285918867853715231e-01,2.913190257233450042e-01,1.842883748851404935e+00,5.672585276188106818e-01,-6.559525230102331017e-02,2.024831871275002193e+00,-5.514322511278489936e-01,1.062781454027061034e+00,3.166594617215621743e-01,3.938351252492273136e-01,-1.301911999869820313e-02
7.535143875560110782e-01,5.342567031422884583e-01,2.119494175246595113e-01,-4.839469991590178433e-01,-1.591480391706063258e-01,3.881440932755020889e-01,3.059715161248081627e-01,-1.079457115288625646e-01,1.300711303187651602e+00,3.886127492691330287e-01,1.451324740467505037e-01,-2.829495013348903854e-02,-5.293532624666306141e-01,-2.270753997790748158e-01,-1.694169210366535949e-01,1.282663376595381655e+00,-7.861262481195788743e-01,1.447559503820595728e-01,5.594894486777959169e-02,2.924289097137746096e-01,-9.905525363796739979e-01,3.650318170573930709e-01,-3.775953428852516502e-01,1.644734495356931503e-01,1.549567407342309799e+00,-1.686229506861435246e-01,2.291630412852222465e-01,-7.341077024452236088e-01,-1.062455774017564858e+00,-9.111876094226832867e-01,3.951576484552216662e-01,2.815558957444838750e+00,-2.706965999182969762e-01,-5.724463335799317987e-03,-5.872774343626291360e-01,-4.570304611864135502e-01,1.529398863066841807e+00,9.885878007385442423e-01,1.692859723949824424e+00,1.396887347044747596e+00,7.946300015425478147e-01,5.897454857253192628e-01,1.622722951788720946e-01,-3.407181547919371778e-02,7.051197820853036813e-01,7.551289763652927478e-01,2.626407495654499158e+00,-4.714818147362288825e-02,1.786065854373967421e-01,5.331931082435905633e-01,3.828179177980580938e+00,1.839488609324458679e+00,3.976836284722171655e-01,-3.057822299856471915e-01,-6.118621951102899414e-01,1.573319417800173259e+00,3.507419773997259016e-01,-3.037378546608752172e-01,-4.342167246700613936e-01,1.674138132318819361e+00,5.528590201158485318e-01,-2.901787503532953227e-01,-2.175903820000932298e-01,7.740515189320100742e-01,1.171384014609904600e+00,4.396871761759141295e-01,-4.011557650616806026e-01,1.296709926705838178e+00,-1.123988740161709077e-03,-1.034918618592420292e-01,2.249666454570184992e+00,-3.824486190191372925e-01,2.660113311885990983e-01,1.491330815917936148e-01,-7.120283608775410111e-03,8.703914767507255901e-01,-1.433809739424607987e-01,3.080796135888840270e-01,-1.138788781595597710e+00,-3.549921868148728232e-01,2.300279233393396905e-01,9.859716658139730527e-02,-3.580044176934310540e-01,1.782972229386277307e+00,5.949920246703481741e-01,-1.136696097970832042e+00,2.106338000349337880e-01,1.592305893124795979e+00,8.542020198859369140e-01,-5.146048897985069370e-01,1.820774121233944998e+00,-3.385222021597227848e-01,1.013198085466018972e+00,4.667090355341343422e-01,-1.298916865090900818e-01,-3.438167886980179055e-01
1.130243703860954074e+00,1.983248050265518980e+00,-6.926650199744629477e-01,-5.118820665112392421e-01,3.725329212917055655e-02,2.826935095135894027e-01,5.413477019703667459e-01,2.837784119956117124e-01,2.362417995826068262e-01,-2.905947573495447633e-01,5.936449904245725273e-01,1.834328482916033898e-01,-2.470887428965806987e-01,7.633723926815810801e-01,-5.949536125781600404e-01,1.901714084187679177e+00,6.079787675953047810e-01,-1.065013313877825496e+00,-9.112074028601373221e-02,-3.140220496527438843e-01,-1.691419793561180773e-01,1.275910670772628652e-01,-9.609097269222289794e-01,2.987241260183528535e-01,1.573020833202139590e+00,2.866122650109646508e-01,-2.109998540791652444e-01,-4.417563906302243160e-01,-6.779361230180773745e-01,-1.126993877061544858e+00,4.306711840665971014e-01,1.513158296126353219e+00,3.057699816157088968e-02,1.566938780138013021e-01,-1.052731168509887905e+00,-9.633837408161360916e-01,1.947206954610193774e+00,4.388094303400623675e-01,1.509728972690363324e+00,-2.354457058172754191e-01,6.018246602768189124e-01,1.470428478874685752e-03,-2.981000385304362621e-01,6.780558434465117079e-01,7.038994613968779790e-02,1.074944330940703852e+00,2.213628763670289601e+00,5.482052305675181314e-01,3.086135436352067662e-01,8.858504916655376427e-01,4.638837255992959818e+00,1.676216529656591625e+00,7.116582106182713918e-01,-4.212171348208533228e-01,3.735374403116663578e-01,7.910728506259993020e-01,-4.141344702401680289e-01,-3.360752189556719116e-02,-1.457174981136628356e+00,6.943402616516360926e-01,-2.980957475903571741e-01,-1.420640337906071138e-01,1.470268906249953822e-01,-2.903217456256438345e-01,5.412429294195878482e-01,-2.308177212244326704e-01,-7.419741856470646324e-01,-2.759221548534401824e-01,-5.445657394967270415e-01,1.051918373348788016e+00,2.521247329273044624e+00,-2.428711769144730193e-01,-6.012254459765694614e-01,5.791358182714623215e-01,1.013894927538482454e-01,8.671840345926264959e-01,-4.997932087239954635e-01,3.990854615767031044e-01,-6.889430653825610040e-01,-7.278602700305566442e-01,1.480339582780851870e+00,-4.168974335238906370e-02,-1.877011062995777579e-01,1.155332033483209120e+00,8.366202222096329466e-01,-8.836882495601217080e-01,3.070074351457315887e-01,2.613640909486836250e-02,8.629913819304270151e-01,-7.385735828568504857e-01,1.242349467671980623e+00,-9.306076035577924843e-01,1.212888229470835855e+00,9.691130103158451803e-02,-1.618852982641307281e-01,-4.497864199500445359e-01
7.820812843206399467e-01,6.038257170155252318e-01,2.212093500475474928e-01,-4.247471751841881971e-01,-5.117591752942535210e-02,2.115382184246270003e-01,-3.424888255416536076e-03,-1.047072505422088767e-01,1.114521136845983973e+00,5.121412588369083085e-01,5.255428896927359927e-01,8.983112931679662627e-02,-4.783859537792829464e-01,-6.173862011251655957e-02,-1.435009317163055131e-01,1.650404725675462148e+00,-5.734285857092309424e-01,2.217838987756406421e-01,1.583016419739497471e-01,3.257647391956985938e-01,-9.757805587236747513e-01,3.156393101467089846e-01,-3.374772259595615886e-01,2.425998047432929849e-01,1.381686923033669911e+00,-5.004816182794428192e-01,3.678840264291592388e-01,-6.649979239551013777e-01,-3.646837455162270647e-01,-5.870938197394305336e-01,3.635612778598358297e-01,2.620875783862887332e+00,-2.988371612192036175e-01,-2.802399870837919971e-01,-4.984460010774543481e-01,-6.186735734480055537e-01,1.160629958877553269e+00,1.275319495187095420e+00,1.564017705051163887e+00,1.679310739043522460e+00,7.471047322561421566e-01,3.698204078316547627e-01,1.849001668542343824e-01,3.413301516348977993e-02,5.180831026100966019e-01,7.300396263165224164e-01,2.784643516769315319e+00,-2.838515620411187768e-01,5.639171713557827870e-02,1.114845424775933624e+00,3.683448432365545866e+00,1.309625126581142940e+00,3.636440021094339836e-01,-4.970362981603753116e-01,-8.142426487685144876e-01,1.639569402990285862e+00,6.256013881906982155e-01,-1.332369232645153889e-01,-3.581985763700645808e-01,1.411225301163391288e+00,1.105246960151465174e+00,-2.287940674315267486e-01,-3.432992373285367327e-01,1.133095836795901867e+00,8.449008361913740162e-01,2.267563257115512432e-02,-4.475024695324579804e-01,1.144973697348706576e+00,5.951802365680591150e-02,-2.264957869811696778e-01,2.519604934143876207e+00,-4.987455328107284758e-01,3.671020705525032124e-01,5.243263038813429366e-01,-2.408648025379637181e-01,1.375212833960201220e+00,1.354970774813972212e-01,7.601330501747070034e-01,-7.007334125988209372e-01,-2.846020459859979201e-01,6.367561073331295951e-02,2.067213072921966766e-01,-9.156857506484056275e-02,1.431620729690100458e+00,6.911441770708368626e-01,-9.204375890100860991e-01,2.470367480905405477e-01,1.893586823406794961e+00,5.660568099393717967e-01,3.725997381847884204e-02,1.930034413215280020e+00,-4.221276251813142477e-01,8.796982321125065285e-01,3.211051138691113360e-01,6.916359072677273900e-01,-9.343838764173584277e-02
1.221086249759192111e+00,8.390902043382153508e-01,-7.294353732852021377e-01,2.374674429925291985e-01,-6.234477111797209758e-01,1.133762263149163507e+00,4.447047466439263408e-01,7.589438422774145154e-01,2.021556788855694453e+00,3.292945068194427782e-01,5.705263656054163635e-01,2.728815271370396700e-02,-4.186446391599622507e-01,2.499278355123754070e-01,-2.933213429088535884e-01,2.181007725093424554e+00,9.570252172016552317e-02,-9.415897097733991750e-01,2.071645607723227589e-01,1.594269994783910349e-01,-7.459900203839451294e-01,7.586135661936649344e-01,-4.890840939418768518e-01,1.757887832074607748e-01,1.154210180720688150e+00,-8.841399090184647314e-01,-4.594753544909261356e-01,-6.040819616333908959e-01,-1.663122432981696264e-01,-4.288469511449630733e-01,9.314749706816402020e-01,2.284968027769425092e+00,3.447156152835679221e-01,-1.039335161099727012e-01,-8.122783610327892756e-01,-9.640796040015653379e-01,1.996575786244032535e+00,5.883648524840211502e-01,9.941735362857004876e-01,8.333647789047566867e-01,1.586257093587560618e+00,2.776572194048688158e-01,1.504560616460418054e-01,8.521123583154754932e-01,1.058564432823396739e-01,6.836049124062377746e-01,2.733710365995220659e+00,6.466366563982656190e-01,7.822990827620220911e-01,9.075533221379472604e-02,5.632498661902570092e+00,2.085584184338490132e+00,1.595063697235537425e+00,-5.214227622979550336e-01,-2.252318712467934470e-01,9.766442952812897094e-01,-1.945882828313014734e-01,-7.740710712792574499e-01,-8.499368124992494611e-01,2.011651265287972112e+00,4.283744586913441066e-01,-7.260185992250328679e-01,-8.093150822778399922e-01,-4.650567124265997387e-01,3.289649873803379698e-02,-6.017655564959583092e-01,-2.627998587358683635e-01,1.132800399796898061e+00,-1.009165694392184731e+00,-3.562116543492334086e-01,3.644459854862382109e+00,4.794079639379272839e-02,-1.865121154687396920e-01,7.960451106470716187e-01,6.153650745774233988e-01,9.572987362857565685e-01,3.182013586195342469e-02,2.223644543191503065e-01,-4.821591279249113349e-01,-9.624464769452724111e-01,8.744765760414681122e-01,4.506987723429611292e-01,-4.768973624812706813e-01,9.939047134280064588e-01,4.529272456429035421e-01,-9.170538016555145333e-01,-3.923110270809682665e-01,1.945262315236141237e+00,1.249476870518606120e+00,-1.960958462145498959e+00,2.450846281099263280e+00,-1.176554486589942439e-01,1.818397403537066914e+00,5.108202571626279109e-01,-7.961099565094982289e-01,-7.218371740903517519e-01
1.148015764944940287e+00,1.665605886902758570e+00,-3.042576734849312611e-02,-7.275803983056272628e-01,-4.539114395983566697e-01,3.034516223614077690e-01,-4.057226021997873411e-01,5.989742993588508257e-01,2.766402760486156076e+00,1.992004053295599042e-01,-3.641591399906399240e-01,3.450509259607433821e-01,-5.419651667626496083e-01,-1.543047635287944086e-01,-2.528439798552482576e-01,1.616897415740157884e+00,-1.804542924165031814e-01,1.485363716509132681e-01,-2.994653861578369103e-01,1.875789148719933797e-01,-9.277049533945587179e-01,7.425084890650073266e-01,-4.805897504488914063e-01,-9.448172735902141128e-02,1.613110337097875435e+00,1.034919752386657954e-02,-1.879112156830983482e-01,-6.177031412022251367e-01,-1.232733176145124343e+00,-1.072850461745858297e+00,3.547374955302134425e-01,2.642430406360773532e+00,-4.260925129067717476e-01,-8.905364869655368887e-02,-8.426897817756893172e-01,-3.612760322518124290e-01,2.336764199243042572e+00,6.067893734243902104e-01,1.264042174636068605e+00,1.041196590422081458e+00,1.053259412594435673e+00,5.162016802648831115e-01,4.796565008882988645e-01,3.058015424596405296e-01,5.948135518649371178e-01,7.016311700379075367e-01,3.208602751400518205e+00,5.380669455161340986e-01,2.228166480108920711e-01,6.579100930962048510e-01,4.232726309734465175e+00,1.997972514148093959e+00,1.137977994129559800e+00,-5.465268759625108164e-02,-1.709743317531390305e-01,1.226366790455468481e+00,3.616248654460529899e-03,-5.958093363895224925e-01,-1.182773708066890306e+00,1.762847463512929647e+00,-2.623436345449325913e-01,4.576196517982511480e-01,8.963475394522028850e-02,5.093264606432413855e-01,1.370756031772867534e+00,6.101453940353851468e-01,-2.263707377714307967e-04,1.056833389028642767e+00,1.946853742234095075e-01,-6.457935350260670671e-01,2.650380835334397389e+00,-4.593672022867406612e-01,-2.807024610235419604e-01,-5.098523404356818389e-01,3.459570770489953095e-01,2.612161006896437376e-01,1.244293512930543799e-01,2.564703724886296943e-01,-1.671611981652349810e+00,-4.359184685037420515e-02,9.647375473966517401e-01,3.311639242233081482e-01,-5.422653613944136142e-01,1.499157860387168251e+00,8.168366839412342095e-01,-1.097486925433886373e+00,3.310711981684505423e-02,1.318045617165514161e+00,1.017629012713725967e+00,-1.522166562095253584e+00,2.316328526799068310e+00,-5.860990331554448707e-01,1.810979035590568831e+00,3.462135860686706978e-01,-1.027028404386691518e+00,-3.790534904724371934e-01
9.755595250980282351e-01,7.245310682075113418e-01,-1.494226902670819923e-01,-3.656351094930117007e-01,-3.864411164870503179e-01,2.909214669866260206e-01,-6.678203543865210978e-01,4.319179315794833274e-01,1.818433773115796459e+00,8.747073908210649673e-01,1.244813067451766120e+00,4.936093910623027270e-01,-3.596879605125423152e-01,9.396856309913090288e-03,-3.754084614346419602e-01,2.712839808024115840e+00,1.084172843280947207e-01,3.010839184624926612e-01,1.291060875043042455e-01,2.853996425459403019e-01,-8.294840996829198065e-01,9.678509672426709454e-01,-1.302468269954296654e-01,1.350447233379289957e-01,1.256761577396968033e+00,-1.299143615529356310e+00,2.372855942101359528e-01,-5.555204085555709437e-01,4.953883167022468115e-01,-3.055257041684562580e-01,3.574623096499912611e-01,2.452798886343892537e+00,-3.557454807623166571e-01,-5.616069127010954176e-01,-4.162929682022821209e-01,-8.480430594371397568e-01,1.113257185414142647e+00,1.472880967363853433e+00,1.530424716989398526e+00,2.383040922630503822e+00,1.036319281296316674e+00,2.182808254804496917e-02,4.806521591889847400e-01,2.619829385050272408e-01,-5.260854394229763642e-02,4.546184083320026770e-01,3.300404632765961743e+00,-3.580869582178556887e-01,-1.142450231956484985e-03,1.500378582808303385e+00,4.143802721214392193e+00,1.091834357334985128e+00,1.020925850065701912e+00,-7.273898342056102084e-01,-1.188066987248839412e+00,1.860001786178236749e+00,1.313237199387124576e+00,-1.475322131080534782e-01,-6.703182850065348974e-01,2.228848169505431631e+00,1.426938561889867341e+00,-7.606629658319860599e-02,-5.869683982220351703e-01,1.512598603354134763e+00,3.409573367331126814e-01,-6.679121363083151408e-01,-3.804819319907432607e-01,9.260586905695529225e-01,2.977906819909171832e-01,-8.696148224511734970e-01,3.410982367894892509e+00,-3.790614086895265356e-01,4.388757881755983581e-01,6.205905895751833157e-01,-2.853065516367895849e-01,1.621017427157253055e+00,5.050564346461305920e-01,1.647543449217944822e+00,-4.598213590489289571e-01,-1.093587755353033764e-01,3.644016354942917757e-01,9.480342437550566270e-01,5.015655581894740145e-02,8.413869497387330698e-01,1.214165016240620565e+00,-9.245795574425063057e-01,-5.534446529835002071e-02,2.555964089556406194e+00,3.558501149124589924e-01,-1.822840914203378571e-01,2.743800622622341034e+00,-1.376543506730234512e-01,9.778887508676539220e-01,5.214322673927651586e-02,1.573776386574498254e+00,-4.719256549198219686e-02
1.264872882078083460e+00,2.662217047320238006e+00,-5.224397409567459460e-01,-1.064235828927939442e+00,-1.662639467136788896e-01,-8.794402496494729826e-02,-3.923846730601108779e-01,6.408439574356227242e-01,1.503120390204284229e+00,-1.970133945217945881e-01,2.307593252443479459e-01,6.210702185144706400e-01,-2.839479791328901603e-01,5.003382407826745260e-01,-6.939094207372242806e-01,2.128171122585469810e+00,8.363303666899046807e-01,-3.798501643091808377e-01,-4.794052911982615850e-01,-3.127626174943295978e-01,-2.322779459504252242e-01,5.909800394833972792e-01,-8.418105515695901708e-01,4.438432372946804483e-03,1.801272069218426086e+00,4.247460391423339976e-01,-2.467472305490059081e-01,-3.965292352751445537e-01,-1.012999512953947745e+00,-1.417118403830682993e+00,1.176568157548141258e-01,1.702503515167179238e+00,-4.612920723168930648e-01,4.381960496990405796e-02,-1.079561662746503004e+00,-6.700561428739282288e-01,2.366812750326508397e+00,4.271137448981223161e-01,1.562955512625505916e+00,2.043874485401654395e-01,5.663208767549375855e-01,1.454175704640675582e-02,1.425548433571819373e-01,5.347136043169296027e-01,8.388023329743155010e-02,9.078233311884520429e-01,2.883297027506323662e+00,6.167471526381772540e-01,1.337431960113776019e-02,1.266108229423835274e+00,4.226630130693630250e+00,1.686730128352686542e+00,9.986417613080799116e-01,-1.801261112522533625e-01,2.962817841267203489e-01,9.881645797146869636e-01,-4.518406153305787321e-02,-8.138038871098712823e-02,-1.939214738864061038e+00,1.146769854548312040e+00,-7.698575799851644641e-01,7.346146833676180377e-01,5.748757575151156596e-01,3.485277909986654876e-01,1.149422618209032798e+00,2.278822619728150811e-01,-4.283129010982005269e-01,-3.497823390685094180e-01,2.916637049918639479e-01,3.627087301206778358e-01,2.494788693366545296e+00,-4.508604955390871361e-01,-7.181786609465100613e-01,-3.454176984874061107e-01,7.358885236524902174e-02,3.575011091484660564e-01,-2.224212184667715697e-01,7.649261848022226307e-01,-1.457981008265976985e+00,-5.881816641423187608e-02,1.829121472980180130e+00,3.340886704407569630e-01,-2.673404318867422802e-01,1.157651063880827058e+00,1.324500647861801106e+00,-1.036804077011360459e+00,3.095471200374544929e-01,1.692390822332734412e-02,7.366493935225162382e-01,-9.963687607692108816e-01,1.748440588106271010e+00,-1.031610131183350543e+00,1.486635015216372535e+00,-1.049579070183560559e-01,-2.349110621569840962e-01,-3.026257145713457941e-01
6.222488364531306715e-01,-4.272634022763442951e-01,-1.622922412421222704e-01,-1.652285249885299123e-01,-4.665538128669196039e-01,9.602422999978859064e-01,8.455344918824680978e-01,-7.511553773313314752e-02,9.719297371705639677e-01,7.052361639596876897e-01,8.725306612541057216e-01,-1.401632786691426880e-01,-4.412513659471557492e-01,-3.609652177251216343e-01,-4.200875740426047722e-01,1.654361675404629528e+00,-7.852839753660958433e-01,-1.474252451379247097e-01,2.205469425618412083e-01,2.410838731236121524e-01,-8.348625668026347091e-01,8.162629204338947009e-01,-1.754008467805548421e-01,1.852465248383941832e-01,1.568952589801132724e+00,-7.314597793999642050e-01,1.342319616910808422e-01,-8.081845426090283890e-01,-9.678242624332435984e-01,-9.230387994305933042e-01,5.691511913900419994e-01,2.966876803927178230e+00,-1.544847508961910698e-02,2.236689698801363202e-01,-4.598590205931734065e-01,-6.384192543889416482e-01,1.395648016626233279e+00,1.002785443236183793e+00,2.165461884204190390e+00,1.838866430218399017e+00,1.042453948110835915e+00,5.714523569809677461e-01,9.855744460914690752e-02,-5.368506113429748206e-02,3.841276478011045326e-01,5.645020096952729771e-01,2.334887326647498984e+00,-1.622809567094329330e-01,3.808784919933083657e-01,-1.899536262382192087e-01,4.495770649285325327e+00,2.356616947670065798e+00,6.357591551156738241e-01,-5.218775539371219852e-01,-9.861440548017927910e-01,1.895246017686246454e+00,8.326598163966834054e-01,-3.741585526947019957e-01,-2.827235928131081044e-01,2.882435821426994060e+00,7.125900093671876379e-01,-1.023767561239121271e+00,-6.437898930699061939e-01,5.815110763759998580e-01,7.602763291720546768e-01,2.197388539815348096e-02,-6.437000916323477595e-01,1.432758489514647682e+00,-2.352307473331551879e-01,-2.440687135571661948e-02,2.596819113374268184e+00,8.845465138957259166e-02,5.874466501043399402e-01,4.079372529205258502e-01,9.201755041348839981e-02,9.095609265020068168e-01,-4.660130107674924083e-01,5.439724648570997134e-01,-9.513233970123629035e-01,-7.102275696842139663e-01,2.788325240479158085e-01,5.254946326909530896e-01,-4.757718878142603858e-01,1.851252527073824483e+00,7.633365960463810440e-01,-1.485228020970881468e+00,-8.719050579096182529e-02,2.032027694521874039e+00,1.010764564393829223e+00,-9.157231596865123002e-01,2.084747159329181532e+00,3.437562330547068168e-01,6.976673703866494991e-01,5.258424020144760735e-01,2.189273089202180278e-01,-7.398043042421940108e-01
7.661368694838955884e-01,3.031466817555980020e-01,-2.435360225993769556e-01,-5.138158398536696314e-01,-4.770517706835285532e-01,6.373886405277628953e-01,3.002980665391357107e-01,1.681230154896870277e-01,1.295956165939555760e+00,6.288204149751939198e-01,8.814374855911530915e-01,1.887610075158303036e-01,-3.792086320898834240e-01,-2.452034583452902816e-01,-5.808906761557820486e-01,1.992079714646018518e+00,-2.963680881230024711e-01,1.622598131699902468e-02,-1.682818909906798333e-02,9.934460035031605907e-02,-6.633201345284042150e-01,9.901609072162949055e-01,-2.348729913224854027e-01,7.433338126637767385e-02,1.689627975613943622e+00,-5.893851739911667442e-01,8.421896729099996592e-02,-6.989611673438244077e-01,-9.309474617339744684e-01,-1.093261329876299870e+00,3.575511735989623796e-01,2.723646105668126260e+00,-2.609760209710004220e-01,1.427736050890638930e-01,-5.521272199150542015e-01,-6.172081901100817669e-01,1.604097617398231312e+00,9.600952256113574057e-01,2.181453863449486885e+00,1.794047948444436713e+00,9.076781535664943945e-01,3.867707394710113156e-01,2.328682362258500671e-01,3.628443444103665594e-03,2.073978713678713004e-01,5.455003929978443633e-01,2.632100794084923479e+00,-8.719791913894045510e-02,1.754957771068885730e-01,2.858765872612072378e-01,4.323031359707762533e+00,2.174703285725055668e+00,7.908195664389624513e-01,-4.586163577491853549e-01,-8.679139013972456684e-01,1.875548541665474689e+00,9.739734595613227519e-01,-2.507989717977626709e-01,-7.691929432302235803e-01,2.827061399195130775e+00,3.855935453816919933e-01,-4.620862490829548697e-01,-3.090193200598356782e-01,8.489962472618965972e-01,9.225042055068994884e-01,5.629356971693799672e-02,-5.865286417802866303e-01,9.521843913415374283e-01,1.815820727015447500e-01,-1.240260948191906354e-01,2.634236899471050553e+00,-4.070359137716644815e-02,3.653055797571266305e-01,5.786066117062166336e-02,-2.287940117052036926e-03,7.512043997004618223e-01,-3.504767192540287901e-01,9.141214201797387418e-01,-1.193763969701906458e+00,-3.753189683775922658e-01,7.145479467074233870e-01,7.203549722385111931e-01,-3.987543276036206175e-01,1.653128050704016250e+00,1.147410921459953936e+00,-1.475455673055479089e+00,-1.554294140185907835e-02,1.685282146644743850e+00,8.383725567248810906e-01,-8.762363258351693052e-01,2.212055644038855906e+00,1.148222219786934062e-01,7.980477047578650174e-01,2.726066544778078526e-01,4.553041436299994360e-01,-6.011508878053626326e-01
9.511565111828859109e-01,2.149894771108430636e+00,-8.559645150408580483e-02,-1.339571247692249001e+00,4.958900859776534109e-02,-4.024319985272211686e-01,-4.233241520273592351e-01,1.351362839571310370e-01,8.766607770990269000e-01,1.598004738032221539e-02,4.141413853180680449e-01,5.964056605688821122e-01,-2.976658825462323854e-01,2.412219459134715138e-01,-6.885829623077386330e-01,1.893749899946411741e+00,3.966773959606973432e-01,2.003677776523192788e-01,-4.543855211493439961e-01,-2.276601168647030549e-01,-3.259196927307499436e-01,4.916328192961245125e-01,-6.796187134893997284e-01,4.414852668277050030e-02,1.956382385227537712e+00,4.810389942719488499e-01,1.966883942523926787e-01,-4.707847121042051386e-01,-1.174682700065814878e+00,-1.542537497793811774e+00,-1.471133058150936868e-01,1.990922776643031300e+00,-7.440335424649704432e-01,4.997201811287088624e-02,-8.536154236469064571e-01,-5.093677551097609557e-01,1.859127065046264793e+00,8.113391299848419225e-01,2.077938056273418432e+00,8.418203417393513854e-01,1.698711005221150705e-01,9.529466062720554076e-02,1.390256083382287733e-01,3.222032535442956314e-02,2.436153945886566918e-01,8.687033532954169246e-01,2.791113514669030682e+00,4.764576293088919334e-02,-3.257505592601492306e-01,1.538870835900131073e+00,3.326962170767419735e+00,1.473502070332344260e+00,3.553515813170944893e-01,-2.215871779460455715e-01,-1.709391696092612545e-01,1.490737006242699447e+00,5.796303596781846590e-01,2.471236371962940159e-01,-1.584490346837255537e+00,1.254366454268491360e+00,-3.592696224414083650e-01,7.489868586798588135e-01,7.016972750260404013e-01,1.185410743389932575e+00,1.519146214423827246e+00,4.980995541893172840e-01,-6.150576889723903262e-01,-2.533555552592484661e-01,8.262261329940575605e-01,4.716343942046355431e-01,1.923278002049715329e+00,-5.932930963573075367e-01,-2.780754668745728519e-01,-4.497661741998315588e-01,-3.688411630205427616e-01,5.671539671214136380e-01,-3.034048334857631923e-01,1.105839232485816837e+00,-1.565461228443473019e+00,2.031374428344479011e-01,1.365686899024006529e+00,3.251156788276869936e-01,-1.136762783575979707e-01,1.486312778018240133e+00,1.501769911704824878e+00,-1.186049434584734774e+00,5.746659716859544575e-01,1.307763926096225937e-01,4.243702892564832352e-01,-1.980446947620079223e-02,1.525263845297054388e+00,-9.523149214138665331e-01,8.346577239390611247e-01,-1.709498130596528442e-01,6.689010368454471056e-01,-1.007090660253132652e-01
1.003929023249261920e+00,1.289177402840690601e+00,1.138721727856018967e-01,-6.939993778778852374e-01,-3.748661480280537917e-01,3.403671092628381412e-01,-1.384153796508666434e-01,3.480850467216243249e-01,2.413845878129129652e+00,2.311647119307890519e-01,-3.817856198256575628e-01,1.913574116629244704e-01,-5.708495046656971716e-01,-2.605074709584046522e-01,-1.988891940235889555e-01,1.347949856453528827e+00,-4.979349114890967432e-01,2.039141234948943504e-01,-2.225018165247976965e-01,2.405113420444934258e-01,-9.977438166762184757e-01,6.134050176291777623e-01,-4.480137765676758810e-01,-4.177798850708536182e-02,1.642460785203420537e+00,7.381114922108029941e-02,-6.495196809691750062e-02,-6.825244206967309157e-01,-1.408533950287194525e+00,-1.109287146256214163e+00,3.586337685735500047e-01,2.800818739310832139e+00,-4.036836307279216829e-01,-4.997372069584393728e-03,-7.745973446092613290e-01,-3.081088600328953930e-01,2.174062005554629806e+00,6.708457084306375107e-01,1.419483282645355171e+00,1.115590728424945333e+00,9.690790874324621829e-01,6.303764672534281077e-01,3.957472705624063281e-01,1.427688037027002310e-01,7.357308756517491055e-01,7.259559794782970421e-01,3.014061674643669253e+00,3.973651278289695443e-01,2.194925313620025298e-01,4.896102295868703935e-01,4.052231136971115255e+00,2.069539789652584894e+00,8.737291126730439839e-01,-5.853725072870324952e-02,-2.717165381992601714e-01,1.333445740167958915e+00,3.940814363957251265e-02,-5.540262445797646818e-01,-9.320704768601193457e-01,1.767033189358619749e+00,-1.369636205227802439e-01,2.497434516429552498e-01,4.711023739061576121e-02,5.580516683211499407e-01,1.464316032489920927e+00,7.398959048543569672e-01,-8.536165607200896233e-02,1.232620532864262763e+00,1.623297849311032548e-01,-4.887824578495816308e-01,2.399423684137958368e+00,-4.424888206630925858e-01,-1.182205405515425051e-01,-4.490898295473464419e-01,2.842348369761982241e-01,3.064805397401247911e-01,-5.965723873071204775e-03,1.251815388485297276e-01,-1.664950172236656423e+00,-1.180372916452991361e-01,7.196660529614833379e-01,2.009486298279728744e-01,-5.581490050475854670e-01,1.717825911268751060e+00,6.995707111464317673e-01,-1.161108435799161676e+00,1.002361195267801042e-01,1.350137126697537937e+00,1.033886611844982095e+00,-1.311915070588791199e+00,2.128471515971954720e+00,-5.067611475618319927e-01,1.601725648462740903e+00,4.366899023672476399e-01,-9.932848855882747685e-01,-4.055437288475166602e-01
1.114007796043622767e+00,2.172693749978882760e+00,-5.844591252583729579e-01,-8.222566198314025243e-01,4.260083100353879992e-02,-4.237308442030240929e-02,-9.382121281980848604e-03,3.237614415722008809e-01,3.970874921573485095e-01,-1.147076259591057468e-01,8.368573854293948067e-01,4.668212863964771309e-01,-2.020510934938014591e-01,6.963336425401464025e-01,-7.121218829206108492e-01,2.246537246965856216e+00,8.134713475536212712e-01,-6.184790247184925871e-01,-2.166544329518411693e-01,-3.323617411131860599e-01,-1.224614358452043028e-01,3.499638672241951465e-01,-8.437339720122501996e-01,2.200490757386800444e-01,1.665259094009462704e+00,1.598507064847178860e-01,-4.742399789511730912e-02,-3.918368189425138204e-01,-4.866811107406117110e-01,-1.174848552931397450e+00,1.832045733133813581e-01,1.509001991798669895e+00,-2.748330627626110467e-01,6.600034994037551339e-03,-9.608247885384543219e-01,-9.166362306294812967e-01,1.797033463638762374e+00,6.774672701958431853e-01,1.718199962198428743e+00,2.879486761625941194e-01,4.282395514666754166e-01,-1.403845933856969208e-01,-1.159146867256019425e-01,5.193500258561024596e-01,-7.598895562503893419e-02,9.627490638892219899e-01,2.522071195849425518e+00,2.846788466366615977e-01,7.913664860573543791e-03,1.417165647698813924e+00,4.195566653108945943e+00,1.383485160932896196e+00,6.680681933810739270e-01,-4.596443081005849862e-01,8.993486075349843567e-02,1.089504797952740578e+00,1.570659426937486280e-01,1.724198240662593029e-01,-1.610775680837720714e+00,9.193054853167333951e-01,-1.529369918954661955e-01,2.488594031817648045e-01,3.186246633918966564e-01,4.094666088147196348e-01,6.931494302487606340e-01,-2.469269008566894463e-01,-7.471694663571434303e-01,-4.949377921183130136e-01,2.992661772892165478e-02,7.996598253837315928e-01,2.517649876952203325e+00,-3.782463944275374912e-01,-4.785448708373118420e-01,3.458965526738361218e-01,-1.778516704764899758e-01,9.578031563367885859e-01,-3.246532901583059627e-01,1.003426100552275990e+00,-8.187219356594096498e-01,-3.390905550943039692e-01,1.530151516442905812e+00,2.593655208820362379e-01,-3.029820660025428491e-02,1.040895885051359659e+00,1.257182202372687518e+00,-9.329310357801214870e-01,3.906659270411960150e-01,1.366722081770986863e-01,5.518991043574894562e-01,-2.948621811792724867e-01,1.461185246503138302e+00,-9.500202284452532453e-01,1.008091056987129530e+00,-1.376163231557140376e-01,6.301524154470250494e-01,-2.368633309242957063e-01
6.859166992242339278e-01,-6.714925112387647443e-01,-1.164568940117524237e-01,1.772142765795600150e-01,-4.276118344719591069e-01,8.543814639844133918e-01,2.279117449136192630e-01,3.031952781289877497e-02,1.092777039287690766e+00,1.135532513013069789e+00,1.596650084026298266e+00,2.411043719200314794e-02,-4.000644581522425636e-01,-2.014336484490585888e-01,-2.577014226077027903e-01,2.412730327289253296e+00,-5.737057157288516507e-01,6.329237201295115356e-02,5.243276591885072113e-01,4.634093180859227279e-01,-9.993489946517195577e-01,8.709247650604121649e-01,4.726526887838933266e-02,3.126833787348080040e-01,1.110120667230845015e+00,-1.720585374919490151e+00,3.605209475679636011e-01,-7.287195278317051272e-01,5.474139723182620543e-01,-6.847255467975643661e-02,6.539528285034776900e-01,2.836387153378831183e+00,1.990259535612365349e-02,-3.970180452157588413e-01,-2.014623619653569397e-01,-9.459023494214756633e-01,6.497883938485133903e-01,1.631790756520577368e+00,1.761639882042324023e+00,2.726137040200694805e+00,1.224546781050012356e+00,2.375905223746965778e-01,2.674967054148671974e-01,1.075904224049931968e-01,5.783989567484837391e-02,4.061660450304689363e-01,2.784521037140584188e+00,-6.257907275133972602e-01,2.741785525213362718e-01,7.236810214297455524e-01,4.455208183097141728e+00,1.418194342877860503e+00,7.819103445029036425e-01,-9.276944446850241555e-01,-1.577607879855638773e+00,2.091568037762955967e+00,1.437334628470960496e+00,-2.499026049299764574e-01,9.422559768321492335e-02,2.717329391318612508e+00,2.054483598985124448e+00,-1.091666762079638753e+00,-1.179860133921638576e+00,1.259594865286888465e+00,-1.646469310905041006e-02,-8.867051363977731526e-01,-5.968660796967654170e-01,1.586463461636804073e+00,-2.545919371073527282e-01,-6.740131710913002117e-01,3.422005228965058876e+00,-6.827404961881361478e-02,9.335496186122489437e-01,1.226091186564257196e+00,-2.321163096949132032e-01,1.952260047433505008e+00,2.409867294178729691e-01,1.360452077521981273e+00,-1.803947258003590903e-02,-6.428693154182210101e-01,-2.839412255373052751e-01,8.530793536332168525e-01,-3.070313274687552774e-02,1.136866840435464932e+00,8.107713094104296303e-01,-1.062454157872899208e+00,-2.056463153935418897e-01,3.209752769679998785e+00,5.510252804609629962e-01,-1.354137575758031509e-01,2.628621214560749486e+00,4.152234860377232994e-01,5.896846734828323777e-01,3.757602235859106576e-01,1.659220066291794859e+00,-3.139216613025403446e-01
8.965605789987352026e-01,1.691868966607257274e+00,5.366732234181389449e-01,-9.041332081393177456e-01,2.628648629463665176e-01,-4.315958441866989959e-01,-5.330811821080552182e-01,-1.458055884721380646e-01,1.285498789753787285e+00,1.458710171997389671e-01,-1.427090676525317181e-01,2.687165869503413962e-01,-5.261373163210365522e-01,8.673475432182918554e-02,-2.220529103856666575e-02,1.315644404492921637e+00,-4.486998198106532110e-01,5.179828088840615630e-01,-1.014591468053788609e-01,2.723631134624171501e-01,-9.996054553255921959e-01,-7.143256423350707873e-02,-5.726953373089892496e-01,1.917181342614068251e-01,1.494253981434178424e+00,2.125488809971705362e-01,4.568976578028042246e-01,-5.736677168872048593e-01,-6.524936428399192856e-01,-7.837895924277064053e-01,9.222073889360307697e-02,2.400314268705038501e+00,-6.286372153903331261e-01,-4.040957150433269196e-01,-6.625903311383646299e-01,-4.165373603755901377e-01,1.375798380264511955e+00,1.195952390392713172e+00,1.296169102354880254e+00,1.161276921982459243e+00,3.790138852750434273e-01,3.537122871383711065e-01,2.223514757958212629e-01,8.620067934375502672e-04,7.789651310323406630e-01,9.282864018556303831e-01,3.014937146716839766e+00,-1.617112837458712093e-01,-2.183109002074481997e-01,1.829846275840239844e+00,2.945353303890700047e+00,8.863859731471275261e-01,8.126206894353726895e-02,-2.492531268998708638e-01,-3.892248474427780769e-01,1.364658654213206868e+00,2.239047769294948975e-01,2.647473646191608743e-02,-6.876225940730712471e-01,3.152522044929286782e-01,7.014567694264726150e-01,5.947905503123185333e-01,2.488888808876875136e-01,1.364689904455004488e+00,1.384127634321581368e+00,5.281466006021932058e-01,-2.847890746136998996e-01,7.751964778661029065e-01,4.477622686941232222e-01,-1.316838711595239575e-01,2.023639855163286150e+00,-9.416756516820232736e-01,-3.898895426106954720e-03,9.418889341299210849e-02,-3.841294925184154385e-01,1.188580955479520140e+00,3.109695514073959610e-01,6.157456201721281941e-01,-1.053153627767087874e+00,1.347414546358053355e-01,2.253552107212901667e-01,-1.676598020451406934e-01,1.154842278495082919e-02,1.433067723023586204e+00,6.974356397337853064e-01,-6.828601097213981008e-01,6.004803243613654473e-01,1.157137638455186135e+00,3.867168868236743329e-01,4.563934909106262539e-01,1.577492822337990486e+00,-1.119834545977560936e+00,1.090969090440284450e+00,1.798775761018298336e-01,4.196914183199572657e-01,2.625599333221110276e-01
9.034794043285589993e-01,6.984037231774686827e-01,2.951117728112610805e-02,-2.109407504367025177e-01,-1.093248225894428577e-01,3.363200110189517589e-01,-4.435372443107343798e-02,8.454080035313826791e-02,1.237205587515062932e+00,5.160002370386048698e-01,6.791269382636480056e-01,1.097177474228511751e-01,-4.510194925940090860e-01,1.044330251557630956e-01,-1.249864080616868156e-01,1.913443006503196653e+00,-3.470725991695815527e-01,-2.211531302951839917e-02,2.406406553449962904e-01,3.245689990507290013e-01,-9.453351591720281499e-01,3.411450496620178630e-01,-3.635800209715825959e-01,2.794033882354846066e-01,1.215368553794119233e+00,-7.484291405199330338e-01,2.489908673853443721e-01,-6.184174120831890109e-01,5.609742322680677518e-02,-3.467818324334219771e-01,5.000508986182420346e-01,2.446610662563627692e+00,-1.451506407867583504e-01,-3.978476909850891530e-01,-5.288320497918373997e-01,-7.805792150881717406e-01,1.156982686868606613e+00,1.263326184044240241e+00,1.304293940102821736e+00,1.589282332066698444e+00,9.288919712703903597e-01,2.501699366722603401e-01,1.797003615722979619e-01,2.731982148355492357e-01,3.612513518937704449e-01,7.228404707154476583e-01,2.850983308962129925e+00,-1.771877983396806244e-01,1.797466960183726203e-01,1.181933091758208931e+00,4.058773664133321191e+00,1.191225323000687286e+00,6.182722344094969680e-01,-5.963242872256597771e-01,-7.585952887727149818e-01,1.482741581142514420e+00,5.102638839507427360e-01,-2.115417801448087887e-01,-3.953367236431970522e-01,1.320515506110990334e+00,1.263215718885664751e+00,-3.224635371305613063e-01,-5.333810664360202347e-01,9.121749118287237890e-01,4.777027652152594506e-01,-3.308457646616259629e-01,-4.101030839640172343e-01,1.106769282485743133e+00,-2.059565070814914356e-01,-3.256266971234984542e-01,2.918574813708721738e+00,-4.507835348931025221e-01,2.813463172027590442e-01,8.169133271089066284e-01,-1.494706332543577765e-01,1.561715726647632474e+00,2.787801721170045099e-01,8.071356036180573623e-01,-3.934054597790881402e-01,-4.251450927516376987e-01,1.198329219592038086e-01,2.676897960647502961e-01,-4.204707501334220554e-02,1.145552487013244303e+00,6.225773749045426797e-01,-7.711997245457584693e-01,1.221641502686826308e-01,2.078094655927435142e+00,5.877897184019897914e-01,-1.362089169647640596e-01,2.085795423499874790e+00,-4.231345228135999781e-01,1.061234058636760791e+00,3.147256250371832098e-01,7.059432689078575240e-01,-9.631921461056841549e-02
1.237647916442118579e+00,2.400070742826456272e+00,-4.633450153705489516e-01,-6.573929171651703429e-01,6.158492604318735464e-03,1.356061185063377750e-01,1.868663194870666677e-01,4.196787344777690443e-01,1.066383574144242896e+00,-3.896257424325266783e-01,-4.975080873025433670e-02,2.387891550142630659e-01,-3.590926244063740724e-01,6.325014594217149844e-01,-4.153175761926443110e-01,1.628555683421101907e+00,4.592429959987571197e-01,-7.992172405349309283e-01,-2.313613097953471087e-01,-2.042689882945776247e-01,-3.896494453386671886e-01,8.502764525791678407e-02,-9.840312189798051667e-01,1.831243774143354597e-01,1.581736150301084498e+00,5.387030714629456041e-01,-2.721830272168473952e-01,-4.512633546350445224e-01,-9.684057997652457672e-01,-1.158603948948862650e+00,3.950111983245300218e-01,1.685304440921508329e+00,-1.191175311447565666e-01,6.569083090372451750e-02,-1.122064454990555404e+00,-7.468641429780262797e-01,2.257666208336500890e+00,3.370722187277803705e-01,1.187805574248305795e+00,-3.327350544474290128e-01,6.712431070547810741e-01,1.583437352752040672e-01,-1.111415918095547545e-01,6.786450177611744738e-01,3.414528626893919006e-01,1.092302342623185041e+00,2.529184126460262139e+00,7.484936465374411041e-01,2.917774951952704643e-01,9.681610816650818574e-01,4.450905095640341536e+00,1.677286700688660259e+00,8.148073257773095213e-01,-1.983481787990258594e-01,5.478473357810066391e-01,6.394274005018163454e-01,-7.116281705323433959e-01,-2.206618413924759936e-01,-1.535812715513773741e+00,4.309316520383175142e-01,-5.517988829561741859e-01,2.827006292197912218e-01,3.229865922123598132e-01,-2.673224217367018429e-01,9.058073476639583177e-01,1.793218124714923978e-01,-4.347755362944384361e-01,-2.551267387403721720e-02,-3.984333604801429951e-01,6.657370100873568619e-01,2.433688738349665925e+00,-4.431560700249213003e-01,-7.704059914442472623e-01,1.724623102955200604e-01,2.417567736268392831e-01,5.726503163786410555e-01,-2.755214358781205575e-01,9.594077464823558277e-02,-1.057136313680147932e+00,-4.931074524033354223e-01,1.459583656307487765e+00,-1.769714425306954109e-01,-2.999387822251725622e-01,1.224279749023055475e+00,6.983951737924818381e-01,-7.986162258329622121e-01,3.241083121073583539e-01,2.581093270658219030e-02,9.498625289179148945e-01,-1.025024385721746256e+00,1.366805945813488021e+00,-1.148846596501002182e+00,1.621885112861834788e+00,1.731023785254432179e-01,-8.484595258990195177e-01,-3.545529805840139659e-01
1.282453603201026082e+00,2.083055993152233665e+00,-2.560935670197547753e-01,-3.914562376715822745e-01,-1.551811874060821661e-01,3.346330910574217832e-01,2.159879090901667409e-02,5.377681385614841991e-01,1.959509737318919864e+00,-2.055359302786058107e-01,-3.932137979199646360e-01,1.366019820851497035e-01,-4.984390659739174056e-01,3.932463813904822914e-01,-1.211671080445357873e-01,1.486643811456612063e+00,6.084071127070195262e-02,-5.960066411517328522e-01,-1.127756248340561485e-01,8.396285875029668722e-02,-7.842572019594615806e-01,1.385354306206487418e-01,-8.239410942603648813e-01,1.390931197972979649e-01,1.364165340625299594e+00,2.177422336041273665e-01,-3.053129079960706926e-01,-5.282056777695428584e-01,-8.124462527917180044e-01,-8.023901005035014578e-01,5.816864812730381251e-01,2.072324422657602305e+00,-5.365556557910122759e-02,-1.362906525199368279e-01,-1.028530463069893042e+00,-6.495816992135696744e-01,2.267771694483109890e+00,4.337994550109668390e-01,7.685534973472309961e-01,3.340326820020889098e-02,1.029856267060889952e+00,3.547686443160826819e-01,1.035430409038847616e-01,7.140607185475168484e-01,5.638128143999001640e-01,9.926075762326551644e-01,2.834338458031848251e+00,7.927613906271330224e-01,4.481866591901804697e-01,8.133410507859378802e-01,4.591819541208542077e+00,1.679484864591981985e+00,1.044789397335113001e+00,-1.582626175594505358e-01,3.725839277161048235e-01,6.261217225447758272e-01,-8.139825043216780687e-01,-5.504950852789952664e-01,-1.179463302488047871e+00,5.446493484980869937e-01,-1.892655126693687240e-01,2.128848290633651441e-01,-6.532441018496544516e-04,-2.644537119375334200e-01,8.564141080624555480e-01,2.218883833192996091e-01,-1.198652569706809556e-01,7.090980263597689293e-01,-5.632588319066594851e-01,-1.301277931019895195e-02,2.749912600821042830e+00,-4.976199288349704153e-01,-6.356000281340808966e-01,2.125235662088161004e-01,4.358096407991384202e-01,6.318476296338546572e-01,8.547833971176294066e-02,-1.652281190922805232e-01,-1.015407734422777208e+00,-4.974050170838268947e-01,1.017695598129072732e+00,-1.818304615410885061e-01,-3.990319924917511418e-01,1.199121046206485630e+00,3.645917463725327767e-01,-6.782749321065882908e-01,1.286843934109339060e-01,8.233533560973556042e-01,1.086295268823525895e+00,-1.377073899966186010e+00,1.777726250360127436e+00,-1.009112147193282905e+00,1.985489959783877989e+00,4.003505508103852861e-01,-1.318393810458516224e+00,-3.272035063621792639e-01
1.117316460926565336e+00,1.711628962926695419e+00,-1.300921173883315962e-01,-5.162637441275892414e-01,-1.528711185429340591e-01,3.179664313636864637e-01,1.384388908190051781e-01,3.361636069661310122e-01,1.718689889966596551e+00,-8.579025910635842966e-02,-2.902886978526215134e-01,1.045178526914086331e-01,-4.993190564490593841e-01,1.994173664540243029e-01,-1.896658105566296215e-01,1.371010538527288158e+00,-1.638152691957027174e-01,-3.758472447123516469e-01,-1.281515039559728841e-01,9.287139806438099443e-02,-7.907411881282584432e-01,2.197409709307159287e-01,-7.229600301332492762e-01,1.220276014452999908e-01,1.505316271952544804e+00,2.488592853818536454e-01,-1.640869591049466669e-01,-5.882431326743312594e-01,-1.084208063063603511e+00,-9.804619915534833474e-01,4.776502876103837503e-01,2.280338127132318427e+00,-1.586256178250461113e-01,-1.595898926240024718e-02,-9.333083291908800261e-01,-5.523295489136246239e-01,2.143484406131922704e+00,5.254857870926061825e-01,1.140148996153805383e+00,3.382905748867183204e-01,8.968298815901022403e-01,4.409632774291193935e-01,1.045387406330216123e-01,4.571555659459037857e-01,6.189287446076140453e-01,9.392949799996251903e-01,2.727868017128304956e+00,5.847049757988664886e-01,3.431786581329779318e-01,6.719512051067711988e-01,4.322683698661023755e+00,1.825669864464223746e+00,8.216436959122783712e-01,-1.508783278189874677e-01,1.508897909769864043e-01,9.054785311501636347e-01,-4.927497567200773698e-01,-4.546038639726321939e-01,-1.057736980524626835e+00,9.145640734679650885e-01,-1.703621370996132589e-01,1.248828283666181260e-01,5.004740130856054348e-02,1.627882253749546315e-02,1.074604603096728228e+00,4.061270425791032035e-01,-2.269914646054453367e-01,7.873126541289967584e-01,-3.250464072604311028e-01,6.405122139355268196e-02,2.472997565994359270e+00,-4.531196636960005408e-01,-4.193278298968668438e-01,5.098177100499859393e-02,3.117402341539230459e-01,5.601820058988409290e-01,-8.197946066507194596e-02,-5.917858439675327542e-02,-1.198795824302884672e+00,-4.226519573607714908e-01,9.039379098874597007e-01,-1.112685943515401843e-01,-4.265284214323168399e-01,1.455193106004168735e+00,4.924760119917067636e-01,-8.829701644588087150e-01,1.887738247470093500e-01,8.444844787772459727e-01,1.041541809856030065e+00,-1.170347974661401169e+00,1.715335562212852105e+00,-8.353617555252330629e-01,1.676619267575929051e+00,4.003029981793163050e-01,-1.061519988963243177e+00,-3.706494497074975802e-01
1.021632802970338094e+00,1.712219339153778552e+00,2.098741456275636796e-01,-6.981185280814674599e-01,-4.987097629974429625e-04,4.763159793220020366e-02,-5.409302677629485023e-02,1.222443851139969340e-01,1.700428632887559299e+00,-5.660237496955097813e-02,-4.965546448517968448e-01,1.083961976324764459e-01,-5.565130579437491676e-01,7.184772554764011498e-02,-6.922102281971309612e-02,1.119759053905187152e+00,-4.342594631972730435e-01,6.680322313476802498e-03,-1.545101187375644280e-01,1.912957399235873934e-01,-9.435122352570419757e-01,6.068312533193309655e-02,-6.831070807579788795e-01,1.196770752168021673e-01,1.544697915983562320e+00,4.023946829931099867e-01,5.038145244894347285e-02,-6.155256588889095326e-01,-1.196221904067106045e+00,-9.943199635518277235e-01,3.365843199914542172e-01,2.440660096107845067e+00,-3.531688974487416366e-01,-1.005115118856832468e-01,-8.579275150720933052e-01,-4.006915519011012283e-01,1.977907554663549616e+00,6.960083224241979671e-01,1.173566313964451435e+00,5.479210646494919734e-01,7.069898603683623106e-01,5.252341374077433844e-01,1.601365789492645297e-01,2.377144241313584039e-01,8.289883208471193754e-01,9.600103132987516386e-01,2.820287966952485625e+00,3.814099827310009072e-01,1.601153142965812404e-01,9.550790224382894600e-01,3.750069200423752580e+00,1.606006536700661513e+00,5.056376835476137366e-01,-8.857417515625337634e-02,2.945707131057917483e-02,1.035178395288432807e+00,-3.769708660226794850e-01,-3.488342632400343035e-01,-8.931285186777587759e-01,6.493588655331692383e-01,-4.781264314163480300e-03,3.391787859900702307e-01,1.886421677156085164e-01,4.387537418088902630e-01,1.374335911438620883e+00,6.806533499444983315e-01,-1.838340001778986377e-01,9.172304561758066743e-01,-3.724254343276601348e-02,-2.201040050541813731e-02,2.153622894728700388e+00,-6.590841049041569200e-01,-2.986730641586738400e-01,-9.269368937199104486e-02,1.265328978128179571e-01,6.228224977954419650e-01,2.339261353000138266e-02,-3.424502474681867525e-02,-1.324243429046974008e+00,-1.986203712613346106e-01,6.213980551773348182e-01,-2.406731727424143985e-01,-3.531306080901356337e-01,1.596063101877340351e+00,4.700121181596425002e-01,-8.417325931068171396e-01,3.607251261196078307e-01,8.835230737169510462e-01,8.903924705716063093e-01,-7.016573580427416523e-01,1.605767371132997834e+00,-9.715853648965475653e-01,1.543322052716307180e+00,3.952045713105204472e-01,-8.727040030228316869e-01,-1.711479043975017711e-01
9.083976641055162560e-01,8.774466876845573582e-01,-3.486509408468985161e-01,-3.568145820280367864e-01,-1.728415689598328253e-01,4.589107914294225932e-01,3.464206633976657512e-01,1.441320470723444769e-01,7.332758656645157469e-01,3.171133855604318375e-01,8.737761918972304365e-01,1.402031798823767661e-01,-3.360941189110300265e-01,2.399113484161492504e-01,-4.604731659052928583e-01,2.001756699766501058e+00,1.030634529904539409e-02,-4.192987435294777132e-01,9.218038447244988887e-02,2.370866014596389668e-02,-5.553577610002636833e-01,4.860953058920722825e-01,-5.093437892069837547e-01,2.512039916419842589e-01,1.471861011490743998e+00,-4.346531340126474352e-01,6.057649458303643319e-02,-5.853121436374226771e-01,-4.121423679141635876e-01,-8.171676697942891199e-01,4.487213696159883525e-01,2.191816702678075934e+00,-8.076414692872826984e-02,-2.817228479806072050e-02,-6.876746106491200550e-01,-8.444901555979372754e-01,1.475393686394526060e+00,9.263290293409378595e-01,1.717542931753123225e+00,1.087951490173874936e+00,8.079562882180648664e-01,1.755994856058357145e-01,-4.426406634691303771e-03,3.240132358534227874e-01,1.524939757510180294e-01,7.759625560572853686e-01,2.497790919017744748e+00,3.896678622801388880e-02,2.311083264066841059e-01,7.765343823108880050e-01,4.388309552145711834e+00,1.658673947935388915e+00,6.832625737158133372e-01,-5.535108000909598758e-01,-4.707091586471167655e-01,1.416493791234842314e+00,4.248241177521565048e-01,-1.264648115344138013e-01,-8.297409462288553028e-01,1.657794528989788851e+00,5.530230124758299670e-01,-4.225538289392857250e-01,-2.965377511689676338e-01,4.882663401138440662e-01,5.385179686320304970e-01,-2.848344272706745395e-01,-6.461661194553885990e-01,5.598639298300827072e-01,-2.420412162670261269e-01,2.729305246341019453e-01,2.732491897480120446e+00,-2.023124034462795984e-01,6.546732364595203579e-02,6.114375489818729692e-01,-5.120603794770377942e-02,1.159610022506812665e+00,-2.228133733990637910e-01,7.770377002840732628e-01,-6.411951000882711860e-01,-5.728237392987813870e-01,7.456278188942043750e-01,3.423417759051914366e-01,-1.751353449716169242e-01,1.288178699596334464e+00,8.822817013236745609e-01,-1.046832422164300391e+00,1.290136753792485158e-01,1.304255415925112072e+00,7.387516779274289069e-01,-5.022550031595549580e-01,1.826894698808406936e+00,-3.599197851029278805e-01,9.325639072711126021e-01,2.172215336700518140e-01,5.072879415026176897e-01,-3.954575069445678270e-01
6.905225277287093677e-01,-3.568468945190567121e-01,-2.190769565584996803e-01,3.559980067574679552e-01,-5.519428759802820494e-02,8.968510104419005202e-01,1.060191599118251782e+00,-2.739942832600568146e-01,-2.600580155914067326e-02,5.549335815924705262e-01,1.212143692647549953e+00,-3.511557561104618475e-01,-3.986448112788891218e-01,2.105617669102202716e-01,-1.413319483445568125e-01,1.744455754110278756e+00,-6.522021165893658878e-01,-6.902927202205192403e-01,6.254362074584730591e-01,3.066149180075720126e-01,-8.450958554288691138e-01,1.143099384299980370e-01,-3.780618973875731204e-01,5.311844721981073825e-01,1.080063059733786357e+00,-1.007530997996953115e+00,2.595814212539261923e-01,-7.133961025802282307e-01,1.998955735682410584e-01,-1.879884731236014517e-01,8.223488549450379548e-01,2.423571508616101156e+00,3.626821757486597408e-01,-1.413910992255716370e-01,-4.498663097185378601e-01,-1.051469454954404581e+00,7.673501928150722184e-01,1.254001303052252991e+00,1.532869560836783496e+00,1.385129644555083139e+00,1.026741898263607400e+00,2.956728320288598000e-01,-2.369255987247404494e-01,3.171186615092366212e-01,2.875514860243730819e-01,7.949266601081997896e-01,2.100280530271780854e+00,-2.903231158530787948e-01,5.110362761427927891e-01,4.496850957823997352e-01,4.618296089899672552e+00,1.491935772324551435e+00,3.966814504042496248e-01,-8.514872759208405029e-01,-8.446243163557864975e-01,1.478868735944798729e+00,3.815218851793296673e-01,-2.035632211545380099e-01,1.124092656478602459e-01,1.479825501757887185e+00,1.655392517437092703e+00,-1.396773387950207113e+00,-1.034850907444796020e+00,2.835134928387488817e-01,-9.739483662358594529e-02,-7.660781410417873971e-01,-7.897278092325051846e-01,1.278455639735228466e+00,-9.873548644877013780e-01,3.488717870856345993e-01,2.950008750005491454e+00,-6.977325717144550188e-02,5.382461577676223019e-01,1.627866554638321972e+00,-7.825156579589939709e-02,1.925923304734079133e+00,-1.676823871911911623e-01,5.066598692380520630e-01,2.370448396300242067e-01,-1.140463933065014590e+00,-1.824915317010319393e-01,7.966691104540021828e-02,-6.686779975406031973e-02,1.293939281118605678e+00,2.557787401306831354e-01,-8.441560216259760274e-01,2.211398280109783121e-02,2.205305630522871319e+00,7.961390053670468481e-01,-9.380617911220240357e-02,1.696589187387278930e+00,-3.345933920890264979e-02,6.558543585209635207e-01,5.448250593865691105e-01,8.086255129212105430e-01,-4.202906289506554982e-01
8.971709980804648543e-01,-5.657005217120758545e-03,-2.058724198040473574e-02,3.413871262625645109e-01,-2.853399111778906483e-01,8.640872072521657010e-01,3.770372156069674574e-01,1.216404303742800175e-01,1.519945682438911927e+00,6.563837815222588468e-01,6.215399406276396199e-01,-1.945563496356476074e-01,-5.382640187298834977e-01,-1.078819641268467799e-02,9.663504271403977608e-02,1.766356472808583433e+00,-7.425999958440135940e-01,-2.957424987757887314e-01,5.152415576299472777e-01,5.353652352807566350e-01,-1.202092405101538031e+00,3.295912351645453597e-01,-2.597196338661958981e-01,3.473686982698184211e-01,9.502385296880869747e-01,-1.161249570177716794e+00,1.248358733364695605e-01,-7.191068764354781040e-01,2.541283423263522856e-01,3.133642820594828571e-02,8.683286853871461375e-01,2.719978775299167317e+00,2.150472161797227222e-01,-4.230088714302566166e-01,-4.571618591783811469e-01,-8.577471513872612086e-01,1.099806391959378127e+00,1.248862397908911070e+00,9.891283077529565704e-01,1.683959289978733009e+00,1.369114957200105565e+00,4.291939663699668728e-01,1.637390532542628563e-01,4.190081644480933010e-01,4.726639073929860824e-01,6.710654320689040109e-01,2.755215158527502872e+00,-7.239213567798874482e-02,5.480344444446549890e-01,5.912797696895976118e-01,4.658550569325523583e+00,1.430191345094367517e+00,8.527039481403223542e-01,-6.739594507410870960e-01,-8.614625088530285524e-01,1.383858089861430773e+00,2.534852427397961683e-01,-5.618917280734522235e-01,6.878766523641366426e-02,1.548603053261234486e+00,1.644209640230112290e+00,-9.211285696365241193e-01,-1.076718088297693887e+00,4.290368184582676880e-01,9.210717407827195835e-02,-5.512320444152241095e-01,-2.951910369222291441e-01,1.795168550591450529e+00,-8.256194658377423723e-01,-5.939435423290388982e-01,3.317248280829769858e+00,-2.603681262264201379e-01,4.365166999778435364e-01,1.238689837756596246e+00,1.515396370931835213e-01,1.712489979303881249e+00,3.590591621970390945e-01,3.728374699584580676e-01,-5.969783905847925176e-02,-8.331239454847465531e-01,-2.837381441372135438e-01,1.976155399294494130e-01,-1.873314827899647816e-01,1.148713887021203472e+00,1.445012429791857622e-01,-7.050386227217797508e-01,-1.587174397383442348e-01,2.788919254518690494e+00,8.835666857791263373e-01,-6.574370212981733852e-01,2.304297157418615072e+00,-1.007844359745492246e-01,1.298597080723751240e+00,6.341428637006802926e-01,1.568579807024408357e-01,-2.978068114331283711e-01
8.281238344854293665e-01,4.921450961808456204e-01,-3.693796990259657353e-01,-1.935741850822424448e-01,-1.444935909907135996e-01,5.470280276130922159e-01,4.866923711928407004e-01,2.856409448584271149e-02,3.716808484417007952e-01,4.546043058225217592e-01,1.213133627198891729e+00,7.215042125003115481e-02,-3.080410388866101079e-01,2.590064606316745954e-01,-4.584940817750718933e-01,2.121877113857439490e+00,-5.060841734711191142e-02,-4.677734985780591104e-01,2.418214275859302265e-01,6.200430995177047544e-02,-5.554782523787520354e-01,4.701010256619698735e-01,-4.380285621281923558e-01,3.353645571863476116e-01,1.380594613432336137e+00,-7.083362085119698781e-01,1.572310811502450334e-01,-6.007256070537863035e-01,-9.845007072243339152e-02,-6.423066113833745261e-01,5.044195113943427122e-01,2.195406268011915074e+00,1.011448219539923254e-02,-7.645503515645507564e-02,-5.857311483728050439e-01,-9.570413149553036458e-01,1.174457401868151729e+00,1.095865090873409553e+00,1.795059390482390826e+00,1.323761405027037208e+00,8.212536321524102068e-01,1.203539975549931529e-01,-6.677161125814883025e-02,3.000660775807856839e-01,6.159727104099310679e-02,7.433134132955926399e-01,2.393575467060799600e+00,-1.571202125005443928e-01,2.441371171142278640e-01,7.976220984679676107e-01,4.425385907076759828e+00,1.542888064661303016e+00,5.977045730341133956e-01,-7.083547641622461866e-01,-6.860246318465694770e-01,1.541370430191296270e+00,6.359159518903774178e-01,-5.359687876565496362e-02,-6.083569833511888181e-01,1.754794313397967986e+00,9.513560113147805364e-01,-7.023641986833054629e-01,-5.097140423025692257e-01,5.868939383245693753e-01,2.847589838387408756e-01,-5.525930938174727913e-01,-7.645435254538858194e-01,6.232843567780490535e-01,-3.488395024734020633e-01,3.205052508492924890e-01,2.847825344229788946e+00,-1.383450709368919673e-01,2.602886868895254446e-01,9.432410870243734813e-01,-1.557129350013536639e-01,1.468557671449089774e+00,-2.168834432750767205e-01,9.477360156833607441e-01,-3.284416430075609572e-01,-6.968983117440437081e-01,5.324199323732171640e-01,4.000991016898137742e-01,-7.743293042699644912e-02,1.221950240892786699e+00,8.629297530697725982e-01,-1.024927827457979168e+00,1.027173758601195031e-01,1.585719169672786588e+00,6.570437904163969334e-01,-2.341238274059221358e-01,1.835275885933060014e+00,-2.118981298311976014e-01,7.132911816309892572e-01,2.223689114430332237e-01,9.690490551036363698e-01,-3.803614552812377703e-01
8.357094213254999682e-01,1.113652884837407431e+00,2.084727565181831443e-01,-5.278699103923530922e-01,2.112684816337306315e-01,-8.599373848304531220e-02,-8.784838368912395445e-02,-1.869767686629908998e-01,5.940916047266591171e-01,2.949411165902375842e-01,5.636387809452020337e-01,1.471967010804466347e-01,-4.238626855223796563e-01,2.462759210004066279e-01,-1.454536759584914574e-01,1.673761575345706021e+00,-3.065896902644246191e-01,8.615797813124487226e-02,1.419176108856071705e-01,2.160581928530992957e-01,-8.306888827841658607e-01,8.616408525859986511e-04,-5.244537244507089246e-01,3.351868177909361757e-01,1.352860469826081324e+00,-2.637587012883601534e-01,4.340032623790186506e-01,-5.727586236821947674e-01,-1.406224796343886752e-01,-5.602793053611136997e-01,2.790062116344947385e-01,2.236706473171714560e+00,-3.240356577503843427e-01,-3.637358495263227631e-01,-5.832822974614557676e-01,-7.192668436595357484e-01,1.052049255949457640e+00,1.290040922659362321e+00,1.444431112048729871e+00,1.269417596317633290e+00,5.056420755998028982e-01,1.942405290351178482e-01,3.592773737561300029e-02,1.325907493055245023e-01,4.635334466726033220e-01,8.853789162674232660e-01,2.706191465653800421e+00,-2.938651584137004225e-01,-5.476280064220233335e-02,1.607434953125651322e+00,3.454731524996710768e+00,9.139299802437539366e-01,1.558568198629931567e-01,-5.351297017724423455e-01,-5.811425608482829741e-01,1.440194815795835748e+00,4.294599554204192038e-01,8.716422599053669229e-02,-5.070038586504093114e-01,6.457045394469903554e-01,1.116513960379529768e+00,-2.962816188577604981e-02,-1.516513817381723306e-01,1.132879382055520967e+00,7.677606743488978314e-01,-8.826120448174745725e-02,-5.477839438568463670e-01,6.921196381722980462e-01,4.063270958889270840e-02,1.321694698458635020e-01,2.388735451555570322e+00,-6.623208626118478604e-01,1.786865298156271042e-01,7.212035408748487253e-01,-4.065775429442034516e-01,1.591167615825103576e+00,1.627310398730991703e-01,8.395221584666994197e-01,-4.806222931069077386e-01,-2.614804348068952011e-01,1.708344633840963578e-01,-5.573820444036758914e-03,1.014962181365476335e-01,1.249640076393752297e+00,6.971461222310761929e-01,-7.026040907017767623e-01,4.501473455187686157e-01,1.432894921746963091e+00,3.876658269449203553e-01,5.200558267902553045e-01,1.591879986097302746e+00,-7.993233880168542083e-01,8.137431257901510673e-01,1.823098435545970619e-01,9.792636456039141013e-01,1.051086479471495805e-01
1.212730932762744684e+00,1.428556886273558479e+00,-4.172530059618763110e-01,-3.175918670058019977e-01,-5.384777374206647371e-01,7.021699615654877213e-01,5.751835468458449396e-02,7.104244835673382275e-01,2.415960782701783494e+00,1.604546281395570206e-01,-2.676058083113269648e-02,1.945431567398623884e-01,-4.786670758065418863e-01,7.159637338156096820e-02,-3.068473590806646834e-01,1.822561009445446967e+00,1.053132113397786673e-02,-4.577969450917047101e-01,-1.161553433594683382e-01,1.169882900137281523e-01,-7.855693200219783234e-01,7.359030219522895155e-01,-5.488660014678987675e-01,1.542299037107333626e-02,1.450020795139703944e+00,-2.563897231745458916e-01,-3.857118518945454877e-01,-6.023059368331908914e-01,-9.018950858345535782e-01,-8.830687509516754741e-01,6.230848734468530381e-01,2.418411711627701965e+00,-5.233303602649302944e-02,-1.857205515695095621e-02,-8.961848396263231153e-01,-6.287155926756938795e-01,2.324927757784796434e+00,4.743869685880005571e-01,1.141980899722774057e+00,7.247415056570379877e-01,1.288960548971041842e+00,4.165496825396782787e-01,2.921864726367963683e-01,5.991358388583143402e-01,3.765636095389482962e-01,7.303423658036976018e-01,2.932833608644328294e+00,7.073726066583685412e-01,5.147613934768441313e-01,2.984512613217061294e-01,4.960034492074356649e+00,2.150128946989424694e+00,1.382892263999975668e+00,-2.179695410064900196e-01,-4.782107486893633075e-02,1.019248313379007786e+00,-2.370363109003724711e-01,-7.008751138533229064e-01,-1.147236266490805789e+00,1.833507986145660906e+00,-1.746022630164688894e-01,-5.614442797903571036e-02,-2.420537175461696944e-01,-1.116121703352958017e-01,8.089775350637332663e-01,1.257012843226765486e-01,-1.239956511613022339e-01,9.965376801211818236e-01,-4.042658867418184587e-01,-3.970292461357756153e-01,3.050295251268876573e+00,-2.005637034213408332e-01,-3.496949002426620878e-01,6.989429077101386167e-03,5.396099929570637999e-01,4.382799146004047186e-01,-7.108994815543334678e-03,1.241607068051165941e-01,-1.219008108037590299e+00,-4.969168925503585910e-01,1.075939089143765903e+00,3.375385463062561264e-01,-5.668981827684999031e-01,1.304186620950809061e+00,6.441372396925373334e-01,-1.041161924292317575e+00,-1.562708819149122297e-01,1.383053069429772908e+00,1.196371562907830866e+00,-1.884654479748909539e+00,2.301199760722168808e+00,-4.205733857948582011e-01,1.883304711704986367e+00,4.258103257271860786e-01,-1.157856588098425066e+00,-5.984130835258341108e-01
6.709677517607661734e-01,-2.345741888889568694e-01,1.048913562436689512e-01,1.169237252367236746e-01,-6.854011843116038227e-02,6.843916929543447658e-01,6.831416143190889301e-01,-2.875346448191054560e-01,5.712948230739383071e-01,6.135228355698926217e-01,8.056426380091014083e-01,-2.674600510711630519e-01,-4.899876581471688808e-01,-3.800700933005055071e-02,-2.787197895797355329e-02,1.530316846497811190e+00,-8.992861416041812994e-01,-2.036447023923947941e-01,4.977228562772001430e-01,4.299256236507331685e-01,-1.057391008136879362e+00,1.614597261347273660e-01,-2.915734967003803524e-01,4.173444836823321236e-01,1.160059449109450025e+00,-8.605932047444972977e-01,3.566037135320710982e-01,-7.493755952472980209e-01,-8.631357142668227844e-02,-2.713564382540178954e-01,6.832618035095987530e-01,2.711260576726724825e+00,1.074226855799704228e-01,-2.195878224737889961e-01,-4.065613255670570414e-01,-8.073475033842861803e-01,8.604894515384531317e-01,1.325195771422826851e+00,1.500856671783689533e+00,1.670821577708866856e+00,9.767837075114975676e-01,4.458369445686753973e-01,-2.795044852814110303e-02,1.223836850525019670e-01,5.233651397199848843e-01,7.449658722990395443e-01,2.394092095717943458e+00,-3.452668276579812789e-01,3.612697654909339806e-01,5.991142423905810865e-01,4.171402114628466329e+00,1.456016934939023955e+00,3.253108251679301954e-01,-6.883504480746983623e-01,-9.409260734317809183e-01,1.603128132245511983e+00,4.814126716143395934e-01,-2.552351606764783343e-01,1.431736032257426849e-01,1.504471691701210867e+00,1.590510987631369000e+00,-1.019741597373057473e+00,-8.587386709116363592e-01,6.785382115386365820e-01,3.418774633544808816e-01,-3.477108129595989361e-01,-5.877412905375878349e-01,1.537067399317173066e+00,-5.984168177330783100e-01,-3.460185398821824521e-02,2.738876486010279887e+00,-2.597296461091243569e-01,5.902898731348845685e-01,1.189545072122953906e+00,-1.186272767368239667e-01,1.725235675129270785e+00,7.515569325712789794e-03,4.746358091848233429e-01,-1.560023217848720556e-01,-8.083139442257427643e-01,-3.325438418118267236e-01,7.510434341614725950e-02,-1.182124627970490005e-01,1.456689488819859379e+00,2.873859324308417618e-01,-8.771632196243576152e-01,8.942941736179174650e-02,2.337617728274018702e+00,7.479781121750276318e-01,-4.684834378158003743e-02,1.836538519074093045e+00,-1.114677431496358118e-01,7.582055898466865118e-01,5.630439327775955682e-01,6.327828217159083835e-01,-2.873827106697428579e-01
7.041522771579387108e-01,-7.824953530654032985e-02,-2.083111957237627765e-01,7.302010475605302808e-02,-1.043246929071113688e-01,7.704104930898194592e-01,9.101441165995509675e-01,-2.078846762168185258e-01,1.861753825240253235e-01,4.913054489829544735e-01,1.050049927474697942e+00,-2.245338079234150963e-01,-3.917397997151422229e-01,1.281144803005575539e-01,-2.599868322623289929e-01,1.712958589385613406e+00,-5.573313210349216673e-01,-5.353011817823258855e-01,4.304014077698218865e-01,2.184651702383787752e-01,-7.661973379850339771e-01,2.565490698538258618e-01,-3.968827352387759300e-01,4.221205909435732373e-01,1.277203355818880670e+00,-7.467853179100839567e-01,2.209917036761875342e-01,-7.034659162786334186e-01,-2.058354065702286961e-01,-4.984376058071759985e-01,6.725049645358733841e-01,2.452722915202544485e+00,1.863437009697488933e-01,-2.627080791228397771e-02,-5.116433241998621373e-01,-9.198947801963557325e-01,1.018682617413829039e+00,1.131141547770707856e+00,1.719531946176607429e+00,1.334855364995649385e+00,9.192159730876883206e-01,3.267947823704132615e-01,-1.627445191583161144e-01,2.236643403623638782e-01,3.060810259054185800e-01,7.795333031229189080e-01,2.174738797495368470e+00,-2.098455493932369076e-01,4.052799872172002105e-01,4.228235286383960068e-01,4.465975541930588655e+00,1.671689069366990354e+00,4.163278754783155122e-01,-7.152468831080409650e-01,-7.561342995049059601e-01,1.531186655840532040e+00,4.398419740061550454e-01,-1.788758325915228153e-01,-1.596766633864569185e-01,1.673873661688653369e+00,1.215698152969595602e+00,-1.109048494795783935e+00,-7.545112824177242494e-01,3.837104779730918791e-01,2.431377067499259637e-01,-4.689260062501058313e-01,-7.617128849836917182e-01,1.107058494394161041e+00,-6.785704596713966197e-01,3.620632479365460954e-01,2.737288517452194814e+00,-8.975565342577565553e-02,4.351080238594623451e-01,1.180634345896788284e+00,-7.042524322667252645e-02,1.571080703949022439e+00,-2.765086891061797614e-01,5.399652892203284926e-01,-1.825857682679059568e-01,-9.387530009960671773e-01,9.733400221297472399e-02,1.564100938493389326e-01,-1.545923278138688628e-01,1.435498327085789061e+00,4.720536266939347469e-01,-1.003171077042457782e+00,7.509869214389144898e-02,1.871349594283322926e+00,8.106480991278874892e-01,-2.445734445380453592e-01,1.696063421721216269e+00,-8.139666943868756332e-02,6.771705283972264677e-01,4.670829873732315063e-01,6.408539676461797452e-01,-4.596598433037815679e-01
7.044997917542047405e-01,8.570435855185591922e-01,3.689986835430607015e-01,-3.703310024150957558e-01,4.101833624484165219e-01,9.314192674592869370e-02,7.286225601591318490e-01,-5.704966049184957422e-01,6.699515110362153081e-03,-3.613343567451374194e-02,-2.664340382695279397e-02,-3.008636580185142240e-01,-5.253216200431030103e-01,2.229588969431071654e-01,5.929764471599568987e-02,7.687804075038565665e-01,-8.915067067257540501e-01,-2.498756388651307003e-01,2.406445624852808773e-01,2.475105531934215786e-01,-9.442998676954139636e-01,-5.357727132484523258e-01,-7.210025974296581097e-01,4.518181632777683587e-01,1.392825464809407610e+00,3.253880004285586991e-01,4.155474136965434662e-01,-6.827757866166062062e-01,-8.535695266253450209e-01,-7.380553679819870094e-01,4.384058575588342666e-01,2.368141366970885731e+00,-9.081336253567612316e-02,-5.963386608259549360e-02,-6.874459758324575898e-01,-5.980052159176070248e-01,1.176669723803726697e+00,1.007544432911075649e+00,1.385427346298116591e+00,5.080186786128517706e-01,4.277622519165754644e-01,5.174675739652468964e-01,-2.754082982494304166e-01,6.673572454747041249e-02,9.177641056775787121e-01,1.124849340556286048e+00,2.152192518563770918e+00,-8.964451035101343723e-02,1.758339428024000006e-01,9.688596223489803760e-01,3.451003821786071679e+00,1.286142335814182580e+00,-2.459537894466959917e-01,-3.646702779141848816e-01,-1.808304914112826289e-01,1.137662857268040506e+00,-3.431849157025271824e-01,-3.225311345748342606e-02,-2.024479112232372424e-01,5.497201832806464239e-02,8.022125992838604613e-01,-4.103694412952200166e-01,-1.085828400114472458e-01,4.442802221826919751e-01,1.005163803051996041e+00,3.749794327329465382e-01,-6.061375139239798537e-01,9.776588168340880625e-01,-4.701132185872611835e-01,7.259186091836569155e-01,1.800665075364466627e+00,-6.280463070271429249e-01,7.597229660770001003e-02,7.936690149906675540e-01,-1.999290212358511010e-01,1.355145987591527490e+00,-2.226566539122146748e-01,-1.096575978439815469e-01,-5.729211839926550143e-01,-6.315139682909107766e-01,-4.838822411647114574e-02,-6.554464096312371257e-01,-1.032087311087290793e-01,1.732559500948914089e+00,1.101644816119534687e-01,-7.039228413179630106e-01,5.851928162278334788e-01,9.353130663631655795e-01,7.308593950144227636e-01,3.640343335264177305e-01,9.275105608404698998e-01,-9.315640192985323864e-01,8.483547352929622365e-01,5.080256821258440914e-01,-8.110296960600360539e-02,-8.612857112294025619e-02
1.177101140539526636e+00,1.198342319814946322e+00,-1.168791790874306180e-01,-1.200636548019481387e-01,-3.248049839787630066e-01,4.082387256587487467e-01,-5.008494525038234002e-01,5.667665180857647256e-01,2.294306298925687049e+00,5.011506810369528164e-01,4.365486172480474991e-01,2.791427032365855210e-01,-4.846164848695940774e-01,1.646581261897797077e-01,-5.239166757793239926e-02,2.204586988695691030e+00,-4.653934586825786424e-02,-7.145288966221478855e-02,1.630471914322251248e-01,3.745897421332363697e-01,-1.031352914880232285e+00,5.486855940339484539e-01,-3.692509281291228573e-01,1.670827724492788824e-01,1.066301781423256934e+00,-9.358229088009921703e-01,-1.166872498646034928e-02,-5.559132969084589204e-01,3.238893749654909726e-01,-1.422975537690780445e-01,6.120905315937454905e-01,2.380428318743969207e+00,-1.205198198615108074e-01,-5.989087989757722053e-01,-6.275683870863197900e-01,-8.038452430538649551e-01,1.509674557727658240e+00,1.135851797181286260e+00,8.022957848010749959e-01,1.522683700818260544e+00,1.265817421199545656e+00,1.942711262412672168e-01,4.057330196852143578e-01,5.834388173639855069e-01,2.810810968478733018e-01,6.572535629201146090e-01,3.288766933706549267e+00,1.521641025780365863e-01,3.057006563020380763e-01,1.289781185787507667e+00,4.483321720217646522e+00,1.147602634067169225e+00,1.184550261723190001e+00,-5.337697034430668452e-01,-5.959595001526829527e-01,1.233647657027094446e+00,2.748019709191765747e-01,-4.874344770526053416e-01,-6.485146109951377413e-01,1.322228984296156540e+00,1.134255069446481912e+00,-2.542400973572667144e-02,-6.073221745367075597e-01,7.072809297392841366e-01,3.291734823378786867e-01,-4.646601488288206738e-01,-9.406353558719537933e-02,1.202714031132328554e+00,-3.004472272548642797e-01,-8.836263454390891336e-01,3.458566467606436934e+00,-4.948661529909733625e-01,2.718979966775629531e-02,7.062244752506201539e-01,1.099910554405734292e-01,1.439978015456655491e+00,6.372274924213516822e-01,7.664115979388348432e-01,-4.277776699229204338e-01,-3.418521865910428281e-01,3.371432326629422160e-01,4.211324918867745404e-01,-1.095720510016632565e-01,8.104998083329512104e-01,5.903161380043648876e-01,-6.082869464100132406e-01,-9.119732155952725572e-02,2.344332445221728012e+00,6.931636790454217545e-01,-7.740858430531314394e-01,2.557989010906795979e+00,-5.069779649415753209e-01,1.652803817529966857e+00,3.142698255613531888e-01,2.076872020128042451e-01,-7.762031042213896059e-02
1.057997287450446855e+00,2.109884841673964617e-01,-7.317187664859154950e-01,3.166016425615376662e-01,-6.881244546499953874e-01,1.299323927790739575e+00,6.842251841145065017e-01,5.996666619694214218e-01,1.697482121240383890e+00,5.456742535238663372e-01,9.252709407789392326e-01,-5.098660214178757366e-02,-3.952441984515309148e-01,9.447735819977216842e-02,-3.739999735643819712e-01,2.239491119184251922e+00,-9.069771354483929793e-02,-8.774590921311408165e-01,3.056735019242671214e-01,1.870560062293918635e-01,-7.383185137148706723e-01,9.074053327656930179e-01,-3.404420820903550360e-01,2.032916273787752914e-01,1.193324032943917645e+00,-1.129930833474600771e+00,-3.528159860885667909e-01,-6.684357937948767203e-01,-1.650964599645547981e-01,-4.440660000220459924e-01,9.400163694857683883e-01,2.471150688731623024e+00,3.785008784822144201e-01,-1.278940346914797521e-02,-6.747708113525264784e-01,-9.877015789651063526e-01,1.759155935999196840e+00,7.289731676953548067e-01,1.338388084022763103e+00,1.247597542590275888e+00,1.585911435215891174e+00,3.131477809416381985e-01,1.238740047999225963e-01,6.805133801495918400e-01,4.051998255079203304e-02,5.872420209272471991e-01,2.578282967354685873e+00,4.086616761626906680e-01,7.758539395268843064e-01,-1.541034847612912095e-01,5.637927023063960874e+00,2.238827090980405110e+00,1.487589131551735555e+00,-6.303951302887509378e-01,-5.511792023448477407e-01,1.275891145452234809e+00,2.003446030032220715e-01,-7.174421987988481852e-01,-6.250818636732573541e-01,2.559889703441692532e+00,6.713442478671300950e-01,-1.067042369038832650e+00,-9.841635846353857797e-01,-2.876136887106968132e-01,-3.716260920152758551e-02,-6.959983921950583241e-01,-4.155589316122970667e-01,1.280947532040079828e+00,-9.672365690790546422e-01,-3.128304022567011122e-01,3.621040035996727191e+00,2.042270360167058318e-01,1.117717597875060864e-01,8.995060061234423365e-01,5.254988332098176063e-01,1.060386960642538678e+00,-1.178668329171371765e-01,4.033356507776025279e-01,-4.154885788038271688e-01,-1.047323276609618325e+00,6.970481100106544758e-01,6.166320084113448008e-01,-4.824682657599496105e-01,1.135324855019842705e+00,5.439838625813542272e-01,-1.104468384121661373e+00,-4.445364946445367615e-01,2.227209245693046569e+00,1.227398984524963099e+00,-1.825113114233025913e+00,2.501381970980411484e+00,2.142388056641786331e-01,1.483039590330999857e+00,5.380600967158035708e-01,-3.819276693802752254e-01,-8.274170724695826262e-01
1.061336550263453748e+00,1.267047231418331421e+00,-2.072031992725791860e-01,-3.922733178630646855e-01,-1.418324461870203446e-01,9.606514170123089946e-02,-5.954118286679703775e-01,3.781593206884312774e-01,1.349403986565833602e+00,5.628663807935230246e-01,1.118075740817344954e+00,4.708338146249747003e-01,-3.267988069919642302e-01,3.396555147309671119e-01,-3.390960134382232094e-01,2.598973712267872216e+00,3.298601373137112769e-01,9.806452925380362839e-03,1.201690470474540140e-01,1.714042783774873402e-01,-6.983751911487231512e-01,5.886454568927439457e-01,-3.757414257403162705e-01,2.326795195038082187e-01,1.214043858427194200e+00,-9.610496173807447917e-01,2.121517943013566110e-01,-4.755581017477817918e-01,5.841964353877089344e-01,-3.001657428386074189e-01,3.523344770601611886e-01,2.065096666829095540e+00,-2.899253231703274869e-01,-5.817375995473668127e-01,-5.612102501921516495e-01,-9.422864790496278120e-01,1.140626604069935102e+00,1.356380150644725280e+00,1.310325429470171832e+00,1.728223157422126732e+00,8.645540868305114923e-01,-9.356351211365282472e-02,2.858838202560482489e-01,4.328451177649346726e-01,-4.136419818369863055e-02,6.546293787153797394e-01,3.144364364280479940e+00,-2.174356973500029266e-01,-2.472852964771385387e-03,1.793909624968256900e+00,4.085742571928029143e+00,8.334298623584714960e-01,8.685454831177202850e-01,-7.154483806910990618e-01,-7.988960761781862541e-01,1.519219481484536782e+00,8.603007955967744147e-01,-2.529874178201779733e-02,-8.270198767390989358e-01,1.372280655533637761e+00,1.284874781941538036e+00,5.176088866479880424e-02,-4.101665614562779449e-01,1.228550690436361670e+00,2.608172258736294324e-01,-7.186614997075759792e-01,-4.459385719579313512e-01,5.343305426145247283e-01,9.399255069454975908e-02,-4.428170215428326451e-01,3.272654819293920436e+00,-5.048459917046110856e-01,1.538064075773116768e-01,8.207366444446182463e-01,-3.179067637538347535e-01,1.726371150803896137e+00,4.726738908821642160e-01,1.473040950625213785e+00,-2.673343600054247649e-01,-1.974050810543894197e-01,5.167047020664923274e-01,6.239092639030101584e-01,1.606989509495928559e-01,7.062680600972855993e-01,1.077918333726845201e+00,-6.940992702828074901e-01,1.154036302762958544e-01,1.994469173233626824e+00,3.126649907041323395e-01,5.471155360341056761e-02,2.339818507811973980e+00,-5.395409317171748764e-01,1.050361687839951763e+00,-5.215153177032361143e-03,1.458654138257272637e+00,6.709434552368831461e-02
1.224548649970167435e+00,1.270237758050693166e+00,-3.763956758188889418e-01,-2.284588968933420894e-02,-4.034914972157257473e-01,7.063274342216343538e-01,5.060284715283852597e-02,6.314040978842100360e-01,2.152526810760060805e+00,2.294567048015293820e-01,1.871120887849295478e-01,1.069002099325514904e-01,-4.805257965625446825e-01,2.402583364560441637e-01,-1.314568284844868096e-01,1.931742335188960213e+00,-2.298304180331461888e-02,-5.685695606135355851e-01,1.156370635844021499e-01,2.331200866150459627e-01,-8.886721071774777991e-01,4.962538015531957614e-01,-5.427747895773660236e-01,1.625223405889018036e-01,1.169310116705091218e+00,-5.838221688346192373e-01,-2.822021772257529149e-01,-5.797058827203904752e-01,-2.223723438295094335e-01,-4.235874516442528215e-01,7.569972686178134680e-01,2.296871164999178649e+00,1.023765981888365428e-01,-2.711428810586596350e-01,-8.144568630593942427e-01,-8.076812760333936803e-01,1.934849656151659936e+00,7.071967189769927664e-01,8.255450968953010893e-01,8.137229856555165952e-01,1.358417152760366786e+00,3.087141305735867092e-01,2.231876329213944299e-01,7.302031429800808215e-01,3.352903116023315810e-01,7.660569013579081599e-01,2.939656802093296051e+00,5.522160761956617092e-01,5.646644148402235608e-01,6.242008567681618381e-01,4.991430286774289904e+00,1.697944502995350158e+00,1.315108004728330116e+00,-4.070643303988193962e-01,-1.636328268011332243e-01,9.383781606218228877e-01,-2.759406213610307024e-01,-6.597565501031312785e-01,-8.367990095755510893e-01,1.359542749763007707e+00,4.843424766720365593e-01,-2.602671014521910631e-01,-5.410896166490483106e-01,-7.798020132081695532e-02,3.705907322812160842e-01,-2.937003397815980410e-01,-1.401096077564345510e-01,1.116199980103220746e+00,-7.001624392565708455e-01,-4.597311220928175235e-01,3.332081086613264631e+00,-2.811232891739302575e-01,-2.438408712661238043e-01,6.034051251943918226e-01,4.373864621386619467e-01,1.003655858721784089e+00,2.515376111477612420e-01,2.077391690743234376e-01,-6.229592538195619644e-01,-6.528571937250950974e-01,6.995285521671971152e-01,2.286243838550379159e-01,-3.613711051307390010e-01,1.016836294909096328e+00,4.108222843163132909e-01,-7.416750148311812563e-01,-1.619627423841408786e-01,1.796866649418279671e+00,1.060837132067222521e+00,-1.471436999551882119e+00,2.299711652006398932e+00,-4.886696085905623543e-01,1.855127204861728440e+00,4.553183027853402454e-01,-7.367016278095093185e-01,-4.157286952857325857e-01
1.217924838781417218e+00,1.498479424356500056e+00,-1.020945339622867515e-01,-2.466314586871782844e-01,-3.397366405963411218e-01,4.542383164317898570e-01,-2.653452576554580777e-01,5.866213663763780728e-01,2.500082824548576887e+00,2.127394506018218667e-01,-1.608467455876361751e-01,1.794714927190595999e-01,-5.459020660165958549e-01,1.111561384059487484e-01,-3.065221633814974034e-02,1.731868966631811446e+00,-1.780434429804735874e-01,-2.037342652469241733e-01,7.010756491333404450e-03,3.091091276285565237e-01,-1.032508231137933219e+00,4.377185708882977422e-01,-5.244285368558548877e-01,9.461653870058900351e-02,1.230179801908160675e+00,-3.816347332755355981e-01,-1.829884594701141898e-01,-5.889824839751962582e-01,-4.241668311582155182e-01,-4.915470365059118052e-01,6.220759586095937488e-01,2.442029946578225363e+00,-1.125375288065603163e-01,-3.503184054086258548e-01,-8.028216652014752430e-01,-6.252962009910416619e-01,1.987020811477569593e+00,7.637157122961044653e-01,7.662425409130242393e-01,9.258679146126237436e-01,1.250234539392034883e+00,3.981008479737158101e-01,3.508568098012664893e-01,5.897160845984065203e-01,5.323242765594826675e-01,7.715744754052404897e-01,3.150148733523961742e+00,5.081078963471881149e-01,4.156188134933178069e-01,8.616165123790725522e-01,4.554167686386371372e+00,1.573804737228953865e+00,1.188039568884245334e+00,-2.753115277490966184e-01,-1.729501915369128784e-01,9.827332281983571782e-01,-2.643226590033870282e-01,-6.481574876884796943e-01,-8.404927677067115521e-01,1.162486436359544406e+00,4.250394080858588275e-01,9.795264771908607226e-02,-3.415648236725599141e-01,2.359107146686147405e-01,7.266216331130446182e-01,4.214609605050723129e-02,1.364241978541347322e-03,1.223121285059709518e+00,-3.920026931535249837e-01,-6.709551422779089780e-01,3.102815673888669856e+00,-4.830324590210955393e-01,-2.516064036527634329e-01,2.889581485577101816e-01,3.650015463734095356e-01,8.857116041106057880e-01,3.950520373673657715e-01,1.753561682159032742e-01,-8.979396228850984318e-01,-3.777803954034772427e-01,5.942181849238113989e-01,1.505489495430763214e-01,-3.592694894361067037e-01,1.119950347219529796e+00,4.224335154134043480e-01,-7.123416521500307574e-01,-4.780933747175886150e-02,1.773592168834200233e+00,9.826583841061898861e-01,-1.307742462169210640e+00,2.309380325342701656e+00,-6.568633509499084422e-01,1.923688618698121022e+00,4.433723566236707492e-01,-8.372695658957218789e-01,-2.568722503725692774e-01
1.329969062680487646e+00,1.710188940750421160e+00,-1.205001345365737941e-01,-2.933611787027801121e-01,-4.408779040784420178e-01,3.224890426920569153e-01,-8.456840353629027085e-01,8.369806950211016172e-01,3.042365812088585919e+00,4.039648590901476766e-01,5.169493890424908811e-02,4.316031917528066475e-01,-5.221255172909102793e-01,1.222004960945529545e-01,-4.913009542763496773e-02,2.212659227853864596e+00,1.038521701712980527e-01,4.132471209320529026e-02,-2.736039159747884197e-02,3.590306436664073009e-01,-1.064699085080519581e+00,6.871957872590206406e-01,-4.079221988294308154e-01,2.882721706705723697e-02,1.131532086159099393e+00,-7.536150468128149926e-01,-1.680372498028541994e-01,-5.243769711442410886e-01,8.791649880764462743e-02,-2.696080704203269729e-01,5.611441221165807125e-01,2.395833754921253611e+00,-2.468137002661211499e-01,-6.215771692022540318e-01,-7.379034548525502668e-01,-6.793002683897095828e-01,1.906178967703296534e+00,9.598137756827419542e-01,6.192601611179220367e-01,1.379663835300826147e+00,1.349014155078327892e+00,2.318475725812228772e-01,5.753260151159100833e-01,6.648077261837495033e-01,3.355843794186461615e-01,6.401187140847957036e-01,3.573260603770153754e+00,4.096693065513941634e-01,2.970243231521789706e-01,1.326779608688449574e+00,4.527040471104466945e+00,1.249506418131724583e+00,1.449054902889281404e+00,-3.599982539121248104e-01,-3.940769660477043690e-01,1.097092188407806201e+00,9.286958492682273469e-02,-6.339210488569180235e-01,-9.526743719606183269e-01,1.331148550650103957e+00,7.129976789131623471e-01,3.806886752049433165e-01,-4.070194924937585723e-01,6.481239076424888390e-01,5.735566322091392166e-01,-2.222279171453029889e-01,1.271844388687702887e-01,1.181005375851005290e+00,-1.356307650349627414e-01,-1.165557160388128954e+00,3.509758725723444606e+00,-5.761690478584665653e-01,-2.076342097767303052e-01,2.846740742934037449e-01,2.676961979867923391e-01,1.082968659343991780e+00,7.577701302935828664e-01,6.589082685882592383e-01,-7.954985813616241019e-01,-1.384744806925944371e-01,6.116278530499927868e-01,4.701773660958523116e-01,-2.249550229995756212e-01,7.828290002828903749e-01,6.591360451220924510e-01,-6.115901661896475661e-01,-1.342446726896211473e-01,2.197919539742716477e+00,7.798960897154442184e-01,-1.214814459114819334e+00,2.750716446422916572e+00,-6.471705273325937258e-01,2.024128977293510712e+00,2.896526576332902336e-01,-3.214046953343353552e-01,-7.641724616846162776e-02
7.499362419523945000e-01,2.773578432708945218e-02,9.829933245894621752e-02,1.860058366537594710e-01,5.661445203774610746e-02,5.463739190123100276e-01,5.082720024598363917e-01,-2.582379299552238217e-01,4.629823047609204489e-01,5.629966244689239563e-01,8.830126838419394275e-01,-2.223813351511264025e-01,-4.707096375281140666e-01,1.667752290940254789e-01,4.832439521137565919e-02,1.670590208997129622e+00,-7.258143565696217880e-01,-2.766428178956519268e-01,5.607616400051996797e-01,4.403119573239778206e-01,-1.052273338239297473e+00,-1.106696276064766948e-02,-3.586061296174001822e-01,4.884969086605766009e-01,1.010885576056104629e+00,-9.432733215575775931e-01,3.911572383264744768e-01,-6.849185973361048285e-01,3.569238298117487496e-01,-3.445213176789607701e-02,7.032758784986434808e-01,2.486811337542715439e+00,1.388523618577653385e-01,-4.113407234497545306e-01,-4.195391249671981959e-01,-9.236679563200533849e-01,7.088098745678554913e-01,1.423796548897145131e+00,1.240009527147639012e+00,1.567782813078988369e+00,9.541057763253784074e-01,3.047161373650730254e-01,-5.936560777567810587e-02,2.640469848988337698e-01,4.559381614760025792e-01,8.027430464430649337e-01,2.475782480220315218e+00,-3.727345493743274285e-01,3.333878604788169109e-01,1.008180455607774251e+00,4.131098818149899543e+00,1.068499907191350573e+00,3.153718293722859167e-01,-7.734605225750459390e-01,-8.838237109787889789e-01,1.463351981380698108e+00,3.862731115793802683e-01,-1.813142253388349001e-01,1.471236333187413425e-01,1.005426342112177629e+00,1.855556662705189375e+00,-9.285155931902511206e-01,-9.010924386395205987e-01,7.136791636520000148e-01,1.132490052069090591e-01,-5.942775414889421848e-01,-5.753699229022145589e-01,1.396556086267576768e+00,-6.970407644687414139e-01,-4.017769496737777501e-02,2.904100446654305223e+00,-3.826132794286877803e-01,5.162866127267440319e-01,1.476961554442157043e+00,-2.045387024186293978e-01,2.034041557439920211e+00,2.109621752052192600e-01,5.863851051093881273e-01,1.647810559971478739e-01,-8.129052846409869915e-01,-3.975109829850054233e-01,-3.992491608815568194e-03,4.847619394381064151e-02,1.186866755165610243e+00,2.230429107034413994e-01,-6.341477259091296004e-01,1.386472567467875172e-01,2.376447435298619126e+00,6.103712874991911175e-01,2.422848038036056750e-01,1.804009404084945256e+00,-3.165885787809207264e-01,8.159919915965301307e-01,4.967486396463036136e-01,8.991979762159256762e-01,-1.059035028214044827e-01
8.044994058325757313e-01,1.268384482502159738e+00,6.126584749473548697e-02,-7.296702368952414641e-01,2.438680886685638538e-01,-1.830397944025474177e-01,-3.106615192578116025e-02,-2.147251010554844242e-01,1.688997779803991239e-01,2.323088122820319845e-01,8.080099531877846797e-01,2.493671447831323496e-01,-3.337864660398829342e-01,3.330218760354212715e-01,-3.719768774312958159e-01,1.822310862163644130e+00,-4.390955867438572913e-02,1.918900272741574931e-02,3.523260570499569394e-02,3.227181262477418072e-02,-5.782076109841671752e-01,8.648138738440580564e-02,-5.811344308736359210e-01,3.238597813877760467e-01,1.527018923207291712e+00,-1.068702714716395774e-01,4.383908205138562497e-01,-5.320762175204558631e-01,-2.949104887856230928e-01,-8.319882929524881066e-01,1.425782909104635898e-01,2.052869172019743615e+00,-3.995688233607046502e-01,-2.158754320633319290e-01,-6.285878277395349212e-01,-7.557475784679019704e-01,1.090784914798424765e+00,1.225625701252065713e+00,1.779854766686407075e+00,1.156026107805456338e+00,3.082689360861456951e-01,8.134668870723821277e-02,-4.688503773743803171e-02,8.085873655251842040e-02,2.963994772306220993e-01,9.010124459979252931e-01,2.563438337663553224e+00,-3.254470086641930160e-01,-1.644487237528846069e-01,1.645034339666798129e+00,3.391692739414201796e+00,9.948007611741036538e-01,7.547214408014768505e-02,-5.491559880747169942e-01,-5.294782216301285871e-01,1.518913736250493418e+00,6.001656155663996906e-01,2.731362796733354248e-01,-7.690651880371991433e-01,7.982087708205054533e-01,8.373285902430792627e-01,3.459466823132059665e-02,5.612959140714481737e-02,1.189108499398537466e+00,8.423832528919577012e-01,-8.890367624245293365e-02,-7.314755674188192502e-01,2.538619428055827743e-01,2.274189195707398414e-01,4.744555964450697938e-01,2.218080543130681814e+00,-5.946180684370838687e-01,1.227741588749014373e-01,5.929511567377614423e-01,-5.145703215519867868e-01,1.477605910665822586e+00,-7.410913255533307931e-02,1.066922169277141119e+00,-6.005743070499741654e-01,-2.145239277386649657e-01,4.949791339531415257e-01,9.702259277095584555e-02,1.298341799041035083e-01,1.290190278284513825e+00,9.870717726933341263e-01,-8.501154009183212734e-01,5.352003876592311693e-01,9.873572687946330362e-01,3.128460381882386399e-01,6.451294362060282506e-01,1.432577419927176354e+00,-8.087426923186106231e-01,5.828766399228539896e-01,2.747368256748916604e-02,1.285671394088989672e+00,5.162812010957329445e-02
7.332990983534495300e-01,4.519995967466313713e-01,8.226815989856084421e-03,-5.954403015828894086e-01,-2.068455679102002565e-01,2.089749352960758033e-01,-1.700555093984578714e-01,-1.992507302446058781e-03,9.820726823685641538e-01,7.449404881394425804e-01,1.148416214003374680e+00,3.220349171090745588e-01,-3.566126929938629453e-01,-1.094527853804127121e-01,-4.673134244515837477e-01,2.202268456292254761e+00,-2.248810225687956632e-01,3.461467452151690827e-01,7.354884026757832483e-02,1.869211608990761220e-01,-7.322447461402228353e-01,7.671972337221584226e-01,-1.950122293901089265e-01,1.737316200803510902e-01,1.534666898871357654e+00,-7.922680416385601276e-01,3.987924522617908307e-01,-6.308695420701065926e-01,-2.335842219916255402e-01,-7.544771766268021373e-01,2.100127467453214991e-01,2.568275921539630247e+00,-4.315212372136038033e-01,-2.205980972550450891e-01,-4.165272828850666298e-01,-6.983482747752813857e-01,1.069921433718606263e+00,1.390612117233276379e+00,2.053151549316842850e+00,2.175023804324818233e+00,6.787146310651985814e-01,1.852535044242083484e-01,2.674747500206510753e-01,-6.703024781926039677e-02,1.510556892612727742e-01,5.608167516872608616e-01,2.845310869530341069e+00,-4.894927698261063442e-01,-1.030200562187046781e-01,1.183992622420088958e+00,3.720060445752525258e+00,1.389848607441245054e+00,4.870443118450991649e-01,-6.254774074305521347e-01,-1.132786001361475670e+00,2.007257587294256851e+00,1.316588643461697572e+00,4.505597764781071879e-02,-5.893256052089091979e-01,2.229289345777009324e+00,1.097221617315095488e+00,-2.189913913352700137e-01,-3.139178650773964963e-01,1.531021874357193724e+00,7.753730186998379903e-01,-2.097709038901448553e-01,-6.261263146087531206e-01,8.096437983262464444e-01,4.446995563284973363e-01,-2.481637376430012587e-01,2.665834660527830913e+00,-3.369742436668639041e-01,5.314282883610828012e-01,3.926536926673948047e-01,-4.126993478488931166e-01,1.372172790306174006e+00,2.075646926056251562e-02,1.423192485133046858e+00,-7.770202720549292952e-01,-1.412144001298310247e-01,3.485212596494930981e-01,7.038228072903005561e-01,-3.034936049583741857e-02,1.354125852164749011e+00,1.231532804169108708e+00,-1.180960294290614110e+00,1.815990808038227544e-01,1.955565594503237747e+00,3.945526147588697130e-01,1.325944803258431448e-01,2.186626760177002193e+00,-1.320187819146064756e-01,5.427216226530358067e-01,9.287518576236705736e-02,1.515471641224758192e+00,-1.607299890270833531e-01
9.733951993080726117e-01,1.922881798780743168e+00,-1.853151263638394552e-01,-8.973280555796903091e-01,2.482339888306659970e-01,-3.898400048092856562e-01,-4.135151890066754432e-01,4.838056525821964049e-02,2.047195140346860232e-01,1.458550766174623314e-01,1.057698908165238594e+00,5.307163445945211055e-01,-2.271683503187143793e-01,6.036222702076432522e-01,-5.566530237553812821e-01,2.311505980610370159e+00,5.791353747937693086e-01,-8.147364275502269604e-02,-9.835682061012732125e-02,-1.465238172725887300e-01,-3.234057006704361692e-01,2.130073806159896166e-01,-6.780833803917916125e-01,2.900498124465803462e-01,1.548140470130648039e+00,-1.196573667204766100e-01,3.452199323488839289e-01,-3.981308815530457679e-01,2.916407282473754137e-02,-8.637136447698893216e-01,3.174479236231181334e-02,1.643738628294949766e+00,-4.872854844676711705e-01,-3.146774415389270163e-01,-7.295057510485740693e-01,-8.923582212814289427e-01,1.196340946075704181e+00,1.186776329070071023e+00,1.733231560033296148e+00,9.951568042990061036e-01,2.327384687715910450e-01,-2.022735562252988006e-01,-1.524203480698772817e-02,2.745940448367608089e-01,-1.527747687339242599e-02,9.055764566826710604e-01,2.739770788156192793e+00,-2.380665444401235953e-01,-2.788285814130472273e-01,2.107405424286870055e+00,3.476054423109218749e+00,7.489288017318509461e-01,2.883772474815436970e-01,-6.021839952069166779e-01,-3.849725443491459065e-01,1.416538735834864893e+00,6.844197724711876818e-01,4.147459090860990960e-01,-1.225368366823799793e+00,6.632049593341480254e-01,6.629193065551474140e-01,3.802426139466128507e-01,2.381930661927012804e-01,1.259620124351056969e+00,6.919048355307314546e-01,-3.541336375316461726e-01,-7.630187884385994934e-01,-3.258248010017231744e-01,3.926970036262986130e-01,5.196017008180797703e-01,2.448639958129762206e+00,-6.413266773461147041e-01,-1.131153175064891075e-01,5.670624822117318331e-01,-5.943694388788456351e-01,1.519095517974083043e+00,2.026181347186362114e-02,1.475304344817808921e+00,-5.371738786138016142e-01,-7.036739326735441669e-02,9.472294210094869271e-01,2.918221793414328413e-01,2.664535469497800735e-01,9.390369085523302406e-01,1.316179243006702748e+00,-7.646243313925814578e-01,5.564392367668307138e-01,6.764705471722312069e-01,1.444993126325706534e-01,7.005525927572737732e-01,1.523473546965515846e+00,-1.005829173785314889e+00,6.539929560335138170e-01,-2.302494543310446562e-01,1.672325636462485443e+00,1.556149173561736099e-01
1.254844677930743835e+00,1.984635034956934607e+00,-5.830978673947584401e-01,-3.459157610692749074e-01,-1.355918960954809460e-01,3.850061208043825678e-01,1.877741918677672817e-01,5.322490028896117442e-01,1.217824689160491580e+00,-1.528317551121916862e-01,3.072882868883451968e-01,2.134408794300395318e-01,-3.466599846922162054e-01,6.216723270032388227e-01,-3.824786586685494649e-01,1.951808999653882326e+00,4.747106823121990948e-01,-8.822458987188438462e-01,-5.438225746205570948e-02,-1.042441016966881295e-01,-4.596750859869406236e-01,2.529116839318740206e-01,-8.434720704356977183e-01,2.224891873272111797e-01,1.383300399842924078e+00,-6.534123402287393689e-03,-2.965375432567403102e-01,-4.626336418265687978e-01,-4.422031975968112594e-01,-8.160647482915758255e-01,5.590255947325847297e-01,1.741881706087888837e+00,3.911894281143141194e-02,-7.729654207260486243e-02,-1.012322345126251300e+00,-9.009500179334913872e-01,2.048895114848850785e+00,4.969737547513962128e-01,1.071531062454074590e+00,5.204914068993837795e-02,9.298482149815898712e-01,9.107716772487434165e-02,-5.229752335784293438e-02,7.899079552566737883e-01,1.748487646362850700e-01,9.744330173553419350e-01,2.615840778864671812e+00,6.535038297738515745e-01,4.119713839493289731e-01,9.133596526417074868e-01,4.806882981927913079e+00,1.603385327264981175e+00,1.048689214163372352e+00,-3.786163649702122824e-01,2.777382723239774087e-01,7.303483763442459864e-01,-4.933211531797311311e-01,-3.175753869751017922e-01,-1.324990947529147256e+00,7.709233700430377922e-01,-7.005640155583345297e-02,-2.330741079359113788e-02,-6.898531108913566467e-02,-2.579759449125237358e-01,4.758547164927751094e-01,-2.527893462122912105e-01,-4.202480899383393975e-01,2.155476630767518831e-01,-6.093268815920294124e-01,3.699797559858183371e-01,2.917706032664086901e+00,-3.229384402545926736e-01,-5.856183708756752537e-01,5.434378034496112342e-01,2.774139618315987210e-01,8.884920989279982972e-01,-1.004578489903889538e-01,2.930294787385541166e-01,-6.815698527490088310e-01,-6.451620767109137455e-01,1.259608678537974091e+00,4.026760248332814096e-02,-2.486472905378313558e-01,9.996023298185408024e-01,6.540368339841267087e-01,-7.418148271369906510e-01,1.199339093341381668e-01,6.651635548402545783e-01,9.413276897644647923e-01,-1.115747223555511036e+00,1.704622953616126813e+00,-8.825253530840128091e-01,1.635475616880583072e+00,2.149087193465016310e-01,-5.335202759583688170e-01,-3.848506075915774649e-01
9.896141984739892372e-01,1.384449649683660244e+00,-2.027435045748068321e-01,-2.706733535134803192e-01,1.318078747981723531e-01,3.420417303289607358e-01,6.401291337929087000e-01,-1.493811862623792286e-02,4.719041267249790006e-01,-1.503940947593022381e-01,1.640646353065631224e-01,-1.067134816947481191e-01,-4.239185249582744230e-01,4.824846273466400493e-01,-1.766524015873806863e-01,1.335485632167575654e+00,-1.837382437913428201e-01,-7.515563817984602935e-01,1.260170237767203605e-01,3.783759605112440444e-02,-6.549663153534251991e-01,-1.798545901611992015e-01,-8.274783531430076611e-01,3.663267122971989309e-01,1.372742283012194697e+00,1.797519543233717654e-01,-1.905578619929126916e-03,-5.738693328283255291e-01,-6.679361104497909540e-01,-7.827751114137589949e-01,5.653483601676664305e-01,1.994854447326043889e+00,7.580441744360472134e-02,-6.783335834304987655e-03,-8.856470638381392924e-01,-7.997413081268804902e-01,1.652435155246380294e+00,6.723858765919538127e-01,1.213044124299627713e+00,1.027217547510343998e-01,7.159933558132948184e-01,3.032839695190563956e-01,-2.395045669165267177e-01,4.955363248609482296e-01,5.245587617292203353e-01,1.081544280403824221e+00,2.263240610255860652e+00,3.589883817945359601e-01,3.791152559075478545e-01,7.923328238162251624e-01,4.307795619744273274e+00,1.535416418766329061e+00,4.316067788277720974e-01,-3.853019342712319939e-01,1.383939318583576883e-01,8.501367101336851917e-01,-5.520532939105409209e-01,-2.046048453197438222e-01,-7.699963003127689998e-01,3.865091140211809329e-01,3.007741524660481613e-01,-3.512473310337712595e-01,-1.338670985039552841e-01,-1.308580769513378872e-01,6.470418282275083310e-01,2.335797591697552633e-03,-5.538095684133292895e-01,5.654835700366626083e-01,-7.124614594877461959e-01,6.859439421466815290e-01,2.386441927371479643e+00,-4.056947265849848994e-01,-3.035983086999901048e-01,7.651387555843764954e-01,1.079917215554355298e-01,1.107548235060887176e+00,-2.491775308744990092e-01,-2.225942472462749677e-02,-5.591109384173835739e-01,-7.715805251802014819e-01,6.615757991614290567e-01,-3.584447155400770080e-01,-2.076518262126648140e-01,1.368259303784126191e+00,3.125515867954952176e-01,-7.237020265811846542e-01,3.243054832237173835e-01,7.122663048151853804e-01,9.140449032178308286e-01,-4.993298180500849170e-01,1.241840314124825984e+00,-8.890838742642691583e-01,1.265176324539208252e+00,3.974737489121754064e-01,-4.521206345617628242e-01,-3.151631294069535683e-01
1.266060717842730110e+00,1.580595981614929757e+00,-1.062263399251831136e-01,9.887261836324467978e-02,-2.038581004386259832e-02,3.397058119777838781e-01,-2.169668844692021481e-01,4.370454475234095693e-01,1.789073927818311205e+00,1.362078618938296348e-01,1.275034625703830304e-01,6.720092935964955272e-02,-5.111792135371449053e-01,5.279791723907962808e-01,1.767310378185780184e-01,1.852589572165451726e+00,-5.864032614799535859e-02,-5.181046586296925716e-01,2.985191039403876645e-01,3.691211390561216499e-01,-1.050021080953135177e+00,-6.703647824398828448e-02,-6.526529454242147033e-01,3.453204502544296450e-01,8.643051648796318265e-01,-6.227086363451661555e-01,-4.876225229949662787e-02,-5.096102791387044917e-01,5.147985033135160648e-01,7.819075351021398390e-02,7.716442105980700905e-01,2.039427633394140127e+00,1.165834271067384131e-01,-6.706245465122220306e-01,-7.723847298247837889e-01,-9.266505752312046429e-01,1.468381201172781036e+00,1.011816896935658239e+00,3.035686658854983566e-01,6.925660985595181174e-01,1.209873853481385098e+00,1.676242003803693481e-01,1.352860125651797474e-01,8.397285705759369723e-01,4.452277785760717643e-01,9.261959234307811650e-01,3.041091393725694925e+00,3.541233290070598394e-01,4.576120649719383482e-01,1.462389534731177276e+00,4.548384174111400391e+00,8.420504710078766664e-01,9.912882521579041706e-01,-5.331837193515318596e-01,-1.263158844978233830e-01,7.209098068723981401e-01,-5.051374029931038345e-01,-4.844019371488538228e-01,-5.475142548826279487e-01,1.137324462337665487e-01,1.197679973416682753e+00,-1.094028220092310155e-01,-6.159143611079207492e-01,1.531594179366316255e-01,1.026264508377645601e-01,-5.577210326983557120e-01,-1.000973698921981958e-01,1.090594082307597024e+00,-8.591285324510480326e-01,-4.556429788992537588e-01,3.373446020502694154e+00,-6.407384590864446672e-01,-2.586103485411318514e-01,1.182710214444828933e+00,1.804405999997334420e-01,1.691714325186669532e+00,6.746700490091033231e-01,2.526648534433617588e-01,-8.147754064718792932e-03,-6.281402399377169488e-01,2.232072488370688834e-01,-1.423612324664362272e-01,-1.416541155636458216e-02,6.717717851947135888e-01,9.800206124513721750e-02,-2.204621811039666479e-01,5.263350044305681319e-02,1.954613770167978881e+00,7.569769222331217406e-01,-5.835836667193459171e-01,2.060046055136250942e+00,-9.535180027940916014e-01,1.860659549019834991e+00,4.207590734401219779e-01,-2.416970031851187195e-01,3.877794995151773172e-02
7.336550978269311685e-01,4.915411723362930752e-01,1.569318362761097374e-01,-6.227606410731629794e-01,-2.099700263057537319e-01,2.189106389472199599e-01,-1.289783969583113143e-01,-2.998573351410975529e-02,1.272466332169926773e+00,6.630075797701143747e-01,7.317377809444176595e-01,2.384385125566621522e-01,-4.360944377691852725e-01,-2.263896107725142937e-01,-3.468923972549898815e-01,1.868097880489015372e+00,-4.704657270966506877e-01,4.240134944094919867e-01,3.279080608537780078e-02,2.570188828110006596e-01,-8.744043043569968976e-01,6.755615437999451522e-01,-2.181320787602771816e-01,1.344545754841354746e-01,1.562160588973253939e+00,-5.754133591583299179e-01,3.688581479594160162e-01,-6.754530585017879396e-01,-5.713876492542292462e-01,-8.257326587712074950e-01,2.319833784671914700e-01,2.738032741085940192e+00,-4.518382870953674413e-01,-1.740163818447938993e-01,-4.533752392745373783e-01,-5.543619721599181149e-01,1.242440977000681457e+00,1.286533370275418475e+00,1.938888325441128213e+00,2.036102159236880649e+00,7.130240898156229301e-01,3.556114709163211707e-01,3.012528868129313309e-01,-1.126655255538766415e-01,3.838564172588957435e-01,5.981211404567208234e-01,2.866086071874750285e+00,-3.678739515334100707e-01,-5.331490721090349771e-02,1.006393558339085503e+00,3.644314857928383500e+00,1.534434320647386940e+00,4.545057461441491253e-01,-4.820506319338303536e-01,-1.011025653985746287e+00,1.917873417159350335e+00,1.060361706205184884e+00,-8.597558129909593783e-02,-5.307250438223949374e-01,2.105018874572282872e+00,9.118278565084625420e-01,-1.437875589240268648e-01,-2.450130893371459673e-01,1.409081146043915878e+00,1.017979370808900885e+00,1.049406006056854690e-01,-4.966333409447258873e-01,1.046973650200826444e+00,4.176247227276637108e-01,-3.288481731400627606e-01,2.492004898145011360e+00,-3.950190701846137964e-01,4.718580403332008899e-01,1.882967107679418550e-01,-2.919461137473344237e-01,1.153928101900074443e+00,1.947443460606451682e-02,1.074858957769343482e+00,-1.005107421395474043e+00,-1.150189379362157593e-01,2.703453231503169518e-01,5.315569582550641048e-01,-1.527945701347772356e-01,1.534133649552442913e+00,1.049027664564346818e+00,-1.186290932554197708e+00,1.980009827715046022e-01,1.903236911762860029e+00,5.290038751699228659e-01,-7.722627724258224191e-02,2.133245998013328926e+00,-1.988637997419480108e-01,7.195360389878450169e-01,2.163721845851718506e-01,9.545175516372326197e-01,-1.890984948832285517e-01
1.322915203111301174e+00,2.514381241789489074e+00,-1.110471340422170966e-01,-5.830027650119796734e-01,5.215850191822367365e-02,-1.098840779211251450e-01,-5.214352163670346041e-01,5.080802469810535849e-01,1.832103426796900303e+00,-1.761763917010990832e-01,-2.128706709140915643e-01,3.561638905272034306e-01,-4.569800840182773882e-01,5.606930102347617018e-01,-9.585260253458616209e-02,1.757543239724449480e+00,3.162044293832423913e-01,-3.201398427579070782e-01,-1.391639358863832332e-01,8.535403252353029879e-02,-7.604274493386746769e-01,1.557530347094449041e-02,-8.373439958366502012e-01,1.749904358130224824e-01,1.293436968895428141e+00,1.514116533770966389e-01,-1.029714246875415851e-01,-4.312569867788771938e-01,-2.890116551563266523e-01,-6.207765776359758236e-01,3.966569930822321233e-01,1.838341037126182798e+00,-2.636079946489038317e-01,-4.316414674350252390e-01,-9.785959693706793860e-01,-7.068262300034179324e-01,1.969294471198249186e+00,7.160807576736691882e-01,6.588143055983430862e-01,2.371230567872000261e-01,8.045984761032949351e-01,1.313652035997457390e-01,1.663580210366010781e-01,7.015203832398968498e-01,4.579135050917990668e-01,1.011773473330217499e+00,3.092368558589733141e+00,5.472047729048933329e-01,1.719257683358079714e-01,1.662183732650688750e+00,4.092617612843510777e+00,1.026321697493645324e+00,8.787872240483519670e-01,-2.519442631108858022e-01,2.599893388762799518e-01,6.832223314121457225e-01,-5.541079036854270612e-01,-2.852438838722868852e-01,-1.248566170212515036e+00,2.542934188868639644e-02,1.853532253513070216e-01,6.134699272730640418e-01,1.357600441429962501e-01,3.015645395250183269e-01,8.052513578086772927e-01,3.981126900855269657e-02,-1.277791415163337385e-01,3.965755163354187651e-01,-2.340288389161177540e-01,-1.126238036179643132e-01,2.780704962831187288e+00,-7.701775188513959591e-01,-6.256455640924726280e-01,3.346225212373613589e-01,1.060048384338980604e-01,1.024401293491903786e+00,3.973666237899356468e-01,3.243535432786035511e-01,-7.936600843947783090e-01,-2.085627282717849029e-01,9.329267556573082043e-01,-1.451152660832454311e-01,-9.771506947716906977e-02,8.960017090187720745e-01,5.578993931092188774e-01,-4.428360767837974388e-01,3.087779342830255791e-01,8.449976253919229130e-01,7.005567946922228728e-01,-6.260764673178557116e-01,1.780357129425842233e+00,-1.306116863740644618e+00,1.852930680963517318e+00,1.716690389586816301e-01,-4.844793602745428029e-01,5.092574114944647956e-02
1.209234630893988083e+00,2.250498254737173021e+00,-2.593917711683614291e-01,-6.217860972952707899e-01,9.446539526215089189e-03,9.987018769129141216e-02,4.007257890533783007e-02,3.722316399117359120e-01,1.346999566071067633e+00,-2.853449431923437141e-01,-1.931527561463334819e-01,2.105033998598664913e-01,-4.246876549371516041e-01,5.007441006153744434e-01,-2.681288952022057304e-01,1.521128023046861344e+00,2.208343687260617139e-01,-5.673977926209006206e-01,-1.842363924877938597e-01,-5.855539587795755702e-02,-5.875426421418079581e-01,5.296056929227332954e-02,-8.965799611145131021e-01,1.739447503480038015e-01,1.507174026420255109e+00,4.342947410771977879e-01,-1.835171419415520255e-01,-4.874511348687214918e-01,-8.935950653933628640e-01,-1.009170523009140119e+00,4.053982555017182632e-01,1.881787863480588685e+00,-1.711974888581676846e-01,-5.731016247339648650e-02,-1.042344212440137419e+00,-6.695485600248712865e-01,2.150983814070502653e+00,4.717158783670008515e-01,1.063036301702923847e+00,-6.496377086587834526e-02,7.244169013830885628e-01,2.436887450646019193e-01,-1.075229409375220990e-02,6.018890461134690506e-01,4.791378145967676305e-01,1.054243969088898725e+00,2.679924501179693053e+00,6.499898355082969204e-01,2.663830415131384077e-01,1.055152276186706706e+00,4.271662217640416870e+00,1.559166052226710120e+00,7.692755158813433525e-01,-1.842611293317144294e-01,3.971853458104932511e-01,7.118372602434215324e-01,-6.501434537263661717e-01,-2.804680406269235426e-01,-1.325002069604853450e+00,3.902091313205007239e-01,-2.944740384563446778e-01,3.233523097658066447e-01,2.369123988437211170e-01,-5.942683653258395982e-02,9.694995554114353986e-01,2.560732008114803837e-01,-3.188575050430187963e-01,2.844393590387178650e-01,-3.370137754531253860e-01,3.779523857010431698e-01,2.449630078758569418e+00,-5.403833914291257257e-01,-6.465690762336461228e-01,1.693601234904057729e-01,2.144144125156298708e-01,6.676014525737630212e-01,-9.050339344660685015e-02,6.652507805026641741e-02,-1.049064455862976919e+00,-4.069761297944563538e-01,1.168327991391015619e+00,-2.039948901830051509e-01,-2.849549663636670727e-01,1.247014893359418952e+00,5.873228932676687331e-01,-7.346982236804882049e-01,3.179877322672891582e-01,3.746402397810422169e-01,9.141443080104231234e-01,-9.175163474561378596e-01,1.489273343553557449e+00,-1.133886794970668133e+00,1.667818798254256496e+00,2.409322290259423294e-01,-8.436445186595620260e-01,-2.541741868603338839e-01
8.920694246488829471e-01,1.105980304382799151e+00,1.266140716827126034e-01,-4.862033805896893712e-01,1.174213564902324008e-01,-9.406936648437452808e-02,-3.910974308035672364e-01,-2.378334331017706305e-02,8.326625315198479260e-01,4.740203392072965816e-01,8.719892718097337347e-01,2.976276170371100482e-01,-3.854772080399565537e-01,2.684539213289165449e-01,-1.936720679162930170e-01,2.086748067653013461e+00,-9.166067937545657740e-02,1.791888709024763715e-01,1.665255979598339042e-01,2.394281304129207422e-01,-8.173044266600739682e-01,2.123839379607501132e-01,-4.212563218276867971e-01,3.139313938889754518e-01,1.265146448069814689e+00,-6.320951678636728133e-01,4.415710626410647155e-01,-5.326315581778076069e-01,3.025898619809139767e-01,-3.726161067570292751e-01,2.722374877336667942e-01,2.190327620344979742e+00,-3.584651189131247140e-01,-5.329868333582832296e-01,-5.146167983945451052e-01,-8.141593978982413216e-01,9.285593756121881537e-01,1.448437680259703431e+00,1.401707603484642961e+00,1.638851136904196704e+00,6.031774665391488321e-01,5.190867675807159243e-02,1.589578460079579258e-01,1.977894013035590426e-01,2.580135608864353447e-01,7.748444184807625756e-01,2.933754012127965716e+00,-3.989545293091925626e-01,-1.049165496271799031e-01,1.858959794118510978e+00,3.543564415490641384e+00,7.189437998083421100e-01,3.549431548533459879e-01,-6.536088413430395372e-01,-7.950699682047698280e-01,1.558666618053275998e+00,7.502228210885898418e-01,1.081760406479545800e-01,-5.436150038549996122e-01,8.896494515764156175e-01,1.398796620742452479e+00,2.546277038894556588e-02,-2.841061054014742959e-01,1.384993997611493111e+00,5.431390332262153731e-01,-3.928873850906842158e-01,-5.195634016304726543e-01,6.568949712526876983e-01,1.493013390395235285e-01,-1.640322582699401677e-01,2.743658243197785840e+00,-6.568323947283054576e-01,2.636455392543545218e-01,8.320803710868193148e-01,-4.792122834521304053e-01,1.798713937738427360e+00,3.717812593936074550e-01,1.233426125307968579e+00,-3.079962930239465990e-01,-1.745281790143998479e-01,1.717961159002393545e-01,2.693975534811509087e-01,2.053532085815268360e-01,9.930910797605064788e-01,8.762708278927938688e-01,-6.583711736748855126e-01,3.522001810243683417e-01,1.799722880876412745e+00,2.503359535141541636e-01,5.862611109427742218e-01,1.914672675133678448e+00,-7.000425815631139415e-01,8.108296895034405871e-01,7.703108031650590659e-02,1.464667336429638089e+00,1.855969723929427051e-01
6.961707403630370550e-01,6.281988800793190109e-01,3.402754909188053234e-01,-4.252746475291424022e-01,2.053868240333789341e-01,1.083421730641964398e-01,3.366881457628497776e-01,-4.038491115006248022e-01,4.428772364033559672e-01,2.996148252206580764e-01,3.562851743681016981e-01,-9.295337845576215341e-02,-4.924398696281043764e-01,5.356234709732447807e-02,-5.606285428682544758e-02,1.243510233337554061e+00,-7.633020944771087279e-01,7.257102048764663138e-02,2.161999564744160329e-01,2.972736908451937832e-01,-9.607316165723301937e-01,-9.935157040833969555e-02,-4.901052502578245873e-01,3.588009710457362722e-01,1.396931671734998437e+00,-1.424754755936736561e-01,4.667372421201165800e-01,-6.789158390046051705e-01,-5.528389833055307179e-01,-6.516709599344989723e-01,3.612277259851346956e-01,2.520591048247118771e+00,-2.342129934048100548e-01,-1.889356380064969865e-01,-5.445708153210602198e-01,-6.097805406293200781e-01,1.051883108353925511e+00,1.230084075671094457e+00,1.563968858268940609e+00,1.245643928144024581e+00,5.335229246414275872e-01,4.268504297687021332e-01,-4.138910357388553285e-02,-1.788468747304049200e-02,7.001808501170696530e-01,9.070639563467340905e-01,2.466201955392837153e+00,-3.020350428675044885e-01,5.709266190510825512e-02,1.119003209896385576e+00,3.447381208647928741e+00,1.232460794519621539e+00,-2.308115722831932670e-02,-4.670707114207851007e-01,-6.079535870216008497e-01,1.489283564845646612e+00,2.960901846997801012e-01,-1.655007149887582907e-02,-2.236608642606664477e-01,7.878249049633576639e-01,1.074774185828755835e+00,-3.339206577969571210e-01,-2.345711463460805335e-01,9.518787683409370981e-01,9.289936574110241319e-01,1.741051171179128221e-01,-5.699956352338313437e-01,1.056118355567305489e+00,-1.179890612713679898e-01,2.506749275460884441e-01,2.123917293128281703e+00,-5.756277047395171875e-01,3.106134486561988317e-01,6.859438495514730283e-01,-3.088215804313765300e-01,1.447682219136990023e+00,-3.867965915227961071e-02,4.484291778148341012e-01,-6.042012795568706407e-01,-4.197010814914328147e-01,-6.606926437231874782e-02,-1.842908813901892318e-01,-5.052804825059364902e-02,1.592305735458375171e+00,4.577075268297908783e-01,-8.304930897117888122e-01,4.449552930948619256e-01,1.481246426059888766e+00,5.744458376875534178e-01,3.844315934419381686e-01,1.427448834565635316e+00,-6.422688933110529685e-01,7.384732928963340104e-01,3.855319251269665459e-01,5.538467885559668069e-01,-5.004116856029222626e-02
9.178096076234555367e-01,6.308245902667003469e-01,-1.981611941184699063e-02,-3.034589641799639304e-01,-3.661973938076959478e-01,5.619925535625258650e-01,7.506531257318699302e-02,2.427337610190737349e-01,1.850747531137668878e+00,4.972543402716921301e-01,3.205533484681881151e-01,9.060229265489039285e-02,-5.052528813228965854e-01,-1.575845496234559162e-01,-1.958333542801734828e-01,1.715347391679785449e+00,-4.903259392839307562e-01,1.595503684344506956e-02,8.170549931228729412e-02,3.093529456807834754e-01,-9.820480644071415410e-01,6.251465354364175164e-01,-3.200666108983897806e-01,1.200046723437421803e-01,1.402524563151508863e+00,-5.589177214219359646e-01,5.135006083286210166e-02,-6.880218677409871697e-01,-6.360827196354956747e-01,-6.814669229884874335e-01,5.194936568087921147e-01,2.733188671798258529e+00,-1.748809439445376257e-01,-1.507285151260368550e-01,-5.998415711045799181e-01,-5.870715663963415043e-01,1.631606472446171407e+00,9.771274538993039993e-01,1.448116528833382599e+00,1.533508303706534903e+00,1.086723931263284815e+00,4.701987730071582883e-01,2.944580489804828338e-01,2.094325325927918757e-01,4.848188802621667959e-01,6.512970198013922074e-01,2.874566121866405588e+00,8.844578221268092899e-02,2.966819066276845662e-01,5.599288632001788724e-01,4.302899616524564763e+00,1.810549745005505251e+00,8.575218401370268140e-01,-3.876486895317716730e-01,-6.527189836993942951e-01,1.501945578875730991e+00,3.974960292241292437e-01,-4.616130304330554601e-01,-5.581752778106010560e-01,1.946881657425611145e+00,6.588991050926342741e-01,-2.932976499719452956e-01,-4.312152880943059818e-01,6.527191847607246578e-01,8.321358054580207941e-01,8.251744309149605661e-02,-2.781557169326869250e-01,1.330927121099351407e+00,-1.362837902935838952e-01,-4.752819335399525169e-01,2.813867736119368246e+00,-2.987550571558138524e-01,2.013690876458542611e-01,2.742923538050536791e-01,1.375874520059849893e-01,9.473888911515022659e-01,7.873609851718854635e-02,4.825338564307041778e-01,-9.648826377326411574e-01,-3.967823201789258403e-01,3.693901032711035537e-01,3.618436433798694063e-01,-3.598133719186624724e-01,1.457562401073294822e+00,6.536403536884233256e-01,-1.061800634014509859e+00,-1.596456734613160844e-02,1.968505236117739754e+00,8.925480404344585672e-01,-9.222638677590240253e-01,2.246261355791835168e+00,-2.230709749063361225e-01,1.290327399663588670e+00,4.363654914713538391e-01,-1.306838604217658573e-01,-3.823074822014995156e-01
8.129045194327029211e-01,8.854813724416814580e-01,5.969411107527586857e-01,-4.276850728538557078e-01,1.826540552359396385e-01,-6.643980915699004841e-02,-2.467599818761103125e-01,-2.418857225870514327e-01,1.308628463450337343e+00,3.945079504028805029e-01,2.145339895929948559e-02,1.896932818607463545e-02,-5.894957817568907688e-01,-3.593125519199442952e-02,1.869687716437714586e-01,1.268724059507554847e+00,-8.571208600778135178e-01,4.386672327259103499e-01,2.058313189833472778e-01,5.039937978246290529e-01,-1.254993157803796944e+00,-1.069485579135061593e-01,-4.077194978004917703e-01,2.945572220233777516e-01,1.225688468066706616e+00,-3.063919327902938083e-01,5.075236610846370899e-01,-6.648674717659340816e-01,-2.456451884511516859e-01,-3.423316927621440353e-01,3.602210232435055226e-01,2.668707668340645434e+00,-3.697820299203694594e-01,-5.212328336760581049e-01,-4.963024650966715301e-01,-5.118921301845994476e-01,1.044471707956939444e+00,1.393927183451252549e+00,1.108374796714302057e+00,1.547893012257638423e+00,6.780124497354624857e-01,4.603528802795837094e-01,2.153444268432906372e-01,2.696906711337697382e-02,8.438445341079823248e-01,8.511308421837300298e-01,2.952759013061296844e+00,-3.091221902210963268e-01,-3.156087751664066188e-03,1.540967808091695090e+00,3.236491082817084752e+00,8.746098010260590083e-01,1.272804689601096106e-01,-4.121794406987379644e-01,-7.026738823850248172e-01,1.445415549741749128e+00,2.748863651412546960e-01,-1.536315025806649637e-01,-1.246059025308217105e-01,5.096867157632933854e-01,1.380967596278895426e+00,3.606362528173390203e-02,-2.890266206428043771e-01,1.267001324483727709e+00,9.860015137092525972e-01,2.233327419870267949e-01,-2.516940609178340282e-01,1.396119001080378563e+00,2.788842894351959562e-02,-4.025043582844456402e-01,2.359945665267785042e+00,-8.276968646485867165e-01,3.099908962002277946e-01,6.079252833115209587e-01,-3.041997158996985196e-01,1.574800485696353114e+00,4.589391743102101962e-01,4.806413530663464218e-01,-6.011626952576318850e-01,-1.614453424766581491e-01,-3.370022746038292549e-01,-1.761794258939538005e-01,1.136348172426215886e-02,1.394760073710362480e+00,3.414569633668342874e-01,-5.939187146216919899e-01,4.096935986394684148e-01,1.986553226923810644e+00,4.777915850836503830e-01,4.189248858018133626e-01,1.777749473581660133e+00,-8.010084602560103573e-01,1.078354929794073769e+00,4.086821445795602026e-01,4.683685109895400767e-01,2.071171454370697163e-01
1.064264738556996992e+00,1.370325219534740180e+00,4.509890855446244129e-01,-2.684149553623333961e-01,6.439585426206657914e-02,2.807904553851103824e-02,-4.777833292127715015e-01,1.310177957953799210e-01,2.053071835175103388e+00,2.693425617670578420e-01,-2.855071684730816073e-01,7.595443768020337938e-02,-6.271913403915367891e-01,1.045067016386327235e-01,3.035348276710910786e-01,1.384844735306985708e+00,-6.278822961957506443e-01,2.268087937935914788e-01,1.801483739132621609e-01,5.374612476605820088e-01,-1.326192976506939125e+00,-9.290482973010094625e-02,-4.959593399646429757e-01,2.473537061265844161e-01,1.055033558275835670e+00,-3.608236174295797460e-01,2.504380697552017199e-01,-6.090205973455393718e-01,-3.253031076323065207e-02,-1.366225671751677417e-01,5.208759350146940914e-01,2.534498897385666361e+00,-2.545113186556016149e-01,-6.696580369748885708e-01,-6.301212847814151585e-01,-5.629872185228403936e-01,1.368873850703877570e+00,1.211931789056769349e+00,5.637932159866023696e-01,1.218318863339131086e+00,9.684352669067808339e-01,4.284722479099917214e-01,3.156554049616450142e-01,3.651236471442922960e-01,8.299570448362899588e-01,8.725253210453642883e-01,3.211779486781736637e+00,5.835545134164915604e-02,1.794491012550213926e-01,1.576564794894367960e+00,3.677707401564774603e+00,8.334165135078626108e-01,5.683780809992926564e-01,-3.488660145940394863e-01,-4.116934079098963917e-01,1.079986949113616923e+00,-1.790151398853783160e-01,-4.126244957562439364e-01,-3.098223522477726588e-01,2.288507264538044428e-01,1.234298540617749351e+00,2.124953155001582106e-01,-3.651336738584796127e-01,8.606902052594761487e-01,8.005339590014574069e-01,1.031806911187116427e-01,7.290528582605926289e-03,1.467075228587995550e+00,-2.522002112773104598e-01,-7.230685164455015190e-01,2.783474176633075281e+00,-8.698742334877433979e-01,8.193072254174441071e-03,6.362912313526634112e-01,-2.634381752089366702e-02,1.493432468947443414e+00,7.247631743956126638e-01,2.430730088002329148e-01,-5.373035001811033995e-01,-2.111141645573086922e-01,-1.637500792614908773e-01,-2.117562332898960120e-01,-5.437569083307558504e-02,1.109249055922089777e+00,1.561482968156109319e-01,-3.773749601849527568e-01,2.511079709747278677e-01,2.079289800549841694e+00,6.315726836876351946e-01,-1.551182048711118866e-01,2.025279219782719409e+00,-9.647710978561884199e-01,1.647373827229160703e+00,4.625654083044055120e-01,-1.769404882072395657e-01,2.068521958898582591e-01
9.087394024504508172e-01,7.062459240886624912e-01,1.102692453502450848e-01,-4.444989403217064483e-01,-3.632626769155146151e-01,4.012192628562030738e-01,-2.169352606532390371e-01,2.504011519188522050e-01,2.067424362786876024e+00,5.835474422664116423e-01,3.046495292380685949e-01,2.007836668175428940e-01,-5.174703582228178389e-01,-2.408510353017009886e-01,-1.865885361615988447e-01,1.782039586964509592e+00,-4.978541509622405603e-01,2.944366688643391128e-01,2.483165948843559651e-02,3.512451533943072857e-01,-1.039309186198219770e+00,6.993996405237871139e-01,-2.519166753126660385e-01,7.228060950815154428e-02,1.429789167124218663e+00,-5.965488350831720243e-01,1.393616737317726062e-01,-6.809852173696715472e-01,-5.936005301109085197e-01,-6.780911703756749009e-01,4.126238120721005265e-01,2.809593844009375729e+00,-3.337961618952773324e-01,-2.454766837590399153e-01,-5.483177326840658061e-01,-5.171483710595571326e-01,1.576936980336940852e+00,1.096889551298402266e+00,1.479024949900735741e+00,1.805494588281176593e+00,1.028823635931301883e+00,4.586201244911646824e-01,4.126980556402334299e-01,1.136889327382551440e-01,4.989638954024265827e-01,5.990746490839153893e-01,3.065695711727623340e+00,-2.663819276056832164e-02,1.620497171540538628e-01,7.989811672381814667e-01,4.040275485115564891e+00,1.669891451091567669e+00,8.254496418638067601e-01,-3.706405975610178594e-01,-7.891721767900217177e-01,1.631890684627424148e+00,6.156440260112381324e-01,-4.104037336097563493e-01,-5.710704304025473466e-01,2.002908887326283693e+00,7.481331187553883488e-01,-7.768870699014759906e-02,-3.564954829290962746e-01,9.991689828561955977e-01,9.669163058632250785e-01,1.578516682187895426e-01,-2.201396333211088074e-01,1.352039429589058983e+00,1.377253328187923453e-01,-6.850267437999988385e-01,2.785902596839129775e+00,-4.013501485726144180e-01,2.690325071026816728e-01,1.224591195238488028e-01,2.914561149479232005e-02,9.672042075277464956e-01,2.120346001994551366e-01,6.811390619561310533e-01,-1.069420647281684289e+00,-1.877012907420182730e-01,3.087533264602067007e-01,4.571270169645506587e-01,-3.076626108749501154e-01,1.440445447334369300e+00,7.814684158503758526e-01,-1.063912687455786710e+00,2.430702685676855435e-02,2.092562931692646622e+00,7.674088051631531293e-01,-7.384362039703230574e-01,2.369533675307890608e+00,-2.498424785592315567e-01,1.253756006345115415e+00,3.688650797280634830e-01,1.131367093663711160e-01,-2.614530162225577881e-01
8.333727317649405331e-01,2.717433163074566282e-01,1.245049765936749181e-01,9.649521366606483852e-02,-8.788942784865824698e-02,6.554385916658320710e-01,5.545591350439931233e-01,-9.895686067791535645e-02,1.134600417552867224e+00,3.941187788427530370e-01,2.625116608926221229e-01,-2.642058160031625080e-01,-5.580114640036684115e-01,1.188099480999736668e-02,9.941755923657979999e-02,1.318964506422603877e+00,-8.697879975941471553e-01,-2.852030997928325373e-01,3.974345930910619384e-01,4.475804963067128162e-01,-1.146168560814564641e+00,5.000500867692270202e-02,-4.204428645262958120e-01,3.564870708530396004e-01,1.130309733471873468e+00,-5.808642063160958102e-01,1.805550704638408943e-01,-7.280799249074590973e-01,-2.993092294837831346e-01,-2.930034997362783722e-01,7.415723095354745942e-01,2.673746585978009183e+00,1.193759739510405482e-01,-2.439185266726688339e-01,-5.573935879024367601e-01,-7.173677708362055094e-01,1.235144950741558834e+00,1.092312548433982844e+00,1.118054092218533579e+00,1.222863030319825794e+00,1.086487794897510906e+00,5.301924871849410525e-01,2.654703195422179751e-02,2.885728303460839972e-01,6.912585779628372951e-01,8.273736367574813233e-01,2.537962936645080880e+00,-3.759370502258517488e-03,4.635654516030593975e-01,5.640567753783194416e-01,4.294248016326399409e+00,1.517617176505350773e+00,5.095357540056217882e-01,-5.102064395602377012e-01,-5.778462959216958961e-01,1.272691967188567030e+00,-4.074750945707650285e-02,-4.522590125400927086e-01,-2.925927551545204341e-02,1.103241940000410981e+00,1.225146209593097391e+00,-7.526614763307778455e-01,-7.284223937628737655e-01,3.361728427197841484e-01,4.915269286581837038e-01,-1.168837680189931394e-01,-3.600184252766049919e-01,1.603042395001454512e+00,-7.292590586531737529e-01,-1.646090410365742551e-01,2.752492758865122457e+00,-3.643446214073258194e-01,2.857357622235904837e-01,9.817999613358194821e-01,1.106691295883276832e-01,1.454377636391719353e+00,1.184098654425095876e-01,6.638061679316920038e-02,-3.543321353129444962e-01,-7.772632501742431366e-01,-1.819755681100322375e-01,-1.248462944613072945e-01,-2.368471277213678450e-01,1.434261946985530667e+00,8.384660203955995872e-02,-7.486025876057883499e-01,7.260219112521493212e-02,2.124257212580718424e+00,9.179569110462740822e-01,-4.877355352480652328e-01,1.836763080644167268e+00,-3.627469697360793943e-01,1.218937992445287666e+00,6.437387475047788854e-01,-1.895639898291350267e-01,-2.864583442928245738e-01
7.494270225095569504e-01,-1.870507991553472804e-01,-1.022306974000970758e-01,-3.311792799900892259e-02,-3.990984562388828483e-01,7.916997112787573787e-01,3.571962818693653063e-01,6.361393733335118927e-02,1.261056359039634200e+00,8.079170784306884956e-01,1.007675519314785495e+00,-1.248492408979508250e-02,-4.439883095925478695e-01,-1.992518621222794106e-01,-2.623743024033845517e-01,1.990351537909741619e+00,-5.986787239957055418e-01,-4.192584033691813816e-02,3.255655733660419715e-01,3.609278018529862297e-01,-9.542332729761904275e-01,7.394541814552116898e-01,-1.407311679349326217e-01,2.356350995005133675e-01,1.295622717780727129e+00,-1.103184385201283924e+00,2.038842497888046501e-01,-7.323465360296176341e-01,-1.701982624425685264e-01,-4.476970430881699325e-01,6.072291972777992264e-01,2.810766891232276965e+00,-2.691954516614408766e-02,-1.737866011945061739e-01,-3.983090130219994474e-01,-7.719188261887081071e-01,1.132883881501346002e+00,1.265374062484793116e+00,1.725739632827584025e+00,2.079880220324356266e+00,1.138373584576797715e+00,3.883708286838229995e-01,2.139741142197401080e-01,1.219111941215629963e-01,2.782848493742934304e-01,5.392184525308442167e-01,2.682558803412452786e+00,-2.749502613412455609e-01,3.225316766912888489e-01,4.558746620543381312e-01,4.433958815468173498e+00,1.750107237053690090e+00,7.609584935168072217e-01,-6.637495730451269393e-01,-1.113423644891492259e+00,1.822788921176916599e+00,9.104253572487563950e-01,-3.482532134897722287e-01,-1.912168413987256343e-01,2.437823401602454254e+00,1.301696610592877335e+00,-8.416389331299705123e-01,-8.239018391696760757e-01,8.588358107538098807e-01,4.116312915886197743e-01,-3.784588398629448180e-01,-5.108657979907113011e-01,1.463593880487510601e+00,-2.611015177917291319e-01,-4.231134978726730500e-01,3.033655109583201614e+00,-1.076133208994728419e-01,6.021742650290616838e-01,7.722900823044086538e-01,-3.012690312030732315e-02,1.406743761561199957e+00,1.996481140158340439e-02,8.513663024474016350e-01,-5.032548658770588101e-01,-6.095944028198924114e-01,4.820811859878770811e-02,5.825801414526070587e-01,-2.353936992263306882e-01,1.397928971036729973e+00,7.131672462385132416e-01,-1.137634134391987795e+00,-1.116940643763913998e-01,2.514903648382598611e+00,7.764994763193137084e-01,-5.631555663909384446e-01,2.344570278887497583e+00,1.725468710022699526e-01,8.495297085622818267e-01,4.403717098391538576e-01,7.192212244239755137e-01,-4.343127995726592250e-01
5.836537786837694419e-01,8.851625844040128532e-01,4.168422641840082155e-01,-8.219792428632701764e-01,4.731014202600243856e-01,-3.986387276573322702e-01,3.063267317315604421e-02,-6.367252986298543860e-01,-3.871709149180337928e-01,3.352679423007184356e-01,8.658683186057520853e-01,1.475690007109609625e-01,-3.650275071130046900e-01,2.065817591240874385e-01,-2.698208441208655439e-01,1.542846025413037392e+00,-4.422232317493671183e-01,3.524162618499119271e-01,1.267496706891867719e-01,1.355680836799517397e-01,-7.025279239654037555e-01,-1.518359281937142757e-01,-5.059278045400209534e-01,4.087345428460551489e-01,1.552039397810257348e+00,-5.369438270941306185e-02,7.723324587586994916e-01,-5.887671454603632393e-01,-3.113352081471000288e-01,-8.027181225735579018e-01,1.754641058869255144e-02,2.229651144006454366e+00,-5.264089606151248768e-01,-2.574798641047714720e-01,-4.715715136211766079e-01,-6.700055233592926429e-01,6.568530457057130123e-01,1.515180826961427307e+00,1.997262794755805704e+00,1.487725161245120553e+00,3.934559626599420934e-02,1.548612660472785396e-01,-1.073587897164240412e-01,-2.304811086936598419e-01,4.788078875892976538e-01,9.281063911063172078e-01,2.443916591150645967e+00,-7.216849071112537706e-01,-3.563988364454673263e-01,1.871822828403659322e+00,2.753777585482714230e+00,7.425820585772233695e-01,-4.490910935203701326e-01,-5.957582586514136302e-01,-8.058342870023695870e-01,1.776000929449216947e+00,8.753427311057345728e-01,4.905961248200084723e-01,-3.967144951811869547e-01,5.837907980854681878e-01,1.260582757201881288e+00,-3.043979879741509631e-02,7.992588711238310384e-02,1.680289670681394121e+00,1.021640984889722548e+00,6.221243996949543664e-02,-8.536709615323747613e-01,3.984138233011322860e-01,4.420155324556527821e-01,6.009803857344219180e-01,1.813055181057717569e+00,-7.367660286009631854e-01,4.226572607650088131e-01,6.928979372454278085e-01,-8.184344605220305047e-01,1.750279327887027225e+00,-8.583288126448690436e-02,1.170720809305684895e+00,-5.224904053512731128e-01,-1.153740603555969968e-01,2.938685150515396582e-02,-5.734770390213969615e-02,2.701305162325307041e-01,1.494778282892314847e+00,9.414726826409284266e-01,-8.434740990730664745e-01,7.467028612983905855e-01,1.101901011821300624e+00,1.033227651743974240e-01,1.424662739841287218e+00,1.176778249427688161e+00,-8.290415068202846571e-01,1.587221587590793570e-01,3.783813301603919377e-02,1.845810166289350462e+00,2.371063992810709120e-01
1.012357515614438652e+00,1.538500877866428418e+00,6.834553694698375370e-03,-4.468833365311534189e-01,6.931827947155604075e-02,2.182905522529378362e-01,3.233968160332100217e-01,5.299269821294230742e-02,1.099454009249499764e+00,-1.171059843256505306e-01,-2.034736257546138627e-01,-2.582258744767740311e-02,-4.995166400534549189e-01,2.844589025800263182e-01,-9.496675876204807576e-02,1.192977417238451743e+00,-3.364257001028653216e-01,-4.036960378260903148e-01,3.451735760239368900e-03,1.285123302894995989e-01,-8.200291354778688202e-01,-9.129892865899658094e-02,-7.644285189305992656e-01,2.521173973346205743e-01,1.435261848320169786e+00,2.920742647455274454e-01,1.286599139498920130e-02,-5.986410843307810037e-01,-9.233836699696502670e-01,-8.594972682729428159e-01,4.786941686968019805e-01,2.221553324787692851e+00,-1.104781966731892551e-01,-5.914224741304446864e-02,-8.773871078912303112e-01,-6.041265013607075574e-01,1.820424284931928760e+00,6.726862185607253020e-01,1.143639368427407321e+00,2.850600443200201894e-01,7.354128590628724593e-01,4.282017542745216176e-01,-4.931365466803265540e-02,3.871884073440675644e-01,6.990147238387445228e-01,1.031784941986173765e+00,2.531269913845913599e+00,3.928341038175653388e-01,2.980569080275218830e-01,8.477044691103629015e-01,4.062030307349760783e+00,1.572401965443843919e+00,4.752523174876163159e-01,-2.343378977416375741e-01,1.073129524881365482e-01,9.073749604371210697e-01,-5.268069617757491496e-01,-3.019887822166865687e-01,-8.034932727128627494e-01,4.659453055375590846e-01,1.621160942776030123e-01,-3.302648291105975131e-02,2.014145357797571256e-03,9.770142183106611533e-02,9.892436076588249083e-01,3.375743394180491519e-01,-3.545794412522335626e-01,7.812656012953946849e-01,-4.337292219068850097e-01,3.291366275835668764e-01,2.284309846176157954e+00,-5.332784987181162784e-01,-3.117702003822339640e-01,3.704874835611219330e-01,1.426960847746016614e-01,8.751916388652555279e-01,-1.026463146197077458e-01,-8.839194223577151455e-02,-9.145241911785898514e-01,-5.164845668465891659e-01,6.142520485607465552e-01,-3.353365526856715850e-01,-2.883574580276547783e-01,1.479305296420287075e+00,3.362894681734228675e-01,-7.590689360606065472e-01,3.340935944816285641e-01,8.161263980043691468e-01,9.259598387118535001e-01,-6.312668675484814917e-01,1.413941947087977713e+00,-9.395060631410618868e-01,1.439197937262315374e+00,4.221942469149990718e-01,-7.380856637986743518e-01,-2.478750721312606986e-01
1.117387240319502650e+00,1.161208174315664809e+00,-3.120153504139813183e-01,-9.509122012039061822e-02,-2.922866430160653839e-01,6.819723407899935808e-01,3.484132761462704897e-01,4.113550609623771726e-01,1.690929118012551413e+00,1.257708713409207424e-01,1.089046331425201908e-01,-8.945032054646764874e-03,-4.818681476429246824e-01,2.217569170003762524e-01,-1.529176932643696585e-01,1.643357078954849726e+00,-1.890910430448447810e-01,-6.167572418117074351e-01,1.083447379686666434e-01,1.835440326384387422e-01,-8.415592191338645556e-01,3.366249963561729341e-01,-6.056240213671296724e-01,2.017186781625258662e-01,1.280160114171209784e+00,-3.093226616643222071e-01,-2.188477815046819541e-01,-6.137817783317778275e-01,-5.624993294516200670e-01,-6.177810117054385319e-01,7.147434519389648244e-01,2.318326821371937907e+00,1.061175485532057094e-01,-1.036886601680518938e-01,-8.328636301422335242e-01,-7.527289922401421141e-01,1.918429057127934101e+00,6.425212545965732769e-01,1.024573749390315092e+00,6.106720363921263051e-01,1.192067423952425376e+00,3.895449911694461309e-01,8.513859459696104803e-02,6.058761260555656225e-01,4.499108333252735403e-01,8.463328302050071583e-01,2.679351373386003043e+00,5.218949813811204486e-01,5.469062639934255676e-01,4.558859099521734848e-01,4.825365155331819089e+00,1.832361676254976146e+00,1.047143309741916495e+00,-3.584813844074579703e-01,-8.017928307358579421e-02,9.478199034640655274e-01,-3.718478809882316272e-01,-5.771265896541957208e-01,-7.836933362478464282e-01,1.247003589416536773e+00,3.225676059334753321e-01,-3.620392144667376466e-01,-4.218765743274809354e-01,-1.600084391677635276e-01,5.450633851592369128e-01,-8.757873870346433165e-02,-2.616651102904173909e-01,1.056611362721641800e+00,-7.129498845644289817e-01,-1.053403091048236706e-01,2.971172869871722799e+00,-2.624642516578173934e-01,-2.317483887738323589e-01,5.524014508479188068e-01,3.980296770223099023e-01,9.024929607489488026e-01,9.437640549728565365e-03,2.583224989043220177e-02,-7.276802803138242570e-01,-7.180210607253261212e-01,6.843952623615828790e-01,4.892827589750765871e-02,-3.998388023484658049e-01,1.254460432985224250e+00,3.561417586701988158e-01,-8.295685511770780618e-01,-4.188254559546761291e-02,1.466144768972095669e+00,1.102319716857842469e+00,-1.330209180117600365e+00,1.976796450721096665e+00,-5.212444146232066977e-01,1.673340300735512987e+00,4.954045071785049270e-01,-8.422058317996214960e-01,-4.744675214694548671e-01
9.155190777577256744e-01,1.608730047454093981e+00,5.364998226808107562e-01,-1.105671468498501175e+00,-1.291667384989744205e-01,-1.822159121076996069e-01,-5.548623159689474171e-01,1.074515829018523605e-01,2.354868005339393555e+00,1.975162992464039313e-01,-6.482092089223718823e-01,3.138487643463847565e-01,-6.125960951959865675e-01,-3.548080178754778879e-01,-1.186834951309992392e-01,1.102585057026929327e+00,-6.585062991439502023e-01,7.505065659904848197e-01,-3.584585521579946032e-01,2.862033067512333440e-01,-1.097135902803096030e+00,4.153956630328188848e-01,-4.503353302540988867e-01,-7.247549897185842638e-02,1.769639146282833808e+00,4.147164449945986431e-01,2.193484732505201762e-01,-6.717955211995096931e-01,-1.593773220401628832e+00,-1.242959859566669989e+00,6.524386841913359936e-02,2.876979728046928919e+00,-7.635860082468296506e-01,-1.168936875919411311e-01,-7.238634348995758305e-01,-9.983570297514571257e-02,2.023015742091359925e+00,8.670975169610954936e-01,1.516062938256942827e+00,1.295062291350405959e+00,5.992340554778635697e-01,6.626043539653916348e-01,4.772138778794406955e-01,-1.439096085187551166e-01,9.525822708744891010e-01,7.763487177796032368e-01,3.187909259128270278e+00,1.471244901494952739e-01,-1.238054276900168033e-01,1.067738363014975489e+00,3.167819773780117032e+00,1.699363552629195251e+00,4.394715802238428615e-01,5.308726634543037282e-02,-3.476763661039352082e-01,1.486507109747352340e+00,2.228644289266441536e-01,-3.183732586807215270e-01,-9.208215999237432392e-01,1.309916539395304280e+00,-8.805548215085132191e-02,7.553984562101890843e-01,4.130668061264770596e-01,1.212112384414317567e+00,1.954853752958461754e+00,1.145504065802460003e+00,-4.891383990154052341e-02,1.139877049886122817e+00,7.135037825620805796e-01,-5.222515165504957313e-01,1.900149131831008198e+00,-7.741276721595068411e-01,-6.201965138202523986e-02,-7.738375543499947939e-01,-2.813388085158954888e-02,3.238059654243753416e-01,1.225657734983653380e-01,2.895498448284682391e-01,-1.931059902875470025e+00,3.023814958617625503e-01,5.387453200606202586e-01,5.754595994771843914e-02,-4.178473580648502939e-01,1.857706471691491057e+00,8.262694040673048690e-01,-1.107185466622563119e+00,4.029306484078649664e-01,1.137546122278392913e+00,7.523784552807949444e-01,-5.938476760720958758e-01,1.931251054593858818e+00,-8.181099401135986104e-01,1.409180342344399595e+00,3.169927167766007914e-01,-6.237698154331374756e-01,-8.193766481952630132e-02
7.498517175669793255e-01,6.205476656574677730e-01,5.173917648358511423e-01,-9.001782469745873705e-01,-3.636328367050503663e-01,7.140563251704160064e-02,-6.289310933415057647e-01,8.409302852465852518e-02,2.399396776930966979e+00,7.685871965648601867e-01,1.191791507554404994e-01,3.571270880435642447e-01,-5.731354273305142577e-01,-6.277990297826866462e-01,-2.124902137765397325e-01,1.616614200871989260e+00,-7.943511627705699407e-01,1.041670610037062961e+00,-1.662614029064985732e-01,4.314711866618570757e-01,-1.179666118590814605e+00,8.860766323234591235e-01,-7.035117999196149885e-02,-7.313033485563544267e-02,1.678379070749213220e+00,-4.344023134529139685e-01,3.904790482355082748e-01,-7.389793805363461532e-01,-1.054206889037357264e+00,-9.662923030333844254e-01,9.967764949533358676e-02,3.204004476203986762e+00,-7.612694676499041080e-01,-2.382755728967777542e-01,-4.162520472949308159e-01,-2.039749850849663093e-01,1.531988584735670678e+00,1.291357658014068432e+00,1.867695131943347464e+00,2.438451961518170119e+00,7.848877044951955151e-01,6.039024715753482653e-01,6.454701686362801505e-01,-3.280082287063922908e-01,6.897936065762937385e-01,4.823756272167142867e-01,3.318818929246434735e+00,-3.238421534227600151e-01,-1.716927358861173314e-01,9.929255130011089836e-01,3.263404077692990235e+00,1.680519890061866750e+00,5.516376400035151173e-01,-2.240705524564879925e-01,-1.122891077078665312e+00,2.068721851328350070e+00,1.158742447697120870e+00,-2.854435233011428097e-01,-5.449478257294562145e-01,2.405625005294542262e+00,6.855153469604511329e-01,3.372984743089121329e-01,-5.632373393857116606e-02,1.805497504349303561e+00,1.613339835459831395e+00,6.942123690200625585e-01,-1.525451561112887156e-01,1.502935221020172518e+00,8.958285147871910548e-01,-9.870539910709845710e-01,2.330658893436948542e+00,-5.728079502555428748e-01,5.101976661019868020e-01,-5.116466156613391769e-01,-2.097235359247922593e-01,7.246913276962334560e-01,2.482978751303229203e-01,9.533357728728670821e-01,-1.646362464341741383e+00,3.068774856163947184e-01,1.584636085155628482e-01,6.130945198981256894e-01,-3.257518329074691743e-01,1.770385184975208581e+00,1.091143560282160196e+00,-1.298476760629277971e+00,1.784557626450057333e-01,2.170873959756424831e+00,5.811051188557734282e-01,-3.753140508376520690e-01,2.480048950364105664e+00,-1.981146835606939494e-01,1.002043503781712808e+00,2.864391401968033324e-01,4.387020999761714335e-01,-1.180535397151613597e-01
1.033256240360593381e+00,1.089061254730716577e+00,-2.128774111492573451e-01,-2.858284947100885875e-01,-3.064337570477823625e-01,6.202813549200461019e-01,3.658409782643928798e-01,3.198502156610064096e-01,1.685242777831514216e+00,1.416136327743547363e-01,1.711239722886542802e-02,7.563964943353790327e-03,-4.935428939717310670e-01,6.642271272179883779e-02,-2.170852721698160182e-01,1.498593553708185588e+00,-3.159789099412240732e-01,-4.266004413661416139e-01,1.158143141930204761e-02,1.616064154360192517e-01,-8.350941079897488128e-01,4.136341532584143499e-01,-5.685392579548426140e-01,1.424501324596537666e-01,1.444739015483973432e+00,-1.336243009395589876e-01,-1.641001979957469048e-01,-6.498186906379844752e-01,-9.458382834556090524e-01,-8.599058858413819451e-01,6.002970463573380488e-01,2.468140775119220365e+00,-2.529197674060318368e-02,2.148494860265304229e-02,-8.168498405216350067e-01,-6.198780267392365317e-01,1.988264643143852650e+00,6.177636927129568356e-01,1.282184140675655115e+00,7.130678570887134526e-01,1.076658290213672320e+00,4.803594485869354669e-01,1.163003554929384897e-01,4.208193012680339073e-01,5.324526497689592297e-01,8.228865185388342107e-01,2.647820239487163718e+00,4.679167741996453356e-01,4.561541448888508654e-01,3.346556800726666614e-01,4.600998171237398182e+00,2.012756539012637180e+00,9.218368787653359320e-01,-2.704326062284703180e-01,-1.322105038026487600e-01,1.098077904668821603e+00,-2.315887930736865163e-01,-5.363037810405840711e-01,-8.215955492801210180e-01,1.489578069380758540e+00,1.097109421873861540e-01,-2.778928409570923241e-01,-2.609475947820762975e-01,2.132767098763199698e-03,8.502544803701996834e-01,1.960414679313951802e-01,-2.877646242154557887e-01,1.064188941409018874e+00,-4.663673486078819819e-01,-5.835574536459209316e-02,2.692504849092754782e+00,-2.580188230814784434e-01,-1.733723386942768729e-01,2.446535422218679978e-01,3.562540933995415049e-01,6.753521222660666679e-01,-1.327341720059990737e-01,2.511894048863888562e-02,-1.041644076933364360e+00,-5.932066025142525012e-01,7.275143912082854269e-01,7.831929898627532083e-02,-4.733221024925203801e-01,1.487478111546261861e+00,4.774921801919275177e-01,-1.005566046291832993e+00,2.003970445836761316e-02,1.313410091265468926e+00,1.110196893030134691e+00,-1.315462136201978049e+00,1.920006955752189937e+00,-4.659077243039856375e-01,1.545919700307500477e+00,4.862683144259842827e-01,-8.824113739367658305e-01,-5.200433143371738787e-01
1.208152538047259306e+00,1.221513417484689779e+00,-4.998200280874768864e-01,1.812507834249591498e-01,-2.252616681858231606e-01,7.567536517264887852e-01,4.034902693064041368e-01,4.828816397298220098e-01,1.409340621105731994e+00,9.914233849277129251e-02,3.983914600245733184e-01,-3.842990251891353903e-02,-4.308744421922742207e-01,5.050688719634217616e-01,-1.108395342879371359e-01,1.904744016312433841e+00,5.095863695627411705e-02,-9.539873575479330681e-01,2.718950667262203247e-01,1.709962809504889936e-01,-7.758354005555403443e-01,1.958800700430147201e-01,-6.755597841755560662e-01,3.243706662030372279e-01,1.053762645403470311e+00,-5.727093449399501823e-01,-2.636424237723125064e-01,-5.507490460773996066e-01,5.462266317729236320e-02,-2.816196870724197998e-01,8.636674756193069014e-01,2.021906321693681896e+00,3.148605634751340809e-01,-2.605727652510149706e-01,-8.473891510351488909e-01,-9.981319845851598371e-01,1.726853954016090320e+00,7.062189218610389618e-01,7.455079588205850705e-01,4.422742646942219302e-01,1.291655396854494375e+00,2.047880923186981006e-01,-2.574096113115223461e-02,8.640190780275799343e-01,2.662952282331902953e-01,8.961456726955894236e-01,2.629331804891179125e+00,5.383353121272578257e-01,6.549087623727198881e-01,6.697392880067639664e-01,5.133060281866600683e+00,1.531596901064911309e+00,1.153050168698473987e+00,-5.379963672769684235e-01,-2.355632576984501014e-02,7.586664360060040302e-01,-5.109721616698134072e-01,-5.511760224580191103e-01,-7.298647061703985583e-01,8.757167509302209440e-01,6.772544496172064887e-01,-5.539135439064459820e-01,-6.538296965143173267e-01,-3.782062622402312391e-01,3.629807527390593869e-02,-5.837400559759713392e-01,-3.194197278192341116e-01,9.211146262663131301e-01,-1.080684440202196228e+00,-1.822229895204008354e-02,3.342367610010779977e+00,-2.431657753969299618e-01,-2.911560829138297724e-01,1.095766547877337072e+00,3.919734969042231731e-01,1.314123932528142857e+00,1.469779782268538226e-01,1.140911815874234847e-01,-1.827584174835447106e-01,-9.400101062188177536e-01,6.415744681969985930e-01,1.062665390457773196e-02,-2.444077570596420168e-01,9.020299719119351245e-01,2.278660603988615918e-01,-5.839957291924215976e-01,-9.755849946191602617e-02,1.605775297244882882e+00,1.042585735507810751e+00,-1.200652717684623561e+00,1.969738326775978488e+00,-5.949034010542981754e-01,1.727370697214653861e+00,4.692615879788427646e-01,-5.702464661051411809e-01,-4.070692918001155847e-01
9.525363256687623403e-01,8.662969119165938592e-01,2.942098016074071176e-02,-2.869588850430748739e-02,9.790400929718133527e-02,2.669905276556235885e-01,4.779230613761742408e-02,-1.852315241974961113e-03,8.394082284431263474e-01,3.722992245801965971e-01,6.820439379824286830e-01,1.169389570115172972e-02,-4.459433974007357970e-01,3.679519672943517561e-01,1.663489561619613255e-02,1.853321778832782041e+00,-2.969710183139491755e-01,-2.691800693343573969e-01,3.798278555543575519e-01,3.408739927910311440e-01,-9.538240484715323486e-01,-2.551607528482185971e-02,-4.992714759850703232e-01,4.206074203557322866e-01,1.025691851283985212e+00,-7.314224116501457651e-01,2.826046513705405827e-01,-5.732672066504995723e-01,4.472801977110805183e-01,-8.070346445979659222e-02,5.981290117056303757e-01,2.192175509438420988e+00,4.158689059189202286e-03,-5.354385438575393064e-01,-5.661949665087169237e-01,-9.244361713778559420e-01,9.678282527964896520e-01,1.310029474047105458e+00,9.835264140882418182e-01,1.244676952094887046e+00,8.948573489239597389e-01,1.565408152216905546e-01,2.271506507079315562e-02,4.438099281487846715e-01,3.783142788208581075e-01,8.612456020998398021e-01,2.743046040653213336e+00,-1.649361565205490765e-01,2.378231010464543771e-01,1.458793346597391238e+00,4.074019204512974390e+00,8.335953409637097966e-01,4.934142807503356654e-01,-6.848645131124873053e-01,-5.910199438764238700e-01,1.228106302919056425e+00,1.825170332288149067e-01,-1.510591940458073379e-01,-2.726482976726627427e-01,5.700258609023085565e-01,1.546424292542982082e+00,-4.074615820942660838e-01,-6.246566836937618161e-01,7.144253440783752129e-01,1.909782739353843573e-01,-5.699658116294452626e-01,-4.452034450115772146e-01,1.014225703442835913e+00,-5.363017971646181214e-01,-1.193633742894598671e-01,2.988951316553691395e+00,-5.554558191086781394e-01,1.829297650191705760e-01,1.272039376507115627e+00,-1.935463180287135265e-01,1.919828271908373019e+00,3.926265718716621111e-01,6.807577928363763853e-01,4.516871639245834125e-02,-5.949584140337882410e-01,-3.572583058868861183e-02,-7.846752043047244829e-03,1.107416945627888172e-01,9.390604664306776428e-01,3.623279993075469996e-01,-4.755739764169555350e-01,2.039017775091023221e-01,2.011578605532042374e+00,5.249223538803746703e-01,1.772358224284536488e-01,1.845697696768325180e+00,-6.737179034091345109e-01,1.108761043595976714e+00,3.344856709428000729e-01,7.772533369899847777e-01,4.758200225275832640e-02
8.187726020948178363e-01,6.884933065466560809e-01,-2.857734224301943793e-01,-9.783011332497149048e-02,1.415255457130975003e-01,4.660119353210691040e-01,8.417756483223541863e-01,-2.084792682887151583e-01,-2.252474646077458065e-01,1.431129044459454325e-01,9.129012844616806177e-01,-1.474093590580265456e-01,-3.375318731105191872e-01,4.792722977976297538e-01,-2.933502727920065389e-01,1.670601957367314983e+00,-1.966116954736350508e-01,-7.657802502022810209e-01,3.286907554980967872e-01,4.454261749864262682e-02,-5.654432166442021623e-01,-6.562394500402080055e-02,-6.659886027446852985e-01,4.789026286926866272e-01,1.308106163087694451e+00,-3.123131760800682000e-01,1.853082006274750226e-01,-5.943284630290962545e-01,-1.898837485546069903e-01,-6.040794587145754679e-01,5.813698039885151214e-01,1.999549308080171617e+00,1.595996648503557047e-01,-3.495282751830575130e-02,-6.904233804745768532e-01,-9.887241336284694482e-01,1.130127557166014318e+00,9.832247705266921045e-01,1.560273239013571844e+00,6.479755046239850103e-01,6.751717676350701414e-01,1.672668831106033371e-01,-3.256085082291200750e-01,3.834205868793412186e-01,2.738092473653692682e-01,9.782085702534604188e-01,2.082024085397963464e+00,-4.678737137879121488e-02,3.275478483432986976e-01,8.308418305016893601e-01,4.322702478698049688e+00,1.399547164095225726e+00,2.813736603745633502e-01,-6.670620937281003249e-01,-3.201318677085028264e-01,1.200014988975722563e+00,3.810526610334763475e-02,-4.422965215227142588e-03,-4.856151274785796002e-01,8.285347525427007032e-01,9.105314599911318307e-01,-8.001554152277867704e-01,-4.352431492706320126e-01,1.863185169875239411e-01,2.668149299401814112e-01,-4.573223837373229239e-01,-8.265730173631845590e-01,5.429550783605203712e-01,-7.212215796492195130e-01,8.044332125894146923e-01,2.545886615570355893e+00,-2.486142065179451632e-01,7.978421806503883940e-02,1.221253263605312167e+00,-1.377478518489705650e-01,1.578889144109901554e+00,-3.200600354466433539e-01,4.686576605236305038e-01,-1.208981835991904674e-01,-9.129837755425916912e-01,4.111670292231501267e-01,-1.133950911392682115e-01,-3.506855117610990780e-02,1.286158279470837940e+00,4.761266840847697690e-01,-8.043619639766788065e-01,2.852150044124843187e-01,1.134098381407987910e+00,7.208398039133030455e-01,5.695686789600640232e-03,1.295382794557583761e+00,-5.515230506989214909e-01,7.511779027994357483e-01,3.279050463531283932e-01,5.808300826365986325e-01,-3.188810028139194008e-01
1.131986174240377396e+00,1.556910352774757200e+00,7.006748105670874971e-03,-2.519472729640587771e-01,-6.552348747259280348e-02,3.581581123989974191e-01,1.446385738467598214e-01,2.700720224563099015e-01,1.767423762284588751e+00,-5.184296645826599881e-02,-3.842265191121057577e-01,-2.957939746346013865e-02,-5.614982596827500227e-01,2.440719252810480966e-01,5.592592145808006343e-02,1.257832530076257171e+00,-3.772417116966914064e-01,-4.057096131708046727e-01,5.627016861257332775e-02,2.616324238564414761e-01,-1.001094991372171172e+00,-2.027499898197299144e-02,-7.112115383433325055e-01,2.166323603187262359e-01,1.262967704427909510e+00,5.860992436651701193e-02,-1.020790618131980076e-01,-6.046351537128853426e-01,-6.956067558256229244e-01,-5.992051997930201157e-01,6.260114448753585359e-01,2.322262822428447393e+00,-3.010835037859144192e-02,-2.188915942223134681e-01,-8.753952753993472502e-01,-6.095750794478445034e-01,1.920653079935166208e+00,6.683429219209687799e-01,7.675220181437611977e-01,3.764302510856631923e-01,1.019712379826192228e+00,4.716833133559674707e-01,9.031102550969459519e-02,5.453628670365724407e-01,7.399139774828740190e-01,9.770063797464352273e-01,2.776847325774672193e+00,5.319510800233819836e-01,4.350023983407173001e-01,8.121113064423300942e-01,4.332804356301722670e+00,1.541224851464386925e+00,7.780612454369666420e-01,-2.230014765156218548e-01,1.023598835022379583e-01,7.871520124428792453e-01,-6.813201862124239616e-01,-5.358282395995026537e-01,-7.249567614484726530e-01,4.765298668181578989e-01,3.113654922254928126e-01,-1.839991896043946529e-02,-2.010870764523738363e-01,-3.169153159754101168e-02,8.385549679259938216e-01,2.383096794182087697e-01,-1.320633517254672373e-01,1.108713943430701621e+00,-6.102746418448546928e-01,-1.111246273326145784e-01,2.648966453897664053e+00,-5.533408649557909342e-01,-3.482280301641700881e-01,4.364635340230176297e-01,3.216545123064780132e-01,9.100237774471050534e-01,1.693635940281599805e-01,-2.192883469269570895e-01,-8.280487641829996637e-01,-5.430328102511774446e-01,4.982583738734218670e-01,-2.965979259300693394e-01,-3.399379761686336376e-01,1.317349172334043583e+00,1.565869589937535222e-01,-6.273848866626738907e-01,1.666018426478705350e-01,1.253545733322660949e+00,1.025391351998692135e+00,-9.971997292282905878e-01,1.733986232940322614e+00,-9.065010945937340692e-01,1.795316993041966569e+00,5.230565920517654677e-01,-1.088628364843954088e+00,-2.379471672195917487e-01
1.011352128010635454e+00,1.685411509972133404e-01,1.775792041081902806e-01,3.107720471491348668e-01,-4.706340691111146057e-01,9.018842958159556389e-01,3.496898671807346926e-02,3.546431190233684805e-01,2.689690417852729887e+00,6.797671943655535509e-01,-1.277158504215442081e-02,-1.623009700843389691e-01,-6.764412823176750855e-01,-2.653691152407389175e-01,2.946368277199619135e-01,1.550105209453958022e+00,-9.815413131064980590e-01,-6.956912336933074315e-03,4.084338489635440661e-01,7.138287468829246363e-01,-1.506087280427992781e+00,4.578909386014896055e-01,-1.858168005662929056e-01,1.915183154446924996e-01,9.205695550706098906e-01,-1.111255638336930307e+00,1.287555871019113729e-03,-7.654074734587157369e-01,-2.608224401207603904e-02,6.646265395255390729e-02,9.151669953147069103e-01,3.057827172870053012e+00,1.154983590018771600e-01,-5.163182790421854129e-01,-4.853902018193923529e-01,-6.276551468065594275e-01,1.460594574153301295e+00,1.146508625912016299e+00,6.420760633511428672e-01,1.796954430816626758e+00,1.621275535206354590e+00,6.494791481638875208e-01,4.380566339605403980e-01,4.315397267625113442e-01,7.381779188565502636e-01,6.016979884645228260e-01,3.148630028035883210e+00,1.574961501666513053e-01,6.208942216152893989e-01,4.479612326666780886e-01,4.681273546295183330e+00,1.591977940408684011e+00,1.136740338192571809e+00,-4.569909666464975206e-01,-8.037554579280978828e-01,1.296166556656786817e+00,3.019814146406657462e-02,-8.919066220541576051e-01,7.002973967397208011e-02,1.653941221661139327e+00,1.447960982695009724e+00,-6.164769973405972436e-01,-1.059378139364480997e+00,4.085469083229378295e-01,3.993427879123510049e-01,-1.766738786699268982e-01,8.746975018831804061e-02,2.294528953974981800e+00,-7.365656278356463860e-01,-1.224278025209125875e+00,3.415357420028012569e+00,-3.718043052397065340e-01,3.485087288493162183e-01,8.081198613048363733e-01,4.026319511583185129e-01,1.364152556831997209e+00,6.288978287554953805e-01,4.135887194286702595e-02,-4.574312432253635485e-01,-6.393560135046527648e-01,-3.649795037487388871e-01,1.900281301575218185e-01,-3.847433383466735135e-01,1.230106670534426350e+00,-2.322097407845069572e-02,-6.845572139429344505e-01,-2.838927197541920022e-01,3.109684419479599171e+00,1.065779889840267725e+00,-1.238816219150044473e+00,2.663354662782068338e+00,-1.241072495255543529e-01,1.801948456798478482e+00,7.848015374739685246e-01,-6.769335795777724485e-01,-2.968144406043768946e-01
1.185980831453176121e+00,1.257504543058939550e+00,-5.464523851065393734e-01,6.247042727741303203e-02,-2.625459934003704365e-01,7.643783065029403634e-01,4.792545172495367156e-01,4.830598100867312672e-01,1.366471521486814611e+00,5.721912286456712349e-02,3.709136154668627450e-01,-1.681513394168307474e-02,-4.145242015506513389e-01,4.609241015053806567e-01,-2.118112241675287888e-01,1.862719690229998726e+00,8.305638230225570462e-02,-9.581230493163707118e-01,1.850867525696700266e-01,9.577754300799537490e-02,-6.918833842802062373e-01,2.784525676261435101e-01,-6.923806349931139748e-01,2.807383131384255104e-01,1.184248376416325854e+00,-4.209583908801237118e-01,-3.003110950921318301e-01,-5.584913534182559536e-01,-2.350894681205660808e-01,-4.976409585322909557e-01,8.061426899499826160e-01,2.037381639520985388e+00,2.694854118499523943e-01,-1.235910887079803011e-01,-8.842818857348948569e-01,-9.461065911053593291e-01,1.864222114569608957e+00,6.026498003016363958e-01,9.310102504092796494e-01,3.654436268685852252e-01,1.232626110553210363e+00,2.342409852726201336e-01,-3.861613980903272347e-02,8.055084241253978039e-01,2.597346943821168264e-01,8.938192238287746560e-01,2.558542766108788058e+00,5.890767466482330628e-01,6.350569657345150887e-01,5.118639134636909782e-01,5.131149739670329168e+00,1.733776763574721436e+00,1.144705815971534424e+00,-4.769739383945847955e-01,3.288217266731241484e-02,7.967135167402756846e-01,-4.876597247781487843e-01,-5.354173019695134261e-01,-8.628152322508038097e-01,1.072046714144503143e+00,3.935341743409079274e-01,-5.191913883494034820e-01,-5.255919319160633485e-01,-4.200052593142501456e-01,1.947515850464768272e-01,-4.350211614877778077e-01,-3.628921377474914056e-01,8.133526312806924619e-01,-9.801684488598468858e-01,1.061394539476390175e-01,3.194743953571430151e+00,-1.853566893034840901e-01,-3.310976453417527332e-01,8.863423860084392869e-01,4.175149301452412143e-01,1.094370724144856366e+00,-1.761117717030441510e-02,9.031316751740370297e-02,-4.016382088268724004e-01,-9.107607098035604976e-01,8.199688751566536205e-01,4.690333076474884066e-02,-3.209749229492477873e-01,1.033361044563259723e+00,3.377090255753242287e-01,-7.244114296885215687e-01,-8.102034317627931914e-02,1.368316469541512870e+00,1.095242677435837253e+00,-1.331722727290515218e+00,1.911156521571928391e+00,-5.581241656099398263e-01,1.680097588730192548e+00,4.476380790211111904e-01,-6.902637440712937611e-01,-5.013315385667724833e-01
1.018062824755654461e+00,5.324914286337368852e-01,-1.558240582751310166e-01,2.788232568067687822e-01,-1.942145991105710401e-01,7.598396766543231706e-01,3.729120010729272683e-01,2.159890628843135207e-01,1.400370712864631662e+00,4.029322076332820801e-01,4.864065536974670478e-01,-1.502181491751765630e-01,-5.046086822155011475e-01,2.279774217230030042e-01,6.204491285500846054e-02,1.761695130696766975e+00,-4.581766382074229371e-01,-5.463563246307711063e-01,4.367683272644138914e-01,4.071896558567533742e-01,-1.057800477970180175e+00,1.743110869823737974e-01,-4.504979379553104013e-01,3.640504964184089753e-01,9.633359553510107975e-01,-8.852666741258514715e-01,8.153981815219424334e-03,-6.467089565935295603e-01,2.220835453940392945e-01,-4.944288256773265999e-02,8.614144821164352317e-01,2.414763569312926350e+00,2.508681348319038995e-01,-3.967675333425352835e-01,-6.125049493639534992e-01,-9.142503863748492332e-01,1.295711590571602345e+00,1.062348764929942124e+00,8.301625978270448236e-01,1.140391967010332408e+00,1.298562738622557555e+00,3.366816443199147635e-01,6.584137963895478340e-02,5.962054620238712577e-01,4.320375475193872772e-01,7.946960170550648739e-01,2.699213439643363355e+00,1.482877332302869888e-01,5.724760470427935344e-01,7.229446167284319102e-01,4.755954880576566346e+00,1.367230601406077994e+00,8.968031094628564626e-01,-6.216073576221068375e-01,-5.031675754049517169e-01,1.098158377892466397e+00,-1.092615919170825123e-01,-5.300795151446822118e-01,-2.062019009799268554e-01,1.078138108426983877e+00,1.326656129512433058e+00,-7.478393249563406453e-01,-8.952060354473674320e-01,1.297227177763142780e-01,7.023276862831928646e-02,-5.572791878857056291e-01,-3.018031529033887717e-01,1.445083552391309478e+00,-9.451068564841104136e-01,-3.340726533696207756e-01,3.282703971475744886e+00,-3.104651259467894331e-01,1.379577679078967667e-01,1.239182965699403560e+00,2.121623688355894211e-01,1.624704781794104935e+00,3.123751614063964843e-01,2.395643089033031581e-01,-5.150157446349923340e-02,-8.705392186567073587e-01,1.609020551278939060e-02,4.165183885195636315e-02,-1.708503793528492187e-01,1.035041778407723267e+00,1.209114071989740857e-01,-5.908603142253641138e-01,-8.768696921387281185e-02,2.295534142815343071e+00,9.131748772390319013e-01,-7.430550353199537605e-01,2.100431744077867702e+00,-3.774467845832822355e-01,1.464656131363277325e+00,5.716854054498146098e-01,-1.065498584347848998e-01,-2.807572501302725843e-01
1.064417974676907797e+00,7.926053232510364976e-01,-3.707629378622796096e-02,1.265975957925280504e-02,-3.595842678793315650e-01,7.408656199803931308e-01,2.098627245921268758e-01,3.650760280603556063e-01,2.202353345082936009e+00,3.209247764879966103e-01,-1.055558998700439344e-01,-8.544319758694521316e-02,-5.896509060194147223e-01,-3.655820139903011301e-02,6.060571753727034272e-02,1.471403543103968481e+00,-6.047811775317248895e-01,-2.954653070698163297e-01,1.927376716260768563e-01,4.179367626117010404e-01,-1.158416734698795691e+00,3.618048341704317439e-01,-4.402467984372319121e-01,1.724187998196441141e-01,1.172485110027206456e+00,-5.215214745004572716e-01,-1.247106468932392132e-01,-6.922134686840536455e-01,-5.169246379465320951e-01,-4.051515526339680706e-01,7.736223146819030116e-01,2.692704533943801604e+00,6.757056824822799124e-02,-2.445070170123666009e-01,-7.033751317728593744e-01,-6.273993380603278824e-01,1.802002424206369247e+00,8.130151317932189370e-01,8.666950692463795125e-01,1.061528161965152872e+00,1.347302881570289657e+00,5.621030116891192474e-01,2.501690860015488571e-01,4.873766928239913199e-01,6.609290679654228340e-01,7.582499650728465879e-01,2.886245868975215956e+00,4.029637466496855391e-01,5.656945776980112361e-01,4.069556688527652955e-01,4.677724866282809479e+00,1.791301170617354055e+00,1.045515622750052831e+00,-3.319291348283872622e-01,-3.375229730069450040e-01,1.082037641735070110e+00,-2.698854833425695654e-01,-7.339292925604984363e-01,-4.342382285826658084e-01,1.383497642719924148e+00,6.802931385376173035e-01,-3.968929804050641552e-01,-6.148500619982151250e-01,7.786186767746838822e-02,6.301116619296103227e-01,3.653977867242053090e-02,-7.582947377431259461e-02,1.626433334623210047e+00,-6.709613938486006512e-01,-5.846824422965747337e-01,3.039296625799371654e+00,-3.407714340142385390e-01,-1.345479265948464065e-02,5.255914026685537532e-01,4.235572372130926855e-01,9.811314469857014275e-01,2.491004243402716312e-01,-7.382894698116360122e-02,-7.529039591625159566e-01,-6.382588985091802725e-01,2.425131063160257949e-01,5.038521623427412444e-02,-4.390276528466215966e-01,1.336687836830135367e+00,1.687631502197293187e-01,-7.932762882512461866e-01,-1.143818188315631201e-01,2.078675590381043214e+00,1.121342405899143024e+00,-1.339084092198532083e+00,2.226033170583065157e+00,-3.925637476807293802e-01,1.766575552231491208e+00,6.439100237315192876e-01,-9.566380787903669969e-01,-4.037818957939269815e-01
7.006893855715699004e-01,5.025382985686251969e-01,2.336562362304862583e-01,-5.900604109050837653e-01,-4.817165870681648643e-02,9.825152568478445758e-02,-1.136591595781155095e-01,-1.726568933805216477e-01,9.057383233246527610e-01,6.340325650071908514e-01,8.126614140529411223e-01,2.003502786387622303e-01,-4.264283951006529461e-01,-1.183273430964078138e-01,-2.830519989166815908e-01,1.831729780554157028e+00,-4.929295565236804788e-01,4.104742230880974452e-01,1.109824073992727311e-01,2.732567695192493207e-01,-8.802654967754486304e-01,4.650236984948367680e-01,-2.588770792259272313e-01,2.212259313604690858e-01,1.489533266897739905e+00,-5.717419552200819766e-01,4.836085311134383780e-01,-6.571256867551256153e-01,-3.485849465692069105e-01,-7.003891939450044291e-01,2.200768605086371177e-01,2.631450932099002049e+00,-4.369147127525746521e-01,-2.601726244831650825e-01,-4.255932412862519776e-01,-6.137824832084322058e-01,1.018739801181406612e+00,1.404770618004974825e+00,1.877748137319655619e+00,1.993663752757504737e+00,6.018875652250981201e-01,2.961607431032485804e-01,2.162884088044912390e-01,-1.169900030758656700e-01,3.980225669564150248e-01,6.623406020090956137e-01,2.799070535614779143e+00,-4.918260691390851091e-01,-1.065068982789282442e-01,1.259260365658041003e+00,3.460566229867513499e+00,1.264217583629040575e+00,2.579428556106098114e-01,-5.522163241025862535e-01,-1.025294693958961334e+00,1.890364337614204082e+00,1.041333498692089687e+00,3.495895024909789761e-02,-4.104117775164751181e-01,1.716014105358089514e+00,1.166532874795787267e+00,-1.714717286876862312e-01,-2.636154467754641129e-01,1.501820888163726941e+00,9.181788453476391609e-01,-1.742969380080505726e-03,-5.646309521326559056e-01,9.755714946702440660e-01,3.664896580510939583e-01,-1.907411608113102064e-01,2.430581971038489719e+00,-4.849983107538556881e-01,5.080082215198787887e-01,4.276559739176034602e-01,-4.268138286711458118e-01,1.416251705893576407e+00,7.437492186932298521e-02,1.126733578808109648e+00,-7.684937764121159143e-01,-1.420649646096326102e-01,1.071758980893671165e-01,4.004529314623394565e-01,-1.856266547810958567e-02,1.461032960993355667e+00,9.735702391887068874e-01,-1.049796276804149331e+00,3.011021625351852360e-01,1.886050717453046754e+00,4.061624831795351831e-01,3.295805381343517859e-01,1.964246793642641986e+00,-3.255551361335228266e-01,5.956894461555963804e-01,1.912012183878194493e-01,1.252648280967894490e+00,-5.526804580324745642e-02
9.678160810680500603e-01,1.011838941169931783e+00,3.322053068353314487e-01,6.830247120485266610e-02,2.936163556676558151e-01,1.731661848047586494e-01,1.234081575380409634e-01,-1.634925065908748310e-01,9.451249181443535097e-01,1.736024575246215562e-01,6.464078581843724081e-02,-1.921140606564810671e-01,-5.725155225547533533e-01,3.783344488230824809e-01,3.498001102989669597e-01,1.286377970592727848e+00,-6.895690776306594438e-01,-2.562752099156532237e-01,4.512683039080895853e-01,4.988188077111238572e-01,-1.222225976058222807e+00,-4.895550337484990688e-01,-6.154326230378103224e-01,4.854148679347292106e-01,8.934659700630830370e-01,-4.278276109350124257e-01,3.289351235920224825e-01,-6.096310575169386903e-01,3.195141616615113644e-01,7.847057989477690398e-02,6.898322446406032205e-01,2.281507424067676482e+00,6.004154156509627915e-02,-6.277145402277459763e-01,-6.137141624823096997e-01,-8.097875367639444377e-01,9.832163466282335396e-01,1.270887677354219703e+00,5.448881715070137410e-01,8.704127256872037366e-01,8.923878504060551720e-01,3.415176889002656258e-01,-3.386075898932228156e-02,4.682473685077062076e-01,7.712895023956948259e-01,1.021341440785114463e+00,2.724139864442846726e+00,-5.233651834397406999e-02,3.178342795144600275e-01,1.512886014709185822e+00,3.849356925481782543e+00,6.676893827443211027e-01,2.778202562897625905e-01,-5.553475594044480212e-01,-3.469037306792612796e-01,9.374475976916027964e-01,-3.978048360448763754e-01,-2.709752311678113035e-01,-9.319393535372810788e-03,-2.719014576039497921e-01,1.626632796292307503e+00,-3.423067247785231970e-01,-6.093626984267964675e-01,5.033994845926430539e-01,3.384987263673974178e-01,-2.866164797824137800e-01,-2.712356265850179859e-01,1.350925856175309026e+00,-7.898586577800117414e-01,-1.304234674188726739e-01,2.762914270744072809e+00,-7.741881655458384692e-01,7.468786334766970569e-02,1.359241750386894099e+00,-1.070429483610441657e-01,1.962198161611311109e+00,5.415981826017770562e-01,1.053033812499929445e-01,9.076142522144348135e-02,-6.492229832083333818e-01,-3.895188954573147733e-01,-4.972132478622284801e-01,8.997109655601637224e-02,1.040083321989981657e+00,-1.306318635759545765e-01,-2.165816025260297595e-01,3.212861571964737983e-01,1.975631408571420389e+00,6.197497153628191979e-01,2.647568725653812183e-01,1.580217454269363442e+00,-9.867088034961544185e-01,1.366746917160015951e+00,5.330818583254374188e-01,1.230388499340938357e-01,1.836791196269111914e-01
1.152628305593220270e+00,2.012849089397148461e+00,3.333140223784128442e-01,-5.590099601956599606e-01,6.858679679987665645e-02,-1.829109835565567721e-02,-2.611137922150316704e-01,2.166479440097027753e-01,2.121295174442781040e+00,-1.534163668067262953e-01,-8.612104477915709655e-01,7.230458330644828902e-02,-6.340134736263556281e-01,1.628092287539347760e-01,1.829007808179013983e-01,9.911842540263324786e-01,-4.968343947009605799e-01,-8.645093406306494921e-03,-9.768481737166928580e-02,3.224690513320301877e-01,-1.142946157467135126e+00,-1.723588713433754638e-01,-7.502553060366117244e-01,1.461283687616378724e-01,1.338376453426411317e+00,4.064210575482927190e-01,9.788892718595038067e-03,-5.926683386974905821e-01,-9.394327876005373890e-01,-6.978742959788761802e-01,4.451352716343809357e-01,2.403998113238013712e+00,-2.972869038954903953e-01,-3.231805257697045186e-01,-9.023653741248508497e-01,-3.979635528930252075e-01,2.013556645756875874e+00,7.029672227376997373e-01,6.411272415293449711e-01,3.539250286457396033e-01,8.387812078684150352e-01,5.513668054304639021e-01,2.129049415895656328e-01,4.124743093054166199e-01,9.847195070021590446e-01,1.030446096991163740e+00,3.019969455820930015e+00,5.205883310234540318e-01,2.395228056955429063e-01,1.194264296948460036e+00,3.765025063710268682e+00,1.324799480332717216e+00,5.943213769263980817e-01,-4.663537682883683866e-02,1.942061242759051121e-01,7.583383544536649312e-01,-7.736656115846399784e-01,-4.909931565219903815e-01,-7.954379644162936636e-01,2.803826844949575126e-02,1.736709338910325806e-01,4.930017209666098799e-01,1.117491559998274875e-01,3.016357155556914638e-01,1.282179648949335782e+00,6.587120394778988031e-01,3.646097718130913989e-02,1.128981860681717464e+00,-2.504702235536047095e-01,-2.821044860361860973e-01,2.327270044668968030e+00,-8.420183692322278368e-01,-4.408638000804844803e-01,6.114311520522089372e-02,2.242497749384670391e-01,7.669999603335440064e-01,3.449196654655359295e-01,-2.914953804945763505e-01,-1.150657718928461914e+00,-2.008768788708314434e-01,4.294274904285083072e-01,-4.627131248964305166e-01,-3.129624404786851000e-01,1.409926888299223968e+00,1.569524745737121973e-01,-5.387969036334262496e-01,3.524789086638548952e-01,1.068426273966103457e+00,9.142504768929655690e-01,-7.481824013941971163e-01,1.657813810635044405e+00,-1.224298616149176233e+00,1.910478001525967695e+00,4.841078039471305994e-01,-1.250083753291969968e+00,-8.618983117810785632e-03
9.611418559135527229e-01,3.705002230085446824e-01,-3.814959460485053966e-02,8.952914992078120360e-02,-3.796621751241454068e-01,8.113844330818857919e-01,2.841209894358690535e-01,2.614260421448882932e-01,1.940050088312239129e+00,5.116230744874984415e-01,2.515147052885463586e-01,-1.051982659476926873e-01,-5.595043616676335096e-01,-1.002060808961624944e-01,1.292904275299477934e-02,1.623334379343228884e+00,-6.734534196334043266e-01,-2.281316828654833540e-01,2.918574198608088754e-01,4.494096060983794327e-01,-1.151930401438305829e+00,4.580840864557476633e-01,-3.218625223137197011e-01,2.123489076511428653e-01,1.148528398685408014e+00,-7.975128194303870988e-01,-1.376099600289432123e-02,-7.176764046039446621e-01,-3.103755059257058413e-01,-3.177062930277133601e-01,7.738601727271461339e-01,2.770515321775085749e+00,8.483020951695252609e-02,-2.623887636377246202e-01,-5.809800949779003743e-01,-6.908300391097847992e-01,1.532978460138775478e+00,9.936997324083741701e-01,1.064912569227413730e+00,1.438866627476671711e+00,1.341440496590529108e+00,5.243236677044363914e-01,2.425030409395693143e-01,3.902227372773187097e-01,5.599954171532237623e-01,6.805195289630533440e-01,2.829378615722227597e+00,1.712850737425680170e-01,5.294032270296555875e-01,3.991655727544706211e-01,4.649258058886213796e+00,1.748608692324865377e+00,9.704273396767716386e-01,-4.634994641027849749e-01,-6.263798051192202010e-01,1.310295920016516291e+00,8.634302900940460379e-02,-6.512230120082217466e-01,-2.544967147758414594e-01,1.701039805348978362e+00,1.011702505778539596e+00,-6.187876494467362543e-01,-7.791086802487935392e-01,3.032446515188803038e-01,4.830139501248276179e-01,-1.529938800969727897e-01,-1.913470670177010446e-01,1.694043328580741914e+00,-6.267157424302703950e-01,-6.018106673875012191e-01,3.111458519677766432e+00,-2.630392221259568175e-01,2.248339146694103841e-01,7.057641395447965538e-01,2.981362062565364734e-01,1.197676197993615688e+00,2.298630606803503951e-01,1.829632677810443808e-01,-5.797367191703044487e-01,-6.778261064071549047e-01,6.994844647361564416e-02,2.027914745764833326e-01,-3.684355182920299732e-01,1.330893742454305695e+00,2.591122644342462866e-01,-8.618713032802496343e-01,-1.462754269671825424e-01,2.375194676099250835e+00,1.025777115192824995e+00,-1.097430041099858311e+00,2.303869389268538903e+00,-1.797664719987528414e-01,1.500887890288274296e+00,6.228413997705363192e-01,-4.364542096088804279e-01,-4.073950473076615730e-01
8.052025066125811925e-01,6.286114646884912727e-01,-2.523278275964873085e-01,-3.474304424772473587e-01,-3.434561013948986274e-02,2.758463290001970658e-01,1.627556021774157480e-01,-3.308796757798927735e-02,2.525380487039295963e-01,5.331813262115068230e-01,1.389486499459092972e+00,2.127242300659041851e-01,-2.789559445064747623e-01,2.952039470990028280e-01,-4.741479569678775374e-01,2.295821932258075293e+00,5.512460777553224167e-02,-2.174886044347769110e-01,2.208042944521747541e-01,6.738146731813712820e-02,-5.407496492883953065e-01,4.539007145276562349e-01,-3.997516512638396580e-01,3.461611018519339389e-01,1.377508667226750250e+00,-7.797532225791817817e-01,3.233833421354315729e-01,-5.579858295167690052e-01,1.704603741309700382e-01,-5.750951314579897389e-01,3.574630877779247928e-01,2.120643917529418054e+00,-1.560125057106822311e-01,-2.309612492882582857e-01,-5.172193450461262110e-01,-9.684281474827559633e-01,9.462473170711476200e-01,1.310746073551073199e+00,1.850071083490425927e+00,1.590925107471170552e+00,6.552809492091976606e-01,-6.249733053051986786e-04,-1.204715262285824956e-02,2.147871423419111525e-01,-8.486173544446418138e-03,7.226021631091230635e-01,2.541680844177901744e+00,-3.824296532936597992e-01,3.823771324716601638e-02,1.283862302827301960e+00,4.050710809435324578e+00,1.183700034510806631e+00,4.522945642343467743e-01,-7.737955146765485015e-01,-8.512608282553869588e-01,1.683050567421106480e+00,9.369642562064872671e-01,1.373990988855290085e-01,-6.185257709177478525e-01,1.604696101383133122e+00,1.207002831427285816e+00,-4.824127920436890316e-01,-4.244849078702603862e-01,1.047537328358062458e+00,3.039260058691692912e-01,-6.328343450412968751e-01,-8.000111277362708107e-01,4.574830534541858840e-01,-5.660529924884068892e-02,2.487845017174216966e-01,2.816596872657284312e+00,-2.843948794960761139e-01,3.463503846520879503e-01,9.680768368973334814e-01,-4.002167579776590989e-01,1.696750502652730530e+00,-6.275389902018208010e-02,1.322383167445586372e+00,-2.435439456978052419e-01,-4.868818396803424320e-01,4.498489170405831628e-01,4.815157558116610059e-01,1.029918051197293849e-01,1.097021498631937098e+00,1.045713303593940102e+00,-9.504065559874510516e-01,2.171236641045289351e-01,1.646844745838192070e+00,3.974017952018008004e-01,2.826569894336611877e-01,1.857915906652634730e+00,-3.182333529236249792e-01,5.338145214848852849e-01,7.264149195542596305e-02,1.604369738089088226e+00,-1.617770572690505060e-01
1.318778088000543303e+00,2.937258178393555852e+00,-2.288640580176117267e-01,-1.013024207238204522e+00,4.940468885263558929e-02,-3.359053413574780156e-01,-6.554267996718967648e-01,5.528191983394866726e-01,1.651478217597499576e+00,-2.828700020725213315e-01,-1.191711038877136253e-01,5.779703035862172600e-01,-3.674692893037607155e-01,5.858022153308959368e-01,-3.951618710015158409e-01,1.899177585532906054e+00,6.641306994337996539e-01,-2.306242785422793762e-01,-4.025869740300177524e-01,-1.521722649228618995e-01,-4.675460080361413806e-01,2.098301993087305639e-01,-9.048674691716434015e-01,7.285601417708562066e-02,1.603883378608342181e+00,4.966771873970709517e-01,-1.237316882916566774e-01,-3.762008306984320205e-01,-7.132492865808471860e-01,-1.102484990187962310e+00,1.375578078865799525e-01,1.675494933197007708e+00,-4.948524864735154294e-01,-2.333818045595231760e-01,-1.069914627248013117e+00,-6.360258447019141448e-01,2.201022414528784665e+00,5.746568693721075816e-01,1.091550014985591677e+00,1.089773429098889190e-01,5.306462901694646295e-01,3.485540449626056692e-02,1.666526404034173736e-01,5.866749782394440338e-01,3.100871792835292462e-01,1.011748090043993464e+00,3.061979591486740926e+00,5.765907212547483063e-01,-3.333192751554873989e-02,1.746377813852553640e+00,3.883747974065391073e+00,1.194577529628899182e+00,8.294438511290200822e-01,-1.571461014509145937e-01,3.756044789210806201e-01,7.948339002991580138e-01,-3.366342330239087133e-01,-8.469767773893296936e-02,-1.726153315212227035e+00,2.850528948180282018e-01,-4.060346557153250435e-01,9.533523259091438717e-01,5.646290394017391412e-01,4.755142821123339858e-01,1.146054241299761856e+00,2.660927249886534396e-01,-2.602444195736106636e-01,-1.639382149083252749e-01,2.156557747233002753e-01,1.791988668285546538e-01,2.471899583846255410e+00,-7.488058668332635559e-01,-7.692875252712981782e-01,-1.472172532250005383e-01,-3.007957233986918721e-03,6.545348000943014277e-01,1.307960687506872222e-01,5.974006315703204173e-01,-1.234161239895550377e+00,2.820649776407979648e-02,1.459385154076784818e+00,2.116541794231713292e-02,-1.228925361697572882e-01,1.013762859808550854e+00,1.015330605504028094e+00,-6.841355279679089962e-01,4.363693829192263896e-01,1.770954639723136825e-01,6.170940664399887643e-01,-5.999200209012325313e-01,1.653929422909493407e+00,-1.380415351106238031e+00,1.671382037028518397e+00,-5.178651877407841608e-02,-2.949829420314416528e-01,9.999548692022353080e-04
1.145325449117750027e+00,1.064278150776674980e+00,-3.672977198629159834e-02,-4.399889297929944210e-01,-6.716011349192442248e-01,4.579290798031649401e-01,-8.383350934597555426e-01,7.722897236296418777e-01,3.254555262847528496e+00,7.359922163654051275e-01,2.689720184579827977e-01,4.777948208407962194e-01,-5.275922934329536629e-01,-2.923797984137043171e-01,-2.075918807865134164e-01,2.281036594865723188e+00,-1.509250803955946574e-01,4.407143889240590084e-01,-8.927685612593437570e-02,4.038371582328809106e-01,-1.106606886041795024e+00,1.138909047339916158e+00,-1.386862867035906222e-01,-9.397705891687288537e-02,1.337554847597973717e+00,-9.618717129810716582e-01,-7.202017025526261107e-02,-6.234961267400154217e-01,-2.776762948759649019e-01,-5.115157697276717652e-01,4.466292342632682821e-01,2.837743434542880916e+00,-4.142644986630185100e-01,-4.636580435417729240e-01,-5.711503119662846295e-01,-5.220180209608328292e-01,1.867206792516008962e+00,1.076576486697865320e+00,1.171186809180045474e+00,2.123126703386450931e+00,1.363310029329206419e+00,3.687151305433852277e-01,7.441568073111577419e-01,3.252441462577496667e-01,3.155915734597954936e-01,4.238764142896102038e-01,3.620730319388693275e+00,1.669085926236724138e-01,1.955458988548164911e-01,9.542408822605541463e-01,4.393737412119322450e+00,1.645437921519739666e+00,1.444714590907534735e+00,-3.463209605464215857e-01,-8.549415959571545764e-01,1.608079684988062086e+00,7.548230887689640900e-01,-6.415338684521095791e-01,-8.520072807882033139e-01,2.435112839565733545e+00,6.960300146294934320e-01,2.641283848097603082e-01,-4.411176748204664877e-01,1.094965544498247789e+00,8.539492368617606077e-01,-1.417483106869266152e-02,7.767292966762040507e-02,1.447619562810462668e+00,2.886001337977133763e-01,-1.415769499429039291e+00,3.392312246636318918e+00,-4.095649764652649627e-01,1.521485805439749539e-01,-1.087026255004481523e-01,2.044099660388096207e-01,8.426882389960632658e-01,5.963453539664260727e-01,9.411177880851772093e-01,-1.190359877639618924e+00,2.582826458761283694e-02,5.427376771667397071e-01,8.543644359974906788e-01,-3.581454148694085404e-01,1.101482081227002308e+00,9.736844347898931940e-01,-1.020493425901427331e+00,-2.300478711590882575e-01,2.552122500043653375e+00,7.850431710966216947e-01,-1.322813769753074853e+00,3.045041820848178205e+00,-1.732218178384311025e-01,1.716389993203334630e+00,2.924063642433313848e-01,-2.502126798784948258e-02,-2.399972468591549390e-01
7.807241568669840426e-01,8.490466592891532382e-02,2.129200841989944415e-01,-3.033059926991194533e-01,-3.998331318916751864e-01,4.443199285502479334e-01,-3.409103612962471330e-01,1.375938375251406498e-01,1.955176575266115435e+00,9.574166002101537343e-01,8.055230708742123769e-01,2.160476454542859803e-01,-5.026228855166768872e-01,-3.749505478508509126e-01,-1.649963049260867176e-01,2.074279310921437247e+00,-6.438787387046680522e-01,5.590979693593922661e-01,2.009959423835930847e-01,4.933441921494828297e-01,-1.149063229999446989e+00,8.551742520463758712e-01,-1.283408556211307339e-02,1.215772865351961024e-01,1.304661888569929484e+00,-1.161400600935605931e+00,3.545779658446074345e-01,-7.152316192318201038e-01,-6.532137730985088098e-02,-3.763942098014989579e-01,4.146844258952898099e-01,2.991481551661569149e+00,-3.565056919001256541e-01,-4.296546826099535976e-01,-3.125191337969998595e-01,-5.983915066253934212e-01,1.086305077673709540e+00,1.492149661160364627e+00,1.621144388713195328e+00,2.592039075148195870e+00,1.077844092016359223e+00,3.943651372588496962e-01,5.035727650764115770e-01,-2.814442955944834734e-02,3.734115742879955402e-01,4.420474481416821200e-01,3.173478853489728024e+00,-4.415106315428776740e-01,7.126210246078937272e-02,9.905417991184042315e-01,3.901801969674627113e+00,1.417036914047372864e+00,7.560142902758474337e-01,-5.878357644476837063e-01,-1.336087510147300650e+00,2.007400736043132738e+00,1.231210570555850925e+00,-3.157244613897155494e-01,-2.119599042397404265e-01,2.414421453724866495e+00,1.482335370181528722e+00,-3.109694992225338628e-01,-6.742114317641173526e-01,1.530965318006920040e+00,7.111278282264735795e-01,-1.777963784447771367e-01,-2.916845525415589502e-01,1.602014778419818430e+00,2.684853086180979953e-01,-9.876840904528105813e-01,3.026425088918924811e+00,-3.766927870327129169e-01,6.851355686640699938e-01,4.315425470539243635e-01,-1.969599514236773374e-01,1.426977845704166192e+00,4.000522968376251653e-01,1.158738248046940589e+00,-7.364837583927488218e-01,-1.515040457756385572e-01,-1.132306515686646309e-01,7.258755145648982943e-01,-1.444809491961600578e-01,1.326698303814014102e+00,8.889928426712458975e-01,-1.069052707801577240e+00,-4.415536753893906097e-02,2.831593199621296630e+00,5.479375526031502464e-01,-2.761995431550137159e-01,2.651905213006445550e+00,4.671500069296841140e-02,9.291721648034034775e-01,3.359588819675591864e-01,1.019541404720237132e+00,-1.480620582418455122e-01
9.279777621986335934e-01,1.030196520322832709e+00,-9.197862732401904107e-03,-1.752852783092288536e-01,5.022318399746462936e-02,4.891564581251028887e-01,7.384268658868058388e-01,-7.793368276104087333e-02,8.495361482744863135e-01,-6.640751493443844411e-02,-1.443515932820650938e-01,-2.490701699580845085e-01,-5.259599521295177382e-01,2.346381122907907901e-01,-1.703432521808223576e-02,1.023436315028473320e+00,-6.095371154666180402e-01,-5.923154619607747806e-01,1.729289500978166139e-01,2.010085627525683982e-01,-8.979479003203514331e-01,-1.767743473957672506e-01,-7.303261319444700472e-01,3.315880565477657971e-01,1.347693615474033990e+00,1.586898304289037498e-01,1.098926714287201678e-02,-6.666763420558483588e-01,-9.166802537498750514e-01,-7.425426764273530544e-01,6.466994383838167160e-01,2.349070632126435854e+00,9.469698921447927686e-02,1.459585598565504849e-02,-8.258052243551997629e-01,-6.544033038291343640e-01,1.696926836744117262e+00,6.753558092696602122e-01,1.142351645697084361e+00,2.829767189952027140e-01,8.562143113419808937e-01,5.302893411572890958e-01,-1.571102371484003335e-01,3.871340427949603868e-01,7.681155072191092614e-01,1.039752482194318928e+00,2.301898550014345624e+00,3.696653977247195133e-01,4.686447002824148389e-01,4.742633212521899511e-01,4.287453533050941346e+00,1.734247277202218163e+00,4.230058159073148971e-01,-2.973657706328574624e-01,4.155148601411634557e-02,9.049990103816893949e-01,-6.279513768597640988e-01,-3.951522539500927911e-01,-5.037214300182917270e-01,5.637419887262582474e-01,3.620667951620173408e-01,-4.659010840465949155e-01,-2.542184403670226800e-01,-1.569233375039912337e-01,8.121821891007947603e-01,2.485134739966755879e-01,-4.141714625664176808e-01,1.069127720843162876e+00,-7.695055116160295361e-01,4.280037683150853534e-01,2.319293128378909330e+00,-4.010477663003045867e-01,-1.766200166374284342e-01,6.471735577288739716e-01,2.325610564802091940e-01,9.821307211897774003e-01,-2.091929292014654829e-01,-3.270420015601585018e-01,-7.148621991017638511e-01,-7.905207495660082628e-01,3.739272904076860193e-01,-4.362616640085122399e-01,-3.484251904084639806e-01,1.584704835184685745e+00,8.987815491631723219e-02,-7.775964509756931875e-01,2.547276510041743824e-01,1.041317279040724575e+00,1.064572146766808558e+00,-7.288797248645904059e-01,1.342980200293990567e+00,-7.516763501772856237e-01,1.377174512564905307e+00,5.892804512386931037e-01,-8.996783687306080246e-01,-3.807958471352470564e-01
1.264303967890566316e+00,1.466045835370657802e+00,-1.126433252088166137e+00,-2.696419693188480404e-01,-6.422216334863971587e-01,8.640820477176238690e-01,2.530718227174120760e-01,9.177499979519577744e-01,1.507452909861306090e+00,2.179408708240507808e-01,1.115138786615318622e+00,4.118200420220217151e-01,-2.063966466480867124e-01,4.705261163721010109e-01,-8.310055015844406423e-01,2.754105354058844046e+00,9.079304947389659208e-01,-1.025274070209221122e+00,-1.073210216366673464e-01,-2.616946917011253038e-01,-1.684363860899212861e-01,1.110184743358748838e+00,-5.979362205223640592e-01,8.231209485593798947e-02,1.522001447046160916e+00,-6.330510585282552727e-01,-5.275366526011282531e-01,-4.672756098473053177e-01,-3.596258815948800702e-01,-9.923792569081165693e-01,6.011702189362727600e-01,1.813278597351613008e+00,1.088006536499946386e-01,1.237366885372499087e-01,-9.412414279129663885e-01,-1.055875900173706361e+00,2.205582806322880618e+00,4.359435910131078673e-01,1.621280426422413656e+00,6.596329397559190788e-01,1.227997651021562220e+00,-5.302815965640478302e-02,9.423781608950852762e-02,8.325040522288370548e-01,-3.690963148549930573e-01,6.639399003792012532e-01,2.657123078209291833e+00,6.540364170866576066e-01,5.089708698027792799e-01,3.502738191599049644e-01,5.576890716364537148e+00,2.190297041108121512e+00,1.648443666972258637e+00,-5.411552592404843542e-01,-1.001367476300552006e-01,1.125058166809037363e+00,2.463801423619268460e-01,-4.044868291308090225e-01,-1.621336063042871256e+00,2.436210289959459985e+00,-2.531458114534095305e-01,-3.586174192625549706e-01,-3.137991735287525286e-01,-2.610677041475735205e-01,1.690565117373965531e-01,-6.783152055945618208e-01,-5.651282660495351440e-01,7.766316706788667368e-02,-4.772795565528695771e-01,1.545457915871595866e-01,3.485543897381468526e+00,1.627853175270740915e-01,-4.011503568487779781e-01,3.965890885459131265e-01,4.076500834801853879e-01,6.606130403281508245e-01,-3.334671105902959343e-01,8.937698631590229592e-01,-8.040883728709429246e-01,-7.282005333961831806e-01,1.755572834917560776e+00,8.387219265158787351e-01,-4.007771088961697981e-01,9.100572338253695159e-01,1.229584616379298723e+00,-1.208023798155936079e+00,-2.682342772619805138e-01,1.033872963781976795e+00,1.044677705605105977e+00,-1.842662817788210505e+00,2.335128462551326667e+00,-1.760833767618831258e-01,1.479446264013529522e+00,8.592551461339073549e-02,-9.090378436044097010e-02,-7.935445970154204609e-01
1.112723690465137194e+00,1.781073027721134405e+00,-3.140196272100529429e-01,-4.520148607972465093e-01,4.915901543983362820e-02,1.148459638124711968e-01,-1.988151879751154372e-03,2.628499452072967646e-01,8.401759538665085625e-01,4.508053480701434967e-03,5.251992634600988197e-01,2.471459159155858509e-01,-3.429910867817758113e-01,5.694591513499719371e-01,-3.273262780007959449e-01,1.965608783356198819e+00,3.165139638431221925e-01,-5.264758457782885426e-01,1.551813951894392279e-02,-2.169106069222195149e-02,-5.356519639759692586e-01,1.328630753194303682e-01,-7.473439365697324144e-01,2.859979824117024894e-01,1.360891151695774237e+00,-1.216522358340333676e-01,9.876835919268384112e-03,-4.684470023436846930e-01,-1.733026810125173345e-01,-6.918490972481105006e-01,4.127418331908149773e-01,1.805186234663956224e+00,-1.230943932250082862e-01,-2.343500617547641940e-01,-8.532046425697428216e-01,-8.849763023579982901e-01,1.600376794888765497e+00,8.439503489985391571e-01,1.216196927790579974e+00,5.014024072068891114e-01,7.036580492745027060e-01,3.907663971206321030e-02,-3.818796906875207564e-02,5.675883375583288259e-01,2.043013927431738264e-01,9.545223896540347974e-01,2.665349474800660534e+00,2.485122998977616349e-01,1.779013284585847510e-01,1.373221944394196647e+00,4.235948312986388409e+00,1.194189169687318808e+00,6.827685585705680626e-01,-4.825745460164581058e-01,-4.716972700211752301e-02,9.958725616290279303e-01,-8.416493933396762550e-02,-7.575560008374740417e-02,-1.076530454942829618e+00,6.032025935419618179e-01,4.400142773054558365e-01,3.799689349986962172e-02,-6.522661364783161053e-02,3.518635196133430565e-01,5.194045385750417632e-01,-2.950442174965026698e-01,-5.127525488736386361e-01,2.296470772101045776e-01,-3.171112570844640266e-01,3.395853095835611457e-01,2.744630689452230321e+00,-4.864548032685780399e-01,-3.172682347287121840e-01,6.829742438836080565e-01,-6.336281964294210312e-02,1.261148429621751443e+00,3.132595219485118099e-02,6.483010973516825093e-01,-5.122061558893931110e-01,-4.672969342042768148e-01,8.938448269048524519e-01,4.539880353771129362e-02,-3.289478540111662186e-02,9.935862489206738202e-01,7.463719275288146493e-01,-6.766375362885369560e-01,2.865918813653045016e-01,8.893785196860675146e-01,6.373468773465001957e-01,-3.183105544211518589e-01,1.631884165351181304e+00,-9.205192349468633850e-01,1.265946818666036311e+00,1.248533287417223914e-01,2.893712518168350956e-01,-1.300010350312946206e-01
8.560077391036001737e-01,1.036750810439025283e+00,1.335622168114314889e-01,-8.937285838140540672e-01,-2.320781688132809162e-01,-1.031192733598504385e-01,-7.929071644822798248e-01,2.018231290727791616e-01,1.658675459288079246e+00,7.316104974268772265e-01,8.932755848770933538e-01,5.831641885112543999e-01,-3.793876953694703680e-01,-1.485744758677390864e-01,-4.592906079204496783e-01,2.332299925257476314e+00,-3.136898349245303974e-02,7.037571127184679698e-01,-1.273256351503971318e-01,1.963564553005253122e-01,-7.811274779589757467e-01,8.908315616805867476e-01,-1.860174394335702974e-01,4.286893265470934078e-02,1.592699785315271122e+00,-6.821060595305399321e-01,3.966848825748140461e-01,-5.721516470678242872e-01,-2.504656228183197442e-01,-8.132566940270882228e-01,3.658016147612624946e-02,2.558582596199529213e+00,-7.043009921401837126e-01,-3.810913140515485575e-01,-4.555574591665264572e-01,-5.688098429675713108e-01,1.258824454897080170e+00,1.412902701187428445e+00,1.913961880656812831e+00,2.300106804684398654e+00,6.280613777693326849e-01,1.395089334758822242e-01,4.948930968519332785e-01,-7.688549007432664284e-02,1.696210346261770585e-01,5.193977914688147068e-01,3.265737475835719827e+00,-4.390197217895094872e-01,-2.873911536522060217e-01,1.623286772474584527e+00,3.422097782495390206e+00,1.188326546920356552e+00,6.162558327589446883e-01,-5.034821615242510706e-01,-1.096505156903579969e+00,2.008424153831692927e+00,1.402665573268578214e+00,5.058276826598420706e-02,-8.662313101371027502e-01,2.125570191652730756e+00,9.224595196028235744e-01,3.666813134625876991e-01,-5.474110622719374764e-02,1.888063043984164580e+00,1.052353341398698072e+00,-1.535777973952295872e-02,-4.231298009528389747e-01,6.990707037458540052e-01,8.654803349666780887e-01,-6.239646299234105076e-01,2.681923857948368184e+00,-5.486029821495086445e-01,3.938901150371024729e-01,-1.411050288628104554e-02,-4.639055279293062273e-01,1.212761565553440946e+00,2.850246556732551340e-01,1.621794702967543467e+00,-1.080596122866923636e+00,2.475497697917122819e-01,5.094767665088776321e-01,8.181741890222451463e-01,2.722169804538265847e-03,1.238632238152609366e+00,1.438982546810551932e+00,-1.123208663632750071e+00,2.336721714950096285e-01,1.908694014916214154e+00,2.624935046882850287e-01,1.384498463174311245e-01,2.411295861001529595e+00,-3.490074064756173433e-01,7.596760314934004610e-01,-4.427585213484058757e-02,1.517734418944034935e+00,3.071788269585229436e-02
6.903750034304405592e-01,2.054785330179657032e-01,7.299622462072659357e-02,-3.333274460431842057e-01,-1.167852019937102581e-01,4.143039106271082517e-01,3.266004432840015070e-01,-1.783829069565562864e-01,7.320108690534069540e-01,5.908177251505403182e-01,8.363419744328325356e-01,1.335756423113988733e-02,-4.296806298721901340e-01,-9.067728161580625168e-02,-2.727038951056606209e-01,1.725001480555711453e+00,-5.893873227493542366e-01,6.377260182565241964e-02,2.206996544883440547e-01,2.656574300750452200e-01,-8.633928106480086573e-01,4.294811883342226633e-01,-2.920064898566182010e-01,2.745558643895403272e-01,1.434708517918691584e+00,-6.204963227176764073e-01,3.582785823505696410e-01,-6.973263928438291348e-01,-4.226894483871262986e-01,-6.699836348709896638e-01,4.072200798686607115e-01,2.645281651385073207e+00,-1.946325873151040220e-01,-1.246379543048383165e-01,-4.586906348716456860e-01,-6.912586761775675326e-01,1.083060218546346043e+00,1.260863850181469292e+00,1.846628773178141447e+00,1.759200599175712032e+00,7.602565367798759244e-01,3.646103825416312505e-01,9.011756530526843223e-02,-1.209957767705645282e-02,4.024180740694282554e-01,6.908156019796248826e-01,2.552785015260661705e+00,-3.514880875854695663e-01,1.186549551664664442e-01,7.987970510477904185e-01,3.885292953807947924e+00,1.541250570990511548e+00,3.463944183168026769e-01,-5.805371544231666681e-01,-9.257405381782330966e-01,1.770167000826823767e+00,7.970417796683095801e-01,-1.001937580396268929e-01,-3.013313556925759640e-01,1.828918363040632045e+00,1.110341157418201830e+00,-5.592687114255834313e-01,-4.572585268368163369e-01,1.030447166835206874e+00,7.218414160516614109e-01,-1.010387158360747106e-01,-6.165465654677158014e-01,1.113105040188935524e+00,-3.542892167704012746e-02,-1.510818850683481873e-02,2.522962657999826774e+00,-3.013546049944219596e-01,4.919400934828987992e-01,6.342151779313269788e-01,-2.376037746850053756e-01,1.377247544836578186e+00,-9.737585016762106971e-02,8.255595546758826009e-01,-6.372075794004421478e-01,-4.551292543238465993e-01,1.052788981884874575e-01,3.158084827368564662e-01,-1.325701814813680102e-01,1.526308804505073891e+00,7.638870500797246832e-01,-1.088050265859609178e+00,1.853539893644456926e-01,1.902558693752082863e+00,6.229902779419794756e-01,-2.490833418357801810e-02,1.890554326543524066e+00,-1.748594247860136841e-01,6.561693883100685465e-01,3.367671318970287264e-01,8.630836925846965269e-01,-2.665009432725778948e-01
1.003893579656632395e+00,1.494903924086550262e+00,-4.243080801367007382e-01,-2.383411302547499000e-01,2.189180990232511559e-01,3.226629594041887650e-01,7.762072267754349664e-01,-3.117227968319474796e-02,-1.197847129224594021e-01,-2.223981643946618403e-01,5.391053215903232054e-01,-7.510698792747161345e-02,-3.234259761845921233e-01,7.291805635978133582e-01,-3.177854716781469691e-01,1.574443174664508893e+00,1.337602865107180294e-01,-1.032974914680667489e+00,1.632098994605311326e-01,-1.103063051715467702e-01,-4.200357338276154984e-01,-2.364587639033366440e-01,-9.206822400113314764e-01,4.498251644399715587e-01,1.364272806026912033e+00,1.503480114064273121e-01,-1.243112292598430590e-02,-5.096178727192828273e-01,-4.142629132838079320e-01,-7.824612570817954804e-01,5.603189418303777813e-01,1.670740954328397532e+00,1.641143817846790753e-01,2.354203570293456060e-02,-9.252773736265422766e-01,-9.848015946718130520e-01,1.535203757996202789e+00,6.659601095727790687e-01,1.312319251257558328e+00,-1.101039627952429267e-01,6.113964880378486288e-01,1.103175302150066206e-01,-3.991083927096515938e-01,6.052545969072550269e-01,2.958813862278824591e-01,1.136760602115802765e+00,2.076779362842170684e+00,3.306727570084288526e-01,3.684657479081589471e-01,9.314864515351424235e-01,4.439786113440438164e+00,1.414011196094057787e+00,3.937967109007429745e-01,-5.142639161661349823e-01,2.143089480525524060e-01,7.924211100158070620e-01,-5.224930338884491432e-01,-3.470246613092174692e-02,-9.037961603457237425e-01,2.430305628211075764e-01,3.259433894289867073e-01,-4.645754236927948644e-01,-1.278824657341756654e-01,-2.418645954010486543e-01,3.815234262610188720e-01,-3.051464720312018208e-01,-7.526445395940570826e-01,1.517492488153902030e-01,-8.265721846261896433e-01,1.053924368455339877e+00,2.452954959876088026e+00,-3.360857259861693702e-01,-3.697458106320691273e-01,1.038925782343842696e+00,1.338457994746221347e-02,1.295424786735939859e+00,-3.718988241447190313e-01,1.806394018941314128e-01,-2.884395542796703849e-01,-9.016676992840613192e-01,8.549833233137960065e-01,-3.347955938612600657e-01,-8.631728105260291772e-02,1.202552540414957516e+00,4.293640395241247187e-01,-6.840186524575118110e-01,3.675052061888119947e-01,4.413279471920267261e-01,8.231982566517750399e-01,-2.859055603403524159e-01,1.068579501774748142e+00,-9.399916773202365849e-01,1.089630254543831445e+00,2.748326873042823970e-01,-4.213259118640164114e-02,-3.196761230613208715e-01
8.772758390521477878e-01,5.903370340764391155e-01,-1.774714248172107323e-02,-5.059699979437974893e-01,-4.226803738458443926e-01,3.787642266774793876e-01,-3.404515151344059132e-01,2.922953195440199381e-01,1.889923414030472149e+00,7.486169111311219426e-01,7.756232795030142402e-01,3.427237105647074622e-01,-4.333020045581971735e-01,-2.248161814716054252e-01,-3.664992190267214456e-01,2.177824983312311780e+00,-2.617604350747835817e-01,3.587016641255768024e-01,1.695904545063767893e-02,2.791317103187192505e-01,-8.922577989617415106e-01,9.355135796690334793e-01,-1.609459101951117299e-01,6.245871556619987663e-02,1.472306570122250413e+00,-8.530411033859078840e-01,1.930267483772309944e-01,-6.490580869664323016e-01,-3.459810270077354755e-01,-6.903811307173600698e-01,3.291173678418520265e-01,2.732549004392399450e+00,-3.967213751185522108e-01,-2.663753880874760727e-01,-4.759212023173291506e-01,-6.121839526073872273e-01,1.417744805256453411e+00,1.233028033974471471e+00,1.740210276940246104e+00,2.150639671053172108e+00,9.798839415772961914e-01,3.022570864200873064e-01,4.476163727380218504e-01,7.161371082407212707e-02,2.416411938377262814e-01,4.993271051028945751e-01,3.106223266881755318e+00,-2.085924636329988535e-01,5.346660888894144703e-02,9.494476478046678380e-01,4.045072652370236277e+00,1.599800148920276666e+00,8.750473840554354732e-01,-5.008949458410882905e-01,-1.025401621253451356e+00,1.860204689192890948e+00,1.074376381467701869e+00,-2.650762218408704296e-01,-6.625711590345297886e-01,2.414066026027944289e+00,8.940922892895031282e-01,-1.018495936597169776e-01,-3.896593263550232056e-01,1.290760039272608406e+00,8.266402955996217106e-01,-9.208787223186964965e-02,-3.505558418051388236e-01,1.130387881236246006e+00,3.427327311499832052e-01,-6.972850792334532866e-01,2.932370202291525452e+00,-3.216341100182343871e-01,3.998395316434489866e-01,1.706110150591773622e-01,-1.247368029168080539e-01,1.102924931921495766e+00,1.939732913860043317e-01,1.158248951777183677e+00,-9.820384821080418991e-01,-1.173362187037852999e-01,4.173842008587227981e-01,7.592846654670430961e-01,-2.087482592334433396e-01,1.319504569730276522e+00,1.099479524486023152e+00,-1.164723080094217433e+00,-6.885186996585246355e-03,2.204969439130569864e+00,6.070678863952533311e-01,-5.441915388828030276e-01,2.524461738198730654e+00,-8.781550647353675298e-02,1.008495671330958299e+00,2.123422434132050396e-01,7.907950012250135607e-01,-2.522427427821605228e-01
1.059699200474951031e+00,1.250939390964731057e+00,-1.723025139819123197e-01,-4.122166800051370594e-01,-2.089782459134334469e-01,2.000308893733020732e-01,-4.446304872658822238e-01,3.904029738757388568e-01,1.585636192105389419e+00,4.809389549010032461e-01,7.917887546934758713e-01,3.882128738746679630e-01,-3.800080955067254296e-01,2.226457031125064767e-01,-3.051013275622620480e-01,2.326681757707824261e+00,1.538975094253625664e-01,-1.062544521459589386e-02,6.113176554396148460e-02,1.849772595863577451e-01,-7.605458223850718458e-01,5.932387560693784812e-01,-3.996199557566174621e-01,1.791094339369103394e-01,1.290500905904556239e+00,-7.520046081730802356e-01,1.215136879515678614e-01,-5.225486288124366885e-01,1.589357972092177995e-01,-4.602342980832127006e-01,3.881421962735667197e-01,2.216450479347570113e+00,-2.733985809135143219e-01,-4.447930576715585782e-01,-6.179585217190382007e-01,-8.218479492052361834e-01,1.386639302456123657e+00,1.179996555556554583e+00,1.306587191144155558e+00,1.549302210099827937e+00,9.240417225621272435e-01,6.778735971257154880e-02,2.958679910654834488e-01,4.026896178573348695e-01,1.209848042637805543e-01,6.738893436950871285e-01,3.092685192717531173e+00,-4.839099876924694843e-02,8.622520389658616669e-02,1.448884804054722419e+00,4.164584678186990629e+00,1.137708576545259032e+00,9.058659748162780634e-01,-5.773426071938192461e-01,-6.591637230368923017e-01,1.446356451419809730e+00,6.316949822620994137e-01,-1.694366520092798756e-01,-8.451532304808908602e-01,1.466448782923395644e+00,9.645222309843445307e-01,4.506202076233700726e-02,-3.444867029084253129e-01,9.976578290510360603e-01,4.786597189233048333e-01,-4.300890776667352089e-01,-3.657439555299141776e-01,7.034533775646150122e-01,3.793649197585056282e-02,-4.414906633061697061e-01,3.122030189438376180e+00,-4.645929253133055936e-01,7.926087004673602887e-02,5.805506094925487748e-01,-1.487306119016270634e-01,1.412887537985648923e+00,3.564185185531436040e-01,1.134261494759663647e+00,-5.438262637349164930e-01,-2.285900540060767649e-01,5.718481178931695830e-01,5.234791283711495158e-01,-1.258822467141185175e-02,9.171418204992884959e-01,9.616894399597519794e-01,-7.912205138573140673e-01,8.657377509399760696e-02,1.863086285880059645e+00,5.052667545844256036e-01,-3.179405561471889130e-01,2.297663973358735401e+00,-5.158853686068902711e-01,1.202323950470586045e+00,1.113151456868315681e-01,8.519269023048565703e-01,-6.621582258395003473e-02
8.425241569832124799e-01,1.437647176427092610e+00,-1.153613414275492938e-01,-8.909737876062502338e-01,1.534050044819478265e-01,-2.524948294031059137e-01,-2.524937717738024445e-01,-6.159392611137823326e-02,1.927330076083240140e-01,3.077949118478905954e-01,1.137582596077167496e+00,4.610218640415711389e-01,-2.470945435355561826e-01,3.765034105327398350e-01,-5.906144287364311074e-01,2.226274755972904362e+00,3.202246809604180622e-01,6.572914110198474491e-02,-7.269415445974383716e-02,-9.395769927322972226e-02,-3.841825359270525375e-01,3.652139796605072819e-01,-5.441371385116282600e-01,2.614644412756470526e-01,1.626885836636629890e+00,-2.191794366239274983e-01,4.078512103248565501e-01,-4.750311198966050141e-01,-1.918169696206288855e-01,-9.562098332114555843e-01,2.477861144584403430e-02,1.915908753466933456e+00,-5.081360319296613914e-01,-2.051760035470290844e-01,-6.319012038937819042e-01,-8.141239221475955468e-01,1.131160860320835182e+00,1.243403229491294892e+00,2.002874739626136602e+00,1.332145619216481780e+00,2.565710195426997298e-01,-8.168128883746456070e-02,2.031899194812777226e-02,8.849658168605943620e-02,3.533028309432673097e-02,8.173599468623162778e-01,2.668300385121705975e+00,-3.697084907421549493e-01,-2.783118556543920930e-01,1.800324429581931174e+00,3.435302495782043053e+00,9.931356055069981981e-01,2.227614543904227751e-01,-6.021278589112430968e-01,-6.182617518853699146e-01,1.659252613369520457e+00,9.450359350564951910e-01,3.860542363215230255e-01,-1.055191745666129277e+00,1.178327964731961774e+00,7.135006327241752988e-01,1.854775962290077795e-01,1.558407566324041538e-01,1.395713444157994143e+00,8.084433165677187283e-01,-2.361451254435007474e-01,-8.071170966972736061e-01,-8.477511092791445435e-02,4.911190357984317467e-01,4.560295901114385098e-01,2.345613754400150519e+00,-5.332854513551938958e-01,1.081103034879855734e-01,4.553684947851235343e-01,-6.024228651613404706e-01,1.429188760580219375e+00,-1.046048528610654671e-01,1.492831590469209768e+00,-6.807234356089126859e-01,-7.762770521134770840e-02,8.064905108408192413e-01,4.034296610032895303e-01,1.790662336164803303e-01,1.162752194883139634e+00,1.361659089800166589e+00,-9.663836127069564963e-01,5.066271865464174740e-01,8.933115002685397821e-01,1.949953293061649218e-01,6.493825989278643185e-01,1.599444955291655202e+00,-7.348195597370339449e-01,4.738790081683458277e-01,-1.614883310507320147e-01,1.729979803853532561e+00,4.059829969731920674e-02
1.166270299756944961e+00,1.793143209673056182e+00,-3.111458382453478611e-01,-3.699626157473023813e-01,-8.505240153181679863e-02,3.636893369502765538e-01,2.704741121242560942e-01,3.570005121326731423e-01,1.340831840515791296e+00,-1.584550563392561340e-01,-5.682272651716119283e-02,8.026163340096081900e-02,-4.408630445452240143e-01,4.309584665985664587e-01,-2.215653984003131960e-01,1.534125464420827534e+00,5.468753533708198278e-02,-6.800076006182882438e-01,-4.183579462722018805e-02,2.140906756229107172e-02,-6.650040141109516689e-01,1.093997680864057243e-01,-8.114146555024005503e-01,2.128662027653848154e-01,1.406399061612394918e+00,1.653342094970983722e-01,-2.076847571356014999e-01,-5.382588943415906879e-01,-7.632838024850927550e-01,-8.510094878528891016e-01,5.565602553369417560e-01,2.015077393783210269e+00,-9.859293005455682657e-03,-4.751254827011908155e-02,-9.732951984966097259e-01,-7.307538051774659094e-01,2.046626238166500578e+00,5.133422994398416650e-01,1.043902337630005839e+00,1.015167767596238946e-01,9.038145713822953731e-01,2.991163753917443491e-01,-2.831943413075937999e-02,6.271016046847205372e-01,4.669912262414837034e-01,1.000164862140924704e+00,2.597163927320345955e+00,6.175262258726507136e-01,4.109611989039627655e-01,7.678883789184922648e-01,4.542763818978234447e+00,1.683977938011324893e+00,8.515735834789672776e-01,-2.662068291937823017e-01,2.531622325852940225e-01,7.626076376525221523e-01,-6.122912806821333431e-01,-3.922414352563180495e-01,-1.092179351116821628e+00,6.599723162568060797e-01,-5.568289596970074640e-02,-2.407169693511757025e-02,-4.250401874827797188e-02,-1.994358962335112118e-01,7.537667044790579141e-01,9.045110101232484157e-02,-3.314974065376156687e-01,5.655900561487607892e-01,-5.772317434001333902e-01,2.908389327055854734e-01,2.639686468451852175e+00,-4.073257662563176673e-01,-4.988218704314357210e-01,3.965731916056559614e-01,3.006596098761266656e-01,7.827615275119804705e-01,-9.989876389820517844e-02,-9.651971490935884468e-03,-8.638036111199742795e-01,-6.022302555447028860e-01,9.785980654919452792e-01,-1.566311880595052108e-01,-3.307542839809571866e-01,1.256546549812081359e+00,4.476239514635402261e-01,-7.600550404901875723e-01,1.821531387514610800e-01,7.456331376814081535e-01,1.013008520757730402e+00,-1.078588989941069221e+00,1.605724397372450429e+00,-9.000180639821144801e-01,1.653966672103448277e+00,3.592767510279329390e-01,-8.807389732269179650e-01,-3.658463004844289546e-01
8.555993124300832475e-01,1.267951620691122105e+00,4.558374834479084203e-01,-4.494099731377382279e-01,3.923061744174683452e-01,-1.975595580855610822e-01,-7.318706457307416757e-02,-3.177105733634228990e-01,6.476694968546163889e-01,1.388117334446319906e-01,1.040517861328877913e-01,7.904022539333421804e-04,-5.189370338980546782e-01,2.858250930950915758e-01,1.282646486354117599e-01,1.258646627850778410e+00,-5.873825081659027614e-01,1.036791105641080846e-01,2.086527626768517885e-01,3.439498735276804720e-01,-1.041852481733634317e+00,-3.924362240969448967e-01,-6.216410881475489258e-01,3.988051531682260675e-01,1.225296821711561179e+00,-4.505475290388092496e-02,4.894701529972119713e-01,-5.898516853027986340e-01,-1.548080752586602493e-01,-3.928644914051824255e-01,3.448944174995197121e-01,2.271158583149202492e+00,-2.857402950709629907e-01,-4.757569593613293901e-01,-6.157891517018245775e-01,-6.474348689153199832e-01,1.020855714409832249e+00,1.291614381692809843e+00,1.065809786536008774e+00,9.825018643612668523e-01,4.888195969671145780e-01,3.115206972949197128e-01,-1.039381784953913312e-02,1.649538404333582009e-01,7.589882056904488916e-01,1.018152938589975243e+00,2.711476447647898080e+00,-2.285433422641451329e-01,-9.909041298201096137e-03,1.742875409019617905e+00,3.244448095032536727e+00,7.002438733018483408e-01,-2.859348268961070527e-02,-4.519478939019756503e-01,-3.958863266006105719e-01,1.203064634184665804e+00,-1.790286708339405841e-02,1.753575365537628217e-02,-2.940881648815572014e-01,-1.000854252979210823e-01,1.243215234883998432e+00,4.539197217795581940e-02,-1.433513698228535971e-01,1.005923366853619605e+00,8.495695908653595474e-01,9.126549787694199223e-02,-4.128556252607252230e-01,9.289607051964997586e-01,-1.548445171726968994e-01,1.180399498481146114e-01,2.232476812454237347e+00,-8.622438491877701949e-01,9.263045834508555620e-02,8.383304342988232571e-01,-3.696579648102056859e-01,1.690125517405137501e+00,3.205532630882872991e-01,4.292585281603332747e-01,-3.878355187769368939e-01,-2.921748811871961449e-01,-1.289099120021980349e-01,-3.974938919752808997e-01,1.231284534976271883e-01,1.281926159521717290e+00,3.102301591833873662e-01,-4.576617973267765871e-01,5.578122381874592861e-01,1.419884025339364531e+00,4.233204503567622456e-01,6.722032348176081307e-01,1.378855436226960496e+00,-1.080818330395574733e+00,1.009181433385587301e+00,3.198273750805565308e-01,5.524702416308517883e-01,2.544254882334014978e-01
7.743210381138638798e-01,6.825940576218880729e-01,-6.735424734968557814e-02,-4.270252582279758791e-01,2.027841212670501714e-02,2.228716024108819416e-01,2.298671465875406494e-01,-1.343363403165770964e-01,3.788365023878299542e-01,4.258328851348931465e-01,9.782725032471675242e-01,1.231295928484350544e-01,-3.520540872489311135e-01,1.894052716226412580e-01,-3.637909571099546269e-01,1.909501101058066919e+00,-2.085423310312427558e-01,-1.161940075756737883e-01,1.714408250771932152e-01,1.192537268779624293e-01,-6.609784606024780018e-01,3.052356376421580531e-01,-4.415878799847879899e-01,3.215419609907376186e-01,1.436875097813410385e+00,-4.854311270882220586e-01,3.395106299473332201e-01,-6.016305802225824229e-01,-2.161326786891692997e-01,-6.927836166855877442e-01,3.390907709568344863e-01,2.270370694152816782e+00,-2.050591632861235303e-01,-1.640400542444518384e-01,-5.523196990775371962e-01,-8.129760321098482567e-01,1.077149014599934951e+00,1.221794708628824333e+00,1.797822304994643350e+00,1.421859133461551572e+00,6.063395428631088713e-01,1.667736205240785141e-01,-1.257758541348390560e-02,1.234627476272894681e-01,2.432976545124155010e-01,7.846199650084341171e-01,2.511695553175590678e+00,-3.043927131335366076e-01,4.461237289304719605e-02,1.155134989387442523e+00,3.858390779888369870e+00,1.295914492438183352e+00,3.144639245103245107e-01,-6.268567646695009099e-01,-7.225666699754819122e-01,1.611972905365899322e+00,6.952715699158089624e-01,6.838738097690255646e-02,-5.560053030612877034e-01,1.398773540266706528e+00,1.011854343329490424e+00,-3.890756017157221414e-01,-2.978447629776228567e-01,9.774405404979329415e-01,5.998053435653752929e-01,-2.737117544847009754e-01,-7.133396159346295784e-01,6.325060861833551318e-01,-3.730473671313260658e-02,2.689387361653197139e-01,2.529584667352736016e+00,-3.669975963781575423e-01,2.953239660550096568e-01,7.549179844617364132e-01,-3.354758074307500615e-01,1.490095225208942109e+00,-1.072195423058919239e-01,9.864550142980939018e-01,-4.845652986885302660e-01,-4.417837776988423615e-01,3.620572946222774813e-01,2.651666093353606812e-01,4.683683125737192476e-03,1.318269171363634529e+00,8.801491364434508302e-01,-9.621765256255843113e-01,2.935397475747632545e-01,1.490390426216946729e+00,4.955222593755137517e-01,2.106143745268603262e-01,1.705521161087769189e+00,-4.260180939346541740e-01,6.293488482145273011e-01,1.771962028342023987e-01,1.123713569006835611e+00,-1.646781079428728811e-01
1.183053427147761294e+00,2.308512798494922080e+00,-3.703313468803792752e-01,-8.783835687659796720e-01,5.807099777795472761e-02,-3.881219222890540110e-01,-9.111579717062747719e-01,4.650492736380511527e-01,9.440904317805139945e-01,2.325529078944998940e-01,1.160214052430489584e+00,7.755459270924641713e-01,-1.992671853217448108e-01,6.823848294468356501e-01,-6.038085770546239850e-01,2.813646127182128254e+00,9.949832149854007657e-01,-6.123652527029323916e-02,-1.692590534768556310e-01,-1.508264997978656097e-01,-3.004827362817052427e-01,5.100543474442660319e-01,-6.319356694061865065e-01,1.967148376195078929e-01,1.444998464343282718e+00,-4.303875169623359032e-01,1.827725753538317344e-01,-3.176055049274359998e-01,4.479114091265574693e-01,-6.871993097151037899e-01,5.555344759959351952e-02,1.516129821826115220e+00,-5.238625373614416159e-01,-5.192847804816533852e-01,-7.636669557573079192e-01,-9.756060273943587546e-01,1.361253451566044603e+00,1.189541268286276487e+00,1.468206733176649070e+00,1.160421066519851552e+00,4.556975042392552022e-01,-3.650854650981118499e-01,1.941723039666199968e-01,5.039838534429662564e-01,-2.468273992904302938e-01,7.956960204668643843e-01,3.144336360253856544e+00,-9.978757961892584238e-02,-2.671899739743703317e-01,2.368999321190875307e+00,3.779679601115735199e+00,6.072463966320933437e-01,7.646561554799465865e-01,-6.385432515948723520e-01,-4.005887303286616574e-01,1.352187313592443596e+00,7.883964010860761151e-01,3.032915823126132171e-01,-1.496690102618288609e+00,8.554541480378298202e-01,6.784611195584338006e-01,6.472694995150042319e-01,1.725220409997740012e-01,1.317441287400564986e+00,4.794852779108478291e-01,-6.328111095969131128e-01,-5.852219757761244479e-01,-4.159807878805560355e-01,4.676308463265554938e-01,5.201868979627016776e-02,2.980456647509996060e+00,-6.556889790866708978e-01,-2.445173987976831387e-01,5.194406663287816084e-01,-5.062938426779240997e-01,1.539285389836213769e+00,3.308178402768545134e-01,1.774603958419022742e+00,-4.894345113275697656e-01,6.601653732232115601e-02,1.185409016246907754e+00,6.001122589052788614e-01,3.004287092029377382e-01,5.617600001571230184e-01,1.499070351121207789e+00,-6.679316021278975946e-01,3.817186804762572327e-01,9.570719180067264187e-01,9.727446823029095579e-02,3.686979428545705262e-01,1.998924932173290703e+00,-1.008627432228054399e+00,9.778485561829270978e-01,-3.475460912604443897e-01,1.751431689169857142e+00,2.127704926486260195e-01
1.014586084772711061e+00,1.016513089840450190e+00,-5.445568779494839307e-01,-3.906433965980006251e-01,-3.233182886802595801e-01,3.894279429455941299e-01,-1.792856663188250876e-01,4.402252841366322000e-01,1.052029777369055230e+00,5.642861443114871589e-01,1.420644519940043038e+00,4.494177767606243323e-01,-2.416374677311957930e-01,3.167185821800010403e-01,-6.263170370904028728e-01,2.740738682167198625e+00,4.977565701763292938e-01,-2.869089743103651613e-01,6.471318276732629382e-02,-1.520474182067278746e-02,-4.351399456654058140e-01,8.753398002177553705e-01,-3.749131969895395655e-01,1.958139079106637759e-01,1.401322069445860796e+00,-9.464321258455727914e-01,5.139416074400426915e-02,-4.956733156220165526e-01,2.328250978839432328e-01,-6.289114265939647064e-01,3.778028934572277286e-01,2.031416112484049297e+00,-1.818158768476219045e-01,-2.551517959269126723e-01,-6.124811971446568748e-01,-1.002114139473718746e+00,1.342922273551460988e+00,1.134371683889190852e+00,1.742372693719083765e+00,1.611263513292535254e+00,8.990691014764682354e-01,-1.029626746700982864e-01,1.838698807464247964e-01,4.303137821063981461e-01,-2.449157763570044555e-01,6.038548585638987554e-01,2.853582846934328288e+00,-1.054312188132776051e-01,1.048330033685427320e-01,1.223093702399081106e+00,4.516462133191937234e+00,1.372193756178604174e+00,1.014269044550251131e+00,-7.304708764216130135e-01,-7.620479459928888311e-01,1.611024144925197188e+00,9.794720628539695939e-01,-3.614098518779039482e-02,-1.040535270626286035e+00,2.090942301401085501e+00,8.479339498106018835e-01,-2.452009850868698826e-01,-4.013274980134671210e-01,9.077664910711251700e-01,2.259250645109212030e-01,-7.581467692459549212e-01,-6.418031776133750199e-01,3.143834460433787559e-01,2.503578975600734974e-02,-1.091224338199123789e-01,3.257323543604560889e+00,-1.826664225329405478e-01,1.407627646422870415e-01,6.940818689071437397e-01,-1.918390737032955595e-01,1.413126603437061535e+00,4.748475160866799660e-02,1.495723008201548909e+00,-4.458228219330153674e-01,-3.858685102088253993e-01,9.172955316354660660e-01,8.326414489271780628e-01,-4.450045811753566838e-03,8.696515698561938512e-01,1.295649701399376852e+00,-1.022562233091708794e+00,-5.156998733504281063e-04,1.698351442710597459e+00,4.933203064346026734e-01,-3.985491321484374017e-01,2.312441852541310627e+00,-2.333627959039248356e-01,8.937499956135501744e-01,-2.254138603675043262e-02,1.350621739352680262e+00,-2.788597252873626919e-01
7.527131614805343540e-01,1.107552760538678571e+00,4.036671138588949770e-01,-1.127535905575408837e+00,-9.235979307132696770e-02,-2.881711714492898868e-01,-7.075469096030544414e-01,-3.504272743132794826e-02,1.532557688853587230e+00,5.962972840027309651e-01,4.805315007586598020e-01,5.057146795012827933e-01,-4.418248547142524796e-01,-2.822892880876817778e-01,-3.934242603235719171e-01,1.845492385188245210e+00,-3.416389218520530791e-01,9.147457240734681028e-01,-2.264640829967176638e-01,2.087864403304597882e-01,-8.577873527931476616e-01,6.897031283050061301e-01,-2.420091345011234352e-01,1.942534780994045751e-02,1.756054045328699242e+00,-2.212150554004432002e-01,5.061137531943172840e-01,-6.209834518814369986e-01,-8.150975619284613893e-01,-1.079510841348395367e+00,-9.116869690967538409e-02,2.715188957190457053e+00,-8.513371911243536871e-01,-2.515805474294955935e-01,-4.806108652716993834e-01,-3.565374887096619538e-01,1.340944544767872282e+00,1.349364630050853719e+00,2.046443502601290376e+00,2.135444634825978127e+00,4.063574882131070209e-01,3.185448054123961592e-01,4.580195924409586894e-01,-2.987827398862384909e-01,4.629122820353437917e-01,6.076206863425821503e-01,3.161686452100675115e+00,-4.552906571019245119e-01,-3.900525943034920950e-01,1.561981644311196682e+00,2.965390725750696177e+00,1.289923030287730477e+00,2.788987462076185087e-01,-3.278568595040178280e-01,-9.833442800130323125e-01,2.023285518092504898e+00,1.253428476495926036e+00,1.018406980783584104e-01,-8.232807456110949884e-01,1.877151299294552933e+00,6.510500031000080456e-01,5.335004431781937839e-01,2.196940530019496074e-01,1.977728977271315358e+00,1.525796785100369313e+00,4.918027485219600425e-01,-4.131401621283782855e-01,7.596273813717371315e-01,1.057941994084431681e+00,-4.411568074884508750e-01,2.139044854256892947e+00,-6.728325654906885944e-01,3.759352370905330587e-01,-3.433172573385524506e-01,-5.120999000038309878e-01,9.601575743342787295e-01,1.376639297968457742e-01,1.338694234670286587e+00,-1.440350975861275584e+00,3.773672308583048141e-01,4.303613802958622392e-01,5.596300325932749287e-01,-7.148891804208684642e-02,1.583951040164212287e+00,1.360919368397869533e+00,-1.200223789699201848e+00,4.253618584809889525e-01,1.543736380572866995e+00,2.907684556895800410e-01,3.042018138436318186e-01,2.098676821264560566e+00,-5.057469426112226607e-01,6.810112921346290760e-01,1.360316440115050263e-02,1.192003922079736045e+00,6.300347103512882185e-02
1.239299486402831940e+00,1.582166002189891785e+00,-5.221246556115279880e-01,-1.270614084201879823e-01,-1.962675219540307436e-01,4.144309703901249420e-01,-1.367973339545648925e-01,5.779512829191514323e-01,1.406656248077506000e+00,2.099465762699127269e-01,7.637085472924034502e-01,2.871204004629465123e-01,-3.396048902677225589e-01,5.762449412433797713e-01,-2.958643960291855723e-01,2.384018256116334555e+00,4.657450255662531347e-01,-6.602021011673534501e-01,1.360985751474758365e-01,7.133350535695304195e-02,-6.107951443428233373e-01,4.058275023419181116e-01,-6.227333990864932778e-01,2.677648359934908240e-01,1.140383097299803250e+00,-6.870151063588679774e-01,-1.469203811286886874e-01,-4.575491219679316268e-01,3.585697418634417044e-01,-3.364191020236665386e-01,6.168920472933746568e-01,1.833858762455533142e+00,4.712705931671407056e-02,-4.057772455966940917e-01,-8.038473440481379573e-01,-1.036261514643134873e+00,1.595739096623721709e+00,9.005246118053628068e-01,9.434946048643219063e-01,8.000477700188405317e-01,1.091861526066165045e+00,-3.745149270763392657e-02,9.982436704400095284e-02,8.000539247594686820e-01,4.822097442170936166e-03,8.146545295373049944e-01,2.893438366083673774e+00,3.245326047769565569e-01,3.601660856871227723e-01,1.282641014972284665e+00,4.797325395358980060e+00,1.186778563544193865e+00,1.155968770918414767e+00,-6.150266672004861546e-01,-2.123749990504083252e-01,9.781167343398884384e-01,1.343002114172470174e-02,-2.921185629192062372e-01,-1.014500237486875456e+00,9.999363415889057638e-01,7.595450988713893237e-01,-1.523177361302056609e-01,-4.523105859387929195e-01,2.209167984654286654e-01,6.971494811876799425e-02,-7.360619910425949541e-01,-3.826789221512915118e-01,4.776883941356949714e-01,-5.645946821472831445e-01,-1.296321020535046165e-01,3.407289691713502044e+00,-3.559699323673400362e-01,-2.618978243087199953e-01,9.498414289987633374e-01,1.045081932759652082e-01,1.446053669279664167e+00,2.889532097446013137e-01,7.918321548880860039e-01,-2.171667399470816884e-01,-5.963272717270969858e-01,8.500623891358464190e-01,3.256263697757160180e-01,-4.356004741936125857e-02,6.762321186300355169e-01,7.073887287521108957e-01,-5.972965033098845966e-01,-6.140764430285661213e-03,1.547613196150529502e+00,7.069360716651884591e-01,-7.460159997197359782e-01,2.135295172423739896e+00,-6.762490420322292417e-01,1.521516058664910798e+00,1.689544473484019538e-01,3.162268743991561992e-01,-1.971215256148334816e-01
1.068322475223114409e+00,2.354519449711988344e+00,-4.623560427888152025e-01,-8.454789749057313175e-01,2.919785399473790455e-01,-1.293893408803124534e-01,3.799994651228930653e-01,6.298886124676453258e-02,-1.283478976764061974e-01,-4.407847798487083413e-01,4.207537743022936594e-01,2.521605922755072449e-01,-2.442848370205983888e-01,8.111042311957896711e-01,-5.923463117078567874e-01,1.679781032490977877e+00,5.922982317642386807e-01,-8.288732993053651299e-01,-2.093176128252497437e-01,-3.723777364286643410e-01,-1.253472833953737098e-01,-1.188424738359907251e-01,-1.060297445435618879e+00,3.108752022857572683e-01,1.709869545864219464e+00,7.023705517981062574e-01,-2.652036693253848054e-02,-4.110278191338199161e-01,-8.937605447658019120e-01,-1.322800332672751100e+00,2.022941490293052591e-01,1.415674028283131491e+00,-1.957893004378010726e-01,1.560694836308458844e-01,-1.078723240875508083e+00,-8.515071908371362186e-01,1.873422239829530378e+00,4.947094761037513777e-01,1.631884335774991701e+00,-3.850121389254856918e-01,2.371358148098948737e-01,-1.601667261177003310e-02,-3.510885824135036581e-01,5.051659350428177042e-01,2.000008134533860504e-01,1.185368264598648302e+00,2.187687032987997160e+00,4.212345248448388091e-01,6.314997829354210279e-02,1.297971203361682591e+00,4.013888579090507669e+00,1.426214641265257210e+00,3.179041958809599722e-01,-3.356038132733238921e-01,4.712819656075259989e-01,8.096401467466087798e-01,-4.133804494448829470e-01,2.085893331873185652e-01,-1.547902739650008463e+00,1.768116712536724755e-01,-4.205172007686251989e-01,2.087014728860943080e-01,5.073996528917735782e-01,3.182171938928790578e-02,8.916341805558954947e-01,6.485891484195827061e-02,-8.053548087755708629e-01,-5.601271281356973164e-01,-2.124686113175003888e-01,1.310879191046555148e+00,2.042378447957169829e+00,-4.671363602108954405e-01,-6.604342457890757245e-01,3.803844672475296118e-01,-1.348769138967201853e-01,8.487020270426588464e-01,-5.403928656181795631e-01,4.590697191039650460e-01,-8.632814523842213816e-01,-4.899371821091898505e-01,1.486677234596768482e+00,-2.414181428086517034e-01,-7.427229305147270422e-02,1.272667320406181357e+00,9.332155769653336375e-01,-8.415573624050899371e-01,5.927172492682961646e-01,-4.516281030478286329e-01,6.692442811372897316e-01,-1.679406217263907930e-01,8.935667096261381559e-01,-1.250934252906564126e+00,1.021859056262853782e+00,-2.064186403805778891e-02,7.155586697100224658e-02,-2.420110855286214946e-01
8.615675559768573022e-01,1.003660858258717870e+00,-8.295612923027884111e-03,-5.269765881956776088e-01,-3.571038064810506257e-02,1.980135762326183380e-01,1.230435309063977467e-01,-8.085816693294362034e-03,8.962415937863463800e-01,2.909443944925412806e-01,5.147108334566530274e-01,1.396409628398403435e-01,-4.147022669223230928e-01,1.230852646972339093e-01,-2.986735722293862860e-01,1.695043759489328394e+00,-2.575169968564604561e-01,-6.772774422092857349e-02,4.465285843239313185e-02,1.335233736982979202e-01,-7.406554001852566627e-01,3.018667261626812870e-01,-5.012215039651423121e-01,2.317920762920441247e-01,1.493488534067546558e+00,-2.208296235445982580e-01,2.184051530903646787e-01,-6.086578659273658154e-01,-5.725495605670357646e-01,-8.233267555666641258e-01,3.360183204238005872e-01,2.349043031121604841e+00,-2.613538538135196654e-01,-1.229488910521830958e-01,-6.529989816629570010e-01,-6.709585379320402998e-01,1.417215549026505039e+00,1.030378264824829859e+00,1.630153276557515518e+00,1.178219181563739504e+00,6.670832552958146922e-01,2.869678105662960554e-01,6.994428020968800064e-02,1.593508471274332483e-01,4.092401058917869983e-01,8.158493427172682777e-01,2.634476756475760517e+00,-6.231388680274294045e-02,8.883625148164793484e-02,1.033534089406360490e+00,3.875171855058364923e+00,1.463564953725565498e+00,4.353118427399441659e-01,-4.438326918913901853e-01,-4.939361895516852230e-01,1.449815860712873938e+00,3.882412229323996544e-01,-8.956518613636926807e-02,-7.040441838456787949e-01,1.293565597171301373e+00,6.266492868569757402e-01,-1.478378654182736784e-01,-1.394682235016203309e-01,7.999956730387075554e-01,8.653928965343641311e-01,4.373690258281637266e-02,-5.322858507242460568e-01,7.290289176832115414e-01,-8.715823680540808749e-03,1.334633528090577448e-01,2.438443013508262869e+00,-4.311151403074716670e-01,1.034104768602580882e-01,4.202646366013592649e-01,-1.603419987214284304e-01,1.149499303097644365e+00,-7.931572756639826416e-02,6.784686100758864358e-01,-8.127235717179300822e-01,-3.505171134290582802e-01,4.975737026288301057e-01,1.607294927336448964e-01,-1.399935350821897018e-01,1.417404079776231729e+00,7.913360924384622574e-01,-9.670420043931902132e-01,2.838351088972184133e-01,1.310599481622955587e+00,6.446509146396022238e-01,-1.817601451770789744e-01,1.733191081975701264e+00,-5.553908027815495085e-01,9.417990211557167868e-01,2.430675947100288115e-01,4.476940506735274661e-01,-2.021353719266693882e-01
8.264399540667087818e-01,5.747744475165259548e-01,-4.883707987791216509e-02,-2.472240433822653349e-01,-4.498401845124674892e-02,3.152759261720036732e-01,1.126154199052780691e-01,-3.626672653115668721e-02,7.091929222376428532e-01,5.284387472574260114e-01,9.793869064156641713e-01,1.083533075517719713e-01,-3.859368681041130400e-01,1.710370502024907702e-01,-2.480589335261971784e-01,2.005434052167000658e+00,-2.592044991935263942e-01,-9.907602839721930954e-02,2.629192696135375096e-01,2.338592197198410272e-01,-7.964532946452792528e-01,3.348996534960033133e-01,-3.749133761682975075e-01,3.301241514077006833e-01,1.277327224772729641e+00,-7.525389021547759238e-01,3.177597652453133525e-01,-6.073434403707230755e-01,9.141302078005519860e-02,-4.306716947713564725e-01,4.465839836218581937e-01,2.337979751599439826e+00,-1.362489518576183445e-01,-3.184711253649787355e-01,-5.049941620597888647e-01,-8.552272656003154783e-01,1.007417369386316874e+00,1.309320070120407742e+00,1.554972081401947648e+00,1.600970083141947775e+00,7.906380280585907361e-01,1.675276961410895882e-01,7.021708122391724649e-02,2.146959394864918491e-01,2.420038930776207964e-01,7.350369229645639102e-01,2.667784682595870205e+00,-3.055301189319662991e-01,1.207768926703143703e-01,1.203706217871655326e+00,4.005615882870630529e+00,1.179028037770420312e+00,4.716048882509208395e-01,-6.802131857168032258e-01,-8.217540334022876980e-01,1.584629242229511181e+00,6.882558168917456420e-01,-4.897372754619176705e-02,-4.116130254409727796e-01,1.399605854951694539e+00,1.301060009667691642e+00,-4.497088911654109067e-01,-5.083192339970639129e-01,9.795982271239755956e-01,4.084071589244395728e-01,-4.432109711579838018e-01,-5.980761418298931043e-01,8.778567643615997618e-01,-1.682632178150538227e-01,-3.774025587318874386e-02,2.818925622360861194e+00,-3.839092938741263672e-01,3.506861800827520970e-01,9.276719575883324298e-01,-2.773740093973973142e-01,1.659282643952438629e+00,1.132130612513705947e-01,9.898335704259991763e-01,-2.973902805096592106e-01,-4.785018385177836064e-01,1.786852628893461636e-01,3.110573401436498298e-01,2.707671270687750376e-02,1.166643130887589308e+00,7.559289639898844060e-01,-8.440611248434528591e-01,1.837627418105581834e-01,1.913104188227086278e+00,5.039889915605275661e-01,1.213870587890475972e-01,1.931961091021139110e+00,-3.706235757988593504e-01,7.844951331056337906e-01,2.367476933118513038e-01,1.110627613671752778e+00,-1.187711504562449782e-01
6.904036270406477271e-01,4.724098142546084289e-01,2.066178606257991768e-01,-5.701362217425870460e-01,-9.065446162842710764e-02,2.638439307677756251e-01,2.315072339251975364e-01,-1.987031774557382058e-01,9.390764910247613173e-01,4.725681034271423941e-01,4.725719858309949117e-01,5.061198694124098563e-02,-4.698306747004095674e-01,-1.839239241951440840e-01,-2.672406313897766061e-01,1.475277026917839462e+00,-6.711201622974427572e-01,2.332411882099161837e-01,6.645212493350313721e-02,2.434514955391870461e-01,-8.898484235425290212e-01,3.993094498662129732e-01,-3.408546914976552933e-01,1.963474948056604663e-01,1.582681117259093773e+00,-2.666667052251281422e-01,3.544110091962044962e-01,-7.083483636500907954e-01,-8.727477686381754918e-01,-9.164328442113257589e-01,2.927606546737154813e-01,2.727864566752242759e+00,-3.464216594649529024e-01,-3.864694508096713776e-02,-5.226219504597410248e-01,-5.180368536121202627e-01,1.306693269500284416e+00,1.142761947574969295e+00,1.898106528512574886e+00,1.608257452900998530e+00,6.470505596381492808e-01,4.708635695879632710e-01,1.371666257500739339e-01,-1.165970293150622589e-01,5.694042275076344195e-01,7.294850629816221899e-01,2.601456872380151442e+00,-2.581685109134728151e-01,4.057692524275410828e-02,7.755737263739327370e-01,3.636152430103968491e+00,1.663567951033888770e+00,2.618688478793225749e-01,-4.071622655024759729e-01,-7.788199560683914946e-01,1.741823819196948397e+00,6.720575140166851202e-01,-1.118675826656804345e-01,-4.411251420070146367e-01,1.740691657198530029e+00,7.371496241272843530e-01,-2.827140301811923440e-01,-1.895742352083873150e-01,1.073357971063267913e+00,1.111750870136876568e+00,2.955654009948174288e-01,-5.389656767839022811e-01,1.088430119078110714e+00,1.794675471406473877e-01,2.015718998854887367e-03,2.215046806580368344e+00,-3.938224403651472416e-01,3.811186951331931305e-01,2.382546555587688741e-01,-2.110904431416704696e-01,1.058272699022048791e+00,-1.621066875007549923e-01,6.553615061048646551e-01,-1.025830740284394249e+00,-2.830926316180791824e-01,2.205550967379505400e-01,2.146261230043611801e-01,-2.246180042782742747e-01,1.721874517013040951e+00,7.950711614167202956e-01,-1.162147913579539837e+00,2.827956819297470226e-01,1.585110284047811291e+00,6.675002121533326616e-01,-1.113056489631636947e-01,1.785967496424201384e+00,-3.134511313977059732e-01,7.369449956942552005e-01,3.388935086507686156e-01,4.949378815083936844e-01,-2.589254060353584075e-01
9.050848987889558162e-01,-4.076760484925806560e-01,-2.276657915231006801e-01,4.660919446668885247e-01,-5.790566507333824164e-01,1.131453722257766303e+00,2.826004303778075766e-01,3.442549867362895144e-01,1.883985612386625208e+00,9.637797135463090914e-01,1.063704218748122488e+00,-8.936171796760086772e-02,-4.932840225136474466e-01,-1.464097668066489111e-01,-5.198560571273758146e-02,2.242233464245205532e+00,-6.034015772578620318e-01,-2.564088665818321511e-01,5.497663904077968455e-01,5.530860355415390117e-01,-1.168320205898215391e+00,8.049917602941254469e-01,-5.281821248131746138e-02,2.766525349951171053e-01,9.263947378073693617e-01,-1.688757116332648911e+00,4.621520268113467333e-02,-7.337839871079845366e-01,5.097099133015727812e-01,1.182788037155639849e-01,9.275277603143170513e-01,2.852999014881092421e+00,2.504904351767876514e-01,-4.424102987528115150e-01,-3.527939803695452348e-01,-9.422585125641991244e-01,1.070305826324682519e+00,1.338548066485085952e+00,1.159946862398452572e+00,2.245162245696705750e+00,1.613776026424900589e+00,3.631193275588901481e-01,3.192307713650403000e-01,4.404888697254430996e-01,2.056175461846797559e-01,4.583229366905741675e-01,2.909065470204158732e+00,-1.494783668060923054e-01,6.015478023284914766e-01,3.875318544578580937e-01,5.041733777568966346e+00,1.614973762744246200e+00,1.212608150496901516e+00,-8.002435045208244890e-01,-1.204325825278055762e+00,1.644979513076933131e+00,7.359457241387359350e-01,-6.542839037305203664e-01,5.718830679607833645e-02,2.452086216391643259e+00,1.816792876130291390e+00,-1.112993078108354350e+00,-1.338540610026131228e+00,5.660840762350377586e-01,-1.509121078853412623e-01,-8.589295487474903901e-01,-2.973258906035746718e-01,1.921672611083957261e+00,-7.575578040507859878e-01,-9.540707008812714385e-01,3.764978680433440417e+00,-4.508705062839801769e-02,6.326660717940234546e-01,1.254314413009493645e+00,2.024195872437743460e-01,1.739866427157910289e+00,4.081711143450185708e-01,7.537269577119176667e-01,-1.478334338682163462e-02,-8.472743351865410499e-01,-2.171977604937482820e-01,6.654173993905769802e-01,-2.294175500232786269e-01,1.025013692409182831e+00,3.919218073666269619e-01,-8.818211399594599875e-01,-4.118629321219407502e-01,3.328125661835456661e+00,8.955701558486945935e-01,-9.808818117773761003e-01,2.799103018182848235e+00,3.202301436437204885e-01,1.256819671637254610e+00,5.954650416200570895e-01,5.065325699974820850e-01,-4.428308525964869125e-01
1.175817619746651443e+00,1.090186063362365898e+00,-1.824503310685952617e-01,1.163411439954931126e-01,-1.956526101115315108e-01,4.604593851516993741e-01,-3.076200033257532884e-01,4.717430985493699103e-01,1.820095734513928809e+00,4.683809567177513733e-01,6.444520458325209145e-01,1.671045721102815684e-01,-4.579674262252143579e-01,3.652659011318051818e-01,2.100415682195710954e-02,2.248612911865091935e+00,-1.587140111126389419e-02,-3.303917458263744278e-01,3.388503826531402696e-01,3.870357880797657968e-01,-1.010169497638886416e+00,3.176304787482881475e-01,-4.305758466120804817e-01,3.068341836243287934e-01,8.935221985088865893e-01,-1.078776673322185520e+00,2.655139931968200639e-02,-5.335833903424003211e-01,7.384897684713449539e-01,1.145481642699457403e-01,7.306605462756901037e-01,2.194013123146661748e+00,6.220989938374615891e-02,-6.869255571095425061e-01,-6.122884466375547730e-01,-9.791529406176757711e-01,1.256698883217347573e+00,1.220097624810629000e+00,6.390702603447449004e-01,1.371430848161294236e+00,1.276622691944166998e+00,9.813535988278582201e-02,2.512576818902186870e-01,7.125339177768368337e-01,2.182399914364218096e-01,7.319110293506841947e-01,3.128076926397070245e+00,9.223123805028105027e-02,3.850993143072126146e-01,1.412282408139707179e+00,4.606746689957820884e+00,9.055226153927372623e-01,1.096697871598263596e+00,-6.801514839957303327e-01,-5.732646562691543490e-01,1.110166068674645512e+00,1.414556130158710068e-01,-4.266608631858366252e-01,-4.723879396150835186e-01,9.251815162030717632e-01,1.489991259824053671e+00,-2.782372660676195597e-01,-7.995489491920282354e-01,5.450845982868722794e-01,-3.318992074456672547e-02,-7.946735040561325736e-01,-1.935184166792046634e-01,1.157091928678795956e+00,-6.291346267085554667e-01,-6.871341110876791891e-01,3.598057671331953422e+00,-4.902903228638412214e-01,4.656065506233959816e-02,1.201217584561910634e+00,5.972342511010426958e-02,1.817319017204442888e+00,6.793445570787197685e-01,7.502212529580658540e-01,3.837090848848023761e-02,-5.653871133694620132e-01,1.678261306587423007e-01,2.804275589840168337e-01,2.337564769573985402e-02,6.348161994921499574e-01,4.050881058136223123e-01,-4.174285839899731787e-01,-7.611385703058620722e-02,2.425327554815098541e+00,6.425183470583301082e-01,-5.077129597304648190e-01,2.404191397414849884e+00,-5.677164323895204090e-01,1.582132831992256516e+00,3.375005652351338314e-01,4.474770612117945912e-01,-1.746343937472483177e-02
1.141173886708740870e+00,1.632809270331287532e+00,-6.573890397014797715e-01,-5.386080811022551096e-01,-3.421694793969336512e-01,4.729828543482388903e-01,1.765509542337781457e-01,5.557024776774800445e-01,1.287984510559786688e+00,7.131605706848409554e-02,6.152117010426053634e-01,3.323368623694679114e-01,-2.974742121777206316e-01,3.715699044127454553e-01,-6.360475060505699219e-01,2.166475386357837429e+00,4.980627534259976508e-01,-6.538080202082697800e-01,-1.669388519998668552e-01,-1.747191783778377083e-01,-3.460589154702756742e-01,7.001428295988202377e-01,-6.676645264995649809e-01,1.069998639162422216e-01,1.612569025605282924e+00,-1.351025619998221516e-01,-2.744524597354136564e-01,-5.043658479413946072e-01,-7.464963022894814948e-01,-1.118756609962676229e+00,4.235592112974379542e-01,1.954113444888446516e+00,-1.097162424847701601e-01,1.036371416380484078e-01,-9.259578679233934073e-01,-8.226546031579018425e-01,2.095991319442279899e+00,5.243034866012633577e-01,1.616196638391772300e+00,5.481031699411180735e-01,8.972169952942354865e-01,1.124692550317210604e-01,5.917470705111761708e-02,5.632997172221365645e-01,2.618858985268818218e-02,8.013196819043086894e-01,2.626938506435936294e+00,5.062884927890962672e-01,3.057219385816290491e-01,6.403740431694273649e-01,4.785691501742869391e+00,1.963529971911871064e+00,1.112234121380455409e+00,-3.796941340414092814e-01,-2.543573631033790861e-02,1.128901002303070555e+00,8.426883295335735324e-02,-2.647338793651891065e-01,-1.442456656186199559e+00,1.745916895301762750e+00,-2.593192645284380093e-01,-6.164866600419804943e-02,-9.590984797780338633e-03,5.858196344399424493e-02,6.741616521968778475e-01,-1.508402467686164594e-01,-5.247210880811934430e-01,1.752502760516617686e-01,-2.160912461178355892e-01,2.945518669806697076e-01,2.847617819826739893e+00,-1.402180466051414220e-01,-3.793585645087176883e-01,1.750953360366894751e-01,2.172695801954303563e-01,6.272437335032594596e-01,-3.145650333437203794e-01,6.455272374973006766e-01,-1.036441770443189192e+00,-5.022509836040595088e-01,1.442579178620347458e+00,4.376381692235937204e-01,-3.474997714633724089e-01,1.201174996181415544e+00,1.063204332655958373e+00,-1.121580838438241967e+00,4.453891183300184853e-02,7.357853690832019122e-01,9.271210460488914507e-01,-1.255167482142999225e+00,1.926708344856874922e+00,-5.136510802461441427e-01,1.356847559654290603e+00,1.274079105146155300e-01,-1.961138604403893648e-01,-5.562067549506493069e-01
8.185425588897514704e-01,-1.097490010088375545e-02,3.128926672230606387e-01,-2.762594906312221266e-02,-3.092585917203347079e-01,4.757511443138413565e-01,-3.651527403308531539e-01,1.029979485940218931e-01,1.992703677604157786e+00,9.839861867202925882e-01,7.565838423177018157e-01,1.037733978021362774e-01,-5.520778641755219596e-01,-2.850112846633276464e-01,6.958412205957043017e-02,2.026933478934415778e+00,-7.846465099766164464e-01,4.931846636304159093e-01,3.884233973316573163e-01,6.475869331163138787e-01,-1.334395994882877412e+00,6.169925311316887262e-01,-1.353500323647149894e-02,2.227896288492969279e-01,1.043269892830717360e+00,-1.379514308820896984e+00,4.035142696728445388e-01,-7.151963522515055738e-01,4.056568680376217984e-01,3.343370739307038875e-02,5.678347421569801545e-01,2.975994475838794173e+00,-2.171802429051787608e-01,-6.559644372216912878e-01,-2.637964298998243251e-01,-6.879146835503048285e-01,8.573343177826237005e-01,1.637526312589333122e+00,1.217939455614855504e+00,2.606326720374337214e+00,1.206747238681293410e+00,3.859678962586694517e-01,4.851404536430988790e-01,9.961093451319021075e-02,4.521708137223949819e-01,4.827208340628135197e-01,3.236790302064450842e+00,-4.844654906760472723e-01,1.639915984570667340e-01,1.186581513852391856e+00,3.948911782089321143e+00,1.087048402934981173e+00,7.440287423776950071e-01,-6.797620388910207145e-01,-1.369395161977361663e+00,1.864630028866544720e+00,1.038771734589866824e+00,-3.857529975206906991e-01,8.762303904271573352e-02,1.938069528207476910e+00,1.981389835560564805e+00,-4.414299193849739456e-01,-9.325545016993562752e-01,1.470384977736395093e+00,4.175132371789559427e-01,-4.115898972209560691e-01,-2.016917696296082196e-01,1.867429767277865693e+00,-3.472387493410380305e-02,-1.158471518721211790e+00,3.258631302255123430e+00,-4.787039887487639644e-01,7.319057619111655200e-01,8.606798761612048931e-01,-1.922318978705447878e-01,1.815125427015508386e+00,6.742085193000990628e-01,1.040840252498156815e+00,-3.140066594410868550e-01,-2.782823554169177593e-01,-4.854222600766973095e-01,5.563086518280542236e-01,-3.410174145934707912e-02,1.127553445783023189e+00,5.694002400643043416e-01,-7.850937447988953766e-01,-7.203589395816989427e-02,3.233340726724677872e+00,5.135961164653612965e-01,-9.274913282311331164e-02,2.683424373145478548e+00,-4.508308576292124892e-02,1.062086173259522148e+00,4.356625022125860669e-01,1.045607854280418803e+00,-1.311692298999078687e-03
9.376329460932432136e-01,6.586624583117756115e-01,-1.745374843585684732e-01,-8.231751065338610562e-02,-1.443995423279243462e-01,4.669043035579164003e-01,1.000816063923051780e-01,1.527052226640475130e-01,1.035461993811443104e+00,5.067051212127046123e-01,9.152293614090192264e-01,9.774429563480754868e-02,-3.985233548716523022e-01,2.308879839982270199e-01,-2.014590409264904736e-01,2.098127365347262963e+00,-1.661120972770633308e-01,-2.748460410628824624e-01,2.952958438494841520e-01,2.571894631659233377e-01,-8.276097890023785819e-01,3.803025082575665627e-01,-3.943475052380376877e-01,3.206773570303332876e-01,1.168701126577971650e+00,-8.755269470118699493e-01,1.696619901719273460e-01,-5.929620639426983475e-01,2.402739306448093970e-01,-2.934119695150241292e-01,5.779680726349439857e-01,2.293703576386142196e+00,-1.456265401092510237e-02,-3.702732892838220269e-01,-5.538600405554491291e-01,-9.164751662046937142e-01,1.141100160127705543e+00,1.219631850006060558e+00,1.307548054744758215e+00,1.477905536895272931e+00,9.938673041076815373e-01,1.559481667156125684e-01,1.022260802773712063e-01,3.999041697715184918e-01,2.015853004898475742e-01,7.255754052143504884e-01,2.746618312269130335e+00,-1.275626987384121669e-01,2.652540401448715834e-01,1.102841910922054414e+00,4.352879808575880638e+00,1.224023652960321673e+00,7.317332030227682305e-01,-6.852566278167406821e-01,-7.201997536665252220e-01,1.422708738920854366e+00,4.880212190905190983e-01,-2.069907829274201250e-01,-4.505584898942699423e-01,1.390627755194858040e+00,1.283522858431108471e+00,-4.986974259255887443e-01,-6.394810289883292587e-01,7.076791075012653920e-01,2.239787821349124020e-01,-5.825383929417600193e-01,-4.947479398836184261e-01,9.682916747116643297e-01,-3.959171375641161728e-01,-1.918872466746182059e-01,3.103435025955679549e+00,-3.368285647412289641e-01,2.444434503929021063e-01,1.024471400346182337e+00,-1.076915089020968885e-01,1.649479781625252883e+00,2.136246719797593729e-01,8.654860840725684401e-01,-1.987721128916436486e-01,-5.847004936266302355e-01,2.403700305734299825e-01,3.289424924032845476e-01,-2.326410487439767305e-02,1.023039511480047459e+00,6.411103612929560658e-01,-7.619566289540267157e-01,5.246286376618869429e-02,2.054299261746481697e+00,6.178907399502518993e-01,-2.369041263700233657e-01,2.089828245500755521e+00,-3.573730291835098827e-01,1.046528937855615293e+00,2.927626027388615659e-01,7.981990494097110922e-01,-1.766338024646780525e-01
8.251957713545901019e-01,7.143277996894344950e-01,1.023882098819769854e-01,-8.190094315890472654e-02,2.518884673292983156e-01,2.195249559684890883e-01,3.648040804376351809e-01,-2.713629287995028005e-01,2.244657647294648894e-01,2.809993229069633891e-01,6.859953264874200096e-01,-1.145127482544252007e-01,-4.362759957268492195e-01,3.810664460851733160e-01,-1.344516865897593672e-03,1.585959354817286560e+00,-4.615547617364623156e-01,-3.260866623513546947e-01,4.061164159948906782e-01,2.920284563988373994e-01,-8.959780573208577792e-01,-2.294343601333050930e-01,-5.625505699479630417e-01,4.906460143009084840e-01,1.114854223305646430e+00,-4.909893955179266967e-01,3.880477063336657539e-01,-6.026382274909594106e-01,2.011123075754897016e-01,-2.325178804146458278e-01,5.525304137319471121e-01,2.180312300113872670e+00,1.791909719961176650e-02,-3.906000542910121331e-01,-5.645975173890005472e-01,-9.012082405189711931e-01,8.563359649099977489e-01,1.297034583586287315e+00,1.196004451795925405e+00,1.066573101216909514e+00,6.944944781203309381e-01,2.082737991154114676e-01,-1.454417640964280611e-01,3.118743668839287775e-01,4.730872804488057692e-01,9.509841713203777136e-01,2.449982892386797673e+00,-2.562589776806940556e-01,2.015281633858779231e-01,1.360634502037451732e+00,3.864169326038724872e+00,8.883177707974609927e-01,1.647158913374516809e-01,-6.763068216634011698e-01,-5.426728027075257144e-01,1.255599735566979458e+00,1.267145708875012655e-01,-1.941475676829833297e-02,-1.738403710656873935e-01,3.905916240103681769e-01,1.490688955009555228e+00,-5.484687704437533062e-01,-5.297212875507003593e-01,6.781790988097508022e-01,3.094743062048878057e-01,-4.288344290804738668e-01,-6.076463949876713677e-01,9.245471950372710079e-01,-5.619478980607178764e-01,2.856572007195711249e-01,2.624507292505826594e+00,-5.468505008632367215e-01,2.299255612453897091e-01,1.316730536247671779e+00,-2.870100819297232153e-01,1.920575891034877136e+00,1.562529304159087640e-01,5.533077434318645071e-01,3.450160726546380729e-02,-6.779014496831162750e-01,-1.037067237560342914e-01,-2.009602216495559590e-01,1.208199733855229718e-01,1.149326242675200227e+00,3.053703066085989848e-01,-5.352895046053014472e-01,3.483596057035270310e-01,1.699394826962925542e+00,5.191237895209597220e-01,4.614057203742032987e-01,1.481130375766370300e+00,-7.150604290932812690e-01,8.547669834570299496e-01,3.595637764915569079e-01,8.306856875104207116e-01,2.220143653668515960e-02
8.154477678540283936e-01,1.794003070987072457e-01,2.791249820299345763e-01,-1.080797269561795115e-01,-2.299745714583935619e-01,4.508088205080028610e-01,-1.439804231966695380e-01,3.320752780809366200e-02,1.734564924056805513e+00,7.789908413069276394e-01,5.655858789132709452e-01,3.856892150275190168e-02,-5.478067084658718722e-01,-2.142068378653939620e-01,3.680392837776147452e-02,1.792773087037587976e+00,-7.800050913060057045e-01,3.288130241115958530e-01,3.244228619062564656e-01,5.524500706453395749e-01,-1.243439951978528413e+00,4.676346369381698675e-01,-1.483299627340766147e-01,2.345702179044295566e-01,1.143518336596740292e+00,-1.029046053235440850e+00,3.494409130821784504e-01,-7.128471710395676286e-01,6.057924780817613986e-02,-1.771687679165816487e-01,5.497903662509946443e-01,2.881043837253005613e+00,-1.912204491922934180e-01,-4.962900373414828592e-01,-3.685889777635688036e-01,-6.514333505727905038e-01,1.024624038089649858e+00,1.450265753051207529e+00,1.270984840881152156e+00,2.172911566601774425e+00,1.096225657056847380e+00,4.314205654156755276e-01,3.602940292955170154e-01,1.065466129331103379e-01,5.338336539684567228e-01,5.907098023316158519e-01,3.039123965947922557e+00,-3.407370197772208731e-01,1.937230022121861350e-01,1.036096991902267339e+00,3.941265856017079461e+00,1.241577591199120478e+00,6.328664815013186340e-01,-5.870068457365450465e-01,-1.106497417300012609e+00,1.714981874785413085e+00,7.503826147814692815e-01,-3.647846397583347500e-01,-3.444754535627891912e-02,1.705270080417097933e+00,1.622289641803824400e+00,-4.236281659700205648e-01,-7.548181090178329722e-01,1.202537466023201107e+00,5.689558692669554052e-01,-2.157722791538603246e-01,-2.577484924180497017e-01,1.699847239861504988e+00,-1.139550298249263904e-01,-8.202648610723408673e-01,2.994548356594758154e+00,-4.684582125072268566e-01,5.703946729256973436e-01,7.531711249950722165e-01,-1.318718553933987403e-01,1.609850090647486631e+00,4.648450068289299852e-01,7.808718893464821065e-01,-4.596225160985822900e-01,-3.462887090100901788e-01,-3.119224815688053098e-01,3.617603860562916274e-01,-1.042786965697973245e-01,1.272747389090504333e+00,5.069408962750668879e-01,-8.216540872978439491e-01,1.739060096157946100e-02,2.754960097199094626e+00,6.128459790989115863e-01,-1.811823991524907362e-01,2.391283494173482183e+00,-1.793478568376118965e-01,1.078125354224055421e+00,4.584889308696648014e-01,6.813004067050139057e-01,-7.797303590311160937e-02
8.311014024522405119e-01,6.934049045197936412e-01,-5.863047147116003111e-02,-2.873502612539060030e-01,-1.524768770376291882e-02,3.352661329864380368e-01,2.894160064368940799e-01,-6.891387404612012157e-02,6.383953935990355211e-01,3.755351704660123691e-01,7.546909129686463213e-01,3.942844949781677821e-02,-4.021827193769174080e-01,1.864323515514868523e-01,-2.457683156609962172e-01,1.779384346343785062e+00,-3.102673237211375223e-01,-2.148713557955114761e-01,2.131276200418087408e-01,1.863288024616728822e-01,-7.682091438068793243e-01,2.344582694540013335e-01,-4.673319533082037625e-01,3.245700911731989047e-01,1.347481205047176722e+00,-4.837292879328197182e-01,2.532181960354237815e-01,-6.188884719620310060e-01,-2.254078549259220798e-01,-5.872126263663376422e-01,4.565285710542862918e-01,2.321326318953138124e+00,-1.063817269510213270e-01,-1.910623980514346565e-01,-5.877323314406099897e-01,-8.015145215906427367e-01,1.182426492394555551e+00,1.142397360614347601e+00,1.557849734843306466e+00,1.272475652109188671e+00,7.524048972883187192e-01,2.432056248771992391e-01,-2.692911342300298438e-03,2.228782604432522629e-01,3.441839388905707509e-01,8.096988098219921604e-01,2.537979743985039782e+00,-1.593728767095044518e-01,1.741794550570442413e-01,1.014907150748041165e+00,4.037250249952554881e+00,1.351967708457785911e+00,4.236206292148825270e-01,-5.839271774515653046e-01,-6.122376493788863616e-01,1.456136281484557982e+00,4.230142938725011681e-01,-8.827836015407745929e-02,-4.838072619339843783e-01,1.258605594286449136e+00,1.000427711808776543e+00,-4.431814714510297071e-01,-3.917063116628335395e-01,7.323166033741058678e-01,5.506711354270061864e-01,-2.481516961036843716e-01,-5.992685460240927409e-01,8.381528672994682516e-01,-2.536799059075551810e-01,1.576944002913032161e-01,2.629791408466458869e+00,-3.702005318736053541e-01,2.238606051828150312e-01,8.079918525108107374e-01,-1.825091439705727181e-01,1.452535486206693038e+00,-3.416766375200175343e-02,7.167135102681967407e-01,-4.511794576628846976e-01,-5.369333829900191368e-01,2.907316250650323619e-01,1.527847538749380618e-01,-6.547769648909404494e-02,1.305289551803460846e+00,6.646305903922609115e-01,-8.793980898018090020e-01,2.253750831863409188e-01,1.597069781472543193e+00,6.256206695162909170e-01,-5.108424816711726324e-02,1.745550713801350406e+00,-4.534206521578030280e-01,8.582312164383780750e-01,2.915293683052465612e-01,6.893470779219856848e-01,-2.005935376734958864e-01
7.540095986646910831e-01,-2.386184314469798062e-01,-5.508605919669279372e-02,-6.571855852045660473e-02,-5.448337015758827340e-01,9.635834949338579758e-01,5.206530647621099295e-01,1.241309853757563142e-01,1.739048816174470602e+00,7.327998618621601734e-01,5.445292836954978011e-01,-1.071870251065318858e-01,-5.248780928193605977e-01,-4.098249365260505650e-01,-2.216127930435952686e-01,1.643174191531273642e+00,-8.509703154636349964e-01,-2.545129242616006593e-02,2.288437870497812554e-01,3.944705300709125950e-01,-1.060992124148742999e+00,8.209547053257841842e-01,-1.409750889068759339e-01,1.336904586785084836e-01,1.409170276883251915e+00,-8.571464498079199856e-01,6.075230733575530395e-02,-8.047471312704372881e-01,-7.817652121223621631e-01,-6.754380211419491742e-01,6.579678226264247254e-01,3.074287024807435209e+00,-2.023112868353593718e-02,1.385806722633967092e-02,-4.672689715919024489e-01,-5.849057991809536450e-01,1.510450316106355828e+00,1.019502466183224598e+00,1.728193169429118381e+00,1.914185678979785754e+00,1.262972957613391678e+00,6.284112952014134779e-01,2.741223017368265014e-01,7.162521216814475566e-02,4.992836663609673264e-01,5.327757477309573719e-01,2.664757861055614185e+00,-3.160231159757345698e-02,4.501487648306033429e-01,-6.381219784172198484e-02,4.573953452155437027e+00,2.219870924643276844e+00,8.738709188281890139e-01,-4.608647496866595805e-01,-9.569873664737766905e-01,1.754854107925686968e+00,6.414243104890410274e-01,-5.845515865101452713e-01,-2.258605956934069958e-01,2.701584955971851443e+00,8.410621232239898770e-01,-8.348905129846833084e-01,-7.473574832450886607e-01,5.662704053012014294e-01,7.354408415024181744e-01,3.902545042273286580e-02,-3.670893084082023639e-01,1.752808248287045512e+00,-3.015554245093418073e-01,-5.174089183018928395e-01,2.867409054882481101e+00,-3.693776677369298156e-02,5.155454252877362809e-01,3.771764186419306331e-01,2.294000902584849011e-01,9.259749681947484490e-01,-1.206279708518603888e-01,4.004810509277056951e-01,-9.417028277150856219e-01,-6.252985217119328976e-01,1.336345626608025361e-01,5.021234371669727192e-01,-5.029537881132898347e-01,1.697374926866345168e+00,5.788799067094347883e-01,-1.303912364810700053e+00,-1.878800104235382462e-01,2.410083937704338375e+00,1.060441881353449523e+00,-1.169677010935592509e+00,2.373929687355950779e+00,2.546996238442071903e-01,1.092594763507711342e+00,6.075941230061483456e-01,-1.564735602131182568e-01,-6.384828904203107003e-01
1.151861156109038165e+00,1.907792924624323039e+00,1.812608520330269424e-01,-5.758998374798892650e-01,-4.558518094223794337e-02,4.623341732083183220e-02,-3.269429042171325128e-01,3.168252551706930431e-01,2.124523148733984179e+00,-2.387165605126184698e-02,-5.290230405711595640e-01,1.775620727477577043e-01,-5.736715503867539923e-01,1.517206690384750867e-01,3.019240284086549542e-02,1.311097681291459649e+00,-3.027386642753895907e-01,-5.481650599420753722e-03,-1.157088856064791560e-01,2.633734456222505682e-01,-1.029326904405943210e+00,7.834368209855074872e-02,-6.729425005305716967e-01,1.145422984654042853e-01,1.376358651691754753e+00,1.890541291836441984e-01,-1.356418319818489260e-02,-5.750072669674802794e-01,-8.060490683810410673e-01,-7.278120492879073256e-01,4.156553654070638260e-01,2.372508947084051911e+00,-3.158040687228065302e-01,-3.074079786590433461e-01,-8.643990081852888085e-01,-4.667765337275961990e-01,1.983129191016550497e+00,7.476149950772982278e-01,8.288492119874200093e-01,5.977748557990452127e-01,8.733793496856163685e-01,4.530244443046217429e-01,2.598138518941066066e-01,4.131781755064150574e-01,7.766486132825366484e-01,9.348104783765993631e-01,3.061629781332147360e+00,4.529434978402976375e-01,2.084591093002310380e-01,1.181636758291168654e+00,3.903977605389213235e+00,1.383439235704846615e+00,7.335877941698591975e-01,-1.279986575609647348e-01,3.799958156193605774e-02,9.127672544197127369e-01,-4.589241350678709974e-01,-4.468959816463812240e-01,-9.008394427133747939e-01,4.744173117229402159e-01,1.985195812522889403e-01,4.459879176038835658e-01,6.079339303166871045e-02,4.249886669475003154e-01,1.166454488380320287e+00,4.738916240268610247e-01,-3.462452803360993592e-02,1.001068152877969464e+00,-1.370683244744308749e-01,-3.384585212684886324e-01,2.501948893809022856e+00,-7.315550532471324363e-01,-3.665361383383529126e-01,5.186582444578227702e-02,1.841120534174741641e-01,7.847585728092447699e-01,3.117535407638356015e-01,2.065563106588619302e-02,-1.134654166333405767e+00,-1.767024003340034177e-01,5.731700268985109314e-01,-1.933014053093947138e-01,-2.940948616100549362e-01,1.326787777567093762e+00,3.952008313148025476e-01,-6.522720495147805719e-01,2.707420189827160484e-01,1.177439648145701012e+00,8.606704605771506866e-01,-7.989380917618646993e-01,1.843147542287135066e+00,-1.046361513850042169e+00,1.797401145761125862e+00,3.895455445062293021e-01,-8.909910960620619491e-01,-6.782548799599363853e-02
9.042401564214076481e-01,8.227598306413266283e-01,-7.785171009018763966e-02,-7.373473833371835262e-03,1.199495970567450581e-01,4.755297228342753590e-01,6.826035598213500144e-01,-1.270814683468499129e-01,4.550004844560040507e-01,8.991354537672974212e-02,3.635818034003327481e-01,-2.215333697604634500e-01,-4.617655419523925553e-01,3.797220286527201449e-01,-2.773426803282397213e-02,1.372819006326656321e+00,-4.646698863741136609e-01,-6.477691357611967682e-01,3.387181129581731676e-01,2.218844823971576341e-01,-8.510744364586297905e-01,-1.991463960370464248e-01,-6.706838717691119278e-01,4.401615796834803529e-01,1.182919753924981388e+00,-2.421470110615825122e-01,1.299111980901192231e-01,-6.275878499779858899e-01,-2.615948122981514024e-01,-4.337214096124011320e-01,6.815425996438556622e-01,2.191236664292203429e+00,1.689310517537863099e-01,-1.666112545833842717e-01,-7.175622758291364534e-01,-8.582863051519674658e-01,1.289969608898993370e+00,9.363830377260884408e-01,1.123495209314438581e+00,5.664748907517949128e-01,8.522081610700238397e-01,3.373822017590065725e-01,-2.040673534572153280e-01,4.468061126380541426e-01,5.517034628089508841e-01,1.004127714753175749e+00,2.300470159192951947e+00,1.215256747405192572e-01,4.263194763747105154e-01,8.078301877350042570e-01,4.308157894066768634e+00,1.362439274413816959e+00,3.829182694140857990e-01,-5.316618766179439515e-01,-2.017470467024455039e-01,1.008293713184980067e+00,-3.341113359389047410e-01,-2.451701214322573041e-01,-3.433725582982824487e-01,4.985185349347382999e-01,9.347664913154747346e-01,-6.511127435696465460e-01,-4.869509063271992844e-01,6.153797528356119706e-02,3.923809201400245694e-01,-2.349331546514382696e-01,-5.418188087121604823e-01,9.720618112478514039e-01,-8.475729522151205231e-01,4.259625843470092876e-01,2.601035065948715364e+00,-3.955002353701250195e-01,-6.653504399140738879e-03,1.127995259247044135e+00,3.987884745184776258e-02,1.492640516827358432e+00,-6.354820552745782392e-02,6.917828830517180894e-02,-2.118243398116383958e-01,-8.687138132564524717e-01,1.851463367191252818e-01,-3.137859136937831139e-01,-1.254839400181592679e-01,1.302378386179358971e+00,1.480685741032031766e-01,-6.384800327061930236e-01,2.403979629320570632e-01,1.381101819961070287e+00,8.509662866000629045e-01,-2.658073605272236462e-01,1.414536606774459804e+00,-6.882888825902178098e-01,1.153937510067457595e+00,4.968075314680804877e-01,-9.519230428970054669e-02,-2.482668305700695688e-01
6.488038079071236641e-01,-5.899578980366529946e-01,3.400093051551728029e-01,-4.163183043441620601e-02,-4.364344263626467879e-01,7.065587203152813300e-01,1.365238753902958679e-02,-4.767299668049882616e-02,1.875904542268433506e+00,1.094429326395815583e+00,7.742072864270974630e-01,-3.009466208056202352e-02,-5.724191232890259995e-01,-5.611656036629862898e-01,-1.754388418946389860e-02,1.806795525791052848e+00,-1.112628944816403509e+00,5.571950307521619239e-01,3.839220413297581569e-01,6.543511600027070996e-01,-1.350001254384304961e+00,7.894274045400113682e-01,9.776449883998283852e-02,1.799609197152431395e-01,1.212959551480464748e+00,-1.340617170613569664e+00,4.190198104213452845e-01,-8.214549000578407201e-01,-1.139895185985286830e-01,-2.274995564959836347e-01,5.697222305494776817e-01,3.298625211231145826e+00,-2.061305955279761071e-01,-3.899207787604995201e-01,-1.991012038335683298e-01,-5.694582493055014849e-01,9.087640571792380273e-01,1.573970855982378403e+00,1.627339347786166179e+00,2.809976375776823243e+00,1.217176242502901129e+00,5.795755377527413987e-01,4.663797226097198267e-01,-1.286710202067675723e-01,5.434501933704457555e-01,4.103400109125333040e-01,3.018547599926054925e+00,-5.457145258743520966e-01,2.139821160925961807e-01,5.987512337873897028e-01,3.985251566528625666e+00,1.580154345655456760e+00,6.525825528919890761e-01,-6.263351517220501208e-01,-1.529779379454878407e+00,2.105601313195763158e+00,1.224425666958785186e+00,-4.445024947724061093e-01,2.255308550476171625e-01,2.608366973839071346e+00,1.798244646756501419e+00,-7.328985929161401236e-01,-9.655172786641050831e-01,1.439856917149632043e+00,6.396926371593196770e-01,-1.564921740430184616e-01,-2.920511146443781625e-01,2.107746725747324579e+00,2.301348067923591340e-02,-1.061343471983470454e+00,3.012428173164306777e+00,-2.833178900051356308e-01,9.316019614823691786e-01,6.349122982305123175e-01,-1.272163274513049558e-01,1.533113837398070167e+00,3.596547802798560345e-01,9.029086837979591884e-01,-6.090843735443801643e-01,-3.555782268149423331e-01,-5.322115534027662687e-01,6.321169792812486588e-01,-2.234661772960304660e-01,1.516369928805428868e+00,6.049796049002569287e-01,-1.110115183504993830e+00,-1.265142474984587428e-01,3.265896433192615689e+00,6.774575099277572177e-01,-3.264602225615682585e-01,2.657648116629599766e+00,2.928106395983955945e-01,8.518428357376908178e-01,5.516831540050880500e-01,8.533237923761194388e-01,-2.492163052081665664e-01
8.306029263245714445e-01,-1.544565158815182082e-01,-3.138510664299740127e-01,1.313501044729070699e-01,-5.408760553472917731e-01,1.139470408037057014e+00,8.076883976927662356e-01,2.019734529930598543e-01,1.457636972239963580e+00,5.913450167376078648e-01,6.517560125858513631e-01,-1.884417035908894089e-01,-4.791450415928542594e-01,-1.882938424602285665e-01,-2.607981649229829113e-01,1.713754743400807579e+00,-6.524274587144147652e-01,-4.711579621729531375e-01,2.981274419057800551e-01,3.008212731670042439e-01,-9.240147085778116498e-01,7.289153944182381606e-01,-2.665843570900841009e-01,2.058618362226904974e-01,1.332558820874073735e+00,-8.565733139754443393e-01,-9.225245923048278063e-02,-7.706861404521145875e-01,-6.511141873216268472e-01,-6.204157694539341739e-01,8.028217820239805791e-01,2.828998031805924018e+00,2.042158385990651137e-01,7.949727137262664611e-02,-5.649670327864447783e-01,-7.479860672703487756e-01,1.587563711244742048e+00,8.591478508192086361e-01,1.603782214380699678e+00,1.483796174041295268e+00,1.350303371136806430e+00,5.480929530133886729e-01,1.155426349927729107e-01,2.969265789211600337e-01,3.818325127492175897e-01,6.109286000411768836e-01,2.463068596882382444e+00,1.560866750794109858e-01,6.239308559888711025e-01,-2.285210575258830312e-01,5.000259424787268259e+00,2.291842908756279051e+00,9.999650347184931842e-01,-5.208869690968406241e-01,-7.251805114241647310e-01,1.515062892064819255e+00,3.332333549358161839e-01,-6.266945614108667684e-01,-3.103220665314279092e-01,2.519768512726420884e+00,7.401223485684529368e-01,-1.056862270039888418e+00,-8.442720431493385691e-01,8.155177854177186880e-02,4.361028439528316092e-01,-2.040648245065305177e-01,-4.451884439274703675e-01,1.577723309018551845e+00,-6.913452423048795925e-01,-2.388124278215191243e-01,3.035569356537918484e+00,8.412621899765865274e-02,3.511171377887227774e-01,6.583845667674643742e-01,3.628503406206773918e-01,9.749884452997963358e-01,-2.341346862117493766e-01,2.383641878350005183e-01,-6.993297645763496551e-01,-9.004894918223983469e-01,3.122346798981767702e-01,4.131324109005615752e-01,-5.162986119709688237e-01,1.568719446729498923e+00,4.564254204600165510e-01,-1.229505734433696595e+00,-2.507507794058805861e-01,2.208418774242965732e+00,1.180670956875053967e+00,-1.397514484245614197e+00,2.245269602808783738e+00,2.230105457734707919e-01,1.192414780615151937e+00,6.353138344593227682e-01,-3.702419170372809876e-01,-7.580271066766097743e-01
1.015476926993076567e+00,1.700016002744213495e-01,-2.487876893187591643e-01,2.189460931588425030e-01,-5.098652791577659160e-01,7.648644546337080019e-01,-3.100290447433866059e-01,5.011052093655704587e-01,2.007281816782981565e+00,9.789525485429354523e-01,1.266168239943560092e+00,2.209161960671489622e-01,-4.234438138552377162e-01,1.840339428377028852e-02,-1.479237898771414428e-01,2.672011298244634681e+00,-1.492510208935072247e-01,-5.294860658975507339e-02,4.272797700383335062e-01,4.742165426759337166e-01,-1.045033459438964973e+00,8.907667776624110800e-01,-7.059741489450527263e-02,2.380742183551018964e-01,9.296859239956885013e-01,-1.750147286879854658e+00,1.101593821314794663e-01,-6.171865612790010669e-01,9.103153395482292964e-01,1.663488252773881459e-01,7.361735609436614869e-01,2.579619514821212434e+00,3.163792040489948887e-02,-6.606541543881623291e-01,-3.635983828611666913e-01,-1.001171898223373713e+00,1.000607837316322968e+00,1.484328525001582078e+00,1.111591470767775203e+00,2.391202645126072390e+00,1.463643037552750048e+00,1.115120132789042540e-01,4.349862195741273641e-01,4.954302662693101378e-01,-9.759319732161819694e-03,4.325390026672314980e-01,3.222621745967431117e+00,-2.493501885999476753e-01,3.602780304147736312e-01,1.092266579364832069e+00,4.771082183599807180e+00,1.164469155933979927e+00,1.271898077060178434e+00,-8.541350687592563773e-01,-1.243147337554004084e+00,1.683992923260100527e+00,1.010452406860157470e+00,-4.531359456396332197e-01,-2.455994862960759750e-01,2.241465192721627364e+00,1.896596114637831176e+00,-6.419629144132690257e-01,-1.143494033003061627e+00,1.010279958784371157e+00,-1.797555443045439905e-01,-1.036727491999927642e+00,-2.806416257946688919e-01,1.488834766879079563e+00,-3.818805766271647917e-01,-1.098157019660319422e+00,3.905017038358059800e+00,-2.251989097426020381e-01,5.382608948263585269e-01,1.187718983359806968e+00,-1.963623702176242602e-02,1.909166092300878192e+00,6.545941146489502316e-01,1.286074977262156693e+00,3.491178136591632786e-02,-5.366428730916873446e-01,-1.335694495890393796e-02,8.579465535565449219e-01,-1.586603823269427949e-02,6.998772451592318866e-01,7.321631328144166950e-01,-7.534184378503832047e-01,-3.188067371766710179e-01,3.236734142959948102e+00,5.902737532728052905e-01,-5.910662798025070330e-01,2.938935296047823886e+00,9.141330013098714069e-02,1.236209564034322472e+00,3.242631011006654740e-01,1.166156981597213926e+00,-1.812770292887268819e-01
7.675101508146831009e-01,1.747407694885813045e-01,2.098586513353968841e-01,-3.866928239742095652e-02,-1.102163352637288984e-01,5.945031289658702089e-01,4.875777369233893488e-01,-1.553629172878403519e-01,1.169430876728010160e+00,4.681729560846861204e-01,2.757521681424852100e-01,-2.210626245693534941e-01,-5.617157857337797822e-01,-1.162666654009445327e-01,5.113752082649436481e-02,1.296854320813940253e+00,-9.483556833109800799e-01,-8.417765956140690897e-02,3.405481212050101014e-01,4.515743541499300240e-01,-1.155646532774085911e+00,1.498251735946228014e-01,-3.539393636477408123e-01,3.113107943467314231e-01,1.229360571586676221e+00,-5.514556240556713895e-01,2.502365786620174282e-01,-7.509942679732423132e-01,-4.685235389032932352e-01,-4.165783783555735420e-01,6.467441211242648258e-01,2.798311168955705863e+00,1.467064040928556246e-03,-2.017647213103286874e-01,-5.114875351106270562e-01,-6.333503269091740329e-01,1.219837791075146782e+00,1.142044782743705245e+00,1.312605499436448664e+00,1.437625859776517467e+00,1.011813417069646892e+00,5.706744910467718146e-01,8.362747404763197501e-02,1.408741873465063354e-01,7.166919850267774450e-01,7.787977891380442053e-01,2.572440382337151998e+00,-1.047841650794238133e-01,3.690192004116046864e-01,5.533946285595314762e-01,4.100754841786192983e+00,1.583114775354583559e+00,4.318215822939848181e-01,-4.787672510804307224e-01,-7.029033274372298301e-01,1.440918322274585828e+00,1.751003136125046100e-01,-4.051883482710051387e-01,-3.036920591761860244e-02,1.343383591538196864e+00,1.181905111441548417e+00,-6.817943952646127181e-01,-6.478440106337739479e-01,5.679020722354590767e-01,6.754437052729427293e-01,2.838253047369770909e-02,-3.758162904478327127e-01,1.626903420189449001e+00,-4.981485005463452964e-01,-2.140508090380628392e-01,2.611987790453703440e+00,-3.708794533754872780e-01,3.812420185803324091e-01,7.866073190884614874e-01,3.897472545772340258e-02,1.360906886519134051e+00,7.309269675469293182e-02,1.768552114637403916e-01,-5.392635295125002282e-01,-6.511614182430369713e-01,-1.954643667883525504e-01,-3.862270979544285554e-02,-2.557277975576558449e-01,1.558024097546642617e+00,2.150866910765391049e-01,-8.686118571670019550e-01,1.051131020941322713e-01,2.135366392821862469e+00,8.729325435423739288e-01,-4.044689526854076678e-01,1.870694605803521871e+00,-2.903167841665733051e-01,1.093940875371573362e+00,6.138217957174820771e-01,-5.189322712348612421e-02,-2.847456540744118803e-01
1.075729343198003729e+00,8.372418798497641701e-01,-4.072102409950293933e-01,1.197577174280757273e-01,-2.899783141273311049e-01,8.483199393095559593e-01,5.866349110577315784e-01,3.487557565524958547e-01,1.366941699132166121e+00,1.927610308496427172e-01,3.717565999946669253e-01,-1.120541209949103556e-01,-4.563229189720817702e-01,2.804768925444515171e-01,-1.503764221389614075e-01,1.723167121130976920e+00,-2.186528125723845861e-01,-8.051314509533189501e-01,2.541962886990926651e-01,1.977989294050782054e-01,-8.202446563627965315e-01,3.028889376428270941e-01,-5.819617511395147602e-01,2.856840912728170201e-01,1.181931605743975489e+00,-5.260789349084706856e-01,-2.069796860316302778e-01,-6.272322798701752689e-01,-3.178560626502255904e-01,-4.645666717753501596e-01,8.259259176496170918e-01,2.282634691383214509e+00,2.661686524805604859e-01,-1.049607987545184973e-01,-7.837201023350260920e-01,-8.802606081415469408e-01,1.731527638188695706e+00,7.061368840782747958e-01,1.036610765150310254e+00,6.572696516919427356e-01,1.261111440916740101e+00,3.507080162441268412e-01,-9.897462087109593076e-03,6.575336222684580179e-01,3.654231228975916013e-01,8.410168582650607849e-01,2.525434440548817605e+00,4.485471959788037699e-01,6.398820266262849055e-01,3.449775373694422553e-01,5.027882032576679094e+00,1.817197014965050483e+00,1.037707876810162411e+00,-4.869646289723534305e-01,-1.730386528455098993e-01,9.645956888922346817e-01,-3.323496024738992194e-01,-5.688842658749052594e-01,-6.129959267717136617e-01,1.306373719452750048e+00,5.869680620391681813e-01,-6.847116601715613760e-01,-6.417049705841305629e-01,-2.796958559470665850e-01,2.602294984935448197e-01,-3.501398120404580760e-01,-3.638006981367049586e-01,1.111565176280366440e+00,-9.516611273417620032e-01,-3.046526084531375744e-04,3.118224990007854913e+00,-1.571586681456562384e-01,-1.255929336246364159e-01,8.896660830631382133e-01,3.926164404531641283e-01,1.128798733978860547e+00,-3.188653109145189735e-02,5.211451877621398054e-02,-4.261087464010622217e-01,-9.239597563051211715e-01,5.574112320187364356e-01,5.785625441017192006e-02,-3.568951724722385643e-01,1.190203537035925851e+00,2.690201403868922592e-01,-8.025249601913839737e-01,-1.024985212500202358e-01,1.653063751299677087e+00,1.113665698948276939e+00,-1.264390651956837530e+00,1.955889044379696129e+00,-3.879711515890879592e-01,1.559067528247263024e+00,5.382486654906156742e-01,-6.410704980276344944e-01,-5.283530115831668317e-01
9.602655544935715382e-01,1.519235519535688139e+00,1.923501145220005148e-01,-8.681991699407541896e-01,-1.007200291467411080e-01,-1.033922327048887868e-01,-5.194346352225145402e-01,1.851198703097010068e-01,1.747441755272793440e+00,3.071944537459559976e-01,1.390659285794801359e-01,3.911571576311018705e-01,-4.683731384755728255e-01,-2.743584118695067964e-02,-2.694448983517463980e-01,1.728244900957911723e+00,-1.858392692877784969e-01,4.034813934661276580e-01,-1.863614665344933141e-01,1.798590369752423035e-01,-8.537105875347350548e-01,4.721493519470956191e-01,-4.529821004427438957e-01,6.200822350998698440e-02,1.592039929590358005e+00,-7.299143295723320435e-02,2.240253055927821091e-01,-5.791655723165959335e-01,-7.553624257037098166e-01,-9.394408002950438430e-01,1.453025807522090040e-01,2.473116932242165777e+00,-5.809536148861590421e-01,-2.556890941507414250e-01,-6.764265622970969671e-01,-4.603949986344385570e-01,1.662004757649355069e+00,1.042830864042183281e+00,1.527832462682159331e+00,1.391948397670166537e+00,6.317451586692330867e-01,3.205297804823657448e-01,3.501645233868322937e-01,7.827484548048867230e-02,5.074263247240804464e-01,7.486404325193632969e-01,3.095262720630696851e+00,-1.077881410361307413e-02,-1.034630648332177244e-01,1.377396105871929510e+00,3.513219444122231749e+00,1.359293636241486469e+00,5.594046325724946200e-01,-2.663875451369664971e-01,-4.948694785031944599e-01,1.504771607668089040e+00,5.003344142171042286e-01,-1.320346789215108840e-01,-9.497105459911999725e-01,1.318816902604505792e+00,3.907442690493850845e-01,4.716727060378315128e-01,1.439131440636897130e-01,1.210558369461554928e+00,1.280519155816183474e+00,3.856945587104685935e-01,-2.796729327836766643e-01,7.478181004569289803e-01,4.904186935481106291e-01,-3.391354409430040739e-01,2.382487187016034014e+00,-6.484028092210758487e-01,1.688043815083223320e-03,-1.342409814602476270e-01,-1.838259937067503458e-01,8.765032698293453439e-01,1.792432546266809479e-01,8.141112493573793296e-01,-1.266950165900544212e+00,9.328697582581291226e-02,6.175578854291150499e-01,2.839420745499954268e-01,-1.668433523725311729e-01,1.406502680131502592e+00,9.926884041684025384e-01,-9.703666219594233588e-01,3.269259534560788882e-01,1.316665481532206750e+00,5.512545879953487660e-01,-2.607302172883973479e-01,2.003932904655284730e+00,-7.277463914791983957e-01,1.181860539273524413e+00,1.441274645604614657e-01,3.101255823110478094e-01,-3.387117167121045380e-02
1.209126143778930018e+00,2.213525524461778637e+00,-4.093058099041674280e-01,-5.089574815286358467e-01,5.471445176587587389e-02,1.946764435842318064e-01,2.991966343168857012e-01,3.357168411629657401e-01,9.466064022597189265e-01,-3.663214224878600378e-01,-4.318649163069965269e-02,1.355174186821673232e-01,-3.823848057181484794e-01,6.447165127133310802e-01,-3.145363751328938973e-01,1.543719069968496171e+00,3.157420419436908765e-01,-8.495599379497640324e-01,-1.206850693953532838e-01,-1.326092821911415420e-01,-4.729356104344655809e-01,-3.997481477123254745e-02,-9.746476071310179456e-01,2.455364010393906726e-01,1.479911220841898301e+00,4.482983228791936336e-01,-2.292119697390311572e-01,-4.722032810926966029e-01,-8.207089280372967810e-01,-9.998800193003187786e-01,4.756293440926552818e-01,1.719094394900332556e+00,-3.051793783575862395e-02,1.288105409875567320e-02,-1.083139685358873727e+00,-7.837452838165976932e-01,2.116447775850978541e+00,4.047484262125319865e-01,1.079964712449060116e+00,-3.160136061608578295e-01,7.147145842006976668e-01,1.854795364496338306e-01,-1.566351441817218082e-01,6.948893715925991144e-01,3.982041170732492086e-01,1.114015687744016159e+00,2.471311465259240947e+00,6.973350203270255454e-01,3.488943308474872773e-01,9.548510582398553881e-01,4.469847656094801280e+00,1.591692588737898539e+00,7.475533187098977184e-01,-2.481750262267336526e-01,5.049836138071421843e-01,6.099656921342380134e-01,-7.828390644427783984e-01,-2.438223829404277676e-01,-1.336130269290513262e+00,2.737156349210698725e-01,-3.121427113812740295e-01,1.228014902133396924e-01,1.815557478240271139e-01,-3.183217431595903868e-01,7.805936673749294119e-01,9.376086904034822145e-02,-4.372743251815048859e-01,1.330952351681067292e-01,-5.675079873144995846e-01,6.639375529457970382e-01,2.475800428139883991e+00,-4.532141112367725211e-01,-7.003889736987125580e-01,3.927846501930162271e-01,2.392157238518411444e-01,7.472010843780600986e-01,-2.235939064356917139e-01,2.998640289160636740e-03,-8.616479346455769850e-01,-5.996692808948151932e-01,1.246059364392581692e+00,-2.760201151869099978e-01,-2.667815797492659735e-01,1.205589801851499887e+00,5.290497011775674441e-01,-7.113139042195673056e-01,3.169084006333771075e-01,2.039409798460916079e-01,9.566048826779072201e-01,-9.202278355740355353e-01,1.324626870728623285e+00,-1.137244857095824901e+00,1.608553271533703199e+00,2.469200250568621136e-01,-8.338819726780630770e-01,-3.269704581234715857e-01
1.087429424418254520e+00,1.003888444855141060e+00,-1.493471814070999604e-01,-4.846028968943949522e-02,-1.730998184104258764e-01,3.679658824158218433e-01,-3.121894555732325771e-01,3.682842119239542744e-01,1.582389749009949664e+00,5.215271160086705216e-01,7.959459144672875741e-01,2.211295252837143510e-01,-4.245060038807408898e-01,3.004929300631822842e-01,-9.246901693054537796e-02,2.280776865765523631e+00,-1.069433740096048524e-02,-1.891473899494307553e-01,2.827061746507830153e-01,3.314437503038807353e-01,-9.287264456429269455e-01,3.971109441588274169e-01,-3.908811721608425604e-01,2.884801265560231198e-01,1.023226756309685737e+00,-1.023585521183072888e+00,1.203802237642830342e-01,-5.403587575431940682e-01,5.958355495716056716e-01,-5.562435480634064788e-02,6.043914853248921748e-01,2.225057772865451700e+00,-5.241031435813481298e-02,-6.095942575604056390e-01,-5.711644693814946772e-01,-9.398990895076801966e-01,1.184532251260296931e+00,1.277475254710032537e+00,9.370266537336628954e-01,1.536912132598352132e+00,1.122001013934736502e+00,8.159486728905535058e-02,2.460434267127537544e-01,5.565030607573266952e-01,1.761060507869927072e-01,7.026870594790172175e-01,3.073668903232773530e+00,-5.195784812734156877e-02,2.580193666896212767e-01,1.446331922178572205e+00,4.389043338533605620e+00,9.440325049336322216e-01,9.509727110149893692e-01,-6.863959227944667063e-01,-6.921348322645892726e-01,1.298223076849567947e+00,4.118153245779882510e-01,-2.904833025417762338e-01,-5.162624175797508874e-01,1.143677973212051224e+00,1.436856119943874965e+00,-2.403973598702273118e-01,-6.831899784817665466e-01,7.894998562309645251e-01,1.122964002195905309e-01,-7.107929552040139765e-01,-3.023251586897453547e-01,1.020702925741416189e+00,-3.843056634158925622e-01,-5.699402735528134034e-01,3.407952747389842774e+00,-4.749156683175486116e-01,1.423787609720083003e-01,1.061997507065042701e+00,-7.498646915895192111e-02,1.769797948227584961e+00,5.548405604958579485e-01,9.490581328333991262e-01,-9.425021560056734415e-02,-4.624431024730537576e-01,2.176417253299134380e-01,3.740793982466570911e-01,4.688341932399975320e-02,7.479447936250775975e-01,6.059365422126820055e-01,-5.559261436582714211e-01,-2.465144342341296646e-03,2.301104145060595130e+00,5.508706252409503179e-01,-2.931948841985885790e-01,2.342444456150804655e+00,-5.061633267966593186e-01,1.337601028726352670e+00,2.561058858888967116e-01,7.743765669433064769e-01,-1.693741355312328167e-02
6.861249466760206417e-01,7.081749721560359756e-01,-3.447208349133742411e-01,-6.395916451767108546e-01,7.513762195630414864e-02,1.460928299141544540e-01,4.288378189498401327e-01,-2.281409133791602595e-01,-5.086174876809221868e-01,3.967366086717163953e-01,1.571799813799141132e+00,2.422981059445941110e-01,-1.881560385976580596e-01,3.488875646296050737e-01,-7.346741189967861407e-01,2.226589707129223328e+00,1.946165283848368399e-01,-2.900683221695922742e-01,8.799751713927123076e-02,-1.622248855723270322e-01,-2.441220812645172877e-01,4.435062333011622338e-01,-4.976476241347917995e-01,3.516808965763277284e-01,1.662189104531391681e+00,-3.952369153352515707e-01,3.800100850170327615e-01,-5.444935281236523705e-01,-2.882406584495696977e-01,-1.031944804871735677e+00,1.672356189444388352e-01,1.966680716668856022e+00,-2.539187653626983066e-01,5.857064713548923440e-02,-5.757353372659850255e-01,-9.464989050402141668e-01,9.884597276230159268e-01,1.193720609783755604e+00,2.376314250001850592e+00,1.345172015141882227e+00,3.154021054316042960e-01,-4.780087517485154258e-02,-1.886958021591112478e-01,4.603280792183116199e-02,-8.909982709829589176e-02,7.916031817679629601e-01,2.208856000954074084e+00,-4.432171256671079695e-01,-1.032180470450946991e-01,1.189235348122286151e+00,3.832956537777935768e+00,1.388764594781782158e+00,1.631393171202407399e-01,-7.394709778881013440e-01,-7.452597122263298068e-01,1.793466926113020499e+00,1.067774864202971852e+00,3.947200952483426173e-01,-8.628070291527627500e-01,1.719822677195629090e+00,7.674818543959706085e-01,-4.691591693240048100e-01,-9.756931500060007922e-02,1.074424599025568972e+00,5.529451801132139188e-01,-4.436354708227270294e-01,-1.078546394231351568e+00,-4.054483267663211432e-02,1.690636294011031437e-01,8.582764932328144081e-01,2.343376654495652467e+00,-2.017688355649496501e-01,3.034055770856501355e-01,7.481812282829264360e-01,-5.462170077334967955e-01,1.470672672855373841e+00,-4.989736222983867098e-01,1.431655531913319290e+00,-4.926783480025613837e-01,-4.619148051961289303e-01,7.854580691168220330e-01,4.670817931881681151e-01,9.410143814776683602e-02,1.340583462699283190e+00,1.328823531144127656e+00,-1.191863236610998911e+00,3.996530881607098240e-01,9.261100183743247172e-01,3.494764738149049310e-01,5.125761525004335351e-01,1.458340877611845832e+00,-3.447306505717321334e-01,1.493892316787850394e-01,-6.268634174576442897e-02,1.840667549089139987e+00,-2.644652986079881751e-01
1.051121628586510592e+00,6.528287413145570373e-01,-2.233334946123257114e-01,-2.667062324654460026e-01,-6.209206060648805314e-01,5.516853695911519972e-01,-6.244949491927944685e-01,6.485099633957903675e-01,2.486767841605794338e+00,8.940385792051259717e-01,9.751227778029316617e-01,4.570002350806979807e-01,-4.179492220323240970e-01,-1.449648069749253088e-01,-3.440293685867799045e-01,2.645679493390436399e+00,1.528675427573683576e-02,2.490224607697770209e-01,8.606823404944896616e-02,3.390133790058035834e-01,-9.312105034592121910e-01,1.172434608519920651e+00,-8.341339942981429445e-02,3.533035502071082967e-02,1.259517522898074393e+00,-1.339448470270736102e+00,3.631286060101765467e-02,-6.006302480150628176e-01,2.339190768041889967e-01,-3.478323278381505457e-01,4.803443371505590198e-01,2.655462403849328190e+00,-2.841229281362989134e-01,-4.853699557607382142e-01,-4.627482323044163071e-01,-7.660008427233112593e-01,1.446301651513100639e+00,1.283257651871609673e+00,1.408602105639320312e+00,2.360531952595957605e+00,1.308356013478183311e+00,1.683090688773467569e-01,5.977331677227726292e-01,3.386697238320703907e-01,2.014193490632915085e-02,3.867398748167769074e-01,3.404050828672594342e+00,-1.075220087233978161e-01,1.778499742453200083e-01,1.056480771064231883e+00,4.519422668037153201e+00,1.470341806040500243e+00,1.347910490245284088e+00,-6.160402007278102943e-01,-1.114539795796735788e+00,1.785733754143694174e+00,1.135199429453781050e+00,-4.335024786607174496e-01,-7.156517925721762596e-01,2.621982291781915997e+00,1.155427837528868684e+00,-1.208998089833201173e-01,-6.749598420673832422e-01,1.211981804972686927e+00,4.080277300844527000e-01,-5.275745813261968342e-01,-2.015960073189790869e-01,1.231301808722736313e+00,1.713618033584928257e-01,-1.156402878765647069e+00,3.582700565988806041e+00,-2.649758985830961144e-01,3.676037784667878783e-01,3.940208697336814447e-01,4.543604097713691004e-03,1.291983356510522984e+00,5.074004474076589943e-01,1.362743134694857750e+00,-7.025546978056349534e-01,-1.648726842922399183e-01,4.608476557611063118e-01,1.022628831083983725e+00,-1.723256059148454700e-01,9.263171264335565702e-01,1.113601650517802355e+00,-1.025569332085102925e+00,-2.487261353241063122e-01,2.729452635509760583e+00,6.148715904373819319e-01,-8.886817659726642393e-01,3.002170073721373011e+00,2.365305888198238060e-02,1.306591975486972812e+00,1.911338914054739324e-01,8.692372670428845094e-01,-2.427701632531917841e-01
1.124999946756384039e+00,1.174545253709303516e+00,1.794784124855643981e-01,-8.172344220649396807e-02,-1.945289125579279799e-01,4.287110336297598190e-01,-1.837638017347627550e-01,3.464035029475239780e-01,2.367648692916920261e+00,2.716863950944884976e-01,-3.020438120592810471e-01,3.970473311318001297e-04,-6.264346949743115900e-01,4.321934492469718669e-02,2.195292519523651675e-01,1.435080808643736772e+00,-5.903520135516452383e-01,-7.586827866729241310e-02,1.787733930186674591e-01,4.975376719720672747e-01,-1.278459391475617490e+00,1.518716682132355000e-01,-4.803629703987208344e-01,1.897919735459180357e-01,1.073551235012646821e+00,-4.566134607298883430e-01,-8.939855073244018513e-03,-6.450756435529223509e-01,-2.555645674814719381e-01,-2.243485524248205465e-01,6.954185536685478786e-01,2.614166856873750611e+00,-6.308307098110571554e-02,-4.864788460825207328e-01,-6.978629304987150617e-01,-5.931588072983724480e-01,1.685694329133086145e+00,9.583938096890404212e-01,5.766630130174168478e-01,1.072449414110853372e+00,1.249621890043756123e+00,5.089993937762128384e-01,3.195744955332279202e-01,5.036806867085819039e-01,7.599004018570293395e-01,8.135023593719397095e-01,3.120571193860062209e+00,3.328139161865448781e-01,4.298043353806194067e-01,9.576739862667053016e-01,4.300881495549025324e+00,1.336319988889419719e+00,9.305331724207522859e-01,-3.130563936607818620e-01,-3.072999206154405916e-01,9.945053814662826452e-01,-3.444529030993866980e-01,-6.616442413013640111e-01,-4.057629907150152593e-01,7.750554922393394497e-01,9.077634462617283351e-01,-5.618669145872295934e-02,-5.177560310982376457e-01,3.569181886218658617e-01,6.873976302016731044e-01,6.547696762985766306e-02,4.596432484799928275e-02,1.608562993876744951e+00,-5.346354473583962985e-01,-7.626831784654355406e-01,3.016982953320068717e+00,-6.089679958163625173e-01,-7.139192382000057735e-02,5.638152317175800787e-01,2.878155379721050178e-01,1.189468364507941356e+00,5.525107173012928641e-01,-3.452310219343224240e-03,-6.563346335519665287e-01,-4.380534624948438371e-01,7.171419219857277927e-02,-8.746407588588717141e-02,-2.834573561516026685e-01,1.172991739829507996e+00,1.027892610462811662e-01,-5.441578109970981458e-01,1.591922772344128711e-02,2.128507561000980708e+00,9.357739254923003180e-01,-9.375611860371391160e-01,2.206421180458426612e+00,-7.004924312350790938e-01,1.867281880487640322e+00,5.838167420969736510e-01,-7.852088521452609271e-01,-1.132663585345515256e-01
1.045871961953297236e+00,2.105155986480804486e+00,3.014193660618329218e-02,-9.027531305843344844e-01,1.838197783484753489e-01,-3.360389321733175394e-01,-4.388371332205708852e-01,1.251347726724350573e-01,9.831862620770771555e-01,-2.823237432871023023e-03,2.648052695738202789e-01,4.169544137340028822e-01,-3.763158392537993557e-01,4.171889368042607793e-01,-3.219400597126709229e-01,1.796407085235089962e+00,2.199465023231135796e-01,2.298020031698000398e-02,-1.809207730435886674e-01,-8.033353539228689499e-03,-5.976604470634400146e-01,1.014327403957601126e-01,-7.214207643584626961e-01,1.962543101607329143e-01,1.549584435790370307e+00,2.038516138742449690e-01,2.186860415569082949e-01,-4.620450888107920928e-01,-4.876217937444222716e-01,-9.257754999256515571e-01,1.122804919647210631e-01,1.924743993327045821e+00,-5.012288709652171770e-01,-2.828401952342230463e-01,-8.205868933412525656e-01,-6.518436619120745457e-01,1.590275362204640830e+00,9.662836620872965465e-01,1.392691061210633574e+00,7.233540030124163689e-01,3.922511084108517565e-01,8.504484729565348067e-02,9.661159972795312079e-02,2.836956225647406238e-01,3.730366415601023000e-01,9.556007979806666608e-01,2.879556735703402204e+00,6.778906053419130051e-02,-1.451698646962475969e-01,1.803542988403063152e+00,3.478169537668700517e+00,9.996950936824652301e-01,3.847673068869263968e-01,-3.377446064918099844e-01,-1.250196942027840818e-01,1.186221573958869069e+00,1.582290676293526821e-01,1.042347438517008673e-01,-1.177778593439842814e+00,4.446850940364326377e-01,3.107075899631485116e-01,5.669687729036071433e-01,3.242853726397078029e-01,9.668164567478640947e-01,1.062262625263038274e+00,1.525158908620510012e-01,-4.542315725558225825e-01,1.277175241272532347e-01,2.941427740777064481e-01,2.372155782513543087e-01,2.295296031736778541e+00,-7.465481839940086850e-01,-2.837139680603955605e-01,1.984336221055979232e-01,-3.046623882839281094e-01,1.109732763938818589e+00,1.081374514082761862e-01,8.368449327845373098e-01,-9.313925299342281638e-01,-2.124968155732187558e-02,8.602641805137847264e-01,2.340324024917314616e-02,3.010401214604696563e-02,1.166353523845175211e+00,9.714548957070774371e-01,-7.284086394097046835e-01,5.222666783280239811e-01,6.638148656184966745e-01,4.184962702817011104e-01,1.498828962434495815e-01,1.551325341267747460e+00,-1.138002745310298769e+00,1.124475892636063623e+00,-4.516297688672288313e-03,5.392186625140518164e-01,1.022094607918725973e-01
1.147943867782981631e+00,1.160334985410498954e+00,-3.183589637619684831e-01,-2.593871751127109215e-01,-4.299827295845126129e-01,4.476519078098130655e-01,-4.647912314655215371e-01,6.312941636588839112e-01,2.115093637339481969e+00,5.608755043667280615e-01,7.709813757537169465e-01,3.988687189064205607e-01,-3.973891788112652312e-01,1.548389124507043579e-01,-3.089747370971336893e-01,2.475891060837695612e+00,2.022641664075479073e-01,-1.048195915492308172e-01,6.846973683186649562e-02,2.230473541637140178e-01,-8.079610835049695350e-01,8.251722239514156509e-01,-3.347891657734828330e-01,1.152383080787745540e-01,1.230881923545955825e+00,-9.713256872829203470e-01,-5.221538708209949586e-02,-5.366380130311571017e-01,2.003675445825525703e-01,-3.844333128713119940e-01,5.167296303854547190e-01,2.310124660508855232e+00,-1.771352456282090371e-01,-4.478570564308873014e-01,-6.324442792438966787e-01,-8.419625590149030225e-01,1.576998362516502272e+00,1.085762904958158748e+00,1.179525710725487953e+00,1.632287838479637321e+00,1.198142907168201932e+00,1.014279474853908014e-01,4.018066478185186030e-01,5.309192725639806376e-01,5.777719654273061334e-02,5.847083749632171479e-01,3.218058909385881350e+00,1.180116642663680548e-01,2.415703078091585576e-01,1.173395685782012254e+00,4.585987492793711873e+00,1.356213806713399084e+00,1.262087677615856940e+00,-5.694031450025948127e-01,-6.723514143997779691e-01,1.406937226953537623e+00,5.928368434585731261e-01,-3.856076682374278697e-01,-8.868639025712763413e-01,1.858667528411571457e+00,8.957277412234745384e-01,-4.415658796508389883e-02,-5.136316348910658913e-01,7.843298144184354115e-01,3.492673627174500695e-01,-5.262636309361411469e-01,-2.425677771248915260e-01,9.026483847264608062e-01,-1.037513854823381432e-01,-7.321002721132907620e-01,3.452793320165851831e+00,-3.402565357236848054e-01,5.050165847594380308e-02,5.414922657667210482e-01,6.291801461535949380e-02,1.285774656572326924e+00,4.236310366919821546e-01,1.064763384204491903e+00,-5.795559126240767966e-01,-3.040243641441138789e-01,6.585829366038721266e-01,6.886677293261092014e-01,-1.358991446978417006e-01,8.442271417073460293e-01,9.327765681883427584e-01,-8.366239276521478807e-01,-1.228182811043471712e-01,2.148201090539991753e+00,6.657600968582484402e-01,-8.606660600788382798e-01,2.613586049236209963e+00,-3.341112524118248772e-01,1.452771381264040818e+00,1.825189796021179089e-01,5.141787397562078699e-01,-2.090151491694347552e-01
7.953712279392157747e-01,9.571598280318265317e-01,2.044768055564694098e-01,-5.768473338773358883e-01,1.474514981122730384e-01,-9.191375595304368540e-02,-1.982522334144756759e-01,-1.747272015135386547e-01,6.318214748576215234e-01,4.415604182899456331e-01,7.763049386723291923e-01,2.237498383231288634e-01,-3.998870070742878702e-01,1.665575704689150061e-01,-2.206147386531260024e-01,1.854519444197075373e+00,-2.730403201848733419e-01,2.310545552831897442e-01,1.330031912707560215e-01,2.201375693437707115e-01,-8.115822641457610676e-01,1.758641471876506435e-01,-4.245380800611575078e-01,3.061463201209106977e-01,1.386147547450684803e+00,-4.359223487539357622e-01,4.881384165552613563e-01,-5.771585429842591708e-01,-5.742480910334202271e-02,-5.679687812291088767e-01,2.224767836874339544e-01,2.303895994517762613e+00,-3.953734233135507425e-01,-3.837917956877792691e-01,-5.108952808907094578e-01,-7.221512922431989612e-01,9.587058173655774729e-01,1.398077088501360254e+00,1.609673892067411183e+00,1.597021894665522801e+00,4.990384669442790022e-01,1.562434212449500537e-01,1.066280542108204304e-01,5.194398602027243406e-02,3.679590048291162541e-01,7.975175377536394272e-01,2.780661196533148249e+00,-4.292711998821513442e-01,-1.288726461276820667e-01,1.656240692885214916e+00,3.398057772836570400e+00,9.068168797757443222e-01,1.799438902175887756e-01,-5.875024896007308151e-01,-7.868827225074728204e-01,1.632707876250206080e+00,7.521341180519378611e-01,1.383410751607479505e-01,-5.018809911561321613e-01,9.858727737652999146e-01,1.230735063614616820e+00,-2.983576347392064010e-02,-1.844995076657362232e-01,1.384442530179272435e+00,7.604868203562992202e-01,-1.567138680782929616e-01,-5.823036220766041327e-01,6.896098361878111316e-01,2.204777497908901041e-01,1.269295666510250609e-02,2.451899113496060156e+00,-6.275715372018610960e-01,3.108198151640474416e-01,6.748597366672434150e-01,-4.916975650334602377e-01,1.634915658943042249e+00,1.818289879043696877e-01,1.102932339826689478e+00,-5.026393068231521655e-01,-1.754418948011394197e-01,1.578609510953005168e-01,1.909599002626604092e-01,1.321325350868806092e-01,1.235564465706346482e+00,8.734192995904919155e-01,-7.913811289283096961e-01,4.189769828596753287e-01,1.612310820252830013e+00,3.033531340521939956e-01,6.103260923421742756e-01,1.744899072408965246e+00,-6.589041762851838291e-01,6.775349072152073715e-01,1.197227046987426879e-01,1.335075881852166413e+00,1.124531446547994973e-01
1.169284763479009781e+00,2.332516215542635329e+00,4.753254525933998942e-02,-7.739276518859522502e-01,1.138687309534657938e-01,-1.561439084847870418e-01,-2.692161506550853622e-01,2.622388854504594802e-01,1.546465581250632049e+00,-2.352921182171915093e-01,-4.059121440791942370e-01,2.587425684019248884e-01,-4.847437358187709489e-01,3.877116457712805886e-01,-1.341364236668272092e-01,1.369746241110152418e+00,2.405777733063552137e-02,-1.840111786225466783e-01,-2.156507045659508681e-01,5.634414089587056612e-02,-7.596470821935836781e-01,-4.931502643159724197e-02,-8.443956568874115831e-01,1.518387820579329417e-01,1.502306148902899707e+00,5.027100495673946234e-01,-1.297948939964421733e-02,-4.993292211179455875e-01,-8.922565619951443594e-01,-9.526748778174510823e-01,2.881844409403586660e-01,2.026084598078454757e+00,-3.611708889521134669e-01,-2.036528295644524644e-01,-9.742219804050207266e-01,-5.357954576714565320e-01,2.026332472499404069e+00,6.430172258738198199e-01,9.921387386403142106e-01,1.798522635095201050e-01,6.105779020981700889e-01,3.014176420100185272e-01,9.945753055325363967e-02,4.482278225052634957e-01,6.525359309465088575e-01,1.050488494706460552e+00,2.878705673460335568e+00,4.907397839642245185e-01,1.027826345053712426e-01,1.390595818694013275e+00,3.787410126478870875e+00,1.300846395009866541e+00,5.776641065812277986e-01,-1.279151691398379420e-01,2.764095508540247437e-01,8.088817169335114077e-01,-5.415723832781053071e-01,-2.237264683481661187e-01,-1.199982254344138966e+00,1.450355037658779267e-01,-1.030710177133188077e-01,5.913363835404208402e-01,3.379005389297962125e-01,3.553700573083503067e-01,1.207449975888796656e+00,4.636411447056708046e-01,-2.138676121435949540e-01,4.366216297193699636e-01,-6.170087503563313064e-02,1.516745568428568003e-01,2.275647749217339477e+00,-7.553149747003646830e-01,-5.580489181305148261e-01,3.142958904879980531e-02,6.704761043785227581e-02,7.442060085042756512e-01,1.106884857643530840e-01,1.281891844167196703e-01,-1.148246152343597171e+00,-1.619078223390336413e-01,9.130195952951437599e-01,-2.769493383498686789e-01,-2.086273240135634588e-01,1.293013100302228269e+00,5.716145573512717570e-01,-6.524098371634022842e-01,4.386812664910274551e-01,5.185915728796657298e-01,7.648833790923528220e-01,-5.501756638067228922e-01,1.504218163067285285e+00,-1.273452055200775757e+00,1.642172486478852278e+00,2.265747405242856394e-01,-6.842141524678304609e-01,-3.860005782211556324e-02
1.162856296685053969e+00,8.481959299401095054e-01,-6.282019708313371087e-01,1.887348601173642892e-01,-4.732555125446551436e-01,9.916320447490427625e-01,4.675527679791335878e-01,5.942099839878602907e-01,1.664666821378424810e+00,2.954082854930724089e-01,6.076368562712881616e-01,1.205341543937241133e-03,-4.112770608038999742e-01,3.031010193524684149e-01,-2.634907380574231794e-01,2.092453040024650601e+00,4.239390355658806397e-02,-8.940767540438615546e-01,2.376467232506196403e-01,1.573552462542000263e-01,-7.384649841619059796e-01,5.857205082126122342e-01,-5.226395047181099374e-01,2.345634167757262301e-01,1.153291438729369345e+00,-7.973070402561452941e-01,-3.368255999644613752e-01,-5.970659785577331347e-01,-1.110691191022847857e-01,-4.134818210310586828e-01,8.741048007930606323e-01,2.226608125264303517e+00,3.088494935664509167e-01,-1.320514347095368413e-01,-7.881874590858813923e-01,-9.713628429790208685e-01,1.824774257177850467e+00,6.790544192082861308e-01,1.034372470378612352e+00,8.055951552054296805e-01,1.431890866638386939e+00,2.516008231712342225e-01,7.707268381770472632e-02,7.840926571780018062e-01,1.468365552631974436e-01,7.406062773249002529e-01,2.653540050635376346e+00,5.202518962943064595e-01,6.975423754746105098e-01,2.853599211657797396e-01,5.378561503319464698e+00,1.902225610720507554e+00,1.363990860198817989e+00,-5.505507267642434366e-01,-2.408447762660523017e-01,9.966441988683447661e-01,-1.731926854647006797e-01,-6.414581522084044085e-01,-7.687717344694627863e-01,1.722872331067388352e+00,5.643972128437150237e-01,-7.110956118893299038e-01,-7.531274997257646486e-01,-3.300317780032274717e-01,5.776595492007730037e-02,-5.917831453107991191e-01,-3.395254979502851378e-01,1.046593057799546589e+00,-9.651493085761452262e-01,-1.913398420059937433e-01,3.475017749560094238e+00,-3.527142775202812830e-02,-1.450230596986480935e-01,8.987552322948995087e-01,4.749978604269019522e-01,1.108163623432523615e+00,2.180834833662792516e-02,2.667184890119348450e-01,-3.841411534925744942e-01,-9.411337423598097329e-01,7.576624631541533095e-01,3.335724146293564951e-01,-3.791999958212215471e-01,1.011533976390872391e+00,4.321017492867631482e-01,-8.547782096914453565e-01,-2.677044748899519155e-01,1.840228384839700748e+00,1.138711005486377381e+00,-1.578506996797819140e+00,2.258859249194606900e+00,-2.272775573948518368e-01,1.657931885721268817e+00,4.789712856992441870e-01,-5.423701950597510368e-01,-6.150785927678008580e-01
1.100660353434663286e+00,5.658581823534823974e-01,-4.300286986268110345e-01,1.889916267921581960e-01,-5.711621829458645161e-01,1.085808761519975851e+00,4.869205877190430076e-01,5.516359939200403684e-01,2.099133606148319231e+00,3.849071863697601792e-01,2.975482376263548501e-01,-8.418614279753727780e-02,-5.048555219457914189e-01,2.779878156147906620e-02,-1.506569962086307113e-01,1.813374479608217626e+00,-3.375164089672930134e-01,-6.609081309670645776e-01,2.266697821213128905e-01,2.942681589104758633e-01,-9.522214187159070420e-01,6.530110593366436067e-01,-4.164084744722953979e-01,1.660176887727410067e-01,1.187228742010759230e+00,-7.743937924765555980e-01,-3.196825974423760375e-01,-6.834449599502917527e-01,-4.406826755116596273e-01,-4.566718137920935394e-01,8.970453670040229310e-01,2.587708608538897170e+00,2.594782251206464996e-01,-9.128142168592540129e-02,-7.332652324513757591e-01,-7.931074638308509561e-01,1.914841648912131378e+00,6.738890821990923818e-01,1.040280642037363590e+00,1.028664472170828015e+00,1.531584961439234505e+00,4.711061697237468593e-01,1.927208617012583503e-01,6.373264044352235924e-01,3.736863989661968199e-01,6.815070261059077428e-01,2.733020025249991658e+00,5.237114921390610967e-01,7.351986959214890094e-01,-7.967670955463246329e-04,5.290168756086966795e+00,2.126846347416412542e+00,1.359480934424673215e+00,-4.367928437020385246e-01,-3.482454515317819910e-01,1.098390883430779619e+00,-1.713173551769344716e-01,-8.057309426778967998e-01,-5.840487805833836088e-01,1.990402262189548077e+00,5.314477371679222628e-01,-7.301852162909908683e-01,-7.937221901769593302e-01,-2.686532425635370647e-01,3.139986892721627898e-01,-2.818789947411682872e-01,-1.996141948311467296e-01,1.484872756600677191e+00,-8.947589933221024028e-01,-4.646521903663335396e-01,3.359858845235759173e+00,-3.957679934176461245e-02,-2.716821531987313743e-02,6.527012865028603006e-01,5.757556741798857125e-01,9.040793938988824774e-01,4.375936660831775127e-02,3.350725487644079514e-02,-6.525698159083282990e-01,-8.797368728579493258e-01,5.477673032175147672e-01,3.111860742922754608e-01,-5.281881792498559491e-01,1.253040202629165378e+00,3.079095271052360028e-01,-9.594702819306466512e-01,-3.205953629249133630e-01,2.100410429524416589e+00,1.265303577019889936e+00,-1.808674174279266245e+00,2.383210141334022314e+00,-9.220742625107819501e-02,1.748246304765029624e+00,6.288989865920564526e-01,-9.471514680282944187e-01,-6.775135543612851308e-01
1.053637949086596359e+00,1.237718024214776280e+00,-8.823457787096163074e-02,-1.667330058069602661e-01,1.901371136828382269e-02,2.228732124723032948e-01,-1.135177980600841074e-01,1.897980234116317666e-01,1.128851134559483160e+00,2.866324691219543919e-01,5.875079092833224159e-01,1.419310664878881134e-01,-4.239377794198281868e-01,4.079990301720348711e-01,-8.119456255323470595e-02,1.969043969674385330e+00,-5.334141592334623594e-02,-2.982745953895493130e-01,2.373432700617147395e-01,2.486893356435669333e-01,-8.547817449801001777e-01,1.092772459215378689e-01,-5.519310625510258639e-01,3.387576968526841981e-01,1.110909140425052843e+00,-6.037935259250372111e-01,1.550725938238540769e-01,-5.312549090095832760e-01,3.010499420029137951e-01,-2.364868351590727613e-01,5.453695493242569636e-01,2.094023732682964489e+00,-6.130717214020825478e-02,-4.924560423108179097e-01,-6.610879819076195263e-01,-8.985238479710440096e-01,1.236385646476309663e+00,1.159209882239112810e+00,9.758867307060745677e-01,1.080716653457111986e+00,9.072260239516621860e-01,1.138911785371701790e-01,8.292243044585788370e-02,5.209812565904369253e-01,3.065776751517391707e-01,8.547011986967105734e-01,2.850080588137389626e+00,9.738119638778533482e-03,2.241944047119880379e-01,1.467491847388596060e+00,4.179325484364347254e+00,9.398962970934406913e-01,6.795477217746308529e-01,-6.043614707707458678e-01,-4.309128712223148083e-01,1.146516336556209659e+00,1.144624311421560958e-01,-1.856637728803749443e-01,-5.764112865638684191e-01,6.548180629911617423e-01,1.184608652686311991e+00,-1.777114278462486041e-01,-4.604185426694492600e-01,6.284271265422578523e-01,2.935172755749159146e-01,-4.929933771801786602e-01,-3.873702936505917238e-01,8.126665870595295438e-01,-4.275025718910474004e-01,-1.511414688809193940e-01,3.028251905726643045e+00,-5.483591231708699887e-01,-4.481041464979712563e-04,1.019159423791658581e+00,-1.112075945920748821e-01,1.675445097163846819e+00,3.727929795818480385e-01,7.050837185410604446e-01,-1.737383924909405852e-01,-4.975246907943321473e-01,2.904748368371322664e-01,8.050007861664060238e-02,4.949467225780612711e-02,8.947648736665504421e-01,5.100577460170919730e-01,-5.247904312212597899e-01,1.794640275547546016e-01,1.764299352908467622e+00,5.676616236544345107e-01,-1.066845385978444916e-01,1.924167448627040589e+00,-7.448634789432179160e-01,1.272063775402274777e+00,2.604740053273858491e-01,5.606189292081291686e-01,3.541710648567730768e-03
9.770014776300111059e-01,1.613962160641682964e+00,4.325599388829397540e-01,-8.785367585661641998e-01,-9.089934584472819656e-02,-8.238479614352489655e-02,-4.442650309006994092e-01,1.456872584522105885e-01,2.223020983452211219e+00,1.515764114284030573e-01,-5.681535632423579951e-01,2.391159006465865822e-01,-6.029733816358564535e-01,-1.886609387786110648e-01,-4.528126350761385588e-02,1.168240366119495111e+00,-5.849340790709158799e-01,4.923739607249412176e-01,-2.359598903571411832e-01,3.027420415481276161e-01,-1.097939575267020018e+00,2.797880681582933238e-01,-5.087434313353426107e-01,1.114239834332089729e-02,1.605755300390834694e+00,2.815001623565051014e-01,1.648191991024441638e-01,-6.474916274548067063e-01,-1.262743287428197192e+00,-1.014524816591987788e+00,2.051016161702236273e-01,2.725829152149771950e+00,-5.879028050214737400e-01,-1.998201999042673038e-01,-7.466730547556520436e-01,-2.399677885628240803e-01,1.941689712770165777e+00,8.664348082095157944e-01,1.274394857482825660e+00,1.109648531671157068e+00,7.041682820011866406e-01,5.950588817897353167e-01,3.930658223724197708e-01,3.789918523539607953e-02,8.977443288463131665e-01,8.261499409165805607e-01,3.127443159869518485e+00,2.105744402719491593e-01,-8.853256917514540358e-04,1.104619358380480421e+00,3.417087373082511981e+00,1.562736405680349439e+00,5.140848013323457977e-01,-3.580461778881766088e-02,-2.625559951717474916e-01,1.310673247183213652e+00,1.426926851123150319e-02,-3.598613005282654820e-01,-8.399602762541343859e-01,1.020910471949131093e+00,1.122478595152721637e-01,5.860227481468825994e-01,2.372658585573703682e-01,9.607395866577563837e-01,1.639028587355541910e+00,8.747572912776639953e-01,-5.526055394404005838e-02,1.145717310516353837e+00,3.875646044851638328e-01,-4.681765580850902886e-01,2.125015836954449622e+00,-7.553243565521017278e-01,-1.191245297931545627e-01,-4.168723562163897389e-01,2.889466808267472653e-02,5.511326897077073461e-01,2.019627569055724714e-01,2.035892854050863621e-01,-1.590727777675503107e+00,1.098153742317600212e-01,4.721325199002319728e-01,-3.566806169131037096e-02,-3.589506353655347870e-01,1.671240669730735151e+00,6.452505329481291740e-01,-9.365574703630079600e-01,3.521670585601988646e-01,1.236402877988422189e+00,7.793168332205047122e-01,-6.083204660202364833e-01,1.902428955768396435e+00,-8.687606529755214080e-01,1.509417174948988194e+00,3.589302963553442916e-01,-6.519686795594785700e-01,-6.850041762905556553e-02
1.051481571834308681e+00,7.350306377238995381e-01,7.918759374491106395e-02,-1.932159965468005502e-02,-3.263549704019807485e-01,5.426695115984994100e-01,-2.400631333051444494e-01,3.715187030220425957e-01,2.289053509828263167e+00,5.630496108939275768e-01,2.326248280144494474e-01,8.057008950218945420e-02,-5.656660355935831941e-01,-4.492833176640777249e-02,8.302118824664983521e-02,1.834155989807734199e+00,-5.099773300999821402e-01,2.822570378321384577e-02,2.488747480836588366e-01,5.064472155678271248e-01,-1.222465884340357523e+00,4.588135541665031569e-01,-2.967164396943703375e-01,1.847012934515208371e-01,1.062096346847143380e+00,-9.075225954910051129e-01,6.204133351539088681e-02,-6.548360613588828372e-01,6.005610897763213885e-02,-1.348381444191741885e-01,6.802591319986316387e-01,2.690629561745961240e+00,-7.410865625685073010e-02,-5.252635117301434065e-01,-5.539166616459900716e-01,-6.892924056193152627e-01,1.441540569232757196e+00,1.164306032389707646e+00,8.443336549948226022e-01,1.648263755721836699e+00,1.310455994542433444e+00,4.083621359369431492e-01,3.913258839364525121e-01,4.283253367653183652e-01,5.202606669511533610e-01,6.530161051276837103e-01,3.171223122871410283e+00,8.592678808221726472e-02,3.771740215433706522e-01,9.606086367677649784e-01,4.391368300591281582e+00,1.329017762376483391e+00,1.020140260642725227e+00,-4.839073089815825179e-01,-7.021525428220556364e-01,1.316072800441341339e+00,2.197743012964379350e-01,-5.884010929825477243e-01,-3.220526828612338965e-01,1.422217160266883162e+00,1.244928281717671670e+00,-2.523265541546532709e-01,-7.208509962891622713e-01,6.782012545480644583e-01,4.708607072716413100e-01,-2.418606480654200697e-01,-6.444532912143130510e-02,1.627618627859426015e+00,-3.929541310215615701e-01,-9.256896540956547348e-01,3.267935133869392050e+00,-4.708210848079122379e-01,1.988632878172749696e-01,6.929576333192036808e-01,1.633984364175196102e-01,1.391349063121043672e+00,5.696077475705072501e-01,4.684407847570234984e-01,-5.038050002534054661e-01,-4.261417733283480724e-01,8.573670591452975387e-03,2.780825943269759626e-01,-2.126125055987101720e-01,1.080480478464266092e+00,3.587457177175294998e-01,-6.771743394136325866e-01,-9.853364531190911269e-02,2.560056221280831767e+00,8.123247241533524399e-01,-8.086269192443562570e-01,2.491082452707102934e+00,-3.704690350543491939e-01,1.600834910011958545e+00,4.997244409304499868e-01,-8.229947739088805392e-02,-1.476246455088061071e-01
1.239963924669616802e+00,1.992601413779370834e+00,-3.864405216208712801e-01,-2.924907196124572062e-01,7.359048597485799703e-02,7.411673467571938678e-02,-2.556437952872642749e-01,4.184064377949167080e-01,9.941964991856162559e-01,3.093636313171299612e-02,6.634441725038457971e-01,3.215726906320355294e-01,-3.257529006632713386e-01,7.573236158947099783e-01,-2.453293297716908350e-01,2.254506464335952476e+00,5.436730625182109033e-01,-6.166670269350437161e-01,1.024624008183853408e-01,2.204016607021656166e-02,-5.615751198582035197e-01,8.168809695892531586e-02,-7.635161958392160386e-01,3.353378502065281763e-01,1.148414095677349644e+00,-3.934000079038207920e-01,-1.553886475876725681e-02,-4.010924134524074258e-01,4.241556982778345031e-01,-3.502819288798166841e-01,4.926097100175616528e-01,1.608573736808143639e+00,-5.209820992581098986e-02,-4.836916392695572164e-01,-8.503753709906766156e-01,-1.037112337245235771e+00,1.473572002534337066e+00,9.560169256329411613e-01,8.677608350456258446e-01,5.226321651301997218e-01,8.195960685790248945e-01,-1.213098139938358355e-01,-9.880800857312854735e-04,7.812508063750478460e-01,7.184012639839665315e-02,9.542670168169407052e-01,2.852770926303216825e+00,2.549777344876914542e-01,2.052097263795421012e-01,1.747207670391440093e+00,4.380854092689467905e+00,8.215725920342722421e-01,8.540918059072190038e-01,-5.995976083345616603e-01,-5.112438037056327156e-02,8.606099027588823835e-01,-1.310496754407526887e-01,-8.592578781276113964e-02,-1.070632101978479467e+00,2.803007544924711603e-01,7.855562836613632083e-01,9.508258589005991190e-02,-2.252158178594693971e-01,3.615085775177712124e-01,1.669661410208134189e-01,-6.665682878869501060e-01,-4.396801943469844653e-01,1.822506503587142945e-01,-4.673842998366003476e-01,1.382479478470912682e-01,3.136837451891584916e+00,-5.673025239318948421e-01,-3.755894607232089233e-01,1.013981119546607523e+00,-8.484941036949944504e-02,1.599607222571997500e+00,3.300188991443388509e-01,8.162186409542215859e-01,-1.330410302773139541e-01,-4.904774676705916381e-01,8.302904861960309635e-01,8.181844071835292498e-02,1.184412137147143329e-01,6.229550452437684349e-01,6.877151954737805717e-01,-4.205842312698543362e-01,2.297256474605195997e-01,1.158845106823678694e+00,5.270544697084701413e-01,-2.077248093849843880e-01,1.799742507301243633e+00,-1.036477543359854536e+00,1.427474210203317995e+00,7.024343902627119829e-02,5.424753985169485926e-01,2.592363629806043734e-02
8.123218061088822717e-01,1.274401970490641745e+00,4.930089822094800567e-02,-7.845016154586338386e-01,1.750029445886235879e-01,-1.751461047146482541e-01,-1.136012217811671055e-01,-1.530867580916017712e-01,3.478804923594893683e-01,2.758390372435259863e-01,8.103111133957732193e-01,3.027435855103240980e-01,-3.329193210305536055e-01,2.714220586178133776e-01,-4.129853823047590078e-01,1.883785033588571300e+00,-1.569725131524107864e-02,9.457963456088405718e-02,-1.236274361089484408e-02,2.718291518619644909e-02,-5.743049556316345283e-01,2.085372270492808489e-01,-5.424727991311619757e-01,2.763898566965780623e-01,1.569531030899869117e+00,-1.331961802230982317e-01,4.169694710322436881e-01,-5.350755450233117827e-01,-3.610112264010097993e-01,-8.882990367951048016e-01,1.134868641095725939e-01,2.106207783575694936e+00,-4.492782184009398994e-01,-2.017172661712734461e-01,-6.228799872285417649e-01,-7.223463716721021388e-01,1.157414572524537277e+00,1.214935631665178484e+00,1.838123356685701815e+00,1.261701059883755693e+00,3.324209178226766870e-01,8.977754384059227766e-02,1.661983892718404271e-02,5.518808448296132207e-02,2.725431149196846925e-01,8.553982971402128710e-01,2.635785483432284249e+00,-3.167389337120214421e-01,-1.846720810188540174e-01,1.609570086188745197e+00,3.402899185795270842e+00,1.068352204938377126e+00,1.492649816129046902e-01,-5.263635661608849770e-01,-5.729950949573022756e-01,1.579721463004314375e+00,6.968225636808753620e-01,2.501417253159627929e-01,-8.316625998806611575e-01,1.003530027409153647e+00,7.608035914972366420e-01,9.554606113721297866e-02,8.253854973416038798e-02,1.256205210026170027e+00,9.064744475802581913e-01,-4.540937860129157233e-02,-7.032249091098814464e-01,2.645441678187933632e-01,3.316798923389284726e-01,3.741566620895567796e-01,2.243260092314320442e+00,-5.750341335774057372e-01,1.334197974070726600e-01,4.606912998735070985e-01,-4.987866355835405829e-01,1.383366291021770778e+00,-7.102167923291807794e-02,1.131655712159904681e+00,-7.176688314107234623e-01,-1.481400556116433676e-01,5.600338598618411767e-01,1.968088383351570547e-01,9.513971611553762031e-02,1.308683150311707788e+00,1.076427962324143728e+00,-9.167229831820979946e-01,5.021420212445573128e-01,1.024293743579794969e+00,3.201988826244411279e-01,5.400801979981215695e-01,1.538669497793476948e+00,-7.512040331163745144e-01,6.016377135530290854e-01,7.774888831349524576e-03,1.277493380282845203e+00,2.525718389682551912e-02
1.122750566961289609e+00,2.478479500840667260e+00,2.885837519546220475e-01,-1.260523903743124396e+00,-3.528689360934803010e-02,-4.157047281918459514e-01,-8.132041916404875170e-01,3.414109962969436585e-01,2.276457134893337564e+00,-7.061770061164293621e-02,-6.188129293821560406e-01,5.244991035366685095e-01,-5.219700165013372306e-01,1.875836567613593797e-02,-2.461259188933170305e-01,1.393010594311526074e+00,-4.252975450680046565e-02,4.901183024736572857e-01,-5.014924292217208812e-01,7.705150585161021914e-02,-8.306139559529570615e-01,3.415149617598062792e-01,-6.725680253710261125e-01,-7.430388344133279088e-02,1.782143570327183735e+00,6.386210995202943330e-01,7.508397932085010551e-02,-5.264198119058329794e-01,-1.395664259330199553e+00,-1.310450714829807684e+00,-1.047770816697918272e-02,2.364559444447867254e+00,-7.918308274696783666e-01,-1.742523448926361351e-01,-9.137153274954034066e-01,-2.314115097561799117e-01,2.235578854430414264e+00,7.005972083590037425e-01,1.330697693560280337e+00,7.413480051431120543e-01,4.876017993550380569e-01,4.076327639796219482e-01,4.157932905713267457e-01,1.252600388409373933e-01,7.357272520252817749e-01,8.881079010184573796e-01,3.260621965693779600e+00,3.773738889978807132e-01,-1.806352969694328681e-01,1.500109172862047036e+00,3.275592829211262380e+00,1.459333606651185722e+00,5.942732265359766952e-01,6.244961169506602072e-02,4.134241087618262256e-02,1.177049978214771198e+00,-3.722862529655335262e-02,-1.992191664295707154e-01,-1.419942969266481558e+00,7.821244977943841992e-01,-4.334493106778042337e-01,1.127467857871791379e+00,6.771343011262869194e-01,1.021448070582016809e+00,1.841016486271019215e+00,9.741396012359105905e-01,-6.736936718826413983e-02,4.944476177737411882e-01,7.158222813794316020e-01,-2.857853552659022078e-01,2.012226674188551723e+00,-8.634250483252647879e-01,-4.574249282421874452e-01,-7.742893964271961860e-01,-3.706911865532969835e-02,2.999328647596554709e-01,1.633948190166442660e-01,4.302571496144554919e-01,-1.867581306026842247e+00,3.674130159042975352e-01,1.046050050933984954e+00,3.184981928001918983e-02,-3.069040206019385542e-01,1.534506147846096402e+00,9.965695538174920154e-01,-9.376930994359089500e-01,4.849886194759930325e-01,5.430704017831871067e-01,6.604797657185629278e-01,-5.958150287667701717e-01,1.810679575980809863e+00,-1.191880920577124137e+00,1.595894188195989827e+00,1.051098920742389309e-01,-5.909604559463979001e-01,1.765076622282818475e-02
1.292886069597784182e+00,2.191479988065716977e+00,-3.101997996150339665e-01,-4.141771323468976806e-01,-2.791354905824748600e-02,9.083606907631425198e-02,-3.276539666422528252e-01,5.294418327986566419e-01,1.560930676516780524e+00,-5.960882817727600202e-02,1.978947865052346211e-01,3.290023391376849515e-01,-3.959152328838067558e-01,6.072133267867129147e-01,-2.021059775333147734e-01,2.011045181912228585e+00,4.237959804731905034e-01,-5.110298680654847825e-01,-3.825992596716171895e-02,4.531808290326502092e-02,-6.554391105877060975e-01,1.501392802764591750e-01,-7.819094727117783528e-01,2.211247407716107893e-01,1.248761053918850950e+00,-1.365721088906242109e-01,-1.314506141841490783e-01,-4.321857538893206785e-01,-5.018015439204659423e-02,-5.417726356493556272e-01,4.780903142038564479e-01,1.781154916270725419e+00,-1.289833747682433696e-01,-3.945243707330147731e-01,-9.297841826982711222e-01,-8.552395902937539596e-01,1.834657087797377129e+00,7.607562567720680402e-01,7.954899719343475617e-01,3.762401343985011248e-01,8.900157879031470598e-01,4.423408907566278581e-02,1.055838213393155423e-01,7.556428513102277922e-01,2.563883962040450215e-01,9.534042582596067295e-01,2.966836614860993926e+00,4.768617839927656865e-01,2.472720531976607683e-01,1.509611046215680208e+00,4.389325462117745325e+00,1.098895920638844670e+00,9.740017601708438333e-01,-3.984330021927244281e-01,1.184001111176160581e-01,7.743572768401155715e-01,-3.596830294147809193e-01,-2.632130308085018910e-01,-1.197817133544338164e+00,3.716805487564709409e-01,3.590697129627031803e-01,3.039978531542114615e-01,-6.826543742597793174e-02,2.217259058903008340e-01,5.035789535397715566e-01,-2.791263697356958229e-01,-2.612069122312455360e-01,3.473726921148901914e-01,-3.834815790179632033e-01,-2.913406476124102973e-02,3.003336912448442586e+00,-5.945829873936202548e-01,-5.141119092058245021e-01,5.904217273016886258e-01,1.020493109268111737e-01,1.181229072667396851e+00,3.094420547263893595e-01,5.061091228656569019e-01,-5.574506587682270808e-01,-3.837080133309317409e-01,9.573261939578967539e-01,2.449279042353819102e-02,-7.158687832904186976e-02,8.065895668145213193e-01,6.314677434537828704e-01,-5.076412086970123472e-01,2.004289726563152074e-01,1.020089033268145151e+00,7.045925241598138822e-01,-6.644746683496303152e-01,1.864110562111447322e+00,-1.080045152683301479e+00,1.702601862283792844e+00,1.547476707065189305e-01,-1.631677947675503892e-01,-5.978152558187543875e-02
1.310176431250257512e+00,1.107140899259288380e+00,8.684662913439621101e-02,1.201560477796104198e-02,-6.861073869562404060e-01,6.880226336763430872e-01,-7.825986523649495208e-01,9.081409289387695205e-01,3.958947489155828059e+00,6.204856142096721872e-01,-3.552721625708517572e-01,2.329530191451516241e-01,-6.856179483437347955e-01,-2.551343663788946947e-01,2.296931091355930432e-01,1.918404532232557802e+00,-4.834604378643594935e-01,2.257375316027003254e-01,9.810294067577302046e-02,6.638344761169289177e-01,-1.491461326204141402e+00,8.133211809461644570e-01,-2.045071354363598437e-01,-3.828791836379644153e-02,9.774796394020819346e-01,-1.046162240596884008e+00,-2.341152255948258099e-01,-6.606163213206892593e-01,-4.147853233204124024e-02,-2.551279592019595199e-02,7.906990494706624961e-01,2.957591040432884011e+00,-1.367324002063305677e-01,-6.836133287151746618e-01,-6.302092717936141897e-01,-5.202063057187875650e-01,1.995452285044428509e+00,9.815428015627930547e-01,3.369868514628366896e-01,1.779370596894924716e+00,1.765099972071327183e+00,5.519171302674386048e-01,7.790585054355962935e-01,6.232434423222836806e-01,6.312828479035025309e-01,5.127586105211476841e-01,3.765602816123435836e+00,4.853242990430086667e-01,5.295105338760557334e-01,8.023350337732499948e-01,4.769781751452894625e+00,1.544623883206537318e+00,1.680070224772428844e+00,-2.755859176551512246e-01,-6.013776601942946165e-01,1.148244358311399038e+00,-1.519691087544988717e-02,-1.049978186785117007e+00,-5.177064188976169268e-01,1.756880161391754624e+00,9.498578011963212386e-01,1.379863924728208513e-01,-7.746993820439211920e-01,5.288617460920108648e-01,6.202395366493576034e-01,-4.031439921494883727e-02,4.298985560206829426e-01,2.094026580525578218e+00,-3.513755111658679042e-01,-1.817105461169277847e+00,3.734867689264970814e+00,-5.206003094231294037e-01,-5.056746681839460744e-03,2.196330529534793186e-01,5.566692267076823741e-01,9.673762117141817551e-01,9.666472163355210867e-01,2.294429240041072071e-01,-9.026840625472227764e-01,-2.226289697829574865e-01,1.458804380025086056e-01,4.700160846255278524e-01,-4.527740153375575116e-01,9.554283118904742800e-01,2.764741523663911682e-01,-6.389024168991559449e-01,-3.851251292679626625e-01,3.025798464546263666e+00,1.054580034392456955e+00,-1.802535856615634424e+00,3.158762191491029547e+00,-3.392434268683888199e-01,2.361457163226373446e+00,6.141537031152677351e-01,-1.057095120193793258e+00,-2.020293568439293086e-01
1.008194962029901109e+00,6.708055594280681877e-01,-4.212836922034463027e-01,-1.255641607725831443e-01,-3.678957882209600849e-01,5.413402368157873568e-01,-1.772973788504907389e-01,4.320784812703506450e-01,1.346511306658382257e+00,7.042475736497303407e-01,1.346503828954766391e+00,3.280546413342289025e-01,-3.157653933320189177e-01,2.205190314602283319e-01,-4.189711786454360376e-01,2.669331216736260615e+00,2.178067045666997603e-01,-2.322169721669824771e-01,2.277839459604960592e-01,1.797560493373224211e-01,-6.787889816841558011e-01,8.250995248717998276e-01,-2.735318559042830833e-01,2.327226554383557966e-01,1.201533805179018755e+00,-1.239936458809382858e+00,8.129907165439140271e-02,-5.455600031922349658e-01,5.049407411762731890e-01,-3.004208469574345397e-01,5.342188421136371268e-01,2.231797322223871394e+00,-7.268756648117960517e-02,-4.108768432753882593e-01,-5.188937919934129006e-01,-1.011401072018446978e+00,1.187007893690510185e+00,1.268479800313200734e+00,1.473473590875263195e+00,1.861613062409474662e+00,1.111467722290016003e+00,-1.325989984755521212e-02,2.512884938678366376e-01,4.634897072259668294e-01,-1.332248085854971231e-01,5.584527137464723179e-01,2.956923501109196106e+00,-1.602028722250186388e-01,2.195517952884719903e-01,1.164716752679137990e+00,4.615355599295719813e+00,1.275804748334723904e+00,1.079506365231403642e+00,-7.837558150312862182e-01,-9.265203597766538124e-01,1.611047033441511900e+00,9.383340069339958234e-01,-1.953413202584981523e-01,-6.966837753558638990e-01,2.065384854748203658e+00,1.280430256355642227e+00,-4.362616860827685517e-01,-7.034419126582910353e-01,9.048670480438028019e-01,4.766829768087132990e-02,-8.730550138718342623e-01,-5.124230701049471426e-01,7.805337055776129240e-01,-1.871372121949876899e-01,-4.460757218106969901e-01,3.489113131906083964e+00,-2.036328057864781882e-01,2.918147474147508302e-01,9.390199696633428905e-01,-1.239029093629692158e-01,1.636237254513228656e+00,2.737885693990291247e-01,1.365888200793455187e+00,-2.160470976010318012e-01,-4.803537598378730400e-01,5.222408468122015091e-01,7.912498705907886620e-01,-2.277382212789169635e-03,8.090597804691783690e-01,1.026977227624256805e+00,-8.940495345485364176e-01,-1.114980248595252021e-01,2.278883923469902761e+00,5.384901682934692957e-01,-4.422238212608557428e-01,2.504256190862061970e+00,-1.270995681692753676e-01,1.021426464401224310e+00,1.297861046429454324e-01,1.254479162705832485e+00,-2.376057655326612728e-01
9.550910209520138139e-01,4.033521639500263767e-01,5.160255447536236106e-01,1.986274298320112042e-02,-2.459558477871321425e-01,3.783409911079179122e-01,-5.750997297596216473e-01,1.951578432305668409e-01,2.603313734710941851e+00,8.094795154216043453e-01,1.121743615516777592e-01,5.097959105693830595e-02,-6.699494551389170161e-01,-2.681170265589115087e-01,3.553890335332101635e-01,1.695181595637741179e+00,-9.508117853094248950e-01,5.446011116126332485e-01,3.696491509908204076e-01,7.867807013527947646e-01,-1.583095901772088698e+00,3.558787725999540408e-01,-1.100230809087674455e-01,2.024663137916691280e-01,9.066413965569692923e-01,-1.166450684605167210e+00,3.328516594750163815e-01,-7.122011387224531642e-01,3.592283748905846785e-01,2.008572725808619452e-01,6.492360647208437197e-01,3.025931023329986314e+00,-2.144026068404685237e-01,-8.157859071821711439e-01,-3.526106958419669146e-01,-5.736402508984640436e-01,1.060842593441239989e+00,1.543982272427061542e+00,6.694907448867970512e-01,2.288005341462557407e+00,1.321030516079740202e+00,5.124076207131497140e-01,5.648617348971955998e-01,2.300232054066979615e-01,7.429438975971589532e-01,5.789560661206563097e-01,3.453398800006637792e+00,-2.477666654712244454e-01,2.452762945290338226e-01,1.319795585386124515e+00,3.883705660199241461e+00,9.338664280987165611e-01,8.122664556212886300e-01,-5.201085842151862426e-01,-1.094141705887265559e+00,1.537760404698810257e+00,4.936288587502212777e-01,-5.895546789491520334e-01,1.374177856361799011e-01,1.270658871557843295e+00,1.924530805419173651e+00,-1.699819466468023843e-01,-8.877909879880793165e-01,1.272111634680887393e+00,5.498638288950309372e-01,-1.780522729330877851e-01,9.186944911395733548e-02,2.147310122937085897e+00,-1.923637488398131090e-01,-1.432931983002816434e+00,3.267881851366356116e+00,-6.997318101633092091e-01,5.165134559315432972e-01,7.875974269412779893e-01,-2.392285552185602349e-02,1.741064571063634769e+00,9.554714180324737072e-01,5.860058871423150517e-01,-3.752955873857657387e-01,-2.203994284264407799e-01,-6.352726939635966463e-01,2.442838347844609737e-01,-8.455887947274998151e-02,1.079840957107316424e+00,2.068322167337978135e-01,-5.232138483443127264e-01,-5.026297891322062394e-02,3.268224556560590521e+00,6.188714797655898714e-01,-2.931107118619522556e-01,2.683611830992814085e+00,-3.609947701439334411e-01,1.533483096039911064e+00,5.717323705495831465e-01,2.988609035537027614e-01,1.335124661066269258e-01
1.290265015514187041e+00,1.048244180148092841e+00,-7.094532428219866294e-01,-2.602170918575485992e-02,-7.559200377399262205e-01,8.033266321443170987e-01,-5.190043861042812345e-01,1.031932554479242814e+00,2.602641536080225748e+00,7.261588315705446162e-01,1.131539656840565788e+00,5.038737483063562284e-01,-3.386699362623355469e-01,1.883038691055338720e-01,-4.538482027035114497e-01,3.021701873588910736e+00,5.536563957997733265e-01,-3.561121573724238543e-01,9.800278843100204695e-02,1.843840761384661908e-01,-7.088896006526410609e-01,1.260067508588269547e+00,-2.390336726292108249e-01,5.329844170021694194e-02,1.136112935172138405e+00,-1.460118720178650520e+00,-3.045127630037356425e-01,-5.073639569232817337e-01,5.446732431406922093e-01,-2.439085931295419396e-01,6.804263611809295842e-01,2.251747113405550227e+00,-1.293208658755046203e-02,-4.717607149402697764e-01,-6.417290808535647262e-01,-1.013121313534087076e+00,1.738183140013811023e+00,1.007309984514661139e+00,1.113017296339615214e+00,1.817943516492861455e+00,1.560843102441353158e+00,-2.101485123111956899e-02,5.133335784379461364e-01,7.805020481989164427e-01,-2.727048346229525855e-01,4.275891950627516147e-01,3.365661738134096304e+00,2.829591807733740083e-01,4.282143423434245921e-01,9.184036110344226955e-01,5.310054324904540657e+00,1.570991405171736410e+00,1.834704545484775018e+00,-6.835337877048245359e-01,-7.617355608157028168e-01,1.408518263597073439e+00,7.475116770921973464e-01,-5.768211452592593158e-01,-1.058847608588729949e+00,2.551485101550985402e+00,8.927501235390564727e-01,-2.316929234854085418e-01,-7.969544335332370277e-01,5.380625847638467185e-01,-6.375773053427225001e-02,-9.592210332783115412e-01,-1.934506595196296974e-01,9.126080980097084350e-01,-2.917411388636869107e-01,-1.038249776472280450e+00,4.095138675540065165e+00,-9.015238154888560729e-02,2.572014449396355096e-02,6.527644692459515507e-01,2.751915798221354903e-01,1.263962336887886506e+00,4.921433873865057040e-01,1.281856260922039192e+00,-4.413445454904012522e-01,-4.462682041683930789e-01,9.289789573695574898e-01,1.094605762292871320e+00,-2.123734582149663930e-01,5.660757571302565960e-01,1.082304121768684180e+00,-9.100171774942568126e-01,-4.446022339558889924e-01,2.534799486068776364e+00,7.887622755608389991e-01,-1.504871049130018790e+00,3.108261594689526230e+00,-1.822413269951711490e-02,1.666728861272530171e+00,1.587833275184703519e-01,5.063159714832263791e-01,-4.115451179989897956e-01
8.398030085709082826e-01,1.138012644394038375e+00,9.645565361727266585e-02,-9.184448500318387332e-01,-1.854463618673001524e-01,5.391220131384988346e-03,-3.369382952396891562e-01,1.067724461457774665e-01,1.438082373461518904e+00,4.481891607899419760e-01,4.920876524284364950e-01,4.007890241936020170e-01,-4.110954710708912829e-01,-1.331725016221900204e-01,-4.562936742701411141e-01,1.863651010569169264e+00,-1.830217254667484694e-01,4.287013597953339694e-01,-1.911282479894703956e-01,1.086240804674695193e-01,-7.270894927635784821e-01,6.930675712451255244e-01,-3.563499487477379546e-01,4.764268274351621257e-02,1.724084261880687086e+00,-1.863922461454593504e-01,2.679824830715045736e-01,-6.108955732670870997e-01,-8.866935469127693592e-01,-1.114336794959346788e+00,8.872362687370222156e-02,2.553738365582676639e+00,-6.004668137164190789e-01,-9.825607340418676672e-02,-6.052707890049887629e-01,-4.771533547675267384e-01,1.576577425416059164e+00,1.081717484058903667e+00,1.953509814175694803e+00,1.663098358797078014e+00,5.746882490429122692e-01,3.076632913911881984e-01,3.235649023737852126e-01,-6.822862779656681254e-02,3.717108363096449652e-01,6.627738004556371632e-01,2.945502688467237284e+00,-1.620728986873747335e-01,-1.465429157511234926e-01,1.148634620813541840e+00,3.543771304239196951e+00,1.586717388270847406e+00,5.107680301789954136e-01,-3.319049580843093650e-01,-7.078347829198465835e-01,1.771150598449252600e+00,8.829068142969840327e-01,-4.013169401159624727e-02,-9.514725003715782670e-01,1.916137669350375550e+00,3.607431759766969170e-01,2.701035494707245688e-01,1.203640276330583403e-01,1.347046681712676497e+00,1.293604989399590899e+00,3.449672685324728927e-01,-4.536039238308302579e-01,6.686478121847769795e-01,6.322882292868469145e-01,-1.999196911718154057e-01,2.312588687612746163e+00,-4.766588705989024399e-01,1.815280099760105403e-01,-1.961063391210091378e-01,-2.603913602786409043e-01,8.190583739930139551e-01,-5.104327549142811948e-02,1.048603387356541017e+00,-1.348232341488995401e+00,6.838519560133765607e-02,6.945053961486893357e-01,5.019438504366686704e-01,-1.966291394677192050e-01,1.544072899907688257e+00,1.226107434333368884e+00,-1.217482003987496952e+00,2.951342520610188425e-01,1.324719368382817342e+00,5.335360917125253621e-01,-2.282833725487404819e-01,2.028276451524311241e+00,-4.510561966378180410e-01,8.696379804845900674e-01,9.462454593711175366e-02,6.747732182291190650e-01,-1.738682310447507706e-01
1.144589886623262442e+00,1.550486370158179472e+00,6.461652580801295620e-02,-3.719593797753404374e-01,-2.471912147520900493e-01,4.442763658636803559e-01,7.735635355612918707e-02,3.893594011034976488e-01,2.383324182584738438e+00,-2.938073862690218641e-02,-7.163387002775347678e-01,-4.457495689200688394e-03,-6.224949690671739422e-01,2.495823209643852070e-03,4.554034311195426232e-02,1.103859053520192202e+00,-5.258800144259179188e-01,-2.291395353458962059e-01,-7.992101132590112567e-02,2.951640483094151723e-01,-1.093088392036649648e+00,1.963414526545885219e-01,-6.471790693349015466e-01,7.732433845528939587e-02,1.393398968070340249e+00,1.850164526395685349e-01,-2.038960928041834431e-01,-6.568235827616661915e-01,-1.180030274868409501e+00,-8.139288445678338757e-01,6.019329766696408512e-01,2.591336502106896589e+00,-1.250190427305008789e-01,-1.033256481685504991e-01,-9.024960974384208523e-01,-4.208884250414047234e-01,2.246804353288933687e+00,5.185293365042318303e-01,8.329779389293021641e-01,4.591852966133704861e-01,1.124691826356317481e+00,6.472381669132872828e-01,2.414407192430207960e-01,4.579176511798737081e-01,8.736257022649422943e-01,9.050750817184362029e-01,2.907277839591952073e+00,6.827876594243176278e-01,4.664106330212423046e-01,4.768376660407888656e-01,4.374195200961039198e+00,1.910912844659459653e+00,9.383007794039511795e-01,-4.988694144917638074e-02,1.240588996114639908e-01,8.416624055183055120e-01,-7.032268705634013850e-01,-7.185600252403666621e-01,-8.209643042753570485e-01,9.065821697626438302e-01,-6.747740456082970684e-02,1.177741362982634987e-01,-1.013630015509400933e-01,-6.487195122663524938e-02,1.172540561916572965e+00,5.991249019981161883e-01,2.320468899517613703e-02,1.338162001411698387e+00,-4.473297179340828267e-01,-3.618048098196224860e-01,2.561883420983027904e+00,-5.124618696087218650e-01,-3.786892031267293235e-01,-3.078518493985288318e-02,4.945708980523669807e-01,4.742184221191599880e-01,1.202722886520578016e-01,-4.092620416095198443e-01,-1.294449023144298883e+00,-4.197861213892852272e-01,6.101988934567599276e-01,-2.131877672074952157e-01,-5.525170942216071079e-01,1.538680462545909622e+00,1.943953205106113691e-01,-8.152831830662119472e-01,8.365284156157143380e-02,1.268542154670209143e+00,1.199017804414026500e+00,-1.496125139986539621e+00,1.917139278346313924e+00,-7.919504653362818836e-01,1.985825238935993386e+00,6.013964537956584255e-01,-1.650795339050221466e+00,-3.750553603156888682e-01
9.740370056522135167e-01,9.950514837822920233e-01,-3.794617038038034518e-01,-4.856063585709406438e-01,-4.152320400693926827e-01,5.957906560963397435e-01,2.840153517159699770e-01,3.667375786929096271e-01,1.495359352663802044e+00,2.890918094643097902e-01,4.806005941837131479e-01,1.893141758970106059e-01,-3.915475794391196085e-01,1.772669554431483344e-02,-5.088322407194112440e-01,1.877221766573652806e+00,-4.553168214431441152e-02,-3.264806475730457347e-01,-9.187916334769369309e-02,1.696261919355244313e-02,-6.056983270652505080e-01,7.652299758131591023e-01,-4.761573180545409789e-01,7.882696606932776406e-02,1.628029638309035354e+00,-2.587147926887913285e-01,-1.370144699758755469e-01,-6.266730551303884011e-01,-9.870749380376433457e-01,-1.095953196167046784e+00,4.437000639534839364e-01,2.425071523225814651e+00,-1.556392874912483903e-01,1.326903232446138836e-01,-7.697959129190931060e-01,-6.545946101580801813e-01,1.959111420675884840e+00,6.677492427803441988e-01,1.755777754004425484e+00,1.041756501557039805e+00,9.653134669337102292e-01,3.511828692743614311e-01,1.579785863175935390e-01,3.014578873981543228e-01,2.592002640888556586e-01,7.046377155248962909e-01,2.641470916995907192e+00,3.154814599809953601e-01,3.096416331698284563e-01,3.411172506640038349e-01,4.580516739435273266e+00,2.144268086369086390e+00,9.674965888418000093e-01,-3.412597316320973850e-01,-3.460859952556256669e-01,1.399129577759157250e+00,3.062718214011455053e-01,-3.684754662101591416e-01,-1.050434527244340277e+00,2.155395344451873640e+00,-1.875029362625665885e-02,-2.498240808045507078e-01,-1.614746360531770231e-01,3.057659458469412783e-01,8.845045654366522347e-01,9.937688227675156583e-02,-4.599132914426599106e-01,7.381214946740357608e-01,-1.151899989144673786e-01,2.144282222201548960e-02,2.694506600203146363e+00,-1.211636522400811322e-01,-6.248783053474714355e-02,5.575559169875078658e-02,2.134986569155258307e-01,5.870178009486184401e-01,-3.071875525476481239e-01,5.219266231421439972e-01,-1.194536519051154322e+00,-4.659662063160683876e-01,1.014039594099938491e+00,4.507126411469288829e-01,-4.485746690094087885e-01,1.500409382526634472e+00,9.390035062753308015e-01,-1.263731882963440745e+00,2.558976660627876321e-03,1.216454717429155341e+00,9.873463779614903846e-01,-1.240098933105737711e+00,2.047111838501088243e+00,-2.482416852941312368e-01,1.236660654398977321e+00,2.965560256711957665e-01,-2.749653980060962621e-01,-6.000607939141880953e-01
9.184045748683602461e-01,1.233834004424132935e+00,-9.516022007626273593e-02,-6.259522963567812903e-01,-1.515483603930074530e-01,3.471131490022156818e-01,3.764273802114677658e-01,1.007569001902070549e-01,1.212354302751990298e+00,5.268596734085573274e-02,1.298636719260121142e-02,6.664672161825926922e-02,-4.587299628624602055e-01,4.268332616841902238e-02,-3.430879268307635566e-01,1.343548821936055182e+00,-3.183281599534106276e-01,-2.449881200760024580e-01,-1.234006483060584303e-01,4.507574119425736964e-02,-7.019393146744421497e-01,3.385415643051922774e-01,-6.211801405396778497e-01,1.295619151720404094e-01,1.674788438957313552e+00,2.357491411333895448e-01,-1.699305244144094784e-02,-6.439839458700169494e-01,-1.326509635919916663e+00,-1.200532547578442966e+00,3.700797716397573600e-01,2.428321314723523638e+00,-2.279515465681753450e-01,1.637402477696569547e-01,-8.283135051900554213e-01,-5.142923794442386676e-01,1.959850523545648482e+00,6.214791043180796226e-01,1.654090713694579273e+00,6.497927197171450286e-01,7.288678323439727880e-01,4.785299606041505394e-01,4.492744429131502459e-02,1.927107024882420139e-01,5.794685554846485953e-01,8.797648468116948672e-01,2.510058714212616504e+00,3.307440532118633980e-01,2.381188267624189669e-01,4.745946328679929715e-01,4.119331766135440276e+00,2.016615440698572126e+00,5.728829221001402461e-01,-1.998148665071536045e-01,-1.071601613080457316e-01,1.237385007470457321e+00,-7.297024577808824963e-02,-2.952371600756900638e-01,-9.549608896600760843e-01,1.413121605760865318e+00,-1.457905443157609671e-01,-8.103435928267330168e-02,7.910999211575552026e-02,2.772277365830082552e-01,1.211104460174156960e+00,4.899767546277166153e-01,-4.405454236543649982e-01,7.486268194234700912e-01,-1.074732372342487030e-01,2.916000226461274436e-01,2.196843341736352873e+00,-3.316649781302358768e-01,-1.664811944548129086e-01,-3.362912869154671691e-02,1.505770638038123610e-01,5.276585602915566664e-01,-3.568461627931989177e-01,1.439189906809068553e-01,-1.317609234489723669e+00,-4.127232615646956315e-01,8.518356474213613083e-01,1.573162980012704493e-02,-4.353294444948273556e-01,1.711895657036595075e+00,6.968054539017134452e-01,-1.146022526710696487e+00,2.459571275785412681e-01,8.025976333799907936e-01,9.803489338996147495e-01,-9.101511214309617737e-01,1.604113080938754266e+00,-5.879341498806393007e-01,1.232996734107495440e+00,3.659609087328903332e-01,-6.141320368428100362e-01,-4.658532376975827449e-01
1.097129860938846901e+00,1.190762044247471341e+00,-6.541392222236485088e-01,-1.758759699789381736e-01,-3.226792005832346821e-01,7.483603435115864233e-01,5.854955739122897906e-01,4.385159894049937002e-01,1.085029303366561226e+00,7.924933130550609883e-02,5.864550453633996518e-01,6.893155681880268337e-02,-3.445414053211567351e-01,3.829059729234231546e-01,-4.681934677769058473e-01,1.950835345748224814e+00,2.041086044543684586e-01,-9.090058618785870070e-01,5.085527760096713451e-02,-6.183813269936342533e-02,-4.805370792741101571e-01,5.018414417006324957e-01,-6.688430093313699754e-01,2.185540224147216604e-01,1.434144553695352320e+00,-2.822579187548340807e-01,-2.920558466241303108e-01,-5.642430849198484255e-01,-6.113176830245129478e-01,-8.744272498027279017e-01,6.534006214541827617e-01,2.041473107869426595e+00,1.543239416661092989e-01,1.061956482851857952e-01,-8.905921949972572804e-01,-9.011712851935458346e-01,1.954604999407112409e+00,5.285700043570338291e-01,1.423000403599479213e+00,4.387650793034350016e-01,1.067510533180140886e+00,2.139006274932458429e-01,-6.488811600618538122e-02,6.432523038638309210e-01,1.374993929862863284e-01,8.466465018348325877e-01,2.417896578437495947e+00,5.297871255622070841e-01,5.266226022377454852e-01,3.297515237399998300e-01,5.058078252434418332e+00,2.021358289431215205e+00,1.077393838062368214e+00,-4.502064447456042284e-01,-2.386146766058733215e-02,1.010783042971312273e+00,-1.824011494735160444e-01,-4.010958667451216542e-01,-1.082829617898616537e+00,1.591006983698170396e+00,3.668453859792761285e-02,-5.049685175396830816e-01,-3.249045439935278612e-01,-2.966260726289517979e-01,4.076880289323009388e-01,-2.957764860030794862e-01,-5.338261503554674325e-01,5.270848922654585156e-01,-6.920854564634861816e-01,3.586172169710111213e-01,2.956378764724084895e+00,-5.406946283019359312e-02,-2.909788622219618426e-01,5.816770007531464337e-01,3.429703227320176628e-01,8.273090115203249884e-01,-3.288110943565422661e-01,2.996730479418124315e-01,-7.101718630205035021e-01,-8.293483817437909966e-01,1.121150238946799771e+00,2.365714169654451748e-01,-3.838593676075596761e-01,1.229776492977123326e+00,6.775104460814416196e-01,-1.020023374697073493e+00,-3.969658304457890363e-02,1.020276802378385916e+00,1.080833372276424065e+00,-1.351180078108158211e+00,1.838244020477777463e+00,-4.088080267097721765e-01,1.403962805612616993e+00,3.348892635427341835e-01,-4.730417923933072921e-01,-6.432653875978951996e-01
1.371407353900292669e+00,1.420647580879905281e+00,-9.123051681361848964e-01,1.602286881304918476e-01,-5.313914107750943305e-01,8.954673977863896184e-01,7.986702751635776920e-02,9.373503437917104497e-01,1.889967296105662831e+00,2.557365303106839405e-01,8.647288832499742117e-01,2.560846505195528144e-01,-3.204756368503918207e-01,5.736019084820030978e-01,-3.937449974543273390e-01,2.641740423529690851e+00,6.512621939740208532e-01,-1.054217283671591732e+00,1.631477338583497694e-01,3.228785159692835333e-02,-5.450582296684718386e-01,7.444684695740599878e-01,-5.903283122885115697e-01,2.067164316798179302e-01,1.080075731710772979e+00,-9.700085069421844342e-01,-4.805216320806229291e-01,-4.685807366866323598e-01,3.709318216088524078e-01,-3.021654000334886847e-01,8.551632793152879053e-01,1.846446713836973341e+00,3.000764261708923075e-01,-2.915263069483517988e-01,-8.765488654251387679e-01,-1.147915757928722469e+00,1.927960718948260821e+00,6.503114526696314179e-01,8.439461502272451732e-01,6.951217260752902138e-01,1.496372543049874437e+00,-2.753994108219232073e-02,1.407638046857176417e-01,1.060226108945809376e+00,-1.800954794492298783e-01,7.180534529390442122e-01,2.887422798809927915e+00,6.494906633952821640e-01,6.677158159271765481e-01,6.919842442872518040e-01,5.645289697635591075e+00,1.651216378111958427e+00,1.709811360164155136e+00,-6.351061183992645631e-01,-1.234526443448242805e-01,8.512138474904413776e-01,-1.363773712449227737e-01,-5.955915981348123278e-01,-1.155710319027565935e+00,1.630658366908528834e+00,5.127954609275904296e-01,-4.513882028962655779e-01,-7.155243297128911495e-01,-3.524278107542412330e-01,-2.367074787381129308e-01,-9.750092395255671729e-01,-3.099984613987023518e-01,6.094872151039583130e-01,-9.380710829086126301e-01,-2.970764305695915430e-01,3.903463299558081356e+00,-5.320993249477412590e-02,-3.689261245700084513e-01,9.881638659612264064e-01,4.717256402497120860e-01,1.218145296721398152e+00,2.103879002230363837e-01,6.340835529484383226e-01,-2.066409832603495200e-01,-8.668995345992297485e-01,1.141446945420784953e+00,5.571808386556145187e-01,-2.557516853556277003e-01,5.747430790955159186e-01,6.722416284527075181e-01,-7.149861230019785019e-01,-3.376081205285475506e-01,1.757197519300205180e+00,1.018159398976751451e+00,-1.672107908405286558e+00,2.482361229910162947e+00,-3.661645599933184281e-01,1.844749783137272114e+00,2.720968676032605726e-01,-2.457316522463856012e-01,-5.298521073824187244e-01
9.210395622761791135e-01,7.561496881764538935e-01,1.288977934219394106e-01,9.890765471514884055e-02,1.536383499985973788e-01,4.174798155799483990e-01,4.581884751809688905e-01,-1.386363848240161900e-01,7.873650262447705606e-01,1.851719000492846878e-01,2.164816126924437034e-01,-2.457159426130186008e-01,-5.327085046554876913e-01,3.187421536870351235e-01,1.816658686455469018e-01,1.314281781917235659e+00,-6.611096503819158254e-01,-4.507961740381994376e-01,4.277608070936270157e-01,3.987670502711671561e-01,-1.083532021409322255e+00,-2.983778611327191355e-01,-6.004654700790486022e-01,4.579038673199125054e-01,1.017126711558913987e+00,-4.178198725730580820e-01,2.162194343583873080e-01,-6.433037288209719762e-01,2.147611170944419001e-02,-1.427291483854458143e-01,7.310418601945037897e-01,2.323867672015667019e+00,1.508486883808916601e-01,-3.883723476640810746e-01,-6.400139579226686859e-01,-8.274973183949558830e-01,1.132255967910334338e+00,1.110241527689634911e+00,8.321972511022233121e-01,8.057276663455424925e-01,9.456107908071554879e-01,3.817774927545413144e-01,-9.937057781190725136e-02,4.491640039665345530e-01,6.787253607653097598e-01,9.824438646131263830e-01,2.511539680973946087e+00,3.259185616280763087e-02,4.192123491631488674e-01,1.034878613715156881e+00,4.159538657980486498e+00,1.091227867192468226e+00,3.737672787255916784e-01,-5.503815433282639447e-01,-3.322844123905699387e-01,1.004555700727283840e+00,-3.447059920401619459e-01,-3.177806508971237065e-01,-9.980473016138757814e-02,2.565854189158707221e-01,1.331850794508827152e+00,-5.907993769547272844e-01,-6.328698235170624464e-01,2.516847035530334620e-01,3.378874555828286219e-01,-2.697579749543772554e-01,-3.865364974388825203e-01,1.297200681716472292e+00,-8.694780490083362512e-01,7.042642576806584787e-02,2.736097222144442842e+00,-5.419002933793403143e-01,8.871758211519061021e-02,1.261518953197757975e+00,1.077168786895867092e-02,1.720702478233389288e+00,2.417536056102361219e-01,4.538433096514682408e-02,-5.481027588853026877e-02,-8.006075926312844482e-01,-1.678593716475833553e-01,-3.771107886084961724e-01,-5.562794924370897953e-02,1.200832716005458600e+00,-3.420782854982695742e-02,-4.559394860038865627e-01,2.260447661089753646e-01,1.825142188187549142e+00,7.833395951454599215e-01,-1.022574215474416071e-01,1.567495427765600136e+00,-7.442049272363318035e-01,1.277514398816026908e+00,5.647305678078050617e-01,-5.436692862675179816e-02,-7.826198844435794388e-02
8.165039276604652008e-01,3.769259444975348039e-01,-3.681812664566549431e-01,-3.959951652778803677e-02,-1.076293867064729570e-01,6.836117256861642399e-01,7.853513005106937950e-01,-4.664198801645118297e-02,2.368995900308359381e-01,3.529948768328744491e-01,1.041079208860240746e+00,-9.944382940941284832e-02,-3.435689701663500184e-01,2.842487419194966725e-01,-3.643999444904815199e-01,1.868655201195830395e+00,-2.231299091948915347e-01,-6.673704097143227099e-01,3.178622110965663161e-01,9.035370839465273196e-02,-6.089201495238940609e-01,2.935475186166285888e-01,-5.037975139768822164e-01,3.888709494017216772e-01,1.328961395777965127e+00,-6.041377905925060521e-01,1.077214921604851688e-01,-6.341988143778567455e-01,-2.179268523423302240e-01,-6.094648099942240327e-01,6.248635742061392495e-01,2.218086683826800964e+00,1.584796457215143506e-01,-6.266675463309029359e-03,-6.245619621007116873e-01,-9.626623004501497771e-01,1.215985313236122467e+00,9.931157864814113001e-01,1.677313176858021393e+00,1.046308021112648312e+00,8.801718031255433283e-01,2.151656726804886677e-01,-1.735330905701557014e-01,3.533278344251010172e-01,1.863893667937421839e-01,8.188220429472908846e-01,2.217672298294271371e+00,-4.753462401319054342e-02,3.858722054748049968e-01,5.487219299227322766e-01,4.572359254139217732e+00,1.659566584249043464e+00,5.496969943473237752e-01,-6.802939944638350944e-01,-5.407738518418501172e-01,1.386719285003758406e+00,3.174617920308757668e-01,-1.462245974466167275e-01,-4.783595280231441871e-01,1.547044867554815628e+00,9.126961140297245034e-01,-9.015927560821296316e-01,-5.878269686543328154e-01,2.529765684052288077e-01,2.407405957075359204e-01,-5.019426732332257224e-01,-7.618273276992749699e-01,7.690149967198012249e-01,-6.427062037414973394e-01,4.707356293077959997e-01,2.785253421995849799e+00,-9.974707231000462526e-02,2.128442919713137149e-01,1.074791681093946183e+00,-3.407943269955738402e-02,1.445317607909892388e+00,-3.020647685493110246e-01,5.975434423995408251e-01,-2.559878726629221113e-01,-8.914760459568269457e-01,4.409122296658998796e-01,1.881773331645866520e-01,-1.478619273907688103e-01,1.311901670886098659e+00,6.045635912138376256e-01,-9.802198198699136888e-01,9.229725977776237489e-02,1.522345216222733555e+00,8.057009062622147999e-01,-3.814144669087627948e-01,1.669757945889652540e+00,-2.326385128460884411e-01,7.975984935436130074e-01,3.586569417513165714e-01,5.574906660699474603e-01,-4.627556276472293839e-01
9.660831120489959956e-01,3.708119823762606737e-01,-4.656037962164151223e-01,2.263628405370855523e-01,-2.670637696861824506e-01,8.366379845916944724e-01,5.038165372280694054e-01,2.431850280133812658e-01,8.628520517579674198e-01,5.066258312669335018e-01,1.134952284012406887e+00,-3.578892404631253688e-02,-3.628888831211647958e-01,3.223273220652783655e-01,-2.561256809371180720e-01,2.211125314865952429e+00,-9.228958941626408397e-02,-7.087338514275984824e-01,4.204538799693856022e-01,2.138506533821269429e-01,-7.393075408739540055e-01,4.456733122239491252e-01,-4.138082865103000496e-01,3.766875539335531320e-01,1.081421671508397075e+00,-1.077437489480034927e+00,-1.027065704364393817e-03,-6.064541634274330795e-01,3.569280699007180147e-01,-2.076247294701754065e-01,7.897157381860190339e-01,2.217582681618536888e+00,2.674849092817596641e-01,-2.620826055671434118e-01,-5.861873092543063990e-01,-1.079654328832754473e+00,1.188901891901351870e+00,1.087364032343972386e+00,1.278690847752509852e+00,1.292462216431235600e+00,1.208498601603045897e+00,1.356980579325920422e-01,-1.676651010034715950e-02,5.836304225767516840e-01,6.272848825943633244e-02,7.196122779575893080e-01,2.527297995988420976e+00,1.818592701207513013e-02,5.104314713272244397e-01,6.749776388657784398e-01,4.945899835573217551e+00,1.477321235657226728e+00,9.470886112532151957e-01,-7.809112485779299284e-01,-6.552732597953426774e-01,1.310208138362398023e+00,3.326617261301524353e-01,-3.343366021270657296e-01,-4.104509405147789280e-01,1.634009104551786162e+00,1.277846222562700973e+00,-9.294286867787966422e-01,-9.010802630454065598e-01,2.146324643374212804e-01,-1.385690338196223781e-01,-8.752166675144559260e-01,-5.755043573041537242e-01,1.008591015961037840e+00,-8.333336699145210691e-01,-4.184985745983665906e-02,3.383030455492790800e+00,-9.488819473083018319e-02,2.223719021119193173e-01,1.325550427891372118e+00,8.500007173156100271e-02,1.681379161627117425e+00,6.422861089275228030e-02,7.159356519556197007e-01,4.249537240868495047e-02,-9.329671484836777884e-01,3.308580440876327522e-01,3.684700448658249083e-01,-1.060569737479375163e-01,9.586121359377343110e-01,5.161517541885495275e-01,-7.965933299857747008e-01,-1.261521898949726217e-01,2.139641848645243982e+00,8.117233065824014382e-01,-6.460122469613389651e-01,2.121137798841978395e+00,-1.477567097317058487e-01,1.107044122801254638e+00,3.877768433440113016e-01,5.801265859302882077e-01,-4.091140291826149689e-01
1.030958980355526355e+00,3.769200979443552146e-01,-7.628683438183962995e-01,4.348669195672412169e-01,-3.878293252658004953e-01,1.289211862533629516e+00,1.260054051671639197e+00,3.272893788379662161e-01,8.013851106488649734e-01,1.645891977367773817e-01,7.120924528571894729e-01,-3.179441397046440798e-01,-3.906425752909120641e-01,3.825818172897095804e-01,-2.843073344229443689e-01,1.771753150877437566e+00,-1.754374074964175079e-01,-1.361376381493795140e+00,3.984743673094927052e-01,8.875565442288280149e-02,-6.373410575710964920e-01,3.450782271464290507e-01,-6.248379360668263605e-01,3.760096640278786095e-01,1.164782216504877788e+00,-6.539509392901903251e-01,-3.667531293601693498e-01,-6.592529959214469271e-01,-3.517200482162639030e-01,-5.015814498081658801e-01,1.037844762269400034e+00,2.184708791905989766e+00,6.018218646901201119e-01,1.434871338103048122e-01,-8.195905245985215526e-01,-1.068203486653939605e+00,1.748240270914286132e+00,5.270277384029735668e-01,1.209671772614035357e+00,3.768522320951626092e-01,1.404015078483020984e+00,3.414797605226465582e-01,-2.407082096421520601e-01,7.900748365727996436e-01,2.023653414009584095e-01,8.604759660472216520e-01,2.086580403586899557e+00,5.670141347725237146e-01,9.055802488775916981e-01,-2.725687542317085654e-01,5.659756145384818637e+00,2.217299966602501726e+00,1.142286583533468347e+00,-6.035855724220891005e-01,-9.466756188452613019e-02,8.915752738401893085e-01,-4.706658457776775606e-01,-6.361449276461290658e-01,-5.583168964248848010e-01,1.654519336143110309e+00,4.936546239416592652e-01,-1.293939991945139756e+00,-8.909508131139246556e-01,-8.769921328162640917e-01,-1.028269397605221513e-01,-6.334814639477488463e-01,-5.800391616996017907e-01,1.061661250075113694e+00,-1.447538361987843691e+00,4.234617659223586239e-01,3.257775863107156056e+00,1.811310614778410266e-01,-1.134584214774483207e-01,1.230734330970805201e+00,5.699427097250994168e-01,1.122665771165754833e+00,-3.922858537224827025e-01,-1.348893985121311090e-01,-1.857601428424052736e-01,-1.381778878300379709e+00,6.978156266626984738e-01,6.826323397751435373e-02,-4.656035733015370104e-01,1.244352809915072466e+00,1.642911498452968022e-01,-9.383914183110595442e-01,-2.537243942019278831e-01,1.557733731646436803e+00,1.345770295012951312e+00,-1.641457700355170468e+00,1.819052193749838731e+00,-1.032701665773195776e-01,1.449680645438783166e+00,6.427019614173965500e-01,-8.185153566443899020e-01,-8.609586847945829291e-01
9.182570685975600666e-01,6.754207516226244934e-01,-6.835205116235382183e-01,-2.419235370340971358e-01,-2.950494221448482501e-01,6.256561797024524640e-01,4.087858295545214737e-01,2.714960206523143738e-01,4.358203812661295418e-01,4.732828454783805094e-01,1.527104067924552222e+00,2.381340628989342956e-01,-2.147212384628019444e-01,3.609000520255953304e-01,-6.901501197435870871e-01,2.542556543222293630e+00,3.795468691609213407e-01,-6.352471091415329285e-01,1.535346268924667190e-01,-9.415272910776695259e-02,-3.234451700857425283e-01,7.639026497346111944e-01,-4.442047745213036913e-01,2.793943439689540731e-01,1.449252184049592440e+00,-8.319139437289307937e-01,6.431165783627512678e-03,-5.404027565264463151e-01,-6.899696366950758275e-03,-7.562709224898724880e-01,4.823922423466310283e-01,2.001180938121030373e+00,2.063813132149161511e-02,-1.354923989868911383e-02,-6.441498277976758224e-01,-1.067918181057151639e+00,1.334681386373187673e+00,9.926629546912750790e-01,1.938010289660667018e+00,1.303890245885180210e+00,8.778225474866558908e-01,-4.137705681581821393e-02,-4.134897064749975398e-02,4.265952013772294493e-01,-2.359906681978067855e-01,6.760592235732982846e-01,2.431672933343452137e+00,-5.433149908758760915e-02,2.539071088522206199e-01,7.603285139336123377e-01,4.758447376835039933e+00,1.675434504200321362e+00,8.853850759670447435e-01,-7.604984982063802690e-01,-6.543824705399663433e-01,1.558743909194112653e+00,8.021071324109374512e-01,-3.176569057889792880e-02,-9.450598798241796050e-01,2.164294544571601087e+00,7.103402862103358473e-01,-6.659162980128943143e-01,-4.760951103528819894e-01,4.995428936997293179e-01,1.339389957466687875e-01,-7.734262737031982748e-01,-8.322266804612895585e-01,2.823550629150627378e-01,-2.907035492093263951e-01,3.565134511786910987e-01,3.093813947211585536e+00,9.849942387811116973e-03,1.556578567243868672e-01,8.722118509403767872e-01,-1.098731255608512702e-01,1.355686928014818715e+00,-3.021776186297304156e-01,1.230978004114070323e+00,-3.640035219715207493e-01,-6.985501222750740702e-01,9.514735756492540553e-01,6.892623657132290749e-01,-9.223925055586118527e-02,1.060901942981229418e+00,1.160686711422381556e+00,-1.138067197352975013e+00,-4.428477304703248851e-03,1.444422562196335358e+00,6.599693004708979682e-01,-5.145554059135364344e-01,2.010881158184821604e+00,-1.063385163351263096e-01,7.289294424020063001e-01,8.070686149846598156e-02,1.140902704772583265e+00,-4.981864721266950347e-01
1.177063507499307216e+00,1.393894092726422063e+00,-3.110878763960128746e-01,-3.783291738692935446e-01,-3.826320810087576185e-01,2.959719761798743076e-01,-6.435330912089916033e-01,6.577590562426962606e-01,2.103338611223367849e+00,5.327893051884234898e-01,8.001652153879071916e-01,4.982968164918240572e-01,-3.742693783045397682e-01,2.144523768791294915e-01,-3.465303192391346321e-01,2.570240807994832455e+00,3.465022734625712864e-01,-3.519193470037097760e-02,9.409817890761250359e-03,1.814780808254611300e-01,-7.538642271370129544e-01,8.233779038958326524e-01,-3.613839934487088623e-01,1.023004711924932475e-01,1.258535053841165263e+00,-9.174048098923723860e-01,-2.416541350887713158e-02,-4.974218323537293873e-01,2.632898933023064547e-01,-4.148454117956594800e-01,4.330748421701686723e-01,2.208646687287785682e+00,-2.652816150160534625e-01,-4.962407798108175450e-01,-6.495031566630437014e-01,-8.448672697155445999e-01,1.572304938931681217e+00,1.113994970127011097e+00,1.186803559481830916e+00,1.623558253856228539e+00,1.108774690621607828e+00,2.645493910981505659e-02,4.232663507898474231e-01,5.321668769753363781e-01,7.932474896028718359e-03,5.949641991312788480e-01,3.295500257381116072e+00,9.249028229561599701e-02,1.469959652424902563e-01,1.408696761615863213e+00,4.448621308328069013e+00,1.217495355468293239e+00,1.239510387123759383e+00,-5.672925695646888755e-01,-6.497148785832782547e-01,1.408711232553056858e+00,6.541079349960566836e-01,-3.005658733070056821e-01,-1.008216478588544573e+00,1.738604622538402866e+00,8.635541226081417943e-01,1.384669102459560319e-01,-3.997633236659668965e-01,9.249795102384114065e-01,3.913121543034026040e-01,-5.321766904005502674e-01,-2.482657730061111900e-01,7.232044005923932151e-01,4.063054392801167952e-02,-7.221573385677158008e-01,3.427418741421014214e+00,-4.122897738098008080e-01,-1.385663752051694009e-03,4.824292924762371149e-01,-1.909538436033528241e-02,1.307150532567327605e+00,4.723726617344827239e-01,1.212669809666274912e+00,-6.035060742224284125e-01,-1.900628419478189723e-01,7.483053966923153277e-01,7.176650330279912282e-01,-6.976435331066863088e-02,7.704556511984415046e-01,1.047868416089434707e+00,-8.026137718613297611e-01,-6.155669001938063323e-02,2.026109985290160509e+00,5.653743902887590211e-01,-7.072535714136541918e-01,2.601486355004249962e+00,-4.433462337477633297e-01,1.431732988793534389e+00,8.835626042964830895e-02,7.004291505449593558e-01,-1.207160849686172988e-01
1.146679280970157144e+00,2.803066941658928224e-01,-3.767538948600203663e-01,3.753339981126198044e-01,-6.954469822922434430e-01,1.047926609957292365e+00,-1.540144738418628978e-01,7.389676205556114930e-01,2.611590050546154451e+00,8.504976832700846812e-01,8.504807918844425885e-01,1.271953420711293137e-01,-4.878987026665277393e-01,-2.324246140644821434e-02,-7.520435716302725782e-02,2.496639068869209943e+00,-2.005711156444766885e-01,-2.985869736549779940e-01,3.906568996699392171e-01,4.975016939431333718e-01,-1.124358137698391102e+00,9.512925747845827340e-01,-1.305535369917133481e-01,1.684321282106226447e-01,8.986329908757458851e-01,-1.646689297820242537e+00,-1.679436181515555349e-01,-6.458807648429872872e-01,6.095276263961595387e-01,1.300150404728626086e-01,9.203507334486874525e-01,2.667272126951943712e+00,1.899386243316560918e-01,-5.593239918830932300e-01,-4.921291872487568719e-01,-9.477121168651206906e-01,1.436611975604121572e+00,1.174068504855795059e+00,8.365153873254196348e-01,2.022683746429240870e+00,1.751525786440623733e+00,2.616822627671569479e-01,4.732411240686286158e-01,6.839388470956726529e-01,1.043028051478699925e-01,4.477192652546811424e-01,3.245060154204484792e+00,1.507335369955629667e-01,6.209317929838682470e-01,6.021417785947228429e-01,5.268258197702934353e+00,1.555013515436798333e+00,1.615886682116134399e+00,-7.092958780387479401e-01,-9.544499555746720487e-01,1.409480671486795789e+00,5.253406803387976609e-01,-7.817325330406972306e-01,-3.411178902162486648e-01,2.331121852663125438e+00,1.493725206027857855e+00,-6.983543488086892959e-01,-1.205473367147812391e+00,4.294221818238602717e-01,-1.565160966136374121e-01,-8.881858379926641511e-01,-8.635928219528743455e-02,1.733828657521991445e+00,-7.031556070112123802e-01,-1.242145397040143928e+00,4.063340804918730065e+00,-1.208259059543677627e-01,3.169991903006121881e-01,1.031385818916164432e+00,3.596345346886954397e-01,1.543911381420520090e+00,6.252806973209696917e-01,7.825901975102164121e-01,-1.582527146258985162e-01,-6.952911319340205898e-01,1.557695694449188206e-01,7.726331471338847567e-01,-2.619112922615008388e-01,7.594208545124132570e-01,4.914009485721566595e-01,-7.704503364933511511e-01,-4.970353280292480469e-01,3.208757651655889553e+00,9.308348295617910884e-01,-1.415490182449298695e+00,3.060054078267667954e+00,1.238949315810284890e-01,1.698874641438439692e+00,5.036053363215416967e-01,1.499463689162316704e-01,-3.998054108178386024e-01
8.822877954240719856e-01,8.904603857888202523e-01,4.851421002237283897e-01,-6.635872456114746409e-01,-2.150673428381489893e-01,-2.388526203084989641e-02,-8.265975375889644816e-01,1.572471208620856153e-01,2.322427257087728236e+00,7.233086587987779259e-01,2.330180885537132818e-01,3.686303422003432417e-01,-5.609980758391728273e-01,-3.266067834015377591e-01,-4.490369234123203768e-02,1.825843020247502224e+00,-5.916886529461459210e-01,8.613135657288208957e-01,-7.314540688059888163e-03,4.944835499146780777e-01,-1.227529422958264282e+00,6.242218760752623608e-01,-1.514077910563835783e-01,5.076820324528844020e-02,1.378684522780055932e+00,-6.712040823659515265e-01,4.080550927727640831e-01,-6.567515759159824329e-01,-2.937159883587127096e-01,-5.002207907546487586e-01,2.171393840552050813e-01,2.905453967718004016e+00,-6.295131201502865981e-01,-5.533638011314667704e-01,-4.228630941376693708e-01,-4.094061823568749259e-01,1.288667016982977254e+00,1.441440951650152513e+00,1.373700827848100658e+00,2.300737400437558922e+00,8.595856217202465510e-01,4.150303986234413212e-01,5.999131783529367823e-01,-6.023706426126039515e-02,5.980557646994659748e-01,5.574836823740050296e-01,3.440819045230893103e+00,-3.353302937993961619e-01,-1.296970998406360986e-01,1.511177579894138479e+00,3.353462398247250231e+00,1.120577943545577160e+00,6.109527601306667943e-01,-3.775107088343969686e-01,-1.054782445972826999e+00,1.821463497562436418e+00,9.522941683419677839e-01,-2.540323066573101363e-01,-4.460032831523120800e-01,1.679695578482972351e+00,1.187898243684137878e+00,3.541300863247092146e-01,-2.498635770757436092e-01,1.748670756685993144e+00,1.154615755703264135e+00,2.425166733336913960e-01,-1.001403031912023733e-01,1.432725549996710868e+00,5.996211765945776984e-01,-1.073992583208991825e+00,2.705178562757750704e+00,-7.220983796412403510e-01,4.217759629270079746e-01,3.628047855232194308e-02,-2.712459271390573745e-01,1.245325267335376740e+00,5.983489951627483094e-01,1.041522884585735387e+00,-1.062283325949783253e+00,2.102342642940567830e-01,-2.309073918035009498e-02,4.852389428267515070e-01,-9.553677490394973937e-02,1.329713571452885157e+00,8.882021156837346387e-01,-8.967626201777542105e-01,1.839320322027801768e-01,2.403088725321759433e+00,4.312258663588657281e-01,-5.593799173351471365e-02,2.497633895747438881e+00,-4.477412022099942490e-01,1.161676384495894165e+00,2.499984988468598457e-01,7.337692275160170308e-01,1.226091481049172982e-01
8.309474360065942644e-01,8.801868988435345154e-01,3.618635425008420725e-01,-1.845277999072942321e-01,2.888988734956990378e-01,1.429990046641687607e-01,3.383719226528901225e-01,-3.257015489725603175e-01,6.424554178279009431e-01,1.413067437661981729e-01,4.673565697674708641e-02,-2.026154439931455165e-01,-5.520098361870022785e-01,2.269461585707435169e-01,1.810555128269297764e-01,1.092718576850333356e+00,-7.958224351104907779e-01,-1.531038477696513023e-01,3.213572062488965209e-01,3.896804218484716253e-01,-1.102297146630866420e+00,-3.973954881318595422e-01,-6.107637841235351583e-01,4.304092928476344060e-01,1.165897940454612147e+00,-1.225513696741627190e-01,3.750739050107290140e-01,-6.545410370423712099e-01,-2.831700890600485909e-01,-3.467656528809254235e-01,5.407649548241840742e-01,2.399944849613152797e+00,-6.268923674437387739e-02,-3.519924579992119162e-01,-6.227083892216880301e-01,-6.750384255819680268e-01,1.095113579871286547e+00,1.167322153890278269e+00,1.018171988883442403e+00,8.568267738207573370e-01,6.893449216941049951e-01,4.395342672111284266e-01,-8.631729720381041415e-02,2.290443930124992922e-01,8.252564697204005650e-01,1.019270255442901840e+00,2.517703784917159737e+00,-1.000592100953491409e-01,2.222362756855514876e-01,1.225682643716775377e+00,3.639112394056874145e+00,1.017148438974939229e+00,7.175539785269391402e-02,-4.547877946675933369e-01,-3.521969595768292827e-01,1.122985642315992294e+00,-2.383095375088829515e-01,-1.700723134890640975e-01,-1.177642895249153554e-01,9.950349249234213822e-02,1.218833986603424790e+00,-3.403698436506676916e-01,-3.664030490798360074e-01,5.830969925863033199e-01,7.135166951389662060e-01,6.382497673512027569e-02,-4.114104122988110346e-01,1.215971332029417873e+00,-5.274381877189192602e-01,1.690137523368740458e-01,2.321709208677652292e+00,-6.877976104008753921e-01,1.243147461662342385e-01,9.839335703868905547e-01,-1.568550735853266875e-01,1.615721430954299986e+00,1.872217663274265420e-01,8.417131036123748355e-02,-3.185509427367934077e-01,-5.757351464088403814e-01,-2.144815634235772706e-01,-4.724981752241579902e-01,-2.517782615987740336e-02,1.397642456888257279e+00,6.594773203904380487e-02,-5.151541192220981946e-01,4.183542830078051944e-01,1.566624978431846005e+00,6.649938683944631723e-01,2.616947160215590817e-01,1.374814458225713798e+00,-8.846765016647064606e-01,1.103354201445045923e+00,5.072638184116824434e-01,7.677722604826572872e-02,3.940242223727641324e-02
9.914386188690964552e-01,1.352676019308282740e+00,9.954989725196057571e-02,-7.713812418163918938e-01,-2.270201053687437298e-01,-3.841660525808116011e-02,-7.557384157627717869e-01,3.336800720257475650e-01,1.969052264944225472e+00,5.374389974070988840e-01,5.080109127050569384e-01,5.100279633691835457e-01,-4.315929513957492136e-01,-4.239752969178682551e-02,-3.191065689341170408e-01,2.151327265526432164e+00,-2.468116002948189669e-02,4.864464607761544990e-01,-1.268591868648750731e-01,2.225214729707126748e-01,-8.562458506506150924e-01,7.205377369754643047e-01,-3.139028920430578240e-01,4.705450747197895134e-02,1.492001072809973072e+00,-5.216515005632198498e-01,2.350548431639576386e-01,-5.570248965471680247e-01,-2.958355511596560961e-01,-7.272274992502961721e-01,1.684716235650668692e-01,2.479959808183960668e+00,-5.827739425575719778e-01,-4.108684124035635876e-01,-5.794221476649821234e-01,-5.659108700187546193e-01,1.500712461278248755e+00,1.221576260023193194e+00,1.521368992155646360e+00,1.845360714488353704e+00,7.687579889007167822e-01,1.960932360618447279e-01,4.722995303378259568e-01,1.281933453065942086e-01,2.930065035432314335e-01,6.135007097782447794e-01,3.295250255378511461e+00,-1.446370885329627543e-01,-1.252826346015536441e-01,1.537709582296851618e+00,3.659613082194436817e+00,1.215260488208793621e+00,7.704976329090472698e-01,-4.093712782778241022e-01,-7.742295125130620459e-01,1.668886321814182061e+00,8.749766492696063880e-01,-1.317860917505382645e-01,-9.201603296785781927e-01,1.692617838622420656e+00,7.375019333261834120e-01,4.251530774796445922e-01,-6.111751203033360946e-02,1.455437294732797593e+00,1.012489652170847521e+00,4.464572663367538663e-02,-2.663945155029525114e-01,7.891286129781516223e-01,5.621396898980149937e-01,-6.573360874346780847e-01,2.774062918079140516e+00,-5.975607620107901141e-01,1.480667855300905611e-01,2.020223028023626632e-02,-2.448259453330593471e-01,1.107008416496149561e+00,3.699989397066356100e-01,1.212187531684090880e+00,-1.062369462355885696e+00,1.366151646904261163e-01,5.665988981156026005e-01,5.926077059625496357e-01,-7.786659632149151022e-02,1.170765341493877676e+00,1.158233309892698681e+00,-9.572579184858152068e-01,1.927115783397524151e-01,1.790780676907728353e+00,4.347793315102863598e-01,-2.262745982172891801e-01,2.364108092362676938e+00,-5.411418192383720127e-01,1.144763790586055485e+00,6.589526449958293952e-02,8.227791442069853911e-01,9.209430368739779382e-03
1.132917931124481248e+00,5.365901369033547752e-01,-5.471173886622320293e-01,2.675234042474411433e-01,-6.331515696470310095e-01,1.192115628509455405e+00,5.487656148194752781e-01,6.303185894854171911e-01,2.125552466759649928e+00,3.919615584991705814e-01,3.827835385726535145e-01,-8.716953402523613947e-02,-4.866380196869996011e-01,6.420119822404987686e-02,-1.872710758109937812e-01,1.913606466424378816e+00,-2.520381389715432019e-01,-7.876569926008599731e-01,2.452541444007992899e-01,2.700015909067366437e-01,-9.093782620915829007e-01,7.192389044228237882e-01,-4.186479166924820250e-01,1.672533710657241324e-01,1.162937996893349757e+00,-8.591900648857847544e-01,-3.924685572935807665e-01,-6.763872403048131199e-01,-3.767536404330279476e-01,-4.321717015367614323e-01,9.537842354464373118e-01,2.544459396803030682e+00,3.319610737880535623e-01,-7.167922227121881207e-02,-7.505886938613930415e-01,-8.495194503031212596e-01,1.959546875239553065e+00,6.270558237876489027e-01,1.022361230346777061e+00,9.882627010613093121e-01,1.612639112154649723e+00,4.424551949414329277e-01,1.811249889407912095e-01,7.144932893384323691e-01,2.969056683117120565e-01,6.656395320439847385e-01,2.710914647473762429e+00,5.856218425031926023e-01,8.034749757057344510e-01,-1.023333354930417993e-01,5.500705859195909042e+00,2.199280364551501332e+00,1.480261568633594926e+00,-4.663477206358965232e-01,-3.269603840584293097e-01,1.063361214475248673e+00,-1.947415785338664218e-01,-8.498810625903004956e-01,-6.239973882083735823e-01,2.106376690346294378e+00,5.046552397548543789e-01,-8.186876102256170906e-01,-8.640040726820497063e-01,-4.058001229660100906e-01,1.931166382208202581e-01,-3.940951132893625308e-01,-2.099357205249620661e-01,1.463760465750535644e+00,-1.000169373572904918e+00,-4.611177161377095768e-01,3.494737234298304518e+00,3.604177077790943207e-02,-5.400282856044814894e-02,7.170578920398215095e-01,6.412444494086549929e-01,8.981641515369016560e-01,2.072560448360721841e-02,3.501281971129099890e-02,-5.939137282286683917e-01,-9.609537995656167730e-01,6.269254646963351441e-01,3.688942170500622009e-01,-5.521369551577333112e-01,1.196044319965381408e+00,3.121627330994619642e-01,-9.719888242205059203e-01,-3.916424974036518125e-01,2.131979888223120678e+00,1.316831259189937375e+00,-1.975114509506902705e+00,2.444599383991013397e+00,-2.791897329056614030e-02,1.795623859805617117e+00,6.350758684036830193e-01,-9.968937280648881849e-01,-7.465788865878402181e-01
8.906810811967703634e-01,1.358356971741343289e+00,1.043519680304015207e+00,-8.378252329845483626e-01,1.030309621903751499e-01,-4.592071760747289955e-01,-1.119373078292102974e+00,-7.229660714051067139e-02,2.595609085029344953e+00,4.939091690751059582e-01,-6.191031434630462904e-01,2.830660434406880865e-01,-7.217955683427097480e-01,-3.710727038925030752e-01,3.506199976859225576e-01,1.144480463288915839e+00,-1.031737494996727511e+00,1.235422199721313952e+00,-5.067476177982272595e-02,6.878369356711732108e-01,-1.574770612684176507e+00,7.099219064785416977e-02,-2.726377320187659548e-01,6.915210119934918354e-02,1.313034624094434388e+00,-1.590262558476090715e-01,5.928615464001744106e-01,-6.738585537376773349e-01,-5.174064913628568796e-01,-4.077851166815954498e-01,1.272977167246908681e-01,3.034028990507882995e+00,-8.169503742716048844e-01,-7.514917468173603066e-01,-4.590993460293973372e-01,-1.532800914253211744e-01,1.283021015101305728e+00,1.501630778590471227e+00,9.129746843885104823e-01,2.026220830550672147e+00,6.677195767137531490e-01,6.135179971214070882e-01,6.423709965281217960e-01,-1.729866848542511160e-01,1.123527380073885862e+00,7.396159432789977117e-01,3.621834777383405424e+00,-3.222775481655579810e-01,-2.594301134402883791e-01,1.968631300260346162e+00,2.610725989297636218e+00,7.089458738906349033e-01,2.113829587851317471e-01,-1.540865554225399614e-01,-8.234551202413895599e-01,1.586269852734343733e+00,4.483452538028621093e-01,-2.677027815068346861e-01,-2.357850551846687459e-01,5.375797420816195160e-01,1.252789854609792641e+00,8.262996651805869508e-01,1.046612555336368100e-02,1.937012444543017686e+00,1.619336211005013348e+00,7.879934929938314792e-01,1.589493890834914325e-01,1.717202586138566911e+00,7.089511218087249933e-01,-1.208684892666070043e+00,2.234477249489399853e+00,-1.171870330898912016e+00,2.966075014064228910e-01,-1.357309399053850674e-01,-3.431015074146194777e-01,1.257894909662566452e+00,8.938965350888543604e-01,5.653560896586665718e-01,-1.221632195600763415e+00,4.607627577914120698e-01,-4.431524298113360683e-01,-7.065952121606089431e-02,-4.028633622126837066e-02,1.469412926182592116e+00,4.816862095056809179e-01,-5.781881400239891056e-01,4.667732614849704476e-01,2.255287355477467059e+00,3.600126327577179985e-01,3.829540641598613848e-01,2.185876961301764343e+00,-9.886064653835758831e-01,1.404435863173583598e+00,3.658925932921758273e-01,2.189661240877675552e-01,4.759403414367363583e-01
1.058771302845275875e+00,1.495097484197784876e+00,3.041603747207832775e-01,-5.960993480067003913e-01,-5.776690662531154541e-02,-1.899924023772958659e-01,-9.998501518826430345e-01,2.960030255774904751e-01,2.095210351099829005e+00,5.292964772524295647e-01,3.538236066308895200e-01,4.659406393383435652e-01,-4.934260573723914800e-01,7.963426001083727390e-02,-3.401659847855509344e-02,2.091466724360241614e+00,-1.308136943896696658e-01,5.539633952885675283e-01,2.017500017102239612e-02,3.949438494457653825e-01,-1.077454123200026537e+00,4.024446624942619177e-01,-3.389157487072087527e-01,1.409378292694477286e-01,1.218478722514660939e+00,-6.638839826879999739e-01,3.398394731714001749e-01,-5.295871696485605629e-01,2.436827392245202173e-01,-2.844286041143644361e-01,2.516379021088042678e-01,2.420005687441325826e+00,-5.406749522200544611e-01,-7.362660446159372540e-01,-5.373617675002548832e-01,-6.212858600973950596e-01,1.246975628426499005e+00,1.422872742673346957e+00,1.019311897973988801e+00,1.858434231617215104e+00,8.206026020832331014e-01,1.583118437579680848e-01,4.959277891712752795e-01,2.456964233000814568e-01,4.143696975870637123e-01,6.796304074742232082e-01,3.481060827857768381e+00,-2.174508165099606205e-01,-1.247180523838991167e-01,2.013995490682249923e+00,3.486692827352689150e+00,6.825564892825508601e-01,6.967377611910974267e-01,-4.743561205601466990e-01,-7.812404381962998468e-01,1.497533439010208856e+00,6.688370735930726507e-01,-1.494202012340825614e-01,-6.577302231709283298e-01,9.474717958267004914e-01,1.278134211578291657e+00,5.119629852030561645e-01,-2.193382891345838359e-01,1.560144075223111493e+00,8.006917147348378005e-01,-1.332375343614664032e-01,-1.218567462836283033e-01,9.970888949186114125e-01,3.860984258255647505e-01,-8.990991828346330816e-01,2.954946896668127820e+00,-8.349849047609978481e-01,1.509839285994797331e-01,3.981948049390150457e-01,-3.166942225085622176e-01,1.546552792317470892e+00,7.701689099581039422e-01,1.152415313883236481e+00,-6.566618071368608422e-01,1.445654878432066637e-01,1.632517878834363056e-01,3.722176327325762424e-01,1.019566032692651447e-01,9.110269596700173445e-01,8.546520666599123350e-01,-5.786861919387042974e-01,2.436376490128457917e-01,2.149184064123994986e+00,3.016497554025446837e-01,1.516806989259960603e-01,2.378233882612955874e+00,-7.946427040955661436e-01,1.315089744006173955e+00,1.143288099888941367e-01,9.377525464034364155e-01,2.960429145244839466e-01
1.276636965099890331e+00,2.000147557864225600e+00,-4.907090618472393362e-01,-3.064190183299648762e-01,-4.741533319557543480e-02,1.482661594623755907e-01,-3.230392814936370871e-01,5.522219678475243088e-01,1.213847265533070319e+00,8.521330855973369145e-02,7.414757790080823696e-01,3.920621633453236221e-01,-3.072732343931319221e-01,7.228049899477685392e-01,-3.253798844666348500e-01,2.417225211313412281e+00,6.598927784521384510e-01,-6.206986287054453433e-01,5.734950265123309882e-02,-7.113146920667494377e-03,-5.171773959753374061e-01,2.729480585356708344e-01,-7.229944898739461001e-01,2.815044449796214043e-01,1.180003108447660987e+00,-4.877046828890727048e-01,-9.178129518361918815e-02,-3.943053001568161409e-01,4.117079975206441311e-01,-3.963458253195557557e-01,4.938901493184416625e-01,1.623425651762676836e+00,-6.233662512810403400e-02,-4.594536159158204014e-01,-8.577787824799982808e-01,-1.044933258482765748e+00,1.579397784979137853e+00,9.137245393475474931e-01,9.222418274148939110e-01,6.154624876233008024e-01,8.997180084074281048e-01,-1.443415322609833962e-01,6.482518989090188533e-02,8.118816288683616822e-01,-2.309601512743741925e-02,8.902314580087290485e-01,2.927190785834889120e+00,3.068728412571140041e-01,2.235231104024423265e-01,1.657806668443270848e+00,4.541127746381881103e+00,9.426684615079585772e-01,1.029013254918475617e+00,-5.987297810815539467e-01,-8.521765577189194252e-02,9.052357653366718271e-01,-2.727650939027437271e-02,-1.350253957061289534e-01,-1.185221735116676722e+00,5.925234283469664742e-01,6.796786698992891562e-01,1.148348927390278051e-01,-2.389843454816976409e-01,3.511553310714885523e-01,1.473209177739569498e-01,-7.093719701768284036e-01,-4.175904368107737907e-01,1.568237957001442640e-01,-4.134188417356959855e-01,2.715380174434012250e-02,3.270037746805407153e+00,-4.941412746043044035e-01,-3.876920893626744635e-01,9.103752785078462750e-01,-2.765981971282779894e-02,1.494783026348734722e+00,3.224445999029700860e-01,9.131776907813076161e-01,-2.194765525204418477e-01,-4.650601859008326455e-01,9.742457298581990166e-01,2.459903715254641021e-01,6.996124188241614750e-02,5.890162486521535179e-01,8.076282234673868299e-01,-5.018334119538534477e-01,1.435740838287270782e-01,1.215701699836488681e+00,5.615959693349510395e-01,-4.344233110850911905e-01,1.968451924209828174e+00,-9.318218554623871608e-01,1.480172459987383338e+00,4.068964774769792681e-02,5.252233311864724641e-01,-4.655132615383711370e-02
1.137722711440907641e+00,1.505204335332311238e+00,-6.019709495137470778e-01,-2.843963447304747039e-01,-1.689851480203209411e-01,4.283300853150890375e-01,1.734431953607713794e-01,4.371443455107859588e-01,9.146409275736070432e-01,1.216805836075568192e-01,8.451049017418683640e-01,2.511499948962427342e-01,-2.907776341288368926e-01,5.572239386191256694e-01,-4.749423827574305035e-01,2.260682414402390261e+00,4.755512398147030972e-01,-7.524310825743784070e-01,5.477938527818315001e-02,-7.734738063499829730e-02,-4.247266120235891895e-01,4.284207657336945863e-01,-6.767105870197032136e-01,2.628070526069747892e-01,1.353876984694796226e+00,-4.136189642936908828e-01,-1.431037487451772561e-01,-4.763301003215773544e-01,-8.604962170839258739e-02,-6.910261282923220172e-01,5.264656302112564745e-01,1.804517001718039193e+00,2.276164739412406268e-02,-1.389522089967336060e-01,-8.459510189324666030e-01,-9.996250062589693286e-01,1.680361717887363548e+00,7.669072905273649488e-01,1.341227431445638274e+00,6.139087011225086155e-01,9.084646588119653643e-01,-8.271109744388882579e-03,-3.154062081131300127e-02,6.704661941713503381e-01,-1.513293994219577776e-02,8.529559894511001827e-01,2.605999025989973461e+00,3.237401149929381439e-01,3.222970226981566322e-01,1.015402106239267743e+00,4.742864959528459323e+00,1.480794637855808560e+00,9.820196368960940614e-01,-5.694449812365538488e-01,-1.334490061855722054e-01,1.058267908803983914e+00,6.114420987072410885e-02,-1.764369575182776206e-01,-1.145405580745422203e+00,1.215845742925485418e+00,3.886836360839486249e-01,-2.426339945797429398e-01,-2.646128969563629196e-01,1.308804319855202403e-01,2.644721631408757379e-01,-5.520998747529082262e-01,-5.715353071430332443e-01,2.320451257961719804e-01,-4.745405497310051235e-01,3.006790566803743681e-01,3.063330505873785192e+00,-2.379712972662162973e-01,-2.748400334737802209e-01,7.658220835893750911e-01,7.394726547959250273e-02,1.203184792013302529e+00,-8.161629725145463921e-02,7.547529034039180962e-01,-4.455620445212462588e-01,-6.406020521134969670e-01,1.075832686691769124e+00,3.081678926293265897e-01,-1.204224908337514777e-01,9.281951516077873166e-01,8.544908896325486003e-01,-8.240506849806648049e-01,7.918917791593005351e-02,1.070725218529343437e+00,7.605256158183214543e-01,-7.468516122232597976e-01,1.863449308911736324e+00,-6.144174608335697396e-01,1.275105449584705841e+00,1.344423680044883052e-01,2.968777593478232890e-01,-3.530305486076888988e-01
9.502559117325591886e-01,1.051811391600074419e+00,-2.019413419190041470e-04,-3.227932366914094686e-01,7.384792565585636404e-02,-3.050892868959137472e-02,-5.073426027113130399e-01,9.303051256503380717e-02,8.568061400312401155e-01,5.871164634380034997e-01,1.183213345708454378e+00,3.539521576714471651e-01,-3.456324025632689367e-01,3.760199525864363901e-01,-2.019741082457228165e-01,2.425713321143916357e+00,9.789977956260903502e-02,8.941842507440783683e-02,2.626490638969805058e-01,2.583145824927660650e-01,-7.937994600059339323e-01,2.923637480096570873e-01,-3.746534126618381033e-01,3.533340589713670488e-01,1.117454622141361709e+00,-9.827370847895620098e-01,4.262126838840141207e-01,-4.937989756709231792e-01,8.050616078689607491e-01,-1.189030734829557012e-01,3.453228188079450756e-01,2.072685276488450246e+00,-2.765371244634885484e-01,-6.847020976446931417e-01,-4.696701915713055731e-01,-9.700362262267061553e-01,7.693331231432706252e-01,1.569614834576602114e+00,1.276753952589960717e+00,1.815291313195384504e+00,7.214128713418775929e-01,-9.135398970137315056e-02,1.845399148328071837e-01,3.335014168114989186e-01,6.712725341199549112e-02,7.211053064289177916e-01,3.030501735977726874e+00,-4.600705967826450582e-01,-7.275376823764344303e-02,2.037886300084602365e+00,3.750102215105852732e+00,5.161578088983116430e-01,5.198447627364873869e-01,-8.019511415169127133e-01,-9.204723002874678484e-01,1.567042525819549059e+00,8.932882061336943069e-01,1.154063088712046770e-01,-5.108318977050277931e-01,9.386312034750404765e-01,1.727648019871415475e+00,-6.894135907227738613e-02,-4.879526449682067835e-01,1.428998371655000987e+00,1.920586877237919765e-01,-7.786747966028266799e-01,-5.300266559435177216e-01,6.247991449615502013e-01,4.065612830424560759e-02,-3.107236571917753043e-01,3.112766774242894385e+00,-6.241926052738120401e-01,3.142054952557426506e-01,1.131885283855107449e+00,-5.118512639326030511e-01,2.088027530923079134e+00,5.377604393354182832e-01,1.485013999868455503e+00,2.132086674743893795e-02,-2.370754895780960991e-01,1.303318334979866044e-01,4.228793945461425952e-01,3.161477859952656067e-01,7.173165720739137496e-01,9.143150666036070628e-01,-5.485233976851288107e-01,2.550167677658649046e-01,2.115684633909270751e+00,1.633010775462914177e-01,6.500735774693229274e-01,2.113867774345901118e+00,-6.324646287498101316e-01,8.221745155635171720e-01,2.317292711703072827e-02,1.845589218998808789e+00,2.384160878993494270e-01
1.123748360252678324e+00,1.942513260295108068e+00,-5.576734214455374428e-01,-5.963052498945253799e-01,-4.526342763583131312e-02,2.482285228899500928e-01,3.305585900238491859e-01,3.308601164207417011e-01,6.816644091082112444e-01,-1.913892015608412434e-01,4.390898639801960046e-01,2.377601071385948006e-01,-2.951200638365377715e-01,5.861669885831742866e-01,-5.515311432132748992e-01,1.866647663295958548e+00,4.780617014950722665e-01,-7.979203626624189472e-01,-1.476641393360411392e-01,-2.316301561618858695e-01,-2.949840639353752958e-01,2.565426325429078780e-01,-8.659008519375922530e-01,2.191038336067264169e-01,1.603900695910415175e+00,2.484289065922923034e-01,-1.860001559373371249e-01,-4.706755325900657816e-01,-7.935707915823431158e-01,-1.145321307588047288e+00,3.836686414637967557e-01,1.719735646555758279e+00,-8.853742453668642098e-02,1.124687349477005438e-01,-1.007496403006657548e+00,-8.424901975892662431e-01,2.006779165952005783e+00,4.867199892654832660e-01,1.509292144540806069e+00,3.688753542298883747e-02,6.504220576775751050e-01,8.596662195761822778e-02,-1.462296710572918435e-01,5.818997854301362072e-01,1.571802590772418684e-01,1.000175525092428019e+00,2.408548643223605623e+00,5.176232166311361960e-01,2.572323582162936439e-01,8.860949252889928074e-01,4.503732904165538287e+00,1.719630825625448223e+00,7.657619296690717503e-01,-3.525193523725246858e-01,2.518538556251797011e-01,9.051729927977205659e-01,-2.808394480722805620e-01,-1.065457907858110703e-01,-1.427261131410295203e+00,9.131962718962080006e-01,-2.995868584432758164e-01,6.276763796885770352e-03,1.701475034168037914e-01,-7.443394431610661499e-02,7.283209765627196575e-01,-5.866057605233071515e-02,-6.175004537404614746e-01,-6.729134314724094512e-02,-3.423190584247302048e-01,7.446230097476651544e-01,2.513031692452170507e+00,-2.940418934094293779e-01,-5.309252360864783471e-01,3.419421808916209837e-01,1.132341573731490830e-01,7.502304917488512581e-01,-3.901145587264855941e-01,4.267716084894851436e-01,-8.992209680817118134e-01,-5.628064316020311431e-01,1.399397888964895253e+00,4.859089272318320440e-02,-2.405440032974128228e-01,1.226796528148592191e+00,8.809324333312585908e-01,-9.397810363202976358e-01,2.757190302081314881e-01,2.395082791505127595e-01,8.614842705898132502e-01,-8.277487597122963336e-01,1.437234259836808636e+00,-8.716876304302078049e-01,1.285051418758905051e+00,1.177180456009398191e-01,-2.441801486749717864e-01,-4.209416571979730515e-01
9.815873181043747175e-01,1.376438649614516674e+00,3.311106148112440417e-01,-5.924152932891658674e-01,-8.421723953410345520e-02,1.312766316126832145e-01,-1.503392500121937814e-01,1.194495072785143330e-01,2.006133768699073450e+00,1.383538430702367927e-01,-4.758823231610276872e-01,8.153214048619328302e-02,-6.044413861706491309e-01,-9.465628837767144088e-02,2.737161407058702478e-02,1.140726249479823373e+00,-6.484772303357592138e-01,2.024212860228409294e-01,-7.618731209102055923e-02,3.367563524956332377e-01,-1.119953084671635457e+00,1.597917104804940647e-01,-5.367419247949241079e-01,1.036693270793055122e-01,1.460363691472342129e+00,1.319444319869359783e-01,1.120624793053722063e-01,-6.626586217786392119e-01,-1.051522185707503887e+00,-8.196639868545705365e-01,3.845174440522312054e-01,2.675142664480534727e+00,-3.616708475802906664e-01,-2.044701810814863463e-01,-7.450154870893397341e-01,-3.643333273114650606e-01,1.846699023366413339e+00,8.489246482426673346e-01,1.122357284956012613e+00,9.615152811117202436e-01,8.384901349043989427e-01,5.956326866300609701e-01,2.782570237439866978e-01,1.694638753478769355e-01,8.816298772926114413e-01,8.635615436411816503e-01,2.963038666010759492e+00,2.582266677080032879e-01,1.736759181528234885e-01,9.216378958960236289e-01,3.726774974468933799e+00,1.575672592157847163e+00,5.550871303475026775e-01,-1.253542470254064289e-01,-2.234663467632665435e-01,1.184512375692025721e+00,-1.828613679602844044e-01,-4.367623839664671603e-01,-6.604582742577138621e-01,8.984757970017261952e-01,3.123415672922902342e-01,2.524195680243470630e-01,-2.631052388290283650e-03,6.384772548745605292e-01,1.334421967540484255e+00,6.440879260959804231e-01,-9.517893369136154469e-02,1.270744115518840811e+00,-5.312305251199390954e-03,-3.657386388561730817e-01,2.299392630009251093e+00,-6.628264580166430830e-01,-1.036028842602231687e-01,-4.808032634786699178e-02,1.230515329235596506e-01,7.367974859300392421e-01,1.844314005411630819e-01,2.570735941556473447e-02,-1.272433899679318969e+00,-1.644378771847805620e-01,3.414345715077195531e-01,-1.393712273574976290e-01,-3.576360939767309621e-01,1.597964739451131155e+00,4.126259127079334732e-01,-8.423565501369507658e-01,2.720696379151129052e-01,1.387956555901864508e+00,8.770499634127498778e-01,-7.002397376966487119e-01,1.847285382074552951e+00,-8.035001654174873664e-01,1.550656142569414087e+00,4.664727087680444750e-01,-7.693204478406614477e-01,-1.420004752539159032e-01
1.069174972664941992e+00,6.392511910002718345e-01,-5.625394627561269845e-01,4.049560966107090820e-02,-5.230409721275224300e-01,9.274483829542308211e-01,3.444664777760283458e-01,5.365314642132904543e-01,1.650259822539506649e+00,4.662696411224312998e-01,8.109659524081407334e-01,9.127292378824837515e-02,-3.899737500919048250e-01,1.507852336281283456e-01,-3.658992997071611741e-01,2.216045029666478428e+00,8.665502704196081929e-03,-6.273965251294020273e-01,1.919660958962454422e-01,1.572334714784433263e-01,-7.195961891489927043e-01,7.845784630716193808e-01,-3.962122162792863778e-01,1.861158326133558472e-01,1.259812259286978930e+00,-9.038091833261694408e-01,-2.247287205267817500e-01,-6.171136569954928097e-01,-1.683445641295414630e-01,-5.188859024603323933e-01,7.484362833475710630e-01,2.363168709195798911e+00,1.603425655899373692e-01,-1.117021324017720141e-01,-6.916351014253040441e-01,-9.152603607575062750e-01,1.712803780660806519e+00,8.138595790715351663e-01,1.336297248760141221e+00,1.227765380785450056e+00,1.346206564168097364e+00,2.450403674709555890e-01,1.618375695589215346e-01,5.965204957909859829e-01,8.631322147372627596e-02,6.398249435683380781e-01,2.717280245936418925e+00,3.151290699058459377e-01,5.554417791390812154e-01,3.323385987973066502e-01,5.159895821620894552e+00,1.930953586727012894e+00,1.291949365714563758e+00,-5.766219370974891012e-01,-5.057167519794661947e-01,1.287188367699133140e+00,2.618321233429812267e-01,-5.418749835275586957e-01,-7.581237110121943346e-01,2.157068652007403387e+00,6.368622660682102810e-01,-6.668655634037787827e-01,-7.115440947380884396e-01,6.225215089335067731e-02,1.899018372048376646e-01,-5.416492263598569057e-01,-3.996296590944624083e-01,1.040253205258449443e+00,-6.404498651343690785e-01,-2.877294434417431157e-01,3.394699841071742163e+00,-1.463546452747216398e-02,4.211474821961457005e-02,7.303535031709255110e-01,3.315105023920197902e-01,1.091536885228991061e+00,-1.151727191133283812e-02,5.754942615869542699e-01,-5.273362883518019073e-01,-7.795896600930561915e-01,7.298650515872003863e-01,5.473542143304896967e-01,-3.563031256909188205e-01,1.099377186070440882e+00,6.788139371547152745e-01,-1.017169013131380417e+00,-2.522584048929705225e-01,1.970219565750519930e+00,1.022456016716754457e+00,-1.391444846124240797e+00,2.377287502225780447e+00,-6.556309989749187217e-02,1.419721432049709353e+00,3.989647267274961662e-01,-1.048833439024496605e-01,-6.009398567299965022e-01
8.016439276363167554e-01,1.035728606935599538e+00,-4.437530717979606409e-01,-6.510760668449071531e-01,5.004313303955958137e-02,1.034257031744514332e-01,2.520757716368985379e-01,-5.717127634192104707e-02,-2.925100054448017683e-01,3.333496643129389980e-01,1.542919676696427267e+00,3.371448871184819507e-01,-1.707752854464526238e-01,4.617205858683306463e-01,-7.502435747280773448e-01,2.383371845887836571e+00,4.260245422250100167e-01,-3.673150268605465119e-01,4.005059651109344615e-02,-2.017951768096549747e-01,-1.959501478909833616e-01,4.745281637413202303e-01,-5.515055755232897150e-01,3.285641451397267598e-01,1.623825689969905284e+00,-4.004228216695289722e-01,2.874708820801109566e-01,-4.917179695325956112e-01,-1.487197230552104177e-01,-9.882992493894773300e-01,1.754321776695760560e-01,1.817037133582001918e+00,-2.532465835606377835e-01,-1.102590631458225112e-02,-6.418164163675923461e-01,-9.927752493782258103e-01,1.108449578791968593e+00,1.133173764440468911e+00,2.211322363765801935e+00,1.204711774876707553e+00,3.667820986798705496e-01,-1.328047336086996544e-01,-1.515736415300092954e-01,1.884760206744638400e-01,-1.714569646848133067e-01,8.019790276219501690e-01,2.331821393747444571e+00,-3.185271497836559274e-01,-9.024063163556104994e-02,1.337465076390913055e+00,3.959985486299792967e+00,1.303047744980721179e+00,3.344459954896517595e-01,-7.317882442235126295e-01,-6.205434697759282248e-01,1.662599629868739770e+00,9.610982254907668443e-01,3.656615367993283350e-01,-1.041537238267183696e+00,1.587539895988460126e+00,6.739584448234290370e-01,-3.120737306440338754e-01,-5.797810138288148063e-02,9.894900650662741270e-01,4.731623557200411723e-01,-5.374360252913368274e-01,-1.013357321250428544e+00,-1.833491156045398141e-01,1.462577889938125875e-01,7.838704096012809597e-01,2.510681440949916521e+00,-2.345550062178916595e-01,1.518474952355420848e-01,7.399821961105681467e-01,-4.955194579182737868e-01,1.456321726347586942e+00,-3.975188233358628587e-01,1.475158632598488007e+00,-4.655923926019363002e-01,-4.276978095397961366e-01,9.563036877306958505e-01,5.032855247755070316e-01,1.150816871610454428e-01,1.168976861763147745e+00,1.367652116880248681e+00,-1.105843929810054416e+00,3.691107621162703079e-01,8.550504506395674165e-01,3.420159184082645631e-01,3.805269363791703996e-01,1.544083907431684111e+00,-4.550540799634376077e-01,3.265252836453856888e-01,-1.201558739888811123e-01,1.765600358188141650e+00,-2.293554904395652683e-01
8.481072639864647433e-01,-1.260462792187991843e-01,-2.835890344195297064e-01,-4.564848777810637248e-02,-6.627027438315428176e-01,9.663237829947615154e-01,2.206370224102070510e-01,3.644875443015056504e-01,1.878625010207976453e+00,8.825229818949787974e-01,1.002701127825891492e+00,1.042884727347652835e-01,-4.367532434316315770e-01,-2.965436060972836962e-01,-3.733553849769101207e-01,2.223193037421220986e+00,-4.252483403119341476e-01,-5.159240316629987166e-02,2.221131006029043453e-01,3.299584987992368323e-01,-9.195585292835330993e-01,1.103068074252598896e+00,-7.215305440607461263e-02,1.093307240148972542e-01,1.349299835597002728e+00,-1.237381160171965533e+00,1.069582531055632280e-02,-7.295327286708920278e-01,-2.839912380650384538e-01,-5.407383302147835691e-01,6.389109956949936553e-01,2.888098983669272979e+00,-3.652745392640688316e-02,-1.217788064566454609e-01,-4.373139323777853749e-01,-7.475587568473680555e-01,1.436507484155624459e+00,1.126075822938906512e+00,1.744792992534990983e+00,2.193579148968706427e+00,1.348811553136530339e+00,3.968391689853353888e-01,3.680979258379513119e-01,2.044731239625487418e-01,1.596344533537127908e-01,4.214432993112988135e-01,2.862692849403236650e+00,-9.167093473154358518e-02,4.006319058192855942e-01,2.051586584633984800e-01,4.791810870584678916e+00,2.047976425436505377e+00,1.154748137624630688e+00,-6.106137245094683808e-01,-1.117078802689094985e+00,1.848662106044435038e+00,9.916866341115303518e-01,-5.221470778174444050e-01,-4.171239146391088060e-01,3.016368648118187501e+00,1.014974237921448363e+00,-7.720621154616988946e-01,-8.462048881091608354e-01,7.487630543258692040e-01,4.259288989641007994e-01,-3.788754992100591412e-01,-3.979585283750638469e-01,1.506385761539228652e+00,-1.976675595693313525e-01,-7.096029642811068072e-01,3.296387446476226835e+00,2.408915932948857419e-02,5.317653218548469285e-01,5.033610114849295103e-01,1.585862142218519288e-01,1.114479339723880802e+00,2.834655362891486119e-02,9.057488336614634150e-01,-7.432908705106235914e-01,-5.621047111830749232e-01,3.287403463632541656e-01,8.583655927476205871e-01,-3.841070774923681652e-01,1.360987712410020034e+00,8.738869746787658599e-01,-1.285411712075732904e+00,-3.030342397716889180e-01,2.633362154762197704e+00,9.117857493499635924e-01,-1.161210276212181425e+00,2.699032738558805100e+00,3.562504622791770048e-01,1.072400855533771846e+00,4.308419800881397865e-01,4.292654852788456710e-01,-5.971706283167014240e-01
1.031106696972506231e+00,1.265873196662295808e+00,-7.759166108084396551e-01,-3.025710321178498030e-01,-2.066460997029417324e-01,6.799080741944359962e-01,8.427749002266575751e-01,2.955384372467585452e-01,3.902959295056430133e-01,-5.230063484472460833e-02,7.837593094107861980e-01,6.052095369748011072e-02,-2.646020692085070403e-01,5.154970716880791226e-01,-6.411043526597967057e-01,1.935758236420733525e+00,3.599151918052229671e-01,-1.089435246398460233e+00,6.204627347179213215e-03,-2.389543535183155654e-01,-2.400355543326839203e-01,4.194071861352854369e-01,-7.774240834545844692e-01,2.677559262527926531e-01,1.579220371502403575e+00,-4.179343464987161222e-02,-2.651294074638170795e-01,-5.384244909064088702e-01,-7.971266699455299420e-01,-1.122146154091532289e+00,5.642426558202667808e-01,1.833520753209541443e+00,1.578564735140645103e-01,2.895627409106440453e-01,-9.465149087264763672e-01,-9.568094593278233528e-01,1.933751646540202929e+00,4.446841591402932448e-01,1.725900061684583875e+00,1.548796315342293450e-01,8.367893761134467256e-01,1.344263214195021150e-01,-2.499999167830100899e-01,5.964404839158575777e-01,4.115552522959708970e-02,9.284206673103145846e-01,2.123276260430661644e+00,5.015519231926082178e-01,4.649896721628883345e-01,2.987177831094683933e-01,4.989851988573354546e+00,2.096371083771252142e+00,8.720947445820596000e-01,-4.718840935690468141e-01,9.881342384163577242e-02,1.015182610699077559e+00,-1.711341319206484135e-01,-2.034949729004594254e-01,-1.238387353519210254e+00,1.521604482562433081e+00,-2.015098208223508880e-01,-5.708255053110201649e-01,-1.463492719971557776e-01,-3.820289236474715411e-01,4.466280411346352786e-01,-2.867250299167642957e-01,-7.650549062913789555e-01,1.175191765593929238e-01,-6.643085906567176568e-01,8.789732720768014262e-01,2.686249248393892675e+00,1.411819502840561125e-02,-3.513815876408620253e-01,5.915297825002224785e-01,2.409811902468260714e-01,7.751569443361853162e-01,-6.331960910055669522e-01,3.615032560217285029e-01,-7.297646419644215898e-01,-8.987109005050850641e-01,1.353024810464193761e+00,1.782864418555226982e-01,-3.504816608671996736e-01,1.324091835169862730e+00,8.208391465651454499e-01,-1.122009279852203445e+00,8.902703749836179958e-02,4.889556316023799809e-01,1.042164413878963192e+00,-1.142852889903936964e+00,1.498016124150094885e+00,-4.639169222151670047e-01,1.134744396756177220e+00,2.394989050606889658e-01,-2.635075184623426048e-01,-7.072751066833868894e-01
9.864246303249057934e-01,1.247862676788301428e+00,-4.279454695909181150e-01,-2.624381083113408453e-01,3.640219689285703608e-02,3.765318834272320947e-01,5.117122150014972171e-01,9.196690446472866043e-02,2.796850491828223317e-01,4.865916255258651013e-02,7.847376835896959779e-01,5.760419411699685410e-02,-3.136230801304303872e-01,5.528467700237820193e-01,-3.896366872973076045e-01,1.887110010420537165e+00,1.631402716152919319e-01,-7.721327328590312788e-01,1.491153265421247820e-01,-5.089563181042024848e-02,-4.656413687585034822e-01,1.131817582134513889e-01,-7.267478235702113931e-01,3.691261045454787837e-01,1.371278481504458968e+00,-2.099067509771776197e-01,1.830085839152006955e-02,-5.244263640750351785e-01,-2.482991616026525294e-01,-7.246201066944972791e-01,5.185774793252517778e-01,1.851053186874461964e+00,6.335749300532272921e-02,-5.627202715144064005e-02,-8.090211782150250608e-01,-9.691678766475231299e-01,1.463006264099055542e+00,8.232396142974323094e-01,1.452163200756590777e+00,4.786870165256114085e-01,7.228105963503532738e-01,8.301095699551763740e-02,-2.079994569586888220e-01,5.230452227356778838e-01,1.651240165333720533e-01,9.598874577980680556e-01,2.313341061943173571e+00,1.800586900782153998e-01,3.009701835467923914e-01,9.588853450178032034e-01,4.458066880106022367e+00,1.437349411483813899e+00,5.747231419019964704e-01,-5.753206399021015827e-01,-1.252878511701049913e-01,1.072728075536451886e+00,-4.618529954073757882e-02,-6.163564455605362313e-02,-8.841312928862472553e-01,8.705685957627087301e-01,5.203463669320546048e-01,-4.384830874441523196e-01,-2.455534005928017571e-01,1.222556147116222736e-01,3.526767101168433172e-01,-4.139969956778644100e-01,-7.053978593024053945e-01,2.953409747583153888e-01,-5.722743518424971976e-01,6.547606614418218784e-01,2.690181925337252533e+00,-2.798923706110480469e-01,-1.708312729382896467e-01,9.256470708293456084e-01,-3.734725212536391115e-02,1.324262168127050998e+00,-2.422474876324677284e-01,5.492464768888000171e-01,-3.523029425657544511e-01,-7.516402727013800078e-01,8.106208398639440649e-01,2.147141162068169629e-02,-8.178728481139180273e-02,1.141709052446992168e+00,6.635202958858206213e-01,-8.057636092260931360e-01,2.400645803820350144e-01,9.053611911508885335e-01,7.423633436953782638e-01,-3.427052999878060779e-01,1.471482351038122305e+00,-6.798359768915301915e-01,1.025134427329387199e+00,2.163726246508262396e-01,3.464570145237108045e-01,-3.215823102060258454e-01
1.064971022223179187e+00,1.323469910774788261e+00,-2.433932487483625451e-01,-5.647292699157901996e-02,4.448196986687651122e-02,5.254782375186046739e-01,6.878980763781772367e-01,1.074370051667507819e-01,8.166305621646052781e-01,-1.484236092618829994e-01,1.894993843297132496e-02,-1.859515051188678214e-01,-4.695845386627134910e-01,4.802191912430174847e-01,-5.894893610601270595e-02,1.302187485540937439e+00,-2.559004968173060335e-01,-8.832697102007580625e-01,2.000996904984924107e-01,1.224566051677744294e-01,-7.719093057427058868e-01,-1.886980604958798935e-01,-8.220874696892467304e-01,3.698586277931685817e-01,1.237664336811517440e+00,4.855621407124233180e-02,-1.155567595323371555e-01,-5.904269131544009896e-01,-5.565309912618188193e-01,-6.015557994323729174e-01,7.266771473637783085e-01,2.052366055146807255e+00,2.151577245812483219e-01,-6.513991718374906315e-02,-9.044814562187946105e-01,-8.267953509801898582e-01,1.740012103566812796e+00,6.125870131004328423e-01,9.345952370042978075e-01,3.123838211504070816e-02,9.410358648866282705e-01,3.601917975555576357e-01,-2.067826631973693763e-01,6.384202180781145541e-01,5.744058076036132610e-01,1.074158734670425330e+00,2.324094968199434952e+00,5.066292096518372201e-01,5.467774614262205235e-01,6.250464714722849813e-01,4.608470977380433098e+00,1.592968697658944111e+00,6.330266925626355512e-01,-3.797979401524435028e-01,1.992891105760029591e-01,7.036899051206284561e-01,-7.837579184579578362e-01,-3.992727374530611328e-01,-6.752635129489544807e-01,3.513185013723458816e-01,3.719891529021389087e-01,-4.669234470730345699e-01,-3.190063933841607025e-01,-3.978665135207776204e-01,4.912366145594446731e-01,-7.901007163670836775e-02,-4.255887868494635518e-01,8.206039360732617638e-01,-9.834075196714807676e-01,4.883705361426045610e-01,2.627045305185831126e+00,-3.719814458825276837e-01,-3.496198243538033990e-01,8.893484731530847398e-01,2.888963269737515605e-01,1.121202996885158676e+00,-1.321644475950801700e-01,-2.477758855506695390e-01,-4.507832267808531412e-01,-9.025955489966032141e-01,5.753469680174403411e-01,-4.039270841257181499e-01,-2.764564294481096085e-01,1.290689512721101995e+00,9.506512569600233942e-02,-6.315160051334693936e-01,1.932309291560777020e-01,9.656940420166520989e-01,1.054979860358630006e+00,-8.367106306779321656e-01,1.384990100450077755e+00,-8.500022307623485984e-01,1.525907336988621577e+00,5.196374034939792441e-01,-8.480880827992665072e-01,-3.700937932755047344e-01
1.181122001175911596e+00,1.941467996345181746e+00,-3.133704481804538977e-01,-5.412425830876823607e-01,-1.542062551144626759e-01,3.113220344475567392e-01,1.511910854542120042e-01,4.316246708802581322e-01,1.571430184917281592e+00,-1.701876051141043844e-01,-1.547712724154374775e-01,1.714976354055947061e-01,-4.397771274310703360e-01,3.510030291399259261e-01,-3.013447835136052744e-01,1.543962570680483148e+00,1.139096108630625048e-01,-5.630354756718800591e-01,-1.695204839443714973e-01,-2.437329829026405742e-02,-6.271691143161314264e-01,2.515974578350547164e-01,-8.006112553123325704e-01,1.279679230876817064e-01,1.530149465561622346e+00,2.881501433486724495e-01,-2.470231929988431496e-01,-5.363222933479354637e-01,-1.019236637418932112e+00,-1.042349326039819557e+00,4.689583482876716891e-01,2.065292219841968091e+00,-1.241117783900558269e-01,2.193174267376479802e-02,-1.005128261912402232e+00,-6.413324549252894524e-01,2.225884857342472323e+00,4.356210439562923642e-01,1.162775602944617681e+00,1.253635272912884124e-01,8.711242958668692360e-01,3.261102356032661853e-01,4.737135267786694859e-02,5.691982439500307134e-01,4.692129096760008777e-01,9.671250317001892638e-01,2.677673470621643848e+00,6.753221002099651926e-01,3.530984395750232374e-01,7.192022721177955269e-01,4.483337722269128633e+00,1.829017223728446107e+00,9.122348545927811969e-01,-1.782108129226283033e-01,2.821876237094568252e-01,8.155857994301278779e-01,-5.435647903195175434e-01,-4.033501314959409001e-01,-1.267451052000341694e+00,8.761372161194567187e-01,-3.351745829669994237e-01,1.567183778355313306e-01,1.141340231074561840e-01,-1.265569191654993819e-01,9.673526307882075459e-01,2.745074688770590132e-01,-2.939456611227002081e-01,4.948947742431717423e-01,-3.694424887405343694e-01,2.346137666104808062e-01,2.547947927409896618e+00,-4.046656590253412955e-01,-5.515444983909825183e-01,8.700053326114007279e-02,3.251422440447007678e-01,5.364516266943413214e-01,-1.536143743434984499e-01,2.632509213058986663e-02,-1.151914883332779471e+00,-4.653741770095362051e-01,1.160632905941763271e+00,-6.529552968253782286e-02,-4.031368939737283164e-01,1.342909613718448192e+00,5.994907776310940406e-01,-8.791167783685498449e-01,1.857419233099423528e-01,5.964544507813502872e-01,1.035172455175269901e+00,-1.239311692086227934e+00,1.668842221677845572e+00,-8.916727911210311497e-01,1.690259606496992140e+00,3.150101215139003985e-01,-1.004807237647219242e+00,-4.066725598402686215e-01
1.485469275286742885e+00,2.491921492662954485e+00,-3.363234108232063813e-01,-3.484585008415308494e-01,-1.969348426949310005e-01,9.190495111745855539e-02,-8.399500896788585358e-01,8.902362995869207429e-01,2.487255000882564460e+00,3.792399734275445078e-02,7.570991803119597741e-02,4.996548625554103062e-01,-4.326977959638259597e-01,5.977281079731536773e-01,-1.090975597404432174e-01,2.311256587091075509e+00,6.084520735379843615e-01,-3.837869312565648228e-01,-7.317791467788020698e-02,1.482268704511750801e-01,-7.929002462578633725e-01,3.511856056822910688e-01,-7.115758359966908309e-01,1.293191636816167778e-01,1.093058120226010566e+00,-4.252503919804807020e-01,-2.560008063188710103e-01,-3.878498708824873464e-01,3.169627652132727125e-01,-2.817636531262417421e-01,5.379742069863922005e-01,1.801513640467946376e+00,-1.685536765613902532e-01,-6.508041599120120146e-01,-9.370564547851982784e-01,-8.631810375412647396e-01,1.980771559053951858e+00,7.974707400920881817e-01,3.937315193627690668e-01,5.888551519263141021e-01,1.157120606411174535e+00,-1.209963297776156521e-02,3.530425096860903555e-01,9.448287024721730987e-01,1.902966847288720675e-01,8.535369165860162699e-01,3.424446633012236507e+00,6.095309190702580260e-01,2.835342546839407230e-01,1.746286642672874034e+00,4.590703876616593071e+00,9.289205962301227970e-01,1.395423928694262017e+00,-3.873708716997170676e-01,8.423568943690235011e-02,6.876444462230875132e-01,-3.621831928402694523e-01,-4.543868370168638871e-01,-1.303516242665363922e+00,4.272738024579287863e-01,4.789505846661753496e-01,5.764453171947280241e-01,-1.799889006741092479e-01,2.991787002024631770e-01,3.733012859681186235e-01,-4.300562590720952150e-01,1.457565456580411922e-02,5.162688966323190076e-01,-3.470932796036743095e-01,-6.412096682897983069e-01,3.484381316760502667e+00,-6.802575994733652820e-01,-6.039870024572812079e-01,5.319076216860370021e-01,2.234609348818424879e-01,1.211722233311784303e+00,7.144563680023905405e-01,6.269532609946711910e-01,-5.320182616583193358e-01,-2.328690065558099431e-01,9.832902707361614869e-01,2.170198979977931431e-01,-6.537056866447318870e-02,4.979818685455019711e-01,6.434655916100391337e-01,-3.528386822591801364e-01,3.205727935386937233e-02,1.466205571222410242e+00,6.942990771368231506e-01,-9.944081737805265941e-01,2.348811210550477035e+00,-1.111253649672472310e+00,2.114015939888215900e+00,1.336013971021914326e-01,-2.977456625161243320e-01,4.149071078240151866e-02
9.627142891305457972e-01,1.514739760184819151e+00,-1.058970686127342631e-01,-6.144143385429188253e-01,5.255922563843003215e-02,1.076383375089327299e-01,1.801018592265695717e-01,5.425062197700000755e-02,8.002028080963521361e-01,1.165747292333582652e-02,2.714830281091442643e-01,1.497605243687769594e-01,-3.997597139865015081e-01,3.126767856872701423e-01,-3.208319780871748406e-01,1.571403282435488657e+00,-5.982886869316422773e-02,-3.001246554274641376e-01,-5.314672411402829311e-02,1.123903071415745941e-02,-6.194011712008069548e-01,1.299418138195437833e-01,-6.979730877859000593e-01,2.353214158144333323e-01,1.544159294822382122e+00,1.458743991967572651e-01,9.664092310358526894e-02,-5.562276509845137662e-01,-7.696825178831641079e-01,-9.722120780020517827e-01,3.254256371464768760e-01,2.105618726304823163e+00,-2.341290181197883680e-01,-4.427182047701280765e-02,-8.187520973759243592e-01,-6.768308889369536452e-01,1.669904128816541711e+00,8.000151137797715251e-01,1.500140138623046404e+00,5.891128910500428306e-01,5.865561609995687542e-01,2.552675835368390933e-01,-3.277964023387898440e-02,2.975252882712765556e-01,4.378551483623945306e-01,9.504412173717523560e-01,2.544345518396937678e+00,1.869507073966086286e-01,1.245663911295029902e-01,1.061479393894768419e+00,3.943199006473244950e+00,1.493030888718231530e+00,4.449792034374756011e-01,-3.441673520205409398e-01,-1.030977279673798153e-01,1.160425320612089362e+00,-3.096666782774137872e-02,-8.451251238328937043e-02,-9.665633848279409079e-01,8.409479475759004119e-01,2.135665319824094077e-01,2.323331057103525388e-02,7.889942619443454652e-02,4.592755484739624583e-01,9.434942020131565910e-01,1.582722042725502876e-01,-5.264338800694561282e-01,4.338509489730223434e-01,-1.223711516960322432e-01,4.190355704482214283e-01,2.305851537273260199e+00,-4.772671013166236431e-01,-2.015544256163055992e-01,3.342357680653310625e-01,-6.763073341314414233e-02,9.639174498267699676e-01,-1.787219601074582220e-01,4.374387559175318407e-01,-9.056469600201272341e-01,-3.879044159597429542e-01,7.926788059274358922e-01,-4.275882638460287710e-02,-1.739833057403024352e-01,1.399904513050572508e+00,7.325980595352934444e-01,-8.928369668695588235e-01,3.667850154769105586e-01,7.571086350653210006e-01,7.240306446616483482e-01,-3.328008991275838158e-01,1.484266816037727921e+00,-8.284424023140655180e-01,1.120048888433739398e+00,2.176030963344940949e-01,1.869037542847198918e-02,-2.194462096764202563e-01
1.228701203867082370e+00,2.328645306409325322e+00,-6.045656154204825938e-03,-1.016646532300765848e+00,-2.873771756152095902e-01,-7.881969443524866614e-02,-7.543039359994536674e-01,6.313405195500019218e-01,2.651564974445792977e+00,3.312134065350189061e-02,-4.141870489675119615e-01,5.413686737999496845e-01,-4.951241042799193748e-01,3.624850394321298130e-02,-3.162981825616629217e-01,1.720309738725868343e+00,1.485432561406385132e-01,2.374740706709497773e-01,-4.491346287632225764e-01,6.898045748311879000e-02,-7.892286060021377336e-01,6.274257400196121548e-01,-6.112630193367948328e-01,-1.083050564251573367e-01,1.686020573912906162e+00,2.822837144945300469e-01,-1.405787093136017518e-01,-5.206244370741410776e-01,-1.176036636511940348e+00,-1.181874669773740560e+00,1.656981391914110202e-01,2.351235627864843192e+00,-6.113088827965876826e-01,-1.713668552028980718e-01,-9.295489460967822914e-01,-3.585919959755916597e-01,2.380147308831935149e+00,6.056264182171277044e-01,1.229105554362103225e+00,8.105778488323428510e-01,8.063790105248606066e-01,3.579876659625167434e-01,4.763079966814893207e-01,3.344863250368607099e-01,5.331265699674488934e-01,7.854057072776139403e-01,3.325662008464288721e+00,5.457315117173925367e-01,2.087523227619227095e-02,1.196240046213676411e+00,3.896783565457599963e+00,1.679106311949356778e+00,1.033547214968552286e+00,-1.243222071347066526e-02,1.163025768879538679e-02,1.129585352693972977e+00,-2.689197075822691296e-02,-3.964165866991343767e-01,-1.493432733230901643e+00,1.271643960832207876e+00,-4.412741511308309050e-01,9.068044435824293981e-01,4.168777385233559674e-01,7.146484561958538206e-01,1.509593235147697055e+00,6.642080634260167926e-01,-1.509355681126101079e-02,5.889174562058218099e-01,4.648339737454176834e-01,-5.018859996870789209e-01,2.499070573811867035e+00,-6.538301038406442167e-01,-4.842843982930959412e-01,-6.498759231434230177e-01,1.808613822552461725e-01,2.678943037149646988e-01,1.965619701198117464e-01,4.644382493804196654e-01,-1.743508810433589407e+00,1.898762492987674522e-01,1.207583313598617369e+00,2.776074051504890949e-01,-4.001918293005932714e-01,1.356627126434998942e+00,1.011961957274885915e+00,-9.822385163134633723e-01,2.208718613880110981e-01,8.561453280325690418e-01,8.174461470245198980e-01,-1.171913640739867812e+00,2.157884577626682621e+00,-9.400837783484713439e-01,1.804801807960674687e+00,1.454314944760589090e-01,-7.665400456942208507e-01,-1.729161392634347982e-01
1.071932038096040429e+00,1.730413107229822778e+00,-1.843269064055397810e-01,-7.656951694282849719e-01,-2.391760755316198472e-01,2.392933688824786520e-01,6.001791077092033522e-03,3.723804970372059375e-01,1.726447445322811136e+00,-3.373100295916420244e-04,-9.840942162314475494e-02,2.640666024314515248e-01,-4.451959978165284659e-01,9.952204721629191730e-02,-3.994460544587962736e-01,1.560721376672140392e+00,-1.147675608318360352e-02,-1.941072480827034097e-01,-2.707910196439999861e-01,-9.678982775978582642e-03,-6.493116202412365645e-01,4.950608743795207878e-01,-6.548458165903223716e-01,3.265580040189983158e-02,1.701058363399778672e+00,2.747458647761296113e-01,-1.407259036184946022e-01,-5.795574204410256502e-01,-1.295047292159500651e+00,-1.248751497755524298e+00,3.108349056942139588e-01,2.312380810700715994e+00,-3.314490847270225027e-01,9.030494561454491254e-02,-9.130996439297458522e-01,-4.959261319804476043e-01,2.211528832109173059e+00,5.292760214805658503e-01,1.513907698501145482e+00,5.779302114985512828e-01,7.808334813942497954e-01,3.959823578712396985e-01,1.787905737285843677e-01,3.138497527844189561e-01,4.879578141359502408e-01,8.515219820526304106e-01,2.774338712437732557e+00,4.981878408927938873e-01,1.960923499348173893e-01,6.697629681886752007e-01,4.194685795998751132e+00,1.974726271339912964e+00,8.350262402345050017e-01,-1.304530964390176462e-01,2.194102049142138133e-02,1.140933481102253566e+00,-1.103769002648244957e-01,-3.449033178001744693e-01,-1.274830056800122069e+00,1.419883404247915148e+00,-4.002079773284827890e-01,2.709151402443712442e-01,2.246404691744691151e-01,2.972393435328113953e-01,1.271569525396479605e+00,5.044055154727435930e-01,-3.071991558489718943e-01,5.686780691888487782e-01,5.057771937108505172e-02,7.729890361292679479e-02,2.363289048024474592e+00,-3.924914985421201763e-01,-3.638017501369558704e-01,-2.729391691425433475e-01,2.156748182514372503e-01,3.602271503599480118e-01,-2.168913561672917156e-01,2.585921419458430681e-01,-1.488270095518442471e+00,-2.369190211945715607e-01,1.146673920314629447e+00,1.478698052871482149e-01,-4.494976734956793729e-01,1.546453379275971596e+00,8.582035929739351143e-01,-1.112608196380447723e+00,2.052918880328405971e-01,6.946218552776491917e-01,9.644316079367809547e-01,-1.159161877983492461e+00,1.806916265180360748e+00,-7.118020878262710793e-01,1.485598254583884170e+00,2.617513764655148845e-01,-7.499682596022576586e-01,-4.226169187088008594e-01
1.276263618223658858e+00,1.616874120112328228e+00,-3.914239784178318859e-01,-1.451981732570012396e-01,-2.429929787850143574e-01,3.294127471717773203e-01,-4.861033886370895174e-01,6.651933921814999762e-01,1.870733740911600496e+00,3.388980639359023828e-01,7.039945628440279490e-01,3.789213127926490121e-01,-3.783130215922982931e-01,4.857429835425814413e-01,-2.066116009853221913e-01,2.488024780721488582e+00,4.261633001232402740e-01,-3.989931158474664397e-01,1.314524644989538693e-01,1.835766974914183891e-01,-7.565210938224867787e-01,4.923678070276454877e-01,-5.256407748980288508e-01,2.213458316229527378e-01,1.065808313264129170e+00,-8.685209820779444811e-01,-9.741116366225635592e-02,-4.547325577486545090e-01,5.632899226024008499e-01,-1.753096556510372883e-01,5.920778165687052841e-01,1.950781913710851967e+00,-5.450188553826371129e-02,-5.872566263686602728e-01,-7.387122615765455702e-01,-9.885414383587913800e-01,1.538769156564390839e+00,1.043082306571734952e+00,7.933302988638151199e-01,1.131257192745998896e+00,1.168101802281005686e+00,-3.690205178540995057e-02,2.678074216785453210e-01,7.810379972946674965e-01,3.097996218236065413e-02,7.390147596984060208e-01,3.179348454457540107e+00,2.486620390146736526e-01,2.952872258353697599e-01,1.515973855433653261e+00,4.665601749765441397e+00,1.002059120649065882e+00,1.246206060376296332e+00,-6.162666814396681181e-01,-3.729110844192151664e-01,1.057100641107020511e+00,1.701149073274365597e-01,-3.398094179685433036e-01,-9.506965175386310474e-01,1.039182346584613947e+00,9.860041857897209328e-01,2.627125121740020441e-02,-5.067126838184845550e-01,5.098265879199854744e-01,8.942986788136453313e-02,-7.499619988006120952e-01,-2.368177111988969963e-01,6.630187934347014922e-01,-4.043832220751662487e-01,-5.307006184530917992e-01,3.565715150724460436e+00,-4.643865793180226298e-01,-1.879420391951207026e-01,8.935836384924231712e-01,6.508645661289837181e-02,1.538790681828915430e+00,5.551354379990518506e-01,9.405754218162714064e-01,-2.207417628855383729e-01,-4.251410957373051858e-01,6.945436654061787340e-01,4.311785446954640166e-01,2.822917390662538217e-03,5.689043133364792837e-01,7.323284251466635197e-01,-5.216997061572496985e-01,-4.403048196328190889e-02,1.913830677339579456e+00,6.166016488706278498e-01,-6.843751758387384143e-01,2.397331974315775938e+00,-6.781612418020286359e-01,1.624938861569514614e+00,1.532887348926486870e-01,4.546194914664739573e-01,-6.375757357473765818e-02
1.102099719946614709e+00,1.331960505729026245e+00,-2.307100133164677880e-01,-4.320724410485418110e-01,-2.133612867641804800e-01,5.964806637557196201e-02,-8.311632482384501142e-01,4.959005220368766231e-01,1.605128219993795291e+00,6.564350304829537075e-01,1.219386600362792450e+00,5.868124361531090738e-01,-3.132748997008633074e-01,3.173362005527386454e-01,-3.748977300316453931e-01,2.813679355582941355e+00,4.528889597950251367e-01,1.242324875751526503e-01,8.773791046234619140e-02,1.813114857158599491e-01,-6.981327134820588531e-01,7.436621761984625323e-01,-3.139366888059698657e-01,1.885525856825034929e-01,1.201199782213079548e+00,-1.116060401517037004e+00,2.070543538161938868e-01,-4.534295813131533626e-01,7.421798788789679691e-01,-2.504122795884242691e-01,3.170974962684119380e-01,2.068556382370879909e+00,-3.574418976777346546e-01,-6.666225766418254484e-01,-5.334691531656807761e-01,-9.527533262471407083e-01,1.137065114989983750e+00,1.422704342855583892e+00,1.300516047165520828e+00,1.946019882657827882e+00,9.102489919195382306e-01,-1.547967530706497175e-01,3.916028250062354998e-01,4.474590964123053571e-01,-1.351791120400686053e-01,5.835098715166118222e-01,3.320472881456674408e+00,-2.536055518852822210e-01,-5.388237391584994873e-02,1.936575401378541450e+00,4.091834569115063047e+00,7.579229724189524564e-01,9.979465296885016157e-01,-7.418672701167112749e-01,-9.051151787433062701e-01,1.596153351795357000e+00,1.047764478219664674e+00,-2.563396463403656844e-02,-8.989943289447893671e-01,1.550279784964428087e+00,1.354018154213036285e+00,1.683680692526808298e-01,-4.257756074923476630e-01,1.406764670984055554e+00,2.254607522396709918e-01,-8.060533900209474467e-01,-3.981046022094422154e-01,5.135044902079074491e-01,2.332726477091766337e-01,-6.556128093876887331e-01,3.434924978947726082e+00,-5.193259482948570094e-01,1.797212452561372520e-01,7.648855469752006142e-01,-3.484130170679989313e-01,1.756852474780478790e+00,5.939704571148105572e-01,1.689970448018639493e+00,-2.787265462639282321e-01,-8.708197022323155290e-02,5.606739650666650032e-01,7.953952857566046752e-01,1.939915364474760207e-01,5.927469265524802911e-01,1.214701707162785693e+00,-6.966290314065378686e-01,6.614139375547858912e-02,2.162448291989825577e+00,2.419974220577123525e-01,4.054717459801343571e-02,2.547719138647941417e+00,-4.979169595162847850e-01,1.081713535960109107e+00,-7.341615101725440518e-02,1.661642542296509095e+00,1.128352401320293907e-01
9.064666389597446639e-01,7.585813164979168244e-01,7.751632125026200471e-02,-1.633999207059711467e-01,-2.071665640881178994e-02,3.178662388054651067e-01,6.106678532906956169e-02,1.342678674656434812e-02,1.108749364659207259e+00,4.152474098880979403e-01,5.333558646922940127e-01,2.718096124518845635e-02,-4.734451465374976409e-01,1.630571481448629956e-01,-4.317925448338033600e-02,1.738208470931852379e+00,-4.277359959085435537e-01,-1.079472839773311515e-01,2.749648336696998152e-01,3.398130258975030071e-01,-9.801082887336413085e-01,1.554999316231916451e-01,-4.342899322279464291e-01,3.237391131118089183e-01,1.175998399867516753e+00,-6.229752881242568430e-01,2.539889325474231629e-01,-6.214069141187644751e-01,2.547871751927721640e-02,-3.113951438312099196e-01,5.388637476493819412e-01,2.407249676412415162e+00,-9.168083541134308678e-02,-3.982641098904962651e-01,-5.619676260705962489e-01,-7.797234481961836661e-01,1.151864113957844937e+00,1.226077178003206036e+00,1.185347033101201042e+00,1.371251654089579386e+00,9.035255685480598764e-01,2.837949953341960541e-01,1.075405560323846738e-01,3.056483741278088750e-01,4.574370182375457894e-01,7.994973267535624428e-01,2.769457765764241408e+00,-1.287442533089096230e-01,2.196705525514289215e-01,1.184077639308974916e+00,4.028921455222949533e+00,1.142428547446433740e+00,5.260401344592191553e-01,-5.729264034924020921e-01,-6.355388094109266639e-01,1.356837017596048689e+00,2.839849999232577638e-01,-2.215488427290329410e-01,-3.319212791098363757e-01,9.957436628619603658e-01,1.263949478772884216e+00,-3.503896891060074292e-01,-5.236376904120001452e-01,7.698855147306875590e-01,4.776426853155621988e-01,-2.835810038974054814e-01,-4.029446265074742017e-01,1.132941542361791010e+00,-3.448648106667256963e-01,-2.097455824653506884e-01,2.831297690074182860e+00,-4.978322002275451519e-01,2.211973226016741845e-01,9.060685249547475451e-01,-1.255752253401652974e-01,1.595268348969077321e+00,2.714811453870081270e-01,6.123278717768222412e-01,-3.280147105698476562e-01,-4.958598269106387346e-01,4.915774382873583370e-02,8.316433601307435253e-02,-3.733699935263767866e-02,1.168324359094651710e+00,4.607889336294100358e-01,-6.837500155918115885e-01,1.734754311519157433e-01,1.970399928659551714e+00,6.225001989152550985e-01,-8.522370161594511329e-02,1.926227078454708863e+00,-5.391318259135147173e-01,1.110400201974873768e+00,3.689862701843141801e-01,5.176776544041596928e-01,-7.130038281402090172e-02
9.749744298162855705e-01,9.365315921642906050e-01,-5.979730614470372130e-01,-4.339278457777002718e-01,-4.831132226597995571e-01,7.882774864640662571e-01,6.190329344544640566e-01,4.001031251650525311e-01,1.265140700565600129e+00,1.967960490765876536e-01,5.544033587602064106e-01,1.239291329227263511e-01,-3.506792533375568954e-01,7.122761352454937134e-02,-6.364514438956798692e-01,1.866614925412325654e+00,5.006533445346433853e-02,-6.244439108494302948e-01,-1.085150831899754087e-01,-1.015156904474610322e-01,-4.508213125966532564e-01,8.229708100760008138e-01,-5.424928139990670140e-01,8.298984225610867016e-02,1.708143169623238533e+00,-1.594952205153296332e-01,-2.729777792355427835e-01,-6.330104579269256737e-01,-1.217603780586436812e+00,-1.272549817452479193e+00,5.057439090479889376e-01,2.344168373774365488e+00,-2.876220377093052782e-02,3.385228066818442572e-01,-8.472573443949743544e-01,-7.060726683372046120e-01,2.128905437209495322e+00,4.668249431090599755e-01,1.902845293170861263e+00,7.531488712809836228e-01,9.976533446928136373e-01,3.582357378206562637e-01,4.194397941071745239e-02,3.665107418518291915e-01,1.818804537623920359e-01,7.316617518080239524e-01,2.408592382187177527e+00,4.700117918802589334e-01,4.307736840309142612e-01,-3.277501069329591399e-02,4.903904597300043022e+00,2.464633342666024074e+00,1.048007584238473067e+00,-3.299702717751628045e-01,-1.914874556317284204e-01,1.323578872565404074e+00,1.684407649266513873e-01,-4.058723661120759996e-01,-1.179449396577931797e+00,2.364340741722531281e+00,-3.362840776130423537e-01,-4.503310594341353168e-01,-1.524066748415513206e-01,-6.657003535389083293e-02,8.334000387748409233e-01,8.531359507265676156e-02,-5.644731597541653434e-01,5.969297133058127924e-01,-2.970648516017601604e-01,3.106389386346298798e-01,2.668626438832202297e+00,5.914529005147767249e-02,-1.556065888819938570e-01,4.394133933855456919e-02,3.448614166546903337e-01,3.931818073444852679e-01,-5.753450227666576655e-01,3.745874596263125689e-01,-1.254420096737534740e+00,-6.534961250593851467e-01,1.265182247866183163e+00,4.532251854614454123e-01,-5.604728283232712771e-01,1.589272913157153244e+00,9.531047141192877659e-01,-1.396235886058244446e+00,-5.359190203492381066e-02,9.309037076681170308e-01,1.149272916667326783e+00,-1.568818715790872398e+00,1.932263686057831276e+00,-1.495417585529569271e-01,1.226841277938715669e+00,3.247920892734795784e-01,-5.478568612781498093e-01,-8.158559609707620730e-01
1.242176739238457950e+00,1.040354444539548728e+00,4.354619901139733518e-02,1.096699680963553192e-01,-5.117712408605534780e-01,7.632670409184063587e-01,-2.435199628682715445e-01,6.745858535032140946e-01,3.239501874620933641e+00,3.870477679008537120e-01,-4.488010158298879060e-01,4.567559231058268554e-03,-6.780600101696354631e-01,-1.115273378838053803e-01,2.534444821316080843e-01,1.558071530774207236e+00,-6.106769158321585511e-01,-1.317187328980603533e-01,1.736618248969898359e-01,5.854950231478232014e-01,-1.403979880078122910e+00,4.711182617364005343e-01,-3.752633167469843767e-01,8.046151168601438364e-02,9.996828664545667209e-01,-7.241495798596754296e-01,-2.437093818937890732e-01,-6.808329793918843631e-01,-2.860273471726997307e-01,-1.316891364662122754e-01,8.686280998692690325e-01,2.823728839322586115e+00,4.201091559502545536e-02,-4.935474678249436864e-01,-7.130159770128821073e-01,-5.663888228414031278e-01,1.985740798815661234e+00,8.230582521208749114e-01,3.751192400326406329e-01,1.218403592920523248e+00,1.642621229458559817e+00,6.095603893621868163e-01,5.018616268853657303e-01,6.483722190925320650e-01,7.433058797055536182e-01,6.842393314268301330e-01,3.335449894177280328e+00,5.745458194270582908e-01,6.429101065683154870e-01,5.457415594194193753e-01,4.830123131660883473e+00,1.668521909883239340e+00,1.417197727480865588e+00,-2.604667743248120226e-01,-3.297373169805909998e-01,9.465678925383258502e-01,-4.234276111968958700e-01,-9.998058490955141764e-01,-4.336790428643884643e-01,1.324320470643931547e+00,7.883865403809755534e-01,-1.378985953515703411e-01,-7.361390274975333492e-01,8.695321737190564448e-02,5.956237944783852045e-01,3.230466549992910830e-02,2.672533103009726574e-01,1.982278904658001828e+00,-6.968797065740143237e-01,-1.242597825155278946e+00,3.432065193853213181e+00,-4.632671774444187540e-01,-1.033682845860516702e-01,4.278971670074784850e-01,6.029023005132951862e-01,9.551098951350474042e-01,6.704891436750246569e-01,-1.674804296832677064e-01,-7.878988882406121608e-01,-5.044017352604550641e-01,1.449809682922147402e-01,1.173023533908147120e-01,-4.862260677865687386e-01,1.125359927177266739e+00,2.750712746369254891e-02,-6.151294596295365791e-01,-2.730479358907815235e-01,2.562292484267440607e+00,1.181597119902419779e+00,-1.733258441049787546e+00,2.666476889376722781e+00,-4.528623490832808240e-01,2.259196436087163029e+00,7.142539175167341714e-01,-1.376317255416688479e+00,-3.057048343951103142e-01
1.353824764550984661e+00,1.185665391308873495e+00,-1.956618688416892349e-01,1.232198519241731738e-01,-6.863397253631342565e-01,8.528753547042253746e-01,-4.303483096897035565e-01,9.528409351479852907e-01,3.557932072610849872e+00,4.593003523112688669e-01,-2.213523226608865024e-01,1.635057571823849143e-01,-6.218452148144291147e-01,-5.693091003913970660e-02,1.146045981186344376e-01,1.966263585258487767e+00,-2.669434423760894681e-01,-2.155383921773287303e-01,1.187198632665113496e-01,5.150123220984323957e-01,-1.286735246944026745e+00,7.626941740372212841e-01,-3.387976408232501457e-01,1.649978688928813164e-02,9.921386955683446640e-01,-9.492177598985730436e-01,-3.855115079893295382e-01,-6.314529341574318666e-01,-8.516021585956101703e-02,-1.154114039288103299e-01,8.849667200190384220e-01,2.713375585734683515e+00,5.254038196602328625e-02,-5.254686610184726714e-01,-7.409127918097256904e-01,-6.570326372678830795e-01,2.119081298118233647e+00,7.766347059390208418e-01,3.713976769176148274e-01,1.318978829616813453e+00,1.783828798781743608e+00,4.802470099090182520e-01,5.965651285959128192e-01,7.905478741553952915e-01,5.002182461321771356e-01,5.918878292199474256e-01,3.493174955155647687e+00,6.692222240346904494e-01,6.721642500988127544e-01,5.580421391822648625e-01,5.156706941264307176e+00,1.726531823087046558e+00,1.758802922532897384e+00,-3.108815704802890822e-01,-3.554353108567188113e-01,9.578505198020723643e-01,-2.701381083151460638e-01,-1.049308806854786225e+00,-6.738794338716804777e-01,1.697668205816860176e+00,6.955213972824220159e-01,-7.734384903208940676e-02,-7.849538451624340496e-01,5.322467680510756249e-02,4.191945301813387870e-01,-1.995776273574990656e-01,2.945766192620893342e-01,1.823870530191800565e+00,-6.597143365143607330e-01,-1.418643641034347036e+00,3.780466947936358846e+00,-3.624885056000617944e-01,-1.727326566846550948e-01,3.875160634569480012e-01,6.736512973651409553e-01,9.049278364218442672e-01,7.299084714514658678e-01,8.619313752971419218e-02,-7.813727276138586753e-01,-4.789515501223198246e-01,4.251836337435686564e-01,4.046115534872800068e-01,-4.968875073746867321e-01,9.182090824932661599e-01,2.417857439660177077e-01,-6.608730211894564555e-01,-4.192545303707781446e-01,2.657990143410545070e+00,1.184602448225399840e+00,-2.040361037101115382e+00,2.963255569313351323e+00,-3.437866802155085666e-01,2.376022023796215521e+00,6.159837768453809703e-01,-1.261686920665368916e+00,-3.729678522473671154e-01
1.215864785537537518e+00,2.068158942642082110e+00,-7.113722034406713135e-01,-8.293605583718792751e-01,-3.438020498192126406e-01,1.312213933316903058e-01,-4.612254630955618384e-01,7.299574122353760242e-01,1.427641779309346326e+00,1.978056341513581839e-01,9.970418375092409136e-01,6.997153843961201325e-01,-2.029855210918347919e-01,4.653717568723846898e-01,-8.181517779934521784e-01,2.740401241841267321e+00,9.886942608762734341e-01,-3.620237001908624408e-01,-3.071334908932192853e-01,-2.683843871667615510e-01,-1.848035626954350197e-01,9.529718247407757969e-01,-6.078929812676447941e-01,3.810045392616559501e-02,1.665488901212476280e+00,-3.183422113769686645e-01,-1.872899734113285530e-01,-3.948167953109837369e-01,-3.363896786690153684e-01,-1.118373589988347128e+00,1.892473057938346692e-01,1.737215995639242783e+00,-3.768576426161468484e-01,-9.298958185341554827e-02,-8.878436826306708163e-01,-8.823715674218814975e-01,1.985828317912626373e+00,7.254090002543513993e-01,1.740282885780594535e+00,9.333393809591331580e-01,7.461758641508835499e-01,-1.628723217677038870e-01,2.230259956116788511e-01,5.520410763333031268e-01,-2.764286388954689810e-01,7.020762461865696080e-01,2.971788374717274195e+00,3.185870650069695942e-01,1.808268678531306517e-02,1.316288362602574091e+00,4.511462145185986650e+00,1.572518045380458585e+00,1.206382270822023983e+00,-4.683717714576788871e-01,-2.157214204719049011e-01,1.325711897229598923e+00,6.153850351720732137e-01,-3.007974333257437682e-02,-1.766183005079144053e+00,1.876759233968975371e+00,-1.500633072981371330e-01,3.862853399944100596e-01,1.673925709681457208e-01,6.632681219104513692e-01,6.505149446777536149e-01,-3.698356184261608615e-01,-5.492893039031820912e-01,-2.754966642871020666e-01,2.973922106241388974e-01,8.683377148285081892e-02,3.027028138592164908e+00,-2.618618983832292635e-01,-3.757509693946375351e-01,4.326721655960774626e-02,-5.287623051288410647e-02,7.834915144235843343e-01,-9.851902153392239070e-02,1.374111290061597934e+00,-1.038584707290328257e+00,-1.392699620535166882e-01,1.680069517373621313e+00,8.015812487494538008e-01,-1.336438501668257561e-01,8.906179686503834514e-01,1.561064170327444156e+00,-1.099836849467106914e+00,1.017404759249679325e-01,7.480849230542088169e-01,5.803336775901740685e-01,-8.544355627617570281e-01,2.183347764331542873e+00,-6.033445759922395624e-01,1.221583941601074752e+00,-1.911373955847097128e-01,7.058605997592646286e-01,-3.269272639941233072e-01
8.349740637325070436e-01,8.532422848043836883e-01,-8.089224288060503643e-02,-4.420193482902607940e-01,-3.767829003720746250e-03,2.032073267183034937e-01,1.256969773486900088e-01,-4.321035269007311719e-02,5.922456710543420044e-01,3.890465589077568564e-01,8.737432101630491221e-01,1.618284079877470583e-01,-3.623184427225710769e-01,2.096531689108914742e-01,-3.450200299639751278e-01,1.929391282563929444e+00,-1.451281751072741044e-01,-1.188889111739714621e-01,1.351881948072859163e-01,1.204627175899468383e-01,-6.750136024021495817e-01,3.191133815835971443e-01,-4.636913380539195439e-01,2.947044099707651910e-01,1.422581677891192165e+00,-4.573082078177178045e-01,2.863733499147987915e-01,-5.852570491693823707e-01,-2.121793632052244583e-01,-6.813783535161070937e-01,3.455762424312828762e-01,2.244088291431256543e+00,-2.173393246496070630e-01,-1.970708643617149480e-01,-5.887697460238153768e-01,-8.005721978703629338e-01,1.177188457160512458e+00,1.175764085108357504e+00,1.688043079314215156e+00,1.351259754543982172e+00,6.483307361302277361e-01,1.617044667690650250e-01,2.835165721017725987e-02,1.824692841227706364e-01,2.500164633007124770e-01,7.885449457948456864e-01,2.599414947589128833e+00,-2.188390795386092602e-01,5.819194651147563402e-02,1.196945962373025196e+00,3.904303025089156165e+00,1.283027707493918701e+00,4.074378159785429498e-01,-5.911622509811651494e-01,-6.481205064435693330e-01,1.537707110925374598e+00,6.051957628179251980e-01,1.951666177752849063e-02,-6.340781474171819365e-01,1.331955534552664133e+00,9.318790229341926690e-01,-2.825705326415896557e-01,-2.667824281519738383e-01,9.284901537837639829e-01,6.160320714921175833e-01,-2.524133553404644958e-01,-6.425147348959142635e-01,6.251084505806230318e-01,-3.869934686571594590e-02,1.820354458094807781e-01,2.590303041896236280e+00,-3.978257964113609546e-01,2.127701271405672001e-01,6.936095296608334460e-01,-2.834066957867339975e-01,1.432870216603924884e+00,-4.228134405202871315e-02,9.475452886872306468e-01,-5.293511664272815276e-01,-4.057429215923684662e-01,4.280481422373746403e-01,2.630509781406082936e-01,-1.256980748971359141e-02,1.266356734781541871e+00,8.695707822100635642e-01,-9.230911223710984714e-01,2.745105877761718216e-01,1.470687018377845323e+00,5.177733675150084647e-01,8.943426924518077525e-02,1.763387577958081209e+00,-4.872601799873997330e-01,7.636946876992373179e-01,1.731360900087776933e-01,9.719892552978575129e-01,-1.502359312417722581e-01
9.200424603932677581e-01,1.670876156681135205e+00,6.682837354914966665e-01,-5.948461015191514045e-01,4.369012785808180088e-01,-3.062956105199106660e-01,-1.262958585044479665e-01,-3.047820955099279638e-01,1.135850704915370768e+00,-1.033786189404332367e-01,-6.506048975646805399e-01,-6.088478747645323375e-02,-6.315497387183202083e-01,1.958458396798683498e-01,2.991680252600407153e-01,7.448899087179183809e-01,-8.209283323361091789e-01,2.016136712755500771e-01,6.914837654777866716e-02,3.963004175187671563e-01,-1.206653361531960122e+00,-5.905059349876267127e-01,-7.396903869638939977e-01,3.221502506091515894e-01,1.296652831829822716e+00,4.536140517327098554e-01,4.085390137149550460e-01,-6.179393772705883414e-01,-7.169305659097159333e-01,-5.658246981722961921e-01,3.284650706315709878e-01,2.403549308820966512e+00,-3.668159190488577415e-01,-4.164351268838827891e-01,-7.443402240221979049e-01,-4.157908311984472860e-01,1.396494100992097920e+00,1.061025055764011960e+00,8.165080433065916576e-01,5.588925715521362303e-01,4.769579274759067067e-01,5.298244164750037788e-01,3.707100547475370572e-02,1.491885554186679896e-01,1.115007489030996890e+00,1.126069333063906885e+00,2.788497533065022793e+00,4.840747274044229775e-02,2.708118833654989122e-02,1.620439480679024324e+00,3.070424172615134673e+00,8.524068632023893421e-01,-6.816404896656380608e-02,-1.806399359859752751e-01,-4.976192666670853360e-02,9.535417126736029925e-01,-5.434433524502976232e-01,-1.533930272188434585e-01,-3.706808677259667006e-01,-5.291557315685284646e-01,7.829610861363592855e-01,3.564769803740641674e-01,1.094338838209600318e-01,7.805426019381744851e-01,1.292914757560688077e+00,6.341553555000056797e-01,-1.867928768669480100e-01,1.113628025498625940e+00,-1.460484573062517943e-01,5.578975766360316779e-02,1.913618336182609569e+00,-1.022347520559599765e+00,-1.473885704684254061e-01,4.330567043695588980e-01,-1.838122398683208480e-01,1.282810658027659478e+00,3.368811483620269276e-01,-1.251430756889162499e-01,-8.077498870284420818e-01,-1.826383519705307990e-01,-9.707227443674892875e-02,-7.200546007631529744e-01,-4.804900528010724869e-02,1.507679680014821777e+00,6.408763837906283900e-02,-4.116797422325713107e-01,6.415187537690066888e-01,1.092487392090143450e+00,6.081514763135940083e-01,3.520763904911458630e-01,1.226044329708054326e+00,-1.353432195767956925e+00,1.370317316705663480e+00,4.534269620110331633e-01,-4.061352287817571738e-01,2.620525745842002818e-01
8.905284210492889763e-01,8.004740797280098796e-01,8.596129180435775619e-02,-1.517467774205694120e-01,7.404252353159261613e-02,2.761236877935338563e-01,1.631516619381630506e-01,-7.228776044703208448e-02,8.390523194867742784e-01,3.395867230139658632e-01,5.299945901325627817e-01,-2.030799132822989905e-02,-4.651035918180993489e-01,2.423214889458291110e-01,-2.586615356135468780e-02,1.656355160696681317e+00,-4.336236489784220383e-01,-1.922417188589043424e-01,3.020379980362372652e-01,3.161264719073483276e-01,-9.496454181230779001e-01,1.225314873319194309e-02,-4.957981923117741330e-01,3.732983802285871899e-01,1.165765931417391599e+00,-5.283272818674383808e-01,2.828703050993262025e-01,-6.129816492104112058e-01,3.601351142747133416e-02,-3.091497039566499794e-01,5.412775386247741238e-01,2.322530295421795010e+00,-5.817384887911414282e-02,-3.841043174578054331e-01,-5.818476001596873948e-01,-8.080389521501301076e-01,1.096021684253372097e+00,1.218624218775364421e+00,1.171395621591323710e+00,1.208335890379812705e+00,8.295724269632920311e-01,2.677199652698327714e-01,2.033435788111408182e-02,3.166446555627885351e-01,4.801932372605991484e-01,8.628905915039075669e-01,2.661705556983264387e+00,-1.369196734213186384e-01,2.186493594938927199e-01,1.232456053612891234e+00,3.975276106813679267e+00,1.075111580913740372e+00,4.097566653247531887e-01,-5.853732386079530947e-01,-5.595909336344371265e-01,1.291898797307131863e+00,1.784144303789916841e-01,-1.643208444120182188e-01,-3.068216250881553586e-01,7.534707034829017935e-01,1.279154245403748780e+00,-3.877605955081516731e-01,-4.961473840458701101e-01,7.023449392906828681e-01,4.517235656765425933e-01,-2.948661728421768657e-01,-4.589575224223771399e-01,1.050608579195034809e+00,-4.219525761981814393e-01,-2.958103726727451255e-02,2.738627543129691588e+00,-5.222537060551608601e-01,1.895047633086219818e-01,1.009588598926258740e+00,-1.607531463022193741e-01,1.662802199138281090e+00,2.240605789272366866e-01,5.492283351234313882e-01,-2.415014272000658435e-01,-5.525939641343998732e-01,2.748611167576542336e-02,-3.682977940892248614e-02,1.170602184269342594e-03,1.173667227104136401e+00,3.971940702806296963e-01,-6.315362986473948004e-01,2.392064701216686795e-01,1.822992923508907737e+00,6.054425926488604670e-01,6.003226461321120588e-02,1.757064658575500316e+00,-6.267465680288193397e-01,1.057450050856953538e+00,3.700582688257757491e-01,5.392010654480025034e-01,-4.499839160849733455e-02
1.527629402405187298e+00,2.038429728583542211e+00,1.687283846369633244e-01,-6.057511337994525569e-02,-4.356212478607580652e-01,2.972517193989732687e-01,-1.225313702835263419e+00,1.027137245001812360e+00,4.115678605043309624e+00,3.295496614614389363e-01,-7.059681044559222851e-01,3.521716423093653736e-01,-7.019223208298472905e-01,9.142400756751171975e-02,4.139057946689080891e-01,1.907590133685394207e+00,-1.844676715731948802e-01,1.666012546271669059e-01,4.763100189892102015e-02,6.569977652547733804e-01,-1.517620775577142700e+00,4.200588518788359593e-01,-4.322988303879731764e-01,1.002070734805107777e-02,8.108203400199447408e-01,-7.923324957720205841e-01,-2.517547494535933295e-01,-5.351833033790012184e-01,3.395817782789800621e-01,1.988226073340693123e-01,7.584065098045624786e-01,2.563303465835682804e+00,-1.893416079960031362e-01,-9.733483318395219630e-01,-7.756133206045063844e-01,-5.724693490501606696e-01,2.050651862843517304e+00,9.646852615633092487e-01,-2.553619202492090068e-01,1.252830508141317578e+00,1.668537361029518884e+00,3.956475299596555750e-01,7.681719746750022004e-01,8.816594069546794810e-01,6.918012879295589723e-01,6.909502105040548070e-01,4.000292348448322599e+00,6.563384124117219720e-01,4.574753456860176648e-01,1.534206097434644089e+00,4.560102450259173601e+00,9.473580931403844385e-01,1.670774727985194552e+00,-2.264604114189379958e-01,-2.122096019142478696e-01,7.200539769345166707e-01,-5.133024778287154088e-01,-9.919539349056275546e-01,-7.145473953201992856e-01,5.829217451716499632e-01,9.756080465092755727e-01,6.366109333718070751e-01,-5.767867695486142976e-01,4.698433237455509892e-01,5.561382537850656504e-01,-1.015640537909529573e-01,5.947042616546240890e-01,1.801382280223543741e+00,-4.239688840429670647e-01,-1.833996355054074323e+00,3.801444869811282601e+00,-8.596334258165025943e-01,-3.702699988043696711e-01,3.609452123279985880e-01,5.103440711796378704e-01,1.175290425930566540e+00,1.323592458123085347e+00,1.417599934461024613e-01,-6.899011193750568260e-01,-8.944336475774961048e-02,2.072919236738227644e-01,1.601600910844288572e-01,-2.608670743222987198e-01,5.918795717765716891e-01,1.094213530910355114e-01,-1.939119217477256463e-01,-2.188545904732709935e-01,2.718786247309896709e+00,9.022632038636690943e-01,-1.512840363734978988e+00,2.998377100333013523e+00,-9.423978086821696021e-01,2.715760581366937210e+00,5.157681161085860833e-01,-1.181499555833168458e+00,1.372320654933606443e-01
1.051585097626098753e+00,6.996696594722849882e-01,-4.656426900275294489e-01,3.708408018701643272e-01,-1.066796850109578837e-01,8.790129166055149490e-01,8.370286039718621840e-01,1.904576070102999008e-01,7.014718014598417817e-01,1.460076822581627964e-01,6.335030937488257408e-01,-2.493161584442195600e-01,-4.198090537310996684e-01,5.198908603499347025e-01,-7.343584377865197688e-02,1.749278298292235245e+00,-1.959635062979955822e-01,-1.096593754093134532e+00,4.594184411556623271e-01,2.017650085397474924e-01,-7.807501615649259374e-01,3.067323787948939007e-03,-6.607981601607688660e-01,4.598612115762511499e-01,9.979341868131548221e-01,-6.582562902553493744e-01,-1.326804979183338340e-01,-6.018980856592415218e-01,1.443042979887201316e-01,-1.892519090982230923e-01,9.426964640937604001e-01,2.055182824227231642e+00,4.665021856817353485e-01,-1.939310651520924078e-01,-7.607893421439759774e-01,-1.082182168174435688e+00,1.402067717313937534e+00,8.181628292568652316e-01,8.912928472496819410e-01,4.735758965833967160e-01,1.225777420496911851e+00,2.354549922767713022e-01,-2.130798005315513444e-01,7.790245228661152321e-01,2.983307316212672755e-01,9.402438961729607803e-01,2.301445910794321925e+00,3.456956859430868612e-01,7.083648188769661180e-01,5.104043821002919312e-01,5.108169557877628719e+00,1.517837719772607397e+00,8.711151914419171804e-01,-6.615838556808451010e-01,-1.519962894890518335e-01,8.386277431058704046e-01,-4.683003424178872054e-01,-4.590962222127347170e-01,-3.977810336306397132e-01,8.090723002239036399e-01,1.007625115060097443e+00,-9.831872991731058775e-01,-8.404335800182122229e-01,-4.363142059282553165e-01,-1.400934410304006672e-01,-7.185699144527475379e-01,-5.113778116339550150e-01,1.023801077982444907e+00,-1.311457066722870435e+00,2.921600464038813794e-01,3.218021365731884131e+00,-1.603004202646311493e-01,-8.922085266379319035e-02,1.472238542843204101e+00,2.981475041777979507e-01,1.583918646193385626e+00,-1.239606027424861034e-02,4.753030306906480540e-02,1.190603768619562519e-01,-1.179752207705452083e+00,3.489093583968028156e-01,-1.271647181863131970e-01,-1.860069906438895082e-01,1.009931711989157765e+00,6.465039932437233183e-02,-5.872018078029814792e-01,-5.202739551486668113e-02,1.695948827304249784e+00,1.032020836853007495e+00,-8.670211422613869345e-01,1.719163092792908909e+00,-4.727055166992451540e-01,1.418038798781612098e+00,5.546293558588060169e-01,-2.971743007069424514e-01,-4.464368001270240804e-01
8.179514002537868755e-01,1.448661026378394112e+00,-1.679378779027573126e-02,-7.230288967266774725e-01,3.514945485031059080e-01,-1.853436747845694232e-01,2.229981552362428621e-01,-2.828586112669950747e-01,-2.036200695755733259e-01,2.331886297257698692e-02,7.069058149191902451e-01,1.645191916663719667e-01,-3.160275310005521421e-01,4.831850025602166254e-01,-3.865372299831085767e-01,1.649971097040210166e+00,1.023572410560485979e-02,-2.410572688364220340e-01,2.826957173313204147e-02,-6.146292415094605638e-02,-4.735739928173852142e-01,-1.171227682845329410e-01,-7.339987020007087137e-01,3.779887568523869756e-01,1.558437912942884029e+00,1.647608989614037789e-01,3.826317303911119794e-01,-5.149079161010091665e-01,-4.576189450752132792e-01,-9.387672522036902834e-01,1.695171479352728938e-01,1.878570080940737741e+00,-3.092722943377540501e-01,-1.013338455600035215e-01,-7.311376375854695686e-01,-7.911047472360361876e-01,1.182146616604402345e+00,1.066850677208066811e+00,1.757844723038985313e+00,6.813635571698288818e-01,2.206357974145802814e-01,7.733115423523895249e-02,-2.113335565645360070e-01,1.538614813082245236e-01,3.320183004766100177e-01,1.025827853028673520e+00,2.338026122442747212e+00,-1.910656649199178880e-01,-1.040316854865279556e-01,1.554578740588574703e+00,3.459942826625308943e+00,1.056003757667863807e+00,-2.534726798991027152e-02,-5.133144341543928180e-01,-2.600177610093328817e-01,1.321024662818351958e+00,2.754534942344093462e-01,3.072867729041314222e-01,-8.533536635900528244e-01,4.481321735594561151e-01,6.035576294879556603e-01,-2.059362233354103400e-02,1.586523619464517976e-01,8.643254399926840748e-01,8.433603612323061771e-01,-3.792678974678431736e-02,-8.116904235512238941e-01,5.816216293420739536e-02,3.518732620448799392e-02,8.488788735424560583e-01,2.049862762020086215e+00,-5.795323003934609307e-01,-4.255123602568440522e-02,6.596634899618265546e-01,-4.640764914550769005e-01,1.407547702069656959e+00,-2.474964488953106945e-01,8.286050924369388060e-01,-5.748774209041402905e-01,-3.542466254703571793e-01,6.328282666475775198e-01,-1.187331745461040478e-01,1.091229563787875501e-01,1.341301875114147668e+00,8.769441664177831663e-01,-8.137921876961109469e-01,6.138177607216064313e-01,5.584706138476399628e-01,3.913329441174653311e-01,6.204678051279464146e-01,1.124906353725409591e+00,-9.608711681512832614e-01,5.976066429468520624e-01,4.790039034077167579e-02,1.016500622261584885e+00,-2.706138765165511106e-03
8.965592567549837133e-01,1.758987828999257541e+00,3.810823260699561232e-01,-1.000223502907155781e+00,2.234768206709145111e-01,-4.357572450620187943e-01,-5.170643233227660840e-01,-9.620670799362707193e-02,1.106044112405302426e+00,1.457322846092423130e-01,8.421448637812650739e-02,3.575136535119348702e-01,-4.583438122666150250e-01,1.373865312706291086e-01,-1.954095854029574975e-01,1.511543788727415460e+00,-2.244428899533496558e-01,4.501536881020418157e-01,-1.667640348697644881e-01,1.506138926859311722e-01,-8.233811382998310613e-01,7.040184111081559948e-02,-5.837967143099045408e-01,1.703458360740598698e-01,1.593575251342794985e+00,2.198325889228604224e-01,4.226103904576805625e-01,-5.440923545899857272e-01,-6.928897040002328644e-01,-9.361824986647144797e-01,2.686432717622438959e-02,2.283384950663321256e+00,-6.575963554656338861e-01,-3.150914697837773337e-01,-6.868549608445547738e-01,-4.651337050440250698e-01,1.422072736763273504e+00,1.150274697618085540e+00,1.512436488779372201e+00,1.148793614734544111e+00,3.130463419781347456e-01,2.611866584644704226e-01,1.960177534769083074e-01,3.624878464717901094e-04,6.133071261577073274e-01,9.044510301985808631e-01,2.956868256023522434e+00,-1.650857752784433696e-01,-2.639761542771956737e-01,1.813734253819017983e+00,3.017139676361548339e+00,9.752951857052025719e-01,1.266074314120217981e-01,-2.789206239998373027e-01,-3.883890767548466294e-01,1.431928963782641562e+00,3.845153400508030672e-01,1.157493782132438254e-01,-8.821055236667534327e-01,5.571920829618819404e-01,5.297744756868609795e-01,6.075774687881619895e-01,3.333797178194624067e-01,1.382487848701818400e+00,1.368333257341264764e+00,4.564287215589543090e-01,-3.940530326099155323e-01,5.017183923984986915e-01,5.536041841279037978e-01,2.194378213382175424e-02,2.023572758597178556e+00,-8.554519227667776171e-01,-3.239214984621900661e-02,2.120222860417489419e-02,-4.237891800670962605e-01,1.111951642035287291e+00,1.736598775445430953e-01,8.154563136764232389e-01,-1.114294975670994337e+00,1.509081010092152564e-01,4.742807052663784440e-01,-1.937585270792363534e-02,1.750677396733113511e-02,1.415020749527597932e+00,9.208401879460030859e-01,-7.976443636186894004e-01,5.989651268644970994e-01,9.530894926346228369e-01,3.536350088634094835e-01,4.341142657113061243e-01,1.571889606762664648e+00,-1.061884883841436755e+00,9.700265505093429441e-01,7.337418057772368551e-02,6.367475887741134155e-01,1.955280883421975924e-01
1.213457860496494067e+00,1.732737672076776203e+00,-5.323826275944697484e-01,-1.462958669143171742e-01,-5.864050702145325034e-02,4.511208674454691425e-01,3.317530082765915433e-01,4.142196863459275402e-01,9.771933856143313335e-01,-1.107438543088027083e-01,3.954246300304381512e-01,8.947963576218262438e-02,-3.621905971007945979e-01,6.655035356497868149e-01,-2.682904361144982097e-01,1.894448328314959795e+00,3.271058258873482116e-01,-9.625880461495146534e-01,1.027890898912049988e-01,-2.261706343763681543e-02,-5.428915308361903502e-01,8.930880214032976827e-02,-8.304761763653797368e-01,3.175981995586548701e-01,1.241994757183759956e+00,-1.596176342412052307e-01,-2.256256711723030051e-01,-4.812314002690638581e-01,-1.778084626812979074e-01,-5.899592281784781234e-01,6.585700030286529838e-01,1.748822856095301637e+00,1.590734353099103604e-01,-1.585082227708309310e-01,-9.528717207998891325e-01,-9.781087331328206513e-01,1.817083734638191395e+00,6.119766681315401691e-01,9.501807882744955913e-01,9.419895293428903749e-02,9.700244286116137538e-01,9.295385094989627728e-02,-1.253855017232967106e-01,8.166990719631826989e-01,2.098851007839550031e-01,1.001524958704745227e+00,2.528533456916378430e+00,5.550701922104055441e-01,4.731814548161660805e-01,9.437923407383765895e-01,4.828932778434055884e+00,1.448225671430721784e+00,9.487145057586879870e-01,-4.736997155872445520e-01,1.993399510210080994e-01,7.068298447954672881e-01,-5.419910422717871823e-01,-3.143754054361047046e-01,-1.065257041514572789e+00,5.595197789201409311e-01,2.923602438810091186e-01,-2.486533809741257595e-01,-2.655581301382179404e-01,-2.960059709299298625e-01,2.647084987229266773e-01,-4.253260795464639532e-01,-4.532341343208756701e-01,3.744788703180181866e-01,-8.281087832897413570e-01,3.962935364998215748e-01,2.994183959422606733e+00,-3.319467037754941785e-01,-4.802388069354234790e-01,8.835576610931702435e-01,2.419023210484877451e-01,1.172803065105885612e+00,-3.173076201662311524e-02,2.359646096623141398e-01,-3.704774276419131596e-01,-7.912538591920598163e-01,9.826257110181095822e-01,-6.958145966171044861e-02,-1.743056154517621248e-01,9.412916870338164932e-01,4.599852257469634886e-01,-6.186710765379761501e-01,1.166912750661289189e-01,9.018967141405069832e-01,9.175151051804564251e-01,-9.097484281418201091e-01,1.642973054828439583e+00,-8.645649416076970351e-01,1.574539255988938624e+00,2.877834565819422652e-01,-3.931750889819060624e-01,-3.348381038162577816e-01
9.117208299167622876e-01,8.977293995901041157e-01,-3.944051281286430760e-02,-3.819255476082970557e-01,-1.266482818576358804e-01,2.880708504383470703e-01,-1.910754325178443125e-02,1.153663302531685586e-01,1.196368877735966896e+00,4.198656757393806060e-01,6.197028674837372630e-01,1.685175519041162695e-01,-4.243444785250232720e-01,1.085460002078341979e-01,-2.460744995419904546e-01,1.889181962017523642e+00,-2.284080581782042263e-01,-4.607565093589056915e-02,1.148262558034998659e-01,2.137625025686110125e-01,-8.216835114140487173e-01,4.073654555568951285e-01,-4.202260517868632861e-01,2.277625947766546699e-01,1.365085474216241268e+00,-5.221368382621855986e-01,1.924607939987767469e-01,-6.046298833323543453e-01,-2.514563725659553217e-01,-6.013115728276652305e-01,4.160620939229860982e-01,2.390569004701343925e+00,-2.131795387803421815e-01,-2.603098771568654324e-01,-6.012423580921641975e-01,-7.301644733271875909e-01,1.347846152734653469e+00,1.123388397419114559e+00,1.470429033241107408e+00,1.411846542037948682e+00,8.362060511057716194e-01,2.506012789302577426e-01,1.612530918287380377e-01,2.425755524910656047e-01,3.388480448602633199e-01,7.425244853241710352e-01,2.795143288899903489e+00,-8.430457064748969609e-02,1.397953332744989174e-01,1.092651270850592882e+00,4.040417771586996665e+00,1.366498093141112147e+00,6.198458340907708752e-01,-5.158411959505000421e-01,-6.276050785097011531e-01,1.472134472319981402e+00,4.833885756485337692e-01,-1.748208229092726163e-01,-6.203062347412726663e-01,1.423331928646911715e+00,8.874154015749561308e-01,-1.992887263534763032e-01,-3.331447288791040684e-01,8.505169742564204771e-01,6.622053132581967594e-01,-1.653401666483553800e-01,-4.505034453267808825e-01,8.929093600612947323e-01,-7.833818514430385127e-02,-1.590162526635023887e-01,2.750816452446599669e+00,-4.179819920618031981e-01,1.697448463923771911e-01,5.649564542599004868e-01,-1.263007757943235831e-01,1.305992038347175033e+00,1.122614310395359527e-01,7.903470802925303129e-01,-6.440002058964492404e-01,-3.656332901544701031e-01,3.883367976905992558e-01,2.885883334107139930e-01,-1.093154476096269423e-01,1.248880776930215930e+00,7.644424247950127871e-01,-8.937279981707377807e-01,1.646696143133158929e-01,1.711248777754448280e+00,6.279756038713044664e-01,-2.683163893671522970e-01,1.993812433388200578e+00,-4.604096263313034454e-01,1.046422316483235804e+00,2.587924245324304540e-01,5.596723841860183901e-01,-1.724609377187137638e-01
1.311762834662525634e+00,1.129595215922513329e+00,-7.398314781499225612e-01,1.811739680458431812e-01,-5.936216922968540199e-01,9.165965114573020323e-01,-4.285367693229474861e-02,8.989372218528837166e-01,2.187825118447662476e+00,4.323902097652922993e-01,8.227100765121051484e-01,2.438687670381747830e-01,-3.740056228620187717e-01,3.746172835507857179e-01,-3.069944436652152775e-01,2.599171035080318770e+00,4.069214895705525747e-01,-7.845191507056901159e-01,2.001220058576710370e-01,1.682375266055422813e-01,-7.205256641231765347e-01,8.349440823876637108e-01,-4.487131550319782836e-01,1.736254602246927181e-01,1.048763672340019770e+00,-1.145431422355918327e+00,-3.921972727696966254e-01,-5.199875108309881533e-01,3.941225985997924841e-01,-2.065002202536250220e-01,8.517506057741949244e-01,2.107173936110035672e+00,2.329178429254211147e-01,-3.692557196227194694e-01,-7.674999964960068644e-01,-1.062649718239730090e+00,1.820724515263912879e+00,7.963310103959746478e-01,8.516966638825151925e-01,1.106815864422435958e+00,1.566221151861514560e+00,6.579785279258149044e-02,2.668180417294659379e-01,9.345880030935246330e-01,-8.746518710216055759e-02,6.290818335411052509e-01,3.031827771751869349e+00,5.118926670227651465e-01,6.349993647217755388e-01,6.768691051216176868e-01,5.502842007564876070e+00,1.637440066900923696e+00,1.696679576555562896e+00,-6.340528729341172731e-01,-3.673065601062557306e-01,1.028151127066082804e+00,7.580163959665209283e-02,-6.559847766708699623e-01,-9.497686141319496844e-01,1.870523948517337054e+00,7.529687502396632537e-01,-4.644592840475897932e-01,-8.237323105098219855e-01,-8.572253190735845685e-02,-1.577679111515493116e-01,-9.018647084490234445e-01,-2.227243411838251697e-01,9.386848482973346730e-01,-8.107020197790273386e-01,-6.148595956744186131e-01,3.933978257099629339e+00,-8.590639520787302086e-02,-1.771429210753094896e-01,9.253175839956775395e-01,4.409157885627866813e-01,1.264576869978692564e+00,3.417250471130491296e-01,6.888786510603528424e-01,-2.594351752841810299e-01,-7.711328207303755899e-01,8.779406301676146995e-01,6.400108889071152163e-01,-2.699018636285709927e-01,6.426440966531872245e-01,6.493852196695797385e-01,-7.482783266521406684e-01,-3.821046721713691752e-01,2.170663570150314747e+00,9.905990787809149101e-01,-1.623122315512339764e+00,2.678762195964828230e+00,-2.287438055087702704e-01,1.820794143858930347e+00,3.304117202758936611e-01,-1.559374259529599516e-01,-4.871274200142111099e-01
8.678804224398612988e-01,3.390114480572814504e-01,1.380697324987292252e-01,-2.177514561311877372e-02,-1.841650009574022917e-01,5.313793065029901452e-01,9.958096809677557948e-02,5.044392322629819014e-02,1.506766297380679021e+00,5.959173349290003419e-01,4.906166969045185899e-01,-4.381012513173221379e-02,-5.306715919363728107e-01,-5.453891591559691110e-02,2.903889943041892963e-02,1.700604169182921233e+00,-6.842996859001995169e-01,7.962442870528024796e-03,3.392132839537796984e-01,4.727792631937977053e-01,-1.150550583488252565e+00,3.216949993634318217e-01,-2.861664287388805405e-01,2.821169221574698627e-01,1.127192659692495491e+00,-8.625063804979182791e-01,2.364795782577560901e-01,-6.925949053638211783e-01,-9.551261512059205927e-03,-2.153186850065180735e-01,6.334355442286057070e-01,2.704658143909395740e+00,-4.956957270965225981e-02,-4.070923243346906140e-01,-4.750450334090390303e-01,-7.205541077784178849e-01,1.149853979418942629e+00,1.274732111979103966e+00,1.171972371937657131e+00,1.715000169574156796e+00,1.107590044598641299e+00,4.160861232611424709e-01,2.207568194187185528e-01,2.489457697652575074e-01,5.291509761840871295e-01,6.913953646192294578e-01,2.855472332605479391e+00,-1.557335951710963617e-01,3.129319304935278545e-01,8.930414200869365438e-01,4.171878676899706484e+00,1.328780484705053500e+00,6.572866013761315962e-01,-5.701470681761552362e-01,-8.399300300902202698e-01,1.485281866024766417e+00,4.024192914630000950e-01,-3.959010011692419839e-01,-1.226028212784091576e-01,1.433884852240947083e+00,1.417136689879741729e+00,-5.239305238954860000e-01,-7.341466290634832692e-01,7.953734347015013473e-01,4.701725337974461683e-01,-2.538145594992368137e-01,-3.021674080312189981e-01,1.556109957815033029e+00,-3.885889878861135682e-01,-5.381934116732480788e-01,2.977528313695706252e+00,-4.160541163728174174e-01,3.919307647530525518e-01,8.707428643468538842e-01,-1.803836200865661932e-02,1.552568698681065396e+00,3.370093380158207252e-01,5.362172833086810142e-01,-3.802462010876960230e-01,-5.303409394691482870e-01,-1.579319179345234359e-01,1.958246054103765788e-01,-1.431785668824119839e-01,1.256334286463933969e+00,3.732313891120145888e-01,-7.678885450192179940e-01,2.345989996932396071e-02,2.443030521319404791e+00,7.309666107003557345e-01,-3.559236224754369071e-01,2.188754358695425672e+00,-2.837828982478454720e-01,1.179647455736615669e+00,4.975102225204317552e-01,3.446879980540660249e-01,-1.642126736681805421e-01
1.332784824499012366e+00,9.193827858398527786e-01,-2.621454463275576519e-01,2.804590979585434019e-01,-6.116262010255141268e-01,6.723084430947501300e-01,-9.351295528405176860e-01,9.611793561112379480e-01,3.152506056963209069e+00,8.857492556172537057e-01,8.204153013780409731e-01,4.004147363487884359e-01,-4.914991931698838856e-01,1.403531185071740794e-01,4.933224015732073919e-02,2.856583730256575748e+00,1.225400548360591202e-01,-2.663876816499868849e-02,3.486609739306677502e-01,5.750630296243153250e-01,-1.216897910568353502e+00,9.134665097726474281e-01,-1.313843928730062949e-01,1.457581261029907704e-01,7.124445206092064886e-01,-1.836429673438563448e+00,-1.037049203242379758e-01,-5.319737109750075632e-01,1.278348312066468928e+00,4.754871593271035035e-01,8.295664113486571623e-01,2.462674078061203531e+00,1.159438465428386245e-02,-9.864595486119698275e-01,-4.826987121001760639e-01,-9.970135445696721721e-01,1.322769852234718213e+00,1.398382359271889364e+00,3.856058274845652889e-01,2.216585616708337980e+00,1.753319212948951655e+00,5.226000896304744403e-02,6.751786371847761092e-01,8.375004788440767456e-01,1.422972459030541481e-02,4.293719670145169642e-01,3.761104766952569456e+00,8.990118035955849130e-02,4.423187216229668706e-01,1.471486978504355836e+00,5.003120394676774829e+00,8.801825351531579189e-01,1.760096206424409448e+00,-7.575955240717375805e-01,-9.922641778673777502e-01,1.318007085523520416e+00,6.093820043354459814e-01,-7.156299200768501123e-01,-4.688395403354165825e-01,1.784289340047102046e+00,1.856150636743089333e+00,-1.638271894420442187e-01,-1.157019519218373205e+00,8.657910756790586637e-01,-2.848039581437549206e-01,-1.115650978913742764e+00,1.207890536183161556e-01,1.600838657304620050e+00,-4.712054202131868985e-01,-1.718794523362374926e+00,4.401485425852776245e+00,-4.311568435454478654e-01,2.105234401448357606e-01,1.111655596987502603e+00,2.006450286881903411e-01,1.882256764173716013e+00,1.174213470452173613e+00,1.169808351770950106e+00,5.589349068861682035e-02,-3.764034769651832812e-01,9.690738721249481102e-02,8.550225099420813990e-01,-1.474099291984964921e-02,2.922793174099775904e-01,5.850765922660448037e-01,-4.218934627956598682e-01,-4.497631635914781101e-01,3.478122118141085295e+00,6.309266401924102929e-01,-1.045726949134715644e+00,3.343754603088577415e+00,-2.092948274768982042e-01,1.936311565231538356e+00,3.238620725432829195e-01,6.105017839225075349e-01,-6.948687147506071859e-03
7.560830751031309971e-01,3.728844290344200951e-01,3.997143338627766329e-03,-4.999759985698041254e-01,-3.090451358231807166e-01,4.221856304380349201e-01,6.887761613498516455e-02,4.785820746422965455e-02,1.295444154881877363e+00,6.531332878666038511e-01,7.775687272075065826e-01,1.812818773415829088e-01,-4.252921078909904784e-01,-2.167786999242918289e-01,-3.897578260307785758e-01,1.900294299461178449e+00,-4.387255705565729080e-01,2.212212123308487377e-01,5.931114470883010886e-02,2.273605395044424882e-01,-8.303177100532701527e-01,7.548574872336217823e-01,-2.256985523096148305e-01,1.329173862847887189e-01,1.553800728011681231e+00,-6.331792762545058739e-01,2.512227432264258487e-01,-6.886828609468256257e-01,-6.258734982965800109e-01,-8.444205053452122911e-01,3.309993061898925393e-01,2.734911044544822367e+00,-3.270929712247548915e-01,-8.411191416397345577e-02,-4.858655400997618501e-01,-6.022838695889541905e-01,1.351405002335313243e+00,1.172155577591567743e+00,1.945404081391907569e+00,1.926567480005793698e+00,8.367851527659025956e-01,3.742646176079605924e-01,2.645151962964875092e-01,-2.942247194796603071e-02,3.310617533154605607e-01,5.854511275472076282e-01,2.771871217363917506e+00,-2.486690986746901699e-01,7.822441603248680986e-02,7.163557875519930285e-01,3.966193762444903292e+00,1.749603654623330673e+00,6.021256795201174183e-01,-4.917906195410108872e-01,-9.527442889319674979e-01,1.860869024840638541e+00,9.646653307976140734e-01,-1.835363361114146774e-01,-5.565332248227208289e-01,2.312673798111108070e+00,7.968197870008387751e-01,-3.272690335803599693e-01,-3.417774069434938999e-01,1.131961360334730937e+00,9.044918416875025180e-01,3.124053190961112447e-02,-5.126647120197438401e-01,1.082407518979041194e+00,2.277702272321364130e-01,-2.789727775767761875e-01,2.610490804174908419e+00,-2.586875433097957644e-01,4.364828390395242286e-01,2.361036748516722183e-01,-1.544642385907764870e-01,1.064403140662240954e+00,-8.202444086870630535e-02,9.587033557880790813e-01,-9.875108674796970742e-01,-2.693151096107822551e-01,3.719750326727120360e-01,5.684539151840584115e-01,-2.412769261682100874e-01,1.545395035659312688e+00,1.004284254790830389e+00,-1.247222294878755910e+00,9.302778635840841526e-02,1.907966200099215914e+00,6.670247921603618124e-01,-4.013031246729996671e-01,2.174201444492907864e+00,-7.738090483668147446e-02,7.916661249571261827e-01,2.733505047927081710e-01,7.166829132989682716e-01,-3.427531375037365935e-01
8.995406088546552548e-01,2.357010959835936781e-01,-2.485883994124125640e-01,-2.386781760506438976e-01,-6.313845812443378280e-01,7.798900057828854759e-01,-1.422853903976484258e-02,4.268878355343285191e-01,2.031735954995470106e+00,8.090394316678061193e-01,8.787300692991393269e-01,2.268085315284540937e-01,-4.307800450491016675e-01,-2.691599321617774709e-01,-4.073101695724025695e-01,2.247893242432740912e+00,-2.875047012032894700e-01,6.460761773181378231e-02,9.995209142618780018e-02,2.817338331911935501e-01,-8.790490711697858117e-01,1.114628930991541589e+00,-1.170679246807731499e-01,5.700507379976024747e-02,1.422077159627293419e+00,-1.068811774304947448e+00,7.892968208900452698e-03,-6.912075212530738311e-01,-3.780738756180153093e-01,-6.518486432851838819e-01,5.277596248583673599e-01,2.815005824659818412e+00,-1.714839240998268233e-01,-1.451074667400937823e-01,-4.882607538196397368e-01,-6.892059118171457444e-01,1.553339279587526933e+00,1.090665893295649447e+00,1.735616282554888201e+00,2.117007429173638933e+00,1.252691302502791926e+00,3.602771498581234799e-01,4.231425404288384762e-01,1.951123189580018513e-01,1.629690445646599373e-01,4.392100863648120135e-01,2.985706054798472842e+00,-4.742097999337681336e-02,2.962082206445116883e-01,4.148398251854613639e-01,4.617791687516285215e+00,1.971795532639746940e+00,1.156107106270221063e+00,-5.381327644641648034e-01,-1.023287220943109643e+00,1.818087975714572480e+00,9.824088970313530345e-01,-4.711018857080550015e-01,-6.131386289469794582e-01,2.884969960136009703e+00,8.210142429218139082e-01,-4.759677183356150199e-01,-6.439607536589091463e-01,8.697217285870616488e-01,5.974553564318358934e-01,-2.487423023777304287e-01,-3.507747818592195088e-01,1.329375198027188620e+00,8.172284677314962942e-03,-7.341814927499197285e-01,3.204735522951737803e+00,-7.491986464613908936e-02,4.166691231521768568e-01,2.863817014135873196e-01,1.177711180747541969e-01,9.961945747549874053e-01,7.155140844714963366e-02,9.775131932439302673e-01,-9.188192227214302399e-01,-3.875352004791848270e-01,4.871897312879277520e-01,8.656225414713434319e-01,-3.661877485593678649e-01,1.338136866948963277e+00,9.962524394970723174e-01,-1.273842763046438842e+00,-2.302283038242158297e-01,2.413255493004335506e+00,8.477819189703627023e-01,-1.117346196436653782e+00,2.688809293922090227e+00,1.997047845716201087e-01,1.132831488666353525e+00,3.420995007964313661e-01,4.182586902749203528e-01,-5.176701610069839310e-01
9.734628848302393500e-01,1.338389106344386015e+00,2.952108493863971339e-01,-5.832447325628423718e-01,-1.254948015029682673e-01,2.393323717331341527e-01,4.769379019036962264e-02,1.155866227032202875e-01,2.023705892942653684e+00,6.207389873271376701e-02,-6.303820168196978546e-01,6.278926975197163252e-03,-6.219573809917694485e-01,-1.374133143079483976e-01,1.516289997021152969e-02,9.720062660336208360e-01,-7.305194793417779664e-01,9.946831342885900651e-02,-1.047111984848161786e-01,3.113025769961070832e-01,-1.110327714013976230e+00,1.563697735237935815e-01,-5.733841797592232892e-01,8.453244352524458272e-02,1.522000046835741971e+00,2.824242663367726447e-01,3.353271312469102705e-02,-6.914624443701758993e-01,-1.346700754757151675e+00,-9.533303129656444108e-01,4.231016115926127252e-01,2.730718530105013642e+00,-3.109576770496418896e-01,-6.945089425484143875e-02,-7.961281204822152624e-01,-3.162010120215189013e-01,2.011741461242604778e+00,7.006360809112250898e-01,1.164169543952362496e+00,7.701007923609806127e-01,8.693457800253276968e-01,6.869155252618318608e-01,2.376546813233608724e-01,1.671931833010715240e-01,9.552312633734426628e-01,8.894922893156873567e-01,2.849963704383744911e+00,3.853139016326134758e-01,2.561803092092915790e-01,6.301166646109028768e-01,3.848397554100826401e+00,1.822876282456965980e+00,5.745523866211098563e-01,-5.069550280395457298e-02,-1.015275289170940454e-01,1.120726822055411631e+00,-3.552243198092347454e-01,-5.172617726791567394e-01,-6.910372856597305491e-01,9.795430966566025521e-01,6.195092872375518311e-02,1.775915670135289615e-01,3.376187811883888529e-02,4.034698644616476759e-01,1.434842052013329594e+00,7.964153588863797095e-01,-9.094445060657996294e-02,1.321993617633334672e+00,-9.917479834649742254e-02,-2.585144822450792246e-01,2.193297472411235738e+00,-5.924772555603097235e-01,-1.658552240453354809e-01,-1.625940523436108787e-01,2.446186174342326325e-01,5.264136594384931644e-01,3.762472679474621051e-02,-2.103240983175845846e-01,-1.424197949771734750e+00,-2.448354929104552824e-01,4.266387795969582286e-01,-2.116685629584130202e-01,-4.778330635326624720e-01,1.744108623796994717e+00,3.402800845726630108e-01,-9.269504826949226395e-01,2.500566145657489026e-01,1.225910833575593939e+00,1.024738038420967889e+00,-9.674136049830599493e-01,1.766721399652942281e+00,-7.690674385112947764e-01,1.615605024819699143e+00,5.415830692415490866e-01,-1.167120144002891768e+00,-2.719717296962732567e-01
1.410704246445967147e+00,1.561454115328452019e+00,-3.359787705387161649e-01,8.768556011157035979e-02,-4.904538797150227447e-01,6.247406172392986345e-01,-5.513031392126619412e-01,9.373625617680613198e-01,2.969108259002111616e+00,3.627863216275490910e-01,1.467057446102619234e-01,2.803504051993177537e-01,-5.167949998197831629e-01,2.857921437615160154e-01,2.600203082086310902e-02,2.280071655474407599e+00,1.540707912539261426e-01,-3.941572966351722385e-01,1.466154235393050953e-01,3.814943470816373194e-01,-1.068253339533939084e+00,5.988526184201068414e-01,-4.628621984870182615e-01,1.200873555413061317e-01,9.258897057953027199e-01,-9.729516551594097340e-01,-3.219545546229941602e-01,-5.200550406945647630e-01,4.091949164706121245e-01,-3.718412070489174326e-03,8.164383531177641373e-01,2.271127755237343671e+00,6.054482243944275810e-02,-6.492006645555405964e-01,-7.776944545277643117e-01,-8.624540570540868423e-01,1.897658654112187815e+00,8.753009837927190340e-01,3.308810907746377872e-01,1.118456692096995608e+00,1.595194762828180401e+00,1.984572590109313639e-01,4.638356773519948795e-01,9.280061497916850533e-01,2.603716986913939824e-01,6.778168702208184904e-01,3.439504093320107536e+00,5.747782371168898008e-01,5.578924007699639365e-01,1.096957780644159719e+00,5.074250250284185526e+00,1.285204607853227765e+00,1.657447108796774593e+00,-4.631740349079926933e-01,-2.726290600348109106e-01,8.601936417848803362e-01,-2.263601440302351886e-01,-7.884242443607211159e-01,-8.355774038450347607e-01,1.195619845435020201e+00,8.782039270419979005e-01,1.730807168805409413e-02,-7.147283195518233656e-01,1.388940193069073681e-01,1.305859878079715930e-01,-5.708113139263210067e-01,1.283983667377919247e-01,1.294733171211113198e+00,-6.741006360916221851e-01,-1.111752847334523286e+00,3.868297082136293419e+00,-4.440189891248960685e-01,-2.776215962353674738e-01,7.281903725795280113e-01,4.598114490210943872e-01,1.267357340958562784e+00,7.823966034966387539e-01,4.323820521449385224e-01,-3.997060824631430975e-01,-4.878514334938848229e-01,5.671794966193777210e-01,3.876805361422651641e-01,-2.444111326742777202e-01,5.994521567465374012e-01,3.825630204057594019e-01,-4.677897415705587481e-01,-2.913183558319166200e-01,2.383298419558753434e+00,9.396722488394875228e-01,-1.520577565044125778e+00,2.775580406382680998e+00,-5.832028750664530747e-01,2.213460957771319126e+00,4.108926272900955690e-01,-5.935616693150709278e-01,-1.907254241319315535e-01
1.150295878576173658e+00,1.299059841516767788e+00,1.646913152835876026e-01,-2.708383573200894845e-01,-2.834256057177849675e-01,2.755542684405986043e-01,-6.167107743384194762e-01,4.859030215814309495e-01,2.649538600501341712e+00,4.423239090371901550e-01,-5.379538213354501108e-02,2.439488045321916154e-01,-5.809452891133736196e-01,-1.301400536345355408e-02,9.095259359552332334e-02,1.820108063003334387e+00,-3.522467859933071099e-01,2.075326779353170448e-01,7.833994022409429547e-02,4.723430951376269560e-01,-1.220294566581219708e+00,4.427416717591466933e-01,-3.669710121136615100e-01,1.044924501799122107e-01,1.132274983365411547e+00,-6.571644681839909907e-01,4.238592333763990805e-02,-6.026270418980197441e-01,-6.623945514328322126e-02,-2.471412258271084017e-01,5.455951676692915031e-01,2.610400645807129383e+00,-2.604629377758360675e-01,-5.941656143904190390e-01,-6.358803488684422467e-01,-5.870321559798553634e-01,1.641004620166206518e+00,1.103655014785816180e+00,7.246621646798840910e-01,1.509751708317927488e+00,1.212936595928538086e+00,3.824545407102822869e-01,4.935903190072772340e-01,4.409599115723265017e-01,5.752373084051700669e-01,6.865228851092886053e-01,3.396855500059781985e+00,1.894757284623146409e-01,2.506544806597712505e-01,1.271513913093764714e+00,4.149767584386138353e+00,1.197622971886214582e+00,1.051319691550029578e+00,-3.563132325101097675e-01,-5.355398139787630463e-01,1.220931278802364739e+00,1.196645518358429028e-01,-5.647989789096523605e-01,-5.791188936127855680e-01,1.144525669477108654e+00,9.786771929363073941e-01,2.059492551421851503e-01,-4.453422309882367758e-01,8.171975203518351272e-01,7.261775209987307855e-01,-2.602889138395836355e-02,6.358318398065343491e-02,1.452570558308194926e+00,-1.347866306843283069e-01,-1.039439678840756720e+00,3.163665627925822843e+00,-6.457357832928145580e-01,7.452757133778645238e-03,3.777125771696464573e-01,1.426675161042926798e-01,1.215844257917743310e+00,6.937293495373153540e-01,4.922280748993588251e-01,-7.575065572405570435e-01,-1.706421706868752608e-01,1.936536435530999967e-01,2.454667113382659749e-01,-1.995570430057204414e-01,1.033912033704025291e+00,4.633079456659831563e-01,-6.143142426647175691e-01,-4.875158376173804875e-03,2.295327154888829213e+00,7.445862922945194473e-01,-8.006834541452810816e-01,2.502760055050209154e+00,-6.322585564462804841e-01,1.779863988410564701e+00,4.042087780078743031e-01,-2.333225413860996467e-01,-1.400484633665644019e-02
1.064442758093364638e+00,9.248950403885022320e-01,-2.411576326016167116e-01,-9.860694641754663703e-02,-3.639548825309181779e-01,7.324508170437191712e-01,3.212665234155201999e-01,3.908409950521930520e-01,1.848048628252764169e+00,2.497044922112910958e-01,1.279794800718977998e-01,-1.366369938151901220e-02,-5.042303092966178291e-01,7.315884416624311715e-02,-1.463252974219367841e-01,1.635660966073816613e+00,-3.304884564977862427e-01,-4.613423950810722762e-01,1.159794245056863793e-01,2.438881572876947512e-01,-9.167474586338152376e-01,4.525563644410683928e-01,-5.053317424003987979e-01,1.682752707525521640e-01,1.300600911259072401e+00,-4.173662301434404309e-01,-1.782801080360140455e-01,-6.527698003512186764e-01,-6.218488460007548513e-01,-6.210612866981793934e-01,7.045175479194560886e-01,2.497761466504262451e+00,6.377058819938646872e-02,-9.981557974219207319e-02,-7.646583443073096120e-01,-6.957363391965177835e-01,1.879579079414011034e+00,7.090616615090044039e-01,1.118108056247339999e+00,8.866740648674624747e-01,1.234264329776015856e+00,4.535483014454501638e-01,1.596906488966252091e-01,5.064247748463683862e-01,4.819735186916974667e-01,7.744970938228092905e-01,2.735188954162767860e+00,4.383725451267126427e-01,5.302707602462125580e-01,3.586263607445308588e-01,4.775250926900173276e+00,1.913573684953429943e+00,1.053248670040813906e+00,-3.555843156898128576e-01,-2.476851028844324620e-01,1.096856156085081135e+00,-1.896765287798108934e-01,-6.130033344240427562e-01,-6.843315579524886783e-01,1.542312337724226268e+00,4.051241037385249211e-01,-4.047500085129872027e-01,-4.802012536501496509e-01,-6.998037296107706418e-03,6.142940609897350468e-01,-2.774567849087805627e-02,-2.354635405186689123e-01,1.239659894586732536e+00,-6.112921121520371592e-01,-2.692504052998115904e-01,2.972636635827353935e+00,-2.358515709802199989e-01,-9.855199087956918735e-02,4.663865441593436634e-01,3.891389100492013697e-01,8.720663316889052386e-01,2.561264107058885964e-02,7.877295903138531452e-02,-8.133608007213712909e-01,-6.677792407964133758e-01,5.741046296765128787e-01,1.460212358764924334e-01,-4.368729395209790534e-01,1.337805985388358820e+00,3.913279860850025216e-01,-9.158154848303774465e-01,-8.494884018833198658e-02,1.691080373025749317e+00,1.106569017738774141e+00,-1.359505499203298440e+00,2.106204747689971235e+00,-3.769987874966183039e-01,1.620660570765328767e+00,5.265939013940320601e-01,-7.851973596564842950e-01,-4.990031768706830739e-01
1.267457433996182603e+00,1.349263914173541190e+00,-6.654438063468786080e-01,1.514923484356909267e-01,-2.850259174550772712e-01,7.240497941341736965e-01,2.038022284284885521e-01,6.320123050245157748e-01,1.424695630113756550e+00,1.765711053057011370e-01,7.254996901380117436e-01,1.204031312698628231e-01,-3.589226536845359639e-01,6.017768031035525267e-01,-2.428779752151233595e-01,2.301517602386705885e+00,3.775392277359543303e-01,-9.774431264341529868e-01,2.460811447380640837e-01,9.723165405519511306e-02,-6.417119726394474588e-01,3.792407232812479712e-01,-6.473116860037267939e-01,3.080231209769321854e-01,1.043061425278967169e+00,-7.792222238102636256e-01,-2.912923441583536999e-01,-4.916008087489268652e-01,3.568054448435153958e-01,-2.383141802550989841e-01,8.225397980735691394e-01,1.859504748099614524e+00,2.851525921917129058e-01,-3.310075933911994506e-01,-8.390007920897091243e-01,-1.108550262473422476e+00,1.684181885779822974e+00,7.662520662214407086e-01,8.016913339091509272e-01,5.909184811387495628e-01,1.304118974696141908e+00,3.150080524678539051e-02,2.035050591458603675e-02,9.433748976820651722e-01,2.195140833191638885e-02,8.326874293754449319e-01,2.739281502675294355e+00,4.944041836428934578e-01,5.970078714823545685e-01,8.772016353677202227e-01,5.244730255011095466e+00,1.413703431335419314e+00,1.312929024063955730e+00,-6.348205709539878061e-01,-1.087810014728410879e-01,8.240627022196225226e-01,-2.652139241469964048e-01,-4.726957992499203343e-01,-9.038656139050427196e-01,1.067907878713984626e+00,7.425839160553753260e-01,-4.831705745852556966e-01,-6.711145701303260491e-01,-2.432352803489307158e-01,-1.460445772216141247e-01,-8.503848876149062708e-01,-3.677693148300539283e-01,6.753080268518527607e-01,-9.757079114105219331e-01,-8.127699623432382836e-02,3.583617400614549364e+00,-2.050967823474241780e-01,-2.989516214986683296e-01,1.155282663243100805e+00,3.211791121483843492e-01,1.422566852548089678e+00,2.119101283072726827e-01,4.804494672630086338e-01,-7.266937663653516566e-02,-8.824200072888441770e-01,8.232610910757619527e-01,2.480871656792227042e-01,-1.552936247291485661e-01,6.844718136558758381e-01,4.665113324490191005e-01,-5.855094343950738578e-01,-1.480227473571958940e-01,1.659963158525759486e+00,9.252826410823449255e-01,-1.154070398613509241e+00,2.143431726744466470e+00,-5.510747974102669922e-01,1.679083807558878760e+00,3.236242849509792241e-01,-1.347855157194777775e-01,-3.764539755589537129e-01
8.790921250183093560e-01,1.446319386788913253e+00,-4.733061504571792893e-02,-5.536662036295504352e-01,2.932203801514459696e-01,8.935680722633121409e-03,4.264508249878474766e-01,-2.123548480618845102e-01,5.350186235477982777e-02,-8.806935296574328054e-02,3.860220810793942858e-01,2.380155816417427184e-02,-3.760305383572343785e-01,4.745112395090153035e-01,-2.699593562492283993e-01,1.415335712593340123e+00,-1.313034370402252349e-01,-4.423901582662945753e-01,6.216413409360332237e-02,-1.252158647851248779e-02,-5.711393698560042198e-01,-2.065885200151220680e-01,-7.943984688315892662e-01,3.771557463644171770e-01,1.492828600900039548e+00,2.576720722174857259e-01,2.344008684313718671e-01,-5.471964626726745218e-01,-6.291631290733255000e-01,-8.997094577701278961e-01,3.281209738248895280e-01,1.943913252030703864e+00,-1.566464082134172153e-01,-4.631348255279901793e-02,-8.067380160750915463e-01,-7.639711950194330026e-01,1.394494927820828289e+00,8.835511314412867190e-01,1.516092009734884449e+00,3.725661018703447791e-01,3.983590696676260201e-01,2.054230407407556247e-01,-2.392188797599376082e-01,2.759066939817051423e-01,4.745892559600459193e-01,1.075775287622402487e+00,2.281662730623262192e+00,5.148951227907758166e-02,9.511220804488765279e-02,1.224993304918384096e+00,3.751387523564188697e+00,1.262514821119270048e+00,1.078737011981772964e-01,-4.288790690749585410e-01,-5.118724187872319975e-02,1.097284933945251950e+00,-1.422571618754703837e-01,9.210271756143614819e-02,-7.997179457780786427e-01,3.233170578614343871e-01,4.384974836328427439e-01,-1.393788895945720918e-01,7.357542469136649221e-02,4.274936490123463217e-01,8.262468520158503527e-01,5.956980323080995898e-02,-6.951455255448497628e-01,2.913762450487459299e-01,-2.820046315935810788e-01,8.195270684192184074e-01,2.104362334064124873e+00,-5.339966940932621142e-01,-1.686118655778763298e-01,6.741018256336199777e-01,-2.213566001194287036e-01,1.250978766186208402e+00,-2.649312097618132800e-01,3.890668920694381749e-01,-6.065668819334435469e-01,-5.249183160206765120e-01,6.189871221682206048e-01,-2.916399763247860544e-01,-3.531549738686284856e-02,1.402970600574321214e+00,5.935030760103137126e-01,-7.671740875876484900e-01,5.259350092633762186e-01,5.576395725509040169e-01,6.244385998588393161e-01,1.737875140289066311e-01,1.105244011879315646e+00,-9.757667550661414113e-01,8.854760464806366027e-01,2.156642266993986923e-01,3.060970272651063473e-01,-1.245325958781896558e-01
9.494587621034297209e-01,1.550690262576517098e+00,2.940411359484939036e-01,-8.575479132255978687e-01,-1.245735614381074385e-01,1.075667795448551067e-01,1.130929679711012437e-03,1.033424237100406262e-01,1.977709766343148878e+00,-1.413838716183468680e-02,-7.033408740085091981e-01,1.012900442870664774e-01,-5.967661573858308310e-01,-1.846787917976560056e-01,-1.257061174267459225e-01,9.242389713521109718e-01,-6.407488130790401915e-01,2.039991691938359275e-01,-2.721907304710054487e-01,1.979096366900764126e-01,-9.886623096696273150e-01,2.437810520070762821e-01,-6.091326479454318710e-01,1.150742573568835914e-02,1.728785530508219814e+00,5.623040310558860000e-01,3.090722114673516430e-02,-6.819590209594564856e-01,-1.740153961704413499e+00,-1.278836564936444598e+00,2.668097287513102600e-01,2.717626098141714852e+00,-4.646343308159746610e-01,7.645272426972632429e-02,-8.496483356570181389e-01,-2.149909420898100110e-01,2.185841874919548733e+00,5.957708578894062024e-01,1.423437958705932260e+00,6.838220916744758293e-01,7.024875855831944627e-01,6.987981474821980399e-01,2.468418983718717041e-01,5.242865125910070589e-02,9.558882734173002049e-01,8.971513624222147154e-01,2.822873694036175607e+00,4.158145918341983327e-01,1.400192143240227005e-01,6.037197409067086573e-01,3.664552258162486975e+00,1.984690498438256512e+00,5.023366403620120879e-01,5.302344136150566323e-02,-2.001539153792503134e-02,1.189365143083436216e+00,-2.770873246768148501e-01,-4.307928850136099053e-01,-9.313752681316781468e-01,1.127288352795773996e+00,-3.393992063429340789e-01,3.880306079817014142e-01,3.129535592548523537e-01,4.982826842382693799e-01,1.741369692481802733e+00,1.056806688505473879e+00,-1.394369245857390860e-01,1.084672749905027711e+00,1.810664569372378851e-01,-1.016114534517028600e-01,1.917307530824784001e+00,-5.952314798973283860e-01,-2.421441361129290648e-01,-5.280452465333642653e-01,2.045716731697234114e-01,2.321321122649450119e-01,-1.395850628248472836e-01,-1.571819320977176915e-01,-1.776876977787560596e+00,-9.042827069678827101e-02,6.894918799332254711e-01,-1.680468023621014551e-01,-5.355672645916397245e-01,1.905724553691373835e+00,5.584056865365334410e-01,-1.092835540590015642e+00,3.395595016136270239e-01,8.198886094092692201e-01,1.014792070472198215e+00,-9.905925280599365834e-01,1.662324075235772636e+00,-8.154495979471408917e-01,1.528481393188880322e+00,4.535208927465350093e-01,-1.211455138670783249e+00,-3.145377805300639817e-01
1.020082451161072656e+00,1.438506997760010453e+00,-2.229386205319128789e-01,-6.581410340522562130e-01,-2.033024776636127573e-01,1.750129054661206385e-01,-2.043562667567509483e-01,3.305862913076501042e-01,1.393489154186408951e+00,2.787900854509247073e-01,5.648484441420970059e-01,3.717949800505859215e-01,-3.658885718186429825e-01,1.815863585413263204e-01,-4.542062629709862076e-01,2.060773661333817675e+00,1.615784308459375374e-01,-8.560581551857683602e-02,-1.170990924403811084e-01,2.649103220261461722e-02,-6.038512107240100457e-01,5.992096880715874763e-01,-5.117093733895068386e-01,1.163170609117390730e-01,1.554542422705604610e+00,-2.652892424403578420e-01,4.299900884690285863e-02,-5.385303194037172059e-01,-5.377280608458208100e-01,-9.253686599127839418e-01,2.827054346197799828e-01,2.206948725439545456e+00,-3.416574445747544986e-01,-1.410835898566059066e-01,-7.399800818595181351e-01,-6.940041237202998481e-01,1.708409573840124596e+00,9.054813705608015795e-01,1.603005138826906428e+00,1.154556475119784542e+00,7.559732587451298835e-01,1.646417713084188938e-01,2.058379624409950592e-01,3.012028378987537947e-01,2.039889317359676602e-01,7.454887218739887356e-01,2.873021389955188631e+00,1.204668947613082852e-01,6.761545355876875940e-02,1.121894192475553442e+00,4.107556813697152087e+00,1.535941975903430512e+00,7.986073336904428999e-01,-4.057233762710906744e-01,-3.994079293049259682e-01,1.404157737264084771e+00,4.593423806433087342e-01,-1.400787130944899095e-01,-1.106536533502002539e+00,1.573263834607082856e+00,3.009167744120713195e-01,1.368335731531893362e-01,-2.018760329865425251e-02,7.804347277388881121e-01,8.605442294782281731e-01,-2.840866575479494838e-02,-4.468680743616244566e-01,4.691585307727880183e-01,1.556417014964918688e-01,-5.728285409339001211e-02,2.692730838386685921e+00,-3.948419443537526385e-01,-8.469062710620027523e-02,1.648552334506996619e-01,-7.120199246835902385e-02,9.333012130797065931e-01,-1.274786037886022072e-02,8.958748576091817295e-01,-9.984736610137061597e-01,-2.075313069204566263e-01,9.225158118026008935e-01,4.246673611517493563e-01,-1.795809709403456966e-01,1.233165867647143532e+00,1.064114082630636782e+00,-1.019606728540864538e+00,1.826510898765938140e-01,1.198368899884601380e+00,6.509100261057807479e-01,-5.613676221231119756e-01,2.011142854774517374e+00,-5.673575566709466722e-01,1.156160947652153270e+00,1.059732896253048895e-01,3.887090683347527165e-01,-2.430984731142120936e-01
9.572390629786859950e-01,2.597758781678739526e-01,-3.872923249433840587e-02,8.231076258884195695e-02,-3.970511691971107537e-01,6.531447161223837838e-01,-1.980651333152712579e-01,3.298646675103798498e-01,1.959959753671372873e+00,8.276600544372703094e-01,8.441819256388485293e-01,1.218102172435530373e-01,-4.890235015044011591e-01,-6.892479454243628789e-02,-5.357848534364434423e-02,2.220106052831864574e+00,-4.226929996852468174e-01,5.082983306226510067e-02,3.618004785105984888e-01,4.974315786965894381e-01,-1.132661646281357903e+00,6.796120705666310879e-01,-1.433267707124409318e-01,2.268547010590189206e-01,1.029723059541212349e+00,-1.350692422653013924e+00,1.602653023437489721e-01,-6.589029552890351971e-01,4.441723253537501748e-01,-1.747286953737203774e-02,6.787024129539980244e-01,2.698937034136760893e+00,-4.110047189061374895e-02,-5.576954487593979159e-01,-4.088315602940056359e-01,-8.327334843529168307e-01,1.113903718364563478e+00,1.388086530860280554e+00,1.123503233169188320e+00,2.149998217898584585e+00,1.328463686706879310e+00,2.787919913269171213e-01,3.911326378669036652e-01,3.648860556547106615e-01,2.635638167460889192e-01,5.270313153462081734e-01,3.127081154861069301e+00,-1.944014125145357985e-01,3.303202442062467825e-01,9.916472759953973704e-01,4.476594453814014329e+00,1.265647993957067508e+00,1.031320943348563279e+00,-6.948290417324691770e-01,-1.080550577091508924e+00,1.614567881269150407e+00,7.548159983996940436e-01,-4.634818912576987859e-01,-1.974180199046998707e-01,1.944030649877404038e+00,1.651196253525605284e+00,-5.291377936427186235e-01,-9.451063374870152245e-01,9.587124178503955152e-01,1.788101945485572886e-01,-6.194673325830970523e-01,-2.393671595174812206e-01,1.585123999473249112e+00,-3.270506065723929878e-01,-9.514436645239587875e-01,3.491174950811083200e+00,-3.269632593423903444e-01,4.767112715408944323e-01,9.532975099152688481e-01,1.246427685453480039e-03,1.689349340422350743e+00,5.480077029644787601e-01,9.386705608275434098e-01,-2.344725926805295568e-01,-4.808857889468672875e-01,-8.551677980253258315e-02,5.859288941562621478e-01,-1.000035301088271766e-01,9.716149173453785259e-01,5.802360259369946371e-01,-7.768325369622459675e-01,-1.802133849706424873e-01,2.934048456662398330e+00,6.657941322706298903e-01,-5.517543187308295849e-01,2.669323030993642654e+00,-6.583043668985244512e-02,1.260026547597897117e+00,4.118650402689358891e-01,7.226914099838246397e-01,-1.707640968164610418e-01
8.499188765459296802e-01,2.062173778820854952e-01,-3.059039411219723892e-01,-2.310847986386634911e-01,-4.883329375087852031e-01,6.736455715730340632e-01,3.780761613531341547e-02,2.971000677657911759e-01,1.417064031888650488e+00,8.197781683832013888e-01,1.249968169115133421e+00,2.464334168938819292e-01,-3.566084872340034018e-01,-1.021213472351454321e-01,-4.788419923934241762e-01,2.420703670912030425e+00,-1.316973833231825930e-01,-2.077786594303773771e-02,1.725985341944163143e-01,2.119455780645282950e-01,-7.424512605563453604e-01,1.008282626191763676e+00,-1.483207389465733828e-01,1.542765004727945644e-01,1.392443633342350440e+00,-1.150306199755781966e+00,1.240339538094873129e-01,-6.488116800990866295e-01,-6.273813308778453113e-02,-5.811404907854185176e-01,4.807851854701173933e-01,2.600945576947318205e+00,-1.521604195515574853e-01,-1.881149897532484183e-01,-4.505352418779554058e-01,-8.289690380873351305e-01,1.270301826967096925e+00,1.228985117503810232e+00,1.853696854560693108e+00,2.132656990250928253e+00,1.093835178585429224e+00,1.993110332131730333e-01,2.999105588660380683e-01,1.940411569962976479e-01,9.345093802280879380e-03,4.759886477112296177e-01,2.851778523332198834e+00,-2.329364288496306168e-01,2.080383217003319019e-01,6.890709138673462020e-01,4.503730409585869232e+00,1.713933465070171636e+00,9.763735294289178634e-01,-6.838342926899169116e-01,-1.098859865978312200e+00,1.873910822196262149e+00,1.153059247081618999e+00,-2.534398953275915356e-01,-5.870441166159342528e-01,2.694524587966403928e+00,1.072151913804809453e+00,-5.671757021938022003e-01,-6.611663143308196267e-01,1.010689722502433385e+00,3.936286207174624074e-01,-5.109546346617852564e-01,-5.389001100515200537e-01,1.047178417393975325e+00,7.099599689193332452e-03,-4.656298475191603670e-01,3.194395556060642072e+00,-8.389624356816702266e-02,4.823823842265831385e-01,5.812010309497513960e-01,-8.453362229637620406e-02,1.307134351847018872e+00,3.397122471657204601e-02,1.252943233026216685e+00,-6.194562318353181718e-01,-4.360954870953993590e-01,4.603246355339546403e-01,8.715615630628266164e-01,-1.876970900944422704e-01,1.209979970591918974e+00,1.094628567131744612e+00,-1.208177207811731435e+00,-1.356278687350423451e-01,2.322319264943054407e+00,6.647371945197072529e-01,-6.355241775582929353e-01,2.523043762785634581e+00,1.521571759237131394e-01,8.534343333726378544e-01,2.268529991838523496e-01,1.047011096039645039e+00,-4.216920292208269361e-01
7.961029932455344627e-01,8.891171043299482823e-01,-1.180178050533968181e-01,-4.424479018024772836e-01,1.840457568978494662e-01,1.873446860323263463e-02,7.230591557014953707e-02,-1.777523625696820209e-01,-6.813798301303730653e-02,4.162509877934507108e-01,1.314481983862383574e+00,2.201061712461545583e-01,-2.772005183896499858e-01,4.255789985398486519e-01,-4.035689723155237996e-01,2.180879182729267285e+00,6.890139058685224027e-02,-1.669710352034280143e-01,2.231574433529402435e-01,5.769697401895259453e-02,-5.365443624860845029e-01,1.802291433825158329e-01,-4.945365943528173824e-01,4.106753124563384816e-01,1.354741018852148482e+00,-5.921725986737311764e-01,4.460400947573495145e-01,-5.210029027287581549e-01,2.721562109800235163e-01,-5.350599460545819586e-01,2.763008474194685871e-01,1.970439372904450925e+00,-2.221695996888699010e-01,-3.179852202493948510e-01,-5.339321167678132696e-01,-9.724270642639498696e-01,8.037342423348754483e-01,1.388163353273037970e+00,1.762506497361352231e+00,1.420333057340630312e+00,4.573322842440127878e-01,-5.705968639449393587e-02,-8.758362871243337289e-02,1.946775133244592060e-01,6.090063026773845367e-02,8.280230962742620715e-01,2.516720106849315464e+00,-4.644274711922680710e-01,-7.675318188664186081e-02,1.658867770983838419e+00,3.712076615499554588e+00,8.646376167181134553e-01,2.010202517101516706e-01,-7.758553748045252663e-01,-7.597304595756666501e-01,1.600865345597502376e+00,8.323993587314977294e-01,2.914039846331776262e-01,-6.003990090422740566e-01,1.020721267447738834e+00,1.312443497252286928e+00,-3.197353595135730697e-01,-2.889194973076026907e-01,1.179257815855328406e+00,3.536532316501008744e-01,-5.989024314413678995e-01,-8.364344520624255042e-01,2.869274485176546152e-01,-3.227173142756951940e-03,4.238251890005727551e-01,2.623881032880029718e+00,-4.590306059368242653e-01,2.905475536060642683e-01,1.067075134103819378e+00,-5.565139224686146413e-01,1.869530841111684438e+00,1.075273352625361056e-03,1.336255225830574656e+00,-1.313838114519381151e-01,-4.151303322962672238e-01,3.613295338160698034e-01,2.790433031712480361e-01,2.417499316370853579e-01,1.048171384575181442e+00,9.936845233848092818e-01,-7.900608196850492648e-01,3.969755927525464578e-01,1.425342526905056584e+00,2.488634754705537633e-01,7.423391938027612547e-01,1.607814576413667984e+00,-5.890723458165365578e-01,4.550094028702268423e-01,1.302076597060847218e-02,1.808987061810268360e+00,2.947741000830272906e-02
1.030779260454827595e+00,7.093966107609954719e-01,-1.803815178324307267e-01,1.819512910408571660e-01,-2.469355917790042043e-01,9.157594936967830002e-01,7.991506074089427258e-01,2.108758041776537251e-01,1.547096247492436571e+00,8.939871866843418502e-02,-1.520787794962359940e-01,-3.185677650977307152e-01,-5.712655907995140003e-01,1.328498491741540999e-01,5.979655090890745317e-02,1.187106796259461250e+00,-6.646283557035395084e-01,-7.636183328804787562e-01,2.811405155606852557e-01,3.231782371733575854e-01,-1.042888977781421200e+00,7.944222610382034588e-02,-6.138442535258896715e-01,2.873050020284930728e-01,1.171689392125273788e+00,-2.676015677030700868e-01,-2.075348648710560184e-01,-7.079096289815287601e-01,-7.201057712649961973e-01,-4.898239419291747776e-01,9.068260783230712718e-01,2.530209062839651857e+00,3.113796116223675470e-01,-3.722491699135341281e-02,-8.057746854597784836e-01,-7.159767015610523089e-01,1.850808384362816916e+00,6.030298906286212235e-01,8.725248540296519639e-01,4.556367739807483108e-01,1.307887072832668807e+00,6.037953037998533556e-01,-3.054026832446764261e-02,5.853063974477843434e-01,7.161572319500755235e-01,9.157303640996544702e-01,2.446010439353256238e+00,5.622755402031188732e-01,7.469483504083298531e-01,4.735011688850399025e-02,4.933618051564958584e+00,1.990692864038316579e+00,9.020351658863131616e-01,-3.334389113637783453e-01,-3.682619292601019279e-02,8.391043887031823800e-01,-7.188044178741138657e-01,-7.380228694499959552e-01,-3.873434714651368127e-01,1.051829746154596013e+00,4.803316132319833676e-01,-7.434906445285425214e-01,-6.379063853583295529e-01,-4.999765702043809101e-01,5.082170280074096436e-01,2.455937480037079235e-02,-2.334597821928821593e-01,1.513550626691370748e+00,-1.115432761537247686e+00,-2.397631308494463376e-02,2.859085145192966859e+00,-2.185124867567906637e-01,-1.439868898876922043e-01,7.766322387172619468e-01,5.423048432927748408e-01,9.467195759271833655e-01,-6.138046224976517751e-02,-4.918047638828286772e-01,-6.005894211279608763e-01,-9.905837444694891580e-01,3.126501149727602957e-01,-2.566469397895624893e-01,-5.038437260197219381e-01,1.460262501309720573e+00,-8.803256076143717301e-02,-7.790374606172314476e-01,-7.068819569167661410e-02,1.647327954539166806e+00,1.306136167808443327e+00,-1.448062923347642750e+00,1.796601863094795526e+00,-4.520329995026954872e-01,1.729782713908862846e+00,7.576772103703693917e-01,-1.366195736277160178e+00,-5.723855958381618425e-01
1.184964391493664060e+00,8.510675652346514353e-01,-2.888822430227137583e-01,1.429647525949975240e-01,-4.028094695680400350e-01,5.592341258759558897e-01,-5.603945860764965037e-01,6.509187064270119949e-01,2.163318628482243433e+00,7.519403683066223643e-01,1.031299163689086917e+00,3.223786788689940730e-01,-4.180669753320767623e-01,2.538461882110338852e-01,-9.522789136125336951e-02,2.701753395622917608e+00,1.359524970072319427e-01,-1.673529049678877667e-01,3.446211415170647996e-01,4.140531951763345431e-01,-9.955599739796593406e-01,7.118279508259459654e-01,-2.417219987404923831e-01,2.394344488530942006e-01,8.728990521528088298e-01,-1.532083557541850771e+00,2.186017050388616711e-02,-5.283287684979164345e-01,1.040921938275990222e+00,2.131278927265132239e-01,7.157507528946686071e-01,2.290372601770742644e+00,7.934991388510281851e-03,-7.773700599319910420e-01,-5.027178538832615118e-01,-1.035172204788880723e+00,1.168570186428591340e+00,1.375142584036669557e+00,7.746200108395280282e-01,1.948727021472970167e+00,1.422281834484909524e+00,5.365067929545164205e-03,4.250651304813687914e-01,6.969085966359886974e-01,-1.313477735941681601e-02,5.441550994870174573e-01,3.353104191844070492e+00,-4.622016451724737796e-02,3.427343960511679555e-01,1.452267176869616039e+00,4.759102901990607926e+00,9.119272579839852177e-01,1.354278543606226126e+00,-7.928937356927607816e-01,-9.150217718848042692e-01,1.375132936655396154e+00,6.475609025599941004e-01,-4.436702040578375250e-01,-4.974714942619491431e-01,1.603965308017138991e+00,1.716448031878270220e+00,-3.054070514097139144e-01,-9.681178371387023640e-01,8.555114578127198666e-01,-1.967522760121553915e-01,-1.050739426612547822e+00,-1.796181999739628887e-01,1.216818185864369184e+00,-4.343680207466125154e-01,-1.061410598006434780e+00,3.958893230184651113e+00,-3.881098308370181660e-01,2.305552318296701930e-01,1.184218470159713821e+00,1.499516942484227511e-02,1.906321303359505448e+00,8.081715059069556339e-01,1.202243081703989525e+00,7.566998607850283776e-02,-4.659092620459364675e-01,1.912054345115566933e-01,6.999225005933904509e-01,5.224742025402262513e-02,4.820881638224030485e-01,6.798133030513191510e-01,-5.276892744225616383e-01,-2.421103895515480109e-01,2.907163594313957766e+00,5.524680220986439849e-01,-5.965328215187276628e-01,2.847487787772746692e+00,-2.769415873761923441e-01,1.513471541108108553e+00,2.482815171436709156e-01,9.427516299281233358e-01,-3.984974381325812054e-02
8.758936110218400461e-01,3.033082662988639822e-01,4.863747900569875826e-01,2.752189128925313089e-01,-8.772657850402501567e-03,6.839478625831230119e-01,5.868498906956096661e-01,-1.721458649226586812e-01,1.715669403511410618e+00,2.552814485727675775e-01,-5.612077416207605918e-01,-5.061605770020042305e-01,-7.470798572112641311e-01,-1.146499931501264863e-01,5.268533132278309106e-01,6.656961358745118185e-01,-1.427591980732217936e+00,-1.971309265540559796e-01,4.776249002581632874e-01,7.073618517034140352e-01,-1.566540887573519392e+00,-3.329703515370288081e-01,-4.717100084614793132e-01,3.703077023215800012e-01,9.531995615887289830e-01,-3.574492389111816881e-01,1.654306103142103579e-01,-8.048575396361599132e-01,-5.069164309865343832e-01,-6.826774998582996190e-02,9.096429237174702420e-01,2.958450948056585261e+00,1.960529727656963317e-01,-3.625987405821362031e-01,-5.897658591334644651e-01,-5.292468103687626435e-01,1.363162638689133788e+00,1.023252360485723989e+00,5.416858691161334782e-01,9.612708969213847876e-01,1.256192326980788643e+00,8.303075107628361540e-01,7.536001950477659583e-02,3.232339656186946630e-01,1.188424866705265925e+00,9.363353682083122020e-01,2.643358084535769592e+00,1.912819569236646755e-01,6.299500995310928220e-01,4.339346076150550902e-01,4.186259461483046174e+00,1.480463068126334214e+00,4.422083291794497995e-01,-3.212743530744255338e-01,-3.672119778147000524e-01,9.709140571664215402e-01,-6.933662454649943685e-01,-7.515432822527778889e-01,3.223423397829356940e-01,4.275479731942883888e-01,1.306288752243699003e+00,-7.010606659082927461e-01,-8.116977097633976124e-01,6.061532172544292774e-02,6.883941763213525800e-01,2.628373424978471817e-01,-3.673091056307598024e-02,2.253658001728362503e+00,-1.035612437137911623e+00,-4.635808553593929737e-01,2.633986532715519413e+00,-5.717711484576619707e-01,2.006342408000539312e-01,9.710294214322938711e-01,3.356448156866167487e-01,1.387729015750670092e+00,3.648422629552944829e-01,-6.761098010871051667e-01,-4.107108212421564097e-01,-8.282402890063677026e-01,-6.371368877752414672e-01,-5.952448553539602116e-01,-3.615739280050740412e-01,1.581364593499881899e+00,-5.273434674232645447e-01,-5.005482407978261161e-01,8.481627494780422105e-02,2.358167700435703118e+00,1.129979928120456778e+00,-7.099297523575864854e-01,1.763027680058878666e+00,-5.873834782835690715e-01,1.673570960212481307e+00,9.508170191208911159e-01,-1.205701287002782784e+00,-2.003268436333075775e-01
1.413813038393156862e+00,1.715588977609292298e+00,-7.466225786629817618e-01,8.780797438817578016e-02,-3.808629736497319285e-01,6.222170545567919930e-01,-2.585843070816030154e-01,9.098711242542814048e-01,1.942521302620574986e+00,2.374151298421929290e-01,7.936169160798887123e-01,3.408236047843075656e-01,-3.359280717908906810e-01,6.629017833900510137e-01,-2.784899941913824839e-01,2.673211800834902618e+00,6.990245616996717537e-01,-8.738533640497720967e-01,1.674764316912673023e-01,9.071062204070745594e-02,-6.229148264032541293e-01,5.743987789425165635e-01,-6.157108840782642423e-01,2.352690564928959782e-01,9.872154397289936156e-01,-9.653838188258028197e-01,-3.617470400585380830e-01,-4.213683450543952436e-01,6.735096809129328399e-01,-1.258172984456582544e-01,7.819201995873125144e-01,1.749840983904463965e+00,1.917238502471297901e-01,-5.112167779160077252e-01,-8.562960484795847371e-01,-1.149062850761447319e+00,1.769779510485517626e+00,8.103961121557972103e-01,6.273399462295705664e-01,7.495753320348130799e-01,1.397733273832835854e+00,-1.071801529592252833e-01,1.889916319276596646e-01,1.073346530039630764e+00,-1.396731291340684855e-01,7.579663525549729108e-01,3.076338698096818369e+00,5.461878978152260311e-01,5.359286756465132529e-01,1.207704286416108719e+00,5.319384927072611013e+00,1.220057696296627192e+00,1.598477636183939232e+00,-6.546397851233456411e-01,-1.373239961843788493e-01,8.057690462165011391e-01,-1.338328550995784849e-01,-4.978951483049744997e-01,-1.124129407430143779e+00,1.129519556714670747e+00,7.717220787487171219e-01,-1.862917070978029610e-01,-6.526962501611527356e-01,-7.094978286952347002e-02,-2.400605462774405563e-01,-1.018416806270180608e+00,-2.397147133709329747e-01,5.524465146968641216e-01,-8.135187396977487939e-01,-4.269833491151240334e-01,3.910718478591030944e+00,-2.736442244590680528e-01,-3.910836818030679618e-01,1.077209004175271989e+00,3.181397863435628248e-01,1.459982920761017766e+00,4.703845518917502688e-01,7.731805041201831319e-01,-6.420843045367075064e-02,-7.022110092455537966e-01,9.892972534434117948e-01,4.703499700080111534e-01,-8.991144582610127722e-02,4.019795716514542594e-01,6.499830299557914914e-01,-4.990368822799818860e-01,-2.234127456081015928e-01,1.822810771030585197e+00,8.228043260525359504e-01,-1.252189809744360449e+00,2.467963431279230235e+00,-6.127099643815918650e-01,1.874940062074509584e+00,1.962177213403974441e-01,4.702603341214756094e-02,-2.688367029348748272e-01
1.017791838485628597e+00,9.561625403829692171e-01,-4.652951418154100960e-01,-1.744953004519105844e-01,-2.165249412368743798e-01,5.096062127978693290e-01,1.637411384384154789e-01,3.190082073056478840e-01,9.238356585007254651e-01,3.872495457808760033e-01,1.061998814443634975e+00,2.017703982971133514e-01,-3.150802632472222697e-01,3.736375860710219876e-01,-4.174447016867895432e-01,2.314613036089311571e+00,2.153821089342082273e-01,-5.261171127807324766e-01,1.796870958314933653e-01,6.231067037201589581e-02,-5.700081220836140661e-01,5.281102232529317764e-01,-4.901885596488347874e-01,2.827060870309591190e-01,1.285658061212464176e+00,-7.575531695379074115e-01,6.632012826059935362e-03,-5.362245628925985663e-01,1.161530503455925345e-01,-5.165366919134155577e-01,5.473534791478248396e-01,2.054919341511830311e+00,1.101405691163298561e-02,-2.232333299218083322e-01,-6.728949432018221932e-01,-9.924998365194583894e-01,1.381455928942317612e+00,1.014382918937856815e+00,1.450454486385420960e+00,1.175621965702984495e+00,9.697253431509023081e-01,3.979182230832600808e-02,4.337008308581392912e-02,5.198986080934646647e-01,-3.612093605639965510e-03,7.403597807785711193e-01,2.658321655994873467e+00,5.323255746726719001e-02,2.905514638116249437e-01,9.957021319786718561e-01,4.630025460058958764e+00,1.418082533170742732e+00,9.073142170317216593e-01,-6.729086233904244541e-01,-5.193997658754087032e-01,1.333569833283747341e+00,4.390988762231860520e-01,-1.715427467907595371e-01,-8.202286845897102108e-01,1.566198217578344432e+00,8.553144218520083442e-01,-4.473145429530541728e-01,-4.957963964137436230e-01,4.628386370446692100e-01,1.837714702956028123e-01,-6.553263621832751129e-01,-5.867226057184233845e-01,5.602382390055713479e-01,-3.995197993998554908e-01,5.478479063271834981e-02,3.151617771808055579e+00,-2.104831870917464598e-01,4.526516533568340772e-02,9.046456015850703469e-01,-3.330093312980592773e-02,1.433021841451672884e+00,1.663655532890012667e-02,9.461028863684928236e-01,-3.105553969881943432e-01,-6.277569759714953790e-01,7.102519797365199894e-01,4.477501699985537709e-01,-7.345407759224886757e-02,9.652091629092411917e-01,8.540017271396410647e-01,-8.704925770479277070e-01,2.102901920693084348e-02,1.624866383497239219e+00,6.775347369638274886e-01,-5.217246437470157705e-01,2.051425674937734644e+00,-3.652722894614541804e-01,1.075341464364478306e+00,1.821443374533970039e-01,7.210758578958540443e-01,-3.174298299804574341e-01
9.434236472849311106e-01,1.826412379882420556e+00,4.246553737902979131e-02,-4.280373860917393025e-01,6.235536648206605470e-01,-2.134551207727306554e-01,4.443656917913614834e-01,-3.590917421504614682e-01,-4.387160054037424484e-01,-3.254614473214136883e-01,2.618346932607972799e-01,-7.177681689507275919e-02,-3.826682050984211991e-01,8.128244019463174430e-01,-6.348725038893698880e-02,1.251916710532308130e+00,-8.205554957347582778e-02,-6.610983590729884174e-01,1.904391890186185321e-01,7.111642200443586692e-03,-5.986318030789982148e-01,-7.479779596949109877e-01,-9.987507245912339293e-01,5.463741147660079456e-01,1.283795117062374702e+00,4.191638043205609399e-01,3.181003553086764191e-01,-4.799808031597417313e-01,-2.102184717881148135e-01,-6.090353167710077509e-01,3.878767122831960346e-01,1.608143878565836182e+00,-4.622402315193413491e-02,-2.411326377482665428e-01,-8.712985587440641444e-01,-8.929844219615545864e-01,1.171800307752079995e+00,9.473631521936909383e-01,1.087745428718168039e+00,-1.215520973666908144e-01,2.674994650981877831e-01,9.635410824191897872e-02,-4.280206041020603869e-01,4.533548915945830315e-01,5.626131169207505556e-01,1.284861737226049572e+00,2.184613276082749245e+00,6.004530068275058807e-02,1.003246088343906217e-01,1.713593352543971271e+00,3.580067389525433796e+00,7.272804613668131246e-01,-1.392612482563336807e-01,-4.921685098284815929e-01,2.133940507664631170e-01,7.529428341788853007e-01,-6.009515620372761768e-01,2.107806972080625008e-01,-6.807720594197289588e-01,-8.196906107222210469e-01,7.405949978375898635e-01,-9.243096360698338509e-02,7.552804035649283987e-02,2.662369717094522636e-01,5.942905987519612188e-01,-1.215420043272892325e-01,-7.145612027232572938e-01,1.247465935747193999e-01,-5.968654841506443320e-01,1.097008491115702533e+00,2.063568628233261038e+00,-7.576263362869422036e-01,-3.358186106073240418e-01,1.155105374185635414e+00,-3.241217837261511359e-01,1.672636084598228656e+00,-9.264694093715647449e-02,2.101473259355304268e-01,-1.331977503019547981e-01,-6.455039170441720930e-01,4.204087394106388320e-01,-7.137564482283274003e-01,1.802246109200026924e-01,1.169037167789036102e+00,2.694708597719256415e-01,-3.599699977152013286e-01,7.089437781942335981e-01,3.476857956495985613e-01,4.993500184483066207e-01,6.939733379016403969e-01,7.251973650856833320e-01,-1.415996431816488377e+00,9.532908339588503921e-01,2.162232241604352401e-01,3.775791251876681742e-01,1.329036653678911106e-01
1.189380308686936338e+00,1.976049199084198627e+00,2.075891750448918827e-01,-3.776836097744568077e-01,1.737241579762348054e-01,-1.340435160209675902e-01,-5.388284647333387856e-01,2.460441050486339432e-01,1.701885423354932092e+00,4.098967396422448228e-02,-1.444469907614416848e-01,2.083352528022472672e-01,-5.286383810295527397e-01,4.399109505050022295e-01,1.551522059220313832e-01,1.613918941303248866e+00,-1.243585033885578617e-01,-6.567509833472449932e-02,9.123204484198330078e-02,3.283957983160679106e-01,-1.046521924575735119e+00,-1.841881080601681653e-01,-6.920754914317348572e-01,2.805504292419691570e-01,1.088057723119385312e+00,-1.636846625089722895e-01,1.547372248549115092e-01,-4.947153152843160595e-01,1.123123579676468253e-01,-2.307280937854494507e-01,4.599150494017060220e-01,2.076402796335269141e+00,-2.399450310539059106e-01,-6.561853512347479711e-01,-7.790997071583927180e-01,-7.070448123315637989e-01,1.478853926921281481e+00,1.075769129940500113e+00,5.218957987387731201e-01,7.234122147888395471e-01,8.257486060707699416e-01,2.036005143583340948e-01,1.899290377725080803e-01,5.630655372464593578e-01,6.195038296738467620e-01,9.816943266028916870e-01,3.139609710059970471e+00,2.048592143771978957e-01,1.369215815987801788e-01,1.869686820894448598e+00,3.778226348878761076e+00,6.708317570291468801e-01,6.152647446018231214e-01,-3.769768186953124656e-01,-1.015997003419529809e-01,8.526488759908359416e-01,-3.624696734816503785e-01,-2.581128652136538415e-01,-6.944155167713712551e-01,-1.806090149225934027e-01,9.603230773269170184e-01,4.008341059311396615e-01,-1.585508494141413816e-01,6.661323526181605059e-01,6.653156799417562217e-01,-7.972081349081117096e-02,-1.019290323204431470e-01,8.659321943942154265e-01,-2.937950460971346378e-01,-3.579591165591635704e-01,2.813081575151841207e+00,-8.938373858036987585e-01,-2.838605605261151354e-01,7.142939242550436774e-01,-6.776353394696964239e-02,1.510739773913920558e+00,6.513369040292795731e-01,3.737063981285521086e-01,-4.284246545071040968e-01,-2.288555834994177030e-01,2.598488395896486614e-01,-2.493032300814092550e-01,4.995258399734670007e-02,8.823222434875775955e-01,3.088794855127745542e-01,-2.749911538133833488e-01,3.413336425080273351e-01,1.506637339678456255e+00,5.516974523735953539e-01,-7.220285147504595935e-02,1.821217551353750297e+00,-1.235116010361777317e+00,1.676696863738198262e+00,2.829051184322964319e-01,-4.032882478114474534e-02,2.513158969757143257e-01
6.881573584328145587e-01,4.244953722403426166e-01,-8.433147188744335998e-02,-3.672433424542233538e-01,7.587491659867655336e-02,2.611971285250572206e-01,4.176031855873392207e-01,-2.759750558725286851e-01,-4.936919467672407080e-02,4.741495479322996864e-01,1.208205128983915300e+00,5.816387663453990997e-02,-3.218183261679958829e-01,2.109567800141807226e-01,-3.990574887351786559e-01,1.923609789150186211e+00,-2.587693797718283450e-01,-1.756260772769158429e-01,2.526446868006922419e-01,1.040475089797022884e-01,-6.122132263613504488e-01,2.580139836844534407e-01,-4.231042230892946288e-01,3.868250985663227448e-01,1.432213276058172280e+00,-5.611221699971535859e-01,4.193930737516636809e-01,-6.155487767143150712e-01,-1.308454359282024138e-01,-6.714789647246380833e-01,3.462136062302867412e-01,2.251095247548651201e+00,-1.527837113056368101e-01,-1.264754028619757831e-01,-4.990824618944226243e-01,-8.765400893738122257e-01,8.837177291295672532e-01,1.302236671423253611e+00,1.948350411551476702e+00,1.494424599239655871e+00,5.409436190029005553e-01,1.384325399925321887e-01,-1.060290064350204037e-01,6.774055025064540381e-02,1.944693101117841993e-01,7.901692075508768287e-01,2.347410242200794972e+00,-4.419595833255308137e-01,3.508899330240775050e-02,1.124021630055315413e+00,3.829952257396354032e+00,1.270802310230965793e+00,1.715846610046982967e-01,-7.153406176064789346e-01,-8.274387940242076134e-01,1.702630304770068159e+00,8.223370645520599043e-01,1.640346097747933107e-01,-4.333862805343950964e-01,1.445031527713066755e+00,1.184171371979366061e+00,-5.929718784430664247e-01,-3.741112257625285320e-01,1.019287636325347357e+00,4.929860245639428040e-01,-3.897366454482511511e-01,-8.504743139124367746e-01,5.953876701200188082e-01,-8.977223748769247447e-02,4.518043447572852589e-01,2.478165008830375715e+00,-3.103481325677247549e-01,4.150477984037195256e-01,9.410653729396097900e-01,-4.275487346196993332e-01,1.646278410042730123e+00,-2.062461312412706416e-01,1.072135438694779008e+00,-3.256363541786342353e-01,-5.377072659786076292e-01,2.649054747886857020e-01,2.622464037676905946e-01,6.062136493299430384e-02,1.348122657738934693e+00,8.886078758057208704e-01,-9.917217916671852151e-01,3.224588360775943463e-01,1.513953137180927389e+00,4.458901292270492922e-01,4.399246381482272983e-01,1.593793117838085971e+00,-3.423349803003518099e-01,4.053657133655135247e-01,1.717680376095870320e-01,1.429928112999006240e+00,-1.799500305438672121e-01
9.831242284258718822e-01,1.242509905700859063e+00,-6.172941760901317076e-01,-3.605863437536958038e-01,-1.048365702759937179e-01,5.157136326330822307e-01,6.894540474232373484e-01,1.821560032003284313e-01,2.896138997293928874e-01,7.809396088854420048e-03,8.238915865827469709e-01,8.706439993478756745e-02,-2.741847544806893522e-01,4.985709090534359844e-01,-5.822370224486065338e-01,1.925718002765723913e+00,2.828683033608712649e-01,-8.935267015268448798e-01,3.328694505858315750e-02,-1.830140322992908075e-01,-3.042049758053966269e-01,3.337561032298982933e-01,-7.405836848251926563e-01,2.945307746816003824e-01,1.549827704844093601e+00,-8.036141249216979809e-02,-1.178626301272725774e-01,-5.352316377670385261e-01,-6.448915223749618342e-01,-1.034240796874165147e+00,4.924692987699436086e-01,1.859305598301049356e+00,6.624472826848720741e-02,1.784702498082800792e-01,-8.776041906141693882e-01,-9.378325993849818687e-01,1.730801673274063424e+00,6.152025763029720373e-01,1.726040179911362937e+00,3.519900694817081899e-01,7.329631383264419986e-01,1.114266186313588314e-01,-2.252760093062087243e-01,5.048320029216625260e-01,8.042077503079864131e-02,9.276363802543030612e-01,2.193592843664838199e+00,3.230401184273324344e-01,3.464632996920082864e-01,5.807558850213189183e-01,4.684709266213845424e+00,1.849624974537120048e+00,7.035567149696585476e-01,-5.074078314715333438e-01,-3.392334405581598489e-02,1.110391891148923005e+00,-1.822207387688540292e-02,-9.934495678394322793e-02,-1.122075268930519787e+00,1.348132428548679318e+00,5.362076156567366358e-02,-4.830948549677130943e-01,-1.316711008675827410e-01,-7.787115375777997617e-02,4.815407935751694346e-01,-2.898079145217684616e-01,-7.724695142994517649e-01,1.407208417058494199e-01,-5.188354164868006491e-01,8.171607024440117328e-01,2.612132257029278648e+00,-1.038482890126714853e-01,-2.473677848514311273e-01,6.494776742745934639e-01,8.098377138815916754e-02,9.620009827628177579e-01,-5.172657943704709327e-01,5.111669734632716677e-01,-6.491824420971550325e-01,-7.865248998785874246e-01,1.160254212420593678e+00,1.542879227888863392e-01,-2.381795785194475989e-01,1.297085378881590811e+00,8.392124470491735266e-01,-1.050135903210143384e+00,1.777929846516025092e-01,6.071809238979550827e-01,8.878572263791555397e-01,-7.515605895330237374e-01,1.473306401756807160e+00,-5.316222913423115370e-01,1.009068843426070394e+00,1.980484181468245564e-01,8.942926586607770345e-02,-5.497994126110682389e-01
1.216333566692592960e+00,5.728028568332302894e-01,-6.025937808326910228e-02,4.098374334265120211e-01,-6.213404490047153006e-01,1.063468748389623686e+00,-1.908455453968782578e-03,6.917036387592963020e-01,3.219773546635587458e+00,5.238571659014750193e-01,-2.447635111319972911e-01,-1.232888934076505350e-01,-6.825492573105753635e-01,-1.465731079586307106e-01,2.904896883374094019e-01,1.640715590808683233e+00,-7.245901872596316462e-01,-3.038618994008048246e-01,3.380183546656649884e-01,6.588382825014357236e-01,-1.462812175869387055e+00,5.435467180300088685e-01,-2.907874160494888227e-01,1.303321416486770967e-01,8.688505438233379286e-01,-1.058544868165478992e+00,-2.894432237225098570e-01,-7.229655730793476121e-01,-6.321511117491107612e-02,7.109839732753053809e-02,1.047848366053773628e+00,2.918359486894856580e+00,2.402941353050419004e-01,-4.988625814412947501e-01,-6.451889070583576302e-01,-6.695049370453509674e-01,1.867229691194122854e+00,8.667936500311537174e-01,3.290825550106468711e-01,1.380103708950221053e+00,1.856287080878410212e+00,6.344250020665260781e-01,4.759482154609017690e-01,7.180970477591732681e-01,6.838098486438937140e-01,6.244809473201040628e-01,3.249944842203865036e+00,5.521409844815925450e-01,8.128035167527080107e-01,2.593361483941420964e-01,5.188696634493282112e+00,1.778457160839002515e+00,1.548196942416145916e+00,-3.732893755637385347e-01,-4.764334855212205566e-01,9.800350896548012392e-01,-3.848775228656943215e-01,-1.118715429177349563e+00,-2.058343775143839371e-01,1.608783071557273736e+00,1.067446037183492624e+00,-5.280049554858617933e-01,-1.062868581761037046e+00,-9.566142168614577557e-02,2.908461363288913359e-01,-2.229446248839774825e-01,2.454241056856848457e-01,2.244706593143686479e+00,-9.927627071448080764e-01,-1.332418584679681883e+00,3.706546047321934712e+00,-3.061023914180834860e-01,3.929375611900716436e-02,7.277206791742297787e-01,7.012253815321226602e-01,1.116586546668175917e+00,6.743072301425656612e-01,-2.149488033968957046e-01,-5.291207871323858614e-01,-7.385313477235564417e-01,-2.923680185656452046e-02,1.908489621375304146e-01,-5.195278768562239247e-01,1.078221133836965606e+00,-1.130415145736353155e-01,-6.221198492745265707e-01,-4.374669979138087750e-01,2.973034050877134682e+00,1.282050630546848424e+00,-1.921343180088925129e+00,2.812908135274750698e+00,-2.001987492656221446e-01,2.257763508522085516e+00,8.271589086526232037e-01,-1.374160508871119513e+00,-4.273465385751900603e-01
9.171870680997242786e-01,3.804922569976508795e-01,2.398265215412970774e-01,-2.784947286250373244e-01,-4.722496031009117412e-01,4.236959099616062763e-01,-6.262805475431996172e-01,3.485901929540123900e-01,2.580857298903235453e+00,9.309372331228652486e-01,5.368382156979569775e-01,2.852615296188672489e-01,-5.517259459711085778e-01,-3.747728533351039060e-01,-5.691223663000333222e-02,2.108119229555488694e+00,-5.871809723080388954e-01,6.151777405056749748e-01,1.576041805671324902e-01,5.634757085888297823e-01,-1.266738611448764651e+00,8.879140847335915687e-01,-2.010810288509223831e-02,6.170513728388082875e-02,1.215735718197550774e+00,-1.193854193254581197e+00,2.533197171352457033e-01,-6.926769256679821130e-01,2.909401316531368131e-02,-2.504251878981154089e-01,4.615639987768589969e-01,3.008986250150927688e+00,-3.765297325235003045e-01,-5.669978681786276287e-01,-3.594578157131462781e-01,-5.597676263642387129e-01,1.264219833854599795e+00,1.444462651153421984e+00,1.291492178414388903e+00,2.552323978570143925e+00,1.233857722471955132e+00,4.108009007966437198e-01,6.395495481042772212e-01,1.021670691592584251e-01,4.263314179917809810e-01,4.271250845474721669e-01,3.439209238269275826e+00,-2.774786688235471033e-01,1.180222307320574898e-01,1.100035728043443850e+00,3.999957612961515974e+00,1.341700075700426265e+00,9.890224799652675980e-01,-5.177375063753674178e-01,-1.237758576801311960e+00,1.858242972414531291e+00,1.046356351535273621e+00,-4.725391644733805130e-01,-2.885296851297496357e-01,2.270934343084006990e+00,1.441472535053713866e+00,-9.079316461016320727e-02,-6.845446086620258219e-01,1.470731535808688317e+00,7.174856197072410069e-01,-1.491848151367703990e-01,-7.755487679246408916e-02,1.736248226984569598e+00,2.441552232358100150e-01,-1.329250700922685269e+00,3.234408178895638919e+00,-4.684563396969428917e-01,5.526787600596114736e-01,3.366660737498755607e-01,-7.014931408893688991e-02,1.361588704003813266e+00,6.396596014752493620e-01,1.058494051003004310e+00,-7.906177915724620364e-01,-6.406314983445327016e-02,-9.118281884408530047e-02,7.259293677357869790e-01,-1.785763958516261019e-01,1.188272456373957509e+00,8.026231304066477890e-01,-9.428889790919567915e-01,-1.183423132908292819e-01,2.987572244385114040e+00,5.963322753951632027e-01,-5.485886054539238499e-01,2.868040437299432810e+00,-6.214392756924352890e-02,1.274786900611378115e+00,3.643192552103148296e-01,6.717849500492809600e-01,-8.594127904660808781e-02
1.162282906219317402e+00,1.932060537919338294e+00,-7.124259197513258535e-01,-3.199287105193678316e-01,6.976264253543658367e-02,3.808242439095823606e-01,6.716613645066347171e-01,2.794943983118145514e-01,1.935814242286149067e-01,-3.360513691882717202e-01,5.371593162337855443e-01,7.706611473388420841e-02,-2.688576432629242174e-01,8.428572632800300779e-01,-4.871012219202839333e-01,1.828806099046118572e+00,5.464115116493080127e-01,-1.238622863554694309e+00,1.226522613804869460e-02,-2.644891000057368879e-01,-2.306943710875072884e-01,-1.799909830594570437e-02,-1.002484673582401120e+00,3.610042997012665733e-01,1.443611825251153391e+00,2.288707541170586779e-01,-2.484374016945792019e-01,-4.455717678054792463e-01,-5.156458414642177690e-01,-9.524438655204883197e-01,5.575795659194582310e-01,1.472152530482290222e+00,1.733141726744130695e-01,1.060632353701508324e-01,-1.067574282150529186e+00,-1.028792484711003929e+00,1.905300331573305694e+00,4.233960213788616200e-01,1.291319880099025319e+00,-3.947275601506672338e-01,6.995049197877580838e-01,1.389520323860121698e-02,-3.597613846879915700e-01,7.926420065804726800e-01,1.124128741136543597e-01,1.123099633265770336e+00,2.155818466614213946e+00,6.138574890997628986e-01,4.271022688684660285e-01,8.381390048284450556e-01,4.804861438963127895e+00,1.615572477172376509e+00,7.390633001384208089e-01,-4.553501126659459386e-01,4.520428357904114902e-01,6.411453584060866628e-01,-6.458626437436981726e-01,-1.089565587992873535e-01,-1.329595474695964841e+00,4.398939479859294011e-01,-1.538416963203392551e-01,-2.918529649147323379e-01,3.284007550707648132e-03,-5.187629459077279792e-01,3.585247281809864628e-01,-3.502142496177463871e-01,-7.131460213015513583e-01,-1.571326619570653227e-01,-8.256602385482055828e-01,1.068463072491142363e+00,2.638437535319086535e+00,-2.406695773287256812e-01,-6.348253793056802818e-01,8.238931326912772857e-01,1.787654622678459537e-01,1.001752591870086473e+00,-4.403948437196957277e-01,2.130417713104341693e-01,-4.710227205330381750e-01,-8.874526768091933748e-01,1.357399750778479852e+00,-1.766857185302214139e-01,-1.786431930745116525e-01,1.079792405492995044e+00,6.158618406962752534e-01,-7.528469711947178844e-01,2.700992340640249179e-01,1.296362816286308339e-01,9.278275733900009925e-01,-7.931645448383399799e-01,1.198251348871247401e+00,-9.698818722044217910e-01,1.325274836709688486e+00,1.837429437541466537e-01,-3.430304396905589637e-01,-4.504950036944252445e-01
1.047057143222407394e+00,1.764579443343979204e+00,-2.625365855103502510e-01,-2.544293707291804263e-01,3.950226616391966927e-01,6.959926832141766218e-02,4.919482198015918128e-01,-8.027282191068918493e-02,-1.418818037157318912e-01,-2.564951661493013457e-01,4.727243349863887723e-01,-2.686142689334231060e-02,-3.411319209168159894e-01,8.520292077346058868e-01,-1.735197269521240315e-01,1.582060322877872460e+00,1.629641566177493783e-01,-9.098840341710849877e-01,2.049074802242375481e-01,-4.172649042216151211e-02,-5.077070330188433456e-01,-4.663593279256778024e-01,-9.622953191019880670e-01,5.061750823785509112e-01,1.233488593875577521e+00,1.416505114915772856e-01,1.080229998466056274e-01,-4.625347000346349269e-01,-5.252188378058986196e-02,-5.537875266119648421e-01,5.204359392245445637e-01,1.550015262536094118e+00,9.985876886835626243e-02,-2.094547526456208009e-01,-9.061282499250136180e-01,-1.012524571146965480e+00,1.340479094027019924e+00,8.312038988158659825e-01,1.044879915430774187e+00,-1.072019932552283894e-01,5.240915497803277923e-01,2.746251769130531040e-02,-3.832365140003898274e-01,6.462585020837442462e-01,3.450278614557842349e-01,1.196952603469439325e+00,2.229145569884506628e+00,2.303475522844061207e-01,2.648580012762157820e-01,1.447264181199062083e+00,4.145328822958777693e+00,9.490354218155467869e-01,2.646464581200457800e-01,-5.527007868384150591e-01,2.196873973171495908e-01,7.072991819014780024e-01,-5.807344187189299456e-01,5.903181897850262594e-02,-8.254512666414846045e-01,-3.553386619846412575e-01,6.448409824157765868e-01,-2.556844873211515656e-01,-1.062577764356107957e-01,-1.927016815695770102e-02,3.161991363804070865e-01,-3.940269127253130943e-01,-6.910899289682848057e-01,1.124196956297484062e-01,-7.870308755638327769e-01,9.598932114031760721e-01,2.479325572013074908e+00,-5.573624154620935300e-01,-3.944756308002628775e-01,1.222141812115325354e+00,-1.340682042362052739e-01,1.598626463922374841e+00,-1.042095450066400919e-01,2.752710279242861491e-01,-6.184460436888983281e-02,-7.905282354868925498e-01,6.577171859201293991e-01,-4.706265185685816754e-01,9.420002023520490653e-02,1.008176019538703727e+00,3.430413820534167213e-01,-4.261952048249718628e-01,4.827811262915787105e-01,5.230011595960859516e-01,6.350547102919670284e-01,1.616540185623390191e-01,1.016173115198966137e+00,-1.203181296376193199e+00,1.125745535702096678e+00,2.196671003681116008e-01,2.381237147668948118e-01,-5.256368864640126315e-02
9.288207470502567453e-01,1.017441153332636405e+00,3.538238049600886947e-01,-3.064820362890799399e-01,1.010246660955699122e-01,-3.892510971749085780e-03,-4.085629736685682523e-01,-1.808893107656553423e-02,1.385863634275082523e+00,4.597615336493479088e-01,3.688781933207361252e-01,1.428480841067486795e-01,-5.192211525698612329e-01,1.373882744057747796e-01,1.023077114952969380e-01,1.726523372569483072e+00,-4.819311958734496804e-01,2.649537165851615361e-01,2.451156669355414319e-01,4.515325819893982184e-01,-1.138918847057731387e+00,4.442874724487988480e-02,-3.997090333926207606e-01,3.085169103244528310e-01,1.110100502777748410e+00,-6.247425960256763888e-01,4.147833060648969949e-01,-5.941123492179922749e-01,2.477103914597216239e-01,-1.537338016991289802e-01,4.200065000364147649e-01,2.444112887409479740e+00,-2.895591567507374564e-01,-6.462641413909486765e-01,-5.051330549728025865e-01,-6.979818116131011330e-01,1.001415884807112189e+00,1.435068186104898391e+00,9.902019525039069681e-01,1.609710065467114593e+00,8.046922512078472645e-01,2.587692895619335687e-01,2.434797570106865261e-01,2.339690261371154545e-01,5.642884592417014566e-01,7.981579820860088548e-01,3.069209421618415590e+00,-2.802469873951977108e-01,3.513198132677196328e-02,1.727460488595687238e+00,3.559981903892648347e+00,7.155735152090147988e-01,4.027595184682299934e-01,-5.507043563380672468e-01,-7.388158522230410252e-01,1.399960597891008574e+00,3.891715408056935499e-01,-1.455617917151846297e-01,-2.647634254279948030e-01,6.035864141803883864e-01,1.541594137368833106e+00,1.388624709392616285e-02,-4.316641473838848109e-01,1.226632421543242035e+00,6.124088255285637938e-01,-2.026591217436195524e-01,-2.676114082953087725e-01,1.199630656205167289e+00,-6.904165909281811953e-02,-5.100609819489985153e-01,2.792053338705964727e+00,-7.646459448251075042e-01,2.589911714291182609e-01,8.471166012866322426e-01,-2.995481527042422321e-01,1.780123096409942374e+00,5.945887727937952949e-01,7.806170983672441333e-01,-3.173430055785420034e-01,-2.148983843734310062e-01,-1.777532716153836789e-01,3.840483271712610835e-02,1.085619078297049844e-01,1.056231425017656989e+00,4.701950975972713498e-01,-5.027425241953856760e-01,2.910998637792478472e-01,2.155611512974980215e+00,4.060194825091489879e-01,3.472966991721794794e-01,2.004376124209659160e+00,-7.600243347807590366e-01,1.149809215738052615e+00,3.008502269399510043e-01,8.066130447119761460e-01,2.248455991586246761e-01
1.112524656255868605e+00,1.439535203245834616e+00,-3.986459460900324547e-01,-2.044137818863193123e-01,3.962113386293096562e-02,1.076816553946689514e-01,-3.293144268225644544e-01,3.191165818792657261e-01,6.700263994559593206e-01,3.743563022850958655e-01,1.320514571344726384e+00,3.806459660371817044e-01,-2.603509988446165435e-01,6.935073376245636245e-01,-3.369452905065106196e-01,2.659922889878336250e+00,5.599993630140245315e-01,-4.436478339441084495e-01,2.450659386546819585e-01,7.018385194570592178e-02,-5.365532088902050800e-01,2.854207405382260809e-01,-5.571572636847232918e-01,3.882051739504249754e-01,1.082859568634753522e+00,-9.245939111873658911e-01,1.775361121942163611e-01,-4.102549890017885281e-01,9.376246467143714014e-01,-1.469515155727183497e-01,4.575052573675449930e-01,1.672089733889243757e+00,-7.468747916269599663e-02,-6.025829717212680681e-01,-6.423084388268095468e-01,-1.167740707880473572e+00,1.001905415125919907e+00,1.310756703039479110e+00,1.142630749782031385e+00,1.230144129617928739e+00,8.058688535299178834e-01,-2.581810122865694779e-01,3.937536278099780518e-02,6.547340896745497130e-01,-1.650129635536531358e-01,8.042049054549771370e-01,2.882421353320188562e+00,-1.547745478700420785e-01,9.062562571772006526e-02,1.939821939310256038e+00,4.294102589774535517e+00,6.083204189327102718e-01,7.878015276279535239e-01,-8.432202088741447277e-01,-5.621811899761255393e-01,1.248904560227243721e+00,5.455411102704292858e-01,8.450807875908641909e-02,-8.417077835012715115e-01,7.693014932907760173e-01,1.403538079867204358e+00,-1.471172346212556992e-01,-4.809056191533652713e-01,8.631448932818397424e-01,-1.219006906686035396e-01,-1.066513137799432798e+00,-6.041523469527764201e-01,2.122411966481082546e-01,-3.056773719333151784e-01,4.694374384298649616e-03,3.359299230230708755e+00,-4.879264966294976635e-01,1.832311045601733857e-03,1.317916280376675742e+00,-3.423450358756984224e-01,2.031094323422315107e+00,4.085803841313305207e-01,1.403598270864948372e+00,1.966468789552644481e-01,-4.715506433777346684e-01,5.798388723144860535e-01,4.105096758613848706e-01,2.977829471965537378e-01,4.894826427454945783e-01,9.218862452761766857e-01,-4.817983800136991235e-01,1.774222746537013062e-01,1.705473829686613652e+00,2.844508302147712442e-01,2.731524445397551237e-01,2.022532486839201837e+00,-7.316185639745829139e-01,1.012514223558560689e+00,-3.426917939092016807e-02,1.592537189017569244e+00,9.839845069052288729e-02
9.938456091280032378e-01,1.239957296117885077e-01,-6.204450525361606683e-01,4.511126407915901915e-01,-3.849551669609829196e-01,1.065633126403195297e+00,6.083585219932997612e-01,3.472824761957766238e-01,9.319039466956173801e-01,6.106685225880654766e-01,1.349816692118298356e+00,-7.492377269431510500e-02,-3.461869013709636400e-01,3.417317587858464956e-01,-2.662802683244280821e-01,2.404876444019210524e+00,-4.323991871309446067e-02,-8.776797656363913847e-01,5.242464850089868511e-01,2.404749953216789304e-01,-7.394473999148060139e-01,5.645065876420238826e-01,-3.565759165150756971e-01,3.999802959674937375e-01,9.725586879679813945e-01,-1.380711597224365983e+00,-8.063569205117612770e-02,-6.133528746057594905e-01,6.130101821911739801e-01,-4.024180162344714873e-02,9.264145231082385745e-01,2.219847441400387034e+00,4.191606402954616839e-01,-2.898129439883175285e-01,-5.544747877340308051e-01,-1.193856032584236893e+00,1.141650457024722343e+00,1.103148204264731369e+00,1.214034595789899473e+00,1.403914333943896864e+00,1.401553592436933116e+00,9.908052353398716372e-02,-1.417350589379818421e-02,6.979267584097689214e-01,-6.083110374990474689e-02,6.592727182979400968e-01,2.517054797277291645e+00,4.024345644679511169e-02,6.420791878509969353e-01,5.097550453377296398e-01,5.307187488450447965e+00,1.540675898891497031e+00,1.147473157560213064e+00,-8.818659635841024080e-01,-7.462903629628032665e-01,1.311568770472667733e+00,3.797895366374846038e-01,-4.288642154925406125e-01,-3.311110073202153670e-01,1.888968950100704980e+00,1.457222299040560998e+00,-1.178035703700323511e+00,-1.147433204674430218e+00,5.866703978564957733e-02,-4.324449995867536423e-01,-1.150233249928150681e+00,-5.817150459641182714e-01,1.123225628698265366e+00,-1.051476414798208525e+00,-1.484094869808427752e-01,3.699467461155946602e+00,3.712165937003036875e-02,2.835126093025719940e-01,1.553834582632338979e+00,1.746640432786150665e-01,1.803290618001448076e+00,9.939162296268344576e-02,7.591564249707416501e-01,2.581999384314312973e-01,-1.097617147715871821e+00,2.988289915085058368e-01,4.940290290944854279e-01,-1.196434090634921066e-01,8.343865608797562672e-01,4.716822398391238846e-01,-7.898933350410090037e-01,-2.824506365792794349e-01,2.445339312848338498e+00,8.765960150989929867e-01,-8.578780802899972358e-01,2.304588849504954240e+00,3.794970744264447582e-02,1.155601292239509803e+00,4.320367410155967480e-01,6.221407567064525246e-01,-5.024183074313719466e-01
1.193111186758655240e+00,8.745394511936668280e-01,-6.978433313495950863e-01,1.747164856711680425e-01,-5.568688329587470065e-01,1.042098206414516115e+00,4.231158424725753320e-01,6.910429935326500850e-01,1.835961454725554720e+00,3.196361078845911252e-01,6.308655562478262535e-01,4.725557019723933966e-02,-4.021398869300423784e-01,2.788568740639731369e-01,-3.142091197417030690e-01,2.185799643278770521e+00,1.188236572873841435e-01,-9.010533587603383188e-01,1.998483260988809240e-01,1.364317453742383834e-01,-7.108402627803666052e-01,7.109503449121312713e-01,-5.020190731945645135e-01,1.940413593444344775e-01,1.178577582738053131e+00,-8.400147277193095174e-01,-3.975910567801752560e-01,-5.927726006235329859e-01,-1.448566106783527596e-01,-4.547538795524085353e-01,8.762875447030346043e-01,2.237970187503254493e+00,3.016356948220100809e-01,-1.099491359813916103e-01,-8.015133833563103938e-01,-9.692430478671590910e-01,1.919185972329667811e+00,6.348361642107853697e-01,1.060888412983879814e+00,8.430131947572386819e-01,1.488856527688686704e+00,2.435120195521566500e-01,1.225925313198966971e-01,8.089668982546742715e-01,9.315307875553974215e-02,7.017392624195651907e-01,2.705340762665576104e+00,5.734306156234705298e-01,7.150252446759057801e-01,2.129536360606278378e-01,5.491886062305185945e+00,1.997322937578254187e+00,1.488208460710078729e+00,-5.383784752659412920e-01,-2.442462429273809243e-01,1.012601303205398207e+00,-1.290640165448382337e-01,-6.842139020149986539e-01,-8.565393761817901019e-01,1.922004722716972314e+00,4.642506269245487704e-01,-6.864853286267216248e-01,-7.518330625128860634e-01,-3.568298975186495747e-01,5.947078920521553513e-02,-6.011452662588604445e-01,-3.156825532689313540e-01,1.031821698666181453e+00,-9.328161469299522945e-01,-2.660803934781426072e-01,3.556778779572420390e+00,1.186168716773838838e-02,-1.681599748320330434e-01,8.107477519839961788e-01,5.263135632560574928e-01,1.014862720048410383e+00,1.370758395397581042e-02,3.075358777621274298e-01,-4.613744680678828480e-01,-9.229454017255597220e-01,8.663052261084830397e-01,4.338296051236392725e-01,-4.218442693813345135e-01,9.960128921587659834e-01,5.048264420328071322e-01,-9.097878136912067593e-01,-3.257047870738263851e-01,1.859183800248611185e+00,1.173872151917380924e+00,-1.758208427391901640e+00,2.368184126411198243e+00,-1.662704063538015808e-01,1.712895416254608172e+00,4.640658170082913592e-01,-6.021841491480508513e-01,-6.688061041447352917e-01
1.136788580622964284e+00,1.622301179672957172e+00,7.905870786146756979e-02,-7.246617955675896949e-01,-2.851030940490612564e-01,-1.441850951459738295e-01,-1.270478952144047380e+00,5.824911663284486618e-01,2.487973624348836843e+00,6.584986055528926352e-01,6.253365067772993502e-01,7.006320761208405523e-01,-4.245208069019051345e-01,3.906441625042476884e-02,-2.617869896851857670e-01,2.551846335891061024e+00,2.329772779262408444e-01,6.170652030289045520e-01,-1.152202389877752531e-01,2.935850575103327587e-01,-9.224792817909502896e-01,8.421073900422194614e-01,-2.511763407542487170e-01,1.869290102887410931e-02,1.320244646355980045e+00,-8.633905269991420939e-01,2.204624600885046193e-01,-4.875774798479751704e-01,2.838122787399304237e-01,-4.158705346567447281e-01,1.759149308684745117e-01,2.381655063612670986e+00,-6.389364158200314670e-01,-7.128371895419345350e-01,-5.453665606667690291e-01,-6.498741715604839930e-01,1.425732179367897423e+00,1.383946503081729063e+00,1.209719847439674201e+00,2.123067833858392817e+00,9.067653265098422066e-01,3.838878324616851190e-02,6.508964639911775096e-01,2.846643304153203546e-01,1.430047437423387913e-01,5.339098452274140261e-01,3.684198582069325489e+00,-1.736193696428056654e-01,-1.768672380259065369e-01,2.003758358226457315e+00,3.707519329888825599e+00,8.376273796711142250e-01,1.034614824742789541e+00,-4.936428023577468238e-01,-8.918689690285110938e-01,1.649701484354519021e+00,1.026158359545943810e+00,-1.603362766346979051e-01,-9.844333114131853524e-01,1.607749068232810163e+00,1.063203566215453089e+00,6.643886582572195998e-01,-1.725207706844943956e-01,1.702419531838949229e+00,7.787612605774236751e-01,-2.568111936281285423e-01,-1.119133703254572287e-01,7.877908142465430696e-01,6.463817712202223342e-01,-1.114710429001413816e+00,3.217730727648554279e+00,-7.148046920322468356e-01,1.283270786307195155e-01,1.424697924385552594e-01,-2.897445136707401114e-01,1.363150502125750396e+00,7.704474116160260344e-01,1.542786013234463960e+00,-8.482576886295053464e-01,2.902102418564190822e-01,5.334654026068385013e-01,7.876543390434478376e-01,6.196172958020829125e-02,7.883799478395602245e-01,1.244601005870318966e+00,-7.557896202331253477e-01,1.064758784733848829e-01,2.201859772183390351e+00,2.742590161795357417e-01,-1.637312399949272801e-01,2.738616124829976961e+00,-6.121734854160021388e-01,1.343879463616072467e+00,-3.787524061559088828e-02,1.164595593150243635e+00,2.038622058099044398e-01
9.307003708453811530e-01,1.034853471709291650e+00,-4.421171962627035157e-01,-4.341986891293924677e-01,-1.719724826406571760e-01,4.301904503967568516e-01,3.620233382024927726e-01,1.819108355021143986e-01,6.314927011820410385e-01,2.509941288069266752e-01,9.189209471441943666e-01,1.887729605227547180e-01,-3.005540898491945723e-01,3.030499036220079545e-01,-5.516969826987759840e-01,2.062694168550263107e+00,1.627905913949348471e-01,-4.966218814747910826e-01,3.154414539702155712e-02,-6.487811441223692577e-02,-4.417698921273492951e-01,5.181210244197069770e-01,-5.600201279406985533e-01,2.379846977822176191e-01,1.538719659973394105e+00,-3.360532037607653066e-01,1.675739085980168519e-02,-5.593552800803730518e-01,-4.936480839527659370e-01,-9.360507249636518257e-01,4.086967620980738181e-01,2.083199733999010927e+00,-9.594406938102931215e-02,3.673370489305737008e-02,-7.387520043205442200e-01,-8.628830761415020589e-01,1.563025306675681181e+00,8.484027151846192938e-01,1.799121759771134421e+00,9.466944736103782843e-01,7.524275548140648695e-01,1.265295007119747184e-01,-3.791660340178056726e-02,3.497164304259866574e-01,8.271966419142462446e-02,7.951044841190515466e-01,2.451585925905985786e+00,9.557620525821525215e-02,2.124936257214332103e-01,7.747329309094778127e-01,4.428181981509631271e+00,1.713911524841126521e+00,7.045516734112821089e-01,-5.393437896050505831e-01,-3.786685732746555844e-01,1.385610764861936905e+00,4.084414816227952549e-01,-8.096481718771032787e-02,-9.905785085117119193e-01,1.675464149763916666e+00,3.614471743889050570e-01,-3.664457294786067076e-01,-1.950756679341185407e-01,4.250624760066602503e-01,5.639845693721501352e-01,-2.792582429199524929e-01,-6.961641577335793141e-01,3.570455574446038116e-01,-2.045220946533004014e-01,4.126283883060934965e-01,2.690767225003131369e+00,-1.735216486909444411e-01,-2.027675320999465514e-02,5.395307561587576739e-01,-4.995466158177786636e-02,1.067679208166212534e+00,-3.154401565628419668e-01,8.176771467339165600e-01,-7.082136738525159902e-01,-5.652679424258645335e-01,9.395940221567372630e-01,3.678784273487326062e-01,-1.831129844304985599e-01,1.283018533182902932e+00,9.827648920036212710e-01,-1.090783291311311798e+00,1.506386430821152478e-01,1.067840403898340229e+00,7.409958749885717788e-01,-5.494169622854252477e-01,1.765442092490681958e+00,-3.969087983223136273e-01,9.145384208584327324e-01,1.581559824977914475e-01,5.073818033189121390e-01,-4.319802988912392339e-01
7.315110531198084631e-01,3.376455761333618799e-02,-1.082650964024896856e-01,-4.007216182833195917e-01,-4.855661896336070371e-01,6.361761001773132973e-01,1.376743617411483322e-01,1.332729925299656060e-01,1.451008329341470171e+00,8.211979055673088723e-01,9.935084493298436126e-01,1.839062483263861347e-01,-4.102655993821234248e-01,-3.300319527671156106e-01,-4.678689028948535000e-01,2.080594233083870037e+00,-4.466998698082494945e-01,2.111036652523652357e-01,9.356878745434327183e-02,2.435336994542642575e-01,-8.239239535397390179e-01,1.011528324202104479e+00,-1.063687182030790823e-01,9.785404802201676244e-02,1.556642241782105085e+00,-9.006156263254930794e-01,1.993053049637079077e-01,-7.202652748587743403e-01,-5.887004076692694543e-01,-8.303355476999680906e-01,3.891611456618178089e-01,2.863565809195254275e+00,-2.746881650577761569e-01,-3.838355392812042854e-02,-4.255361103795872735e-01,-6.326930605548275466e-01,1.351433266709216596e+00,1.190933971893654464e+00,2.081608353090457886e+00,2.214454009431221060e+00,9.870593294497675974e-01,3.866164036131368720e-01,3.260055921156960745e-01,-4.193719923147884443e-02,2.208718211770549500e-01,4.707932842294767495e-01,2.786685962207916312e+00,-2.787744721172296103e-01,1.452020916087332358e-01,4.589047160603590414e-01,4.217168570325705801e+00,1.954446368683538493e+00,7.791977389730757597e-01,-5.486118167875229101e-01,-1.139433024474798328e+00,2.012757091834036061e+00,1.198218391459942911e+00,-2.629847183698590385e-01,-5.153074190741011584e-01,2.880512304369720056e+00,8.562062048419931681e-01,-5.217912747860093958e-01,-5.093328660393721119e-01,1.134477276614536789e+00,7.936447073975685385e-01,-9.126575662552371959e-02,-5.282214140310681483e-01,1.219354176406958867e+00,2.140733313541961780e-01,-4.328118423020026473e-01,2.809509721901088941e+00,-9.922967554565209625e-02,5.674721011456667075e-01,2.370920848968475214e-01,-9.093918780453305595e-02,1.030881802253530877e+00,-1.221902740122929321e-01,1.078611634758778637e+00,-9.932235099909884068e-01,-3.299008994409476370e-01,3.840302798789024807e-01,7.985925264042135208e-01,-3.088162003586450988e-01,1.555393570652128021e+00,1.095638356603122476e+00,-1.388058653217620453e+00,-5.918318196450939039e-02,2.200386127078568066e+00,7.299314232988582951e-01,-6.489686907782619141e-01,2.412250637998275771e+00,2.068712411947870589e-01,7.520477926697993754e-01,2.975672858395100318e-01,7.984128497136904201e-01,-4.800191810571778905e-01
9.342057307394384669e-01,1.322045452544654109e+00,1.590989009899912432e-01,-8.019644374483316795e-01,-1.241907422736411443e-01,-9.294987677285393435e-02,-6.190662550657584084e-01,1.894211267894031492e-01,1.658087161607662230e+00,4.733501330907501359e-01,4.755037929611204972e-01,4.454385484981064902e-01,-4.320066810247492062e-01,-1.971388455040247456e-02,-3.056720240452751591e-01,1.994276803302249990e+00,-1.120169659082439206e-01,4.649261737728666022e-01,-1.119075903666753025e-01,2.051452376887974161e-01,-8.398175917779882038e-01,5.773184578550327739e-01,-3.591248142326066706e-01,8.894260748517823778e-02,1.524069340701578179e+00,-3.781191702893940132e-01,2.976911595265044896e-01,-5.672086205112399915e-01,-4.004884283030518688e-01,-7.848283666411741688e-01,1.427695189015873445e-01,2.459380050626145398e+00,-5.810772231814036459e-01,-3.589146565024397550e-01,-5.834226794641556024e-01,-5.517761814252658548e-01,1.435755811704984453e+00,1.221763916235545144e+00,1.588293646203606579e+00,1.726852878080094467e+00,6.556028436073180199e-01,2.201012115932309832e-01,3.846570127678897721e-01,6.860613154914892153e-02,3.594653045495166399e-01,6.733100861287748540e-01,3.158577044100075781e+00,-1.892116436472218166e-01,-1.509198087620853279e-01,1.538400865179633703e+00,3.518504233373996648e+00,1.196744228563274337e+00,5.850776041928982263e-01,-4.003379961226233297e-01,-7.299095570531468624e-01,1.658218400444772866e+00,8.117163516882235363e-01,-5.975221648023416182e-02,-8.639076267772998197e-01,1.508072100613146338e+00,7.261399209377177311e-01,3.828133510159339448e-01,-1.720951870747323281e-03,1.442949976051432603e+00,1.076905990150843540e+00,1.232969274879146260e-01,-3.369252639923200898e-01,7.413102124737920295e-01,5.447154514580280216e-01,-4.532733335940488661e-01,2.578530359873797195e+00,-6.224727002257437469e-01,1.568769356412135219e-01,5.595448769736743877e-02,-3.006669577737899890e-01,1.128533016441472858e+00,2.762155674754078194e-01,1.131526566016982205e+00,-1.051900191911621540e+00,1.042505925557249413e-01,5.128541963063955045e-01,4.613281641583131809e-01,-5.835246735592847234e-02,1.263546781266901009e+00,1.105840824856041626e+00,-9.546441381393264702e-01,2.833729197168021186e-01,1.620679809569473218e+00,4.195924055968209276e-01,-4.295220084732254140e-02,2.158948626752374977e+00,-6.047226309190182336e-01,1.032669351911986499e+00,7.845727287694528873e-02,8.416014469156205546e-01,2.489947379958878937e-02
8.539463985950466185e-01,2.525424845477772795e-01,-4.620334198451600538e-02,-1.197525749402447159e-01,-2.769811128763489672e-01,4.562405111895465604e-01,-2.104810041370995255e-01,1.638149875262713828e-01,1.359820293090379550e+00,8.587599806266628111e-01,1.197749869844358273e+00,2.141229232857996267e-01,-4.053759302831639877e-01,-1.215296823285304251e-02,-2.241837970200829533e-01,2.365180026076288300e+00,-2.761849750433478801e-01,1.442226213990090711e-01,3.212784534449523721e-01,3.792147194808620503e-01,-9.467707389073809487e-01,6.907115125290640423e-01,-1.424861307864655480e-01,2.588455393856565201e-01,1.159260792303932197e+00,-1.296433325702502692e+00,3.169936064951460741e-01,-6.282390739311481953e-01,4.703778703425771646e-01,-1.756153742483127500e-01,5.011075197715103569e-01,2.565796892591070133e+00,-1.670624673806134219e-01,-5.050399742608513431e-01,-3.637218446489307033e-01,-8.722362606852991362e-01,9.031711169450584720e-01,1.510566432024227801e+00,1.490893824299921899e+00,2.278064036451882934e+00,1.052504715629195786e+00,1.503292360066171840e-01,3.133276679903577167e-01,2.155945658132821796e-01,1.221227208880525938e-01,5.303606961673266174e-01,3.006188951227217743e+00,-4.311619115159991411e-01,1.306883261364248650e-01,1.235742465601451290e+00,4.164661985467108529e+00,1.133976514666587221e+00,7.782574974963354375e-01,-7.741422203638252952e-01,-1.207293030722332627e+00,1.816901368852498866e+00,1.110706121284742887e+00,-1.805122684152654089e-01,-2.819947187311043768e-01,2.002795301280477780e+00,1.691022595393295136e+00,-4.840503007721616013e-01,-7.888399076073822069e-01,1.293338302310292676e+00,2.309423025235426419e-01,-6.724484671336836694e-01,-4.588506172556737206e-01,1.216332277256749972e+00,-4.950733380922493071e-02,-6.528083396261485927e-01,3.273305847474501373e+00,-3.348795798394857970e-01,5.739313736136937294e-01,9.516301975890454345e-01,-2.618918061972581035e-01,1.801350397626682254e+00,3.994660927980324128e-01,1.314926413410397732e+00,-2.189655954344900124e-01,-3.782536157961122747e-01,1.206178849077810256e-03,6.786839177487213881e-01,3.604691675691934494e-02,9.976494816911479768e-01,8.680322080544871088e-01,-8.711019583646968378e-01,-3.094093334794723038e-02,2.677647546837096382e+00,4.523650607874092344e-01,-4.082562953888024815e-02,2.490429370083520055e+00,-7.562349373269316999e-02,8.607148874708545616e-01,2.379031573295170565e-01,1.420669294231521329e+00,-9.919014474341725229e-02
1.234452701114164608e+00,1.436722892955190067e+00,-5.098410241427795420e-01,-6.331246193412687351e-02,-3.762591262386903446e-01,7.934647832829602176e-01,4.207501294929051339e-01,6.018196178501221683e-01,1.877864777416773601e+00,-1.922501247203772801e-02,-1.614849292669157110e-02,5.387251824160735336e-03,-4.677684540227469712e-01,3.215448500456685732e-01,-2.069439369498841941e-01,1.677253588465307699e+00,9.155309718728021906e-03,-8.729210036660958183e-01,4.245545989340237386e-02,9.645146540879639963e-02,-7.481296155632656264e-01,3.835475783327932375e-01,-7.051906712632213248e-01,1.669859568152292362e-01,1.297443602884836622e+00,-1.916868121408395742e-01,-4.199009899624137621e-01,-5.846443862900246868e-01,-6.904795849130613838e-01,-7.061132565254295557e-01,7.847622024502852733e-01,2.187078223091567075e+00,1.957026780825630863e-01,-1.929002973484700290e-02,-9.606223806704708990e-01,-7.847912148082831774e-01,2.214950204197688066e+00,4.096216088237403241e-01,9.100220706407160520e-01,2.396298580887921137e-01,1.296560947009768761e+00,3.753692967895428945e-01,6.019252004875930151e-02,7.807894172547252820e-01,3.981568768788763535e-01,8.822989996006124214e-01,2.655134043917855458e+00,7.975518463845991946e-01,6.716031332631386963e-01,2.663046105165267075e-01,5.168748936540399797e+00,2.026164210791116194e+00,1.276819361988590806e+00,-2.952189319389998956e-01,1.834390581604521397e-01,7.354622195984742428e-01,-6.628416207968416130e-01,-6.922308645798362914e-01,-1.015670313756935395e+00,1.235973330651748192e+00,-3.879639049920199922e-02,-3.324621532935448376e-01,-3.720719543276611585e-01,-5.516115029270364234e-01,5.035104589377548123e-01,-8.842859076665243734e-02,-2.151443462661453698e-01,9.284523768747121597e-01,-8.843394218587740108e-01,-3.180000541591160301e-02,3.079718377617189251e+00,-1.852526526709298849e-01,-4.599651657406731986e-01,4.729492907847254735e-01,5.919057344572428159e-01,6.818520821231324192e-01,-6.574313660589981012e-02,-1.619260324955587027e-01,-8.145479212906379107e-01,-8.119508906848049712e-01,9.863138713343269082e-01,3.222471701205553707e-02,-5.044349482353979175e-01,1.205297280009968386e+00,3.292524277871843319e-01,-8.362792720699713245e-01,-1.182696253787613450e-01,1.216196021514205583e+00,1.262206830694283077e+00,-1.784341090348686265e+00,1.983971336481698655e+00,-5.716290582950938060e-01,1.916357511709124051e+00,5.104927648436328180e-01,-1.316500624099414818e+00,-6.038707758835675232e-01
7.930444729720473873e-01,1.443228809974201443e+00,-1.407189182782322689e-01,-7.522055343530366089e-01,3.437933988088690551e-01,-9.356652587786590258e-02,5.111912757846319710e-01,-3.186846584911058322e-01,-4.781016537840692138e-01,-9.116801113333808382e-02,7.003563400463856947e-01,1.043347148900880400e-01,-2.878098821913790406e-01,5.151369534834260300e-01,-4.906065056979781458e-01,1.546570748156201214e+00,4.591728827211194464e-02,-4.403760449216881923e-01,-1.326133347030238746e-02,-1.706319354992848480e-01,-3.424051164771091949e-01,-1.237302173455898102e-01,-8.097430373416013571e-01,3.807774272360645584e-01,1.669604300084284176e+00,3.640558032631671104e-01,3.054965590304941081e-01,-5.242869986830736018e-01,-7.640394403158385916e-01,-1.155536366690699701e+00,1.762188731684761200e-01,1.819741923372992787e+00,-2.476119739289584509e-01,9.798469674168666654e-02,-8.027950951441078509e-01,-7.931292074732131381e-01,1.326597403252648855e+00,8.930949605553848425e-01,1.927985824171627671e+00,3.954548289884906032e-01,1.701583066731077731e-01,1.060079887241087149e-01,-3.255708452469656677e-01,1.540725570933222932e-01,3.198777715911949038e-01,1.074143872339185846e+00,2.113383804513925934e+00,-8.024761080480889708e-02,-4.489909313005600866e-02,1.269317882241882689e+00,3.597665421431515131e+00,1.319556178169419614e+00,-5.554931567600124298e-02,-4.707105528789776172e-01,-1.034059487483382500e-01,1.265766678322223893e+00,1.432402864781304186e-01,3.151910541806611787e-01,-9.676214601881858446e-01,5.395333313316659218e-01,2.782501865112466111e-01,-1.339539200267290953e-01,2.480079541268417342e-01,5.976016428233317246e-01,9.077288983525684252e-01,5.556317589960413361e-02,-9.136286179135826302e-01,-9.209112352115111921e-02,-5.276011655933509487e-02,1.162243041758287632e+00,1.889427769080757269e+00,-4.652716779992607798e-01,-1.279470305993113399e-01,5.808389641610525178e-01,-3.892895440279303676e-01,1.203911749341411319e+00,-5.105444671712737748e-01,6.734425163261321678e-01,-6.974052669729315923e-01,-4.708550737225610794e-01,8.387543548797192772e-01,-1.747087972558465929e-01,1.640150686652047662e-02,1.484247362218154231e+00,8.935145898788340313e-01,-9.383251357549196037e-01,6.277297762850631013e-01,2.015674605089385896e-01,5.103181038202947439e-01,4.348400665798984321e-01,9.365345426006644880e-01,-9.315252978511104898e-01,5.455801654256997590e-01,6.525795553659194392e-02,7.741755433087365024e-01,-1.614886942696026062e-01
1.083612987858477927e+00,1.036207192392739618e+00,-4.455150867377334345e-01,7.661160873521533077e-03,-2.104260974623260450e-01,6.943717786115519708e-01,4.787784866708023057e-01,3.337264228370424024e-01,1.127144754403445193e+00,1.598653207606660076e-01,5.291215250254150959e-01,-1.816174088141134235e-02,-4.048240543155565696e-01,3.905584214587178860e-01,-2.309730153654077633e-01,1.864519961077671928e+00,-2.235637290265979349e-02,-7.977654077456516335e-01,2.148331335751189619e-01,1.184037398458230861e-01,-7.025905127347905621e-01,2.816537078569212316e-01,-6.232622970599448475e-01,3.021675721954316662e-01,1.217232422481997034e+00,-4.831183790513036702e-01,-1.590310074419939157e-01,-5.787185993569549103e-01,-2.031086993051363088e-01,-5.055251887216780649e-01,7.343256592005257266e-01,2.113316614585141195e+00,1.996745697321243851e-01,-1.312497448056295091e-01,-7.967898204089168823e-01,-9.297730019949723701e-01,1.661387110314110682e+00,7.500777915405560936e-01,1.115391544872626373e+00,6.236251217905787181e-01,1.124996018718962709e+00,2.316662702171011501e-01,-4.264151229954488143e-02,6.586544802612566141e-01,2.593712351222284829e-01,8.637602349376447552e-01,2.523728663246461501e+00,3.819101294477479924e-01,5.336220241775693207e-01,6.003481259936982450e-01,4.896064928034460806e+00,1.654668627314622054e+00,9.654996508706213953e-01,-5.274846041865680624e-01,-1.598705839571617493e-01,9.831348913224449149e-01,-2.270882901727321324e-01,-4.209014459453950252e-01,-7.398016276236664135e-01,1.176562965242567538e+00,5.857073205016164463e-01,-5.648253209639058081e-01,-5.317036247235427115e-01,-1.418056102002163144e-01,2.398472323241134241e-01,-4.316897078760896234e-01,-4.458332502109374484e-01,8.307237478126772157e-01,-8.268691820958748995e-01,1.354009378966151977e-01,3.077233347997818669e+00,-2.024325964047243853e-01,-1.622693452764751298e-01,9.129818378047824812e-01,2.649751476123928806e-01,1.213185768494865258e+00,-4.050872856730286520e-02,2.653646226449544732e-01,-3.744440793938936807e-01,-8.507509603518155217e-01,6.710881072087979682e-01,9.262531475974303263e-02,-2.548708780507721317e-01,1.100420599868010774e+00,4.202742482651815603e-01,-7.764395245345472318e-01,-1.990836974507886881e-02,1.464819771624340738e+00,9.809764404265397530e-01,-1.008048234562479273e+00,1.875803335282446138e+00,-4.884827254717630796e-01,1.440597077098999534e+00,4.141030742552522237e-01,-2.957227651318832251e-01,-4.455753482154809486e-01
1.128278665247131718e+00,1.765800603719273276e+00,-1.086903347092261357e-01,-5.984700379356303612e-01,-2.010863087380325154e-01,2.759178685572508671e-01,-5.860498558167281935e-03,3.918823765902601508e-01,1.918373672015310838e+00,-4.271747152281821225e-02,-3.071852708318208447e-01,1.765733147207074472e-01,-5.018794414867975284e-01,1.402615943167794255e-01,-2.171637792950959767e-01,1.432110014680813448e+00,-1.330869409791699542e-01,-2.542206163425259624e-01,-1.841469378284368574e-01,9.594907243705169675e-02,-7.994953934356968661e-01,3.244168350699864756e-01,-6.846250004394003330e-01,7.280014184593742999e-02,1.544578273516790556e+00,2.335770658989667625e-01,-1.638970111619299785e-01,-5.854464259643651358e-01,-1.126866559903195730e+00,-1.025121646443934553e+00,4.275306001799621947e-01,2.329105856685041331e+00,-2.376733751649033333e-01,-3.068031124182041269e-02,-9.234492882567322258e-01,-5.088402311544266698e-01,2.192763651343951015e+00,5.389754837398417209e-01,1.179578996856026851e+00,4.638922398096319011e-01,8.988322286133709760e-01,4.420165391204991523e-01,1.819747983829089200e-01,4.215616115625801519e-01,6.059499297722037436e-01,8.966786445718329945e-01,2.835057841283750601e+00,5.742986729349682795e-01,2.941158876195765770e-01,7.146805788627081935e-01,4.265944592318137829e+00,1.841456389899175594e+00,8.738562785788547282e-01,-1.241130683842730231e-01,1.006775406874483303e-01,9.701156354274642624e-01,-3.831860589790642146e-01,-4.603781302275103959e-01,-1.121862067631953064e+00,1.060148214730991301e+00,-2.218691134674747600e-01,2.406296488579639514e-01,9.912812521763206264e-02,1.438170925098086750e-01,1.160974733955371319e+00,4.627812259326314903e-01,-1.860834493045272486e-01,7.891304939537453489e-01,-1.788221142499087923e-01,-6.149539751019894585e-02,2.483908982833097134e+00,-4.698997661925131686e-01,-4.094597334993084203e-01,-9.342756606039559486e-02,3.005216610295652901e-01,4.866751181469070042e-01,-4.295609641990810745e-02,3.175581675199262710e-02,-1.318400188368104908e+00,-3.166423931745621645e-01,9.504686932616809303e-01,-1.919987880791232393e-02,-4.399064007864457726e-01,1.459446698331960723e+00,5.902356000824011684e-01,-9.271193243244095772e-01,1.769629888046773403e-01,8.842509285645748784e-01,1.017116482930176424e+00,-1.210747385143722710e+00,1.821620859163754602e+00,-8.139321193599210469e-01,1.695327484512788363e+00,3.661069087592922489e-01,-1.025462361062698946e+00,-3.570012586979769420e-01
8.096518904414669038e-01,5.530980440608532778e-01,3.826659957367912201e-01,-2.383702065730104458e-01,7.935653923843451196e-02,6.507563881084502122e-02,-3.325317578119611484e-01,-1.419994072952343311e-01,1.137546342735497706e+00,6.655549605021867654e-01,7.082353707393727049e-01,1.151289871205094656e-01,-4.969692765242185728e-01,4.212668067652268478e-02,6.328091117002970778e-02,1.848571019703761698e+00,-5.962999291285235870e-01,3.701951475651796275e-01,3.443306152978378165e-01,4.968032803596352798e-01,-1.152563019116921827e+00,1.441301407077811292e-01,-2.667666222969790613e-01,3.440888705560527505e-01,1.094419782364115079e+00,-8.979502521969886519e-01,5.416700443538425835e-01,-6.293019009340121706e-01,4.215141253956655731e-01,-7.447737028939105386e-02,4.135160401715667899e-01,2.561515880624170904e+00,-2.853673714896743374e-01,-6.598521640438355096e-01,-3.704749506794033920e-01,-7.417241733410100402e-01,7.228054493611226761e-01,1.628012679520009165e+00,1.207526078903545130e+00,2.027530276410787202e+00,7.941865048037757280e-01,2.416697747221708825e-01,2.450574682550409333e-01,1.078369417436193384e-01,4.865270608531870322e-01,7.138246735792370679e-01,3.015075923432902094e+00,-5.308197576646532800e-01,-9.033179027340923484e-03,1.703499559063052171e+00,3.495655805356435497e+00,6.856767436276864913e-01,3.063655931153522749e-01,-6.746908861971929738e-01,-1.052830859241977057e+00,1.654167054039773266e+00,7.676177116021932756e-01,-6.545941387261006161e-02,-5.801658607251525268e-02,9.497702477706396751e-01,1.883804339149535823e+00,-2.105566654036430951e-01,-5.956733641148970193e-01,1.484589296321593643e+00,4.980890006669540515e-01,-3.584014564719755214e-01,-3.784998403298754921e-01,1.306436707730422420e+00,-1.394183254381516079e-03,-5.456130593205126278e-01,2.836199103284442469e+00,-6.908884963638499688e-01,5.222705421547056970e-01,1.003731957176013934e+00,-4.312422709721626668e-01,1.986584992566793550e+00,5.734533953367890735e-01,1.030255456677330095e+00,-1.698251215193503638e-01,-2.413377200869178674e-01,-3.825012083039305288e-01,1.897616714575854346e-01,1.716782036602829686e-01,1.081582777251790528e+00,5.569532328422636125e-01,-5.859586582835560886e-01,2.630963303982906121e-01,2.477789361348310848e+00,3.108103405632742788e-01,6.015684222322901231e-01,2.085492780268993318e+00,-5.319297373837801324e-01,8.689654114409339769e-01,2.899128935285436026e-01,1.324429012946656270e+00,2.218262961701047420e-01
8.763680239532003480e-01,1.021045195367678682e+00,1.288267707700613274e-01,-6.526335294450784641e-01,-1.677297850611611518e-01,1.710737424924540784e-01,-1.425890073507424805e-01,9.672921535095918566e-02,1.536858227705693691e+00,3.863165937725985266e-01,2.698696829406583286e-01,2.205866885858641657e-01,-4.751415747484186158e-01,-9.963406516992237560e-02,-2.626751966478766409e-01,1.647552600622859797e+00,-3.857017111159175560e-01,2.410003483523480150e-01,-5.870714491042591798e-02,2.169633418170745787e-01,-8.811557851628960547e-01,4.938065939472446875e-01,-3.977429633611450077e-01,1.106990955510059327e-01,1.555548402220605420e+00,-2.236260244820494070e-01,2.052094531142230061e-01,-6.417097411231180715e-01,-7.935123316265255689e-01,-8.945453131016293247e-01,2.783191704783960496e-01,2.600729758898046473e+00,-4.116183243220593591e-01,-1.494251479690048012e-01,-6.249471639582649951e-01,-5.062455673976397064e-01,1.580070652347356885e+00,1.032141710520363409e+00,1.624878979485259833e+00,1.454251723219757819e+00,7.455640257707754071e-01,4.016789227557028830e-01,2.693084291989609191e-01,5.956418877658187228e-02,5.167929052616409002e-01,7.234675778924929412e-01,2.887077676611342181e+00,-3.729175762257211368e-02,4.145248109949865867e-02,9.800555369647787618e-01,3.760086271995117801e+00,1.584874579506309278e+00,5.551772214906043335e-01,-3.278647469557475214e-01,-5.919871255398638787e-01,1.561101416692182831e+00,5.060038092868351933e-01,-2.100731700877507824e-01,-7.322478081517429516e-01,1.602810532384728148e+00,5.096092484694513258e-01,7.050850299639715990e-02,-7.734539905615517297e-02,1.005214690445604742e+00,1.133118895103111701e+00,2.984933901933697342e-01,-3.573940458688931732e-01,9.681796154779194197e-01,2.437439728094133173e-01,-2.518254893913849379e-01,2.429418181636443741e+00,-4.804414550459996103e-01,1.417269451731408281e-01,5.311810726197772892e-02,-1.006044117078950528e-01,9.156885197556724476e-01,3.501865328486891693e-02,6.718864573458893652e-01,-1.145423963147828683e+00,-1.400734955375752822e-01,4.757697303825050295e-01,2.811342158608037822e-01,-2.424394072230603436e-01,1.519137073404399407e+00,8.590337377033320232e-01,-1.059403169962345848e+00,2.296648986328977959e-01,1.511808088667175642e+00,6.818412424125874782e-01,-4.129483174981106730e-01,1.989381912576139833e+00,-4.875219978613778982e-01,1.088112672879992804e+00,2.706691552047172378e-01,2.176950466029688169e-01,-1.993193674523789649e-01
1.164940441720815345e+00,1.256949321026711086e+00,-3.544562056662002858e-01,-3.640987511757117767e-01,-6.023730079818149230e-01,7.176687615243511065e-01,6.113210883875175305e-04,6.968111253116084924e-01,2.557587528354998252e+00,2.692453990625289784e-01,-2.034940026167719740e-03,2.162042858526492528e-01,-4.922294795268012946e-01,-6.416742217284858441e-02,-3.238108564771911002e-01,1.833480488585757406e+00,-8.750043804234935996e-02,-2.923702216794608622e-01,-1.337528101094406785e-01,1.552134734164304641e-01,-8.335733577793371651e-01,8.600816533514730189e-01,-4.597075711539632126e-01,-2.564676886464228867e-02,1.493816140289491168e+00,-3.299227243214053473e-01,-3.447812019044191878e-01,-6.319287464501484042e-01,-9.822074588834930342e-01,-9.222213514828938585e-01,5.860924704936409935e-01,2.570225755174319282e+00,-1.195108637350271175e-01,-7.392162125464563083e-03,-8.386465922746705326e-01,-5.680970595817226299e-01,2.303642905824219156e+00,5.319883346957241521e-01,1.260753304650944262e+00,9.811601678729614529e-01,1.301248092035291348e+00,4.642865743442667892e-01,3.673785374056061648e-01,4.952714663075812873e-01,3.935638028723864035e-01,6.623386240332025388e-01,2.994751515006011999e+00,6.265275790006274992e-01,4.740160953883166828e-01,2.372975390629952219e-01,4.880578632169103592e+00,2.224002367019995763e+00,1.382841883633478375e+00,-2.074601775533442272e-01,-1.984521537824439907e-01,1.170203378634101954e+00,-4.108332443002837842e-02,-7.131648821123131032e-01,-1.097122657599066908e+00,2.120750836777686388e+00,-1.392499484428849355e-01,-5.193016225599392244e-02,-2.557455298788551268e-01,6.405264961283207992e-02,9.054841452032597049e-01,2.002756947480097138e-01,-1.068599635827189864e-01,1.116695743989001510e+00,-2.588118696854139755e-01,-5.361378298414061216e-01,3.027130184461492846e+00,-1.827001690808717493e-01,-2.372463923414486198e-01,-1.169922025325774440e-01,5.148971810855839104e-01,3.852062617150796564e-01,-2.899546662175234157e-03,2.086849869786875367e-01,-1.335790100079840670e+00,-4.184681715182932416e-01,1.014429146914580526e+00,4.447261270993910776e-01,-5.973349004213909241e-01,1.384853808256551577e+00,7.209775950442661729e-01,-1.136348525434826451e+00,-1.820217486567992649e-01,1.541439246354105119e+00,1.183837481964413296e+00,-1.894566342696636596e+00,2.416447420781120847e+00,-2.998296120957318900e-01,1.819523421495365056e+00,4.307183290251407892e-01,-1.072192094633701798e+00,-6.148717649744601665e-01
9.064960515050713985e-01,1.331573492980364648e+00,4.738139560928168459e-01,-7.084897617378631551e-01,4.655783664181038783e-02,-1.271177912104468066e-01,-4.267386258004110533e-01,-1.811095821291364150e-02,1.725858543478262508e+00,2.847302287308445257e-01,-1.692029568586748689e-01,1.957833837183146075e-01,-5.677367980220058286e-01,-7.732339686462814943e-02,1.274923901034519247e-02,1.338487383707188672e+00,-6.016966025646020011e-01,4.820982146525195633e-01,-4.338497204710414085e-02,3.638649188079881580e-01,-1.115082599101426819e+00,1.370925113884749191e-01,-4.579529082785457339e-01,1.446099572669208022e-01,1.437924709419518665e+00,-3.465097689040256418e-02,3.433936458784774270e-01,-6.325797257378373839e-01,-6.906089778979398464e-01,-7.019425832663016562e-01,2.386361473971680969e-01,2.630735090036073309e+00,-5.171163701467287321e-01,-3.736142436128286337e-01,-6.227153190475578359e-01,-4.006253589787829861e-01,1.478791348385464666e+00,1.150829568046883633e+00,1.245018876150419285e+00,1.366089093371892105e+00,6.523109580992716428e-01,4.649828468578054985e-01,3.142478931725888325e-01,3.645150745069551668e-02,7.930097993209213048e-01,8.254903467481023993e-01,3.070005436984400315e+00,-7.715683482543325700e-02,-5.092581500872904454e-02,1.425948693474261564e+00,3.302259879689716016e+00,1.168334914679313163e+00,3.363528144434638767e-01,-2.466554237000638250e-01,-5.026977327967709908e-01,1.410910566529789412e+00,2.419007166425156119e-01,-2.004003376470436248e-01,-5.648646721993665354e-01,8.053320150956427836e-01,7.360386933908398266e-01,3.730035335673114183e-01,1.465865501024363540e-02,1.195906118652665384e+00,1.295043726253357175e+00,4.936274629063789887e-01,-1.834693163864026255e-01,1.142909687571978861e+00,2.905268891484302785e-01,-4.201926901310276685e-01,2.268087174831285857e+00,-7.941791076859509024e-01,8.636613254496901260e-02,7.957766593695111967e-02,-1.873588776271289391e-01,1.083093012359181095e+00,3.341241539657778259e-01,4.835061290932398115e-01,-1.091932338705860150e+00,2.196672035670288459e-02,1.486117543847920164e-01,-3.423842509175917259e-02,-1.357700627073957222e-01,1.478174910973623524e+00,6.020662321087777435e-01,-7.757612011150215592e-01,3.931200483132382129e-01,1.564048593531279341e+00,5.693028160383242220e-01,-2.748809682387137743e-02,1.863079653943055192e+00,-8.452637356177283845e-01,1.248060430361964457e+00,3.162323310720225322e-01,8.758874772833347144e-02,9.298535953591874348e-02
9.396924377469508816e-01,1.291824050818639602e+00,-1.560989023688532373e-01,-5.206765928308192404e-01,-2.981564500673637708e-02,2.722644397925349513e-01,3.415793886773328403e-01,6.434755382665618972e-02,8.408447481161166470e-01,5.429381234564276126e-02,2.911823301669568265e-01,8.223292603560199143e-02,-4.090352338898616824e-01,2.464399807508781959e-01,-3.296334085808063641e-01,1.541163497138485328e+00,-1.473070759912010197e-01,-3.710790575571665251e-01,-1.819051855125831257e-02,2.786426122776496095e-02,-6.376003415174893441e-01,2.015312505529872344e-01,-6.613104596225745091e-01,2.298140965028371840e-01,1.544009064925187413e+00,7.540591929672792182e-02,4.822315546659129704e-02,-5.904626479541190687e-01,-8.525766344647887074e-01,-9.824955271527251455e-01,3.948253805136011096e-01,2.199018622526325739e+00,-1.588729268140017803e-01,2.545460135574963145e-02,-8.058571679880397465e-01,-6.779281866832638226e-01,1.708055867740650990e+00,7.558518975502726001e-01,1.545829254787351337e+00,6.249219641148816562e-01,6.810298991193431961e-01,3.137401706579172611e-01,-3.983190912184031429e-02,2.966007353017933168e-01,4.434253073373095599e-01,9.199975604381489536e-01,2.477825570273716416e+00,2.211747641712112633e-01,2.121828154906242048e-01,8.021510194718147746e-01,4.118899807759317966e+00,1.677209906085684432e+00,5.117103752451197529e-01,-3.474987533769759995e-01,-1.371369849977598920e-01,1.185478285676966115e+00,-3.669224646503721488e-02,-1.662061960797971416e-01,-9.025032798960902491e-01,1.079066550165577398e+00,1.899638721210825942e-01,-1.471991430884888596e-01,-1.987537730754998511e-02,3.284401427237342852e-01,9.055907738287470865e-01,1.531131016279225765e-01,-5.314905350136157614e-01,5.675218742844722053e-01,-2.270617934988836684e-01,4.037077757603222961e-01,2.354132787454592091e+00,-3.764232564733934194e-01,-1.540967740441447353e-01,3.463935299056699613e-01,1.944594242839545184e-02,8.996266680725277798e-01,-2.519057795275893574e-01,3.446908258099215527e-01,-9.222951555090438402e-01,-4.867343272456918224e-01,7.743898338216198551e-01,-8.633987017402866559e-03,-2.523173266109323687e-01,1.469745812354575243e+00,6.843745471418095638e-01,-9.684357521993998130e-01,2.872026602068862289e-01,8.597751661096613152e-01,8.263100181033438130e-01,-5.405987794226714271e-01,1.535740927527712962e+00,-6.844863885186839303e-01,1.131570256869801616e+00,2.878483371479860220e-01,-1.377151746195885984e-01,-3.345799838842341556e-01
1.084544130155461250e+00,1.908949413839531761e+00,4.840559407644244583e-02,-6.434208232871447830e-01,1.318685012541172263e-02,1.407739814591779937e-01,1.834619671990664058e-01,1.736193325379543628e-01,1.550090034955692975e+00,-2.513123902499827533e-01,-6.079701797304168931e-01,4.213904302597371032e-02,-5.394952878783386696e-01,2.118662264325643640e-01,-1.015956039940746902e-01,1.025855366665069823e+00,-3.189204758598225276e-01,-3.125204034398764152e-01,-1.740834847034710697e-01,9.492985226322339654e-02,-8.361259030255044911e-01,-3.981033760348717809e-02,-8.231444661603688484e-01,1.423291994288455320e-01,1.561693608275871448e+00,6.053434151808572139e-01,-9.377893988428945282e-02,-5.963690207980055780e-01,-1.353913242824180019e+00,-1.090429952576032369e+00,4.108866318637396375e-01,2.277019382725506524e+00,-2.254735215695718442e-01,2.132240288860295929e-02,-9.819285923399411198e-01,-4.486697085647841643e-01,2.177667581724018753e+00,4.762461059854515288e-01,1.099851240088299154e+00,6.721516263493509946e-02,7.276961086409289292e-01,5.231403775218017582e-01,3.649114608711864771e-02,3.788106255732503480e-01,8.235053192518373422e-01,1.052907723587488187e+00,2.647084526352228906e+00,6.077876899339623717e-01,2.841252165038630206e-01,7.558033883551276144e-01,4.010254582863939987e+00,1.766021088147540885e+00,5.693595741250202513e-01,-4.338449904556918035e-02,3.228060772724934413e-01,8.033392281370235199e-01,-7.344368289677870587e-01,-4.010379488410628079e-01,-1.037247173927732469e+00,4.541567512564343989e-01,-3.145162906730176733e-01,2.696497072443156950e-01,2.439468436680687358e-01,3.300773584014593531e-03,1.324793862970749858e+00,6.917625116361022508e-01,-2.151101886078717884e-01,7.602273562801395990e-01,-2.844420606512313432e-01,2.514860800379277173e-01,2.124204906470349652e+00,-5.898181921303231601e-01,-5.046945685940470439e-01,-6.017198019448291579e-02,2.719532460433617405e-01,4.767701943629534256e-01,-1.327340933664012956e-01,-2.981246372029981995e-01,-1.328476762465224947e+00,-3.660216294868391396e-01,8.434579266490339622e-01,-3.836877001977490598e-01,-4.278771796567882313e-01,1.606968509017733693e+00,3.658283543220266498e-01,-8.266349176253384723e-01,3.540894734646063968e-01,5.219348553792433343e-01,1.038768908005034852e+00,-9.760260284062127756e-01,1.422963788492709991e+00,-1.064126778945337692e+00,1.675507341833901709e+00,4.325529430042743262e-01,-1.300007626588917997e+00,-2.904332750555896903e-01
8.603538159376744598e-01,1.080344859113654854e+00,1.825712770399331442e-01,-4.728316019102689061e-01,4.441890854341266903e-02,2.713039709188707072e-01,4.495797064807233734e-01,-1.316375556750761233e-01,1.048221112306498393e+00,2.524433229499428721e-02,-2.151192071364556591e-01,-1.140805684354009308e-01,-5.405540172002378796e-01,4.684447038175434952e-02,-6.958834417171166908e-02,1.000427429053341477e+00,-6.832179692148498962e-01,-1.770873844727756108e-01,3.469684955155512979e-02,2.138844113826710858e-01,-9.332121264917301318e-01,-3.886187171460558920e-02,-6.404040437818355747e-01,2.377695370644096196e-01,1.505840650975047046e+00,2.607916034530016747e-01,1.368753978216403211e-01,-6.808995120326982731e-01,-1.159388029890750182e+00,-9.326931311243042977e-01,4.453263263416229467e-01,2.517908510365284958e+00,-1.685461519911194972e-01,1.643747940759647530e-02,-7.679061564726882283e-01,-4.897929516083212587e-01,1.700988149831867746e+00,7.717561552655444190e-01,1.376347763828863480e+00,6.196857437184140061e-01,7.016743287860951472e-01,5.742974603048789373e-01,-1.776058191013919763e-02,1.569997218866907851e-01,8.294085181024591913e-01,9.714035903563333907e-01,2.469566220003128088e+00,2.170193687186411091e-01,2.584079814599157254e-01,6.382284310025150287e-01,3.856225898851716849e+00,1.724483415956317600e+00,3.003181223561067759e-01,-2.154503951416882057e-01,-1.254355081765510804e-01,1.145850763600312572e+00,-2.983072060074893894e-01,-3.023662371786296488e-01,-5.698814601260933088e-01,8.003019212853429432e-01,2.735460006842756475e-01,-1.725347256738935520e-01,-4.400434088382267073e-02,3.140227944611137523e-01,1.175476912640456506e+00,5.301770863975079351e-01,-3.828850854505892465e-01,1.061229549333390310e+00,-2.986706529399684729e-01,2.682824663925574282e-01,2.081757936865955561e+00,-4.999785473927462198e-01,-7.612048332508623838e-02,2.576228812093583898e-01,8.693742232859634489e-02,8.271411779915899265e-01,-1.885228041935752552e-01,-1.099987753435879290e-01,-1.058733864973621319e+00,-4.812943928596399301e-01,3.725396145085698163e-01,-3.106600668753711214e-01,-3.465491876516076930e-01,1.733483664996832818e+00,3.288494240372943356e-01,-9.140723304562975438e-01,3.458599388482073156e-01,1.022057441990987803e+00,9.379297999118854090e-01,-5.285664053020637798e-01,1.419313804186242312e+00,-7.451426237830779398e-01,1.240124155691773922e+00,5.014155545821705751e-01,-6.662884244596991579e-01,-2.927315409920338007e-01
1.134686412988553883e+00,1.627662749060609038e+00,-5.172225445244257314e-01,-3.429516823233759171e-01,-7.275668595605171152e-02,2.819034885946009039e-01,5.713256084952450520e-02,3.802209063539460643e-01,8.238030768676725124e-01,1.004477794708681926e-01,8.305170601249971529e-01,2.814102053489267452e-01,-2.911989629676996483e-01,6.027495166072390775e-01,-4.374814740151736769e-01,2.247390357438892483e+00,4.875132019841936226e-01,-6.698684354755931603e-01,5.348943191812288028e-02,-6.669379209037412659e-02,-4.390914877520897264e-01,3.260806841577443826e-01,-6.980433612005554345e-01,2.850524657936522321e-01,1.335214628665825298e+00,-3.694021112410668661e-01,-6.646836536044842259e-02,-4.562500910568274559e-01,1.267537204120183780e-02,-6.468910855816357719e-01,4.730061069948364172e-01,1.749796541475699518e+00,-3.603553977184908996e-02,-2.144770096778993440e-01,-8.357321488916249486e-01,-9.970175525462069421e-01,1.586316566353143998e+00,8.424743273375925323e-01,1.295782166224099807e+00,6.191252401002113048e-01,8.172624542325510610e-01,-4.537500885052558885e-02,-3.564247590115078579e-02,6.487135843606570695e-01,7.697805500793131195e-03,8.837217162790779179e-01,2.647174744764178467e+00,2.525857678065689393e-01,2.429955702935661654e-01,1.253191351868755632e+00,4.544058993648212308e+00,1.286136310472179911e+00,8.723345467951744148e-01,-5.790155534645751167e-01,-1.374865857529933288e-01,1.053089197043261427e+00,7.582075284150002759e-02,-9.631613485281610709e-02,-1.129671226811756357e+00,9.676615824770580243e-01,4.917077778239522523e-01,-1.307521127573583741e-01,-2.071185772400789549e-01,2.757405976207567555e-01,2.887877682997705975e-01,-5.502534840645432190e-01,-5.738479968003568077e-01,1.664715876856909249e-01,-3.984543405972708063e-01,3.150114497958673709e-01,3.000173359677613227e+00,-3.388575009519610437e-01,-2.763269469525762578e-01,8.033707754862416950e-01,-2.434678860085060653e-02,1.313131872488524809e+00,-5.665461134964078216e-03,8.241586584713497254e-01,-3.893498242550270660e-01,-5.661816339018790334e-01,1.009435408675624535e+00,2.489829218564794666e-01,-3.663144311268545783e-02,8.811812550685261813e-01,8.583647056197819536e-01,-7.415814170867418564e-01,1.612573243457160743e-01,1.034309382887002693e+00,6.578453034227873530e-01,-4.891331695753465270e-01,1.796235534230670616e+00,-7.357045016152369277e-01,1.231985475372142869e+00,9.066579211343306355e-02,4.755988962774752582e-01,-2.333287057389316077e-01
1.030995219405638208e+00,1.207916100711156959e+00,3.128846945001317326e-01,-4.851191027914470988e-01,-1.996684592835061833e-01,7.782692773232194328e-02,-7.160758293821971598e-01,3.094878858650466080e-01,2.383570108164136947e+00,5.235029929068485410e-01,7.590443388477291498e-02,3.098785568367399268e-01,-5.612704191024998623e-01,-1.048461547787543774e-01,2.155360468089750903e-02,1.809931684665750939e+00,-4.188369753582709132e-01,4.855782521452945977e-01,2.817009964272153971e-02,4.556975342200164647e-01,-1.190500339938636687e+00,4.653770459813994509e-01,-3.063948582873586290e-01,9.493476277902129778e-02,1.254548750730322570e+00,-5.948488351561066478e-01,2.246322935133908683e-01,-6.122115310660460885e-01,-1.650459335672964656e-01,-3.821942535203420865e-01,3.709821369087645815e-01,2.677714860727236523e+00,-4.409208106100088731e-01,-5.759583887233812316e-01,-5.568740427232168333e-01,-5.160201515652125259e-01,1.467647725964679628e+00,1.253033296303046384e+00,1.021065216077168936e+00,1.784751815459801216e+00,9.924736692482261091e-01,3.708365114662659501e-01,5.096365072143365094e-01,2.177886116916848414e-01,5.822492427586104524e-01,6.595490796864384997e-01,3.389607124592435738e+00,-5.247026182696871988e-02,5.051361040068309133e-02,1.460166906508792106e+00,3.727332036713833840e+00,1.105239576152214465e+00,7.961967544808831176e-01,-3.653995289862497220e-01,-7.236307530749443995e-01,1.463508791887452753e+00,4.640245785228371278e-01,-3.755382515436919144e-01,-5.528078500473743162e-01,1.253008598146207131e+00,1.050432780392514420e+00,3.145988301815022536e-01,-3.029918950670553723e-01,1.244047882481958300e+00,9.315177689791835913e-01,9.966356226947992170e-02,-3.680905236983589290e-02,1.349694602353768591e+00,2.102439422049383055e-01,-9.675689951024002422e-01,2.900070052298258094e+00,-7.096452590394974891e-01,1.604405424226539312e-01,2.371038119133476729e-01,-8.000004951433897782e-02,1.249464510006787155e+00,6.356893666457248404e-01,7.507218955666141724e-01,-8.791777099087255687e-01,1.204701737107499726e-02,1.242124399214408204e-01,3.100309334364794722e-01,-1.220324459883857515e-01,1.155847757152025146e+00,6.655541733352636768e-01,-7.161404353157982960e-01,1.278662161279559006e-01,2.228151083119235487e+00,5.709133839628346418e-01,-3.677537768412006414e-01,2.419636971907302314e+00,-6.193552613583239719e-01,1.472963421897117264e+00,3.070310167885454411e-01,2.525023023824400914e-01,7.956457206931610848e-02
9.760466898374597911e-01,1.958193878022995271e+00,3.725420509325463314e-01,-8.412330282765163592e-01,3.755578566141174468e-01,-5.444265345021555014e-01,-6.479173558444302206e-01,-8.935078730107332001e-02,9.186309337784319684e-01,1.033325447132826536e-01,2.040240203764677740e-01,3.620167256305799608e-01,-4.411599555936640549e-01,3.820735586655728544e-01,-7.590271620784172502e-02,1.656751650938955711e+00,-7.371680074587266818e-02,3.196873300825097131e-01,-4.112851209071714115e-02,1.873020642615914333e-01,-8.420038830496180404e-01,-1.654906507923988856e-01,-6.544428466393941157e-01,2.803745901794441053e-01,1.376656293094620231e+00,6.596107229792319560e-02,4.697332591468574847e-01,-4.791946446208185106e-01,-1.106424174284035278e-01,-5.946795798722388504e-01,9.472436807741266285e-02,2.034536274859707117e+00,-5.683882275685840924e-01,-5.493966959046694409e-01,-6.853834015368047705e-01,-6.266721645182149469e-01,1.189475798585617028e+00,1.286126034683741537e+00,1.175979187009489335e+00,1.037525202147090209e+00,3.187640250934433150e-01,1.054325317413697949e-01,1.352597583447282259e-01,1.797618512396365609e-01,5.426242690579557992e-01,9.754130257373689883e-01,3.013784444539186591e+00,-2.131958230354147610e-01,-2.590004050643442413e-01,2.250664426521467032e+00,3.019305089184169510e+00,5.129520893007868398e-01,1.044607540139026458e-01,-4.068651521743028021e-01,-3.443546472422442384e-01,1.260054107191302730e+00,2.507234893678700338e-01,1.858148281270596558e-01,-7.952762966977771075e-01,-4.674458621648303058e-02,9.353530837764497674e-01,6.164150138719014516e-01,2.077544994837692005e-01,1.377864862324824413e+00,1.027313705888678763e+00,1.125985950815028835e-01,-3.896996067313815981e-01,4.038035538609491271e-01,3.486451427639247758e-01,2.274503923592169352e-02,2.253615163896054874e+00,-9.811170777035551627e-01,-8.519449166040819754e-02,4.610744196081230095e-01,-5.142753478810464518e-01,1.542258851885397242e+00,4.173600291416740826e-01,9.094138737142450912e-01,-6.492666836782502449e-01,8.093039454828448998e-02,3.212725712708537906e-01,-1.378470503405375691e-01,2.185713624220000373e-01,1.091250905761789181e+00,7.790485310546344522e-01,-4.898912386095422011e-01,6.386594352051340184e-01,1.081611488904191232e+00,2.076719838403530138e-01,7.845782346843885868e-01,1.525661785157227612e+00,-1.271579810534984256e+00,1.027755439395640735e+00,2.990462858405235069e-02,9.523344691218023073e-01,3.986072356123896432e-01
7.681637600962556434e-01,3.194929442637990391e-01,5.513189209791720113e-01,-2.706895175015273658e-01,-1.292850740012045641e-01,3.337678669186582292e-01,-5.262845739127225420e-02,-1.273845938427165814e-01,1.868464939936286484e+00,5.949471449087408992e-01,-4.561170129129732409e-02,-7.808216640958837163e-02,-6.478899724375810631e-01,-3.552914463360366537e-01,1.791536287710264741e-01,1.216017380135272052e+00,-1.139856372570396958e+00,4.824168224519008730e-01,2.282510311825460825e-01,6.049761187315555455e-01,-1.392707206271517340e+00,2.367366633473204085e-01,-2.281638534946446861e-01,1.957689888609683015e-01,1.258671795310272623e+00,-5.385455366940177235e-01,3.792771976163023528e-01,-7.699316159379091529e-01,-5.500571959993401094e-01,-3.953603977712802919e-01,4.946856381367996658e-01,3.073260082310532049e+00,-2.861030901502519264e-01,-3.813683847272061889e-01,-4.329976890119012212e-01,-4.155114826308986542e-01,1.231255950579711378e+00,1.306365281584181082e+00,1.225501697100138232e+00,1.882845901643691366e+00,9.816419245459384602e-01,6.679246453581577647e-01,3.480931931198338880e-01,-3.918482570878821514e-02,9.016656511240682681e-01,6.947127009890678995e-01,2.981435283068183395e+00,-2.245405550247430715e-01,1.787521437256353041e-01,8.754452823396505767e-01,3.614013307217531779e+00,1.402498435402677490e+00,4.007793124907970128e-01,-3.594292339754249221e-01,-8.901953081379805344e-01,1.607404257105241818e+00,3.925511344959476956e-01,-4.370346067147116154e-01,1.618122919214315392e-02,1.368635990409843295e+00,1.280839604448952507e+00,-2.463491471864801552e-01,-5.159392964067173182e-01,1.112781386027099417e+00,1.042570846081311675e+00,3.423749698639789729e-01,-1.465704487068975603e-01,1.892414505949710168e+00,-4.832655575690756461e-02,-7.384961442196753545e-01,2.520087948120493415e+00,-6.012226344855011728e-01,4.733611530302210268e-01,4.038345670455509850e-01,-5.533651287210258896e-02,1.280731143384945980e+00,3.733178166576442414e-01,2.984645650988742016e-01,-8.474187458332003153e-01,-2.583361146090058513e-01,-3.990173945102983843e-01,3.261901519058180154e-02,-2.432435358580648521e-01,1.611145417294473692e+00,2.933878769009167220e-01,-8.480391860158593698e-01,1.581314994251177275e-01,2.433539821262180158e+00,7.431592671471023426e-01,-2.522349652415529775e-01,2.124397518365710003e+00,-3.701075326491276574e-01,1.197498263539200192e+00,5.909110082658234342e-01,-9.664020783623217259e-03,-7.485691512742997933e-02
9.866125760405914935e-01,1.303149339300148313e+00,-4.271729076055219565e-03,-4.709129333509041171e-01,-8.883973825026129922e-02,2.815319959209660050e-01,1.468425062604893638e-01,1.436655434966724876e-01,1.401198537804988709e+00,1.041835507882640788e-01,8.316667650661302424e-04,7.262485898121512351e-02,-4.900791348855367269e-01,1.262339647872678938e-01,-1.678003132181406509e-01,1.432169378073068877e+00,-3.263952974716533006e-01,-1.993031819912366442e-01,-1.213103912314709293e-02,1.691098040176136630e-01,-8.478152589608316525e-01,2.069718489261497818e-01,-6.039021651394290702e-01,1.831616943251729301e-01,1.459468935917116905e+00,1.216531640935925029e-02,3.353671187916024143e-02,-6.172147593130927756e-01,-8.383116844940039503e-01,-8.433956781156652927e-01,4.440072789307114576e-01,2.383179989873743132e+00,-1.891607323884567649e-01,-9.515236557022649366e-02,-7.832613981660199176e-01,-5.848519089496462264e-01,1.774487450845537273e+00,7.860900603348316418e-01,1.295787785334654441e+00,7.612637758295438539e-01,8.232737167150752100e-01,4.179208693242058015e-01,9.888216018025361431e-02,3.063533158337423679e-01,5.944589926350697384e-01,8.852939300712416859e-01,2.697724171483948830e+00,2.729939765014926523e-01,2.487124939447784566e-01,8.174462258254719949e-01,4.088565437572234451e+00,1.638471705818426605e+00,6.170106391865759488e-01,-2.786547473259197716e-01,-1.703254655399975559e-01,1.148584229744972207e+00,-1.319298415209184117e-01,-3.259799178688896903e-01,-7.893790424904050251e-01,1.028608684820861541e+00,2.872976892022858220e-01,-3.516217719566872013e-02,-8.924181267042931298e-02,3.778211691363745905e-01,9.830597557321985036e-01,2.688495686623756931e-01,-3.287634585418752198e-01,9.000167272775903005e-01,-2.256995554066391074e-01,2.917376892759238061e-02,2.453951321810873942e+00,-4.675568360997078843e-01,-1.430134934557120707e-01,2.577370216678109838e-01,1.092698918690670346e-01,8.678489555191564175e-01,-3.318252869621435286e-02,1.982620947035644288e-01,-9.933886442994728228e-01,-4.048548712902018676e-01,5.916862319479675447e-01,-4.047448507650677763e-02,-3.017121977115731490e-01,1.461209685435988392e+00,5.343791341256840521e-01,-8.873886353858342346e-01,2.273369158822702574e-01,1.172868016842829597e+00,8.764972218683338978e-01,-7.039734840570706087e-01,1.730820523779399878e+00,-7.040190642234592788e-01,1.369478958844952521e+00,3.807731091610751517e-01,-4.440245770381298640e-01,-2.748771792075569431e-01
8.135998730344145002e-01,1.742178716937932137e+00,1.004997722648437869e-01,-7.646211726657985430e-01,6.102481343874376352e-01,-3.815987645187999822e-01,3.421938190217293507e-01,-4.713628096777444654e-01,-6.447511585685854474e-01,-2.195413701096707582e-01,4.679557758814864021e-01,6.908938279770833468e-02,-3.318134086601245980e-01,6.566772058344122476e-01,-2.761223510274886106e-01,1.336373094288787255e+00,-4.763486161349089754e-02,-3.528407867469962600e-01,4.396671603277915036e-02,-8.865007410727904213e-02,-4.672969143160111694e-01,-5.278035799492495350e-01,-9.113412009867253305e-01,4.703229228542263884e-01,1.537576073514441699e+00,5.220169556290099599e-01,4.513380424217540154e-01,-4.907043814352648470e-01,-5.233140429529324900e-01,-9.462182074064520165e-01,1.473467788332600836e-01,1.700369762855556299e+00,-2.899050574473998054e-01,-1.063306985360823187e-01,-8.089478939663099499e-01,-7.872603335507214473e-01,1.132104047441655492e+00,1.021826500896216627e+00,1.606505035730479314e+00,2.116551649675325608e-01,2.570546421041264296e-02,8.105194979839808189e-02,-3.770039663085708592e-01,1.770732541569569052e-01,4.898225268901847396e-01,1.206273004408907834e+00,2.171807889605750663e+00,-1.538731934516911759e-01,-1.323190226959781723e-01,1.759945372268868713e+00,3.208513380921679925e+00,8.440432245364806185e-01,-3.188257596001070615e-01,-4.666603198237555539e-01,6.026804138884234163e-03,1.095566419614980358e+00,-1.036924645457545924e-01,4.122216886271907743e-01,-8.229012083623198359e-01,-3.310640439745267116e-01,5.596994494169333922e-01,6.080038513388341670e-02,3.149299845663169339e-01,7.242211966647318366e-01,9.163174772664671730e-01,8.328203957532370749e-02,-8.541784124723054150e-01,-9.667471441580055558e-02,-9.314960195587806968e-02,1.198777938401686338e+00,1.754230479369360385e+00,-7.345612274066617431e-01,-1.909806983032218963e-01,7.861554859851302979e-01,-5.284279397764306552e-01,1.494627690764603001e+00,-2.846911929866270952e-01,5.723859567471671905e-01,-4.752674416803345236e-01,-4.017962564975155471e-01,5.675003752210749930e-01,-4.930895713364137900e-01,1.868475635078856723e-01,1.373166057419130226e+00,6.697906988069521894e-01,-6.341916922355683717e-01,8.128223559600780135e-01,1.448520155329844350e-01,3.555912937983958799e-01,9.533363113942769917e-01,7.046404381791973037e-01,-1.296403124055898859e+00,5.910537531420261281e-01,6.442851964261955833e-02,8.669633940394303462e-01,1.228387354650811725e-01
1.133377549764718495e+00,2.151210145990354317e+00,2.797795104691366275e-01,-6.932871234133037852e-01,1.148019771160486563e-01,-8.987236767892975431e-02,-1.865963752225258676e-01,1.731888825208039995e-01,1.864571575631625899e+00,-2.449189702034465788e-01,-8.329104441318098129e-01,1.020115728997274818e-01,-5.967257982986421405e-01,2.121967747505174029e-01,7.735873457255565411e-02,9.676025786921483851e-01,-3.930989536086463843e-01,-5.964278383700718361e-02,-1.728856420003053729e-01,2.158184158323388224e-01,-1.011382521462027118e+00,-1.858319259118363931e-01,-8.151161726763782589e-01,1.405891430468370895e-01,1.454459783900598602e+00,6.019703743233728588e-01,6.329701289151834498e-03,-5.752563067309557354e-01,-1.134023137032474260e+00,-8.929834744437241678e-01,3.660740366736084384e-01,2.304799656982568834e+00,-3.406049744436398519e-01,-2.110456129460084318e-01,-9.524346497381410703e-01,-3.886269016621032857e-01,2.081711467861828257e+00,6.228264950219478679e-01,8.111802342098921592e-01,1.809581381457866511e-01,7.034114781142354333e-01,5.221687801142870233e-01,1.446925983385551340e-01,3.759838223169812976e-01,9.505148185741344458e-01,1.071421759783927286e+00,2.906027221278878248e+00,5.423610015791715533e-01,1.858789304950939358e-01,1.181658321497507380e+00,3.694910657980867263e+00,1.400063097935047463e+00,5.071521092395858687e-01,-1.518400980553497037e-02,2.943951794195159843e-01,7.554406225889854776e-01,-7.799551013372835184e-01,-3.963631358621071410e-01,-9.478966377843082158e-01,1.209906599989762910e-02,-6.500195387123339219e-02,5.512052479234237357e-01,2.760925167457769502e-01,2.726569719178251194e-01,1.391953811756984294e+00,7.462480814824702380e-01,-5.661948949493400551e-02,8.875765186523283390e-01,-1.647766563487923774e-01,-3.407421819617262315e-02,2.144898266486612304e+00,-8.231573362150124140e-01,-5.123071905639009493e-01,-5.309581710500368978e-02,1.850441596097128771e-01,6.450737019591754606e-01,1.804620978139226950e-01,-2.699583925387069039e-01,-1.270708563708394578e+00,-1.800051714886820586e-01,6.176752341974243166e-01,-4.832791199818399774e-01,-3.208278426037884934e-01,1.485263621947253254e+00,2.704061636008920910e-01,-6.169052477377350296e-01,4.295298008719363181e-01,7.166679422831089274e-01,9.034834941424165766e-01,-6.983095450063270260e-01,1.491948005981029279e+00,-1.280812483879320895e+00,1.808665956113467033e+00,4.203390137885322231e-01,-1.224318288058124704e+00,-4.437290081718847645e-02
1.007852305203773113e+00,1.717674533392170133e+00,1.888082026123757973e-01,-6.751596240620947320e-01,1.078719115120375244e-01,-8.289876670838197681e-02,-1.815346639726976297e-01,6.517388390880554661e-02,1.340495833825016136e+00,1.704940261953893921e-02,-1.379349161649766065e-01,1.784974519828942396e-01,-4.976174165504462232e-01,2.142851897496453883e-01,-9.754527770632703820e-02,1.379793814517744632e+00,-2.645047590144661842e-01,1.814485123563253088e-02,-7.750688193417094862e-02,1.745186720916692136e-01,-8.726688609372262873e-01,6.311381788141834370e-03,-6.701420002587277214e-01,1.958773853609577231e-01,1.460150810551523071e+00,2.023113921817047689e-01,1.714288346574641408e-01,-5.654593708488893089e-01,-7.335103379509432253e-01,-8.190107003563185106e-01,2.941120153701506923e-01,2.262106464467428246e+00,-3.655223229553831721e-01,-2.451252156942470006e-01,-7.941942132063970483e-01,-5.361439408414059304e-01,1.675061440893398368e+00,8.980331361711388904e-01,1.186141490526332554e+00,7.127442017354800319e-01,6.109021551845689180e-01,3.496618017722500360e-01,1.212128138216770207e-01,2.590618803204109422e-01,6.666718274184799675e-01,9.574270572632732623e-01,2.838023202145383284e+00,1.774042546178869473e-01,5.654839227218590170e-02,1.347694202412360820e+00,3.624359613342835296e+00,1.249338269632977116e+00,4.093297326350705534e-01,-2.449152594314178699e-01,-1.149320383009990176e-01,1.109052010116752696e+00,-1.447284714059572930e-01,-1.672930199967037623e-01,-8.478151458898127713e-01,4.755314467804960810e-01,3.667500422819011119e-01,3.279338442888759531e-01,1.236498483450108182e-01,6.902367621322238467e-01,1.136992681432521968e+00,3.698386608608025816e-01,-2.935141746158083098e-01,7.189384883722518271e-01,9.332199290121530322e-03,3.417264420192928087e-02,2.273563206613747667e+00,-7.132681488272529791e-01,-2.112656026469756920e-01,2.030791061398747599e-01,-7.964612691525745081e-02,9.940225558451477594e-01,1.331647071265997240e-01,3.197330986008166676e-01,-9.955908896221841164e-01,-1.789691584528884660e-01,5.339533326212766440e-01,-1.711627065588990360e-01,-1.490970492311208817e-01,1.379494213821553572e+00,5.759100932270451167e-01,-7.234559757506432431e-01,4.185111644028123301e-01,9.918723060849243822e-01,6.687685085045855793e-01,-2.239425132465336366e-01,1.592828987595275470e+00,-1.018919980688587579e+00,1.342638556870980437e+00,2.706413664400050267e-01,-1.831695954480070387e-01,-1.339477063483573982e-02
1.038113683934523079e+00,2.283427426041757080e+00,-1.246307623874973597e-01,-8.587456052704249831e-01,3.288907507612821579e-01,-2.168081792661546436e-01,2.165122363500137648e-01,-2.537970279973229826e-02,3.164004966167420774e-01,-4.025352020031133238e-01,-1.587234395373099405e-02,1.806912934953119332e-01,-3.638298550183213242e-01,6.143119276421334929e-01,-3.528482702901972190e-01,1.336802336939435731e+00,1.922517395473024027e-01,-5.092422299199741431e-01,-1.956317986306098378e-01,-1.778760962031961101e-01,-4.226074564856936999e-01,-2.489891253756838507e-01,-9.974450823237346331e-01,2.807878073862569712e-01,1.653494057970183340e+00,7.712752473152001409e-01,7.029953968494599692e-02,-4.701180317077399695e-01,-1.025735112519424508e+00,-1.215578311152301527e+00,2.030359320187387351e-01,1.708243394677230409e+00,-2.885036579781650734e-01,4.123649804765572302e-02,-1.021853432628150538e+00,-6.712885101957801748e-01,1.854999434714139417e+00,5.832586186664493466e-01,1.419950088864471383e+00,-2.123231831840484141e-01,2.748436702208759130e-01,1.728186580457624633e-01,-2.286036903385592067e-01,3.852237259131590097e-01,5.059311781766331340e-01,1.184398828255903258e+00,2.367341958091646603e+00,3.801864319344581133e-01,3.866569748123932504e-02,1.350888356183718608e+00,3.702769351105906992e+00,1.339662975442233561e+00,2.068995634711139620e-01,-2.236343804212248543e-01,4.045389767135205705e-01,8.213653475204318877e-01,-5.191689758858476500e-01,9.139268920356863335e-02,-1.297968239207003993e+00,-3.644934604208249773e-02,-2.636687934955268542e-01,3.488624627197134398e-01,4.982774022004131664e-01,2.135209739990947542e-01,1.140178626800683492e+00,3.660884919243619917e-01,-6.029420349902190335e-01,-1.185767354395557138e-01,-1.324578304370138127e-01,9.774397010542845710e-01,1.907202418121483722e+00,-6.418211891898589760e-01,-5.798759511473193795e-01,2.399512515119372746e-01,-1.173896989318559403e-01,8.261359023418233249e-01,-3.332292490836738508e-01,2.185175926623065812e-01,-1.001464098086693788e+00,-3.532753713001433593e-01,1.124614248968115460e+00,-4.070561994049067267e-01,-1.137919264102956185e-01,1.406405466484049516e+00,7.051468672748981703e-01,-7.557719341219149012e-01,6.310727345713533776e-01,-1.638743915517395511e-01,6.870704165578234157e-01,-1.087833714953495012e-01,9.515269926666041211e-01,-1.328049189659351370e+00,1.170072994284852452e+00,1.129486231094843640e-01,-2.425981161536365782e-01,-1.177493316132192658e-01
7.724352484067081859e-01,8.085412670653367995e-01,1.038757890206050000e-01,-6.947594768781052421e-01,-1.064461839578326185e-01,1.375351712364483170e-01,-2.222624465300210295e-02,-5.373571876300134442e-02,1.036606868523326952e+00,4.535845274989737108e-01,5.898430578694447979e-01,2.206911126550767932e-01,-4.191582925271539750e-01,-8.315457408944172679e-02,-3.698472723428433140e-01,1.737947865829765126e+00,-3.603238406119292914e-01,2.501046165925550069e-01,-2.406203198924539849e-02,1.589838473790676221e-01,-7.710160623702975169e-01,5.068750383392799375e-01,-3.679799223342350434e-01,1.580627267715958295e-01,1.613690739278566211e+00,-2.785558249109620910e-01,3.169693300950402470e-01,-6.428602573988885238e-01,-7.366691513532641622e-01,-9.545552886971051532e-01,2.108345957966622497e-01,2.555129126862595523e+00,-4.306103893520671355e-01,-9.371291525962985314e-02,-5.634853203731680082e-01,-5.620119898946502879e-01,1.371730105805774702e+00,1.136826754109171000e+00,1.902266512785048214e+00,1.598091691018121541e+00,6.037522816999052466e-01,3.341052927028260733e-01,1.879388386742108508e-01,-4.711444155287038138e-02,4.141260519813135255e-01,7.116862229282681085e-01,2.735102750395755677e+00,-2.303564669823617850e-01,-4.395794376704252604e-02,1.026524054561495092e+00,3.634948084427496617e+00,1.546375470588436496e+00,3.780914756646739372e-01,-4.215079690511703836e-01,-7.392439934637221599e-01,1.730092225099377767e+00,7.741933469101300869e-01,-3.929909712605306887e-02,-6.872243229221672856e-01,1.742289663749795992e+00,6.356718497813872437e-01,-6.019240382110072063e-02,-7.562539154550620979e-02,1.181189256978560032e+00,1.084443562698074848e+00,1.967998418278789075e-01,-5.389448481727904250e-01,8.074329387072146647e-01,3.367437628714753384e-01,-3.126959841526444350e-02,2.322298897054579481e+00,-4.271625587442303695e-01,2.779919488240050751e-01,1.577043544336110548e-01,-2.632517264086468578e-01,1.048794213709280498e+00,-9.941169280282541321e-02,9.025503628557880464e-01,-1.051414275145644783e+00,-1.593180185291961926e-01,4.545699454890849145e-01,3.514721574603779652e-01,-1.610701060639640192e-01,1.557952451395905991e+00,1.003692863047024764e+00,-1.142949212661807490e+00,2.927387361678238098e-01,1.453018718450096447e+00,5.683175182353820132e-01,-8.481725346228480289e-02,1.874734448704393541e+00,-3.990363982414861788e-01,7.687173203093399243e-01,1.960382894994958103e-01,7.165345175850543757e-01,-1.979746697286091095e-01
8.288527130556723188e-01,7.165984011982323709e-01,3.872870968862944241e-01,-1.187233174136107516e-01,1.980051544344716419e-01,2.443038228349162511e-01,3.236357266520211717e-01,-2.792296838402424375e-01,9.060043214845181492e-01,2.249900145271861163e-01,1.160275737905169802e-03,-2.244459101472147666e-01,-5.828663554873027008e-01,1.224468659723033787e-01,2.206125811831617378e-01,1.085920397116946656e+00,-9.035999547019994971e-01,-9.274802538096926785e-02,3.428337981626727871e-01,4.566269425396413673e-01,-1.190995318473287767e+00,-3.050759402441949319e-01,-5.404635779548674357e-01,4.009775323874847919e-01,1.137619427013412121e+00,-2.398621877422640603e-01,3.517117689259839919e-01,-6.852642079664127417e-01,-2.956291968550386340e-01,-2.947110089187975346e-01,5.888783310614020827e-01,2.542185487938870114e+00,-4.670000416888969719e-02,-3.671298896481229312e-01,-5.880557948061556628e-01,-6.424760475352353506e-01,1.120992251680128948e+00,1.181072115799933986e+00,9.828606550165119859e-01,1.016874339378227576e+00,8.042885011705016574e-01,5.026718373948195762e-01,-1.563286169026691097e-02,2.166988749602535846e-01,8.597800855067805337e-01,9.638329424433027537e-01,2.588948712535439789e+00,-9.174579577220920434e-02,2.712484337635557297e-01,1.094047706932174124e+00,3.723991593341109407e+00,1.105959141489750497e+00,1.664876461811106712e-01,-4.447220338443305110e-01,-4.380833500767699618e-01,1.170204858564723116e+00,-1.969030095040407158e-01,-2.705313837153814349e-01,-3.614316930124494842e-02,3.083221977196299868e-01,1.275626241641058423e+00,-3.961080596803043807e-01,-4.641532258699111457e-01,5.876947521389326301e-01,7.129945021994910093e-01,8.173219876205362056e-02,-3.409677548428799998e-01,1.425183495121711719e+00,-5.455947765507637159e-01,-2.463303113790088483e-02,2.416044404866067197e+00,-6.547965292565463002e-01,1.887713190724895074e-01,9.479240828987105516e-01,-8.977167099648314386e-02,1.579377720538708951e+00,2.401919804689390259e-01,4.229328208485411134e-02,-3.573967181250770064e-01,-5.804361484908230340e-01,-2.986864810554008542e-01,-4.109375782389675380e-01,-8.216657605140575971e-02,1.424887342616086627e+00,2.382068476510224020e-02,-5.477028694957796207e-01,3.363475939768013068e-01,1.802937478808801952e+00,7.235100442341436677e-01,9.241464555565220840e-02,1.528120646361289747e+00,-7.710249201845728040e-01,1.174426167924228270e+00,5.685358897541333834e-01,-4.436079059664740920e-02,-2.641422626866285484e-03
8.781608855849727391e-01,1.083073693567278006e+00,1.563316211289145774e-01,-5.637105224847659413e-01,-3.856727136704801023e-02,1.605135147144529095e-01,3.798972311353132625e-02,-6.145507674107028584e-03,1.261350314341939338e+00,2.496986643988432786e-01,1.472458072973588661e-01,1.041515705367642708e-01,-4.902646225442119921e-01,1.480484523723817059e-02,-1.703211024469986623e-01,1.451092191809840282e+00,-4.572461484965876233e-01,7.328048749183022070e-02,6.216365287832995024e-03,2.207098225701830119e-01,-8.968369947580698831e-01,2.356732385149487852e-01,-5.011903154666379478e-01,1.884527856627114806e-01,1.491929140530749098e+00,-8.159061697482114517e-02,2.117168403993083814e-01,-6.390991368103051684e-01,-7.783781400972064057e-01,-8.316155468850485732e-01,3.406541475107677241e-01,2.504829625877502686e+00,-3.135019172690841627e-01,-1.467507821074365837e-01,-6.691534850057979655e-01,-5.405278932468506881e-01,1.540272911171619130e+00,9.880708066156926872e-01,1.478893238017032097e+00,1.141851699632620010e+00,7.059609386571069622e-01,4.189552953979478467e-01,1.441487331807334016e-01,1.217015308919730671e-01,6.087387354516371474e-01,8.320086488957958437e-01,2.740517172538528445e+00,1.669278533971331469e-02,1.027127793165588110e-01,9.894067487703176456e-01,3.756641021919630674e+00,1.502921430229241961e+00,4.267744977697090492e-01,-3.252483552039207026e-01,-4.276380558642297047e-01,1.387440416942193000e+00,2.113639925335941139e-01,-2.019197997513310083e-01,-6.470141908809032838e-01,1.157196974947204193e+00,5.403060107545633040e-01,-1.248163253024639485e-02,-8.561136896236944127e-02,7.898453069537056948e-01,1.071931386313319967e+00,2.975467418122025309e-01,-3.821010415455757814e-01,9.580226209612030530e-01,2.051353385861929418e-02,-4.212291536104562084e-02,2.336157694201378199e+00,-5.244288535142143104e-01,6.377858244404288612e-02,2.394005846747648825e-01,-8.079091923290876442e-02,1.006269677940147433e+00,6.625753596340488993e-03,4.394022376464370994e-01,-9.947146432824516271e-01,-2.707856206681376054e-01,3.923724861119070040e-01,3.862749580246320480e-02,-2.168963827146340173e-01,1.522431529742425349e+00,6.485889852566875113e-01,-9.347861573442379779e-01,2.973352446636908231e-01,1.353875683549047748e+00,7.180825724522154063e-01,-3.122280378902583253e-01,1.753406506581265845e+00,-6.355397232207021796e-01,1.121265076713301667e+00,3.323148435359576380e-01,3.661668705255533007e-02,-1.716052752626932576e-01
8.281756917848857036e-01,7.181021545965524666e-01,2.410678542738982633e-01,-6.466663410453159511e-01,-3.007284287389900279e-01,2.485393491394173593e-01,-2.586896345663550201e-01,1.206029417011900418e-01,1.937035820262927199e+00,5.797370681087009592e-01,2.478218347508770736e-01,2.326491254323142521e-01,-5.204043017997916909e-01,-3.299569466729723732e-01,-2.277220177206511209e-01,1.657687282513935489e+00,-5.864207942794243955e-01,4.958697444490562933e-01,-5.418094796866763929e-02,3.290132644296339115e-01,-1.026219315466542437e+00,6.891673614568480932e-01,-2.394978071463370051e-01,4.454016310942829349e-02,1.561552258590451769e+00,-4.150858926010189132e-01,2.434995421372340985e-01,-6.961705216103830640e-01,-8.463470725640056536e-01,-8.610326989160697053e-01,2.759609673185573486e-01,2.883182418588400076e+00,-4.803458943791921731e-01,-1.813977757855761985e-01,-5.272798927801397584e-01,-4.130024907402015666e-01,1.556878809074567327e+00,1.129419113541989539e+00,1.689478505568841271e+00,1.886639964752616638e+00,8.543162040376076627e-01,5.008459069469840541e-01,4.208525880061321223e-01,-6.062272854370773234e-02,5.719021536255087801e-01,6.041721185295672036e-01,3.042897319485185825e+00,-1.312278961286829360e-01,2.768013178090694693e-02,8.588489946335542413e-01,3.713717520751513845e+00,1.688603904392145916e+00,6.283474901432164472e-01,-3.118835644604041613e-01,-8.370541365893358066e-01,1.760884362118655178e+00,7.550137022801021169e-01,-3.042050448511989247e-01,-5.943960950961848511e-01,2.038538223406679784e+00,6.404125267769558150e-01,5.294220879831001980e-02,-1.789787908616840562e-01,1.233343952182363701e+00,1.230813121652689857e+00,3.851379809687890954e-01,-2.651164685185143366e-01,1.286738182604895142e+00,3.948458167635521265e-01,-5.979951772673152144e-01,2.496180724267389905e+00,-4.585659158729162854e-01,3.213744597121664937e-01,-9.540869233751161915e-02,-8.493556764009473070e-02,8.614283568802360014e-01,1.236891118539649725e-01,7.416188789254828384e-01,-1.282387236251280260e+00,-4.190613359796441229e-02,3.076636870016439262e-01,4.414098482105892063e-01,-3.053582647082006551e-01,1.606856368986980588e+00,8.966590504452216503e-01,-1.161946079151877198e+00,1.397498974574859776e-01,1.915038153324598813e+00,6.972202202343562583e-01,-5.242155111142379198e-01,2.253804872636993473e+00,-2.829856594781246515e-01,1.088742295028916951e+00,3.241500431747831312e-01,2.381069005215941392e-01,-2.219021542877023800e-01
1.037571749232322205e+00,4.536953451625818090e-01,-1.082407520243453408e-01,1.042248309288329455e-01,-3.758984827744235591e-01,5.329042276692305125e-01,-5.179285217743569980e-01,4.512052862813045184e-01,2.003014256022394690e+00,9.065763408129201562e-01,1.122267941395528323e+00,2.731754488178855800e-01,-4.394328914523064622e-01,7.757425895507562286e-02,-7.391635864948603585e-02,2.599421869784774408e+00,-1.350123444287453234e-01,7.904912709799910564e-02,3.915835918824872586e-01,4.918672430507781135e-01,-1.084771069673459154e+00,7.305303658625564855e-01,-1.227338149914669052e-01,2.494264965285717395e-01,9.139554769610869212e-01,-1.611374615448003533e+00,1.924858982651227735e-01,-5.861424939557752234e-01,9.739394818241127183e-01,2.016252639168887306e-01,6.547145123509423570e-01,2.508118649194463146e+00,-7.099634305250784871e-02,-7.671488312972711832e-01,-3.774812684008155284e-01,-9.631878549296876146e-01,9.487255109015142462e-01,1.546859322821747540e+00,9.916621042770751293e-01,2.324694781825209056e+00,1.340490468437980809e+00,8.247297326773311843e-02,4.486443190267099812e-01,4.778186223233522600e-01,6.564122107533260086e-02,4.900094050626442321e-01,3.318261943134465763e+00,-2.899346930407540879e-01,2.518730208639068380e-01,1.429534555031380050e+00,4.476672769988166323e+00,9.063736414288037224e-01,1.139434835402527213e+00,-8.213235986700129221e-01,-1.182377305448796712e+00,1.626477340864161736e+00,9.449657591343929575e-01,-3.717165617690668666e-01,-2.660824172814483246e-01,1.823190047431012761e+00,1.950270936629332263e+00,-4.045512505855904939e-01,-1.012734540084778700e+00,1.178483469377915593e+00,-7.810880580241774673e-02,-9.557315936387025257e-01,-2.363904014280039934e-01,1.406085010541164859e+00,-2.626994551331938155e-01,-1.108472270623535927e+00,3.789014724060459471e+00,-3.973190425990664187e-01,4.791158206898534222e-01,1.161415279674499645e+00,-1.226413034955043668e-01,1.989770056174913426e+00,7.798161098714841977e-01,1.310914924525763414e+00,3.944404862153394475e-02,-4.006042943880986362e-01,-7.333760030511904393e-02,7.380637634826365812e-01,7.606393723365673099e-02,6.474700267246664698e-01,7.140335287719536961e-01,-6.239822491767368362e-01,-1.956397690874191464e-01,3.127188026070803595e+00,4.721463342422556053e-01,-3.016064574850224056e-01,2.841619836927536724e+00,-1.338699461527110834e-01,1.257172781904759340e+00,2.727441061109001641e-01,1.259778539708206635e+00,-6.773586981374146720e-03
1.014197709607938425e+00,1.432257709322756867e+00,1.734867524601348965e-01,-4.766369872856957013e-01,8.709091012145518673e-02,-1.170829912688883256e-01,-5.617083220576066793e-01,1.305830672031759732e-01,1.351454415886531812e+00,3.675041372182908384e-01,4.901755071852751389e-01,3.129250150885665160e-01,-4.454408273374959593e-01,2.783243555056603147e-01,-7.021974364063210405e-02,1.972084430625817397e+00,-9.514772757986655893e-02,1.819394641573163218e-01,1.127786633794867488e-01,2.929011872224731028e-01,-9.295606560497622350e-01,1.555749348794320808e-01,-4.781205721161285727e-01,2.655537920515338435e-01,1.206679475245439281e+00,-5.172837286235651977e-01,3.321587365891391364e-01,-5.199945675368341513e-01,2.413308219496046458e-01,-3.161777975773618632e-01,3.225601534226112399e-01,2.202876067825667583e+00,-3.608175124337338335e-01,-6.079113959259789812e-01,-5.949500963890423932e-01,-7.480056004327364505e-01,1.156925474867257719e+00,1.334310290090942708e+00,1.078446974011934456e+00,1.431290675533283485e+00,7.184394812436373234e-01,1.122448511257069792e-01,2.409208143600504171e-01,3.161410430994044951e-01,3.808920831708681454e-01,8.085238224680519892e-01,3.109019717367103475e+00,-1.863559944847778538e-01,-3.783772609444717439e-02,1.886849070095408365e+00,3.616622033910541933e+00,7.067802568357077764e-01,5.152533339692461078e-01,-5.407570449091708698e-01,-5.986991193397019906e-01,1.349090645953906709e+00,4.277040227353738899e-01,-5.173069220327135981e-02,-6.200695499905932717e-01,6.249308967194688869e-01,1.243279395744740778e+00,2.300925943119521144e-01,-2.387664041430171691e-01,1.213961309053192217e+00,6.231232273607694161e-01,-2.606126545352743795e-01,-3.197031562421115414e-01,7.805421144059591088e-01,7.362849784495045791e-02,-3.767649334623144330e-01,2.822016100593561116e+00,-7.526391833836099110e-01,8.417512048247445533e-02,7.062226073089313827e-01,-3.246798876985366733e-01,1.660055737633747253e+00,5.316646598266971946e-01,9.841392918637690279e-01,-4.157247496151568189e-01,-1.250716740097529978e-01,2.086979900647836783e-01,1.588129123283687494e-01,1.373728768302301950e-01,9.386365414570606580e-01,7.219128575317694807e-01,-5.393869633323385981e-01,3.185446806622969640e-01,1.793607550193468514e+00,3.486221815864268825e-01,2.918871469622245640e-01,1.997712943954597087e+00,-8.612833638941395087e-01,1.162977798355336212e+00,1.395733474916109329e-01,9.336474831485790382e-01,2.201620337893683832e-01
1.166486963079804706e+00,6.456489915412596536e-01,-3.014181788865107348e-01,5.645293152015775640e-01,-2.424512516493039227e-01,9.062262337714546145e-01,3.262088621252228759e-01,4.179399656716887845e-01,1.655503794138578844e+00,3.831040910164225100e-01,5.044009927433059648e-01,-1.751112580691205345e-01,-5.108852684340892125e-01,3.964810121430882295e-01,1.723457564330290737e-01,1.938945652153770682e+00,-3.089526132946268655e-01,-8.069061130138854843e-01,5.516586471095189514e-01,4.608238202648909931e-01,-1.109615134898914501e+00,1.238019733754489593e-01,-4.892510637311877075e-01,4.115602707316783349e-01,7.307445174287598988e-01,-1.134793441398813885e+00,-1.277951735931413257e-01,-6.076261386760396510e-01,6.819039808479994136e-01,2.825016464963998608e-01,1.052964311563190147e+00,2.269256061380617417e+00,4.435265676658724510e-01,-5.634108521176754980e-01,-6.510812575015927361e-01,-1.066125924620217935e+00,1.307069932912135357e+00,1.042430672904221867e+00,4.099595762109811137e-01,9.921504460606676012e-01,1.542174121623818728e+00,2.557182620201092771e-01,7.034421732006344852e-02,8.796304361725572063e-01,3.493335677318119004e-01,8.077805959672806901e-01,2.800537196401397644e+00,3.041501455690551192e-01,7.461166272167857327e-01,7.864628263212899428e-01,5.162569438539995836e+00,1.210480441491176062e+00,1.174737238869513867e+00,-7.024421194997004791e-01,-4.025615152160644250e-01,8.583046224689201420e-01,-3.682411356946585501e-01,-6.777982988221115113e-01,-1.724801239695814559e-01,8.300047260391446580e-01,1.541395497332185061e+00,-8.458709674297734127e-01,-1.136046211369390546e+00,-1.719336200984141749e-01,-3.210398267237664083e-01,-8.972481012591224658e-01,-1.937402330997614053e-01,1.533333549323988798e+00,-1.313066021294071017e+00,-5.132543403749414423e-01,3.724759496361159883e+00,-3.001968922752975000e-01,2.597678069418775382e-02,1.584613087199945758e+00,3.577029661440354058e-01,1.839496950497246264e+00,5.348698245197007761e-01,1.521777811746614639e-01,3.027928658557952346e-01,-1.041981631001297259e+00,-1.920725193738803682e-02,1.800842135438757152e-02,-1.328946055774907764e-01,7.277778177326758025e-01,-8.212477225307790452e-02,-3.629653055103108095e-01,-2.285143136335829328e-01,2.566395290362520676e+00,9.747853765521721225e-01,-9.741649749063592267e-01,2.267740159535528655e+00,-4.252260437037117535e-01,1.762744596064536928e+00,6.246164994895744282e-01,-2.774570694416182426e-01,-2.604911047210612951e-01
7.649084788214365327e-01,-1.875208893594740855e-01,-7.538724378133753179e-01,1.016023911176253680e-01,-4.313953228748372837e-01,1.127895784874043850e+00,1.120818721328766365e+00,1.082749400669870132e-01,1.775401982113438137e-01,5.693330248913831548e-01,1.580947771846832106e+00,-9.447746593041750351e-02,-2.549090198608449098e-01,1.712652243623111747e-01,-6.578875789833742438e-01,2.252674314403011024e+00,-6.631930929182477952e-02,-8.990627871356076106e-01,3.399412145135929375e-01,-2.056423567167472294e-02,-4.069096577342357079e-01,7.930494929230899048e-01,-3.594985317364163269e-01,3.365172897621235837e-01,1.431276170808418513e+00,-9.722489037132155953e-01,-5.486378152504164940e-02,-6.725891947013772354e-01,-2.957494691146311805e-01,-7.657630372656643036e-01,7.158204954231206507e-01,2.303528323660106736e+00,3.047031996133027776e-01,2.349050489042599499e-01,-5.791509264719099104e-01,-1.076876498819376859e+00,1.303977007263016796e+00,8.977474144325277017e-01,2.113727441399515072e+00,1.334569584587645519e+00,1.084510656521331162e+00,1.821788013378059234e-01,-1.739983947235925199e-01,3.619159725897203028e-01,-1.274360407472433510e-01,6.444309711315399092e-01,2.050133043198792748e+00,-3.194820555552672220e-02,5.316090358880606326e-01,-7.386321758788561009e-02,5.178939122550722196e+00,2.200699923120699619e+00,8.707497247774353966e-01,-7.936501054236886343e-01,-7.598480477660881638e-01,1.630829369444890098e+00,7.104458083971347815e-01,-2.253997832248401667e-01,-5.730004104063114445e-01,2.683385314514692865e+00,7.619602517568020428e-01,-1.343557896479447455e+00,-8.096072710568562592e-01,6.324580450729466730e-02,1.190597324504660826e-02,-7.601238522795805697e-01,-9.277447387763272380e-01,7.452023648449458415e-01,-7.183967194363211073e-01,5.101636194586327555e-01,3.071770737710734611e+00,3.055694903838185872e-01,3.675381022140514764e-01,1.062719729699774129e+00,1.011667221410470358e-01,1.269849835450258535e+00,-6.064923145442608909e-01,8.244366432850711579e-01,-3.035454665014813980e-01,-1.098855629652261801e+00,7.209660877982750904e-01,6.267833598155849728e-01,-3.023258977807233294e-01,1.371227842679884734e+00,8.773932422560885014e-01,-1.339941733018546577e+00,-1.713469212589462942e-01,1.707331391223306571e+00,9.676843911404043874e-01,-9.236347597642178275e-01,1.952202369732796816e+00,3.087812416824049500e-01,6.272384366995265026e-01,3.527171807725228980e-01,7.015368767513372461e-01,-8.359273262782211944e-01
8.036773998483149883e-01,1.003197838187627200e-01,-2.229986400125008039e-01,7.187202221950750314e-02,-2.715085808093055109e-01,9.358917812587124185e-01,9.581411171893274847e-01,-1.450495523000530640e-02,8.765683957383517688e-01,3.623014917899869958e-01,5.147882936200867121e-01,-2.741851775112790768e-01,-4.735784722701198435e-01,-1.212138740949150750e-03,-1.947642193847902992e-01,1.445605101766886946e+00,-6.752492145435211590e-01,-5.939334453957727522e-01,3.157262611351767112e-01,2.454625508487369157e-01,-8.706655627696633371e-01,3.352528680720810450e-01,-4.400755274041589504e-01,3.080641577838656997e-01,1.334352575798380069e+00,-5.122489022693471616e-01,-2.973778375827795806e-03,-7.424897655346457404e-01,-7.029360572524057105e-01,-6.564395760043962857e-01,7.593668985155903606e-01,2.622510476865138607e+00,2.186022054216430477e-01,9.660041178334236034e-02,-6.323945643257016247e-01,-7.653689445943158143e-01,1.494071753851358597e+00,8.323338754435961606e-01,1.537834413063587480e+00,1.040846150451980812e+00,1.115951649826042447e+00,5.235571267202150381e-01,-7.383332302162337601e-02,2.990108333208629232e-01,4.950280247594892602e-01,7.871233389167727745e-01,2.253672082044051006e+00,1.499291904030501388e-01,5.723514118128187889e-01,-1.270192464020958312e-02,4.732522113330719371e+00,2.078715489378847536e+00,6.721466591066291851e-01,-5.007349848641080570e-01,-4.903908089547469040e-01,1.332796748157281996e+00,3.064183557617283782e-02,-4.719641904174225466e-01,-2.924275998895625728e-01,1.794814359623656763e+00,7.072002922505912226e-01,-1.006037560305468093e+00,-6.795704294442078686e-01,-2.061989244001893873e-02,4.906843418638587861e-01,-1.194508119493472575e-01,-5.428739528451324015e-01,1.351603426213188186e+00,-7.911052109457898940e-01,1.823356699092341104e-01,2.718621964690406845e+00,-4.835011445495451810e-02,2.287414746547293820e-01,8.062582368609374495e-01,2.570793802813944318e-01,1.087324050435404699e+00,-3.175455265806760852e-01,5.769692802001064047e-02,-5.795605486195412048e-01,-9.536741187327132385e-01,2.717074036892868083e-01,7.060139179467118942e-02,-4.178265721026806490e-01,1.603786664418442420e+00,3.064602934022535585e-01,-1.079570173101318531e+00,-3.774542309451078825e-02,1.756510618028569004e+00,1.115030477550476240e+00,-9.914361087514316218e-01,1.796486592175201125e+00,-8.722932247899234381e-02,1.099689756570274346e+00,6.221742365781800510e-01,-3.794334396058111625e-01,-6.396496606550610142e-01
1.107711230035238748e+00,2.072094099402088219e+00,-2.604041980339310003e-01,-7.924516955371582183e-01,2.876425441993746279e-02,-9.230768976113540303e-02,-2.437699215178417700e-01,2.993253728758531462e-01,1.008650467041489307e+00,-2.408353717475097966e-02,4.244013307117472378e-01,4.160772140710345957e-01,-3.273052343613770399e-01,4.800694549602678163e-01,-4.582628498642016268e-01,1.981464084559242167e+00,4.280478702048234330e-01,-2.771402618992516165e-01,-1.892535806468552961e-01,-1.079323610855075777e-01,-4.524022956752114522e-01,2.835913452379738020e-01,-7.449524753253508047e-01,1.763324989601696979e-01,1.569754322350352727e+00,1.177471128207267792e-01,2.978048977454111901e-02,-4.504384834214086308e-01,-5.221733399011778687e-01,-9.983391657268221309e-01,2.101950285504882998e-01,1.830401312636690481e+00,-3.589298667681627419e-01,-1.553858660403981129e-01,-8.871051093446050695e-01,-7.481469015219704977e-01,1.778081748749290369e+00,7.912594231393581534e-01,1.450252496492800747e+00,5.594830930844537642e-01,5.386925454751563258e-01,4.087026980310076718e-02,5.577372555881790483e-02,4.285497012607338285e-01,2.041683216163764913e-01,9.262668633802072504e-01,2.779723342009798426e+00,2.469714199038969549e-01,2.332401318013890834e-03,1.477903176991000489e+00,3.953988345434800156e+00,1.282380851638149188e+00,6.472361609541592564e-01,-3.643805660221395848e-01,-2.706506129558605700e-02,1.114617533263195348e+00,9.334358937221343133e-02,1.146069386479173224e-02,-1.345955558333820523e+00,7.926219631998212556e-01,7.395768097981772482e-02,3.870704670209614839e-01,2.449865616361713572e-01,6.132051645985753252e-01,8.844377190397607613e-01,-6.630603786053179682e-03,-5.019265191511923518e-01,1.537010433016139377e-02,1.014911646972490034e-01,3.316023359274661853e-01,2.504347529988983911e+00,-5.449236238996514325e-01,-3.779013146913710597e-01,2.245098666797474551e-01,-1.364258757714745252e-01,9.639842335113085747e-01,-4.408164331267899749e-02,8.049026187977151858e-01,-9.260383213493793564e-01,-1.944471101771196309e-01,1.144389448341661231e+00,1.576866376167441741e-01,-7.094021901467062463e-02,1.117699433542098442e+00,1.031594300112645968e+00,-8.325525577183303660e-01,3.757719557061626747e-01,5.779275965673377202e-01,5.718604319338844721e-01,-3.063843505662029454e-01,1.639807854231703610e+00,-9.832640572789270728e-01,1.211813539557919261e+00,1.504304974599357525e-03,3.297464861237827671e-01,-1.094467151519687431e-01
1.094466795631368505e+00,1.484126457792416254e+00,-5.135711771856532604e-01,-2.501694684618369635e-01,-1.034961075001126773e-01,5.632094082890448661e-01,6.753468974511266376e-01,2.751308853451628900e-01,7.952961479370675990e-01,-1.541152741325392539e-01,2.674553319619513703e-01,-1.741405185041591808e-02,-3.760572966639396664e-01,4.962908604984845873e-01,-3.563022408893389281e-01,1.601006099012471928e+00,1.068689181399974930e-01,-9.650500036946336735e-01,3.432557579407243681e-02,-7.694929109321455019e-02,-5.013787347858097432e-01,1.405103202614495506e-01,-8.279941485666886258e-01,2.776410584004627147e-01,1.442574239038391770e+00,1.021036379405171751e-01,-2.405095318144472583e-01,-5.522483296547668896e-01,-7.843932881659674283e-01,-9.277546536885693529e-01,6.213299093559914166e-01,1.930612105499206699e+00,1.445784915800307213e-01,1.212108976347820166e-01,-9.711694042744587474e-01,-8.499727500988791817e-01,1.973751336337860485e+00,4.570114141324323476e-01,1.284926582760598901e+00,2.058308721033519362e-03,8.938092914608749551e-01,2.587953127664677222e-01,-1.903576146924588763e-01,6.409768075777433349e-01,3.299052206651046371e-01,1.008820274344733203e+00,2.291034742111224709e+00,5.944629362693215624e-01,4.991372028498863300e-01,4.715721705850138279e-01,4.799946926537557168e+00,1.884141484069306260e+00,8.161143616427539715e-01,-3.630314643798649432e-01,2.397267374715346122e-01,8.035513432633456521e-01,-5.580617265303727814e-01,-3.359874081906799592e-01,-1.070178017293503814e+00,9.069577107862946130e-01,-8.456987387971795500e-02,-3.826803388653646776e-01,-1.437022275804096527e-01,-4.263401326721968365e-01,5.638952721075142227e-01,-8.718464769335421138e-02,-5.367845775100837935e-01,4.305452443547942432e-01,-7.714080416879210977e-01,6.393917233648438447e-01,2.638146855891432274e+00,-2.067792123134755689e-01,-4.416422269741607232e-01,5.963816524853980949e-01,3.123322850610114054e-01,8.186194920208774706e-01,-3.684219187224725411e-01,6.623195481510912863e-03,-7.201723192509323912e-01,-8.388190062526647006e-01,1.072437470511010682e+00,-1.174999368274379230e-01,-3.515197377141785484e-01,1.312104047202881540e+00,4.809775144588550044e-01,-8.811192220924517482e-01,1.432164322064309603e-01,6.197775755854524338e-01,1.078376253932141093e+00,-1.119683444750665835e+00,1.464577877261963534e+00,-7.208187643764811803e-01,1.439607435349349318e+00,3.678565913032449952e-01,-7.405170976684387618e-01,-5.412218484735504820e-01
1.060632826496295422e+00,3.220880678112113538e-01,-1.148719595830783868e-01,1.716649769768631151e-01,-5.664181675092581081e-01,8.056225059925563592e-01,-2.941327581036669581e-01,5.554078204684230746e-01,2.538929526852538032e+00,8.501720158862442478e-01,6.852903940857419940e-01,1.456117040207605129e-01,-5.234980711511268980e-01,-1.255189859795527996e-01,-1.746226380209880968e-02,2.283989703282481631e+00,-3.908923597395969063e-01,1.161336987918466790e-02,3.357998301700909072e-01,5.425622711294828537e-01,-1.206933209580659305e+00,8.350167381428119651e-01,-1.129829891883402659e-01,1.564794111124742648e-01,9.791042210201069684e-01,-1.454686464232862964e+00,3.719055228746714903e-03,-6.647628207572113812e-01,4.306730378854510821e-01,3.997313149689762923e-02,7.736271178740717902e-01,2.779661123851904225e+00,7.821481296937993211e-03,-5.848347582388488952e-01,-4.460192375378298490e-01,-8.115007545912360509e-01,1.336589436444010959e+00,1.283242452557233904e+00,9.336466210960318035e-01,2.152653500134930287e+00,1.553855118363272725e+00,3.270323413119891609e-01,5.055355666978407214e-01,4.839984835873780700e-01,2.661514425764431868e-01,4.714681271176766608e-01,3.290840206195082551e+00,-6.712417198760936565e-03,4.505968724847442819e-01,8.156560258566327715e-01,4.774964728621307941e+00,1.418950468532984566e+00,1.336087681601984212e+00,-6.413887161494800093e-01,-1.027039517721742179e+00,1.525831506693100748e+00,6.314449239547007542e-01,-6.687196547258802415e-01,-2.643252683162582439e-01,2.144772997133038039e+00,1.532731173093960564e+00,-4.959215777591240437e-01,-1.031397589567276007e+00,7.747386297143592504e-01,1.426394961656853866e-01,-6.189423703692097378e-01,-7.750109945918259857e-02,1.766640667265727771e+00,-4.217330825735743360e-01,-1.243747655279502817e+00,3.737423914129805347e+00,-2.792252426960308287e-01,3.951329087780447447e-01,8.492984960240914649e-01,1.989707780871731724e-01,1.533568701761610642e+00,6.527909085858265570e-01,8.134899365021066586e-01,-3.262403679569712001e-01,-4.947798060084885319e-01,-4.620184647312175485e-03,6.727064495588035431e-01,-2.134344099219034618e-01,9.107029720933603745e-01,5.225779848744729339e-01,-7.769683690506096196e-01,-3.349771326715567654e-01,3.126845647508384118e+00,8.079292717004253888e-01,-1.034833661511818992e+00,2.928573419119762544e+00,4.540453685371592663e-03,1.557549574900868983e+00,4.780079480499807576e-01,3.024657003426627355e-01,-2.552959348434392650e-01
8.253257516514127534e-01,8.937999402406524574e-01,3.620758066686237120e-01,-7.079274068460588154e-01,-1.322635604723779723e-01,6.441552012524054405e-03,-4.684920180722226823e-01,2.797420468200791099e-02,1.729508723272727089e+00,5.721249776416970079e-01,3.169450836624380652e-01,2.909445437056373263e-01,-5.088652573044966099e-01,-2.226488339181342258e-01,-1.669685993469019469e-01,1.709534838494719766e+00,-5.296450678846036375e-01,6.157371489510883311e-01,-2.577834176903867625e-02,3.502413725264445499e-01,-1.040813046814653919e+00,5.185788086306342137e-01,-2.652885541599699915e-01,1.005808603438975574e-01,1.495437807620545900e+00,-4.217390051295764608e-01,3.859041943927727925e-01,-6.535794751965535720e-01,-5.507745378623788435e-01,-7.244864192224506061e-01,1.977633381745499130e-01,2.757582720445449276e+00,-5.606840350625406089e-01,-3.444401615490215729e-01,-4.930879558294852250e-01,-4.500441017773034735e-01,1.331864129858147061e+00,1.299734902119610069e+00,1.598912398483811614e+00,1.942439829609957203e+00,7.100802124297330709e-01,4.001518505623416488e-01,4.078522249012825895e-01,-7.610579258314574547e-02,5.651100518351682700e-01,6.480128305625664220e-01,3.117583267676190761e+00,-2.873136843418312991e-01,-1.073951356092127246e-01,1.317338600878729338e+00,3.401868215277346952e+00,1.294885741168195992e+00,4.521689567459463710e-01,-3.718018844148745505e-01,-8.837117675716182896e-01,1.763899602985262272e+00,8.269104036429000271e-01,-1.487291095884360759e-01,-5.446954483699389948e-01,1.612432637624944487e+00,9.159085390903213275e-01,2.071103044433694196e-01,-1.302392879588852304e-01,1.505199292694136215e+00,1.184568965910749672e+00,2.903341280247515588e-01,-2.878188238372004770e-01,1.158512287353929970e+00,4.998715350283094994e-01,-5.824796052693952397e-01,2.458268129819623837e+00,-6.242601253371939940e-01,3.437500326744372114e-01,5.924881720387398243e-02,-2.777931153449360591e-01,1.138861189614863267e+00,2.832738458437288886e-01,9.298653470194804260e-01,-1.091352079043927725e+00,6.523832715709054764e-02,1.689745933122335231e-01,3.689310640494392057e-01,-1.254092047653227737e-01,1.466443949177963724e+00,9.125721514323993366e-01,-9.945182842920494704e-01,2.680508833658177825e-01,1.921693605863696419e+00,4.897135838966946153e-01,-2.451300022355712427e-02,2.164119266248902385e+00,-4.743640042971457582e-01,9.880645088426607270e-01,2.339181254188827108e-01,6.752562660146379514e-01,8.140489295215269649e-04
9.020098925972909187e-01,1.560634593063294329e+00,-5.140029132410744994e-01,-8.846769416557995758e-01,1.453011764035261333e-02,4.485826563336237083e-03,1.502883357277476906e-01,9.505985806898187285e-02,-1.444240537771124266e-02,1.260950464181613273e-01,1.223072467313523370e+00,4.408420200926216337e-01,-1.688563298030751336e-01,4.929975932694272700e-01,-8.379992197994561298e-01,2.297922069014643576e+00,6.162285084971172999e-01,-4.019618172824888647e-01,-1.701533062297650722e-01,-3.244373723567547940e-01,-9.094717778171113043e-02,5.228346133897652237e-01,-6.731521211624914569e-01,2.282834086284663555e-01,1.785231611844269706e+00,-1.727860871998520426e-02,1.388116928395197180e-01,-4.565143604386551757e-01,-5.783196868351531128e-01,-1.290880260215388153e+00,8.815456598923568365e-02,1.723132513213487815e+00,-3.520637379037712122e-01,1.149556421726194155e-01,-7.974958582729478884e-01,-8.896773509505071509e-01,1.514554237109260848e+00,8.715253078464674230e-01,2.214221183494228917e+00,8.161024405023917794e-01,3.085632867961052295e-01,-1.097080123125976914e-01,-1.232923340604936274e-01,2.357402133235408370e-01,-1.349412397970722877e-01,8.543621117357574901e-01,2.381092817868529110e+00,-5.225197509536436136e-02,-1.090083298746207380e-01,1.273845304309709991e+00,3.977551111716147059e+00,1.505054064503225320e+00,4.453863338561351859e-01,-5.530750577954822722e-01,-3.051558290443546761e-01,1.501648067145704646e+00,7.131385404072408951e-01,3.219500797207257570e-01,-1.416013793258078968e+00,1.523027590680131160e+00,6.419478528798780448e-02,1.068824884697491817e-02,2.531433460965053506e-01,8.018606814744619893e-01,7.650551386455486380e-01,-2.430017588132665773e-01,-9.385861686523178093e-01,-4.242498307341676655e-01,2.765696779027234098e-01,8.747200311634270031e-01,2.344727384462682807e+00,-2.620993830175651906e-01,-1.301143193909859441e-01,3.233934924348786932e-01,-3.720605813833751108e-01,1.031946620359493805e+00,-5.072699873193539100e-01,1.310534597601895834e+00,-8.632577598760742266e-01,-3.060760416035683273e-01,1.360369577090418725e+00,4.617543264577372852e-01,-7.487146523282861565e-03,1.250225321953872815e+00,1.470828096404434238e+00,-1.180762642624235914e+00,4.107014042065236237e-01,3.372053864109740839e-01,4.465950229640832103e-01,2.831665564042668004e-02,1.472344765539259859e+00,-6.307683339179226412e-01,5.401919267353731957e-01,-1.693155639959686987e-01,1.247737976684757166e+00,-2.963531416996713075e-01
9.041594691776839721e-01,1.456909184494098675e+00,-3.073806325801098915e-01,-6.959557372344666870e-01,1.342887379422780803e-01,-5.515704325308057321e-02,3.797677888772849064e-02,2.669493089612937076e-03,5.041445686072310028e-02,1.818876552670682101e-01,1.126753339140543764e+00,3.512186163070256106e-01,-2.329181977239191959e-01,5.186598930770155436e-01,-5.873983219110470166e-01,2.195953158303471486e+00,3.996638362482069495e-01,-3.110155892315836779e-01,-9.002514988344929858e-03,-1.446715420918952000e-01,-3.167152951763834157e-01,2.790164598084574621e-01,-6.448898347201194037e-01,3.133148500992130048e-01,1.558833603918871047e+00,-1.945188050995680373e-01,2.582595258106343272e-01,-4.664022816313712627e-01,-1.692525015773835850e-01,-9.141314810797696033e-01,1.772368746921232641e-01,1.776948420770658732e+00,-2.990300756624825196e-01,-1.291768732824548072e-01,-7.183486832370475916e-01,-9.190803166438140659e-01,1.243767471941138680e+00,1.075261612706849945e+00,1.864578898975776333e+00,9.474484083279353097e-01,3.720210227875397901e-01,-9.169333882824820536e-02,-1.048000097483742371e-01,2.730676876834047806e-01,-2.327858591385734144e-03,8.843453819603792621e-01,2.492129429041989752e+00,-1.716959472329778746e-01,-9.176135169791301005e-02,1.554526314265421316e+00,3.828185136548983625e+00,1.128085783863783220e+00,3.436443905524261266e-01,-6.208344903264726433e-01,-4.034211502144510186e-01,1.436160349441795825e+00,6.135265472888637994e-01,2.909158577667738665e-01,-1.085419119520739883e+00,1.045002339665817237e+00,5.933933645918563204e-01,-3.137129149234924030e-02,5.427543230616917180e-02,9.194018160733061773e-01,5.949605303107404763e-01,-3.734666424514714311e-01,-8.361476405387813227e-01,-1.257564218204598738e-01,1.172812872962996633e-01,6.542590322534155289e-01,2.470335660496817187e+00,-4.220577420662611212e-01,-3.165280522426629217e-02,6.583402465217539357e-01,-4.342859202740271263e-01,1.411442348056371809e+00,-2.074388639599626383e-01,1.241248749572547272e+00,-5.236663378872359331e-01,-3.329402630413969000e-01,9.206150238812926823e-01,2.915187944724342284e-01,1.193459089618533198e-01,1.108525790398898536e+00,1.189310970062266382e+00,-9.149017785144351045e-01,4.329332765327720267e-01,7.567394881479497792e-01,3.568805347691048624e-01,3.499858801721132395e-01,1.498279071098727933e+00,-7.416935167966073328e-01,6.140935023339324506e-01,-8.490472439946045169e-02,1.366231660387274838e+00,-9.317719823742298679e-02
1.053656460115841798e+00,1.451126587321651229e+00,-7.486984581812001771e-01,-3.418695163952573668e-01,-4.728473395522145295e-02,3.816919854808653589e-01,4.296514095986628812e-01,2.755260655935032332e-01,9.812375667064487939e-02,6.533755230675941661e-02,1.231596026613259065e+00,2.445175763402837044e-01,-1.906100567290759662e-01,7.163486209565028684e-01,-6.551654059280604958e-01,2.367477882747849982e+00,6.584490930379462981e-01,-9.446845620511937769e-01,7.326297727952130190e-02,-2.401818264574772099e-01,-1.753919094127108225e-01,3.626375231613961914e-01,-7.480554527321736646e-01,3.457815449140740904e-01,1.444931490179506062e+00,-3.361970311961777758e-01,-7.557773912292192753e-02,-4.451548204400408437e-01,-5.839079316405260123e-02,-8.340555575451163994e-01,4.559722849282462076e-01,1.571408879938114733e+00,5.676739720667212108e-02,-8.491486583548757405e-03,-8.541936945477561771e-01,-1.121869701887590054e+00,1.515727577558840800e+00,7.770581986590378021e-01,1.658891074044667180e+00,4.669070493742806249e-01,6.914256756927096292e-01,-1.427369018280883473e-01,-2.265026418048289303e-01,6.325343925453994487e-01,-1.864687939958973306e-01,9.096320404826693240e-01,2.306914299470449237e+00,2.015321016775088736e-01,2.538775751687246118e-01,1.057716551200067912e+00,4.698991605112695424e+00,1.458581549617498752e+00,7.713546885531429309e-01,-6.748974233258839828e-01,-1.210417780545693933e-01,1.121393522842415447e+00,2.001620322980299238e-01,6.185980941019958435e-02,-1.227312610643587432e+00,1.192083346177121861e+00,3.572826240016123700e-01,-4.012371451121130028e-01,-1.862830535783291108e-01,1.246168844974208101e-01,1.578226888654039595e-01,-7.091003888308333725e-01,-8.481743825411118820e-01,-1.786313693055695540e-01,-4.740182965761214895e-01,8.032282354022652893e-01,2.898270737157424115e+00,-1.502704783521248422e-01,-2.535083936580121433e-01,9.366585953100690087e-01,-8.746429766029964470e-02,1.319159749872694798e+00,-3.449880072585928548e-01,9.548368133345330744e-01,-2.998909473406947690e-01,-7.443855351891321970e-01,1.229582471412981493e+00,3.111314636012271206e-01,-2.207434868579633003e-02,9.413879644664890911e-01,1.020297210759231188e+00,-8.986903881351764323e-01,1.881056527006125800e-01,6.948563093429460658e-01,6.589136597828193498e-01,-4.033960337131898832e-01,1.569042197274502781e+00,-6.108144231567653737e-01,9.188207981622984466e-01,1.700866354442898132e-02,7.829529279308728995e-01,-3.888156500389702286e-01
1.119594225954760436e+00,8.899789526299177744e-01,-4.073250415682599934e-01,-1.223536928694892723e-01,-5.118170212255790386e-01,6.611735875780123672e-01,-2.104538861161794894e-01,6.294101118212069856e-01,2.063921076407047472e+00,5.886236122634416201e-01,8.212480231721490664e-01,2.980701282384575768e-01,-3.999665270968535413e-01,1.108514877090495399e-01,-3.259241261547188850e-01,2.435372266141897502e+00,1.146174300558874815e-01,-2.541196443729439314e-01,1.256284512201350234e-01,2.269155004398169528e-01,-8.055621938744130794e-01,8.792280644105046061e-01,-3.120510235391482645e-01,1.271197875269783339e-01,1.223551318470335048e+00,-1.044383233990663351e+00,-1.177527906940669389e-01,-5.740890796762542214e-01,1.159210668430052937e-01,-3.937823925581276363e-01,6.152175844677594263e-01,2.382978772512365673e+00,-5.518266422732975851e-02,-3.493731254076679060e-01,-6.272841950379133280e-01,-8.681263638467271448e-01,1.612385855918695654e+00,1.017909144603261762e+00,1.233797302282789055e+00,1.609365605476558381e+00,1.304481924472769894e+00,1.594628592165046599e-01,3.569667157966592841e-01,5.502466007796972258e-01,5.162296018479795023e-02,5.659297677327546072e-01,3.087921568626279090e+00,1.694096718959606784e-01,3.641927009688543659e-01,8.454358664719212602e-01,4.832927976980100127e+00,1.578208470023007015e+00,1.328756240343917039e+00,-5.865258814214315830e-01,-6.837515969722220976e-01,1.409317054059690877e+00,5.473133292371791248e-01,-4.729741515093001114e-01,-8.095014570002323495e-01,2.098111565556169289e+00,8.647656974269273267e-01,-2.917324474405486034e-01,-6.413462182912258447e-01,5.676254645234587448e-01,2.639173496133265795e-01,-5.650015107358093980e-01,-2.756689684293116560e-01,1.027815089012729111e+00,-2.838321519855744324e-01,-6.792320680076746608e-01,3.508605147240476896e+00,-2.043797950681600362e-01,9.300469114508831681e-02,6.096252523215114349e-01,1.708283016395943377e-01,1.229702084283770036e+00,3.061552682113555801e-01,9.324084933686230814e-01,-5.547695143386903727e-01,-4.665054934272916398e-01,6.495664896355528573e-01,7.034845986223827730e-01,-2.236537724500147206e-01,9.201676790748491985e-01,8.555579276883323869e-01,-9.171633163716799153e-01,-2.133254602154707746e-01,2.225354695319698539e+00,7.967248847213168617e-01,-1.100520492810439510e+00,2.628205994104397814e+00,-1.703729440408872087e-01,1.452826354443256474e+00,2.692174043611156864e-01,3.254458530004621375e-01,-3.595081768876621786e-01
1.250434519216427010e+00,1.151139194517564190e+00,-5.691977429268402222e-01,2.601139762199988770e-02,-5.890907909390806774e-01,9.312022876731225196e-01,1.865134849256807614e-01,7.792703368136958408e-01,2.336906726354891717e+00,2.636565143385967147e-01,2.614114344388572819e-01,1.124548727146505722e-01,-4.596419950824693901e-01,1.817753609234839529e-01,-2.493621300117351836e-01,2.043754241004108962e+00,6.086280732269205851e-02,-7.072388050217905953e-01,7.843801134474626124e-02,1.767300526973648866e-01,-8.117013148197436134e-01,7.336041516475447777e-01,-5.104025200964968922e-01,1.041394223580286160e-01,1.231324220233908751e+00,-6.569555535779103561e-01,-4.336339443990645526e-01,-5.961927682489517322e-01,-3.887828209476691388e-01,-5.435132960676469782e-01,8.171463985365821081e-01,2.344422082238834193e+00,1.731144395315116213e-01,-1.351593124383523858e-01,-8.467371473096795276e-01,-8.211377257005738617e-01,2.135942207476472454e+00,5.616878751146634485e-01,9.429419410694299675e-01,8.070626200200573530e-01,1.500026510284723225e+00,3.330283660753913244e-01,2.469394224509223745e-01,7.798400458747212216e-01,2.377887637523031228e-01,7.005850065019165740e-01,2.899956606548821814e+00,6.878015573344146150e-01,6.744206413246887077e-01,2.573624028316843781e-01,5.346738895490244836e+00,2.036848776608780387e+00,1.548345883515644505e+00,-3.904269397648944540e-01,-1.472908931247429998e-01,9.590622958770994577e-01,-2.496555918184737433e-01,-7.749408723862015735e-01,-9.597434775542785790e-01,1.849656273470122514e+00,2.369018860352948563e-01,-3.892666586547068874e-01,-5.942286354535303294e-01,-2.980013068977428459e-01,3.361391454708617665e-01,-3.148887616105198184e-01,-1.454612794218419491e-01,1.128924385124200125e+00,-7.664511312946352684e-01,-4.825392959824255090e-01,3.463740426469823053e+00,-9.974351798006109160e-02,-2.717103319089672619e-01,4.835911829507638648e-01,5.958669040605164557e-01,7.783281014282175114e-01,1.125852137311411649e-01,1.727169569659903203e-01,-7.592696649694526956e-01,-7.411609743075457946e-01,9.159985638595562474e-01,3.932844039041528128e-01,-4.996399383638019387e-01,1.065488125342944459e+00,4.936526668850029220e-01,-9.070113495802192283e-01,-3.056981197513640169e-01,1.797636604215695044e+00,1.216280668943248378e+00,-1.937136930638822196e+00,2.447209744255851582e+00,-2.848735236421726658e-01,1.927184111690635415e+00,4.823987340858170159e-01,-9.818761276176293240e-01,-6.242446152048901631e-01
1.012556132994559821e+00,1.835738366268880650e+00,-4.140694931380423105e-01,-6.268736075208636294e-01,2.229633634451154700e-01,-5.441672876506081780e-02,1.706365380107316976e-01,6.031722929567778779e-02,-5.768239162543409293e-02,-7.094383511400534359e-02,9.124456259625914889e-01,2.910514467052032761e-01,-2.317443312207295159e-01,7.348456830932014183e-01,-5.368651275840489179e-01,2.069323568188182527e+00,5.352901712924815758e-01,-6.295211671392654251e-01,-1.396388312440089569e-02,-2.127574938803979965e-01,-2.539154158575149256e-01,4.878663069846450595e-02,-8.315865391431488396e-01,3.602007009786658553e-01,1.505538376767694198e+00,4.467821786676006574e-02,1.291145786672312779e-01,-4.236266165030883046e-01,-1.932560144937771618e-01,-9.059315051528359364e-01,2.598862722941674974e-01,1.541221997301058577e+00,-1.730676973630231319e-01,-1.044628001532842687e-01,-8.625199668504139883e-01,-9.791127025361158198e-01,1.416188287452278427e+00,8.800728074990478156e-01,1.606770400655606501e+00,3.654088900264330642e-01,3.809554469930480081e-01,-1.186895136064451406e-01,-2.302377140573237391e-01,4.734936472843435662e-01,3.441448935709406909e-02,1.023172699479748093e+00,2.381982015975828038e+00,7.580251107829902302e-02,2.176757872407701633e-02,1.548708028029256889e+00,4.016817594471397079e+00,1.105698835520366519e+00,3.839944415397738009e-01,-5.717377385814359503e-01,-3.654648860482578865e-02,1.098258818514771473e+00,1.226242878483977394e-01,2.436657327635969594e-01,-1.215821595273109734e+00,5.142469935191991137e-01,3.667586388048937884e-01,-2.132072618217711879e-03,1.229476406510888187e-01,4.826716859309406749e-01,5.118959084914351809e-01,-3.859339655495512833e-01,-8.145360588758510101e-01,-2.923949609202481925e-01,-1.747568026197643953e-01,8.939735132311026344e-01,2.465536939991633592e+00,-4.519043754839917604e-01,-3.022395591845589702e-01,7.708504089545114013e-01,-3.054569691716760294e-01,1.364188603957639412e+00,-2.433561825390805899e-01,9.335583037470631673e-01,-4.336953963400906886e-01,-4.783349687857401111e-01,1.082916382778531084e+00,4.604527673693720180e-02,1.021905525987449881e-01,1.026891201524774644e+00,9.968185138457263950e-01,-7.625286587408670602e-01,4.676687533003899278e-01,3.892601746837330845e-01,4.632227330495262141e-01,1.852813672300298031e-01,1.277446427813732965e+00,-9.839698467604031107e-01,8.364139350632042724e-01,-5.059997375099101191e-02,9.130055571346007426e-01,-1.093352206405083238e-01
9.759068704672199113e-01,9.238563710415126362e-01,-1.238481395343903335e-01,-2.763658147187373904e-01,-1.778569963564601286e-01,3.432297010225020539e-01,-1.141636142646103580e-01,2.339728325019509447e-01,1.343583459715424144e+00,4.689250802031210696e-01,7.313299951336564853e-01,2.064948847434857071e-01,-4.115495368096480089e-01,1.692782944157407710e-01,-2.352228157971102962e-01,2.079751696634672520e+00,-1.073148512287440404e-01,-1.120282930183945369e-01,1.576345279538392541e-01,2.319086204396832440e-01,-8.252204770275937129e-01,4.667012300024288018e-01,-4.008069930351180754e-01,2.351697521388427525e-01,1.268963731840542231e+00,-7.166914552332459554e-01,1.449160519795363866e-01,-5.801687202123382292e-01,2.279403729798890055e-02,-4.469281337995631986e-01,4.769856482206526471e-01,2.327799139563395681e+00,-1.576724204087080750e-01,-3.555434372372031637e-01,-5.943641963409271867e-01,-8.108560861536731057e-01,1.320679933669813177e+00,1.158137055080841638e+00,1.335635504820863240e+00,1.474088674151218470e+00,9.468317644133826816e-01,1.798895663439070980e-01,1.974898585613033553e-01,3.547972035106617961e-01,2.412252236574090880e-01,7.107021568812487144e-01,2.888768271242829755e+00,-6.213882635325902737e-02,1.843432204590066403e-01,1.171419437699448896e+00,4.215023631829755146e+00,1.274017621553858115e+00,7.771625032600912864e-01,-5.791768707395384963e-01,-6.598114042862103235e-01,1.434077494518422924e+00,5.027681502977580097e-01,-2.167884814349692602e-01,-6.284508894993597883e-01,1.443495521950872273e+00,1.029032586089320134e+00,-2.239721477143026829e-01,-4.519063386965369578e-01,8.195438960540017970e-01,4.645503142710232236e-01,-3.713133851546499553e-01,-4.132697673904854319e-01,9.029614810529127400e-01,-1.663271336104312770e-01,-2.977134852755811689e-01,3.003918671386172079e+00,-4.018005527872405280e-01,1.590561349487621956e-01,7.066460004662886707e-01,-9.702656077888144326e-02,1.428816207510551939e+00,2.346337336170798982e-01,8.848225095805473117e-01,-4.820348535992968753e-01,-4.006858973072534580e-01,3.914018837904076897e-01,3.735160808814468325e-01,-7.065641876721573400e-02,1.075234411398326317e+00,7.617350743463827678e-01,-8.174767301454834989e-01,8.448907809395170276e-02,1.902496484201941840e+00,6.117697248535304277e-01,-3.390511430980263641e-01,2.147482997872498967e+00,-4.345954554890030241e-01,1.137206077145892946e+00,2.427004108554712547e-01,6.504322563913742528e-01,-1.529742302135160270e-01
8.515650650391564103e-01,1.215970388748100595e+00,2.851311504366832450e-01,-6.636919792252689021e-01,2.536017440374581378e-02,1.575545661837292055e-01,2.973232251024964246e-01,-1.230894616377478379e-01,1.279140060795324274e+00,1.363065798229012859e-02,-3.993094469072450692e-01,-4.437351893529078994e-02,-5.638805430355116055e-01,-6.353100035482943386e-02,-8.875485863228810279e-02,9.100222673152100761e-01,-7.277359896468100775e-01,2.811663493094496147e-02,-8.278870267648887060e-02,2.106061006951378822e-01,-9.592068340925929970e-01,2.780494279525019818e-02,-6.240795113318063914e-01,1.617368015086814159e-01,1.618404787286559676e+00,4.237298082654831766e-01,1.546175751060589465e-01,-6.901368384350610174e-01,-1.430895975487960881e+00,-1.097773595563211524e+00,3.397275246780127045e-01,2.618003184874879707e+00,-3.160507681190326545e-01,5.247103795203106325e-02,-7.797386485610824369e-01,-3.610828898824882116e-01,1.827847841431496922e+00,7.402149621198103047e-01,1.462106772329780036e+00,6.777993997119333702e-01,6.325425491430594072e-01,6.359291867452736557e-01,6.594881714538000650e-02,5.125611981512306903e-02,9.110003597348041993e-01,9.532929710459029371e-01,2.569212205909919167e+00,2.285846057792631503e-01,1.691525418444172479e-01,6.577751940903002748e-01,3.652609403974460545e+00,1.798659683903713224e+00,2.706432658204712682e-01,-1.102388973042296161e-01,-1.175284051184610212e-01,1.209670259219987054e+00,-2.431093392195067260e-01,-3.011543957098514745e-01,-6.679277227432930397e-01,8.911785141785540931e-01,6.629818940360143742e-02,4.640274911667019442e-02,1.283480777700817810e-01,4.700257908298588472e-01,1.454313782169117442e+00,7.859972483922190722e-01,-3.218514032559687266e-01,1.063680849659319083e+00,-5.592260741146908715e-02,1.827291277582393514e-01,1.910667532493603993e+00,-5.601977888308613540e-01,-9.826091780730512870e-02,-5.796051671729457455e-02,7.431265716328704085e-02,6.168585002199158396e-01,-1.988757414853760674e-01,-1.119322810164810056e-01,-1.353135433899652629e+00,-3.050406419357710175e-01,4.418746849501056229e-01,-2.870881019172833448e-01,-4.000978626588623799e-01,1.855521626577465666e+00,4.272223396001510465e-01,-9.980943750117015068e-01,3.936723514449478323e-01,9.072049261258751107e-01,9.314859528053603954e-01,-5.668007632770690751e-01,1.442552954689583222e+00,-7.843396494567642652e-01,1.262667265463313981e+00,4.766675432024355397e-01,-7.854640288240668511e-01,-2.751984494649857282e-01
7.178220428872915670e-01,1.321736731785808638e+00,4.060713236477252464e-01,-1.020609340378318519e+00,3.290408994813404653e-01,-5.027937592255473653e-01,-4.023696319252915710e-01,-3.560267679055575396e-01,3.638075674355729650e-01,3.287539462149159930e-01,6.363926879713291962e-01,3.558820526625968150e-01,-3.828756364421396774e-01,1.362310262324573640e-01,-3.114004296973715835e-01,1.688814274839022689e+00,-2.465436295564397695e-01,5.490158998341820862e-01,-6.272882873800224302e-02,1.209542704621641707e-01,-7.183263680830322961e-01,8.420964272763842295e-02,-4.868594979527964828e-01,2.598603901376521641e-01,1.624494579444013098e+00,6.082415724799977719e-03,6.552764502485826092e-01,-5.525313226800505628e-01,-4.436843374741261670e-01,-9.117840812714561594e-01,-6.919869653283483579e-02,2.261217178208930534e+00,-6.954540737383013704e-01,-3.119232463788434995e-01,-5.359745617869561274e-01,-5.622282863542101827e-01,9.741730210800244594e-01,1.420481185251474709e+00,1.899795444568306069e+00,1.547509163338683269e+00,1.136060282143541711e-01,1.496645289139907353e-01,1.029606221560499940e-01,-1.866483823472145920e-01,4.591918599478272411e-01,8.596158192530859443e-01,2.782393081550491143e+00,-5.573102391018169843e-01,-4.174049855943839371e-01,1.984776704945379500e+00,2.757723962699962783e+00,7.987853277499397109e-01,-1.707289908481893770e-01,-4.674470829685105633e-01,-7.331384566040838324e-01,1.752106743592215299e+00,8.983561395222126045e-01,3.887557096451870198e-01,-6.996273702399592453e-01,7.654023597335458673e-01,9.417073342751010046e-01,3.828411408471439348e-01,2.547216193568940246e-01,1.789622940556664599e+00,1.233948276784648135e+00,2.294143015099847083e-01,-6.578147090129532470e-01,3.531705114041548410e-01,7.144487234431849965e-01,2.463848482146312469e-01,1.923246030463285905e+00,-8.061866015458499790e-01,2.667836234853222521e-01,2.740485362115450130e-01,-7.276672863522239965e-01,1.456396998481623184e+00,6.525964986242233090e-02,1.252686873742338225e+00,-8.681108215747446177e-01,1.423995059939964225e-01,2.923760165685171941e-01,1.143130659488188483e-01,1.939650259628841189e-01,1.428050401090207311e+00,1.122967394186935586e+00,-8.807005530926881320e-01,6.889792705857843425e-01,1.072768320027847722e+00,1.186356407397946011e-01,1.077019178902058671e+00,1.464117372707569587e+00,-8.978075873420187092e-01,4.420652596850786487e-01,-3.721955993404862939e-02,1.586805089078695330e+00,2.613301721886428508e-01
9.425788761487267076e-01,1.039006151705280878e+00,-3.150075534813632228e-01,4.453783359636309669e-03,1.652421164082684135e-01,5.685821712726257804e-01,1.056755043129187221e+00,-1.223727318671823106e-01,1.932572967063916902e-02,-1.633176072928055056e-01,3.394108360535500468e-01,-2.966602396406456954e-01,-4.088055178224800357e-01,5.743245425248938441e-01,-1.443468667212925993e-01,1.277022616609670758e+00,-2.757842333991671335e-01,-1.070574683857037357e+00,2.986051282070633084e-01,4.299259463277851911e-02,-6.321336276879020444e-01,-3.168340669478523219e-01,-8.579886013597556316e-01,4.800642624775798284e-01,1.266481961205984996e+00,6.082615138352583106e-02,-2.238534951302251219e-02,-5.994912900915041476e-01,-5.194672704042663236e-01,-6.477062523777814551e-01,7.290618969156050788e-01,1.940493793769093811e+00,3.124892343815273699e-01,5.122217848132076812e-02,-8.718836238485542234e-01,-9.334336742209601301e-01,1.505293613083822368e+00,6.595144495325730993e-01,1.186449733576572463e+00,-5.199777456512721940e-02,7.913848477178171414e-01,3.056137493886101342e-01,-4.097598744867453902e-01,5.777284100408195400e-01,4.972254501847617747e-01,1.128804274677321029e+00,1.989206758665860608e+00,3.565456032312095958e-01,5.417247141811228905e-01,5.475795958070832636e-01,4.585857339345041694e+00,1.594707118945192903e+00,3.833769566435337173e-01,-4.933347194500268262e-01,1.544387877594454173e-01,7.720506341780247750e-01,-6.986063413778461628e-01,-2.280986864991322027e-01,-5.654052214092880613e-01,3.151990423605706138e-01,4.927424795889508990e-01,-7.698638882984636389e-01,-3.631098991475633087e-01,-4.503115297861531863e-01,3.517603293664112174e-01,-2.227435392276025938e-01,-6.733702382575799117e-01,6.420836066111650364e-01,-1.103207038701527587e+00,9.285443618581966652e-01,2.469211042116753241e+00,-2.756769290493439328e-01,-2.460734046283719056e-01,1.158523242315892210e+00,1.638182950896968082e-01,1.299410521272669206e+00,-3.688428843310999627e-01,-1.850909069741648594e-01,-2.345814488398169084e-01,-1.083960593496429592e+00,5.299600487437391427e-01,-4.724935330565137037e-01,-2.029235064492924401e-01,1.359987726724575907e+00,1.048227054956539783e-01,-6.820518456112738548e-01,2.730997094302994310e-01,7.854999101777246917e-01,1.005236775668079119e+00,-5.076699696673030449e-01,1.094254752480119830e+00,-7.851354032069870481e-01,1.182874998311983505e+00,5.003581288601357535e-01,-4.751070164109059690e-01,-4.207603918876740567e-01
7.527696080136379031e-01,1.190633152934037930e+00,1.505754900169725685e-01,-5.632937252446524878e-01,4.350086371599511392e-01,-1.044904250561056180e-01,4.658103549740661431e-01,-4.604798258441429315e-01,-3.064772278795879767e-01,-1.171076282219052356e-02,4.702195226217052437e-01,-4.377366740344024176e-02,-3.905015404458428430e-01,4.238743612335951205e-01,-1.970343136965345687e-01,1.287076766831552366e+00,-3.554388573554008168e-01,-2.714426761109663411e-01,1.472621901514590825e-01,5.882923512327953991e-02,-6.491753850824839578e-01,-3.609312961269547371e-01,-7.457263121509931647e-01,4.449899138931349141e-01,1.470921171816386819e+00,2.292632595711019128e-01,4.372647057477788701e-01,-5.766100979745388821e-01,-5.402124355080836215e-01,-8.223646348526950645e-01,2.757381475370782042e-01,2.028072466613461522e+00,-2.054691116154583885e-01,-1.005343143543387108e-01,-7.031891500297026143e-01,-7.444733413059301252e-01,1.090612362252455725e+00,1.082187191668916526e+00,1.610783944624312625e+00,5.874117856365658197e-01,2.577573966209181777e-01,2.284596920733988068e-01,-2.829150996308353871e-01,1.157195050560829025e-01,5.610760959105467460e-01,1.090573813424431604e+00,2.211252024646050973e+00,-1.999320047014160329e-01,-6.569365646966515704e-03,1.389640894613667577e+00,3.404540740735507942e+00,1.065437276860127680e+00,-1.935571176457027143e-01,-4.870695966942933941e-01,-2.346515342311338015e-01,1.242636201953942976e+00,2.708213845042628520e-02,2.233990554160369679e-01,-5.473857162941992982e-01,1.670735222106778384e-01,7.721724157772671404e-01,-2.153176953828098150e-01,3.988170108159711652e-02,7.143926177269923627e-01,8.594789536669608099e-01,7.657314459759484437e-02,-7.735705894498121626e-01,3.855866076909290063e-01,-1.984965246541576800e-01,8.840345392779215272e-01,1.921366681704921309e+00,-6.160791751652650028e-01,2.347631868056491988e-02,8.155562156615563385e-01,-4.094703500140048358e-01,1.484887492150587462e+00,-2.425613983506683113e-01,4.744426264972591012e-01,-4.776817605178373949e-01,-4.933253107740370180e-01,3.085535766503833544e-01,-3.796911235198179857e-01,7.227858908124623616e-02,1.478556879870447816e+00,5.470057183198464568e-01,-7.312576814149762683e-01,6.397317760707093015e-01,6.869689541353842799e-01,4.860613437611963628e-01,6.693272414305007079e-01,9.678070028524933255e-01,-9.819911849531989256e-01,6.304435414332674181e-01,2.224556331657197572e-01,7.018128162230317102e-01,-9.199290975944185433e-04
9.485479878644680340e-01,1.065393405208831634e+00,5.096110953591832526e-01,-4.478970206401511334e-01,-2.898686493934300723e-02,-4.744612027885519723e-02,-6.999735061506735523e-01,9.101077106250496374e-02,2.071829133819352631e+00,5.477892823685813761e-01,8.274197555592571751e-02,2.290946007396757744e-01,-5.864127813414634627e-01,-9.379413698938672550e-02,1.487742501569155884e-01,1.659321986368235136e+00,-6.198700909928571701e-01,5.962505925125584083e-01,1.307388346041438720e-01,5.408447761790196040e-01,-1.292276039331585524e+00,2.310568604992425390e-01,-2.983608085632755147e-01,1.800961077117099185e-01,1.175755628517447082e+00,-6.057757136918403562e-01,4.017878348229338981e-01,-6.273787868246308852e-01,4.813323923710033370e-03,-2.309029023771672628e-01,3.552914505665156764e-01,2.705875934973319019e+00,-4.540755570619707804e-01,-6.783423852221761585e-01,-4.810626288383988980e-01,-5.175307892594606107e-01,1.181367870936880227e+00,1.432562433145325498e+00,9.692025855739716533e-01,1.880482529777963707e+00,8.806978917895986747e-01,3.828477204530009725e-01,4.542342496522359663e-01,1.298945344229652799e-01,6.903923117558316003e-01,7.079405257924585859e-01,3.341531567834784333e+00,-2.465396511946175151e-01,-1.853825440744723274e-02,1.686548959185452556e+00,3.420975198270961304e+00,8.328060078885062278e-01,5.218446314330572600e-01,-4.196850908685940129e-01,-8.264644405136059024e-01,1.504356985479750497e+00,4.918203443616353532e-01,-2.728342185275507426e-01,-2.992440155309180616e-01,8.909527127279169845e-01,1.407454960760348817e+00,2.648927718762676409e-01,-3.522706363780182537e-01,1.441791723641233869e+00,9.096207194292835752e-01,8.285573108437443990e-02,-7.513909828508436028e-02,1.449530233360994735e+00,2.005684875783012855e-01,-9.157996708314088963e-01,2.768986174556987034e+00,-8.300860024106899715e-01,2.872566194257248906e-01,4.501699465705556458e-01,-2.362105464907046093e-01,1.527711898477532637e+00,7.220277239591441631e-01,7.586408220015896653e-01,-6.768334219278371311e-01,1.539279240297986018e-02,-2.010445017226702991e-01,1.486740712154221156e-01,1.291301943496081517e-03,1.164806627712242637e+00,5.327940632556162903e-01,-5.902685500054221102e-01,2.429276116898149152e-01,2.349873988257169977e+00,4.443919404423912756e-01,1.094812939863136214e-01,2.263371590042963621e+00,-7.099091082651456386e-01,1.316501957644562681e+00,3.305805837721804696e-01,5.413796671685264794e-01,2.372648233605760826e-01
9.785414159337181284e-01,1.058072638420776146e-01,-1.043916750977252228e+00,1.113441170347142517e-01,-7.711888422438504254e-01,1.299479394848767955e+00,7.556610020116203419e-01,6.166432037433913216e-01,1.115755552991082755e+00,6.590131083530111900e-01,1.624921069697938592e+00,1.370899717426825037e-01,-2.295520318589526487e-01,1.494712532568628904e-01,-7.887323954709328788e-01,2.732213501761964203e+00,3.387796953907935005e-01,-9.432898194871779385e-01,2.072646179157496271e-01,-6.430460754168218496e-02,-3.469256362756315548e-01,1.270328484885041798e+00,-2.913279450751914412e-01,1.759697186893863508e-01,1.422410546834446565e+00,-1.242235993611532141e+00,-3.377620759159974950e-01,-6.221629173150760028e-01,-1.791061762421150005e-01,-7.608843729023291313e-01,7.688338235211991112e-01,2.276758376273273932e+00,2.953460183439161058e-01,1.832270943199040825e-01,-6.493359844066842745e-01,-1.111011343681376218e+00,1.691298145197847713e+00,7.461951555997958785e-01,1.973239674130198740e+00,1.463840642816151894e+00,1.400559727585219516e+00,9.650151947481661052e-02,6.232714002471201331e-02,5.844753049031788938e-01,-3.665567252297293743e-01,4.902687324001245850e-01,2.411479131652672692e+00,2.384751148156585843e-01,6.256694144591105067e-01,-1.786361606755624276e-01,5.707242100697472509e+00,2.408027166326170754e+00,1.497793143594540854e+00,-7.629950800634850427e-01,-7.334105306501370602e-01,1.586791134933054792e+00,7.943136585286922902e-01,-4.490790588015557416e-01,-9.448549343656061916e-01,3.282124554528280669e+00,4.765791054763508505e-01,-1.146003543169217931e+00,-8.617954863855006309e-01,-6.322035370773648744e-02,-1.063829476610280711e-01,-9.205664643217670307e-01,-7.339918440844771519e-01,7.100296578974190087e-01,-6.565864790596988021e-01,3.235218915108090121e-02,3.603040488327853730e+00,4.263553193515114415e-01,2.044192630284233370e-01,8.061356076901963208e-01,3.379718135367071885e-01,1.004531846594291400e+00,-4.472019903196468027e-01,1.007146498980381999e+00,-4.862700268400093062e-01,-1.005889365190994589e+00,1.134459977991844504e+00,1.027235614882183956e+00,-4.248873680303054678e-01,1.126379884492881178e+00,1.109245798506077296e+00,-1.415265941456585574e+00,-4.417033554829269959e-01,1.922847898207342698e+00,1.081561406694283134e+00,-1.678653483874651187e+00,2.509668497860213954e+00,4.605140891646711809e-01,1.022957155547615793e+00,2.832411246028667673e-01,4.348296141508812274e-01,-9.661797869460162502e-01
1.244359777760952523e+00,1.791114541095792934e+00,-2.443999714419969882e-01,-4.289208393134172903e-01,-2.921435375732368556e-01,2.771129735204178046e-01,-4.295915060294544507e-01,6.354770804404317186e-01,2.208225700856385032e+00,1.880500265771269108e-01,1.504170514700847172e-01,3.593137226510908500e-01,-4.485883697707355178e-01,2.638308054295767091e-01,-2.224952909926756761e-01,2.045998035655205882e+00,2.017034047886351877e-01,-2.211973704855797473e-01,-8.230883165020626280e-02,1.534857517212425138e-01,-8.026628037219194489e-01,5.256439953840726931e-01,-5.689499627942059545e-01,9.007514210205620764e-02,1.318341992083489789e+00,-3.592471431002807192e-01,-1.608385713355771351e-01,-5.116371482514735503e-01,-2.840379736184170945e-01,-6.088704184786787321e-01,4.818058388268647851e-01,2.181841684805375436e+00,-2.118469221715019724e-01,-3.493933567835301179e-01,-8.318554314773380920e-01,-7.116802837546893912e-01,1.949210365348735596e+00,7.906544827802620690e-01,9.556038073465579208e-01,9.080660392054196173e-01,1.080470014683023283e+00,2.000229518523021777e-01,3.231951743184577897e-01,6.064784865227027533e-01,3.012297479981446147e-01,7.707851711764658331e-01,3.158097817806413854e+00,4.404947847163759866e-01,2.684858449253917922e-01,1.163960545076028641e+00,4.466996644611553435e+00,1.429521639730336524e+00,1.175530997908456055e+00,-3.391400106362814637e-01,-1.653698747441688932e-01,1.041896903359801119e+00,-3.808668515414276312e-02,-4.425348709167135075e-01,-1.115478531063543999e+00,1.179988148121758007e+00,3.295978732754187845e-01,2.686139504268552636e-01,-1.752009348780536047e-01,4.166114151811282085e-01,6.825286059694926077e-01,-1.093619920737946005e-01,-1.334040028118964605e-01,7.515755725410138144e-01,-1.763193382601370984e-01,-4.837160737789124587e-01,3.103133171584980587e+00,-4.881983365791939811e-01,-3.165905464693112847e-01,2.615447678210455207e-01,2.057732322041069262e-01,9.361062801962374280e-01,3.389607833630089995e-01,5.581739903448119655e-01,-8.772420175774578999e-01,-2.677094525662785385e-01,8.803301773145293385e-01,3.052030791050148184e-01,-2.392950608849369054e-01,9.779868906779107807e-01,7.381151638050625907e-01,-7.419663577185914294e-01,2.795137851231677129e-02,1.479961964474886482e+00,8.092431349696422860e-01,-1.061867727242509885e+00,2.265433421395914415e+00,-7.343674307770815535e-01,1.751025839935293371e+00,2.332009660396858197e-01,-3.174557123708979245e-01,-1.951637605535928299e-01
8.911749155770442021e-01,1.173886733451813047e+00,-2.016840688890756406e-01,-3.807392496118955916e-01,2.280811211843312702e-01,1.979525625176453696e-02,1.049405589261702687e-01,-9.863304053773819247e-02,-6.135768326074098056e-02,2.608249138683650381e-01,1.182902188862319681e+00,2.006605504909839965e-01,-2.759596074877846972e-01,5.812584504468000235e-01,-3.627236723565164800e-01,2.148497967322381186e+00,1.945985136552096928e-01,-3.769574313491300122e-01,2.226616876837460568e-01,2.074848733782589522e-02,-5.026269067563833293e-01,4.672262620102823893e-02,-6.124174319905681951e-01,4.374324182397425487e-01,1.294692389976551450e+00,-4.795762939911493716e-01,3.476640816734956063e-01,-4.842113954680306587e-01,3.272564013245728987e-01,-4.886246389870894102e-01,3.407485385870085981e-01,1.800606330242088049e+00,-1.362788452478497503e-01,-3.360944802450342994e-01,-6.293283817563688487e-01,-1.025712778525611935e+00,9.205607171251544152e-01,1.269082224439149531e+00,1.543826391390366481e+00,1.056755308237078639e+00,4.925493071981834614e-01,-9.303304717090615794e-02,-1.491459399129887453e-01,3.570151792523362233e-01,6.461255780403823978e-02,9.100123523787615465e-01,2.490414493370820548e+00,-2.907717455181927368e-01,3.145156092093939759e-03,1.695469317333031967e+00,3.868648521321730094e+00,8.153210241658552793e-01,2.757878553941173205e-01,-7.528417294707823171e-01,-5.227062199259473463e-01,1.364868534056588256e+00,5.115254613948128082e-01,2.460235167148875635e-01,-6.982774902486516000e-01,6.650247865880847264e-01,1.193523603464922811e+00,-2.788768354236561553e-01,-2.642826498726079665e-01,8.969663315298568307e-01,2.606983376365936689e-01,-6.496191650073827040e-01,-7.991972644221194688e-01,1.811779083848131799e-01,-2.026480982252008012e-01,5.234557999698050690e-01,2.688728715374534062e+00,-4.863211988192475688e-01,1.018641797416064004e-01,1.159889776609598577e+00,-4.636690536536191010e-01,1.863028365929120023e+00,2.535859249942862270e-02,1.160786445577404624e+00,-4.352724373086291898e-02,-5.025493503231830417e-01,4.723938184754684633e-01,1.409859363367354512e-01,2.410301308269507947e-01,9.435515277363007991e-01,8.698050249296412906e-01,-6.639479995728680972e-01,4.006784867954345519e-01,1.234885013135534892e+00,3.106299371592119440e-01,6.121973259740938200e-01,1.513820979327529015e+00,-7.541939151262255780e-01,6.410828218039243964e-01,2.792152791021002001e-02,1.524232243605500692e+00,3.384599459199427729e-02
1.321284419574119351e+00,1.552633744999950771e+00,-3.111413763435032509e-01,-2.593601781585241906e-01,-5.861094694383137682e-01,5.428900229398445632e-01,-6.015587810776219513e-01,9.126953550140838312e-01,3.031128938669087169e+00,4.048001575280700814e-01,1.386222648760667142e-01,4.010791727140001206e-01,-4.935518711000531078e-01,7.571926804427796254e-02,-1.845274170809138858e-01,2.255777858785639189e+00,1.571804213557937424e-01,-1.352681326667996842e-01,-5.998189663169170571e-02,2.773136738171615434e-01,-9.557319583143761843e-01,8.718044703139034013e-01,-3.995828934242620645e-01,-9.274911859399881386e-03,1.225258535370424617e+00,-7.516162684625873336e-01,-2.988765558799628685e-01,-5.475293115808634870e-01,-1.587737952323883261e-01,-4.458626899730511184e-01,6.100209085262501274e-01,2.427421208104469930e+00,-1.651794830507715139e-01,-4.314449069533641823e-01,-7.760883715943885930e-01,-6.922364787545324250e-01,2.086598052088133759e+00,7.973447556034269912e-01,8.088330910035905763e-01,1.300872118264836397e+00,1.432822090833967277e+00,2.663032527656679638e-01,5.428113711351968407e-01,6.832631635622401500e-01,2.542778859688383797e-01,6.022895804853274360e-01,3.435421780463230768e+00,5.292559254952651226e-01,4.019165730218812738e-01,9.147963829134921898e-01,4.844015723425298958e+00,1.621073000769437389e+00,1.595226287845477042e+00,-3.417713652535045998e-01,-3.522201829089770531e-01,1.120172727847789540e+00,9.724042795802978478e-02,-7.100850063478129082e-01,-1.062905676224595197e+00,1.782203097753915388e+00,4.265524555698235742e-01,2.023831986067081146e-01,-4.292902878865948457e-01,3.952681892704668631e-01,5.668197515372405126e-01,-2.089932513154938443e-01,6.621046761702775729e-02,1.147740273293027524e+00,-2.181281328405701991e-01,-1.050077866696483175e+00,3.537872192585787445e+00,-3.806710897741336641e-01,-2.310561894371140901e-01,1.774724301170300389e-01,4.054895967463097994e-01,8.467559257461928501e-01,5.334983988560060286e-01,5.858317739268368296e-01,-9.369478985036980845e-01,-2.609945595607545687e-01,8.325069617390539189e-01,5.831107806312816333e-01,-3.648715903273095362e-01,8.923429365224561094e-01,7.329461798763190483e-01,-8.020784873368116408e-01,-2.393241985147039341e-01,2.084285197115224086e+00,9.408220415357115840e-01,-1.617186796203998966e+00,2.786233233834515488e+00,-4.513128564146122179e-01,2.021210621779405248e+00,3.210354493759873806e-01,-5.592142530629191643e-01,-3.048687655598529278e-01
1.227136558695145707e+00,2.213885338634556721e+00,7.133746110005616259e-02,-8.504836280478287325e-01,-1.050146602655686184e-01,-3.521093791616923263e-01,-1.281704964591518614e+00,5.751042429496432407e-01,2.297927356965272505e+00,3.531723009461824603e-01,3.397539159254106544e-01,7.138487742629183730e-01,-4.176205744113709595e-01,2.602565777974696348e-01,-2.346667293848296032e-01,2.371981048640657619e+00,4.013663388004146682e-01,4.509549387330766823e-01,-2.050015555271131884e-01,1.900457600468387354e-01,-8.291020640592464686e-01,5.562380362501146980e-01,-4.697092533713729257e-01,4.726968058459674049e-02,1.351233428544234227e+00,-4.415555176047155084e-01,1.690329496913804130e-01,-4.249827268493384658e-01,1.475996712913900666e-01,-5.243633911985808860e-01,1.284822018861620507e-01,2.107396511156979901e+00,-6.525561847652798786e-01,-6.923090345831290904e-01,-7.017094887567253414e-01,-6.457342479447986117e-01,1.594177192219637718e+00,1.214567511602304251e+00,1.031818140210389867e+00,1.520523163706044123e+00,7.480963640320795749e-01,-6.781410889817540699e-03,5.349315037620678837e-01,3.974805205835010291e-01,2.176452598328288413e-01,7.033327750053137706e-01,3.610794717232811202e+00,1.668242242431938749e-02,-1.993026013385194584e-01,2.211023463296867497e+00,3.597236835695525325e+00,7.095170320475574499e-01,9.292286403809901785e-01,-3.958517342526306493e-01,-4.967318212146868972e-01,1.347044356906836660e+00,5.898001848455547425e-01,-9.463187804412787063e-02,-1.205700905830623171e+00,9.145824604838369565e-01,7.429844096950892762e-01,9.121414637366087597e-01,8.925673787506710477e-02,1.465831038464114666e+00,8.877090163817722424e-01,-1.197792769103512844e-01,-1.059789847624247328e-01,4.666588412719945289e-01,5.756712287730664235e-01,-8.046037282749838315e-01,3.007561528162145947e+00,-8.499231302088814388e-01,-1.738128840434692846e-01,9.669970082983067594e-02,-2.742233198736934718e-01,1.270288624813746825e+00,7.286489040968986419e-01,1.318472362765642281e+00,-8.920981780755148360e-01,3.021950286294774468e-01,7.437674081719674035e-01,5.032663154769050351e-01,9.247257419626975228e-02,7.523427892714423804e-01,1.156033060063528017e+00,-6.070233227463607273e-01,2.648403302458990360e-01,1.616961409728175036e+00,2.786017244025420503e-01,-9.274907597324927311e-02,2.408791092528199229e+00,-9.923923231120672650e-01,1.486943493467769439e+00,-8.226765631817956059e-02,8.461790098686683415e-01,2.857284389413193848e-01
1.449076106518616847e+00,2.377095439322948867e+00,-7.828109680267735238e-01,-5.923969588461638347e-01,-4.921415519479335754e-01,2.713743891229337124e-01,-7.310755857730526497e-01,1.092393039737146410e+00,2.324053593285236197e+00,1.649732618709089105e-01,6.792884052979308862e-01,7.260403580605719887e-01,-2.717305125043055769e-01,5.291498424872990158e-01,-6.276398106297480517e-01,2.843625873052173514e+00,1.086949599587043291e+00,-4.853466040666912229e-01,-2.771245157494768852e-01,-1.474997147370923356e-01,-3.640907525072132889e-01,9.851255243114149796e-01,-6.271853322937319675e-01,-7.175654112954760189e-03,1.431029203060080190e+00,-5.129397595236501184e-01,-4.099540543398754178e-01,-3.644774993638110194e-01,-2.596275071428411074e-02,-7.936954964123603684e-01,3.893270005144657264e-01,1.722286002946139316e+00,-2.511943696711260721e-01,-3.083033258752475581e-01,-9.637030857073121126e-01,-9.188077607515989786e-01,2.229829554416633997e+00,6.263598689156852917e-01,1.131199186008958524e+00,7.962189995290771538e-01,1.111995632851319415e+00,-1.531622926662718487e-01,3.765825227077791992e-01,8.658612724778359526e-01,-2.463154675273593330e-01,6.836265884643646373e-01,3.300294745654109185e+00,6.262389435867841136e-01,2.191418466821413724e-01,1.342225002375982967e+00,4.942360674153553290e+00,1.493734223009382855e+00,1.664102394966612941e+00,-4.261519026909698082e-01,-4.469710001305593483e-02,1.015421624306476867e+00,2.247455342239186304e-01,-3.424614960268475006e-01,-1.804680390498850207e+00,1.664559246955003458e+00,-1.033555821972801103e-01,5.056791409680003735e-01,-2.358905441534535352e-02,3.394994707057713557e-01,4.277356346767049455e-01,-5.160053876996164579e-01,-2.366302635734884863e-01,1.752926502204599224e-03,-5.858261354996993631e-04,-4.122839114807739236e-01,3.531237858252463724e+00,-3.163864587020747132e-01,-5.797591386557379156e-01,1.285788051513762908e-01,2.282795421930716717e-01,7.858053641116247157e-01,2.664913669958888787e-01,1.136313753020795847e+00,-9.173604119547443814e-01,-1.871160739538271500e-01,1.677194579887969050e+00,7.883801275444524137e-01,-1.965310712018603634e-01,5.982272080249873003e-01,1.307565129301023088e+00,-8.580036937686350562e-01,-1.003855923383919491e-01,1.117457413004400379e+00,7.311411872936964818e-01,-1.416249448810308120e+00,2.542532157396810710e+00,-6.962709043816742716e-01,1.809895551266778035e+00,-8.665494178229460331e-02,8.930737873556016115e-02,-3.021034720605603741e-01
8.650224846519709576e-01,6.843517906108563809e-01,1.698880153041195662e-01,-3.754617099005544412e-01,-1.672999837773374576e-01,2.848558038761465627e-01,-1.454265366294290041e-01,7.200383228183804274e-02,1.548047532505804069e+00,5.471967045030260435e-01,4.522584394852686707e-01,1.401217472427777888e-01,-4.962729353041827052e-01,-8.930160364688592700e-02,-1.221340071860273491e-01,1.756292058648809107e+00,-5.093009567069584076e-01,2.263482963190122099e-01,1.369210889525892261e-01,3.593500501216547183e-01,-1.025041057535481581e+00,4.410875724620793026e-01,-3.067231586870647897e-01,1.908439500929845212e-01,1.334616897646936806e+00,-6.120757449147996576e-01,2.708738618623850458e-01,-6.579315861456288550e-01,-2.984392945894107640e-01,-5.187923297182441829e-01,4.147495445397593739e-01,2.657647481305792425e+00,-2.857972641945376036e-01,-3.366729387770038273e-01,-5.155585546751655368e-01,-6.146877009038889117e-01,1.290074089781709343e+00,1.234868738420293433e+00,1.418246435536302030e+00,1.732324287585126132e+00,8.999588953777550859e-01,3.744791823707753764e-01,2.851962834727659879e-01,1.233989961798112045e-01,4.924216515620373213e-01,6.804121268949196999e-01,2.945287433614963479e+00,-1.766046791282823158e-01,1.153819040497030268e-01,1.076251840462529419e+00,3.866228344384080806e+00,1.354573574927446566e+00,5.898028115747580014e-01,-4.750022528585018944e-01,-8.040302224624169547e-01,1.592767643732130534e+00,5.890057216105759608e-01,-2.583965491302260831e-01,-4.191265827928894461e-01,1.543682230235994712e+00,1.069011428385701512e+00,-1.647906985092448262e-01,-4.035462547596716520e-01,1.070063854088416644e+00,7.988597027217744229e-01,-1.534596585603831276e-02,-3.284630831105023185e-01,1.246190565335591360e+00,3.204203277567548719e-02,-4.731115195607040746e-01,2.729979743106646595e+00,-4.847841137668897904e-01,3.161335865020713509e-01,4.622146054968000461e-01,-1.305968764687368555e-01,1.307316269075476267e+00,2.530183655149615407e-01,7.459758884264993117e-01,-7.400897934193537697e-01,-2.609740288098879590e-01,1.196496503466810690e-01,2.999695659992551722e-01,-1.417462094676311679e-01,1.342500130887184895e+00,6.851672981525729345e-01,-9.011617583906424978e-01,1.406437230524254234e-01,2.064660118850082604e+00,6.259964258740546850e-01,-2.492743719197981489e-01,2.148213254895306346e+00,-3.848017666878971732e-01,1.083516375511182073e+00,3.400121980110103470e-01,4.970843463722579014e-01,-1.184767114321339521e-01
1.192020278925594035e+00,1.732596974439524651e+00,-5.679464701019427686e-01,-3.944453490563692433e-01,-2.583578830944315285e-01,4.887501325615134506e-01,2.444909707130993870e-01,5.311133728711270319e-01,1.378352760491292850e+00,-4.913525389887321571e-02,3.127707890882427955e-01,2.092170365648337582e-01,-3.597962493857394528e-01,4.368350849951661008e-01,-4.435137125861740581e-01,1.922669306808683087e+00,3.487225935127520882e-01,-7.619996248302068897e-01,-9.427106118843918414e-02,-9.023864886768054316e-02,-4.825054830339053358e-01,4.446630200853704529e-01,-7.484073605842540555e-01,1.584032677826416602e-01,1.481499504273669610e+00,-4.120263934629727481e-02,-3.036940991488669139e-01,-5.120483325465913227e-01,-6.957751955470579119e-01,-9.537852650993150494e-01,5.361428306870410498e-01,1.944498056762957727e+00,-6.534210144930663322e-03,2.839388611195117762e-02,-9.701819031807145111e-01,-8.169830269008352408e-01,2.119893860203447389e+00,4.778361492451167480e-01,1.279356467429275668e+00,2.742525116523673034e-01,9.696487858373865620e-01,1.835153895196375839e-01,1.408648378675578239e-02,6.682218958003885989e-01,1.964365242804076983e-01,8.934007353716379995e-01,2.616208768938481644e+00,6.255253926117164687e-01,4.126761093750383469e-01,6.486848745462709953e-01,4.824863160197113032e+00,1.861444081449714183e+00,1.086749720563818133e+00,-3.380145102961016335e-01,1.486406678020790739e-01,8.969278617563183342e-01,-3.110276015026642860e-01,-3.720195133157913059e-01,-1.306135668697705032e+00,1.249230963868434019e+00,-1.825219614223372588e-01,-8.434628087933958296e-02,-7.444428865302789300e-02,-1.836400088733526337e-01,6.234555988616738986e-01,-1.112552378054026958e-01,-4.174053633045218814e-01,3.582061524357980642e-01,-4.823401871208963243e-01,2.748383655633033218e-01,2.857764829789220418e+00,-2.309496958023635194e-01,-4.780948566303187541e-01,3.310276412205973573e-01,3.173939090685646280e-01,6.990264167122894889e-01,-2.019261953066322779e-01,3.043824153969312829e-01,-9.056405863178553783e-01,-6.062647775080320933e-01,1.272529455694812128e+00,1.729110792681501918e-01,-3.563482461469513196e-01,1.170570026871253777e+00,7.454434095259412363e-01,-9.311009723740604205e-01,5.938438521048317043e-02,7.645336184959863335e-01,1.010787725528100589e+00,-1.305778343557874033e+00,1.819779260369392970e+00,-6.811373503147590824e-01,1.573931827700481012e+00,2.494498987484513042e-01,-6.097395419954616536e-01,-5.019784373204230210e-01
1.064941600195387306e+00,6.703286876996525923e-01,-5.198693196210417700e-01,3.234172006318173365e-01,-1.433450296400883839e-01,7.220525533687388586e-01,3.600857790697785110e-01,2.968905663307573883e-01,7.255789669157448607e-01,4.298321687098110022e-01,1.228158223665713811e+00,4.527474585578034061e-03,-3.348391159915303228e-01,5.692740341293410777e-01,-1.885637468477555923e-01,2.374725758032273149e+00,1.298516417049377369e-01,-8.555131100735252625e-01,4.898269419667052871e-01,2.060023834039695356e-01,-7.083109318465360404e-01,2.624981560938060010e-01,-5.040134503019485512e-01,4.569091558070069725e-01,9.189496089916751043e-01,-1.159784324540772404e+00,3.347799952039931526e-03,-5.327828212407484942e-01,8.290485962289617650e-01,3.904851068685299964e-02,8.316014130724143083e-01,1.944100559404071005e+00,3.326650009876001568e-01,-4.478835071125351619e-01,-6.190704068479154776e-01,-1.224325187834798268e+00,1.058196849046862953e+00,1.156667194852865066e+00,9.891661165242610076e-01,1.113469997237275688e+00,1.201958869432316668e+00,-2.443136684504898515e-02,-6.990316419607268961e-02,7.696065416019659544e-01,-2.972130182554288957e-02,7.899056349503323915e-01,2.586537027693248003e+00,2.826152736958889578e-02,5.093883410593276206e-01,1.069443249510607430e+00,4.979796589088787861e+00,1.095545952943075108e+00,9.687719155265036575e-01,-8.746540131581299615e-01,-5.537339454570936459e-01,1.125130546037291124e+00,1.842354912106326514e-01,-2.680526297430300131e-01,-4.340596764988173817e-01,1.099746603590963767e+00,1.518804375374720905e+00,-8.602914389278863982e-01,-9.541958336887196301e-01,1.701381532286219134e-01,-4.180780451919670071e-01,-1.165599699751955987e+00,-5.712987984842449185e-01,8.286423419661290701e-01,-9.916895944949558617e-01,-8.784371174948291117e-03,3.585297741496639823e+00,-2.010544729763908967e-01,1.120954590444255966e-01,1.654050176827187135e+00,2.265220069719957319e-02,1.995548439648852534e+00,2.562765455756286781e-01,8.076801899476914182e-01,4.010793622242534440e-01,-9.766446949437506131e-01,3.076737656612937299e-01,2.795430773168953165e-01,6.006572468083976046e-02,6.570588488477429046e-01,4.379864915548395965e-01,-5.372180110830732103e-01,-8.850824834074805247e-02,2.140307761728945657e+00,6.916134049716679000e-01,-4.011640706878227824e-01,2.074830516105030664e+00,-3.653080650517008809e-01,1.191625560733726275e+00,3.206220808157593805e-01,8.101770484719079679e-01,-2.438906035757495427e-01
1.057620190665374382e+00,9.000686987646302484e-01,-6.891149165361193374e-01,-5.001543320072254772e-01,-7.742578814606019266e-01,8.130324912608020149e-01,4.820778024069044543e-02,7.423844411305073887e-01,2.068273621428582842e+00,5.329044618314651149e-01,8.763122519676465050e-01,4.169165664353517431e-01,-3.203897085933001265e-01,-8.782107654531867702e-02,-7.609192425154902573e-01,2.469533851147582837e+00,3.132066072177089322e-01,-2.964774830613732259e-01,-1.859473727758184369e-01,-5.440366368211323883e-02,-4.709587213132114258e-01,1.370977727195973328e+00,-3.083710745191478031e-01,-6.351472086539247663e-02,1.693420901654115296e+00,-6.775039796682273963e-01,-3.123553870710198410e-01,-6.044470718561733014e-01,-8.635807323134697677e-01,-1.162635215399779653e+00,4.403049539817840419e-01,2.471688562652332610e+00,-1.907863335264488036e-01,1.585922594339176928e-01,-7.403989196023317287e-01,-7.168887600684163974e-01,2.145463630869990812e+00,6.388003935196648886e-01,1.962896453058844859e+00,1.488919756495014735e+00,1.199651911322527686e+00,2.400479951568380288e-01,3.637412817798199582e-01,3.708289360147974389e-01,-8.374241123117676100e-02,4.808456412957051729e-01,2.880085169777585108e+00,3.657391227094042851e-01,3.331611586308124151e-01,1.555169347107938638e-01,5.029258265762994284e+00,2.420614857681767873e+00,1.470511211920077610e+00,-4.042411937793176091e-01,-5.712256428987220191e-01,1.617885789570113753e+00,7.749687983513133815e-01,-4.684612075804797104e-01,-1.331588676513312697e+00,3.165814774906473339e+00,-1.579484139068360327e-01,-2.415836759026861735e-01,-2.694337268902781135e-01,4.050979722293782670e-01,7.398178215713819839e-01,-1.426866807142987970e-01,-4.308832700255191828e-01,6.649802786623570938e-01,7.955550816883125154e-02,-3.485968787254826173e-01,3.158222709268422079e+00,1.044908328264465558e-01,-9.543894539214767270e-03,-1.573489202450652213e-01,3.135740313787633848e-01,4.054825354593075692e-01,-2.910926716199107034e-01,9.625476366796794636e-01,-1.347307687535661991e+00,-3.836410029705922264e-01,1.370956477005997209e+00,1.013553358458848752e+00,-5.360443753439130266e-01,1.346600469250922583e+00,1.346630026492736443e+00,-1.500885349190379081e+00,-2.629790686367297625e-01,1.529100776000699824e+00,1.019449274977187958e+00,-1.773222006482408464e+00,2.604135711846343959e+00,1.223180532356797912e-01,1.297562341070194858e+00,1.790641969418975410e-01,-4.904407327797671856e-02,-7.820537558989548721e-01
1.094392823455342389e+00,1.980839983573222884e+00,8.297251289122813123e-02,-7.926903590515204101e-01,-2.151008337529740355e-02,-6.181779851748309129e-02,-3.049888481008611874e-01,2.639702238953028912e-01,1.735506869281809417e+00,-3.511423417250439383e-02,-2.709879465169516277e-01,2.843827644852410241e-01,-4.920270997130588020e-01,1.842867915321387828e-01,-1.876642788967742836e-01,1.456224913568613388e+00,-9.831960533387715251e-02,1.372544884675422350e-02,-2.181363475996176138e-01,1.070319307513391549e-01,-8.102395013322944983e-01,1.922866411141260223e-01,-6.896760354841184881e-01,9.486032293126941961e-02,1.556271075458985020e+00,3.062655532441206918e-01,2.829780882128177244e-02,-5.468762736775376609e-01,-9.616556335243219289e-01,-9.918598999100758373e-01,2.615215401804926731e-01,2.253609443440638405e+00,-4.230454913622815338e-01,-1.736480580904341542e-01,-8.759753000895562636e-01,-4.795430164295008124e-01,1.978392085404614642e+00,7.319587982286424044e-01,1.201447632623989126e+00,6.101055478852137615e-01,6.710788191119955171e-01,3.579238813512440887e-01,2.066805473037988117e-01,3.108809777808534403e-01,6.257045872495783367e-01,9.254866478885716008e-01,2.948834109955278393e+00,3.641529592339893817e-01,7.197473249497282621e-02,1.230983250639105187e+00,3.772395879185165501e+00,1.455129598285159531e+00,6.275112853286537451e-01,-1.455775362364400416e-01,1.161813576687786842e-02,1.059591046777250689e+00,-1.985435094071447137e-01,-2.546682317491104630e-01,-1.114564056552165283e+00,7.042866857075846809e-01,-1.760585565325792357e-02,5.127322457677452316e-01,2.552303655168524088e-01,5.845489790846519762e-01,1.274567581588026410e+00,4.963220663398587029e-01,-2.118533722558532117e-01,6.244521584835432959e-01,1.128302308683894473e-01,-5.956131517412704968e-02,2.316208032850852305e+00,-6.732208024287238413e-01,-3.610285867124236048e-01,-1.021267031381440094e-01,4.637953935917783765e-02,6.864176818309080108e-01,9.597274112705650451e-02,2.926919616384096035e-01,-1.276284659662576093e+00,-9.203837058032765528e-02,8.335165790027894150e-01,-5.944279363130658411e-02,-2.610756634193046044e-01,1.393631931492834930e+00,7.047830318273781147e-01,-8.208767271259573839e-01,3.564819880435332045e-01,8.216347918968079922e-01,7.619708375977274351e-01,-6.212160373242018307e-01,1.723093158016633097e+00,-1.017295731630014410e+00,1.526138304051273487e+00,2.367738573144910763e-01,-5.069337340934050307e-01,-1.053020695351676861e-01
1.106281062425647610e+00,2.022330644973776348e+00,-8.884571803766611042e-02,-7.006026936996417875e-01,1.021224680209918689e-02,9.306533789696902481e-02,1.155634748948934365e-01,2.308406107494688220e-01,1.370324614307103062e+00,-2.385509146773131250e-01,-3.437438996123056145e-01,1.456817044497221991e-01,-4.710059305135091967e-01,3.137966752525943037e-01,-2.325920971601160292e-01,1.280145018090836695e+00,-6.160723146130980821e-02,-3.730010839309345072e-01,-2.038880280723702754e-01,-9.297148024672227673e-04,-6.840677916150907922e-01,5.238204805096169370e-02,-8.358824899075973924e-01,1.456708244123965934e-01,1.593064774731960842e+00,5.391068431667848104e-01,-1.017161580904622220e-01,-5.494247799688297684e-01,-1.202576419920269313e+00,-1.127335044401255093e+00,3.572207251368761938e-01,2.111117625322062707e+00,-2.470478735849544472e-01,2.098591807514216256e-02,-9.919560764557109334e-01,-5.354641229858262408e-01,2.141493026709039960e+00,4.953278966729212640e-01,1.214595490801158917e+00,8.545020274490344736e-02,6.691714120281178069e-01,3.865232319830775864e-01,1.664688967250374518e-02,4.179040990003550782e-01,6.392007250136974017e-01,1.035476782898000048e+00,2.642207179398923245e+00,5.696408910690354821e-01,2.258874607140248236e-01,8.953210462410789994e-01,4.055460283719519055e+00,1.699630282489123845e+00,6.139856185309143788e-01,-1.121778873370112839e-01,3.020503628641622029e-01,8.453788475177743678e-01,-5.722794277381638706e-01,-2.929530170112101262e-01,-1.193925731477271324e+00,5.467097234954561014e-01,-3.333899955237850099e-01,3.055449574579170990e-01,2.848930574771846302e-01,7.419889861627637639e-02,1.218066011382851643e+00,5.209073667549474207e-01,-3.083971510220701040e-01,4.847967363998124668e-01,-2.046867768399586174e-01,3.513231746407098344e-01,2.205867598980319144e+00,-5.520638660724098701e-01,-5.280244810840436509e-01,-1.802404654905329084e-02,1.941277506680213483e-01,5.375823535237023165e-01,-1.683358045344258980e-01,-3.975851901369975572e-02,-1.260127136120347435e+00,-3.429704410123755043e-01,1.023194732855787770e+00,-2.478032618698421952e-01,-3.568342454184065260e-01,1.487451454703307974e+00,5.604715348050807178e-01,-8.505147199125281388e-01,3.600262539733268818e-01,4.100606174960012007e-01,9.470723389213441257e-01,-8.784053483693960995e-01,1.441171809377763013e+00,-1.057910397900623689e+00,1.571162534267666055e+00,3.093156584018227351e-01,-9.531218899351729945e-01,-2.816632860125284910e-01
1.111581628505254660e+00,1.008492219468887896e+00,-5.860146922913325729e-02,-1.376081312677540636e-01,-3.256728607196369696e-01,4.046058958919264148e-01,-4.885234974271729924e-01,4.900348807472916235e-01,2.214307825860777790e+00,5.860039533576504311e-01,5.255108866496835951e-01,2.706547052703372480e-01,-4.851091590494346906e-01,8.873325383829587520e-02,-6.345320640588369976e-02,2.203566896570889444e+00,-1.384428849051705379e-01,3.445232054598465488e-02,1.832692910385362584e-01,4.003078367214195632e-01,-1.053972835225788884e+00,5.872315691282825600e-01,-3.075380616451807714e-01,1.692880007979642720e-01,1.088000026463607828e+00,-1.000922919559275925e+00,6.167956801743088024e-02,-5.784714975567414319e-01,3.176414570742520649e-01,-1.490631863521147960e-01,5.817361637203498637e-01,2.468601916679548314e+00,-1.561156294789056986e-01,-5.931102419414049365e-01,-5.670522851488715155e-01,-7.838651359109669592e-01,1.404476293808335718e+00,1.219055264337884692e+00,9.228036465595728099e-01,1.718989558070884716e+00,1.232811112057659031e+00,2.130193248871402045e-01,4.198081663724457790e-01,4.880022256387617219e-01,2.863606753913658931e-01,6.217835963631536123e-01,3.276128056813573330e+00,3.385747028198263231e-02,2.613931434085536298e-01,1.281297024514805871e+00,4.377254373774417395e+00,1.148967979902449699e+00,1.105875427378476772e+00,-5.594358048562315666e-01,-7.346001212622773613e-01,1.364227149524949834e+00,4.477348966637220706e-01,-4.473545963641443191e-01,-5.591751459278805347e-01,1.472944847779280142e+00,1.245044358974790377e+00,-7.814015447750960464e-02,-6.351053720418974313e-01,8.655636662733168230e-01,3.616278834039436951e-01,-4.520169308964004928e-01,-1.311345234215733346e-01,1.265859221602712026e+00,-2.124313585767313439e-01,-9.072707587015580444e-01,3.407476246182358892e+00,-4.842616697092195777e-01,1.470728435319620386e-01,7.013216140246353314e-01,4.186028188515332482e-02,1.484550058061301581e+00,6.199404925321556625e-01,8.577629593151303578e-01,-4.354821642211864630e-01,-3.121680327057052007e-01,2.384298210522394212e-01,4.723891562777719488e-01,-9.401464568027534385e-02,8.700217096029978503e-01,6.364327179942881330e-01,-6.637818261023389343e-01,-8.044918760933500446e-02,2.454743839139529538e+00,6.487416831602597078e-01,-6.445331678848476020e-01,2.576822076273537654e+00,-4.214145446475834333e-01,1.521741235094782319e+00,3.116343154621520339e-01,4.021492301160299321e-01,-6.970306773820234003e-02
1.223802713972795830e+00,1.941016353673120864e+00,-2.842034051334973999e-01,-3.837865652858789556e-01,-1.625498812881605304e-02,8.064138041006288504e-02,-3.564033501118781255e-01,4.515952501282594067e-01,1.372147810089313191e+00,8.695275378998598703e-02,4.739662889751694030e-01,3.449463750645030968e-01,-3.711655765216647640e-01,5.779304119102801618e-01,-2.278767717516572977e-01,2.155581734399654170e+00,4.011518917652924787e-01,-4.148889124179545584e-01,3.050554781848669600e-02,7.400376242402173510e-02,-6.554524588715082700e-01,2.047736897700204728e-01,-6.941106128319418644e-01,2.532292366256981841e-01,1.219150618855390666e+00,-3.502714599755634151e-01,-2.179438331659144801e-02,-4.386764965612146572e-01,1.727687719217474438e-01,-4.483838757259780428e-01,4.535282284067051473e-01,1.814004568033438902e+00,-1.477340302548580675e-01,-4.527354324696498122e-01,-8.317434847643416784e-01,-9.053489304153506945e-01,1.598171172031246368e+00,9.341242586882696486e-01,9.181634897046538901e-01,6.885445835902903600e-01,8.590508857363945427e-01,-1.008721355225983274e-02,1.144193179502168839e-01,6.814878404217310504e-01,1.736994036888389048e-01,8.972892199337769714e-01,2.969463611360453115e+00,2.737483160092983869e-01,1.827740449230366160e-01,1.622093857522998839e+00,4.296029172125814810e+00,9.761306010711194858e-01,8.989502151647940087e-01,-5.050351091526738001e-01,-1.116129778731925759e-01,9.499931110381694133e-01,-6.383119971713319130e-02,-1.712905557022698366e-01,-1.071156889836986759e+00,5.329191150392562637e-01,6.574818408274228920e-01,2.016400672702154395e-01,-1.716768054427488810e-01,4.697302206869972685e-01,3.933464604991845359e-01,-4.375592436207003111e-01,-3.395769599310264342e-01,3.664842741777036839e-01,-3.030716663110266662e-01,-7.005387369290566602e-02,3.062798868275967479e+00,-5.788997340930550628e-01,-3.365166014625078916e-01,7.343250154615101888e-01,-3.305577478325934238e-02,1.392470496556235782e+00,3.463716159771632053e-01,7.578604382231054482e-01,-4.041248481865854503e-01,-3.683724442373151886e-01,8.118047832139675402e-01,1.409174033263123071e-01,1.995593615184365621e-02,7.612713285073013925e-01,7.200902035167189297e-01,-5.234049198035407580e-01,2.001284151925349364e-01,1.252532937763594756e+00,5.824291586129399789e-01,-3.882279605368059161e-01,1.929145168105525165e+00,-9.651864691090431547e-01,1.496987250027013605e+00,1.108316967089650884e-01,3.238884786268914628e-01,-7.688103061976536701e-03
1.180577975274262004e+00,1.746707857581298651e+00,-4.742942465702362775e-01,-2.138773234547259317e-01,-3.287783462480935170e-02,4.421475791567085478e-01,4.486387814806528929e-01,3.427217046943947798e-01,9.339068811575471640e-01,-1.902691344167023180e-01,2.086371017133362427e-01,3.446232071038422828e-02,-3.860217239781173482e-01,6.138593412775260605e-01,-2.585615317412360836e-01,1.678175924826340815e+00,2.083149228149753784e-01,-9.539708521852370282e-01,5.902023666974059307e-02,-3.573538306497817812e-02,-5.539878815209009488e-01,2.573790587460300650e-02,-8.679694894282696804e-01,3.033229547749589639e-01,1.319903131237552429e+00,4.989979437671609314e-02,-2.300232454431684059e-01,-5.065134172627568931e-01,-4.768732125625362306e-01,-7.327571789362008481e-01,6.365638192679882179e-01,1.810244270027803415e+00,1.391940711558815047e-01,-5.715922163240000353e-02,-9.863320888799977926e-01,-8.969356199731067791e-01,1.917037855935761259e+00,5.232353525547912554e-01,1.010607831901670028e+00,-5.214167490731291821e-02,9.137812803725136046e-01,1.824051638390976338e-01,-1.589085504249439507e-01,7.530645021229422920e-01,3.251234154187079839e-01,1.042019648816919553e+00,2.442060820178036273e+00,6.096465729173570214e-01,4.789674852733949439e-01,7.984249069387071573e-01,4.750277337374823716e+00,1.587820414903032828e+00,8.563661187727213964e-01,-3.890758184898258643e-01,2.941588737900147077e-01,6.786258427513636171e-01,-6.669061156045369421e-01,-3.309037643569932019e-01,-1.073992296028916105e+00,5.150384610372296113e-01,9.267374359218846780e-02,-2.314205683562156057e-01,-1.632082810960976682e-01,-3.800971829239426780e-01,4.474366185614679914e-01,-2.102319465796278486e-01,-4.528380650031906818e-01,4.013184485715375338e-01,-8.146446078785778422e-01,5.105670850889367784e-01,2.783823259916494486e+00,-3.363870573909460426e-01,-5.189586747501655495e-01,7.368236470928559712e-01,2.807777650085472865e-01,1.003481190812467894e+00,-1.460427711266873707e-01,4.852815252700587445e-02,-5.429400596443606508e-01,-7.907172689652557374e-01,1.006872769321765615e+00,-1.799578812135175787e-01,-2.482929481094675872e-01,1.106356624236205510e+00,4.080045518642552160e-01,-6.788416443605120865e-01,1.661512426087754790e-01,7.061353899792497391e-01,9.908406549061437030e-01,-9.776129697757252046e-01,1.507107603085080738e+00,-9.002154344682236076e-01,1.578063732232860339e+00,3.349225739270695890e-01,-6.641811368340704291e-01,-3.839904475552682328e-01
1.335469139042605224e+00,1.177264444458807180e+00,-6.696525996635050992e-01,2.538410922837632810e-01,-5.385405117782365858e-01,8.973234158099394620e-01,-5.592507540232144470e-02,8.789682996097135659e-01,2.240825978925452766e+00,3.920275774792775225e-01,6.883674882752273128e-01,1.926840939003689746e-01,-4.070022657029553348e-01,4.078540346740789913e-01,-1.950841333111283382e-01,2.496494617083223844e+00,3.275430199875794535e-01,-8.017467466709971013e-01,2.467087539741462110e-01,2.265901596239963678e-01,-8.060096064982994468e-01,6.981808547593628678e-01,-4.775320462875483618e-01,2.043885202422609515e-01,9.649995639693098592e-01,-1.130971767085270363e+00,-3.822363090181348788e-01,-5.208667870056542526e-01,4.826232824413363431e-01,-8.603200056546844721e-02,9.007761976765232825e-01,2.104384567165237918e+00,2.709042974965349404e-01,-4.428659995976596542e-01,-7.738964408288653285e-01,-1.063351065888308744e+00,1.789089549064169171e+00,8.130878121450154650e-01,6.643571870981244132e-01,1.022201607642085452e+00,1.596593544415809252e+00,9.018749047177460065e-02,2.567865812014563098e-01,9.808458695617017220e-01,-3.429160201432912558e-03,6.699562543578305718e-01,3.056512574195018317e+00,5.377992684108900967e-01,6.694696027404886118e-01,7.483097417475540469e-01,5.479211900293158521e+00,1.524801161823846174e+00,1.670011374441858099e+00,-6.266666515644311319e-01,-3.130621823694917927e-01,9.279279481291509146e-01,-8.781907894810880855e-02,-6.958919586486775888e-01,-8.570313714362789437e-01,1.590887617026840672e+00,8.618718555382673951e-01,-4.582054218117503352e-01,-8.680825322145835354e-01,-1.454744862244206072e-01,-1.969931510965798882e-01,-9.044343142616575459e-01,-1.625961298901699159e-01,1.042134913025962728e+00,-9.225780602207417358e-01,-6.614024516063752301e-01,3.955331734889998785e+00,-1.549847314008719890e-01,-2.055247939737179230e-01,1.028853702000020132e+00,4.628453388012137015e-01,1.352017469259844118e+00,4.400436735178036574e-01,5.589442772696946449e-01,-1.609436444983169956e-01,-8.018365855835604128e-01,7.507768448735742117e-01,5.135172610006937255e-01,-2.477817677020958398e-01,6.016339526909662005e-01,4.926615557155266112e-01,-6.288537130912850159e-01,-3.671589417516076259e-01,2.238108473557129052e+00,9.994439167037092453e-01,-1.579492560001630297e+00,2.642901311858224300e+00,-3.227454962674028982e-01,1.917822884680925544e+00,3.823178462761701035e-01,-2.837579319458065630e-01,-4.244885677140461389e-01
1.094181981475995658e+00,1.482533409012675829e+00,-4.314931923651890155e-01,-2.137173136180295918e-01,8.115316481427076178e-03,3.599484402286151075e-01,3.242238913439303705e-01,2.405821281879345630e-01,6.521190570427289890e-01,1.326043964881865045e-02,6.281458373272941209e-01,1.000672866834708269e-01,-3.402147750458501818e-01,6.019858923458863975e-01,-3.067980058688930534e-01,1.934502253305658392e+00,2.385342994022511820e-01,-7.848736907473402580e-01,1.393731556046934328e-01,-8.166296857808723331e-03,-5.342684978018843456e-01,9.851166281858036999e-02,-7.512312832773831994e-01,3.479574961879688955e-01,1.280155069065989304e+00,-2.480552666387480787e-01,-5.541049058779509706e-02,-4.978138461928250380e-01,-1.033460241695953741e-01,-5.956290589891266585e-01,5.677917165948080935e-01,1.810328419437291281e+00,7.676266127476244483e-02,-1.721495251017685635e-01,-8.487275194418592017e-01,-9.759409914400111186e-01,1.560238918530118646e+00,7.952137984793027359e-01,1.180958189317545148e+00,4.028025479073701343e-01,8.324963178261481911e-01,6.706864101871368167e-02,-1.369131076970691585e-01,6.500926643124942395e-01,1.816991814248559711e-01,9.653299993495287890e-01,2.483230696436671714e+00,2.987468086262386469e-01,3.446337703010490805e-01,1.077223566902341112e+00,4.554777033060446456e+00,1.333598745022835708e+00,7.371311178429469368e-01,-5.484546776967754722e-01,-3.437022136069667333e-02,9.324680881980536018e-01,-2.102017926708261708e-01,-1.593935147130132179e-01,-9.346223045492000336e-01,6.830087222143486070e-01,5.326122039746749026e-01,-3.035147558647763311e-01,-2.723720054642057020e-01,4.521532354216772909e-02,2.929579243928099874e-01,-4.556457283553458915e-01,-5.680772332921837364e-01,3.547328313935669830e-01,-6.415115951125153204e-01,4.496822328744768948e-01,2.869412788522082369e+00,-3.486026625886929353e-01,-2.806543088761952465e-01,9.364890448151526048e-01,4.541715054321553147e-02,1.336735095564531850e+00,-6.073648883136645305e-02,4.832910542985811020e-01,-3.135354939210556191e-01,-7.211612647968035361e-01,8.234789166641623970e-01,4.955268265952050832e-05,-7.986036627014569955e-02,9.981288561996221054e-01,5.811113398208069825e-01,-6.772267366783517595e-01,1.919200692650879503e-01,1.005160153019239111e+00,7.645358045898611454e-01,-4.971609321812953675e-01,1.599093082158860701e+00,-7.836626961563822880e-01,1.270974270507904791e+00,2.301897486010598126e-01,1.383344977135448628e-01,-2.629814697546613012e-01
8.237295592478087736e-01,4.055336078036337888e-01,2.836887870204882200e-01,-2.110068496609908695e-01,-2.285629648475384079e-01,5.704582829092859075e-01,3.177781167296364617e-01,-1.710358389614986818e-02,1.787137607475647094e+00,4.144627854801948841e-01,-1.306628626898344581e-01,-1.563536844556732419e-01,-6.200629272218423083e-01,-2.786081399575363604e-01,6.099682465594347125e-02,1.139700402096795351e+00,-1.011853151344814794e+00,8.860229133396049783e-02,1.739374861848355935e-01,4.655188672743057476e-01,-1.231711464148052881e+00,2.834921411742493680e-01,-3.479376770153168597e-01,1.776070973604284842e-01,1.348440302263464563e+00,-3.326683961144337176e-01,1.490187806609428733e-01,-7.719354660870233475e-01,-9.070287448623239879e-01,-6.212286330368268494e-01,5.928414799945203040e-01,2.967506320096835903e+00,-1.245250034397934746e-01,-1.335556706789572945e-01,-5.772058945099498573e-01,-4.487639462972073945e-01,1.569781872203545037e+00,9.798172201893720068e-01,1.283529552759427039e+00,1.388917193457961385e+00,1.065752914337991797e+00,7.061884178963313552e-01,2.276152604292223658e-01,9.643609388089949275e-02,8.584866482556003930e-01,7.502533969314475470e-01,2.745518630791472070e+00,8.125915205324586721e-02,3.653324769727434029e-01,3.906849044195196408e-01,4.065327413428150294e+00,1.828908167306899202e+00,5.718412932605179133e-01,-2.866346938561343261e-01,-5.847425497482415802e-01,1.409487429373458278e+00,5.669591227318587778e-02,-5.541746625689625283e-01,-2.012135154912745305e-01,1.518178943286127902e+00,7.655663928028979548e-01,-4.094408444246105949e-01,-4.668036502108156016e-01,5.386749271728559219e-01,1.027481436073117038e+00,3.996913000585172182e-01,-1.979069499767341922e-01,1.746980316513326859e+00,-3.153562579021196299e-01,-4.349544146119175281e-01,2.501601884556545752e+00,-4.073862807535083008e-01,2.606001055517223053e-01,3.154372910916946049e-01,1.878101704337193367e-01,9.458069918911560237e-01,7.877606043707868766e-02,-1.593957324873918058e-02,-9.918444293603987383e-01,-4.800307577185110031e-01,-3.619012250353159654e-02,-2.053313762209801885e-02,-4.253293922817293904e-01,1.714086674869062632e+00,2.472184195619919755e-01,-9.751169662624877832e-01,7.602733910916359417e-02,2.021924376065825424e+00,1.003602612891543622e+00,-8.205908915856534591e-01,1.995231291545826124e+00,-3.207073977781957907e-01,1.341091124600286122e+00,6.538704417485277087e-01,-6.232440422413647596e-01,-3.470322630971985345e-01
9.782319048187694266e-01,4.394314083099087886e-01,1.506185760496368820e-02,3.066709226806574318e-01,-5.117632645008553249e-02,5.187507131952271422e-01,2.187905695270053741e-04,1.111429175363689570e-01,1.227134124068666843e+00,6.110172803661546581e-01,8.396380541289084620e-01,-4.983168677019145232e-02,-4.841490624593474679e-01,2.877566942318104393e-01,1.499639797988734369e-01,2.042697058702001911e+00,-4.270463476795930413e-01,-2.693426037773244408e-01,5.638513133171781933e-01,5.178243740615986468e-01,-1.143988864680286488e+00,9.911373200045742182e-02,-3.423273286931039494e-01,4.441250994365478766e-01,7.922853138484384772e-01,-1.254728543333723412e+00,2.608032756572584154e-01,-6.074450588586874922e-01,9.184576708581175808e-01,3.141279503980474175e-01,7.892570296797263296e-01,2.359080067894026911e+00,1.523247583839416608e-01,-7.193481881571488490e-01,-4.491921128964829757e-01,-1.014043247312578000e+00,7.944886914196094274e-01,1.472410404947413820e+00,7.428905319518039896e-01,1.653016435106387627e+00,1.207331027731352702e+00,1.695483439966772865e-01,1.314381313338959800e-01,5.421966106661257889e-01,3.312272983169572971e-01,7.443870139886757942e-01,2.903945165667664696e+00,-2.296674601056835074e-01,3.822251784215770498e-01,1.379272175398173150e+00,4.382689039956062516e+00,7.580386894406008214e-01,7.335061864529398568e-01,-8.139648270509975969e-01,-8.545420046578700024e-01,1.286542679585700899e+00,3.044764762417426218e-01,-3.301706772141149715e-01,2.309722951409964864e-02,8.306236474869258535e-01,2.058424048659239780e+00,-6.719189859127355779e-01,-1.038108709146604358e+00,7.217982557971900359e-01,-1.638844994682284728e-01,-8.932786082813521933e-01,-3.318391263031477134e-01,1.446928416374542614e+00,-7.653585844974641894e-01,-5.623346389226216990e-01,3.460482865925605722e+00,-4.889109084169967478e-01,3.716428687467763781e-01,1.592283480820625874e+00,-1.080549727932986065e-01,2.202574820205675188e+00,6.525236644315601797e-01,7.376775618071638174e-01,3.678779134894205605e-01,-7.195559359825823842e-01,-3.550905710555678496e-01,1.402758936745130969e-01,1.255248115955423516e-01,7.545885773802814001e-01,2.016465052560775240e-01,-3.783176774178489410e-01,-1.059783645376499717e-02,2.769490117203752710e+00,5.584897091746106046e-01,1.751796182007414604e-02,2.226239506606082053e+00,-4.338872768508056366e-01,1.235696613721170678e+00,4.452922945615369610e-01,8.715146577148766838e-01,4.301291137185309088e-02
1.224326962506506966e+00,1.007346610422339195e+00,2.181546275542278202e-01,4.812397482865027332e-02,-4.587254890745145475e-01,5.156038851702083869e-01,-7.541908758123705425e-01,6.631076655735580472e-01,3.372129363344296138e+00,6.347501751281271476e-01,-1.595409377147292695e-01,1.799568440881664511e-01,-6.664107245854840045e-01,-1.400923280222839962e-01,3.030685902872604087e-01,1.888818956078525346e+00,-5.521253453736296724e-01,2.631199259352078323e-01,2.220426026843979050e-01,6.957341588890628703e-01,-1.501650431339135450e+00,5.466623482157348946e-01,-2.242221713691409102e-01,8.763998155408463109e-02,8.880898635818710307e-01,-1.092105736236572033e+00,-2.741557785446380180e-02,-6.452169906456625137e-01,2.877032465051476695e-01,1.486404215359140579e-01,7.537225180827373805e-01,2.847779838244219430e+00,-1.356260496116313274e-01,-8.023349421905088263e-01,-5.532577614918575692e-01,-6.015802792768778495e-01,1.607714343287300673e+00,1.202945671928579152e+00,3.333640661658492377e-01,1.843632497927771619e+00,1.585458012499742164e+00,4.678383821657582375e-01,6.645372493085777155e-01,5.629197960982915694e-01,6.380258841791318636e-01,5.798358897812991852e-01,3.660190552425659050e+00,2.328489678159459397e-01,4.247801233057171277e-01,1.162976760530976872e+00,4.453593463372182981e+00,1.157965569713432119e+00,1.358146316071637827e+00,-3.988872637782516217e-01,-7.110029211101545066e-01,1.193486606950310946e+00,7.826396704088617318e-02,-8.462705819202186452e-01,-3.010878756603033723e-01,1.309346189585222975e+00,1.382968651531495397e+00,6.214901816994711226e-02,-8.203701888095856765e-01,7.604131924019279509e-01,4.839978886758815602e-01,-2.030284842790233135e-01,3.019309874825621964e-01,2.012377224856396918e+00,-3.685832151940355295e-01,-1.627800271649964658e+00,3.627525803067462640e+00,-6.358786531746631887e-01,1.204815295812926706e-01,5.657291351601916318e-01,3.182383245326996235e-01,1.375480675015694487e+00,1.030668543865310927e+00,3.801368537659395308e-01,-5.608031855202485483e-01,-2.452188368501956317e-01,-1.343933077934135190e-01,3.277700673024881439e-01,-2.470489233378351801e-01,8.774056041004072437e-01,2.115399632222788595e-01,-4.812863841278007815e-01,-2.342491949841066234e-01,3.066389904621603435e+00,8.467825949677154629e-01,-1.139679710043169703e+00,2.933767948971686579e+00,-4.617654347053298247e-01,2.095759442796745642e+00,5.683336448737068558e-01,-4.845515235368690887e-01,-8.515430111779742628e-03
9.278622564862469835e-01,3.053092472439303817e-01,-2.958188506964734565e-01,3.565913423770776802e-01,-1.607684881598480109e-01,9.858273834727033780e-01,1.027067637197722316e+00,4.374584486985391707e-02,7.967726523288908291e-01,2.185074389080533530e-01,4.353693959645036360e-01,-3.767250949494180823e-01,-4.870201938869916924e-01,2.628529648686019349e-01,-1.869810300860919039e-02,1.432753573217733223e+00,-5.909197052382360038e-01,-9.271029654416319543e-01,4.636244465465617637e-01,2.894683737154365444e-01,-9.209286774550338173e-01,3.481041670513262964e-02,-5.720841422850905245e-01,4.238228925741642783e-01,1.083110878736208704e+00,-5.794735661517993464e-01,-7.998605423219407040e-02,-6.966574291877951630e-01,-2.633137211191762805e-01,-3.150422967804339391e-01,9.461287486864395913e-01,2.385023624272196052e+00,4.378765945721652675e-01,-6.712479814573685255e-02,-6.999571047722230599e-01,-9.253000352342917179e-01,1.430214940412416702e+00,8.076359697428636686e-01,1.055719483573721362e+00,6.479478677944676690e-01,1.241201274182452963e+00,4.475492580050032254e-01,-1.827102583010080106e-01,5.807406851459859798e-01,5.028571541501681841e-01,9.037544834245742065e-01,2.224451072057269219e+00,2.952757735693034014e-01,7.332095574502279778e-01,1.508197799595220046e-01,4.989204143859856444e+00,1.797751436441297423e+00,7.487861186667745805e-01,-5.732250940130529937e-01,-2.661518899449143438e-01,9.844443502550077607e-01,-4.228396069763886711e-01,-5.468946171709753168e-01,-1.966803607917261276e-01,1.110656170224412209e+00,9.476375355718399396e-01,-1.111925892250399617e+00,-8.582457611369156414e-01,-3.955308144143391269e-01,1.180839251602237017e-01,-4.107374079907522013e-01,-4.834101738232637890e-01,1.368355137095078833e+00,-1.252703903133422170e+00,2.320467270382458314e-01,2.981017596768803735e+00,-1.151064310312773509e-01,6.543902305812185349e-02,1.269734128593106526e+00,3.500775788355622309e-01,1.389387100652064166e+00,-1.329340054346741518e-01,-1.716407899354710498e-01,-1.306450600129596129e-01,-1.177780476056289771e+00,1.582767601167950344e-01,-1.742143027981061798e-01,-3.265776821306495270e-01,1.327231807293619781e+00,-2.820676048312353856e-02,-7.530570320404321727e-01,-6.154387542650530118e-02,1.816728904453593696e+00,1.150674376614598593e+00,-9.860412389380242004e-01,1.702221079093259259e+00,-3.034630294437953291e-01,1.349485967453273538e+00,6.931751101030302342e-01,-5.840033985115602455e-01,-5.514924378069636646e-01
6.394578054920776466e-01,-7.778584699526641666e-01,2.566973154459680773e-01,7.360890820829535386e-02,-4.850588055771449802e-01,8.204782264885137621e-01,8.978132655717452337e-02,-2.713589057831020113e-02,1.805141681858387415e+00,1.171719732000703562e+00,9.652273084603470998e-01,-5.105209302382415770e-02,-5.519802574918583060e-01,-5.489138592106823644e-01,-4.231996329249565481e-02,1.934360063681627162e+00,-1.085388631972536100e+00,4.755568668025773604e-01,4.516452633878227374e-01,6.609225824202978883e-01,-1.331245852118083217e+00,8.552871602686282770e-01,1.392300319468684489e-01,2.044131724493739866e-01,1.162052948728039548e+00,-1.526658771319356900e+00,4.060538391624641807e-01,-8.258143952381393760e-01,5.067384635216076738e-02,-1.404776687542423907e-01,6.289284365655840592e-01,3.293348096948657044e+00,-1.295905984102871389e-01,-3.999712333229727412e-01,-1.638287560228375295e-01,-6.442475497975674870e-01,8.265112111460956035e-01,1.614917972785152367e+00,1.649766198523964000e+00,2.916290465832349632e+00,1.291164297771880243e+00,5.440613976371631022e-01,4.525718960556893156e-01,-9.238822928947081070e-02,4.546426931342444355e-01,3.731908676631225386e-01,2.984900020977141466e+00,-5.844423443581175937e-01,2.639111738007126062e-01,5.296549049150233168e-01,4.145951723034507097e+00,1.594922856806118006e+00,7.191606168997914939e-01,-7.050769053509300388e-01,-1.620922102866532155e+00,2.148317055192263236e+00,1.317160791388821917e+00,-4.566443758884349835e-01,2.875066527939491579e-01,2.774400327251192788e+00,1.941234976330816764e+00,-8.968189016998352470e-01,-1.104324368191233363e+00,1.406518912039361080e+00,4.656941843576420936e-01,-3.330370016146565471e-01,-3.339631915429622233e-01,2.141894405269469726e+00,-7.225604986712474975e-02,-1.079834136992113836e+00,3.164623029421263389e+00,-2.037626070282207436e-01,1.001786433045607438e+00,7.887984215213695860e-01,-1.195916930656138466e-01,1.640291296536267263e+00,3.577606332179657511e-01,9.841806659674847690e-01,-4.633662285503850065e-01,-4.463598393335668768e-01,-5.667362339485626510e-01,7.170773622760784338e-01,-2.081536114859354192e-01,1.453624789692906427e+00,6.111687518598376556e-01,-1.120540415489898800e+00,-1.970541711472305058e-01,3.434930608814330988e+00,6.818775299089762099e-01,-3.557547798955674745e-01,2.736739147666412464e+00,4.138923730521514299e-01,8.047080227318723633e-01,5.591840701338118835e-01,1.001714717990134673e+00,-2.932155729638989961e-01
6.569407969503706646e-01,4.378658507553562229e-01,1.423281860183090997e-01,-6.471411942362732539e-01,-9.432600977940494569e-02,2.227338197670017117e-01,2.055371596142308577e-01,-2.141832940054863021e-01,7.376991629461300271e-01,5.274004320005593049e-01,7.141569782038630354e-01,1.221767289883955304e-01,-4.180809977890941331e-01,-1.669936379264178039e-01,-3.854861523179677896e-01,1.644098369676750826e+00,-5.435880119578897496e-01,2.607005118078436490e-01,4.287020525425928180e-02,1.776593958398558215e-01,-7.802626152970110196e-01,4.987043819066535599e-01,-3.143793246208311798e-01,1.940780727830697661e-01,1.643851764020805017e+00,-3.235938468680684132e-01,3.944328115943519508e-01,-6.907004036594346363e-01,-8.218374768757272797e-01,-9.874596702681616156e-01,2.213847253338599441e-01,2.667675094598700447e+00,-3.953562836536674285e-01,-1.056539403466574822e-02,-4.965279317292354833e-01,-5.570291343631873504e-01,1.231985720190160505e+00,1.194462952766566888e+00,2.094517908167422338e+00,1.733202688412101233e+00,5.664573127453416124e-01,3.903267634444535505e-01,1.271224038372096576e-01,-1.646301400677359639e-01,4.422124115420010826e-01,6.958706890630917963e-01,2.573763611517075667e+00,-3.575677425789927644e-01,-3.710506328485725647e-02,8.479781130596816263e-01,3.588275016740685608e+00,1.647766701175221948e+00,2.317406797697617871e-01,-4.621878885593674324e-01,-8.734913135077750912e-01,1.864532733316555557e+00,9.050899450239435762e-01,-5.870477874032886678e-04,-5.168543994977667921e-01,1.929660035292939391e+00,7.471812889572785332e-01,-2.833218860069959266e-01,-1.515140566792069488e-01,1.224685110697478763e+00,1.088380140520452066e+00,2.111470853398473846e-01,-6.404210958742269089e-01,9.094601364866252702e-01,3.148236377261983687e-01,8.734561542834862191e-02,2.205116904560977531e+00,-3.528494051541188337e-01,4.362779911670151556e-01,2.289202015632190168e-01,-3.116281499158459201e-01,1.094723511572324615e+00,-2.298259637963731006e-01,8.960304979455762098e-01,-1.020172137800853918e+00,-2.404128929136189197e-01,3.135743976478936323e-01,3.468313032948668884e-01,-1.744709492385157212e-01,1.700942031590503278e+00,9.837243313429675506e-01,-1.239141249315450333e+00,3.022792997814277571e-01,1.527913195310800054e+00,5.787075384186823879e-01,3.297925113753125137e-02,1.792587448993338883e+00,-2.513007226226456337e-01,5.624896815219013746e-01,2.439340132745791145e-01,8.554938929912556667e-01,-2.607637651583424865e-01
9.717386585630281015e-01,-4.504484891341739017e-01,-6.039063238965141078e-01,7.887452454289862747e-01,-6.612746361966639341e-01,1.663969295044850361e+00,1.232108553175974563e+00,3.939124658738691886e-01,1.575173200896630821e+00,5.627900363717748267e-01,6.988412262246201934e-01,-4.507197795491633130e-01,-5.061501285789679061e-01,8.756316928295856949e-03,-7.244507387738696735e-02,1.775211055256324943e+00,-6.695345411257449530e-01,-1.109174295960384082e+00,5.930351898061405613e-01,4.031396175449124542e-01,-1.024377294567534236e+00,6.044305642030242121e-01,-3.184505362996917777e-01,3.343208587787923625e-01,9.626059343973252247e-01,-1.262883639412186954e+00,-3.498401474008033807e-01,-7.828655651793621217e-01,-1.318681880306253884e-01,-1.283670521254358654e-01,1.248814716927667323e+00,2.728276332852769492e+00,7.017629230872328705e-01,-5.657148193149774684e-03,-6.111591791233474957e-01,-1.006279006456071379e+00,1.595832607186528973e+00,7.367446244640654118e-01,1.047237067953748602e+00,1.144842103718937576e+00,1.825434861201646886e+00,5.485694102089904156e-01,-6.555224971147001478e-03,7.207734346643911438e-01,3.231917071684998199e-01,6.481195415766277668e-01,2.326912772827568254e+00,4.397819929018335627e-01,1.074876808133107264e+00,-6.397670361591384358e-01,5.899318950381367443e+00,2.363190646824714136e+00,1.388767798449457747e+00,-6.643497070269762661e-01,-5.631263439669189630e-01,1.131721436099224043e+00,-2.084728958727140036e-01,-9.558479067552330122e-01,-5.091268524059633371e-02,2.334667190052480912e+00,1.061287689958563929e+00,-1.636586450788775515e+00,-1.396590464938690435e+00,-7.319933055471624650e-01,-2.587691110660332861e-01,-7.257985491444565174e-01,-3.619482704317813493e-01,1.933364659804519103e+00,-1.577299880630105955e+00,-3.168384239295617411e-01,3.668258193574403414e+00,2.792711251496930447e-01,2.630701124568726179e-01,1.347396291118837519e+00,7.212575359133069908e-01,1.258234539974214972e+00,-1.138382055075039534e-01,-1.965451039428697255e-01,-8.550515158881011324e-02,-1.449006257843777679e+00,1.483205979963704291e-01,2.779698726538367692e-01,-5.796532993704766046e-01,1.282025142009044050e+00,-6.070077493549530523e-02,-9.786099131566896592e-01,-5.453744607942696554e-01,2.675519445231723026e+00,1.474146454243871807e+00,-1.986108799381054668e+00,2.381336717349608278e+00,3.531387505462955101e-01,1.590090553154785313e+00,8.834337691790059566e-01,-9.461699194062482832e-01,-9.371425176594625484e-01
1.057606729734543283e+00,1.269608991380919871e+00,-4.962441617162560714e-01,-2.194165271142979878e-01,-8.417127198960104584e-02,4.065934617752748892e-01,2.463746267897919950e-01,2.783226430486233083e-01,6.556868431153479726e-01,1.863171516087506197e-01,9.393094674269817368e-01,1.784489167956425648e-01,-3.002066674435447946e-01,5.395804203390073273e-01,-4.104693816991196176e-01,2.194466596894532717e+00,3.182354480409877451e-01,-6.941399115677787668e-01,1.507591565202517636e-01,-1.639139333961419503e-02,-4.864009160750916161e-01,3.171773090206750911e-01,-6.395941913989857674e-01,3.259878136211831201e-01,1.299108187187124619e+00,-4.970558014604575248e-01,-2.025530259181948511e-02,-4.988025877552562104e-01,4.849001095672500483e-02,-5.802184143641739844e-01,5.345259396529949969e-01,1.855153715157898286e+00,4.011843539798176650e-02,-1.878043790033971372e-01,-7.697885658295487987e-01,-1.018773973651700526e+00,1.449260112477852136e+00,9.067202754483540961e-01,1.365582797878913679e+00,7.574452858996896243e-01,8.579804115565334843e-01,2.110881090960081696e-03,-7.468597830733086917e-02,5.963664127282122251e-01,2.808236394924978896e-02,8.608841025905263900e-01,2.540313277535386050e+00,1.600831596306227511e-01,2.935961191228796396e-01,1.091823476247727687e+00,4.591793705274297643e+00,1.345128525042752043e+00,8.080066305374803415e-01,-6.355840620139154851e-01,-2.662712492382278695e-01,1.137507261554858928e+00,1.528892950676230267e-01,-1.107609566426540348e-01,-9.332769161344929287e-01,1.112216194346606901e+00,6.785392896151903885e-01,-3.690489354154197765e-01,-3.558563544952267899e-01,2.661648850163575997e-01,2.034807587966769304e-01,-6.111791738118370620e-01,-6.270732677748585004e-01,3.338850974678495565e-01,-5.017801717317872390e-01,3.365503142014764082e-01,3.008578455502117777e+00,-2.694501378711908757e-01,-1.333764481238114974e-01,9.487467868965981932e-01,-3.112716341892030752e-02,1.412588995979089379e+00,-5.431609997266767520e-02,7.941214221995871458e-01,-2.787611322125677082e-01,-6.763779686547857217e-01,8.335264102019724897e-01,2.470968170989863433e-01,-4.507581235503765882e-02,9.476916068346998845e-01,7.796303629220748821e-01,-7.780537188289529116e-01,1.259452255496739670e-01,1.229231548110202965e+00,6.849576876193811392e-01,-4.422890960195994259e-01,1.788833140346913986e+00,-5.903773408434818126e-01,1.117768647300114271e+00,1.603867596912891824e-01,5.586084133364974669e-01,-2.845545201408271607e-01
9.242388795791676159e-01,5.329267078261453738e-01,-2.003297308754249384e-01,-2.581934945712294205e-02,-2.183622710707880943e-01,6.425712582146443363e-01,3.539952667623382787e-01,1.524180404980407522e-01,1.135224250182804928e+00,4.425734296606893547e-01,7.035301024839617501e-01,-1.843512519735525379e-02,-4.352644938502439054e-01,1.448972429727616862e-01,-1.851163964887249380e-01,1.871833435909678878e+00,-3.267020966640900026e-01,-3.887446957915598467e-01,2.837501434978695891e-01,2.605807600642127131e-01,-8.607467005700026874e-01,3.860924374245249258e-01,-4.153872895242773922e-01,2.961998196752416712e-01,1.218395729279667661e+00,-7.411172532877940977e-01,7.030326113781314168e-02,-6.419544034205160177e-01,-1.062492180125069741e-01,-4.150695481711850210e-01,6.549348099470631013e-01,2.415844458243745940e+00,6.687419633595709234e-02,-2.184265654027759962e-01,-6.003784489809975700e-01,-8.505354062004204518e-01,1.334703321624581385e+00,1.050329757372063577e+00,1.325071077589444313e+00,1.294942277678077014e+00,1.078830661239404964e+00,2.952257166897190310e-01,7.013033875876681367e-02,3.970147914446799375e-01,3.154064977179723006e-01,7.430117484914283699e-01,2.624938324057709327e+00,2.712844968632082548e-02,3.932232780366813896e-01,6.978699171083107000e-01,4.534427119514601756e+00,1.544780229337685995e+00,7.789282638142812631e-01,-5.955696717447407362e-01,-6.022346191787956160e-01,1.351980015262958412e+00,2.728660055521695549e-01,-3.460938696454973762e-01,-4.304521646668530988e-01,1.531018874692375409e+00,1.028982579690782773e+00,-6.310436735584418200e-01,-6.485324327721858628e-01,4.092018834755211665e-01,3.300130069110857045e-01,-3.992100283261765803e-01,-4.628961759135466481e-01,1.128951412157529255e+00,-5.450894659839445877e-01,-1.284554631912928624e-01,3.011359537125898989e+00,-2.425412736450935081e-01,1.975105652072744467e-01,9.033223980497906425e-01,6.661111352050634593e-02,1.402916853199847935e+00,6.122566765804787758e-02,5.414311105036677674e-01,-3.704147564112025837e-01,-7.009730385121952789e-01,2.837369705879560500e-01,2.426648107070195626e-01,-1.864786544734866047e-01,1.209006777977249758e+00,5.084569430947394331e-01,-8.614896251514155834e-01,-3.525774329398823070e-03,1.961513835759565616e+00,8.221609694886730102e-01,-6.108187616562262834e-01,2.036298880065115391e+00,-2.779079906721850790e-01,1.153974826333437953e+00,4.186432989017727646e-01,2.604985317000949041e-01,-3.458131983150501965e-01
1.183571699897297602e+00,2.589293606272905723e+00,-1.167155021599640824e-01,-8.784760869873542433e-01,1.848505184069840768e-01,-1.958981451123644191e-01,-7.448623158388423260e-02,2.411037874201393816e-01,1.119214147831768980e+00,-4.273567751381693869e-01,-3.592440135978854365e-01,2.680217916858145255e-01,-4.214870255148298606e-01,5.486770726697129952e-01,-2.773284202868390169e-01,1.352510457797127419e+00,2.422131690613126831e-01,-4.263040857105075410e-01,-2.926456025455974053e-01,-1.192729975916028140e-01,-5.384944164913588738e-01,-1.210001409884581824e-01,-9.897213076656738995e-01,1.722394689309608151e-01,1.620778599508445161e+00,7.812598896832131379e-01,-8.135613128690621920e-02,-4.596936015187405578e-01,-1.099138877091686339e+00,-1.184299063657965112e+00,2.404142274799056789e-01,1.790023247649728422e+00,-3.332208899239281208e-01,-3.850185510273479439e-02,-1.086975139194485296e+00,-5.831881588053391408e-01,2.159286831942200280e+00,4.671952139460786024e-01,1.139289109686216994e+00,-2.459955211992641555e-01,4.647276521984147202e-01,2.324133266603706505e-01,-5.127705575884948519e-02,4.977799045028552527e-01,5.729931905240235324e-01,1.143706580993573807e+00,2.659988283144435695e+00,6.073792011457183060e-01,1.000686881797674538e-01,1.328992673267928470e+00,3.853187665041393650e+00,1.413275102705269237e+00,5.128558346416038916e-01,-1.010458998253458973e-01,5.219254866323410624e-01,6.891896065051652531e-01,-7.026953592164809637e-01,-1.197193796741536781e-01,-1.442369675047631361e+00,2.919632313257425338e-03,-4.685694653891741002e-01,6.051945255744558549e-01,5.285189571570136913e-01,1.171552160114892605e-01,1.243336237931047084e+00,4.954891298881804462e-01,-3.546483818912547492e-01,4.670755069499421541e-02,-1.055318593117850479e-01,5.838440472379148316e-01,2.097030357343677487e+00,-6.980794233873977017e-01,-7.356588782234151358e-01,-1.449235213767754993e-02,7.261819328607137247e-02,5.984711471052821530e-01,-1.374606424252030612e-01,7.393939429390999907e-02,-1.215126267698016793e+00,-2.357872573418922091e-01,1.233944066430758157e+00,-3.576985226146402463e-01,-2.230762968701388016e-01,1.335144597143187672e+00,6.598258786504993534e-01,-7.097488069866271232e-01,5.221494974412344003e-01,-4.114537403444173957e-02,7.988381363453846973e-01,-5.758692741252091629e-01,1.227280052484891470e+00,-1.387135983239087489e+00,1.570626792122376880e+00,1.544686218370665276e-01,-7.667940763482197220e-01,-1.217344402308743190e-01
1.114842894848743660e+00,1.162689116376015797e+00,8.218788207497716714e-02,2.269070348264432546e-01,9.988586657859392648e-02,4.662757314552666288e-01,2.925513366505917978e-01,1.142246156251561229e-01,1.389149994014994505e+00,4.771022679272365896e-02,-1.536684375025771376e-01,-2.395077712755848687e-01,-5.879308573366722745e-01,4.202010347314362737e-01,3.337572859945646675e-01,1.281847804110748168e+00,-5.674469485698918625e-01,-5.997642528180749943e-01,4.137254364087347702e-01,4.538232735967940301e-01,-1.191080170950989503e+00,-3.745993280669597247e-01,-6.907416025373145363e-01,4.293650351694745515e-01,8.702647921626698313e-01,-3.849090381730765897e-01,2.845690815034351839e-02,-6.090253974512446211e-01,1.337310462655609822e-01,3.067473225098726886e-02,8.654083146186750675e-01,2.246090770414208126e+00,2.414638395860004283e-01,-5.134810515726155877e-01,-7.536204223947911007e-01,-8.347267685131788406e-01,1.394936825671747371e+00,9.577873795299605142e-01,3.383125430386464405e-01,4.791114183701646878e-01,1.162248560138655851e+00,3.996208158007550915e-01,-3.010291537892438585e-02,7.049293186460872107e-01,7.518411473946110535e-01,1.029856122100492932e+00,2.708190252091780437e+00,3.387847551677624636e-01,5.702521279432909429e-01,1.066706504151085255e+00,4.441771684246662133e+00,1.038352323043794101e+00,6.659863648506632039e-01,-4.681631732366915433e-01,-5.856422562400542819e-02,6.713815798028802684e-01,-8.052962077692492615e-01,-5.401121468313343499e-01,-1.971446533516506561e-01,-1.149898107119569080e-01,1.215383861560972223e+00,-4.313088115962864233e-01,-6.753361015013035207e-01,-9.559121967217387716e-02,2.458497522149870607e-01,-2.856779105140113684e-01,-1.515688100091651114e-01,1.417340677713112118e+00,-1.119363180897246846e+00,-1.775387075743466436e-01,3.000461771487480611e+00,-6.188790262534822340e-01,-1.659060539665292988e-01,1.277102532326391815e+00,2.415289134903978452e-01,1.648042129685512114e+00,4.685177227376061126e-01,-2.542569794895729318e-01,-1.992893036670206897e-02,-8.399319063889181258e-01,-9.764159690212936837e-02,-5.005338111777373200e-01,-1.161286834016056480e-01,1.014516976401958370e+00,-2.670862474806644515e-01,-2.478061182491525516e-01,1.310103860077450610e-01,1.875745713853249397e+00,9.222987437371711339e-01,-5.314026052398426181e-01,1.702786849406897618e+00,-9.323407351293175882e-01,1.764366196914105789e+00,6.446550179607037911e-01,-6.915706216119557048e-01,-5.404676023615628822e-02
1.194581844923755520e+00,2.001992036402872710e+00,-2.843716320229661143e-01,-2.578935703194029094e-01,1.429330138270486494e-01,2.700857060673607646e-01,4.276745790709805539e-01,2.263221179029981656e-01,8.889164705484906559e-01,-3.611019688662807647e-01,-1.580144345251289217e-01,-3.715299187378984236e-02,-4.430659245962348392e-01,6.702380727322465592e-01,-9.436749190427018430e-02,1.351322152261366982e+00,5.879569973077569678e-02,-9.199569023877317564e-01,5.424126058237568188e-02,1.178032462631605631e-02,-6.575907829673376392e-01,-2.895112650102886764e-01,-9.775987519297753003e-01,3.412329499738053773e-01,1.284317876437811368e+00,3.364140268739791995e-01,-1.761702312062294606e-01,-5.036417363668057590e-01,-5.784451544644466647e-01,-7.034801631610986261e-01,6.230925068663205613e-01,1.780548314566438028e+00,1.128757609456789157e-01,-1.104469783596424004e-01,-1.037992049290007657e+00,-8.230709764347511337e-01,1.929548476416640623e+00,4.973686516508056821e-01,7.888700639747636689e-01,-3.478471890994165872e-01,8.124513114683060699e-01,2.505786098076982493e-01,-2.100615055826112743e-01,7.523035624153895373e-01,5.431617314300254407e-01,1.166203737956853281e+00,2.429903919866454931e+00,6.633505367478887971e-01,4.574791691931876514e-01,9.682205881614140974e-01,4.492720896292026644e+00,1.416488530925195555e+00,6.614738735585039553e-01,-2.986518186964130517e-01,4.892453311432971574e-01,4.956560359287158768e-01,-1.004280875460168421e+00,-3.237252075534846618e-01,-1.007062412436493304e+00,-1.128117458744100077e-01,6.854978534549679980e-02,-7.645591185680544744e-02,-4.093516812380985914e-02,-4.377468732974733046e-01,5.981540481254492558e-01,-5.807955542402820637e-03,-3.789929702777538045e-01,4.442613143430066414e-01,-8.716119776057876800e-01,5.957322072966935167e-01,2.558007019036443008e+00,-5.148378630262104849e-01,-6.320558842234219599e-01,7.365064818479772901e-01,2.694453634066750203e-01,1.018546060281294796e+00,-7.513233489451504044e-02,-2.308375478607427311e-01,-5.536159417679586969e-01,-7.577934278925835265e-01,8.732750694332185315e-01,-4.926460072027201709e-01,-2.210828973368060002e-01,1.156380971791723056e+00,1.855913001809695873e-01,-5.140379480772784282e-01,3.062735171214074903e-01,5.073419659294207129e-01,9.862540867226057273e-01,-7.942155134911124126e-01,1.266398028075102156e+00,-1.182292576219520663e+00,1.687389969290629121e+00,3.909636530790450148e-01,-9.543943456500858513e-01,-2.526825628033710913e-01
9.217355908711531987e-01,1.382263034605420549e+00,-1.947277554994163162e-02,-2.468260282367251701e-01,3.909043520840758679e-01,1.312624953572154585e-01,6.456684588510008815e-01,-2.658775385503967525e-01,-4.448782473054846420e-02,-1.900874584278653134e-01,2.137061039329491430e-01,-1.760774970135221551e-01,-4.277755080849443003e-01,6.036084648185925383e-01,-4.976119524382910386e-02,1.206005967519188760e+00,-2.953047669110110407e-01,-7.025178263359901365e-01,2.380153693721392405e-01,8.823178206172008209e-02,-7.061804452006714694e-01,-5.218278969223635322e-01,-8.786537833888607985e-01,4.909610368536425629e-01,1.272891692246596040e+00,2.221335494697640189e-01,1.999004880090960445e-01,-5.586178562736393571e-01,-3.908718954653060962e-01,-6.037917942811822369e-01,5.315502865033793212e-01,1.889295986400115090e+00,6.881103257873105727e-02,-1.408773248822850488e-01,-8.322491898023094414e-01,-8.489197484078526701e-01,1.307937923292421978e+00,8.665828527445831320e-01,1.120781893307901456e+00,7.089294752543240374e-02,5.301826210556911390e-01,2.501073624918814242e-01,-3.526495350818555363e-01,4.463811310110999964e-01,6.036471374786525068e-01,1.180441674283431830e+00,2.177371549517486127e+00,1.517184933688719428e-01,2.802087555791299422e-01,1.179936289659205606e+00,3.943089420583266058e+00,1.123051241105490039e+00,8.771089338209658859e-02,-4.669258145683491401e-01,1.014257921109584792e-01,8.273088071211407435e-01,-5.815657008064520905e-01,-2.576808096826696537e-02,-5.493899293999633393e-01,-2.269093669870845265e-01,6.935808047384388608e-01,-3.638825416816833802e-01,-1.418527627795649892e-01,6.056613766372442864e-02,5.681555424698345735e-01,-8.196947227917150691e-02,-6.354714780007746366e-01,5.177535909603693254e-01,-7.497016860858011222e-01,8.643761815379703561e-01,2.230115756917966152e+00,-5.720245820603842013e-01,-2.281902578192639974e-01,1.080008665261121381e+00,-1.067765226272132106e-01,1.485382477928149481e+00,-1.536284408323052575e-01,2.122338916358601502e-02,-2.496001102070359856e-01,-7.786849237274336977e-01,3.583509913427180282e-01,-5.873130223228113511e-01,-1.260985916893953007e-02,1.305535999637731370e+00,1.754455384911434157e-01,-5.201177827404415144e-01,5.013075673778264463e-01,7.029097857490854695e-01,7.254114723617847149e-01,1.511815981656713936e-01,9.735918476366232088e-01,-1.093340129021016294e+00,1.074645046159651729e+00,3.767374052088495739e-01,-3.752713467113760748e-02,-9.326300021915268079e-02
1.304556848318578322e+00,1.399573522266228665e+00,-2.733273043285149306e-01,1.056700384847005791e-01,-3.507657749506125078e-01,6.428549466980646443e-01,-1.689231819593832173e-01,6.892078392967501133e-01,2.427338605326384346e+00,2.400997598212588902e-01,5.989546469144441110e-02,1.047727509644344746e-01,-5.262914016988468058e-01,3.045762192897777942e-01,5.361746171848114084e-02,1.945657506696216732e+00,-5.600585445298222886e-02,-5.233427680033911900e-01,1.957474296122809765e-01,3.541307957082318603e-01,-1.046597429652780686e+00,3.568803878110214933e-01,-5.446518343149481245e-01,1.968210208406252493e-01,9.791588516737086412e-01,-7.221420097529316351e-01,-2.609004566842738626e-01,-5.586323113803778329e-01,1.436281774669794231e-01,-1.189755186329291003e-01,8.299970519484782816e-01,2.274198000985979018e+00,1.325650464220158309e-01,-4.992757051777380606e-01,-7.964453518783970454e-01,-8.404700869727829149e-01,1.836327140111682077e+00,8.141753970649566741e-01,4.489904673200095786e-01,8.463227434094680035e-01,1.458259721325906533e+00,2.855796121070870441e-01,2.839300920970960762e-01,8.436289079007106562e-01,3.971492004789733410e-01,7.844260550408378441e-01,3.129404472179647012e+00,5.551671035945331401e-01,5.898215160930847523e-01,9.064575169459000437e-01,4.965042903390886053e+00,1.385728038214838920e+00,1.372142073573849874e+00,-4.375125236274530205e-01,-1.632614666714385376e-01,8.113962748377522294e-01,-4.181618645196635287e-01,-7.256763207200490617e-01,-7.047524828284386089e-01,9.569334863403291536e-01,8.021410243918141170e-01,-1.738443305236306302e-01,-6.642929316648583660e-01,-3.862910061515911764e-02,2.189373872313089553e-01,-4.218759107047822532e-01,3.162870953581364830e-03,1.286891861833713513e+00,-8.184856101232563796e-01,-7.214203592183461300e-01,3.539730441975354580e+00,-4.229803879006368006e-01,-2.660872548475191057e-01,8.081482866301898937e-01,4.411974556693017968e-01,1.245574081752018891e+00,5.536862824917909709e-01,1.681899799179641941e-01,-3.899234141045180291e-01,-6.348487408722865988e-01,4.774269376580481117e-01,1.358294495445105110e-01,-2.713692091615306778e-01,8.136653677495547798e-01,2.230901813303662884e-01,-4.980300052078523443e-01,-1.777466151587152043e-01,2.094343460233214493e+00,1.003414563936697368e+00,-1.364552099316255429e+00,2.407842912456763518e+00,-6.304797399021648818e-01,2.052499769127032803e+00,4.917034112453843586e-01,-7.490586819160722776e-01,-2.478157977661868960e-01
1.007624999775307506e+00,1.442541966210820092e+00,3.101147163700940235e-03,-2.887458903768729268e-01,2.221817741164127669e-01,5.847754509367578124e-02,6.125934130689308921e-02,-9.423591917000151419e-03,6.674874414616331908e-01,7.321446000456385828e-02,3.918015038084547985e-01,6.441346741053294300e-02,-4.265948379838644944e-01,5.024990971935915374e-01,-5.813748463694001778e-02,1.657103061322533488e+00,-1.208555257869551591e-01,-3.667452778203849073e-01,2.009146827961983406e-01,1.813381060337807271e-01,-7.983312855732689339e-01,-1.848227321337865270e-01,-6.982870071778366494e-01,3.927613727275672817e-01,1.191580999315494438e+00,-2.052362642477454091e-01,2.172984702101699028e-01,-5.249106782070338539e-01,3.487623254734417699e-02,-3.971944601274419728e-01,4.770384790253633378e-01,1.980827987018868752e+00,-8.468071240708471836e-02,-3.951257435848549160e-01,-7.330441650815000543e-01,-8.525535003618034402e-01,1.247275241061516660e+00,1.076339877759549202e+00,1.019188767718678168e+00,6.803772899724361833e-01,6.816322063319300018e-01,1.465961242122433839e-01,-7.157496186370881919e-02,4.647481535466181368e-01,4.446482791976781868e-01,1.000717287550768386e+00,2.640885412560795231e+00,3.418491528198784601e-02,1.721363870056696888e-01,1.526467430870279474e+00,3.920509650298896531e+00,8.993112502521747320e-01,3.818404681678445600e-01,-5.309593972176362975e-01,-2.069265091233150333e-01,1.021606405972008691e+00,-1.436363806293888823e-01,-6.740361431889035915e-02,-6.047258644113953086e-01,1.598254469547679690e-01,9.891069066272817345e-01,-1.106075242552630455e-01,-2.460556275582192753e-01,5.267861416932271279e-01,4.783127359565420011e-01,-2.778448950094153380e-01,-4.723636595845438491e-01,6.261236700425812929e-01,-4.451859738841064118e-01,2.440265333853233465e-01,2.641997286382398613e+00,-6.376578263131731372e-01,-1.134444282953759736e-01,9.879423628896728538e-01,-1.740753094479289276e-01,1.616009664510865917e+00,2.127438596737089571e-01,4.899508845488003694e-01,-2.384214476014029360e-01,-5.147014467759047918e-01,3.183555233651402250e-01,-2.095538715580924083e-01,6.900156966862164287e-02,1.040663038362544146e+00,4.164529802946141945e-01,-4.862590513330650177e-01,3.706735372042523347e-01,1.271965276621765506e+00,5.595734208057088210e-01,1.429949816187472966e-01,1.513171918059256882e+00,-9.810326033803283829e-01,1.181268921626649870e+00,2.619408033097415656e-01,4.129351755425083037e-01,4.781911682134082353e-02
1.019787726023567265e+00,1.471634428612307088e+00,4.958488445217985874e-02,-6.135017131873486962e-01,-1.432807484055589331e-01,1.873198590995066859e-01,-9.526239039927097974e-02,2.337868572694665747e-01,1.746864287152391171e+00,1.299464723385079512e-01,-1.095209921963156696e-01,1.818414515192678937e-01,-5.040111587824165351e-01,4.868987820940999522e-02,-1.864746653048297009e-01,1.476844399468098867e+00,-2.833229042427405919e-01,-1.287420684128129378e-02,-1.127017956389864128e-01,1.757049774686388899e-01,-8.741254074346896941e-01,3.255274601774543752e-01,-5.702797640995359574e-01,1.049291286455837358e-01,1.518450322800709795e+00,5.110567295944321714e-02,2.533805217263171428e-02,-6.086446838578627450e-01,-9.368574244304205267e-01,-9.182797506796933629e-01,3.642654277463682755e-01,2.445405442939412755e+00,-3.182785967633984248e-01,-1.244489751512446452e-01,-7.886974065172307480e-01,-5.016049115050206231e-01,1.886484282896470077e+00,7.828662400368600061e-01,1.305337692601812982e+00,8.802618849401560031e-01,8.175611339912891573e-01,4.302687892609696196e-01,2.170828209016786303e-01,2.644860018409957991e-01,6.091305993728820534e-01,8.412073110389973740e-01,2.874875932351688590e+00,2.917928012658186909e-01,1.738670143343850061e-01,9.078388649912391140e-01,3.976242793103967443e+00,1.646635946007804163e+00,6.897119697385170056e-01,-2.110838366990748227e-01,-1.920848481263955909e-01,1.200635785142265766e+00,-4.101003778689071844e-02,-3.450757023554037461e-01,-9.059133512609877092e-01,1.147325241702788379e+00,1.649773982986477427e-01,1.929769306829916542e-01,2.052771133000531531e-02,5.445344026593670339e-01,1.150872801147809543e+00,4.007803437966683813e-01,-2.406696107078344915e-01,8.989012476408315688e-01,-8.127896491745466301e-03,-1.600442889597383234e-01,2.441661001965035549e+00,-5.240046685013732830e-01,-1.703287148074538182e-01,1.012594347981207732e-02,1.061089312888815056e-01,7.293360963572996791e-01,4.166441858201358484e-02,2.806478313344483722e-01,-1.201590151294136266e+00,-2.291215094483812775e-01,6.717125357907151040e-01,5.217033743063004270e-02,-3.274050907847607106e-01,1.470415212414869721e+00,6.525121123772128495e-01,-9.280278857609226550e-01,2.272035634272179805e-01,1.179706915098653441e+00,8.485272900420801623e-01,-7.776575510116885415e-01,1.864652517066696102e+00,-7.286733306148884814e-01,1.446264574566972438e+00,3.350879829829848111e-01,-4.820982194941446086e-01,-2.371337685882376756e-01
1.018644673749383056e+00,9.841386999460816076e-01,-3.816951306311636150e-02,-1.034987405492622248e-01,-1.236821326216262923e-01,4.813927627659161379e-01,1.956803378645000646e-01,1.872009376476539977e-01,1.481002805613738538e+00,2.405892035814516383e-01,1.715823745448622761e-01,-3.201230575211058693e-02,-5.116713486361406105e-01,1.799140852996561901e-01,-1.327771047648912406e-02,1.569031324548592066e+00,-4.080006691933689700e-01,-3.368210138610636672e-01,2.084498298311088793e-01,3.104670234953238461e-01,-9.889260370163440728e-01,1.552712880971409415e-01,-5.341423066153003774e-01,2.711549424605509406e-01,1.190918511026787696e+00,-4.186757506205888157e-01,2.832822414323488136e-02,-6.280239924942045970e-01,-2.857016414377101521e-01,-4.138273717157163745e-01,6.499565167570064972e-01,2.402665926598601231e+00,1.407934574179064979e-02,-2.854179611276211337e-01,-7.015809199322878831e-01,-7.338955596600776898e-01,1.539216420656038142e+00,9.350267949295868464e-01,9.913270377486853580e-01,9.407079410574266110e-01,1.062746595771119074e+00,3.840171356308538786e-01,1.015120715455535699e-01,4.597755445848525357e-01,5.474362801589831573e-01,8.493831677838288297e-01,2.746652057923103740e+00,2.193359940844925027e-01,4.014384570588933610e-01,8.367097840198987058e-01,4.375555927321086891e+00,1.445572591247372252e+00,7.535430488093525225e-01,-4.347894511403657125e-01,-3.192674594789619569e-01,1.094738109999899844e+00,-1.627073105262917263e-01,-4.390961051023450912e-01,-4.886967021651972831e-01,9.508975200598865918e-01,8.291334055166137418e-01,-3.323669805220070828e-01,-4.803810051345357435e-01,2.759232987333259945e-01,5.468260828877161694e-01,-1.199722659343244180e-01,-2.760398038129409648e-01,1.200894856172562974e+00,-5.768280655857449535e-01,-2.046125249210969388e-01,2.869333658085317929e+00,-4.344108976926707166e-01,-2.083265770368665504e-02,7.403613700801455755e-01,1.599158015106925679e-01,1.259836660980073964e+00,1.971104243885841156e-01,1.944323370131538220e-01,-5.226061846458788240e-01,-6.074562207758499310e-01,2.707743199371434040e-01,-3.227936406721448881e-02,-2.256375854747081633e-01,1.228968213676501664e+00,2.951159161256253771e-01,-6.955755440571421699e-01,8.250775271865440352e-02,1.753833360168679079e+00,8.834183004532706329e-01,-7.008532572118690851e-01,1.922935502575062960e+00,-5.923150988354517477e-01,1.465443123688913385e+00,4.812264130993086364e-01,-3.145030244665190655e-01,-2.368365473222057982e-01
1.199876624725213503e+00,1.453403771601001981e+00,1.755354047886382163e-01,-3.102382143210576371e-01,-3.115635923388795359e-01,2.421509220967392739e-01,-7.416742227549659727e-01,5.672870981335073060e-01,2.888316076576534108e+00,4.204236658228184265e-01,-1.688924889527170792e-01,2.899456943616898208e-01,-5.953769837599760528e-01,-2.098308389145732422e-02,1.082747118868149228e-01,1.829054543925506815e+00,-3.120970734730577623e-01,2.507005027174420975e-01,3.183795538829111565e-02,4.802539387411431382e-01,-1.245070771835993018e+00,4.723486417081063093e-01,-3.750388083829480634e-01,6.802007459875333839e-02,1.133075788199632949e+00,-6.237962614143321982e-01,3.498108716314396460e-03,-5.915315587525757923e-01,-9.334149470863994935e-02,-2.530703518975170319e-01,5.353513191651884107e-01,2.614288453338070806e+00,-2.969253057859871925e-01,-6.248455243677608628e-01,-6.626924562722419365e-01,-5.546939509965593817e-01,1.738945598668303560e+00,1.069254131664005847e+00,6.408343766668882502e-01,1.483755048410975608e+00,1.244340788897189132e+00,3.892033212781839113e-01,5.499929846369949749e-01,4.716851397556615644e-01,5.943197270509100738e-01,6.810446144147088710e-01,3.499306266715630720e+00,2.568100854376443865e-01,2.466660388843687213e-01,1.315287887155674351e+00,4.153632604948744422e+00,1.192433643755630435e+00,1.130422080859395884e+00,-3.117907723021720590e-01,-4.854028495661961706e-01,1.176371649600881586e+00,6.533315582544757527e-02,-6.096773217365196729e-01,-6.516887936993092101e-01,1.114774514854126597e+00,8.959872108918602862e-01,3.315765540770740927e-01,-4.005825435044538807e-01,8.155916919094136075e-01,7.813274536110081936e-01,2.845448410049228327e-02,1.392109300944106565e-01,1.462316558432550817e+00,-9.198694568518919756e-02,-1.148859858846443815e+00,3.199010058622563157e+00,-6.833963385586088179e-01,-5.668330429519936875e-02,2.769824193303236370e-01,1.831013961443808125e-01,1.141506227064483792e+00,7.594042972191812346e-01,4.676950456381359644e-01,-8.390948540691366420e-01,-1.068419709560901598e-01,2.477649247712466751e-01,2.556794605202665216e-01,-2.210632421091665301e-01,1.005321030833377094e+00,4.703124102429543374e-01,-5.930701546731167451e-01,-1.810195301589168082e-02,2.288405640839045407e+00,7.589454936247526096e-01,-9.074286263160442623e-01,2.571824555050452155e+00,-6.832656637582510406e-01,1.898997014216022627e+00,3.980588924594175015e-01,-3.696909884596300544e-01,5.160273641897472618e-03
1.362094474814552925e+00,1.842302418044230672e+00,-2.233160695926570960e-01,-8.493238632336386207e-02,-3.018226772093948740e-01,5.323163652105338262e-01,-1.502054546566903848e-01,7.123073527137636640e-01,2.588046878783448079e+00,-1.571396793239429601e-02,-4.197488277558468206e-01,1.000895989327173774e-01,-5.645675018895384145e-01,3.158560318145827717e-01,7.054736442500664229e-02,1.623347595956107448e+00,-6.657484102723743025e-02,-5.531234857504505609e-01,3.433649322606680682e-02,2.862912890828462897e-01,-1.028679766094669157e+00,2.294096293860752867e-01,-6.926491498404800939e-01,1.368645134798918694e-01,1.111803571318551231e+00,-2.358627259922964348e-01,-3.575072794590992142e-01,-5.523746778241196420e-01,-3.671778893939452448e-01,-3.878697475808374762e-01,7.715917810880368322e-01,2.242279819734094293e+00,6.375466197647822186e-02,-3.689464217286519410e-01,-9.448822973839452466e-01,-6.976718093623016648e-01,2.187193654421538014e+00,5.615123728379659562e-01,3.845757391266886316e-01,3.656391441973517731e-01,1.368364769087028865e+00,3.894860267094132356e-01,2.596934851455579008e-01,8.502887780989547561e-01,5.791748206015099321e-01,8.925074269174158026e-01,3.097716749356457910e+00,8.060903963600639655e-01,5.942214809537934572e-01,8.047186388861057305e-01,4.870848854283000406e+00,1.561298942463925643e+00,1.334456708992637797e+00,-2.307047635608688585e-01,1.912663249082418027e-01,6.006296116132665563e-01,-8.174578820903942722e-01,-7.823478737097195879e-01,-9.272646673799653794e-01,6.522368177485584617e-01,2.582796534658958754e-01,8.852385077706581562e-02,-3.653450760920687879e-01,-2.790545657780405531e-01,5.674975061290321587e-01,-2.181785309966516317e-02,8.838936277357012372e-02,1.180359039525830323e+00,-7.798104652660350355e-01,-5.627109856220746664e-01,3.232336288755966791e+00,-5.009833049453076281e-01,-5.275353030517454522e-01,4.523056364166764265e-01,5.656612890674408423e-01,8.576552408181847831e-01,4.353686170497196861e-01,-1.938775758562691909e-01,-7.572854680339000666e-01,-5.627025823238445135e-01,7.099152012391352073e-01,-8.536750460999611989e-02,-4.000218660807526305e-01,9.877347311901746307e-01,1.527006144667738541e-01,-5.196057413790831081e-01,-8.036000595847186956e-02,1.565410541313867032e+00,1.137518497738299939e+00,-1.615499048581808372e+00,2.190931442799895379e+00,-8.682699582455519760e-01,2.261227765393973854e+00,5.237137083385852154e-01,-1.422178524588781023e+00,-2.876018405414872969e-01
9.346552160326473402e-01,1.148509036855773324e+00,2.080954547412085520e-01,-4.976107171850821520e-01,-8.547679229953095148e-02,2.250685823675511177e-01,1.694983821516177214e-02,7.025040829407994125e-02,1.635261583510551286e+00,2.040428053993445512e-01,-1.432875131997029539e-01,5.476997008071534528e-02,-5.501324271211979200e-01,-3.373364057913132152e-02,-5.702950726343547494e-02,1.299894974504228973e+00,-5.724598717940150294e-01,6.660708588595720681e-02,2.766283137429735584e-03,2.916297505213719665e-01,-1.019789782261980360e+00,1.989039971818228336e-01,-5.144748015986502221e-01,1.596726327972458614e-01,1.440818477515023677e+00,-3.264436717514925673e-02,1.342907191179234794e-01,-6.587681916712886387e-01,-8.737359408738463173e-01,-7.787579638944917004e-01,4.161441952983739867e-01,2.597853713914249241e+00,-2.767941860282849831e-01,-1.714065073264740557e-01,-7.050851753426105040e-01,-4.795914237547030390e-01,1.689718132872605194e+00,9.058025219368958103e-01,1.264297455514383994e+00,1.036450845871402793e+00,8.307688519277309780e-01,5.158302596363125714e-01,1.961720276456355716e-01,1.813242554674346363e-01,7.375053824033760419e-01,8.445597026012415798e-01,2.822583782494677784e+00,1.610179159711124519e-01,1.940129579150460248e-01,8.725405780730715044e-01,3.853587647600233534e+00,1.575256521986545311e+00,5.330350082330115313e-01,-2.443339119236669910e-01,-3.253055351654209337e-01,1.261757506824519259e+00,-2.631570364993984779e-02,-3.596997014915224167e-01,-6.112780909480959313e-01,1.058565303903498789e+00,4.643386583918829302e-01,2.710430810346187158e-02,-1.179843462466058923e-01,6.223803092994424357e-01,1.126123294400132036e+00,4.143430339255328443e-01,-2.375586507184326845e-01,1.171179119574544014e+00,-9.311096225586223962e-02,-2.098707138697564201e-01,2.385163145252463313e+00,-5.554451944048469647e-01,-1.170524682671943151e-02,1.707349579430471609e-01,6.415767737354922950e-02,8.959878895382060726e-01,9.173311347210089117e-02,1.839065970109780013e-01,-1.071226975097673284e+00,-2.887000951943079485e-01,3.417552294481128738e-01,-5.415924504326902200e-02,-3.034097508814492805e-01,1.545941260182986499e+00,4.761028967264537282e-01,-8.800127375092744453e-01,2.438535651426892437e-01,1.439369407524485611e+00,8.388345048440427609e-01,-5.848929485189331423e-01,1.820644525139815340e+00,-6.763602955788448057e-01,1.363600936066601488e+00,4.339567451947952126e-01,-4.274688976252385975e-01,-1.932429834975248895e-01
1.084109726032813859e+00,6.274679250901524785e-01,-5.107273735280155602e-01,2.017930569168217003e-01,-4.300664452612080191e-01,9.695364919802194059e-01,4.970503656791256941e-01,4.656045489906857071e-01,1.541644836041534017e+00,3.727924843480486805e-01,6.493539196864481777e-01,-4.574249962856857810e-02,-4.285076714513836316e-01,2.296387583717289793e-01,-2.174772287016312755e-01,2.017397023451791060e+00,-1.261093677083990616e-01,-7.744071315729862404e-01,2.910647044798868044e-01,2.174675739117331863e-01,-8.082811398513924939e-01,5.417141198280297498e-01,-4.663424406406277978e-01,2.605471650116989446e-01,1.140382392055599325e+00,-8.537866915777638788e-01,-2.294734981373889038e-01,-6.271190632924117381e-01,-8.315729267033322714e-02,-3.654130855246436882e-01,8.582585902038635250e-01,2.331521206890522890e+00,2.852319612378252933e-01,-1.564454301734331532e-01,-7.152295510230246567e-01,-9.464479521597390921e-01,1.663238846957113104e+00,7.942005322158460778e-01,1.098394588933386817e+00,9.926268628472380007e-01,1.389650149021028680e+00,2.898433504198872912e-01,7.584705630235936968e-02,6.800681147359624035e-01,2.050372822333391687e-01,7.258812935143298395e-01,2.629590362377696167e+00,3.766225321046705043e-01,6.560584345113972260e-01,3.136968491765602107e-01,5.213206650251001051e+00,1.840230521257560703e+00,1.223633414606446035e+00,-5.796913435009606319e-01,-3.821595101117745696e-01,1.107770071631563269e+00,-4.816589220418598938e-02,-6.000833454675857936e-01,-5.985400653922845482e-01,1.739535285305269685e+00,7.630793267060271834e-01,-7.827864060947774538e-01,-8.045833427239301727e-01,-1.631782406411438346e-01,8.375610873901928599e-02,-5.699068999154390802e-01,-3.666311350773684974e-01,1.171848850390612817e+00,-9.166879204370363965e-01,-2.144465217526116962e-01,3.395455747110196043e+00,-6.100305703960190451e-02,-6.419289564857696972e-03,9.561291095329876866e-01,3.912345314653060679e-01,1.216950976086073499e+00,3.797056199115206310e-02,3.049022734343082019e-01,-3.366298340493116825e-01,-9.259144009956286059e-01,5.581801442643005151e-01,3.137657645074721779e-01,-3.436272185400985890e-01,1.076556700678293232e+00,4.010871836733731488e-01,-8.611053842807497860e-01,-2.333521624680972573e-01,1.991507300755593901e+00,1.083871389840409094e+00,-1.362708199107740992e+00,2.233884161929430956e+00,-1.770976666043644898e-01,1.525130707324708013e+00,5.039385146063202203e-01,-3.554736880585749881e-01,-5.696640299914267347e-01
7.337293454745329457e-01,6.896814720467048243e-02,7.024699599772407654e-04,1.621197312566979853e-02,-8.799838199487013124e-02,6.819398838805783569e-01,7.461130945433362971e-01,-2.009332509422861457e-01,6.240218029246130671e-01,4.442514728194184581e-01,6.264599071325915869e-01,-2.434857899214347698e-01,-4.785490010377791426e-01,2.041779966899151533e-02,-9.964153399217157148e-02,1.454596078282986316e+00,-7.648468030797753725e-01,-3.431505827387476559e-01,3.838945717003689473e-01,3.251543725420694142e-01,-9.533349010566845028e-01,1.635942698727704259e-01,-3.992973031046764820e-01,3.744455460065581054e-01,1.260964689893040447e+00,-5.938378196669144016e-01,2.296815927519439970e-01,-7.283801466097952204e-01,-3.841712875818718009e-01,-4.793257887231743286e-01,6.638409759117231967e-01,2.611018185872135078e+00,1.062637538671128423e-01,-9.186141608426287575e-02,-5.272533137174078011e-01,-7.731529054390395839e-01,1.136975565035061031e+00,1.109242315250115407e+00,1.512316171072072946e+00,1.308738955895870859e+00,9.499954257054080697e-01,4.592999022135061948e-01,-6.542924729474926260e-02,1.859988036054315841e-01,5.321842400405483176e-01,8.009998274940135499e-01,2.334855034357862902e+00,-1.352842644554672069e-01,3.975884890586023901e-01,4.627085845798433184e-01,4.282775153726075423e+00,1.644922680109564883e+00,3.985143827713431008e-01,-5.843646705787006734e-01,-6.849723542845641555e-01,1.454749963853931405e+00,2.469300603163405716e-01,-2.909650302599230964e-01,-9.893355288637706302e-02,1.447949269831546815e+00,1.156751466184560595e+00,-9.043357186718091745e-01,-6.817586339107469806e-01,4.231554084447806119e-01,4.752343547584882977e-01,-1.925601552798776872e-01,-5.774101761182188763e-01,1.351923448998142874e+00,-6.181994302536517605e-01,1.325596510125627847e-01,2.631839194650075875e+00,-2.311182714494811608e-01,3.842619888042169696e-01,9.844350978816458486e-01,-4.848918536925650447e-03,1.445646899700643750e+00,-1.321125308639335416e-01,3.022612011954550759e-01,-3.688485723312844300e-01,-8.159301054136374187e-01,-3.804333167993889653e-02,1.367536587413764604e-02,-2.142700316321685672e-01,1.519714311870599799e+00,3.155950521144055276e-01,-9.324493777435273190e-01,1.058126430756978764e-01,1.934167219266514248e+00,8.598925514911646140e-01,-3.306025887231721083e-01,1.727524278789965617e+00,-2.112341756990343544e-01,8.897403402154792085e-01,5.513589883855209983e-01,2.284431200988446264e-01,-3.818817710690901590e-01
7.741694480930516598e-01,1.487329296117974931e+00,3.262917444284202939e-01,-8.243287991609419274e-01,4.964865008972335070e-01,-4.809162182536826369e-01,-1.606652484980774509e-01,-4.179699744942467765e-01,-5.820623151611203916e-02,1.258981831749138580e-01,5.904323093831068681e-01,2.199556443543868589e-01,-3.733276096465226179e-01,4.025466604554955308e-01,-2.101618939987253964e-01,1.571180870411788444e+00,-1.855569877205434648e-01,1.793072823524859971e-01,5.422050987915557480e-02,9.299586053014544107e-02,-6.793291286939258100e-01,-2.614529801602133441e-01,-6.578271175483706434e-01,3.900892398176707410e-01,1.479285172049566555e+00,1.097536524690942150e-01,6.122679812775687624e-01,-5.166769092162272203e-01,-2.255745970134779288e-01,-7.449778004667314546e-01,6.060596541648638480e-02,1.998977566977781617e+00,-4.944217713668779268e-01,-3.460637959752974058e-01,-6.200005729657096509e-01,-7.015697343253560758e-01,9.108242268796818975e-01,1.348066111639965037e+00,1.621591346674947864e+00,1.041334138687928679e+00,1.065926459345427069e-01,8.928074434880900467e-02,-9.460263716783620658e-02,1.102736567904154252e-02,4.795241536609906041e-01,1.014755635086620922e+00,2.581622350060672311e+00,-4.409999273900792049e-01,-2.933488573085550333e-01,2.055295552822028693e+00,2.918139634887701117e+00,6.221138689031866509e-01,-2.486964157386279961e-01,-5.201061308544552286e-01,-4.659825111198133696e-01,1.442442690230892222e+00,4.575869729985541090e-01,4.020980107795601999e-01,-6.404853554610391297e-01,9.908292978080801561e-02,1.027890341563113985e+00,2.314860839800204628e-01,1.852734285426545224e-01,1.393601509823285678e+00,9.719805047579166413e-01,4.431882722704794109e-02,-7.106150369989903126e-01,2.348450670652555416e-01,3.004307255612119198e-01,5.601201974130398664e-01,1.958415212872370637e+00,-8.374992438865571653e-01,1.057995428641390206e-01,6.719933853375505972e-01,-6.819451103404223780e-01,1.671713192376228285e+00,5.846917313226357438e-02,9.957995361885552121e-01,-5.109074378686564444e-01,-1.032688504052782230e-01,2.537494954926919899e-01,-1.837386708268715640e-01,2.680805124371269388e-01,1.291313448520723384e+00,8.426243598755699393e-01,-6.494368102768736106e-01,7.429628312168758963e-01,8.614881036887549470e-01,1.588406430099634781e-01,1.178323155449434445e+00,1.173126813341616614e+00,-1.115960021468561880e+00,5.309848258065750226e-01,1.567999668423264437e-02,1.414122536589144774e+00,2.976839885750449666e-01
1.096386678036562756e+00,1.286797786658769427e+00,-2.076372833748989510e-01,-4.103196340997798397e-01,-3.152243380045282040e-01,3.267132877253071666e-01,-3.507145414800775796e-01,4.827551740538812419e-01,1.898912160632109325e+00,4.155634898370110797e-01,5.372438266791002004e-01,3.474004007089181445e-01,-4.166913531855371833e-01,1.402678725616362532e-01,-2.992447861032255796e-01,2.178680490463735797e+00,8.414736527337013383e-02,-7.042384102420055914e-02,-1.348872120234101413e-03,1.825700804334620397e-01,-7.924829290726004283e-01,6.608833921747787610e-01,-4.190458214129259007e-01,1.168032948034475049e-01,1.345662682696496582e+00,-6.203779522837847837e-01,-8.144290342203208688e-03,-5.513093505583559484e-01,-1.641158389914221249e-01,-5.865767062313138602e-01,4.380056170702709695e-01,2.318362885035551990e+00,-2.424100175419715286e-01,-3.341557373300285128e-01,-6.830250205656779316e-01,-7.406767717218842861e-01,1.653812557528669291e+00,9.987374654775300620e-01,1.271885662784324911e+00,1.386418328147446477e+00,1.028275405800431974e+00,1.822171648756810980e-01,3.266507346150189228e-01,4.293861360431395768e-01,2.102178816485634205e-01,6.729541079124424785e-01,3.087577068606104813e+00,1.469346225007872597e-01,1.882372404848603464e-01,1.133790248861370475e+00,4.344018932396931376e+00,1.426307775423385049e+00,1.040922813348309051e+00,-4.636285394774529722e-01,-5.213611043444548176e-01,1.360127281470254301e+00,4.300786033239339945e-01,-3.260125467236203445e-01,-9.215120912313076174e-01,1.619493997298043997e+00,6.498917108586355074e-01,5.002913492592978018e-02,-3.068755586033252714e-01,7.481388097184967778e-01,6.161893186480472684e-01,-2.355696933190540854e-01,-2.765825266874533117e-01,8.252630066959713018e-01,-3.167158772292364560e-02,-4.899315828303398845e-01,3.091207899913609669e+00,-4.032126686352146550e-01,-1.958056729717798372e-02,3.672027328329604545e-01,3.771961669292420161e-02,1.118502205883070477e+00,2.752168293940145394e-01,8.677520586822802251e-01,-7.794327301296908317e-01,-2.633696389929039428e-01,6.926741239547644646e-01,4.930077696021576972e-01,-1.754213622766316039e-01,1.044482115433533975e+00,8.894874872334682658e-01,-8.765956163288916025e-01,1.677865409526202445e-02,1.771955867657809547e+00,6.916409703557921951e-01,-7.578989954191781564e-01,2.336190065645952885e+00,-4.755961221134082373e-01,1.395467752756518021e+00,2.000846468570228187e-01,2.925459241454726467e-01,-2.057964156578181159e-01
1.415789097458210577e+00,2.052909883692719095e+00,1.794289255304602482e-01,-2.123809942754525948e-01,-2.938115340785747431e-01,2.602987353526834968e-01,-7.901428204817704248e-01,7.780283207315098482e-01,3.475069831768731632e+00,1.053155017611436817e-01,-8.558165711200600434e-01,2.189882799730664686e-01,-6.866512536040202397e-01,1.140611156068383342e-01,3.283703461685137936e-01,1.516880101375423839e+00,-3.036464807717936809e-01,1.412594481589553308e-02,-2.030287716147712723e-02,5.216854208958254802e-01,-1.376347771088158645e+00,2.156909058452997074e-01,-5.745959433320515508e-01,4.492601254637892949e-02,1.014880891217199599e+00,-2.984000042047648127e-01,-2.309876694487039417e-01,-5.640227159116456557e-01,-2.448326392975017640e-01,-1.725675303625195944e-01,6.862395548116306809e-01,2.514255622322526307e+00,-1.829689292763962416e-01,-6.802323733266557593e-01,-8.625181883260203408e-01,-4.975410603264101006e-01,2.157894297792575689e+00,7.711351180189217613e-01,3.895968218219048040e-02,7.943537437599732520e-01,1.421079460102085523e+00,4.904251182921900432e-01,5.545368812721499507e-01,7.526060950117796633e-01,8.218889458232057077e-01,8.265417299660657857e-01,3.609510412435866566e+00,7.142603556542415078e-01,4.458335201195309794e-01,1.253772824460895663e+00,4.403601048189143441e+00,1.215607397207059348e+00,1.349061717820752682e+00,-1.217001728147172335e-01,2.678153784412384830e-02,6.634282564924368630e-01,-7.386660729377013679e-01,-8.806104091176053528e-01,-7.843756821532287260e-01,4.146711720306957005e-01,5.392091504428978554e-01,5.524283158933946947e-01,-3.243913410977827816e-01,2.343219189403077385e-01,8.365560028627352374e-01,2.241093052390819573e-01,4.168333155353329822e-01,1.584828848579224569e+00,-4.472786081959387872e-01,-1.246494386924674291e+00,3.271784517261326464e+00,-8.109115266579756121e-01,-4.596661750877148456e-01,2.043203403106754468e-01,5.026239813853494720e-01,9.115247248501028299e-01,9.157914509637152811e-01,-1.542963332268066923e-01,-9.208159719586828107e-01,-1.852409968940859908e-01,3.604096273161532804e-01,-9.584523463906491347e-02,-3.498415311748994116e-01,9.273173613898676448e-01,7.580484324658598450e-02,-3.440893017889926631e-01,-4.747054616706086749e-02,2.050100832019769115e+00,1.002138409796536234e+00,-1.447544518729845908e+00,2.503989014364240262e+00,-1.033460892627315664e+00,2.515836173187661284e+00,5.469258706684647642e-01,-1.472606096234084117e+00,8.966038674122323027e-03
1.150860429068762958e+00,2.078130482320703631e+00,-1.067598444316643636e-01,-5.359865019092998617e-01,1.772182313809884113e-01,-9.955354613595590596e-02,-2.178669771709174641e-01,2.214206271882750987e-01,1.018957904315656915e+00,-9.116925412329343614e-02,1.978808425588517994e-01,2.588250519197518584e-01,-3.999256727728690564e-01,5.881959418410361851e-01,-1.716009972051025789e-01,1.767777323236351394e+00,2.218944999819115194e-01,-3.686196953519048081e-01,-1.542135102544627684e-02,4.929681477886246194e-02,-6.639815667881202588e-01,-7.659354070232893275e-02,-8.035846384102478535e-01,2.871351947248497183e-01,1.316114012415734225e+00,5.954020053258905071e-02,7.397798520119935883e-02,-4.545155442286482605e-01,-1.750922694557632830e-01,-6.226273734508863678e-01,3.663150204770214691e-01,1.806374307632524934e+00,-2.151794444521753502e-01,-3.597635690397325003e-01,-8.771627238888798361e-01,-7.995682247987698776e-01,1.605191477525998556e+00,8.791483165635047836e-01,9.789457848591821554e-01,3.916434456165625022e-01,6.319166346279572188e-01,7.823605866937727304e-02,1.539197312833529008e-03,5.593248733819736751e-01,3.800044286265603644e-01,1.024647642019266502e+00,2.801015871223963227e+00,2.646603239584482958e-01,1.086889987059690421e-01,1.660105476725751039e+00,3.940595306628271288e+00,9.571931035398378862e-01,5.666280050543243130e-01,-4.010425446283699125e-01,5.764882981407581930e-02,8.792782525982627551e-01,-2.799479380565880193e-01,-7.308240754632136515e-02,-1.042473670144666187e+00,9.377335928052676906e-02,4.801243379636211950e-01,2.983558325159102464e-01,5.142521815207026781e-02,4.575943543680206504e-01,6.751215110167584355e-01,-1.226064608986509596e-01,-3.880790844632381886e-01,2.916607813560156970e-01,-2.496819961488923045e-01,2.386790179439331749e-01,2.617792167666356473e+00,-6.935509553418507389e-01,-3.999880920360889269e-01,6.204471068840491377e-01,-1.028631749608555912e-01,1.295169660030196290e+00,2.085650119220414100e-01,5.177162434476115793e-01,-5.508835242487781780e-01,-3.324577969207944128e-01,7.609024827277816039e-01,-1.515602774096030392e-01,1.741626200271439995e-02,9.757315562080529636e-01,6.137619080122269644e-01,-5.104489291143455842e-01,3.980520478933582962e-01,8.365878844299947659e-01,5.762309160042389244e-01,-1.277017133325044074e-01,1.548746743303209161e+00,-1.178586537051953709e+00,1.402471640652894092e+00,1.381937266161512023e-01,1.364976497951163603e-01,4.923002307716584092e-02
1.026735781232739564e+00,1.647295452943883243e+00,-4.110165811330669938e-01,-6.112621565750312458e-01,1.881764671528075861e-02,7.213069791776655082e-02,7.832699032110090887e-03,2.127258721849143441e-01,5.004818479234569573e-01,1.084237898342973877e-01,9.118794569986823362e-01,3.534340628655614491e-01,-2.605101201790426813e-01,5.401372124139189879e-01,-5.490465612253971894e-01,2.199561980989813925e+00,4.756117036192161751e-01,-4.517011537040964697e-01,-4.291847572860586074e-02,-1.374578396012355042e-01,-3.500959475295318812e-01,3.383556966265383048e-01,-6.857681280747902619e-01,2.649264169972602168e-01,1.511948019319168779e+00,-1.811926634999080632e-01,7.830833937961838298e-02,-4.573703963420842622e-01,-2.214858256631749844e-01,-8.862521295134374588e-01,2.786890861314927914e-01,1.766160457149528185e+00,-2.208557161111333877e-01,-1.298311526593633469e-01,-8.036414432500530447e-01,-9.147681994277920836e-01,1.506700027717689405e+00,9.085353742398775134e-01,1.633697189539213168e+00,7.403744355652034370e-01,5.581007879150980955e-01,-5.641341008315886585e-02,-5.192332971350784032e-02,4.357581169574199498e-01,1.381066211866344151e-02,8.854959789436973594e-01,2.586705087744394671e+00,7.769987946663825529e-02,4.566144844350472631e-02,1.389663529472664472e+00,4.141161482525239634e+00,1.269807628280128942e+00,6.128579192527807695e-01,-5.509394776931179072e-01,-2.248594828606134965e-01,1.248250891177428823e+00,3.413596580882166664e-01,1.030337893160255258e-01,-1.201356450468532344e+00,1.048784282274644930e+00,3.840764812385392135e-01,1.404690379353004670e-02,2.080513076256166119e-02,6.109808285819865459e-01,5.557344703931035301e-01,-3.584216867037850474e-01,-6.952023348966674954e-01,-4.085105953877743445e-02,-5.049875408101576341e-02,5.018765529806571424e-01,2.658764728914757569e+00,-3.880093803164201827e-01,-1.988850209897037313e-01,5.844706648225218570e-01,-2.206210747847837106e-01,1.239175689681613068e+00,-1.474178313397506157e-01,1.025876594984838963e+00,-5.956423907369139403e-01,-3.894034246693401924e-01,1.063178281598565089e+00,2.825601442997940360e-01,9.588156587334306646e-03,1.043547241313989682e+00,1.085494471253941828e+00,-8.765802672831075615e-01,3.172191510360784505e-01,7.664508608397662126e-01,5.185942773569472974e-01,-1.272880413542896716e-01,1.634313953009061127e+00,-7.642781600827525113e-01,9.382140224692058217e-01,-1.958355467514394377e-02,8.403823599554594015e-01,-1.785333353254247024e-01
1.175122779358198422e+00,1.794143067724397689e+00,1.685662994885444022e-01,-4.825637994248054286e-01,3.294868832360922650e-03,-2.063283772230075641e-01,-1.034294948212187926e+00,4.030785586617714467e-01,2.017319681020853572e+00,4.127641651966819647e-01,3.971996902591941603e-01,4.836201785475675585e-01,-4.637931211416506661e-01,3.153771136222033311e-01,-5.066262007271837842e-03,2.226396703434075697e+00,1.102134852369467954e-01,3.057031267705643818e-01,6.299332904884336060e-02,3.524659165324963706e-01,-1.010992350917383042e+00,2.731328330249435110e-01,-4.495555417982535218e-01,1.986593596868563849e-01,1.093893048765871567e+00,-6.922833112675319533e-01,2.591609050908540990e-01,-4.648224515464864925e-01,5.621909146885746278e-01,-1.229581644778439120e-01,3.276908893003820933e-01,2.154506440614988527e+00,-4.309460311206583238e-01,-8.340431058089901040e-01,-6.121551012374485401e-01,-7.580362303684734515e-01,1.253406653635996459e+00,1.379170567610239040e+00,7.573321689776890686e-01,1.559612548303893398e+00,8.653291076881417521e-01,3.090557322774439841e-02,4.279013111051244156e-01,4.644728444244156651e-01,3.176315804155600553e-01,7.508722907632754406e-01,3.486070841759996597e+00,-9.940800571541830166e-02,-5.864835616403653307e-02,2.206786315037090329e+00,3.682277622837000663e+00,4.824947299119506372e-01,8.021771068801726301e-01,-5.315642679369729784e-01,-5.981222520020900157e-01,1.266736584883306760e+00,4.288375185487817154e-01,-1.472461750319156160e-01,-7.505404465513660917e-01,5.412881274320662239e-01,1.331307184215237083e+00,5.309657414056434543e-01,-2.627580458163109034e-01,1.335800903050187616e+00,5.418999243601105853e-01,-3.774892408778605102e-01,-1.145674894318771120e-01,8.141979189055001953e-01,1.587647645055821899e-01,-8.172433297630488092e-01,3.160481736596771896e+00,-8.676422003326569321e-01,-1.750773703604600884e-02,6.532602370805744574e-01,-2.800118275259930178e-01,1.712564890759949776e+00,8.690411300737255207e-01,1.132871845393769394e+00,-3.890360332443811853e-01,4.101795687213188879e-02,2.579684146643164144e-01,2.905284183336905302e-01,1.849724372839640085e-01,6.634144263507153472e-01,7.676691322526970618e-01,-3.848236265105615672e-01,2.349455423269545540e-01,2.054773064283970996e+00,2.850632632794156684e-01,1.503334180061219327e-01,2.331986242760355932e+00,-9.649501580075087181e-01,1.465470640950283787e+00,7.898967588095484604e-02,9.216605519710661110e-01,3.551190662962701028e-01
1.252356431709018114e+00,1.680027098786355477e+00,-3.422916508025936611e-01,-4.265600851709983043e-01,-4.619989030931548890e-01,4.679595085032285939e-01,-3.019072053924231613e-01,7.420547926370327785e-01,2.482005956582170825e+00,2.004295817892962073e-01,6.040154669336678106e-02,3.405000871819388042e-01,-4.604657558211107116e-01,1.406957053491900977e-01,-2.938309100720835065e-01,2.010554719314041172e+00,1.661917084250008059e-01,-2.747914776596517838e-01,-1.440835927026231367e-01,1.285602675081079782e-01,-7.876137160577493246e-01,7.217483851532328076e-01,-5.365413880635474531e-01,1.386725434348004549e-02,1.407836508458454983e+00,-3.300138029958653019e-01,-2.923737471359931783e-01,-5.483063565035740661e-01,-6.034664118755758144e-01,-7.739885757006110811e-01,5.225650705719260269e-01,2.313924553380291016e+00,-1.815176075128934197e-01,-1.977696249737339040e-01,-8.660573505233530867e-01,-6.505536369801364627e-01,2.192237585664873478e+00,6.294603752687524256e-01,1.062356235170023311e+00,8.893273308021039103e-01,1.200742115179634695e+00,2.956464782011625769e-01,3.666645849769164522e-01,6.006629986702392010e-01,3.089053295914932495e-01,7.178095008240509278e-01,3.133100689061980137e+00,5.868671556523620270e-01,3.648527828839032150e-01,7.639673789335776899e-01,4.712492006949148937e+00,1.803878345207861278e+00,1.351095401482046654e+00,-2.620779558243364615e-01,-1.281692527180617880e-01,1.061567304169623416e+00,-6.828180181586596120e-02,-5.833210946332619828e-01,-1.204769086013707247e+00,1.619489306727955213e+00,2.357701516057514324e-02,1.963174869481119078e-01,-1.759951117757128092e-01,2.205096947731899348e-01,7.860850686198401771e-01,2.550615911472986497e-02,-9.487575102121603710e-02,8.543236953385766608e-01,-1.965981660005821641e-01,-5.376118117972548127e-01,3.118564411402411363e+00,-3.490238362953653750e-01,-3.450721705957766061e-01,3.366564199134366997e-02,3.774758241771779543e-01,6.291568777536655777e-01,1.996809395937337306e-01,4.154439200293786882e-01,-1.127474667105359041e+00,-3.108226600284282326e-01,1.043669910554588576e+00,4.024386090870776811e-01,-4.140506959498612138e-01,1.119712772777017973e+00,7.709917205332407208e-01,-9.189895116826521937e-01,-8.505775027441303537e-02,1.454357706395505323e+00,9.903574490894617721e-01,-1.538403927490110901e+00,2.378007706245765629e+00,-5.636358976135028565e-01,1.853143136006656810e+00,2.977947688880463462e-01,-7.224079199206736579e-01,-3.932165528252913322e-01
9.049900075043419978e-01,1.665445339007727732e+00,1.598162600637233199e-02,-9.015116609555658966e-01,1.495292854009204198e-01,-2.198555163142104640e-01,-1.754497061264134739e-01,-2.857044506437451947e-02,6.348006633513512131e-01,1.054349606363121639e-01,4.901463155689057549e-01,3.452196758434862289e-01,-3.522139988467704041e-01,2.979500577718834919e-01,-4.216775171291980429e-01,1.765983250425359641e+00,7.700280530072822760e-02,4.173317346158977870e-02,-1.442052656989697146e-01,-3.077033820182838858e-02,-5.458444428053582653e-01,1.985746704648182481e-01,-6.420926959539817735e-01,2.100073312368760103e-01,1.645497004725970491e+00,1.464270009608109879e-01,2.880823908299071090e-01,-5.148364220658461221e-01,-6.576581912675221187e-01,-1.054489321739318752e+00,9.180797701870466176e-02,2.053852798188825712e+00,-4.873160636257767298e-01,-1.329796776796522972e-01,-7.458530177834178376e-01,-6.436869406562092388e-01,1.474060553831127995e+00,1.007901098512439253e+00,1.737701696722351308e+00,9.261734837402173515e-01,3.369070678429829102e-01,1.330274799831421828e-01,3.931783507029448788e-02,1.247312814025699212e-01,3.438690543874182159e-01,9.073572091070893908e-01,2.685372135044255426e+00,-7.982649145010342617e-02,-1.564258557015817397e-01,1.539104205381768953e+00,3.458771289647506464e+00,1.208053854896727008e+00,2.547310084678736652e-01,-3.833796364628208608e-01,-3.055103141273277090e-01,1.402222739783605343e+00,4.123350658196980878e-01,1.670307852877644106e-01,-1.063927863649660743e+00,8.659924407770411836e-01,3.385121723148559747e-01,3.165244769821504711e-01,2.730416157223614082e-01,1.043846278303266484e+00,1.097973501441440680e+00,1.754410216426853242e-01,-6.049094631354815510e-01,1.692682882397561484e-01,3.465387537162516463e-01,3.970658108791808028e-01,2.155047440600176945e+00,-6.098105524225526652e-01,-9.471914371289828771e-02,1.922554355756407873e-01,-3.632086391103607759e-01,1.082470420521364662e+00,-1.099162400647081816e-01,9.136086303568786704e-01,-9.785534456682085658e-01,-9.077719877144929672e-02,8.066778266405391085e-01,1.121622659733217953e-01,-8.847876457556913543e-03,1.356460668276872950e+00,1.061612658547448129e+00,-9.253194412312568673e-01,5.160626879662549849e-01,6.948624518317144672e-01,4.331612616065726451e-01,2.214516116289815817e-01,1.492803693446109525e+00,-9.034268964359982723e-01,8.385028608896749613e-01,1.399370540602201674e-02,7.584205741907426024e-01,-2.046619016469924945e-02
1.084099070774907414e+00,1.445624374649794097e+00,-4.956820327234017221e-01,-3.602013522374619137e-01,-1.884600523064948741e-01,5.023538298847788353e-01,4.232263473705749623e-01,3.457108751941980196e-01,1.018872935400461754e+00,-1.531149431725192800e-03,4.234089719653846284e-01,1.191693756191349318e-01,-3.584750856885819958e-01,3.978193457591488458e-01,-4.317442320872733053e-01,1.819545366760599858e+00,1.825330968528004472e-01,-7.386250379260612675e-01,-2.049220981503114408e-02,-6.776402304222065021e-02,-4.969522029358259818e-01,3.623823590339413370e-01,-7.186722038917547906e-01,2.136945545873747410e-01,1.488596086154458487e+00,-5.980586402488102110e-02,-1.950907550705593685e-01,-5.456760604093561229e-01,-7.085534286263138748e-01,-9.480072572929130192e-01,5.311564171200842122e-01,2.007494033012356738e+00,1.449444835205182525e-02,6.697710158542700964e-02,-9.060787496938246255e-01,-8.221294121285598333e-01,1.933338537299052806e+00,5.663899463810890822e-01,1.419165562249746548e+00,3.728392969999577700e-01,8.911934350700816410e-01,2.146690186804529055e-01,-5.992426251730102738e-02,5.602481487944090954e-01,2.353445732457939976e-01,9.036927539959908051e-01,2.468205111382633987e+00,4.764192941545316584e-01,3.906091803320378419e-01,5.988423894444039330e-01,4.697056510023354114e+00,1.849372241401778361e+00,8.888826288595276237e-01,-3.868967117756932361e-01,3.513054775835222632e-02,1.001203988257137301e+00,-2.092754333436044334e-01,-2.959150135848094831e-01,-1.128232540637747139e+00,1.260589885848362179e+00,-1.409897435022514078e-02,-2.569591623832332417e-01,-1.277192972486929645e-01,-9.972668043071097888e-02,6.165659746695659749e-01,-1.133676978746466224e-01,-5.189966861124343245e-01,4.185083465432131722e-01,-4.983682100446932273e-01,4.151085427703620212e-01,2.721173932876301382e+00,-2.108177302777795026e-01,-3.371480888944486387e-01,4.500109668293491572e-01,2.266722860106175630e-01,8.155489960580463160e-01,-2.880767755360365001e-01,3.142701730899364332e-01,-8.187870447832341636e-01,-6.666940946759511988e-01,1.099286397953636474e+00,1.190024626591059120e-01,-3.223456303764549724e-01,1.272806112451545735e+00,7.064862963464573209e-01,-9.650855435655125714e-01,1.109398226141262711e-01,8.094310581292207818e-01,9.734247133097105875e-01,-1.059936723516297308e+00,1.689887130218079125e+00,-6.128484556239783831e-01,1.362301643421389041e+00,2.785625309956573092e-01,-3.998571467031141746e-01,-5.008085344662751570e-01
1.104600000644601066e+00,2.717787193863682171e-01,-2.519043178463686861e-02,4.278165051425497634e-01,-4.608129662908542756e-01,7.989142585966233501e-01,-3.667284642216838697e-01,5.267555818149356472e-01,2.538291861992482801e+00,8.815559761496634117e-01,6.910068116500278634e-01,6.365799412485359521e-02,-5.596974941611565502e-01,-7.206447532825913105e-03,2.004764908691224479e-01,2.295182488148392430e+00,-4.752224934927926081e-01,-4.492475794908536157e-02,5.188571195343300024e-01,6.834296593524357144e-01,-1.368496247795682796e+00,6.004486196250475860e-01,-1.163187163800817325e-01,2.619034479417080008e-01,7.151639069837103513e-01,-1.690538729875068702e+00,6.651734521814862966e-02,-6.506943736847712323e-01,9.669566295175382464e-01,4.608180555647471976e-01,9.068420566027707297e-01,2.721886621799851191e+00,1.304709995240586062e-01,-8.339806046093194425e-01,-3.945131987772528825e-01,-9.196624713037483412e-01,1.077876711654063069e+00,1.453339075824888305e+00,5.376683941231685804e-01,2.185205316276737086e+00,1.658831307435712166e+00,2.814461261062215502e-01,4.880224155330892821e-01,6.177886081644072824e-01,3.091753570485624714e-01,5.109965541198357997e-01,3.371597736378551868e+00,-7.407821853321906735e-02,5.155955286785116609e-01,1.094779302707137969e+00,4.794325682669770217e+00,1.029543306379631096e+00,1.318769572499587373e+00,-7.519395753094830770e-01,-1.072661457843946398e+00,1.393009313619021139e+00,4.818045746874863866e-01,-7.035216760187618101e-01,9.438711368899843634e-03,1.642747894668043163e+00,2.060871805018338332e+00,-5.947932907973586536e-01,-1.276680407751418889e+00,7.650003139262694374e-01,-1.744410623724377274e-01,-8.949472767196866574e-01,-2.329598275196187451e-03,1.969713915946763372e+00,-6.922003178867862649e-01,-1.407166763086671324e+00,3.986664321639179498e+00,-3.951535306231721001e-01,4.401931370741587468e-01,1.298339228471512730e+00,1.679628989269336681e-01,1.963164378746384608e+00,9.455661330479290250e-01,7.698822682562770359e-01,1.270812310013378355e-01,-5.991436029695360599e-01,-3.588096422891744464e-01,5.256303166765444734e-01,-6.952430946414386859e-02,6.698846155693409798e-01,2.441463085811627076e-01,-4.777895642565178624e-01,-3.495301244837595855e-01,3.517075448499118018e+00,7.315679487087701771e-01,-7.806621694755003782e-01,2.963300232409647794e+00,-1.073556592046105429e-01,1.665027532650507514e+00,5.433153270857367101e-01,4.432068409485466765e-01,-7.930100414851459778e-02
8.634059212509234138e-01,3.214278935119286862e-01,-1.538213936341862459e-02,5.938646793488688846e-02,-1.358828555390191317e-01,6.034959190698917508e-01,3.397426159217028507e-01,1.155827750764473749e-02,1.082310091455290113e+00,5.172201563631200205e-01,6.650292140924882744e-01,-9.933388136420656656e-02,-4.803932511598967281e-01,9.025447625496325899e-02,-3.932686882363145564e-02,1.744374028344370720e+00,-5.645000766838037531e-01,-2.565671250161456474e-01,3.877208630430662439e-01,3.843070392683833880e-01,-1.015888130851667182e+00,2.445253649828690590e-01,-3.632718045866132339e-01,3.485275694052074602e-01,1.119513540653984229e+00,-8.376673986074881784e-01,1.991060148492526660e-01,-6.729223870017044806e-01,5.225007285011651348e-02,-2.324128512759806586e-01,6.810739640547031071e-01,2.531055013406553478e+00,7.010661919741512094e-02,-3.302822024389335809e-01,-5.153056535349461731e-01,-8.325446698107760168e-01,1.113522598368963834e+00,1.212349979588295046e+00,1.225895365176178808e+00,1.478138506879659309e+00,1.073641453532448109e+00,3.457114726111749636e-01,7.695233211822341546e-02,3.280922255424918443e-01,4.324052130133720917e-01,7.476908354155522574e-01,2.648927695559877726e+00,-1.223292743037940611e-01,3.730162491126085000e-01,8.162454325006801570e-01,4.341574418956281711e+00,1.357672362655383047e+00,6.248635005459550751e-01,-6.345173207642775814e-01,-7.402234863564693956e-01,1.403601062125091170e+00,3.071794430807203713e-01,-3.363407891226732893e-01,-1.599755374986949752e-01,1.339812787515229031e+00,1.380722965959574777e+00,-7.008377773833389668e-01,-7.634173047454957395e-01,5.726758791609833921e-01,2.996648410668910634e-01,-4.104464792979003462e-01,-4.342284543447916256e-01,1.363868727973702732e+00,-5.768360185314806987e-01,-2.367305396212868729e-01,2.984897588785950795e+00,-3.303637158942256402e-01,3.395959401655861964e-01,1.068909381329290031e+00,-1.354929114238402621e-02,1.623191116648684540e+00,1.916784811017208656e-01,5.133369131650870054e-01,-2.132648577143190227e-01,-7.006614030983553398e-01,-5.398318359631859575e-02,1.431518872581980517e-01,-1.176873747411771309e-01,1.217651989241701482e+00,3.551456589969332889e-01,-7.599456256247160146e-01,3.384190075564835753e-02,2.240560199424976418e+00,7.551127328423263840e-01,-3.301579392009780234e-01,2.019675244437202366e+00,-2.889321093519554018e-01,1.093286152863265803e+00,4.824036157042392858e-01,4.076282446933698345e-01,-2.322784924443288546e-01
1.124053430097882833e+00,1.274728995856521996e+00,-3.897031904153370196e-01,-9.568167294452156746e-02,-1.313154900545948078e-01,4.382097757253364811e-01,5.835911081678679668e-02,3.756605834754868090e-01,1.151035343953505485e+00,2.441506883153805596e-01,7.388011960942173495e-01,1.637121514524445542e-01,-3.680150594864052271e-01,4.838920122362737053e-01,-2.384900266052815687e-01,2.164414997882051495e+00,1.960092920782885995e-01,-5.967202635018180601e-01,2.026424832112124208e-01,1.267126401656287205e-01,-6.840955228445009251e-01,2.978989638458006683e-01,-5.900144651682621699e-01,3.099867895162254916e-01,1.153982165087187095e+00,-6.484606023465153690e-01,-4.089792754521970330e-02,-5.109928102203211697e-01,2.348413174103889389e-01,-3.470880769340765060e-01,6.214195990809119330e-01,1.973065171097760473e+00,6.086381729591044953e-02,-3.539852966725120509e-01,-7.427765284219550734e-01,-9.894730794095145665e-01,1.454186853302469773e+00,9.654744068386050815e-01,1.050587909542240350e+00,8.819800076729580329e-01,1.029878301944535890e+00,5.799280767957376570e-02,4.199558455883438401e-02,6.666541735326563245e-01,1.273462513154330344e-01,8.313224603175165539e-01,2.754637512669338317e+00,2.034946014100990075e-01,3.548093447416788004e-01,1.164634585722568616e+00,4.637837105124377857e+00,1.225651404342880779e+00,9.427072864300461985e-01,-6.186301679130605802e-01,-3.052003985930471508e-01,1.067175455538766027e+00,4.611834017745686243e-02,-2.631532925329731487e-01,-7.966181738649562583e-01,9.911782681773844139e-01,8.875341109826788699e-01,-3.119579500070911449e-01,-4.950044678306030344e-01,2.791336017173261519e-01,1.448979080844520206e-01,-6.314212634429191562e-01,-4.394205098233358586e-01,6.425957757945921500e-01,-5.865555285922290363e-01,-3.181744178390566447e-02,3.213609194824013304e+00,-3.534484956619959317e-01,-1.230699989603741690e-01,1.003292577262500762e+00,5.156837608169838327e-02,1.496485876510738500e+00,2.063128936927445811e-01,6.876903037731831869e-01,-2.049166216553728326e-01,-6.476902040368772706e-01,6.282739470446849772e-01,2.190466098896907132e-01,-5.166959538482909786e-02,8.462716887207919481e-01,6.034266084572923461e-01,-6.374989635994765536e-01,4.710044516023698113e-02,1.606110192631121425e+00,7.140023605548850849e-01,-5.645817527366929767e-01,1.997512898774004508e+00,-6.153760030295476469e-01,1.360905720476162983e+00,2.455157369272695511e-01,3.488908753394741047e-01,-2.057656506920504391e-01
9.050372364032083228e-01,1.455456879161840744e+00,3.141463142106385997e-01,-7.595526950913994435e-01,2.854182397270908778e-02,4.047403475630773073e-02,7.630870460362509933e-02,-4.535089213437072664e-02,1.487852460968052348e+00,-4.849261047844444228e-03,-4.754644357914009078e-01,5.033255659194670745e-02,-5.664487535370484883e-01,-4.738990573316124999e-02,-8.581586974165067438e-02,9.727556652607954879e-01,-6.294851857091259273e-01,1.261330339242339726e-01,-1.483802778177069071e-01,2.062100770344464651e-01,-9.642419172075660239e-01,5.330686492616615313e-02,-6.346112376472228256e-01,1.243902948195341196e-01,1.626904948935823825e+00,4.617450545732569300e-01,1.493922031406025031e-01,-6.612730993432869298e-01,-1.398506839936866086e+00,-1.102767660891057044e+00,2.835224092852747790e-01,2.579589594259674268e+00,-4.014927687359904906e-01,-1.406995326058782525e-02,-8.010086204107216279e-01,-3.328511165000478944e-01,1.887849136358203950e+00,7.464694981715833677e-01,1.391209325424942023e+00,6.879956370815104583e-01,6.118894838043827944e-01,6.019424054732215312e-01,1.344246477281972885e-01,6.940861225084930808e-02,9.037888015076622761e-01,9.482572328419049956e-01,2.712506307253967464e+00,2.534566982581000771e-01,1.071701423282368226e-01,8.414816506558062681e-01,3.561372026038666760e+00,1.699635524541486031e+00,3.192980788791147106e-01,-7.635916018542482364e-02,-8.586262068559258331e-02,1.187309403047363432e+00,-2.338350355951824833e-01,-2.910262080798747819e-01,-7.763106513239284023e-01,8.040321613480354568e-01,1.380193112259189836e-02,2.542170433454280509e-01,2.180805873785416071e-01,5.768847781507691064e-01,1.522227604072934559e+00,8.244218732024788387e-01,-2.560065074808552943e-01,9.942494930016277932e-01,7.060463373203454407e-02,7.042405370688381572e-02,1.933011564690811923e+00,-6.392211965623786352e-01,-1.636532048383579352e-01,-1.686542943743630507e-01,5.324856028784662187e-02,5.849691997999530990e-01,-9.865131554250844426e-02,-3.666271619038430352e-02,-1.426100172986934034e+00,-1.791637231266747787e-01,5.096372754034814712e-01,-2.567619378896137117e-01,-3.746148201336152450e-01,1.787121517503382107e+00,4.951353102506468873e-01,-9.563262706556510118e-01,4.159037497948541717e-01,8.720727816426609991e-01,8.774800389521107968e-01,-5.487371673611739498e-01,1.508544560034452919e+00,-8.820518655821272258e-01,1.345297980148540073e+00,4.205238225632428328e-01,-7.686350434577284840e-01,-1.985192342224244288e-01
8.066679677811001703e-01,1.440382135505982930e+00,6.323993848128093287e-01,-6.079645252060890126e-01,5.472764773456939569e-01,-3.723146138701483587e-01,-9.400193557984437565e-03,-4.914971917088832298e-01,4.598437796161641833e-01,-2.077615467892551804e-02,-2.043154054821545995e-01,-5.698225523190045272e-02,-5.553019093338487089e-01,2.734090950006171084e-01,1.896417801641029355e-01,9.052803580045134524e-01,-7.499756871381503265e-01,1.851157588767115558e-01,1.449541844569901539e-01,3.326382454855162929e-01,-1.071242232725573063e+00,-6.226126237695810417e-01,-7.141576269639617891e-01,4.081355254973326185e-01,1.316821299387755495e+00,3.345313584499388648e-01,5.627385901210277819e-01,-6.038162392983270621e-01,-4.949621429289901009e-01,-5.558048380632825136e-01,2.592962312583220186e-01,2.287965472449881243e+00,-3.698712793321216052e-01,-4.047446016447552863e-01,-6.625792292797976213e-01,-5.276492098460598967e-01,1.071096408234222697e+00,1.231753000418944755e+00,1.091021467816438939e+00,7.295014849362427833e-01,3.015072182258526357e-01,4.040845194183400046e-01,-7.762142811661162933e-02,5.631665144790164168e-02,9.620404630015002567e-01,1.123885700456425329e+00,2.613328574998102116e+00,-2.132269282442595948e-01,-8.104003925794535379e-02,1.786073882213198072e+00,2.915280509226855887e+00,6.908910949036273230e-01,-2.937601841303036920e-01,-3.341745226463704865e-01,-2.355551232474345780e-01,1.133556379713914097e+00,-2.223685944313228413e-01,8.060672891661102568e-02,-2.908444815922166526e-01,-4.824835078801610333e-01,1.049610630300509051e+00,1.896727688134122181e-01,7.574531350953539466e-02,1.010744467085679332e+00,1.143225417906375663e+00,4.143701231729000622e-01,-4.168922370491400797e-01,8.881143572393337404e-01,-7.404542486572512905e-02,3.281186928539788772e-01,1.841774877005523336e+00,-9.824201574542446025e-01,1.874480992334272289e-02,6.745343555218009657e-01,-4.141406839065915335e-01,1.560423271340406259e+00,2.280193923659507571e-01,2.015845355948418516e-01,-5.726244137745821750e-01,-2.227794343027613144e-01,-1.627087729718099673e-01,-6.498997934997829962e-01,1.053067021624420341e-01,1.475062512721793340e+00,2.191401987566735654e-01,-4.455993604617698445e-01,7.274411023760796180e-01,1.062058923850181191e+00,4.260497200562695097e-01,8.540256434299562383e-01,1.078975609742690578e+00,-1.284144838078964401e+00,9.752691601418400635e-01,3.463858191449538104e-01,3.181931309586807366e-01,3.125759948019103396e-01
7.026893119844501712e-01,9.117665017827253360e-01,4.448827079327259404e-01,-6.808288264462483141e-01,2.811124164257922109e-01,-2.244702039952512496e-01,-1.302096798680031919e-01,-3.930495352834291745e-01,4.820617807206307170e-01,3.796738417193705195e-01,5.144652107805270935e-01,1.341699442600280956e-01,-4.543769461075544691e-01,7.447429562475481324e-02,-1.196310884755291681e-01,1.493392027806345279e+00,-5.621202004645382555e-01,3.987996846546797425e-01,1.212154314635568719e-01,2.741984448795484752e-01,-9.157315021036653846e-01,-2.638465481173724037e-02,-4.458851589624326373e-01,3.221582223848754034e-01,1.444095822353283154e+00,-1.822711324007839639e-01,6.132766467280904576e-01,-6.189894917099780791e-01,-3.347620783987124149e-01,-6.555685257802066346e-01,1.562631470252888455e-01,2.434055513535646753e+00,-4.767771235284763987e-01,-3.463793415212554350e-01,-4.930539460984654787e-01,-5.911428066473215504e-01,9.058709436279877014e-01,1.425726461102194698e+00,1.652681237926032942e+00,1.548905781484370525e+00,3.496443329846425918e-01,2.834633994893034359e-01,7.133273664122199986e-02,-1.114256305340094039e-01,5.967108532130203091e-01,8.625968675083162118e-01,2.705812552642052449e+00,-5.045059796886189885e-01,-1.993806598640973649e-01,1.670874583045109052e+00,3.033688332480230621e+00,8.838595370468589341e-01,-1.091740529725356845e-01,-5.003273373293184445e-01,-7.656473137803182505e-01,1.655750021863119592e+00,6.625858229693766255e-01,1.839408789945781997e-01,-3.581881062001497917e-01,7.238809734489048964e-01,1.214520024957633337e+00,3.110083100329891215e-02,-6.242597392494314557e-02,1.495473748867794939e+00,1.030214548891895232e+00,1.435955497699805405e-01,-5.766214576340005227e-01,8.099754243981110990e-01,3.112831534183672644e-01,1.119299566314176375e-01,2.094897780725151648e+00,-7.402966398084370736e-01,3.564944860062854715e-01,5.615814994488637080e-01,-5.605962283942743651e-01,1.583771611308468330e+00,1.344387510293469368e-01,9.107027356026735632e-01,-6.415234995428136244e-01,-1.079568594209099897e-01,-3.361597642884128767e-02,-2.496483223310538846e-02,1.212679319850058501e-01,1.452190021429458966e+00,7.538059828128212958e-01,-7.908865477287875256e-01,5.610444432732897280e-01,1.482409086021171385e+00,2.904525960076500546e-01,8.514067756790693053e-01,1.519538622718350718e+00,-7.685739421789457015e-01,5.910612991987076459e-01,1.816195065373178708e-01,1.205908710386150773e+00,1.807326777725519751e-01
9.916259199038931493e-01,1.337568200784302608e+00,1.990757997039000471e-01,-8.042801635571373842e-01,-3.990507091155602870e-01,2.954512552589543262e-01,-2.007705237914187424e-01,3.456108382820600178e-01,2.608346115560652656e+00,2.200741987758282059e-01,-5.611341286920552562e-01,2.094377858406895887e-01,-6.005226385152001578e-01,-3.628050718794724183e-01,-1.916557829049179706e-01,1.228736802807814721e+00,-5.860854258371727132e-01,3.395183520160657276e-01,-2.962101600074706353e-01,2.543515741902952487e-01,-1.042339785959941700e+00,6.508152465543444176e-01,-4.335417622326419584e-01,-9.630474979600398000e-02,1.718233829800167589e+00,1.993708400545954884e-01,-6.235614801895589254e-02,-7.022272573449562794e-01,-1.648526678702210146e+00,-1.226107069705413055e+00,3.055731035139516716e-01,2.910553506161381421e+00,-4.893841870724385812e-01,3.620498852811640522e-02,-7.833899078759901657e-01,-2.023682590290977190e-01,2.282784871237141022e+00,6.308959853428390829e-01,1.465880819394993928e+00,1.142273335845602977e+00,9.440271671760857020e-01,7.078603095449751414e-01,4.528867380218080108e-01,6.408449495120292771e-02,8.281143417265165452e-01,7.151386522645201138e-01,3.068527733419349701e+00,4.245748851362629583e-01,1.833674400977481911e-01,4.321986645335033073e-01,3.932835359787646645e+00,2.167828623453941894e+00,8.548673625053452296e-01,2.987670985624840680e-02,-2.575273139357507901e-01,1.367750559736509830e+00,3.678608066468985749e-02,-5.858080203182491896e-01,-9.685192870469447879e-01,1.843868653956441062e+00,-2.956199196139919216e-01,3.706320815963303206e-01,1.502078351480749252e-01,6.222718883141895585e-01,1.675678002283847334e+00,9.533931092865371992e-01,-2.788160263016259410e-02,1.298122146071064353e+00,2.971126251115567829e-01,-5.585849363706659743e-01,2.266949296477851483e+00,-4.746026305884107899e-01,-1.292081042960547821e-01,-6.786355794197889146e-01,3.065852806122814078e-01,1.310004242395710339e-01,-2.461083575419409364e-02,5.410065683638526357e-02,-1.889964646546319571e+00,-1.737205007869491169e-02,7.411922178215959445e-01,1.927827641526286828e-01,-6.233304897076026307e-01,1.838432191738686550e+00,7.238908606868962314e-01,-1.228085634597873677e+00,1.218697984851727367e-01,1.289935905501773838e+00,1.066037613956768215e+00,-1.395521458232167555e+00,2.141414108730932853e+00,-5.173563706688122377e-01,1.641100890616996821e+00,4.530760606788572509e-01,-1.177836920791470066e+00,-4.161220767409573029e-01
1.026601083516911483e+00,2.110178027544254764e+00,2.335172950196809927e-01,-8.936105473877158367e-01,2.219635900678328944e-01,-2.908125707145173267e-01,-2.407472348456797806e-01,2.307320935820893204e-02,1.213220959965155110e+00,-1.633005431330935842e-01,-3.340125221348227424e-01,2.326616672222177884e-01,-4.890501394729740436e-01,2.857228724287877442e-01,-1.344068284200767849e-01,1.238689545319281216e+00,-1.739126050356010200e-01,4.231968860025217549e-02,-2.032797991762015644e-01,8.352554394883304756e-02,-7.892701900565218809e-01,-1.173466896365603640e-01,-7.885410599315170188e-01,1.767947317493267778e-01,1.577370568155219477e+00,5.603078392689668785e-01,1.792964584521402338e-01,-5.328001415511248728e-01,-9.921060923832469847e-01,-1.024788767542527124e+00,1.746744577948561028e-01,2.139658810986558635e+00,-4.741154847125669258e-01,-1.817115952797918599e-01,-8.839577523243151713e-01,-4.673139243976877077e-01,1.808830765284206388e+00,7.949021195457894873e-01,1.227155308109364462e+00,4.100626844050825337e-01,4.232181898198630332e-01,3.408090220121827163e-01,7.566784176010550589e-02,2.285067585039390337e-01,7.301393840069843044e-01,1.047388389466378467e+00,2.803042477716748859e+00,2.506252538806879593e-01,-3.920478189753485998e-02,1.488715709073928029e+00,3.395749256235241820e+00,1.221956271283486828e+00,2.745385710907339849e-01,-1.423804711620963448e-01,9.684827278485391711e-02,1.013619582658238150e+00,-2.993308096062371471e-01,-7.366542902577426222e-02,-1.045951585595500610e+00,1.615250182506857701e-01,5.193307193804183597e-02,5.810914505988032941e-01,4.039193683877237984e-01,6.871668302777608206e-01,1.374094383699136612e+00,5.932007240907170020e-01,-3.101818607887290580e-01,4.617440230997754691e-01,1.511839293850139876e-01,2.502683756036057083e-01,1.995333954905902374e+00,-8.125637928671352039e-01,-3.764132727797367406e-01,-6.724980757833481926e-03,-1.234473659074267482e-01,8.270207023466160656e-01,4.653965988984459790e-02,2.475175540360768367e-01,-1.194831685383791919e+00,-6.631686032080008619e-02,7.190881800409700819e-01,-3.073902260110326634e-01,-1.455459515005143589e-01,1.453569337276526818e+00,6.356540870051463621e-01,-7.200953042605615639e-01,5.656276663086784451e-01,5.193205817461784557e-01,6.383401286378195261e-01,-1.192724383508046437e-01,1.364574896249083125e+00,-1.249240926555155173e+00,1.346968603990639224e+00,2.028773912249575428e-01,-3.155051555758801585e-01,3.987141636882057805e-02
1.276791186037106840e+00,1.577538058563856094e+00,-1.545638812639586468e-01,-2.187218897130827067e-02,-2.387216459730369111e-01,5.394436138965155170e-01,-4.299353198493199857e-02,5.627835955692305214e-01,2.300866595894409450e+00,5.605506141016297628e-02,-2.812481668289373293e-01,3.079200011311394869e-02,-5.632904547738710743e-01,2.946155372189514510e-01,1.011179676640939773e-01,1.585198632808397123e+00,-2.001460433054291777e-01,-5.197155407699571850e-01,1.241326743866260629e-01,3.274592801325719726e-01,-1.060932380848889078e+00,1.567385747743442193e-01,-6.511310404610076707e-01,1.950341602236094762e-01,1.076739064926067746e+00,-3.282453204413366965e-01,-2.492493180843375622e-01,-5.760208071694635779e-01,-2.591651815809868920e-01,-3.093377200983513653e-01,7.795186370806604925e-01,2.289262364928143167e+00,8.893265707160646905e-02,-3.870711546408474590e-01,-8.709264706667922962e-01,-7.249818718972125264e-01,1.971961670226006991e+00,6.842461742203466146e-01,4.593925570826380422e-01,5.125108386513465009e-01,1.321484183506894450e+00,3.944528401906039483e-01,2.097453384921174058e-01,7.743686628489103718e-01,5.940313045111499379e-01,8.908852195419458830e-01,3.007518006559624979e+00,6.477571151195775645e-01,5.726194066856389320e-01,8.291897354954281818e-01,4.763093524000243661e+00,1.477349685758269970e+00,1.178856237782284433e+00,-3.021423485010797938e-01,5.277265952025200768e-02,6.974814097038189997e-01,-6.972813888243921676e-01,-7.145357463280328503e-01,-7.391868279239468542e-01,6.370055212275123058e-01,5.100751134526797514e-01,-6.678910813879568309e-02,-4.575428330947068911e-01,-1.642539722329293683e-01,4.992193522676791062e-01,-9.238478260021948385e-02,1.102903071140026725e-02,1.255940805301028362e+00,-8.056402790985666140e-01,-4.990319073857453214e-01,3.182910526000814144e+00,-4.980575526199698677e-01,-3.824169708110257138e-01,6.221651644468688680e-01,4.688431847958526300e-01,1.039410052311513288e+00,4.219135499015873036e-01,-1.359146068935405127e-01,-6.069796714643912461e-01,-6.133482017159146427e-01,5.102978239398529015e-01,-1.139026071718535205e-01,-3.385139135942034638e-01,1.019189558138217766e+00,1.103549768328592195e-01,-5.098806560344155692e-01,-4.741527770705117328e-02,1.702290277826156828e+00,1.074894989557326541e+00,-1.352256781632242166e+00,2.122476927641861799e+00,-8.072805429944029942e-01,2.082193331229577282e+00,5.430999458421188475e-01,-1.150173058156432226e+00,-2.530804239274103140e-01
9.213199657444910429e-01,5.185102188819301627e-01,3.740642012543140549e-01,-1.458220635054378045e-01,-1.804858039649249180e-01,2.255598872707509361e-01,-6.379902941632231705e-01,1.594932336571622256e-01,2.090116552648868087e+00,8.299993339782302249e-01,5.565714679410264099e-01,1.990815971707775855e-01,-5.570555646300459074e-01,-1.322369437600828812e-01,1.338315454111137504e-01,2.015175608423726228e+00,-6.173517559473005178e-01,5.254234572630722688e-01,3.174115409226260787e-01,6.249098094207417020e-01,-1.329313926447721173e+00,4.450079262275583591e-01,-1.282649124933126217e-01,2.245512079070218214e-01,1.009510488809080675e+00,-1.189911564042336334e+00,4.067012382240249857e-01,-6.490748258479130950e-01,5.123698460787160514e-01,7.339196067949993463e-02,5.016282088274746087e-01,2.785069266397373067e+00,-3.002750447809959256e-01,-7.820998814150472711e-01,-3.426521829309413514e-01,-6.807181722666636459e-01,9.172750970458564135e-01,1.621207354801274647e+00,9.800924555782908332e-01,2.355222205074124275e+00,1.111362858645855711e+00,3.096090996639845327e-01,4.971552382047164098e-01,1.904606666272118942e-01,4.877149892113498142e-01,5.685535193620454564e-01,3.374390046868152915e+00,-4.064816189748895470e-01,8.303012397407827372e-02,1.582875894857565413e+00,3.762901658512777026e+00,8.022872561157543547e-01,7.160836742471795580e-01,-6.280299625825441767e-01,-1.171319861094024528e+00,1.680172943317932654e+00,8.311387695881810034e-01,-3.301223529926264888e-01,-6.638177184427040967e-02,1.380862119479473460e+00,1.915310008666559094e+00,-1.119918966015335249e-01,-7.582319147683663774e-01,1.508346507120966518e+00,4.750496258085958878e-01,-3.703490212406075344e-01,-1.208900695988103235e-01,1.670419362791823348e+00,2.855391140385326459e-02,-1.158934899447553679e+00,3.222805494973469020e+00,-6.659949741827722036e-01,5.388370225934190350e-01,8.283269055072217668e-01,-2.393339801887385820e-01,1.855815411623462863e+00,8.325423621167922228e-01,1.031793526023455643e+00,-3.013006147312995431e-01,-1.476363403694927467e-01,-4.052541194039567252e-01,4.191600695280652267e-01,5.661327354340456308e-02,9.799010020658414089e-01,5.490233408889335642e-01,-5.971197143062139112e-01,3.905331460872718541e-02,3.001552537414334587e+00,4.178773050997717231e-01,7.478124381034978452e-02,2.592778143692740400e+00,-3.660026518621406488e-01,1.217023591932805182e+00,3.580128002988997582e-01,1.001919587294633374e+00,1.776429188654261582e-01
1.079818835368867802e+00,2.128975260609339948e+00,3.008085761409230452e-01,-8.083430683362415881e-01,1.402294252460701274e-01,-1.571479418881206458e-01,-1.745946482246233944e-01,1.019787479122212515e-01,1.694647570823292204e+00,-2.360100232715882929e-01,-7.652945241039412760e-01,1.312386586475055572e-01,-5.761925304828673378e-01,1.808872977622664746e-01,5.667121295081511967e-03,9.611958395576717384e-01,-3.879570751098073700e-01,1.536967238068087660e-02,-2.166153339033463077e-01,1.717962701341967935e-01,-9.526819183290887727e-01,-1.558510080377312201e-01,-8.062962517940301943e-01,1.299044357475694911e-01,1.545331531664441371e+00,6.778672567994561415e-01,6.032687356515542554e-02,-5.780984122159380512e-01,-1.258034099041551723e+00,-1.020278307231253567e+00,2.831529755904429457e-01,2.312117442165368519e+00,-4.127843927759469178e-01,-1.496698268420731393e-01,-9.389326667719984920e-01,-3.586303500679975942e-01,2.055306806452032120e+00,6.396449597179423296e-01,9.969781870270899571e-01,2.356458822388322050e-01,5.928821817359811730e-01,5.159787375710200852e-01,1.298896605516257907e-01,2.799146986663824110e-01,9.353432160259407269e-01,1.066101993599945619e+00,2.856219380196099777e+00,4.682857001420325238e-01,1.069096863230374339e-01,1.197192532823987632e+00,3.550781795431590560e+00,1.433156809610552918e+00,4.029686631568736854e-01,-7.388555365973548117e-03,2.510537304329600872e-01,8.540128891477138939e-01,-6.452462818996184124e-01,-3.081941330932044254e-01,-9.903773374312129230e-01,1.113227337923681226e-01,-1.364418138199795238e-01,5.859702752381961144e-01,3.718595670662475650e-01,4.009313055886557509e-01,1.502420509085064193e+00,8.224816950560699391e-01,-1.273407783265111948e-01,7.828529238105752519e-01,-1.662577774839400085e-02,7.186302227746554916e-02,1.996418936188766757e+00,-8.180456516643186404e-01,-4.728767120873557661e-01,-1.540297758051633326e-01,1.057136252200265719e-01,5.943573534665641533e-01,8.578078050285259382e-02,-1.735346069647052403e-01,-1.370278802889558722e+00,-1.180009603970347820e-01,6.666858929751811047e-01,-4.485794298184563877e-01,-3.115707564887768566e-01,1.568834018777397254e+00,3.884767427707624954e-01,-7.029027699366021675e-01,4.878553723864901270e-01,5.856185477499773473e-01,8.540353000904212788e-01,-5.687173947849952782e-01,1.421572569510582973e+00,-1.264033289503808444e+00,1.661503888348160096e+00,3.705227572531305524e-01,-1.059897131530250780e+00,-4.694953334311718907e-02
1.189002026524290434e+00,9.640373636561438975e-01,-1.881322911857044589e-01,2.015617471378073899e-01,-3.775972679831264833e-01,8.249777953927188712e-01,1.778250396903576225e-01,5.267865800614958127e-01,2.311669284334458396e+00,2.698660863972473511e-01,-5.856972746498895210e-02,-8.343579729034311665e-02,-5.756561931995078929e-01,1.405659568674209048e-01,1.097598976651253944e-01,1.639420356508197063e+00,-4.124212813993167748e-01,-5.378938488358951941e-01,2.617655865555031380e-01,4.183461035560511188e-01,-1.143704674293085866e+00,3.136368465380480752e-01,-5.002901420233575314e-01,2.131888849996295965e-01,1.013619619040827535e+00,-6.697549567162555118e-01,-2.389973982621766690e-01,-6.458046366257492732e-01,-1.658408135729605437e-01,-1.868918713212182059e-01,9.018900786823871307e-01,2.510885565172492839e+00,2.116944855973533213e-01,-3.557964257569151134e-01,-7.554000439225316832e-01,-7.631360556935615769e-01,1.826879772643702715e+00,7.744127596316815465e-01,5.683137539952323181e-01,8.723818884527854145e-01,1.497685045186363029e+00,4.656918047857331322e-01,2.284106010647324325e-01,7.226707389987756525e-01,5.620215242138338896e-01,7.851827097854892079e-01,2.938113346873116427e+00,5.378118986939448565e-01,6.850711787137164777e-01,4.911614836266633422e-01,4.993169058609440825e+00,1.659735179788480730e+00,1.251871680763472439e+00,-3.971844506026585009e-01,-2.155679933057470243e-01,8.754416880837626591e-01,-4.816873781357015050e-01,-8.122721931043181964e-01,-4.742191960459132827e-01,1.149661427150283188e+00,7.863794196039191053e-01,-4.461617229865590950e-01,-7.555032078430805598e-01,-1.757644264716589078e-01,3.229980610129299379e-01,-2.418555201769402307e-01,-2.292855231867174659e-02,1.585519994664364773e+00,-9.450972650911259043e-01,-6.426701111425170421e-01,3.360476065278138247e+00,-3.306947147042290092e-01,-1.397591575817643816e-01,7.896760039567536360e-01,5.211184100833265997e-01,1.137302406355624296e+00,3.874173163246608653e-01,-1.126516449975107914e-01,-4.788800237538695104e-01,-7.700930431538426379e-01,2.915492697144790313e-01,3.030122245495162070e-02,-3.956998909715719881e-01,1.081486461557792156e+00,5.173519658308545210e-02,-6.184265516511728844e-01,-2.017906442803490408e-01,2.173953132157818491e+00,1.154136641993735779e+00,-1.493124232459797307e+00,2.309015008436870353e+00,-4.648146029313505734e-01,1.977647302578241728e+00,6.517695274623194202e-01,-1.051110368106848547e+00,-3.878654157148100357e-01
1.183886658988810403e+00,1.567660045307440964e+00,1.891199780034391043e-01,-6.410536739600395384e-01,-4.867529771457533294e-01,1.942800884023520025e-01,-9.186970498918913819e-01,6.805114439680918226e-01,3.342031603266245376e+00,4.588533480140644105e-01,-3.238362095046758982e-01,4.463246368971087175e-01,-5.988690189166583355e-01,-2.588081278739075564e-01,-6.422171867892617625e-02,1.828362448293755937e+00,-2.818729750201953155e-01,5.291612344769262011e-01,-2.092694042373595964e-01,4.078915929135657481e-01,-1.189774109275338443e+00,8.143022426572942285e-01,-3.038707520297989628e-01,-1.098797806011635736e-01,1.403423328390430047e+00,-4.270603788605015771e-01,-5.493184550921539899e-02,-6.147347768321311801e-01,-6.691358458728597913e-01,-6.604358863680448444e-01,3.628812004446448913e-01,2.809067164477932810e+00,-5.263809441822913104e-01,-4.491019789469419821e-01,-6.899771108900945027e-01,-3.543222800642082393e-01,2.069192384054272082e+00,9.362387464541935822e-01,9.722600597171343617e-01,1.655898531597187917e+00,1.193802193857544935e+00,4.827027224130573391e-01,7.129136084908849202e-01,2.946987515108784317e-01,6.100877409635790949e-01,5.815893880086535628e-01,3.633477690419681938e+00,3.245896263284135941e-01,1.355956752363171591e-01,1.105628922837949446e+00,4.033849513284175181e+00,1.568459958678594113e+00,1.234873269301958842e+00,-1.415366456788382798e-01,-5.147157937246383819e-01,1.368931132733787193e+00,2.988588458047417573e-01,-6.437234209442475041e-01,-9.381103800670271831e-01,1.737697485948890286e+00,3.655503419137304810e-01,6.130567781884999068e-01,-1.270184325919383739e-01,1.004894548664817311e+00,1.235368556713390742e+00,4.241198224886893464e-01,1.966460737460724584e-01,1.408417989038063478e+00,3.494201657443943843e-01,-1.285859052622889021e+00,2.992218669670132503e+00,-6.346648253406695916e-01,-8.043754763801926055e-02,-3.689629189000749321e-01,2.307068317046072625e-01,6.257240787530891080e-01,6.092401489358940658e-01,5.505977332952456393e-01,-1.453827711417802870e+00,1.570936356805937573e-01,5.599298723934429400e-01,4.830644033618168298e-01,-3.953211892904961999e-01,1.250602075311133765e+00,7.891497021428811598e-01,-9.014098009727296024e-01,-3.403069206237124833e-02,2.079098793783131782e+00,8.217682137140123189e-01,-1.250366425419830563e+00,2.731003291551448164e+00,-5.635248486906243581e-01,1.906993098372217421e+00,3.345436498817299098e-01,-5.888550325395200957e-01,-1.198065876688404474e-01
8.959643232495511089e-01,1.005913617109920333e+00,-1.184333318172313548e-01,-2.827306252953336041e-01,1.109636233110662257e-01,2.172586579578138499e-01,2.553233394623605212e-01,-6.196206216333979833e-02,3.973329911565819939e-01,2.410407368136552875e-01,7.817858208452629354e-01,6.424917538953439644e-02,-3.695878028098010804e-01,3.980290351185639675e-01,-2.363745051856874779e-01,1.832589334377815682e+00,-1.159114078189560360e-01,-3.711140231780142851e-01,2.229302854661403543e-01,1.249109528692056992e-01,-6.838315592975175994e-01,5.882134277566836156e-02,-5.859464043882315343e-01,3.835430356843849697e-01,1.290738040805592401e+00,-3.944107335400655612e-01,2.450727247609337800e-01,-5.588876522514716338e-01,-2.693698601491556488e-02,-5.203936371390242011e-01,4.547186960625502206e-01,2.068726717736109499e+00,-7.038690997019639295e-02,-2.546776430626274679e-01,-6.522714538902572023e-01,-8.928567860805187717e-01,1.147812763522055191e+00,1.124718409609041014e+00,1.412861122326730889e+00,9.853047382534865228e-01,6.749589607061927676e-01,1.285212594892737870e-01,-9.142248476402498047e-02,3.460041660361714011e-01,2.881297413452329481e-01,9.002602530196621711e-01,2.500868372901447589e+00,-1.127901652342108707e-01,1.599911758060881817e-01,1.269366287282180039e+00,4.028631383526516174e+00,1.129977737748016686e+00,3.814550454036148563e-01,-6.185998887314834160e-01,-4.439920467319460884e-01,1.285486246457475445e+00,2.449787393697478999e-01,-3.075079510454881149e-03,-5.786510330414494918e-01,8.025960208274697250e-01,1.015054446780037090e+00,-3.635923316319755183e-01,-3.319296287391915179e-01,6.335326345101425227e-01,4.232641139510224804e-01,-3.807345334952842997e-01,-6.377395769945886084e-01,5.900399978161768866e-01,-3.550549441237864090e-01,3.393817985992781949e-01,2.651766106140201806e+00,-4.432468717931815627e-01,8.224632733997834511e-02,9.816837565997806880e-01,-2.288198970409686672e-01,1.593835533343800348e+00,6.181242973453737743e-03,7.295567441953580978e-01,-2.656932160179081848e-01,-5.734594986093122237e-01,3.729808175659398151e-01,3.327187162785720520e-02,3.776773544394546045e-02,1.144942270075695490e+00,6.295750527583083844e-01,-7.225834713062544434e-01,3.016204371450601496e-01,1.370118906931379277e+00,5.555012745605910629e-01,1.288092482260737026e-01,1.588135887354323206e+00,-6.659679662427557822e-01,8.909043724342047277e-01,2.266680292472408875e-01,7.806043850131074713e-01,-1.059424176540643137e-01
1.220805224281749979e+00,2.378448298566806507e+00,5.899126362750525265e-01,-1.105643837268046159e+00,-1.536144958924009485e-01,-5.173919543935778798e-01,-1.609361368988204477e+00,5.559225292607579139e-01,3.389431307247606995e+00,3.093718402554165858e-01,-6.629171369194979402e-01,6.808905009491929006e-01,-6.254320421344305991e-01,-1.654343818782933462e-01,5.268248244195383734e-02,1.704841627256699299e+00,-1.905513216045558456e-01,1.040078311479121442e+00,-3.882329535284610444e-01,4.215730966653106204e-01,-1.254168159047315267e+00,5.052947543734096492e-01,-4.049913224376033849e-01,-1.313382132609698660e-01,1.458993159872003176e+00,-2.189000984438440461e-02,2.011211109907949934e-01,-5.264126486505098512e-01,-6.062175168848868978e-01,-6.927778831288218253e-01,3.894016192942767463e-02,2.651988132612747684e+00,-9.243655302582272082e-01,-7.094856761944949852e-01,-7.109023359778097184e-01,-1.993444898543810240e-01,1.955644889636866335e+00,1.128823838578316252e+00,8.149599058220822201e-01,1.627425306432906726e+00,7.869831972385019636e-01,3.903574533096613730e-01,8.095330345684564888e-01,1.555883122989846767e-01,7.767852522923737180e-01,6.927795697967433775e-01,3.956921075516872666e+00,1.553023230714407343e-01,-2.576141692218694712e-01,2.075182741125973340e+00,3.098388193458581519e+00,9.038540051437080614e-01,8.619495530921932325e-01,-2.853703305372090604e-02,-4.257231540636129408e-01,1.339968965239985765e+00,3.224846619541696935e-01,-3.636700117767907026e-01,-1.093492777573901842e+00,8.151521431300872145e-01,4.133004256063272930e-01,1.385562210654542659e+00,3.368700842668530537e-01,1.663580334508744318e+00,1.652433835260764594e+00,7.308862017481538853e-01,3.001783306779133298e-01,1.095963013631111149e+00,9.076619199038314934e-01,-1.351536917527954573e+00,2.599245395692838745e+00,-1.107745708223403902e+00,-2.080140064174978431e-01,-6.355133066264997410e-01,-1.146672154789221548e-01,7.464012492313475411e-01,9.178902529442656277e-01,7.838776464717176484e-01,-1.611461093466507677e+00,6.634129404665832785e-01,4.884797859509633078e-01,2.776248168851963571e-01,-1.483559266596226889e-01,1.158009147811859707e+00,9.225470616533182344e-01,-6.508886269515656853e-01,3.256482407167696769e-01,1.724492959837462980e+00,4.417396943938264875e-01,-4.161038782807436887e-01,2.521596045260381835e+00,-1.140367225005496365e+00,1.877333797179521646e+00,1.218600465970155478e-01,-1.701970072365088793e-01,3.619579888230625153e-01
1.245612018010270106e+00,2.023225995203980609e+00,-4.519787803383717995e-01,-6.595875369596098103e-01,-3.763458055153149351e-01,3.630225619960258943e-01,-1.067813471258409752e-01,6.847748015661866416e-01,2.071675292306314198e+00,-4.584145236755785002e-02,-3.203999028319226561e-02,3.610786456592315341e-01,-4.082627564497783301e-01,2.490498279046635677e-01,-4.606112615476929406e-01,1.867192733229955603e+00,3.399016055022357485e-01,-4.421162631858687742e-01,-2.983638903950463495e-01,-7.426569297982857365e-02,-5.552494657965931779e-01,6.452101696763189453e-01,-7.034892393701095425e-01,-1.055579324392125207e-03,1.623373200323046328e+00,1.341288674822777305e-01,-3.537469570919671291e-01,-5.185440110036154682e-01,-1.070102123469264921e+00,-1.163656819471046378e+00,4.081777282133335349e-01,2.120413382010263970e+00,-2.284504569985185418e-01,4.212188779503223124e-02,-1.005854497557180594e+00,-6.141061541854831995e-01,2.423880455432172454e+00,3.928568529763554196e-01,1.300291681866319937e+00,3.947614736832356641e-01,9.763441978352634942e-01,2.794107781423044168e-01,2.210239300335198331e-01,5.755787924116888554e-01,3.005043365943781408e-01,8.289008287854694457e-01,2.896223844956418603e+00,7.311516974657912282e-01,3.171527728119775680e-01,6.552605931367758707e-01,4.648809738465093488e+00,2.010494725651462034e+00,1.217097962205810457e+00,-1.553233487815048608e-01,1.768248787649495668e-01,9.555382914054824095e-01,-2.574788304938732120e-01,-4.641903610664104285e-01,-1.517283178659669662e+00,1.486221051664126103e+00,-5.449094527504809715e-01,3.148515155461066861e-01,1.554513515540729141e-01,7.834701320074022313e-03,1.024550375212005981e+00,2.588740646949272972e-01,-2.310612292748153163e-01,4.269412366661504143e-01,-1.222831068170219249e-01,-4.299832969274380856e-02,2.751946495631925504e+00,-3.153627908232892740e-01,-5.597759883085908772e-01,-2.135493288026897585e-01,3.827881926827743087e-01,3.142054184627802726e-01,-1.290688686574750776e-01,2.924363996771552898e-01,-1.398528126306481267e+00,-3.106668669085350665e-01,1.435661598288150431e+00,2.814428213657843569e-01,-4.778439537434524542e-01,1.288897704229857055e+00,8.991856926260175520e-01,-1.046489346469032800e+00,5.403636947592471707e-02,7.024750859213048093e-01,1.045961883733958597e+00,-1.588098599996605520e+00,2.021080885198458077e+00,-7.201505879559398915e-01,1.769043037498907456e+00,2.212206274948574636e-01,-9.474234572538513532e-01,-4.932499316006087042e-01
7.929282741973574522e-01,9.091065070779088542e-01,6.176171743148001214e-01,-4.116216632818051613e-01,2.871913676322061515e-01,-1.330211217188162487e-01,-1.966475524646124629e-01,-3.328355641861580061e-01,1.023281644115154210e+00,3.533926521810067944e-01,8.082853179967747215e-02,-9.782981812567675961e-03,-5.755279257597679665e-01,4.971193517278442442e-02,2.074821815470809794e-01,1.241849406832666203e+00,-8.479873890018463367e-01,3.891525181330358074e-01,2.483317425795968925e-01,4.918587441753098366e-01,-1.230164469078933731e+00,-2.438644279707465889e-01,-4.504789687114539865e-01,3.519683585694503014e-01,1.194721931584542762e+00,-2.733711793569991166e-01,5.656205247313141893e-01,-6.505707459849041641e-01,-1.377951617044758104e-01,-2.939361355189724634e-01,3.532547124937350791e-01,2.576156163051916970e+00,-3.488807809235839885e-01,-5.479055589437711316e-01,-4.933588129728447846e-01,-5.569330215596537403e-01,9.248076245772016701e-01,1.440516810815201332e+00,1.091481965252337982e+00,1.464811857545837315e+00,5.973694388194442650e-01,4.178839717967494094e-01,1.403837365415809002e-01,3.263349297850497155e-02,8.418312589952214875e-01,9.019405117912964176e-01,2.875221100040137756e+00,-3.675183080973678518e-01,-2.853839208721760390e-02,1.670180866877881698e+00,3.147059214980148845e+00,7.343863473826006683e-01,1.633837278664784787e-03,-4.535780458878428956e-01,-6.803122786590627413e-01,1.412363401669780139e+00,2.387432853443521852e-01,-7.087345005547612820e-02,-7.620317170478929647e-02,2.636184071666796136e-01,1.490839601520213442e+00,5.171479966509962001e-03,-2.845356436843423653e-01,1.279774099784224628e+00,9.223079132710449990e-01,1.578597472194737394e-01,-3.138026729694025629e-01,1.309485505747885581e+00,-2.163063692221325190e-02,-2.582587609562392306e-01,2.303390433385413161e+00,-8.678762182675534564e-01,3.118662680940649801e-01,7.558807619072606121e-01,-3.802454353275482313e-01,1.716171699942543150e+00,4.544899346534972406e-01,4.974587811145130267e-01,-4.602562998453607612e-01,-1.982279564009130635e-01,-3.977296330451534079e-01,-2.672455927040386370e-01,8.761865330611695590e-02,1.358598214552975580e+00,3.005863245711397624e-01,-5.207920415233232569e-01,4.785729203976643586e-01,1.909245543218202057e+00,4.140622676895970855e-01,6.530247521955339085e-01,1.638395120301878283e+00,-8.844746750097538524e-01,9.930300757390503330e-01,3.892438163872096180e-01,6.308495057070269141e-01,2.703854055859011840e-01
9.929263322705003114e-01,5.183181238386298517e-01,3.800285846496225250e-01,-8.204336323732830394e-02,-3.375630853031620915e-01,3.559036712827715609e-01,-7.387461072549557084e-01,3.329929891028757805e-01,2.700141160958239084e+00,8.700915797821471287e-01,3.264674140319681062e-01,2.023597595147873796e-01,-6.134601221225841616e-01,-2.515508434934150550e-01,2.028838239657173581e-01,1.988519210026271855e+00,-6.942094844989967761e-01,5.742114764303226648e-01,2.895314648489430986e-01,7.038467692723430202e-01,-1.456070860366663222e+00,5.810202587466601898e-01,-7.615246153761423553e-02,1.471915010379842847e-01,9.737925572199399582e-01,-1.262457072732201091e+00,2.896544126204714797e-01,-6.747803500987399339e-01,4.213693762573427204e-01,1.159321471804732884e-01,5.789838374254885345e-01,2.947346049703057247e+00,-2.845048124044761706e-01,-8.068683069832696120e-01,-3.581483711733701725e-01,-6.100010250699817727e-01,1.121001682286311585e+00,1.541518245498402884e+00,8.105607075478244994e-01,2.420769629778247278e+00,1.316888294075218901e+00,4.070484379831137423e-01,6.289622326913094641e-01,2.472108633204375683e-01,5.587226438263285244e-01,5.093158912472030009e-01,3.547119850086298154e+00,-2.550753692674139206e-01,1.822033808622391948e-01,1.393109480190239280e+00,3.958048087450503960e+00,9.644975928935171083e-01,9.587353122392840987e-01,-5.498213892372146860e-01,-1.154967727672229216e+00,1.631453948917547248e+00,7.277268821925804154e-01,-5.394288790051940952e-01,-7.194909061223864200e-02,1.586165142891772906e+00,1.817766751883712839e+00,-6.489817520168628118e-02,-8.309110127778022159e-01,1.393921194120719909e+00,5.242901785511534518e-01,-2.786587514953571265e-01,5.888885653850017832e-02,1.937887081306385095e+00,-1.646669870045961576e-02,-1.486691048097833034e+00,3.389605616232443275e+00,-6.448003927772907318e-01,5.000301371001966144e-01,6.709369624572056878e-01,-5.751952116998182429e-02,1.679716678331951263e+00,9.424972304944763124e-01,8.702045578500100520e-01,-4.507086515479366007e-01,-1.265057944076493635e-01,-4.039984537940135567e-01,4.776146733841606928e-01,-6.926702430911610420e-02,9.882599503532539797e-01,4.666473269713060645e-01,-6.131298121639980891e-01,-9.423206449175403066e-02,3.231892953232859078e+00,5.580913423781733718e-01,-3.628646702001325219e-01,2.839999596998467268e+00,-2.899202211203205648e-01,1.492788256373938527e+00,4.489311331290391505e-01,5.541749396664779059e-01,1.084970022088849184e-01
1.091340898416690797e+00,7.663646326525603847e-01,-5.792057638785393092e-02,7.109419052707677267e-03,-3.709212153070319817e-01,5.441219676945711070e-01,-3.710814265265158229e-01,4.772396070749488350e-01,2.257322653343655894e+00,6.475788429567278515e-01,5.424660748952133682e-01,1.870155644451046706e-01,-5.071694834710241961e-01,4.052665211369592402e-02,-8.271704764232834517e-03,2.168318621434952131e+00,-2.662510391977554458e-01,-1.240839147669187126e-02,2.644071802800936344e-01,4.627820441831599352e-01,-1.126543627952921955e+00,5.931199024552591403e-01,-2.631449081186190697e-01,1.901168253757832272e-01,1.021464799730098516e+00,-1.132724728173110762e+00,5.024500034789300407e-02,-6.107938226842798413e-01,3.769597503507351455e-01,-4.691069968872607632e-02,6.720541184347768038e-01,2.561791245811694484e+00,-6.811425867490861208e-02,-5.995837971837774116e-01,-5.304132990865710884e-01,-8.024252531954692014e-01,1.354654384510559639e+00,1.240778759990336155e+00,8.726265257865040148e-01,1.798931239594369069e+00,1.339910811184625850e+00,2.627732155615575271e-01,4.171491647379350631e-01,5.017877771830655531e-01,3.141028903403186301e-01,5.986137936114999114e-01,3.244725893021548568e+00,2.622259943482412037e-02,3.470209839075740765e-01,1.125517894745721614e+00,4.508745881209407891e+00,1.208323183210260998e+00,1.144987816082574605e+00,-5.906188387613366952e-01,-8.019561455792511007e-01,1.374284336372127990e+00,4.295003651331227856e-01,-5.267279268406105386e-01,-4.093649393033848005e-01,1.572413928971217567e+00,1.383577683083396348e+00,-2.558468441638327984e-01,-7.900920195174817584e-01,7.812691755885503575e-01,2.614697220151493973e-01,-5.143154366180153758e-01,-1.138765528312986053e-01,1.462979895484851411e+00,-3.557557887145882392e-01,-9.814836430154334490e-01,3.502201320365140980e+00,-4.300112268201349286e-01,2.229182780613876425e-01,8.201188703717379180e-01,1.005325916567324646e-01,1.544051277438897696e+00,6.366610172924147548e-01,7.718415097102629963e-01,-3.409724702834548982e-01,-4.151322059866262570e-01,1.023929247158502642e-01,4.683183335091777866e-01,-1.252221228173757139e-01,8.836707812690141051e-01,5.223526959519495527e-01,-6.595698552238136170e-01,-1.518451023833892188e-01,2.675691942000491430e+00,7.126169972287802468e-01,-7.406284848586237590e-01,2.638541517759501076e+00,-3.117933933775813848e-01,1.544783303576835465e+00,3.945588951788875920e-01,3.203845938797077464e-01,-1.199488130100242467e-01
7.119903812707578661e-01,-5.560585250184925110e-01,-1.752596045239208089e-01,3.476675222790259756e-01,-3.525408299943725288e-01,1.140993865634449378e+00,1.025904043086039552e+00,-8.332586563413876823e-02,8.714440828214136125e-01,6.585728548179667907e-01,8.421890089655756917e-01,-3.661895021020444285e-01,-4.898540457990679942e-01,-1.274230930710178455e-01,-1.131256915757443138e-01,1.593681695860416303e+00,-9.017328796694619175e-01,-5.125846727770905220e-01,5.249563158134458174e-01,4.057123961076307128e-01,-1.022083761767585530e+00,4.360859103184533403e-01,-2.465297035604856468e-01,3.653454809719001162e-01,1.167141444094504266e+00,-1.024652435847172693e+00,1.016080677333715543e-01,-7.989345334445867586e-01,-2.883851908681112075e-01,-3.361160605349881036e-01,8.809022195644419240e-01,2.831412316348461911e+00,3.239415633033879138e-01,-2.843867545419120901e-02,-4.505409401563056360e-01,-8.476497325252041470e-01,1.143134758703071352e+00,1.091389843813120208e+00,1.541726833542885533e+00,1.596406163967440062e+00,1.288907023693664167e+00,5.379631541684953833e-01,-2.390808548436904740e-02,2.492579851241032429e-01,4.436888461545245299e-01,6.656182963840355793e-01,2.283484869312579324e+00,-9.670793616117885627e-02,6.323930194350427803e-01,-8.546689993542744279e-02,4.838508665394366304e+00,1.993574459082810835e+00,6.971106718793576018e-01,-6.742302254852305943e-01,-8.916375828988922780e-01,1.555498787976989483e+00,3.633417682664421000e-01,-5.187726086164202721e-01,1.003216752477288365e-01,2.152755279605284233e+00,1.321502112286638386e+00,-1.368017097994804976e+00,-1.070403390827954215e+00,1.742589402003708043e-01,1.908098193163537681e-01,-4.191291708929920645e-01,-5.613680868113211098e-01,1.737651977090769684e+00,-9.084200082736715309e-01,-9.406763216452013188e-02,3.004978159062625220e+00,3.601602335938303145e-02,5.610553261786714874e-01,1.155161219359755798e+00,2.019227700106815959e-01,1.444975576281272378e+00,-1.758962841070916550e-01,2.377432276589793170e-01,-2.452721889561502167e-01,-1.068453115708945633e+00,-1.399342707493081983e-01,2.284929333222761594e-01,-3.561190776467082486e-01,1.532907756479857220e+00,2.253150130301351250e-01,-1.066725203123813248e+00,-1.744121649008431030e-01,2.476271783670668469e+00,1.065199751666559225e+00,-8.484458668272665260e-01,2.049679370389906552e+00,2.218572929749279554e-01,9.492083148591459185e-01,7.038052909693173209e-01,5.658567207959002560e-02,-6.343974408240811158e-01
8.951460676921842996e-01,6.303352571049493092e-01,3.143192193137481771e-01,2.053652764801061625e-02,3.734161124460082248e-02,4.414328381040348304e-01,3.216778669772661359e-01,-1.099248181146234016e-01,1.356357804764715347e+00,2.771218392969985178e-01,-9.053769299970210183e-02,-2.457894784531082233e-01,-6.153812411513200908e-01,5.374103227382019676e-02,2.611516803613472826e-01,1.130843180247831592e+00,-9.324772814841615354e-01,-1.551150173150835643e-01,3.611639607108573236e-01,5.140688573121687810e-01,-1.271381321922002039e+00,-1.667814194926853233e-01,-4.926124786202922268e-01,3.557226178981182096e-01,1.073816863802387500e+00,-3.905636921047205834e-01,2.215022007634469547e-01,-7.061727032723101871e-01,-2.848355515362246404e-01,-2.125538005526800278e-01,7.056863957772113727e-01,2.648530520840180813e+00,3.713133549949704237e-02,-3.791788787840404962e-01,-5.982835701722327704e-01,-6.394138766786474637e-01,1.270644426237147018e+00,1.106507263055063861e+00,8.349333190110495018e-01,1.063122148849883208e+00,1.030650797844605782e+00,5.611143992667300129e-01,6.786944154580029642e-02,3.131679763883119527e-01,8.626762750531005164e-01,9.053517370329378089e-01,2.688755774040886060e+00,4.801099739239472752e-02,4.076518322670824035e-01,8.627379103171649577e-01,4.033948398258026202e+00,1.272224454109450953e+00,4.257622460062382430e-01,-4.226572139832652231e-01,-4.352178164997627108e-01,1.116423519978291479e+00,-2.852368662368492958e-01,-4.647015810273581460e-01,-2.209537087574808822e-02,5.489838447221306872e-01,1.241028057071132951e+00,-4.712603358048041424e-01,-6.081249271603359485e-01,3.997461449044492632e-01,6.315260002824751862e-01,4.468850338113150578e-02,-2.185106027864403000e-01,1.650397740486598153e+00,-6.872220733227649703e-01,-2.738369683881889394e-01,2.654173950938920612e+00,-5.772148034762334401e-01,1.671599738440628369e-01,9.232952490075958529e-01,9.225865470146081548e-02,1.480659491663061322e+00,3.123232454914239287e-01,-8.516339667655459245e-02,-3.859113256948709658e-01,-6.477649270895677880e-01,-2.877882879776905156e-01,-3.317903803358014936e-01,-1.889006837010096529e-01,1.389206088937170458e+00,-6.206000795156574323e-02,-5.607379272578396634e-01,1.770584623026912330e-01,2.053013208393309696e+00,8.676051571753060632e-01,-3.383599716002371194e-01,1.760191923688876781e+00,-6.467401701042504447e-01,1.402196171163036187e+00,6.567218173051242447e-01,-3.962191985136500061e-01,-1.054044245621638121e-01
1.142649694360392543e+00,1.204174684061749989e+00,-1.485995116215041989e-01,9.640942604958768758e-02,3.578291813010961442e-03,3.096639819728384535e-01,-2.208627946583363033e-01,3.065900006973741876e-01,1.285759196244227853e+00,3.608434232815694864e-01,7.205100288069805625e-01,1.294660351777233431e-01,-4.283312209610736776e-01,5.276175762454077267e-01,3.736960554836216142e-02,2.179999754842631532e+00,2.614624913709323595e-02,-4.189359217514073142e-01,3.837613298892017522e-01,3.398933019748199280e-01,-9.394059613793837027e-01,6.576521776952132248e-02,-5.286001494487709840e-01,4.009532427917251729e-01,8.718964275446590140e-01,-9.471119913984382688e-01,1.250047598148125161e-01,-5.023899378304264030e-01,8.604310305362474764e-01,1.431164006220180251e-01,6.925676253579740038e-01,2.006409687833006217e+00,7.760144693317749809e-02,-7.088982867427515711e-01,-6.268306119594357906e-01,-1.045022570595196987e+00,1.082049970055148913e+00,1.273574057488500610e+00,6.366498817777963559e-01,1.163887529924219955e+00,1.096723093171129815e+00,2.105993449871740308e-02,1.086614873406834408e-01,7.141983996987635308e-01,2.193800911827034072e-01,8.363412547523028095e-01,2.976833862531272246e+00,7.403290901401876623e-03,3.224815281119320365e-01,1.649172913383978312e+00,4.415481469709592766e+00,6.736429477589780390e-01,8.542420567126776110e-01,-7.318308931489307945e-01,-4.914894528735543333e-01,1.038980056339549485e+00,5.571431577175023353e-02,-2.615901184279766367e-01,-4.380164077058625316e-01,4.602522726803182085e-01,1.600906250530495178e+00,-2.878435078772010325e-01,-7.317409203248663729e-01,5.605733924579179295e-01,-9.460933347468869492e-02,-8.635428257142454544e-01,-3.128399011633602456e-01,9.429619846047530007e-01,-6.837444100029849148e-01,-3.800043808543240864e-01,3.440394153789571696e+00,-5.698629547521905092e-01,1.641555083854441544e-02,1.408706708480691683e+00,-7.959843543934175258e-02,2.017873538242588083e+00,6.386399487691656329e-01,7.700838052346459239e-01,2.345503407596662981e-01,-6.100683772937627314e-01,1.154918564056344188e-01,1.035273699010728077e-01,1.519891574866820694e-01,5.930092499278249996e-01,3.577815259531603731e-01,-3.023318189698110947e-01,7.097811294783212821e-02,2.182151295153328618e+00,5.294285889090263320e-01,-9.100246120184612986e-02,2.114266747531849511e+00,-7.494290227306358299e-01,1.426228951655758692e+00,2.871472522898983470e-01,7.056295510020389461e-01,9.247941462985265204e-02
1.058982476317311239e+00,1.661215906078610249e-01,-4.903151375910862475e-01,3.850136501021796942e-01,-6.058802367770964592e-01,1.158015866093448754e+00,3.868123144377424438e-01,5.484127763970424452e-01,1.927342532285307497e+00,6.627986888855571523e-01,8.551607155784259895e-01,-4.286722390665378968e-02,-4.535808935798553154e-01,5.595235127077495541e-02,-1.697680238151605125e-01,2.229846287887389700e+00,-2.589848333755406795e-01,-6.187598945306150844e-01,4.001168982242804262e-01,3.627074886560859857e-01,-9.594391761952840714e-01,7.838448199691863127e-01,-2.626756214548527368e-01,2.361403765616891248e-01,1.022616785226270419e+00,-1.328738276467287038e+00,-2.052366339094174597e-01,-6.711280083648298866e-01,2.157498341957961863e-01,-1.261852192650398941e-01,9.466889204140704894e-01,2.569430440281491812e+00,3.189833681210635929e-01,-2.794521189112533777e-01,-5.727808755189014445e-01,-9.707930436274572195e-01,1.505746352237843810e+00,9.770091207552062951e-01,1.073216964485437686e+00,1.560355433898430455e+00,1.616553741436176583e+00,3.149955441123381550e-01,2.281162319134816818e-01,6.545195312293559109e-01,1.427230012344289922e-01,5.659098134379516587e-01,2.810003023943743461e+00,2.365698539744518769e-01,7.053439293685777045e-01,2.266208289585732727e-01,5.368291362552071178e+00,1.845020810022806934e+00,1.410336855323673255e+00,-6.801747823188079023e-01,-7.354085149913376362e-01,1.316615912110408182e+00,2.831460009819851686e-01,-7.172397766551686926e-01,-3.692004582646570277e-01,2.249561391174980773e+00,1.169216004996268321e+00,-9.630174061936533914e-01,-1.111030859990506992e+00,4.082536010329629317e-02,-1.024700821389690208e-01,-7.714718895352437045e-01,-2.889618636136804808e-01,1.544515552425947069e+00,-9.144991415671009927e-01,-6.574750711396166736e-01,3.736624630627961352e+00,1.546748870324871072e-02,2.418454343799559814e-01,1.072678498830706539e+00,4.092040794081984179e-01,1.383801175648579518e+00,2.236049021928565028e-01,4.973354164402756794e-01,-2.043942853997552378e-01,-9.304269025086002731e-01,3.055198026163862823e-01,5.662556813392960464e-01,-3.468131805439363946e-01,9.954550733378316751e-01,4.108260116763771119e-01,-8.941459711097754504e-01,-4.154286735528568975e-01,2.681733984501148527e+00,1.072998970432710308e+00,-1.466016767817447386e+00,2.635734411947021627e+00,1.245144713971391148e-01,1.526570039456316419e+00,5.597144814102728017e-01,-1.129287984441276482e-01,-5.879251793967368300e-01
1.073948344539773281e+00,8.566591266195655585e-02,-3.538411906282550867e-01,5.251808775311224142e-01,-6.656047959602309216e-01,1.412793108985608059e+00,7.857104818745064279e-01,5.200810643504116815e-01,2.371738110259653531e+00,4.489179032032803995e-01,6.418859476106258954e-02,-3.323596778775421701e-01,-6.035739213280090221e-01,-1.189972285182655659e-01,6.196073210027380762e-02,1.528172800866655967e+00,-7.554373736316624122e-01,-7.647606424847227524e-01,3.944256264316357563e-01,4.765674253774385138e-01,-1.201681780397628740e+00,5.796604110688443612e-01,-3.508148355092323145e-01,1.988691708339382080e-01,1.031156031630131586e+00,-9.342187528648151496e-01,-3.809509264175872101e-01,-7.767526894616973987e-01,-4.783027879055403719e-01,-2.426613270704185421e-01,1.134243287803698097e+00,2.868371558832626622e+00,4.700917025732826438e-01,-8.928936267376993974e-02,-6.877363207876776574e-01,-7.638538025714747270e-01,1.917593370452655765e+00,6.440809410941461532e-01,8.032930926182526576e-01,1.060982603064972940e+00,1.808280169518772684e+00,6.783669230354711921e-01,1.942610614327773266e-01,6.772398306691189696e-01,5.775512504070632325e-01,6.672795647125115970e-01,2.670376500931117114e+00,6.098788299413966385e-01,9.790591759593779697e-01,-4.494587768263734739e-01,5.578688629180989622e+00,2.328379954764901338e+00,1.444183984138525112e+00,-4.222490403505862466e-01,-3.865831418052719237e-01,1.019084305958901426e+00,-4.315555868576003151e-01,-1.075903257107454936e+00,-2.155206852045827848e-01,2.062385921583110626e+00,7.326411250084913229e-01,-1.089496536242890778e+00,-1.111893071085650275e+00,-5.897715918690696890e-01,2.002288332772237389e-01,-2.564106116805934255e-01,-7.370191517593005504e-02,2.064740704190986875e+00,-1.287007867214033485e+00,-6.688435591279660031e-01,3.494558236492086856e+00,4.221497589056538713e-02,7.689807014734256763e-02,8.358223497846688499e-01,7.994484424434625813e-01,9.227618802694760314e-01,9.468603063749292392e-02,-4.059589571647082007e-01,-5.402422009758282018e-01,-1.121053544205913521e+00,1.995390146047011370e-01,1.687489718556184626e-01,-6.685997959422038672e-01,1.363995060876403986e+00,-9.485578231589086862e-02,-9.199020232236586603e-01,-4.749018190461833933e-01,2.552412291500495201e+00,1.501764038834243919e+00,-2.172083525679559646e+00,2.476492147006927436e+00,8.529159655401619133e-02,1.945235615106397198e+00,8.977477105381199696e-01,-1.518951792008514046e+00,-8.040251926716426301e-01
1.121282195301644524e+00,4.244691079975317916e-01,-3.048649896060029452e-01,3.169714668424913340e-01,-5.019551726944762038e-01,8.262884784273880623e-01,-2.410525539425329433e-01,6.016931104871413583e-01,2.185463915242971566e+00,8.098358358888302355e-01,9.882574455331523122e-01,1.587615261391721044e-01,-4.548745288419578925e-01,1.224716111838693861e-01,-5.741617751850952578e-02,2.536421827956873098e+00,-1.182857000259781577e-01,-2.657806186203595100e-01,4.268411023085681433e-01,4.739466502062957276e-01,-1.075097646787699812e+00,7.528576714062020780e-01,-1.852132524276301484e-01,2.474873327642361787e-01,8.598661988342145568e-01,-1.607760688608723676e+00,-2.705775242224758848e-02,-6.018956507668291600e-01,8.626253736383313608e-01,2.137482308595872738e-01,8.420850384119905607e-01,2.489540458667893752e+00,1.414152750374990664e-01,-6.620064222894717076e-01,-4.712699791889047307e-01,-1.012668340596071026e+00,1.198384014196687719e+00,1.314937813115387488e+00,8.246903742619184907e-01,1.989073131811780026e+00,1.564524994706240513e+00,1.457799195769357015e-01,3.947226487747078627e-01,6.661330231871729346e-01,6.987928236498575085e-02,5.150170997649099469e-01,3.210346325251905775e+00,-6.889875739311684955e-03,4.950335572546344376e-01,1.003230628142420144e+00,4.985400312026563086e+00,1.205194307926958031e+00,1.390230190724957904e+00,-7.850138364381167300e-01,-9.680170177366400619e-01,1.405984649848333934e+00,5.821638878498260894e-01,-5.859690363371288235e-01,-3.083423545104605479e-01,1.901355837619185030e+00,1.720344298406211836e+00,-6.172666812708353934e-01,-1.141288713649713848e+00,6.319272790982058963e-01,-2.253962905469280020e-01,-1.003099444308562127e+00,-1.806074830663493835e-01,1.517744105163603585e+00,-6.404468525278645963e-01,-1.068696272338852893e+00,3.969018375897793938e+00,-2.462381270995363525e-01,3.312153609491130246e-01,1.227339355778447549e+00,1.557374573390555850e-01,1.818463731103660441e+00,6.869129369254720618e-01,9.605008494253196583e-01,5.702993281940704762e-02,-6.465954138729191891e-01,6.577809142070623061e-02,6.767479042283572888e-01,-8.103585577767108417e-02,6.484369599085944014e-01,5.194332059281826508e-01,-6.322416094230162154e-01,-3.483743523929119790e-01,3.091549065710430533e+00,7.331680603239125738e-01,-8.861873065215418732e-01,2.872481113782952455e+00,-5.915944088503355403e-02,1.524035542211018779e+00,4.052502246636943140e-01,6.199184172107163882e-01,-2.157523110246385156e-01
1.133986802775937219e+00,4.466629793969223439e-01,-1.074913795518681880e-01,5.062208088671369399e-01,-3.605847873044048524e-01,8.859966075232410532e-01,3.667161355715325977e-02,4.588270873101902847e-01,2.219397448015565821e+00,5.930106075169261359e-01,4.074992209381618768e-01,-1.108174030236472041e-01,-5.727494206641396968e-01,1.403130886213390660e-01,2.431796452288693677e-01,1.953328820411957878e+00,-5.165355152007902184e-01,-4.175924722006700840e-01,5.262323694616347636e-01,6.050474045561359260e-01,-1.304759037252461340e+00,3.189252497510822737e-01,-3.144947424405838965e-01,3.226066166250054490e-01,7.310511044657119761e-01,-1.318997587999909182e+00,-5.489345020731087321e-02,-6.539902010968938750e-01,6.610303366970344818e-01,3.415937016589241093e-01,1.006449195884279391e+00,2.578544293753930461e+00,2.982002667535646467e-01,-6.653559146942957803e-01,-5.414984429969822433e-01,-9.321658244615014244e-01,1.277268194398809564e+00,1.188343716152154617e+00,4.196305921714764686e-01,1.509023507185328628e+00,1.631341979053364089e+00,3.544740436855082777e-01,2.852233450412199334e-01,7.352211884814228160e-01,4.377547218470418389e-01,6.777417909757599279e-01,3.075327775022476118e+00,1.822006636591394502e-01,6.734345862946966577e-01,8.163180175059646659e-01,4.980197539136073992e+00,1.212617528454932980e+00,1.239987744750679077e+00,-6.633579701645858639e-01,-6.756612904527110608e-01,1.076396902631687746e+00,-7.985621507178070067e-02,-7.639617076557625452e-01,-4.305952475848517924e-02,1.194363206538440858e+00,1.712143212348806953e+00,-7.203874777511112271e-01,-1.192797035194252064e+00,2.014345000688355647e-01,-1.518227986133322549e-01,-7.584792226384664549e-01,-4.206820783411913123e-02,1.876847200875152666e+00,-1.048751570933569077e+00,-9.855091534666704511e-01,3.783980591726469278e+00,-3.578695178550002076e-01,2.065119920755751903e-01,1.363678231950515185e+00,3.352756517189244834e-01,1.796524766686760310e+00,7.251062237600294225e-01,2.745422882159721523e-01,1.196025970594993826e-01,-8.350600088190671677e-01,-2.273214299436714381e-01,1.866762218363492432e-01,-1.685253817601904958e-01,7.890386211239367453e-01,-2.119733128121259469e-02,-4.276588948887208863e-01,-2.925943117559615669e-01,3.023529850287279608e+00,9.345178693708441342e-01,-1.006470753292261211e+00,2.587124305717289019e+00,-2.812563814608534107e-01,1.800310260295663323e+00,6.544452809090752776e-01,-2.097962659208240654e-01,-2.020150803013388563e-01
9.499410881471285206e-01,2.920035436045191890e-01,-5.739779727204635806e-01,2.435175920949312900e-01,-3.443470312287242319e-01,1.031193346822514068e+00,8.558982059525347408e-01,2.444780504581260949e-01,8.157642883812297185e-01,3.889035259833270031e-01,9.663648565751372654e-01,-1.480933490569350253e-01,-3.722204817339390126e-01,2.729363473438994880e-01,-3.171121174134393650e-01,1.993942739400407449e+00,-1.728407468455588902e-01,-9.161777629549739954e-01,3.745248094570380326e-01,1.444923230196329955e-01,-6.786453023711633836e-01,4.707163976510256309e-01,-4.742796599973003180e-01,3.496083409693339084e-01,1.193588215107855621e+00,-8.554720483731728109e-01,-1.378098742625520068e-01,-6.472496669751772735e-01,-1.042491926438513516e-01,-4.435626720857092087e-01,8.504669627551324496e-01,2.274329506126716360e+00,3.621677858803729610e-01,-2.165300191190247525e-02,-6.707979575537700301e-01,-1.028083186807542848e+00,1.450032841841259579e+00,8.405600908415208350e-01,1.396897227649687823e+00,9.801864940997797593e-01,1.252529773143735703e+00,2.570962876541732500e-01,-9.957693902227091054e-02,5.882274275876591130e-01,1.324793391569618062e-01,7.557035552860288385e-01,2.313128465339469031e+00,2.187199235288336263e-01,6.456100081940239210e-01,1.839392567416480162e-01,5.187768879472067773e+00,1.899510575263144485e+00,9.918436894797483250e-01,-6.807404002361486794e-01,-4.647263471520841627e-01,1.221811032769925642e+00,9.205748364261412409e-02,-4.445313971019776433e-01,-4.896261721118130850e-01,1.829334749300890017e+00,8.571512943298571496e-01,-1.083703174064013286e+00,-8.467278879469423147e-01,-1.805823220748927760e-01,-1.273502772798540406e-02,-6.754401541368098005e-01,-6.051032122726368589e-01,1.031922358153575914e+00,-9.897944871841956038e-01,1.802352650973306769e-01,3.229926067733485340e+00,5.238385899140568513e-02,1.238082948039683912e-01,1.160038388037839541e+00,2.747043991885837477e-01,1.345301374820766949e+00,-2.112384322871511122e-01,3.813583248789194635e-01,-1.846324541091777238e-01,-1.083907670341927698e+00,5.171963268412664849e-01,2.874399538130407716e-01,-2.959009555446581174e-01,1.182813842359351275e+00,4.414389956334224263e-01,-9.576157674134389008e-01,-1.703335292674980073e-01,1.847580390583585697e+00,1.046601549191516822e+00,-1.083111119712950376e+00,1.987680013022290693e+00,-6.372727671678846129e-02,1.174411485566475122e+00,4.893950349749138784e-01,3.348460560149257859e-03,-6.432665842085873997e-01
1.039239859499868412e+00,8.066274407400363389e-01,3.435869650259280039e-01,-1.601887105118624532e-01,-2.058460455292244751e-01,8.578511296546825760e-02,-1.092836559574257516e+00,3.571348317496995106e-01,2.435062297038824930e+00,9.172257224583064694e-01,7.025560094176017678e-01,3.904235695260677708e-01,-5.329177245378861061e-01,-3.719657436298069719e-02,1.436716149823329403e-01,2.386442051105117201e+00,-3.403785362736134745e-01,6.421351393018696063e-01,3.040035186673739620e-01,6.504551118921163555e-01,-1.337708261170500013e+00,5.485621545293616341e-01,-8.969678728280439106e-02,2.011469752544468581e-01,8.951958567759601415e-01,-1.441546953043363555e+00,4.097595041323646159e-01,-5.773625436451192972e-01,9.948113291886344633e-01,2.920345074049981449e-01,4.687991635479836217e-01,2.653850471750776041e+00,-3.768681917730390407e-01,-1.025422231472590706e+00,-3.207969740003935311e-01,-7.583708581859421871e-01,8.443887189024068540e-01,1.761630261969860278e+00,7.731054996593011985e-01,2.572680332779142098e+00,1.171679431873838162e+00,1.446322568968096967e-01,6.340574860572381066e-01,3.090611546825487999e-01,3.298142668508096675e-01,5.088657372227614051e-01,3.688677074298107428e+00,-4.512223955228025218e-01,2.056859154411644353e-04,2.036495735316487643e+00,3.751249166356541487e+00,4.581623954176425872e-01,9.057251028303864304e-01,-7.039595228847217445e-01,-1.262689471180895362e+00,1.679610320440556581e+00,9.995749967779732348e-01,-3.015132812061178669e-01,-1.733544173745233952e-01,1.293361613811370825e+00,2.155446136700054360e+00,1.305540396511115087e-01,-7.987206086994446119e-01,1.761525848851971610e+00,2.971641690412174519e-01,-6.263912764322681070e-01,-2.530562232868727168e-02,1.567390602078949868e+00,1.564491528359316375e-01,-1.480674745188103714e+00,3.555557192338767436e+00,-7.727369841945017637e-01,5.099602907440439203e-01,9.106433174600245817e-01,-3.187747825871982132e-01,2.071206673356816186e+00,1.142755824401494813e+00,1.375737488327300806e+00,-1.345248324981658250e-01,1.019938350938431881e-02,-3.792738727161040213e-01,5.970235603189908424e-01,1.978586132821378851e-01,6.519052802712614891e-01,6.844763756499482321e-01,-4.394478118135416445e-01,-1.678501356963624236e-03,3.255896866293544356e+00,2.450481702958665631e-01,2.023916892299474912e-01,2.869929136266325287e+00,-4.523191188276349806e-01,1.333148226978595918e+00,2.285633403368565464e-01,1.390966667046606542e+00,3.569283588643009653e-01
8.847517611750752575e-01,-3.650287450850023818e-01,-7.683695280676248185e-01,5.728763316496348068e-01,-4.693136865233813459e-01,1.326029987064266669e+00,1.022435609209587870e+00,2.553552598085353509e-01,5.448891124971714239e-01,6.926591630794417531e-01,1.634179761297637423e+00,-1.926027205686563493e-01,-3.071161045405482737e-01,2.802073312002483219e-01,-3.881770835837123901e-01,2.422080395507975048e+00,-1.244823226448260045e-01,-1.058825985226885757e+00,5.995820761445040947e-01,1.902557683138589029e-01,-6.430371186784429316e-01,6.809797641165861171e-01,-3.036012817212490611e-01,4.324572084457237731e-01,1.031947046738608487e+00,-1.494193777391917610e+00,-1.019967588491666188e-01,-6.640033352912323439e-01,4.839608695712729336e-01,-1.398749491652961918e-01,9.950029293261608565e-01,2.291855512648904192e+00,5.509337360781547677e-01,-9.681430285940914593e-02,-5.120646395030592490e-01,-1.254026669708609987e+00,1.081605596868879804e+00,1.065055216412205130e+00,1.516211447471071283e+00,1.474672949701759883e+00,1.438773511440462949e+00,1.327717361438801591e-01,-1.205018841389951106e-01,6.387850079814993975e-01,-1.480954899025171967e-01,6.183474409390564697e-01,2.242746783682788347e+00,-1.259799737084009441e-02,7.382029650258786768e-01,7.957895020264704744e-02,5.551721269767073252e+00,1.852183430829081878e+00,1.128257452146103290e+00,-9.552005166109627243e-01,-8.581679474120644802e-01,1.445663012728989782e+00,5.239685730069847391e-01,-4.273978419361615932e-01,-2.360594439517621490e-01,2.367748771857421275e+00,1.439710101938362241e+00,-1.575655633229143149e+00,-1.287457652962057830e+00,-1.033885838032541082e-01,-5.433915156136124303e-01,-1.242087933655330989e+00,-7.528157987475303514e-01,1.155904847067511509e+00,-1.190388955051973952e+00,7.735430586277580733e-02,3.682349966291879717e+00,2.662588743399761371e-01,4.253115731626125884e-01,1.658086446608984632e+00,2.125101968048238588e-01,1.767717141920902790e+00,-1.744775417712041143e-01,7.531389368636018933e-01,2.997366407757773299e-01,-1.308559511697452882e+00,3.187550648473359005e-01,5.869394021196450151e-01,-1.974229282000822538e-01,9.826380293164828084e-01,5.056263029756686844e-01,-9.876295116104656380e-01,-3.618385353865056220e-01,2.469872483200640012e+00,9.807190222428501247e-01,-9.905187861495692303e-01,2.254500299494945903e+00,3.291082106380196493e-01,9.331969928657050106e-01,4.859347246916387864e-01,6.961523625735279719e-01,-7.201551085841715327e-01
8.579818060501839261e-01,1.014136684598732963e+00,-3.884448991825548148e-02,-6.128866329701235793e-01,-5.401626974225894051e-02,7.599140114644117872e-02,-1.642836367838934053e-01,4.307124369182585566e-02,8.772232191459485851e-01,4.494528818454891494e-01,8.684562581673287429e-01,3.089450023447879445e-01,-3.570701877036617233e-01,1.410786619217862525e-01,-3.995838441401809438e-01,2.059398677484018059e+00,-4.883474583516606016e-02,1.009275769812585100e-01,3.122893830306967128e-02,1.119642484223701551e-01,-6.698170362281744561e-01,4.741810428292836388e-01,-4.122170083451531797e-01,2.175894968916704253e-01,1.491203306302375298e+00,-4.660109326260473694e-01,3.063019310939239515e-01,-5.665448657587469627e-01,-2.430761325767814007e-01,-7.557471923584450080e-01,2.345974309284734327e-01,2.281601521303218583e+00,-3.739754554238943762e-01,-2.421888700028583252e-01,-5.749835047984527270e-01,-7.363580238585505366e-01,1.235365726658978813e+00,1.217747248557265571e+00,1.755507185667942727e+00,1.553017861599905292e+00,6.118026765179771509e-01,1.330915864393514281e-01,1.537433166467787604e-01,1.227164110032674116e-01,2.112868758449026885e-01,7.268065435714241573e-01,2.791531698051061383e+00,-2.569825738321999675e-01,-5.803002765669591778e-02,1.362748765307763010e+00,3.751707377750399086e+00,1.242884421585384258e+00,4.676753139416544025e-01,-5.540576688382874426e-01,-7.266565294947555653e-01,1.644918019274863585e+00,8.077770066474878607e-01,4.998211260349785801e-02,-7.684601740685877980e-01,1.504633752761532106e+00,8.589330791917654251e-01,-3.926454258466199887e-02,-1.513615809265990153e-01,1.192303186388168790e+00,7.616369775939211273e-01,-1.724479867061443628e-01,-5.862865439546871560e-01,5.611314060589063235e-01,2.444802313353182377e-01,-5.057722024099264857e-03,2.593852558934913510e+00,-4.540281176601702606e-01,2.173052386746002762e-01,4.590355794059091110e-01,-3.414398060243060695e-01,1.342195563637353484e+00,3.873242681917121732e-02,1.152607761459185642e+00,-7.124378111459865881e-01,-1.983828881698079805e-01,5.208290114698261863e-01,4.146241532792380724e-01,-1.295979374570654929e-03,1.244252133519323955e+00,1.063794442315822986e+00,-9.755135718074643414e-01,2.837908623374156281e-01,1.493727913683946751e+00,4.339927248519896974e-01,1.096598854616021579e-01,1.918374631849359080e+00,-4.952733429031992984e-01,7.720433357975100552e-01,8.334718690893794246e-02,1.123502585672962129e+00,-8.943742129126452944e-02
9.154613463402714313e-01,1.113818694982836144e+00,-1.182805302056978564e-01,-5.890460169338547214e-01,-9.322480093833442061e-02,7.809440757721941573e-02,-2.840130621733793492e-01,1.521759902332918690e-01,9.920227882534824460e-01,4.749044098938558500e-01,9.665937480809934090e-01,3.777787783558094192e-01,-3.354033073613930105e-01,1.979396021084278701e-01,-4.263388490724586699e-01,2.241351124210351209e+00,1.046803772621623385e-01,6.887207292221475541e-02,2.836483515954895535e-02,9.747756836523846502e-02,-6.371334316813327403e-01,5.464997607484034514e-01,-4.060125757162937887e-01,2.086220652854153534e-01,1.449800588150388370e+00,-5.806036389056321578e-01,2.666083882936295946e-01,-5.359984503810785172e-01,-6.039117972664764800e-02,-6.857759150020533712e-01,2.461146801090926539e-01,2.203544574965256686e+00,-3.662378237078550702e-01,-3.055843639033662407e-01,-5.819683241327820999e-01,-7.923623807634113669e-01,1.243009104142337451e+00,1.232711484126787882e+00,1.689455697270632495e+00,1.590558797387148005e+00,6.646309136270749374e-01,5.758861482731825188e-02,1.898609693286727462e-01,2.026523853933143715e-01,1.114263447818187869e-01,7.008542301465225943e-01,2.879902396385530583e+00,-2.356292416323323979e-01,-5.497850683311074349e-02,1.464051408427871515e+00,3.855794694088094943e+00,1.170671567956920400e+00,5.928296674564877966e-01,-5.926359897538148180e-01,-7.368593074966284240e-01,1.625270764320590366e+00,8.529935700454333025e-01,4.404291342101962492e-02,-8.436152218103055711e-01,1.537375451290855954e+00,9.029301589685021501e-01,4.744004379471034039e-03,-1.870625189225036122e-01,1.203331671115459356e+00,6.459517984131610824e-01,-3.128797437473507248e-01,-5.662444895206589779e-01,4.909982393787406529e-01,2.412780319976010612e-01,-9.366238817703370634e-02,2.766159577038380668e+00,-4.484698881965860084e-01,1.849717733827144217e-01,5.090087166119149353e-01,-3.363546976703893909e-01,1.400105773590666569e+00,1.191559409773310096e-01,1.275148388139098810e+00,-6.363758153962004727e-01,-1.842573781022713297e-01,5.923955124604596278e-01,5.069280759666585645e-01,3.330408637895321267e-02,1.106283264074476858e+00,1.124938053190949638e+00,-9.353706344200587441e-01,2.378182407418171773e-01,1.565808340729116566e+00,4.013045432880240071e-01,6.551382547195916395e-02,2.034181935157671983e+00,-4.958529001678746440e-01,8.303675842630553472e-01,3.538780094548754640e-02,1.231852668273491380e+00,-6.819325361975925315e-02
1.023426426610698936e+00,4.830728551954083239e-01,-3.278397162552860733e-01,3.875100693463267021e-01,-2.126839207907316731e-01,9.538041498810729824e-01,7.624657401197899587e-01,2.089457160186855011e-01,1.139952105623475598e+00,2.631421678720795576e-01,4.536287562450597166e-01,-2.771723485594863590e-01,-4.872959148030031051e-01,3.067694465744535415e-01,1.134158466746593152e-02,1.635052904614871405e+00,-4.423641234879424067e-01,-8.864184147057776464e-01,4.575132911700802163e-01,3.219147965286404123e-01,-9.551149449666964664e-01,1.115160351778106129e-01,-5.494541832190924513e-01,3.979648162763955721e-01,9.950957947066295661e-01,-7.404114171258994181e-01,-1.223258958265907859e-01,-6.596103279085383519e-01,5.319441847638328724e-03,-1.647002054661466097e-01,9.642307418744957559e-01,2.332309188287614798e+00,4.201182049450375433e-01,-2.132662976057198012e-01,-7.009484772556801024e-01,-9.641961435360548727e-01,1.448558633520581784e+00,8.535212190608633120e-01,8.653461663220343159e-01,7.451892307690561879e-01,1.340757660851382038e+00,3.747053370864881217e-01,-8.305073369677636042e-02,6.869827047976435619e-01,4.288920461940311513e-01,8.638908972098080508e-01,2.435991205091371015e+00,3.293671710195431590e-01,7.300223402986367738e-01,3.512464065881365505e-01,5.069128096325521859e+00,1.641734524312895127e+00,9.313834106544115476e-01,-5.994696961689716108e-01,-2.887943458625113480e-01,9.417447587185876490e-01,-3.949689514167106230e-01,-5.939152881563174446e-01,-2.599930698963007769e-01,1.076642955617600039e+00,1.057381395712077454e+00,-9.775737471269740908e-01,-9.118333764572306155e-01,-3.280727304529392763e-01,1.934178338990344415e-03,-5.523384697221768169e-01,-3.816092386683488380e-01,1.374465780773764356e+00,-1.233553546718466620e+00,-2.033379659262685157e-02,3.231759591853093916e+00,-1.661824011527301692e-01,2.121674778547914808e-02,1.305560738076692928e+00,3.670840099632463605e-01,1.475330488528835859e+00,7.250271113352624308e-02,-4.351474173983660432e-02,-4.797952510328862274e-02,-1.107196143654092246e+00,1.792312829529107976e-01,-7.503549686340488245e-02,-2.792981823717951562e-01,1.127727524186797670e+00,3.929567358641028463e-03,-6.510283201399036379e-01,-1.246228885608571257e-01,2.011129045818226047e+00,1.100758996953825175e+00,-1.047543499234684150e+00,1.913198656436131406e+00,-3.436006207901465270e-01,1.507490163701093788e+00,6.501100766178118384e-01,-5.124562356837125687e-01,-4.725431414791871898e-01
1.296427424431039643e+00,1.727988675606209279e+00,-1.218795240950779069e-01,-4.379159044709739490e-01,-4.870803620564562175e-01,3.233009447422290905e-01,-7.828819201792431848e-01,8.253523354320265737e-01,3.075478827789067893e+00,3.681183304915118804e-01,-4.729367097115866336e-02,4.472705266790870104e-01,-5.222698845450036709e-01,2.872213426855078910e-02,-1.339502712171095067e-01,2.111311743339990610e+00,7.355677324960530061e-02,9.500553675944872767e-02,-1.297718133341102253e-01,3.023105404850104927e-01,-1.014222432773407068e+00,7.770330756954861862e-01,-4.114390926013944405e-01,-3.143107252803109541e-02,1.280995836761610773e+00,-5.693384075805936195e-01,-1.965645688089699139e-01,-5.451922821503176753e-01,-2.844660452242030457e-01,-5.130738660281779495e-01,4.921286881305922956e-01,2.471461998227782786e+00,-3.180574277304252240e-01,-4.742655941596008451e-01,-7.694950906954102221e-01,-5.854441965498424771e-01,2.068627565975214466e+00,8.520140369393260915e-01,8.149414961282992476e-01,1.332496876102562622e+00,1.288969051842538072e+00,3.003532729951403080e-01,5.849141313286002619e-01,5.709019514795723449e-01,3.756335692977330609e-01,6.315019059600163187e-01,3.521271821656694723e+00,4.608622222848318128e-01,2.693591577999547293e-01,1.136825361134699230e+00,4.477607989502515373e+00,1.486726329055779949e+00,1.426400171799260264e+00,-2.689373057905912190e-01,-3.472004325353519882e-01,1.154015287882253826e+00,1.166053778882681358e-01,-6.371807404259205443e-01,-1.069494846634715168e+00,1.558015129242282359e+00,3.994139699213216099e-01,4.416579912235705230e-01,-2.587696379040268502e-01,6.341910761688688281e-01,8.060478912809641017e-01,6.033272679198953270e-03,1.090137141799726317e-01,1.131858226322721928e+00,3.891912809583113197e-03,-1.080950734204702668e+00,3.314875427541660535e+00,-5.306751107791565225e-01,-2.354661168085740441e-01,4.123825052250534862e-03,3.024698465134343928e-01,8.112818559707468680e-01,5.934404678178999415e-01,5.970614163770407989e-01,-1.086765603742463560e+00,-7.895219694720334580e-02,7.655737854334745407e-01,4.969742972595673214e-01,-3.266868446448415453e-01,9.656750207146216347e-01,7.593436925227839973e-01,-7.735625791555562625e-01,-1.132367503717706114e-01,1.973003932159491214e+00,8.475114529469506275e-01,-1.370886705047160481e+00,2.701107511980471720e+00,-6.039728099647846404e-01,1.989301761753058617e+00,2.862605227997511159e-01,-5.131950400758347186e-01,-1.735570461276055854e-01
1.420996680622381270e+00,2.647027042897093008e+00,-3.551612994813347912e-01,-4.731802590762622662e-01,-1.926121208609969659e-02,7.623788470132064621e-03,-4.866282264633449706e-01,6.831226003124143409e-01,1.835349638842086240e+00,-2.136076086322410139e-01,-3.892198690768894354e-02,3.977062599731567283e-01,-4.049795247112864538e-01,7.143983672250268091e-01,-1.764687434362587071e-01,2.005030281742426368e+00,5.965535023070349663e-01,-5.858249591614260732e-01,-1.254327232721535457e-01,5.960730750583960458e-03,-6.351345631341978049e-01,9.720420445376665164e-02,-8.865250224922505140e-01,1.862126311195218265e-01,1.238666157368383480e+00,3.271709119580450825e-02,-2.427404500753509164e-01,-3.847575265647344422e-01,-8.511155278496596033e-02,-5.639592322860718099e-01,4.771791238533108492e-01,1.643979306893371461e+00,-1.455043611995182617e-01,-4.323820537242139550e-01,-1.040302505019846890e+00,-8.422203169951605339e-01,2.055644098602339209e+00,6.253705189105869255e-01,5.745280766457230293e-01,6.837258067189921906e-02,9.134083993819623881e-01,1.555848676401039299e-02,1.313816911183515734e-01,8.931675230458737680e-01,2.747225600326994033e-01,1.009936220979041011e+00,3.076673967709313562e+00,6.806226881964572151e-01,2.682485739012433479e-01,1.625007007674903026e+00,4.456285054178775518e+00,1.053966594746766905e+00,1.104785640814923919e+00,-3.149101527746063778e-01,3.640725235277291194e-01,5.603931834292836811e-01,-6.360680187171533495e-01,-3.219769067315838562e-01,-1.405346219994187518e+00,7.479394962190211160e-02,1.173700359388700487e-01,5.405520180052515444e-01,5.965384333251037841e-02,5.271436226723269503e-02,5.505324669992218700e-01,-2.164492079767119659e-01,-1.531603966884613199e-01,2.203378336095448975e-01,-4.154659724502361984e-01,-6.125656031380688482e-02,3.047847659147731036e+00,-6.722874241930368866e-01,-7.448492430058494262e-01,4.807225533561659825e-01,1.965656022578468054e-01,1.054137370518791528e+00,3.885062085202771187e-01,3.811157551531483278e-01,-6.408055331761867146e-01,-3.318880672771968854e-01,1.149924187794856723e+00,-5.492701083694645492e-02,-9.340767641441613534e-02,7.074876775644184379e-01,5.974642834276586711e-01,-4.071453055151602607e-01,2.113768501097108010e-01,7.976382475034469177e-01,7.473178427561548709e-01,-8.579650293994807164e-01,1.858668819298109565e+00,-1.285707887853527076e+00,1.961051229812611485e+00,1.308809821339433632e-01,-5.038318955467717686e-01,-2.385877699064087309e-02
1.029100294811192029e+00,9.606273524993981239e-01,1.960468424659842501e-01,-3.255403080970467045e-01,-3.065330958066910250e-01,2.956804502964846537e-01,-5.386778913263559065e-01,3.629120549329210021e-01,2.417269593318852383e+00,5.838231271629457098e-01,1.827635598316167953e-01,2.438967066828947039e-01,-5.566942323362843448e-01,-1.320954975045727786e-01,1.399455909142144350e-03,1.869515118955592303e+00,-4.447231029259686164e-01,3.403204870580348040e-01,9.275599405486967264e-02,4.666977694268214516e-01,-1.188334537150968151e+00,5.632561984934143506e-01,-2.666270331397985194e-01,1.021614310282662474e-01,1.214933758535206243e+00,-7.561906520869815518e-01,1.473553219363407107e-01,-6.370982169671880468e-01,-1.303503565406646247e-01,-3.333618860237623771e-01,4.789893952430330781e-01,2.728916486617185555e+00,-3.168376313526145016e-01,-5.251942143344172642e-01,-5.434398174043061358e-01,-5.697649225778408377e-01,1.488324637968418518e+00,1.212252740737607137e+00,1.032885187811625638e+00,1.823463957228671717e+00,1.136725455869187051e+00,3.931743128622279260e-01,4.948262371734467591e-01,2.728716407955716350e-01,5.277976715376617722e-01,6.186217725069806939e-01,3.321519991681880057e+00,-5.580839707778811887e-03,1.733964689469691400e-01,1.193025405256564975e+00,4.020911164372090951e+00,1.276580454456298197e+00,9.300776579881995243e-01,-4.084928927726219072e-01,-7.664817461425574852e-01,1.469984691641588181e+00,4.630147924246855728e-01,-4.710937254961825582e-01,-4.907213702700485847e-01,1.524124369250329458e+00,1.081364888801755297e+00,8.423273476797138448e-02,-4.681655483271501828e-01,1.058376507072452677e+00,7.785240731090270483e-01,-2.051453701361222182e-02,-5.143591546704495698e-02,1.469507081825689454e+00,3.286392246194121819e-02,-9.946356647572218712e-01,3.061437220819458460e+00,-5.746905052806217107e-01,2.056765676804329090e-01,3.412195498812596872e-01,2.584836524556176351e-02,1.242720904712308450e+00,5.803456452586002179e-01,6.935755961807332781e-01,-8.031512918850660654e-01,-1.379906890771753492e-01,1.220183016333306059e-01,3.819527717701113323e-01,-1.874857324668354197e-01,1.155082196794387395e+00,6.150004441990233328e-01,-7.712442915183875813e-01,7.011521169987711133e-03,2.393835853549231452e+00,6.784835470066117313e-01,-6.190988783900108761e-01,2.517169549856998145e+00,-4.435596971793090981e-01,1.502125523131413676e+00,3.733676702906255640e-01,1.420985077559127341e-01,-5.177542073777458009e-02
1.279399317280355053e+00,1.651239923218636774e+00,-2.564991261257066890e-01,2.283084974852389593e-02,-2.249492116574237921e-02,2.137129758541457814e-01,-4.804288159809913528e-01,5.131323614316013471e-01,1.555177288142712833e+00,2.807405125985773520e-01,6.803555031029457911e-01,2.749959989577347441e-01,-4.025996655730180729e-01,6.545164076741918358e-01,-3.953759650888122312e-03,2.378043092998431085e+00,3.289908583522361263e-01,-4.669775353090981906e-01,2.936445862056777933e-01,2.767188480019258656e-01,-8.645501485709017331e-01,1.226404673759898811e-01,-5.937598260655991833e-01,3.580774115641051081e-01,8.588326743062129065e-01,-9.159321817157742851e-01,2.406718490808090749e-02,-4.336568369510960252e-01,9.853093331476783234e-01,1.491001260775499659e-01,6.643392210815566301e-01,1.822642603222623725e+00,3.596156749869616753e-02,-7.851031014263500918e-01,-7.097958227677066967e-01,-1.081688434738878657e+00,1.243214730648057209e+00,1.200510150806244791e+00,4.789152668317147032e-01,1.008950727861866348e+00,1.122825682572861972e+00,-8.771845464698740935e-02,1.667036984680178580e-01,8.610274376569727606e-01,1.159398757492613452e-01,8.454962967174958210e-01,3.144019397858785592e+00,1.476542532255930573e-01,3.019015824107365575e-01,1.865109036593399328e+00,4.508560044202722494e+00,5.682443737837150621e-01,1.045520374520186202e+00,-7.078493581944548252e-01,-3.424253631095789951e-01,9.042851874240942500e-01,-3.441937233498204574e-02,-2.720771492445763773e-01,-6.968626118068265152e-01,3.189998045495057166e-01,1.440536491294269084e+00,-3.701828524443018242e-02,-6.306148854699280548e-01,5.154891924122608771e-01,-1.345852655323926950e-01,-9.365365651469748087e-01,-2.375872164720416735e-01,7.246931658508910523e-01,-6.358309265771168173e-01,-4.653963168897832237e-01,3.600131533504179693e+00,-6.240201083640357638e-01,-1.732885492072267497e-01,1.331682221215076734e+00,-4.164588896250193129e-02,1.965387549912659182e+00,7.519125000068429543e-01,8.624663787442187202e-01,2.089100168960409398e-01,-5.199070528129670077e-01,3.589846192694283178e-01,1.655981783872755297e-01,1.801747140994273133e-01,4.004823054025070661e-01,4.568356968224380754e-01,-2.195658706656044012e-01,5.494366671712697103e-02,2.043192324482037137e+00,4.986601873641729465e-01,-2.221454942986947900e-01,2.213653654647488978e+00,-8.985017136474615640e-01,1.620216354245343604e+00,1.914105511541972782e-01,6.512335448734716259e-01,1.468751382655378857e-01
9.180892904902395735e-01,1.081460937547543688e+00,-5.388769089764967879e-02,-1.946709874006736785e-01,2.222198636912970371e-01,1.524158069622482958e-01,2.335794165779043197e-01,-1.142786293602565117e-01,2.910924231434698917e-01,1.929604321629027064e-01,7.318633281368986943e-01,1.761566319425994509e-02,-3.858443495895699793e-01,4.982014654051457048e-01,-1.215570925391643575e-01,1.775321430220672791e+00,-1.471683013890193181e-01,-4.173598618174810260e-01,2.987351228756943144e-01,1.734103045242865460e-01,-7.443849553487075221e-01,-1.389430197508314535e-01,-6.331666148191827936e-01,4.493732835581246698e-01,1.175122922998619535e+00,-4.054461676558543948e-01,2.897391540776003138e-01,-5.423307131659873548e-01,1.958782797128795217e-01,-3.446578146777116158e-01,4.983331272909839460e-01,1.988395568942351144e+00,-2.151201010178088735e-02,-3.678208928922784837e-01,-6.513969478460386320e-01,-9.399554755359743607e-01,1.025814279040537569e+00,1.188717761829759301e+00,1.206795165183824903e+00,8.841418342247432394e-01,6.650178813767839703e-01,1.005933195166930361e-01,-1.364311511810410438e-01,4.111559143897955404e-01,3.369440565651619091e-01,9.613643090772666655e-01,2.504147768133892171e+00,-1.338277575620586690e-01,1.719587999650943888e-01,1.462898059583330745e+00,3.966113246430975625e+00,8.980227064507220192e-01,3.041993693156953560e-01,-6.551235130249093430e-01,-3.962406815235894331e-01,1.173466407087792485e+00,9.584335385067344060e-02,1.569624275934415614e-02,-4.691203152575832980e-01,3.890629618689827041e-01,1.226251024253841138e+00,-3.673280372880722844e-01,-3.880915939488066568e-01,6.082379195961807872e-01,3.068118565164417166e-01,-4.732374291634217078e-01,-6.163901129824718161e-01,6.188139042095812670e-01,-4.878951454836731871e-01,3.543531958737161092e-01,2.688145113712516743e+00,-5.366786615567766816e-01,5.901359318410732968e-02,1.199139679455585528e+00,-2.651636830987737503e-01,1.800974717384611790e+00,1.279516241524846776e-01,6.660941838149685434e-01,-4.893234055823647566e-02,-6.184511655336430991e-01,2.179021654918864015e-01,-1.150115643539863508e-01,1.250346425912156612e-01,1.039387563216369159e+00,4.736810886295148570e-01,-5.474841022492034082e-01,3.484066373258110083e-01,1.424709919758096799e+00,5.040511426152611829e-01,3.307766168133939311e-01,1.502338405213025085e+00,-8.056850627532614606e-01,9.346145341145858376e-01,2.480059844607996056e-01,8.245224663174841595e-01,8.108281868943911785e-03
7.443648009878257588e-01,7.560527670278670564e-01,2.944907387134527710e-01,-3.671376395199628662e-01,2.775232419168436881e-01,1.455841919977934884e-02,1.769480410942652071e-01,-3.698975551337623235e-01,3.064964076273860583e-01,3.246978170586009571e-01,5.743640488017329737e-01,-2.478236185357772514e-02,-4.535207043406492833e-01,2.117477701029846227e-01,-4.521589031169959139e-02,1.477570860999156910e+00,-5.714622594472336115e-01,2.982201886022892157e-02,2.770359340063269782e-01,2.928082281238357232e-01,-9.213183406935769870e-01,-1.574202546612026854e-01,-5.053301377872103650e-01,4.152321200625825881e-01,1.281980057035020826e+00,-3.140256963813484181e-01,5.106120086356301657e-01,-6.231198465472296277e-01,-1.117098039130051124e-01,-4.513164976789764138e-01,3.643035146506773958e-01,2.334585917136058342e+00,-2.160076800840763089e-01,-3.487319218247145192e-01,-5.244335527117497397e-01,-7.353956226765927529e-01,8.706162389016528502e-01,1.357170687878052728e+00,1.435522264425778349e+00,1.292491773786627718e+00,5.169934936775213430e-01,2.727753637080115867e-01,-5.482036455873599834e-02,8.155802981360653348e-02,5.678351591521989539e-01,9.159500758147001154e-01,2.539244871207892551e+00,-3.857410030900741416e-01,1.311979624986613080e-02,1.466261263492459666e+00,3.437113051923480711e+00,9.125786455291713395e-01,-9.158605107748019059e-03,-5.821650474683255361e-01,-6.526278682289051725e-01,1.456345596048479907e+00,3.694035826800866062e-01,7.653996910290603028e-02,-2.245331601446500791e-01,5.450372959164213604e-01,1.356343749497199713e+00,-2.990565184811129762e-01,-3.047107448219896764e-01,1.063120981066843385e+00,6.865542612886376128e-01,-1.122764255021727053e-01,-5.999505256262811503e-01,9.063528239592940627e-01,-1.514663842008643346e-01,2.290434802965262695e-01,2.317458611067896967e+00,-6.380765635090148713e-01,3.086373806754614257e-01,9.482324405969282388e-01,-4.180759962269718355e-01,1.746519192831548217e+00,1.194036887109807821e-01,6.792541973769974373e-01,-3.066798911885766366e-01,-4.166501166131429956e-01,-1.059146260734183942e-01,-1.484348379088065717e-01,1.086275274020042647e-01,1.342316074825061989e+00,4.921259036535477471e-01,-6.709040364493437103e-01,4.620808093477127843e-01,1.586779788459866447e+00,4.232428583738725436e-01,6.621732552699659546e-01,1.462963685636118782e+00,-7.328072120383892774e-01,7.068344633564282997e-01,2.957372521097543783e-01,9.741038687468326351e-01,8.859534970546378840e-02
7.487235475270346274e-01,1.040501344680198947e+00,3.693454120138640051e-01,-7.487686525473865595e-01,1.549552332977894298e-01,-9.849177021245014707e-02,-3.494576586922482075e-03,-2.754848384403938422e-01,8.068854266024888533e-01,2.593692083282468919e-01,2.027412070053375703e-01,1.105285109061233256e-01,-4.831378241090864556e-01,-1.123508206916935814e-02,-1.665905537430920069e-01,1.314585089265787765e+00,-5.859113877785917524e-01,3.093146591797744094e-01,-2.355922172423134675e-03,2.205941700951399576e-01,-8.943300801033547964e-01,7.461909852357551109e-02,-4.963070258337064500e-01,2.315716859586292309e-01,1.570434266567690695e+00,6.751201317930441426e-02,4.391020433668397782e-01,-6.448909844933021773e-01,-8.329547794951011053e-01,-9.091007074809653865e-01,1.792913629685143895e-01,2.518704956452463506e+00,-4.657440092270757614e-01,-1.586815952823366627e-01,-6.006852113274929739e-01,-4.811054574654668459e-01,1.292292295279025671e+00,1.155634179099798375e+00,1.683977746993754687e+00,1.274872791255412974e+00,4.276317396381401625e-01,4.116023640495103941e-01,9.282206532078979278e-02,-9.000097672721278641e-02,6.860599545117089804e-01,8.729384172284344601e-01,2.668460946903197684e+00,-2.390745501903164261e-01,-9.740993768982587897e-02,1.271033766537164933e+00,3.237173591698479402e+00,1.288561436252867454e+00,4.456377086763851914e-02,-3.379162643624050166e-01,-5.462881105417574101e-01,1.547567920271334163e+00,4.142186115110131350e-01,2.280806418508465883e-02,-5.437841219790062741e-01,9.348709005492515933e-01,6.919725220097922014e-01,8.406257645282583235e-02,6.587085089410198158e-02,1.174014734018750339e+00,1.259891824290695350e+00,4.311122077107906181e-01,-4.964209739736270000e-01,8.496457491656703720e-01,2.782050508260864308e-01,1.398448033331987084e-01,1.987962929946938795e+00,-6.538136288122731177e-01,1.921812948196769399e-01,2.178074656636310724e-01,-3.370385686280875648e-01,1.140638434127382972e+00,-3.444328512256639163e-02,5.964935987683663843e-01,-1.011281667246146876e+00,-1.287612552147520684e-01,2.236961603748841565e-01,-5.452084906329013325e-02,-9.242412794094168049e-02,1.639739506199597630e+00,7.301041640958270129e-01,-9.391714310178900238e-01,5.003937349291318615e-01,1.211823665155779439e+00,5.216898152486123541e-01,2.930550951789555048e-01,1.516680769325029932e+00,-7.408070174602194857e-01,8.037864980157196637e-01,2.586311627826005655e-01,5.041122773022375103e-01,-1.325081992165011435e-02
1.153873960100956220e+00,6.499495072851874111e-01,-7.652369904350805330e-01,4.180051005089318039e-01,-3.761676317703209205e-01,9.876154258863309998e-01,4.375208980537033665e-01,5.511154653482479571e-01,1.110698760103267402e+00,4.487384166571612432e-01,1.254198454394069628e+00,3.053874310615069254e-02,-3.194712302763736966e-01,5.393960609575306764e-01,-2.896363306345954847e-01,2.544387033818952926e+00,2.826117628557553441e-01,-1.049185843130577833e+00,4.469002964789722254e-01,1.558128974886867912e-01,-6.429433402538662357e-01,5.324932948992000536e-01,-4.830875369113343809e-01,3.824882339877596071e-01,9.396404854056226164e-01,-1.274177150941441683e+00,-2.186779392554342449e-01,-5.358915885788120281e-01,7.259761618844544628e-01,-2.933950674718444063e-02,9.348518740150312256e-01,1.963223250070094128e+00,4.351245544829894230e-01,-3.460596446423357397e-01,-6.802160210763315007e-01,-1.256299852710791365e+00,1.341464781929573302e+00,9.675596977656002462e-01,9.852743950247118132e-01,1.052122822905457333e+00,1.428976461288473443e+00,-1.273809074195314528e-02,-1.422903276783276522e-02,9.053341873943709928e-01,-1.485564869483277928e-01,7.179390678616200949e-01,2.616293028557850953e+00,2.530757093587959750e-01,6.684473883276034201e-01,6.950880967338370908e-01,5.471132338865456468e+00,1.439913774341703423e+00,1.333490367706462454e+00,-8.493388747175423248e-01,-4.819568388055223140e-01,1.069313830438536339e+00,1.246804605006367472e-01,-4.522189274853037899e-01,-6.081356748873170126e-01,1.576179634831276655e+00,1.237744241301798276e+00,-9.581118134303321376e-01,-1.039370194575356399e+00,-1.478251447491777393e-01,-5.126641925044335135e-01,-1.234530760961205509e+00,-5.149362587040864359e-01,8.607110276152344364e-01,-1.124560749487359956e+00,-1.258649854170302285e-01,3.846746219987570825e+00,-1.483649368456202433e-02,1.835268973277782989e-02,1.540560529824302138e+00,2.543492773169546695e-01,1.747620413782970505e+00,1.809844403027369153e-01,7.353382582942123991e-01,2.811251797343263803e-01,-1.080053791720605005e+00,5.775997258086140729e-01,4.633596758827698836e-01,-9.838652588415569555e-02,6.288355908532237137e-01,4.916588273507482842e-01,-6.618007069091579320e-01,-2.865030576167839071e-01,2.187638088301253170e+00,8.876991182549225368e-01,-1.032474404065228502e+00,2.309985897646580355e+00,-1.769038888193324999e-01,1.401433682424023441e+00,3.579226252742946368e-01,4.227850804449181932e-01,-4.641903159366165821e-01
1.020714582987074071e+00,1.458383047435926283e+00,1.441353451169320038e-02,-5.557025379504462181e-01,-2.168081869483064195e-02,-1.596247925012017621e-02,-4.381278420080593761e-01,2.132370359500364021e-01,1.361138455036909889e+00,3.299593634992284974e-01,5.292521494194708520e-01,3.460511633798954989e-01,-4.105976234580043793e-01,2.508901995208149271e-01,-2.253174681000976176e-01,2.022247058870295877e+00,2.521865305833914661e-02,7.811790509131286142e-02,1.901123911668600036e-02,1.832635531410479746e-01,-7.941161585344209684e-01,3.287523568715575162e-01,-4.948074628926329988e-01,2.074862806853933483e-01,1.342977290336856644e+00,-4.179298063106280936e-01,2.205544192883716059e-01,-5.222381071153066046e-01,-4.827054185792123420e-02,-5.538099592145584449e-01,3.006235225289921043e-01,2.189164049707554405e+00,-3.588437004913874184e-01,-4.313907915256871006e-01,-6.537270517358884092e-01,-7.314554265714456882e-01,1.369864306734420722e+00,1.169768069450407566e+00,1.282446366151708039e+00,1.319955248060535435e+00,7.256767733314145596e-01,1.217547918423005915e-01,2.274602543658530984e-01,3.143988222880376160e-01,3.021728176330630289e-01,7.851590573506282977e-01,3.022927880459855388e+00,-6.853794979094149364e-02,-4.382950405376964675e-03,1.612959579429481760e+00,3.801388508948781109e+00,1.014452508866128921e+00,6.264404769284863672e-01,-4.908468385184044380e-01,-5.179516361208008624e-01,1.368808900560405828e+00,4.458552058869371670e-01,-7.697893030023876537e-02,-8.232567140327047284e-01,9.821402750090373335e-01,8.752146376460765431e-01,2.081685201492183279e-01,-1.452385290174720289e-01,1.054731445932370670e+00,7.119243097118290731e-01,-1.788756521016199308e-01,-3.719572628079642063e-01,6.367946045212028450e-01,1.150735688741522378e-01,-2.482995863979280404e-01,2.775107282237379902e+00,-6.181701182969510100e-01,1.206878990371999805e-02,4.962400993965576657e-01,-2.337545120569374801e-01,1.383196351603504626e+00,3.240807426646244438e-01,9.674591405176270476e-01,-6.383586276914229307e-01,-1.496420940053107551e-01,4.985879016374812345e-01,2.669784871807775462e-01,2.205209437381855375e-02,1.041130004052969404e+00,8.673734907273705774e-01,-7.216140112700717424e-01,2.701182395322988539e-01,1.549547277025832948e+00,4.560836583832205138e-01,-2.595079112781095709e-02,2.002144505284760623e+00,-7.568974865188442536e-01,1.157935733997054406e+00,1.158958608785216060e-01,7.448104415888485708e-01,4.755170453243706685e-02
1.230829270402391318e+00,1.508711879297421010e+00,-4.127398546486050757e-01,-1.200006541173259667e-02,-2.089929509723966183e-01,6.412652014237629761e-01,3.328475947142035540e-01,4.949320355924113901e-01,1.617107213450665215e+00,-3.408734788448861130e-02,5.205117742034109929e-02,-8.097403589678808800e-03,-4.652838085997950124e-01,4.485786621424961429e-01,-1.056140756105054535e-01,1.686042147261496815e+00,1.047905417483324664e-02,-8.556615465449594060e-01,1.317052344443984668e-01,1.405989409988301353e-01,-7.882194265481046180e-01,1.617278411526427151e-01,-7.397251146209715689e-01,2.550010873421161284e-01,1.176617854956681031e+00,-2.430709680144217122e-01,-2.998585920062344368e-01,-5.542930301141990590e-01,-3.452433242433669003e-01,-4.984884394284415654e-01,7.805094006498104475e-01,2.065604965937384740e+00,2.028055855258014128e-01,-1.790404875639611260e-01,-9.260873720241972196e-01,-8.556956892033933393e-01,1.966383443627651939e+00,5.658381289485239218e-01,7.525402106798131374e-01,2.353923623729305969e-01,1.211681008567335294e+00,2.941078730433338007e-01,7.406425440868995291e-03,8.092212853551001839e-01,4.082000880676835974e-01,9.413150644683405677e-01,2.667566076978185041e+00,6.683512461362810519e-01,6.109668401125586401e-01,6.286572066802038616e-01,4.972728751721783524e+00,1.656062574766429485e+00,1.114419684384204023e+00,-3.775290521152309120e-01,1.561974680373069413e-01,6.863807972518685130e-01,-6.858943378814156278e-01,-5.818277804515359364e-01,-8.835889712527025264e-01,7.637505234175190338e-01,3.030419592073265722e-01,-3.082186700154763148e-01,-4.162306276834064622e-01,-4.144649975966633315e-01,3.607520723786497019e-01,-2.435455439749154571e-01,-2.408046295451395369e-01,8.814496280144402673e-01,-9.355601728560590802e-01,1.029534590815045503e-02,3.095485986935433864e+00,-3.174018778263288376e-01,-4.306384012948639151e-01,7.526712686801548813e-01,4.481689986217558541e-01,1.011540961746075329e+00,8.665560906006913866e-02,-7.592488414801346064e-02,-5.211482877176476514e-01,-8.108337167926717992e-01,7.828430215655516333e-01,-9.356423096035976217e-02,-3.375628458092829742e-01,1.056722268185115388e+00,2.360511896035751844e-01,-6.360031243830867043e-01,-2.285078133495671571e-02,1.289076422295553304e+00,1.107314928103788398e+00,-1.343501499617365535e+00,1.872909581165905335e+00,-7.357358151623939468e-01,1.846185706270068394e+00,4.767928316514769560e-01,-9.772471733802896576e-01,-4.151753254672104765e-01
9.932056117400438477e-01,1.565224510034743055e+00,-1.809105015945892680e-01,-4.775166614783843411e-01,2.447206703953586082e-01,-1.419382268601807606e-01,-2.143169767490970545e-01,3.435773770078659473e-02,2.386768925720330614e-01,2.124237845027794336e-01,1.069088900501522055e+00,3.299538118389049868e-01,-2.788943480266933284e-01,6.502548377029360172e-01,-3.375915625671948583e-01,2.254559397483840932e+00,3.674432068505471549e-01,-2.903390277329728764e-01,1.469789859782089092e-01,1.679484348040186786e-02,-5.111024986130867642e-01,4.716992705731259949e-02,-6.484417745443076253e-01,3.988075659096188552e-01,1.268533361719096586e+00,-4.407036072647804170e-01,3.226345978838797146e-01,-4.322874166194189405e-01,4.506664713347254825e-01,-4.436538951947548437e-01,2.872947851512522299e-01,1.700125520009331259e+00,-2.269442209312017011e-01,-4.594842547079413531e-01,-6.729167100228671261e-01,-1.013553742461027696e+00,1.003589873686866252e+00,1.271878134487845813e+00,1.365978813707189321e+00,1.010828455617278188e+00,4.851282827194847158e-01,-1.609390453055205561e-01,-6.371438926040387529e-02,4.333522850042699215e-01,4.483856389182205859e-02,9.182740585989221938e-01,2.699994816569110778e+00,-2.278809497263967199e-01,-6.217660684229890655e-02,1.992155872207168166e+00,3.786819177129797431e+00,6.278824074199085281e-01,3.706936379559097050e-01,-7.166639452108410913e-01,-4.404906092982063259e-01,1.277356729053832574e+00,4.595820709491053591e-01,2.491712472630208397e-01,-8.534476323387770735e-01,4.421551759442736707e-01,1.148565852398164333e+00,1.201060271528686663e-02,-1.606318312528915437e-01,9.929704882212591066e-01,2.951885288212333647e-01,-6.481455415808352605e-01,-6.940908438550172921e-01,7.143534936395312673e-02,-8.767000998637725084e-02,3.642524996957638983e-01,2.774025800873137548e+00,-6.086957968125830121e-01,-2.345864620924605071e-02,1.068926337621897371e+00,-4.783249735992775031e-01,1.861604889770745785e+00,2.015142165651135353e-01,1.245882800835495852e+00,-7.970762150100219046e-02,-3.523648676230939913e-01,5.672276367598605429e-01,1.574648630333414512e-01,2.929924212642063264e-01,7.919146614445378152e-01,9.265553213052433179e-01,-5.535003444158568264e-01,4.252729816860583156e-01,1.191294537137354670e+00,2.363944204434664798e-01,6.300392911037968613e-01,1.604218682370741833e+00,-9.285978919475786908e-01,8.040530552229101513e-01,-4.827896608618625907e-02,1.523437137140568609e+00,1.575398683126260080e-01
1.061679317897729291e+00,1.761715943528227690e+00,-5.478975486891047852e-01,-5.353277465163795990e-01,9.415165248109312601e-02,7.102706769488634220e-02,1.065062642457412223e-01,2.134260343567495055e-01,1.516579726949764950e-01,2.799368543379682217e-02,1.087174830924519497e+00,3.449481341825736957e-01,-2.091003355849633261e-01,7.347392361335605138e-01,-5.878901447029650784e-01,2.314273011886027298e+00,6.656875040103791275e-01,-6.843478248564591748e-01,6.476313111774684161e-03,-2.122131719102743896e-01,-2.301623567066561349e-01,2.343658511163240754e-01,-7.716248002961394459e-01,3.359580870734288349e-01,1.456929960608806196e+00,-1.947442145305412764e-01,5.320754179463145495e-02,-4.124620247088270353e-01,-4.490259948903840836e-03,-8.210791323794632834e-01,3.160182240438580981e-01,1.534461182028466153e+00,-1.239872203366522152e-01,-1.420222059577337936e-01,-8.449488164351129926e-01,-1.047894017758534524e+00,1.437469266104437260e+00,8.907276201721577857e-01,1.583506469973935404e+00,5.182737397488053066e-01,5.237385992845630112e-01,-1.750648776764617831e-01,-1.678516394963058822e-01,5.572065941180136539e-01,-1.037420622733061792e-01,9.461919232055999718e-01,2.470497210784962316e+00,1.012761107263343840e-01,7.651692087402719999e-02,1.494071575310695676e+00,4.267913935299238126e+00,1.149523690829718836e+00,6.038344558259647332e-01,-6.318811144283189574e-01,-1.218476199323372255e-01,1.133214541446535772e+00,2.436052815082389855e-01,1.792998422405236159e-01,-1.258441155367994613e+00,8.090733969188017571e-01,4.332882521656070129e-01,-6.896549847606814332e-02,-6.449349522825373326e-03,4.561236109245628834e-01,3.381070322713179976e-01,-5.787141077500346231e-01,-7.919097525520163439e-01,-2.684945252192979526e-01,-2.170769231932688781e-01,7.273760546824595830e-01,2.739492907573922942e+00,-3.649832226716350769e-01,-2.783798813570022568e-01,8.287259304949177174e-01,-2.484432219815389531e-01,1.397128923647733334e+00,-1.827858556646998478e-01,1.072440573293132804e+00,-3.580240520541398963e-01,-5.117989890565174393e-01,1.150835979016853416e+00,2.319663887057872020e-01,9.186086505349677633e-02,9.002187294055914446e-01,1.071905221161361998e+00,-7.849052894884429588e-01,3.397757163874145503e-01,6.104084386006676244e-01,4.820044002450282195e-01,-1.484465401296791720e-02,1.506028310568080064e+00,-8.461540387364775428e-01,8.993746906587352097e-01,-6.912276817061607792e-02,9.990847207424187193e-01,-1.649455043703678125e-01
1.103251188193793197e+00,1.191443111771034902e+00,-1.224484521738746362e-01,-3.915729034435933564e-01,-2.984394006007345945e-01,1.054619682814776915e-01,-9.660286388848455807e-01,5.441180744852796014e-01,2.017780955270161769e+00,7.703808189644680837e-01,1.103842221670025658e+00,5.864338438023892763e-01,-3.665223074815604498e-01,1.711577303449208776e-01,-2.867911764071014447e-01,2.787561118477555944e+00,2.928468430616392726e-01,3.011970162013262731e-01,1.027013365560587310e-01,2.950035656030848275e-01,-8.538414034931545160e-01,8.319847071477981526e-01,-2.166437928970935678e-01,1.443122186978749999e-01,1.154850021076203159e+00,-1.251807462556222106e+00,2.176519610075246525e-01,-4.876386222487194000e-01,7.595612495230161798e-01,-1.550458427650522886e-01,3.454655051274024280e-01,2.266490170125992520e+00,-3.912844010608960699e-01,-7.425348581753734578e-01,-4.768088718016001426e-01,-8.826845063945404357e-01,1.141065677040075776e+00,1.487397891121718718e+00,1.210309329640842257e+00,2.204817927193090110e+00,1.028610464441265471e+00,-7.342244861263685918e-02,5.169973751220354741e-01,4.077832461892882399e-01,-5.519621115030104441e-02,5.138401729080684932e-01,3.485598966232594798e+00,-2.775347503381553893e-01,-3.903681939777008114e-02,1.897129352064792052e+00,4.073555739604918458e+00,7.735125300374787738e-01,1.083005281717406287e+00,-7.160259957381582829e-01,-1.035817358081580153e+00,1.667171962487003833e+00,1.121142211460392168e+00,-1.368168398988498236e-01,-7.797452911860865976e-01,1.718447753135599498e+00,1.481331751885491821e+00,1.950004835219383836e-01,-5.186278916342136336e-01,1.526607101192609672e+00,2.754030217624958699e-01,-7.446024140231122246e-01,-2.715099065281714186e-01,8.012949960725506138e-01,2.855941311048201259e-01,-9.765088398009864612e-01,3.530883764785592405e+00,-5.461848563682969449e-01,2.691825143356374461e-01,6.883240193780395533e-01,-3.039637485669290928e-01,1.742561937586998955e+00,7.375452079221171964e-01,1.667585584236269236e+00,-3.422716151555279529e-01,-1.806728635530946425e-02,3.978274073450189796e-01,8.572722868203903612e-01,1.521756047002471579e-01,6.112612024596422167e-01,1.161762274374988468e+00,-6.976265486528302473e-01,-5.780860149588507024e-03,2.499736218664185383e+00,2.666375998860358587e-01,-7.286273858098346601e-02,2.757650774130536497e+00,-4.108580375761742287e-01,1.184468932108500017e+00,-9.603333525205925980e-03,1.560081763541481648e+00,1.314232233199388311e-01
8.856802795706526510e-01,2.685122732937691437e-01,3.124617929094807289e-01,-5.334404330676867367e-02,-3.010029961480836236e-01,5.118163016922762099e-01,-2.213677933458229607e-01,1.480726613554099180e-01,2.175461152765901574e+00,7.543495591885883700e-01,3.063504033500366042e-01,2.205323754903537603e-02,-6.014542278998795677e-01,-2.650555817248544388e-01,1.327392001652628606e-01,1.705355590919524600e+00,-8.506199621779406694e-01,3.409968316749295014e-01,3.087523938082985531e-01,6.193295876683230228e-01,-1.357589727050044548e+00,4.792935716123302159e-01,-1.480805425280649623e-01,1.922954584326935223e-01,1.093147895865162145e+00,-1.018218707782072796e+00,2.626675624113046226e-01,-7.253999785650803167e-01,-1.249251496391323712e-04,-1.195708167134563737e-01,6.169456416765959350e-01,2.968603279415576779e+00,-1.693475389580639812e-01,-5.362898736522232479e-01,-4.016582611201243713e-01,-5.958996596599960283e-01,1.184265826189273785e+00,1.376096553385878885e+00,1.059026000672601997e+00,2.113911962731599203e+00,1.235384693343745566e+00,5.095544908024499664e-01,4.382817759382976464e-01,1.750890240386074881e-01,6.306544203865031006e-01,5.842639527661823706e-01,3.163461522575807372e+00,-1.972792905864514945e-01,2.750927063583328280e-01,9.459122787480851446e-01,4.055541853864631285e+00,1.306291828795335785e+00,7.826461834308675591e-01,-5.122380761065036259e-01,-1.024822867844515706e+00,1.606095607833489591e+00,5.589748778169345567e-01,-5.242935702160038680e-01,-3.031354910136574432e-02,1.665926737874344088e+00,1.547150737630689887e+00,-3.550464570562200661e-01,-7.884684582918881635e-01,1.068659215978371435e+00,6.115180029238296289e-01,-1.244906443234476967e-01,-1.032647065085350313e-01,1.896323163490003072e+00,-1.940591095290754020e-01,-1.036470900813490692e+00,3.090114073186950527e+00,-4.961463119279453382e-01,4.947855371046358530e-01,6.649852161441959231e-01,1.090702101188026352e-02,1.497091051242382953e+00,5.733392938159205254e-01,5.822652293533856493e-01,-5.442863470527585790e-01,-3.391298807092398837e-01,-3.334725233288517998e-01,3.193973704544803560e-01,-1.863358230964548001e-01,1.265658807057854052e+00,3.767384717411194073e-01,-7.732245209985653123e-01,-5.271191241068645672e-02,2.871608468420376425e+00,7.203955426196132494e-01,-4.754497074086004305e-01,2.513995898406704566e+00,-2.061284588509328386e-01,1.331735794477920898e+00,5.400988962560722140e-01,2.614423684007550763e-01,-9.585889996740826202e-02
1.085091230039272769e+00,1.669144089633534556e+00,-8.395451882944049427e-02,-5.857816292813444736e-01,-1.466812985850426687e-01,2.446480992726058623e-01,2.799598039120321236e-02,3.079923726211754031e-01,1.698982992655647895e+00,-1.146548629778365580e-02,-1.879002128886262946e-01,1.607438663871932905e-01,-4.878416122324551463e-01,1.599163426607198013e-01,-2.192878059004558788e-01,1.450354879190214774e+00,-1.546267271151176570e-01,-2.402501092817474759e-01,-1.415169767648489230e-01,9.916300934685731705e-02,-7.876233481520920066e-01,2.776863652514067193e-01,-6.728243339252550914e-01,1.106768866610709778e-01,1.529872906694279555e+00,1.880612238153947235e-01,-9.410337332667165211e-02,-5.856572122702752292e-01,-1.029121104038104306e+00,-9.860191938721987182e-01,4.126313220743895172e-01,2.309076616486941624e+00,-2.360402058965235528e-01,-4.958440202083208570e-02,-8.862749690676792191e-01,-5.401416958126783463e-01,2.054798144320743702e+00,6.178207141681666403e-01,1.234806570494815015e+00,5.337722273681944074e-01,8.425943445123038611e-01,4.128277454930101564e-01,1.449449486776347995e-01,3.848993166050826420e-01,5.850100184694169148e-01,9.018772585482942583e-01,2.784447878457551262e+00,4.719252577542301097e-01,2.588401199582002765e-01,7.926557458643919141e-01,4.181438172027478473e+00,1.751611474378038213e+00,7.737268921096688290e-01,-1.762626080970625397e-01,2.869027573820337462e-02,1.024520032923669444e+00,-2.940800085013561826e-01,-3.874293060061506644e-01,-1.048479616580879403e+00,1.015358542043176993e+00,-7.804858602024658532e-02,1.806337525329387850e-01,7.063571331441598211e-02,2.358418798648379555e-01,1.109386875790591587e+00,3.954263805472592042e-01,-2.491975534967632577e-01,7.607945115824953364e-01,-1.695346048463482747e-01,7.182210773302610818e-03,2.454122212084966392e+00,-4.784450065641922545e-01,-3.396842190890859148e-01,1.475673029695961924e-02,2.169313820260033165e-01,6.136053401166600141e-01,-5.005640106812259127e-02,1.166042409529310375e-01,-1.214080751900614263e+00,-3.308477621955464576e-01,8.679546542023246491e-01,-2.656492391537179643e-02,-3.791296284213755419e-01,1.448791332238898333e+00,6.014031619891044844e-01,-9.114978568550093918e-01,2.134801161337575026e-01,9.169805692570918154e-01,9.500532200549646200e-01,-1.003453636764913837e+00,1.765361483899911210e+00,-8.053814777667673841e-01,1.569796628249475523e+00,3.464353111802744856e-01,-7.886217760000868715e-01,-3.173601499816702254e-01
1.161371920932210644e+00,7.285501246644123796e-01,-3.965503516162569575e-01,2.025807810723824209e-01,-4.252395722334387229e-01,6.785449367691136491e-01,-3.357672703602702646e-01,6.282890894137430626e-01,1.948817465141758243e+00,7.256609675099680024e-01,1.123244683273684874e+00,2.622202629042408861e-01,-3.942918151177607911e-01,2.800203010299557871e-01,-1.560753442937423685e-01,2.691971036486417113e+00,1.509116891345083644e-01,-3.327958875782640047e-01,3.683390446799946760e-01,3.620435191466387925e-01,-9.194655020259525635e-01,7.242332602075909342e-01,-2.646470662033760801e-01,2.614912517930401137e-01,9.003994850851726461e-01,-1.518081081199951443e+00,-2.455916783405795445e-02,-5.390520574213257810e-01,9.594592751610577785e-01,1.482684398250959656e-01,7.598357595013025545e-01,2.257912795891724222e+00,9.435506683359390356e-02,-6.705415478137979335e-01,-5.224205779876195388e-01,-1.078209148272661899e+00,1.194684107581171828e+00,1.301253581068217313e+00,8.732639230371503913e-01,1.834399631285297261e+00,1.434779067941249542e+00,8.719172806772979012e-03,3.442468847111844754e-01,7.167322675918210706e-01,-5.671359032959311097e-02,5.571658986038896533e-01,3.194837027580478939e+00,-6.665910412751607783e-03,4.102920014116934744e-01,1.245767363340575695e+00,4.923149158399201752e+00,1.065213996456849888e+00,1.360160142205716127e+00,-8.132594999487856580e-01,-8.733429632410475429e-01,1.360112593257219782e+00,6.060408974773678903e-01,-4.481241581520319928e-01,-5.076479891846026327e-01,1.720950297399791440e+00,1.625942174316434397e+00,-4.759803625590575682e-01,-1.002868000283789751e+00,6.738257318207147017e-01,-2.611847515614742488e-01,-1.093817643641110449e+00,-2.615211164327112536e-01,1.166086024092762852e+00,-5.562641965454008242e-01,-8.844919891224318764e-01,3.944268072948775128e+00,-2.817502994562748886e-01,2.244509743508721344e-01,1.242795423941889021e+00,6.289049808809300812e-02,1.861419419985838042e+00,6.573348832792889063e-01,1.137892349535228664e+00,1.007994464319801331e-01,-5.945568612440237377e-01,2.677565496392734223e-01,6.958026490711024525e-01,8.902048755088598497e-03,5.340721411720663614e-01,6.702612014545969998e-01,-5.957954231725853811e-01,-2.698849225284159492e-01,2.802930449507236688e+00,6.264592843926390930e-01,-7.075872136360129572e-01,2.769163141232526826e+00,-1.972234730847864936e-01,1.456881478215458436e+00,2.723391792574603176e-01,8.743172099108402762e-01,-1.527359120603061227e-01
1.180480939940512286e+00,7.431603314651378245e-01,-2.864608014636710331e-01,2.010877405085468306e-01,-4.513105215985244723e-01,6.517369926492886378e-01,-4.849462528289228413e-01,6.629842266147268903e-01,2.272810557441480306e+00,7.656495597307395595e-01,9.615381064343608841e-01,2.729261406967160020e-01,-4.405196615444121333e-01,1.989891478539689285e-01,-6.673125732282358946e-02,2.634712352128619095e+00,4.537811966959931498e-02,-1.887219352375751613e-01,3.617802982753142160e-01,4.451696308555890269e-01,-1.042845293261055239e+00,7.337120754252580701e-01,-2.228454713194961689e-01,2.295415418164425125e-01,8.629298763109338744e-01,-1.550387794327964031e+00,-1.220606799377871310e-02,-5.535035217236264904e-01,9.652772264554223547e-01,2.187785946159839234e-01,7.648554753770713255e-01,2.372633283705570584e+00,4.839487395402120029e-02,-7.485094317946368037e-01,-5.004017268913917293e-01,-1.013173897093350595e+00,1.216893904603195686e+00,1.339537770656585636e+00,7.507403388072386718e-01,1.953203663347330421e+00,1.494088131524712537e+00,6.557269432638657136e-02,4.359705310846023751e-01,6.989885943450597772e-01,3.210749662563860962e-02,5.317293035774200982e-01,3.339795632914697610e+00,-3.236972898337020510e-03,4.036225689801576921e-01,1.294842928729607934e+00,4.849427704121048066e+00,1.020223781273118302e+00,1.399387562336667834e+00,-7.719493514770656706e-01,-9.151948280201713803e-01,1.365471940150078112e+00,5.928709280193054099e-01,-5.209549723964146395e-01,-4.447476006909708013e-01,1.697698653291223936e+00,1.693184317283870532e+00,-3.795168877772228111e-01,-1.022964767449548784e+00,7.643772758388689414e-01,-1.886983709055145564e-01,-1.010718457838882811e+00,-1.459486144411575870e-01,1.348369938606895690e+00,-5.048457653254384558e-01,-1.113238978087457420e+00,3.979596179048914273e+00,-3.503587958595488772e-01,2.449224616823488798e-01,1.166994213260131863e+00,8.824426655299831557e-02,1.847251554888835301e+00,7.927032338513075871e-01,1.090203776931740753e+00,4.136894902096877047e-02,-5.136062878671803222e-01,1.542745025547831439e-01,6.891202252195465228e-01,-8.158178285622541548e-03,5.344326931304841377e-01,6.103085238575958194e-01,-5.544672819403634323e-01,-2.896376490987984664e-01,2.985255814839149480e+00,6.303634453615195588e-01,-7.521453187715290145e-01,2.885202164757083576e+00,-2.143309679108673649e-01,1.570489582230440551e+00,3.114200110481350481e-01,7.542188270988112730e-01,-9.861168983648521680e-02
9.859560684306739597e-01,2.055411962594503317e-01,-2.461196889537573540e-01,-4.144392653780526459e-03,-5.896361424261360451e-01,6.682734694318708257e-01,-5.145283391191060041e-01,5.484491047202767477e-01,2.146638720634669539e+00,1.076539986196839660e+00,1.382517662138323722e+00,3.756616934244246808e-01,-3.929483820010214457e-01,-9.544973860454726566e-02,-2.933031765102112054e-01,2.833982295431921816e+00,-4.672062926995440568e-02,1.782839535473544901e-01,3.011330890204363397e-01,4.206414582513232081e-01,-9.723172513908806547e-01,1.134281940031693470e+00,8.693800577259991336e-03,1.485303782732887157e-01,1.079042897346891072e+00,-1.754283093955473438e+00,1.447436662854152956e-01,-6.111660397712334047e-01,7.620460008240808047e-01,-2.507664382984398088e-02,5.860074316250263315e-01,2.645557827835532727e+00,-1.463918899018762376e-01,-6.164340493699143053e-01,-3.323255059125413413e-01,-9.300797245258802803e-01,1.051972468707762065e+00,1.519810084718577592e+00,1.381486306640265171e+00,2.668138088011072107e+00,1.380804986174341664e+00,8.381563016578819081e-02,5.427026850847231909e-01,3.637425799035270968e-01,-9.608045025374079007e-02,3.434233781335278568e-01,3.337960100099584437e+00,-3.371079551588983536e-01,2.174808980069301567e-01,1.149857346728809349e+00,4.611243748696486122e+00,1.244585740331368484e+00,1.296950667749880548e+00,-8.267051994373214585e-01,-1.384195699962251780e+00,1.897465048972458934e+00,1.357334477752112356e+00,-3.765184249431341446e-01,-4.097858974162819079e-01,2.657962520590165134e+00,1.749070743574696163e+00,-4.599937384357360992e-01,-9.992897234048898625e-01,1.321751868994836210e+00,1.307918921742556861e-02,-9.324458873862393471e-01,-3.029001957173588777e-01,1.362360356122237715e+00,-1.867006008314704008e-02,-1.192409444174926447e+00,3.834143437358904727e+00,-2.111058595468088828e-01,5.993475814706142879e-01,8.839322331395096377e-01,-1.082398179362646928e-01,1.751765653910795528e+00,6.105858107529518186e-01,1.572348490776089402e+00,-2.269295615642183961e-01,-3.287750800007372409e-01,1.452295479924518018e-01,1.088912321975260777e+00,-2.805400446442185558e-02,7.615452354840310800e-01,1.037026161313640005e+00,-9.258408014026073829e-01,-3.079847401377482918e-01,3.194057739420393283e+00,5.058298694668409423e-01,-5.665362430574788499e-01,3.074563891353088607e+00,1.838392137900297651e-01,1.110001254452315012e+00,2.087165823457703684e-01,1.434906014101481553e+00,-1.871507568372556829e-01
9.565694096322625573e-01,8.582529888114300842e-01,-4.433998116592187122e-01,-5.960662106703096264e-03,-5.121310544989272906e-02,6.816266250351756817e-01,8.660407317448775011e-01,6.369218260846165602e-02,3.650951367446570450e-01,6.268614603018493603e-02,6.436324207483190563e-01,-1.526737684315924715e-01,-3.707362159320417572e-01,4.580332769840940732e-01,-2.837181645103172278e-01,1.660263788555412789e+00,-1.218376848229553722e-01,-9.487246610009192338e-01,2.652937700997560766e-01,3.782126937612714096e-02,-5.899963449484069145e-01,7.596297848670630071e-02,-7.016012419582801085e-01,3.962091879769529257e-01,1.295328898410348373e+00,-2.794525338975777928e-01,-6.644567740361376207e-02,-5.981082561298943778e-01,-3.796254402331795674e-01,-6.452332164378649093e-01,7.080893312867069245e-01,2.034171550893727698e+00,2.588458156848847946e-01,2.947951225313512336e-02,-8.004410707368752043e-01,-9.613039305361326115e-01,1.518525118706997690e+00,7.314344179260389156e-01,1.353926812497874721e+00,4.022874695570892722e-01,9.237344893145327251e-01,2.422340683867695299e-01,-2.546366449329043324e-01,5.609833396630530267e-01,2.920808711442834382e-01,9.607078445423566926e-01,2.169227239671822183e+00,2.880717695369031661e-01,5.171078352172552295e-01,4.877754566667794056e-01,4.766756745756095981e+00,1.707828009415684134e+00,6.450866332867841724e-01,-5.593797675706690953e-01,-1.033046550165039879e-01,9.987763739414757813e-01,-2.764752778882221262e-01,-2.639743860662758790e-01,-6.542868689916786495e-01,1.005232756787683090e+00,5.497750805432819465e-01,-7.802680689574865713e-01,-4.680563887684153768e-01,-2.371970912943053289e-01,2.650832343785125556e-01,-3.870402447073981733e-01,-6.608082451182932804e-01,6.669771674875497602e-01,-9.154083094160504475e-01,6.277605729436877002e-01,2.754485961680261497e+00,-1.535652652364004334e-01,-1.192706408808933832e-01,1.049125688590277550e+00,1.653954614462447292e-01,1.264099470343430509e+00,-3.168579413988678595e-01,1.740658099369172263e-01,-3.006061703372215899e-01,-9.949623035753483169e-01,6.409733087364116733e-01,-8.635485882813576097e-02,-2.256091529431640819e-01,1.272549779166515460e+00,3.775172871134799824e-01,-8.346992993084693113e-01,1.150639556884807679e-01,1.120294670032332851e+00,9.716243662668567760e-01,-7.088567822246181205e-01,1.482146863217238986e+00,-5.103678580379428231e-01,1.145026953386498514e+00,4.236255546159037877e-01,-1.592210340968434057e-01,-4.942414964617329320e-01
1.318107818066877712e+00,1.464433814456172822e+00,-8.992966866827896422e-02,4.101965092354264986e-02,-2.751658005696867026e-01,3.231916159225328156e-01,-8.294964127299861989e-01,7.142016192700891830e-01,2.608379236187870376e+00,5.112786820957848644e-01,4.074773452965211318e-01,3.367837162061912970e-01,-5.058175106644057228e-01,3.240940886258977804e-01,1.189871561392308319e-01,2.387629256826633295e+00,8.578066389100341693e-02,-8.620109296339997784e-02,2.522345933107115745e-01,4.766038407857193793e-01,-1.149885432831920129e+00,4.271916529707143750e-01,-3.877679815921550865e-01,2.111896294055289058e-01,8.188236920394001972e-01,-1.168160825440374806e+00,-2.016991650584473716e-02,-4.966054628935503423e-01,9.112594098729731584e-01,2.534304236028228630e-01,6.993106183260898723e-01,2.238772135701291521e+00,-7.133192847845495899e-02,-9.037517772069887378e-01,-6.237975446245075384e-01,-9.087412434246423532e-01,1.393435599596624108e+00,1.263000642657581940e+00,3.300437055140399423e-01,1.538012891236030022e+00,1.397622741607331687e+00,8.062675488927795175e-02,4.775053863351799710e-01,7.924990827015581107e-01,2.458843381642609738e-01,6.721587365252403856e-01,3.546891476435766410e+00,1.741348221572933397e-01,3.317890037115795998e-01,1.721430628819460296e+00,4.542612822115723148e+00,7.119742041969072677e-01,1.335561230080763107e+00,-6.116584057204460523e-01,-5.783035857645021371e-01,1.055418965184178104e+00,1.373245747420273610e-01,-5.394888422039072484e-01,-5.847858796232934253e-01,8.410110268640551556e-01,1.520867001199625257e+00,1.054429619877421676e-01,-7.615215631566509824e-01,7.410882776239016145e-01,3.752750633899615273e-02,-7.544291119212698238e-01,5.780065298968084520e-02,1.271477525378867268e+00,-4.514884209237332025e-01,-1.188545195064333315e+00,3.827330521138419428e+00,-6.497631915360040367e-01,-4.402977713540139060e-02,1.011091948800407092e+00,1.037521276991977409e-01,1.782291434880212799e+00,1.026225571231956568e+00,8.382640816446185195e-01,-7.012341005682509731e-02,-3.243864549242000961e-01,1.748026947807428400e-01,3.796590585429682752e-01,3.863062040090264881e-02,4.480918715750943360e-01,4.388712242017668852e-01,-2.884443926073255726e-01,-1.310566398095885376e-01,2.677418597092944275e+00,5.879175874701104698e-01,-6.504760082764939888e-01,2.734120237278629961e+00,-6.925428610160243581e-01,1.903142048267096875e+00,2.983913048798850776e-01,3.252059660925932238e-01,1.347103793535523453e-01
1.331014227839337760e+00,8.331975067777984689e-01,-6.083101088532573142e-01,4.276121411282352014e-01,-7.185461716470982196e-01,1.168713609091346362e+00,6.376166564366975154e-02,9.486509832307038481e-01,2.781331166800534938e+00,4.847092793467723260e-01,4.262355663234114744e-01,6.480669930104362986e-02,-4.966639100572661780e-01,1.836614661043283192e-01,-7.145508106989639785e-02,2.304413102325391094e+00,7.163907470863650762e-03,-7.651793743573317430e-01,2.946043335597062773e-01,3.695316632450295069e-01,-1.016184292086554919e+00,8.082739018874540715e-01,-3.776351941081736996e-01,1.498544103168205077e-01,9.144310315604420314e-01,-1.246680393561729439e+00,-4.756339875790591698e-01,-6.050127546681207669e-01,2.830979352310638575e-01,-2.301104422989941334e-02,1.047663496798947991e+00,2.428555141668836903e+00,3.592651303381103056e-01,-4.069107004981577513e-01,-7.425539851045540596e-01,-9.642780240780651768e-01,1.936379325361214265e+00,7.440962172477698644e-01,5.426700531902379776e-01,1.162781346786972758e+00,1.857145377599852765e+00,2.954777196543010298e-01,3.579909284543932868e-01,9.713099214595963815e-01,1.612729467805872341e-01,5.995031948964616442e-01,3.118295847118741193e+00,6.521405277953040702e-01,8.425028777091618792e-01,3.052959164583181062e-01,5.718557861726611513e+00,1.827396990342764260e+00,1.848471618863373855e+00,-5.510304504466058129e-01,-3.733850757167944678e-01,9.318679582902020808e-01,-2.057053617287244451e-01,-9.689071631504498905e-01,-6.640027570605939733e-01,1.929939209786895482e+00,8.516115214079026385e-01,-6.297965618882355177e-01,-1.058984386689339363e+00,-3.334043283349539255e-01,-1.436584948562118491e-01,-7.586371617434297665e-01,3.295513549333994874e-03,1.546541243531476928e+00,-1.082199923121501151e+00,-9.805603277399577156e-01,4.067157501143292997e+00,-7.003174487889007871e-02,-1.298673982653184567e-01,9.297208410469338657e-01,6.906118902101231471e-01,1.173840054474675210e+00,4.795894719230505143e-01,2.408414710061347885e-01,-2.972003799585913875e-01,-8.882943494265144180e-01,5.765252673067666755e-01,5.186157907437773940e-01,-4.363866049245538337e-01,7.485614254267305423e-01,2.788095408765050021e-01,-6.998358273745618474e-01,-5.357134476304894477e-01,2.621412356636567687e+00,1.225999740242025071e+00,-2.076711407851661750e+00,2.862898666551688009e+00,-1.140426056040158009e-01,2.141472961517968621e+00,5.852008181588304048e-01,-8.658172443804372787e-01,-5.730654786110689347e-01
1.193022721120575724e+00,1.302009268353523819e+00,-3.036889003300538015e-01,-4.415823025466032448e-01,-5.111441717727618350e-01,2.031727113735607992e-01,-1.150574742284555807e+00,8.135939648960586190e-01,2.483452054160819600e+00,8.474605960551812034e-01,1.199349864096130647e+00,7.380873532569366402e-01,-3.360654197370880336e-01,1.236923231894704184e-01,-4.232303802351531363e-01,3.087463866373846955e+00,5.352265237209361537e-01,3.088620083162090801e-01,6.178744131754704272e-04,2.401047149184445673e-01,-7.765434230860059905e-01,1.169875428241987647e+00,-1.572688846255568818e-01,3.746060130353903728e-02,1.210070794289884510e+00,-1.394686032605934489e+00,7.051791148388436570e-02,-4.648370630643990364e-01,7.427000274715356287e-01,-2.374519862087579591e-01,3.363576392125371961e-01,2.272064609974780325e+00,-4.293111210991055193e-01,-7.194943898088441703e-01,-5.052495038838025199e-01,-8.886991209490424648e-01,1.363184654389397732e+00,1.401063206924067828e+00,1.266013268082157417e+00,2.341520140057329336e+00,1.169758279710410687e+00,-1.236369600040522765e-01,6.518384540715117526e-01,4.801794020936668850e-01,-2.214958323775465532e-01,4.049786974184426680e-01,3.661157825507379560e+00,-1.596661785853906168e-01,-1.735817313995520472e-02,1.791003684886849356e+00,4.344041164000628008e+00,9.604798108088812292e-01,1.416900704122182386e+00,-6.985738769514874269e-01,-1.065043260040699380e+00,1.719113000228463140e+00,1.277723914669212979e+00,-2.288329994420932878e-01,-1.024894485320311910e+00,2.220357241967983342e+00,1.260800547632335622e+00,2.990257681301988213e-01,-5.121394964704060193e-01,1.514649749998181916e+00,2.596608377072862073e-01,-8.056387464092809036e-01,-2.055214532334783684e-01,7.319545442274713043e-01,4.042628753368117667e-01,-1.203997723124266006e+00,3.777383910441304060e+00,-4.426386096062473463e-01,2.107451764535354655e-01,4.708042349759298251e-01,-1.971629044117431673e-01,1.538488952331187098e+00,7.563064548607438820e-01,1.841409326171233429e+00,-5.184975314795918777e-01,5.953342337647926641e-02,6.838865735790038425e-01,1.145566118689497870e+00,6.970918556026084456e-02,5.257653181508115114e-01,1.383034570865206092e+00,-8.207385391479387060e-01,-1.528587244123834066e-01,2.574151874763157544e+00,3.206207552050510667e-01,-4.900988078508094481e-01,3.071483018217242567e+00,-2.678692686279261492e-01,1.323722612383631647e+00,-7.539970983750476918e-02,1.496830855032561747e+00,2.430717200246423904e-02
8.348755421309578262e-01,1.091650995716215711e+00,-5.892759109243200788e-02,-7.930830108662816347e-01,-1.121135585865905143e-01,6.980570529817886616e-02,-1.086995338743199091e-01,5.379605988971272734e-02,9.400879121256905391e-01,3.907816784050606174e-01,7.425936330525269025e-01,3.418121889368361255e-01,-3.534388835190333533e-01,4.793730869162816932e-02,-5.080953261470452231e-01,1.957164748629066864e+00,-4.675434493962044025e-02,1.484186427710710299e-01,-1.026443115339656653e-01,3.284645431012371553e-02,-5.962135775746020272e-01,5.855558142689094581e-01,-4.285685415510314122e-01,1.412272499259754066e-01,1.670410219647452399e+00,-2.341475680244366198e-01,2.557000079426474115e-01,-5.831865564380209754e-01,-6.823789749694794127e-01,-1.051704583087070377e+00,1.509202448726588708e-01,2.345883603635573689e+00,-4.596921978461149250e-01,-6.879476833601613772e-02,-6.265074281223717012e-01,-6.296545709658565304e-01,1.455380852836462680e+00,1.072272337766114969e+00,1.971876478473645999e+00,1.462381902049388893e+00,5.429441843099427345e-01,2.028637972612138962e-01,1.670709463457757948e-01,3.100487551633120120e-02,2.469132884717744891e-01,7.205991521994449256e-01,2.740898299345871703e+00,-1.721834896597677078e-01,-8.934365106567006276e-02,1.151046036616573565e+00,3.712211878547870825e+00,1.522428299257597484e+00,4.639242519386574948e-01,-4.406754982366909434e-01,-6.437065931408056940e-01,1.690736713079900699e+00,8.147054165477312093e-01,4.356405857006478977e-02,-9.432236265184036350e-01,1.756165901192494161e+00,4.529274241899017284e-01,5.891403920164228758e-02,4.010556537161728829e-02,1.155297884002925546e+00,1.034557010708087255e+00,9.361673651589066947e-02,-6.016191181310996949e-01,4.711681049824322787e-01,4.090714106486909030e-01,9.775395664892061465e-02,2.376297508982980311e+00,-4.023393027401607758e-01,1.557131146400769772e-01,1.144965013258735925e-01,-2.905938619637878917e-01,1.004615668905544545e+00,-1.525373157494720189e-01,1.080237968155778105e+00,-1.065468937236818459e+00,-1.229228073684535960e-01,7.415788091920693104e-01,4.493956451613870251e-01,-1.229992984380040566e-01,1.443050988829425618e+00,1.192532089337358769e+00,-1.161100420330747562e+00,3.069906349186455330e-01,1.194546518071827101e+00,5.169068049569605083e-01,-1.019768929684068404e-01,1.863192742200684870e+00,-4.625906731377912862e-01,7.554122566880671075e-01,6.953728442446913127e-02,8.733639210345769399e-01,-2.047736242675823048e-01
1.071697068437078126e+00,1.398529788974518961e+00,-1.365031663066214040e+00,-1.724268588582897888e-01,-8.040697645890736156e-02,6.907747011629907785e-01,1.070673096783718803e+00,3.321705154356572320e-01,-9.168900008544853542e-01,-9.112770366809261335e-02,1.893727807332986623e+00,1.936056058078265973e-01,-2.748606549276610966e-03,1.081028092820705000e+00,-1.018952278963165536e+00,2.732451760634310833e+00,1.194482924617041197e+00,-1.721446028625548408e+00,1.261993927485998701e-01,-5.745024050572189456e-01,3.268488875502630897e-01,4.389897837908414147e-01,-9.172457643020424101e-01,4.557099911086324173e-01,1.518460121384069827e+00,-3.573132583297985443e-01,-2.879737960444328504e-01,-3.790835031784145492e-01,2.420606442802664127e-02,-1.028041231955054258e+00,5.659250516348246496e-01,1.079411034260276292e+00,3.717698642068020809e-01,3.004979614274027044e-01,-9.855680432891009701e-01,-1.452662044520300455e+00,1.573058954030915668e+00,5.181212436130102628e-01,1.994697632222039996e+00,-9.563752642536571535e-02,6.640293229613742909e-01,-3.851037765358745202e-01,-5.681134143544804838e-01,8.736054541051893052e-01,-6.246844472440745699e-01,9.803382371276615492e-01,1.767442755456377856e+00,3.597822246976569160e-01,4.334097029344771146e-01,6.708207328914774781e-01,5.400718830815716132e+00,1.769437597735568968e+00,8.973932354156075597e-01,-8.566295939258599113e-01,1.182062929177180033e-01,9.837844385796341573e-01,1.200383253806275863e-01,1.991956535642731285e-01,-1.540317997271977823e+00,1.442778357351458762e+00,2.752145134415545646e-02,-8.922619089415311233e-01,-2.469353929796867797e-01,-5.232082579163631619e-01,-3.249055577025834474e-01,-1.197168184249352008e+00,-1.243693698334078057e+00,-8.416351216761198684e-01,-8.964325291187035250e-01,1.597942588881410275e+00,3.047444746791765358e+00,2.287179419682723869e-01,-4.179673387926758354e-01,1.315304005410218302e+00,-1.159947250529175244e-02,1.327008234212835092e+00,-8.508918134266767463e-01,1.059271301920875263e+00,8.892137829685120565e-03,-1.195575604693525751e+00,1.796071079616818222e+00,4.154100553471932744e-01,-2.654056565166784676e-02,8.240254595113587488e-01,1.199614617887342582e+00,-1.047323732831279219e+00,1.118042504520007085e-01,9.644476874227891905e-02,7.749932578486589119e-01,-6.396384647880013485e-01,1.280473944603558012e+00,-4.550132936685309382e-01,6.784700230349370864e-01,-9.088996227992751642e-02,9.858423386315622317e-01,-7.179863353380796509e-01
1.243566785625330073e+00,1.552754011162150949e+00,-4.983451541153737230e-01,-4.963239397027774391e-02,-2.531192026048820209e-01,6.710346421196324851e-01,3.578761066098585797e-01,5.456113543772734831e-01,1.611465428241154463e+00,-4.873410757910842661e-02,1.035639329928296770e-01,2.515392828629214872e-02,-4.414875806839363426e-01,4.587620353029752684e-01,-1.834025335615176999e-01,1.752225516517774473e+00,1.062626647236313282e-01,-9.073004536462915270e-01,8.966469897818041268e-02,8.400758802357777277e-02,-7.134282304311846401e-01,2.435909886423665016e-01,-7.500188845527587800e-01,2.319176246530853802e-01,1.229377741291465487e+00,-2.181035005989871156e-01,-3.488286102710640435e-01,-5.453975946869477065e-01,-4.224850465132213850e-01,-5.892162526401756306e-01,7.656435390014684206e-01,2.028873752493653093e+00,2.006826386291443720e-01,-1.176470764292529281e-01,-9.530359064528765023e-01,-8.647919359811165885e-01,2.048335690843759327e+00,5.036977444983186114e-01,8.351434761004812302e-01,1.904771301513902282e-01,1.210732777208797684e+00,2.731034073216969671e-01,2.830879642180546274e-03,8.229756772335214965e-01,3.467990500334151571e-01,9.297180074412897399e-01,2.643348725329993876e+00,7.144953036659389412e-01,6.164264507233356838e-01,5.540069122387171197e-01,5.057788405695619716e+00,1.757339403000718114e+00,1.174713406039050501e+00,-3.685218720803576375e-01,1.895327421264690892e-01,6.927309988903845861e-01,-6.608405138449718885e-01,-5.785959796322660553e-01,-9.924813980190493323e-01,9.063288911112596935e-01,1.579163840598115376e-01,-3.024071021605808096e-01,-3.744037473871862920e-01,-4.686110809167965963e-01,3.730396185370051798e-01,-2.440031235202785309e-01,-2.690948753408904937e-01,7.813488373596304548e-01,-9.099672146723575272e-01,6.546634805833917437e-02,3.102001329170040123e+00,-2.629674227076942428e-01,-4.693076759376736962e-01,6.794769536392093467e-01,4.747785905097228198e-01,9.157118199515357215e-01,1.086630150918288518e-02,-4.168102240334825570e-02,-5.930542829023475182e-01,-8.146183743978419045e-01,9.270609996914345174e-01,-2.966334930840258677e-02,-3.697111271354943662e-01,1.067091762111198605e+00,3.210797269559789724e-01,-7.028956108019577265e-01,-4.330517144020673559e-02,1.180740368499689552e+00,1.134324101366418036e+00,-1.458632536471184737e+00,1.885054086759119008e+00,-7.006891653400599829e-01,1.840793028898739969e+00,4.470668246887474773e-01,-1.002706149860046692e+00,-4.769256816417716260e-01
1.245105030756408215e+00,1.155934994433864382e+00,-4.886691867044632986e-01,2.194189142762487110e-01,-3.498704209700827517e-01,8.261557559970462705e-01,2.438852642326756470e-01,6.099411271127043177e-01,1.846064627808061465e+00,2.085573291790989436e-01,3.657863058174149473e-01,7.408646714148522938e-03,-4.575477790584805970e-01,4.035799183811839552e-01,-8.206881449740144330e-02,2.002596174770960413e+00,2.610826058938769956e-02,-8.432446003686998592e-01,2.655013713832062305e-01,2.400106542596594228e-01,-8.653313198832390807e-01,3.562315513237759301e-01,-5.884711822605740439e-01,2.679030547396815676e-01,1.015457522802463153e+00,-7.446794863246255503e-01,-3.040292209700915516e-01,-5.638474222060225749e-01,1.192453233913715049e-01,-2.040222738182089213e-01,8.943098322364512187e-01,2.148487333272562250e+00,2.937713844661885010e-01,-3.269723856890601188e-01,-8.137080798544251703e-01,-9.678169399164617825e-01,1.780795966932332330e+00,7.361871003722504359e-01,6.690011931386943278e-01,6.703100434608992853e-01,1.433725617143903230e+00,2.342062859677108699e-01,1.033492218476436408e-01,8.783563860534269185e-01,2.592076852907169160e-01,8.131124798578726054e-01,2.808042428637600452e+00,5.566064883622244830e-01,6.806836501121180660e-01,6.300104985418735204e-01,5.226964552665952723e+00,1.571936540557587580e+00,1.330622003083476113e+00,-5.288422209287153564e-01,-1.288422108228800544e-01,8.134566973447481253e-01,-4.161052523232613432e-01,-6.612944985108937246e-01,-7.106223235262865146e-01,1.126262145825666083e+00,7.391096029121877464e-01,-5.152014943970133487e-01,-7.422782194382543386e-01,-3.053003703155668935e-01,2.540976835169361792e-02,-5.996659940673665368e-01,-2.067842854641280259e-01,1.106650053421025737e+00,-1.033222741891188567e+00,-3.284877334684701555e-01,3.525179504480871806e+00,-2.314247530246711926e-01,-2.457558115480367733e-01,1.016857620909544568e+00,4.568223893981306905e-01,1.277476711530654896e+00,2.767486165333010173e-01,1.618818849966005557e-01,-2.380507777657849822e-01,-8.802556178203740922e-01,6.016682409813183252e-01,1.450513227621944845e-01,-2.869385483003771276e-01,8.572625157175554067e-01,2.464638149511336751e-01,-6.005705744398058821e-01,-2.023542877636598791e-01,1.900029073599444285e+00,1.070786212161416451e+00,-1.402020170532641608e+00,2.228171651846631462e+00,-4.915916480817669743e-01,1.853423333085752578e+00,4.940111395907578196e-01,-6.391347849354120925e-01,-4.181128646339136723e-01
1.269212280940535287e+00,9.926425538472668508e-01,-4.161525558521893542e-01,1.016048889912550823e-01,-5.853272034975319782e-01,6.907479791172500549e-01,-5.885654967708502383e-01,8.677931691364624278e-01,2.640014119625815781e+00,7.156677308365788637e-01,8.614757048060616151e-01,3.758902700399711638e-01,-4.286020408861820896e-01,1.825373594557667123e-01,-1.657235485371414963e-01,2.734210137608947377e+00,2.300990145650333996e-01,-2.226420239645527099e-01,2.301083538223430147e-01,3.709640270246004068e-01,-9.673616955368683490e-01,9.252263796393656037e-01,-2.439234084209254139e-01,1.343726945490282265e-01,9.523588937807760946e-01,-1.466635964491659117e+00,-1.630617162555058341e-01,-5.326912131753617219e-01,7.624607343800107184e-01,5.474712240249779427e-02,7.425463410206236681e-01,2.348252416172807777e+00,7.643740503711748957e-03,-6.740953262794062706e-01,-5.829480833676825569e-01,-9.737294000498794011e-01,1.513647993443834272e+00,1.171209294443384064e+00,7.686011468190958595e-01,1.843419652214424609e+00,1.562886008322231346e+00,6.283986260452339989e-02,5.119171850728376771e-01,7.644472898676246686e-01,-2.856802154377879877e-02,4.989164459125513540e-01,3.436788508073476578e+00,1.858474057557653603e-01,4.296191308780692997e-01,1.166949700451447747e+00,5.032956372915541543e+00,1.229754781685085785e+00,1.629847983871438810e+00,-6.853605056276070862e-01,-7.889110236482914651e-01,1.312179254526420369e+00,5.409895622534164339e-01,-6.074114881918707409e-01,-7.133651929723594520e-01,1.939651793981766792e+00,1.317809442676669107e+00,-2.209444360644256533e-01,-9.080500151145580734e-01,6.366982125153826111e-01,-8.430825250458950926e-02,-9.172604056914601678e-01,-7.584087532811056853e-02,1.240873823668017017e+00,-4.250395806802226839e-01,-1.191874452000788898e+00,4.045794143205869275e+00,-2.952483644278386943e-01,9.513581449293968817e-02,8.905613413242557952e-01,2.179709103369140699e-01,1.554042112079764060e+00,7.476526304032986570e-01,1.072380024986933300e+00,-2.125356003253813242e-01,-4.474329216455787406e-01,4.636415642703891615e-01,8.097309761177036158e-01,-1.171804361158956809e-01,5.343428226274677950e-01,7.409753706691969422e-01,-6.515580984678155385e-01,-3.609606136277714872e-01,2.818806997416820170e+00,7.264620287519277797e-01,-1.158422206854495817e+00,3.017247590005240454e+00,-2.008520478831460343e-01,1.748537120650152321e+00,2.757386418409135675e-01,4.477968264226927508e-01,-2.005173221952592510e-01
1.037122235968240824e+00,1.503101109378854883e+00,-1.544841193128074774e-01,-3.184498863387458800e-01,1.640572635544286784e-01,7.533202213907536082e-02,9.325478466847114678e-03,8.831246619976396151e-02,6.095769310540500863e-01,1.080527724183351496e-01,6.342546627276494098e-01,1.602525768971666542e-01,-3.667690277394279330e-01,5.656954850438330462e-01,-1.901958005709114552e-01,1.915801078936286483e+00,1.150781644347534938e-01,-4.343241379523921641e-01,1.693924442961281529e-01,9.777623612796965125e-02,-6.645441899560839971e-01,-3.483896658204649333e-02,-6.898687211451207668e-01,3.771182885256952888e-01,1.222964830577996764e+00,-3.067037103845333124e-01,1.738262021191929185e-01,-4.895273486971934984e-01,1.477588664392697204e-01,-4.378827275804263452e-01,4.495986598197319606e-01,1.864239917232389798e+00,-8.915680377007689783e-02,-3.788618046215474489e-01,-7.426720461248305094e-01,-9.283911658515978660e-01,1.261400590959972146e+00,1.069059974511116007e+00,1.128833150061678836e+00,7.283799601479529207e-01,6.822772463721442637e-01,3.665652067398500469e-02,-6.634112664446703556e-02,5.126299438393412400e-01,2.631222810142361812e-01,9.603396319928092506e-01,2.653322028821675005e+00,3.058394100277014860e-02,1.495744000807679996e-01,1.566859491443399754e+00,4.049087880888810886e+00,9.144623464278658354e-01,4.942568258197018727e-01,-5.880229622496598862e-01,-2.379901441211727253e-01,1.069298174633862120e+00,1.522508171033487567e-02,-1.364793680884879290e-02,-7.593536002208407520e-01,3.742308466424970614e-01,9.373207025632468437e-01,-1.046605606091267071e-01,-2.385177496098743466e-01,5.518635915723990593e-01,3.716148385918276453e-01,-4.375598687897888084e-01,-5.385154255218779218e-01,4.188958801338460436e-01,-3.875452923117794768e-01,2.808446074239359103e-01,2.769969754512169757e+00,-5.655369940695426090e-01,-1.314975785153590926e-01,9.953243043508663845e-01,-1.996529791966250578e-01,1.622522325520662445e+00,1.737751435996097160e-01,7.134898035470919053e-01,-2.086557687780687953e-01,-5.073180015733007586e-01,5.091605072907147145e-01,-3.935010953666923106e-02,9.741508460410081005e-02,9.380373029679222041e-01,6.019100897877533995e-01,-5.408902070986115751e-01,3.301942984715615648e-01,1.222590213829456873e+00,5.158464148035022401e-01,1.047977117076238085e-01,1.596863220661943972e+00,-9.181106738617921259e-01,1.123669314185415713e+00,1.652307226340285207e-01,6.560829291802405816e-01,1.151596907574192752e-02
1.007286182800050556e+00,7.420040997770386282e-01,1.292155181481957071e-01,-7.499277245467994568e-02,-2.513591389152289302e-01,4.907751864526241348e-01,-1.358299687189268856e-01,2.628814792428513236e-01,2.071152389715815723e+00,4.978903113621625520e-01,1.701509956667694723e-01,3.691139560499395733e-02,-5.679823096262213156e-01,-3.991187499352068235e-02,8.305134636002403647e-02,1.688149953454197494e+00,-5.786551822234983211e-01,2.343539112405887415e-02,2.368099193386907775e-01,4.828594481684828632e-01,-1.203178249389266652e+00,3.567367565227163584e-01,-3.381559482849392784e-01,2.044259946806165351e-01,1.113109106300830042e+00,-7.501417943910553277e-01,1.026196235298983683e-01,-6.642039703389341909e-01,-9.154629139652259440e-02,-2.236835248434629886e-01,6.459390873367807373e-01,2.683201209607539717e+00,-8.964866453723746575e-02,-4.629331230786404849e-01,-5.680263273884260666e-01,-6.578551343397349704e-01,1.430581970018570903e+00,1.140060802149297059e+00,9.168500705246251936e-01,1.532493233889717477e+00,1.210478102356823404e+00,4.395178151945096090e-01,3.276623375914813341e-01,3.699984145752399090e-01,5.848089781982865887e-01,7.019177139357652973e-01,3.064472971884080188e+00,6.954818566959641846e-02,3.507963151745308594e-01,9.392189869530321866e-01,4.266857564341803410e+00,1.349942774673509982e+00,8.744470369808530208e-01,-4.542363002155158647e-01,-6.463120780619402428e-01,1.306562891429782880e+00,1.588020623676056897e-01,-5.354278876223369510e-01,-3.079292871827009614e-01,1.295064741580799428e+00,1.169147076776769101e+00,-2.562213172710399167e-01,-6.385596486274979222e-01,6.626766607333447467e-01,5.705094258948654184e-01,-1.310079471517706651e-01,-1.143904308974482698e-01,1.577866695889799775e+00,-3.793321789195288618e-01,-7.565008105770063551e-01,3.078551946863079092e+00,-4.908802466992933100e-01,1.887797865923361296e-01,6.618994496354049240e-01,1.291604234602190537e-01,1.353279719347533883e+00,4.749466238963005460e-01,3.861762884209813951e-01,-5.545642420936180983e-01,-4.337631147375194951e-01,-2.436210801654015157e-04,1.728512978315399629e-01,-2.157627936822018588e-01,1.181629602932370071e+00,3.320259168552733842e-01,-6.964535306724188857e-01,-2.075538143911009881e-02,2.376057423414717817e+00,8.128832308943542140e-01,-6.979053165761399669e-01,2.320700283498704497e+00,-4.274757768113086054e-01,1.521957567575665582e+00,5.080143415955993280e-01,-1.210947387444353818e-01,-1.467587603868416579e-01
1.327100178242265782e+00,1.501697906077157363e+00,-1.428915855332758555e-01,1.032879015356080732e-02,-3.413329619350429778e-01,4.365119472404067613e-01,-6.318860459079442826e-01,7.458829245227780458e-01,2.711985092817315923e+00,3.990859735069526848e-01,1.750124809280356186e-01,2.734379255963662603e-01,-5.271681015729836606e-01,2.681939210833442222e-01,8.829854033927597712e-02,2.188205773827835099e+00,2.198104864291000604e-02,-1.978580166433236975e-01,1.803635764322480406e-01,4.303901425158211946e-01,-1.126093137669973432e+00,4.504414578799472713e-01,-4.417307200463103656e-01,1.654779244012676287e-01,9.187354182637711419e-01,-9.425373953769839996e-01,-1.388722263927254230e-01,-5.254187547835438288e-01,4.958208223762763378e-01,4.778621832909690781e-02,7.284912211055962761e-01,2.299990595262052739e+00,-3.453420217718555785e-02,-7.286356612583784198e-01,-7.057858145961717344e-01,-8.312498109127938184e-01,1.659105569691960991e+00,1.049506991613937457e+00,3.812620289953227992e-01,1.275200832264201445e+00,1.433008441294987279e+00,1.928054137691510572e-01,4.474511105611791439e-01,7.951499990333676937e-01,3.349526174464163009e-01,7.022080225716477164e-01,3.439312198344226079e+00,3.657893397518229839e-01,4.235378947226189905e-01,1.367613444949398849e+00,4.691274529422065243e+00,1.040373723957196184e+00,1.391174522209269071e+00,-4.934766866268002206e-01,-3.957213996522924715e-01,9.644402713568058783e-01,-8.830000358108713865e-02,-6.473909695106622175e-01,-6.852332839023271838e-01,9.567591906887285003e-01,1.127996605859885815e+00,7.847149220861870944e-02,-6.707896921529439282e-01,4.489302497567781436e-01,2.073489711569741489e-01,-5.262156827433651651e-01,8.298098781529450463e-02,1.302680184551945786e+00,-5.265319843220660490e-01,-1.074407630952254111e+00,3.688140515546177944e+00,-5.703150023429477411e-01,-1.580394640168982234e-01,7.941619424818879835e-01,2.691016704893716693e-01,1.458905375324044851e+00,8.448021237182044008e-01,5.463979227094268865e-01,-3.246375109554828775e-01,-3.884617248147937407e-01,3.424880101531896370e-01,3.050976515818611956e-01,-1.260017586718764071e-01,6.308735990043443653e-01,3.810292084620321429e-01,-4.060568603715604130e-01,-1.579568381031856705e-01,2.424082747970147889e+00,7.780678925675810209e-01,-1.036502080820237648e+00,2.651733103612825104e+00,-6.702576853017171432e-01,2.020473728489587284e+00,3.770264454433266410e-01,-2.237001257055653003e-01,-2.980578362847524643e-02
1.416278290479812796e+00,1.435127447146180568e+00,-6.555043335331237619e-01,4.636442766133945792e-01,-3.595380009650684383e-01,9.463543271660797007e-01,2.648476287852908340e-01,8.084123954302820936e-01,2.037387388375808683e+00,7.056640481885775862e-02,2.557741314506695174e-01,-3.551637431777179832e-02,-4.643826025827810788e-01,6.249123859492796695e-01,2.266322042591395469e-02,2.074928801538843182e+00,2.068281549176343437e-01,-1.191075159805614181e+00,3.396373158912973089e-01,2.471734013848638500e-01,-8.764809337969184933e-01,2.255474714612105691e-01,-7.059348600198415147e-01,3.161951506244168320e-01,8.204358500536991228e-01,-8.126029504633277556e-01,-4.830208217110180113e-01,-5.149159709860283707e-01,4.296791686068908156e-01,3.856477844347638850e-02,1.080288170581606533e+00,1.935246109494669131e+00,4.972220622877516205e-01,-4.344748491105993593e-01,-9.178030201033762214e-01,-1.103022673571253165e+00,1.901727157554967906e+00,6.118634152693975814e-01,2.244805680442814033e-01,2.748486831560920107e-01,1.634793523165593232e+00,1.675417963464009286e-01,5.705284068092729421e-02,1.192313944630736033e+00,2.170910897520142990e-01,8.850117373342394345e-01,2.843449711803092583e+00,8.120129225625726255e-01,8.726269669244608451e-01,6.528305498574055177e-01,5.642730280890503103e+00,1.468329759004922241e+00,1.582854635483980310e+00,-5.553456141819551606e-01,1.319994472005030506e-01,4.658995563876047186e-01,-8.560621816137553575e-01,-8.113144532286851174e-01,-7.633639254943346275e-01,7.116981295153061993e-01,7.607459198871646677e-01,-5.641777200014540528e-01,-8.858236013116330687e-01,-7.565674049361207354e-01,-2.959933044869806906e-01,-8.463907202087121995e-01,-1.022621172057600614e-01,1.101915108133925791e+00,-1.447215706058159634e+00,-3.671539400588440527e-01,3.863021200623936835e+00,-2.329669805616781941e-01,-4.703382320792482418e-01,1.302953364486239218e+00,6.458816009411703085e-01,1.386112061272091189e+00,4.265080036671878294e-01,-6.456097186412401712e-02,4.488167749795968220e-02,-1.074322991755735757e+00,6.713451266422767461e-01,1.794281334225422686e-02,-2.814942389725706984e-01,5.919415604938802478e-01,4.103923770037209984e-03,-3.649863327068343377e-01,-3.019399351661400943e-01,1.926207522391641946e+00,1.182866556512348399e+00,-1.703061911600713296e+00,2.265912177056015331e+00,-6.382717991610831199e-01,2.207892871819776559e+00,5.541355668693869196e-01,-1.031336410989087016e+00,-4.220057438588933341e-01
9.473142297142882473e-01,1.244223151260348770e+00,7.964326390705663006e-02,-5.108175731529742691e-01,2.004248971075391073e-02,2.540096177824871515e-02,-2.663567241046118084e-01,8.078799620165336148e-02,1.160237845831788128e+00,3.404811777290424613e-01,5.192409109720077520e-01,2.485826084624145060e-01,-4.269033437075903659e-01,2.047024820519976473e-01,-1.889011268328320003e-01,1.872079058488615999e+00,-1.483400030415853166e-01,7.536539509261652725e-02,7.294463396654654597e-02,2.135433212300710260e-01,-8.332759815066985709e-01,2.471319753675864650e-01,-4.833237729196460108e-01,2.432144777216578291e-01,1.345449222032728542e+00,-3.915307039799615918e-01,2.763273538846577893e-01,-5.578934886438606799e-01,-1.290259177831127868e-01,-5.575685204547204954e-01,3.212911751990600306e-01,2.267122174655415545e+00,-3.239749853828490789e-01,-3.849565986730712486e-01,-6.210224658997066660e-01,-7.136947359082528308e-01,1.283168370445451512e+00,1.195533686380424232e+00,1.345771158667665723e+00,1.333780304362779390e+00,6.956637841092029317e-01,1.843338601232864249e-01,1.714975376755733527e-01,2.436281019485763699e-01,3.780452382567752734e-01,8.035649366582876540e-01,2.903565021944320534e+00,-1.309201466727578644e-01,1.350570139817980353e-02,1.501027739405589312e+00,3.740157033870052938e+00,1.058742275010675193e+00,4.935931022068993923e-01,-4.978449023996203704e-01,-5.593135252961091153e-01,1.406991231734461945e+00,4.350221118144287358e-01,-6.592209554766526036e-02,-6.775205965596255986e-01,9.676751217072920852e-01,9.501662133123505161e-01,6.866519961613704037e-02,-1.877505798349453914e-01,1.039685393136572822e+00,7.355131984855751703e-01,-1.271060096289134966e-01,-4.181777697379305270e-01,7.416455345873969041e-01,5.640788446271493423e-02,-1.537115977796619237e-01,2.657378324038038642e+00,-6.003407558789769505e-01,9.334206478261082573e-02,5.592073408218937169e-01,-2.520749006881862764e-01,1.417387192150111552e+00,2.516819383112042785e-01,8.713775958760467955e-01,-6.093840823329396139e-01,-2.167052909010712125e-01,3.614788881405673893e-01,1.840045763917584898e-01,1.019855359119536953e-02,1.151562999018465705e+00,7.794101072136064845e-01,-7.458809446506773355e-01,2.975336445975225175e-01,1.573222332573902982e+00,4.789710026955904532e-01,6.561797187519996521e-02,1.895217263854567014e+00,-7.120932297845570247e-01,1.058581643072072476e+00,1.760340329572604445e-01,7.332837548593171828e-01,2.401568817508498155e-02
1.275726516336004535e+00,1.831667627172362867e+00,-2.074499438849027322e-01,-1.371255749464914686e-01,-6.575338070893795017e-02,2.939195676213794961e-01,-1.751203002080396476e-01,4.904129014917072427e-01,1.770851175933069177e+00,1.381623993924507854e-02,4.119541650098029750e-02,1.481535593769964798e-01,-4.763589666051233351e-01,5.133565888672760869e-01,2.457785219463881621e-03,1.819774473086643862e+00,9.601497904796491012e-02,-5.459049833999538581e-01,1.193856868594654064e-01,2.174422761777184410e-01,-8.820255234417703205e-01,5.236360374858811673e-02,-7.207819976836608022e-01,2.644289175707347228e-01,1.080033305062885418e+00,-3.175283829207499742e-01,-1.368952199608322873e-01,-4.958931468268203968e-01,6.063604192393512449e-02,-2.874868226158047158e-01,6.586677724652572063e-01,1.984673411663797182e+00,2.242337432519020402e-02,-4.677951913777979587e-01,-8.709330028636768084e-01,-8.487475482163451268e-01,1.751701931239608934e+00,8.087735629735606224e-01,5.483824939651806840e-01,4.660158846947971556e-01,1.096730153870680624e+00,1.795419034087479826e-01,1.197834544517745875e-01,7.916372277770393762e-01,4.146722125760932687e-01,9.428814398489939741e-01,2.967506616942444442e+00,4.903190949368576024e-01,4.099283199833930191e-01,1.298133352854081934e+00,4.544181591893221572e+00,1.122491678984717245e+00,1.012715586594954420e+00,-4.156836813026176247e-01,4.600123610484752046e-02,7.182695790354083343e-01,-5.307939230334756120e-01,-4.489174526193223658e-01,-8.615561667532904977e-01,3.177551011262356173e-01,6.570844396504217366e-01,5.229361108578989281e-02,-3.440168802755756428e-01,6.130570021345149723e-02,3.692789444145225808e-01,-3.158166735611421805e-01,-1.503299556356966216e-01,8.152073046686428848e-01,-6.772505411548658261e-01,-2.435956315709895126e-01,3.146981852089524523e+00,-5.806306945436275901e-01,-4.067851144954696685e-01,8.087259531180156502e-01,2.274311370016227629e-01,1.309477132169487801e+00,4.346236657445904927e-01,2.234195749515083818e-01,-3.816372971835018113e-01,-5.458771649524214453e-01,6.033683527685170800e-01,-9.542962323617332210e-02,-1.248002657129727300e-01,8.301739918303027155e-01,3.013407561505671017e-01,-4.112588710925106916e-01,9.705057418136783798e-02,1.462465243774480506e+00,8.284255755851948066e-01,-8.124573475809779843e-01,1.954895136460435445e+00,-9.792610419056002602e-01,1.846809730624598078e+00,3.502336812914054742e-01,-4.736629780472507156e-01,-8.577742176858371703e-02
8.860358624795042770e-01,6.475247588819813549e-01,-4.623212995880829346e-01,-2.397571016091289420e-01,-1.944212159952631302e-01,5.072859020194454560e-01,3.050661609949695263e-01,1.561918626128070420e-01,4.958872552658869504e-01,4.891625972820735635e-01,1.351081393890554594e+00,1.924894057645148426e-01,-2.713580724255512111e-01,3.097827089009683732e-01,-5.337657619135333098e-01,2.361744836419842564e+00,1.654794298373231665e-01,-4.555947235706276355e-01,1.984096374653797623e-01,1.855558439442214769e-02,-4.839438485250857624e-01,5.981391422497799315e-01,-4.251217409034742101e-01,3.052105171578324283e-01,1.381793540332642678e+00,-8.074557453682243979e-01,1.224610814431603967e-01,-5.601034111954900085e-01,5.535803492499802303e-02,-6.302667716086747252e-01,4.694016952741597581e-01,2.101669272610362516e+00,-3.097756855218813943e-02,-1.284663367608916418e-01,-5.946442052049084603e-01,-1.003429471990723520e+00,1.201401481708966434e+00,1.112521321237672112e+00,1.798093989028423989e+00,1.400362535228599103e+00,8.385142883195544350e-01,2.104491910440331459e-02,-1.090662272839703142e-02,3.572621495371027800e-01,-7.492593699439020760e-02,7.022143524115946889e-01,2.508418526600829424e+00,-1.510017747698537416e-01,2.033487181744479400e-01,9.411102767169603478e-01,4.486939602948578631e+00,1.476007800236119660e+00,7.288548634654624658e-01,-7.412956739743823409e-01,-7.120062615608602208e-01,1.563043966273656382e+00,7.614773525755373917e-01,-2.562369442851480938e-02,-7.543405527845469249e-01,1.863412387430114281e+00,9.381104248072325014e-01,-5.927789588488431294e-01,-4.896234701636617004e-01,6.720019528883079962e-01,2.134661464060454428e-01,-6.763261494131338480e-01,-7.584061464387659157e-01,4.749131304469978998e-01,-2.546949815705823461e-01,2.336057364624683497e-01,2.999685866140594293e+00,-1.336434498040590946e-01,2.236814292228168632e-01,9.170420510690237004e-01,-1.801906042150240861e-01,1.487471220906484870e+00,-1.521515775847166463e-01,1.157528857274729095e+00,-3.147185627807814745e-01,-6.258359134435803606e-01,6.746802951778159141e-01,5.495210901256262215e-01,-3.674563670969177576e-02,1.084435274335700194e+00,1.016819024453378795e+00,-1.022089234801293323e+00,6.883511346606538406e-02,1.603535440800264222e+00,5.933645362046524596e-01,-2.583875195367146271e-01,1.970228177019492488e+00,-2.103482740282452412e-01,7.381415521347345354e-01,1.296174557284686668e-01,1.163240715123519120e+00,-3.543742802165639749e-01
1.265113587641900406e+00,1.139568771453720597e+00,-5.423837574142208462e-01,3.294988319384521969e-01,-3.630897737594335761e-01,9.808177280550121058e-01,5.223050476413579890e-01,6.086111432853794634e-01,1.833192452124591254e+00,7.752495341158102682e-02,1.486021311672777734e-01,-1.291439447146728869e-01,-4.873574389528830819e-01,4.234589252019273498e-01,-3.229293943442623771e-02,1.774479724196392549e+00,-7.595882013696014790e-02,-1.066730403098513413e+00,2.862685400497628208e-01,2.322877492754067130e-01,-8.815891872176635502e-01,2.500812688470002154e-01,-6.686848080422834739e-01,2.845102084654935748e-01,1.007986701099274907e+00,-5.878857214549716437e-01,-4.157017824961949382e-01,-5.903099987917220792e-01,-1.064713192316988355e-01,-2.527040479613191781e-01,1.004697247785566905e+00,2.159064796972685052e+00,4.283982212489286234e-01,-2.131714584188256767e-01,-8.899435619384205021e-01,-9.555681773330368944e-01,1.948178596356286096e+00,5.556225228309907838e-01,5.706768375814061933e-01,3.278942136890989900e-01,1.512589174164916672e+00,3.319506229539177511e-01,1.771269082554780688e-02,9.543911947825902686e-01,3.636049983716942435e-01,8.806709204573948124e-01,2.653433552675539708e+00,7.469149059501105636e-01,8.348894023765078831e-01,3.127949777985912228e-01,5.447747330802078736e+00,1.787928782338259914e+00,1.365196765803217360e+00,-4.619551562219961216e-01,7.807215482293888842e-02,6.339859819832607268e-01,-7.662736979159453510e-01,-7.859367535714101294e-01,-6.922766271985953956e-01,1.013155895194604916e+00,5.293761247487761556e-01,-6.575562024938832462e-01,-7.657034896703470706e-01,-7.054878302151651459e-01,3.245189455215147234e-02,-4.998225497492367886e-01,-1.835253948120008083e-01,1.200625411274684584e+00,-1.299520540958809756e+00,-1.848895716801959299e-01,3.470113643100849465e+00,-1.659727798630630247e-01,-3.578455961148884201e-01,1.031791808183649017e+00,6.329176269036329572e-01,1.123860452860703019e+00,1.548324673759167713e-01,-2.094523820478622067e-01,-2.767222486090951117e-01,-1.055074986112357838e+00,6.431025156793814812e-01,-2.786496569173710358e-02,-4.064812383293396891e-01,9.608740530543526948e-01,3.869130361759320902e-02,-6.022458620495354520e-01,-2.365328096096548927e-01,1.742398708160289633e+00,1.264739506181120854e+00,-1.716314624774356590e+00,2.096488103961138272e+00,-5.082595479914224779e-01,2.002521168290371634e+00,6.181515052089756601e-01,-1.190019828077770292e+00,-5.497036674031616776e-01
1.309686585485471344e+00,1.574365553510728821e+00,-3.934533957324128917e-01,7.073301351248817426e-02,-2.908950347569402295e-01,7.031990334710771506e-01,1.985270391402640944e-01,6.338736435454120910e-01,2.080174910732673688e+00,-1.412363961674778512e-02,-1.230734578005071023e-01,-1.049528971121441168e-03,-5.104851723491978799e-01,4.104974104133711776e-01,-1.040723007595023564e-02,1.690566111890656531e+00,-2.175025102238520303e-02,-8.304625404085154150e-01,1.375843373659774160e-01,2.195865923963749855e-01,-9.052533333500093482e-01,2.033439599203160641e-01,-7.155874037700202805e-01,2.186002995998459209e-01,1.091821327012558074e+00,-3.317946827467438964e-01,-3.758201527516480400e-01,-5.583623868977845017e-01,-2.728263153863296209e-01,-3.745416303581181605e-01,8.543361057146910964e-01,2.138772084747846414e+00,2.278629138434387635e-01,-2.673793844337984393e-01,-9.373499255671091657e-01,-8.314708234272518705e-01,2.070724795913954974e+00,5.416336019461327478e-01,5.196738047106381764e-01,2.646026146258508849e-01,1.373723769245549065e+00,3.366978981945686900e-01,1.047985531652561031e-01,8.955389646286830985e-01,4.590762511406613622e-01,9.131658781385610935e-01,2.834602402162007539e+00,7.752434460074115741e-01,6.845057296091107135e-01,6.065055805014034629e-01,5.105794519371820606e+00,1.654748304212273258e+00,1.296820167149567826e+00,-3.411955886530808613e-01,1.808028033019193348e-01,6.025404425691496257e-01,-8.063828718545412721e-01,-7.321405726594826247e-01,-8.630828976565096955e-01,7.534630813430780449e-01,3.317758869401623567e-01,-2.479480922309844626e-01,-4.983795428185928689e-01,-4.908239919661171458e-01,3.286912669413990518e-01,-2.426732319094004886e-01,-8.556416414516032631e-02,1.079542665557757797e+00,-1.010958726074405511e+00,-2.672715810922254853e-01,3.279273065588286240e+00,-3.462229227835755263e-01,-4.763995358717849071e-01,7.272179050459708360e-01,5.669424453053957258e-01,9.793769835530505841e-01,2.503394676940143282e-01,-1.848499634356113308e-01,-5.313009802242569801e-01,-7.974502713132518572e-01,7.344428798647955059e-01,-8.409820624598213223e-02,-3.849898070367892555e-01,9.822115231599558571e-01,1.298532354359175356e-01,-5.633059265058788512e-01,-1.133652139837657558e-01,1.510190427389115131e+00,1.177179895226389661e+00,-1.593120104139973403e+00,2.060577665954223203e+00,-7.407657475130628999e-01,2.089365218881719333e+00,5.388404138302781421e-01,-1.261502174374848906e+00,-4.068162893883238707e-01
7.505209592058816881e-01,1.177933023625454823e-03,-4.275006191359944085e-01,-1.203562877260616615e-01,-3.549294891869580471e-01,8.184558338000460509e-01,6.684141117120536713e-01,5.690494677878063512e-02,5.634791032494081975e-01,6.332710474407300394e-01,1.323429393216658090e+00,1.896719353355320881e-02,-3.192308746310843492e-01,3.065918655154999117e-02,-5.342070319519933719e-01,2.147341013731597137e+00,-2.191228563589694978e-01,-4.248461862465486849e-01,2.578122714808461224e-01,9.620241089848813321e-02,-5.886706959946760298e-01,7.538979648064283445e-01,-2.917168695253947730e-01,2.752120687016473832e-01,1.448397456249602255e+00,-8.971136446618293014e-01,1.084683793329661583e-01,-6.747530751055945686e-01,-3.133832128521421012e-01,-7.340770360875510381e-01,5.587711469993867919e-01,2.464468784258622147e+00,4.940955089198023620e-02,6.114160238336457942e-02,-5.152108311628078585e-01,-9.093624910079386447e-01,1.233597322093854309e+00,1.071733288230668268e+00,2.033189678728300365e+00,1.640763669781318379e+00,9.718137966148496787e-01,2.339621698263855409e-01,-1.112303558892385746e-04,1.991517559005368532e-01,4.114697157105323688e-02,6.172420137192553558e-01,2.351979995588683536e+00,-1.800166579926253119e-01,3.284058816416873250e-01,3.319847137161706652e-01,4.645432576029397964e+00,1.926992856118492359e+00,7.289034521347569351e-01,-7.087820323904605591e-01,-8.906064008560123924e-01,1.748242277304848713e+00,8.675184310544264976e-01,-1.764231729852758224e-01,-5.165528766371959568e-01,2.486707235239972835e+00,9.019871303299611398e-01,-9.495434897991200662e-01,-6.560109541458665205e-01,5.665689494046995955e-01,3.181766416899272087e-01,-5.060084009547560768e-01,-7.749577173883939185e-01,8.841715061435615475e-01,-3.334765832067152491e-01,1.775534987899215766e-01,2.913544861757587867e+00,5.798304653531072272e-02,4.358545178492096439e-01,8.103045430907558355e-01,-5.022574871620256315e-02,1.290002442578622066e+00,-3.523404419011070265e-01,9.448878802264595311e-01,-4.930639469191180346e-01,-7.612825145694458451e-01,5.130862288283412065e-01,6.085361739747050525e-01,-2.304453730534907763e-01,1.399520549012027937e+00,9.274628258768742306e-01,-1.267032018343100308e+00,-5.348056850471960555e-02,1.861955143883096797e+00,7.961192897292328485e-01,-5.894711104773961985e-01,2.046576441057342155e+00,1.494176132247490019e-01,6.489016343058037206e-01,3.074095467847729468e-01,8.608074290947889118e-01,-5.928624601712970676e-01
9.646481199143301932e-01,1.287225616168902187e+00,-2.349698459737777356e-01,-6.369619138937080427e-01,-1.024986964859273125e-01,1.602513026237939453e-02,-4.241350330659427459e-01,2.462705209991609134e-01,9.445982711418496880e-01,4.859251597581299986e-01,1.170176328256711473e+00,4.940458896505997011e-01,-2.803168550851372065e-01,3.003735590506174669e-01,-5.221658168991807347e-01,2.497908950383845195e+00,3.628861920625998105e-01,3.226835572070665958e-02,-3.966608960593240307e-03,2.558773176557028323e-02,-5.214233735815965165e-01,6.323354846040566413e-01,-4.181340593494256574e-01,2.033752871574412702e-01,1.452652062678509770e+00,-6.607581775335137353e-01,2.476714318827714090e-01,-4.843554755039922721e-01,1.320833490420898482e-01,-6.783641998943166218e-01,2.024706316933045924e-01,2.044179344284171584e+00,-3.943530413556435299e-01,-3.491385080900880067e-01,-5.965163236622095244e-01,-8.708527747977548028e-01,1.226791376376887177e+00,1.256044256409689197e+00,1.720157415452806093e+00,1.612368092096599037e+00,6.370062565879878180e-01,-7.571970673895822568e-02,2.008231999067746631e-01,2.671753579139505286e-01,-5.445065533112247724e-02,6.816761637499777482e-01,2.939179782381369233e+00,-2.502580660455988593e-01,-1.078202375226342408e-01,1.650060623950921901e+00,3.902692818989900836e+00,1.063341199318269314e+00,6.760411395574941196e-01,-6.499926872553021262e-01,-7.449734184901208867e-01,1.636377313901873354e+00,9.773691293986527251e-01,1.219083554205535880e-01,-9.999547511548065870e-01,1.572385402043377844e+00,9.049094969113971043e-01,9.099204397416249535e-02,-1.542315526564543571e-01,1.278476256779941034e+00,5.365756138927308960e-01,-4.817018051924704114e-01,-6.099317959586325610e-01,2.559353983759486972e-01,3.163585762413071989e-01,-7.745131788348108559e-02,2.893060442726159032e+00,-4.418756455977727038e-01,1.406727546409307084e-01,5.450923125602971098e-01,-3.961295294069451800e-01,1.468452748991316170e+00,1.510053450398187169e-01,1.515180526784299264e+00,-5.641835486603314909e-01,-1.383025937858273768e-01,7.526501932338538481e-01,6.347395060012632761e-01,1.065221431548477593e-01,9.508627937538102204e-01,1.291196263414892798e+00,-9.189886845064072496e-01,2.329433041885460298e-01,1.506635258740773420e+00,3.100610356839123005e-01,1.335905272375698671e-01,2.097906580545055633e+00,-5.209731886778931065e-01,7.979131182059069349e-01,-8.046597420679052481e-02,1.522595983331318070e+00,-3.153890229146871782e-02
1.204043068970654717e+00,1.928555357617746324e+00,-9.079041371711026320e-01,-4.839164627359421877e-01,-2.159989175042194010e-01,4.633293805658554865e-01,4.056699664095982927e-01,5.583480928710403690e-01,6.865984062815753131e-01,-1.449154415995554668e-01,8.020036591737094156e-01,3.144127584875847092e-01,-2.107029881059622745e-01,6.961016979502331337e-01,-7.379941171015029777e-01,2.268316794194843666e+00,8.308544181480921331e-01,-1.082475322974244758e+00,-1.453066559805533953e-01,-3.493776745996352018e-01,-1.003887662069682385e-01,5.184294037574076475e-01,-8.586224824232338015e-01,2.034117306652359625e-01,1.595536672162021885e+00,9.666559214884747064e-03,-3.582039638719868302e-01,-4.303273971587223690e-01,-6.026615666768724289e-01,-1.149449929207825960e+00,4.613088488687541733e-01,1.551606716713447742e+00,3.694986560687435473e-02,1.724863087947510476e-01,-1.046593933650678654e+00,-1.004801139920426412e+00,2.108928844411908532e+00,3.900820709950730825e-01,1.587042834490088872e+00,1.221562621092942003e-02,7.996136446838857381e-01,-5.474506364879433429e-02,-1.603452776204160601e-01,7.561562988180318134e-01,-1.377810512457158243e-01,9.324824154869126858e-01,2.375812992187132267e+00,6.283557106294056505e-01,3.626865987789707479e-01,7.152383986979398145e-01,5.000702312085176793e+00,1.885519190388631472e+00,1.084728239757661417e+00,-4.514176255174057739e-01,2.597657587392825373e-01,8.913597260703912672e-01,-1.782350968541812630e-01,-1.437953241454135167e-01,-1.635917060722957839e+00,1.339864325772569531e+00,-4.081890066902169600e-01,-1.533651225426483633e-01,5.160318575208423103e-02,-3.025333966565587618e-01,4.281650936779748395e-01,-3.887623712461917291e-01,-6.944672686002945072e-01,-2.793938117072520821e-01,-4.769344476522260345e-01,7.824013562867635496e-01,2.861518611478463647e+00,-8.697656855866819914e-02,-5.913772616231416368e-01,4.487508894490764844e-01,2.144109626874876606e-01,7.280065959689704380e-01,-4.766514977183649027e-01,6.199904222233417750e-01,-7.847613465059549709e-01,-7.028326366348773835e-01,1.714117282282435317e+00,3.075656115302066174e-01,-2.682770117914470287e-01,1.047881636090992163e+00,1.055284968235848053e+00,-1.023799539100926692e+00,1.083513763304376765e-01,2.521033074936145368e-01,9.240574443219489176e-01,-1.179628545154636665e+00,1.624828464692172902e+00,-6.884669270800938268e-01,1.317800752731723923e+00,4.758224362265345286e-02,-1.357107588227234318e-01,-5.879030425891275113e-01
1.209503898942803968e+00,1.564565092925132461e+00,-2.903860534890971845e-01,-4.387174343637856300e-02,4.394852728824315269e-02,1.376828257037995273e-01,-4.428575718550539775e-01,4.067512986370538930e-01,1.126163486786512236e+00,3.257173699929444277e-01,9.753989855437441570e-01,3.129317963552015192e-01,-3.436044965556426245e-01,7.034286548428153596e-01,-1.101959260975017840e-01,2.507207856272409607e+00,4.215005737078607040e-01,-4.533150350976981602e-01,3.059794182848134536e-01,2.094331782403691389e-01,-7.455253140340083462e-01,1.343479930719180815e-01,-5.816517075124572056e-01,3.964072174498820544e-01,9.093434630515215833e-01,-9.559689333694894042e-01,1.207831941878226983e-01,-4.167111612703126022e-01,1.081663432900888289e+00,9.925944820185894635e-02,5.845484898710209265e-01,1.731965317228420620e+00,-1.870117414812133561e-03,-7.605210900907359850e-01,-6.670840919059138896e-01,-1.141765629120381043e+00,1.065366810222128979e+00,1.296897896973647768e+00,7.036455412421647182e-01,1.117062683372262333e+00,9.792752277309355602e-01,-1.816887334010262589e-01,1.027241098253767887e-01,7.868739169040450676e-01,-1.656233798900619281e-03,8.398165622921278661e-01,3.043897709625069670e+00,-1.781658577378616992e-02,2.026207296232415689e-01,1.993860884423613644e+00,4.377704810799890822e+00,4.788882338530153771e-01,9.023443246806353013e-01,-7.932764562471930070e-01,-4.530135711134689602e-01,1.037437423489854460e+00,2.074904014159910659e-01,-9.902381562258023850e-02,-7.087215708865075570e-01,3.873164815923524351e-01,1.541598145789286667e+00,-8.811783263000838584e-02,-5.975977606206905879e-01,6.991705976157446267e-01,-1.846522877169995969e-01,-1.048592153446173070e+00,-3.942308080380010349e-01,5.139556374382595605e-01,-5.217578521585132245e-01,-2.741329958546557810e-01,3.523556009051119098e+00,-6.005754885569893897e-01,-8.391298611885276981e-02,1.417934981103895931e+00,-2.042417306924300680e-01,2.096917264541882986e+00,6.607797966714865634e-01,1.116051716432422403e+00,2.996421696703670534e-01,-5.050765866984396890e-01,3.821055236713897241e-01,2.396016213409463691e-01,2.767343596477300771e-01,3.883931654206247419e-01,6.193915128955503890e-01,-2.697315201230999770e-01,1.238464584938231972e-01,1.953024691753226572e+00,3.670854548813264895e-01,1.017178917494479529e-01,2.118154732112778493e+00,-8.640502904853840649e-01,1.350753665997310282e+00,9.183545116660696284e-02,1.145088504577824962e+00,1.786487060332236920e-01
9.634352555624776659e-01,9.321215968795556472e-01,-8.843207772994063354e-03,-4.683401271908959607e-01,-2.554498231084909587e-01,1.601146536235477091e-01,-6.058711124009312776e-01,3.142301538771172797e-01,1.726428664581397765e+00,7.014303392491731959e-01,9.072263662341948365e-01,4.284284247449889893e-01,-4.014040263520038954e-01,2.235465850658256703e-02,-2.924203916757353583e-01,2.379959195809893124e+00,-2.741266240433631873e-02,3.217710460336756229e-01,7.858197494382554438e-02,2.831032291068893980e-01,-8.715985394720366930e-01,7.377989997114966503e-01,-2.341129399202878103e-01,1.450088666464325327e-01,1.308904371118836840e+00,-9.520843251354611514e-01,2.647979726991026572e-01,-5.640993986722540043e-01,2.077181456033776463e-01,-4.186238090295063552e-01,3.159288605070696976e-01,2.450182029111078297e+00,-3.981846540233303644e-01,-5.107974617323114419e-01,-4.806579946305904461e-01,-7.489399572589421350e-01,1.203126114439784455e+00,1.384330769070503342e+00,1.464969628826289672e+00,2.076875321080146275e+00,9.115049082033495065e-01,1.107884113126486603e-01,4.193145409909896371e-01,2.160214200071573498e-01,1.431025947288309674e-01,5.628754454192703705e-01,3.224731881713695181e+00,-2.840245935828210611e-01,-2.489289865760184461e-02,1.519408203415498537e+00,3.920936424983152868e+00,1.086729782148531331e+00,8.323084158219029582e-01,-6.108112117292455734e-01,-9.873688159978306622e-01,1.729326852323459951e+00,1.030007317200449357e+00,-1.341553504780812200e-01,-6.752072648976326086e-01,1.814958313698809000e+00,1.232548812597556998e+00,5.367474576260594654e-02,-4.092573057875873443e-01,1.424307963067466432e+00,5.733158030487990331e-01,-3.892517734144569364e-01,-3.503606088033730526e-01,9.140846032981968516e-01,2.972240135428089181e-01,-7.028704858384564602e-01,3.107628171626953151e+00,-4.899673175651153567e-01,3.265307660281187574e-01,4.968091515360050225e-01,-2.760984187703998671e-01,1.495224024512307182e+00,4.482333867968770202e-01,1.370320471525920958e+00,-6.047421719197410006e-01,-7.706534559393629635e-02,3.440186936438586196e-01,6.885891317495229647e-01,1.944664759235470441e-02,9.860316186132013216e-01,1.075565995679802933e+00,-8.768370061667860593e-01,7.677921657794123389e-02,2.237788948023318625e+00,3.942736530420884455e-01,-1.057885924606963290e-01,2.484240130988147222e+00,-3.476965583282195515e-01,1.031556121586105323e+00,9.875475889391105433e-02,1.232972503177633739e+00,-2.208878900779642773e-03
1.170559225473476905e+00,1.903621160401143264e+00,-1.831702225828071851e-02,-6.958993615726432047e-01,-2.363974904773838981e-01,1.293009692841701475e-01,-4.064573685413054860e-01,4.932205295765056396e-01,2.301525153076548591e+00,7.212386590016614529e-02,-2.888022387323577189e-01,3.287644550385739883e-01,-5.111078383792202473e-01,8.597203601350818236e-02,-1.963125467875490304e-01,1.619208935812795458e+00,-5.763898804546241372e-02,1.352317098973299103e-02,-2.317327192376742728e-01,1.532796276552707837e-01,-8.689884061100568990e-01,4.469514980217907940e-01,-6.029350156336963362e-01,1.654933753645612682e-02,1.516458251265349055e+00,8.665119432923726328e-02,-1.096887027263418746e-01,-5.603434009590260167e-01,-9.257179456105262272e-01,-9.312070754667894912e-01,3.477238375566176209e-01,2.373741363102538138e+00,-3.830774534306762846e-01,-1.962744595919987400e-01,-8.720693712373708273e-01,-4.739931267915377666e-01,2.145561898774193121e+00,6.771991192900513878e-01,1.109166879309884779e+00,7.824243055367325894e-01,9.121000503518151836e-01,3.893583640038686955e-01,3.444816224959851292e-01,3.954158261779068262e-01,5.677709357979230376e-01,8.207301722181260528e-01,3.121680966229533727e+00,4.839888918988337618e-01,1.768476996353579023e-01,1.026977723858081948e+00,4.092906502764821930e+00,1.635938171962373566e+00,9.555749381965530365e-01,-1.316718342818219423e-01,-4.954398883140742615e-02,1.073095380774742758e+00,-1.549920558295864170e-01,-4.434329154178607846e-01,-1.160470533911564184e+00,1.123954424262024077e+00,-6.562600794949943750e-02,4.889401512567912444e-01,1.197862304654047638e-01,4.922525650174751632e-01,1.201076745501871379e+00,4.346580036563160720e-01,-8.166486303062947538e-02,8.200655293576035731e-01,7.106892323899399733e-02,-3.966689259118694189e-01,2.615056788082140926e+00,-5.792131298327882760e-01,-3.616642919427598968e-01,-1.976612476860400147e-01,2.141298143389477882e-01,5.604170976613611632e-01,1.892858918129993184e-01,2.921668342548359720e-01,-1.355126985764699032e+00,-9.834788897520774231e-02,9.030848585593588274e-01,1.355513554395502140e-01,-3.675076949653851566e-01,1.329865201200860492e+00,7.263138635022640122e-01,-8.782214299771404775e-01,1.681055498746303889e-01,1.127975231110860399e+00,8.787314636697902692e-01,-1.087552751994103062e+00,2.063113491494938501e+00,-8.407171849575607592e-01,1.743331701881867035e+00,2.831817642062756102e-01,-7.500870959208192357e-01,-2.121111630350110966e-01
1.225200682454721468e+00,1.987697769643113954e+00,2.439151471006701932e-01,-4.458611967493135708e-01,3.382775945091438807e-02,-1.348746938193547962e-01,-8.122038753242515341e-01,3.935674504243779070e-01,2.229819368838594329e+00,1.666055200605736086e-01,-1.889244283449127981e-01,3.204077956797170557e-01,-5.509943520747663248e-01,2.993342871765782287e-01,1.453325356641500532e-01,1.746012478300367876e+00,-1.127147428684923125e-01,1.533806619524955561e-01,2.345266889527024973e-02,3.812474713128400916e-01,-1.120806457428442426e+00,4.419284479668283971e-02,-5.871538945159934242e-01,1.855583757139862011e-01,1.107069753703603165e+00,-2.983388914595825891e-01,1.295525270136866636e-01,-5.017293200120116481e-01,1.044988382261702320e-01,-2.287206700083119770e-01,4.232036434412190795e-01,2.223518271205101815e+00,-3.458466652238700312e-01,-7.183454888437907915e-01,-7.432474478857336031e-01,-6.343162293801016816e-01,1.570217614586749022e+00,1.113447661929256816e+00,5.157913231253055120e-01,1.027194579917574124e+00,9.246989842320156860e-01,2.276575206335695600e-01,3.674894201738629351e-01,5.288680434621864102e-01,6.033330301641676163e-01,8.757899515783773570e-01,3.384385798931683897e+00,2.030807932904997726e-01,9.780671223843190321e-02,1.889763827144602448e+00,3.772924847937085602e+00,7.171256715732317044e-01,7.931309166120055210e-01,-3.392996278511898889e-01,-2.337882187983097437e-01,9.665047383475205978e-01,-1.708451963385460015e-01,-3.404642470354044548e-01,-7.501430923613809920e-01,1.583314923934955321e-01,9.462899398254105421e-01,5.588067943936965154e-01,-1.634275645182489411e-01,8.652295990598406483e-01,7.600993861465684676e-01,-2.189938579218253523e-02,2.258659367220616776e-02,1.000506469864485215e+00,-9.246812998381839788e-02,-7.157276969870940420e-01,2.947062479347079211e+00,-9.059066896321870122e-01,-2.384516549331117119e-01,4.936665284482850691e-01,-3.700120726589724296e-02,1.401445972139928386e+00,7.849480954210541483e-01,5.083895454346797349e-01,-6.049430562574891201e-01,-6.575617516499787651e-02,2.804936349488014180e-01,-5.344787273192463939e-02,4.928721637913469067e-03,8.602224010892283168e-01,4.315171147486394077e-01,-3.376724542109088567e-01,2.568670306079449683e-01,1.756954460150670361e+00,5.431339864513722304e-01,-2.536800247311930545e-01,2.119142381905099626e+00,-1.138706434651247656e+00,1.782708130571204475e+00,2.624622206552398307e-01,-4.707306528716256877e-02,2.598772591256220954e-01
1.187498347978034108e+00,1.166823091406873569e+00,-6.451793480468525077e-01,7.079151608748945890e-03,-4.242796688372283964e-01,8.696253391789485754e-01,4.528348074845911508e-01,5.997099347241379164e-01,1.601524940855479695e+00,1.438087184796031093e-01,4.564542067538728265e-01,5.230859596118159205e-02,-3.968553637525157884e-01,3.518136377527159575e-01,-3.315193666202095324e-01,2.001271856607095501e+00,1.505897562542213297e-01,-9.133949734731097170e-01,1.143362256115217634e-01,5.874686251716685487e-02,-6.401116339369616881e-01,5.437749556853931354e-01,-6.196195490861882149e-01,2.009583401848570872e-01,1.275918059358453149e+00,-4.988878452929921825e-01,-3.734176805756130868e-01,-5.719618907004152542e-01,-3.876996563699734999e-01,-6.318618508320645866e-01,7.841601952079586546e-01,2.128427368748328607e+00,2.320559664170704361e-01,-3.659515787484030058e-02,-8.779634625276563353e-01,-9.148863145375635275e-01,2.001597097419522964e+00,5.452587936526103185e-01,1.105308671473019144e+00,5.325398902303964954e-01,1.304111633932332204e+00,2.489562488773962301e-01,4.276019413085098420e-02,7.718711473576610471e-01,1.735381166663980124e-01,8.022820530542881245e-01,2.610790040562296355e+00,6.244133734474804909e-01,6.429162911493846444e-01,3.082141916436232920e-01,5.276829475770258959e+00,1.973700776901255782e+00,1.310930444114552174e+00,-4.549537743618663477e-01,-4.660525803720155791e-02,9.171615908177518373e-01,-3.027667386112374848e-01,-5.895947994564830763e-01,-9.829525014280732220e-01,1.582532136215006879e+00,2.119594026772275153e-01,-5.213285312676760874e-01,-5.174279798925643936e-01,-3.955941423646224253e-01,2.582076971738843651e-01,-4.004520280930323750e-01,-3.569450238381615681e-01,8.170010657501034501e-01,-8.570146336430226608e-01,-3.363597762575387673e-03,3.265219647071938347e+00,-7.176754972637064411e-02,-3.012754821110547598e-01,6.778825976524076591e-01,4.804961120585669043e-01,8.953115327794904932e-01,-9.564020823189339771e-02,1.947247563148873373e-01,-6.000072357175559867e-01,-8.657288000698171171e-01,9.872620831128663399e-01,2.601284040942382636e-01,-4.147086495656563954e-01,1.089940531168267057e+00,5.110510154271221683e-01,-8.989563874465694715e-01,-1.772784046177922623e-01,1.416518307504614604e+00,1.155048747112253249e+00,-1.617270619023748246e+00,2.097046754956196413e+00,-3.751481211113785186e-01,1.681654402871060938e+00,4.247923314138824513e-01,-7.273556918041343966e-01,-6.269707941049578181e-01
1.028409736420015319e+00,1.252259671020035325e+00,-2.022977735447240577e-01,-5.880822725326865230e-01,-2.687700351607151816e-01,1.147743022306053629e-01,-6.205619249561205031e-01,4.252518192805449515e-01,1.603787273478612496e+00,5.892609798312209435e-01,1.008219051337410299e+00,5.349365898344116133e-01,-3.336553362021241198e-01,1.568326203118953766e-01,-4.553558296173829678e-01,2.546566477302155462e+00,2.939371084904420228e-01,1.667025384650592801e-01,-2.712064202140717500e-02,1.251619765208333290e-01,-6.652938043962085546e-01,8.141290552274635939e-01,-3.242873631283701430e-01,1.190663380498285517e-01,1.405433189279857942e+00,-8.185182910754978947e-01,1.676880269794691070e-01,-5.073470974099334452e-01,1.327514206522317775e-01,-5.952404241585407263e-01,2.563942215872148656e-01,2.230167675336085509e+00,-4.162786598821439088e-01,-4.225700515228342780e-01,-5.763502111906113612e-01,-8.018789939554806789e-01,1.366873716551254558e+00,1.247422786947002260e+00,1.567330314561493854e+00,1.828950107520562973e+00,8.408181519059294562e-01,-7.203037877628881702e-05,3.735545124402074313e-01,2.982150392600433353e-01,-1.059621793896758923e-02,5.898016814444407840e-01,3.177883285608289476e+00,-1.667582458744407692e-01,-4.924710032999150833e-02,1.549134561050985237e+00,4.039197790352765161e+00,1.157615240440668547e+00,9.219670343492735176e-01,-5.973569892192547304e-01,-8.197392544986397134e-01,1.655793178334725280e+00,9.985505196455239929e-01,-6.474073925154180675e-02,-9.834624434306828977e-01,1.842827491900255854e+00,9.101299316297536413e-01,1.679399372122969414e-01,-2.478225867869169596e-01,1.301477846283507933e+00,5.720685088176288291e-01,-4.302144630756878918e-01,-4.239701611987329311e-01,5.404147220063031387e-01,3.485503719117844512e-01,-4.946293773234158309e-01,3.103456131537325469e+00,-4.390350016632388885e-01,1.569811346156025911e-01,3.928250186552875167e-01,-2.633168797719562804e-01,1.353512069630172121e+00,3.202275996657263923e-01,1.470521319871446408e+00,-6.913797025709682575e-01,-6.388935930759426229e-02,7.088639921595584203e-01,7.589164457022856691e-01,1.513116089250421403e-02,9.233876620782264233e-01,1.261555848774866817e+00,-9.321982525173561074e-01,9.507412338984805311e-02,1.851060154582842454e+00,3.930707853483675907e-01,-2.187351045132634730e-01,2.419185910511639559e+00,-4.182633741050035270e-01,1.036335178097293586e+00,-1.691724797278454373e-02,1.246859096223642105e+00,-5.919474613513880934e-02
1.152592028541209679e+00,2.180438217556420533e+00,6.309574991061021876e-02,-5.611927961356260042e-01,1.957372637796587211e-01,-3.081521423086175382e-02,3.873142298771142800e-02,1.508881254781330172e-01,1.303355610196154313e+00,-3.266108781721814847e-01,-5.205395904307998922e-01,6.443899536008607098e-02,-5.179497921632054691e-01,4.570790926068403759e-01,-3.515878252857929098e-03,1.132677061103704919e+00,-1.580190575285289334e-01,-4.087797581229437038e-01,-8.610810835426011001e-02,1.059248589363548654e-01,-8.291842869118731807e-01,-2.948114271464523650e-01,-9.135431001704590326e-01,2.443484134223321558e-01,1.392383386955516222e+00,5.464933091546163579e-01,-2.806415501775408328e-02,-5.270759734084756731e-01,-8.619046681981484825e-01,-8.233173884245094110e-01,4.315086419894116898e-01,2.013021171720946523e+00,-1.809248418078719389e-01,-1.861837700562864462e-01,-9.935590953276255410e-01,-5.831884330261829508e-01,1.965220297186237364e+00,5.978826522392470810e-01,8.175858782375553524e-01,-8.534990624092730904e-02,6.661991130379608661e-01,3.686458660983076285e-01,-3.385340295714679704e-02,5.225514389603929111e-01,7.690165675895797026e-01,1.140269883299705800e+00,2.688612868841274040e+00,5.533876967869246766e-01,2.471885493567921865e-01,1.226927084979782201e+00,3.918754956912647192e+00,1.305467449252360801e+00,4.892780375494867884e-01,-1.453219783552366084e-01,3.960188155211754601e-01,6.397974988385443096e-01,-8.646285499517106787e-01,-2.909713831932117523e-01,-9.967103756544901660e-01,-1.901730729293598099e-01,1.078938413428195964e-02,3.437542646531317470e-01,2.015575170710057762e-01,3.839662709114710637e-02,1.068999919305803070e+00,4.221106262972532663e-01,-2.280625634624381393e-01,5.924920881322540689e-01,-4.170144620050609263e-01,3.157630601607560594e-01,2.254012101417671055e+00,-7.385843217636949287e-01,-5.782561050393953961e-01,3.046892907762625557e-01,1.514273947844782531e-01,8.578804222101420462e-01,7.285916219649102299e-02,-1.978425970158228520e-01,-9.356987261053290039e-01,-3.919929133271389810e-01,7.330368868907528590e-01,-5.236015062065382253e-01,-2.248067434732398673e-01,1.324489373836073458e+00,2.635921184118403815e-01,-5.400573177497843824e-01,4.403218854256265580e-01,5.261198576772774249e-01,8.735369640856718298e-01,-5.682634188712568646e-01,1.313589482655908469e+00,-1.317610368096677753e+00,1.697890149198233889e+00,3.647968596525922313e-01,-9.742737896766380246e-01,-7.423397225880101757e-02
1.045917944165726698e+00,3.563106430793493429e-01,1.140375916381045213e-01,2.358881029497407189e-01,-4.660980279788285996e-01,8.520963917095805140e-01,-6.981677023867760568e-03,4.048830482512550955e-01,2.668847756453002873e+00,6.191107187547435498e-01,-7.378583426823126512e-03,-1.056688725018456454e-01,-6.518502432944131009e-01,-2.071946128524600472e-01,2.334642380402297546e-01,1.606693729440032969e+00,-8.419545943814901179e-01,-4.966426122048696323e-02,3.494219975089832841e-01,6.479464251027929889e-01,-1.425025965661679273e+00,4.783129443277687187e-01,-2.313776774159604921e-01,1.747224510170729272e-01,9.662373526929204370e-01,-1.025307843150046194e+00,-3.643562298363600682e-02,-7.376481951162059403e-01,-7.184289749363204081e-02,-1.579161253858263336e-02,8.766169843166927711e-01,2.961117390820111162e+00,8.859459013237019898e-02,-4.882714626689281245e-01,-5.323595369478379968e-01,-6.369309099020115106e-01,1.543721388674954342e+00,1.086270541080792240e+00,6.690719493445351773e-01,1.677949316827447079e+00,1.578550069792673538e+00,6.040426352264267607e-01,4.274959287819823928e-01,4.637612879709550606e-01,6.873506684245327403e-01,6.190417190130110825e-01,3.149810555646844090e+00,2.135866996015449160e-01,5.968396575724734809e-01,4.953191659020544924e-01,4.695362230559705807e+00,1.602685693027779301e+00,1.167637667411420388e+00,-4.373678356516106369e-01,-7.168062245348525430e-01,1.254746827368324658e+00,1.888599338127350258e-03,-8.594958069639263565e-01,-7.609203706235623255e-02,1.622507764285672671e+00,1.293113088416835810e+00,-5.227371144549743942e-01,-9.638388474087764557e-01,3.740651135883983902e-01,4.285456065617437860e-01,-1.663974253883107601e-01,7.047170718010054014e-02,2.127344402925788192e+00,-6.904454644599543611e-01,-1.147054247162367036e+00,3.394932322240770795e+00,-3.730117798552393671e-01,2.605638436397134106e-01,7.358805912698054286e-01,4.033287593529749082e-01,1.291576383929044392e+00,5.898855683678172479e-01,7.857666472535479452e-02,-5.171349165177784313e-01,-6.079181151630571600e-01,-2.048910193673852964e-01,2.070273814302808491e-01,-3.836868368243376293e-01,1.203107073270963889e+00,5.718593124460702448e-02,-6.974020539847828326e-01,-2.624896426298862218e-01,2.922352843488097651e+00,1.057202579081640614e+00,-1.274066400051222292e+00,2.630167391057923076e+00,-1.847483580229510869e-01,1.820335505182754332e+00,7.298689793267474357e-01,-6.886256431157959934e-01,-3.028939013948747094e-01
1.100661432320825472e+00,1.284488108971655329e+00,-4.585435902824085974e-01,-3.485406896558599366e-01,-2.782497079766015902e-01,3.584218031154953743e-01,-2.238305882070754094e-01,4.909629848404263308e-01,1.346357218968996294e+00,4.148735943869049647e-01,1.015973333267131018e+00,3.925584327912313709e-01,-3.075419453692558869e-01,3.549523105931426392e-01,-4.658986218114335998e-01,2.506466471042547717e+00,4.107279342336400130e-01,-3.342609500494936325e-01,5.266498447831546165e-02,4.385475272284673071e-02,-5.561107621635050791e-01,6.905261493674381690e-01,-4.647438573771016657e-01,1.925923111976263202e-01,1.329433501778086724e+00,-7.651746325838982843e-01,-1.877079493345559791e-02,-4.931949868367961343e-01,1.516765808580613495e-01,-5.605266181668790981e-01,4.434584445165735689e-01,2.029014164649031393e+00,-1.470868117627723848e-01,-3.105824914340850618e-01,-6.917067367263869393e-01,-9.438288566131549651e-01,1.503100518579495004e+00,1.027253629351476238e+00,1.416363183407327586e+00,1.308012168884301385e+00,9.646306476743600200e-01,-2.248496626592749736e-02,1.934871146709370437e-01,5.309796457076338960e-01,-6.826731260348350983e-02,6.849712654793598254e-01,2.922772789991367137e+00,8.124444608258127309e-02,1.829386478648931669e-01,1.238252273169219819e+00,4.532624827109002830e+00,1.329992628691036405e+00,1.053154992904752785e+00,-6.256805639322833290e-01,-5.332301186069453580e-01,1.369226599515472431e+00,5.742177007473199257e-01,-1.649660120781137052e-01,-1.033813471070002654e+00,1.655062134012831310e+00,7.412040656007899964e-01,-1.172840425948211418e-01,-3.623268205833081179e-01,6.849519090149526201e-01,2.981499391907498353e-01,-6.095590697672530478e-01,-4.847705376217489315e-01,4.471141944199633622e-01,-1.300427207869372381e-01,-1.881719610673581178e-01,3.237618786365444201e+00,-2.922317084976022716e-01,-2.702998971160890107e-02,6.612929051440890049e-01,-6.086239337048450493e-02,1.333585077414383591e+00,1.616581706359568327e-01,1.155812212965047658e+00,-4.845327038011062459e-01,-3.987852415278121399e-01,8.728661223058178376e-01,6.069232790665637367e-01,-5.444132939510135105e-02,8.598097953580947639e-01,1.052170833185750887e+00,-8.717794419383062543e-01,1.507503789873404498e-02,1.626206709032988362e+00,5.935744124101085539e-01,-5.723621554232969366e-01,2.253575313170043337e+00,-4.355094343531413226e-01,1.187745847496491258e+00,7.144139267562946150e-02,8.089561266714722088e-01,-2.331133357126428107e-01
1.084204994350549844e+00,1.758693177107232053e+00,-5.339301040164599055e-01,-6.202532125746306191e-01,-7.422323667742494746e-03,-1.721614684395106343e-02,-2.974763319625348124e-01,3.464130808290577512e-01,5.002556911954847418e-01,2.396156459127165295e-01,1.321110756864315894e+00,5.372507046432730693e-01,-1.860897157432246096e-01,6.566165200411665515e-01,-6.482273611672086933e-01,2.673312904731173667e+00,8.119948380618109418e-01,-4.095609286043182529e-01,-3.099945308089364221e-02,-1.759995126299146173e-01,-2.470224502566475411e-01,4.995373672488717109e-01,-6.299922134326926271e-01,2.698880126925021217e-01,1.444069719670861174e+00,-4.952591333630677606e-01,1.094770554079614044e-01,-3.868993787184776822e-01,2.816941947894058274e-01,-7.299528069556494581e-01,2.285777249308192371e-01,1.587871753598387725e+00,-2.688680588217900458e-01,-2.952225633864745125e-01,-7.544137473714875863e-01,-1.054708930274940837e+00,1.337428959732683165e+00,1.074469128494168313e+00,1.640043655116024901e+00,1.018074531474796540e+00,5.617348963346296964e-01,-2.735322023789403256e-01,1.570428125946216058e-02,5.143359383868508772e-01,-2.553750750086808408e-01,8.088988030845476462e-01,2.761474835072927903e+00,-5.503158912086308918e-02,-5.296835882810090046e-02,1.771660881229776496e+00,4.172561796820827063e+00,9.852339283424653704e-01,7.459805688097250753e-01,-6.986277273583707537e-01,-3.965868283763450686e-01,1.349811210496762559e+00,6.787495388718666200e-01,2.219158830806689242e-01,-1.311845554713334083e+00,1.162184403472300787e+00,6.505639965192452356e-01,1.050546226959495622e-01,-4.536400656776787277e-02,8.873344654976378365e-01,2.983872380450707240e-01,-7.230211610333225902e-01,-7.398811538732599224e-01,-2.728329715789744592e-01,8.507899061210322245e-02,3.602854421380938810e-01,2.968352352839802144e+00,-3.992311870459916423e-01,-1.517580338816177932e-01,7.474353011688665838e-01,-3.651270946825685981e-01,1.505481294564931183e+00,2.266740721266219394e-02,1.512488981713694391e+00,-3.638422187054968227e-01,-2.972079821426516499e-01,1.142148985455570198e+00,5.429062908299238099e-01,1.757749941973560381e-01,7.391108878456047471e-01,1.331347442121602498e+00,-8.098437048998905485e-01,2.790816188571569878e-01,9.637027315465080957e-01,3.135301417337371666e-01,1.011827294724543802e-01,1.853581444975172188e+00,-7.391318435328683156e-01,8.520012140954326130e-01,-1.930035811155939030e-01,1.511230389455174183e+00,-6.076346775171981296e-02
8.668782510015631271e-01,7.091397174254985281e-01,3.096749386465434961e-01,-5.468604008092338153e-01,-2.670487625782046459e-01,1.537656563971504242e-01,-5.719540884607847708e-01,1.664071985720155245e-01,2.074791963382644155e+00,7.270905934688475236e-01,4.362590054768487047e-01,3.101238589683050773e-01,-5.199228412931417020e-01,-2.748449643770161654e-01,-1.311844528607598592e-01,1.909905027225708984e+00,-5.223345206354648163e-01,6.316425171424558949e-01,4.435440998804799501e-02,4.325193054537193604e-01,-1.123367863154320911e+00,6.795049024974987306e-01,-1.619917498304908610e-01,8.365748165139266779e-02,1.380399274856662695e+00,-7.526516739406833301e-01,3.403348928889931568e-01,-6.620406001612918478e-01,-2.764745462340348903e-01,-5.239352541139330466e-01,2.920317920102846188e-01,2.842925326459948554e+00,-5.000052305987261470e-01,-4.515100114741405490e-01,-4.346586092521274591e-01,-5.021346027415402036e-01,1.288724534773473041e+00,1.376117903860982317e+00,1.477764855909238229e+00,2.216136600072157847e+00,9.131558153566663449e-01,3.845238572270307520e-01,5.101204130930694358e-01,-2.628037871138674819e-03,4.883081206967924692e-01,5.529544896314319002e-01,3.268723937285346270e+00,-2.992815044207027819e-01,-3.376193958054425626e-02,1.278574754766313326e+00,3.626779395049843480e+00,1.280172018900948006e+00,6.731805525494400921e-01,-4.407623228414864758e-01,-1.042128519078627580e+00,1.813883982645339454e+00,9.500630621795421726e-01,-2.632067152429724555e-01,-4.551774709637942395e-01,1.878927725768535062e+00,1.149114800499176248e+00,1.099302424095150998e-01,-3.493412056744373828e-01,1.530941802527665985e+00,9.850018495060508528e-01,8.965608831403931722e-02,-2.056826232560831635e-01,1.365226157960424569e+00,4.234171138780777888e-01,-8.977373631789737907e-01,2.788781461843747866e+00,-5.700353353198233108e-01,4.313791344649669512e-01,1.755807623545591056e-01,-2.136879350393526278e-01,1.250711910869946486e+00,4.453781762869211680e-01,1.030938699917250290e+00,-9.574728289789589120e-01,3.254705144729674871e-02,7.130298608139695737e-02,5.347661173510607213e-01,-1.289532086897949570e-01,1.328782719744251439e+00,8.958133466814431900e-01,-9.669071791505122748e-01,1.154449126877862275e-01,2.361641845037815379e+00,5.077135910954672093e-01,-2.015142041695565100e-01,2.464590842498037837e+00,-3.139075872632274833e-01,1.093180690730969129e+00,2.667220042164638594e-01,7.419409715091116464e-01,-1.633705101750793087e-02
7.617900355069534557e-01,3.052995329936816216e-01,1.009885073979325115e-01,-2.417050126027800450e-01,-1.263388337714517751e-01,4.197388437240219816e-01,1.996252857528894031e-01,-9.142079984845516427e-02,1.005510237238661730e+00,5.884575045317945730e-01,7.224291656699506348e-01,1.437789678299608576e-02,-4.612219828668480681e-01,-6.001031455267095971e-02,-1.669803689576845884e-01,1.740961825306807542e+00,-5.915258474363114249e-01,5.959377447929409266e-02,2.554568266617736061e-01,3.346690872087129676e-01,-9.584455976020760382e-01,3.838285879783142063e-01,-2.954545054249901326e-01,2.777389033352251624e-01,1.322438427934853777e+00,-7.041364130812780564e-01,3.242709040382674712e-01,-6.858302077031062094e-01,-2.402145789551313193e-01,-5.000152288162701408e-01,4.722762888697557560e-01,2.640750471334266880e+00,-1.600510832097124247e-01,-2.459772317269225406e-01,-4.660518310733423597e-01,-7.064135232172086276e-01,1.095510223242143200e+00,1.279652751442875047e+00,1.595172867202876432e+00,1.745546948098537499e+00,8.665545345080474249e-01,3.630600683172589549e-01,1.417554896419014332e-01,8.538637015242964146e-02,4.362843536247432707e-01,6.940688865857992385e-01,2.682618388352937533e+00,-2.914695255500728832e-01,1.671068714182055714e-01,8.988375920912009542e-01,3.955111233640429269e+00,1.418422137061781552e+00,4.514881224153119987e-01,-5.808765590764501940e-01,-8.933291111978680643e-01,1.666029728596638559e+00,6.685832779016552818e-01,-1.861240718852484877e-01,-2.565904190014119957e-01,1.644673732405125932e+00,1.232194715113249739e+00,-5.069333915078862995e-01,-5.380936429693038425e-01,9.819977188349254815e-01,6.304617895031650043e-01,-1.676687481559575588e-01,-5.035289453979387986e-01,1.235528705271036198e+00,-1.351597891763836323e-01,-2.060923767159220654e-01,2.688638645434473951e+00,-3.631520569602303405e-01,4.468035070309442913e-01,7.203900435361734189e-01,-1.807544889987800496e-01,1.460804558953127774e+00,7.973508714014443388e-02,7.585521654439939532e-01,-5.350260900063297242e-01,-4.578988981405236469e-01,1.997052729961390494e-02,2.765105034804706263e-01,-1.151213194736316614e-01,1.403639773770374077e+00,6.436410297858496943e-01,-9.558789585963830548e-01,1.413672535988599877e-01,2.081898824688645178e+00,6.340646470121732436e-01,-9.641676087691763986e-02,1.996635523477224172e+00,-2.423411959447974162e-01,8.403141543870719099e-01,3.734167260489185680e-01,7.311203152286498419e-01,-2.026708394057416263e-01
9.338135719428708459e-01,1.795019529977637696e+00,-1.994102291628321311e-01,-8.232150123660324503e-01,2.610083093853962644e-01,-2.414627424823035384e-01,-4.212204282107223641e-02,-4.599158137040504357e-02,3.066436479335454823e-02,2.085460715455109137e-02,8.546056258977321463e-01,3.600478599688277104e-01,-2.567103404740507244e-01,5.805996526770901278e-01,-5.249802759642682171e-01,2.000181214651735928e+00,3.926429463535305309e-01,-2.718362955850753271e-01,-7.743494921705515455e-02,-1.617594781065668785e-01,-3.311138372554565112e-01,8.744284064426677272e-02,-7.492366308559414989e-01,3.145143477884711491e-01,1.590476756850432105e+00,9.487288024558496180e-02,2.794768818467327498e-01,-4.447656575686929625e-01,-3.159291444507377200e-01,-9.851021020802325223e-01,1.134870599627059162e-01,1.701591054075989540e+00,-3.704230743382119218e-01,-1.417013712134271852e-01,-7.870650115488200260e-01,-8.517529580834748426e-01,1.324956451134127189e+00,1.016411858485472219e+00,1.755929556636878441e+00,6.779714813196482392e-01,2.485035163808513858e-01,-7.095985193479742437e-02,-1.327652980394566362e-01,2.703397087063850734e-01,1.229243640726205844e-01,9.789132757192269274e-01,2.503538068710482900e+00,-1.031329545726016872e-01,-1.495737209159516690e-01,1.725928750949064394e+00,3.606266836598099434e+00,1.019703452061469617e+00,2.158811897917647937e-01,-5.280433430890005830e-01,-2.118007613426503011e-01,1.299812266361812796e+00,3.850838882232061611e-01,3.299997294449248386e-01,-1.163157510453664223e+00,6.027552751628652006e-01,4.349415858331947549e-01,1.891240162676578462e-01,2.443468035346426925e-01,9.021276034072231997e-01,7.735537327145848296e-01,-1.800608404550827490e-01,-7.916498376606740939e-01,-2.265038794877568540e-01,1.686912923492706606e-01,7.575301104069260827e-01,2.261827611781851211e+00,-5.611526503420296574e-01,-1.722943271740539073e-01,5.487227912831164067e-01,-4.556097216117283022e-01,1.339014642566952462e+00,-1.879700810747956252e-01,1.090969377406230123e+00,-6.258861733683507289e-01,-2.479795375110342148e-01,9.547300952169669452e-01,9.537115494373213376e-02,1.362009358969168415e-01,1.144531598150881013e+00,1.121411769419230264e+00,-8.260328452446235037e-01,5.601099300863972008e-01,4.601533243156962216e-01,3.356269922132116279e-01,4.684027668408359824e-01,1.308641539633513595e+00,-9.899772440474834401e-01,6.936865268554156527e-01,-9.707655234243511844e-02,1.165303308156762307e+00,3.270265958778995063e-03
1.243130076138252216e+00,5.992081886504598831e-01,-2.155124602506126030e-01,2.504004546763620720e-01,-8.132891473758664391e-01,1.059883066900215276e+00,-2.880792184018394209e-01,8.968203923099001829e-01,3.505304117905770234e+00,7.024533006247596356e-01,8.473518361988341407e-02,1.096111993056353012e-01,-6.138942555678178481e-01,-2.248912400109894794e-01,6.692703322630105811e-02,2.086413782371179693e+00,-4.277532867944784933e-01,-1.440367022786020468e-01,2.183253739294631623e-01,5.775417173614191269e-01,-1.326604583851885177e+00,9.696926481666670039e-01,-1.689783182994680222e-01,1.970776234858076514e-02,9.819714359871966058e-01,-1.282116096378474124e+00,-3.297579979509520642e-01,-6.915254426825225842e-01,-3.371765124017045423e-03,-5.497021362885456952e-02,9.334887631889637882e-01,2.923809130165532011e+00,1.003227575972027164e-01,-4.904669632939617219e-01,-6.074956323066156294e-01,-6.831416816349435983e-01,1.938001882775014728e+00,9.095948058398493075e-01,5.955774433298528514e-01,1.776727026240332297e+00,1.884328466385929435e+00,5.177849131208634992e-01,6.329742446554558200e-01,6.795605517939368179e-01,4.268290890713732910e-01,4.670786806080071130e-01,3.446221980283819875e+00,4.877004576645710410e-01,7.043161295438521430e-01,3.141565931951166846e-01,5.266625464474857132e+00,1.874550520971429268e+00,1.784943553961491070e+00,-4.137675386620367490e-01,-6.834623694604904376e-01,1.222057407547972652e+00,9.478706358551619582e-02,-1.072159741909618047e+00,-4.602298732581162621e-01,2.288449357783508553e+00,9.622543486615874331e-01,-3.838676257666222003e-01,-1.015494210099954442e+00,2.001692838112046346e-01,3.016826107002053003e-01,-3.334401012145207233e-01,2.229615997436664721e-01,2.056813613019374376e+00,-6.501100667667357724e-01,-1.545559278555372673e+00,3.901888179319682681e+00,-2.097984105786891706e-01,1.018365818060176370e-01,4.843332307736437636e-01,6.466608939676462553e-01,1.000516256238045187e+00,6.784691697166893576e-01,2.556040941859305526e-01,-7.066587821442459338e-01,-5.530279836509268687e-01,2.473109049842679430e-01,6.158249683976699806e-01,-5.216902871298497724e-01,9.892143062736198367e-01,3.067234414949610022e-01,-8.132371439964050097e-01,-5.365080013842205009e-01,3.081767184887358013e+00,1.191407253669122035e+00,-2.054916679586447081e+00,3.152139509801004102e+00,2.523622841840988951e-03,2.172727992314146483e+00,6.608827210711150091e-01,-9.536497586600356513e-01,-4.772148593299517239e-01
9.594821917488280949e-01,8.257469072251708564e-01,6.820873882052505555e-03,-1.145728032382112849e-01,-3.659737405185430059e-02,2.863936497700888539e-01,-1.259255060711677587e-01,1.111259396348682482e-01,1.163172086392380677e+00,4.915556650961777629e-01,7.498397276379404897e-01,1.190063433544477356e-01,-4.394749661804719931e-01,2.480210222541262555e-01,-6.247125744932158220e-02,2.015835433125930276e+00,-2.410274380891931356e-01,-1.095819712112500455e-01,3.086049747096905604e-01,3.417854458999458056e-01,-9.508706699022717590e-01,2.233892978539216978e-01,-4.043264663008551141e-01,3.372584431674592875e-01,1.089349875269915335e+00,-8.463712687414206570e-01,2.600910626438979745e-01,-5.787940230203603154e-01,3.945047750371433182e-01,-1.506179493636445876e-01,5.450147714946314004e-01,2.298437850368377777e+00,-8.873655420235027069e-02,-5.315790701945373176e-01,-5.335104830113119867e-01,-8.775746788072011917e-01,1.043072247393246776e+00,1.329883962361826155e+00,1.102794253243812861e+00,1.519442305537479276e+00,9.478297366229841980e-01,1.568244495444156006e-01,1.508061536803356195e-01,3.902228333872781452e-01,3.094156662763380972e-01,7.591387309050712240e-01,2.893022317316532810e+00,-1.880233271434024744e-01,1.914368370504759276e-01,1.421060416537281990e+00,4.092674591125228467e+00,9.389844436597249988e-01,6.345530608947886897e-01,-6.688733071266518282e-01,-7.259154057357951606e-01,1.376291181826562626e+00,4.280278773418038640e-01,-1.827661891375647607e-01,-3.625872719085898588e-01,9.956926885510904990e-01,1.479440005707737260e+00,-3.151543962449886993e-01,-6.096740398880122758e-01,8.908972499028190439e-01,2.717301576263984053e-01,-5.382071058712571965e-01,-4.009798907564318671e-01,1.046730208313709554e+00,-3.308865383470321886e-01,-3.381302167981357076e-01,3.075160022640504032e+00,-5.144824783711553495e-01,2.401694908229927150e-01,1.063645199127094099e+00,-1.870821537374257604e-01,1.796377936312882895e+00,4.212992912821464375e-01,8.618984582269865191e-01,-1.305051630359046477e-01,-4.684973894599551159e-01,5.344735899274433155e-02,2.133395842940877529e-01,6.645708606775646565e-02,9.486200999641557496e-01,5.468194525316626420e-01,-5.969570566559573299e-01,1.319789346788974305e-01,2.155229585051908536e+00,5.132615340082946620e-01,2.532521454733288602e-02,2.078825367101165611e+00,-5.373353919510672760e-01,1.113947429607935691e+00,2.886885323695180805e-01,8.661525441931334779e-01,1.070795148092545945e-02
9.985273111086275799e-01,1.894521132496299387e+00,3.433652094073693650e-01,-6.758371632077959656e-01,3.237530566474911553e-01,-2.581005357476179873e-01,-1.580329105537245371e-01,-9.856844560633440389e-02,1.055698852450990266e+00,-1.248413749134836548e-01,-3.230553242322518614e-01,1.008965203144845113e-01,-5.255494396640556509e-01,3.300491946502064899e-01,4.304963633688263513e-02,1.140804198241262890e+00,-3.662097767427441863e-01,1.929071588136349602e-03,-3.056682257227000959e-02,2.062915684183131981e-01,-9.316886270056692343e-01,-3.361086458329123339e-01,-7.766859323987910235e-01,2.783260743169180262e-01,1.393476962792665086e+00,4.019690611575462147e-01,2.676447512305621945e-01,-5.511817753232330919e-01,-6.703354108962864544e-01,-7.297239675408043746e-01,2.849037100496268904e-01,2.162463357073605152e+00,-3.600765255461044201e-01,-3.208879507009619880e-01,-8.185357598393087075e-01,-5.322961066703104649e-01,1.554095781313387103e+00,9.391050429497331820e-01,1.005605110492219012e+00,4.591908662396750884e-01,4.767643495401120424e-01,3.551974686105705548e-01,2.180195576759098169e-02,2.659447666115254405e-01,8.125790629932192477e-01,1.084733593818237640e+00,2.767793413856106888e+00,1.490796837321217427e-01,2.021921201667921386e-02,1.594683776593450730e+00,3.367192762564893638e+00,9.849972519050665953e-01,1.630945535399724589e-01,-2.301297228997422339e-01,2.196397618236733962e-02,9.585853405191756549e-01,-3.980464015142054501e-01,-8.876005483201782065e-02,-7.379065032355268672e-01,-1.819046886492317050e-01,4.895509162972720985e-01,3.960210519314164568e-01,1.918583583795727132e-01,6.751193598133166107e-01,1.162999969309951309e+00,4.308099816795358250e-01,-2.961884741444243963e-01,6.876687982795728349e-01,-8.213718268846748050e-02,2.042212757264679768e-01,2.086953589701752598e+00,-8.750478095569400594e-01,-2.741714364641419377e-01,3.612801198092757682e-01,-1.614269379627830958e-01,1.159834421586141362e+00,1.956303775604775752e-01,1.538487360166722051e-01,-8.498953656582943772e-01,-1.927359539711026026e-01,3.624621494861856030e-01,-4.646710417700551932e-01,-5.278972121789657357e-02,1.368122032056454884e+00,3.781397277120309153e-01,-5.332027731586159724e-01,5.723885482308321837e-01,8.245883239459297354e-01,6.005749879124053781e-01,1.305061241191931010e-01,1.314544295680536212e+00,-1.282431359108474833e+00,1.338775756291539887e+00,2.939797300871835883e-01,-2.090203059868656621e-01,1.427304370304620651e-01
1.192406069205966146e+00,1.740266872371587947e+00,1.454785612357425983e-01,-3.073043854178414969e-01,-5.757442000562261464e-02,1.777923432739185738e-01,-3.008033211143909536e-01,3.612414646344685454e-01,2.178480122481930792e+00,4.785482883791974951e-02,-4.231574459689870227e-01,1.055404833121183217e-01,-5.874456270156411808e-01,2.220198970542225370e-01,1.478420276664212940e-01,1.412096626535294774e+00,-3.313523553247103570e-01,-1.334767708598464386e-01,4.139043439686420495e-02,3.577409693123901890e-01,-1.123053320290852586e+00,1.559057177843831132e-02,-6.437436407674215211e-01,1.831643698305794321e-01,1.171925145199117946e+00,-1.023029293204367196e-01,-2.907644297642755782e-02,-5.736041374071070287e-01,-3.861126951772400062e-01,-4.075170024262437796e-01,5.692248782983335698e-01,2.350082393292256100e+00,-1.609272327656412482e-01,-4.545247451901344715e-01,-8.211133762396533031e-01,-5.847680419274522423e-01,1.826767643304407329e+00,8.412028657230715689e-01,5.707754036096206463e-01,6.689458653493988161e-01,1.044841839091765756e+00,4.159125781539945166e-01,2.525735679598368200e-01,5.510425322340145593e-01,7.397601632068485644e-01,9.236376185399597372e-01,3.098803035068514955e+00,4.378846628789673789e-01,3.241674876291334439e-01,1.224619591344297653e+00,4.123947248682083178e+00,1.219362659390601511e+00,8.402691951112638558e-01,-2.387335530746544365e-01,-3.082657095087493193e-02,8.351617071185701846e-01,-5.286866998624867309e-01,-5.282499500706435702e-01,-7.050239387844738914e-01,3.443708486298675542e-01,5.758172426515010267e-01,2.507048762413267573e-01,-2.114148965014821802e-01,3.183393419450455397e-01,8.358840915753920076e-01,1.808086235574981326e-01,8.819117104163609611e-03,1.188635357436538253e+00,-4.140730722128747043e-01,-4.907399386464481594e-01,2.812039431337763684e+00,-7.193709057539900975e-01,-3.114581787575849137e-01,4.171153022120851483e-01,2.274082026725023353e-01,1.075044914644994520e+00,4.888293553234423494e-01,1.843676520218329173e-03,-7.760054062066589209e-01,-3.293311445955734440e-01,3.612804303647895177e-01,-2.095209165640755100e-01,-2.314684027708847069e-01,1.133749257860148019e+00,2.085445210073458844e-01,-4.870898863868359241e-01,1.723271523848906583e-01,1.560695801067552679e+00,8.657393189936131161e-01,-7.990941731234236789e-01,1.964728215063757943e+00,-1.002517717986072254e+00,1.894226463103471758e+00,4.574276090232721748e-01,-8.236615680815806417e-01,-2.994759653859346837e-02
1.389330463356488021e+00,2.026396651824111217e+00,-6.016436548925206962e-01,-3.885819963170795699e-01,-4.965841475799153693e-01,4.809597044880198902e-01,-3.927003718658567677e-01,9.554355942469615615e-01,2.483059802380483738e+00,1.204726325191055464e-01,2.426776314459867523e-01,4.530123759408288819e-01,-3.900884072640538602e-01,3.646956603092931792e-01,-3.976253803143013910e-01,2.332021660420847908e+00,5.786493264410395021e-01,-5.287818303998084168e-01,-1.720861956516659685e-01,1.220109194362361399e-02,-6.153511589348531485e-01,7.870550397128563969e-01,-6.226204949927787169e-01,1.966930564088512079e-02,1.361066192055033319e+00,-4.008412076202850227e-01,-4.313185397891278194e-01,-4.665510544755333555e-01,-3.359311180801887176e-01,-7.280071678569379756e-01,5.555665387103116970e-01,2.015961644952383391e+00,-1.103915534972184365e-01,-2.378409816617991779e-01,-9.554453611590549844e-01,-8.006840291920055419e-01,2.294801689091043873e+00,5.397767819076881857e-01,9.466041240329713391e-01,6.588673765771706492e-01,1.255986665039332761e+00,1.163504172113626889e-01,3.386074455022105023e-01,8.241491528622519880e-01,8.349403483609635357e-02,7.342085722395544911e-01,3.171548732365190748e+00,7.315485804056689467e-01,4.082400398522302298e-01,9.015062117260136398e-01,5.013712448587469339e+00,1.724158076559252795e+00,1.581832041319441551e+00,-3.228279569476080746e-01,2.862286201443509093e-02,9.019096380448883288e-01,-1.542267375144116270e-01,-5.677873209474354477e-01,-1.467950206163626259e+00,1.534061195042646375e+00,-8.457517710530362831e-02,2.588598926385176080e-01,-1.708955722900779017e-01,2.475039349066066041e-02,5.378535618535913443e-01,-2.529056415826851367e-01,-1.183682071382629597e-01,5.295309902642106881e-01,-3.091448760966136744e-01,-4.672021609584452451e-01,3.389535952504330041e+00,-3.038524044409797176e-01,-5.325154782995301650e-01,1.563414625574008621e-01,4.259564454825875979e-01,6.756344838103632844e-01,2.318560374715500916e-01,5.566609232725335810e-01,-9.727912679223630343e-01,-3.683667695701289269e-01,1.347740109814069331e+00,4.982604112838264765e-01,-3.618092671306830654e-01,8.544901960626913873e-01,8.768151313195249319e-01,-8.384442634930830973e-01,-1.424774682496059985e-01,1.294553050581544795e+00,9.750788492638903238e-01,-1.687902314847977259e+00,2.440212032060715686e+00,-6.443375275023186521e-01,1.978536863268824941e+00,1.900107743392523973e-01,-6.487254356521003906e-01,-4.057141938444345786e-01
1.208665123714061984e+00,1.909665676200855700e+00,-5.890409652091592452e-02,-2.960120309477052847e-01,9.795791668950791509e-02,2.778100388843440793e-02,-3.439706221977388290e-01,3.280436122936739585e-01,1.449305976385958150e+00,3.762425865785676282e-02,1.601539835318598337e-01,2.178380545641470101e-01,-4.540072427170117053e-01,5.471217957588468961e-01,-3.055813631936465935e-03,1.841661370782350815e+00,1.079271812950119980e-01,-3.389697713345389829e-01,1.089840055345183412e-01,2.107163286165169569e-01,-8.606516097476255567e-01,-5.855615591595764169e-02,-7.165543002338143896e-01,3.002518205653299521e-01,1.109142175657356955e+00,-2.677129997988821342e-01,5.135696605452014230e-02,-4.711020411645722161e-01,1.875020889843586058e-01,-2.848325913022107247e-01,5.122141045180710339e-01,1.921494587279453103e+00,-1.218883735545656932e-01,-5.522596123387912836e-01,-8.134700308308663308e-01,-8.395018744909856778e-01,1.515821922544475120e+00,9.890455935544819610e-01,6.583736218785622984e-01,6.164507531051870437e-01,8.721848778627382393e-01,1.034659097532015792e-01,1.051717367063857017e-01,6.646498749097675685e-01,4.105518106528329159e-01,9.657807741888380093e-01,2.990862458405784796e+00,2.645671814587708948e-01,2.153356798924379312e-01,1.693252308311051557e+00,4.116924955925243879e+00,8.217147967690836552e-01,7.500362086804489570e-01,-4.593036502926791109e-01,-6.772177109190008482e-02,8.407624071627981532e-01,-3.138428144442544365e-01,-2.369621597954021386e-01,-8.260638554558561442e-01,7.970045574522299781e-02,8.550973422942566016e-01,2.058863338597890502e-01,-2.247456003443466521e-01,4.481843345409121104e-01,4.490818771737291604e-01,-3.093949129927278108e-01,-2.316827231910683071e-01,6.503202344750076414e-01,-4.323013872184584550e-01,-1.576753972873630172e-01,2.964715295270657691e+00,-7.191276639563064510e-01,-3.207963036620656294e-01,8.385159399509893863e-01,-1.896273578417596861e-02,1.503582664699727900e+00,4.880949136393303855e-01,4.771425931478565641e-01,-3.208387084021316893e-01,-3.876374163228947234e-01,4.924073573453889852e-01,-1.193673121534392090e-01,3.465709049751436455e-02,8.084870623308108017e-01,4.212036433075035391e-01,-3.586411516095889818e-01,2.598556784619041049e-01,1.390520842332691576e+00,6.021202219038226389e-01,-2.487251863398951546e-01,1.825386483080357891e+00,-1.106175939012600917e+00,1.607536645294141309e+00,2.360720905926093627e-01,6.819968935276293776e-02,1.044077130229520423e-01
1.333277017527150221e+00,2.856103881820593937e+00,-2.074811435077410504e-01,-9.184887915352946131e-01,2.031488419991553385e-03,-2.215973228745362067e-01,-5.620274408519780884e-01,5.769730865133837483e-01,1.845856141680674023e+00,-3.008631782167013879e-01,-2.966647023149525109e-01,4.964747093214737506e-01,-4.111829776533096892e-01,5.311783320357604810e-01,-3.172037528791105676e-01,1.759453078111883340e+00,5.272512031674860822e-01,-2.784668426306896594e-01,-3.762029362797107979e-01,-9.692839854428569879e-02,-5.571159179087687985e-01,1.860207843483090984e-01,-9.034562344148548974e-01,6.460988078453340500e-02,1.566872006672905826e+00,5.089840941638137384e-01,-1.825937144976237658e-01,-4.073658781752992342e-01,-8.129667625012636512e-01,-1.068147048903201446e+00,2.212192719023901577e-01,1.774755642251651278e+00,-4.274759577583426284e-01,-2.133275733000368768e-01,-1.084586470216950982e+00,-6.005429562573812996e-01,2.290937481121024799e+00,5.073825081819341998e-01,9.768760290004468994e-01,3.916085547483327822e-02,6.399030647236568781e-01,1.280099933064958728e-01,1.777023354022157497e-01,6.180127490579651051e-01,4.078724471367904947e-01,1.017294600365527213e+00,3.055923770757162039e+00,6.733801827040988286e-01,6.678145428475464052e-02,1.551806006906202740e+00,4.008872504539175985e+00,1.314581554091859950e+00,8.939466281615815468e-01,-1.112049208603322070e-01,4.292278610706082853e-01,7.210269403679165912e-01,-5.072303882198516689e-01,-2.129425107025461616e-01,-1.648887456081987057e+00,2.886403625713802601e-01,-4.460337715832061178e-01,8.780977740709323687e-01,4.947909926167336492e-01,3.000015443219813949e-01,1.159183730696470294e+00,3.397237881333182163e-01,-1.829911021750167954e-01,3.686856839894703253e-02,7.559053803100113100e-02,9.936562582493790874e-02,2.500356068396540010e+00,-7.259275974806609355e-01,-7.889126513166360155e-01,-1.578566631931512532e-01,1.205087928744509734e-01,5.747091042879137746e-01,1.404701051443996707e-01,3.723858957247680457e-01,-1.269231766101644787e+00,-4.472737490027345331e-02,1.393572135285956026e+00,-5.094532882369562365e-02,-2.074425746198460263e-01,1.071863525115400284e+00,8.608024587707577835e-01,-6.755189466088675765e-01,3.788493958052947530e-01,2.663537289261082019e-01,7.391763913961499899e-01,-8.315562985547984010e-01,1.684107595690416792e+00,-1.349123775576719586e+00,1.811981650753003770e+00,5.299455720198079089e-02,-6.563941883730317617e-01,-6.141495944875047241e-02
9.237964306348617205e-01,1.962293021611640764e-01,-1.157142564828130132e-01,1.379519590206528257e-01,-3.317032381329257373e-01,7.051444412936000994e-01,5.484364312181266854e-02,2.377384674393595576e-01,1.552703596673094655e+00,7.498504834039471101e-01,9.315011513476303406e-01,3.952123424768672066e-02,-4.607419723635797770e-01,2.164987443371570175e-02,-8.899898093058311588e-02,2.157469454297407552e+00,-4.091060466073445090e-01,-1.443942675206531523e-01,4.058109988100884191e-01,4.366282011004757324e-01,-1.044854669711600348e+00,5.703217644900638872e-01,-2.100483180849836984e-01,2.880460424090025562e-01,1.040061142215484180e+00,-1.271646990061253701e+00,1.548345556009337320e-01,-6.583570679189240105e-01,4.094254739583664815e-01,-5.942838707685682564e-02,7.118174969040707012e-01,2.597237411473745983e+00,5.188019639336521882e-02,-4.688844314853392592e-01,-4.365892214417725348e-01,-8.951492890376695488e-01,1.072904567994272140e+00,1.335017569765861722e+00,1.192949178292090906e+00,1.938298820579385406e+00,1.271672059940096577e+00,2.602876860930019021e-01,2.550280765923803594e-01,3.881207114283748427e-01,2.406278770774877840e-01,5.884224933854456108e-01,2.915755029105625784e+00,-1.819946216107664327e-01,3.759418410321536674e-01,8.886174035732337106e-01,4.551837444661503085e+00,1.313798209096357361e+00,9.342074794787216252e-01,-7.283721963467295613e-01,-9.948238065244998651e-01,1.555814542219628116e+00,6.504132740610688579e-01,-4.102911867099724441e-01,-1.820047301892664393e-01,1.831767312625751210e+00,1.611026621866073594e+00,-6.934370264800346906e-01,-9.520633495729267093e-01,7.768802098144997892e-01,9.794915836399775699e-02,-6.757239432372954546e-01,-3.552902681235527993e-01,1.468762028776005479e+00,-4.803036490431921157e-01,-6.627864995994914299e-01,3.407329106302001698e+00,-2.664168621800833137e-01,4.519969287705331573e-01,1.096260207840980216e+00,-1.464487864008018336e-03,1.726887490449876550e+00,3.955912104718086186e-01,8.554526361353533837e-01,-1.299823561926358728e-01,-6.256127141076469611e-01,-4.842186940397474881e-02,4.887456316941979906e-01,-9.250854029451149874e-02,1.008060536234069771e+00,5.274526817253639699e-01,-7.832628012829712105e-01,-1.446447096262346022e-01,2.737293259568377657e+00,6.981337078894217507e-01,-4.942801911240587431e-01,2.468784205339530580e+00,-7.636561096802285675e-02,1.160134497210771887e+00,4.251673825507470417e-01,7.231038852367597247e-01,-2.297950188000437988e-01
8.858990893164599978e-01,8.455159215426290009e-01,6.095247855521622737e-01,-1.601226670380956341e-01,2.546555823765939142e-01,-1.125364757060579035e-01,-5.247884815606165265e-01,-1.824457771938451378e-01,1.328284879001233154e+00,5.468333964750518028e-01,3.293343765913314680e-01,5.666788983668927249e-02,-5.779087192582055277e-01,1.380530654916484745e-01,3.411002403155873886e-01,1.613812946965635930e+00,-7.384321169112133543e-01,4.294101240324992297e-01,4.099326155099152769e-01,6.337337816282485603e-01,-1.362086763368532960e+00,-2.092540838903693690e-01,-3.503231445141677947e-01,4.023338310052827493e-01,9.080196600505981985e-01,-8.006010199419683060e-01,5.992640524352107478e-01,-6.103379536826691876e-01,6.511100845030508566e-01,2.028821375600358135e-01,4.668357975532934079e-01,2.521130778311360565e+00,-2.765432353548019639e-01,-8.886141773229581098e-01,-3.937406780806707585e-01,-7.150391354540234223e-01,6.485695034804843662e-01,1.697386950184635701e+00,7.276568335246851316e-01,1.832088057445478091e+00,8.032771889999257287e-01,2.743476296280044080e-01,2.554155351731643431e-01,2.024651552244287056e-01,7.015734417642075504e-01,8.223997173687657147e-01,3.160355943726134598e+00,-4.880091292020306559e-01,-1.463975065097086747e-03,2.060485207240241756e+00,3.285188079578357012e+00,2.995814168521380161e-01,2.076925487058247366e-01,-6.335078148685296950e-01,-9.067395261020302355e-01,1.410762592797922599e+00,3.946019761393574354e-01,-1.161868660516235247e-01,1.056436067101649279e-01,1.452854646952688178e-01,2.132888920063995997e+00,-2.897733503903776597e-02,-6.104436222297697778e-01,1.469515912374572242e+00,4.811479205274259430e-01,-3.143380563235145253e-01,-2.050561888281559608e-01,1.483697815567062817e+00,-1.481293449287957031e-01,-6.975465781437690804e-01,2.841218167582503895e+00,-9.404647308771358905e-01,4.203918024044208113e-01,1.178687765691605271e+00,-4.350980326724791514e-01,2.201101504371238526e+00,8.764238142265163845e-01,7.849247331977908804e-01,1.983769233137433474e-02,-2.061401551586169167e-01,-6.699828395254014968e-01,-1.230229642166205672e-01,2.663052457347524493e-01,9.506289072617692959e-01,2.307046469262336030e-01,-2.596826683719768436e-01,3.536115658400628137e-01,2.579059304444769829e+00,2.615923229564670605e-01,8.261308736405901243e-01,1.994063914919262936e+00,-8.587843255074617543e-01,1.114491061829108620e+00,3.643032551851031475e-01,1.094692888524845031e+00,4.578935437542898113e-01
1.090884985878022739e+00,1.547395833685666133e+00,-2.917002836825223211e-01,-5.394968490266909278e-01,-1.985989992060521181e-01,2.331118234070805595e-01,-1.712391201891838022e-01,4.040552946013930002e-01,1.449732259723015115e+00,2.117323049405530067e-01,5.096553556449584521e-01,3.385282815122041544e-01,-3.710020750375504495e-01,2.824242337975440553e-01,-3.997986844938871687e-01,2.071958783282153327e+00,2.247132176566559170e-01,-2.506826732104299182e-01,-7.574345125371198528e-02,3.256921187373560539e-02,-6.129366962289882759e-01,5.220144612059753886e-01,-5.680880699983177351e-01,1.447676546715681023e-01,1.463778118619222246e+00,-2.881009506346743354e-01,-3.272645436071661140e-02,-5.195336118681281867e-01,-4.036393783084006870e-01,-8.131887203350753879e-01,3.715255804161484710e-01,2.113430125229307510e+00,-2.420367274088859599e-01,-1.852861120012201379e-01,-7.859016434495865733e-01,-7.552571159452958760e-01,1.753390488367903455e+00,8.497409427303266316e-01,1.401714249394697021e+00,9.638915388110196325e-01,8.427257169377222468e-01,1.407752074652006691e-01,1.744102332522728949e-01,4.395465393300338475e-01,1.953782702197470744e-01,7.841741580799774791e-01,2.871761255020995218e+00,2.325605887639417835e-01,1.588404370996702175e-01,1.122066937199583059e+00,4.290543285366551274e+00,1.489845620130641368e+00,8.954312707469466170e-01,-4.184738389115407742e-01,-2.784244413319340583e-01,1.243181813081730924e+00,2.471450237319882948e-01,-2.066080279483541726e-01,-1.113474695849261842e+00,1.366222253246588858e+00,3.190425256132073395e-01,9.792000152603302920e-02,-8.970760086892655416e-02,5.655746166870820879e-01,7.141790689925294755e-01,-1.358926484944434909e-01,-4.050432182835121964e-01,4.760653088261669330e-01,-4.672679487470862009e-02,-5.717214381065588436e-02,2.831331133499367159e+00,-3.954402472896526577e-01,-1.820309198803984896e-01,3.082989923570317314e-01,1.355376774467671741e-02,9.895894129210752732e-01,4.704086700350973427e-02,7.751133205949113369e-01,-8.610979336624076108e-01,-3.072869923802492020e-01,9.381281579447565688e-01,3.496626711497973217e-01,-1.771155311317247905e-01,1.123180192476634032e+00,9.376807667550899339e-01,-9.101016457888582156e-01,1.427311398729346759e-01,1.205980108619445490e+00,7.052938035809841466e-01,-6.851834099831970448e-01,2.008682875871018680e+00,-6.354810217534045957e-01,1.308685042698569001e+00,1.412445953653715669e-01,2.029828740783646834e-01,-2.460706300002811764e-01
1.202949488395687716e+00,9.335664129543239653e-01,-3.051177030199681006e-02,1.859532504862260183e-02,-6.051609610102602899e-01,8.191996748984191612e-01,-1.966562636404391440e-01,6.977966428447361924e-01,3.233350223258171674e+00,4.428890212415493299e-01,-3.313781026818644615e-01,5.053078100607397150e-02,-6.491125242280565422e-01,-1.967774407917210477e-01,1.191706776674296142e-01,1.637319444283038772e+00,-5.654201444773123697e-01,-9.508100117517935546e-02,1.081028336722597294e-01,5.235702975254185043e-01,-1.318286845666892804e+00,6.619979346153292976e-01,-3.276256931816399209e-01,2.827920312962900473e-02,1.120972913175871000e+00,-7.243684837504013041e-01,-2.672981963661462679e-01,-6.948267349145640370e-01,-4.818759248264851136e-01,-3.114446058748620016e-01,8.145646300274186347e-01,2.882128741894043777e+00,-5.390402011876072041e-03,-3.737352097570464937e-01,-7.042831123327353282e-01,-5.371729943271434937e-01,2.062338930686392402e+00,7.797789561377964640e-01,6.259744005134406653e-01,1.334204891429235706e+00,1.623638363474994240e+00,6.179921234470755476e-01,5.254310571771083627e-01,5.704658829612295756e-01,6.703976211306956756e-01,6.251452815838425270e-01,3.299111617254371076e+00,5.596521726771385152e-01,6.159499301735005261e-01,3.722383726927023240e-01,4.872716318064975738e+00,1.880986140058868106e+00,1.459019617920090717e+00,-2.462581991718343355e-01,-3.992985042910779936e-01,1.082432198998318995e+00,-2.313052431022439848e-01,-9.819631637851072847e-01,-5.356139385034792699e-01,1.742488028034227199e+00,6.082965763275427484e-01,-1.613592796042920829e-01,-6.816603894399355656e-01,1.387048731732947182e-01,6.901002035236232235e-01,9.292831856234243237e-02,2.078616391884322567e-01,1.912269088884391177e+00,-5.564129873414848104e-01,-1.205642940430190935e+00,3.380419510077061318e+00,-3.614817282386124098e-01,-5.904743177465869575e-02,2.463284179297722809e-01,6.059405361036650506e-01,7.856051623055477773e-01,5.253287424532950833e-01,-5.868472630229137899e-02,-9.707814806104346772e-01,-4.689195691228350005e-01,2.970087778356343966e-01,2.733815439385758328e-01,-5.517683411706451047e-01,1.228260380606648328e+00,2.071360609025646449e-01,-7.971886916315328309e-01,-3.055348805305035387e-01,2.490358168074223499e+00,1.207999519617789286e+00,-1.862508023399272572e+00,2.723039347089707185e+00,-3.042920377174156421e-01,2.154654203624843500e+00,6.763915254419718970e-01,-1.316450960533797288e+00,-4.154655884061622673e-01
1.337909208184024479e+00,1.186136736974760186e+00,-2.021271289699814178e-01,7.691339226569493537e-02,-6.804897281262423103e-01,8.211111076146344612e-01,-4.491687239824206368e-01,9.380059066304665683e-01,3.488814885800811894e+00,4.738962284366174949e-01,-1.558487832870932288e-01,1.914986079102863892e-01,-6.062289554648729872e-01,-5.856666066246736524e-02,7.459139613614518272e-02,2.007598885637526198e+00,-2.323141283327307682e-01,-1.857272299317579700e-01,1.016570710588173831e-01,4.920891364443488181e-01,-1.251517908247405497e+00,7.916369989131410989e-01,-3.307894303477690867e-01,1.224475238677399935e-02,1.023748577803925919e+00,-9.465741293175919946e-01,-3.635891729718297993e-01,-6.262705320993033897e-01,-9.272189879359848952e-02,-1.550620242781701741e-01,8.481046962855812721e-01,2.699307866593768868e+00,2.092400616711981298e-02,-5.128335899773983630e-01,-7.321908085394300825e-01,-6.583622359180307804e-01,2.096509030432175180e+00,7.952287578490665476e-01,4.487405333733995860e-01,1.362785553032237029e+00,1.741053990488478753e+00,4.581296442445222938e-01,5.957649439240512157e-01,7.603147625567259205e-01,4.680748498798732449e-01,5.826717868172135439e-01,3.486534761786013625e+00,6.301741400682742134e-01,6.334587525780784878e-01,5.928754138366766346e-01,5.107559439616293773e+00,1.719502832256977642e+00,1.731704622566539786e+00,-3.208741024246581919e-01,-3.864404888106532932e-01,1.005799759185132647e+00,-1.868298306830796784e-01,-1.004264258101217111e+00,-7.035732501741498446e-01,1.753070957777560501e+00,6.857069579868008136e-01,-5.769985867919674716e-02,-7.525553557680562111e-01,1.243616161486988947e-01,4.394211713006472841e-01,-2.024090249577013001e-01,2.610722243810245091e-01,1.758972768823785060e+00,-5.901655291038288009e-01,-1.386117462204224715e+00,3.749715242551256544e+00,-3.584221472772786687e-01,-1.540874729599829851e-01,3.606851351455748200e-01,6.311645214909034074e-01,9.050602967492018536e-01,7.036893397450942889e-01,1.674319440489683841e-01,-8.019505280115224455e-01,-4.481012347203804369e-01,4.565357697350341248e-01,4.433850862831584250e-01,-4.801535117866085334e-01,9.251477574379755042e-01,3.123963385882745358e-01,-6.917559446312776528e-01,-4.008428508653172906e-01,2.619952508979204620e+00,1.148829348887172586e+00,-1.974335577412127396e+00,2.954768121598503328e+00,-3.326034867617035928e-01,2.309734999086338281e+00,5.805587176060102994e-01,-1.139367415478974355e+00,-3.669084319108781855e-01
1.054543608532301668e+00,1.250474495651064721e+00,4.762990391675536728e-02,1.150099888378564028e-01,2.475404064291074624e-01,3.393840276830016878e-01,4.370364741565191946e-01,-4.204676634009141267e-02,7.894317939647268467e-01,-5.409787800863216645e-02,-2.542151893895505665e-03,-2.418217121004934134e-01,-5.300565383888262705e-01,5.423738933240271898e-01,2.344771600398544154e-01,1.254170477629422686e+00,-4.660620290815921107e-01,-6.887311598657127609e-01,3.944246821706816064e-01,3.358956916807623316e-01,-1.028002669344885822e+00,-5.061603458510268716e-01,-7.789647320060503199e-01,4.870870311286568111e-01,9.589298581219045658e-01,-1.949963619025704697e-01,1.027821078388904130e-01,-5.823059366058845887e-01,6.725329887156616948e-02,-1.132525960561774347e-01,7.753107954898058596e-01,2.067948011534580299e+00,2.194294587114828388e-01,-4.229184375996394851e-01,-7.806972258831736955e-01,-8.791085628744433889e-01,1.300333240854624428e+00,9.516406249158263497e-01,5.392432547008356725e-01,2.846844798871748239e-01,9.389207178614729088e-01,3.225546665654501766e-01,-1.773692386550734246e-01,6.521065000696117941e-01,6.977709990387801486e-01,1.108785588248830001e+00,2.499705967209471247e+00,2.616138494922980451e-01,4.824906972698631002e-01,1.174724819381853802e+00,4.273364615503326469e+00,9.753295740842887751e-01,4.348749815111702111e-01,-4.987120730839953442e-01,1.564768989688536394e-02,6.787474553384857945e-01,-7.826360325136122453e-01,-3.445950288447098830e-01,-2.752854124814509973e-01,-3.133303317482629691e-01,1.131124181964992870e+00,-4.426366262468507395e-01,-5.275635463202350550e-01,-7.274237252697690614e-02,2.750116844719374676e-01,-2.887797015340282103e-01,-3.319654542291509136e-01,1.093253233112336353e+00,-1.069468783726137184e+00,2.233274021217804828e-01,2.762385629995532277e+00,-6.237222122466798968e-01,-1.944317271116116630e-01,1.333080024763640958e+00,1.030824351614043483e-01,1.695795853270011921e+00,2.852286423666295367e-01,-1.711687755419961654e-01,2.102742003946622695e-02,-8.617485565292026806e-01,7.710200571966252525e-03,-5.851129447529370697e-01,-3.812548352761230275e-02,1.061176483884884725e+00,-1.724814939776161404e-01,-2.726155450001428449e-01,2.743638678707708278e-01,1.483095193332191641e+00,8.323043691316838188e-01,-2.055285963009513550e-01,1.403824590548820694e+00,-1.033589753851273940e+00,1.523535063471430639e+00,5.560654634966480936e-01,-4.132493789571580201e-01,-3.152489309527828354e-02
1.099994276668027515e+00,4.048012945900000270e-01,-8.288180174758522090e-02,4.498168012377325997e-01,-3.275699990275396933e-01,7.877153196373190003e-01,-9.216710714552284189e-02,4.191210327348671716e-01,2.084525495222812275e+00,6.829259802447966710e-01,6.194882147856564103e-01,-3.786826101512832943e-02,-5.415587970290998143e-01,1.480726161159151011e-01,1.987137241498838636e-01,2.110988926616076622e+00,-4.491585666874394200e-01,-2.999335313656150692e-01,5.355115825924139372e-01,5.997341578325445788e-01,-1.271947846691347639e+00,3.641900013300574113e-01,-2.651674195387855315e-01,3.342134575488333592e-01,7.328665233148096148e-01,-1.435423830560742076e+00,4.029918031014656510e-02,-6.364715064855620552e-01,8.435285495173809878e-01,3.806910289567371208e-01,9.350097374269001893e-01,2.547908990423484621e+00,2.270580988043675030e-01,-7.310808759450859728e-01,-4.811860782217639021e-01,-9.646801942993167289e-01,1.110885431747360874e+00,1.327188996367852036e+00,5.213684846075867796e-01,1.733206847092408243e+00,1.554067793234463313e+00,2.740877947382592827e-01,3.075149487379076896e-01,6.770134074582907502e-01,3.502845506779249107e-01,6.413118575415259759e-01,3.124796653208621766e+00,2.137487890950948155e-02,5.681842911258583317e-01,1.030587914422583351e+00,4.827065127594164728e+00,1.051469882858304672e+00,1.172831812321663669e+00,-7.347337140750789253e-01,-8.292029164055987334e-01,1.209267896903454265e+00,1.751770744521401468e-01,-6.478023525147595940e-01,-2.872320210595658008e-02,1.253852325789913680e+00,1.896094343549973082e+00,-6.805467677813445970e-01,-1.193367760655413390e+00,4.683074886064780840e-01,-1.944781839442117910e-01,-8.653685625221163580e-01,-1.011426512591646620e-01,1.784255531659509675e+00,-8.948903548463694735e-01,-1.011012533227558352e+00,3.804598577992595487e+00,-3.881027813625953504e-01,3.042375036005523503e-01,1.417189393366701244e+00,1.899983916983232213e-01,1.949239715929820038e+00,7.759675429426751148e-01,5.443018782543632694e-01,2.010358227750639326e-01,-7.506511152528910769e-01,-2.733677982220931169e-01,2.919290891775508934e-01,-6.769058063436125816e-02,7.203362518122398139e-01,1.174869791740521530e-01,-4.266670817725501941e-01,-2.562219873593689079e-01,3.113498561862016345e+00,7.886574296086094060e-01,-7.230353157538683684e-01,2.628919207259329038e+00,-2.600272178528455491e-01,1.638369342397727690e+00,5.661923102606636338e-01,2.461662679714178292e-01,-1.152781405235285273e-01
1.052913719732940567e+00,1.217189855688805888e+00,-7.647234468804452179e-02,-3.119468494463561448e-01,-1.127052218782635812e-01,1.723367172380665946e-01,-4.107374479129263789e-01,3.047977860301567254e-01,1.490492629658421553e+00,4.545896124860932530e-01,7.119549138907367292e-01,3.068558418668143606e-01,-4.104019808853208717e-01,2.673958453235105726e-01,-1.769695792319031513e-01,2.204859105250077000e+00,3.202750086227107440e-02,-3.057023890492004126e-02,1.470291823314100188e-01,2.553102765074188318e-01,-8.529855694231861518e-01,4.033961866632566617e-01,-4.243395622438897452e-01,2.410123755698762027e-01,1.186611447425178767e+00,-7.620050387653759527e-01,1.765843119338638967e-01,-5.283359150485259503e-01,3.064910005893786149e-01,-3.013298763599456809e-01,4.411989359854992521e-01,2.209937369765138548e+00,-2.201189340220144897e-01,-5.305105567410686174e-01,-6.004168542348755633e-01,-8.414428167060334918e-01,1.261950198278038782e+00,1.244753085780781809e+00,1.135033937090684120e+00,1.492103613662080219e+00,9.259682820297338024e-01,8.586972364525635726e-02,2.539550655071810548e-01,4.282557481591051651e-01,2.103987156115930124e-01,7.251638335772949695e-01,3.072179674436840813e+00,-8.304863197403225539e-02,1.115118604352255960e-01,1.552095030813250176e+00,4.092774565117126784e+00,9.696772857863644735e-01,8.056013766246269414e-01,-6.015938696934813867e-01,-6.432045024005015321e-01,1.367407773961220263e+00,4.943583806724912155e-01,-1.733051370198119279e-01,-6.798867543884905551e-01,1.128561072079094618e+00,1.178598982374733373e+00,-7.760094118083094017e-03,-4.207154863666930922e-01,9.720610999423957566e-01,4.012018420211191927e-01,-4.705373625011297634e-01,-3.417480307168362930e-01,8.170868163601814338e-01,-9.808342798002239737e-02,-4.393726491424883029e-01,3.119171047514068817e+00,-5.404900471796887373e-01,9.699503592686688214e-02,7.725907692303288776e-01,-1.708014722229260207e-01,1.588915906130463185e+00,4.509103261043101996e-01,1.021920662426956117e+00,-3.650653648473030088e-01,-2.861951006849584589e-01,3.661606057792569091e-01,3.671477607441919755e-01,4.418608558349190751e-02,8.775649579705063763e-01,7.784969565801771463e-01,-6.515896031902238539e-01,1.245952594360130727e-01,1.961759978070527266e+00,4.831763267502887649e-01,-1.458725594987322904e-01,2.211894902980294564e+00,-6.073984485067380756e-01,1.228011762164154197e+00,1.676438510169086515e-01,8.385645545279334367e-01,1.972718994078181964e-02
9.698679834276586753e-01,7.082381628388033645e-01,3.611630498827368696e-02,-4.133575941051221836e-01,-5.491047977524775581e-01,5.953660127617386166e-01,-1.616958227590507557e-01,4.243821035452413071e-01,2.577521429571894007e+00,5.621689724318950088e-01,5.690311777320117281e-02,1.803066173232809044e-01,-5.585465064981207650e-01,-3.613634855274429625e-01,-1.910837269826832496e-01,1.701772020394046514e+00,-5.484343585040848401e-01,2.397836238754368909e-01,-4.465322311636006625e-02,3.625560743898726956e-01,-1.087345207773046774e+00,8.677165747077719704e-01,-2.365736357313579230e-01,-1.963288041055558097e-02,1.475576474019969941e+00,-5.481889490968052669e-01,-3.730246289590571918e-02,-7.144653677927051971e-01,-9.046262642077750327e-01,-7.884434948615863803e-01,4.887386799699119377e-01,2.955486208836845652e+00,-2.926926104459968148e-01,-1.403878572267068248e-01,-6.094282019770881353e-01,-4.343180122722555270e-01,1.900829077068303175e+00,8.993073337197252659e-01,1.425300787222853582e+00,1.717075862641159301e+00,1.215894600920758961e+00,5.815141507305354729e-01,4.943789330420833017e-01,1.655856502000804253e-01,5.609322013407593843e-01,5.568898849398455919e-01,3.122478060367992914e+00,2.051210910080445426e-01,2.968691180659013829e-01,4.113678854830927212e-01,4.331249929867006188e+00,2.026065723933685891e+00,1.077384102779634034e+00,-2.542312913012501063e-01,-6.817317341196145186e-01,1.560827457068191038e+00,4.468034144369132932e-01,-6.295556207747257105e-01,-6.674752037911566571e-01,2.325644709816951483e+00,4.159052792944036847e-01,-8.129902662870058805e-02,-3.655115854187943603e-01,7.280424559375767712e-01,1.079787492481656397e+00,3.282316231013467367e-01,-8.919603141466980745e-02,1.537418562012570877e+00,6.403248838043626434e-02,-8.532410152213185661e-01,2.861127551744325093e+00,-3.029767298427251676e-01,1.753708189566838827e-01,-1.299425694928512953e-01,2.705227651826060953e-01,6.266870810184392848e-01,1.600037786595975287e-01,4.288833589256274559e-01,-1.337188940719395092e+00,-2.206367866478421425e-01,4.591345030348549239e-01,5.068085137370034188e-01,-5.075244785607784248e-01,1.546400042066099267e+00,7.293659622171495549e-01,-1.177197603813860738e+00,-1.130863964680788314e-01,2.111535361733084759e+00,9.913865077339290011e-01,-1.340373496504682516e+00,2.533606151288529063e+00,-1.392676113829227069e-01,1.514326750712542413e+00,4.694638081942829055e-01,-5.138399674783675763e-01,-4.407711783014086615e-01
9.753911398765435781e-01,3.536214347396865465e-01,-7.434482204318797194e-02,5.581737290182997580e-02,-4.692107903405093872e-01,8.433657193811943120e-01,1.953506869629955123e-01,3.459763349093563645e-01,2.142615693563654666e+00,5.753654634954968872e-01,2.940447909485750522e-01,-4.480997281548698696e-02,-5.537488288965380923e-01,-1.599809618666460653e-01,-3.666560903659132897e-02,1.730527345493851232e+00,-6.237412960143247087e-01,-1.651578865252271711e-01,2.524959698792351159e-01,4.452113795781481587e-01,-1.143474472543827947e+00,6.104296676362700458e-01,-2.715344291211975181e-01,1.636586678295992026e-01,1.179512878847656765e+00,-8.726795351700724623e-01,-4.564375600288678170e-02,-7.189468996733563433e-01,-3.336956578034876442e-01,-3.537530193307020232e-01,7.564342689314181856e-01,2.821379252336131849e+00,4.693202298715820620e-02,-2.562599765087507087e-01,-5.696648048988598445e-01,-6.732563190215622440e-01,1.594255255733111332e+00,9.895011176402239705e-01,1.120504312451580553e+00,1.575682751280874871e+00,1.390400269019629764e+00,5.209119924712362071e-01,3.141333867470085250e-01,3.791552822374736342e-01,5.094246900181441662e-01,6.212961054120980098e-01,2.913186035891078163e+00,1.791033572337027424e-01,5.193372482374154497e-01,3.555532376967628916e-01,4.705466059721119976e+00,1.825462777482776744e+00,1.079385986275696485e+00,-4.558827504079489001e-01,-6.897657272317923027e-01,1.379563932991727526e+00,2.084960819452680858e-01,-6.829086523391869612e-01,-3.181507369271039942e-01,1.957389012055903654e+00,9.584483276996370593e-01,-5.778922468418036251e-01,-7.813050719737635319e-01,3.672183117001136532e-01,5.085938883735673377e-01,-1.515192474836696279e-01,-1.630054978168372082e-01,1.709603814770963126e+00,-5.342857332156045747e-01,-7.279875746922044311e-01,3.187456772726670273e+00,-2.267216366043754150e-01,2.445020805248249163e-01,5.947185461447040966e-01,3.207253982586036889e-01,1.119030803484988734e+00,2.434901472995091853e-01,2.760721167027449519e-01,-6.731998267456961171e-01,-6.216863466972877283e-01,1.407651898416321101e-01,3.353450671580967546e-01,-4.016245033042070700e-01,1.324837478190618700e+00,3.601314026352376851e-01,-9.307957477501038746e-01,-2.018724670614358563e-01,2.457252387744192745e+00,1.033949450143494930e+00,-1.228552360477366934e+00,2.448444937225867424e+00,-9.512586232964875821e-02,1.524318722471034171e+00,6.000399089707332267e-01,-4.164240188214018423e-01,-4.427058739720453051e-01
7.551745645577708776e-01,9.128219238040088390e-01,4.143120107793819562e-01,-7.074379495904685733e-01,1.002332055313453901e-01,-1.359420790714014338e-01,-2.966856657107464490e-01,-2.082672180601226053e-01,1.036163795726446679e+00,4.680658076585414440e-01,4.302465857623379852e-01,2.125270665415419369e-01,-4.773599264035764955e-01,-6.038623204639796682e-02,-1.448873440331930884e-01,1.594619084128683140e+00,-5.432726626518560309e-01,5.116134554690296987e-01,4.981870469794954376e-02,3.062140535848055789e-01,-9.690358264722505055e-01,2.199786844587601209e-01,-3.634213028999643824e-01,2.209707558071345446e-01,1.473132890594997413e+00,-2.848563592581212500e-01,5.190804344587256480e-01,-6.330103463669904951e-01,-4.330401015234698336e-01,-6.930510649441308235e-01,1.640609420203513746e-01,2.577946785487919001e+00,-5.263241862905951862e-01,-3.477366375436548585e-01,-4.909659665487209335e-01,-5.244343635552708438e-01,1.091619497600661681e+00,1.376036807962174535e+00,1.639060940125578902e+00,1.736565832025255052e+00,4.995378056741053840e-01,3.322439235126830592e-01,2.253522066177917615e-01,-1.039500543921964976e-01,5.809385609117947435e-01,7.653075317341417882e-01,2.896130674622672263e+00,-4.167599588710116376e-01,-1.703713120066976394e-01,1.531003790167518197e+00,3.176073084940534308e+00,1.058354016829069710e+00,1.333416016395031489e-01,-4.421441728543958893e-01,-8.247303968557604392e-01,1.713556805827091134e+00,7.523126894199645420e-01,4.493585004380806769e-02,-4.473158420133269697e-01,1.121853445845758523e+00,1.080903549628303928e+00,1.248764022949996333e-01,-8.161647597678484134e-02,1.523579626016282607e+00,1.110517390668450899e+00,2.151134260188079517e-01,-4.496270844542089029e-01,9.551080529848995360e-01,4.171233685284575499e-01,-1.993106647450240132e-01,2.247428464026786976e+00,-6.946621411490050413e-01,3.537194926885056101e-01,3.259427622476310793e-01,-4.454347188111510425e-01,1.385122445285623005e+00,2.026901706845888884e-01,9.360362454505988250e-01,-8.508657522342836232e-01,-1.649791217129881193e-02,5.916526687615830671e-02,1.562686794440232008e-01,1.616512031436179164e-02,1.459555923409478151e+00,8.384475994740451243e-01,-8.844871648699227373e-01,4.370813792885357985e-01,1.672359310470377780e+00,3.687094419004299795e-01,4.802262245560798282e-01,1.806949514657564482e+00,-6.414492510258164026e-01,7.583726435678703748e-01,1.969746918759563703e-01,9.931363805387360966e-01,1.080469144864630859e-01
1.048369873762631466e+00,1.279242855635203568e+00,-1.724916712552541087e-01,-4.335944052380079627e-01,-2.227314893253923289e-01,3.053114179576614240e-01,-1.534187984494109203e-01,3.499798497848694012e-01,1.596490870736777090e+00,3.121722111611501815e-01,4.484269122094460269e-01,2.614105526078564501e-01,-4.207929251161482420e-01,1.678230537527287125e-01,-2.891541767558230558e-01,1.974084919948766892e+00,-7.327639850859435366e-03,-1.468550314731462969e-01,2.736370766186095593e-03,1.509231019425458509e-01,-7.657577457215951622e-01,5.077393155775464795e-01,-4.878951819294631287e-01,1.543799639840786053e-01,1.391685737851396043e+00,-4.206673560183936678e-01,1.795023901757147877e-02,-5.652297182396470721e-01,-3.516357310558326787e-01,-6.823130858150983080e-01,4.297275316025246372e-01,2.293607143525926428e+00,-2.170671542302460011e-01,-2.423251627797462504e-01,-7.136502978591512392e-01,-7.188616770120929145e-01,1.654422994085215093e+00,9.397192604749882161e-01,1.330915151882570591e+00,1.171552227267534274e+00,9.286547139585832333e-01,2.274121395635349541e-01,2.211926899482215547e-01,3.879709794192172101e-01,2.946356835326910950e-01,7.480746726667562019e-01,2.915433844981412559e+00,1.609111545812580424e-01,1.955024886690734376e-01,1.050427901592200897e+00,4.260505993277541315e+00,1.479405890879923913e+00,8.740290277338901292e-01,-4.299360692248277993e-01,-4.144686871669164274e-01,1.305743327411132082e+00,2.838984060437602652e-01,-2.826072531274322897e-01,-8.912650801886358165e-01,1.428686332590503261e+00,5.452325273655712623e-01,-8.359162117814455950e-03,-2.322326232227081844e-01,6.344177343738506281e-01,7.000185831863730002e-01,-1.187422646073695853e-01,-3.426170507608415905e-01,7.757123163829371393e-01,-9.607304687326756465e-02,-2.429422770603266724e-01,2.873845561395235393e+00,-4.078144197921444447e-01,-5.158165839658469809e-02,3.753039267304272286e-01,2.899159924150926382e-02,1.072937229198280384e+00,1.384622983558213005e-01,7.022641300246781348e-01,-8.075859404867085090e-01,-3.281177930429267087e-01,6.839513715008843642e-01,3.302954199088413700e-01,-1.926425108425533217e-01,1.167964557422008109e+00,8.078026600350263209e-01,-8.883151140583770422e-01,9.972954925120303127e-02,1.529673225148357574e+00,7.273899361656840368e-01,-6.736719426663129173e-01,2.099899627611515829e+00,-5.450020561858062162e-01,1.323194388743389682e+00,2.342147223077349905e-01,1.636594029071431755e-01,-2.305213216831760170e-01
9.670180756201542938e-01,3.396572289590678029e-01,2.006835783705801513e-02,-1.484257131893025328e-01,-5.389234665959374837e-01,5.430982944753685038e-01,-5.936660257177679423e-01,4.678832403949185759e-01,2.472973175874541241e+00,9.838583287421366341e-01,8.640104120141671729e-01,3.268473124005871755e-01,-4.888835586427832114e-01,-2.516425987977282674e-01,-1.487017637295091621e-01,2.422004786821883027e+00,-3.438719500673604879e-01,4.126772542568830637e-01,2.142792308149120695e-01,5.063497794652105366e-01,-1.149564881690907425e+00,1.001225881370535920e+00,-1.289334366804717469e-02,9.129650098765071387e-02,1.146710197331128667e+00,-1.435482170977605776e+00,1.814258757664518051e-01,-6.555916328774848978e-01,3.440199114543303072e-01,-1.433971221993586287e-01,5.295640832581114399e-01,2.851935764780173077e+00,-2.686082877895390464e-01,-5.949166483247638748e-01,-3.596147509932871578e-01,-7.173355230981801611e-01,1.210343568522880053e+00,1.455818514689812160e+00,1.287768143337150617e+00,2.576030795093709802e+00,1.325884212186086764e+00,2.748999100537991569e-01,6.096257220005787403e-01,2.397741704400184748e-01,2.059879517020198891e-01,3.908406853465914987e-01,3.418004264344164600e+00,-2.671220872705647453e-01,1.792680721178798176e-01,1.107453184203488039e+00,4.303982343214518558e+00,1.312127399609866796e+00,1.162739306949928775e+00,-6.398773539898032769e-01,-1.275702534197596272e+00,1.846190009659161024e+00,1.139602982300269574e+00,-4.600719459686670731e-01,-3.563964961345912896e-01,2.429872523898845671e+00,1.549370008114008934e+00,-2.356142166132958460e-01,-8.252608923981150646e-01,1.367561181805397208e+00,4.089493682156631893e-01,-4.841008709686609457e-01,-1.487081726116220581e-01,1.591874682107162098e+00,1.091270285163646325e-01,-1.303022140415172059e+00,3.524063902149157101e+00,-3.579716584938136270e-01,5.476970954437515582e-01,5.611778429355448461e-01,-5.613526469734387431e-02,1.507989468176202053e+00,6.451990757866621351e-01,1.249567988644123773e+00,-5.571553929696771990e-01,-1.814650007294112410e-01,2.681325450935645449e-02,8.802985326131600452e-01,-1.276916233750919893e-01,9.905065412901372657e-01,8.864067244491905528e-01,-9.246614062178495352e-01,-2.166772969222686140e-01,3.085415770636656951e+00,5.782817827626359763e-01,-6.229778635367189121e-01,2.981871448090366528e+00,3.604814343236162344e-02,1.256886438585269605e+00,3.066059582912334935e-01,9.238770799474633755e-01,-1.363490127486072234e-01
7.369302129464272433e-01,4.471690113882815787e-01,4.760528557693399776e-01,-5.976831910397132352e-01,-1.664891825859680652e-01,5.671789635220697567e-02,-5.362115872217110280e-01,-5.471588884439966549e-02,1.754126387615230875e+00,8.178936144893320659e-01,5.460681553014736789e-01,2.694586580242003260e-01,-5.247568985197955671e-01,-3.552353762118911629e-01,-1.084452644207345440e-01,1.817118560961670459e+00,-7.150492256282996451e-01,8.179872415626410209e-01,9.522431932084521322e-02,4.789601843289362781e-01,-1.169550285667361411e+00,6.036914491460718679e-01,-9.905453715848228091e-02,1.251396174641802583e-01,1.404812419645438126e+00,-7.739447796897627185e-01,5.238514905449209724e-01,-6.935051998771409876e-01,-2.656343640028485664e-01,-5.171054663437044674e-01,2.181157275292387454e-01,2.944523255045302434e+00,-5.715088951197825340e-01,-4.646167357780219276e-01,-3.350511833862118705e-01,-4.680345314185380134e-01,1.035337000301342902e+00,1.548546131869157350e+00,1.651394905796960577e+00,2.462878158907710002e+00,7.717781289353276009e-01,4.095438609189275825e-01,4.840907173288571674e-01,-1.828119799189441563e-01,5.471489206335846678e-01,5.452240208167278279e-01,3.201740692324821946e+00,-5.400884154856897545e-01,-1.448099133549528572e-01,1.384575644732657818e+00,3.303430988491137033e+00,1.164165998500636734e+00,4.057854553676807363e-01,-4.857887068571565270e-01,-1.238200260890422122e+00,1.998928658831559346e+00,1.178718898745802601e+00,-1.333953878110397673e-01,-2.601918143535701944e-01,1.874707688482217804e+00,1.394077577801288603e+00,4.803765950234384352e-02,-3.532592792200619503e-01,1.830628470626786353e+00,1.060769941494392521e+00,1.362266392356690503e-01,-2.938747482540979283e-01,1.428231445224230622e+00,5.648180396854750596e-01,-8.351349174236413209e-01,2.595596028330167560e+00,-6.186196132146319915e-01,6.242860791968560807e-01,2.309505540955232306e-01,-3.913134862566887695e-01,1.405234411231020220e+00,4.227777286317770389e-01,1.153053263914408877e+00,-9.116210667916200272e-01,8.699700416977929063e-02,-1.645928773553743119e-01,5.083797912935904550e-01,-5.041080023795485587e-02,1.435245559514228830e+00,9.200674562161044179e-01,-9.958283681526867159e-01,2.136146232282530033e-01,2.456202742542886064e+00,3.832495741817427137e-01,2.205130557223838328e-01,2.360344268428549608e+00,-2.744078122597934932e-01,8.224982853017924755e-01,2.567001691437963973e-01,1.132882450929977747e+00,6.731648923470973100e-02
9.562167542596132774e-01,1.571724262647818282e+00,1.760094640443866099e-01,-6.182338147942826323e-01,1.716905154227323371e-01,-7.060076191726383232e-02,-4.892517916243904752e-02,-3.996453289873019843e-02,9.999794635842995660e-01,3.137688945675196073e-02,2.127437711135199416e-02,1.269982240047167754e-01,-4.750247011890794679e-01,2.629376349383557576e-01,-1.076928487291768377e-01,1.386955483568826253e+00,-2.854120466924094934e-01,-5.001591853004173915e-02,-8.699314801718448231e-03,1.633242267206700959e-01,-8.368188906117987047e-01,-6.831121526675909550e-02,-6.750241992608255748e-01,2.563206870839337959e-01,1.436580163663496057e+00,1.556366502639469629e-01,2.302155049940297071e-01,-5.678699763868469974e-01,-6.279997983581628862e-01,-7.758865835805399680e-01,3.069668648971763947e-01,2.213919574690852876e+00,-3.156660643291583357e-01,-2.365317234582464678e-01,-7.635346492260577378e-01,-5.968569732807678108e-01,1.521898100340019155e+00,9.583876759508958010e-01,1.252627960792780382e+00,7.197975655393049621e-01,5.584508215537614673e-01,3.158643802334495376e-01,3.940603612634375336e-02,2.415455879204082557e-01,6.323918003467353666e-01,9.779838229111261771e-01,2.715506151359591058e+00,8.482219540185062523e-02,5.324510328344957133e-02,1.367367200273999606e+00,3.602631770278552636e+00,1.186034969669341299e+00,2.969146341478723361e-01,-3.155091651916025475e-01,-1.648881105180440565e-01,1.140754447116492765e+00,-9.427813141879298753e-02,-9.128123718968778055e-02,-7.563936679434972721e-01,4.153554965960608580e-01,5.138792096730059322e-01,1.860877191874948933e-01,6.623938538454635094e-02,6.998034418089180697e-01,1.032091209525428210e+00,2.621988319260103451e-01,-3.921081992275062822e-01,6.734760254612552899e-01,-5.953373402240996065e-02,1.852604018757193494e-01,2.245582582917823533e+00,-6.889773080459551391e-01,-1.441142463715940902e-01,3.804756045907202733e-01,-1.505495857978099428e-01,1.142194433283759469e+00,7.949215940983900275e-02,3.695034151491704555e-01,-8.373516612058881092e-01,-2.601738619476169911e-01,4.554031114291478555e-01,-2.038277439991363349e-01,-9.071608582003723442e-02,1.372739483881828093e+00,5.568147148209875441e-01,-7.083499595488496059e-01,4.501911584296495739e-01,9.927615976310844026e-01,6.239291391615118254e-01,-2.599245256289672845e-02,1.487413495525644391e+00,-9.954781998291504230e-01,1.194388332667331909e+00,2.650009382955578197e-01,4.109349616498465807e-02,-4.314362713333852462e-03
7.458764101745479769e-01,-3.892999004660141482e-01,4.899219344239737206e-02,1.520211880668593807e-01,-3.539387935864471424e-01,7.666529753391043700e-01,1.690242969681708396e-01,2.795660151065562649e-02,1.393003695270676356e+00,9.701346425520707140e-01,1.094730952060177120e+00,-3.911912646953497052e-02,-4.831473321886406991e-01,-2.094713011114754941e-01,-7.934516675874320191e-02,2.073661865756608158e+00,-7.395840734632477265e-01,1.011027191120160706e-01,4.843740194011622036e-01,5.336712636994705994e-01,-1.148996891470823511e+00,6.528857482770283882e-01,-4.340671991686995135e-02,2.974142546314550439e-01,1.077949284986281953e+00,-1.444020080155639763e+00,3.260641965489021743e-01,-7.384395928373337359e-01,3.408320373210715903e-01,-5.854546127111381892e-02,6.795569406670161072e-01,2.886674283779794514e+00,2.644855186188010965e-03,-4.342478194171521255e-01,-2.778537856165012032e-01,-8.289708617813895675e-01,8.215759844811019175e-01,1.526077395799009917e+00,1.470081645036735774e+00,2.426891655922399416e+00,1.236895808420446663e+00,3.610663219951329994e-01,2.855469908539067236e-01,1.439287873446005728e-01,3.053258556606913698e-01,4.985478459769037696e-01,2.854643580510909828e+00,-4.579728422973279867e-01,3.145492251278847462e-01,7.464577788205342124e-01,4.337761860059877073e+00,1.386857345656051121e+00,7.420716992017402092e-01,-7.806164364864993654e-01,-1.344778547229828147e+00,1.872515949940301461e+00,1.027671968463655272e+00,-3.647263928610522399e-01,1.148242476106869914e-01,2.242224921650106229e+00,1.900451829223783307e+00,-9.040655682485124744e-01,-1.074057683356744342e+00,1.100365748017238410e+00,1.806358585712342091e-01,-6.118290004343924782e-01,-4.284104515027591376e-01,1.746085409123387500e+00,-3.332375330771290001e-01,-7.441012487700113809e-01,3.277409572425749484e+00,-2.166868659004181907e-01,7.744883672975214628e-01,1.098711968809329420e+00,-1.230467648431124161e-01,1.816378910736142993e+00,3.387544319346463273e-01,9.779607643782743942e-01,-1.531189897929987609e-01,-6.016054499140169876e-01,-3.593750179901042952e-01,5.822809418004619708e-01,-9.389747013562127487e-02,1.206724065654187106e+00,5.627783283946731219e-01,-9.318802596169675212e-01,-1.446798942265111743e-01,3.080513216397555709e+00,6.451010485619369517e-01,-2.547419565995110990e-01,2.518996434620229596e+00,1.803854984349445578e-01,8.621196334194305422e-01,4.780158869330446425e-01,1.068936465212765530e+00,-2.484159851128135421e-01
1.037573949697385478e+00,7.215709600042941041e-01,5.210927713768063185e-01,-5.171843255148056429e-02,-2.483778529999983720e-01,3.090243911701879842e-01,-7.049332540513641998e-01,2.972001325362291224e-01,2.866693759993432344e+00,7.035666859129821038e-01,-1.177780929112819952e-01,9.962170341959511455e-02,-6.893625031176868756e-01,-2.340054582505208258e-01,3.830331656967025378e-01,1.643526238804688733e+00,-8.746463133186255234e-01,5.436993418252175081e-01,2.891946995763631234e-01,7.711989517453785581e-01,-1.593318510406315225e+00,3.287672398061455836e-01,-1.739171352057414244e-01,1.609101063264640197e-01,9.204101059170681776e-01,-1.013044478759813849e+00,2.595794730653689930e-01,-6.884925322923050039e-01,2.573842359933355972e-01,1.543479989570459843e-01,6.344053409972150170e-01,2.977471812600812839e+00,-2.528917305335864896e-01,-8.318613588048260343e-01,-4.284516536166882439e-01,-5.269049816839598277e-01,1.244908147097958384e+00,1.441579068112680995e+00,5.259937248362083206e-01,2.093072774227121791e+00,1.333438734343890264e+00,5.237957028703879025e-01,6.040737533165231321e-01,2.964376958929114125e-01,7.935325024834077867e-01,6.133152095580638452e-01,3.550026633025985312e+00,-1.008923988801824490e-01,2.500228802673291617e-01,1.377274044887569548e+00,3.887532171926084690e+00,9.339924483178636549e-01,8.944507965174283148e-01,-4.328042902840629758e-01,-9.253941181129395899e-01,1.402975923160257210e+00,3.006360235195346120e-01,-6.454313836901011125e-01,-5.444473841782593304e-03,1.089921789821775455e+00,1.716762835665039511e+00,2.896685113478042473e-02,-7.723212126420750945e-01,1.179304590364488536e+00,6.527608804579130286e-01,-6.128709637732221438e-02,1.900603184846320071e-01,2.098653697062307089e+00,-1.732966403566117142e-01,-1.488545802240824223e+00,3.255844870366451094e+00,-7.660266697889592802e-01,3.594651356064187953e-01,6.390722584506558501e-01,5.015983988614393374e-02,1.599267817394392832e+00,1.009738032802855789e+00,4.693080849073045790e-01,-5.049352240705778927e-01,-1.522023597987826604e-01,-5.099078685754696583e-01,1.832803410446643411e-01,-1.222537856738359352e-01,1.054139536276181399e+00,1.822190533135760182e-01,-4.734818364364966614e-01,-3.719495901764430235e-02,3.111242353284747075e+00,6.607050950893780250e-01,-4.538545034337456707e-01,2.687869775652423243e+00,-5.036979725899922711e-01,1.727643140917618059e+00,5.664845192563177090e-01,-3.595074269824624635e-03,1.564454714629089915e-01
9.472938202428441423e-01,8.371376660813099058e-01,2.297693402410234675e-01,-1.289312823919676054e-01,7.225946281155956608e-03,2.275229439904254969e-01,-1.838491651944648697e-01,4.305087883788882852e-02,1.432298739748496086e+00,4.591786618337035941e-01,3.799425133432837165e-01,4.779576545336544635e-02,-5.249894791923810367e-01,1.361946728118875738e-01,1.071444740818964236e-01,1.713633981436829989e+00,-5.176159267976065959e-01,5.652929764315467454e-02,3.064120714447511884e-01,4.579281451545570980e-01,-1.142344443958310141e+00,8.637760137487859868e-02,-3.998255880038347199e-01,3.207661592638448855e-01,1.063174004817774687e+00,-7.123959137271366204e-01,3.035420559118591211e-01,-6.183291564413688768e-01,2.273902973498609370e-01,-1.137206126319187938e-01,5.531887098549902460e-01,2.473823910067076248e+00,-1.356426810639951852e-01,-5.783297846517996277e-01,-5.257111152755304939e-01,-7.463371037203553326e-01,1.082156871866132519e+00,1.336723873579710675e+00,9.380681578065892534e-01,1.509907261514778831e+00,9.610354441623747412e-01,3.014657480382825216e-01,2.048469474433256554e-01,3.247385528093140739e-01,5.477336467635177675e-01,7.894410231270454492e-01,2.973632209158220796e+00,-1.639541815508851752e-01,1.945922570264126961e-01,1.416691450154619503e+00,3.895848581541713873e+00,9.144759648298634858e-01,5.440576085619935887e-01,-5.657281497337959264e-01,-6.913564615797915813e-01,1.326040641967217715e+00,2.517741287110513149e-01,-2.728355756005284016e-01,-2.173085239199089580e-01,7.640162863313598729e-01,1.499531809875874089e+00,-2.147210273485957166e-01,-5.806758024020471920e-01,9.234785761502978252e-01,4.700479637930188304e-01,-2.856668980055329099e-01,-2.628708398345204200e-01,1.323594026874221896e+00,-3.195416312977137352e-01,-4.953206866953281384e-01,2.932084344841379142e+00,-6.355841622862945517e-01,2.436162486541209593e-01,9.507024636276082408e-01,-1.454321406706952091e-01,1.731353997922949084e+00,5.245511337685337949e-01,6.071815108038208786e-01,-2.520959725198173018e-01,-4.003477057697991670e-01,-1.573975923727858328e-01,3.834839436361531240e-02,1.834159617025249434e-02,1.067322686234360329e+00,3.521462854962780220e-01,-5.324110078284800540e-01,1.745025505303027802e-01,2.243159212105739542e+00,5.605210467060659507e-01,2.109130574867468244e-02,2.050274404102477632e+00,-6.330673118725241855e-01,1.247268015140145403e+00,3.953599764224502433e-01,5.189973904430500440e-01,7.771501933662372519e-02
7.992961115952702533e-01,1.405264845997030498e+00,5.301077769298357945e-01,-8.019095428374216628e-01,3.135228912118563360e-01,-2.625413348366672506e-01,-3.598227382133417640e-02,-3.383526664983729226e-01,8.596634833399787734e-01,4.109948559661388834e-02,-2.443977295272376504e-01,4.838627747593494954e-02,-5.443061346294971736e-01,6.363472640533950064e-02,-2.953208678167784651e-03,9.732929197416418932e-01,-6.945875049446355032e-01,3.017367360179543101e-01,-3.604324538340870909e-02,2.524848788221616402e-01,-9.887292173749848700e-01,-2.380575317346205200e-01,-6.354665912944214012e-01,2.531518177334948216e-01,1.541909965408650329e+00,4.102398254256731103e-01,4.417263723800853858e-01,-6.341647862836964356e-01,-9.893851153093535800e-01,-9.072882482499884382e-01,1.761947538348915820e-01,2.464186417030884257e+00,-4.846768153259045642e-01,-1.982341312368606778e-01,-6.903912000579423003e-01,-3.984003208055862943e-01,1.399620261300918100e+00,1.065219247396626878e+00,1.411354489881886165e+00,8.741143460619433814e-01,3.496849787160231093e-01,4.859024735731022893e-01,4.726434094383615697e-02,-4.907932749494132996e-02,9.123974706589926820e-01,1.010230151906448270e+00,2.672554450654003766e+00,-1.040564691551595367e-01,-9.397253285665778388e-02,1.410198681841074109e+00,3.039757913888405216e+00,1.158594322787786179e+00,-9.317113261158649351e-02,-2.143321809736732364e-01,-2.693753542678065660e-01,1.299423189137906220e+00,-1.864737935233101718e-02,-6.728835108198605308e-03,-5.435022095072802317e-01,2.712201069886466254e-01,5.570070112814483609e-01,2.849718761081880825e-01,2.208911005627701707e-01,1.025790848548135958e+00,1.431995678645610282e+00,6.691334713966468062e-01,-3.903021409129776575e-01,8.704850710848234252e-01,1.947450715895442386e-01,2.219000287713867037e-01,1.774276529440260486e+00,-8.324870700968212134e-01,7.291530609204011082e-03,1.659457748464008842e-01,-2.948780761103894088e-01,1.080326273044854180e+00,3.369602274342708981e-02,2.501681617061851659e-01,-1.071877687599634976e+00,-9.785283897088509208e-02,1.652569277751330112e-01,-3.857426876644110547e-01,-9.617690930777500480e-02,1.682865964042060236e+00,4.929330396359966615e-01,-7.675932507902247792e-01,6.288274533957329826e-01,9.392884114123449812e-01,5.587307746507961248e-01,3.549961803358364087e-01,1.278917523256080546e+00,-1.059436722852867163e+00,1.000062355712268758e+00,3.208187055276178201e-01,5.170311927146975517e-02,9.761578440506685217e-02
1.053131759385214306e+00,1.156278467277917388e+00,-3.323227574490252301e-01,1.694464671568685077e-02,6.193898131750989744e-02,4.189811795336036981e-01,3.512359669548555385e-01,1.422964231195324447e-01,5.549432891149040925e-01,1.425299577920333682e-01,7.569839189456442075e-01,-5.055446476750768969e-04,-3.680654551548976916e-01,6.045543856940142069e-01,-1.538497443600663206e-01,1.946474025125568996e+00,5.710025435159898910e-02,-7.649818414444372605e-01,3.255456532300795014e-01,1.316465742035894948e-01,-6.831715160432854095e-01,-2.230099641391913856e-02,-6.784836585559033129e-01,4.376556431965715754e-01,1.087871424331536385e+00,-5.411670519155207248e-01,5.083547424835285766e-02,-5.204543955671038225e-01,3.069726815594502334e-01,-2.648170821156540233e-01,6.729066632331189846e-01,1.876473767673961568e+00,1.752404517157210018e-01,-3.381306788792556306e-01,-7.402121716027328935e-01,-1.054139245688465065e+00,1.249943989331167682e+00,1.001865158755133045e+00,1.010317811651027853e+00,6.400404389142009265e-01,9.179852281188456420e-01,6.248482366030633228e-02,-1.471315878828443058e-01,6.652306406173348341e-01,2.099935794818886814e-01,9.496521285345439489e-01,2.499088809932252353e+00,1.330458543281485828e-01,3.870170028089812697e-01,1.194803405127124574e+00,4.542118666033016616e+00,1.089160866276739359e+00,6.689839189752753157e-01,-6.741558587310889639e-01,-2.276107569854388391e-01,9.693103591523962725e-01,-1.493034616364292133e-01,-1.707294722664973174e-01,-6.007821976633482830e-01,5.282031482735767280e-01,1.069183453833915776e+00,-5.159848911630526835e-01,-5.422171850131464188e-01,1.430169990879119890e-01,3.762454752741573039e-02,-6.875630441655979919e-01,-5.586696308937291189e-01,6.180399821757900369e-01,-8.182252544742484313e-01,3.040743846848248944e-01,3.044992924482762042e+00,-3.849957250664644559e-01,-1.023133637192403106e-01,1.315907540117401187e+00,-1.973041936793232254e-02,1.715803173910129598e+00,1.223910346347306111e-01,5.185741524911285927e-01,5.465245047218614260e-02,-8.227771727098045496e-01,4.370641667178216117e-01,-4.755614064010824094e-02,2.735048809883477983e-02,8.833091205542287216e-01,3.914589363690592072e-01,-5.221866861007962157e-01,1.593257335147683640e-01,1.467380679455634107e+00,6.934219339827751849e-01,-2.318834282098008459e-01,1.661737293887979527e+00,-7.264250047268135946e-01,1.216688821218377292e+00,3.022367259736330469e-01,4.154857494467791290e-01,-1.603990324203625195e-01
1.069706179671138679e+00,1.525177203709595641e+00,1.769086848211504082e-03,-3.245886341872992187e-01,1.257262750310729205e-01,2.062138493343357304e-04,-3.067706225309002055e-01,1.573535914361285648e-01,1.086674389871821855e+00,2.193376360329610530e-01,5.082250180024898700e-01,2.231408620451686697e-01,-4.194630759732818071e-01,4.624586337643988854e-01,-7.325794187489287346e-02,1.950241576996948556e+00,2.153971986387126503e-02,-1.770837914509144628e-01,1.703224048670823887e-01,2.244768558962452754e-01,-8.365015211836588360e-01,1.702408422027568147e-02,-6.006657349006463420e-01,3.335240947866097150e-01,1.144603924570382514e+00,-4.530767771059904248e-01,2.215529442194650867e-01,-4.960885353298520872e-01,3.052145422776162409e-01,-2.775517973292891405e-01,4.378845038826156832e-01,2.006324492764152811e+00,-1.803747156223254877e-01,-5.514467330832020231e-01,-6.825099519249482327e-01,-8.631840520426641294e-01,1.219207960704789873e+00,1.196026041066452938e+00,9.531269781140848663e-01,1.022289520034420196e+00,7.644445385204222676e-01,6.770045930373236320e-02,9.445531100697839022e-02,4.890336467493122674e-01,3.332024161440746424e-01,8.973785289941047516e-01,2.924044715739596789e+00,-2.767527235035804889e-02,1.012999485456972659e-01,1.762364861718358267e+00,3.910650382578737538e+00,7.496394207343561877e-01,5.664928697049640416e-01,-5.709704743238278590e-01,-3.750284680505904800e-01,1.125725310398570489e+00,1.136312922928088831e-01,-8.251531141821459581e-02,-6.669708663711636509e-01,3.690751555055682420e-01,1.150225302305468489e+00,6.259165920384135440e-02,-2.937041894998119185e-01,8.029972120379333944e-01,4.168465089327528794e-01,-4.083038398240489419e-01,-3.778792772950116952e-01,6.513144672544639580e-01,-2.572374293242168375e-01,-1.153042608158146853e-01,2.896561633752628317e+00,-6.813342159081596794e-01,-6.379259721006134976e-02,9.327928775214406887e-01,-2.185968758256606748e-01,1.695631893362780307e+00,4.347192402843151338e-01,7.880135205182354774e-01,-2.272657428584736738e-01,-3.504301949675628913e-01,3.237455094817554557e-01,2.075461895265670598e-02,1.262526594953709003e-01,8.621756667257247653e-01,5.765206997902710961e-01,-4.583322846701727293e-01,2.970678536217428167e-01,1.582092057239955274e+00,4.513605566230620703e-01,1.434936125267710083e-01,1.832455806739928583e+00,-9.320626866922625542e-01,1.250431945512432641e+00,1.782540643414565751e-01,6.983877179268505042e-01,1.389348287558529460e-01
7.357834061463282005e-01,2.616984659350179987e-01,-3.818258271511976720e-01,-2.207654924238153238e-01,-9.356210705674294914e-02,4.726595069547712691e-01,4.459276952183295339e-01,-8.597888138786710654e-02,-5.064924091464773070e-02,6.121444514847778073e-01,1.663364878696406146e+00,1.337596680052989262e-01,-2.420252542733882517e-01,2.806902142954656454e-01,-5.593495292558763321e-01,2.372334703381869581e+00,3.201674549620375787e-02,-3.726747435740541126e-01,3.014797455702311058e-01,3.571665919055377891e-02,-4.662968051616772636e-01,5.386640877033225250e-01,-3.557122374889545857e-01,3.844119108315202094e-01,1.384899768699578981e+00,-9.322624097655877184e-01,3.109535250297391640e-01,-5.859575395183145297e-01,1.927184217737558658e-01,-5.870141415472294177e-01,4.235182252680400050e-01,2.141295214072655551e+00,-3.979112075683821637e-02,-1.260593209149454830e-01,-4.762911146955343678e-01,-1.048592574540829547e+00,8.563742387005137680e-01,1.313545077892156687e+00,2.038379499227036984e+00,1.670419432298420492e+00,7.002839573830365039e-01,-8.417438350022066196e-03,-9.163450100737917381e-02,2.007714707408791988e-01,-1.089348830902270304e-01,6.873129860436540950e-01,2.354623854523378412e+00,-4.392750169969855123e-01,1.136581793313406474e-01,1.020360101989376655e+00,4.262220622621562427e+00,1.352944811724759555e+00,4.590947910894891404e-01,-8.618523920252236792e-01,-9.563734672365169498e-01,1.777588305873443186e+00,1.064593002497205454e+00,1.465313652586409388e-01,-5.336927135167288672e-01,1.934181243511761794e+00,1.277020951095438228e+00,-7.959025930843303120e-01,-5.704162571714903596e-01,9.386559993333132290e-01,1.433727726381612833e-01,-7.856565166815216994e-01,-9.312818857981688403e-01,4.710461347650244379e-01,-1.882731192418924948e-01,3.950167219111156425e-01,2.875367924931484076e+00,-1.160225845400195965e-01,4.608451573125549317e-01,1.123375344947995069e+00,-3.861166870366699033e-01,1.746896393903198286e+00,-2.259685949744982547e-01,1.367794410920791570e+00,-1.288807066984505312e-01,-6.582752061140110245e-01,4.449145675520382315e-01,5.688983082090355303e-01,7.687498786168706078e-02,1.144354513969874532e+00,1.069614483726722520e+00,-1.062034385999498065e+00,1.459144927787931201e-01,1.726360367415839203e+00,4.496521672550661819e-01,2.230012269288387805e-01,1.848562473037207887e+00,-1.013979694321746616e-01,3.677842228348857656e-01,1.009604033541648960e-01,1.749430896650058909e+00,-3.020975542690293447e-01
8.356504850591742750e-01,2.281707333270377447e-01,3.117886808412821398e-01,1.128439739954771870e-01,-5.858443673203443669e-02,5.191340305615741446e-01,2.063560880335055803e-01,-1.012848079959690062e-01,1.405771325732150467e+00,5.525197342011203272e-01,2.911803040212999072e-01,-1.956830986998630006e-01,-5.930937116929441144e-01,-4.737138401330322213e-02,2.273079708175298475e-01,1.425137977845460924e+00,-9.522164335587217643e-01,3.290116948087812299e-03,4.535606275490514649e-01,5.882268155649246211e-01,-1.313669660196921996e+00,4.684157739509148266e-02,-3.143455733161304444e-01,3.588224026977133718e-01,1.005905372281407306e+00,-8.221969331698673056e-01,3.135492382886704288e-01,-7.232506686395823170e-01,6.549426121774293286e-02,-3.617603715584261082e-02,7.128648544016233934e-01,2.768785487134559187e+00,2.339216276494493485e-02,-4.864586001389915038e-01,-4.497365634820716940e-01,-7.038409567787116128e-01,1.010686084541693619e+00,1.338627077127805265e+00,9.547584439272620571e-01,1.625499186273176244e+00,1.114368294461411502e+00,5.013421817026713079e-01,1.626402481942964551e-01,2.461051007663187518e-01,7.186891140563094194e-01,7.657860496928317051e-01,2.799682940417862476e+00,-1.895889603220565767e-01,3.640623754517663957e-01,9.339530125424320151e-01,4.051862482738167515e+00,1.176506558171131367e+00,4.891498837950196132e-01,-5.684053587663782103e-01,-8.100774728995725482e-01,1.382896012026126886e+00,1.736831880541446771e-01,-4.327896558001953498e-01,1.446804662608213166e-01,9.988731687222067723e-01,1.663005571381902525e+00,-6.200286404241976967e-01,-8.305820069321242505e-01,7.304831264684310543e-01,4.389908984999816299e-01,-2.128275439488280796e-01,-2.543783398217761560e-01,1.795054065304422686e+00,-5.816836115041903454e-01,-5.332879877537569646e-01,2.900596067610564432e+00,-5.143354945165603542e-01,4.296195399914330415e-01,1.076998542257625813e+00,-1.922493692333142323e-02,1.726266099115677521e+00,4.310271932186977017e-01,2.845138187616721437e-01,-2.070350478737584821e-01,-6.172357883913325294e-01,-4.762565417604087692e-01,-5.887094326537833933e-02,-1.091726063646686340e-01,1.287102597561123662e+00,7.611610284608427701e-02,-6.082530822600429321e-01,7.813964518222848987e-02,2.571522190437111277e+00,7.459380978861049893e-01,-1.738979812296359284e-01,2.044733765657361424e+00,-3.902296938463313269e-01,1.223361761580157303e+00,6.178779432138737926e-01,1.879556401255646769e-01,-7.601636582658982677e-02
1.001633282643086043e+00,9.351516073391545891e-01,-2.423765834041256562e-01,1.646262038671826300e-01,3.455637680635735565e-02,7.467347482678090564e-01,1.039904847843193370e+00,-1.230713034299515951e-03,6.413433517524301797e-01,-1.323161533408584722e-01,1.060538459354665175e-03,-3.825679438763438522e-01,-5.013463520501344473e-01,4.366556305737810395e-01,2.304919480055345193e-02,1.112224266042483478e+00,-5.035920429970103251e-01,-1.044483169859478089e+00,3.327443920988900627e-01,1.866547977400482006e-01,-8.501512758613838372e-01,-2.844112789099960681e-01,-8.080535554269647758e-01,4.325385825188612365e-01,1.167304038454253234e+00,-1.732321377565772952e-02,-1.273316180086326022e-01,-6.493540061777097749e-01,-5.971507594389888762e-01,-5.156560623625744411e-01,8.705826737928009651e-01,2.164988197320099061e+00,3.865322425107864945e-01,2.805643207698077513e-03,-8.751913776021092994e-01,-8.522568752338046671e-01,1.670464847954833854e+00,5.906270325218014872e-01,9.052871419037820111e-01,-2.165906628540703593e-02,1.043085950984689037e+00,4.641305272437444840e-01,-2.980344502125973905e-01,6.428274736485705132e-01,6.635510217767293106e-01,1.093757578154369803e+00,2.132489509722603316e+00,5.165650955409729628e-01,6.980543945011576934e-01,2.977590399303887692e-01,4.790989374673143786e+00,1.741937566355970635e+00,5.864282403685826539e-01,-4.097865865463189983e-01,1.821021062159355886e-01,6.715151054101486938e-01,-9.269146458651590370e-01,-4.938784993080139740e-01,-4.300793702896478776e-01,3.836084400645736192e-01,4.983530307926063996e-01,-8.085230903500935096e-01,-5.143383490547871473e-01,-6.450475735200441596e-01,3.745611602762120018e-01,-1.106685950024723919e-01,-4.569355696478217821e-01,1.076060371750716005e+00,-1.276560376903784988e+00,5.738049349632990959e-01,2.630653174878164968e+00,-2.737674978875489495e-01,-2.620203187566499947e-01,1.094840477969658332e+00,3.841263863923387589e-01,1.177768446083649945e+00,-2.220309445134484583e-01,-5.049314654518417544e-01,-3.125899704745498386e-01,-1.130677954013141306e+00,3.777920067496273737e-01,-5.233376832322249594e-01,-3.419012431477488900e-01,1.396300993273493551e+00,-1.403698662083910920e-01,-6.388451191556829833e-01,1.336423527135793543e-01,1.120311859413885447e+00,1.190881091691671667e+00,-9.502799470530784998e-01,1.305926198845018593e+00,-7.197359954291777662e-01,1.509255158104601646e+00,6.736912024951452471e-01,-1.076853884529906269e+00,-4.826635648976872472e-01
1.059646711075528991e+00,1.963584200844629146e-01,3.565271536140958430e-02,5.350701530605064260e-01,-3.950382164232927873e-01,1.021330019179170101e+00,3.007619428268392126e-01,3.446049944823014188e-01,2.357937267964690164e+00,5.514536131764270488e-01,3.888492912454288852e-02,-2.855353563721391708e-01,-6.570765311491623129e-01,-5.565028514616345012e-02,3.447554189685826387e-01,1.524816046682385462e+00,-9.073706520160342848e-01,-3.784259343403886811e-01,5.261742330576407722e-01,6.831198731718570727e-01,-1.452439848927614463e+00,2.510502620318260103e-01,-3.024133061444442827e-01,2.962259999072759387e-01,7.920570055677141896e-01,-1.118504726867968202e+00,-7.474440903581425211e-02,-7.426249000775131393e-01,1.813923026156603058e-01,2.148631748393834417e-01,1.063265569754851869e+00,2.853729562001293019e+00,3.314857810839241803e-01,-5.174880565675645805e-01,-5.475068600819872344e-01,-7.753510625336343942e-01,1.421129478187478812e+00,1.069377959766379949e+00,4.443068733297823591e-01,1.419505628691094534e+00,1.681112243314659249e+00,5.939694925227090305e-01,2.744523562977191355e-01,6.213024827255022586e-01,7.004363225788110547e-01,7.001592066452557717e-01,2.958997496059169841e+00,2.703129136006225952e-01,7.719326047126344736e-01,3.886262058297469402e-01,4.962975925703053903e+00,1.531849159792866288e+00,1.152894862874664028e+00,-5.279404878783510169e-01,-6.159317006337723388e-01,1.060632341535663326e+00,-2.952584637539151791e-01,-9.157848463362432412e-01,1.211316441257080934e-01,1.281484486421103020e+00,1.522849251044906982e+00,-8.417365680621358148e-01,-1.188848293941487944e+00,1.289786738766773855e-02,1.038556352807225025e-01,-4.045240792167288379e-01,2.759506727339500198e-02,2.221580863210932844e+00,-1.137839106034217451e+00,-9.800469144837944402e-01,3.536818579755415026e+00,-3.235001050035724024e-01,2.385484105303857794e-01,1.174073924930981061e+00,4.827641777018050195e-01,1.533976033359366165e+00,5.914841712402332252e-01,-1.531937040716799814e-01,-1.332594980713839306e-01,-9.024360624931452302e-01,-3.665628828244607007e-01,1.263875888341028930e-02,-3.508473269661287475e-01,1.104824305149365138e+00,-2.397071249905312618e-01,-5.345193233288432211e-01,-3.022375624011815476e-01,3.008894982447449351e+00,1.139626009020320518e+00,-1.277810463728240142e+00,2.488886521484325431e+00,-2.073205534054501920e-01,1.875806597384640284e+00,8.416561299869249613e-01,-8.247127539513809946e-01,-3.336118020534510342e-01
9.871764541154659511e-01,1.178120147112664995e+00,5.216610563053755700e-02,-2.455405767249679849e-01,6.352074333647793336e-02,2.003482604521951704e-01,2.225786883070268729e-02,5.731657717722399292e-02,1.094388140123214725e+00,2.177668382813156001e-01,3.235135837196214670e-01,5.261139897936838172e-02,-4.714343524268244101e-01,2.993026225547678609e-01,-3.059599043098065740e-02,1.645811139819003399e+00,-2.926528461516512136e-01,-2.186333203662596536e-01,2.007324733116129245e-01,2.717403342389499432e-01,-9.216230196584838108e-01,8.712516492916599908e-03,-5.730130956499595030e-01,3.244205897747332035e-01,1.196871787168095835e+00,-3.587583911415688775e-01,1.894613673708369916e-01,-5.782095558293421922e-01,-7.414632276945631872e-02,-3.865277771731099321e-01,5.153363092883662677e-01,2.234818562866834668e+00,-1.015366393220239194e-01,-3.863163942453675115e-01,-6.743586835500903209e-01,-7.717402675732445427e-01,1.312432246509809497e+00,1.092217431677330319e+00,1.046730148743548527e+00,9.774289856255499176e-01,8.335479159240297697e-01,2.566507707384557135e-01,5.616425730803464855e-02,3.997717084480989502e-01,4.975448037269362134e-01,8.982221188046143334e-01,2.757112383379221932e+00,3.183853410351746016e-02,2.186121527021990252e-01,1.296541260695935893e+00,4.006331528680608933e+00,1.089178366233548356e+00,5.174330937133422292e-01,-4.966224385653878470e-01,-3.645739588776590323e-01,1.146877632051267915e+00,-1.247971542209702633e-02,-2.095508290465893930e-01,-5.101942220200201827e-01,5.915311070181921149e-01,1.012928106615081258e+00,-1.649724182721798438e-01,-3.532496958172297585e-01,5.913499462776464766e-01,5.517842426084160756e-01,-1.900580309061412621e-01,-3.718303517108867418e-01,9.338345313949752979e-01,-3.892011222892365896e-01,-5.734629664692686424e-02,2.735368005692031090e+00,-5.775087033493435662e-01,2.232835162332511003e-03,8.387516516985045190e-01,-8.318180099518808490e-02,1.493897116317260299e+00,2.589208674715513525e-01,4.592028704708676079e-01,-3.886118584927542585e-01,-4.787610727482576323e-01,2.236546550908889985e-01,-7.561442762473347123e-02,-3.773281544837264745e-02,1.131885623921186967e+00,4.127991642927201221e-01,-5.937389295895965091e-01,2.512600121882136439e-01,1.603699861187902309e+00,6.463039830694576882e-01,-1.286370378406835879e-01,1.760789258364396703e+00,-7.778151343035503151e-01,1.255475125362120803e+00,3.414507115121636627e-01,2.440613516149410245e-01,-3.320939651928728198e-02
1.053017884515949465e+00,1.866629825461599390e+00,-4.601964996033204303e-01,-4.051817180455773992e-01,3.409518545049025628e-01,-3.885910154600158428e-04,3.518219096410825641e-01,1.239003568666366406e-02,-3.429851435350936839e-01,-1.797184934207839146e-01,9.094633231285718100e-01,1.653657250117676891e-01,-2.339366015382484676e-01,9.276878912735401217e-01,-4.202688340825190827e-01,2.000485366544325849e+00,5.380986181419968872e-01,-9.068210690703011334e-01,1.230400368563390467e-01,-1.920843874522772943e-01,-2.699393050694922636e-01,-2.185635355568226190e-01,-9.332023617902964752e-01,4.746096675740499871e-01,1.339637299946768056e+00,2.207008862679013528e-02,1.088954722624220217e-01,-4.038629016353110224e-01,8.496314506126578792e-02,-6.847858436207849842e-01,3.964685850430195169e-01,1.372125114437632076e+00,1.107525233845246815e-02,-1.764449159910872478e-01,-8.975642774284421366e-01,-1.105480863392074298e+00,1.304600877467113396e+00,8.730479521263988518e-01,1.339500904187387986e+00,6.069943350926720882e-02,4.250736861449841975e-01,-1.622685563687131238e-01,-3.686068522867852471e-01,6.376628885696229432e-01,5.104076057423784230e-02,1.125796675523624391e+00,2.251622330701642305e+00,1.342381747925079916e-01,1.395625804122275770e-01,1.609913642627907038e+00,4.171977536048086854e+00,9.271368858094883869e-01,3.429058730512024589e-01,-6.435540149401897114e-01,1.095521384206521454e-01,8.732062368280750775e-01,-1.929910579567175599e-01,2.297316514823987965e-01,-1.087441668020715291e+00,1.208725326883519635e-02,5.685899099507053522e-01,-1.770585811649157959e-01,-1.653705767709674757e-02,1.954261617290218300e-01,2.363744700177961011e-01,-5.951588070496389715e-01,-8.380654537670917392e-01,-2.911900401657046000e-01,-5.424226553802039552e-01,1.057920804312536767e+00,2.571754096593952266e+00,-4.745985135016390077e-01,-3.779622070001031342e-01,1.164161494362165428e+00,-2.688859470748442559e-01,1.614309613327221449e+00,-1.903391229787455008e-01,7.463053436432999233e-01,-7.273693267987635380e-02,-6.937809715282959866e-01,9.591488782121955214e-01,-1.723989881626494802e-01,1.749621628431871634e-01,8.855562784143797828e-01,7.349967822092535741e-01,-5.517906301976285288e-01,4.792017374984715028e-01,3.839874933417655178e-01,4.884706783993245649e-01,2.802989542861266670e-01,1.109479519291415750e+00,-1.115320030500473791e+00,9.139135144591352677e-01,1.418978456657926657e-02,8.268083678608970644e-01,-6.681769542752941105e-02
9.271201930220195342e-01,8.021563052285384243e-01,7.688153766943987832e-02,5.730611689344078385e-04,1.526869228756655983e-01,2.287284035294855911e-01,3.924294083479323847e-02,-6.686395301605893571e-02,7.109125019753235186e-01,4.006983575674467613e-01,7.472564466273168282e-01,-4.838641103270008292e-03,-4.451382274108307557e-01,3.872671637607130735e-01,5.052548668001610732e-02,1.857769174347195129e+00,-3.340349989815925569e-01,-2.405721936172742770e-01,4.278004057794989046e-01,3.679729275486141038e-01,-9.773514583291509350e-01,-9.030774041894046311e-02,-4.879192666568472614e-01,4.564447493170349368e-01,9.835238511189756672e-01,-7.865662409035166780e-01,3.472446738981762593e-01,-5.724499070496830155e-01,5.774399468244022504e-01,2.241009383090464269e-04,5.966772421246337998e-01,2.182045522209625332e+00,7.154104160925489619e-03,-5.883399678560261581e-01,-5.307776702318317552e-01,-9.491682307838411603e-01,8.377036856156834244e-01,1.394192479766237280e+00,9.667935673191593304e-01,1.312418360368137416e+00,8.637381383414375335e-01,1.355377258310463406e-01,4.430542739213824688e-03,4.258411358989910855e-01,3.809066095205337898e-01,8.686461192757056748e-01,2.734075982029085417e+00,-2.510208862634906168e-01,2.115526328671753498e-01,1.566555279011606849e+00,3.989025787957209079e+00,7.100436950587010188e-01,4.139048395908207501e-01,-7.288599286999095650e-01,-6.526420319645176438e-01,1.254677783326787033e+00,2.311759899702025556e-01,-1.039606705876178067e-01,-1.831439225105071511e-01,4.649907547370553118e-01,1.718146373981659814e+00,-4.404923844909750530e-01,-6.667747348446945166e-01,8.021920233374134623e-01,1.342701219392690160e-01,-6.342873889284093014e-01,-4.700137559728435055e-01,1.030898818965629404e+00,-5.440106378812012977e-01,-1.109652719034501800e-01,2.989293732982745588e+00,-5.894160220340936007e-01,2.403748294973996891e-01,1.387918743566368240e+00,-2.619092688101421484e-01,2.060391620628683640e+00,4.377324038632003922e-01,7.363088877190377968e-01,1.618524847023241620e-01,-6.000412152793427323e-01,-1.498130272355321368e-01,-3.424471849111007660e-02,1.731729685880291636e-01,9.053292735940141611e-01,3.354502544151587440e-01,-4.236379655206891082e-01,2.335971192119001283e-01,2.091615957604635589e+00,4.615141400790952475e-01,3.679038793490599368e-01,1.815621645230345749e+00,-6.904198311926342813e-01,1.038163156287353672e+00,3.283504208215083375e-01,9.610597717736459877e-01,1.094209076495751276e-01
9.201734748416752208e-01,6.372577019639924512e-01,-9.651777242333348106e-01,7.441534926343806866e-03,-1.727122183687281876e-01,8.453863440370403826e-01,1.061009794062836908e+00,1.613270697380306817e-01,-4.044680594906473470e-01,2.158423153037160869e-01,1.655271696199831943e+00,1.149613224830156599e-02,-1.536366702326394940e-01,6.602919527471243777e-01,-7.374628527277635737e-01,2.405971178171126379e+00,4.856068257706495639e-01,-1.285021700057417338e+00,2.813986758963175072e-01,-2.427988640611034032e-01,-1.150355242052988336e-01,4.697901745808248375e-01,-6.584591015049040541e-01,4.351829514754009809e-01,1.401192433577182594e+00,-6.555259041711953838e-01,-1.189187012711201141e-01,-5.239234347080852228e-01,-1.936004639598287724e-02,-7.797779060352590941e-01,6.591868054899987506e-01,1.681292029446852965e+00,3.485062775737147178e-01,1.836412837549520061e-01,-7.702804375799177095e-01,-1.267482579001885767e+00,1.346922885382930257e+00,7.680057773336904647e-01,1.913414879413926073e+00,5.881196051111489131e-01,8.579583770544401133e-01,-9.448682777457506621e-02,-3.861227380659008612e-01,6.301418029434238122e-01,-3.029046879486239074e-01,8.516370259473187154e-01,1.928737711032778357e+00,1.309931076531890559e-01,4.760800469682520686e-01,4.374828517546547335e-01,5.183828091416656569e+00,1.821197376274473756e+00,8.011540649553992033e-01,-8.343410390029522006e-01,-3.077490291749439555e-01,1.249955707352795820e+00,3.225662130404953754e-01,-4.267598770888947346e-03,-9.507101831722484242e-01,1.772492937856591011e+00,5.534428724645911180e-01,-1.099018793705442532e+00,-5.565542887721003362e-01,-2.012272088525294267e-01,-1.862607606920130277e-01,-9.898814104975777184e-01,-1.053707686846873770e+00,2.089531468010252802e-02,-8.649556696368095876e-01,1.031057793218286278e+00,3.045419088083397785e+00,1.813471152574525624e-01,-2.089254351670209731e-02,1.303853639300943223e+00,1.063966206927163816e-02,1.430175781106979738e+00,-6.307400735392506563e-01,8.809023545288972024e-01,-3.264243116973286618e-02,-1.150380980254460450e+00,1.107078913300771239e+00,4.043470543885192559e-01,-1.094183115156007191e-01,1.057279248827961204e+00,9.181905791011275575e-01,-1.076419878006491082e+00,1.458713230827352048e-02,9.655084531740290021e-01,8.316128070033882436e-01,-6.170775685142763090e-01,1.558174526884113398e+00,-1.728071411164692206e-01,6.799071113705945635e-01,1.574470094245251084e-01,8.569628990613791242e-01,-6.832522358976784727e-01
1.082358188826691991e+00,1.844770259265821721e+00,-7.475393868928242869e-01,-3.450582187117812727e-01,2.174866971860792142e-01,2.558554549097739050e-01,7.227388409480417497e-01,1.135208642871083362e-01,-4.772271876487119702e-01,-2.962199529173240586e-01,9.521163854967196194e-01,1.040586310430512140e-01,-1.898816877509582057e-01,9.804260895314408364e-01,-5.785179019592465721e-01,2.005161110454833917e+00,6.795991847456006596e-01,-1.272157038406674268e+00,8.015172968231379369e-02,-3.362506672162053345e-01,-8.770248313349249258e-02,-1.034140297113394502e-01,-1.012267114012495028e+00,4.556172297425398199e-01,1.440295824314526296e+00,1.418891225589161420e-01,-9.789514845866084669e-02,-4.096714134243431560e-01,-2.250374825005014845e-01,-9.106577936191337930e-01,4.815375395723660579e-01,1.285187397455596958e+00,1.635552019199077445e-01,7.560469329317021092e-02,-1.008212308181754002e+00,-1.156137879422639791e+00,1.584338314561332561e+00,5.924422803283339034e-01,1.485890964137078996e+00,-3.034690079388930872e-01,5.062552110571342245e-01,-1.448871436763913834e-01,-4.795185524615693806e-01,7.420214693810995854e-01,-4.518486725417447669e-02,1.146773419981348185e+00,2.011920259913352549e+00,3.752290180071108927e-01,3.059682716655923174e-01,1.119550151891591794e+00,4.625174597681603217e+00,1.361567796161670119e+00,5.148774915824994025e-01,-6.075869872070281952e-01,3.232300697895915675e-01,7.594355221329156524e-01,-3.891509200532766721e-01,1.411642003619956454e-01,-1.288478145960542109e+00,3.179493048708614822e-01,1.166023012459658503e-01,-3.865145189338206055e-01,-2.848038078225763325e-04,-2.962958396216679446e-01,1.885210004611623802e-01,-5.936943715440037295e-01,-9.268629114780916334e-01,-4.455464192665089529e-01,-7.631222591482970108e-01,1.348608085969627446e+00,2.583087301787167611e+00,-2.468470557978592606e-01,-5.243687344393773708e-01,1.093468441408670611e+00,-6.323839749964521584e-02,1.316284245448792412e+00,-5.004531442054527268e-01,5.432617129247605536e-01,-1.960849513254308008e-01,-9.096928992334580855e-01,1.312961177940529911e+00,-1.441488821578176815e-01,8.231541270960152090e-03,9.845712768182717234e-01,7.578878806669139268e-01,-7.220355449972022388e-01,3.806171136840013625e-01,4.553302794576163937e-02,7.177069948228540497e-01,-2.417248101179039210e-01,1.026764435090709249e+00,-9.887594851675081120e-01,9.746001865997518943e-01,5.431097976738286093e-02,3.868970828056870759e-01,-3.503174275585048680e-01
1.130101996659334418e+00,2.722970228861093522e-01,-3.843236051860367541e-01,4.236328742298647310e-01,-6.892972705948124945e-01,1.236681364066243738e+00,3.422728038534832984e-01,6.550196576365152623e-01,2.540340506698696821e+00,5.922889251812717415e-01,3.634054610098065852e-01,-1.059259556470013852e-01,-5.506121642051455822e-01,-6.519338753991783808e-02,-1.471048757890003333e-02,1.957924035776727578e+00,-4.632645039385275831e-01,-5.701898644593815790e-01,3.571007125746493704e-01,4.641188249286198331e-01,-1.147535671068819596e+00,7.581609069612702534e-01,-2.743954842240323155e-01,1.674794445189488057e-01,9.946801698126853664e-01,-1.194680721881162810e+00,-3.178850103687833606e-01,-7.099814561861219619e-01,-5.288466682186521162e-02,-1.212335412361360554e-01,1.027873517991007901e+00,2.755788839815979330e+00,3.319443045834211126e-01,-2.820483997460334069e-01,-6.294576432941352273e-01,-8.331457957218046939e-01,1.777259409883330088e+00,8.333857702189995109e-01,8.079899410673998528e-01,1.419917751526098115e+00,1.780791007966114670e+00,4.915806799656174952e-01,3.258802795433481392e-01,6.982488357985503491e-01,3.659607504768985775e-01,5.771895499240570215e-01,2.941718950746149197e+00,4.573579577198126911e-01,8.200931186707234311e-01,1.224253798263086335e-02,5.458331721109988877e+00,2.014932805037259911e+00,1.553499060679481847e+00,-5.217392795157820284e-01,-5.822723042547438554e-01,1.159188354911563135e+00,-5.140073514054321890e-02,-9.563838596225551214e-01,-3.419993118297852686e-01,2.170754542260911801e+00,9.683064511493808535e-01,-8.579142970190577477e-01,-1.104915242280273269e+00,-1.749993333223645031e-01,7.983751611571099360e-02,-4.991825332657425784e-01,-6.287711553956121247e-02,1.872762682602382878e+00,-1.010843063942954645e+00,-9.166080389789361682e-01,3.736473821149225216e+00,-3.389258975732961643e-02,1.299191189077013586e-01,8.570184180934330431e-01,6.292921675817825244e-01,1.129742375616530570e+00,3.193046574261312887e-01,9.900230647687785490e-02,-4.311450871124155038e-01,-9.124775323830055518e-01,2.560558933470695187e-01,4.358643595672346827e-01,-5.074882511182020606e-01,1.096463852151156271e+00,1.846437302767750532e-01,-8.612717622703456311e-01,-4.832390548265630970e-01,2.761897205385455578e+00,1.266258016976481660e+00,-1.906876754852123934e+00,2.733993409397593943e+00,7.155079010913079074e-02,1.882524184309625426e+00,7.120382023899067825e-01,-8.663374296527583951e-01,-6.354624188232923521e-01
1.039029171377844785e+00,1.038499347883798052e+00,3.820246302162667584e-01,-2.877827828323268333e-01,-2.187196918197172324e-01,2.433339775370653157e-01,-5.312873672100868472e-01,2.884371222492231324e-01,2.567211399865493959e+00,4.886270788121224173e-01,-1.925965325980859011e-01,1.413014176801825061e-01,-6.354340789653980526e-01,-1.594447413269882152e-01,1.905424451875167291e-01,1.548801466260187665e+00,-6.819576460768778103e-01,3.900581975839009230e-01,1.184202820610629481e-01,5.663006159763454006e-01,-1.357118219179342056e+00,3.354546971652118126e-01,-3.152492587732544926e-01,1.207412594672162137e-01,1.150592073629836287e+00,-5.904847251073728209e-01,1.703215629083111582e-01,-6.626341994355248177e-01,-2.337874751735535828e-01,-2.555305607118609768e-01,5.228808910183505576e-01,2.816099822248703255e+00,-3.057766493896824089e-01,-5.786294797095579145e-01,-5.652857135195473726e-01,-4.830452275542646556e-01,1.520329669340064083e+00,1.190257030632492885e+00,7.907562117508579735e-01,1.657005643369226622e+00,1.148376848605124678e+00,5.129070575790275477e-01,4.917254741205477897e-01,2.720167319475869094e-01,7.604089749189857361e-01,6.933113344660050137e-01,3.345558564356077014e+00,6.056977859653697727e-02,2.125940604203797601e-01,1.210163768921409311e+00,3.883716274585234718e+00,1.205670035345330682e+00,8.290677516408592185e-01,-3.206340292765436639e-01,-6.465302489692832388e-01,1.325905000428737157e+00,1.592256027786708716e-01,-5.560448144916201318e-01,-3.475251600434908772e-01,1.107653971072921628e+00,1.109125419506129528e+00,1.475810211676523154e-01,-4.530839727298691111e-01,9.685937828577532160e-01,8.972208679391167063e-01,1.720508917846072239e-01,6.936825316117789519e-02,1.692506048458150225e+00,-7.348561760025748568e-02,-1.055855118795812286e+00,2.936179873151266051e+00,-7.005603681718124420e-01,1.525757185338165733e-01,3.377585172291619475e-01,8.371877510028423452e-02,1.231960933202342900e+00,6.775021714438080878e-01,3.729035374803811309e-01,-8.253148039714344186e-01,-1.401056438708458696e-01,-7.740283652650881141e-02,1.293118292116238188e-01,-2.149910396479469410e-01,1.226820913369192301e+00,3.511512310746236487e-01,-6.427458483503176723e-01,6.261047022556265329e-02,2.405052465974561571e+00,7.381058980273275116e-01,-6.073069716781589467e-01,2.407889368972047528e+00,-6.038314711580412553e-01,1.665424665224824796e+00,4.885021535150158578e-01,-2.547541795931382858e-01,2.160419543733471670e-02
9.393664839605193606e-01,1.080229344701462146e-01,1.071801447780556943e-01,4.629370706312669892e-01,-1.740238265022621689e-01,8.305150117071042892e-01,3.973452464250772365e-01,7.250266109470648868e-02,1.587992494525691578e+00,5.458295715718542995e-01,3.256156368513822841e-01,-3.051853331694269755e-01,-6.018141180269546142e-01,5.463990924462107379e-02,3.011807149119738458e-01,1.523241420545331959e+00,-9.009422769216071103e-01,-3.538337856663762437e-01,5.892039745013000207e-01,6.299477218928363209e-01,-1.350315331925411533e+00,5.232976221609575429e-02,-3.349459007854365122e-01,4.037777245471294019e-01,8.147956320819347287e-01,-1.068734899192933074e+00,1.310445799947500822e-01,-7.234194489760988889e-01,3.407244723745237458e-01,2.132285978864114639e-01,9.584082309686358103e-01,2.709509103477623970e+00,2.906100623918653203e-01,-5.267135674342175999e-01,-4.876797652560059815e-01,-8.466017017276005197e-01,1.078849664986379908e+00,1.242053179859565759e+00,6.512396302523262293e-01,1.451242540375693224e+00,1.410902280549270138e+00,4.909536339099222491e-01,1.256843497949883259e-01,5.029161399899489959e-01,6.507663074416226712e-01,7.647011200065937375e-01,2.766012518069876691e+00,5.738158538612134207e-03,6.212983178895415959e-01,6.804582921622863712e-01,4.616536276164929120e+00,1.262267170411144779e+00,7.860419475746543982e-01,-6.386384171031216361e-01,-7.136961358714575265e-01,1.171985040309228232e+00,-1.062017506610737905e-01,-6.400107803035327558e-01,2.228767981477899340e-01,9.996596986740300395e-01,1.774469936605256537e+00,-9.090021004536623650e-01,-1.128391458027222516e+00,2.648503402004919738e-01,5.507995956164291051e-02,-5.093857643309572802e-01,-1.888656731999018845e-01,1.971480004926387419e+00,-1.048571488796286255e+00,-6.265711303162669887e-01,3.306049012623801353e+00,-3.844114384627679293e-01,3.563278958161883447e-01,1.401710055545040801e+00,2.100998896728877297e-01,1.826452692922536203e+00,5.015901867802756708e-01,7.270652597968574327e-02,8.568846879934088889e-02,-9.029149539863378093e-01,-4.916090290837062948e-01,-7.322449222034663197e-02,-1.665982306292620174e-01,1.108170579846186277e+00,-1.627616000354680237e-01,-4.951140261190181135e-01,-1.182752231095438034e-01,2.833316382270693268e+00,9.257739928657706674e-01,-6.085910871519595311e-01,2.188973866727248918e+00,-2.937067989862456319e-01,1.487300711225079564e+00,7.408492506408284051e-01,-1.684615062955547860e-01,-2.009973740375011197e-01
9.287933845025042601e-01,9.647184330262996710e-01,5.384227548651523421e-01,-5.093978367062648172e-01,-1.335476670819369938e-01,1.469581841787415133e-03,-7.455152422649424793e-01,1.338863915348880440e-01,2.337572706566353631e+00,6.190872557607355331e-01,2.024519500806370997e-02,2.555857665838838777e-01,-6.062647208506880547e-01,-2.400956532103494800e-01,1.188039642251855765e-01,1.644280588654235764e+00,-6.965958164011769593e-01,7.270742964635726890e-01,7.565369926613105256e-02,5.619322834039623960e-01,-1.331121771558437139e+00,3.894670827925705292e-01,-2.274829080571412199e-01,1.112881862422315099e-01,1.245899701192703546e+00,-6.194155233794980120e-01,3.822324230627784925e-01,-6.579057219227424369e-01,-1.877940503080125501e-01,-3.283370150472186833e-01,3.287225913613738837e-01,2.864541724050240212e+00,-5.158242656315583652e-01,-6.271266129373902487e-01,-4.599074573748992423e-01,-4.338680876081010274e-01,1.279719180815671820e+00,1.410267637783268135e+00,1.071715111795846331e+00,2.049819597706885155e+00,9.262200846630695983e-01,4.552351673286076927e-01,5.420012900049668847e-01,5.184648103976961797e-02,7.205886027574656127e-01,6.421504107052801169e-01,3.411652510173305952e+00,-2.389691973368468503e-01,-2.714599398755997151e-02,1.532580086862428637e+00,3.419193528790341663e+00,1.006492319652950940e+00,5.904011831271340771e-01,-3.653464955551827265e-01,-9.047165683314605245e-01,1.609634671682705021e+00,6.075962542892696661e-01,-3.363006733479169119e-01,-3.189082820745419156e-01,1.224204157040017282e+00,1.294326455377819762e+00,2.998212290818765280e-01,-3.319786896287365563e-01,1.517883269920691447e+00,1.053719244529351506e+00,2.196498279486900906e-01,-2.561532976214131452e-02,1.569115463830146329e+00,3.304794874768310908e-01,-1.064017864629276611e+00,2.745470220583127841e+00,-7.913734853023339788e-01,3.378058928004032402e-01,2.349878551855883180e-01,-1.911965165260712252e-01,1.354631379336578068e+00,6.967367981474130723e-01,7.630433301375334487e-01,-8.873822985321417889e-01,9.060689148065470544e-02,-1.743089997751013920e-01,2.550075159207809694e-01,-8.534392239572546890e-02,1.272264986126470543e+00,6.057711979572233396e-01,-7.139853960235650332e-01,1.929480355971703309e-01,2.436489840954444652e+00,4.953670257433603896e-01,-7.459303378440534926e-02,2.395205035908007041e+00,-5.916872391006733345e-01,1.336365241489211542e+00,3.510735661775346572e-01,4.249748169891746641e-01,1.715353150531381266e-01
1.114199362047242348e+00,1.177992680756144939e+00,-3.258200660465375709e-01,-1.501357802893394933e-01,-3.477161468324741489e-01,7.416448616563116047e-01,4.474664710953784041e-01,4.310754040723512315e-01,1.804680908641378645e+00,6.860178849883713514e-02,-5.646596472947656986e-02,-3.528975629159036842e-02,-4.992768793047294706e-01,1.510944400537892474e-01,-1.818518131558846118e-01,1.508224034594575436e+00,-2.467087177033772394e-01,-6.369778146535047814e-01,4.214026185660630502e-02,1.563824324844751701e-01,-8.330169026763452056e-01,3.823817623410589728e-01,-6.247751494672859618e-01,1.554336196118069335e-01,1.368911561843981106e+00,-1.527045595521059063e-01,-2.869089653734928635e-01,-6.375592527073156157e-01,-8.804093554446169589e-01,-7.822950635462636582e-01,7.119048751051839652e-01,2.392003467083261725e+00,9.885816837295285930e-02,1.798270098744357559e-02,-8.788301015168092922e-01,-6.771731807642309420e-01,2.103816724548912109e+00,5.088056435327279470e-01,1.093025126805989178e+00,4.883499003222740997e-01,1.205277537810728550e+00,4.754479516289093488e-01,8.763196551313670590e-02,5.768199161451246226e-01,5.173640083815918000e-01,8.524255058605522128e-01,2.630985229385318203e+00,6.338399986114308104e-01,5.864050136858151019e-01,2.208686383860111735e-01,4.882167631328393043e+00,2.067174668277953486e+00,1.078912922547974773e+00,-2.672987354199718446e-01,1.516598492900750328e-02,9.228951215642400285e-01,-4.756987693557755970e-01,-6.458220639407336039e-01,-8.578849513995234766e-01,1.383085579717610925e+00,4.334380005221180610e-02,-3.493144693437658654e-01,-3.401683386219228611e-01,-2.993554376495191072e-01,7.068519768637088196e-01,1.040593247322411097e-01,-2.375600570646401732e-01,1.089112607761746787e+00,-7.036077610756277245e-01,-6.028249983901978748e-02,2.853860872118142211e+00,-2.147567246460325152e-01,-2.911606413360813272e-01,3.495923976351452689e-01,4.976461152572744240e-01,6.561943443226425643e-01,-1.118192929556786064e-01,-1.449003466770820703e-01,-9.505858337550420201e-01,-7.231805807647080364e-01,7.975166017525602280e-01,2.351829977535428717e-02,-5.174810157096173535e-01,1.401193357088756031e+00,3.490111939220738035e-01,-9.340600968471886034e-01,-5.630062290633841560e-02,1.306637634231400558e+00,1.221021664495471448e+00,-1.584779941052542052e+00,1.943536309824272834e+00,-4.923379368968636705e-01,1.738444343598437802e+00,5.410494101555441970e-01,-1.192937027966711083e+00,-5.820413442990373110e-01
1.021863471240496146e+00,1.979247609418549381e+00,-2.970317499834418395e-01,-9.243245540636813029e-01,5.036000015315099387e-02,-1.273166178792206060e-01,-1.213334804577613224e-01,1.938379122403925958e-01,6.503816159568351907e-01,-1.779421489752625041e-02,5.950620815615703663e-01,4.356451319677214773e-01,-2.806750551260882576e-01,4.560206577564479002e-01,-5.999451381488261070e-01,1.994987002804913256e+00,4.632721903957648935e-01,-2.583664107549374367e-01,-2.381449628691306997e-01,-2.014824744739128759e-01,-3.209686881616497511e-01,3.436576586500227348e-01,-7.413751281086482514e-01,1.731108937908609757e-01,1.710690111854865858e+00,2.149251583902530294e-01,8.265314882132429597e-02,-4.563659657490787280e-01,-7.150271687639112583e-01,-1.206687821913734471e+00,1.133336125569082420e-01,1.813210292700398796e+00,-4.172602678196722925e-01,-1.861011293478481710e-02,-8.758000379114030398e-01,-7.369540692847504904e-01,1.745690810548391481e+00,7.840187281608554937e-01,1.769982439927987095e+00,5.915476822925395117e-01,3.887840007285795485e-01,2.145103778787765814e-02,-5.280155760726011616e-03,3.070308742240238642e-01,1.427497785919645823e-01,9.209523069352811842e-01,2.632441056750631336e+00,1.557077105671895167e-01,-7.869902854532805081e-02,1.407893713977620198e+00,3.841251355425804093e+00,1.398232604608639296e+00,5.106528555420853932e-01,-3.728643812311015493e-01,-7.623763393945770517e-02,1.253153502938409103e+00,2.827158581174448737e-01,1.411065778477375576e-01,-1.418926707136538790e+00,1.007009359727198294e+00,-6.279639189866284554e-02,3.483028093508213630e-01,3.584564485614615270e-01,7.123053434336296119e-01,9.918198248966874075e-01,5.740018428993587385e-02,-6.500166890184156943e-01,-1.748212440144844004e-01,2.539862646090607634e-01,5.706148962016499571e-01,2.303204186115962226e+00,-4.794568010689027049e-01,-3.222345027165652298e-01,1.213426742930244218e-01,-2.311299261570479713e-01,8.816017979310311059e-01,-2.520623022258895451e-01,9.354712963294419259e-01,-1.041574286958250939e+00,-1.711540072141486679e-01,1.261435490302326379e+00,2.208827764921952319e-01,-7.238450000614371493e-02,1.247853913298903938e+00,1.209436260344105118e+00,-9.892806145906529736e-01,4.408954822292396880e-01,3.459397181735421878e-01,5.304827257055786394e-01,-1.709827427196125571e-01,1.510286345429247223e+00,-9.133362318820446024e-01,9.663622202373436387e-01,-6.632663088619755731e-02,5.648159470646436642e-01,-1.687901605391158300e-01
1.358612059173570419e+00,2.108855797677885668e+00,1.173778018866523526e-01,-5.380172557813966971e-01,-3.906518986641875357e-01,1.630782558348310984e-01,-9.095675563501610661e-01,8.098628077586653706e-01,3.468938909407373927e+00,1.695494373445300962e-01,-6.874625773935472139e-01,3.978816207122903847e-01,-6.257601225663688149e-01,-1.041127052868852376e-02,7.122874643244370141e-02,1.682284895736455343e+00,-1.362202754988852960e-01,2.171275658196529790e-01,-2.127881994743500704e-01,3.835951651009438246e-01,-1.197040111665304440e+00,5.274699633762848228e-01,-5.144442562016737774e-01,-6.862878421611853796e-02,1.279322216004496360e+00,-1.868500868080762711e-01,-2.160019729617528028e-01,-5.575401349800781503e-01,-6.013708864342601768e-01,-5.512775824525492085e-01,4.787202028782038266e-01,2.555145648300738870e+00,-3.940771636750393103e-01,-5.136123419903306786e-01,-8.590235456190562502e-01,-4.077150294401833963e-01,2.289958697674479460e+00,7.318570043818691806e-01,5.050875141416280023e-01,1.005391814613023627e+00,1.263035612237520144e+00,4.590512638025338044e-01,6.286367554055564133e-01,5.713829398817817928e-01,6.936166585022409681e-01,7.383534466858856504e-01,3.633756784303587395e+00,6.442696753849748159e-01,2.744443355869974899e-01,1.201691512360198111e+00,4.241243811851728829e+00,1.447086454176988113e+00,1.346362230316410002e+00,-6.677506846181285871e-02,-7.737607501292864676e-02,9.231763186924063502e-01,-3.357144556194381346e-01,-7.545036462223386753e-01,-1.070862237596702515e+00,1.000122703126406609e+00,1.708012807448816284e-01,7.409749034025616687e-01,-7.140392733835090877e-02,5.229979211875884770e-01,1.129957052711068943e+00,4.094619400193657555e-01,3.189969637512017897e-01,1.307198161577304285e+00,2.583711195168168773e-03,-1.179146577016181974e+00,3.074921000512803371e+00,-7.359655087030416709e-01,-4.235737296234450833e-01,-2.378267675735399045e-01,4.071238673640049099e-01,6.036478031098098107e-01,7.089562747151914035e-01,1.627924410750413164e-01,-1.329389367812558564e+00,3.471823974333770879e-02,6.874182349400050906e-01,1.793105588282428442e-01,-4.042688381106300244e-01,1.084328062701069628e+00,5.039309718811390004e-01,-6.396236441050594523e-01,-1.219133663799193412e-02,1.776888565734374481e+00,9.384722669612377555e-01,-1.475275137043823070e+00,2.564462327385922613e+00,-9.051776523006467290e-01,2.297671947054211294e+00,3.908539627599504906e-01,-1.203744665419270721e+00,-7.514425061622809210e-02
8.383952683399272798e-01,1.014714027545297492e+00,2.196217535098100027e-01,-8.947619498719212583e-01,-3.006756927106613575e-01,1.358158436021630611e-01,-2.870876319734501636e-01,1.439028776460970493e-01,1.953864128319865001e+00,4.506470540524666335e-01,8.786977297309067625e-02,3.117467501071795599e-01,-5.043290011732255440e-01,-3.461468888623211448e-01,-3.441544188015370764e-01,1.571135316696369078e+00,-4.822201069069146362e-01,5.353294514646919078e-01,-2.256990159213786706e-01,2.132216189405755358e-01,-9.112728779416844338e-01,7.397760346330786163e-01,-3.107194903787883766e-01,-2.824300667531032261e-02,1.750156726606298507e+00,-8.884171840768964601e-02,1.955020799309939161e-01,-6.814469776176840243e-01,-1.260706649171966731e+00,-1.177462198819833938e+00,1.506314941286369946e-01,2.841987162614539209e+00,-6.023118157839016940e-01,-3.351793915045167549e-02,-6.157359964350272996e-01,-3.139646726939834820e-01,1.798967915187499100e+00,9.685957739895613150e-01,1.863136556921087150e+00,1.675225420399849563e+00,7.190781654789815125e-01,5.230339849395342355e-01,4.197010791154999199e-01,-1.223776151187103006e-01,5.951602697990583390e-01,6.360976941330613865e-01,3.014356938465059699e+00,-2.237288589342324718e-02,-4.742327177081769041e-02,8.022873856281526050e-01,3.598726462514326929e+00,1.868494380984657033e+00,5.974424764209350647e-01,-1.846814859890066052e-01,-6.685868406516188855e-01,1.744084709962069768e+00,7.022178855909464446e-01,-2.597829511029066119e-01,-8.614049994206660621e-01,2.089530382937823560e+00,1.747592625002490352e-01,2.756361242833696434e-01,1.048310216446972781e-01,1.210565184230038005e+00,1.527193153217360155e+00,6.589650374424378398e-01,-2.817533464378792485e-01,1.054465544655993625e+00,5.996840347638061619e-01,-4.334018805324678647e-01,2.240199463435962102e+00,-4.663635691921101945e-01,1.782245870773151997e-01,-4.570182857337378168e-01,-6.875987617024813259e-02,5.313035564509596131e-01,-4.551542104285816182e-02,6.958178366539559123e-01,-1.635919322096934803e+00,8.136710388296314322e-02,6.032581160006194043e-01,4.332023286672661011e-01,-3.857320989266024847e-01,1.753412005036480092e+00,1.054355129031422145e+00,-1.294067423494797309e+00,2.188924390281919430e-01,1.459181340126463944e+00,7.329189290060306172e-01,-6.469776921525586255e-01,2.132055969202950596e+00,-3.749598150654697148e-01,1.092984507919441572e+00,2.593853955061212191e-01,2.042178469185537693e-02,-2.775806929990146665e-01
1.199228807045729539e+00,1.278427990017154681e+00,6.042426636292680397e-02,-3.621070973633026546e-01,-5.575460676112460323e-01,4.291408108908760788e-01,-7.457831919385673469e-01,7.303267336717733649e-01,3.299783043402058524e+00,5.423374952865029908e-01,-1.252867862613243344e-01,3.548706173435046685e-01,-5.905615096000639275e-01,-2.118288177231560376e-01,-2.854527275039187018e-02,1.956451321378265940e+00,-2.897485105330955824e-01,3.179392635614006202e-01,-6.064944278944393169e-02,4.543423082103745236e-01,-1.214443221781564386e+00,8.400508832210644705e-01,-2.650635414520698951e-01,-5.087560715313660387e-02,1.255457060012781234e+00,-7.234391197230052306e-01,-1.129757486525239385e-01,-6.267710858742250313e-01,-3.671347405173190914e-01,-4.378065907603880813e-01,5.294148316159480450e-01,2.799471358079911543e+00,-3.341812841103040665e-01,-4.913907285485438758e-01,-6.537178666936719340e-01,-4.857135120686425500e-01,1.963437260698072562e+00,9.686084606590571466e-01,8.563334291834709955e-01,1.713124927528136165e+00,1.380701978671317498e+00,4.551727076335753686e-01,6.741647421425460696e-01,4.194727839399724489e-01,5.213860377227100829e-01,5.508875383517251034e-01,3.572902837318568281e+00,3.331994511545650628e-01,2.887095055291547530e-01,9.492546597567159683e-01,4.383129491414707424e+00,1.582579016138843109e+00,1.376619406704522763e+00,-2.581260691856186451e-01,-5.891762207685402597e-01,1.332758968737266514e+00,2.749298425602533791e-01,-7.336673094630075109e-01,-7.820369282283596846e-01,1.850668084972746374e+00,6.255436666464799789e-01,3.038630090236370540e-01,-4.104478934721602634e-01,8.040040947909415925e-01,8.972600894299860297e-01,1.258636168052515991e-01,1.786151242594996580e-01,1.558785515030956192e+00,4.634672396898845831e-02,-1.341152101602528068e+00,3.290669139556781531e+00,-5.178531228503051587e-01,-1.049377762565641137e-02,-3.840649807439086572e-02,3.135952203887183987e-01,8.223300797077925939e-01,6.507391075844295436e-01,5.287089859797639013e-01,-1.149952159740555757e+00,-6.055840758800457024e-02,4.459600289834685927e-01,5.292640006618860582e-01,-3.888066108287367983e-01,1.124333116394276910e+00,6.584606771002931014e-01,-8.449677869031029243e-01,-1.715143732580367009e-01,2.397167289993512362e+00,8.880158425354141016e-01,-1.388807794514730576e+00,2.845546161477921387e+00,-4.076041795914400745e-01,1.945025846726410990e+00,4.084635591539343968e-01,-5.577264923762801363e-01,-1.944011191289478080e-01
1.286196634491086677e+00,1.270051877212702518e+00,-4.438016451765925963e-01,-5.523513461054985196e-02,-5.211925626216580287e-01,5.593450580144703199e-01,-6.199554277962338045e-01,8.602132621330078610e-01,2.492854030370905249e+00,5.978811372827622650e-01,8.165791185165949262e-01,4.366330831169197291e-01,-4.002247981615507655e-01,2.573057631279362933e-01,-2.399611259427498755e-01,2.715278901830652458e+00,3.683924877423318534e-01,-2.438050576101589428e-01,1.365960661973471824e-01,2.748013022204233713e-01,-8.571862148674953552e-01,8.824536172528125721e-01,-3.270110619558780352e-01,1.210132816772148678e-01,1.047266834642041289e+00,-1.246047150055453967e+00,-1.713046350842341858e-01,-4.996130031525038984e-01,6.123569526218366477e-01,-1.082611151549666140e-01,6.530268644761529906e-01,2.219869794745129798e+00,-6.121221178879562852e-02,-6.137157305725902123e-01,-6.492287104747784809e-01,-9.555520258635556985e-01,1.606196510917242914e+00,1.093185297117304833e+00,8.465151319874242297e-01,1.635977388182524805e+00,1.427389013057291933e+00,2.045076055957834038e-02,4.698116349041167594e-01,7.574355190420154482e-01,-4.657519979907076557e-02,5.519207851848514368e-01,3.395058751446788037e+00,2.338871449441098371e-01,3.595647487234929218e-01,1.262612393068626604e+00,4.923065323151175399e+00,1.225450860898330330e+00,1.563077070478504638e+00,-6.363483772792546400e-01,-6.487813712322691995e-01,1.261460073941614413e+00,4.825909816242220929e-01,-5.195660521449466662e-01,-8.983292275276215655e-01,1.793427477421879246e+00,1.078437231949994857e+00,-6.227231540746863692e-02,-7.126475916843589831e-01,6.288717835417860780e-01,3.980202383089648244e-02,-8.182457834807610464e-01,-1.216980971528116573e-01,9.859985393233735573e-01,-3.191125063605180778e-01,-1.002913406316886746e+00,3.884833287093756304e+00,-3.321370483833784304e-01,-2.353952037489902283e-02,7.580606583629339035e-01,1.783029470217822321e-01,1.441617101398872558e+00,6.570862475550909299e-01,1.089958535088559444e+00,-3.344555894041234545e-01,-3.802711958897680433e-01,6.573050087373913941e-01,7.653269871745369546e-01,-1.062312246871993382e-01,5.596307141813685604e-01,8.410761542609643815e-01,-6.725311979101864512e-01,-2.697346336709694481e-01,2.458975157943918965e+00,6.945854896502241527e-01,-1.093766080553466580e+00,2.868996100881666234e+00,-3.353433191801318269e-01,1.718713932449758008e+00,1.986509431344414822e-01,4.390173926497223933e-01,-1.836136123791717867e-01
9.596835229841998993e-01,1.266567542794674761e+00,-4.928313681151352266e-01,-4.603300974811304069e-01,-9.006406769008909463e-02,4.162538540218885252e-01,5.542426616733604483e-01,1.483288274254604966e-01,4.228996614331986814e-01,3.946724805856977047e-02,7.255672794134333525e-01,1.220312149918680589e-01,-2.989238254053553367e-01,4.149127242788005487e-01,-5.527951087865013990e-01,1.862910160481836330e+00,1.982191967877048877e-01,-7.030574349202227680e-01,-7.489204199780934157e-03,-1.447321555666156168e-01,-3.672547875698796149e-01,3.430024616502424517e-01,-7.053579474687337036e-01,2.626856250371025769e-01,1.584758200403035833e+00,-3.411935865039706500e-02,-5.575506955832817968e-02,-5.461931537470781084e-01,-7.251489692298206391e-01,-1.066505532830330338e+00,4.252253660587788087e-01,1.951888321523948644e+00,-3.703166642971547629e-02,1.479603701089778900e-01,-8.499620799538455396e-01,-8.574911572037297036e-01,1.719916038712152373e+00,6.682122499757985334e-01,1.751399182804399102e+00,4.840514589593316597e-01,6.835083412116654822e-01,1.508727123775003287e-01,-1.605665327118500629e-01,4.147310507421448356e-01,1.521854484709031508e-01,9.098739150421075728e-01,2.284486099029969353e+00,2.633256906755792603e-01,2.690247648650633816e-01,6.718526869135452717e-01,4.479393781781388029e+00,1.806254066751663334e+00,6.388652596307200504e-01,-4.645022452426186277e-01,-9.526611074035346016e-02,1.182976312292557841e+00,6.478158447448278956e-02,-8.274279062390590966e-02,-1.100921081057041340e+00,1.352746272553640994e+00,6.528631503117746093e-02,-3.527511578309536766e-01,-6.240002793279569859e-02,1.133934155852149850e-01,6.354298063699828081e-01,-1.549115998321386467e-01,-7.264259247833819710e-01,2.043580270747921146e-01,-3.526455914070842912e-01,7.090310921004241429e-01,2.514329672325309240e+00,-1.767333510052750412e-01,-2.057350466943683176e-01,5.111023707734099197e-01,2.903387681081513738e-02,9.243128231859463195e-01,-4.628909539418682995e-01,5.463366197468502161e-01,-7.700261600969169340e-01,-6.587715576878285795e-01,1.092799229567657182e+00,1.590258162673597597e-01,-2.338272503104542044e-01,1.355268877221321056e+00,8.744767923113705432e-01,-1.065162962106229294e+00,2.205668682480754761e-01,6.475181869719851546e-01,8.396650868033376236e-01,-6.529587277624824271e-01,1.502342174921108331e+00,-5.589521345958206044e-01,9.919362101807469578e-01,1.877175151973516365e-01,1.273146912833985622e-01,-4.863445508736491951e-01
1.050987328253600195e+00,1.203240550841615297e+00,2.133286965508505717e-01,-2.204538169998135344e-01,-2.264753490498093436e-02,1.426531277606574721e-01,-4.029412049265273521e-01,1.979836005409803534e-01,1.787491808162381624e+00,3.793536562817984015e-01,1.905952513293180106e-01,1.456670636575653210e-01,-5.356718591884723768e-01,1.722134876102836554e-01,1.132752513418563423e-01,1.751679244501254784e+00,-3.747788465327100971e-01,8.579197294209711666e-02,2.078605665649624346e-01,4.368186722065113825e-01,-1.140708968285998992e+00,1.197967612919873526e-01,-4.476258079139971979e-01,2.614511911950090362e-01,1.075995823936244156e+00,-6.082678192888377744e-01,2.204463450915224998e-01,-5.824511050943029788e-01,1.820753087291968608e-01,-1.500140612406029028e-01,5.234896605261054603e-01,2.411457968820943876e+00,-1.986087126450668816e-01,-6.219903085354678840e-01,-5.983963817294870591e-01,-7.074902090634961338e-01,1.277009492365786869e+00,1.249017516574734366e+00,7.914389219879520709e-01,1.376157371531786522e+00,9.883526984034081142e-01,2.831286028334804583e-01,2.805432150287212600e-01,4.048951972058099091e-01,5.545605048031766460e-01,7.999078429889703301e-01,3.134072897478102693e+00,-2.009834662490773971e-02,1.807133635579808439e-01,1.529574367404967772e+00,3.912819485031524547e+00,8.896565557279703107e-01,6.825839111538515303e-01,-4.870218971117590279e-01,-5.485013827923622687e-01,1.211157014110656904e+00,1.208292533177158234e-01,-3.266982795665835937e-01,-4.064126798840829169e-01,6.455807165650575552e-01,1.297328327643846091e+00,3.527610010645154670e-02,-4.621133674391533219e-01,8.846779006368061804e-01,5.574590543842801171e-01,-2.051909584693247801e-01,-1.493923633364718229e-01,1.245110281292113541e+00,-2.495945839689268642e-01,-6.187258641521855562e-01,2.983241055129888242e+00,-7.048503087602032702e-01,8.295999171927671834e-02,7.769839119019694706e-01,-7.953674210733979733e-02,1.592594286360190736e+00,6.183329885097696987e-01,5.737715891958115044e-01,-3.892883644521196729e-01,-2.917308363339697341e-01,7.108201932837454606e-03,4.341324801289159208e-02,-7.478930583819709543e-03,9.930590711573087370e-01,3.865946533555163489e-01,-4.841605755856505100e-01,1.694788983957661310e-01,2.125169576886914324e+00,5.774407440298233718e-01,-1.556233969250333526e-01,2.128386085822862039e+00,-7.669468886329533497e-01,1.458302720463307667e+00,3.586089302481710872e-01,2.865837537674705837e-01,1.144858920684609371e-01
1.036349824769235095e+00,1.014120666672728710e+00,1.471796999457041788e-01,-3.574632101340869395e-01,-3.253618506693984336e-01,3.241314548857731070e-01,-4.640670933323303715e-01,3.806189580746209278e-01,2.400590723026307494e+00,5.287729436762514945e-01,1.339288477619243189e-01,2.374436463795853158e-01,-5.504718773332608617e-01,-1.276717763415767815e-01,-3.962153670313178777e-02,1.828319524684041575e+00,-4.158828333758597950e-01,2.765270876226355035e-01,5.363471344045569328e-02,4.224479032294211622e-01,-1.141519375418835081e+00,5.796456630393842513e-01,-2.995495223957702624e-01,8.601708240730480959e-02,1.267631483962420536e+00,-6.567345664658524873e-01,9.812627451505563647e-02,-6.380600502732893808e-01,-2.832993030229292719e-01,-4.355688498376412143e-01,4.758689528318101880e-01,2.711304518567872357e+00,-3.075966167788492522e-01,-4.475728629872954278e-01,-5.840683106119596291e-01,-5.544345575725008191e-01,1.593420445210381065e+00,1.122404528941025381e+00,1.080851727581043864e+00,1.696952858917658347e+00,1.127929618538907164e+00,4.109209347986213512e-01,4.707866562621825790e-01,2.808480046274743347e-01,5.304034460299262843e-01,6.344556967068049058e-01,3.266331182025658642e+00,6.850215087720286367e-02,1.963609659096305915e-01,1.079626401743374320e+00,4.081404271140549156e+00,1.397110142156442025e+00,9.501970112370402566e-01,-3.703977154845347619e-01,-6.827050008431490014e-01,1.434239180467852259e+00,3.912087737000577992e-01,-4.868491363720810483e-01,-5.705963036905963293e-01,1.568479607219492200e+00,9.018097277668819522e-01,8.575533828288728344e-02,-4.100195990656563261e-01,9.463005469232408373e-01,8.348905019573973352e-01,4.741428272543868339e-02,-6.509151567960902440e-02,1.411292311082325446e+00,1.853133743917661364e-02,-9.062106349261616067e-01,3.003491584409487380e+00,-5.376543237473205838e-01,1.460004059140645460e-01,2.574186275803640456e-01,7.524726707036079321e-02,1.117196711867711967e+00,4.893557928518272315e-01,6.184807550510451613e-01,-8.982029378629614591e-01,-1.599836001974988542e-01,2.350867287706563946e-01,3.671732647278758699e-01,-2.397598275829851966e-01,1.211163644982389265e+00,6.299437555748751416e-01,-8.235228720542788761e-01,6.141050791120983288e-03,2.238153731215679620e+00,7.374160171453977286e-01,-7.483653189553178819e-01,2.467496829255022117e+00,-4.451635714243680764e-01,1.525177185535195878e+00,3.785554463920176582e-01,-1.902699847164293634e-02,-1.163978036923790649e-01
1.070167676864809847e+00,8.947195434628798516e-01,-1.535083858614196273e-01,2.303501345088883046e-01,-5.492093894999643122e-02,6.469119419196150966e-01,4.444693999173143228e-01,1.794840735289724432e-01,1.213047706100322642e+00,1.723033957153810025e-01,2.563110735146667540e-01,-1.871803155289113452e-01,-5.084230870470136665e-01,3.841147281888984133e-01,1.052837368477183011e-01,1.571032580391281019e+00,-3.947972785818172903e-01,-7.036949136315504560e-01,3.983950925495152173e-01,3.451580847172069921e-01,-1.008398948617218238e+00,-7.187435249370888179e-02,-6.143606902400590153e-01,4.006234286890879570e-01,9.717845718168747204e-01,-5.719972422152177494e-01,-2.964647847576873385e-02,-6.134839002631162774e-01,1.028733740689313780e-01,-1.136434517177860037e-01,8.560681694379794759e-01,2.235173309354376858e+00,2.767503519295033132e-01,-3.659976804932212335e-01,-7.242595523583432726e-01,-9.130208108895954133e-01,1.406023758237123777e+00,9.299643115197347987e-01,6.873665584775039417e-01,6.685363726857453948e-01,1.196687478695188656e+00,3.294384430928315455e-01,-4.374454923538437234e-02,6.786898333778288439e-01,5.162700113163855020e-01,9.301872307384266847e-01,2.598945576040519345e+00,2.930389481625550463e-01,5.874040265616020662e-01,8.091546527523273413e-01,4.701709268452621160e+00,1.300710420916763477e+00,7.974792854932875041e-01,-5.514462299639737441e-01,-2.056218118110153537e-01,8.605368694867907564e-01,-4.771605165677806903e-01,-5.002791931988095353e-01,-3.142636262932130276e-01,5.473845513231583304e-01,1.112713197943278498e+00,-6.338058786799671829e-01,-7.368589794261835024e-01,-1.023381410290241655e-01,1.342872156128402938e-01,-4.516497914020654036e-01,-3.034025459497107780e-01,1.262743259550080932e+00,-1.062799841620781560e+00,-7.715099891996324288e-02,3.113727440987595685e+00,-3.954809862148469524e-01,-7.101633171516157084e-02,1.248347805076862160e+00,2.432668931526129064e-01,1.566624398021853271e+00,2.605721175489532082e-01,4.859823256891326881e-03,-5.664378501941325084e-02,-9.105938492865300882e-01,1.245468421699661432e-01,-2.088699500368536577e-01,-1.621386676938218474e-01,1.036866053449972291e+00,-4.222774325945533036e-03,-4.778587785263390675e-01,2.374971541653914109e-02,1.882782095942979295e+00,9.463063105224931437e-01,-7.064502195376189952e-01,1.825210930968283130e+00,-6.417327429372298164e-01,1.568196788744381731e+00,5.746544321751261286e-01,-4.043143111324693506e-01,-2.407068167812052573e-01
9.666968950065696342e-01,9.234807264372654201e-01,4.828105392012191910e-01,-1.189544334102424772e-01,1.318254909885290815e-01,-3.192124709970051155e-02,-6.470026541221873817e-01,6.550022524037579785e-03,1.633249538025725478e+00,5.932203938259315024e-01,4.003989989347160328e-01,1.361645696122224525e-01,-5.619704467494219813e-01,1.521041845599875875e-01,2.950196840157420786e-01,1.828486790002587847e+00,-5.723651954295247979e-01,3.829420714722353014e-01,3.863747555004138357e-01,6.205248710848001448e-01,-1.335184333221629327e+00,-3.831692442044337676e-02,-3.219894895198490703e-01,3.581682614734639225e-01,8.782028086004607381e-01,-9.514818880975158821e-01,4.969448157003322208e-01,-5.880482057777718374e-01,7.730717767867603119e-01,2.479268185628800136e-01,5.042619242865225004e-01,2.490112851520861259e+00,-2.553664500366634726e-01,-9.253087415466834109e-01,-4.114347891386702649e-01,-7.572892062709272176e-01,7.530580933740038674e-01,1.660978943631088889e+00,6.596583177808570397e-01,1.893170863562772865e+00,9.340427951680356777e-01,2.228171403515390170e-01,3.320389290776725177e-01,3.047245704387833154e-01,5.878549746764909489e-01,7.635818879246356605e-01,3.285459801206195074e+00,-4.023626461827106149e-01,4.437099406504197568e-02,2.037795161794765608e+00,3.514687127001404399e+00,3.453063144256414141e-01,4.479919310182594594e-01,-6.503237794965545104e-01,-9.140402707338615151e-01,1.392054011439585182e+00,4.368732880225623116e-01,-1.936281759058813279e-01,-1.006343309967705490e-02,3.569518684585588630e-01,2.090136887701822932e+00,4.500099302096216558e-03,-6.696183520697320812e-01,1.414381361487171418e+00,3.727019721302509137e-01,-4.391177866225653981e-01,-1.460468840022024484e-01,1.468246878122058785e+00,-1.629198860638170765e-01,-8.710479822277785722e-01,3.084615158222125508e+00,-8.864994471665965659e-01,3.730219625852182475e-01,1.153755621750516269e+00,-3.545827089658468156e-01,2.160715332196971872e+00,9.491083697713718070e-01,8.776012388349885285e-01,2.141808935980860085e-02,-1.994193649913849620e-01,-5.368652293572779843e-01,3.322273376261930533e-02,2.402753569254181265e-01,8.239956674209699683e-01,3.071846512436805510e-01,-2.678160012491265229e-01,2.427567790506593992e-01,2.701781198426054686e+00,2.931280876629975829e-01,5.719511848294787093e-01,2.208949886564697707e+00,-7.911210543164681752e-01,1.249411882604605228e+00,3.368554950087884192e-01,1.057030077029293968e+00,4.144833788004183006e-01
8.089108709719793344e-01,5.728508038611878073e-01,6.160963142670812520e-02,8.321366288369436148e-02,2.018717827240317786e-01,5.889436403651913121e-01,1.100937745191444606e+00,-3.503922307491473820e-01,2.274037865721909579e-01,-3.055509142270193546e-02,3.188074564017295831e-02,-4.721126607882669690e-01,-5.337375660462810867e-01,2.947194727527052138e-01,1.051937227120134377e-01,8.628304818590250003e-01,-8.675257068965596119e-01,-7.445891376459603528e-01,4.023372377458994120e-01,2.803271264032440313e-01,-9.663595520141380346e-01,-4.526245934549955052e-01,-7.290029333702454650e-01,4.905529186815571485e-01,1.202344936234820638e+00,2.417857163752874794e-02,1.462788209330167788e-01,-7.069873015432188712e-01,-6.621594595968068875e-01,-5.120995068171961817e-01,7.667892664319790885e-01,2.355219274388832051e+00,2.747535592428366757e-01,-1.473576214901559100e-02,-7.383934212560576693e-01,-7.616314556597789664e-01,1.328888280862335902e+00,8.245608515360500768e-01,1.110623758298496577e+00,2.888624371542400926e-01,8.329008701044898766e-01,5.485179747833979214e-01,-3.337725853809149212e-01,3.641263683440285615e-01,8.286418635079740858e-01,1.102932765983613228e+00,2.037293700402270424e+00,1.888014650158746921e-01,5.433992209949313201e-01,4.328109042146079943e-01,4.266062565825880171e+00,1.581269200476018488e+00,1.602721687381129245e-01,-4.364901236126849104e-01,-6.585079773839330741e-02,9.084240256222839704e-01,-6.794198929078062443e-01,-3.315357125518511028e-01,-1.120312586926978105e-01,2.825276736150457157e-01,8.283711517899949861e-01,-8.718703537294095751e-01,-4.977113140120122958e-01,-2.313676382490568173e-01,5.543001304484922453e-01,4.855581653858742630e-02,-5.496559091194457292e-01,1.236531104750057786e+00,-1.081920186730443767e+00,6.524246805895620449e-01,2.283667788204775118e+00,-3.783893575924446862e-01,3.667678391307091501e-03,1.136808416122326637e+00,1.460007410485351653e-01,1.365647001522662496e+00,-2.446110756022760180e-01,-4.327224011121513225e-01,-2.916304333795217696e-01,-1.042201208535630474e+00,-1.362213096917541666e-02,-6.353203037914538776e-01,-2.490945341933170354e-01,1.599806942795607201e+00,-1.737721698603079679e-01,-6.633993354971228218e-01,2.966462082483151130e-01,1.239566560036986953e+00,1.035576629265811954e+00,-3.483573362806373641e-01,1.116113533312925510e+00,-7.034242797945338133e-01,1.158336972752300520e+00,6.952574131438953309e-01,-6.510661569707922869e-01,-3.495937286498891905e-01
1.237477817951572412e+00,2.355870200591201336e+00,-2.579051061012253010e-01,-6.573153192727594352e-01,4.483635741247539441e-02,-5.192207436848444990e-02,-2.655216368502011925e-01,4.201310709610444061e-01,1.339634027880699740e+00,-1.792605998250487997e-01,6.908519476079094668e-02,3.518905542038736622e-01,-3.839785189505702245e-01,5.781513004888541030e-01,-2.928275179934920480e-01,1.828743220859859520e+00,4.153220455501281383e-01,-4.410291588568674981e-01,-1.674111568474022371e-01,-5.236005185603636453e-02,-5.592414227258002413e-01,1.079686539396653711e-01,-8.484980770531355132e-01,1.879136063750878605e-01,1.438570695430449131e+00,2.146258369753989703e-01,-9.707260670218650911e-02,-4.348260958379140950e-01,-4.729319391821715790e-01,-8.500716253058795413e-01,3.387761027283093251e-01,1.767857885159604070e+00,-2.508744413563983588e-01,-2.366483509368985105e-01,-9.829607012826728774e-01,-7.508681327427610963e-01,1.952489311220844348e+00,6.611677172156111837e-01,1.031527261131808704e+00,1.976451242752419457e-01,6.821619964114744583e-01,8.664816381525564104e-02,5.387521124073089279e-02,6.230093800230150913e-01,3.267522253867489734e-01,1.007530499538521473e+00,2.851897969556041357e+00,4.895403239631674897e-01,1.438439707316942484e-01,1.471527029878521464e+00,4.141634643990602882e+00,1.230154620011851829e+00,7.873314111524883918e-01,-2.928760974129149264e-01,2.357360837376082374e-01,8.048507011756657059e-01,-3.779614789786165385e-01,-1.589108803404308545e-01,-1.350620191702211814e+00,3.386636366575319634e-01,3.700766352352974353e-03,4.538024127288872167e-01,2.060312154971994658e-01,2.669207799654374491e-01,8.171124346238062275e-01,1.590184105573760887e-02,-3.343497192542935204e-01,1.434573308764237609e-01,-1.791554931571366083e-01,2.334765026529523890e-01,2.630202542412528821e+00,-6.207884652079664889e-01,-5.824887887720732182e-01,3.021953047151813010e-01,4.705561689052210894e-02,9.356153384532637229e-01,1.023250654592153253e-01,4.512981332319606076e-01,-8.554281027460347575e-01,-2.818359724192371352e-01,1.128562630173581827e+00,-5.331251053984922827e-02,-1.174730914003588311e-01,1.015888796701833519e+00,7.483381528661097182e-01,-6.359640031151653217e-01,3.369158440389914411e-01,5.628293015231178309e-01,7.022361113340693795e-01,-5.833498119739961574e-01,1.629638509852771255e+00,-1.173926068740055451e+00,1.579827142080292068e+00,1.055642682074844629e-01,-2.540037023612810030e-01,-8.625149625696498790e-02
9.301055086112388626e-01,6.110007501430326782e-01,-5.597395039660161414e-02,1.667384402749128025e-01,-4.230191215725861986e-03,6.697365958899224037e-01,7.191638389331069803e-01,-4.165292146187998812e-02,8.678663549261953492e-01,1.659122913915940800e-01,2.194835560835676214e-01,-3.007254695897965124e-01,-5.211397696760523557e-01,2.661820615483175279e-01,8.134817748637557244e-02,1.307553591330206544e+00,-6.421026877086339901e-01,-6.526304195771029937e-01,4.009250139521423062e-01,3.361063444486614982e-01,-1.007887907616674017e+00,-1.335181228300699185e-01,-6.016390205565275151e-01,4.165242296842784908e-01,1.090572708279931913e+00,-4.010212345752359742e-01,5.634225204873555271e-02,-6.726515646278401483e-01,-2.504579264101408631e-01,-2.988574036767248643e-01,8.122837719168873871e-01,2.375865393379201329e+00,2.576001045539765832e-01,-2.006535450469877913e-01,-6.923123416302677802e-01,-8.294812042323438384e-01,1.357822779690279535e+00,9.159264147964695235e-01,9.517231125273879488e-01,6.742009199117930951e-01,1.071842014533269438e+00,4.451001933950862188e-01,-1.265283926351227772e-01,4.943754537664059034e-01,6.346487488072101169e-01,9.530689316890246232e-01,2.383048323946882707e+00,2.030060034615854825e-01,5.625572521622459465e-01,5.724728553108305862e-01,4.526326450631040998e+00,1.490835127593677978e+00,5.532826681877001107e-01,-5.110867964782166428e-01,-2.498298141473284106e-01,9.786501956533089075e-01,-4.296045569738339287e-01,-4.447222208489618467e-01,-1.951870806001992920e-01,6.680398378733138909e-01,1.022099065882422719e+00,-7.762243496208975913e-01,-6.735340751893389433e-01,-7.854651807387924567e-02,3.324583543490207127e-01,-2.315183414664460093e-01,-4.090094891522481069e-01,1.327127409204914121e+00,-1.010761361027729288e+00,1.520234328200753549e-01,2.783553079122273566e+00,-3.485671696426081434e-01,3.821675935152822612e-02,1.151828667283107510e+00,1.994624032924323109e-01,1.455613474690965248e+00,3.496702850995331291e-02,-1.193932156401243949e-01,-2.048724878261680704e-01,-9.466261656136029101e-01,3.882803155868574940e-02,-3.010258028530483077e-01,-2.234465021268795260e-01,1.315924055055530451e+00,-2.473280643853303928e-02,-6.266655730497471266e-01,1.019395314733545221e-01,1.730942030266973131e+00,9.889376320741594117e-01,-5.963335332125567767e-01,1.612900420898601084e+00,-5.595289944491275147e-01,1.349787682791317112e+00,6.322086719164989876e-01,-4.464502823532162101e-01,-3.207834212620441772e-01
1.058964867106339192e+00,1.154988074086423566e+00,-3.901272552457258347e-01,-1.372748996689697742e-01,-1.686832365480723794e-01,6.013731225210716680e-01,4.864786673852361520e-01,2.775775133859861854e-01,1.068459854919183050e+00,8.587857424135283968e-02,3.997300509643653132e-01,-5.112920563351885939e-03,-4.094015983475176590e-01,3.613949759717924315e-01,-2.610748055914305921e-01,1.731867696894724418e+00,-4.979951126334314360e-02,-7.330294056050740137e-01,1.346589035369224474e-01,7.717513808700557365e-02,-6.728155002937443729e-01,2.476414443836964518e-01,-6.614508222674133631e-01,2.761227925183670218e-01,1.321098659921296381e+00,-2.663826516095769703e-01,-1.405181768123740793e-01,-5.824508529967930004e-01,-4.614599878970160329e-01,-6.753431245088332702e-01,6.547366848741806855e-01,2.124652680265538329e+00,1.198136739458231514e-01,-5.309561327017334187e-02,-8.298491260511121625e-01,-8.521390303564462254e-01,1.746218657840235888e+00,6.902939564368493208e-01,1.217182699373247079e+00,5.188962075204339719e-01,1.013821750122600562e+00,2.714390444233549249e-01,-5.691611908941231202e-02,5.817648764752205715e-01,3.271085300265071938e-01,8.965853076673182542e-01,2.484462365753349999e+00,4.013581396919386202e-01,4.743869242601400082e-01,5.876345551212412976e-01,4.734905040030784384e+00,1.723246048071110703e+00,8.627317338526352408e-01,-4.504272820395647803e-01,-8.281547086453433515e-02,9.882237659866163204e-01,-2.638188138342402178e-01,-3.781523184059470966e-01,-8.216337995035156716e-01,1.127319883076738138e+00,3.762628912375374224e-01,-4.491608688026816898e-01,-3.670452274882812782e-01,-1.114518281803926758e-01,4.458424195396081258e-01,-2.307849076927410703e-01,-4.604086149722683707e-01,7.464198547617139079e-01,-7.030915537669812920e-01,2.488034205151756495e-01,2.857731482790612620e+00,-2.367405979318480402e-01,-2.102300060827465011e-01,7.234257306855547132e-01,2.438687935530456374e-01,1.057632442824851360e+00,-1.347930609590057838e-01,2.049152497588172528e-01,-5.671399134993264646e-01,-7.753836781971443770e-01,7.529539547718520076e-01,3.193244978756452912e-02,-2.883391229709322268e-01,1.225533501120581903e+00,4.668418973519815607e-01,-8.377710376078876253e-01,5.980073399846586035e-02,1.216245264726361963e+00,9.858512334727909110e-01,-9.774197326508113903e-01,1.751775880971609300e+00,-5.602021523940653447e-01,1.403979389883521778e+00,3.962649299274525472e-01,-4.027684527084950949e-01,-4.492515430084874084e-01
1.162980708986641298e+00,1.125555197617754688e+00,-1.712729422024000248e-01,1.055279931010810746e-01,-1.353890141048835205e-01,4.217273472668180423e-01,-2.559703238922075852e-01,4.156394071992863815e-01,1.653131616213927124e+00,4.219958616855417621e-01,6.408062418282756134e-01,1.454941448851273800e-01,-4.518726304111646552e-01,4.089207739707794720e-01,2.550242269922026184e-02,2.197579355977512527e+00,-1.719592279236964449e-02,-3.665079081128675975e-01,3.466742278072160732e-01,3.688256509147326279e-01,-9.876918793644561267e-01,2.344778728090975983e-01,-4.673790221141567169e-01,3.332284465028393372e-01,8.978857084319455950e-01,-1.009026986460541675e+00,4.960667481406191848e-02,-5.279036094587643557e-01,7.292811014662414770e-01,1.012372726218040420e-01,7.203444386420699841e-01,2.144034551573911873e+00,6.971649522915884800e-02,-6.748728487859583236e-01,-6.241276265422988079e-01,-9.896712987497942038e-01,1.224778723022689864e+00,1.216964905571431554e+00,6.457735813343381537e-01,1.278603680822175903e+00,1.219173595952581568e+00,8.812338291656196532e-02,2.010905575836350878e-01,7.088201964367418784e-01,2.329710141707850013e-01,7.697283420816598554e-01,3.065505823553984932e+00,8.151923859529583427e-02,3.730541239741703152e-01,1.451041296265929148e+00,4.552326918975998282e+00,8.646037930249537151e-01,1.016912900276461640e+00,-6.834036846125801645e-01,-5.294920375647163002e-01,1.079768530017933603e+00,9.018756889039192259e-02,-3.834495500206821506e-01,-4.662678377594220991e-01,7.835041603594962156e-01,1.487214244502216953e+00,-2.852554945203953363e-01,-7.671696474597052839e-01,5.231068833315013489e-01,-3.025824963904422127e-02,-7.873414278114898579e-01,-2.299870403229633542e-01,1.095683131461261839e+00,-6.530121250640269492e-01,-5.740221974547090600e-01,3.524887005873615919e+00,-5.095322409479154935e-01,2.800448561642600309e-02,1.244657091296853313e+00,2.989847168684942047e-02,1.848729813788013043e+00,6.459365556355924909e-01,7.225661444400857114e-01,7.339599330176449499e-02,-5.858035869755350289e-01,1.619440581401699886e-01,2.112155322627459753e-01,4.767336002802691208e-02,6.457938869023371886e-01,3.807808820709786546e-01,-3.930263191707151771e-01,-2.860312108845858292e-02,2.320272964143047734e+00,6.253660474230358091e-01,-4.067004100345658069e-01,2.297272934660647081e+00,-6.246607453680654842e-01,1.540310260576401191e+00,3.313277004221796274e-01,4.731608914427258283e-01,2.106571824874170495e-03
1.440290001626023386e+00,2.525130670890672224e+00,7.838329124676882143e-02,-6.493809160321611929e-01,-2.958853494335928480e-01,-6.559138138932540940e-02,-1.202427858346952316e+00,8.843452751467986150e-01,3.402103706420890106e+00,1.139828129206804652e-01,-5.724530871895729955e-01,5.546940760981191598e-01,-5.765033441314697527e-01,1.702362006624447144e-01,3.064596433399868758e-02,1.912414353332317019e+00,1.705372729392715114e-01,2.365191007258400924e-01,-2.628734203484641707e-01,3.173435801575065773e-01,-1.097996309171498153e+00,4.819442959472209909e-01,-5.790663753397830016e-01,-5.647105301503196895e-02,1.251768963621023190e+00,-1.772290124919867760e-01,-1.876014976925743094e-01,-4.738264315127295179e-01,-3.106585258926288784e-01,-4.930946387575629863e-01,3.885115501597333765e-01,2.303883013773315724e+00,-4.781727129761658146e-01,-6.481206541020632095e-01,-8.933990723569712467e-01,-4.818217864646233695e-01,2.234187716093331666e+00,7.953918056757994792e-01,4.138393371498785278e-01,9.393522502685794917e-01,1.154456665207559851e+00,2.838705826235168317e-01,6.387272837617545829e-01,6.561657956418367466e-01,5.634362830137378264e-01,7.696630545889686648e-01,3.761156563491572236e+00,6.156876326097534546e-01,1.538575201932630976e-01,1.657856295527352142e+00,4.109388066878832291e+00,1.124687740166097072e+00,1.351422494180752887e+00,-1.119316116207545453e-01,-1.823049159892919935e-02,8.613449305729473648e-01,-2.885804591965194232e-01,-6.166239399817956546e-01,-1.255073909487141481e+00,6.809875891973438122e-01,2.232365457435886158e-01,9.961926151769406879e-01,4.570737391019959184e-02,6.866720835647791565e-01,1.050080331999938110e+00,2.565916732337105710e-01,3.056734471786717311e-01,9.839262779466418918e-01,1.286496392827402302e-01,-1.157408145991017046e+00,3.152980341095131145e+00,-8.552240384195788359e-01,-5.328519983909780766e-01,-1.786004042288982518e-01,2.776479888632069071e-01,7.580228866045586322e-01,8.445075867762850130e-01,4.231222750244107433e-01,-1.210058719214649692e+00,1.610936627269415888e-01,8.189903917151781787e-01,2.128075006509605460e-01,-2.515404142348739436e-01,8.524274735700617667e-01,6.468651761446349013e-01,-5.026632188442834437e-01,6.853417736859251930e-02,1.628637527996430467e+00,7.588131472244481479e-01,-1.198212732970021621e+00,2.553497236290124484e+00,-1.113481065838797246e+00,2.299042159420966680e+00,2.316566081839763480e-01,-8.393226305944736509e-01,9.448677979804642746e-02
1.174645104434028919e+00,1.433232310627457151e+00,-4.879854291949977108e-01,-1.212163340467486972e-01,-2.456986802658352453e-01,6.673038037116643117e-01,4.577024573956416376e-01,4.588537975043063266e-01,1.419327017582213468e+00,-3.267590522545321674e-02,1.687050168237149705e-01,1.289195145703964096e-02,-4.268332620248755371e-01,4.059773971629401790e-01,-2.494582984540076875e-01,1.707003490815548474e+00,5.836906077190473496e-02,-8.695911093669870251e-01,6.737133583358714817e-02,4.864405417852906560e-02,-6.655894098770862577e-01,2.756104534896898217e-01,-7.336967289413307558e-01,2.273301732235553096e-01,1.317259844136743130e+00,-1.547399428389103770e-01,-3.072259735867659547e-01,-5.640523044096412697e-01,-5.860223908795509917e-01,-7.182203892792355937e-01,7.137784754763636386e-01,2.071649469810452615e+00,1.654553867178731319e-01,-2.508951591646085832e-02,-9.349979537837305177e-01,-8.352516688445823512e-01,2.026393674264186817e+00,5.029240747066007211e-01,1.035276355257680914e+00,2.381569701718460053e-01,1.128948147569541316e+00,2.957388540774749108e-01,-2.814963296753127814e-02,7.235485527937108863e-01,3.470464577609008172e-01,9.221763878771114253e-01,2.547760378061219022e+00,6.512031648467732081e-01,5.751758409649014858e-01,4.632766753718301489e-01,4.971958936433273912e+00,1.858340802571878170e+00,1.073928227235570354e+00,-3.618084337802132122e-01,1.412907415676694090e-01,7.927674389232196583e-01,-5.488249850260707996e-01,-5.187834744583770252e-01,-9.931798135518312698e-01,1.063322271663581731e+00,8.448600449589280248e-02,-3.482846346629968060e-01,-3.182763802023153010e-01,-4.043744479628957889e-01,4.692631478314434057e-01,-1.633942657817925581e-01,-3.478423255489869748e-01,7.341363860110506900e-01,-8.196793092956956572e-01,1.894209202284669047e-01,2.952676497465536620e+00,-2.217680739325420258e-01,-4.104116776623402685e-01,5.993874101841608626e-01,4.272586874262865875e-01,8.487127192381318519e-01,-1.205677288723597251e-01,-4.157390621471690473e-03,-6.879683406092060860e-01,-8.034946827756896948e-01,9.523187541534402500e-01,-6.182377368778024795e-03,-3.892864578765159456e-01,1.188013643022856058e+00,3.999873480235345835e-01,-8.117078599465583633e-01,-6.935366859197156231e-03,1.077154632664178546e+00,1.127428353512303527e+00,-1.391139978898281004e+00,1.807383247834738249e+00,-6.365633544332920390e-01,1.690547275006073491e+00,4.326509836416443378e-01,-9.101420343701247528e-01,-5.228074581792877540e-01
8.745767665005017566e-01,7.246016336660293655e-01,1.987266579344063588e-01,-2.703071909197794498e-01,9.986987471509570224e-03,1.009824340162811251e-01,-3.581126516796588333e-01,-8.640962319556022564e-04,1.164298093321171956e+00,6.312525561142113828e-01,8.316023135603872740e-01,2.003342661624292476e-01,-4.466385760992212517e-01,1.247210413661098277e-01,-6.003374154311402755e-02,2.048474768305390992e+00,-3.417051547461822381e-01,2.388173710919478943e-01,2.847026713389514962e-01,3.969866611146659618e-01,-1.013671965824394228e+00,2.728396176143323415e-01,-3.008500973833022063e-01,3.151599981768391512e-01,1.135759876778913879e+00,-9.085144636221756942e-01,4.383768132772907222e-01,-5.903870463917584299e-01,4.377911085125156809e-01,-1.549439594754056237e-01,4.059726729575476867e-01,2.423568011466326499e+00,-2.698625370205399165e-01,-6.130671685909379054e-01,-4.282664882505757831e-01,-8.018485178293716098e-01,8.513664278029302590e-01,1.533463523207609480e+00,1.256844830638052191e+00,1.920540967325614856e+00,8.187916440951573671e-01,1.542904116932722336e-01,2.421339699986682636e-01,2.002296628308308790e-01,3.356013811087103504e-01,6.992435841100110849e-01,3.019656791076143598e+00,-4.317615516274449505e-01,8.406690855250850691e-03,1.676731656995011033e+00,3.694423681362084544e+00,7.671641844561611912e-01,4.660116021010193843e-01,-6.860055530683486502e-01,-9.721900553599440720e-01,1.613650406198726461e+00,7.815347845724091025e-01,-5.993187929052768564e-02,-2.740263915440732667e-01,1.098212236194044067e+00,1.690564982036147912e+00,-1.714794759142863612e-01,-5.496596591083910965e-01,1.373000871587441996e+00,4.264931423047190195e-01,-4.582774687566670835e-01,-4.105968971779863641e-01,1.088450589724053508e+00,1.295345479144137391e-03,-4.848461013474648640e-01,2.951133364959208194e+00,-6.164343881132177128e-01,4.179238971408449910e-01,9.557091361838232491e-01,-3.853150668930782619e-01,1.895411037215945393e+00,5.126553537369462621e-01,1.132387290359623488e+00,-2.015421552010786543e-01,-2.543939735299089455e-01,-1.161746814414589268e-01,3.089682517331632239e-01,1.544689053801941436e-01,9.942083062672831817e-01,6.978833304820172279e-01,-6.336858844589511319e-01,2.147873138614977695e-01,2.322007962030783190e+00,3.315387233954938950e-01,4.154420109818234841e-01,2.142155400738784188e+00,-5.154859837607816964e-01,9.123189436344720793e-01,2.160047911197470194e-01,1.331655301652094447e+00,1.521662878088198001e-01
8.416214287906236269e-01,-9.210411443795962771e-02,-4.250419409733588449e-01,4.604976456083962333e-01,-2.054753589338952913e-01,1.133238939226088648e+00,1.234696545395209899e+00,-2.429750555767842823e-02,4.083930425936620479e-01,3.564148468902090805e-01,8.587800146330337725e-01,-4.096995994285886900e-01,-4.275616446745076904e-01,2.607134357541416869e-01,-1.354538010065519660e-01,1.625686227442870280e+00,-5.585318148291656959e-01,-1.025175317209804149e+00,5.549758930658930112e-01,2.521819137068995742e-01,-8.205435037818225030e-01,1.547326304977765798e-01,-4.969972575809679660e-01,4.712260562233020478e-01,1.085204521774557396e+00,-8.213447015034258669e-01,-4.022133890823939573e-02,-7.118855651369933035e-01,-1.072590559676733779e-01,-2.934098350572603708e-01,9.752608416981701778e-01,2.377992407349216020e+00,5.196703929738750727e-01,-4.962419643915194634e-03,-6.220984250963766948e-01,-1.036020974705301523e+00,1.235743256894444642e+00,8.956075347375451745e-01,1.302635956500709069e+00,8.660169524748072556e-01,1.248164650543831744e+00,3.826691605102402471e-01,-2.501771062085119124e-01,5.417466672835304919e-01,3.352287070634130117e-01,8.435222067017565939e-01,2.066866599751294054e+00,1.423050107750811755e-01,7.506232783175222911e-01,1.603008967717367561e-02,5.131053601633449368e+00,1.867540220733484579e+00,7.284183304982428941e-01,-7.130382137176536350e-01,-4.674997728041242473e-01,1.157990426391174887e+00,-1.356761365173931311e-01,-4.685909473166832706e-01,-1.055374314919411693e-01,1.487361114908043458e+00,1.138884781499863941e+00,-1.412836284268823572e+00,-1.016751713951115521e+00,-3.512779878705213354e-01,-9.101638033883419077e-02,-6.520790007712251590e-01,-6.538765882917165762e-01,1.319997297109614554e+00,-1.302865291373863199e+00,3.615491636908650386e-01,3.074645201969975261e+00,4.270559856187094994e-02,2.393940597598847586e-01,1.474433886412867212e+00,2.786129393486015959e-01,1.542977047268625945e+00,-2.632138566847179728e-01,4.830102580998973938e-02,5.077626488052255915e-02,-1.307224528012057130e+00,1.310749398682169442e-01,-1.278326347732355872e-02,-2.886760068104024524e-01,1.318850280197892966e+00,8.294351273527578172e-02,-8.618866530975015650e-01,-1.188750750237951292e-01,1.962010289531992635e+00,1.114482573832005219e+00,-8.816135710323156349e-01,1.728002142049609668e+00,-6.603616110502641412e-02,1.086299143532524436e+00,6.656067413121453669e-01,-1.484544893257552789e-01,-6.429761041993422577e-01
1.051693726386535133e+00,5.916962517117296816e-01,-2.544807425887471442e-01,2.720957495248413904e-01,-3.290304845681094603e-01,1.003617264455633373e+00,7.439543648593686109e-01,2.971718633889418593e-01,1.666853240433960881e+00,1.943536265563836629e-01,1.767122035913820666e-02,-2.871399256350859464e-01,-5.562321472255006283e-01,1.267340212315115344e-01,3.960793768184062147e-02,1.379240229535603879e+00,-5.980305405926300555e-01,-7.784509461027102617e-01,3.237968156859545865e-01,3.450682628730760704e-01,-1.046000945395211490e+00,2.037995772637756775e-01,-5.504786731524188292e-01,2.832133343208609877e-01,1.112241120501720193e+00,-4.965417838532587003e-01,-2.318154820740672417e-01,-7.033201706654692575e-01,-5.112884401152697489e-01,-3.798939933249144696e-01,9.519228096756637836e-01,2.539886008798277750e+00,3.496440260265324951e-01,-9.347443552221118557e-02,-7.671240602249461693e-01,-7.768977459557353527e-01,1.798679000964523489e+00,6.598818625700887397e-01,8.515988700940977374e-01,6.372977194905673493e-01,1.412130357254272273e+00,5.569651829872090953e-01,1.699326441878073676e-02,6.334713248357397575e-01,6.136222503468825584e-01,8.515873010820075306e-01,2.516717366298209413e+00,5.321749177622688842e-01,7.778875729396304006e-01,4.492681531467279665e-02,5.087330137403584196e+00,1.972664609217410270e+00,1.037492630224115420e+00,-4.025357431159724553e-01,-1.515411568745310134e-01,8.933161713280854954e-01,-5.842351626831586708e-01,-7.716146054828914025e-01,-3.627684374509831944e-01,1.260485326365537784e+00,6.293375395900537850e-01,-8.201520065711185303e-01,-7.701558011824644057e-01,-4.653206081368613800e-01,3.479205177656720105e-01,-1.540278614478015617e-01,-2.238407480655420501e-01,1.564570686109238995e+00,-1.146953842631776022e+00,-1.698777249307459325e-01,3.077543218661933366e+00,-1.638236327175225937e-01,-8.261154609829489404e-02,8.741228665081947069e-01,5.545263478552661107e-01,1.040729460875544410e+00,1.179699456519017753e-02,-3.536708055292192565e-01,-4.892293600689148203e-01,-1.016968098837058854e+00,2.946872115411540149e-01,-1.152379336968070711e-01,-4.855676552985804806e-01,1.352051997717703014e+00,-4.315044279887414458e-02,-7.781354442221166678e-01,-1.625627532667546227e-01,1.888850262629838461e+00,1.291884396615696762e+00,-1.517017886079001565e+00,1.975802903904394281e+00,-3.362107773238220965e-01,1.741579512607666969e+00,7.457231770428041084e-01,-1.206570316306123214e+00,-5.886069439496318667e-01
1.040825343400280545e+00,1.643915056197721380e+00,-2.395611285992557682e-01,-5.527266109202360056e-01,2.756909543112755212e-02,9.791993215140687434e-02,1.884495982608358489e-02,1.897089042914306134e-01,8.334409434535116068e-01,5.538744048228674832e-02,5.071482248640912793e-01,2.484180700414119758e-01,-3.523759946033357959e-01,4.429325442391938705e-01,-3.648817817586992307e-01,1.885945850605448726e+00,2.000068563648231268e-01,-3.810294007828819440e-01,-2.664661370570622217e-02,-1.785260264142032177e-02,-5.484606719172041567e-01,2.036296138962724322e-01,-6.952575134636466148e-01,2.509866312197523430e-01,1.457246885706068529e+00,-6.502856302055001758e-02,6.221412024258153595e-02,-5.010426320933314415e-01,-3.910450369429609996e-01,-8.237279543753677213e-01,3.463135645948841601e-01,1.937682855921146752e+00,-2.032864278973086636e-01,-1.608467310398879468e-01,-8.179492233744808383e-01,-8.021643756617861110e-01,1.604109881629348200e+00,8.602819218508108712e-01,1.403237236368992225e+00,6.484931503917976681e-01,6.435911571493395655e-01,1.039630420624224061e-01,-9.467814564595847249e-03,4.293568266249362386e-01,2.533883511416923362e-01,9.211434770258050131e-01,2.646560053573419946e+00,1.771608000488651413e-01,1.204012864904991098e-01,1.277661443331838065e+00,4.091399738825038490e+00,1.312228852982664229e+00,5.979701418483022168e-01,-4.435116393492531950e-01,-1.377743643979639221e-01,1.133600768946631199e+00,6.284088522336223059e-02,-5.151121166908875088e-02,-1.054550890806002617e+00,8.274035737503129262e-01,3.677855354957055845e-01,5.043252662283737031e-02,-1.344052834140990749e-03,4.940012589680956578e-01,6.963723238475554300e-01,-1.344295870220456601e-01,-5.353026012088853980e-01,2.819903532892015230e-01,-1.551607705718345831e-01,3.380165711198356293e-01,2.584865853903097310e+00,-4.708772120354576818e-01,-2.319790301392951615e-01,5.090886868755807315e-01,-1.011682303942111338e-01,1.146026717073696188e+00,-5.269170767661229826e-02,6.754770497672522023e-01,-6.921222167813049220e-01,-3.931028949853858645e-01,8.737847965347026458e-01,9.004099471614504524e-02,-7.673279203443561514e-02,1.149287844590592078e+00,8.257832606749385684e-01,-8.018555915800795741e-01,3.123739456898505518e-01,8.736480630527758695e-01,6.355448203333926571e-01,-2.890641549349619033e-01,1.625617976817985255e+00,-8.391750040342027539e-01,1.153538358543526376e+00,1.273183978195295274e-01,3.227236803557982370e-01,-1.625384095350882463e-01
7.983509198269487239e-01,1.021748433647690302e+00,2.590432619886247623e-01,-5.237848125512674091e-01,2.213109685460770693e-01,-5.019715059767132503e-02,3.454459243442514760e-02,-2.549648695689399336e-01,5.555372006692723685e-01,2.682989178172022204e-01,4.518363487936610801e-01,7.732371097865091414e-02,-4.479398219234482781e-01,1.917282102016105716e-01,-1.164097399468004834e-01,1.509828685147388327e+00,-4.437441701620200574e-01,8.597241662113441762e-02,1.459897766537540109e-01,2.327702802952918981e-01,-8.671396582337569381e-01,-4.821211650125489800e-02,-5.308527480018438993e-01,3.370733820836818717e-01,1.381235913410472582e+00,-1.714639802981748062e-01,4.398021775417927381e-01,-6.027514216769325195e-01,-3.150759140353200927e-01,-6.165561552006869617e-01,2.920461825189352156e-01,2.315218736811476941e+00,-3.098512995242014290e-01,-3.006889711074646754e-01,-5.863287692607731527e-01,-6.704837270346004630e-01,1.082408010976538826e+00,1.250578687163873992e+00,1.475490386762056128e+00,1.213364912740545698e+00,4.959936217485716448e-01,2.724474404110683312e-01,9.524944868913517992e-03,8.434667929056287317e-02,5.546660059632820827e-01,9.050490023602759670e-01,2.632123219769108680e+00,-2.762287105515129348e-01,-2.772552805142959598e-02,1.465440805607019836e+00,3.426545890318701826e+00,1.016687541408922923e+00,8.870830067368973282e-02,-4.933508102409224216e-01,-5.532024315957537741e-01,1.434935027868113888e+00,3.518063064315274935e-01,5.737698402184726598e-02,-4.456065981563673839e-01,6.433527274491381842e-01,1.051274894898742929e+00,-8.541777201666403418e-02,-1.389830087269404435e-01,1.065576205359811457e+00,8.571507473956900824e-01,3.459464329792660831e-02,-5.474722319456550856e-01,7.832144196150738757e-01,5.675899344671990476e-03,1.881124765106646501e-01,2.269187912570520993e+00,-6.506639325806995444e-01,1.916311918496640954e-01,6.729182890833349528e-01,-3.723261433915808216e-01,1.512831170732466202e+00,9.211969286686283453e-02,6.909375081535278351e-01,-5.554130562910470914e-01,-2.951246641062438836e-01,1.214446379797774478e-01,-8.524571520042900641e-02,4.782004012849006003e-02,1.369951245142575269e+00,6.212363392134666595e-01,-7.403218530325010871e-01,4.654623329806030774e-01,1.385992766881643190e+00,4.501313009788423525e-01,4.723521779996718295e-01,1.513697423922228724e+00,-7.843797887915362477e-01,8.066418530016905564e-01,2.425996737382236368e-01,7.962084926473194102e-01,6.176084857314290133e-02
9.586049026332078560e-01,1.099275061762130967e+00,1.384318318375386547e-01,-3.114392157058147870e-01,1.591309854547325042e-02,1.839034321453470455e-01,-6.682592957427962999e-02,5.422333866913206513e-02,1.296565494038381727e+00,2.875379197087548633e-01,2.564952957201875883e-01,7.682679704641846852e-02,-4.964349387872653008e-01,1.736272641442959119e-01,-2.238695651290323330e-02,1.609428660707983072e+00,-3.938920514174761855e-01,-4.644614930605518721e-02,1.653941306002582323e-01,3.138784165576927743e-01,-9.860202274433724767e-01,9.529822789610509215e-02,-5.074516943008058334e-01,2.774001841336090068e-01,1.239260286683768086e+00,-3.707113352022660124e-01,2.202540141939024476e-01,-6.032564574360631537e-01,-1.883722596273321725e-01,-4.313532147816658835e-01,4.743731989977144625e-01,2.377402683001998529e+00,-1.803943978350203703e-01,-3.851971130004158694e-01,-6.377244083123813079e-01,-6.914445288149313473e-01,1.332997633943223681e+00,1.125669277403447133e+00,1.109415657714152958e+00,1.164870552544916338e+00,8.401909534356591935e-01,3.162151096420687812e-01,1.367882434110544443e-01,3.092060491919383369e-01,5.506911437077299798e-01,8.495263321638675258e-01,2.841476393016506563e+00,-1.160213206801921637e-02,1.771851637212225605e-01,1.263785854250169649e+00,3.900232964688842063e+00,1.146283787105716323e+00,5.160838952971399385e-01,-4.567470374356388807e-01,-4.602254717425545705e-01,1.250553374216332836e+00,1.067771726277557398e-01,-2.357137802018616779e-01,-4.814737903988570156e-01,7.768275855865197643e-01,1.002323089661063316e+00,-1.010346636459312775e-01,-3.306482516717323961e-01,7.424465322669986378e-01,6.881917473939489494e-01,-6.643232011967342698e-02,-3.230488229287636348e-01,1.054189215467770779e+00,-2.448537602661213786e-01,-2.054809980008565073e-01,2.686885346979744682e+00,-5.932189355225474525e-01,7.036756151234239975e-02,6.804471578996175163e-01,-9.173580353564837753e-02,1.410525943238905455e+00,2.846344105368879274e-01,4.873498613740130381e-01,-5.366377378978992585e-01,-3.809259315233527454e-01,1.719946065890899378e-01,-1.391664646814341766e-02,-7.480466215164172095e-02,1.213478803604755241e+00,4.593271622214681882e-01,-6.611240837431016093e-01,2.417356982337883486e-01,1.713181503189045607e+00,6.434259290420943911e-01,-1.571003810272830759e-01,1.855238504561840474e+00,-7.159489605622159081e-01,1.247516908436553384e+00,3.528106808642030856e-01,2.298031358201471641e-01,-3.091527495396456660e-02
1.286573519549242040e+00,1.816112407583276633e+00,-1.380511996759494486e-01,-3.333612306032380790e-01,-3.258596338063352582e-01,3.890036116780972719e-01,-3.208849240125535851e-01,6.631128327740501982e-01,2.608500606038601788e+00,8.064919812973206370e-02,-3.357922230467891844e-01,2.214150310465322347e-01,-5.460131721708690877e-01,1.749727023881365584e-01,-4.575503948024339795e-02,1.684259585328544473e+00,-6.454555391631056072e-02,-2.615233262934402725e-01,-7.893095743230771344e-02,2.524480367073001497e-01,-9.855545995418263372e-01,4.014883152899217933e-01,-6.107702687261802321e-01,6.457748058853705897e-02,1.274008629355861233e+00,-1.866824838151355526e-01,-2.589751041829037037e-01,-5.608788454096911291e-01,-5.655184060163114257e-01,-5.915012731596096529e-01,5.966027873492749656e-01,2.347938363330957845e+00,-1.386841069158767092e-01,-3.193048354944935108e-01,-8.916556322644223487e-01,-5.969209892744554713e-01,2.170919776858873274e+00,6.363738304176865812e-01,6.925280493278642702e-01,6.658307901909586990e-01,1.223179393715465801e+00,3.920983040552590837e-01,3.461528509244070073e-01,6.523610708686542470e-01,5.542573185095214239e-01,8.212739782349899320e-01,3.173390319649935787e+00,6.551822291708255808e-01,4.178218720525389007e-01,8.879548112094128864e-01,4.571828754529200012e+00,1.607392360661356712e+00,1.237751734723064434e+00,-1.965672275225111010e-01,2.263848407347268665e-02,8.476228253691843184e-01,-4.566170330280118206e-01,-6.676244304424364673e-01,-1.017056332363360793e+00,9.900214653768919515e-01,1.617482055601259516e-01,2.624749161552801802e-01,-1.988802025182301592e-01,1.039883833515605760e-01,8.238559470545174790e-01,1.492097922496911644e-01,4.531847418589085574e-02,1.088002815822340263e+00,-3.831705257686267574e-01,-6.087138305281135642e-01,3.044942479474973318e+00,-5.209772886603232234e-01,-4.210584979320947108e-01,1.512311851864672485e-01,4.264235316550070154e-01,7.296273652922427022e-01,3.740528764921043359e-01,6.783897527591181698e-02,-1.025808527579265661e+00,-3.392243270625687757e-01,7.767881927445151602e-01,8.336095239756982633e-02,-3.955651851142657494e-01,1.114248587854048456e+00,4.273322015903869842e-01,-6.908912145286569828e-01,-1.661935879388554138e-02,1.506362234318811000e+00,1.025959157730292004e+00,-1.446743128182448546e+00,2.244722960617407281e+00,-7.973635796831297640e-01,2.060707974435335821e+00,4.213339690086767009e-01,-1.103770393951498230e+00,-2.612044078604212061e-01
1.178111633907794387e+00,7.541975721782966380e-01,-4.986922997974934657e-01,1.546981624547222323e-01,-6.507993766058584040e-01,1.095754013465918497e+00,3.548350752616783454e-01,7.053305834898800919e-01,2.401342931425146876e+00,3.662581358734496861e-01,2.311576987460181032e-01,-7.998661604281004367e-03,-5.032019127729384644e-01,3.489999498885158757e-02,-1.798581341903749409e-01,1.910017856163512384e+00,-2.083840593158166055e-01,-6.691008413408046085e-01,1.609843540301257037e-01,2.721379948710169194e-01,-9.336796327111926974e-01,7.595928509203301315e-01,-4.244467270115609980e-01,1.117251785663279096e-01,1.198792435084163222e+00,-7.742466586610953216e-01,-4.109506676611484055e-01,-6.622403456220660178e-01,-4.613914133508286719e-01,-4.853648856605383699e-01,8.970614799708150899e-01,2.560668415848756485e+00,2.377628617955443446e-01,-1.027820412587446552e-01,-7.781147888895637577e-01,-7.828220895598851925e-01,2.074358688698793696e+00,5.994457126004084646e-01,9.709890697254479619e-01,9.878728806802870022e-01,1.601341619536949423e+00,4.528112561397384939e-01,2.607349753234233791e-01,7.082132567266794521e-01,3.318280518367948129e-01,6.576503121780616912e-01,2.848513788674141622e+00,6.376488076922138815e-01,7.530395329217625111e-01,-3.896291079948821512e-03,5.408064794623208549e+00,2.180317146634512149e+00,1.531261628161762811e+00,-3.969313307045603256e-01,-2.808878152022011299e-01,1.045118413546224145e+00,-2.122746258766665672e-01,-8.712167299854518543e-01,-7.323326737150671617e-01,2.074675779855125413e+00,3.770864352729882962e-01,-6.071054194206040311e-01,-7.541625225028604218e-01,-3.253492950519611959e-01,3.317936995332365635e-01,-2.721475064103870967e-01,-1.248753509973442033e-01,1.444665241704414349e+00,-8.615214163568282180e-01,-5.858014348138900207e-01,3.469590708403881063e+00,-3.353354087511717374e-02,-1.227580280566114984e-01,5.286103359528373513e-01,6.531584665552939706e-01,7.831813930465427731e-01,9.128418817763189752e-02,4.279537891517309900e-02,-7.520671327976150566e-01,-8.284435073474994971e-01,7.012037504805681554e-01,3.874015031670242637e-01,-5.705147341510530268e-01,1.191428194566668708e+00,3.657218639531832349e-01,-9.669319625999940326e-01,-3.751422273946289354e-01,2.077465257470366922e+00,1.304046747518956328e+00,-2.038329291756387995e+00,2.509870766085499749e+00,-1.078659351966693158e-01,1.901275527246364394e+00,6.050195166356640009e-01,-1.108180601861628700e+00,-7.015665272639177719e-01
1.102204036267151910e+00,8.225608294777735363e-01,-6.590463163590560836e-01,-4.459898239972470702e-02,-5.643196842488903409e-01,9.731664464127376402e-01,4.754540269090540283e-01,5.953449154386457609e-01,1.684876357222496512e+00,3.240610537209807629e-01,6.413690609081121874e-01,8.534432540262266997e-02,-3.841197190760394231e-01,1.619255724260133533e-01,-4.426788252107035637e-01,2.104755848449973321e+00,7.649498455291520171e-02,-7.585317782117704244e-01,8.944920810167947267e-02,6.277831100698172406e-02,-6.281481925035625746e-01,8.112664662966966311e-01,-4.801692126002307104e-01,1.407999766338961511e-01,1.376316616559110750e+00,-6.513697901922484990e-01,-3.461053255555311958e-01,-6.159172308592404388e-01,-5.292057133837206884e-01,-7.493858363116654431e-01,7.389610517462059658e-01,2.322982825533839613e+00,1.700555944952477083e-01,5.157771440549251130e-02,-7.954163258818263138e-01,-8.664084546598550540e-01,1.982767561500287101e+00,5.971501367257717741e-01,1.403692239519155560e+00,9.135311722359287234e-01,1.331595071013173870e+00,2.921037926444114419e-01,1.213807026390210653e-01,6.252607180249434293e-01,1.118452971211283953e-01,6.817309518447159933e-01,2.622613720388732084e+00,5.085058691944837062e-01,6.066930536070821445e-01,9.676730282506551539e-02,5.285562748393480170e+00,2.193242211034741818e+00,1.351475151688339427e+00,-4.710228738577452723e-01,-2.876142038656892552e-01,1.179842079847727820e+00,5.929882923986390386e-02,-5.926104061262595923e-01,-9.565387137122174366e-01,2.209872037157910363e+00,2.030963646876245698e-01,-6.170563934113588722e-01,-5.601455591834839653e-01,-1.990124660631357179e-01,3.423724535522655321e-01,-3.591004009163140109e-01,-4.020906740510500343e-01,9.159141756218005526e-01,-6.662033842701040598e-01,-1.164232282485316849e-01,3.262118972419220775e+00,4.750057336485857817e-02,-1.202640617969766706e-01,5.107350584153219630e-01,4.569776461153458591e-01,7.849587328792614338e-01,-1.929792624992069661e-01,3.781489077160383738e-01,-7.675278988280522796e-01,-8.095442979414433360e-01,9.941196325942782686e-01,4.971852852277249823e-01,-4.805360010588054509e-01,1.220480184502997112e+00,6.991461674409240601e-01,-1.118515159988619168e+00,-2.508501751936242363e-01,1.604513370070256961e+00,1.161745961758512857e+00,-1.709297920584452513e+00,2.271795898626887134e+00,-1.016060236721426646e-01,1.517258387683110055e+00,4.134854008504539324e-01,-5.337386057253947769e-01,-7.344348223839092249e-01
8.955898753826687653e-01,4.501479817015263674e-02,-1.133124847862548024e-01,-5.969112132041765051e-02,-7.366611981733315329e-01,1.155186865433083687e+00,5.715693711128806420e-01,3.810858373691551337e-01,2.533849750347787477e+00,5.536601470832277494e-01,-6.943331027718374626e-02,-1.529768826260792247e-01,-6.104328277949435666e-01,-5.149655812648854525e-01,-1.565494157648912310e-01,1.366032465476506808e+00,-9.226149053151502244e-01,-1.480903143495848617e-01,9.017984401533246652e-02,4.049690157857340211e-01,-1.154506258075227887e+00,9.046280545427121123e-01,-2.162376077898246485e-01,4.787240819764587707e-03,1.466758192149061335e+00,-5.748182383614527380e-01,-2.265388708643037707e-01,-8.358797571590241837e-01,-1.327154486973912917e+00,-8.540338503606712539e-01,7.675157925186149033e-01,3.214715973103674962e+00,3.382090920995656225e-02,1.530746643996326872e-01,-6.300044957956054681e-01,-4.287188221221521212e-01,2.089329746278970834e+00,6.465149540491809121e-01,1.484319760482215589e+00,1.500296995184651205e+00,1.497746250171020588e+00,8.310139757538564931e-01,3.651888605128476017e-01,2.022344051438503265e-01,6.917255864046747416e-01,5.538641574387365152e-01,2.754611103067209132e+00,4.229624041470155804e-01,6.564901525741938526e-01,-5.495789646819165819e-01,4.933928646742202773e+00,2.679739123298798376e+00,1.203554934275124388e+00,-2.154394496020690108e-01,-6.007768669313817700e-01,1.479471601044804130e+00,1.203514790149908253e-01,-9.252505011555818282e-01,-4.261076439161513019e-01,2.791780533233460204e+00,2.178523046476413261e-01,-7.016987905195298802e-01,-6.521680175897387466e-01,4.170051942899810626e-02,9.866904040761752537e-01,4.091348423093922881e-01,-1.143591702728533610e-01,1.979860892571149833e+00,-4.650583226662431402e-01,-6.994251734642358276e-01,2.879245828269236362e+00,1.388719396722565280e-02,2.309245150355969112e-01,-3.610496272405006035e-02,6.244497401655786373e-01,3.655236898853411187e-01,-1.666120508734703631e-01,-1.618293205959295822e-01,-1.378200215687845231e+00,-6.584628485744976611e-01,3.894863030952715466e-01,3.976707945722529058e-01,-8.027342103004657670e-01,1.852294680596197951e+00,3.885091683489970138e-01,-1.371397712952186154e+00,-3.228890149630824769e-01,2.226503112079333491e+00,1.418568437940439519e+00,-2.067169247929665055e+00,2.482396531978841914e+00,2.183832665914456905e-01,1.615510332859758869e+00,7.748314848152935141e-01,-1.363308058717287441e+00,-8.494259245330002539e-01
1.221306510198592266e+00,1.503682986023957113e+00,-2.137895449201435150e-01,-2.179674152843022461e-01,-3.493255745033247983e-01,5.417065764459697563e-01,-6.644347352309482035e-02,5.884735545498893661e-01,2.327880849757222315e+00,1.324517829588700846e-01,-1.477915719442077225e-01,1.321836430378909299e-01,-5.250102695308904721e-01,1.641245528579088897e-01,-8.751582412001940314e-02,1.693543716687192058e+00,-1.275057330075222983e-01,-3.877881226548770544e-01,8.496317210186996038e-04,2.404763842760727632e-01,-9.459856291462236388e-01,4.225593804479310656e-01,-5.828168287498463052e-01,1.079074799117937522e-01,1.268619957952766608e+00,-2.890399425845465720e-01,-2.543020602740461156e-01,-5.888393887120424441e-01,-5.529440625621615535e-01,-5.856501920574651576e-01,6.575122087632609968e-01,2.373416296661279734e+00,-3.626950981827237186e-02,-2.388646868971847637e-01,-8.562653602252956464e-01,-6.561059040114809449e-01,2.077977352996914107e+00,6.450784539374792015e-01,8.228540249128704076e-01,7.071068504210741290e-01,1.250661286934105831e+00,4.009365120928620740e-01,2.675872396919291574e-01,6.343860354209232000e-01,5.056191544143882055e-01,8.075890251584182389e-01,3.003676360943996038e+00,6.026767179629884952e-01,4.832456030716012485e-01,6.774878738371881148e-01,4.713979226489631635e+00,1.726136961004817838e+00,1.205572515046821724e+00,-2.645489461004635889e-01,-5.324889668613730365e-02,9.096467637193214051e-01,-3.902880808166487858e-01,-6.601639297510643045e-01,-9.099607196251795482e-01,1.185445135419717744e+00,2.446096378518984871e-01,-5.096215862541109143e-03,-3.221425105636781527e-01,5.742731232777575912e-03,6.999820246974686189e-01,4.263154301920335509e-02,-5.931814892331432887e-02,1.127470675654786536e+00,-5.145785025151670133e-01,-4.731482292838427028e-01,3.062819008664249054e+00,-4.000159668985729944e-01,-3.237814158610194393e-01,3.016927420712260943e-01,4.343038344313607801e-01,7.899159185896249546e-01,2.452272997568782364e-01,6.178478353007405000e-02,-9.147885101696882071e-01,-4.905404385272275070e-01,7.279127611200895132e-01,1.088692006145366153e-01,-4.126029607676259259e-01,1.167402110893146494e+00,4.033055044186140137e-01,-7.616937412276648667e-01,-5.911550471864601697e-02,1.570526094361673231e+00,1.070512402653622797e+00,-1.459270187467050617e+00,2.200657643758189952e+00,-6.416059216611331717e-01,1.924224479917790553e+00,4.617840015459778735e-01,-1.011883539180294056e+00,-3.628172200982013873e-01
9.232735500862896405e-01,1.071784753488311148e+00,-2.163701972973033349e-01,-4.202126184786304508e-01,-6.170827222145083835e-03,1.436150854121991671e-01,-7.596125209501786157e-02,9.588516029403426622e-02,5.983824695980959341e-01,4.083459899250514447e-01,1.108183396784718555e+00,2.867562159213891126e-01,-3.067312911504581630e-01,3.681710836509817786e-01,-4.021164487482751237e-01,2.259740089638883731e+00,1.636122788193337674e-01,-1.937746969967414079e-01,1.407679661945076266e-01,7.140892156617559272e-02,-5.798425346002835656e-01,3.781908369361955402e-01,-4.803830162180421359e-01,3.091045339974149986e-01,1.348242332262762133e+00,-6.288434015487104345e-01,2.569350875339255769e-01,-5.165285999528256289e-01,1.705748073749364657e-01,-5.525780896505019246e-01,3.404896371734339455e-01,2.032766764740733034e+00,-2.099282528611742527e-01,-3.201951900691810127e-01,-6.010935056035634494e-01,-9.274830540502716492e-01,1.118578553704091316e+00,1.232843030992892608e+00,1.592682892671449579e+00,1.373844864485685546e+00,6.697872667345717845e-01,-1.266575069276049126e-02,4.772841086060493343e-02,3.186171593452093442e-01,5.371778717075248455e-02,7.713993058934298652e-01,2.711300083450304488e+00,-2.265426214566361729e-01,2.727870297246962061e-02,1.481378970425267561e+00,4.011078243876538885e+00,1.063759137717642966e+00,5.455983624923790298e-01,-6.855974403372639969e-01,-6.556497057059673672e-01,1.497683864492703742e+00,6.951195603619129137e-01,8.179294511073498253e-02,-7.680509903195832377e-01,1.255744560248127417e+00,1.055796570056773520e+00,-1.982339892255236546e-01,-3.009867414513068828e-01,9.861223596842245698e-01,3.863786549354502053e-01,-5.394445670658343239e-01,-6.579497570756120961e-01,4.023682336211313326e-01,-3.642903199751047066e-02,1.300448088083567544e-01,2.846598003995495674e+00,-4.141438519927750361e-01,1.533650783620866265e-01,8.500256293489667492e-01,-3.392661497353165467e-01,1.613533233322959726e+00,8.657637200921525222e-02,1.214686915575502235e+00,-3.258224125652062764e-01,-3.824839002982503566e-01,5.485601182916566287e-01,3.894402343604965733e-01,1.032905699521597942e-01,9.978148761780121223e-01,9.923404604532409801e-01,-8.197263166093211595e-01,2.459117630884441463e-01,1.515647327926745502e+00,4.032274285631938793e-01,1.791817425461175728e-01,1.878827606310832232e+00,-5.444489251419897258e-01,7.922816626502853232e-01,5.426198653624925150e-02,1.313085867797131545e+00,-6.900965581049595121e-02
7.555955595542102055e-01,4.744347717030232281e-01,1.196660168073151037e-01,-6.567753893729803005e-01,-3.288434886185613304e-01,2.792563044889767587e-01,-2.099116112343124008e-01,7.845724285756980332e-02,1.570144327713506094e+00,7.216284989183803233e-01,7.152023853649375207e-01,2.928022157923247937e-01,-4.409050186811294680e-01,-3.142987730438062122e-01,-3.920534262190106256e-01,1.945554372182222158e+00,-4.433265077602966397e-01,4.887253984840363996e-01,-2.082221068299703465e-02,2.585631104727139640e-01,-8.812428930469873301e-01,8.518801091475456388e-01,-1.645836152928586982e-01,6.835141619682692793e-02,1.604017570110540802e+00,-6.317778584360477234e-01,3.104216508524945128e-01,-6.847464023811271616e-01,-6.636109815870281370e-01,-8.851964563008608566e-01,2.247219306843890041e-01,2.823603328474137975e+00,-4.879240107770732582e-01,-1.487732467657618685e-01,-4.518812320330724552e-01,-5.143459937839158780e-01,1.361540581452009402e+00,1.248496199681323970e+00,1.985233986770682302e+00,2.158953515557703540e+00,7.905714215409627155e-01,3.808353608621158903e-01,3.890976195794496606e-01,-1.221610789089639798e-01,3.554617071120405036e-01,5.328420811744715158e-01,2.961333971644106278e+00,-3.212904043996129833e-01,-4.291392059341074539e-02,8.946883911436012138e-01,3.735609879480521922e+00,1.674470539719403295e+00,5.984920550019853236e-01,-4.484327936335424925e-01,-1.055541429081533700e+00,1.976431919142139337e+00,1.149778666405909311e+00,-1.567785660536984704e-01,-6.059577108710025861e-01,2.410960347594851783e+00,7.977060585814050864e-01,-9.723062556611365703e-02,-2.430558387364631090e-01,1.432326591443943808e+00,1.078256903323813631e+00,1.524827191538103421e-01,-4.416527535652107206e-01,1.104233179620965455e+00,5.040241121599384755e-01,-4.873128665192804077e-01,2.567252680790711672e+00,-3.470852808831670910e-01,4.769262942091069268e-01,2.277027001517924198e-02,-2.282662191227188830e-01,1.009738881196473814e+00,2.456982196962737008e-02,1.114877047191714876e+00,-1.156205502532887675e+00,-5.873631518934629980e-02,3.593581637107334803e-01,6.654831013820126095e-01,-2.232268525630727862e-01,1.556565390995795273e+00,1.136302297255740168e+00,-1.275849583236123852e+00,1.229888314579022646e-01,1.986828913331683655e+00,5.768905564203166136e-01,-3.088007122713688490e-01,2.301810098334847510e+00,-9.877035255697652616e-02,7.888085979725096841e-01,2.144582454390993320e-01,8.539348991328077343e-01,-2.529018822759016016e-01
1.311292492814243094e+00,1.789708028663935746e+00,-4.786540212928794280e-01,-2.825164827377463217e-01,-3.559387790101926075e-01,4.004040304993358168e-01,-3.991789329490590954e-01,7.727416469218999495e-01,2.114566581399998757e+00,2.231314706185434926e-01,4.631639162470450044e-01,3.995564561230453560e-01,-3.858197842674926936e-01,4.108637650364297955e-01,-3.055975027423651902e-01,2.364851052688969446e+00,4.665072244166358906e-01,-4.551190146018577742e-01,-2.225988726641443816e-02,9.432183081347017550e-02,-6.837949589386004279e-01,6.230983313733584605e-01,-5.761805298655673369e-01,1.238144731836392648e-01,1.233753096244275760e+00,-5.981259077462405260e-01,-2.488489102458480151e-01,-4.684765016685960015e-01,5.591205517503672340e-02,-4.837294587189278072e-01,5.633614693467627887e-01,1.999819721480544210e+00,-8.847252807690728083e-02,-3.870475262338268219e-01,-8.442049135728506570e-01,-8.806758421020450811e-01,1.909345912835103354e+00,7.885193229139482174e-01,9.104920564718019804e-01,8.868782873965409541e-01,1.185574812998170247e+00,5.626296001632508093e-02,2.879572442739115612e-01,7.732390429959279388e-01,7.763406155332414071e-02,7.437522175838514604e-01,3.140534878397645002e+00,4.761508861621930322e-01,3.441321438257964327e-01,1.181175098413749236e+00,4.802599643236293403e+00,1.386600631771986780e+00,1.369265916505501002e+00,-4.615342540843125341e-01,-1.732469982942343723e-01,9.945194486364852260e-01,1.061788486451764602e-02,-4.405344101384660593e-01,-1.194590140851959914e+00,1.289317053154156234e+00,4.323333083165241675e-01,1.278772834184648821e-01,-3.212835128608740876e-01,2.729096189529721661e-01,3.493948043270604931e-01,-4.628625653134521567e-01,-1.952321703427812860e-01,5.977911470366796820e-01,-3.452513982705239792e-01,-4.556815099906563749e-01,3.417885003668372779e+00,-3.815494906924722374e-01,-3.475136003683502728e-01,5.080051223521083736e-01,2.351328545417972204e-01,1.089913386073646517e+00,3.576563268267060614e-01,7.284667153193885580e-01,-6.213351528237276433e-01,-3.991915736251482882e-01,1.010263316112009591e+00,4.444359986877559066e-01,-1.864449683075523057e-01,7.553749433129866020e-01,8.018547380047245099e-01,-7.003739386744293194e-01,-7.520909772925349346e-02,1.567341184665741682e+00,7.992634734197996416e-01,-1.159049459118946634e+00,2.376949501537806597e+00,-6.575383817933697639e-01,1.766336434124624155e+00,1.780897788485508726e-01,-1.021280592146698862e-01,-2.429679559508136633e-01
9.167802862181849699e-01,3.587437529134293035e-01,-1.693458643709023492e-01,-1.892503762806874157e-02,-3.409338790220251547e-01,6.933088778007501229e-01,1.874801413639665404e-01,2.317306788999557998e-01,1.476157055942068475e+00,6.129681932455032234e-01,7.809826993978803422e-01,4.276308110401956519e-02,-4.492771042833607620e-01,7.251780988717329568e-03,-1.903539396144183493e-01,2.012782097021076577e+00,-3.693514896524527358e-01,-2.078002049689453845e-01,2.826895357277690590e-01,3.283206951226873560e-01,-9.364315643143930057e-01,5.895502653536521809e-01,-2.876386484253765086e-01,2.410572802104475332e-01,1.206007858740078209e+00,-9.636469881954927708e-01,8.390140233598063213e-02,-6.621327321717930259e-01,-2.578961145811797806e-02,-3.558277712825108630e-01,6.486099278557514447e-01,2.574169104815987819e+00,1.092322413976987150e-02,-2.790324959134150018e-01,-5.257423010766804072e-01,-8.190074378731504456e-01,1.307146202527309731e+00,1.143545344694206989e+00,1.361799902928982231e+00,1.665756379513804397e+00,1.179374956393010487e+00,3.127964495734160133e-01,2.054164230591900009e-01,3.458006877654135613e-01,2.796666935986536484e-01,6.325007536773039618e-01,2.793345407402030300e+00,-4.857498725388037508e-02,3.713470700933589885e-01,6.831874882926236570e-01,4.549318194324540876e+00,1.572456072791315496e+00,9.019914692542556622e-01,-6.152533062382139484e-01,-8.095331568792651922e-01,1.510276788814207904e+00,5.241652576856278278e-01,-4.029830064019221947e-01,-3.799402657944258022e-01,1.903104182928888832e+00,1.160871488066189894e+00,-6.162043430172280400e-01,-7.412000780903689190e-01,6.155754648484704772e-01,3.314268810611200600e-01,-4.304264514267028829e-01,-3.956129200864713091e-01,1.302524193460073754e+00,-4.109261394072625251e-01,-4.324896022197900480e-01,3.162770499025547188e+00,-2.192146072595266282e-01,3.236141180858122524e-01,8.211650397717171757e-01,6.412034977931900526e-02,1.405758424922863625e+00,1.694096424843412607e-01,7.049167808613451269e-01,-4.255567181294946932e-01,-6.100934539946359925e-01,2.091344253712831280e-01,4.375372590723334842e-01,-2.038224732573145626e-01,1.188618537274777509e+00,6.007012037952796923e-01,-9.241842454904485304e-01,-9.463644841888030346e-02,2.303859450925716867e+00,7.984656018710557523e-01,-6.932659152840974226e-01,2.306250647760062833e+00,-1.163063573682399099e-01,1.162428933541147513e+00,4.159169622481476702e-01,3.992056773943770120e-01,-3.471972015079619611e-01
8.292585958466933693e-01,6.328466031457713470e-01,-8.068760193337534692e-03,-3.573934616236302819e-01,-1.127326395498627620e-01,3.113741753330755979e-01,6.085190450813099394e-02,7.948854166937940890e-03,9.758842505086817720e-01,5.161286195557606149e-01,7.976925856246642743e-01,1.370699702727586899e-01,-4.117682223619905102e-01,5.906860422331543237e-02,-2.675454206874057217e-01,1.913197645583159190e+00,-3.149371842165344937e-01,8.479036469894424277e-03,1.704103688419451867e-01,2.320283018116367224e-01,-8.225705535711040906e-01,4.279892140312394622e-01,-3.585171433905124383e-01,2.567159617404322081e-01,1.369935271734858961e+00,-6.300764659424409331e-01,2.788466432429382857e-01,-6.273178264718959340e-01,-1.939663209598807558e-01,-5.806595464334562973e-01,4.029471562577003341e-01,2.452000445316905530e+00,-2.130326098492939246e-01,-2.494010912591804185e-01,-5.284899242490874727e-01,-7.480137376892740386e-01,1.180678805634144402e+00,1.227440930361491489e+00,1.615942105836376985e+00,1.611315465523101675e+00,7.978529264716320846e-01,2.490004490759400169e-01,1.391184638196298340e-01,1.536363032988105615e-01,3.137601279461561532e-01,7.111950723854373324e-01,2.727176805028263207e+00,-2.341289694007256950e-01,1.070313724768575253e-01,1.074485852499798888e+00,3.965265454371285969e+00,1.352020712062991681e+00,5.162507347892991705e-01,-5.797090870645089655e-01,-7.890283757427066780e-01,1.612746699891004276e+00,6.786582862078786027e-01,-1.105719659485131234e-01,-4.949993360899612171e-01,1.574234445259288684e+00,1.064460820919294726e+00,-3.328180791481480938e-01,-4.033238545750136295e-01,9.909196244658919905e-01,6.230174712593141706e-01,-2.242903147562291810e-01,-5.319050196001735564e-01,9.365364540379170766e-01,-4.011299139379859852e-02,-1.213843574919142299e-01,2.717260111658295507e+00,-3.821555133069071131e-01,3.174497313811734389e-01,6.524827618494226655e-01,-2.138083697096144209e-01,1.418047777181516533e+00,7.022479747828824781e-02,9.071225346925264610e-01,-5.684177324432966305e-01,-3.866204132302211716e-01,2.660100062985797376e-01,3.393242089848862997e-01,-7.187226163985130367e-02,1.292972940994620679e+00,8.030527266856090085e-01,-9.445886322173127070e-01,1.740775037689067106e-01,1.837221343211185687e+00,5.725488664518534332e-01,-8.236606756714376365e-02,1.982795653744819697e+00,-3.492839227002719205e-01,8.587753664037580670e-01,2.552346548968321693e-01,8.483311622631075632e-01,-1.728463069560299825e-01
9.799007909160494245e-01,6.126423589506424516e-02,-6.091308290626166189e-01,2.271726352419012329e-01,-6.137561043227923729e-01,1.073659008047038066e+00,3.328559462863418528e-01,5.041780942900065954e-01,1.508684241008104721e+00,7.910809820837961803e-01,1.361790937759506326e+00,1.013170044410947324e-01,-3.490817612200127762e-01,7.644484354751322763e-02,-4.099920449733389094e-01,2.574089552476357401e+00,-1.716961684263412780e-02,-5.421877431872388353e-01,3.569923353836547686e-01,2.355617222540077882e-01,-7.431528920780757774e-01,9.926421759212404883e-01,-1.967426384886437618e-01,2.320563479278118235e-01,1.148436909499794822e+00,-1.459774860109775085e+00,-1.102195231715387413e-01,-6.392667372770578504e-01,3.232982472536303220e-01,-2.675794663685582275e-01,7.970727405206051719e-01,2.463899064796726268e+00,2.132471475060428445e-01,-2.244198862714678611e-01,-5.079499626911849752e-01,-1.046766436307003501e+00,1.333194412036006860e+00,1.099196598766590149e+00,1.490185118635240169e+00,1.853024251092535435e+00,1.448736356898513211e+00,1.544974494840761214e-01,2.117906604923923686e-01,5.406083676433152130e-01,-1.145031478580931239e-01,4.905691127750129166e-01,2.754615172174786242e+00,1.245771442818660937e-02,5.396828828725475091e-01,3.752800446159088033e-01,5.251826115969926434e+00,1.809681183604624488e+00,1.336356471684707170e+00,-7.973576383386200561e-01,-9.545971029586588497e-01,1.589392685388179460e+00,7.883672087551039098e-01,-4.849448822430100225e-01,-5.047699429542240601e-01,2.659038518673141560e+00,1.214739813516525935e+00,-9.731691644986999457e-01,-1.041128844573646850e+00,3.788842145420694973e-01,-1.462590780179324756e-01,-9.428659465277344776e-01,-4.998992923547044276e-01,1.195509696722878212e+00,-6.241789523252787575e-01,-4.933965205304948753e-01,3.710890921625599859e+00,9.933543901207192439e-02,3.765038754717306424e-01,1.055109213640904375e+00,1.925113708435928772e-01,1.469149577747669966e+00,8.706326788747764667e-02,1.003831707698807696e+00,-1.915257377931481875e-01,-8.377312905865481607e-01,4.733722935623296824e-01,8.445930900290898879e-01,-2.410731886725346329e-01,9.610951210845705139e-01,8.009864477271441130e-01,-1.058272636334091743e+00,-3.747989582717972668e-01,2.591692981704534660e+00,8.836381879383812255e-01,-1.148487364084685547e+00,2.655765113394640942e+00,2.660535837457402852e-01,1.150396877072925816e+00,3.666902482452218948e-01,6.563482423902013974e-01,-5.883530057265335955e-01
9.439959526675127943e-01,6.901085128580946026e-01,-8.743692552280124541e-01,-4.427902635136122811e-01,-5.027127817654069020e-01,5.458190757446688135e-01,-8.068191911659489124e-02,5.178507297173848833e-01,6.910195081601453460e-01,7.770873796429267344e-01,2.147032689722341736e+00,5.923661789586788240e-01,-1.001518968385728403e-01,3.059396903886139052e-01,-9.879097507786945842e-01,3.278500892069956762e+00,8.391495415540757286e-01,-3.689122046955515821e-01,3.740639105426799699e-02,-1.897424094562995545e-01,-1.324800031718458282e-01,1.318393888492030985e+00,-2.539854600030708176e-01,1.653116833391763685e-01,1.546734575327132877e+00,-1.266086505199485845e+00,2.945129739445861983e-02,-4.764803023996047049e-01,3.360111527534488385e-01,-8.100854941127763054e-01,3.044799524444357641e-01,1.947647934295948069e+00,-1.877195622931115415e-01,-1.009240630945620332e-01,-5.447271466296568221e-01,-1.145615923172227379e+00,1.254018910693591948e+00,1.182031256471230307e+00,2.288869335917305126e+00,1.985174881886840881e+00,8.762189681613701264e-01,-2.810984731728383701e-01,1.728414493507597904e-01,3.727663697368606699e-01,-6.534800887193642494e-01,4.505563145339461228e-01,2.739592604857672864e+00,-2.675586086535949315e-01,4.545839737250217255e-02,1.059804072587235746e+00,4.770249373734999132e+00,1.597930314631489601e+00,1.155338322644173576e+00,-8.969734654838976695e-01,-1.042514579547654030e+00,1.943633340279156796e+00,1.597308814204789318e+00,1.174371747299667035e-01,-1.236168704296582099e+00,3.003131079763207367e+00,8.071849271854658614e-01,-4.653838021800476565e-01,-4.609277306923407203e-01,1.076435861970411523e+00,3.270915848440369977e-02,-1.078767725513420039e+00,-9.003075027871051406e-01,-2.797773324457386579e-02,2.167501191825141615e-01,4.019886760861191011e-02,3.432363897427074484e+00,9.716104473723247148e-02,3.091101350556744731e-01,6.930947298827275782e-01,-2.984044653330883423e-01,1.409098922434008028e+00,-2.046685701751688735e-01,2.063224077872889417e+00,-4.326023085522173739e-01,-4.172263538984913867e-01,1.236764833762868276e+00,1.308680347724232362e+00,1.555743916648499869e-02,8.255090323356046866e-01,1.776700243376628796e+00,-1.327231849398073038e+00,-1.124810724950471852e-01,1.714061090218053085e+00,4.114040708734988949e-01,-4.289546485958302680e-01,2.495329233728775797e+00,1.508687249757550974e-01,5.150785067030050346e-01,-2.030800972991012032e-01,2.086772292266029005e+00,-4.658477517877526175e-01
9.128510678080683505e-01,8.950135818964818357e-01,-1.599324489557760881e-02,-3.962542745328549998e-01,-9.192964240748886795e-02,1.500020995741010998e-01,-3.103894347831994138e-01,1.302243602926948518e-01,1.149741533543640504e+00,5.714387116603264483e-01,9.355523353808128384e-01,2.963716397736378405e-01,-3.849027724045883669e-01,1.592060013839564636e-01,-2.642416736682867695e-01,2.204843452110019086e+00,-8.027314201381097192e-02,1.122799867600171031e-01,1.583763895061030824e-01,2.407248125161525198e-01,-8.122246589259751737e-01,4.717481420937892911e-01,-3.415661081114115261e-01,2.510400121509996918e-01,1.285605866860606517e+00,-8.007658377771457170e-01,3.111423758010533058e-01,-5.625872111686560650e-01,2.083147899057049557e-01,-4.130856567150313907e-01,3.522394482528447002e-01,2.314054699165067674e+00,-2.912054404794327533e-01,-4.500755220381091326e-01,-5.097075859274726728e-01,-8.154453879571383901e-01,1.083661383291028901e+00,1.359939455765070804e+00,1.469685252314921309e+00,1.769032127295657286e+00,7.956796771638156018e-01,9.861066389319544934e-02,2.289705878080519064e-01,2.339025508828477817e-01,1.850582216381589373e-01,6.792892134594676889e-01,2.960577780360275746e+00,-3.008935434941035214e-01,9.987946581501816468e-03,1.506083398219690839e+00,3.885893955822488532e+00,1.023045404192964858e+00,6.105494094465366839e-01,-6.483787321099467871e-01,-8.590627633803701313e-01,1.616739165121243937e+00,8.263886144197499783e-01,-4.251606646403647410e-02,-5.832228741258880245e-01,1.427043253879719531e+00,1.275252108490909198e+00,-1.176133385832962008e-01,-4.057057085375193051e-01,1.235174771988704512e+00,4.892251290963713917e-01,-4.306892829420251312e-01,-4.809064820944746743e-01,7.994875936142615824e-01,8.819883736326111778e-02,-3.247179077603346009e-01,2.937993335931218475e+00,-4.906405784356079325e-01,2.950537749325738979e-01,7.360582546025967732e-01,-3.204218927698944674e-01,1.625085968655391788e+00,3.120529045313204519e-01,1.213096713184881104e+00,-4.150274842083732096e-01,-2.458000447759350338e-01,2.810411012114835683e-01,4.593614751491818526e-01,7.154976266893442460e-02,1.026785885429134293e+00,9.259762087479646020e-01,-8.041519749273853268e-01,1.788028189733751883e-01,1.987125360124373907e+00,3.971837227938235237e-01,1.262029681671426595e-01,2.151661455906087816e+00,-4.557272152255260611e-01,9.057067380251770938e-01,1.300252270901033347e-01,1.245393793006353444e+00,1.378699950640882577e-03
7.730292303859578329e-01,4.961907642682695241e-01,-1.683432935203532654e-01,-4.741789205044381061e-01,-2.201425439243197002e-01,3.890209336077340985e-01,1.738178632367027021e-01,2.899263044245063703e-02,7.988227939138746736e-01,5.777316996117373149e-01,1.064273099857102833e+00,2.046488569859754303e-01,-3.450224783459057143e-01,6.624201984907970853e-04,-4.931029280992225705e-01,2.080987768321219900e+00,-1.770529902164874048e-01,-1.461739060513983501e-02,9.115198507939764605e-02,1.071131370436881058e-01,-6.413758599923045089e-01,6.794493590344703460e-01,-3.144460989316109067e-01,2.071077818708629281e-01,1.539196878492482989e+00,-6.385134666278160509e-01,2.458435922297954046e-01,-6.323461824172876833e-01,-4.076356351553291901e-01,-8.345975162117238444e-01,3.267785851708615574e-01,2.453892319071828698e+00,-2.541794928855228286e-01,-6.907822462518914408e-02,-5.242493677732779078e-01,-7.550752824570676758e-01,1.252346002540771774e+00,1.166427356893571021e+00,2.001507762487522157e+00,1.721358800436729730e+00,7.423506283796807992e-01,2.133942410967437364e-01,1.270883267253561377e-01,6.832876437976959094e-02,1.537419088602373640e-01,6.426885583561235959e-01,2.619300531282707123e+00,-2.668216453738442850e-01,6.750963276900665000e-02,8.581820260220842655e-01,4.058301072782770191e+00,1.623732886880640436e+00,5.584032121519937331e-01,-5.947742217864615544e-01,-8.710225572394423299e-01,1.792794977920706412e+00,9.591046965363061449e-01,-3.995692903379044481e-02,-6.655064996651228748e-01,2.129799760811735165e+00,8.218457838993959985e-01,-4.056768151008843803e-01,-3.284323853441015739e-01,1.033963604184463980e+00,6.865806939161607225e-01,-2.181577929135890548e-01,-6.715719553857251167e-01,7.348172751085760845e-01,1.245738870740917825e-01,3.320661369553429276e-02,2.656242328989868451e+00,-2.177876749628459563e-01,3.683453333355828918e-01,4.725667380430370601e-01,-2.354986124420996862e-01,1.230512839324847896e+00,-1.719905697139521017e-01,1.110053554601366788e+00,-7.530694755278135588e-01,-3.753803593838567765e-01,5.239489563668440208e-01,5.627557875794828579e-01,-1.332687493868830453e-01,1.400931455961650363e+00,1.083324423789879809e+00,-1.193620661632832647e+00,1.403436202994586546e-01,1.667083963700220162e+00,5.873320517626282600e-01,-2.040640825060293650e-01,2.011874751815849294e+00,-1.483369505218219975e-01,6.580442531926615768e-01,1.728348403686011947e-01,1.042195097231939815e+00,-3.313179717889419007e-01
1.306040219222063925e+00,1.586622193937503145e+00,-5.405529798047361556e-01,2.190343828102729873e-01,-1.416551851540114315e-01,7.298097000743242191e-01,4.782536094834319296e-01,5.297240647149104031e-01,1.408102943471349899e+00,-1.313906927402579139e-01,1.157579237523018167e-01,-9.241710027894572965e-02,-4.490786018216950115e-01,6.658481092453668593e-01,-3.330206880339975362e-02,1.733296681669482142e+00,1.206246922870956584e-01,-1.178795089414399033e+00,2.532865396707756900e-01,1.342866968893393909e-01,-7.618956372922567333e-01,-2.508880261686108337e-02,-8.380224664912279131e-01,3.531220216793706790e-01,1.009501602568793288e+00,-3.229544207337189388e-01,-3.694336457910433191e-01,-5.193120828856354620e-01,-1.552356162951218366e-02,-2.779918849933851188e-01,9.270505593930914445e-01,1.854328839725966960e+00,3.994483862867285739e-01,-2.517141057470999033e-01,-9.754558103539494596e-01,-1.013342715672411742e+00,1.902284571398986435e+00,5.333858337479187028e-01,4.839085807841585485e-01,-6.583529772507668021e-02,1.298315493789220731e+00,2.117492819576931584e-01,-1.123079642258853622e-01,1.022716244745815795e+00,3.509785645595260295e-01,1.021778752450281935e+00,2.569484486409844948e+00,7.655069598200879843e-01,7.453134741342307690e-01,6.786343330628988868e-01,5.241405517697618421e+00,1.505447332549953554e+00,1.176102249067577876e+00,-4.637248180174239343e-01,3.092924700993302523e-01,4.533626494039659782e-01,-9.740187445140794376e-01,-6.120470454364618229e-01,-8.320185743564618708e-01,3.646227831967441269e-01,4.624226804467312935e-01,-4.753964068353463968e-01,-5.694830192364361832e-01,-7.376788954867105064e-01,2.708810971137909362e-02,-5.237950526251059502e-01,-2.613315883258490180e-01,8.263484403356068375e-01,-1.308775333780713535e+00,1.422201332349565250e-01,3.302824608339591350e+00,-3.037287425785596406e-01,-5.360410143278749873e-01,1.140099732976303626e+00,5.130363995039716185e-01,1.240941776097219229e+00,1.450372151170771784e-01,-2.020117008210812193e-01,-1.551611871428020262e-01,-1.031644060424941722e+00,7.534438239434495532e-01,-2.345951693788327908e-01,-2.718319509081402741e-01,8.557490208964567691e-01,3.181553770384037971e-02,-4.394890282269964255e-01,-5.526073195050773545e-02,1.292130064563743463e+00,1.142000299503892702e+00,-1.352762701379530252e+00,1.780335023862695820e+00,-8.368286263533251113e-01,1.961123249826606241e+00,5.149640943034590190e-01,-1.048861536142060569e+00,-4.011904608317971022e-01
8.216245720156352128e-01,5.745323639915933533e-02,7.083386566534570772e-01,6.115739866526637147e-02,-1.886158388303621480e-01,4.828378529219081727e-01,-1.836304195752486712e-01,-5.686269653594921980e-02,2.428854116048951184e+00,7.445057162580522858e-01,-2.192305608463003819e-01,-1.888789018894747040e-01,-7.507814390562261853e-01,-4.389824356290482066e-01,4.760277216033592662e-01,1.165207195580650668e+00,-1.425334220752347392e+00,5.601250342319122888e-01,4.149130052735306995e-01,8.636519600562657661e-01,-1.724163067433973184e+00,1.628728427820868574e-01,-1.201048937548488960e-01,2.283423845290316612e-01,9.672358243477741091e-01,-9.108688541117874182e-01,3.849506454424181934e-01,-8.110178888722628932e-01,-1.251840228042884196e-01,7.585769834224009855e-02,6.986129131262236447e-01,3.283809466836858704e+00,-1.612898868777889738e-01,-6.461682767537400007e-01,-3.402694727906725447e-01,-4.293463010075064812e-01,1.086353689697395541e+00,1.464945214323614575e+00,7.481566647396000747e-01,2.152796624168987094e+00,1.285135532759235755e+00,7.585909768935532593e-01,4.736157196749608556e-01,6.737520077026366849e-02,1.043462316439093929e+00,6.438941880220052649e-01,3.214583199609000630e+00,-2.362063264272773466e-01,3.254586083214068282e-01,9.118015278986147942e-01,3.756291291236595331e+00,1.199513380389716666e+00,5.595311853774236344e-01,-4.100401729538351026e-01,-1.042626567254940628e+00,1.533819867201026588e+00,2.650417669928297193e-01,-6.701661508277555468e-01,3.970143315778587034e-01,1.209827692878253869e+00,1.820810912538470383e+00,-3.765775866099762559e-01,-8.831554829276233587e-01,1.097679942220313176e+00,8.006005328192421500e-01,1.800837185635214555e-01,8.666243289689867790e-02,2.472348002300635894e+00,-3.201743655649293974e-01,-1.264400690446904507e+00,2.894175124673001420e+00,-6.796466034112488286e-01,5.942540851936554125e-01,7.021476317743343687e-01,5.615324857247912249e-02,1.569402936492012124e+00,7.609260647186986137e-01,1.277022458610062583e-01,-5.467123502763500120e-01,-3.367471615557743880e-01,-8.706509104147062139e-01,-2.790262808928350990e-02,-2.266346652626944624e-01,1.448097368669848173e+00,-6.484741279287276061e-02,-6.127727166102869827e-01,8.222663330149704297e-03,3.185301658848668005e+00,7.913384350499150788e-01,-3.547796767158476472e-01,2.425763060597131648e+00,-3.155587387434071744e-01,1.481703161786245948e+00,7.707999913580706464e-01,-2.051538171789105136e-01,2.609579043524001829e-02
1.397632488283246488e+00,1.477594346774475653e+00,-4.378124558601022009e-01,1.820943904792602375e-01,-5.295079803689822784e-01,8.821410006186478636e-01,-1.867727810578673209e-02,8.935163080214210130e-01,2.842564141525989463e+00,1.478216833504389927e-01,-1.791916303452861237e-01,6.237344640482671287e-02,-5.511795995518361524e-01,2.667604092691130968e-01,2.976101417156129525e-02,1.874244124127684596e+00,-2.529910844260208069e-02,-7.347955291988277349e-01,1.333968447787003686e-01,3.216920751710243276e-01,-1.037340733548935079e+00,4.862647788850852359e-01,-5.864950371157306996e-01,1.246070077712548990e-01,1.013083377607598035e+00,-6.321441779523885307e-01,-4.975081347289102007e-01,-5.771031536218794722e-01,-1.603601712786505429e-01,-2.374725248249571763e-01,9.459784580916753560e-01,2.323535673809268509e+00,2.416753740783416649e-01,-3.602904835616852486e-01,-9.046136392328868459e-01,-8.050625663838544277e-01,2.214654624195159460e+00,5.411672573487162907e-01,3.546080345048205906e-01,5.689684689394273187e-01,1.661601929315733805e+00,3.823011894584115722e-01,3.077941539778496494e-01,9.740949098781842563e-01,4.252987285322520350e-01,7.781041649903062130e-01,3.113923820122963093e+00,8.699370324965342016e-01,7.795211732447240305e-01,4.640649253079897063e-01,5.391953724856723085e+00,1.776597712040297372e+00,1.663757058255229904e+00,-3.268945478718775499e-01,5.375081616944543672e-02,6.425835580951139159e-01,-7.179139774642399052e-01,-9.564615514242421623e-01,-8.588556992882238061e-01,1.193013975692943873e+00,3.860182820863690134e-01,-2.262178409745888574e-01,-6.756646533074237571e-01,-4.902830365180040895e-01,2.562503930974541211e-01,-3.073173608256227762e-01,1.090887666142476009e-01,1.385725241984009592e+00,-1.015310064880404095e+00,-7.731186737924169439e-01,3.646964825350193173e+00,-2.892933473417656498e-01,-4.403916252791850172e-01,6.218257729081440033e-01,7.330921797834235587e-01,8.911919040357116906e-01,4.501085431283310956e-01,-1.560841519466812377e-01,-6.042769546894029009e-01,-7.527169278828305110e-01,7.193429151294936652e-01,1.421941868816196108e-01,-4.823098917363523030e-01,8.849930890362713853e-01,1.346705012399261880e-01,-5.889683801171946564e-01,-3.259213033830427597e-01,1.988734950007336577e+00,1.273771447488466935e+00,-2.057021075235305752e+00,2.507703776293090492e+00,-5.531148259696252456e-01,2.358118192796338164e+00,5.968540202273986406e-01,-1.486682584200861079e+00,-4.696953709664238308e-01
1.214020980055706689e+00,9.488512174311676262e-01,-4.248101395803702274e-01,7.603147274096955233e-02,-6.144075924192732296e-01,9.555869636792808652e-01,1.286418574358516864e-01,7.387373525241149874e-01,2.555887744841696119e+00,3.640407060919595983e-01,1.656101940796119165e-01,6.983299712056914577e-02,-5.122070851300112304e-01,5.032284819208036886e-02,-1.446920869345256211e-01,1.950516381854852099e+00,-1.570849612072862111e-01,-5.411110570813582044e-01,1.238817051278435222e-01,2.931656061936132041e-01,-9.679541232370784121e-01,7.393337901740228979e-01,-4.261462541312109886e-01,9.362155923492498921e-02,1.181712865738308915e+00,-7.597839646774612321e-01,-3.751444165618331716e-01,-6.372667955976636378e-01,-3.699608873396329489e-01,-4.417806976664899743e-01,8.414614430223650299e-01,2.534054233244546595e+00,1.512633611779320431e-01,-2.013876364008549968e-01,-7.769667888454918625e-01,-7.580207603609750988e-01,2.061441870151732303e+00,6.551419855134563708e-01,8.814569849577864602e-01,1.040674237338272023e+00,1.564962758673134058e+00,4.198856181451176006e-01,3.228654038053596076e-01,7.087306484991955369e-01,3.451557569073721021e-01,6.579616981706321033e-01,2.990829862780323367e+00,6.132883697741124962e-01,6.771897526217924845e-01,2.351614741208697401e-01,5.254040038056702500e+00,2.012803411815347054e+00,1.526627180949714724e+00,-3.807290077278155938e-01,-2.853240592629175953e-01,1.037337299773566590e+00,-1.855717464468585876e-01,-8.419297213393019952e-01,-7.747231437400994292e-01,1.917322249531224987e+00,4.261082977006013239e-01,-4.153272734230582519e-01,-6.888187317027740786e-01,-1.653104634272689610e-01,3.828583979783415359e-01,-2.503479984879644071e-01,-6.353889655941957759e-02,1.410542254074458768e+00,-7.389777628945974897e-01,-7.058123888901000065e-01,3.480320960694525567e+00,-1.390540727364552032e-01,-1.514116173001316956e-01,4.755772884268866241e-01,5.965672551894249942e-01,8.261392418180889541e-01,2.230830458144867356e-01,1.295826850969158950e-01,-7.683578143814024930e-01,-7.017808482492172706e-01,6.846173629031847563e-01,3.904231346288593585e-01,-5.144465435384828478e-01,1.116124870884738662e+00,4.028373692432720699e-01,-8.932907646829724158e-01,-3.338635696514953843e-01,2.099047537586097079e+00,1.218750449554957038e+00,-1.912877043516454600e+00,2.557357684142237186e+00,-2.177915866202517758e-01,1.951079898743558250e+00,5.552307103645748310e-01,-1.012652918108936761e+00,-5.866311422734646897e-01
1.060965602891421611e+00,1.637768034534122563e+00,-6.299223907451696469e-01,-5.611589130786209800e-01,-1.190230884378643550e-01,3.330908888325057604e-01,3.626884617538908007e-01,3.176601880787477405e-01,5.453769601826793378e-01,-2.484309197641004774e-02,7.801486932091943327e-01,2.675652587675180771e-01,-2.528557170953091293e-01,5.315210393122055121e-01,-6.519527692677031805e-01,2.082877384327630033e+00,5.135130018535178920e-01,-7.610379884395107597e-01,-1.036888255714948637e-01,-2.416813212017892565e-01,-2.404473377276069024e-01,4.353051632386777392e-01,-7.613815609377944105e-01,2.224439726747670654e-01,1.617381781937767604e+00,2.720341172945228703e-03,-1.409967554167863846e-01,-4.822262830394214994e-01,-6.531279644909138149e-01,-1.126983099196294802e+00,3.731004019231616287e-01,1.765302218182498883e+00,-8.470919493554485147e-02,1.261890184787653746e-01,-9.227369765328181650e-01,-9.015281573953403127e-01,1.857917969250457269e+00,5.960823305894771273e-01,1.720866517956023856e+00,3.579246622906835373e-01,6.685047875629487324e-01,3.250825310271288071e-02,-1.289906527164955130e-01,5.209332027033876100e-01,1.255891720852220228e-02,9.102691523077425240e-01,2.385937594537265838e+00,3.648772301682694508e-01,2.301361533593825337e-01,8.366584903356473202e-01,4.563286832880159238e+00,1.756760215257316737e+00,7.909841315012178242e-01,-4.559563161839234602e-01,2.009705305291309418e-02,1.108164950306112173e+00,5.928367420133012766e-02,-4.990371150295041386e-02,-1.374195188895185327e+00,1.329095960932971554e+00,-1.264824395643158461e-01,-1.513701108743407686e-01,5.549542200160705041e-02,9.296559689740802046e-02,6.075488831708782955e-01,-2.306737310130673180e-01,-7.145288184284750432e-01,-7.413716102808898256e-02,-2.678362294555373113e-01,7.123618342796167457e-01,2.622551351572388612e+00,-1.885878042956174172e-01,-3.612767890528286174e-01,4.198490062404101053e-01,3.673024824666835941e-02,8.538152860502301600e-01,-4.333886452425601554e-01,6.947739819958589358e-01,-8.176052670008588930e-01,-5.795671618664212099e-01,1.374190199371512433e+00,2.587186088308316423e-01,-2.079067435151579213e-01,1.206657005761182511e+00,1.038650358869591450e+00,-1.047223134382980980e+00,2.147383236764269787e-01,4.505198364737679206e-01,7.994295003495617280e-01,-7.473860603733288865e-01,1.565836949130453348e+00,-6.558870161463523640e-01,1.085745869848913081e+00,7.133820536814211577e-02,1.760459968419951782e-01,-4.673314339234447834e-01
1.049915159471560555e+00,8.865340159628778416e-01,1.809760403927767047e-01,-1.956849192026420825e-01,-2.707423519295314440e-01,2.568628161011394795e-01,-7.145982684219156500e-01,3.854453517893182690e-01,2.341046897254150938e+00,7.155939389683591001e-01,4.880958817183154164e-01,2.959905496907390687e-01,-5.276994534771584089e-01,-3.397422768891623923e-02,4.099926364196448958e-02,2.154538545651225601e+00,-3.319263032857485141e-01,3.605824615435218594e-01,2.095898889801464104e-01,5.215407219155743235e-01,-1.210126944408969063e+00,5.570256519445536680e-01,-2.086798389868149695e-01,1.651337512623142212e-01,1.051768489384342420e+00,-1.095798634935998273e+00,2.274093364302808840e-01,-6.007610969121368605e-01,4.326841586143495011e-01,-3.438489491540286380e-02,5.111757294098169258e-01,2.630734909907830321e+00,-2.844410870641588818e-01,-7.332576787627163029e-01,-4.606349610465098054e-01,-7.068147993780335980e-01,1.204541943093589529e+00,1.428749728221362814e+00,9.053480530676218940e-01,2.083218215714618182e+00,1.179329528265066429e+00,2.500823100818982958e-01,5.192128701713336625e-01,3.456733368759035141e-01,3.858204581466893046e-01,5.785770850690344913e-01,3.434924593561011985e+00,-1.716789918447540475e-01,1.380343303845648073e-01,1.527881616594574776e+00,4.024192702262758381e+00,9.295661878522192278e-01,9.618633919187178360e-01,-5.701745232756962878e-01,-9.538376425747405740e-01,1.522747856798972732e+00,6.635675368067055491e-01,-3.994074468153263613e-01,-3.706099105662614135e-01,1.422032756476824034e+00,1.555870140288155179e+00,3.225429215855979415e-02,-6.551899531369486107e-01,1.265562428035228670e+00,4.650605502551705683e-01,-3.824516344430458625e-01,-7.067919088789409443e-02,1.460484215916534101e+00,-4.888878990246349476e-03,-1.146213578710036263e+00,3.347844627731396905e+00,-6.192655291438173837e-01,3.154241151804512699e-01,6.805047952674272427e-01,-1.021212566938650701e-01,1.640512889898305904e+00,8.009774825269089238e-01,9.942877900931804680e-01,-4.276791696865049897e-01,-1.445295375714663044e-01,-5.255752785908129887e-02,4.840405424937261891e-01,-1.280439880656669693e-02,8.862266548531121391e-01,6.364880184342538438e-01,-6.136173353070766279e-01,-2.234663492855554212e-02,2.752131733535214231e+00,5.068865150635526451e-01,-3.042393188926877379e-01,2.661521535832984675e+00,-4.319360023113567593e-01,1.432819216443509180e+00,3.071487245894999885e-01,6.992751976227034039e-01,9.562154497705188660e-02
1.233217973616843377e+00,1.956151721270424026e+00,1.479267743789776102e-01,-5.351391102822558032e-01,-2.187812647001781130e-01,1.952068492614457695e-01,-3.857705085975558501e-01,5.113471214484929250e-01,2.734408266605908633e+00,-2.181008904912853930e-02,-7.897343722792298237e-01,1.821546466966337263e-01,-6.244310824281255057e-01,3.907993970185656696e-02,6.838270245421496085e-02,1.267224380956807561e+00,-3.479529885978133175e-01,-2.401655672683133957e-03,-1.729865574667099060e-01,3.098149641876635219e-01,-1.120880438057755502e+00,2.312831779593138570e-01,-6.440596071619452134e-01,2.426513317542550174e-02,1.375941171559637688e+00,1.811628497528417758e-01,-1.685355693300071567e-01,-5.990704305245343475e-01,-9.949148725931901138e-01,-7.541780654321373900e-01,4.905826308224909837e-01,2.517050775276633345e+00,-2.944803909231127337e-01,-2.817247370743624635e-01,-9.097683017599555999e-01,-3.878794493193482573e-01,2.263916915565737931e+00,6.045605867121838228e-01,6.881527517209300449e-01,5.755326475551105769e-01,1.075816740856267106e+00,5.581027627608468045e-01,3.781038930971586942e-01,4.808925455099357649e-01,8.433721075213700402e-01,8.850831639221690139e-01,3.203140722092726378e+00,6.593105541882546827e-01,3.232835099637910714e-01,9.198538135424864093e-01,4.147455333206920614e+00,1.626027742654019947e+00,9.995756071103063523e-01,-2.416593678832890113e-02,1.141748457075297818e-01,8.368853923669212769e-01,-6.108134793625338288e-01,-6.679966341388403617e-01,-9.701005470218433402e-01,7.124523093068277912e-01,-2.590043439607717102e-02,5.006393733013208003e-01,2.900944691007887807e-02,2.328572632551656474e-01,1.250273134035339906e+00,6.064414709312413443e-01,1.380687115586824998e-01,1.221814701851177798e+00,-1.902704570226809166e-01,-6.109618001515002561e-01,2.638507089480888634e+00,-6.848644454753394228e-01,-4.511902812679540742e-01,-1.647259909193488914e-01,4.014884990012254073e-01,5.214980953378103301e-01,3.634740002950158089e-01,-1.860045921170719874e-01,-1.349026294912531121e+00,-1.681266875696424412e-01,6.609239109608157081e-01,-1.390467288152596459e-01,-4.550276761549754689e-01,1.365658862297433496e+00,3.284128092322153858e-01,-7.025836033406200887e-01,1.341771103924412345e-01,1.300616515067645196e+00,1.040307337738551663e+00,-1.332188994130949489e+00,2.063566695267733397e+00,-9.729953876529625623e-01,2.095099788822849973e+00,4.803749392927179618e-01,-1.447737031172936728e+00,-1.806795170874703205e-01
9.364182511719565394e-01,-1.395253513181075045e-01,-7.372702491087953502e-01,2.499369144894849626e-01,-6.246528440146154049e-01,1.045334229577333574e+00,2.147020178822175995e-01,5.032959285782588887e-01,1.163527108699617063e+00,9.977375580329685967e-01,1.978547633505924441e+00,2.254932494750035987e-01,-2.515564892323935986e-01,1.518964625069935681e-01,-5.611798120597062400e-01,3.045683617459701509e+00,2.303380099882562093e-01,-5.092562193465020037e-01,4.275141514630077522e-01,1.868922333741994957e-01,-6.026993651409999764e-01,1.168947290861799715e+00,-9.450708946314911874e-02,2.756316280792885931e-01,1.111629297683359496e+00,-1.845730004835030247e+00,-4.541743373135037620e-03,-5.974291754940159738e-01,8.153341357091055119e-01,-1.414450481995332964e-01,7.412814210435213491e-01,2.333793728139219592e+00,1.931787237555761538e-01,-3.204558961015142038e-01,-3.965642436977224183e-01,-1.214308182648942358e+00,1.009273814235028599e+00,1.333442727869468047e+00,1.705245964452488883e+00,2.267758065110982990e+00,1.398437004676907902e+00,-5.776923688998253370e-02,2.150635153458231863e-01,5.241318208314376115e-01,-4.178686820141854774e-01,3.944661489428753498e-01,2.778926379811397229e+00,-2.578368143607580043e-01,4.276376222081934020e-01,6.491741284253780275e-01,5.250022123332174218e+00,1.582788069535694175e+00,1.343232080865105260e+00,-1.010438223012583459e+00,-1.262987082703007413e+00,1.829397538335388429e+00,1.301973631033954248e+00,-2.920374522187128008e-01,-4.983129961404619279e-01,2.962486063567292938e+00,1.598953987415691502e+00,-1.081534121691202444e+00,-1.171460103515673534e+00,7.247368030797582961e-01,-4.445958690106506239e-01,-1.359831851796190705e+00,-6.699487021707063450e-01,9.719736644521910218e-01,-4.876784307825703380e-01,-4.944994962659245985e-01,3.943415046589360706e+00,1.656135239403224713e-01,5.676154860381675826e-01,1.313389438218559579e+00,-2.755391905960438009e-02,1.814742687175739944e+00,1.323036279760715916e-01,1.573010145170542495e+00,1.072853617950446647e-01,-8.153566801140479381e-01,4.673667886976371477e-01,1.141767161760860905e+00,-5.737001092277380088e-02,7.434889398325048582e-01,1.086331665594223894e+00,-1.080412974488065503e+00,-4.006971366932964851e-01,2.833996795873694019e+00,6.525029356465563701e-01,-7.619518734109864688e-01,2.803925454478911838e+00,4.278637130520283050e-01,8.354270495178459655e-01,1.977110297299718988e-01,1.585568734204138908e+00,-5.190937701598992149e-01
9.704753275018032088e-01,1.537950509118994891e+00,-3.245406534755826411e-02,-8.224791083859375185e-01,-1.348585737944538454e-01,7.661349895168156898e-02,-1.307313658902963804e-01,2.026297237581520250e-01,1.449473111329990349e+00,1.471746535232416608e-01,1.455870376874410788e-01,3.028811971417481597e-01,-4.291053398989395640e-01,6.416271766468595317e-02,-3.884088067452456938e-01,1.648646434478727496e+00,-8.529281048737868964e-02,4.567352045979902742e-02,-2.114126650819210251e-01,4.141059214988473264e-02,-6.823231893947420135e-01,4.621460959263239410e-01,-5.662682124680873397e-01,7.719473515851246748e-02,1.680077473030107349e+00,1.212870100526491912e-01,7.121592447373582824e-02,-5.808554762768362023e-01,-1.046291649148041625e+00,-1.146061189420632953e+00,2.128355334272547805e-01,2.349862749954684915e+00,-4.363947834246557078e-01,-2.390195155600249866e-02,-7.871856941232989735e-01,-5.101715591494220270e-01,1.871531641769458520e+00,7.924025903671969573e-01,1.647495399718633013e+00,9.579219708538851963e-01,6.398659863046970431e-01,3.350251956145636201e-01,1.952501664358387012e-01,1.640975545639581090e-01,4.580675195200490379e-01,8.148488296160220079e-01,2.813704143775246802e+00,1.918502574793978510e-01,3.304624642132701628e-02,9.877502164537699247e-01,3.839967151952323299e+00,1.691171813180620820e+00,6.111660799514773146e-01,-2.326611722777692237e-01,-2.515273198478897299e-01,1.361700742558934696e+00,2.488841451952003014e-01,-1.679557711652103213e-01,-1.104264988714202422e+00,1.399668929960998565e+00,-3.866258384188053787e-03,2.797294401792044249e-01,1.930243525716660580e-01,7.471136864648030285e-01,1.249897185376692255e+00,4.095198272432591935e-01,-3.906378806879593490e-01,5.639038569804817325e-01,2.598648497532441426e-01,3.944690128662209361e-02,2.299860496306365132e+00,-4.781756542646817265e-01,-1.486883482710378290e-01,-1.453903201268332002e-01,-3.252371552039504121e-02,6.507512610940940911e-01,-1.247427209515129531e-01,5.792154631458750202e-01,-1.336039796037208571e+00,-1.215935175483985331e-01,9.027190926714123709e-01,2.113977480351661997e-01,-2.884667696807254877e-01,1.513427835133214217e+00,9.637091275241761457e-01,-1.083801338406412906e+00,2.974902067843910869e-01,9.057166834271599409e-01,7.385425475670908124e-01,-6.036788633076473065e-01,1.802164344102145987e+00,-6.897470359980040211e-01,1.197893808626339318e+00,1.827842132889554161e-01,-7.636655193584235279e-02,-2.564709766360662169e-01
1.432264762519547929e+00,2.911386242532284729e+00,-5.362927439954682240e-01,-4.464517156234167894e-01,1.989086520606528352e-01,-5.779497488277246520e-02,-1.554791996516726171e-01,5.561610818187977534e-01,9.841726590029777899e-01,-4.785388309777502958e-01,1.080180419020859706e-01,3.240021534813322113e-01,-3.232806696989991568e-01,1.049783397508414762e+00,-2.557145034096308667e-01,1.962960886840342090e+00,8.376289037037432106e-01,-1.011915854392851699e+00,-8.888251375693945189e-02,-1.733128394215631141e-01,-3.896347212844579744e-01,-2.128707022323823583e-01,-1.110877565970114667e+00,3.181026396583085392e-01,1.244692497769526396e+00,2.969705825792620657e-01,-2.633941887192265963e-01,-3.213929924556535034e-01,-2.549682631561633883e-02,-6.341678269472639240e-01,4.904492245166904296e-01,1.236442449124138143e+00,-4.607854280193501850e-03,-3.294972411458497175e-01,-1.158528354616345180e+00,-1.005491287662544142e+00,2.002991555559637149e+00,5.031092200929727642e-01,5.940935087740735199e-01,-5.499601402803568906e-01,7.179547635428382701e-01,-1.258276535205354318e-01,-1.560253622864519185e-01,1.027375418648232897e+00,1.789937481051931956e-01,1.190812788924844767e+00,2.720573939935340135e+00,7.548281364955355954e-01,2.975524485425565246e-01,1.715054775883165128e+00,4.528145648025852843e+00,9.457652912751630669e-01,9.100915732767697053e-01,-3.772615138051976791e-01,6.766956243401238691e-01,3.194408849723884281e-01,-9.472571604467573403e-01,-1.400984511905433716e-01,-1.536177085807274523e+00,-5.004229020804509265e-01,-2.182824216497605829e-02,4.211843741943268604e-01,1.698236004581682168e-01,-2.977877363526384435e-01,3.680910567763236996e-01,-3.787639213144058381e-01,-3.753197141031467954e-01,-2.565029850618747442e-01,-6.817161183108207956e-01,5.822723512143133107e-01,2.890366587707915436e+00,-6.512894492241796396e-01,-9.407692591189039666e-01,7.831125738821291815e-01,1.399278216875487479e-01,1.181850154607743342e+00,1.608313875162342144e-01,2.868633799980031540e-01,-3.805266875526177595e-01,-5.499567802761323732e-01,1.353389509873745622e+00,-3.015903180451097176e-01,6.139227856232332137e-03,6.353432893997230657e-01,5.381368599581259904e-01,-3.008230121784699618e-01,3.562707493535367531e-01,1.891340703842553372e-01,7.248819707437466064e-01,-6.080646303106229666e-01,1.386382063301002443e+00,-1.518716019459251276e+00,1.826918488639918570e+00,6.466892583962755015e-02,-4.211255586907274862e-01,-3.073693473944039134e-02
1.112004582197693603e+00,1.904965196823690032e+00,-9.787863868963096736e-02,-4.477360999136581476e-01,1.601040507887648845e-01,7.076879683891054706e-02,1.239452089736813867e-01,1.446050070225314843e-01,9.631989376695928584e-01,-1.837675350461173973e-01,-3.469165939297985668e-02,8.684317380204839565e-02,-4.435713859386211655e-01,5.226437696987571435e-01,-1.194107203613711810e-01,1.451581470502838478e+00,-7.370650336461059826e-03,-5.164190218701538715e-01,9.076046183922249766e-03,6.361510763764641196e-02,-7.121645011928866564e-01,-1.703061142576595133e-01,-8.469005146908039627e-01,2.977994824905981774e-01,1.347648067141615780e+00,2.342564823876625291e-01,5.718916761236397805e-03,-5.115509426503790369e-01,-5.221779142837859045e-01,-7.218572796645026379e-01,4.588491453399293762e-01,1.921025165920064781e+00,-1.040088607617639382e-01,-2.021190970136862997e-01,-9.201953207660245049e-01,-7.402439020921695034e-01,1.741722943079055508e+00,7.210648563818639056e-01,9.810585996350394966e-01,1.445472077293575852e-01,6.856641525057257658e-01,2.335699842184476571e-01,-8.145584123215467154e-02,5.458267519693640324e-01,5.374833480395366792e-01,1.076779310593268368e+00,2.607174287583333694e+00,3.979687030849732299e-01,2.468858489975170323e-01,1.252394872292530437e+00,4.079381397562101164e+00,1.245490592768437654e+00,5.251680759639846263e-01,-3.192725392113072713e-01,1.956209479339845458e-01,7.825173115211541131e-01,-5.593812562170913383e-01,-1.930026415839790621e-01,-9.503194783493027487e-01,9.691392943202736809e-02,2.787391607083873346e-01,1.077349290552374050e-01,2.917132146753153438e-02,1.234072067843369203e-01,7.688394174845768481e-01,6.777402923548292435e-02,-3.824398747540921906e-01,4.720244184216685346e-01,-4.635716423955988930e-01,3.886771852765977253e-01,2.461512471699980331e+00,-6.136741391356896891e-01,-4.351044777995351498e-01,5.779529494072007667e-01,5.436078600636330693e-02,1.103251143118602506e+00,3.392047250236912559e-02,1.239777622382587374e-01,-6.612634874797663764e-01,-4.957787070068794266e-01,7.301678081181885993e-01,-3.262206399702556880e-01,-1.297567100702133325e-01,1.189064432104846247e+00,4.057879549851326484e-01,-5.781698869999268853e-01,3.766441701574708145e-01,7.133599529666674322e-01,7.806336803805591362e-01,-4.082352166544484517e-01,1.395858211082765532e+00,-1.130856840193116497e+00,1.472713707697474117e+00,2.909119769670152067e-01,-4.089967767807797805e-01,-1.062378616975677148e-01
1.222685394766981570e+00,2.027339750417564535e+00,-2.161319744547238186e-01,-5.981779125168584788e-01,-2.240919694740272083e-01,2.603807083728419958e-01,-1.109626278662714793e-01,5.323085172531784037e-01,2.051792007413849817e+00,-1.055031648558385216e-01,-3.126993908814523215e-01,2.460798541134855411e-01,-4.812960061211219442e-01,2.457489841046903711e-01,-2.438271421454132615e-01,1.563997454223855943e+00,7.146197075467136672e-02,-3.562898327319148351e-01,-2.211126148759719467e-01,4.938424385966169727e-02,-7.400908414917621858e-01,3.500487422040149399e-01,-7.379677163419322561e-01,5.845189400291886384e-02,1.518100557131656814e+00,2.363205260647472661e-01,-2.520724416867223816e-01,-5.414302126943590920e-01,-1.023878623804081789e+00,-1.002556139140111213e+00,4.421540336031136165e-01,2.189663554494169162e+00,-2.198723443506540032e-01,-6.807825958094218533e-02,-9.854168219765870873e-01,-5.581722726610849339e-01,2.300470873395378923e+00,4.712682442112938186e-01,1.058765468486249750e+00,3.142012033569046014e-01,9.418068320546280070e-01,3.680542463073970816e-01,1.949691725363164596e-01,5.482683454807369960e-01,5.258371717087811925e-01,9.102421330786465425e-01,2.905871272200881705e+00,6.894038665495213491e-01,3.176421335385484768e-01,8.037285659405454252e-01,4.405551093891568293e+00,1.796406836522502992e+00,1.018793699741523451e+00,-1.217397102975915080e-01,2.194200622759028274e-01,8.527979636043937495e-01,-4.854397466854627474e-01,-4.832352335052548797e-01,-1.279690647271750414e+00,9.628590527470838323e-01,-3.226525759164580176e-01,3.424620294208444715e-01,1.292457333331203106e-01,3.319687096886270172e-02,1.079705753708127158e+00,3.734672575780496051e-01,-1.488861110948342947e-01,6.499568958531474205e-01,-2.230639542161773070e-01,-8.293236832617811860e-02,2.621061561338480672e+00,-4.775902213009670660e-01,-5.430603152921280596e-01,-8.742771563603521368e-02,3.518929914872780951e-01,4.661418081830150939e-01,1.164746319028936439e-02,5.633852931131866359e-02,-1.288940546495979778e+00,-3.135067287985504048e-01,1.115106038141418843e+00,8.379718678771769236e-03,-4.290841201241888392e-01,1.322203836355850592e+00,6.222996812883802020e-01,-8.659390046417634323e-01,1.478426835930830852e-01,7.941499213335786456e-01,1.024214317986882561e+00,-1.341506464382945962e+00,1.873889061071492224e+00,-8.963513205515661886e-01,1.833915619201382796e+00,3.200457716522862039e-01,-1.101228753157301732e+00,-3.485328396270648277e-01
1.113373689042374881e+00,1.475969709305725797e+00,1.940079407358798469e-01,-4.140799925434127116e-01,-1.671939813587241530e-01,1.781693307988324038e-01,-4.369717574559712214e-01,3.565995508419905202e-01,2.321763708454362529e+00,2.555740755447042933e-01,-2.315643561976110099e-01,1.942819450741248288e-01,-5.765320620088523196e-01,3.217421407175828640e-02,5.485105361913589217e-02,1.563554893996467188e+00,-3.821018151447962419e-01,1.361675412362797488e-01,2.509088098015782586e-03,3.816444196218782281e-01,-1.135002929533701410e+00,2.780411752410798520e-01,-4.873493349786508499e-01,1.164449392220439361e-01,1.260174729494005330e+00,-2.791261827583996769e-01,4.959923555513064131e-02,-6.031336815167418486e-01,-4.332084629466356196e-01,-4.842879733739946513e-01,4.760814600858777057e-01,2.537719468514452181e+00,-2.910705855676880560e-01,-4.417812462857679257e-01,-7.169522093049001121e-01,-5.244735593624240133e-01,1.750162564329588388e+00,9.671309405016321747e-01,8.417001739884248934e-01,1.151284178159693639e+00,1.033852135814334217e+00,4.289670761027124524e-01,3.748137787557007106e-01,3.816779799871611867e-01,6.755457589795819118e-01,7.927584585988950439e-01,3.205395587374717081e+00,2.599303337593076857e-01,2.183346264957936600e-01,1.198860637957723574e+00,3.994526210036076108e+00,1.301934525507527862e+00,8.523823281836713228e-01,-2.623555228510812132e-01,-3.229693740788116552e-01,1.133099294813254332e+00,-8.474205540039858597e-02,-4.888238285948763862e-01,-6.806153107157910664e-01,8.971660417453943825e-01,6.563318020251085461e-01,2.686013651718649475e-01,-2.235069987677258951e-01,6.824226684886304239e-01,9.446089402161433890e-01,2.163385373111893217e-01,-1.232897497716167745e-02,1.267816918091730027e+00,-1.143211826908546447e-01,-6.889396542049686101e-01,2.813960316331755696e+00,-6.711895085428576380e-01,-1.113110323230088600e-01,2.342239505034418301e-01,1.337408576874168920e-01,1.031877615201469034e+00,4.840358060950211150e-01,2.945325499508187894e-01,-9.327547282910833015e-01,-1.788306121979819641e-01,3.252293462285136272e-01,5.025118961830032926e-02,-2.411959493769117446e-01,1.212896411394984941e+00,4.422686240749379438e-01,-6.638594287559727025e-01,1.320571618257325164e-01,1.802808493925670108e+00,7.877752432829899787e-01,-7.407598865340481176e-01,2.178184497515725848e+00,-7.819294002974148672e-01,1.714997608789748718e+00,4.029285338600091526e-01,-4.644371627064282637e-01,-4.743045646027077566e-02
1.094397968012708056e+00,1.431098172228212118e+00,9.809911611287606970e-02,-4.201344630793937274e-01,-1.256350200165308739e-01,8.778435273641965741e-02,-5.742115199643649248e-01,3.476845462374994478e-01,1.978951657172786094e+00,3.810761875817685329e-01,2.561964644810595382e-01,3.119507938981779804e-01,-4.909575783391512127e-01,1.498487654394895507e-01,-5.923609923617467743e-02,1.948480832715621336e+00,-1.315172888330738699e-01,1.516060605699577346e-01,5.266783400645743546e-02,3.274456313376049588e-01,-1.003526387786011220e+00,3.591021515759635907e-01,-4.395928437035340197e-01,1.657262815537229872e-01,1.220661352181400705e+00,-5.452434633214484627e-01,1.481678236929895309e-01,-5.502865092955540050e-01,1.376834761597889312e-02,-3.695255581339190742e-01,4.125223332396907860e-01,2.362416568629727376e+00,-3.197855226517039018e-01,-5.472171831185759228e-01,-6.435733698529939595e-01,-6.737100316119772891e-01,1.472113478375873585e+00,1.162641164645988878e+00,9.747080581007633304e-01,1.413596581878669323e+00,9.500668737689155208e-01,2.249009172854105065e-01,3.590830160162857831e-01,3.892130594476961303e-01,4.263832072851366228e-01,7.439981035130442955e-01,3.229921973116060219e+00,4.225671990604670802e-02,1.026244540814985895e-01,1.533303380102958968e+00,3.938254640302139453e+00,1.029305019537598787e+00,8.237717359202832990e-01,-4.371126621127257028e-01,-5.263873371813395652e-01,1.284716788323260861e+00,2.884240877737010433e-01,-2.953284295090569667e-01,-7.056456099443282337e-01,9.804001917414876255e-01,9.727781290950230364e-01,2.400200641799885570e-01,-2.884283465489523302e-01,9.733434273766115030e-01,6.959440965462849737e-01,-1.352846640669310707e-01,-1.557390497899359127e-01,1.008660514843141565e+00,1.246476873136455332e-03,-6.443517877562945362e-01,2.982090061250974422e+00,-6.605641728216679054e-01,2.694441691822993534e-03,4.717132848522896937e-01,-7.533080789745072448e-02,1.352448703767731075e+00,5.441875515437475386e-01,7.694776342431903782e-01,-6.543967109779449398e-01,-1.433877812020200593e-01,3.357646600246161350e-01,2.484877290880089240e-01,-5.401343694565852172e-02,9.953067726428866946e-01,6.712857048477675059e-01,-6.309679539967030237e-01,1.506525792816852394e-01,1.921007983887912829e+00,5.631426022998582415e-01,-3.359581356303837918e-01,2.244287507736303589e+00,-7.340361453293189342e-01,1.463309585913313615e+00,2.392273532560534322e-01,3.331400372505941565e-01,5.718635675999766965e-02
7.770810612600312917e-01,1.150893091728261819e+00,3.105513957793836211e-01,-5.093821072058319910e-01,3.582804284345455503e-01,1.484116860120898718e-03,4.992303211141496111e-01,-4.245733143522918418e-01,2.525830443480547860e-01,-5.706641625062749967e-02,-4.313923170433570098e-02,-1.573972342194236151e-01,-5.033552637649332251e-01,2.444804310571950245e-01,-1.889062374153643864e-02,9.241677561679209063e-01,-6.828773966393748562e-01,-1.866003860839245965e-01,1.277390305497032863e-01,1.890026467752900230e-01,-8.766493747352065435e-01,-4.069474581501345556e-01,-7.333144232450470312e-01,3.842981046114715138e-01,1.452338660124834258e+00,3.687807788426895050e-01,3.594148963554956167e-01,-6.424379496248834309e-01,-8.803702147287747470e-01,-8.273398956067101739e-01,3.631008983893354580e-01,2.295894533531529724e+00,-1.879416320254921058e-01,-7.637874251973708617e-02,-7.324663020614384790e-01,-5.784410005994718995e-01,1.321512564873450923e+00,9.591302526114685589e-01,1.393189101035554600e+00,5.021251943767562897e-01,4.141726073177302569e-01,4.561635403508388364e-01,-1.955659579401280990e-01,1.008326634438551778e-01,8.388369372223420939e-01,1.098407245582914360e+00,2.297311335502970842e+00,-2.115381650811789388e-02,1.132729774650974020e-01,1.095114048183454258e+00,3.446241926296144786e+00,1.280211417717302957e+00,-1.175401240571304351e-01,-3.234059875572651288e-01,-1.288734153914103953e-01,1.130800496851218195e+00,-2.863923214757421176e-01,-2.162805460328556806e-02,-4.296256373136264073e-01,1.347145928409168025e-01,6.113237443788072101e-01,-1.789825619698248160e-01,2.129203744941627827e-02,5.196321210134661195e-01,1.083240854993373858e+00,4.045638024234993746e-01,-5.593224347139059693e-01,8.089576431427247805e-01,-2.991511121603458445e-01,6.362338849599525892e-01,1.851536866163229433e+00,-6.552466846281073121e-01,-2.574280461956750254e-02,5.987726778420350282e-01,-1.961515268508656762e-01,1.228182391148982644e+00,-1.804968069536998232e-01,2.544806948802613711e-02,-7.227327330529487170e-01,-4.935346952755116368e-01,1.693405489887949145e-01,-5.387880777925846409e-01,-1.072582015207900474e-01,1.660344650879396422e+00,2.798253930604409634e-01,-7.293701566741395137e-01,5.794665246009630399e-01,8.157328661950229431e-01,6.962752635890625541e-01,2.598594402955216043e-01,1.035625423729034544e+00,-9.890086353803515529e-01,9.338941394180750866e-01,4.143710175227811598e-01,-7.036041050491137483e-02,-6.545800652159833311e-02
8.881035870390928677e-01,7.725318487940971979e-01,1.948405513727302640e-01,-7.367456824325091524e-02,1.412130752973341785e-01,2.535226111001879223e-01,1.644797337130400883e-01,-1.342058900942565969e-01,8.563760917745808499e-01,3.236881708404140690e-01,4.036530631888674003e-01,-8.937439187348619751e-02,-5.048857266846601410e-01,2.486398948489021987e-01,1.019324899763981440e-01,1.523672074471369431e+00,-5.727444244040358345e-01,-1.715222352469825406e-01,3.657555818897108568e-01,3.948365171322456013e-01,-1.059602121938475694e+00,-1.383139135833004740e-01,-5.061309686018606868e-01,4.116918630969447213e-01,1.078835404616646398e+00,-5.297338337050206958e-01,3.259145924749965451e-01,-6.249952867513436372e-01,1.255361476836638346e-01,-1.754380796993156855e-01,5.867784480029551997e-01,2.358024105174806095e+00,-2.654512095944677741e-02,-4.626518202976113714e-01,-5.651028083213904818e-01,-7.985140389859437526e-01,1.015970967345409814e+00,1.269629611707116412e+00,1.005104888766687354e+00,1.182313394042980637e+00,8.484373233339517206e-01,3.082813506542279036e-01,9.944404283707783399e-03,3.283419668483475995e-01,5.864326596805291558e-01,8.989690142844527498e-01,2.676813141552901065e+00,-1.547559749107262350e-01,2.422842740885600699e-01,1.304024640247532396e+00,3.900977155725229295e+00,9.494717032804047552e-01,3.384471903328599707e-01,-5.852164685730969484e-01,-5.496616220227394933e-01,1.226973714439880014e+00,5.139880952677022830e-02,-1.943108399207728043e-01,-1.573733605503935262e-01,4.833134680254242976e-01,1.447807347145715129e+00,-4.074306508769716673e-01,-5.577155727008563657e-01,6.915118269408488949e-01,4.241455119058998857e-01,-2.853869941455952075e-01,-4.062603012478029907e-01,1.200162381863391747e+00,-5.205916653721337495e-01,-8.401506395404090277e-02,2.731974803621678660e+00,-5.979370777707766482e-01,2.059180668140898618e-01,1.128310441768007211e+00,-1.622093170480566338e-01,1.779987263683452614e+00,3.249883484108321841e-01,4.244246367189652980e-01,-1.320853112567679233e-01,-5.802454285115070665e-01,-1.648439823533461857e-01,-1.714501552574925758e-01,3.102048857601835685e-02,1.158442194380743029e+00,2.272086366826325809e-01,-5.165285782616809707e-01,2.639195526928872493e-01,1.939422728375985061e+00,6.009692901129579656e-01,1.654963278871446897e-01,1.712860288127374009e+00,-7.022040193937618691e-01,1.113891588517730735e+00,4.332443541832897149e-01,4.599180795070721417e-01,2.890666369335592734e-02
1.112618512861842213e+00,1.528673434269481213e+00,1.002638908246276245e-01,-4.567146318445648445e-01,-2.463715529858315767e-01,3.851150155063324254e-01,1.248152911717353986e-02,3.608336532857350232e-01,2.361243730338486557e+00,1.286677982476563953e-02,-6.638093209530484540e-01,3.903270866886372065e-02,-6.135975351062574745e-01,-4.260921512965114288e-02,6.036625321953925649e-03,1.135352521529619407e+00,-5.254373834469204807e-01,-1.196967786975657172e-01,-1.118054356286593831e-01,2.858378424258075645e-01,-1.077945440239036490e+00,2.501710408885575720e-01,-6.146958004863486424e-01,5.819103123565472213e-02,1.444450705127600099e+00,1.877145518792844581e-01,-1.559255061361320693e-01,-6.586637834151662929e-01,-1.221007926203059313e+00,-8.721746935570958703e-01,5.373329187447246635e-01,2.623885553964955264e+00,-1.978155609402443282e-01,-9.569894853965413284e-02,-8.759376328259096400e-01,-3.920941782600974035e-01,2.213778949803790752e+00,5.632019693609132682e-01,9.451835143914006920e-01,5.841586554982372004e-01,1.065528351053115941e+00,6.402313708741954601e-01,2.689985358787480019e-01,3.837603986689662738e-01,8.591080808488962273e-01,8.793991306049897538e-01,2.932892615653959201e+00,6.096358296967940849e-01,3.962499847242277329e-01,5.305063946365033978e-01,4.252257891387164257e+00,1.902476479267162457e+00,8.900604090436784466e-01,-4.875336090547571777e-02,4.864340005263029232e-02,9.386713828934112325e-01,-5.565982529731829942e-01,-6.652452371704167255e-01,-8.395148625949485632e-01,1.014677268893873219e+00,-6.790955720797872686e-02,1.735523718511897684e-01,-4.982693479985797480e-02,9.328971701405508465e-02,1.249965674055373732e+00,6.422770420199896968e-01,-4.125088827910960987e-05,1.301524544019004637e+00,-3.033276262257360023e-01,-3.752706454542273917e-01,2.498116862944439465e+00,-5.242213325956457393e-01,-3.282773520620830832e-01,-1.151865196800664626e-01,4.288269519438221433e-01,4.576161575998894948e-01,1.059208281717052835e-01,-2.952768813697346229e-01,-1.366225039934204188e+00,-3.398064148098211001e-01,6.165719777726985651e-01,-1.518419628144416778e-01,-5.369025116473924442e-01,1.574336706501209715e+00,2.944600748370037602e-01,-8.685317041977500541e-01,1.116108619797723800e-01,1.262523413693915408e+00,1.143864375460160732e+00,-1.396054821788209610e+00,1.933005512844068852e+00,-7.672624235481719790e-01,1.895966742102293434e+00,5.598859476351238929e-01,-1.488400427897375478e+00,-3.538997339497659822e-01
7.982298028108381072e-01,-2.085626423019443232e-01,-3.045748914013497455e-01,1.312622205795108687e-01,-4.082977576408937104e-01,8.887513977373926455e-01,4.261376615032796966e-01,1.401881549904071822e-01,1.034306298548454794e+00,8.268488648917452499e-01,1.325511513755464721e+00,-2.884896410556531121e-03,-3.828854331685443424e-01,-2.572057204553800103e-02,-3.177270013979769381e-01,2.262589434835867941e+00,-3.701722121246738273e-01,-2.885889755651147026e-01,4.151761929368984472e-01,3.104967955006322500e-01,-8.443822272199186241e-01,7.556643395841008415e-01,-1.638053683888410772e-01,3.000352884540427034e-01,1.190511597126133525e+00,-1.324018224852370418e+00,1.522851967559163411e-01,-6.897152813882978517e-01,2.093242364658702837e-01,-2.902000827897436297e-01,6.919219673586746167e-01,2.608437499619306266e+00,1.099530292971883094e-01,-2.253910537353174814e-01,-4.028933305064300030e-01,-9.531515482835232200e-01,1.025797179147358573e+00,1.291718078362860567e+00,1.664201616733994804e+00,2.027586880789004287e+00,1.208438535274824588e+00,2.414820090828212751e-01,1.423996684401638291e-01,2.808043555361156018e-01,7.748250333483019947e-02,5.383120141114099422e-01,2.623004203365780551e+00,-2.736366465487341526e-01,3.910552277452346570e-01,5.200237703392522892e-01,4.712660922339924063e+00,1.642537744069326733e+00,8.783165991287190666e-01,-8.020529057155156849e-01,-1.117844775076593411e+00,1.761671317444513107e+00,9.310431382965690394e-01,-3.150609013966090277e-01,-2.156061408667833135e-01,2.417755917580841185e+00,1.475905829379231982e+00,-1.011002250420557358e+00,-9.783594771229732201e-01,7.217327057476961016e-01,5.765210486949867708e-02,-7.462139913488532450e-01,-5.960548556158850042e-01,1.307115312703421850e+00,-4.637459539801016550e-01,-3.345444872060387986e-01,3.307309116805039473e+00,-2.494478095294339060e-02,5.850220603021509813e-01,1.094539155514988815e+00,-3.456342007454750453e-02,1.632443297948654948e+00,4.008378574910481662e-02,1.002632577496838984e+00,-1.793007941267530381e-01,-7.639084438767635987e-01,1.137047276224993908e-01,6.600773403884527823e-01,-1.506228110149940291e-01,1.175197905364370854e+00,7.314245265888861258e-01,-1.057881392103767304e+00,-1.801300885075779457e-01,2.588101551131964051e+00,7.426562372421914304e-01,-5.420182020046062643e-01,2.382843512856739121e+00,2.127566614121364497e-01,8.243989825546170769e-01,3.920679368071494642e-01,9.887565506776097024e-01,-4.503117489427405640e-01
1.100077585446464390e+00,2.117579010623794833e+00,-1.600562763887941053e-01,-6.706588898736479676e-01,1.421728703111960757e-01,4.338195198039201950e-02,2.698337505138102554e-01,1.399531009178655028e-01,8.859254245284016172e-01,-3.495661040431490285e-01,-2.241244395171408388e-01,1.050953504086237777e-01,-4.279838898804307901e-01,4.908537568596632039e-01,-2.586091102635271755e-01,1.276224981702622774e+00,4.735715087396935585e-02,-5.696566624375385413e-01,-1.605273486998776145e-01,-7.688000404751713091e-02,-5.714696017336255984e-01,-1.256530858348011148e-01,-9.380514313585626152e-01,2.287343839689392477e-01,1.573070616895901885e+00,6.298849178130060400e-01,-7.976794808743151166e-02,-5.164474694198375460e-01,-1.094432238473546981e+00,-1.117202913256470254e+00,3.631680874010894122e-01,1.901706162229115371e+00,-1.755216222712043250e-01,4.227200447000634131e-02,-1.030558143047278552e+00,-6.330311825313620355e-01,2.045785839860821742e+00,4.812584852970719917e-01,1.218278056306073553e+00,-1.756605896475025297e-01,5.595499804462873428e-01,3.007629769585221657e-01,-1.325665505024751223e-01,4.773614367210794462e-01,5.844491613393626439e-01,1.125077615669471731e+00,2.465278758018607075e+00,5.595491830808835276e-01,2.263026801436848201e-01,9.984995703663299693e-01,4.054181604908397851e+00,1.580690846624856150e+00,4.839425445267699355e-01,-1.699488949841705399e-01,4.187707635633868275e-01,7.441656046186553297e-01,-6.901584455671164742e-01,-1.777085250809203598e-01,-1.215595968346014466e+00,2.213273674073652497e-01,-3.084109031479652652e-01,2.279591771305382597e-01,3.134428582374573224e-01,-4.937433923258016666e-02,1.090366334169395657e+00,3.966638388128112536e-01,-4.325144990279949919e-01,2.535545592698079109e-01,-3.382026579022137658e-01,6.688082076709136459e-01,2.139260514520085810e+00,-5.559652383321241897e-01,-5.928831864807653229e-01,1.947252614032337070e-01,1.294703599482166512e-01,6.776694687845000731e-01,-2.552758428876085173e-01,-4.491306750245982471e-02,-1.066390415713776463e+00,-4.529811772303349304e-01,1.068828505974208865e+00,-3.731391376300440821e-01,-2.732654413737084509e-01,1.427383653567148025e+00,5.248166254176316325e-01,-7.724500412782606684e-01,4.430510788323256954e-01,1.585684705594254673e-01,9.003942393241519682e-01,-6.577129143013940027e-01,1.201248190607024702e+00,-1.176103198851685683e+00,1.466417641406736916e+00,2.697559942590006532e-01,-8.021979191796051456e-01,-2.537416709910198520e-01
1.030323000321736071e+00,1.384464334205329772e+00,-6.741051990612899614e-01,-4.213047225713379418e-01,-1.311333932174081618e-01,4.175384516602428375e-01,4.158886232962414331e-01,2.912885675378729666e-01,3.891001917879132743e-01,9.077855065578802063e-02,1.039777375928847780e+00,2.401989199120415641e-01,-2.311333901723812978e-01,5.520569545497608921e-01,-6.513696224362107712e-01,2.232714513979576321e+00,5.127557276643244233e-01,-8.056348071183812021e-01,4.264988558351605341e-03,-2.088385945852437864e-01,-2.441317268042168531e-01,4.647901769942883732e-01,-7.002726722358769695e-01,2.731029486416774454e-01,1.529794801117860814e+00,-2.506774980510026452e-01,-9.830867176212623737e-02,-4.862047612559804999e-01,-3.659959042281506481e-01,-9.663409176411915658e-01,4.295749707425149388e-01,1.759642157755942904e+00,-1.035733873651301096e-02,6.565084389725438230e-02,-8.515808159241564645e-01,-9.973815633488625210e-01,1.661706125821093893e+00,7.167820193774862014e-01,1.733890969846663133e+00,5.522751268722273510e-01,7.232192670986863359e-01,-2.320361855275454577e-02,-1.477898756647222367e-01,5.394318204399807248e-01,-8.187888290210465492e-02,8.700080400492791188e-01,2.358625943629739208e+00,2.460531566668061609e-01,2.547534866079560478e-01,8.621147617309621314e-01,4.654806198365540659e+00,1.666322579315589580e+00,8.016886896668931062e-01,-5.757090297502496234e-01,-1.406891281431676965e-01,1.186892226618081247e+00,2.174901778718658085e-01,-2.411434037523642326e-02,-1.235892479070740624e+00,1.437609879535015400e+00,1.735410471769015250e-01,-3.413194278357911671e-01,-1.261727105899990153e-01,1.524280678046632809e-01,3.817491213628648739e-01,-4.697170587822948606e-01,-7.741681821177293088e-01,-1.857657460624850820e-02,-3.574485651367479422e-01,6.782884045942152440e-01,2.790534547740075144e+00,-1.351628894460769614e-01,-2.328115742617375417e-01,6.675723942846452097e-01,-1.577109270349769110e-02,1.083034599077520310e+00,-3.883167274702686855e-01,8.431865501965292164e-01,-5.744319908218714632e-01,-6.669642024963561289e-01,1.240974389803964018e+00,3.405098188016322802e-01,-1.388695950699811443e-01,1.109641064497585816e+00,1.034025722015050164e+00,-1.018522756685538377e+00,1.619249388663711875e-01,7.133640989689358225e-01,7.456285906683489673e-01,-6.189528217366089269e-01,1.642212895844417986e+00,-5.359393827102253427e-01,9.772656836974267236e-01,7.029606638603130842e-02,5.008548131992507368e-01,-4.583955617486745737e-01
1.187859278406409480e+00,2.351704634026206442e+00,-4.238615832445877252e-01,-8.633578090402129757e-01,-2.859700911880144747e-02,-7.217770317668487090e-02,-2.425128142189016400e-01,4.427935849669293322e-01,1.093110947872958594e+00,-1.352900822764996625e-01,3.860330165110775757e-01,4.836804375322110716e-01,-2.944183459533136760e-01,5.589464096886754829e-01,-5.635522353487079084e-01,2.062293677426658256e+00,6.537178619551053949e-01,-4.255981527844743262e-01,-2.881112594492123979e-01,-2.185483317997100050e-01,-3.219120238684018975e-01,3.650374380928814166e-01,-8.222094313875094596e-01,1.321063861184765265e-01,1.643029384788490033e+00,2.505879755800123343e-01,-1.058421746891112514e-01,-4.151077952500666912e-01,-6.666565788756888544e-01,-1.149776319190754847e+00,1.984638593562558506e-01,1.697632603567241549e+00,-3.515400864528773206e-01,-6.733291744827646363e-02,-9.883105184941840538e-01,-7.628938379586043261e-01,2.013390363866065957e+00,6.168738003602362019e-01,1.466518509276423909e+00,3.024004296852312867e-01,5.495761535571975775e-01,-2.244854293781128884e-03,4.305921228969862569e-02,5.248664223693417785e-01,1.223230773557079654e-01,9.457633274102229537e-01,2.767430844119138644e+00,4.278529083048221437e-01,3.532038142169759143e-02,1.393667795333075610e+00,4.138679869072404038e+00,1.428939095405290516e+00,7.964858100652394413e-01,-3.112509142023737740e-01,1.622098748551381586e-01,1.003413772443343177e+00,-3.339753205461148955e-02,-1.474764638208066192e-02,-1.607814238084394054e+00,8.460719001587817534e-01,-2.750453142369422288e-01,4.844436053550722487e-01,3.653480793264076709e-01,4.071633111405210670e-01,9.137399947408030298e-01,1.887316478040562684e-02,-5.021247377113597921e-01,-2.031045575709181650e-01,9.143331841831092710e-02,4.345003247882247566e-01,2.528936830965265781e+00,-4.901072907958718416e-01,-5.570239118345440277e-01,7.968096454577797139e-02,-4.003030209176007548e-02,7.555509546709722191e-01,-1.403726540743678308e-01,7.676576205662088981e-01,-1.062879325065052338e+00,-2.009367556753451356e-01,1.461041735645855599e+00,1.971282722685271105e-01,-1.353574002628106787e-01,1.091714803357315411e+00,1.125579097172739962e+00,-8.839426028169534710e-01,3.502981019251827366e-01,2.815732590893197385e-01,6.475540334094969097e-01,-5.872541151864802966e-01,1.630216532412287256e+00,-1.031446466669271089e+00,1.328918291464577184e+00,-4.649935363060403448e-02,9.633040946524046300e-02,-1.984774509932001885e-01
8.386255879590691631e-01,1.322581844896015157e+00,-1.461064790668878677e-01,-8.611857457569740415e-01,1.756467850036780298e-02,-1.926196026928456151e-02,4.312247368434241057e-02,-2.043267687220895468e-02,4.718527668681899989e-01,2.157146749928534057e-01,7.807725590883670685e-01,3.300536469856490962e-01,-3.048838675460694980e-01,2.231437991660639164e-01,-5.806426912462324674e-01,1.909473179966550305e+00,1.085025925581409312e-01,-4.750078256699023782e-02,-1.320271204025675327e-01,-9.350674971495787080e-02,-4.347520256145178674e-01,4.243674209614810011e-01,-5.671408946434424170e-01,1.935528246566566579e-01,1.727765442234504345e+00,2.346208722197491714e-03,2.471041340361589400e-01,-5.436918321803234644e-01,-7.566775952443332010e-01,-1.175730108472193169e+00,1.111950200896081875e-01,2.114724820205846179e+00,-4.314534383365529191e-01,1.871906540181982048e-02,-7.092221033455876622e-01,-6.864344130086447171e-01,1.476300335354390647e+00,9.775465707989557940e-01,2.036352407053430014e+00,1.087529352189762433e+00,3.836831093709756058e-01,1.292437526654315882e-01,1.415620165266287880e-02,7.440984463605149202e-02,2.050458100064002087e-01,8.276966850084479521e-01,2.547983965731164702e+00,-1.203262826657845452e-01,-1.106693156374513459e-01,1.216653181622719071e+00,3.681023455877801887e+00,1.489209739286487144e+00,3.301349504648703470e-01,-4.406050787249087275e-01,-4.395092746579083443e-01,1.567082756650389319e+00,6.501002650957374840e-01,1.684755311775250897e-01,-1.082763350004579461e+00,1.441773872357773989e+00,2.661150662343482742e-01,7.244353289961902309e-02,1.877524262258561394e-01,9.952409979366493298e-01,1.028934605842304340e+00,8.697426759224941017e-02,-7.284774671059131013e-01,1.432482102450889361e-01,3.451188011012352175e-01,4.890628620634124846e-01,2.205720327881352194e+00,-4.066957330000222637e-01,1.845568531851210503e-02,1.753371755827821399e-01,-3.357015135665664674e-01,9.958516132654912090e-01,-3.137272314588310240e-01,1.035410267349493374e+00,-1.022048261677603875e+00,-1.900558768125435172e-01,9.203512118693588651e-01,3.122277646899221382e-01,-7.984194447275050344e-02,1.444290649842449703e+00,1.212358620131734899e+00,-1.135661583689149268e+00,4.196484282043811409e-01,7.403698697022502717e-01,4.967483436856133805e-01,4.235073017595897271e-02,1.568459731928434353e+00,-6.240745168002925780e-01,6.684891936541765833e-01,8.122878190901905437e-03,8.965970135589436119e-01,-2.069782205082115190e-01
1.158552938290964507e+00,6.146722933075502437e-01,-3.763485121705096859e-01,9.977243919074074707e-02,-6.320555491448223151e-01,7.637411754451453039e-01,-4.826489134073507770e-01,7.628323439086858171e-01,2.509171419192607999e+00,8.577730315298455199e-01,1.029647910535723021e+00,3.425276216301768040e-01,-4.239059470584872757e-01,4.222001336368423619e-02,-2.154077099933062178e-01,2.737752785847073600e+00,8.151407298439988791e-02,-1.096080283678492334e-01,2.628333101881381584e-01,3.958290181631179960e-01,-9.807546908755587767e-01,1.038126085867780546e+00,-1.383217075627484194e-01,1.300403265532377173e-01,1.006727363791136032e+00,-1.583080909610141251e+00,-8.360938488150920778e-02,-5.794714060141494816e-01,6.864139946419673954e-01,4.291231993047928128e-03,7.182380388598090803e-01,2.509298801054684169e+00,-1.553528059723752186e-02,-6.100770658719976147e-01,-4.928762859351624726e-01,-9.472098532041371977e-01,1.390425578020813902e+00,1.260123504534377492e+00,1.010895241268126021e+00,2.142210145845692360e+00,1.544924756896924878e+00,1.092288946289183271e-01,5.234118620786658571e-01,6.175995900324110499e-01,-3.876936673436559566e-02,4.296008857142337711e-01,3.371095208321301495e+00,2.940476810752637449e-02,3.985526231630091565e-01,1.016527540741366309e+00,4.967264056810607897e+00,1.345500074250906231e+00,1.547430548933324879e+00,-7.245110686547282519e-01,-1.005780548494405124e+00,1.528648254379676219e+00,8.154330486916119280e-01,-5.734886365624333182e-01,-5.834136112928054452e-01,2.318831692024052593e+00,1.428710136331039493e+00,-3.779782519474506608e-01,-9.760637057657971516e-01,8.071092353389113239e-01,-4.467817401850404657e-02,-8.988088052002622952e-01,-1.516021750580395233e-01,1.355128905359753499e+00,-3.250549601434133962e-01,-1.202073991201256353e+00,3.979797206946019017e+00,-2.162657520908088382e-01,2.892380869844878855e-01,8.661981233701604443e-01,1.546653835393058674e-01,1.564589212367576865e+00,6.560370216669348942e-01,1.185654049449580416e+00,-2.545189435435794012e-01,-4.477043367224115000e-01,3.520858990325120286e-01,9.213003550758394056e-01,-1.359828044909032474e-01,6.644205406807082159e-01,8.214216385657501229e-01,-7.945210368364273856e-01,-3.808189951398781026e-01,2.986008774324765191e+00,7.090348910554781225e-01,-1.075227956441322075e+00,3.061410969778169289e+00,4.058489035174583925e-03,1.539098732943125381e+00,2.906712301222090233e-01,6.805894892419628306e-01,-2.591264950942532841e-01
1.020252436183342271e+00,1.406307695396842306e+00,2.211630134827030081e-01,-8.793518287154966639e-01,-4.519743476005503857e-01,2.035567154030221149e-01,-5.086583880317063766e-01,4.426325022257298070e-01,2.868329950409380658e+00,3.405107403129704613e-01,-4.433372700968599145e-01,3.497920517717573730e-01,-5.882055058987780694e-01,-4.005596923856664660e-01,-2.210005589717462526e-01,1.459075901261948083e+00,-4.731379164428344275e-01,5.329809959787613627e-01,-3.332230420799241477e-01,2.777689240723011377e-01,-1.057375521893699766e+00,8.063415330769184708e-01,-3.532186296962662730e-01,-1.428466521878292428e-01,1.707267969357233461e+00,2.887035448561115630e-02,-2.534270238170127643e-02,-6.778923533103523580e-01,-1.454896031946769419e+00,-1.163530122384490273e+00,2.378939670901437098e-01,2.928151213897447036e+00,-5.996990007153062407e-01,-8.135219399133564178e-02,-7.338688026807587139e-01,-2.004927603368963362e-01,2.230321272235174845e+00,7.487765672921485871e-01,1.470859971213991368e+00,1.443433959225795871e+00,9.583418707722406449e-01,6.373376500778868969e-01,5.803369962117583825e-01,4.479940353252583052e-02,7.378233007221002282e-01,6.342718327484400120e-01,3.284346966285233815e+00,3.335707853352292140e-01,8.658113651049362258e-02,6.643736140138987167e-01,3.841589084742434324e+00,2.026385962765992588e+00,9.469777813316782034e-01,-3.039640490879791379e-03,-4.134525795111981816e-01,1.487965003658549001e+00,2.964027149621094037e-01,-5.543217410490181019e-01,-1.024200140433438655e+00,2.008979134448376946e+00,-1.660655493494454238e-01,5.347547565456794993e-01,1.500262428732108688e-01,9.151783132561126521e-01,1.666167562651027279e+00,8.731967789701637894e-01,2.230338000158704759e-02,1.276997111920043837e+00,5.104900045240637896e-01,-8.099828269497741928e-01,2.410552013516947145e+00,-5.236573236736974390e-01,-7.093916863131179140e-02,-7.473928939944906036e-01,2.259369339766520435e-01,1.999080605387895115e-01,1.340507663391033444e-01,3.392372463708636099e-01,-1.902494926542113163e+00,1.465809424667314786e-01,7.448618062450820254e-01,3.805696965046101998e-01,-5.597001558893834883e-01,1.717258987158000183e+00,8.920735851986065779e-01,-1.222097576454667767e+00,9.563731251488288843e-02,1.495819667967634325e+00,9.445463593643628197e-01,-1.304168870068897812e+00,2.363589254840150478e+00,-4.883476748491181185e-01,1.635231204153403617e+00,3.630126718564981037e-01,-8.570185541218489078e-01,-3.240786529751661926e-01
1.092841145104560541e+00,1.235979718874714806e+00,9.470419947074108780e-02,-2.041877000366153494e-01,-1.339954910173493663e-01,2.826811755734690568e-01,-2.948657878634268203e-01,3.106248427171663939e-01,1.972326256477235251e+00,3.293662550624323893e-01,9.697548915357528942e-02,1.327983325976454521e-01,-5.373120705852528767e-01,1.462224692758368194e-01,5.985653325879869424e-02,1.732266355107939138e+00,-3.315249684685724341e-01,-4.020362606247283865e-02,1.564030489747230690e-01,3.927706624502046995e-01,-1.099727245281246102e+00,2.261397762844751247e-01,-4.697828917270575610e-01,2.139422669533567745e-01,1.128167733290109886e+00,-5.435662060657183714e-01,8.349036954885034889e-02,-5.925069903070012689e-01,-3.453722564177441612e-02,-2.678072464361995753e-01,5.717075626554232182e-01,2.432270787025022862e+00,-1.462447823146506287e-01,-5.091626647621112500e-01,-6.619710766396056378e-01,-6.878757752158056737e-01,1.503482696083553449e+00,1.081384313539296871e+00,8.074759521151975150e-01,1.222953354421679517e+00,1.083458817422155995e+00,3.305258000823296793e-01,2.861611307299912754e-01,4.623207452832459041e-01,5.455351825511728370e-01,7.900351417744223559e-01,3.099714355902551954e+00,1.526193691944064679e-01,2.774039008643526816e-01,1.248745714277734287e+00,4.159283638997094634e+00,1.153648778458132629e+00,8.437380423895046722e-01,-4.249111473913422810e-01,-4.311814759105480621e-01,1.142360487690376125e+00,-7.774008857409253626e-03,-4.383552281795568550e-01,-5.274159718973931987e-01,8.555210503039665237e-01,1.011862630089094717e+00,-1.548723121310713324e-03,-4.455011931845239692e-01,6.352098252253147725e-01,5.960144724083544787e-01,-1.329826985441425746e-01,-1.178303348099015713e-01,1.253820516545172570e+00,-3.304970512272563665e-01,-6.050652462964789535e-01,3.019217719571877456e+00,-6.048007832519770588e-01,-1.217705040339357725e-02,6.389599632726868927e-01,7.762229203176899961e-02,1.358327863231879373e+00,5.121045058980469022e-01,4.217422887552569888e-01,-5.445228895748135400e-01,-3.553945476676325654e-01,1.926998386921638939e-01,7.632065417650951700e-02,-1.350815947198525935e-01,1.055354657107897998e+00,3.849215261519253195e-01,-5.769102856825365500e-01,8.796370563812824783e-02,2.014452550237345374e+00,7.303938163818011198e-01,-5.559591769702515451e-01,2.174285157160651849e+00,-6.989036828183300409e-01,1.591823036194248253e+00,4.014020885018554363e-01,-9.695246044068062119e-02,-3.547083823489871612e-02
7.307163980754426413e-01,1.191696894645149607e+00,6.708697938279063466e-01,-8.347360214528727340e-01,3.090702940045979008e-01,-3.226981601931220855e-01,-1.806712072018110127e-01,-4.096836881852844447e-01,9.312489614143533156e-01,2.007895329810347462e-01,-1.535304609474537618e-01,7.811981146611039761e-02,-5.609368140599063635e-01,-6.108236635682127991e-02,2.802682147711366145e-02,1.015097880071585523e+00,-8.269466126797029304e-01,5.540814434686135437e-01,-8.197251030297295071e-03,3.350751437123045129e-01,-1.081416451921792587e+00,-1.717939085929345300e-01,-5.195921341133051818e-01,2.425944028661599638e-01,1.531240548612218699e+00,2.526599351759118983e-01,5.683259824671371696e-01,-6.585422864633682094e-01,-8.868844227109879963e-01,-8.351312707254577861e-01,1.221041375135452633e-01,2.614938598336091324e+00,-5.774668543371082041e-01,-2.807357113647050428e-01,-5.834322001926711687e-01,-3.561322510050825563e-01,1.221698509091698970e+00,1.244922986900464768e+00,1.491284446541142561e+00,1.263450241163980747e+00,3.274033234646063217e-01,5.028362109023184479e-01,1.326261533295502448e-01,-1.793827367626371072e-01,9.322640732217619686e-01,9.387389637406527987e-01,2.780138385814758362e+00,-2.990768153154318432e-01,-1.875109267050297790e-01,1.534789202862870905e+00,2.822834661333464723e+00,1.048778676438304469e+00,-1.729520224222066416e-01,-2.523685660005483000e-01,-5.151076119194873959e-01,1.496458028172026555e+00,2.680644294369333713e-01,3.680216121999801970e-02,-3.955268261433002586e-01,4.364893008021994980e-01,8.179514607790059344e-01,3.033453094024279317e-01,1.657457551202376478e-01,1.367793700198113749e+00,1.477025123618639135e+00,6.721797244144165351e-01,-3.781715808679874669e-01,1.020221456595366671e+00,3.785005597036280589e-01,2.739806934994237775e-02,1.770607155007815958e+00,-8.791981161322868221e-01,1.924282334371744119e-01,1.524837954238057458e-01,-4.137284303410621034e-01,1.201006145151825022e+00,1.365886439358984794e-01,4.394258190314719315e-01,-1.064578744549959044e+00,1.822630363522187436e-02,-4.074741719461438816e-02,-2.870037751431366857e-01,-4.173490659080159038e-02,1.702781433880861339e+00,5.585415455555011732e-01,-7.903437490972500257e-01,6.383385366054905585e-01,1.233342467680728083e+00,4.479350655605983111e-01,5.893238035885342008e-01,1.401492887802884946e+00,-9.692576666204768543e-01,8.688143944452579870e-01,3.053155863067781861e-01,3.897086339171892955e-01,1.827399129354445595e-01
1.196081092851809968e+00,1.586277056561848475e+00,-8.368268353893949518e-01,-2.457246908071830105e-01,-2.748803287570693032e-01,6.033134703382514452e-01,3.744434726145149939e-01,5.707306150317774662e-01,9.174292791891849319e-01,2.562357558071406971e-02,8.612731330966334475e-01,2.399809476085859594e-01,-2.559740410086577267e-01,6.200511001653096210e-01,-5.926029571626760806e-01,2.316187967099794243e+00,6.450071852184982024e-01,-1.028118907774179469e+00,6.408891638742642005e-03,-1.889135149536958491e-01,-2.850298842439500380e-01,5.335786222073980456e-01,-7.437767365438452405e-01,2.366207089121180329e-01,1.414898528123135213e+00,-3.369613531274247564e-01,-3.230020464444726125e-01,-4.657371695032318515e-01,-2.695684517384051571e-01,-8.394552545965225931e-01,5.903754198710872148e-01,1.707361924506746842e+00,1.287516784692890326e-01,1.867143851766342455e-02,-9.438244190148625812e-01,-1.045448407793202028e+00,1.925250570585418597e+00,5.470542605267745273e-01,1.394080243048839929e+00,3.250974929461818430e-01,9.910066891812026046e-01,-1.799451551197567278e-02,-8.997507145487268487e-02,7.876254468484392701e-01,-1.083897085049754239e-01,8.651386848615487679e-01,2.483957145469416261e+00,5.371281966431368238e-01,4.465070418334729507e-01,7.028702095087533408e-01,5.111264064856949396e+00,1.773688559266650255e+00,1.169652512204653938e+00,-5.382982627710868329e-01,5.158203816956896670e-02,9.417051253181445425e-01,-1.051298250284323776e-01,-2.568060494906982405e-01,-1.345430335641424779e+00,1.416615641768234513e+00,3.340318025740082741e-02,-3.396782255788157179e-01,-2.434261151283384217e-01,-2.421704116874978663e-01,2.108878412069609132e-01,-5.750664199152903944e-01,-6.071615499691433993e-01,9.014755717882216857e-02,-6.327191989985414544e-01,4.654708925590728685e-01,3.130932389931804671e+00,-8.346254115304985177e-02,-4.237149711797003060e-01,7.001625432785850700e-01,2.421955275508767547e-01,9.762987149183267599e-01,-2.667737767736136911e-01,6.242657604181465203e-01,-5.366260138902858579e-01,-7.787259154541132933e-01,1.382019576384178716e+00,3.493257615622434864e-01,-2.387931167581367753e-01,9.476403281576598614e-01,8.861510173992622752e-01,-9.242794220241195013e-01,-7.569817684486002118e-03,8.223028121736255525e-01,9.259417422784801399e-01,-1.178994514467248012e+00,1.847723606113256700e+00,-5.497086135308667521e-01,1.381444042980086273e+00,1.473319968057116847e-01,-5.116011135965103929e-02,-5.480095069554150600e-01
1.152982269137312610e+00,2.141052412341614808e+00,-2.470090931286336722e-01,-8.465836052702371273e-01,-8.614043637964562128e-02,-7.192330811854347195e-02,-4.116174245533660847e-01,4.319550405019152439e-01,1.459571602487109043e+00,2.032447165143200229e-02,2.959152033118530589e-01,4.841281426461298554e-01,-3.533029749109790618e-01,3.775359429024804370e-01,-4.594004583352784277e-01,2.019247942500393744e+00,4.316394274145089471e-01,-1.564944404364057018e-01,-2.608710330475026984e-01,-7.886834944660989222e-02,-5.074194307338466547e-01,4.396315166910995109e-01,-6.950017704498003823e-01,9.437794519089624801e-02,1.598308150403208838e+00,9.210636937337308983e-02,-3.115386211299325803e-02,-4.580095664516954379e-01,-6.255678118719134595e-01,-1.037462624095229380e+00,1.972654363547390877e-01,1.939215502179414408e+00,-4.234384953743596247e-01,-1.682744551014828671e-01,-8.938540240113022062e-01,-6.749806006202271336e-01,1.933290004601359469e+00,7.516945825838401429e-01,1.415200543163364966e+00,6.755146577487045612e-01,6.286681114371599488e-01,8.611381819679619909e-02,1.805784619848135875e-01,4.250963690381944771e-01,2.238697097466294805e-01,8.654573000483206657e-01,2.946612757901684976e+00,3.195708288949500875e-01,4.452730634893722894e-03,1.419816229297171439e+00,3.997645670975907173e+00,1.384954661465990666e+00,8.064147060476865025e-01,-2.979978612228977863e-01,-4.683926561341789085e-02,1.141924743634772588e+00,1.309328434551488285e-01,-8.832741445233641131e-02,-1.424688716454195481e+00,1.014632498619419065e+00,-4.955989457194545644e-02,5.194092533398579903e-01,2.707252050907179020e-01,6.587361634110688868e-01,9.948619838947596605e-01,9.715521548005062735e-02,-3.861873972352471984e-01,1.205674944380873415e-01,2.128854598796988684e-01,8.791179842317536908e-02,2.578487983542774753e+00,-5.471580155157209635e-01,-4.006367073831754722e-01,8.282001493846308238e-03,-5.793570540943911162e-02,7.975971277549953609e-01,2.682491014620336234e-02,8.033883802383028350e-01,-1.117230783263205129e+00,-9.043062808307666955e-02,1.210012563774349070e+00,2.630602154827664241e-01,-1.464415115599365103e-01,1.131653305899194661e+00,1.087000161793574726e+00,-8.857233698075279715e-01,3.073894106792251502e-01,6.841494591392300872e-01,6.204997721848541925e-01,-5.578573430874778083e-01,1.836198230123766706e+00,-9.359259035216616063e-01,1.358185796066160300e+00,9.781795111441726753e-03,1.353503475877662066e-01,-1.361911801053595772e-01
9.712074759975438676e-01,1.581075848277477158e+00,1.226100126197729318e-01,-8.985239246701028915e-01,-1.261600281691317993e-01,-5.997338445387428996e-02,-4.193894398875063767e-01,2.106416134432527731e-01,1.719917490093898715e+00,2.392255117969739331e-01,8.865872993218371079e-02,3.811549496412851012e-01,-4.588516018434290467e-01,-1.621392280905921413e-02,-3.218360869414127468e-01,1.685160554997230165e+00,-1.436847912145254591e-01,3.115909953051922976e-01,-2.305738059354810465e-01,1.234867454392572783e-01,-7.922115297327420036e-01,4.934139486935125718e-01,-4.947663346026237585e-01,4.445711566654661495e-02,1.652932838068288834e+00,4.172291184573123646e-02,1.589017331873439909e-01,-5.795231499101919370e-01,-9.334361178686794158e-01,-1.060243847093696345e+00,1.471493336229418580e-01,2.445267784609028716e+00,-5.615761143490414220e-01,-1.595307923114384629e-01,-7.275083129600046217e-01,-4.482832233822173218e-01,1.790639519962753390e+00,9.299762815509748926e-01,1.584002699581186890e+00,1.230546872195983354e+00,6.263788211674572448e-01,3.388204403324879266e-01,3.169556687151341978e-01,9.532399118233213231e-02,5.040599030373366096e-01,7.682774940219723181e-01,3.022494102368544766e+00,8.379494772351932241e-02,-6.919866247005752868e-02,1.231986973294077137e+00,3.604465579263001818e+00,1.509583816095355413e+00,5.909152573944131959e-01,-2.238679858346883100e-01,-3.897305775524475546e-01,1.456544809566570065e+00,4.083653207633721749e-01,-1.532604391273549305e-01,-1.048383197470870831e+00,1.375860762563740236e+00,1.726790906787451230e-01,4.629914009667767116e-01,2.078646008505639908e-01,1.060120029721855817e+00,1.335935016095402217e+00,4.564220504045472526e-01,-2.993042488293493619e-01,6.732605664343944696e-01,4.602856558245815854e-01,-2.258345017431522272e-01,2.322174673353883723e+00,-5.970764476234893259e-01,-7.336883990933927568e-02,-2.253007872737119721e-01,-1.192989715278615498e-01,7.270899270083818200e-01,6.538627211246472726e-02,7.215568617340529789e-01,-1.372822527855846131e+00,5.677406274008423015e-02,7.602125423522732017e-01,2.676108137543111720e-01,-2.309054634807558015e-01,1.469237481933173273e+00,1.008845561502503596e+00,-1.033103983859351427e+00,3.212612642852800127e-01,1.127431541812643045e+00,6.267205039658387822e-01,-4.273142146252130180e-01,1.944045517963090663e+00,-7.259600592315815781e-01,1.211804004433716386e+00,1.511956090669476227e-01,1.122497975667172132e-01,-1.177169236595112523e-01
9.194571939585870490e-01,1.367935835269197709e+00,3.738621789999342360e-01,-3.609159243504188597e-01,2.969350012265623562e-01,7.181730260943927635e-02,3.503962817990424194e-01,-2.406689759378758953e-01,9.253304895515912509e-01,-1.287880857700809123e-01,-4.760341985871226478e-01,-2.000349825976810991e-01,-5.939799615315588532e-01,2.381744303962423648e-01,1.939523993035648930e-01,7.846508333906186961e-01,-7.759796309045507989e-01,-2.189487770104019126e-01,1.441063272279410334e-01,3.166794240695279816e-01,-1.083209684196982048e+00,-4.885733107070839853e-01,-7.655080154682237792e-01,3.522244300646144577e-01,1.296826723303502682e+00,3.648111617890660296e-01,2.264351588486889777e-01,-6.460864605071494626e-01,-8.219376211981808122e-01,-6.242170427945551436e-01,5.044948655708891838e-01,2.367394120427765980e+00,-1.148103280802806880e-01,-2.116785303243011174e-01,-7.938427435103811991e-01,-5.301769029185530169e-01,1.524658624214007441e+00,8.655722460134509522e-01,9.144714198710879316e-01,3.313031162620898584e-01,6.485906739821166722e-01,5.510745863753389040e-01,-9.351448800859052390e-02,2.745191983423198034e-01,1.001166088750863770e+00,1.121515346142994751e+00,2.509881330019495316e+00,2.174395967767882576e-01,2.609346154927341122e-01,1.066057950328737736e+00,3.636384616987427876e+00,1.249310524353916207e+00,1.139719781198965110e-01,-2.289429222564107469e-01,4.416339654508549817e-02,8.738283861337070579e-01,-6.912907816756365120e-01,-2.751860626459062820e-01,-3.845323745329425336e-01,-1.634821369905687938e-01,6.014191911875780283e-01,-6.652044267871634609e-02,-7.150022142098377831e-02,2.644453307060896652e-01,1.057240376065669452e+00,4.695335087231575777e-01,-2.939832072734206436e-01,1.121730985136958569e+00,-5.204090484640174763e-01,2.892511842121584520e-01,2.064561530369988684e+00,-7.465236185312189576e-01,-1.794442514920165377e-01,5.920961672234225093e-01,2.536487833500920830e-02,1.166498110574424096e+00,7.263049796058262952e-02,-3.215149910680360490e-01,-7.207699599699814996e-01,-5.150736831589499687e-01,7.439222139590062621e-02,-6.784792499668061971e-01,-1.885390805268963577e-01,1.560020674122990281e+00,-1.268919095555387511e-02,-5.429348104703412004e-01,4.804858007509527629e-01,1.033430891676779817e+00,8.440845454038606865e-01,-1.311532092506872971e-01,1.202414079934805979e+00,-1.114732057700807077e+00,1.390524651726930960e+00,5.513353470131288070e-01,-7.285240308148044353e-01,-3.345466890223691703e-02
7.730113892853157642e-01,1.190364662658690342e+00,4.892133515908587693e-01,-6.523579801740673201e-01,2.798659502816263633e-01,-5.212039488600872517e-02,3.092036664732372708e-01,-3.862344991032368169e-01,7.832617039467073550e-01,-2.134855364070861738e-02,-3.776703482865021999e-01,-1.203090079517890321e-01,-5.747774084664668548e-01,3.046436545743157198e-02,4.219293812036795099e-02,7.482725940566029577e-01,-8.747732168235384798e-01,1.033590363316495564e-01,2.280371326995588727e-02,2.682222807713491863e-01,-1.023822166651201737e+00,-3.091211980616740407e-01,-6.674271233214255084e-01,2.792590696481280221e-01,1.531837319605039660e+00,4.829786077330130434e-01,3.622961410284382677e-01,-6.831212043485936913e-01,-1.202817764863882699e+00,-9.383314932410166120e-01,2.998713671885044341e-01,2.545015994279599791e+00,-3.342047830086922744e-01,-6.960932548932843855e-02,-7.221083423612364438e-01,-3.897341131268371450e-01,1.492535984874743704e+00,9.320127726625636599e-01,1.387465050537721734e+00,6.628344679125963701e-01,4.433183719661147326e-01,6.037842473425021339e-01,-4.006850483825832865e-02,-2.040334433876890563e-02,1.012351693432162580e+00,1.048649328975614692e+00,2.482856766062969456e+00,1.764466003824040341e-02,6.674608369406062613e-02,1.018462878483856304e+00,3.264760930670477901e+00,1.412212468233095208e+00,-8.611294563953342251e-02,-1.783371388185711059e-01,-1.629040424561367939e-01,1.201964029277197143e+00,-2.666170372008275224e-01,-1.290843152729242438e-01,-4.361039539275819443e-01,3.048506372760935168e-01,4.426911791157994713e-01,3.666963533826148036e-02,1.293951886994789691e-01,6.742564794511265447e-01,1.413229664384312523e+00,7.423168220683722396e-01,-3.975151613394877770e-01,1.044293696584527309e+00,-7.422100695821476357e-02,3.516313079975507128e-01,1.724054020694033351e+00,-7.272369703955687825e-01,-1.171059685917565096e-02,2.223133029398687843e-01,-1.373930089876287119e-01,9.671674885273009448e-01,-1.133025695048239245e-01,-8.710280111422363802e-02,-1.080840498093531998e+00,-3.014435096023619920e-01,1.262235215738484184e-01,-5.196625571039843461e-01,-2.192385190086698632e-01,1.825867057231044477e+00,2.874806208037574695e-01,-8.121352676725606123e-01,5.734198448330491971e-01,9.004643219298565926e-01,7.517685840190581059e-01,7.344747576153948243e-02,1.173223370634759455e+00,-9.782750415462603266e-01,1.067885547723670614e+00,4.658858746188741518e-01,-4.013350096400576938e-01,-6.001614911939490149e-02
1.106753074982669505e+00,1.113103918194395803e+00,-3.724386851184420810e-01,-6.291618311654412210e-02,-2.266679038560796555e-01,5.658020830432765047e-01,1.485334171743555309e-01,3.980366728201418791e-01,1.372169101367228361e+00,2.754080746518266509e-01,6.103405981712659578e-01,1.096212536163767570e-01,-4.038141006244609921e-01,3.568407193329650728e-01,-2.199097678931760669e-01,2.052772727868386049e+00,4.868382185922065508e-02,-5.736071161093803106e-01,1.932531130305204514e-01,1.659517236400682161e-01,-7.513408608561098490e-01,3.795024608507532871e-01,-5.466871571564798638e-01,2.689732717055995925e-01,1.183524489733246199e+00,-6.436978660389165441e-01,-9.129508533955857374e-02,-5.553715536818571996e-01,2.514894339105722132e-02,-4.036539274571830926e-01,6.646702949974114816e-01,2.136811957135726914e+00,8.179407462824844766e-02,-2.821564500234033379e-01,-7.380816445445359530e-01,-9.207571448311699935e-01,1.566629957568952403e+00,8.992469835429551805e-01,1.076270914509652954e+00,9.287213974238174297e-01,1.122788746659575621e+00,1.677833725987658564e-01,8.279096384160643252e-02,6.304444494732862614e-01,2.047495908210548166e-01,7.967894170314728797e-01,2.751160740716717790e+00,2.665342377965292942e-01,4.238454371955073241e-01,8.958944418080712069e-01,4.736188612331405423e+00,1.444883070796671776e+00,1.011113899486636214e+00,-5.609753526153532510e-01,-3.202895678142542168e-01,1.092991779464199675e+00,1.053715435438473680e-02,-3.796076228182851953e-01,-7.493866129042536794e-01,1.230634267262534109e+00,7.805317356825947073e-01,-3.835039963797924889e-01,-5.345426740713908886e-01,1.865970070148765814e-01,2.361958012232846515e-01,-5.016199418708711111e-01,-3.833392771892938922e-01,8.402600670571030994e-01,-6.160454571120519418e-01,-1.285725515889283854e-01,3.198435977572977151e+00,-2.916444349297629968e-01,-9.409706755905607178e-02,8.761282292563083995e-01,1.612070946691513962e-01,1.331770996173192056e+00,1.570588753669043824e-01,5.335696430947723945e-01,-3.540794018865591752e-01,-6.752977056910307585e-01,6.066509028952592475e-01,2.348569685849742905e-01,-1.678379222596447229e-01,9.733838353081110117e-01,5.475146578161326216e-01,-7.289963845607807524e-01,-2.152540364451832611e-02,1.696177542025134155e+00,8.366002609306947280e-01,-8.324845890995344888e-01,2.072605789212085270e+00,-4.995055841708003208e-01,1.434250137865863639e+00,3.323238923215807716e-01,4.456325801112440144e-02,-3.104800246573136691e-01
1.251839519054886773e+00,7.049863236606892514e-01,-7.489169097021628474e-01,4.390261719438584009e-01,-6.418362033137663403e-01,1.238870784857992735e+00,4.587567438932096953e-01,7.974875392969531518e-01,2.100381069511850107e+00,3.883101748903010630e-01,6.317080717974224990e-01,-2.795293735699554138e-02,-4.339836443134791888e-01,2.881507294047757628e-01,-1.997719019365830073e-01,2.247682931187954036e+00,5.955166987246124366e-02,-1.025456441883973113e+00,3.224269200455516238e-01,2.373486250634596340e-01,-8.276728099275413308e-01,7.205182091744980477e-01,-4.610928807533084539e-01,2.213573170664183687e-01,1.001915693515452954e+00,-1.104346852540723622e+00,-4.742554602552896403e-01,-6.067395514702842441e-01,1.332723064788607914e-01,-1.899686526319962487e-01,1.048727469396995904e+00,2.286676858917457089e+00,4.579245766938138673e-01,-2.138215235003282921e-01,-7.782499816985712915e-01,-1.043260060326886451e+00,1.890023925483006462e+00,6.560453961846048898e-01,7.965509463408289026e-01,8.990869532024435840e-01,1.724726313269385525e+00,2.604453090914788937e-01,1.547987295313230094e-01,9.514506246605142215e-01,8.787421342452850226e-02,6.704036888382364223e-01,2.771994522550540463e+00,6.400619230527396786e-01,8.724117990382298515e-01,1.079685070264944091e-01,5.799399343503159443e+00,1.975895257024224527e+00,1.683707999272657130e+00,-5.974813021979032968e-01,-2.810443362161961223e-01,9.218354343539856277e-01,-2.476835801396254366e-01,-8.474068115456948602e-01,-6.984805569333589759e-01,1.933147886220033751e+00,7.057181334902239422e-01,-8.691164185007087539e-01,-1.015954721602607691e+00,-5.438365024145274118e-01,-2.026909510131369441e-01,-8.067233929210058108e-01,-2.189369113851440951e-01,1.296799576359355388e+00,-1.212653192615154252e+00,-4.926809185192445595e-01,3.878442755827909316e+00,5.731504074240584279e-02,-1.422229039217607904e-01,1.053254945281815402e+00,6.567990333288676874e-01,1.160652031914241267e+00,1.695003314243830883e-01,1.971560492958617794e-01,-2.298854025992167482e-01,-1.071829837296396359e+00,7.096436674327584182e-01,4.416697819714035522e-01,-4.393636424253407613e-01,8.578743801712105377e-01,3.083496605816857805e-01,-7.983730681336242974e-01,-4.723801185824665905e-01,2.249468909908808545e+00,1.261554985809588469e+00,-1.983773341657962375e+00,2.556329631447398221e+00,-7.723237857382037053e-02,1.903141383602413139e+00,5.689523907531235380e-01,-7.728908199244335364e-01,-6.975616766736636443e-01
1.119254694278985163e+00,2.345036839920937144e+00,-2.254356595048965239e-01,-6.855347366475675885e-01,3.525428894508702560e-01,-2.247692738439723281e-01,4.604901693166157939e-02,7.799716166609504953e-02,2.841536094715865768e-01,-3.297155955136392702e-01,2.728337549383781924e-01,2.413777882077934867e-01,-3.246016844332366147e-01,7.935528257142406838e-01,-3.178765944143934763e-01,1.671891700407825976e+00,4.146966681654650766e-01,-6.146258238126754980e-01,-8.182233758631071718e-02,-1.518070842319932945e-01,-4.082585374573086123e-01,-2.684883486452990242e-01,-9.876276352276800452e-01,3.484453221704508774e-01,1.458774200709177293e+00,4.402597109882763204e-01,7.729939687095496725e-02,-4.108457164447080756e-01,-4.048513590087278180e-01,-8.902231275886681727e-01,2.761050004386391143e-01,1.515210016651571623e+00,-2.034921931682242557e-01,-1.742702911698731927e-01,-9.874549834135638582e-01,-8.523440731325815367e-01,1.646435971235772788e+00,7.330203794266189066e-01,1.192811563313764811e+00,-1.088970206968518095e-01,3.641385018304152954e-01,-5.700350785416252730e-03,-2.228285232805740090e-01,5.597357416262733754e-01,3.240267459288028173e-01,1.167008427252256952e+00,2.482513292821440842e+00,3.129741293402957814e-01,5.472600544170302950e-02,1.683202060138542677e+00,3.851436304388308862e+00,9.919418058825579809e-01,3.327374118709956474e-01,-3.861949544230854348e-01,3.226446563157714387e-01,7.650967277126431432e-01,-4.470486772924603391e-01,1.290279590602431969e-01,-1.255464577979089835e+00,-2.304581514833117240e-01,1.423635447859818159e-01,3.048174544458736035e-01,3.034897105099363390e-01,2.665971844871108942e-01,7.437145534185569673e-01,-6.477697469593829416e-02,-6.046638655175007315e-01,-1.956070854153416638e-01,-2.735646400069866591e-01,8.506742112917444754e-01,2.286307846148425416e+00,-6.726050180436597969e-01,-5.659557959661946080e-01,6.270738471503278788e-01,-1.839645683045202651e-01,1.213612632079924092e+00,-1.000133182375545493e-01,4.703647366998173762e-01,-5.762263823569402366e-01,-4.107687202999428799e-01,1.045463249510216297e+00,-3.225419978530569276e-01,5.448188857843433430e-02,1.058081289907054412e+00,6.970066134501585742e-01,-5.505970022745396708e-01,5.734479188967613883e-01,1.270951303890431872e-01,5.530564175314729436e-01,8.224777366778895926e-02,1.099394279662611273e+00,-1.364393196717892165e+00,1.204693870455574300e+00,4.359579320067777375e-02,1.919314085334440645e-01,1.061137968253111907e-02
1.120471779022299330e+00,1.313839543034515778e+00,-6.909085069232954179e-01,-2.439989343947051581e-01,-3.123463341741239407e-01,6.453873737899966656e-01,3.985364343913550544e-01,4.880034877306494989e-01,1.061912685889936370e+00,1.239088009138221702e-01,7.628666896429006083e-01,1.822677771990877105e-01,-3.052347849399922874e-01,4.401486904905253517e-01,-5.303814511556520506e-01,2.165895635215707049e+00,3.834615772370413844e-01,-8.472043223974421444e-01,2.573121150968946808e-02,-9.667992295591398832e-02,-4.149012450547870934e-01,5.704470320353098867e-01,-6.530478083465169892e-01,2.124317002957918921e-01,1.433428568677360015e+00,-3.724904135025181029e-01,-2.590285971787299468e-01,-5.239055628749604843e-01,-4.160671241877316184e-01,-8.457957691531423627e-01,5.882718492014116229e-01,1.941969820838073568e+00,8.831602985340925027e-02,3.291043955538000554e-02,-8.739262541658467942e-01,-9.483241738277143895e-01,1.882777567178262057e+00,6.082448696515244668e-01,1.458694131300309005e+00,5.597013977243644467e-01,1.018370577301298985e+00,1.036061389167609037e-01,-2.975535294824308008e-02,6.551551599362392952e-01,1.540228638146212692e-02,8.182475765133631063e-01,2.510333873866848808e+00,4.547919219795127921e-01,4.389374021095705514e-01,5.677593684445503275e-01,4.990635153919849465e+00,1.865367354958529678e+00,1.103057127000737436e+00,-5.038680086247333545e-01,-9.298195966784550404e-02,1.070303186711099697e+00,-3.383695337269010395e-03,-3.105165295793136382e-01,-1.174819236756155627e+00,1.610839814414877003e+00,1.182794400900719911e-01,-3.935603830724025975e-01,-2.925823101648766800e-01,-1.100831744640576870e-01,3.465122618069539362e-01,-4.220775697570831042e-01,-5.620084579796784663e-01,3.600918879736537681e-01,-5.569586715428224144e-01,3.175101711237466873e-01,3.041220840713308338e+00,-8.598842501622017132e-02,-2.826236207509315590e-01,6.015407503582521631e-01,2.431642234159013261e-01,9.284631570862816874e-01,-2.575358806185126248e-01,5.589937249437242350e-01,-6.499500880915792811e-01,-7.373562033013220107e-01,1.188699396144889286e+00,3.550731276997770025e-01,-2.943791773067242490e-01,1.100698620524136917e+00,8.347996113393929551e-01,-9.967116002751652548e-01,-2.242513313712835021e-02,1.036308024107547521e+00,9.556632763225412219e-01,-1.184406936705381552e+00,1.911029316763605435e+00,-4.353376948537995839e-01,1.339321396181445856e+00,2.256623183141752143e-01,-1.181816713540324859e-01,-5.640733368101344958e-01
9.588505038939539871e-01,1.235742735733170505e+00,-1.397329322557483988e-01,-5.978772116450178364e-01,-1.143782095749551336e-01,7.894906610706836636e-02,-3.272572697354342863e-01,2.175988653943174422e-01,1.133326451502181254e+00,4.350017179281938651e-01,8.786946673854907353e-01,3.960132334712799240e-01,-3.425436757432592239e-01,2.133855116732221169e-01,-4.186065144205854960e-01,2.238179542767488428e+00,1.480552187960836874e-01,4.401608254450942170e-02,-1.254431543537534721e-03,9.036611136702238367e-02,-6.391822841351072482e-01,5.547301357296900992e-01,-4.300529142524134874e-01,1.885778193691697857e-01,1.448270968245910062e+00,-5.390077339173453552e-01,2.161367678752266763e-01,-5.264396454495168243e-01,-9.350388904024997672e-02,-6.971390572463328494e-01,2.562187477409264558e-01,2.183325547854746418e+00,-3.653927821992017932e-01,-3.090183233414044994e-01,-6.170936223761752659e-01,-7.815250047326836036e-01,1.336709193435935195e+00,1.177354550233596697e+00,1.618647957996081299e+00,1.505337811507965862e+00,6.967012149498926776e-01,6.169724025613626539e-02,2.092901876993742971e-01,2.483414550603053050e-01,1.204560716960244027e-01,7.089910395838643353e-01,2.922070644657075000e+00,-1.556075261627473671e-01,-3.344200999070422176e-02,1.455914715510582047e+00,3.910692320020003887e+00,1.194022288941112730e+00,6.623852567349446385e-01,-5.593889799397870899e-01,-6.627711550385639860e-01,1.560384302963453873e+00,7.633382426618189331e-01,1.577438097043262766e-03,-9.089227160177004716e-01,1.496852148436192298e+00,8.086807055877878181e-01,6.830312225702594997e-02,-1.588458657850548295e-01,1.130414257936091182e+00,6.650037771977257428e-01,-2.838218057372381420e-01,-5.197188552227051117e-01,4.811911253218656981e-01,2.235847779891415033e-01,-1.309072096876759961e-01,2.796772766246077069e+00,-4.586334517507120179e-01,1.139014955698210568e-01,4.551783198800288810e-01,-2.834199316469819263e-01,1.332905617226443962e+00,1.414790522264205985e-01,1.218360842903937868e+00,-6.836644168364309770e-01,-1.732957259122307470e-01,6.585853692146793614e-01,4.957210096007613198e-01,6.618845792827232621e-03,1.085125314867880553e+00,1.110260113006626304e+00,-9.182762830173322177e-01,2.219582069858393458e-01,1.520042793846115625e+00,4.364388419009446740e-01,-5.573578852420907337e-02,2.059771758551768528e+00,-5.367865816215882102e-01,9.326255891102714912e-01,3.980769231964143007e-02,1.075124012500590531e+00,-7.681060685616875050e-02
1.007017107076565221e+00,1.831046600143770187e+00,-2.890982941187217881e-01,-8.502605687041010496e-01,-2.281066217977953392e-03,1.841035276820945921e-03,3.011804644155297028e-02,1.867573376982996081e-01,7.502484702207983247e-01,-2.440683573100965731e-02,4.688581270599230244e-01,3.476839561564294967e-01,-3.137746386699838408e-01,3.823688666901182143e-01,-5.598269872182517481e-01,1.852530781834213824e+00,3.169271870830440707e-01,-3.075786876767999112e-01,-2.174634970231882902e-01,-1.666279845685043615e-01,-3.804407858113130758e-01,3.456078395846688966e-01,-7.311832184778221944e-01,1.641625851741486120e-01,1.710780285905971976e+00,2.396587895984797212e-01,3.460582084090257915e-02,-4.953235983121556107e-01,-8.769237177588542487e-01,-1.227608630517633026e+00,1.809899275709353772e-01,1.925638027383869133e+00,-3.549278523007059483e-01,4.752107787054389576e-02,-8.826429537175575213e-01,-6.980639606633828320e-01,1.826343730408015009e+00,7.126909316346856649e-01,1.750406103409898773e+00,5.433447409299867470e-01,4.707718630363474377e-01,1.192791105704701926e-01,-1.161332709614512973e-02,3.019844375648681467e-01,2.264658306910036223e-01,9.197050849450779664e-01,2.576154337293841579e+00,2.276341844516433788e-01,1.137962340442495723e-02,1.156710317461244752e+00,3.957049360509096392e+00,1.574558736385302637e+00,5.438314424464598673e-01,-3.311515229927206594e-01,-4.664052343168523240e-02,1.224659611404786741e+00,1.673835779414654390e-01,3.691325495920738664e-02,-1.345295681405415777e+00,1.105383128361227207e+00,-1.350424081746528782e-01,2.340036482445420063e-01,3.018003710440397835e-01,5.500740331656613913e-01,1.028243429851815716e+00,1.473374261790044437e-01,-6.143776348083216376e-01,-3.968441818330559201e-04,1.407867173711382092e-01,5.513956062510328993e-01,2.282894035104462649e+00,-4.245378818075993266e-01,-3.144027354876657299e-01,8.750408907509821255e-02,-1.230967849602310066e-01,7.745389738434846905e-01,-3.083947655124493203e-01,7.337432037648669025e-01,-1.107797207039385334e+00,-2.522765943319173476e-01,1.216941166473438862e+00,1.707645909927124062e-01,-1.676146694484312027e-01,1.353262439452327381e+00,1.094558128456446733e+00,-1.034328410334990123e+00,3.898284331725921925e-01,3.948020786454781161e-01,6.546509380678281476e-01,-3.896000172083013968e-01,1.513152633750683762e+00,-8.393136597987038705e-01,1.037773766402366959e+00,3.158245107288043529e-02,2.509373095614642057e-01,-2.628131543812684545e-01
1.028781404257613108e+00,1.872313937668907968e+00,4.129832833233144929e-02,-4.790695824157895633e-01,4.632495309322662291e-01,-3.539930039225718805e-01,-2.988572642799851020e-01,-8.332327819381107892e-02,2.030692559622960802e-01,3.701550687151988761e-02,6.910624022357159113e-01,2.563088377024341780e-01,-3.437690275147269325e-01,7.531083497048605135e-01,-1.150810546033105841e-01,1.939721155124372931e+00,2.221711245845622851e-01,-2.551026127959713508e-01,1.774323650869017444e-01,9.613212809966104055e-02,-6.523987447454953070e-01,-3.415823365664544253e-01,-7.689025185784401639e-01,4.621743612968062243e-01,1.165132281808471948e+00,-1.960187645302019221e-01,3.984186228701855903e-01,-4.167392073786787554e-01,5.037056064234746167e-01,-3.048457107184925352e-01,2.925134796659351055e-01,1.632554399658426636e+00,-2.401480185816851631e-01,-5.941052488580356172e-01,-7.175829718509033617e-01,-9.658617682454634368e-01,9.509556281121525068e-01,1.294855453915831678e+00,1.024789351461069753e+00,7.095760903596657343e-01,3.929874387259687518e-01,-1.180068572150466122e-01,-1.140732167522183899e-01,4.718109204308932880e-01,2.726168627860106053e-01,1.059399482162855843e+00,2.730803029691081907e+00,-1.914385139697691585e-01,-8.564572687907780202e-02,2.293940978495006888e+00,3.499342463716464291e+00,3.160942463467661945e-01,1.649937071361054775e-01,-6.504788425509795413e-01,-2.430810016501401272e-01,1.049013458711334668e+00,7.839697984785992668e-02,2.616057187089810832e-01,-7.387603561799556129e-01,-3.706011438669578606e-01,1.256122001747769446e+00,1.892277733521868788e-01,-7.566423376532846468e-02,9.579285819253844370e-01,3.753891121850658763e-01,-5.108640271431577062e-01,-5.941018209360680036e-01,1.348560663069167109e-01,-1.895494341846605812e-01,4.039108953750802367e-01,2.606103759544398102e+00,-8.413758100329922218e-01,-1.428832116389202045e-01,1.173985720989844994e+00,-5.124243973867470547e-01,1.994561295113164379e+00,3.682930236133030166e-01,9.734269521132598024e-01,2.399628988690327702e-02,-3.205944788830689118e-01,3.543880701320271664e-01,-1.996243887476755741e-01,3.725644134074425073e-01,7.607718260209221928e-01,6.441382486143840680e-01,-2.930578194284944038e-01,5.776343739871805383e-01,1.066586794994862419e+00,1.915499497988270017e-01,9.132531569066213439e-01,1.366212205467086660e+00,-1.276070205015869208e+00,9.494974678507943633e-01,8.022424240993919486e-03,1.291115779280418874e+00,3.601122174740883919e-01
1.149389556598430673e+00,1.647462080198860424e+00,-7.505889336830169345e-01,-3.544762022052101447e-01,-1.917952871669257597e-01,5.163126426039579275e-01,4.587773896943025953e-01,4.524694646815524690e-01,7.446259584863821335e-01,-6.521960950198876783e-02,7.125274949739759389e-01,2.018693125605154348e-01,-2.689528489809313583e-01,6.008543472226711701e-01,-5.877922947911339291e-01,2.106664367883576805e+00,5.492124674888443359e-01,-9.901502913248904081e-01,-3.889767993776669514e-02,-2.145642142114272399e-01,-2.759194326225974936e-01,4.207835764978686832e-01,-7.951203977855643146e-01,2.394639770482779317e-01,1.498750572623642308e+00,-9.847204469619669220e-02,-2.798623400736952593e-01,-4.790128773759451120e-01,-5.251442346786948656e-01,-9.825558007214136857e-01,5.300945635342352302e-01,1.723470209641225992e+00,7.814868550628545352e-02,9.973814875883824094e-02,-9.705278590932823191e-01,-9.725458788852366920e-01,1.960999896075822591e+00,4.988537275234529167e-01,1.477946845679592336e+00,1.786308422794122830e-01,8.641672932182444811e-01,4.033623111970047193e-02,-1.430791101019335820e-01,7.020352136859695502e-01,-1.034712306083096500e-03,9.232367201021068892e-01,2.387410574253978623e+00,5.385353295125573370e-01,4.017434527551855261e-01,6.760793084757419358e-01,4.923575821166310540e+00,1.820727165281941229e+00,9.991505367474439181e-01,-4.688014636962521964e-01,1.379917832940720235e-01,9.276085690760529356e-01,-1.944156098399780763e-01,-2.064472529735345285e-01,-1.356118504891826948e+00,1.265870874357508891e+00,-1.215886195785816082e-01,-2.824972688076257121e-01,-1.015521399943060676e-01,-2.443085515611143066e-01,4.019699571845969377e-01,-3.703778090803275802e-01,-6.389228075380231076e-01,4.164308264891503075e-02,-5.700245291517936908e-01,6.373965029415282757e-01,2.867045798801570289e+00,-1.265156786641191133e-01,-4.552925243569684866e-01,5.801802135891741541e-01,2.124052050579064432e-01,8.681005760624539436e-01,-3.751338607500310229e-01,5.000413760823849696e-01,-6.753049767325055575e-01,-7.469487575328308537e-01,1.391063852632184128e+00,2.174185531836222429e-01,-2.625720626763217713e-01,1.096869801029123126e+00,8.623683638621174596e-01,-9.596247219848357268e-01,9.400368766605632365e-02,5.705592916781123680e-01,9.361100078239705802e-01,-1.081941689696356290e+00,1.651312082303693529e+00,-6.381854111929903262e-01,1.318710359397927911e+00,1.585035393277235694e-01,-1.736937588001064015e-01,-5.436664193596810746e-01
1.021941408833463960e+00,1.433093336383510330e+00,1.506247134517094688e-01,-3.946886392055817816e-01,7.599711093939952311e-02,6.892899994815310238e-02,-1.569907041421765848e-01,9.476033000888364755e-02,1.360938857829947279e+00,1.538354089414528669e-01,7.222725627309301011e-02,1.136062588436054371e-01,-5.025888064655820164e-01,2.549647400192573965e-01,-6.448196669394667957e-04,1.541243642914966516e+00,-3.046193671619752408e-01,-7.349797077962288983e-02,9.896933275621516701e-02,2.780964143050946857e-01,-9.649660682708034454e-01,-3.463040158706576221e-03,-5.983848064487347074e-01,2.663151890049874071e-01,1.254929066614664634e+00,-1.779092868966567764e-01,1.837181698684783315e-01,-5.711644999199666506e-01,-2.598203805828963597e-01,-4.805002646915801368e-01,4.420595343783350062e-01,2.271652926518517024e+00,-2.163290447597978616e-01,-3.986217358349746775e-01,-7.139981150750996930e-01,-6.666812503082543140e-01,1.453172979099393247e+00,1.043834102740640368e+00,9.924479622481835461e-01,9.171444316930779106e-01,7.870801175360506718e-01,3.015295154497598107e-01,1.266218936131728867e-01,3.656583373644163859e-01,5.945251785712871717e-01,9.139241345287869578e-01,2.878156629336002137e+00,9.677418921881858482e-02,1.570475541051306878e-01,1.387645719013536949e+00,3.838299981683869877e+00,1.082345398139625825e+00,5.119018735051615865e-01,-3.900248093632340263e-01,-2.771329864348589522e-01,1.108963374388132639e+00,-9.102833695505407885e-02,-2.297265804199198624e-01,-6.129722302606921414e-01,4.757478217592556735e-01,8.289262505139718407e-01,8.396921404161217239e-02,-1.920481942352037785e-01,6.652317989613774074e-01,7.740294708958106451e-01,2.727158637627924431e-02,-2.756413989397181186e-01,9.285337566191776970e-01,-2.331801394114935144e-01,-1.488664444043433788e-01,2.614707295190199066e+00,-6.766312420894482482e-01,-8.555787699300097804e-02,5.956711217486535537e-01,-7.006278360011328199e-02,1.331515855724188402e+00,3.106543076758467303e-01,3.915926153561682943e-01,-6.074640676379090554e-01,-3.277762271005126848e-01,2.841711578775580893e-01,-1.216731905762278854e-01,-7.113794888265811966e-02,1.183744968120998831e+00,4.336680540954964691e-01,-5.884139277371860377e-01,3.034752870562051341e-01,1.473305529050760176e+00,6.456233279545222636e-01,-1.739159265836136559e-01,1.762368615247961179e+00,-9.035587511529752369e-01,1.369181919023414018e+00,3.273894530961504734e-01,3.660985130430598200e-02,2.099105874430179375e-02
1.152166201128196787e+00,2.373812019540774365e+00,-2.401300728419673014e-01,-8.313567892248763247e-01,1.473341513283694115e-01,-1.961749463110103453e-01,-2.089739582257436612e-01,2.685226767802972869e-01,8.827073823630180449e-01,-2.079666435152240644e-01,2.205162646886058009e-01,3.874405482707090620e-01,-3.357549392619834094e-01,6.033158331027871357e-01,-4.079692100983446368e-01,1.819772984553866157e+00,4.675506789273498609e-01,-3.857611310702420138e-01,-2.179010943215708984e-01,-1.467174079558810351e-01,-4.285465394745427981e-01,7.395233715992638457e-02,-8.750685688369593818e-01,2.061080984957859297e-01,1.567243284522560343e+00,3.677044025420949658e-01,6.630169045493461422e-03,-4.235288833398244135e-01,-6.032476963215965826e-01,-1.033457720473597075e+00,2.051429037615600248e-01,1.692048618200716170e+00,-3.442695858451921276e-01,-1.471978335824928874e-01,-9.738953244933924447e-01,-7.421345487222770210e-01,1.859048430456734069e+00,6.955946679979305713e-01,1.312746096444144861e+00,1.896382825265818806e-01,4.576903544057701057e-01,3.778235917322375625e-02,-2.462576251000539451e-02,4.941966917778398138e-01,2.839569617211209485e-01,1.036347742318513010e+00,2.716617019311924786e+00,3.587343023670384046e-01,9.714449042264802769e-03,1.572577762174950600e+00,3.889606981518431095e+00,1.204842551567275155e+00,5.626610513644554334e-01,-3.057751670085773754e-01,2.089083506874022111e-01,9.200019152724981941e-01,-2.079844001594840508e-01,3.299425929689189796e-02,-1.421164770711207170e+00,3.351003937774346131e-01,-7.703895081944647782e-02,4.944962092259124198e-01,3.709613009613650370e-01,4.433739958674417503e-01,9.401540004867567912e-01,8.319518995761079894e-02,-4.906308915248042135e-01,-1.146859911111742791e-01,1.150328766694515975e-02,5.155035997610166731e-01,2.370390219745251770e+00,-6.292802995928192811e-01,-5.444073208949898879e-01,2.344117277731787852e-01,-1.156538971249053555e-01,9.298757419511085587e-01,-6.288134003782946957e-02,6.131622477201503774e-01,-9.249212614394834997e-01,-2.158633892741437799e-01,1.210192611424975251e+00,-5.283217013320734567e-02,-5.776904567586457762e-02,1.112559368821383066e+00,9.193512278550659556e-01,-7.264471818150539661e-01,4.694133324062536583e-01,2.656699257956018911e-01,5.912250503984834982e-01,-2.597608436478217042e-01,1.424040052901437869e+00,-1.209015638273548632e+00,1.305865960163684836e+00,6.294344291007336611e-03,9.006338327904980789e-02,-6.082377355879431402e-02
9.161038283716385067e-01,1.622188075502693838e+00,4.570455500863902509e-01,-7.386483341322305218e-01,2.896345237530772443e-01,-3.415798480139805027e-01,-4.026120270328106820e-01,-1.485157361418709132e-01,1.111807655516661164e+00,1.280432324985660286e-01,-4.060735384530739234e-02,2.009544069871767036e-01,-5.134278607770337288e-01,1.924531845782616601e-01,1.279996654130088896e-02,1.358172666445017329e+00,-4.165984502193178507e-01,3.283932375742544818e-01,-4.679950957310198556e-03,2.779398293663898900e-01,-9.874026335496923767e-01,-1.591199071805212695e-01,-6.044797883367021285e-01,2.577042371030353052e-01,1.391414005747607430e+00,1.087132507879725873e-01,4.309993858782029674e-01,-5.640506497601183167e-01,-4.374709431162329132e-01,-6.399143584778550498e-01,1.897626571824957420e-01,2.306031107573669914e+00,-4.969457462162502059e-01,-4.379149051268029225e-01,-6.670376454846717040e-01,-5.200573035412293654e-01,1.292161528918013946e+00,1.203200480789676341e+00,1.181536102215126283e+00,1.054494245960977850e+00,4.410485526114951704e-01,3.098594109400530927e-01,1.463794607180446961e-01,1.065025340425963946e-01,7.321566207102414570e-01,9.589729683097981683e-01,2.931558680047242404e+00,-1.428453370928007005e-01,-1.318826594384909789e-01,1.815649891307954178e+00,3.121078371628868364e+00,8.182581824673031967e-01,1.074120432194997088e-01,-3.239282392141037414e-01,-3.558121218321141921e-01,1.272047773877982291e+00,1.141423447236424027e-01,1.201202512707724712e-02,-6.095073125766685695e-01,1.674936105057147628e-01,8.536911205268038483e-01,4.261705126464236937e-01,1.136142882830844386e-01,1.193455237073449471e+00,1.157081302937112532e+00,3.313530798936443200e-01,-3.201091727244346208e-01,7.784928027563235986e-01,2.170041843111593927e-01,-5.395642219496799008e-02,2.159648653253849915e+00,-9.048657617365187811e-01,-1.398469103496784161e-02,3.594867489823512230e-01,-3.561877256979393835e-01,1.354469399459551138e+00,3.280597439433487472e-01,5.678924846096353729e-01,-8.075498062695954937e-01,-2.009374634344635036e-02,1.685371640185054920e-01,-2.238875467212609327e-01,5.099787136090283557e-02,1.328700672000211913e+00,5.811685090281877297e-01,-5.905559155432494878e-01,5.658972423698247489e-01,1.226126292796572592e+00,4.062451944571883744e-01,4.681357497318653915e-01,1.538136652622325018e+00,-1.119956672793630759e+00,1.109301608568358688e+00,2.117391946487393317e-01,4.451108433738149572e-01,2.526819067271895980e-01
9.778332696616061082e-01,1.456192930419943465e+00,5.283949574211993516e-04,-5.018928477202100336e-01,1.474516331962084092e-01,-6.630554807353955526e-02,-2.219896293789280217e-01,4.553739288331296042e-02,7.804021334503550289e-01,2.255959785850345234e-01,6.303633997946984646e-01,2.560648915648465751e-01,-3.807606652465040931e-01,4.077676055860722237e-01,-2.133111164659892145e-01,1.933114055703540002e+00,3.335421912339897599e-02,-9.984531785696057482e-02,9.635799362702965332e-02,1.354415583833787629e-01,-7.184130220327334948e-01,8.620181709170782192e-02,-5.908800601015017362e-01,3.137854897879008842e-01,1.310420803057025463e+00,-3.171176779104032950e-01,2.858663519016390042e-01,-5.059770150403724021e-01,4.879428658801199248e-02,-5.207211190666544143e-01,3.147210025316704018e-01,2.019901345669747883e+00,-2.763688013684993394e-01,-4.097283017785121051e-01,-6.701860173530194142e-01,-8.181078873056222278e-01,1.207949488194106635e+00,1.188376418022294656e+00,1.291907452646194665e+00,1.076810292978788386e+00,5.949908304453143115e-01,6.659235003110036688e-02,5.398118491189882184e-02,3.362149221739750837e-01,2.985952797481288279e-01,8.882341541944853702e-01,2.801393236111613838e+00,-1.238444046226977457e-01,-3.994447721211921709e-03,1.702616813551703689e+00,3.735034681112799237e+00,8.758552169228378537e-01,4.126914908503744872e-01,-5.543915103137315725e-01,-4.284721823393663476e-01,1.283407515267735777e+00,3.187782902100796956e-01,4.907536354375865995e-02,-7.518255385799850199e-01,5.966096194063194025e-01,9.766276804790903210e-01,7.576484345773210061e-02,-1.407135902140226880e-01,9.498556362404175779e-01,5.949807335736346792e-01,-2.784949179100842942e-01,-5.102895551822808073e-01,4.717487470514388215e-01,-4.394413433893890747e-02,9.966540040549909385e-02,2.647813049953057440e+00,-6.353736023456291182e-01,-6.731290397313113849e-03,7.569184073800641066e-01,-3.212028287882899291e-01,1.569916163976734502e+00,2.285479877628723844e-01,9.163975640007162582e-01,-4.108121776788391522e-01,-2.824132447948101698e-01,4.423632292797010090e-01,8.417628411328456628e-02,1.145674020286983064e-01,1.025319288832541975e+00,7.723141869463551190e-01,-6.322667836271317343e-01,3.772878367620888795e-01,1.331493242769051122e+00,4.048895630797843537e-01,2.847105004808945794e-01,1.705558257038399139e+00,-8.729926188960583922e-01,1.005831274654774177e+00,1.070294152229420981e-01,9.110197197854734696e-01,8.934782527524892659e-02
9.724866030023282537e-01,4.732987949940042349e-01,-4.121613740915119894e-02,-2.419162575832773943e-01,-5.703369798126116663e-01,6.150331593513379547e-01,-3.533701441355571737e-01,4.732916430545887065e-01,2.470794741984419840e+00,8.032392214830461619e-01,5.856482019770212766e-01,2.642813145402891362e-01,-5.017972791943260402e-01,-2.805019646950276946e-01,-2.081085946535029541e-01,2.164127292797350055e+00,-3.800360662645296816e-01,2.706246491556640876e-01,1.046955945167227231e-01,4.156793995407850884e-01,-1.078254662653779228e+00,9.840191075655316810e-01,-1.125936372350672676e-01,4.458637135963663956e-02,1.297637798654688979e+00,-1.078238660373098678e+00,5.641167770542483695e-02,-6.776119300216055796e-01,-1.916353208238836814e-01,-4.418527608354445579e-01,5.269787252643090003e-01,2.867630397711821821e+00,-2.488122017328322499e-01,-3.665443932093500612e-01,-4.763541379350017535e-01,-6.240097968458540034e-01,1.527535440794697497e+00,1.188102767434138007e+00,1.385819134818585541e+00,2.181791069597003307e+00,1.296176199201996004e+00,3.884015577434293820e-01,5.419375909292150073e-01,2.310624867662020021e-01,3.095377653972773979e-01,4.554146133853650968e-01,3.253382773937944616e+00,-4.315547249066321867e-02,2.538276319718043017e-01,7.438537348433598151e-01,4.409229297699671868e+00,1.675175558129359032e+00,1.166605672625713908e+00,-4.900464026180842980e-01,-1.011600553879862030e+00,1.722663119649755714e+00,8.526696804760915960e-01,-5.353452104406415391e-01,-5.244262216060989745e-01,2.471545293472248161e+00,1.022531467206244660e+00,-2.213647282312831144e-01,-6.445372892926132247e-01,1.030742395958933688e+00,6.509190731915934780e-01,-1.826918174890684865e-01,-1.524369537514780881e-01,1.524058588561984173e+00,5.517316242939492715e-02,-1.064711951951610613e+00,3.275754979826740243e+00,-2.849081760589645129e-01,3.787070879756204711e-01,2.826074984902383624e-01,1.047504570736153134e-01,1.112014612889153486e+00,3.899890034095450653e-01,9.137120313150854933e-01,-8.793687371798921681e-01,-2.390952609424333575e-01,2.749999793166925111e-01,7.557961407800080078e-01,-3.038937575507772437e-01,1.220139805092597785e+00,8.468125225378908549e-01,-1.062885151177850540e+00,-1.976843314811123631e-01,2.639429754390580030e+00,7.775468601396169355e-01,-9.978309121642194857e-01,2.795996599917458525e+00,1.622636437103475160e-03,1.355314973281268598e+00,3.694389442947849100e-01,3.112163234030137504e-01,-3.129806047692743620e-01
1.011198330134343681e+00,1.012716433005297567e+00,4.114898857756671413e-02,-2.523792125876309078e-01,-1.674265493222681922e-01,3.253191397195310253e-01,-1.847209999430760585e-01,2.437585962441588538e-01,1.724508462174343837e+00,4.114821095724985334e-01,3.331211121078145876e-01,1.439535791311068458e-01,-4.964949848831724522e-01,9.148754286923564683e-02,-6.299388302242719950e-02,1.817760967617877643e+00,-3.202530031430472768e-01,-1.804953224185321115e-02,1.511496424307884889e-01,3.402858167629491115e-01,-1.008967224475841862e+00,3.485761102314852145e-01,-4.155369743561996287e-01,2.106680322723025189e-01,1.217150321845424710e+00,-5.992103368256799234e-01,1.262789056259616127e-01,-6.084522805217382757e-01,-1.107750418242967605e-01,-3.848072850474280049e-01,5.218770883021126572e-01,2.465674675584687225e+00,-1.686996361549641665e-01,-4.116748851183671953e-01,-6.165151964024812026e-01,-7.010443125479809412e-01,1.430868007578744550e+00,1.115851235151188448e+00,1.089764897834692547e+00,1.387272756545687269e+00,1.020538893816302917e+00,3.120238256590111003e-01,2.598426379040716938e-01,3.615405397582786007e-01,4.566302234268234672e-01,7.431473829416540555e-01,2.996273968290326550e+00,4.090068125751719630e-02,2.331358287390890016e-01,1.139580663383755521e+00,4.142423633357672053e+00,1.271302130945684006e+00,7.844034720321966248e-01,-4.702596899370323769e-01,-5.647512523846923704e-01,1.314677232362400527e+00,2.438990848721423743e-01,-3.560307177959769476e-01,-5.329789851627352304e-01,1.198079035238966528e+00,9.994929946199490045e-01,-1.164228126905377247e-01,-4.431160943283590781e-01,7.447392330720519205e-01,6.099799332940909480e-01,-1.592142237713457531e-01,-2.416776429201374921e-01,1.172528358913559554e+00,-2.242241951955095125e-01,-4.888088102306378246e-01,2.951307180745366132e+00,-5.073281053240252803e-01,1.016495969005894590e-01,6.059650663580190555e-01,6.474760701661377849e-03,1.337734303411449943e+00,3.619087474309245489e-01,5.890457162064464125e-01,-5.882289682045976908e-01,-3.620707574599976164e-01,2.419073394556448542e-01,2.054083835155466609e-01,-1.384827737816896054e-01,1.140571094034036337e+00,5.437873418927442470e-01,-7.278305128084967546e-01,8.701652403952153669e-02,1.989728861160500850e+00,6.995043089430204031e-01,-4.814589841190264896e-01,2.163493275002304816e+00,-5.423172370040855172e-01,1.369530558101879958e+00,3.573568538820598439e-01,1.803432365527459502e-01,-1.088179058747772432e-01
1.109441003281880445e+00,1.268007508230897695e+00,6.866011875313027257e-02,-2.918874049227961898e-01,-2.004071501365471408e-01,1.993759712146114804e-01,-5.914472024820998097e-01,4.104087105808344460e-01,2.142904134022900031e+00,4.773230094715505967e-01,3.365927765911203018e-01,2.974115361167404825e-01,-5.001986297914728929e-01,1.192814081999762771e-01,-2.533414318913890240e-02,2.048344792934456926e+00,-1.572919279621963762e-01,1.393252538971291310e-01,1.170183186474938464e-01,3.857115373968947880e-01,-1.062249271354449576e+00,4.351139223877737994e-01,-3.765127032644456362e-01,1.685234426336260916e-01,1.137734620879957914e+00,-7.577777722617369260e-01,1.256689019162434973e-01,-5.615841272227168890e-01,1.911303256884575585e-01,-2.292781830360428597e-01,4.872348716750070086e-01,2.421435274869705889e+00,-2.600166716255763455e-01,-6.085393495941855413e-01,-6.020733873526441515e-01,-7.135175967026577970e-01,1.422571487572341198e+00,1.214130812784228741e+00,8.963641818636933767e-01,1.573729812841465625e+00,1.080189435025407318e+00,2.235323972307974860e-01,4.046977077002410494e-01,4.343038957526211830e-01,3.888378003774982661e-01,6.914057884233788531e-01,3.293265787542180689e+00,2.763207812729469304e-02,1.631801469261018322e-01,1.483003444836320739e+00,4.089354367651192312e+00,1.023685622901660652e+00,9.419165752073309639e-01,-4.885328919613988186e-01,-6.279117008390258103e-01,1.311398373920454219e+00,3.481618887807264584e-01,-3.688385579845889772e-01,-6.138418828889051770e-01,1.128835974417990551e+00,1.146876331225131995e+00,1.343182000418398081e-01,-4.486769426424351837e-01,9.644045995783545600e-01,5.514810925295172694e-01,-2.709066248246483344e-01,-1.153199894189649299e-01,1.160556594143458797e+00,-8.473387922596969934e-02,-8.167648843960655380e-01,3.182210010361011143e+00,-6.187884675653393396e-01,7.047973216715920641e-02,5.838699385051921986e-01,-3.306157745485047844e-02,1.444342913042906851e+00,6.338373853058594243e-01,8.055982031626442996e-01,-5.400808527929753522e-01,-1.941900158899997897e-01,2.431450543116863150e-01,3.296724409235020081e-01,-5.594836973782954526e-02,9.194110440013674168e-01,6.296094529782431115e-01,-6.083260184322619724e-01,5.543880972895376402e-02,2.208519635059291275e+00,5.832013786178436021e-01,-4.336348299171333687e-01,2.408724045121905633e+00,-6.249944091280654757e-01,1.515576212624686114e+00,2.760100659178511551e-01,3.681053632569117329e-01,3.959728503366927166e-02
1.154747571759491276e+00,1.411107337231432890e+00,-1.099819883468299980e-01,-3.930462149454965748e-01,-4.358936682493238512e-01,5.614287876423198487e-01,-1.704530160050876653e-02,5.512862467517951615e-01,2.565032869205705168e+00,1.370793679604356552e-01,-3.987210872105598214e-01,1.210228716824188755e-01,-5.680068703821140597e-01,-6.528432475360235188e-02,-1.273307177656906597e-01,1.458691962384325747e+00,-3.318321501033136278e-01,-1.973037058821016099e-01,-1.215922242596148561e-01,2.427101076631754117e-01,-9.909557361025038702e-01,5.486252198539414149e-01,-5.360821755721338899e-01,9.049887473665557680e-03,1.450310286656476988e+00,-7.282296990504058543e-02,-2.652712219527801896e-01,-6.486835816655028841e-01,-1.103481995340680921e+00,-8.716606240550480722e-01,5.791775554667597525e-01,2.620318888022828308e+00,-1.534173339183877993e-01,-6.956440204323841026e-02,-8.620521119405982757e-01,-4.668296063338655544e-01,2.286351332416805882e+00,5.379769307514293830e-01,1.041938471681228773e+00,7.742821717038999019e-01,1.216535298454982428e+00,5.717301542847628149e-01,3.375371154396133444e-01,4.552551777637597330e-01,6.549677723291023046e-01,7.705830802002939794e-01,2.997462771709785478e+00,6.465026292542923603e-01,4.532972730369428382e-01,3.743761485503384057e-01,4.583873708388699342e+00,2.064327607758174477e+00,1.165929429696511255e+00,-1.121743669825528700e-01,-5.953819061617626751e-02,1.027517140067704116e+00,-3.463706929128447243e-01,-7.267849443983206426e-01,-9.557074434704959653e-01,1.540429773404525138e+00,-1.031064533003363815e-01,7.762993172621768245e-02,-1.657767898942701934e-01,5.425916826155174899e-02,1.084632368708390082e+00,4.406821248413004266e-01,-1.345400274363139914e-02,1.265549246301789887e+00,-3.027092295509456465e-01,-5.142005960904042494e-01,2.786612588075203956e+00,-3.668961109363325090e-01,-2.966971094084140392e-01,-1.272132074808566271e-01,5.019321804302582235e-01,4.076086348172279772e-01,8.760042408480828158e-02,-9.198144576738531697e-02,-1.360958276635596320e+00,-3.764404228539767194e-01,7.943098214966555215e-01,1.298798531905817344e-01,-5.816539761256085406e-01,1.474275359455071488e+00,4.679277484780349217e-01,-9.819963647842109289e-01,-4.950563276913533262e-02,1.442810977226049785e+00,1.184963138781573999e+00,-1.700338844439380992e+00,2.203427752205028511e+00,-5.448389596045705163e-01,1.918861016475359449e+00,5.170331993594341480e-01,-1.373730536063960006e+00,-4.803302981035768582e-01
1.155549903520191934e+00,1.541663076100650009e+00,-3.499510900637757271e-01,-2.893386269994411286e-01,-1.942498832064301628e-01,4.367562098748219990e-01,1.194616640199915314e-01,4.335710799225812595e-01,1.500347156789733738e+00,6.153708271060678858e-02,2.443286214804821499e-01,1.512551063530211959e-01,-4.202056556093891060e-01,3.653907526637413805e-01,-2.555500512512382527e-01,1.832078917224882142e+00,1.028994700065511414e-01,-5.693784827893573208e-01,1.806212476864022670e-02,7.597490431468535699e-02,-6.927468007227561841e-01,3.215435816246492440e-01,-6.701429977879000965e-01,1.998050851151210450e-01,1.338847213181209472e+00,-2.102431532340498788e-01,-1.719398278178162764e-01,-5.402364110727073676e-01,-4.421189386441491953e-01,-6.924981430993850662e-01,5.727602499781273560e-01,2.088792552763030219e+00,-1.789786708329010878e-02,-1.537550002865268883e-01,-8.690326458162768164e-01,-7.933573603444152855e-01,1.886029091211852693e+00,6.799144712465903240e-01,1.091831888178717236e+00,5.433255559722534045e-01,1.011016024569233895e+00,2.325251315088021908e-01,7.426720693951364971e-02,6.170668119567921384e-01,3.220475075948824317e-01,8.770657694178456421e-01,2.738356422214584640e+00,4.694555573669010329e-01,3.895252478576909927e-01,8.399492483496555639e-01,4.624426601586037577e+00,1.606537696230529333e+00,9.835756448595875945e-01,-3.804489791485836658e-01,-2.704112290537752372e-02,9.489470227441038075e-01,-2.593385631670775959e-01,-3.943274941803426303e-01,-1.009266493562370304e+00,1.042854577594972465e+00,2.550677400177291387e-01,-1.060751513517305678e-01,-2.265057525497571334e-01,3.912333715308102811e-02,5.712498376682751955e-01,-1.477330134475233203e-01,-3.297832345256547226e-01,6.672822942484640807e-01,-4.988544459738248893e-01,2.337125620171986995e-02,2.914490451865179743e+00,-3.536357001800636279e-01,-3.241154294185216722e-01,5.051288306745560508e-01,2.414172749762227288e-01,9.619462512060550363e-01,3.152250546838447631e-02,3.033345337890178128e-01,-7.237206877536163097e-01,-5.677806358667465414e-01,8.789334235231179848e-01,9.789695891995731092e-02,-2.731979754775598623e-01,1.124088677693937388e+00,5.748635406546105386e-01,-7.852420785800054981e-01,7.308015407255369356e-02,1.181347611476705417e+00,9.251696827737383444e-01,-1.031640455466788175e+00,1.897397877519300113e+00,-6.990952015818046039e-01,1.577075323939062468e+00,3.174263934927960551e-01,-4.517240545604716551e-01,-3.456381797502955933e-01
8.995917292871399296e-01,-4.339798706282694818e-01,-1.602699700235875602e-01,5.793235694722382867e-01,-4.866444589945919108e-01,1.152637363878688204e+00,4.323758809580742213e-01,2.518503427493636315e-01,1.750904612609567312e+00,8.787125141440743636e-01,9.085909393784405985e-01,-2.145869643503932611e-01,-5.287534448656643349e-01,-9.570798753938190850e-02,7.222639104418759892e-02,2.032018575823529627e+00,-7.498499076822227050e-01,-3.598755706408466315e-01,6.268935422625598886e-01,6.023572229486926499e-01,-1.244669402301818106e+00,5.852348376750041714e-01,-1.132737110692062510e-01,3.395270436316015772e-01,8.458580352675404423e-01,-1.608313153730672296e+00,5.882426097935913867e-02,-7.485836220114625572e-01,5.262319848660805821e-01,2.170252072030804946e-01,1.005344774970908350e+00,2.843591298508181708e+00,3.421218846195413499e-01,-4.613369289887718216e-01,-3.701246729085297393e-01,-9.507770741269307990e-01,1.024278032814729622e+00,1.321548726957485709e+00,9.929828261645690102e-01,2.044036161261121975e+00,1.623076068742340450e+00,4.166171508487674924e-01,2.384556852021729179e-01,4.812540887709266801e-01,3.281745417343044924e-01,5.369553177750568951e-01,2.813532459760313742e+00,-1.112767419973422212e-01,6.735030243122911431e-01,3.590595706708650248e-01,5.039321596635908840e+00,1.553185181431324224e+00,1.113004196007739921e+00,-7.916809012945187352e-01,-1.101341686075360871e+00,1.508492551516900981e+00,4.790891096555774387e-01,-6.903858005252851981e-01,2.016119571872658778e-01,2.096127900402881217e+00,1.904327527389189534e+00,-1.208747278419155746e+00,-1.393661961641756264e+00,3.933601905066081983e-01,-1.975563507622444259e-01,-8.390957984518641055e-01,-2.801747391599829773e-01,2.034198822995586298e+00,-9.678052926904677777e-01,-8.622787612491980003e-01,3.707122305982661903e+00,-8.917853730645239341e-02,6.016011481414585971e-01,1.418316657819896687e+00,2.404140432415650674e-01,1.826643304104601517e+00,4.243435610295706595e-01,5.103616618483953760e-01,1.150522458903107115e-01,-9.618227420494919189e-01,-3.723473084878443640e-01,4.500507518227784831e-01,-2.238316294334843082e-01,1.045326868301637235e+00,1.585399949748889092e-01,-7.667926080186281412e-01,-3.762019165770201234e-01,3.311919719134877482e+00,9.462814422978247375e-01,-9.267790506272053364e-01,2.643311091807184710e+00,2.228852632268198963e-01,1.317227668298328824e+00,6.873563482620017595e-01,2.908599447727354681e-01,-4.174306639920314366e-01
1.153863964064498315e+00,9.970092534339123347e-01,-1.186678378177836168e-01,3.048718238385248469e-01,-1.840633187637493728e-01,8.508730580685999190e-01,6.045519965364758441e-01,3.102540313172396091e-01,1.847350454337113534e+00,1.051219455071730757e-02,-3.785825775014754480e-01,-3.247790901424172927e-01,-6.176399125171414539e-01,2.532174283915318291e-01,2.470647856367705897e-01,1.158818940366620920e+00,-6.399907298704421432e-01,-8.096418032041889923e-01,3.337489779310749416e-01,4.125907445927364248e-01,-1.173563399085294945e+00,-1.057064848493102227e-01,-6.772964166498620653e-01,3.187128202474820426e-01,9.868777858574323547e-01,-3.012391934582661635e-01,-2.452500739658239060e-01,-6.726590299142031215e-01,-4.182700057135254612e-01,-2.204629994307527596e-01,9.955702092241693890e-01,2.440036932470980968e+00,3.660689901760218468e-01,-2.408834418699634106e-01,-8.455829233609715168e-01,-7.509225850728522555e-01,1.856686813193570984e+00,6.212618788935173608e-01,4.261284032650309861e-01,2.893918435550431045e-01,1.412893725191807670e+00,5.799234912026351996e-01,4.283789335171449275e-03,7.603320554654278141e-01,7.918705921187075836e-01,9.738476898389143432e-01,2.615572936259504822e+00,6.700997645126910429e-01,8.060498529378624655e-01,3.047904915892839517e-01,4.974438885516477171e+00,1.710135141975756667e+00,9.954820977762267598e-01,-3.271947676990349940e-01,9.897867520104264294e-02,6.025388252397556599e-01,-1.023226880945898198e+00,-8.307435245222349884e-01,-3.367048524382626473e-01,5.192167964570890692e-01,6.572066394282178869e-01,-6.141910723721029086e-01,-7.100856413814996548e-01,-6.082550285005289270e-01,3.692241347215670100e-01,-7.013431698654526425e-02,-7.082029344076778976e-02,1.620170285598673043e+00,-1.299660320741929276e+00,-2.208101773781658839e-01,3.053838622374547285e+00,-3.660007769998322447e-01,-2.728703311877571647e-01,9.550880707001714320e-01,6.043281693135281740e-01,1.115367230260356779e+00,2.174776031905791274e-01,-6.386780470705830659e-01,-3.979947513075560162e-01,-9.991313391397005361e-01,1.863405596816847254e-01,-4.139976249808133280e-01,-4.401662128241032312e-01,1.246894186131539239e+00,-3.155400844577719299e-01,-5.085593592250849948e-01,-7.992453627234369362e-02,1.793013187955862175e+00,1.297622709249011574e+00,-1.451039491025086781e+00,1.848100137407938215e+00,-6.711301053544858064e-01,2.020887897110502429e+00,8.010726268230556890e-01,-1.579558212972289155e+00,-4.243140986109553703e-01
1.330971225203469555e+00,2.295291480896251901e+00,-3.098659532993023880e-01,-5.063921190270099792e-01,-1.643184514667574425e-01,1.829666323433765118e-01,-2.983455557893759935e-01,6.450002824614650132e-01,2.029971030229296147e+00,-1.338555684200532780e-01,-1.639759199551043545e-01,3.226052677213924746e-01,-4.454939232920896441e-01,4.601051840557952022e-01,-2.136870409900661349e-01,1.816243912306450436e+00,3.350466222039803488e-01,-4.803963249531319479e-01,-1.682313461153370771e-01,3.688110031719697007e-02,-6.972388403593779982e-01,2.731466525522232014e-01,-7.927566372529366578e-01,1.113245564668274290e-01,1.368846651343283094e+00,8.220856315470542741e-02,-2.725776324137036966e-01,-4.681134479060207187e-01,-5.437097882284460670e-01,-7.685889768377280884e-01,4.817336402498880177e-01,1.942744170207188148e+00,-1.664045158307566330e-01,-2.496373929403339909e-01,-1.008429691822102292e+00,-7.041308511343060683e-01,2.200472615152003542e+00,5.401833567480786025e-01,8.077176944554951277e-01,2.296868910700826660e-01,9.766697992810001727e-01,1.987136397186570758e-01,1.835496475987037357e-01,7.354503755216779126e-01,3.858999382028862613e-01,9.387674621528732111e-01,3.011482971520906826e+00,7.025449526551347246e-01,3.184450651852249736e-01,1.159680913920292600e+00,4.503043106544454943e+00,1.467265915227164985e+00,1.121558777809808394e+00,-2.218042497077214459e-01,2.724607745313153417e-01,7.144217838299622425e-01,-5.467388897209558563e-01,-4.384348291495808736e-01,-1.340139915339944476e+00,6.133914125531066963e-01,-1.011394132299162918e-01,4.145532528086555146e-01,5.677880613934004062e-02,1.860108230008250541e-02,7.897217570343869619e-01,5.694948010052869325e-02,-1.339554391992500149e-01,4.782587008886906021e-01,-3.387152190097186266e-01,-1.276604071588898215e-01,2.894336217517483156e+00,-5.478881108843793868e-01,-6.349689856434976853e-01,1.927391359737477827e-01,3.065269552805854891e-01,7.434953454198403033e-01,2.094872053825374558e-01,2.182264769420989015e-01,-9.687439540559079632e-01,-3.363242940479717613e-01,1.138711581807178241e+00,1.565576205276064670e-02,-2.822404550151587088e-01,1.006096314684893578e+00,6.105166766046599136e-01,-6.518816017148904018e-01,1.399366841424828367e-01,8.635391576480981879e-01,9.111174755563907768e-01,-1.188092141707919991e+00,1.928641243401881589e+00,-1.044552123294300916e+00,1.928158875531910788e+00,2.382103010699089807e-01,-8.401481780501542929e-01,-2.137390605750265904e-01
1.033025146870235389e+00,3.704841445864779370e-01,-3.704591016408340653e-01,8.844152098215596336e-02,-5.190087707391888294e-01,7.420979045319471279e-01,-2.371007067777541333e-01,5.385586751378971249e-01,1.871574597865427902e+00,8.689510774976463292e-01,1.271977680923384035e+00,2.702346367351062817e-01,-3.813649130041814050e-01,7.393319698410082130e-02,-2.829604063424383531e-01,2.689722811732469854e+00,2.068901251823729304e-02,-1.587311115100096814e-01,3.234556771215060800e-01,3.437614901851368532e-01,-8.870618603138552549e-01,9.406933024969935664e-01,-1.457399349767836139e-01,2.073687375117918563e-01,1.058924552084752557e+00,-1.549459349253665463e+00,3.809767361507282457e-02,-5.935988089113154453e-01,6.707353015648807038e-01,-6.309357216784516886e-02,6.752106005956042267e-01,2.464411300851322650e+00,5.295046248609103223e-03,-5.212882832261767074e-01,-4.451786004386784623e-01,-9.952915273322588963e-01,1.172551109750085363e+00,1.336142363788529241e+00,1.266104336487475113e+00,2.159227359736369145e+00,1.378430947778917615e+00,8.026262543066770005e-02,3.826031361582902246e-01,5.051928782112810046e-01,-7.318637706123187758e-02,4.636401217384113482e-01,3.126670702360265786e+00,-1.459894761539505814e-01,3.429258885302262638e-01,1.002116033877067602e+00,4.823024598744902747e+00,1.325000968232135312e+00,1.287056552080673821e+00,-8.026793808350640713e-01,-1.090544277102539095e+00,1.643515187350522044e+00,9.593030021539213914e-01,-4.054884400497462682e-01,-4.788334893427522720e-01,2.311439307566510060e+00,1.540931125045975403e+00,-5.699985462869607833e-01,-9.715282562568842151e-01,8.855516162025028892e-01,-7.610000746371325953e-02,-9.495996376036444087e-01,-3.505963448095643087e-01,1.224769204413769685e+00,-3.210834098664699932e-01,-8.723396978520554512e-01,3.780668350107066367e+00,-1.696076614329184995e-01,4.111219988727932151e-01,1.017991059248454011e+00,7.075197010567926825e-03,1.698998598490207401e+00,4.722334659746151853e-01,1.278904856307747862e+00,-1.383756928939394726e-01,-5.289545389122153329e-01,2.789773573597253975e-01,8.751073932018424983e-01,-6.682637683193937139e-02,7.616703888654194898e-01,8.657700099156109275e-01,-8.568992943934768958e-01,-2.846451319455595708e-01,2.848117892746322433e+00,6.316342203688738444e-01,-7.193975035397288664e-01,2.823954699876525254e+00,5.322296598386722088e-02,1.212327831530178868e+00,2.614681441899118219e-01,1.056613594502817666e+00,-2.687186233153704973e-01
1.271116267396927180e+00,1.889710622586486366e+00,-2.581476204203144165e-01,-3.791681860731649367e-01,-1.220711126336059410e-01,-1.775058099275367285e-02,-9.086817287712523061e-01,6.269824523443386921e-01,1.813370358557721884e+00,3.947081654606990342e-01,8.385533710115539163e-01,5.711748250500635615e-01,-3.462736784747430518e-01,5.282237263278570794e-01,-2.381893085620234440e-01,2.677132367278014513e+00,5.856068878386686549e-01,-9.369833295407317686e-02,6.132843635109715835e-02,1.706297088342694224e-01,-7.259531256441820180e-01,4.870796056384408823e-01,-5.006387725910239617e-01,2.100957521032332243e-01,1.093604324728010280e+00,-8.788662664745438002e-01,7.149420346136599325e-02,-3.972956876794687675e-01,7.966557278394028607e-01,-1.531243197609866158e-01,3.975503982787663704e-01,1.851336211357774264e+00,-2.786114130457642002e-01,-7.520290202744732699e-01,-6.867984183371214080e-01,-9.756123986350181410e-01,1.351918474609858256e+00,1.249526228294707053e+00,8.525315375531197226e-01,1.383355479227542206e+00,9.621975233058941424e-01,-1.731216521749108783e-01,3.476385314480324729e-01,6.867247613081207680e-01,-4.012128291221495058e-02,7.217880746100433509e-01,3.379652187210748782e+00,3.369477013895164075e-02,4.352780886866243482e-02,2.088758081179475923e+00,4.215260876466095041e+00,6.114337211827247653e-01,1.099792583318678796e+00,-6.545758410368051061e-01,-5.105296072012439623e-01,1.195949240751990494e+00,4.820283643312357480e-01,-1.256304158876269117e-01,-1.037157923309468099e+00,8.500237625373987527e-01,1.170230894455280390e+00,3.649443813713348916e-01,-3.414786240468560274e-01,1.032009845887837507e+00,1.789555656412256113e-01,-7.789817566055030618e-01,-2.548925785359709151e-01,4.279353547329500795e-01,-2.070144170577690318e-02,-6.174275150837498227e-01,3.497897993016833240e+00,-6.495221947854488143e-01,-1.409456281254391485e-01,8.289430904776944331e-01,-2.004852861215382642e-01,1.721866309674905171e+00,7.274176446037712296e-01,1.354700612445644659e+00,-2.078224569956643730e-01,-1.407030534077201023e-01,6.723129016877429365e-01,5.227857781754720046e-01,1.919255972604863025e-01,4.359444083754204780e-01,9.709919113521587875e-01,-4.464796892214116797e-01,9.923800756693421099e-02,1.895113232135848147e+00,3.271342580854919579e-01,-1.432067625824968715e-01,2.421290142056891526e+00,-8.413723329678945984e-01,1.462397795574648551e+00,-3.420132434366507379e-02,1.101584670410149958e+00,1.877963119942884784e-01
9.226886774358979970e-01,1.657581895377636894e+00,2.008925513148644426e-01,-7.864022952667705235e-01,2.529516349228471683e-01,-3.312175869498539815e-01,-3.885982978905425100e-01,-7.744846883706105189e-02,7.519418818055763065e-01,1.706369235009884966e-01,4.350493462329056427e-01,3.250501770594956819e-01,-3.994228355794341434e-01,3.278233551634925913e-01,-2.205227235600963620e-01,1.751761041329773061e+00,-4.657105755109425260e-02,1.800935845096608978e-01,-2.988807543714266934e-02,1.188075903109132858e-01,-7.307191392658274331e-01,2.139675420175302101e-02,-6.081910482553322117e-01,2.689369833874738491e-01,1.454593159832149762e+00,-2.748159226473703004e-02,4.044667977588670693e-01,-5.074958180495304783e-01,-2.476073182789282345e-01,-7.237174569604520880e-01,1.326256613298000819e-01,2.077274430622528811e+00,-4.887253979009054117e-01,-3.824981976320494526e-01,-6.727334064604063579e-01,-6.685268396214696374e-01,1.231933016926355151e+00,1.214466826686873002e+00,1.434833502376041237e+00,1.099126900330276824e+00,3.730385624841550118e-01,1.142407997969148714e-01,8.980251311879640375e-02,1.550176593132586711e-01,4.268494926583821791e-01,9.187525729526995200e-01,2.850868316543200276e+00,-2.057521552565741985e-01,-1.863577981178893284e-01,1.893363286570653781e+00,3.275870000076550159e+00,8.162793760826665412e-01,1.840120240418280928e-01,-4.466856084727562348e-01,-4.149787164066368605e-01,1.369186758441031770e+00,3.942623244886787615e-01,1.670590348343824194e-01,-8.247878777835067066e-01,4.551173732079996093e-01,8.112373154866330260e-01,3.670118524102723434e-01,1.323560571310915812e-01,1.242801906787354138e+00,9.614393464816247681e-01,4.581068737408067193e-02,-5.043509908992914736e-01,3.760361231188061870e-01,2.924596967452059437e-01,1.520931849832211913e-01,2.289270615904962725e+00,-7.783754064016497054e-01,-1.379047879606630500e-02,4.483099781233811365e-01,-4.534088340674521378e-01,1.427613139091844729e+00,1.978430487409307825e-01,9.512295336487429642e-01,-6.967566629798952471e-01,-4.768762272656568157e-02,4.534532662111486756e-01,1.261827735075940482e-02,1.305035401507322890e-01,1.187696042467554447e+00,8.839241559127495318e-01,-6.844574993618790515e-01,5.449385070163590417e-01,1.068493021176524449e+00,3.046832819755283528e-01,5.537077073968650343e-01,1.561666027870033169e+00,-1.023659956555654116e+00,9.007404935839833371e-01,4.318217919314895625e-02,9.711318525536862811e-01,1.980290558986632643e-01
1.001922543241434260e+00,5.789648169296803815e-01,-5.741588627939621381e-02,-6.276592574997341689e-02,-3.225340347202879099e-01,4.344565858972078143e-01,-4.695030688167287081e-01,3.732928566023022698e-01,1.877469890860137935e+00,8.106437149186009883e-01,9.859152025119750640e-01,2.784159840245976070e-01,-4.397758417136462539e-01,5.120613604143396669e-02,-1.205864053593110885e-01,2.436425058044395797e+00,-1.644419033376064709e-01,1.289813730674064796e-01,3.000124047314127740e-01,4.318574755310864988e-01,-1.033584822072068476e+00,6.842574791921494093e-01,-1.749851923253832320e-01,2.246112277311865246e-01,1.043938826594721370e+00,-1.343855901087568805e+00,2.116797075989860777e-01,-5.914737587003643382e-01,6.527467651468412679e-01,-1.381599003568290129e-02,5.635221854593042146e-01,2.510902010584953548e+00,-1.538043231609989014e-01,-6.558477255687418239e-01,-4.202770987087507959e-01,-8.785273550757746186e-01,1.048088260447222586e+00,1.465662121664760509e+00,1.133311455808981627e+00,2.175768376086370637e+00,1.201240164689576284e+00,1.281757112846331759e-01,4.137019815199650674e-01,3.867511108596997094e-01,1.396566843777580780e-01,5.346129382971744892e-01,3.239884975991634164e+00,-2.648084255917738661e-01,1.880804823673081771e-01,1.389015362845072765e+00,4.300575837015386149e+00,1.006328901427743006e+00,1.007097577624957330e+00,-7.338320236934090524e-01,-1.081958406866774025e+00,1.630145568106713405e+00,8.945671739884365481e-01,-3.140798283335964891e-01,-3.651261239302710515e-01,1.770245746508630091e+00,1.687333329317940667e+00,-2.931766231267025069e-01,-8.170709383577920981e-01,1.189109320836146289e+00,1.586722650535874468e-01,-7.225536472672553501e-01,-2.723171886040497425e-01,1.288281788210127843e+00,-1.326348630402209572e-01,-9.322854837419576324e-01,3.515466929589559086e+00,-4.238097716036882123e-01,4.208351483275352134e-01,9.484282940078572199e-01,-1.464625716602030447e-01,1.801795369993801188e+00,6.394236865154456773e-01,1.230811011620208895e+00,-1.830396314539299851e-01,-3.311293191706619066e-01,3.591214328468117500e-02,6.597060611490428439e-01,3.336007230493004405e-02,8.062404059892170904e-01,7.690968382161755823e-01,-7.065052171871388786e-01,-9.866318216391217755e-02,2.802570132690719973e+00,4.851574237012743485e-01,-2.663754070708987953e-01,2.669712359503604748e+00,-2.123059679795684662e-01,1.195949457323379761e+00,2.526901217587344539e-01,1.132501497441780858e+00,-2.577733873650706053e-02
8.971723506103351786e-01,9.996674695809193434e-01,-5.149317951141640232e-02,-4.639189012226193620e-01,-5.771392431417236846e-02,1.880481540522153383e-01,-3.449478501687125442e-02,6.676782445679399491e-02,9.652878199670470449e-01,3.828476384130194976e-01,7.062508405093588237e-01,2.067319093491862270e-01,-3.924267386211548470e-01,1.731999435116903796e-01,-3.000106020416455355e-01,1.927826970764383585e+00,-1.360145541999564500e-01,-4.867930314459603669e-02,8.976975244418305966e-02,1.562044674023469748e-01,-7.405769977340038723e-01,3.668306530687778233e-01,-4.559044694576991352e-01,2.451174634857530843e-01,1.406084697950593432e+00,-4.495970721178069174e-01,2.344689090599058057e-01,-5.805655666346593025e-01,-2.375478176721923518e-01,-6.597280604433046758e-01,3.515169511993250229e-01,2.289737121593042879e+00,-2.541129243929292625e-01,-2.480158244578292703e-01,-6.115456551363824822e-01,-7.516637878062077949e-01,1.299071193819541392e+00,1.141170636204548172e+00,1.555288997467487055e+00,1.358803942811649845e+00,7.223233047558546005e-01,1.903885312818942299e-01,1.170063934146164802e-01,2.206876163997399387e-01,2.923774693396721247e-01,7.700803877882703707e-01,2.748783272702580494e+00,-1.330586773343053753e-01,7.001542772045378504e-02,1.222965654160217852e+00,3.928379063760210066e+00,1.287820957217544970e+00,5.273824034938796590e-01,-5.334934951462697583e-01,-6.072364613707125214e-01,1.487125695728990893e+00,5.349820928161641564e-01,-6.764211297814026747e-02,-6.883780889752912913e-01,1.324683187212795765e+00,8.614050648350546346e-01,-1.435137710913440001e-01,-2.450156459766169859e-01,9.244900162229883200e-01,6.791562259387663447e-01,-1.813109995815604947e-01,-5.233302346035457742e-01,7.085766802348427706e-01,-2.124219707423651016e-03,-1.350051339943592055e-02,2.662792800327295595e+00,-4.427820886930903255e-01,1.509345218642608732e-01,5.717707457847941432e-01,-2.137901132656060965e-01,1.342754692617150081e+00,6.509812376798279621e-02,8.934111008392313646e-01,-6.288621463399556299e-01,-3.312590427783750902e-01,4.546291041160524515e-01,2.799079131256577702e-01,-5.180983008246350940e-02,1.234311022454827489e+00,8.496290244247038936e-01,-8.930468186747622106e-01,2.369511014039894781e-01,1.539091513015309109e+00,5.516075177966299758e-01,-8.168448740073980252e-02,1.888402779365068174e+00,-5.273754846541856001e-01,9.391091536658813244e-01,1.883321041184228550e-01,7.603964280828878763e-01,-1.307322336586069222e-01
5.895624427792323097e-01,7.827597685523728366e-01,4.915904768873827768e-01,-6.970383275964283643e-01,4.494598885065329008e-01,-2.602721265234723691e-01,2.119019578132379789e-01,-6.561115195785888199e-01,-1.797679067687200094e-01,2.677077543769549317e-01,5.339284918542045455e-01,-4.250931617382727734e-03,-4.397379654086754353e-01,1.311005321419831393e-01,-1.286948962417361342e-01,1.238284975902573803e+00,-6.987608272063265957e-01,2.812679564771479734e-01,1.669012709192659316e-01,2.199260335839139380e-01,-8.473839674162537694e-01,-2.643939516176303517e-01,-5.295731554122137252e-01,4.100555926205116108e-01,1.505882117097063100e+00,4.842871388813243388e-02,7.060787027350835521e-01,-6.403222279185152299e-01,-5.220483591748094065e-01,-7.721569373412505710e-01,1.339858326516868980e-01,2.377239191862390744e+00,-4.292964825063609879e-01,-2.130834188839779708e-01,-5.022533203319947681e-01,-5.978114902667515107e-01,7.838121750681494859e-01,1.405359062853158481e+00,1.820697967122240524e+00,1.310659868830729380e+00,1.599896765704298396e-01,3.166176383917899684e-01,-1.205152469502488027e-01,-2.042196792569313524e-01,6.773996378525413142e-01,9.682684574408438882e-01,2.393051211966350511e+00,-5.780084332669409575e-01,-2.142098071056607322e-01,1.586968050145918685e+00,2.870141441850603492e+00,9.095481074130302712e-01,-4.284478952838605137e-01,-5.075937628098401433e-01,-6.862142302207444589e-01,1.640346260924321342e+00,5.557355847271396865e-01,3.147453833175498650e-01,-2.571777250607265586e-01,4.689087869083081728e-01,1.181683615016253519e+00,-1.360217322939116236e-01,1.044783122950365337e-02,1.401561163034307000e+00,1.089197562968887478e+00,2.331520363607052504e-01,-7.461225909200488449e-01,6.984504493564128724e-01,2.217076057089706898e-01,5.486080584921262382e-01,1.764837723799452140e+00,-7.295349724026619631e-01,3.810341958830696929e-01,6.746970488655363862e-01,-6.450792697326698244e-01,1.624965524130216332e+00,-9.465538856672484069e-02,7.653565619000921583e-01,-5.870351306515755319e-01,-2.291957843077684909e-01,-9.911175098644686710e-02,-2.429264377586100032e-01,1.451213678982018473e-01,1.624609013134731272e+00,6.655766621297618535e-01,-8.157261539072615530e-01,7.024484131052479707e-01,1.158990485470968723e+00,2.882759572863309305e-01,1.138495596294975654e+00,1.133737837273062432e+00,-8.318484698682631073e-01,3.546002661224944008e-01,2.094337436840638667e-01,1.253071193366888325e+00,1.586225512403656168e-01
1.303804439918153868e+00,1.836378563995196167e+00,-1.001754352636739093e-01,-3.615611114219559052e-01,-3.646584297120913365e-01,3.531500151771314044e-01,-4.898788563969543319e-01,7.188202353890991159e-01,2.826935082591981008e+00,1.483184312703432484e-01,-3.323875184311789188e-01,2.824422642272377271e-01,-5.550590134858381930e-01,1.283442356606374624e-01,-3.387260437704703309e-02,1.766661711682802949e+00,-5.154578872080739504e-02,-1.382813408228837915e-01,-9.633627839320046959e-02,2.880126627701508069e-01,-1.029655996798200190e+00,4.804855881443654830e-01,-5.602536319479988203e-01,3.286552882837526224e-02,1.259539063246453150e+00,-2.750766685553938662e-01,-2.440797744170075390e-01,-5.569933710430217122e-01,-4.885103879178605002e-01,-5.463245362549113970e-01,5.728983112827392699e-01,2.397376246365160668e+00,-1.962349244346782151e-01,-3.878316051893012095e-01,-8.631490080082089289e-01,-5.757670849844996885e-01,2.160867047224896975e+00,6.944323646025939434e-01,6.626092523118303212e-01,8.357472900776286018e-01,1.254673553610894388e+00,3.828322086858508833e-01,4.300929809530480430e-01,6.385138001613943626e-01,5.412303776856801640e-01,7.753540263319653736e-01,3.307657063311396861e+00,6.206226783125263768e-01,3.798014495985712613e-01,9.833855261673948300e-01,4.524002282996097968e+00,1.548537520658597622e+00,1.297074236202481412e+00,-1.976443102505386629e-01,-5.985314693423304799e-02,9.039629981131526160e-01,-3.468647928007139170e-01,-6.825377677315016545e-01,-1.020939564864711713e+00,1.077135900369772914e+00,2.322060209084732818e-01,3.527578257808094975e-01,-2.105648247819606189e-01,2.492917095199688182e-01,8.408163771129936181e-01,1.405309547892341360e-01,1.022979653346535178e-01,1.142248927005518944e+00,-2.800216263430038155e-01,-7.896349086160785458e-01,3.121989094374852058e+00,-5.548948812098821737e-01,-3.871392248747870801e-01,9.503803373386324194e-02,4.063660181432440233e-01,7.468018629017634247e-01,4.778484847912199407e-01,1.717619316795334083e-01,-1.054317828157493198e+00,-2.491255968901525120e-01,7.465542744671961328e-01,1.679319895624246661e-01,-3.800548879306904215e-01,1.067200746101478082e+00,4.815756635913920336e-01,-6.832845340299438242e-01,-4.060990243047940540e-02,1.656872670944964598e+00,9.824790672783774159e-01,-1.439933399514424783e+00,2.382291953169016985e+00,-7.785386695956122427e-01,2.094492023593358176e+00,3.983033018561094041e-01,-1.013932716136386025e+00,-2.144611656557379176e-01
8.737880831590150166e-01,9.921592845646507453e-01,3.200496477046398947e-01,-6.224115134389790471e-01,-2.308684986142345852e-01,3.663192792105017803e-01,2.061393022914626560e-01,5.227400833772077871e-02,2.051213814631831056e+00,1.622670624732512612e-01,-6.098947770809446389e-01,-4.002774828665062179e-02,-6.347171297525557865e-01,-3.367384963414153942e-01,-5.107148161994762292e-02,8.814177994524768911e-01,-9.161644006127389606e-01,1.996928098635823989e-01,-1.279283219183638132e-01,3.210709129630454073e-01,-1.126721282710779315e+00,3.199704921688613646e-01,-4.795820961655116177e-01,3.603768691906153454e-02,1.638141663934213677e+00,2.761119203653031873e-01,4.570871153737476877e-02,-7.555231379212390408e-01,-1.662866524412238256e+00,-1.121573279509968657e+00,4.035617935225962460e-01,2.954856259688749542e+00,-3.394054141694400895e-01,7.942024385588383750e-02,-7.455272240405478312e-01,-2.281503456550272868e-01,2.054392357652884193e+00,6.785380598507240180e-01,1.433339727062935332e+00,9.776011406567134410e-01,8.835856305992553228e-01,8.022402154843710775e-01,2.668427737661949739e-01,1.122292429858205015e-02,9.975247364945737383e-01,8.190066701428109219e-01,2.772941566488740239e+00,3.339335833474920689e-01,2.639991684644281134e-01,2.943949321115491014e-01,3.849869294738750281e+00,2.125650337940589552e+00,5.493119234845160737e-01,-1.315922216583104154e-02,-2.392156348327843796e-01,1.307715027917628836e+00,-1.725299410322478355e-01,-5.563526045231482753e-01,-6.283501215232378811e-01,1.475364356167983448e+00,-5.199441086404973933e-02,4.526588607901782524e-02,2.325118749293591733e-02,4.559526947727839397e-01,1.597554102446117064e+00,9.630632276746008413e-01,-1.273350433327894438e-01,1.477934320869794593e+00,4.799749675997930232e-03,-2.720994405526024895e-01,2.064513060307484160e+00,-4.777925487874430388e-01,-2.827299200449946703e-02,-3.569269236058055794e-01,2.758571136577471772e-01,3.334519318240231067e-01,-1.283105636965866103e-01,-2.364320061543102591e-01,-1.648090808017200981e+00,-2.432751619095517848e-01,4.104230039724414691e-01,-1.100495348546320362e-01,-5.958582536232508442e-01,1.975603347976315982e+00,4.114507597074145151e-01,-1.145813711381791444e+00,2.048949316540923382e-01,1.291854962893599801e+00,1.108788658983264508e+00,-1.124608832417688387e+00,1.815843332831545531e+00,-5.410521982352828330e-01,1.491217879027951332e+00,5.955572264643564928e-01,-1.243328220072132728e+00,-4.156557889882855350e-01
8.993364466628582798e-01,-2.686894079681377834e-01,8.307597278513022265e-02,3.740940737868414523e-01,-4.682306445257416461e-01,9.071662363967341047e-01,3.677517332571489383e-03,2.590981131163476170e-01,2.169288973092865280e+00,9.615372476068101415e-01,7.273723970090533175e-01,-8.210831601408183356e-02,-5.753351973305148581e-01,-2.335539143260333406e-01,1.430390213842059888e-01,2.014648518638400443e+00,-8.319043636075154069e-01,6.003445117231515082e-02,5.356131967990732656e-01,6.908677313580232626e-01,-1.382008113497297686e+00,6.336781456696337633e-01,-3.465127005017265560e-02,2.637339646486960842e-01,8.764803454720819786e-01,-1.585262042294691254e+00,1.754023941437839740e-01,-7.469833165888166704e-01,5.103968786988990480e-01,2.238734775355013529e-01,8.633285681259798006e-01,2.989386576463636036e+00,1.097495978001373773e-01,-6.043087842380476804e-01,-3.142578656094267009e-01,-8.083022261372565520e-01,9.988008857478493097e-01,1.462565970523082459e+00,9.548500800945212141e-01,2.361862712411503473e+00,1.551734194121826782e+00,4.485894918598535286e-01,4.184572755695210033e-01,3.466278808857606308e-01,4.316162701486259134e-01,4.846830788377026744e-01,3.109158391485241868e+00,-2.281543173575396599e-01,4.968696894640696748e-01,6.861152798688918697e-01,4.629462342373945383e+00,1.358389469354506218e+00,1.056295109240623864e+00,-7.201409376323100187e-01,-1.237895413834298797e+00,1.638300962599740229e+00,6.745989226047628406e-01,-6.606327095593917953e-01,2.027712138480264326e-01,2.060034513252350763e+00,1.988863604424149889e+00,-8.536969610735105629e-01,-1.262791646526838729e+00,8.440771744700082957e-01,6.288169118795616797e-02,-6.376298212329869486e-01,-1.419623219015977433e-01,2.138313342243284509e+00,-5.982426175734506524e-01,-1.197632754902008934e+00,3.621431690432660222e+00,-2.761301002063887289e-01,6.617415445061750612e-01,1.154261124418551665e+00,1.234675654989878107e-01,1.805951829278798382e+00,6.429652785563950701e-01,6.705509876891095900e-01,-8.563064817059395928e-02,-6.509230581431268980e-01,-4.947888149458092855e-01,5.082270579588994419e-01,-1.765756529389321539e-01,1.055139134836403869e+00,2.615604484516946826e-01,-7.392869577651679514e-01,-3.060490537130056699e-01,3.471449531121902687e+00,8.030492116286354065e-01,-7.134270260238217976e-01,2.796203549336368166e+00,1.288365235191983871e-01,1.347002352409559567e+00,6.302659911507833002e-01,4.474025235384689880e-01,-2.315689408656404213e-01
9.103274075640666041e-01,1.243146967994265051e+00,4.249432415090368953e-01,-4.920877150987460480e-01,1.420106720598659500e-01,-3.078878317756822414e-02,-1.697225200045064386e-01,-9.910493772186679262e-02,1.386996285765522696e+00,2.024519700339229011e-01,-1.396354934234422251e-01,4.867749245426714055e-02,-5.680754660873454931e-01,6.754774125415823061e-02,1.018774177289863969e-01,1.244703713694712999e+00,-6.494681638467619811e-01,2.143511427735579900e-01,9.421264590129241334e-02,3.794596673331313008e-01,-1.122573605214608472e+00,-9.138007685632021371e-02,-5.364146843751309568e-01,2.534501063495701589e-01,1.307648517161920099e+00,-5.864409230291651315e-02,3.310277645387312839e-01,-6.313493333683415365e-01,-4.998766874947938588e-01,-5.334463624684249172e-01,3.710112361933208258e-01,2.514639510766148334e+00,-3.317023311488710990e-01,-3.925577973336683013e-01,-6.421196063632914619e-01,-5.116246692791750483e-01,1.364223895948390775e+00,1.138397999279900930e+00,1.074238013374484435e+00,1.110618525173804549e+00,6.906442469772643422e-01,4.490436954044120244e-01,1.678162497216518778e-01,1.539386525097992675e-01,8.131829929250711242e-01,9.121361793951084929e-01,2.890582877790853988e+00,-4.203894386747135392e-02,7.059826443097484694e-02,1.381922861767107324e+00,3.462602371851236427e+00,1.079539048422339942e+00,2.725195845395508298e-01,-3.168105734850374389e-01,-3.971071850584516616e-01,1.242764447781371517e+00,-1.666623622467955368e-02,-2.132993035131152681e-01,-4.133213995921664052e-01,4.450749707328622851e-01,9.107831362978118239e-01,1.353119798717287714e-01,-1.317155595665861767e-01,9.143443322270750073e-01,1.052629583928481605e+00,3.184891800728225086e-01,-2.371435230365872560e-01,1.172071867611639284e+00,-5.940231471488378184e-02,-2.243241858063089733e-01,2.328281795413662980e+00,-7.742770412079228448e-01,5.575486773258959972e-02,4.386004788329482817e-01,-1.492650852707749776e-01,1.289912931215033032e+00,3.195879028655326803e-01,2.932699800473224094e-01,-7.779526649626877788e-01,-2.092552426645774011e-01,2.146313523501863774e-02,-2.274436190678135739e-01,-9.213132348152405782e-02,1.406975661819581891e+00,3.622775004460822013e-01,-6.323257403777146068e-01,3.962013345635982398e-01,1.561211212411682148e+00,6.165979715811131801e-01,4.200647323043732451e-02,1.687469132767134283e+00,-9.053822825745627689e-01,1.265223235024857118e+00,3.946474733913060695e-01,5.441625506252448230e-03,8.800673386156981914e-02
7.704239981479050758e-01,1.550562261941890174e-02,-3.548893873072588856e-01,9.013053812904270323e-02,-2.365295722384898602e-01,9.345159934945710400e-01,1.033193986507254136e+00,-5.571830925791216443e-02,4.439205591938061857e-01,4.057987831395971079e-01,8.928077480533480603e-01,-2.393843983731223091e-01,-3.975638781800792110e-01,1.090556069063914751e-01,-3.159741954961289290e-01,1.672873354517483202e+00,-4.939945819312585584e-01,-7.034110213957663893e-01,3.590134421417194299e-01,1.622343315838407907e-01,-7.182816757569393529e-01,3.702160243728527256e-01,-4.399653484623806121e-01,3.614881410466980194e-01,1.338028338614432267e+00,-6.385933157591224818e-01,3.880644374505673455e-02,-7.117083641626803514e-01,-4.838293203054865321e-01,-6.445237679967319444e-01,7.354307265040407326e-01,2.464370322883569386e+00,2.526994819423756256e-01,1.093984728569737941e-01,-6.047939348946400617e-01,-8.920090105170708217e-01,1.325578228653804036e+00,9.051640244078457131e-01,1.705152580056017886e+00,1.097142393240079672e+00,1.039684935312596092e+00,3.872066449539302568e-01,-1.563019455942705194e-01,3.114895141630943387e-01,3.063896279077271134e-01,7.783576076016974765e-01,2.140373818891474489e+00,3.127839267125922390e-02,5.310259316074565916e-01,8.472410931565377279e-02,4.776579263231347738e+00,1.992887914213088196e+00,6.251283405983111274e-01,-6.257358206220353658e-01,-5.751952636818411513e-01,1.413529593560964637e+00,2.326686452802604888e-01,-3.270288857640625269e-01,-3.267362181206757143e-01,1.880468062743017477e+00,8.341142664419737285e-01,-1.129770841149194016e+00,-7.194393028656801414e-01,4.560380700586974534e-02,2.989388653086921810e-01,-3.655846539940721396e-01,-7.077075319275558662e-01,1.110758959955481018e+00,-7.917809939031755784e-01,3.794966016929165464e-01,2.780241256099648339e+00,2.199542739196314045e-02,2.878247851484297404e-01,1.000542923907699500e+00,1.383723607753136187e-01,1.266216803662436829e+00,-3.988961108683116707e-01,3.206488075456687126e-01,-3.828781159296852366e-01,-1.016046336687872476e+00,3.418860258828806953e-01,1.750073888682975309e-01,-3.167369739557916453e-01,1.505423218557489395e+00,4.530032346363084272e-01,-1.101466837760679329e+00,-2.202205556790642893e-02,1.704882753516391514e+00,1.009206751213303832e+00,-7.627338028199612818e-01,1.743181053098284972e+00,-2.710867426067070651e-02,8.774103755821364148e-01,5.230982574048712586e-01,1.079570181821429414e-01,-6.403828046043100741e-01
1.015936643269602202e+00,1.366668510803470848e+00,1.425396759853163053e-01,-1.399768762755497775e-01,2.744855751786212661e-01,9.237103004453872668e-02,9.963458950769127354e-02,-6.355157599178784533e-02,8.041701609116225224e-01,5.115513187153575281e-02,1.557370826413744247e-01,-5.689756592891334619e-02,-4.967736778639691986e-01,4.832767905091769900e-01,1.376449831864008377e-01,1.439255063531752254e+00,-3.529168867546851329e-01,-3.650841412763960458e-01,2.940341581641083835e-01,3.077350777755449851e-01,-9.795570230930880085e-01,-3.724204968092711399e-01,-7.063516628444557188e-01,4.344203972358744448e-01,1.061020977891788286e+00,-2.166934920824023780e-01,2.374642322394802663e-01,-5.541450591130004932e-01,1.115919646254903697e-01,-2.065080481238155130e-01,5.779343091121552645e-01,2.073795115924734311e+00,-1.049563190024632719e-02,-4.880339106522864623e-01,-7.181761972850662090e-01,-8.268804247382892658e-01,1.193350475169663305e+00,1.108565408130466778e+00,7.508923156379256891e-01,6.250075726253527808e-01,7.684320962414341594e-01,2.391916037959175012e-01,-7.320494135680263859e-02,5.004621426849558130e-01,6.170932458571791734e-01,1.043236007019205491e+00,2.666219916076151719e+00,6.123419335370874905e-02,2.533680111503410215e-01,1.520705948286932951e+00,3.903250343176722037e+00,8.014169264120614145e-01,3.397115967692314609e-01,-5.114620982092077384e-01,-1.738414561025563021e-01,9.061438227579862170e-01,-3.782000468547486172e-01,-1.724680731128538369e-01,-3.834941069014667359e-01,-1.590692611638757636e-01,1.185304972110000188e+00,-1.725298647194914992e-01,-3.648631521227272412e-01,4.280453910489910863e-01,4.401714963794212121e-01,-2.415687982237717524e-01,-3.650076968916537989e-01,9.139298953963251870e-01,-6.378169273683179652e-01,1.219276671285497160e-01,2.666528827122139678e+00,-7.173783028468276868e-01,-1.016807539314507486e-01,1.133179289282579605e+00,-1.118251800911556071e-01,1.725565891274221997e+00,3.507945028156243539e-01,2.334776736107201378e-01,-1.148899955684266061e-01,-5.846535067610197922e-01,4.957859299607203507e-02,-4.007992007715238114e-01,6.466960569155721927e-02,1.040447818405985991e+00,1.332782362239374185e-01,-3.383083055725055743e-01,3.651734505408674725e-01,1.477425695495215852e+00,6.140945210340109650e-01,1.485681215247618980e-01,1.489765859645072910e+00,-1.052801264656581859e+00,1.327220050503143955e+00,3.906370869582044270e-01,1.418486920113293803e-01,1.079207790773878406e-01
7.517855680880863867e-01,-4.676605329850850312e-01,-3.940881205407964494e-01,3.265898305415981806e-01,-4.090627880935533978e-01,1.166491726170911791e+00,9.956216681589211692e-01,3.138339646783275261e-02,7.252046044892906940e-01,6.823686633466370388e-01,1.166462722964725751e+00,-2.565393086719636728e-01,-4.076749824383281151e-01,-1.559495430094239021e-02,-2.824185067088209600e-01,1.920386367801679928e+00,-5.847316409157476969e-01,-6.445287812398596827e-01,4.959036056270574866e-01,2.881749042397463434e-01,-8.351022465148197904e-01,5.967384555667156754e-01,-2.542935597358038091e-01,3.602331958326302486e-01,1.198556994101839468e+00,-1.142935267837097868e+00,4.235829499623654237e-02,-7.492173719264724197e-01,-1.247150653729875991e-01,-3.805567016081761178e-01,8.560054682571296425e-01,2.648265513232170409e+00,3.398552024350244838e-01,-2.947930760383854487e-03,-4.715741863332345574e-01,-9.634308088246397173e-01,1.151284664430495264e+00,1.073395585320357837e+00,1.671682271917094509e+00,1.604024786640110278e+00,1.282114781388354885e+00,3.861140275367985208e-01,-4.384712107309279849e-02,3.283159382466020459e-01,2.041109712519904584e-01,6.298261749291469425e-01,2.266863487771257013e+00,-9.354075665862131295e-02,6.140888492855245406e-01,-3.148351131974047590e-02,5.022324076409947935e+00,2.001021532953758619e+00,8.284588166087437644e-01,-7.566347575291115790e-01,-9.056679596140252420e-01,1.590620585172458856e+00,5.318910977949684593e-01,-4.403066000498719879e-01,-9.746625532592811947e-02,2.371910798547832044e+00,1.258138040439013006e+00,-1.383906460439392028e+00,-1.064993863895250747e+00,1.652309404523482628e-01,2.418722439245724054e-02,-6.483519212830550771e-01,-6.631427281893313985e-01,1.443813894836629474e+00,-8.747515801430522098e-01,3.894596876303280109e-03,3.167308361195680710e+00,1.322977992334729014e-01,5.234356761284364445e-01,1.207667599038422024e+00,1.690995124402198124e-01,1.475030136056661778e+00,-2.401209856231636963e-01,5.079354154114102959e-01,-1.693242269993808780e-01,-1.088178106757716090e+00,1.107787481921794770e-01,4.213091467717150485e-01,-3.107843476754442169e-01,1.390013536971023589e+00,4.448947716484374371e-01,-1.120908646375151196e+00,-2.189071608318982620e-01,2.377256292007460914e+00,1.011173820783419330e+00,-8.806267872476403191e-01,2.119253565877182499e+00,2.856245798950390880e-01,8.694858861757137625e-01,5.803772067082199060e-01,3.688446273013328836e-01,-6.825030712296138447e-01
1.232278107636914699e+00,1.535495004481772785e+00,7.536651658021656375e-02,-2.805780417073062138e-01,-3.181742062755195666e-01,2.933165359750623535e-01,-6.442427013855698270e-01,6.077339012937061913e-01,2.812926971894783357e+00,3.478135408208489210e-01,-1.656579578525792518e-01,2.749064765052267045e-01,-5.775540810777783918e-01,5.141756265529599801e-02,7.380658277370361064e-02,1.839710032028498699e+00,-2.228870860952064381e-01,9.599151306861028465e-02,2.459660547674679537e-02,4.273916137254804570e-01,-1.178009510093886991e+00,4.561742456987404881e-01,-4.311076054227764853e-01,7.758436464427066748e-02,1.138926131862767921e+00,-5.684160900930159688e-01,-6.675945061778970624e-02,-5.776704312866407509e-01,-1.261122288242128020e-01,-2.903457182749997756e-01,5.688078357715888878e-01,2.524278971848788355e+00,-2.359834422811505905e-01,-5.733311780465029095e-01,-7.149963151823237606e-01,-5.937198799033471808e-01,1.820316638075502258e+00,9.773898201473466552e-01,6.228968278712982976e-01,1.291930710987369668e+00,1.260731988523470015e+00,3.678070917409775875e-01,4.971815749115248706e-01,5.448466444331092617e-01,5.570039963594409782e-01,7.121342872159155402e-01,3.426420904810949075e+00,3.515353758468308110e-01,3.011047536794191903e-01,1.233605540866903549e+00,4.299196935284537169e+00,1.261343326973109136e+00,1.182200053411768037e+00,-3.077247824356731942e-01,-3.703132770494049764e-01,1.085103839984362217e+00,-5.900443467798743846e-02,-6.257933420309621519e-01,-7.322631948690412340e-01,1.072178134554742535e+00,7.687264550299505173e-01,2.909490631291680174e-01,-3.878948836658866473e-01,6.287703839687496243e-01,7.274076712908411624e-01,-7.488675657175813960e-03,1.140024298595361252e-01,1.366474367962327463e+00,-1.988682904580773014e-01,-1.029854864925797475e+00,3.221463094542390770e+00,-6.375915355351262637e-01,-1.437307961881744700e-01,3.066837982912005156e-01,2.428822918182304003e-01,1.090576026860990089e+00,6.895838649193721803e-01,3.946386184459939606e-01,-8.219830742869894680e-01,-1.849287798901344260e-01,3.687926529608249182e-01,2.263156679912022851e-01,-2.466775641116498163e-01,9.860972866025560224e-01,4.526651807749181300e-01,-5.928244845987614697e-01,-3.327717357399523346e-02,2.141229881961567827e+00,8.159885515592847360e-01,-1.033775502082591169e+00,2.513882042059191857e+00,-7.057395889849763515e-01,1.946404514824771503e+00,3.999744280964590559e-01,-5.052200866058731421e-01,-5.355508310409040629e-02
1.062879112373173562e+00,9.269897031897119666e-01,-1.330865929983337526e-01,-4.297226756425520655e-02,-2.384286455595673870e-01,5.544763799025924644e-01,5.167596000503899001e-02,3.315668318951142668e-01,1.714322866653220423e+00,3.645024394794829647e-01,3.598022451593247961e-01,4.964261167002641251e-02,-4.901827817406479437e-01,1.690189568285234145e-01,-5.693917176508722644e-02,1.838279753435066777e+00,-2.774024295197756729e-01,-3.190419658455330154e-01,2.234257767829115893e-01,3.243149339264260744e-01,-9.803223864349238648e-01,3.449751010794184225e-01,-4.573360335485140982e-01,2.429682252779433727e-01,1.139704599666113038e+00,-6.783844198456979724e-01,-1.294679408018625799e-02,-6.125548822501484247e-01,-5.207967598494334105e-02,-3.104313496740234157e-01,6.776508884621621487e-01,2.404733588149891244e+00,2.342641413912743831e-02,-3.599345593863305659e-01,-6.655523723124452395e-01,-7.932924673190038245e-01,1.519790458586747217e+00,9.929699691645406112e-01,9.699969108306725207e-01,1.170644590290579989e+00,1.182469397120577081e+00,3.153577749761810045e-01,1.888196320437661724e-01,5.195356670637751861e-01,4.088276563324296231e-01,7.620838893733959951e-01,2.882672232776730237e+00,1.991873559388209758e-01,4.153015585465231752e-01,8.736585379418027042e-01,4.543695051883745784e+00,1.422085729770486306e+00,9.503800436478153646e-01,-5.011983220378910531e-01,-4.481001444049694804e-01,1.164601679726165129e+00,2.219211026761275241e-02,-4.777429181631632771e-01,-5.221281020962311725e-01,1.230123640829221987e+00,9.527805812630607551e-01,-3.472129548546278865e-01,-5.971419946448470739e-01,3.544892297291153405e-01,3.911952543526512338e-01,-3.125749022198143212e-01,-2.451479165369316870e-01,1.223446073177978821e+00,-5.514632189441959209e-01,-4.189866133288666639e-01,3.139412244644024241e+00,-3.818389422050070259e-01,2.766934537911826253e-02,7.868958219018749034e-01,1.735904645689838599e-01,1.330068911633527140e+00,3.022366761543407443e-01,4.000988293203101565e-01,-4.450477452487342500e-01,-5.884237050803335922e-01,3.056740181074683593e-01,1.727769086291809086e-01,-2.066158489667107023e-01,1.084570031317548811e+00,4.000789917705869780e-01,-7.044555915761170350e-01,-2.775056117539981271e-02,2.016506946614168960e+00,8.543932864472763011e-01,-8.112430530659351380e-01,2.175048164915166726e+00,-4.697291140520329922e-01,1.505296712560741046e+00,4.405381607243815112e-01,-1.221092092405814955e-01,-2.465845470584246135e-01
1.066714616491611034e+00,1.499990312840621787e+00,1.077232483325161055e-01,-4.824777119578636531e-01,-6.176416147925010980e-02,6.611567925234479448e-02,-4.028850938871342824e-01,2.605746526682134467e-01,1.764973282751724826e+00,2.566563769303218390e-01,1.257448334073146268e-01,2.524920443932005543e-01,-4.932146597301107493e-01,1.705895794642605101e-01,-7.515930882288235360e-02,1.753202044859470066e+00,-1.807799775695198008e-01,7.338725334698834035e-02,1.584704004699238195e-02,2.739255200145148117e-01,-9.563783232551565927e-01,2.484483826264527462e-01,-5.181953693658527538e-01,1.769660778204931173e-01,1.298626055764803722e+00,-3.014429553104729931e-01,1.382297729247352891e-01,-5.593818929223407510e-01,-2.505703961492509180e-01,-5.222678191637089018e-01,3.911459104509930063e-01,2.332893212219433021e+00,-3.125465370500283280e-01,-4.298444093601538341e-01,-6.986158415391565679e-01,-6.336434430204266333e-01,1.556198984884300085e+00,1.055141829326452285e+00,1.045320318796918446e+00,1.158735049703427000e+00,8.568835766457288949e-01,2.741385694989696420e-01,2.713736877175888518e-01,3.570871413349086532e-01,5.042416409733780913e-01,8.149241457869529359e-01,3.078966800727418907e+00,1.065912033086087868e-01,1.108645987927719540e-01,1.417607858259448017e+00,3.883719649185928269e+00,1.140520582940318661e+00,7.040433153131371302e-01,-3.732084539314138305e-01,-3.785928242291592416e-01,1.215610143480771566e+00,1.223230485738520945e-01,-2.701998846014768141e-01,-7.501537955158855686e-01,8.406455766453541090e-01,7.532646080120382059e-01,2.341970620573133322e-01,-1.682893946621188130e-01,8.296240820073236266e-01,8.272415113470481529e-01,2.638956541504383635e-02,-2.042315402061734009e-01,9.253307884502750547e-01,-3.187027627357912757e-02,-4.067173932717124130e-01,2.758935771614731358e+00,-6.561919815289832814e-01,-7.269336007002939748e-02,3.916689005219339270e-01,-5.298998708566348553e-02,1.217902723810496912e+00,3.881988199755596614e-01,5.907173752814396384e-01,-7.653789063405851412e-01,-1.838635603313749367e-01,4.113895968898065858e-01,1.076708701374444743e-01,-1.019808487514917983e-01,1.131155453984758807e+00,6.246199098555157425e-01,-6.714718311989669175e-01,2.241255132593428234e-01,1.612167810125697320e+00,6.238939772802550854e-01,-3.506683525456332218e-01,2.028037300628550810e+00,-8.092494738975624102e-01,1.434236065331350840e+00,2.634749723912716002e-01,1.129377347560413247e-01,7.516620518990380084e-03
1.019959698727455066e+00,1.208051795232603531e+00,8.269726479898285854e-02,-4.653526093704584143e-01,-1.650626555880255197e-01,1.091505168421674499e-01,-5.464348797250038192e-01,2.955387102450277581e-01,1.836275352067524347e+00,4.958684991916204599e-01,4.770727775076603061e-01,3.401075035097100852e-01,-4.612595456604251520e-01,7.444393200302122648e-02,-1.527108078011814030e-01,2.053562349538210707e+00,-1.390018979286255507e-01,2.376343253156025792e-01,5.296932589124835750e-02,3.074842510264233497e-01,-9.544761425120051879e-01,4.924224512613359361e-01,-3.613271133637823151e-01,1.553484522214448882e-01,1.284582143616428418e+00,-6.497831835950880208e-01,2.079101878507084167e-01,-5.663851015698313507e-01,-8.140696383234224953e-04,-4.359912510905468164e-01,3.600640574707381081e-01,2.425683562667404480e+00,-3.635575548194849849e-01,-4.996899364705253421e-01,-5.793584919975157677e-01,-6.770277516410634355e-01,1.374409592242771483e+00,1.238406945807895898e+00,1.212106986102092776e+00,1.660885869878119259e+00,9.061963094623858295e-01,2.075037799271676198e-01,3.714077090764648648e-01,2.839430361659454061e-01,3.483988048772934665e-01,6.806007742917272729e-01,3.194625644885793037e+00,-9.319381780836158424e-02,4.373558882166980744e-02,1.486973227097306172e+00,3.884456246745845220e+00,1.091159488081209439e+00,7.794993813037736086e-01,-4.858784430853222980e-01,-7.023142324284468163e-01,1.474629782226378971e+00,5.746401949665471687e-01,-2.242049249178749704e-01,-6.825991299026583636e-01,1.316407449391432838e+00,1.033583038804158916e+00,1.624766665049001690e-01,-3.065185018853188170e-01,1.154962551976031815e+00,7.081986111268354644e-01,-1.696104717352457936e-01,-2.436436715869635394e-01,9.815371733682340949e-01,1.388320121064920143e-01,-6.269796078854007471e-01,2.953820661370500034e+00,-5.932408842144563099e-01,1.390951299983611555e-01,4.389834442024023176e-01,-1.588937647946944143e-01,1.368077614977369461e+00,4.648729207030370403e-01,9.692325798677667859e-01,-6.858973479803314177e-01,-1.122590037695676557e-01,3.314794780901827997e-01,3.957820930138957194e-01,-4.187247594692306008e-02,1.052005571470385537e+00,8.258204004240228269e-01,-7.557703354343806579e-01,1.421472275257535667e-01,1.996676755023106375e+00,5.077777179879188196e-01,-2.330963545980904161e-01,2.293736951721281780e+00,-5.804382300444057563e-01,1.264673812374652373e+00,1.948573844712687131e-01,6.496385229166090625e-01,2.160913863360658382e-02
1.133119151299085470e+00,1.886443018798883653e+00,4.114022591035001453e-01,-7.066338696154331744e-01,4.605488587416294022e-02,-4.461352380206101143e-01,-1.359548167398243912e+00,3.413654313467121559e-01,2.254806010530175264e+00,4.841925349735867190e-01,2.529732045867301160e-01,5.864562212062456314e-01,-5.008141991284552619e-01,1.708497648931640023e-01,3.668185374601340420e-02,2.159027908122276074e+00,-5.665146802056042485e-03,7.055468400452195032e-01,-2.551867231994538882e-02,4.169981618544165713e-01,-1.115482326207184238e+00,2.998750828753452002e-01,-3.787025250507456420e-01,1.366589341003246472e-01,1.163981507298611495e+00,-6.175083056568657636e-01,3.992634393173635221e-01,-4.734700426270744833e-01,4.618657365903107159e-01,-1.795135256630422393e-01,1.699395377918231087e-01,2.303166578689319177e+00,-6.593530223485226660e-01,-9.181690251503809019e-01,-5.523821916384759056e-01,-6.120800171115324817e-01,1.202667246888986075e+00,1.512021090417299263e+00,8.193704278036617605e-01,1.851613602389372115e+00,7.413975779684078837e-01,7.449526905889436446e-02,5.624331482021377449e-01,2.855209952686854624e-01,4.271202183559473231e-01,7.117965419134624216e-01,3.690193738144383673e+00,-2.460633160254728780e-01,-2.447283265337220626e-01,2.473267248732649914e+00,3.236721586224147185e+00,3.376825081808478846e-01,6.668968799526482361e-01,-4.624913498817387336e-01,-7.379247153803039083e-01,1.427528876356673582e+00,6.451231152650107603e-01,-7.870325873862225874e-02,-7.343260292010649337e-01,5.334395593539091873e-01,1.382644885743735230e+00,8.285515300822070550e-01,-1.084440165297878844e-01,1.778869983304155689e+00,8.336252902309150281e-01,-1.438985331893259945e-01,-3.534809127269444851e-02,8.823784676823975825e-01,5.333313538408442911e-01,-1.032937145564611470e+00,2.978909391576181953e+00,-1.028781688038232778e+00,6.704189601280259592e-02,3.876217775539573251e-01,-4.213908887332304953e-01,1.674678360455346571e+00,9.978460891574401082e-01,1.281383063300656211e+00,-6.077213093947955169e-01,3.253140054887684318e-01,1.399131250374350266e-01,3.263241665253909241e-01,2.262400068334207148e-01,7.414417396764623192e-01,8.837201141713169061e-01,-4.030175672021957256e-01,3.341893253814381959e-01,2.127538878671636713e+00,1.450771699386034230e-01,4.191275270252004526e-01,2.397712201498750861e+00,-1.037659332009684299e+00,1.404411129697255234e+00,2.308092853085946805e-02,1.114714205124044177e+00,5.123425179442137045e-01
1.245564182705838796e+00,2.348420094065284403e+00,-3.908916003974112208e-01,-7.987158535888427835e-01,-1.916543008110290214e-01,1.537297237997224397e-01,-8.831928114830539522e-02,5.682751212303411847e-01,1.734064572788224456e+00,-2.356098200313433699e-01,-1.707150436338417676e-01,3.597273308264457570e-01,-3.972212923422724917e-01,3.802415589014625508e-01,-4.521751586632098974e-01,1.698500690363320631e+00,3.938808182546220116e-01,-4.815162319808580782e-01,-3.520084637293238172e-01,-1.469798602033666468e-01,-4.837486509077169039e-01,4.052229628283026130e-01,-8.408785861719587640e-01,3.829231674891511727e-02,1.677753299829909173e+00,4.563898651267931372e-01,-3.033185590772088380e-01,-4.843373081936937496e-01,-1.189958199434627550e+00,-1.271877447438815256e+00,3.235696220329621342e-01,1.950958900681120767e+00,-2.808366477174953357e-01,6.900776352324811125e-02,-1.078661303884902001e+00,-5.958597081043685018e-01,2.433283720652398952e+00,3.416803118237973225e-01,1.288263969781470841e+00,5.393980569126610725e-02,7.703890603349223820e-01,2.497101628488844205e-01,1.138498823584287029e-01,5.649948342190276307e-01,3.704597499758848222e-01,9.526272516557854342e-01,2.792975197591686332e+00,7.542202464006366736e-01,2.366921000365550531e-01,8.574873009200754126e-01,4.404071690443817744e+00,1.873287176387514519e+00,1.000459386463823597e+00,-1.037731107256212870e-01,3.815593871159163042e-01,8.286763777075626392e-01,-4.556089733995365432e-01,-3.355563668186598014e-01,-1.612988824303535740e+00,9.884495018404597655e-01,-6.971989322103488984e-01,4.741439216698805081e-01,3.700220411378397634e-01,-1.964901943310493060e-02,1.154118608218352104e+00,3.886050717317249270e-01,-2.874273971678953932e-01,1.779687804762800640e-01,-8.750824126258799351e-02,2.530549181684136339e-01,2.481090516993743833e+00,-4.312765356306852427e-01,-6.962703772790671541e-01,-2.380196388222827475e-01,2.995013124985049235e-01,3.033009538918512993e-01,-1.980678808471891816e-01,2.028342723748467469e-01,-1.426155132407748605e+00,-2.711685673002592334e-01,1.510451541494135075e+00,6.645804012008055262e-02,-4.172779743386014761e-01,1.322729924758281328e+00,8.730378305119923521e-01,-9.676686185642838778e-01,2.275892850121953304e-01,2.669081019111726460e-01,9.843701438299834461e-01,-1.323278081435259601e+00,1.708283937833590560e+00,-9.827835060573808512e-01,1.721420444460283861e+00,1.697909588153726501e-01,-9.720469479627118492e-01,-3.999447858182280102e-01
8.039039057182061354e-01,5.534798573167953872e-01,4.615016150305052689e-03,-4.764269089509310939e-01,-2.454829656656986603e-01,3.662958840210747136e-01,3.252388490654178899e-02,6.334944622465893405e-02,1.273196874873410600e+00,5.730265678269048646e-01,7.038002963549809810e-01,1.781947294820575844e-01,-4.285244313282876583e-01,-1.195971660510262297e-01,-3.396475003695094141e-01,1.877901321728752126e+00,-3.824348662665708054e-01,1.516409545708803930e-01,6.981668028934931436e-02,2.247458858420591510e-01,-8.330875102365524754e-01,6.371103402178830422e-01,-2.897314184336764464e-01,1.599259226281148916e-01,1.500416723058589641e+00,-5.772291099328477060e-01,2.370299894095335147e-01,-6.630078730302769729e-01,-5.292478672554267183e-01,-7.774122404171219802e-01,3.503729576499547416e-01,2.632253621900526586e+00,-3.014724643778784463e-01,-1.388137995489537313e-01,-5.242305044120609825e-01,-6.316780111887858595e-01,1.356868894792062186e+00,1.154745321365852950e+00,1.794731428287599240e+00,1.758145659065624811e+00,8.274191504451648971e-01,3.420122615693916290e-01,2.346012921677878005e-01,4.828333712346116746e-02,3.471222067712357306e-01,6.385105058099872499e-01,2.783479210818685434e+00,-1.957935501955911095e-01,9.077127397190047631e-02,8.420465825886638278e-01,3.965521160118025357e+00,1.627149470743141757e+00,5.963870863917140053e-01,-4.898185564103167411e-01,-8.437510675392918547e-01,1.736865018128435523e+00,8.052796584675909752e-01,-1.794781055432221051e-01,-5.787006772350375972e-01,2.015165456491113005e+00,8.128511159333792202e-01,-2.689399391673671369e-01,-3.238998493659657196e-01,1.052133887414109736e+00,8.515740938178164576e-01,-6.771423657656483464e-03,-4.876441990500652857e-01,1.024769863398134806e+00,1.447453465543743212e-01,-2.417742032138006092e-01,2.633793920249409837e+00,-3.191205615533627693e-01,3.483007053843614753e-01,3.206942564887216296e-01,-1.478986313558641741e-01,1.128825334678857040e+00,-1.989301122009073941e-02,8.954814209956482030e-01,-8.976579798006731892e-01,-2.877387799027150694e-01,3.749683454580663433e-01,4.696810649036716745e-01,-2.017048102153782274e-01,1.462734145326080704e+00,9.265640671041200926e-01,-1.135552274519971094e+00,1.244888167864961759e-01,1.831438344572387411e+00,6.536478345597916961e-01,-3.522516369964497351e-01,2.108425648644996375e+00,-2.103430759860013266e-01,8.749956149601236799e-01,2.694413990515905355e-01,6.513563206131229855e-01,-2.830889180952558259e-01
7.696870667774239338e-01,7.297941959334913742e-01,2.577297442042488784e-01,-6.640581388987447653e-01,-1.365009167049485161e-01,1.556209229105849079e-01,-9.211829234707252789e-02,-5.722064866521477111e-02,1.386318299808679377e+00,4.898681061214760213e-01,3.380630768728234981e-01,1.729413025512054336e-01,-4.904674905681249975e-01,-2.128282316658724471e-01,-2.387370219707508068e-01,1.564447604073166964e+00,-5.853943156002877624e-01,3.980348784503353610e-01,-1.292080868793312604e-02,2.744679184017344009e-01,-9.461829586541680159e-01,4.837908782982985878e-01,-3.195251301070085592e-01,1.282656889349445550e-01,1.573818327926111316e+00,-2.806878934949332827e-01,3.301063995882986823e-01,-6.827853512696394622e-01,-8.232308036673336993e-01,-8.876764422252347853e-01,2.437505813236382490e-01,2.745976542901690021e+00,-4.544059370785487606e-01,-1.453795259791234584e-01,-5.358924296170821666e-01,-4.637867489413906585e-01,1.408079855130460301e+00,1.157334376606308446e+00,1.766544957929117032e+00,1.703142291647009143e+00,6.861036131807027871e-01,4.548576993282508751e-01,2.728625502272979397e-01,-8.965736446066409349e-02,5.762252800857066148e-01,6.931252732514361359e-01,2.846492597954723980e+00,-2.128424735026441805e-01,-1.634208935476559599e-02,9.669093963726311802e-01,3.563101799708708661e+00,1.567401032190079535e+00,3.899045884550806917e-01,-3.547941250289656234e-01,-7.758782817703414603e-01,1.728110359091599157e+00,6.989181222333682442e-01,-1.560757657920643082e-01,-5.514686936895749625e-01,1.721871870309067853e+00,6.963706795057317267e-01,-1.866874657577455299e-02,-1.199556080483071274e-01,1.218528381077212952e+00,1.198976319143685076e+00,3.523934512798641561e-01,-4.038955846032557528e-01,1.104557318314918657e+00,3.398825947021363869e-01,-2.666557193093925804e-01,2.308622038249221742e+00,-4.883644364017722950e-01,3.186700140500120515e-01,6.897697815577426284e-02,-2.002058273911664354e-01,9.972068062724381843e-01,1.457336009116333431e-02,7.359350270827826890e-01,-1.142758561816666463e+00,-1.108796771350095689e-01,2.717704894976757379e-01,2.896196857781728751e-01,-2.187777440239406790e-01,1.631674899359773612e+00,8.632565353861674229e-01,-1.114338743439182933e+00,2.666001520585752904e-01,1.667843049961291513e+00,6.246255858380294068e-01,-1.848204221103075529e-01,1.966471638797139487e+00,-3.932676655706487390e-01,9.020078203396899585e-01,2.936702547930383211e-01,4.457145958137286867e-01,-1.723045501191877160e-01
1.113883167460824053e+00,2.555100945342703600e+00,-4.154976104153215166e-01,-1.162896054441119098e+00,4.396394143920488717e-02,-1.660993689431380926e-01,2.947760827987727650e-02,2.966927537629072686e-01,7.472375210009137847e-01,-3.721804086609059592e-01,1.233755206708310181e-01,4.492694257944224168e-01,-2.824905820463725625e-01,5.205414414440566739e-01,-7.052349498702492614e-01,1.703925469010671545e+00,6.120355707406808232e-01,-4.669388793484035016e-01,-4.744908641235984770e-01,-3.856401898224747771e-01,-1.605063317574251247e-01,2.918046325177550138e-01,-9.567971725002476502e-01,8.466375974253440018e-02,1.938028489079168137e+00,8.382415763653825458e-01,-1.335189313219402318e-01,-4.346108795579048945e-01,-1.437343054202137926e+00,-1.661904977280916684e+00,5.401743931801056275e-02,1.683011361854684029e+00,-4.505979568325397810e-01,2.568689850227905414e-01,-1.109925239838290612e+00,-6.102761730617104474e-01,2.297916014497333403e+00,3.543009453242460527e-01,1.810307018697469239e+00,-1.368711381403375782e-01,2.951657993907278454e-01,1.079915933387925464e-01,-8.206607234579825494e-02,3.704568807725525104e-01,2.519007076521514454e-01,1.049401827355902928e+00,2.495369631715725234e+00,5.574031492391480214e-01,-2.486673176643071359e-02,1.110117659875071272e+00,3.943607269371094848e+00,1.795220421101715758e+00,5.672186608388398721e-01,-1.244144854742425532e-01,4.391797063565384684e-01,9.701707168264073200e-01,-2.183100137778891670e-01,6.944261906224813430e-02,-1.849548446970497251e+00,8.368880284342654630e-01,-9.520522980441783467e-01,6.002509715127810619e-01,7.533974863651743403e-01,2.364245138634427645e-01,1.371180214807336428e+00,4.947285434453798092e-01,-6.158548236066516690e-01,-4.752634354390222748e-01,2.509693174932399184e-01,9.176607544078884127e-01,1.962256920665961246e+00,-4.567147774892083012e-01,-7.147174249904001408e-01,-3.539424706577321000e-01,-1.394565415550287624e-02,2.791712173481792902e-01,-5.496843770544912466e-01,5.066697941234612479e-01,-1.542498678187420591e+00,-1.590234298164118487e-01,1.781350565778556660e+00,2.780198830082930561e-02,-2.839444681837534068e-01,1.466230269382118756e+00,1.220347426744415209e+00,-1.112231112628852880e+00,5.144620598076229401e-01,-4.916429978103344922e-01,7.641155962119975387e-01,-6.903945667226647487e-01,1.229196198525712713e+00,-1.137299083504774266e+00,1.212014658934176481e+00,-5.812822303861786555e-02,-3.293635969464054347e-01,-3.449921914944382717e-01
9.812490811347883701e-01,1.118509360779905704e+00,-3.882550513051279129e-02,-2.739184130482908985e-01,-9.610377613876175396e-03,2.457417144309325674e-01,1.241116401896769084e-02,1.111488351184824752e-01,1.095149415507944646e+00,2.787936858575604804e-01,4.882209349787712815e-01,1.078637169496353965e-01,-4.378731574619512679e-01,2.789276098198960052e-01,-1.308868582829995630e-01,1.800068037114992414e+00,-1.915399382734394584e-01,-2.208869345903112513e-01,1.745601146563303674e-01,2.269576232683977457e-01,-8.473856412128537574e-01,1.613778992930743339e-01,-5.338804907904451946e-01,2.976677467167376800e-01,1.244128884679061908e+00,-4.434216755970106782e-01,1.659444700551485352e-01,-5.729942796233901126e-01,-7.284564571092633223e-02,-4.483916333088102668e-01,4.923176672213356309e-01,2.229063367143233609e+00,-1.166293676083586528e-01,-3.452236727724982690e-01,-6.618633836905374324e-01,-7.953851607461683848e-01,1.329945268349065124e+00,1.090155120739891625e+00,1.184622717261341052e+00,1.090332513898196742e+00,8.460051292352739338e-01,2.164892808223116138e-01,7.866657409629870812e-02,3.877740126842466051e-01,3.897563160692805173e-01,8.459000308655660882e-01,2.761538632328230491e+00,1.077313359430617790e-02,2.040207013286904347e-01,1.239879472284152628e+00,4.089004692706566857e+00,1.174619162227565905e+00,5.934680796930793534e-01,-5.250459240342810752e-01,-4.354097129173949976e-01,1.236160586202688538e+00,1.543314343690888601e-01,-1.899385375719738756e-01,-5.892581976687457646e-01,8.799643875613865074e-01,9.631289647797067754e-01,-1.909537274273488405e-01,-3.584310273424621274e-01,6.382983347481915315e-01,5.244910599101715309e-01,-2.529432971721456980e-01,-4.164034705703323902e-01,8.551203892909688964e-01,-3.150293719845206342e-01,-6.416693319437200005e-02,2.798169911818687794e+00,-5.022513802896559909e-01,3.475264902789139410e-02,7.881398888342894260e-01,-9.200446062877347397e-02,1.450808516859117825e+00,2.035842441275632075e-01,6.088610907633552616e-01,-4.297130272672018414e-01,-4.651421086701736929e-01,3.346966720448678601e-01,7.397338974459269356e-02,-4.995979672174552522e-02,1.121249638694887807e+00,5.560095259788302435e-01,-6.869638322863910185e-01,2.068491964355749779e-01,1.617653927073535947e+00,6.368456838476542758e-01,-1.984381162121278408e-01,1.849442570283871934e+00,-6.689703243790874332e-01,1.189950363709050052e+00,2.928052134682830876e-01,3.912660448272298752e-01,-9.101769829911193765e-02
8.775710228021975645e-01,1.458547917322676302e+00,2.668161869921037987e-01,-6.057391635980600153e-01,3.056943712213108233e-01,-1.267224585055985453e-01,1.097290768542436568e-01,-2.330156286157610002e-01,6.010824286253857451e-01,-7.840336728227842444e-03,3.159702862576230231e-02,3.443448693142495132e-02,-4.785536763322475462e-01,2.917025057083212913e-01,-6.290914412451065196e-02,1.220200823079407915e+00,-4.207428775628949680e-01,-6.485565611527568941e-02,5.140221119785611664e-02,1.725794776194992663e-01,-8.463725143196446643e-01,-2.580719792443080252e-01,-7.081333072355079361e-01,3.265208253010776218e-01,1.431518972793993649e+00,2.480138566179141690e-01,3.334017427943125611e-01,-5.833266533309433566e-01,-6.441952986004908510e-01,-7.670019355656729765e-01,2.955929745486758353e-01,2.200762717958133940e+00,-2.956891799053743553e-01,-2.165656117350124865e-01,-7.396850573226889658e-01,-6.017148324798697878e-01,1.364182522095518824e+00,1.014419551633605199e+00,1.302227580668518403e+00,6.501413045233401800e-01,4.398104353713916947e-01,3.358244702601564935e-01,-6.474213667141139050e-02,1.717829730340243444e-01,7.075892856550853871e-01,1.041497587355815213e+00,2.561038161055711360e+00,-1.603528442673556043e-02,2.565114716177342713e-02,1.408459627588610763e+00,3.426827623271030632e+00,1.099354703583523607e+00,6.097646055877814497e-02,-3.394006018064739671e-01,-1.676528128853621569e-01,1.146603384915618751e+00,-1.346841717419783313e-01,-4.834234285754496208e-04,-6.160868015206901749e-01,1.724781047717893756e-01,6.334355445562839249e-01,8.960851984251788638e-02,7.451962415808957574e-02,7.248782571246801254e-01,1.044762768181190182e+00,2.917710549478892412e-01,-4.785500971703708917e-01,6.671669090995078211e-01,-1.093579081198257641e-01,3.918778257642631102e-01,2.059160543350327277e+00,-7.265115510825106426e-01,-8.674372160763642314e-02,5.126362214951833973e-01,-2.409444682875278576e-01,1.263643345032987364e+00,1.258233365918354218e-02,3.045431003923014801e-01,-7.354081058435872897e-01,-3.162392477788179557e-01,3.050343151054579760e-01,-3.586696353066005094e-01,-3.648758479672886690e-02,1.449802004163121660e+00,4.648134401454205866e-01,-6.716108693716931199e-01,5.508273229501299273e-01,9.027227899889506135e-01,5.798144183380304906e-01,2.674038428501335773e-01,1.264502055959046301e+00,-1.053833073929291375e+00,1.037836158338559578e+00,2.886850449424563925e-01,1.609116358382949585e-01,4.182073403814173806e-02
8.831432558839230618e-01,1.394935045955512543e+00,1.768613265164743487e-01,-8.542584482650834588e-01,9.908564275378319020e-02,-3.547559237032649748e-01,-7.464261486621621700e-01,2.337980935109423841e-02,9.782772396500311052e-01,5.092530734154754324e-01,9.129008402184659587e-01,5.287733383967577749e-01,-3.482752543199909567e-01,1.898722198667944228e-01,-3.559163584639710720e-01,2.241585453286157215e+00,9.394872001301518560e-02,4.973806426778683010e-01,-3.587289160677890193e-02,1.500560939184419629e-01,-7.121384020666317038e-01,4.170568988410486289e-01,-3.838716532357854816e-01,2.044207038264562182e-01,1.465052421920963077e+00,-4.943591814438055843e-01,5.045169757228298302e-01,-4.980679901278545207e-01,1.016355838848725934e-01,-6.385877852935055721e-01,3.139187023213724226e-02,2.187565381510581553e+00,-6.367005707043622564e-01,-5.096959959482130209e-01,-5.138584630311473500e-01,-7.059978249237618408e-01,1.017545400541028267e+00,1.480132071642133340e+00,1.676367806003889793e+00,1.848477078285605479e+00,4.132528322198720794e-01,-8.256863585641316394e-03,2.827260984081746420e-01,4.361574571430158753e-02,1.839057712597041427e-01,7.143733910818291788e-01,3.108839647910367709e+00,-4.866387786192774012e-01,-3.401757473192288939e-01,2.108613137838225793e+00,3.201250295783987010e+00,7.012251990954201375e-01,3.204974871930097446e-01,-5.837320196146809081e-01,-8.715417616639919984e-01,1.753440090563511911e+00,1.091930036430384110e+00,2.548161444294815281e-01,-8.237473592827646574e-01,1.137821677402067744e+00,1.148753324877181958e+00,4.131127981543295524e-01,1.498274294103361590e-02,1.808669279719774092e+00,8.593789859851617141e-01,-1.968961929363228780e-01,-5.311318293541433810e-01,3.822434085235566492e-01,6.620810648794087649e-01,-2.259462892265412526e-01,2.564206964416344547e+00,-7.310858617872965093e-01,2.536793145655687476e-01,4.069942275315289182e-01,-6.311558324221886451e-01,1.597648634018250524e+00,3.513087593663722363e-01,1.577684888064426527e+00,-6.645288185432736139e-01,1.560760578307262003e-01,4.126601753070623380e-01,4.727728397411140038e-01,2.302741533924687056e-01,1.044075666823695903e+00,1.259114452729068301e+00,-8.068616919962185996e-01,4.459998795081863143e-01,1.571434459132860617e+00,9.469732251786344701e-02,7.383380431502741814e-01,1.989197179541271510e+00,-7.450333567418625513e-01,6.844613577244511582e-01,-1.077887468994800924e-01,1.788075386323322302e+00,2.602909150838772501e-01
1.128975670041761692e+00,1.016609285385062567e+00,-2.763963991771208328e-01,-2.468023118981274022e-01,-5.190294488805684558e-01,5.524907777521135266e-01,-4.016565241805662434e-01,6.480504466629536386e-01,2.362971901763904370e+00,5.913923220133259218e-01,6.139775835425799189e-01,3.510158620156912379e-01,-4.386733470830045389e-01,1.612548858228417259e-02,-2.820198298373871038e-01,2.346728350584250222e+00,4.061824894358884164e-02,-4.873730338843468290e-02,4.986628101871725532e-02,2.688507273882344561e-01,-8.874739823023514163e-01,9.014460407260207475e-01,-2.894184075886001573e-01,6.863171783719268504e-02,1.266240594665740016e+00,-9.490986367515396038e-01,-9.255818170737575845e-02,-5.819784601367602450e-01,-2.688006038383172758e-02,-4.473515288580451887e-01,5.474232943959401743e-01,2.486877827468785274e+00,-1.755492393567638643e-01,-3.827130890068698998e-01,-6.260006569811606969e-01,-7.573024360282682999e-01,1.691975112738902443e+00,1.025730398517598507e+00,1.202221269757869582e+00,1.690690796224797676e+00,1.280206923473168557e+00,2.188659466413803711e-01,4.533338102336125219e-01,4.810094401342078774e-01,1.522403422704092235e-01,5.505489558778631221e-01,3.232051108585566546e+00,1.751906829498007800e-01,2.965750720960301789e-01,9.261534633737084077e-01,4.643861472640432808e+00,1.563939861457222413e+00,1.317305886085165856e+00,-5.007893124450280009e-01,-6.898383674828213463e-01,1.438336854457020753e+00,5.606521399157226027e-01,-4.996320231787927391e-01,-8.389663326521532571e-01,2.081627217991663059e+00,7.850578252999467210e-01,-8.507647048277075519e-02,-5.355692463681891446e-01,7.215863693807350598e-01,4.720509487331359111e-01,-3.671548539839823988e-01,-1.753351020964832863e-01,1.109150221309075368e+00,-1.049810083270832362e-01,-8.460563761001829164e-01,3.416039983404342006e+00,-2.961257404703293572e-01,8.029410067342941659e-02,3.872981439083579280e-01,1.646270094102097459e-01,1.111895950444037107e+00,3.861703410831642258e-01,9.094907673050498520e-01,-7.523683950399961962e-01,-3.072597258716522894e-01,6.266666881175589898e-01,6.979024699418485689e-01,-2.511803327080837089e-01,9.811196440421189324e-01,8.787909033051880536e-01,-9.261635791063469458e-01,-1.806719350232871002e-01,2.236261281240512488e+00,7.804003025198287258e-01,-1.110802620961140130e+00,2.688527919877753192e+00,-2.323849383892797604e-01,1.529372538848965846e+00,2.678442932346797867e-01,2.051354080599862850e-01,-2.994354585190118767e-01
9.821996296500152823e-01,1.812522618782783201e+00,2.182437203847429896e-01,-8.336362297753781014e-01,2.181524509304318404e-01,-4.259147650694579679e-01,-6.962767735009935954e-01,4.037688482203255491e-02,1.045192902254454159e+00,2.432784851152589856e-01,4.809466541933827832e-01,4.514436302422256686e-01,-3.955372491219760200e-01,3.312585466326277150e-01,-2.152453932343807164e-01,1.949465259478920132e+00,7.932390987846676955e-02,3.217114314896503124e-01,-6.106905661743820130e-02,1.464423039148764205e-01,-7.582280355235672120e-01,1.195264749922148595e-01,-5.625526110255958390e-01,2.317941411977675337e-01,1.413000386558629806e+00,-1.635142404366470570e-01,4.154519927143320857e-01,-4.748059739188307260e-01,-3.126651297594862378e-02,-6.278074015735336522e-01,9.110347797197526631e-02,2.057121644174147779e+00,-5.721036475005767397e-01,-5.191271454233226113e-01,-6.499122744645084992e-01,-6.755702422484014535e-01,1.211659455195105650e+00,1.301927495294110892e+00,1.343129721808781429e+00,1.291769096350173784e+00,4.061943065664639918e-01,4.358966306493694542e-02,2.044828767725730412e-01,1.859047481838727589e-01,3.586088311961340702e-01,8.655372510456885715e-01,3.071275999751374552e+00,-2.423109780118262169e-01,-2.549219839167034540e-01,2.144451817717818454e+00,3.220512553409418555e+00,6.456321849390205259e-01,2.953174834404699856e-01,-4.675042692763875518e-01,-4.978004753576176777e-01,1.408232853703955678e+00,5.360010618526980242e-01,1.732857857982578464e-01,-8.892815029898122337e-01,4.789360001117997090e-01,9.243359095706770168e-01,5.490770153774731099e-01,1.318435783610501510e-01,1.450930451779045782e+00,9.280967784829557976e-01,-3.918097260048980512e-02,-4.263556735196952219e-01,3.556712088693663176e-01,4.359536672540311741e-01,-9.300760287359016720e-02,2.453718381312048891e+00,-8.492720818275574235e-01,-1.160398520637266617e-02,4.128929314541590623e-01,-5.010767926198509414e-01,1.502732658972585789e+00,3.849082227651800525e-01,1.159842729057586563e+00,-6.776650480620316497e-01,9.193422575168830324e-02,4.616700117691930894e-01,1.407818897221916887e-01,1.937152270379000063e-01,1.034723394780264982e+00,9.882300163000758975e-01,-6.242117040523120775e-01,5.204704053851175738e-01,1.241619337702290826e+00,2.046818600618153239e-01,6.078761084916808333e-01,1.758753411675813449e+00,-1.055338612060356951e+00,9.702188415622685635e-01,-3.053731013590349486e-02,1.177334339376203687e+00,3.023127070456578247e-01
1.009700405811976509e+00,5.213691192437192035e-01,-5.477411769699892796e-02,8.021095914407161409e-02,-2.901061183113067821e-01,5.466309546757890381e-01,-2.407075314436630253e-01,3.292045565736854695e-01,1.813229961361749298e+00,7.138649438505758615e-01,8.096817289043530819e-01,1.349641043403957963e-01,-4.751023598848957974e-01,8.534006413114918199e-02,-2.238060157084487134e-02,2.221638634108830779e+00,-3.021800985502921533e-01,-4.823386659663552595e-02,3.663823620606846410e-01,4.639888560812742702e-01,-1.091864945070734283e+00,5.208026729698933543e-01,-2.385474959158998542e-01,2.700852096681045089e-01,9.814931766344299202e-01,-1.257485805528877121e+00,1.587638363707537525e-01,-6.154070426382063363e-01,5.785123896962687251e-01,3.979602523459968566e-02,6.764956037619671569e-01,2.519882707643004149e+00,-2.178620269244868624e-02,-6.166754563703524816e-01,-4.608526751833232904e-01,-8.860394941524042389e-01,1.095727157297762044e+00,1.373675803096768622e+00,9.817107148871163647e-01,1.917077175013848667e+00,1.267772342856977819e+00,2.065118487909163025e-01,3.300160605954886583e-01,4.552377092327494768e-01,2.522517019754031975e-01,6.038644096252773208e-01,3.113453992870436338e+00,-1.513965321335780101e-01,3.176804505073784757e-01,1.199718242670320123e+00,4.439794701634964369e+00,1.082622580342325946e+00,9.872264492305600214e-01,-7.061261742291832233e-01,-9.383880452393476013e-01,1.469203992459444219e+00,5.862223683527141294e-01,-4.081775821643102153e-01,-2.579587474308774331e-01,1.543469585812520029e+00,1.661151618588626810e+00,-4.435062904431067432e-01,-8.891635085641506064e-01,8.861428928361860802e-01,1.080380395888931311e-01,-6.875316335364349829e-01,-2.481378715239390687e-01,1.422547886261442240e+00,-4.024773684529655560e-01,-8.314409930434125684e-01,3.488876285922735132e+00,-4.049550194539883186e-01,3.603626154317299823e-01,1.071121700955599332e+00,-2.969471171595611247e-02,1.790189110246500181e+00,5.975195709382232767e-01,9.142571123438687497e-01,-1.071981847917398145e-01,-4.962703402295985944e-01,-4.535578953592156459e-02,4.663312440350542709e-01,-2.408927435463514843e-02,8.581693085229860074e-01,5.270705860600608528e-01,-6.412130272096151495e-01,-1.125340850124607051e-01,2.761497085185897760e+00,6.154189513775006892e-01,-4.101447594758786397e-01,2.541222019207812544e+00,-2.532081920125819341e-01,1.308944716215458826e+00,3.731788418413445885e-01,7.441892304551365189e-01,-8.367036325817989173e-02
1.103328016713231774e+00,1.512932154002724516e+00,2.187881724301544151e-01,-5.002792950501383507e-01,-1.889261642417857656e-01,1.523435727462966183e-01,-4.630878774256304564e-01,3.601280665764040045e-01,2.402265543418995897e+00,2.464906114776452550e-01,-3.046089724909578078e-01,2.179054554969866442e-01,-5.829619795596960863e-01,-2.395894381396158901e-02,2.707816694413633929e-02,1.517565842377797791e+00,-4.011601283180372679e-01,2.052844005343987810e-01,-5.527800649207398331e-02,3.670638771886708396e-01,-1.129858005236746621e+00,3.252038383115641862e-01,-4.814233782734674283e-01,7.904144529202905556e-02,1.328199009967932831e+00,-1.938849690445086649e-01,4.465157936648338211e-02,-6.113975119056231922e-01,-6.005573458327631009e-01,-5.900083946714187455e-01,4.316626079219715306e-01,2.586935127096163356e+00,-3.481062050015993337e-01,-3.944036482980856628e-01,-7.275639487965720464e-01,-4.659951755512356519e-01,1.828257352674435898e+00,9.305583891163355936e-01,9.148362296839658292e-01,1.160319476384187753e+00,1.004715179828412852e+00,4.635647175343975412e-01,4.024994962134579857e-01,3.302480930746915511e-01,7.057936471245641608e-01,7.830223995265155335e-01,3.221788449793349329e+00,2.774917255886632517e-01,1.892192242075436681e-01,1.150485835167353033e+00,3.933855376675901017e+00,1.386949574604592339e+00,8.450488852168773768e-01,-2.110784308834968703e-01,-3.116086435766827756e-01,1.166587273503921107e+00,-6.071304404370891916e-02,-4.927231181672127036e-01,-7.373016347073149124e-01,9.911657146620813652e-01,5.202328957232466022e-01,3.412388657608321774e-01,-1.426157531281027069e-01,7.199046538759136249e-01,1.077118013704515320e+00,3.415385354244615534e-01,1.228149092647012885e-03,1.259892584676475913e+00,-1.370072063293806958e-02,-6.968484351790855680e-01,2.724295506149353230e+00,-6.729945062555162671e-01,-1.231472402238052849e-01,7.597519291616025572e-02,1.421361051942823805e-01,9.036597370169143773e-01,4.403261531970887321e-01,2.796365392636337432e-01,-1.087795582771043712e+00,-1.165829487929405106e-01,3.844622731657788006e-01,6.861109969645644291e-02,-2.837280405209575695e-01,1.291587399427787997e+00,4.957862471645063107e-01,-7.300665335618896634e-01,1.461763557975945538e-01,1.721598569590939931e+00,8.054543015261896866e-01,-7.998761615459618612e-01,2.179072782577966549e+00,-7.762467923525089297e-01,1.714892432685732437e+00,3.961617621648447773e-01,-5.479618020212240204e-01,-7.026730167001299376e-02
1.264038899968854324e+00,7.096156725620449413e-01,-4.387030498460154360e-01,4.538846951926840401e-01,-5.168307610713591682e-01,8.783430534697322933e-01,-2.990586175202107344e-01,7.814939503703057788e-01,2.377640813551467502e+00,7.078819734853243340e-01,9.174111669498921096e-01,1.712597916397442244e-01,-4.518022617232969051e-01,2.936896157111751893e-01,-2.966397483754268372e-03,2.641330475563273605e+00,7.549772958030714909e-02,-4.944818030181081236e-01,4.521211391934071289e-01,4.634546336205963568e-01,-1.063232915359769049e+00,6.899528930920260095e-01,-2.725528118018285539e-01,2.669068607136896309e-01,7.315961480100731107e-01,-1.652438784799643567e+00,-1.643594983908445439e-01,-5.531698249090030162e-01,1.100281808824106200e+00,3.727914693310236949e-01,9.521429700705976718e-01,2.308805440630495642e+00,2.585605160933162616e-01,-7.526616528822380747e-01,-5.554149839424511459e-01,-1.109396770730325610e+00,1.310790293864288358e+00,1.222780325780936428e+00,5.051296149186494944e-01,1.711418585055755504e+00,1.700018836008418077e+00,7.334659983815366990e-02,3.828220360054559457e-01,9.015956346173841229e-01,1.251907477111535716e-02,5.597184204962255549e-01,3.279275427826383371e+00,1.856146744481722288e-01,6.096140241371559298e-01,1.076949637859423436e+00,5.272542774754375827e+00,1.109121053728835182e+00,1.601085989417828426e+00,-7.989857870747605340e-01,-7.726868147581620327e-01,1.157126660543005947e+00,2.913057532250685755e-01,-6.823749883502452374e-01,-4.060224359871977273e-01,1.611997862016936178e+00,1.701922441420969490e+00,-5.854149494942046950e-01,-1.210357820281231955e+00,3.430171777148207646e-01,-4.436155364716218852e-01,-1.184460874422192278e+00,-9.579189869063453600e-02,1.460082749587910289e+00,-8.867629957531188989e-01,-1.121291590620330014e+00,4.230136094098853938e+00,-2.602149560811607976e-01,1.454538051144880217e-01,1.391706214525634699e+00,2.821996995396767738e-01,1.879461441052992621e+00,8.142058807566305845e-01,8.508056637694714208e-01,2.335678833479444272e-01,-7.446380597413482239e-01,1.695240745481900735e-01,6.190442977155266036e-01,-6.797501439651820743e-02,4.274733901217464549e-01,3.957809664487557111e-01,-4.624863045444600473e-01,-4.175509662192258831e-01,3.083242800014509122e+00,7.926597666492504191e-01,-1.106155433467003402e+00,2.928801646886252552e+00,-1.854577735808068395e-01,1.794578703661834362e+00,4.168740064872881179e-01,3.723531512806222410e-01,-2.028809339537503975e-01
1.184468923519560679e+00,1.923385294598668693e+00,-3.923516650617548951e-01,-4.938636037048240723e-01,-8.397370565348109828e-02,1.929894916580802700e-01,-6.173382409865030285e-02,4.342461978723959337e-01,1.245577651830735988e+00,-2.617902145143000125e-02,3.672942701077636651e-01,2.969868785219810237e-01,-3.563519655371211181e-01,5.143038502021712866e-01,-3.673985561049593618e-01,1.984921936904751494e+00,3.867046163812150605e-01,-5.451605555479270837e-01,-7.750048719110377848e-02,-4.614498753952227944e-02,-5.280704557649344988e-01,2.868023299807955784e-01,-7.500566040945338964e-01,2.021139939429386356e-01,1.415851331425176163e+00,-6.472713857198897358e-02,-1.267338605067410973e-01,-4.691312356129012096e-01,-3.764732657025247065e-01,-8.021492907926460747e-01,4.271317933192232408e-01,1.851214319568754485e+00,-1.366990757791844424e-01,-1.738551538132138141e-01,-9.152923340039047506e-01,-8.296169301044230560e-01,1.866508660072697223e+00,6.951119588417025152e-01,1.185402478858515352e+00,4.249200021630669122e-01,8.092159093113235890e-01,8.371171162078189232e-02,4.048861777873560830e-02,6.201491026044135824e-01,2.043478831277100172e-01,9.216203871539621062e-01,2.756307459172671059e+00,4.267698824103867694e-01,2.351008302908913494e-01,1.191327748719388069e+00,4.418548972957450083e+00,1.410072591618741988e+00,8.931010280254895184e-01,-3.932818955554709950e-01,5.289783175652684744e-02,9.405879584683505268e-01,-1.738646105499512817e-01,-2.028345586259632793e-01,-1.243118151466876764e+00,8.228308953119797264e-01,1.429157794301386952e-01,1.366874947986576605e-01,-9.551816093403494440e-03,2.055896385247807934e-01,6.187448394433106014e-01,-1.809798781763195530e-01,-4.159969206316362911e-01,2.553985722780736656e-01,-2.946723122794131511e-01,2.123565360295176785e-01,2.811174875275431972e+00,-4.368102939522341410e-01,-4.278247273259822570e-01,4.471710409466090885e-01,8.774786576626251999e-02,9.955997394205593487e-01,1.196527700337624012e-02,5.488313284689798621e-01,-7.384185969709383679e-01,-4.323082144529520332e-01,1.091926894254134917e+00,1.217328710709538742e-01,-1.564186273884927703e-01,1.024061344663041773e+00,7.881427757463896899e-01,-7.549833710070488202e-01,2.021461428421511553e-01,8.300718330413574542e-01,7.610053071512409284e-01,-7.343578022246066705e-01,1.769751347771220118e+00,-8.845774447558381048e-01,1.464257868430080212e+00,1.435287878575181864e-01,-9.527093671672079433e-02,-2.326334761072743340e-01
9.064666580316015354e-01,1.212270385398729999e+00,3.416733922790916034e-01,-6.707308091075602219e-01,-4.012966079875469882e-02,-3.110907771499443752e-02,-4.015166903361064299e-01,5.053126128873319800e-02,1.695109436620671151e+00,3.667258865834632786e-01,6.790353804737675469e-02,2.365111379216312537e-01,-5.264078270264319626e-01,-7.391518506592982540e-02,-8.676199284301566728e-02,1.545799671402521058e+00,-4.808005718449596122e-01,4.221599194037956027e-01,-3.284206209870725590e-02,3.237528582851370018e-01,-1.035386147824922221e+00,2.978296918230989299e-01,-4.114459640582170397e-01,1.350653452132660470e-01,1.447693020451749080e+00,-1.994959262859573312e-01,3.074502863817719089e-01,-6.255830439432809031e-01,-5.927386498820393923e-01,-7.060323367067339317e-01,2.527092765820447839e-01,2.605309881373352621e+00,-4.857741718976522072e-01,-3.472427982656572931e-01,-6.014747470090412440e-01,-4.660512039576045762e-01,1.461207637965354467e+00,1.161952168264742014e+00,1.358734766704456254e+00,1.493529205331877829e+00,7.044794254522481758e-01,4.045224763813648483e-01,3.240518283393366561e-01,6.000764632657186459e-02,6.482050849698139938e-01,7.658087475909265418e-01,3.059381465625853558e+00,-1.018709442965549106e-01,-3.351767630323927716e-02,1.351262243872257685e+00,3.471132077918829939e+00,1.242263560477586681e+00,4.476222850044362378e-01,-3.117294456859220908e-01,-5.936912039985906553e-01,1.492641080959124844e+00,4.145286046971049521e-01,-1.916699130206079849e-01,-6.150915347170283765e-01,1.116470597294912270e+00,7.575804825789205221e-01,2.739767543507325431e-01,-5.867350283852018622e-02,1.201343477342239563e+00,1.170955843229500415e+00,3.383793707178741617e-01,-2.406382419202950373e-01,1.077391036069257346e+00,2.940265151659454679e-01,-4.313820690333508567e-01,2.412608928799899743e+00,-6.902196825797819457e-01,1.344426501116077755e-01,1.219284051200005548e-01,-1.852709707015681717e-01,1.102184181744032765e+00,2.902409889167706925e-01,6.506884669934932530e-01,-1.044179696985322980e+00,-1.680807092307240458e-02,2.413983483213414938e-01,1.345093354381647066e-01,-1.363147250892531026e-01,1.422091730576506619e+00,7.261097274495446063e-01,-8.514169231864132659e-01,3.173722568668973509e-01,1.649233505553598711e+00,5.650412435209180018e-01,-1.130976817053975236e-01,1.978800285950258919e+00,-7.018241846571102727e-01,1.182375350991256902e+00,2.749845331594555908e-01,2.787229475109815890e-01,2.216353378186375345e-02
1.313068282456735014e+00,1.873232801055910279e+00,-3.694310753938154779e-01,-2.162396024105108228e-01,-2.937416367879277512e-01,5.468600596466581809e-01,8.236249147915530866e-02,6.563465586071590696e-01,2.171064701473306435e+00,-1.079983483367878694e-01,-2.864442008234172055e-01,1.085382113287235301e-01,-5.002587066898073198e-01,3.594122735291490622e-01,-1.208612193624399866e-01,1.621848269870391324e+00,6.710460359797620900e-02,-6.975033603895499645e-01,-4.773419344468881470e-02,1.225356565078304372e-01,-8.150320444569750800e-01,2.812242444340078973e-01,-7.590865766365774148e-01,1.306628891112333601e-01,1.287180038085185441e+00,-2.700489672188400442e-02,-3.934945732244869987e-01,-5.446397998066377921e-01,-6.739793784296828072e-01,-6.856747041321050729e-01,6.982051651196192754e-01,2.133698314534297591e+00,5.728749147699374600e-02,-1.495786153585602629e-01,-1.004598275311118449e+00,-7.084468915468989936e-01,2.290105447836284114e+00,4.233466508788475968e-01,7.057013221531494018e-01,1.547941192631309137e-01,1.225310001749262412e+00,3.603340119050739143e-01,1.435306354349517033e-01,7.987841463965358324e-01,4.901471048073542947e-01,9.248864046738682898e-01,2.866640596690053222e+00,8.424645952360247936e-01,5.691265905802689318e-01,6.155696701027474349e-01,4.908806426353315544e+00,1.795151839674398619e+00,1.255395843366854391e+00,-2.099771986737322682e-01,2.955040042347992779e-01,6.342367752973929740e-01,-7.827477483367272226e-01,-6.754931020220200644e-01,-1.122159459318726515e+00,8.373475063714963529e-01,-9.485106182173388967e-02,3.313303603052514257e-02,-1.998016328378941497e-01,-3.997701759272528355e-01,6.669988511331603753e-01,5.548366864758269568e-02,-8.264413858486241438e-02,8.703742791617722352e-01,-7.208224146868629223e-01,-1.779461991185580239e-01,3.016668064408294381e+00,-3.835805448878821799e-01,-5.883449963370045444e-01,3.196482805171688701e-01,5.498076575999534255e-01,6.578371310764377089e-01,1.243728818126443314e-01,-1.692791654004848212e-01,-9.170227514257319745e-01,-6.102090096395023089e-01,9.986865084735188081e-01,-5.926976045130027959e-02,-4.512126482623801671e-01,1.128336531830369749e+00,3.241623566162645798e-01,-6.994231398193289095e-01,-2.536846650480240051e-02,1.112287806609599139e+00,1.175491382077116898e+00,-1.659934053995181236e+00,1.984342066641278324e+00,-8.307840586890525847e-01,2.079113722056832536e+00,4.576796715596104237e-01,-1.401331160314281954e+00,-4.267820409631567502e-01
1.049564451285382116e+00,8.767296379783685589e-01,8.729690874756733387e-02,-1.136050701404922592e-02,-1.452920734787246371e-01,3.711862199098179826e-01,-2.913801663730723468e-01,2.699207412034402287e-01,1.838183103139844787e+00,5.171893711642105984e-01,4.269521250379866850e-01,1.024692220644508878e-01,-5.215903692654154655e-01,1.496955472388704633e-01,9.725765706985456394e-02,1.932557621476414855e+00,-3.730541795476188804e-01,-3.123173018538968893e-02,3.134952926932713657e-01,4.741191993506288505e-01,-1.152676818033360640e+00,2.600236913007810124e-01,-3.635547360623245794e-01,2.805384924401307378e-01,9.846784699034043520e-01,-9.262878726186520861e-01,1.692864918857396317e-01,-6.013876677114704528e-01,4.077098649539312447e-01,5.679402033156311091e-04,6.443676936610813755e-01,2.461571165336786216e+00,-6.698472076885556015e-02,-6.391430740427699320e-01,-5.430190872677719272e-01,-8.039239600431544730e-01,1.198870342249682253e+00,1.292318612469212313e+00,7.847858981102955322e-01,1.568743463581525610e+00,1.166925980844762289e+00,2.629204739728132068e-01,2.925141342793768362e-01,4.723890416457994235e-01,4.412099356004863249e-01,7.236767859840917971e-01,3.118967910802999732e+00,-4.243731381914205014e-02,2.934433805872015411e-01,1.345669062860872511e+00,4.225368880862099275e+00,9.705408656902329012e-01,8.499421758737413235e-01,-5.901789146480505011e-01,-6.946094063517700423e-01,1.269905192184497267e+00,2.380556460552070153e-01,-4.091634704934125066e-01,-2.936632005399576473e-01,9.775906519654855575e-01,1.503137010797101825e+00,-2.297190881559316167e-01,-7.116663120311979007e-01,7.937601570992893762e-01,2.961806679393026442e-01,-4.546063957380250820e-01,-1.674107167139792796e-01,1.392629841431189952e+00,-4.223208251844610683e-01,-7.375223493625120419e-01,3.265542896983121501e+00,-5.672784147951863698e-01,1.928580640077176001e-01,9.814314731712401318e-01,-1.314659306290148766e-02,1.712694216975721773e+00,6.392066987499469555e-01,6.446828979183515385e-01,-1.993921469086585851e-01,-4.387127803482245847e-01,-6.118738020192271421e-02,1.899685451108432677e-01,-2.360844257812166891e-02,9.079879649072861714e-01,3.630440787243275347e-01,-5.102722180688614717e-01,1.785511938095618589e-02,2.468709257626706233e+00,6.307142383198669489e-01,-3.287824252010314030e-01,2.319692640202501543e+00,-5.426994577589683288e-01,1.455398735478721672e+00,4.049426538406643017e-01,3.861297888697085567e-01,1.854996309021950118e-02
1.390042340562599232e+00,2.285839405141051994e+00,1.051282127594913157e-01,-6.626257636231205339e-01,-3.760212330696313110e-01,-3.808995679334103990e-02,-1.301067500202228722e+00,8.884346414018298166e-01,3.505579336410749924e+00,2.893131973754801689e-01,-3.890968234745694754e-01,6.055145843486624546e-01,-5.693333091121122180e-01,5.115353226314937884e-02,-1.138388633244763470e-02,2.059453546999442164e+00,1.315864582056115450e-01,4.066462083187202259e-01,-2.503247595108384904e-01,3.573651997877256292e-01,-1.126730038288092928e+00,6.599363786822196598e-01,-4.547712688136196224e-01,-8.626804936710461003e-02,1.264811520166592596e+00,-3.876087810565952974e-01,-1.275587843404641097e-01,-4.937519798119314740e-01,-2.261736308113573291e-01,-4.659783185181374243e-01,3.547415942210297435e-01,2.431622187013745773e+00,-5.377905427199700661e-01,-6.794429349389661255e-01,-8.024754812701144768e-01,-4.709093259046165381e-01,2.126462904685331168e+00,9.201113784794457962e-01,5.547518838960436849e-01,1.322895296993822134e+00,1.183738141322928428e+00,2.779197761021534041e-01,7.260065541001488043e-01,5.636533155586986865e-01,5.003427335852901336e-01,6.693441261333340497e-01,3.849158288322497068e+00,4.707385370940659897e-01,9.903986147758678249e-02,1.663555145974158656e+00,4.061146386341048853e+00,1.132927108947437533e+00,1.381594463428810649e+00,-1.628060498816204238e-01,-2.588593964247763446e-01,1.068059647053405836e+00,3.500592061102669739e-02,-5.995012699499796538e-01,-1.186750655764841955e+00,1.055276055851651407e+00,3.898652871118286622e-01,9.603877665036169020e-01,-3.222897253743517432e-02,9.420225991073170047e-01,1.041506511189658646e+00,1.997455503904765339e-01,2.954173336695546936e-01,1.080882848812571906e+00,2.863856734421019734e-01,-1.338739707586621863e+00,3.233570754828906324e+00,-8.180510615318548062e-01,-3.661435493504940353e-01,-2.140967264018462102e-01,2.099362655714263615e-01,8.111756008099341164e-01,8.873007958993681665e-01,6.504979587179664513e-01,-1.226634926330457454e+00,2.364042480120442935e-01,7.366549965900315300e-01,4.050170048767608444e-01,-2.355970467532205181e-01,8.568411796517382273e-01,7.797948590760939158e-01,-5.901689720205416378e-01,1.707114821865735044e-02,1.906287643838724843e+00,6.932794869843672547e-01,-1.135192543995631631e+00,2.740779649049335021e+00,-9.396323117391758295e-01,2.179820095811016323e+00,2.028334759482957050e-01,-5.273547597749475013e-01,9.647665982264208573e-02
1.122571237677138845e+00,7.303952558128280481e-01,-5.366371684312646329e-01,5.147626092777601858e-02,-4.699730715261168923e-01,6.643165385211443619e-01,-2.930067259787744738e-01,6.370239819155355532e-01,1.704217484997255116e+00,7.468664638851209014e-01,1.381835614110794808e+00,3.565231492148228098e-01,-3.203422177469026355e-01,2.847900609203041222e-01,-3.685529430757754632e-01,2.871011940460494571e+00,3.461338950493985656e-01,-3.493339536595244654e-01,2.814388910125216747e-01,2.248801099700512562e-01,-7.230703743823173602e-01,9.042763168807815832e-01,-2.559480549087847501e-01,2.279609296538722685e-01,1.055478926095094749e+00,-1.481723875138800439e+00,-3.223708082214682413e-02,-5.209413582169264423e-01,8.195428463943692510e-01,-8.221774992886454747e-02,6.557757361323104384e-01,2.181146136604789731e+00,2.906437733062250395e-02,-5.343870515484692163e-01,-5.316564741683437179e-01,-1.099631541530384338e+00,1.233892840276602954e+00,1.261986944667271793e+00,1.209469603643740676e+00,1.882470882484810648e+00,1.324184976772350808e+00,-6.807205412232025799e-02,3.176641565879669837e-01,6.498099636058893847e-01,-2.212162164599593694e-01,5.193337011143094317e-01,3.106028503731600665e+00,-5.188076670937408208e-02,3.311594904778479287e-01,1.186838028958546065e+00,4.930563273847400119e+00,1.212556889476069877e+00,1.356370421094310164e+00,-8.341088360433488447e-01,-9.153415236737810767e-01,1.500222018391185852e+00,8.549942963103874805e-01,-3.273727942716661010e-01,-7.078176090146000021e-01,2.082128823021265784e+00,1.410699221585187679e+00,-4.680306771785616160e-01,-8.803513686010793204e-01,7.589310212178526083e-01,-2.042369185425190192e-01,-1.107069331053066596e+00,-4.054145210825867984e-01,8.754927772505269878e-01,-3.692957988709416051e-01,-6.918975555726045723e-01,3.861535538697059344e+00,-1.769927283344028823e-01,2.363184094325668227e-01,1.096952412874091953e+00,-7.023364230547030074e-03,1.735500453423115541e+00,4.567719565906583346e-01,1.376239415185821269e+00,-3.683168440498096885e-02,-5.499998108310317768e-01,5.311081900651037913e-01,8.751642432266903970e-01,1.378131715294550474e-03,5.872223975845975996e-01,9.546298334001815933e-01,-7.803341261426892661e-01,-2.534732023054648287e-01,2.558498002770407176e+00,5.838838182444702207e-01,-6.958912641657416520e-01,2.743268368225782794e+00,-9.637867811185923950e-02,1.253543900661677757e+00,1.532035784054381899e-01,1.152823707891614147e+00,-2.412751719747786849e-01
1.089530426881333725e+00,1.131239371005966055e+00,-2.345483741303637237e-01,-2.048732232549388410e-02,-3.667064209577035327e-02,3.124242106313270262e-01,-1.612729845928700390e-01,2.860613408381708078e-01,1.085204409104284951e+00,3.984593733100113555e-01,9.213907805981125243e-01,1.866704268493915575e-01,-3.768492695371029044e-01,4.960477685230323397e-01,-1.243894067224395883e-01,2.289664021137851613e+00,1.249074667975823005e-01,-4.038330484007290333e-01,3.227288519588110693e-01,2.457453859761911108e-01,-8.030320892474450689e-01,2.140367112343848910e-01,-5.034777142545174833e-01,3.735024857536920484e-01,1.002220072994560507e+00,-9.252838951280264457e-01,1.352903568227103170e-01,-5.013032770588508047e-01,7.154117166731017718e-01,-4.661785078773661439e-02,6.098694880656126971e-01,1.991404835292003295e+00,2.231467266098363655e-02,-5.892787267489634218e-01,-6.180237091507980729e-01,-1.046110591704066728e+00,1.095730857989530849e+00,1.255518830924585716e+00,9.330455486986584113e-01,1.248347068330591725e+00,1.008704497130758826e+00,-1.584919016422586813e-02,9.077090153815020601e-02,6.295028047803270521e-01,1.103574253866497212e-01,7.979621867235560106e-01,2.894467126878206731e+00,-5.185060925343981664e-02,2.588932808079795755e-01,1.563695733525059417e+00,4.398463185868993541e+00,8.161914465145585496e-01,8.272734471293040626e-01,-7.459780945332659119e-01,-5.579206338665897436e-01,1.182159862617433888e+00,2.804368912672656755e-01,-1.700814804887975928e-01,-5.570840856246308537e-01,7.950558895200340315e-01,1.449345411978963494e+00,-3.095578844524169426e-01,-6.470316359532248818e-01,6.513485046312592619e-01,-2.625992428069023887e-02,-8.473583948856246995e-01,-4.300473422050042904e-01,7.611096195212924131e-01,-5.247528442896008949e-01,-2.367210253950535748e-01,3.348073699255007529e+00,-4.797583354529229016e-01,6.098937672645150798e-02,1.281887834045798646e+00,-1.390582843683742797e-01,1.912057743084851102e+00,4.667442507962970555e-01,9.479914486496232584e-01,1.081948741502420930e-01,-5.755333688244863577e-01,2.844922690054841885e-01,2.462730614591545075e-01,1.354131687603602474e-01,6.732961519292228747e-01,5.749535958592797424e-01,-4.701824540914684158e-01,8.308082244644748870e-02,2.023859525093405942e+00,5.017952240191514424e-01,-7.315334595889605440e-02,2.094506274728185513e+00,-6.384828275063250125e-01,1.239042270439045801e+00,2.086469504384522167e-01,9.272520156355590348e-01,1.293970693026014196e-02
9.476697928601589549e-01,5.515658320029213080e-01,9.659039355133690330e-02,2.484422993385726475e-02,-1.473482843370795825e-01,4.692458603812720286e-01,-4.815279662956351014e-02,1.346536619150306702e-01,1.562516175121071882e+00,5.652908535025296111e-01,5.263623423007103286e-01,8.791181140265003080e-03,-5.175012968834092897e-01,7.391358076828517809e-02,6.436034315743788259e-02,1.835457684358241748e+00,-5.272434473392699772e-01,-5.292740469241447726e-02,3.605318199138756174e-01,4.731027033053168962e-01,-1.141184992132968201e+00,2.654967966944274949e-01,-3.259914923973261658e-01,3.064784184729449912e-01,1.032368962828114745e+00,-9.347423296303949414e-01,2.162039445248134517e-01,-6.460875576591658120e-01,2.701388843511227655e-01,-6.939450484287945642e-02,6.566411557738429661e-01,2.558676059264645808e+00,-2.666713830397987595e-02,-5.299231794447745170e-01,-4.979600056699997612e-01,-7.955854025402419039e-01,1.115782554294370232e+00,1.306693527808916677e+00,9.807621556952261788e-01,1.643638065249752866e+00,1.135637034642168697e+00,3.214508908667196296e-01,2.276169468924048034e-01,3.710605048764277769e-01,4.640877788659983350e-01,7.132495917552010845e-01,2.948071807897190588e+00,-1.262733329572018892e-01,3.136001780333156352e-01,1.126582265422313434e+00,4.220323330830265895e+00,1.119190755946239735e+00,7.319887704622567437e-01,-6.137357552693715190e-01,-7.853451056662630325e-01,1.378971477361580433e+00,3.301902011862490327e-01,-3.841015137309296001e-01,-1.700846066946749557e-01,1.180541197283451194e+00,1.532305877721027221e+00,-4.407642181412823046e-01,-7.636869891320405834e-01,7.814122446046118942e-01,3.161448798003916316e-01,-4.197460883210707427e-01,-2.659396684310784686e-01,1.465563239620893965e+00,-4.538211342511547786e-01,-5.959400857416574659e-01,3.143384562387005143e+00,-4.785586838022324874e-01,3.145854099438260554e-01,1.015363328579274915e+00,-3.290274664223308970e-02,1.702668187353953755e+00,4.814583216096445795e-01,6.083448701750535648e-01,-2.071832017534328552e-01,-5.267219741415184453e-01,-1.419558287523972062e-01,1.849341704720570134e-01,-5.970715078752025784e-02,1.060070418567259365e+00,3.510237683613725013e-01,-6.221263304974579134e-01,2.060809436457017307e-02,2.480922799388896038e+00,6.680956170040637243e-01,-2.854073300835298643e-01,2.230650804371691720e+00,-4.007789587773897821e-01,1.278163020638250602e+00,4.524423212669225203e-01,4.446042590878393486e-01,-7.048558510973679248e-02
1.349278795280774101e+00,2.139173351140286172e+00,-3.193424431151744569e-01,-4.378162987790900074e-01,-2.768430866101685983e-01,2.384151213692582982e-01,-4.994259075659150393e-01,7.544512930403862727e-01,2.338243336241564663e+00,5.213389206951521415e-02,7.713325985833574538e-03,3.964649690559298723e-01,-4.454202144221314774e-01,3.869896116698172128e-01,-2.096954820554738363e-01,2.058906513739644950e+00,3.656262116130836737e-01,-3.516039352908570392e-01,-1.301523311248474479e-01,1.083817013495636805e-01,-7.622629626440610151e-01,4.631299660775426430e-01,-6.679252287746224592e-01,8.153952339167365448e-02,1.294182147261456084e+00,-2.394420544031516107e-01,-2.611229263345969942e-01,-4.692735270214459242e-01,-2.694756548832755172e-01,-6.083507596196242595e-01,5.036823470212297149e-01,2.031597086032392863e+00,-1.860463920349647027e-01,-3.717715735379636954e-01,-9.268009748735213105e-01,-7.351086961371419148e-01,2.108905392777030485e+00,6.732764454590118852e-01,7.726431925986667615e-01,6.124056364761676363e-01,1.105422205403764124e+00,1.588925374759363185e-01,3.110436408968879629e-01,7.451436224532921315e-01,2.908339073023886723e-01,8.275261638577398049e-01,3.201763260705448033e+00,6.118160492429101094e-01,3.084703281539373787e-01,1.238566877130317767e+00,4.578336443540096390e+00,1.391403850802090947e+00,1.282931585862918222e+00,-2.944357139996253703e-01,4.956532958161030678e-02,8.461679465537448319e-01,-2.866150342461706302e-01,-4.833921675514679661e-01,-1.277075870091619159e+00,9.153535968075479090e-01,1.525085819175504287e-01,4.029017779134865807e-01,-9.951200803361891223e-02,2.205936431424110333e-01,6.574990445611569312e-01,-1.156496768191045410e-01,-7.333128746112405061e-02,6.203873643127627568e-01,-2.655237003097597470e-01,-4.526426394172617940e-01,3.164054368323828914e+00,-5.286458180813133900e-01,-5.098145130005201642e-01,2.437174455852336441e-01,2.874108535852932800e-01,8.689617288891657854e-01,3.810980732765696932e-01,4.504441418847076606e-01,-8.816857300329311586e-01,-2.766657578357663572e-01,1.044686503972932723e+00,2.295951497270011799e-01,-2.479212859597070551e-01,8.764072059757838096e-01,6.935421955719378584e-01,-6.490278121483592511e-01,3.060553260595605396e-02,1.283620044295592733e+00,8.510064968774817551e-01,-1.215831605420359285e+00,2.232894919329624361e+00,-8.955069266686754847e-01,1.946756070237258385e+00,2.160662883093749931e-01,-5.746886061538603041e-01,-1.809700205986723709e-01
9.284244059796145088e-01,1.116954889289266672e-01,-3.598260668707808918e-01,2.144488070899980281e-01,-3.907108236418140867e-01,8.647879500534507713e-01,2.909422080906274299e-01,2.862441445207414281e-01,1.257882036023678207e+00,7.299895860698069061e-01,1.198805833818750388e+00,2.538634682535266529e-02,-3.928208399643735582e-01,1.190966070882364808e-01,-2.364524289111721300e-01,2.323814030965937860e+00,-2.205898326218176386e-01,-4.177131186602821011e-01,4.248840343455138613e-01,3.215051691699533642e-01,-8.673793019734344911e-01,6.637968754744034694e-01,-2.429319245469375166e-01,3.128063624733818937e-01,1.071663552899903227e+00,-1.331864828858012606e+00,6.083437453695253461e-02,-6.426822413947141932e-01,4.288618070673297922e-01,-1.339101092565764262e-01,7.629216874915480950e-01,2.458087947468334367e+00,1.714699463829630899e-01,-3.453924231198493566e-01,-4.732182568173916026e-01,-1.012446656295631353e+00,1.111054498440698257e+00,1.238483347141292157e+00,1.340838321572827008e+00,1.800375485829927236e+00,1.300735613194433427e+00,1.823176832814545067e-01,1.543088046220044141e-01,4.711483155893047003e-01,6.438133043584343129e-02,5.857536817833878251e-01,2.735597608161933536e+00,-1.220922005597812332e-01,4.563829588859936726e-01,6.832951609546369376e-01,4.861891059473494536e+00,1.483600965526805648e+00,1.029281304703952626e+00,-7.975694055009627803e-01,-9.459179443588185965e-01,1.538777943237841672e+00,6.687373104243816702e-01,-3.876582712066865000e-01,-2.933811357472262404e-01,2.060451077134223929e+00,1.487079948730982926e+00,-9.008344400832375420e-01,-1.004786739989851130e+00,5.425843576152301617e-01,-8.544459850732577522e-02,-8.626459052632853286e-01,-4.910044967694859874e-01,1.268995260177451012e+00,-6.274001602813276124e-01,-4.260985888719253101e-01,3.504275116880156471e+00,-9.559528289447533078e-02,4.165998204687084150e-01,1.210458601094403619e+00,4.855943713106546100e-02,1.702532277664329907e+00,2.069196209689816990e-01,9.111505564183814965e-01,-4.123795476251723713e-02,-7.933873604882923924e-01,1.654410578978458002e-01,5.805477946184363081e-01,-1.178260574343124312e-01,9.739135052547754912e-01,6.137386609006951765e-01,-8.730404670802812683e-01,-2.095177638244101748e-01,2.586542277487195562e+00,7.608979229422855317e-01,-6.582816674239493349e-01,2.428092523355027232e+00,4.334106045020491571e-02,1.079026470736036858e+00,3.941162536879611045e-01,7.858183297476759588e-01,-3.822992602750410196e-01
1.140401014343771724e+00,5.525507673043150714e-01,-3.676486308531750069e-01,3.103244089930308203e-01,-5.201707914126272314e-01,9.847682501876577899e-01,1.735033040163583562e-01,5.890700349840419792e-01,2.182136292894729213e+00,5.359121555546979554e-01,5.271186837422805471e-01,-8.813059272711795678e-03,-4.984764601233774295e-01,1.097733028653492676e-01,-4.848088589138671578e-02,2.090995366797722355e+00,-2.568979638270434407e-01,-5.432635800021599071e-01,3.449246760512813537e-01,3.990844057245887533e-01,-1.044532019140272938e+00,6.217389868495010186e-01,-3.422923530976759721e-01,2.212742640008800998e-01,9.836855426328849905e-01,-1.141190816707939426e+00,-2.116802027659133445e-01,-6.432675954942199681e-01,2.017222140013950060e-01,-8.222084789505301750e-02,9.201478276316764626e-01,2.519324714629830098e+00,2.530424524832683431e-01,-3.827561981579238881e-01,-6.346989595296286257e-01,-9.063917749696486226e-01,1.604816520574264826e+00,9.432578059489244993e-01,8.108117315740845932e-01,1.360306464503226564e+00,1.586819493839498163e+00,3.334456207065978894e-01,2.693605217440157573e-01,7.093965596708062815e-01,2.729192372614837048e-01,6.353402046913082524e-01,2.952605191469498180e+00,3.368818964524136761e-01,6.726391484637599394e-01,4.619499943812814813e-01,5.204840267932361542e+00,1.669139822201051393e+00,1.393989361413913386e+00,-5.889027373485307137e-01,-5.624207200132099738e-01,1.145532853416812546e+00,2.949697469417089657e-02,-7.483249596269410109e-01,-4.277733114205749532e-01,1.784022174340538225e+00,1.098774366722971241e+00,-6.908303234195456444e-01,-9.855720061248787189e-01,3.590461451564475048e-02,2.002789431262197439e-02,-6.285012694257788857e-01,-1.529561615701550137e-01,1.547248872678987697e+00,-8.889215945792400264e-01,-7.514114998009309154e-01,3.677577082232256878e+00,-1.565000069095378588e-01,8.984050833972907768e-02,9.854533185053570010e-01,4.286257902049822599e-01,1.352545457892180725e+00,3.823135037631499311e-01,3.487202917321107210e-01,-2.647987684441357459e-01,-8.199122968386245436e-01,2.904505164724335842e-01,3.995394192055904958e-01,-3.253983889530248641e-01,9.410572484742303345e-01,2.993139164958704690e-01,-7.376314926954062878e-01,-3.407712193598625983e-01,2.566781839430620327e+00,1.054731361207318585e+00,-1.431228236962861944e+00,2.585502865419041285e+00,-1.328771313492652650e-01,1.736886502113697883e+00,5.639805841424199162e-01,-3.741943611400635472e-01,-4.533897616656606955e-01
9.495664257189304625e-01,1.738965393319661823e+00,-8.012908927588786867e-02,-7.237194497564589657e-01,2.538988527055688893e-01,-1.819357518006249341e-01,-1.863369778746676309e-02,-5.175943128467550003e-02,3.071165954488537797e-01,1.218697008567720674e-03,5.691731971341613683e-01,2.635454623462499812e-01,-3.299884266570924374e-01,5.090522668651228377e-01,-3.663520312380990074e-01,1.780902297615242436e+00,1.700297185408219947e-01,-2.426259747500614516e-01,-3.526356914716221452e-02,-5.171973580079360783e-02,-5.011551102587228357e-01,-1.262817920955672246e-02,-7.447068987471175960e-01,3.133882787948044646e-01,1.513725505264551741e+00,1.206007816521532661e-01,2.595654799068590757e-01,-4.813453436260961560e-01,-3.788177931074367955e-01,-8.825379095571328492e-01,1.977074107726055074e-01,1.840732690970090513e+00,-3.247686661620725612e-01,-1.852150172484545165e-01,-7.876941050704648895e-01,-7.858096131200487111e-01,1.376232596271369069e+00,9.933320157730787248e-01,1.541817413483805854e+00,6.329728053072121163e-01,3.549679274755640490e-01,5.033717630127215736e-02,-9.861782011780532986e-02,2.882406504824371885e-01,2.976530296560895295e-01,9.981204235474828712e-01,2.553850610131825682e+00,-2.801130496003881309e-02,-6.492430851791868018e-02,1.622616426160242042e+00,3.624602223937359646e+00,1.042843193213718100e+00,2.337060407646672777e-01,-4.660704570033439853e-01,-1.655783135174958010e-01,1.205593553949367625e+00,1.673379286671080324e-01,1.889731181753370459e-01,-1.011812854566207731e+00,4.457711319965269592e-01,4.871098560809526967e-01,1.678670973473043726e-01,1.692258408603687647e-01,7.871126340307227354e-01,8.200432053479385086e-01,-6.160714498810587747e-02,-6.612070734818576989e-01,6.759915696575913291e-02,3.522685608938096874e-02,5.971822987135471106e-01,2.268205386408006063e+00,-6.114317382703482462e-01,-1.808497431797035371e-01,5.523625665105001969e-01,-3.485931054193900369e-01,1.311018402544195105e+00,-8.989150920728783412e-02,8.170948818074096343e-01,-6.413394998357754284e-01,-2.839455710398674504e-01,7.722385832586575738e-01,-4.465384075904316186e-02,7.306866194112571211e-02,1.197527136465602382e+00,8.904782002025005694e-01,-7.500729434709050292e-01,5.291236904219596138e-01,6.255541699609963313e-01,4.348730424497452285e-01,3.216579873709888848e-01,1.335578176451680088e+00,-1.021267191397152718e+00,8.760197118012041928e-01,3.259035404742388620e-02,7.712666915645400856e-01,1.043169399097582106e-02
1.002861766059941928e+00,1.849368390462223122e+00,-1.851293745641185984e-01,-7.094308830359979945e-01,2.006273563400312598e-01,-1.206047451880262744e-01,8.697111423618508752e-03,4.693593080398639206e-02,4.022982479431780889e-01,-5.017530396669075965e-02,5.418739807143372333e-01,2.795655902284996386e-01,-3.186793526117238096e-01,5.494588227545337267e-01,-4.054164335873360336e-01,1.826508578641953484e+00,2.759413740723907771e-01,-3.578139385655670357e-01,-6.725713481744649558e-02,-9.566811587389087435e-02,-4.497541600554912367e-01,3.726233181908689129e-02,-7.805258936866916741e-01,2.929165906638471761e-01,1.525586204144021796e+00,1.508356126914429385e-01,1.638091170204863944e-01,-4.675169970221675353e-01,-4.281569295408950149e-01,-9.262284466092737256e-01,2.282608000779362545e-01,1.782915086107738745e+00,-2.852107953695934839e-01,-1.440546505415578049e-01,-8.417491261626626198e-01,-8.054488296838957506e-01,1.511685670609783427e+00,8.901834348522139617e-01,1.507968914092666424e+00,4.912670736829609641e-01,4.099272001351016992e-01,3.703296977242892529e-02,-1.031464821795378545e-01,3.675190640975260492e-01,2.550866263228744879e-01,1.003356069813647666e+00,2.548501817082127641e+00,9.279240458835326388e-02,-9.005195007702151977e-03,1.527720561222031481e+00,3.798798399366302370e+00,1.142881410684584154e+00,3.558891837643740619e-01,-4.439118421940953518e-01,-6.225428542031941070e-02,1.125147222579092610e+00,6.583243688171791508e-02,1.368259929698830146e-01,-1.126648018852135280e+00,4.934808831096257897e-01,3.229172392837253991e-01,1.749835364112768410e-01,1.847738899129046652e-01,6.188788861478824455e-01,7.913479678985784194e-01,-7.765775454821355339e-02,-6.446093580456084826e-01,3.173434597025015513e-03,-3.230827837685163600e-02,6.197436547642536375e-01,2.336800429271477242e+00,-5.634675224026023388e-01,-2.763942339234639611e-01,5.116659490956012579e-01,-2.607118555833093931e-01,1.207918750001246266e+00,-1.274151553842774454e-01,7.590956114281832701e-01,-6.832481203201856701e-01,-3.247439754657288069e-01,9.232766099045132124e-01,-2.377706376129665178e-02,2.396691374337028835e-02,1.169374762082175945e+00,9.005563016449936731e-01,-7.667507410103342469e-01,4.833102381726011587e-01,5.276826947363346676e-01,5.058552040454512566e-01,1.007321558656424920e-01,1.361707544556464367e+00,-1.022585505105787718e+00,9.787287103031565572e-01,3.251783951295442177e-02,5.824309806858656291e-01,-5.725502137789750812e-02
7.796277967368142603e-01,9.500678961445414572e-01,4.455913654178037531e-01,-5.717624600648323341e-01,2.138645746921388757e-01,-1.753131196554959526e-01,-2.939539534927754771e-01,-2.581481934325802197e-01,8.640664036174083851e-01,4.344427119735118081e-01,4.581938531974599216e-01,1.583538141336051641e-01,-4.825840271729491260e-01,7.172001921750158215e-02,-3.351596183413940722e-02,1.589563600997392800e+00,-5.460126404609517703e-01,4.178192743041838630e-01,1.570853096576237395e-01,3.530532650167655939e-01,-1.015866332077427714e+00,1.800091687831856246e-02,-4.088773420991451690e-01,3.066102708773105201e-01,1.326837935291232951e+00,-3.590128969579742257e-01,5.634289675682669918e-01,-6.109957462849474608e-01,-1.131163835792490246e-01,-4.681884056420455575e-01,2.305217217684065178e-01,2.464759984999629783e+00,-4.433002588639228803e-01,-4.774861316617347584e-01,-4.817642094340952585e-01,-6.125080697266025442e-01,9.233321513173022854e-01,1.460330308835837032e+00,1.419811825805420868e+00,1.644748514006844964e+00,5.059852000401243721e-01,2.762307432349384029e-01,1.625791228326841642e-01,-1.132730445174219558e-02,5.916284274704426416e-01,8.247202545931929807e-01,2.881404215669040259e+00,-4.533946021374251623e-01,-1.427465659585160362e-01,1.738333340191318577e+00,3.165512956997660332e+00,7.938187111174388466e-01,6.865267593178220329e-02,-5.158079926955880801e-01,-7.951136423768470074e-01,1.597635090927547852e+00,6.176080079253364330e-01,7.249635374232621388e-02,-3.165785815071578413e-01,7.027536081844336646e-01,1.363321644295512503e+00,6.592777525082071932e-02,-1.870180100780490240e-01,1.479686010646459771e+00,9.083287339262536841e-01,3.545334172975161957e-02,-4.498349655484058518e-01,9.704147732934115256e-01,2.334877816948400797e-01,-1.690529454437168511e-01,2.343441924482859040e+00,-7.707393489079165105e-01,3.442599261569203040e-01,6.333257844339268416e-01,-4.895939513937562770e-01,1.662261575398225277e+00,3.334474649823033210e-01,9.063642415295987131e-01,-5.460196431400805572e-01,-1.012584582890332374e-01,-1.107910678789554293e-01,2.089651361673555696e-02,1.268463285325078793e-01,1.308322279967624180e+00,6.754625738877548802e-01,-6.884456732436380344e-01,4.692676549728426183e-01,1.770694132342675697e+00,3.057495778766338157e-01,7.090504699680839629e-01,1.728407807628002057e+00,-7.639317297608152479e-01,7.838805193776419156e-01,2.140134629640889352e-01,1.116066934308318270e+00,2.227638309909955039e-01
7.265329240206530592e-01,5.576122297625982771e-01,-1.440504312207926407e-01,-4.641142845420745400e-01,-2.122050744707337788e-02,2.947245972868999253e-01,3.873061769679159161e-01,-1.647783669230722392e-01,2.080505357417317125e-01,4.332721474343799173e-01,1.081578748491268449e+00,1.097773254670700721e-01,-3.243483495378984838e-01,1.543214689211811486e-01,-4.681729844095345872e-01,1.915895396593893629e+00,-1.956572813416103118e-01,-1.698295834397989812e-01,1.455042974603935335e-01,5.523897092145241272e-02,-5.723950943866292773e-01,3.920143248712042450e-01,-4.332477071560756343e-01,3.094526994161534983e-01,1.529942569777595240e+00,-4.453598589592543400e-01,3.205763499863171773e-01,-6.171607599721775639e-01,-3.946673380954038857e-01,-8.433757723085502089e-01,3.189063309504895360e-01,2.286960507328454018e+00,-1.964615255952406048e-01,-3.317879869393880465e-02,-5.562677206335489011e-01,-8.103694008660824455e-01,1.118792027209975615e+00,1.164221554492454347e+00,2.008631863622158065e+00,1.415153141839636586e+00,5.728528016486968966e-01,1.789795558455579694e-01,-5.396588580264136126e-02,7.021592201866809491e-02,1.962126736369160240e-01,7.686356040813109303e-01,2.388985773678485636e+00,-3.075623011085277803e-01,5.087617647586977626e-02,9.618311313370592197e-01,3.920349667866430465e+00,1.485800302962734909e+00,2.976094133007193276e-01,-6.249639540376912272e-01,-7.366335401863913779e-01,1.685715559449080914e+00,7.793740348048767697e-01,9.483342284679976975e-02,-6.085314407390309821e-01,1.658470374943045833e+00,8.615406094132999071e-01,-4.866716616612982160e-01,-2.655017487825952482e-01,9.284782070674103549e-01,6.448677945102183617e-01,-2.367210021536582110e-01,-8.015788196998768766e-01,5.567282440775025432e-01,-8.280549172848199191e-03,4.162054443477576360e-01,2.445013728150324361e+00,-2.656601843533562546e-01,3.219991654251620483e-01,6.786469938236830979e-01,-3.268123147550384133e-01,1.373535826125605208e+00,-2.824197004579964143e-01,1.005986723708134800e+00,-5.820162969457015611e-01,-4.830805990443781672e-01,4.739781158098192448e-01,3.267369637396143056e-01,-4.878293270586714359e-02,1.425204022016204997e+00,9.726585845238652217e-01,-1.101221927143322343e+00,2.837683681936077340e-01,1.361480808920771501e+00,5.393412203346563683e-01,1.292438858307999872e-01,1.657023742029396951e+00,-3.168591263025375970e-01,5.143331560150086190e-01,1.674331935864892817e-01,1.136153474934709751e+00,-2.757497716936341270e-01
6.294113978413549138e-01,-4.289560875548242835e-01,2.523268231882083712e-01,-2.414177220367006993e-01,-4.700434734990686092e-01,7.252785029090573765e-01,2.275733744566351691e-01,-5.569892065522917546e-02,1.767889091558626724e+00,9.261126288385962413e-01,5.951654153780832068e-01,-3.470837323585662659e-02,-5.550498684818607753e-01,-5.989254445349417866e-01,-1.678522695715981006e-01,1.617214803805807621e+00,-1.071441961717600533e+00,4.622654901187851495e-01,2.220652683271781003e-01,5.065716518361533804e-01,-1.199057403324433224e+00,8.440497760104812563e-01,5.714253296737914489e-03,1.134050467666178480e-01,1.445225452208040551e+00,-9.448491390536661871e-01,3.163142415381296479e-01,-8.339846405261335249e-01,-7.234557876747462757e-01,-6.402923087333800556e-01,4.924807773088953899e-01,3.288587414740497650e+00,-2.507776746910942989e-01,-1.128393786087961981e-01,-3.132851597011666600e-01,-4.674592691573899450e-01,1.228849302093679707e+00,1.309696235515977358e+00,1.888058864418281191e+00,2.466186171321649745e+00,1.106723407526702285e+00,6.592799416259029766e-01,3.986352906109758010e-01,-1.940297025686799626e-01,5.878465197186495406e-01,4.583904382238039865e-01,2.836054184370162101e+00,-3.675698427497542942e-01,2.199761619200862328e-01,2.637996320685323526e-01,4.015269161894469363e+00,1.975287663444700526e+00,6.210565628691742113e-01,-4.775728936763136145e-01,-1.298442978183906416e+00,2.064679654871223846e+00,1.077278194739540451e+00,-4.441952266893919310e-01,-3.340488004797970145e-02,2.784939825258168078e+00,1.182728485734404034e+00,-6.672097101079483839e-01,-6.986443217483464529e-01,1.208822877431516840e+00,9.497621604191641698e-01,1.713783875752293850e-01,-3.562464123638642288e-01,1.901211177575033329e+00,1.093000089035958550e-01,-7.484752382028383444e-01,2.688866055595419802e+00,-1.919433619694596027e-01,7.763197194737908591e-01,2.589796819744963896e-01,-2.742567186526519152e-02,1.083097317639106105e+00,2.941555524893640916e-02,6.996519597570460824e-01,-1.018077897201942417e+00,-3.512026216254143240e-01,-1.805726619381460285e-01,5.845874489205895586e-01,-3.895666010941497559e-01,1.779094558424327843e+00,7.116960206068541073e-01,-1.328712216006254110e+00,-7.578247308810842631e-02,2.700067786110740276e+00,8.295032951598870774e-01,-6.324974635877410600e-01,2.452211598331597742e+00,2.806528725135959412e-01,8.405008687063789674e-01,5.474886477536835550e-01,4.101335221589115787e-01,-4.360128859827607783e-01
8.807309951538215831e-01,8.822958312790333268e-01,2.963758247354145725e-01,-5.401820647342667758e-01,-1.281726550280970489e-01,5.298584998320143846e-02,-5.253603784721416758e-01,9.620220915704580378e-02,1.739869899545806176e+00,6.157724013360721393e-01,4.652201286590889606e-01,2.912616317051125447e-01,-4.963414467828525245e-01,-1.140914348740114798e-01,-1.133824539205260384e-01,1.884312753600653423e+00,-4.340642062524726619e-01,5.095900568734610392e-01,7.299740803884796625e-02,3.882175621933636189e-01,-1.061311169439210778e+00,4.861430610136708297e-01,-2.594126172971161215e-01,1.520875441133648920e-01,1.343078884527540762e+00,-6.508857656597246688e-01,3.721114017114682815e-01,-6.259318829730968758e-01,-1.513565168442176923e-01,-4.814671695029294485e-01,2.858655158301069421e-01,2.657771694691641429e+00,-4.652881440576439598e-01,-4.813722488085096507e-01,-4.723475918672155327e-01,-5.694781912873004837e-01,1.206867827776391344e+00,1.380682453837110746e+00,1.404657996532373110e+00,1.982050339360296176e+00,8.110517327450508240e-01,3.109284240230262841e-01,4.040146474887342243e-01,5.643582179922600195e-02,4.741847343533814874e-01,6.413310938460929922e-01,3.175357954599199672e+00,-3.036904038429601438e-01,-5.325342632278638744e-02,1.463757907841326311e+00,3.558747840923052408e+00,1.100137830680784301e+00,5.525105747783110033e-01,-4.745161179783567995e-01,-9.226668679958039965e-01,1.697371234431000797e+00,8.106365875752985506e-01,-1.665877040406277820e-01,-4.726544568547039193e-01,1.474669180194796869e+00,1.195707935364009433e+00,1.235095980230727086e-01,-3.018883513908016125e-01,1.464899549961413694e+00,9.006743715713447784e-01,7.978053215190072933e-03,-2.713496597533457955e-01,1.180944255963573886e+00,3.320318485798680608e-01,-6.795882477117412002e-01,2.728799233590779583e+00,-6.302527646124356231e-01,3.528989534448160881e-01,3.464188874141135299e-01,-2.799829642871166646e-01,1.391008321660989200e+00,4.380227783374743278e-01,1.015145427849653892e+00,-7.911760226760932158e-01,-1.841760125065056153e-02,7.974434402440844227e-02,3.932132947423660485e-01,-3.790726891518819697e-02,1.249683387467958262e+00,8.401958368217400386e-01,-8.486675772739012968e-01,2.075047672113767283e-01,2.156795434034972203e+00,4.440876160508026027e-01,3.287820692240167597e-02,2.263661285931243938e+00,-4.818882692400722756e-01,1.050832916404649486e+00,2.292140644320236897e-01,8.516486281407793513e-01,6.187467899331222654e-02
9.082755797407934262e-01,-1.831090803142759738e-01,-7.566310165688944211e-01,3.727425845983280972e-01,-5.816596420629324138e-01,1.325295083587594958e+00,9.750753455029153027e-01,3.527096490444878718e-01,9.414273404527124800e-01,6.202208588548636659e-01,1.325990710597466871e+00,-1.381083730621156247e-01,-3.363756334890407595e-01,1.355913854974970523e-01,-4.548950175263681839e-01,2.274807080415671479e+00,-1.483977746251705365e-01,-9.541377584608878859e-01,4.216902749941904838e-01,1.438085599531797321e-01,-6.337496882959869904e-01,8.327667637092411868e-01,-3.144471158627052398e-01,3.082018404222536256e-01,1.210157041751194651e+00,-1.227070510983416574e+00,-2.054823813505409491e-01,-6.856250280270271835e-01,-4.259647047419345967e-02,-4.428792772688260326e-01,9.214205382426562396e-01,2.421465853183863981e+00,4.377222263658028800e-01,5.744815066459058039e-02,-5.878780161041539110e-01,-1.088315331208760117e+00,1.433232424167284691e+00,8.677498826871258286e-01,1.629853244517286193e+00,1.370845761598733947e+00,1.438341616892220509e+00,2.524745646784057884e-01,-3.392629107510329589e-02,5.690249415229459151e-01,-5.206843223833079737e-02,5.987134459347533966e-01,2.302921624995334593e+00,1.626246421985796109e-01,7.293989943754317640e-01,-1.676371443448463339e-01,5.540609143585792040e+00,2.184166202846988369e+00,1.223499123656217158e+00,-7.750751166757769983e-01,-7.268374161593355032e-01,1.444917492296907691e+00,4.453269931731410058e-01,-5.256696478484139678e-01,-4.517040939642001374e-01,2.635237357125248980e+00,9.328102296751198397e-01,-1.370995077793437655e+00,-1.070916742737905825e+00,-1.742485341934087995e-01,-1.849481408624358281e-01,-8.733055202075203916e-01,-6.611604410104324758e-01,1.164568206457895938e+00,-1.003145117654990370e+00,2.170886523699339099e-02,3.497782525305731305e+00,2.890914696640895509e-01,3.081931895523657428e-01,1.178923056492573007e+00,3.436476838540587497e-01,1.310888560117968060e+00,-2.984206687958380622e-01,5.865078200873328207e-01,-1.761328414973918344e-01,-1.178068101362736542e+00,5.636642981474038194e-01,6.212083430632896475e-01,-3.776333486950987917e-01,1.191791520426366269e+00,6.004995285421670381e-01,-1.166614307788586213e+00,-3.735092796466533138e-01,2.211804537555295269e+00,1.119992881296058673e+00,-1.393631974173174415e+00,2.294223710843624087e+00,3.379231945856229213e-01,1.076071708866717991e+00,5.035825118715124837e-01,1.875356519961987878e-01,-8.409687013396587307e-01
1.032393605496640943e+00,1.252538984800706467e+00,-4.103294852722796371e-01,-4.082945584169157538e-01,-1.636660992142890403e-01,2.661489107001023258e-01,-1.287729943535592114e-01,3.367507410572407878e-01,9.541557240842610810e-01,3.789199954874787890e-01,1.087986758168000057e+00,3.633549411157976916e-01,-2.878700374553964658e-01,3.931732443991796666e-01,-4.877913419134018991e-01,2.429082309665965500e+00,3.778749009421967231e-01,-3.282987467984299634e-01,6.519994060214012732e-02,8.779185018259715034e-03,-5.049342048560464535e-01,5.730993405120858863e-01,-4.973199458485710323e-01,2.390134226510156612e-01,1.371225736179668253e+00,-6.605027086088752775e-01,7.414217460665301074e-02,-4.921950886934534641e-01,1.145930373005434877e-01,-6.187922056984235253e-01,3.856375019671161031e-01,1.976171578690826269e+00,-1.714232853429172032e-01,-2.732275324371731262e-01,-6.785112883342306889e-01,-9.506290760769483539e-01,1.380991849898587365e+00,1.071645587925283527e+00,1.540730477525710462e+00,1.258852646129165809e+00,8.138939368344740855e-01,-4.124918115053749501e-02,1.065345148500169009e-01,4.542702144568439016e-01,-5.388737604299265183e-02,7.321693532540296534e-01,2.793367304945005625e+00,-2.058977671066794524e-02,1.148890102717205070e-01,1.319699621708203541e+00,4.345875607524701145e+00,1.257593811916167592e+00,8.462685709776458509e-01,-6.476089921328507248e-01,-5.390020469383551838e-01,1.408607227248609872e+00,6.147617285080495542e-01,-3.820644688657960641e-02,-9.955451616312257501e-01,1.505207930001196237e+00,7.783596645693349192e-01,-1.450595148347318397e-01,-2.932802907575048357e-01,7.652664340423781519e-01,3.396418857841989603e-01,-5.829316521693046482e-01,-5.915383657011754615e-01,3.277736207025301884e-01,-8.597090197414564150e-02,3.245175435108837991e-02,3.049899389504001412e+00,-3.193158496429354121e-01,1.017501713123870888e-02,7.162726553621692194e-01,-1.747780899491889195e-01,1.407071920080764205e+00,7.021046390878776799e-02,1.194029096180832417e+00,-4.437397851480667788e-01,-4.025673631957297216e-01,8.321592633418967155e-01,5.256574880777286074e-01,5.208077809756739285e-03,9.215051635470148383e-01,1.072513035308745977e+00,-8.771340355597023741e-01,1.208778968619720062e-01,1.458389167066665548e+00,5.206461586942181530e-01,-2.834523822397363446e-01,2.056179542321682874e+00,-4.903527941393146516e-01,1.003136416028713285e+00,3.897566427353207907e-02,1.019619792953937232e+00,-1.919015337594660586e-01
1.006810044352268063e+00,5.100219364045230908e-01,2.069321142990067086e-01,-4.642976628119965810e-02,-4.522440679759746063e-01,6.457107524781912078e-01,-2.291178145759517615e-01,3.765820869071899724e-01,2.717453327458010826e+00,6.442239538789640285e-01,-1.721301394996560541e-02,3.306953724730664346e-02,-6.367945048002494612e-01,-2.959978935678751477e-01,1.362710311225602267e-01,1.635472440769734082e+00,-7.906328373712241397e-01,2.221002581517049213e-01,2.084584375147676139e-01,5.989874425032715166e-01,-1.374447239647510699e+00,5.869523937512653999e-01,-1.996063441534757787e-01,1.018596004249231191e-01,1.125408861099667313e+00,-8.833033712102918988e-01,4.510053644741579548e-02,-7.272573841837670638e-01,-2.815026813154661856e-01,-2.275993149728561260e-01,6.895121499119813979e-01,3.002998483126607887e+00,-1.273393165166419316e-01,-4.567284346497015313e-01,-5.184044960227780496e-01,-5.298758162572629882e-01,1.579448554303209740e+00,1.124707161090511720e+00,8.981801118142571649e-01,1.844349415478717003e+00,1.407872065505967996e+00,5.938985507494796146e-01,5.062037919700486110e-01,3.034171167023841376e-01,6.845283003875302086e-01,5.846377054512486016e-01,3.247311229935688992e+00,1.175154882422280167e-01,4.117603085135200236e-01,6.603554778041388351e-01,4.365023768348906152e+00,1.595262352660757221e+00,1.067851382662881932e+00,-3.737927469545857528e-01,-7.882371886912737935e-01,1.419368744260143256e+00,2.510723604975730328e-01,-7.406458054047753148e-01,-2.271632673920224166e-01,1.774997412894017357e+00,1.126552455593939905e+00,-2.538401106429018506e-01,-7.329707607456484864e-01,7.148985256029568580e-01,7.141128293454259701e-01,3.896929277788385715e-02,5.384753270244013734e-02,1.970300371435770082e+00,-2.996193583322163123e-01,-1.165821521650014958e+00,3.180794563441463829e+00,-4.423498014892404684e-01,2.841668192144849447e-01,4.115872047849575832e-01,2.728382302748156296e-01,1.142122280930571776e+00,5.543187530803104224e-01,2.907028810733351953e-01,-8.009384513648185600e-01,-3.611623405535692166e-01,-9.008721230672300795e-02,3.124236311581432557e-01,-3.691737284602463198e-01,1.300478825474354894e+00,3.083225594022992455e-01,-8.160190345154432201e-01,-1.655778254389035364e-01,2.747899471197730925e+00,9.417852497717804638e-01,-1.100227945701671484e+00,2.634040137389678904e+00,-2.205104053542898956e-01,1.687795898855485976e+00,6.145300955755849115e-01,-4.616156245342871167e-01,-2.405314701961964174e-01
9.610433074961739486e-01,1.066532858590047983e+00,1.445430177442141861e-03,-5.225753909262156327e-01,-1.560711549908890827e-01,3.654584086067647064e-02,-6.491092075092215197e-01,2.593999968654547295e-01,1.492026620187998365e+00,6.547528749870221709e-01,9.759711832742572479e-01,4.590198981082980190e-01,-3.758248338404927558e-01,1.168473453631748010e-01,-3.069795189074812081e-01,2.411692965785982246e+00,6.020598024289608441e-02,3.140613823574670560e-01,7.613415291869723989e-02,2.451110436079926014e-01,-8.150118630468072833e-01,6.421204798753685772e-01,-2.807776379848632153e-01,1.799375122335390431e-01,1.308631358665972133e+00,-8.941249001155442411e-01,3.196958580322600274e-01,-5.333665676350622942e-01,3.061206205164999083e-01,-4.124211060169613585e-01,2.649948300107891064e-01,2.326086747167428026e+00,-4.277405818020995065e-01,-5.444287256030124755e-01,-4.892050464534633547e-01,-7.847813175623175042e-01,1.117113110732302683e+00,1.427096863850584096e+00,1.473550208097486047e+00,2.005385104052968881e+00,8.012852275658870482e-01,3.939948764486389532e-02,3.704235088062139969e-01,2.182857216668491751e-01,1.098442241939380781e-01,6.054895600769862885e-01,3.196708154322178252e+00,-3.391036857794770265e-01,-9.265972817526220429e-02,1.723597971636844584e+00,3.789640873039660907e+00,9.256160650679716717e-01,7.268257877011898849e-01,-6.402629636782743994e-01,-9.570791420760451640e-01,1.709727843248481927e+00,1.040222725288566519e+00,-2.518984734737492182e-02,-7.107845642851708945e-01,1.588594662740481889e+00,1.281348046658972173e+00,1.195438701087777611e-01,-3.418805503497481801e-01,1.500697601434635597e+00,5.508404794377582681e-01,-4.390685082672327599e-01,-4.075872176415145653e-01,7.446594722739304784e-01,3.377588567722711321e-01,-5.752286377816591134e-01,3.045679790308311929e+00,-5.488280696323197816e-01,3.002235087228989907e-01,5.694720496264260579e-01,-3.744555603526416032e-01,1.600839366151664667e+00,4.547794218660743959e-01,1.462275623460875362e+00,-5.205258921344019241e-01,-4.859470024255230225e-02,3.594313664867957447e-01,6.411034008100607862e-01,1.065448662632627053e-01,9.279056771230925760e-01,1.114401002041673028e+00,-8.158864497535150972e-01,1.595732649270824033e-01,2.100605440261489321e+00,2.980516118185221330e-01,1.405729528261932537e-01,2.368900624165490854e+00,-4.596577202028320763e-01,9.483757387147246920e-01,3.294145120067809573e-02,1.451665290791003926e+00,8.145808197250020699e-02
9.673509783223330771e-01,2.173724845099820779e+00,2.347647116687527902e-01,-9.117421569454648989e-01,4.669560571733409327e-01,-4.923962470547757486e-01,-1.817882103503925539e-01,-1.857097133908341691e-01,4.244820134036361159e-01,-2.172164452936659884e-01,-1.291962171409305471e-02,2.321487052585509969e-01,-4.173698245461112122e-01,5.116815044879938768e-01,-1.672922244188893015e-01,1.325588123228979454e+00,-3.603269002454168035e-02,-4.680519793214719948e-02,-1.208237749243709358e-01,1.010543183180468568e-02,-6.535545646168419154e-01,-3.659901830501846032e-01,-8.699342410661209390e-01,3.096901314114428594e-01,1.536369244113405585e+00,5.794096821199921088e-01,3.451549540223387558e-01,-4.793502058223870765e-01,-6.570719258608641589e-01,-9.403559540414261342e-01,1.047490050047313603e-01,1.863228191196154349e+00,-4.658627488761823976e-01,-2.476188457763525697e-01,-8.580442235618951363e-01,-6.087132834966151318e-01,1.467022228335906231e+00,9.532118587755219474e-01,1.303912281589427069e+00,3.149242952237865101e-01,1.794183459764432942e-01,1.679919085467963535e-01,-9.785584681867071088e-02,2.202331792961361168e-01,6.224603243508344264e-01,1.140542409501385190e+00,2.627721842862919210e+00,3.986575809782823276e-02,-1.616739321690021103e-01,1.889845077494835657e+00,3.147776924361289197e+00,8.450328480030129263e-01,-2.850148070606206563e-02,-2.853788591841789901e-01,7.872723267041520367e-02,1.018309615097899634e+00,-2.103874889906645063e-01,2.040128080838552183e-01,-9.957122522793453445e-01,-3.048185176357809389e-01,3.392857245999405524e-01,5.317109835950257768e-01,4.397558745664109647e-01,8.446433119389752386e-01,1.190998383143539341e+00,3.562099108261877478e-01,-5.198943644613088777e-01,1.184333328089447468e-01,1.394138376264992263e-01,6.257568136588191887e-01,1.882822569349252184e+00,-8.903163357829286806e-01,-3.386205416887559383e-01,3.454123365559688685e-01,-3.816321788101257884e-01,1.207383030506560262e+00,1.673831831966487993e-02,4.855917732348650206e-01,-8.411653194709456383e-01,-1.092201483021539854e-01,6.441314274040754739e-01,-4.173036006239598250e-01,8.395434724421857453e-02,1.322536373260092324e+00,6.822793263833445421e-01,-5.844741360868860314e-01,7.405125611144098841e-01,3.139756799016930611e-01,4.089497486138482518e-01,5.501783239047965957e-01,1.060792484362085286e+00,-1.415245666847935624e+00,1.034090632905981577e+00,7.795556456255300914e-02,3.558486951029342094e-01,2.060748474034739264e-01
1.066561892246271182e+00,1.517827058402421603e+00,1.927443983264314764e-01,-5.269799185002537190e-01,-2.085569309856659947e-01,3.704729324408379543e-01,1.451358377865870908e-01,2.612169594412743212e-01,2.313462836844164983e+00,-6.958690119233221227e-02,-8.910564364691513362e-01,-3.465118472899886282e-02,-6.480044625159647742e-01,-1.137130826821521196e-01,3.562611205987509244e-02,8.650671125448365917e-01,-6.964162746123307990e-01,-8.923387894389300801e-02,-1.518038159567625112e-01,2.868525821902898620e-01,-1.112045147893288455e+00,1.616723335191898592e-01,-6.505080631178100647e-01,4.598943895483947886e-02,1.524848659946690166e+00,4.213360058217761051e-01,-1.457853897736459403e-01,-6.928550511295503700e-01,-1.556619487449889760e+00,-1.018741613508725941e+00,5.142086498224605062e-01,2.714450041170014760e+00,-2.225548236936274460e-01,9.757012090055985909e-03,-9.042662299696254680e-01,-2.921662999876118993e-01,2.306655749471670624e+00,4.786248225548772606e-01,1.004527624684625531e+00,4.392815405729053602e-01,1.000548033607102649e+00,7.534707721872000441e-01,2.333720688198719917e-01,2.990173267215136543e-01,1.010238317332737612e+00,9.258926096917985404e-01,2.837537457100940852e+00,6.558878595402399814e-01,4.003593045393883942e-01,3.717879791200910389e-01,4.135691882526158381e+00,2.046565862735079566e+00,7.649354458421251390e-01,4.748589782183559871e-02,1.412599661117666106e-01,9.138846142067065248e-01,-6.970428297582008659e-01,-6.856641946529156151e-01,-8.167227559298375628e-01,9.455552611761917081e-01,-2.612310504920729581e-01,1.873091577895483195e-01,5.659642566928034524e-02,1.692783482585680233e-02,1.464544072760545435e+00,8.971539292129558918e-01,6.359903993198967598e-03,1.366059915647419798e+00,-2.881707458350044049e-01,-2.600544459661324748e-01,2.248006196098339071e+00,-5.401693701090848343e-01,-3.553621613626776199e-01,-2.726328864446913025e-01,4.660125936337918828e-01,2.818644962766443385e-01,-1.125317841134126917e-02,-5.192427775997514594e-01,-1.554586674788609679e+00,-3.366258309118129732e-01,6.033575923979401789e-01,-2.914379131644449505e-01,-6.173673350733188681e-01,1.771226443631297220e+00,2.155791611713051559e-01,-9.287735423352244668e-01,1.729436846916496962e-01,1.070430828256799138e+00,1.222902736252561962e+00,-1.446054750027449654e+00,1.775590655664082362e+00,-8.083779577660361593e-01,1.894677315988795296e+00,6.238207163801190447e-01,-1.792645059024946308e+00,-3.984785471816399416e-01
8.196108959262848881e-01,1.486621626954751640e+00,3.300873290068796484e-01,-5.968331816983764027e-01,4.958888609557626226e-01,-1.955650323948009972e-01,3.738312710571234376e-01,-4.464688153418925332e-01,7.271823346011474509e-02,-1.711894670603923696e-01,-6.594928110558906376e-02,-9.875536021753539284e-02,-4.812917327940679502e-01,3.975844644205731027e-01,-9.267479107368803426e-03,9.425590833920665101e-01,-5.318689122148118065e-01,-2.059298811783300820e-01,9.771397177821045110e-02,1.399014299509108161e-01,-8.168802379711594952e-01,-5.644207609197015030e-01,-8.286781866462740176e-01,4.177736183146912863e-01,1.439159067296820416e+00,5.053283718974721506e-01,3.978915303856489505e-01,-5.883539611079354748e-01,-7.610873299204564679e-01,-8.117114014068933514e-01,2.992472658264285212e-01,2.100368608562815709e+00,-2.353869664533944916e-01,-1.463294938360390485e-01,-7.792990164007043141e-01,-6.119502136408547788e-01,1.282774865708827372e+00,9.747229878452456919e-01,1.302581658304168943e+00,3.076033056865639104e-01,2.832120675468497439e-01,3.630274164312939922e-01,-2.431784686977094267e-01,1.494348781030551132e-01,8.216797321030772094e-01,1.175546006433408230e+00,2.313011715178885375e+00,-2.289409934209080122e-02,3.240222893368883972e-02,1.412857325922074025e+00,3.280665468705643129e+00,1.039809901812903892e+00,-2.150668534307321744e-01,-3.270891889447860024e-01,-4.833194707160370918e-03,1.025077621012483231e+00,-3.835332585422180918e-01,9.147497116552999463e-02,-5.303438068127448446e-01,-2.930818381848780962e-01,6.080767851172477201e-01,-7.722086088823854055e-04,1.499409918646271989e-01,5.684542666589927906e-01,1.079151346999092986e+00,3.746495078991279870e-01,-5.809561552561386399e-01,5.726622941380675735e-01,-2.591140945162281328e-01,7.678583064893752530e-01,1.783798104042581656e+00,-7.734744565590681020e-01,-1.381967537309344296e-01,6.551707767970511576e-01,-2.898210191991296147e-01,1.327873739929767538e+00,-1.244537285860035647e-01,8.423578466779507723e-02,-6.415045549574174277e-01,-4.316778134638614151e-01,2.297891761556326018e-01,-6.432110433323501297e-01,-7.337638976138705083e-04,1.551408422149632038e+00,2.980795690615171134e-01,-6.014832755914146789e-01,6.936774539857653021e-01,5.813176663913874886e-01,5.856552792814766484e-01,5.204396335854313271e-01,8.869255466949796940e-01,-1.217223003937540682e+00,9.305052500734465326e-01,3.293511168067598249e-01,7.512503400099625195e-02,6.818333236198331759e-02
9.408489778003075177e-01,2.193219649769810875e-01,5.157198803321280667e-02,1.754866072625513862e-01,-3.284720125143199554e-01,7.256496530037650494e-01,6.186270559002771119e-02,2.226116174407457016e-01,1.902820437570877043e+00,6.863268013866942185e-01,5.083508496557853640e-01,-5.770447243122284187e-02,-5.520172889340122513e-01,-8.006934420056717461e-02,8.450595934161009293e-02,1.837329177129623847e+00,-6.752154338969751368e-01,-7.045450682465341508e-02,4.052177656556177898e-01,5.465979469377653110e-01,-1.234390235941997371e+00,4.461082008657694664e-01,-2.245518802369501632e-01,2.650398224830602389e-01,1.002523024920865868e+00,-1.128257136238067559e+00,1.300933891643032414e-01,-7.012718620025415461e-01,1.986925401334640462e-01,-2.619592189296460205e-02,7.701455975388159514e-01,2.768687360757366545e+00,5.921247302487969710e-02,-4.856400403519563480e-01,-4.597109193707765717e-01,-7.722292233135461537e-01,1.199129670258084701e+00,1.268824706206495900e+00,9.759559531275742161e-01,1.828651851754929059e+00,1.350774161566164366e+00,4.247313684263275824e-01,3.006822994675122374e-01,3.780084405133291581e-01,4.823964833098862703e-01,6.248846919718654691e-01,2.976726561701556584e+00,-6.782385821730198272e-02,4.469624787148259726e-01,7.639609835552548800e-01,4.499703449293956048e+00,1.379548788620755362e+00,9.246490023704131422e-01,-6.075223778671277053e-01,-8.918562496665747297e-01,1.438852817890051705e+00,3.655064220274699127e-01,-5.664241599199218991e-01,-6.157939738411211117e-02,1.625013796627380325e+00,1.547298989420506032e+00,-6.365881334440581796e-01,-9.502643837960040862e-01,6.533128055883630214e-01,2.662204664971556944e-01,-4.252826152876246768e-01,-1.930410362908197008e-01,1.775753659494395897e+00,-5.675419153431554564e-01,-8.192199202763268406e-01,3.315488026033394764e+00,-3.476273081167299273e-01,4.045192889650972012e-01,9.829690499758243494e-01,1.249980524031052004e-01,1.597358802696801305e+00,4.759674104580084442e-01,4.976895788684989053e-01,-2.634935601769705649e-01,-6.182342573404484565e-01,-2.079438029549790512e-01,2.989746060051078347e-01,-1.902400433688329340e-01,1.127454560904611380e+00,2.817949146528587745e-01,-7.227137704844106558e-01,-1.467513246545344985e-01,2.807780414175886641e+00,8.228130488375672291e-01,-6.817762425018587535e-01,2.456304991072168153e+00,-1.559054587092797428e-01,1.382683701988330238e+00,5.680762312290477123e-01,1.738534764778833785e-01,-2.224976305044480962e-01
8.287887284627404316e-01,6.456750942807092386e-01,4.502463688710762191e-01,-4.527775474717965487e-01,-9.474847511641069919e-02,4.605338246085149967e-02,-5.702896801575643160e-01,1.897598857353050006e-03,1.778301923842991128e+00,7.264238493980547107e-01,4.664223916217058452e-01,2.352046041026108480e-01,-5.364529778234196078e-01,-1.917406492824008657e-01,7.346070618842515110e-03,1.823077201845197504e+00,-6.417875531207775097e-01,6.540670025246431152e-01,1.672486277571037516e-01,5.102893428868615633e-01,-1.209875140073680022e+00,4.226143409567476583e-01,-1.811344510442486344e-01,1.848428509059731883e-01,1.250021557387377857e+00,-8.049490243614411122e-01,4.798549167288765904e-01,-6.572992726402721031e-01,1.839283228547561322e-02,-3.027281971662147964e-01,3.145648939083532936e-01,2.792699199074150762e+00,-4.666180537378323834e-01,-5.919500192889430856e-01,-3.803205256512527388e-01,-5.542310833545123216e-01,1.009246602225004619e+00,1.541496284286540508e+00,1.326967634477052904e+00,2.233228024252346344e+00,8.419471749910272251e-01,3.550091067415835910e-01,4.418724036904992380e-01,-7.406476865846015056e-03,5.561446669229043183e-01,6.150485339703446463e-01,3.234565130958926726e+00,-4.477703758170456516e-01,-6.787768211618262770e-02,1.550574967518469460e+00,3.421147496184685721e+00,9.521181585857364515e-01,4.633330562235816741e-01,-5.189846989590389814e-01,-1.095281385615461511e+00,1.779778885731692295e+00,9.041308419650002648e-01,-1.768477681885463060e-01,-2.269313642930484987e-01,1.418470062477000582e+00,1.536447821296234473e+00,5.204062821034702302e-02,-4.364468871864695121e-01,1.643717253965533365e+00,8.566616752850791938e-01,-2.684476782173705889e-02,-2.323886632399845276e-01,1.427050617488637041e+00,3.242333896782583769e-01,-8.492845010529250782e-01,2.761931380980090278e+00,-6.904576072412407228e-01,5.075920884686850876e-01,4.815967136880063837e-01,-3.436819178668172325e-01,1.586306033482366651e+00,5.757457941954420289e-01,1.034627853396673069e+00,-6.574623013967015872e-01,-6.718715611152115130e-03,-2.255287835886427006e-01,3.639608409863648308e-01,1.578827348324485236e-02,1.244361033782883208e+00,7.307808699480971004e-01,-7.777498161002096566e-01,2.079217671708488424e-01,2.493186458377886439e+00,3.850675862705816854e-01,2.390696788104099135e-01,2.325025434029811322e+00,-4.406492862626859575e-01,1.002916313287011141e+00,2.846943019622310556e-01,1.014720904893454900e+00,1.518074520106996728e-01
1.198328906584638309e+00,1.021981306174871484e+00,-5.843660427344832264e-01,1.681342826923623024e-01,-4.657342485805258669e-01,1.033550518157017040e+00,6.209260632337707531e-01,5.988424310233614323e-01,1.838172422659198002e+00,1.074668768864306262e-01,1.701119274369349288e-01,-9.720928439651130293e-02,-4.697478383746285791e-01,2.764074520546923042e-01,-1.858817568625885097e-01,1.744632649537986469e+00,-9.787577113766171566e-02,-9.894188439404146829e-01,1.749651475382714150e-01,1.562746873612626819e-01,-7.943774531685607876e-01,4.545024583681235297e-01,-6.248601824766489843e-01,2.059619173890551713e-01,1.203300570607954922e+00,-4.685801643937859695e-01,-4.420029160928200529e-01,-6.231863805150533731e-01,-5.235889481472617568e-01,-5.547743777033133927e-01,9.188474305466343139e-01,2.280642187060646364e+00,3.451415380847952519e-01,-1.600166607375891337e-02,-8.945661146136281161e-01,-8.623210097134841323e-01,2.101654825551483974e+00,4.587984910980552611e-01,9.096328574587948523e-01,4.090419072446900284e-01,1.457164265305408879e+00,3.988673593269724260e-01,4.108555386777086593e-02,8.136563599991137874e-01,3.487569658811080497e-01,8.263999043272131084e-01,2.579630999447453998e+00,7.549933398065248324e-01,7.967096780734741479e-01,2.914592279906680350e-02,5.433840145069375183e+00,2.122705888553113152e+00,1.364263870283305868e+00,-3.899321641271726868e-01,3.740627066082136132e-02,7.932678409263940189e-01,-5.907949087224936280e-01,-7.764194031101618876e-01,-8.206170977988198612e-01,1.506914942587974870e+00,1.972442776934436592e-01,-6.560947995576076330e-01,-6.345020665294380802e-01,-6.646869828204434727e-01,2.710968091619255782e-01,-2.866426543644678970e-01,-2.445298922753521564e-01,1.144347724922470944e+00,-1.097611849743367118e+00,-1.011884527095665010e-01,3.283049583377985581e+00,-5.349593772345034859e-02,-3.209367150730045304e-01,7.047615955749338967e-01,6.557329204567526881e-01,8.129394864626202644e-01,-7.473444246847910089e-02,-1.777071751270504762e-01,-6.165388246989875753e-01,-9.923839891393685386e-01,8.347106953639661375e-01,1.055533680500421873e-01,-5.300114881605448858e-01,1.184903717189824901e+00,2.337214856341502944e-01,-8.605818578431196908e-01,-2.469029851075030257e-01,1.557883338406133023e+00,1.334152670225476012e+00,-1.910566312436698944e+00,2.102506323068464411e+00,-3.481978635686759360e-01,1.882213024256437883e+00,5.980392890436343478e-01,-1.272095535200970851e+00,-7.039364092614984747e-01
1.337260270930713979e+00,2.073931829897349921e+00,-3.376487520035554857e-01,-6.247739193599102236e-01,-4.605775498060721840e-01,2.047883327234876760e-01,-8.236897165640781893e-01,8.977357620025384621e-01,2.746070384798075192e+00,2.674563881872598636e-01,2.043783568122865268e-01,6.008715068178041019e-01,-4.183305674673616359e-01,2.030020913212836620e-01,-3.646151831056162473e-01,2.368846281042429336e+00,4.856490301957513966e-01,-4.062918046269403671e-02,-2.497640667180638097e-01,9.578655693668869375e-02,-7.299422327679516709e-01,8.658366057247662839e-01,-5.044377772529458070e-01,-4.502606846132761742e-02,1.414418804619814951e+00,-4.362041835091273745e-01,-2.456094914968246778e-01,-4.692929327123609440e-01,-3.070170642440261943e-01,-7.312701330550459566e-01,3.712273687255543408e-01,2.178240636265018182e+00,-3.775532254964472645e-01,-3.804083602361811312e-01,-8.526055727736978618e-01,-6.679497875562893094e-01,2.156151238097745892e+00,7.610965602752570724e-01,1.033703418602486046e+00,1.127167399209858534e+00,1.126341352732695089e+00,1.237515339278434934e-01,5.137750567486710773e-01,6.195640809100465551e-01,1.479256682099912013e-01,6.577530007656644528e-01,3.444492580933014914e+00,4.984593164827081369e-01,1.737876383908567857e-01,1.281239510934398584e+00,4.505824147021991521e+00,1.489672363503747210e+00,1.447847222997403982e+00,-2.937446971076694280e-01,-2.214176948193282424e-01,1.143884383738980937e+00,2.166872763192385087e-01,-4.633529815479685565e-01,-1.426507961913984879e+00,1.599594781931945375e+00,1.001598480381696021e-01,5.808569571332754533e-01,-4.665425155620522846e-02,6.288839780011106217e-01,7.946566121119940096e-01,-8.801060387132947360e-02,-4.288445879341118427e-02,6.011766076547372384e-01,1.496108997504203286e-01,-7.731706336295645077e-01,3.267005968569555829e+00,-4.823950485169329894e-01,-3.809612625423912102e-01,-8.289366228839981088e-02,2.197956333521719485e-01,7.266234338610945143e-01,4.269283137258132466e-01,8.579521836292081094e-01,-1.145101724870980497e+00,-2.914986869226249278e-02,1.179778076198327641e+00,6.152303451952114699e-01,-2.716033878011376856e-01,8.798597491169339868e-01,1.060448749817167746e+00,-8.504948795150240048e-01,-4.782501373402753275e-02,1.498812681595224294e+00,7.608937083516895683e-01,-1.302328955592867210e+00,2.587743089242094285e+00,-6.842350740037089762e-01,1.860971770587214191e+00,9.603583992074482545e-02,-2.216437759069810332e-01,-1.986501973945383193e-01
1.285075889240760549e+00,2.409581500834235612e+00,-2.629670520662916733e-01,-6.744080898771058763e-01,-9.109760774623464064e-02,7.191322142887177082e-02,-2.340555139664966533e-01,5.439312819948286526e-01,1.817173683283872743e+00,-2.299648670358774016e-01,-2.574491866537441109e-01,3.261968948287695680e-01,-4.372387281419259919e-01,4.512857700440184860e-01,-2.694794621627175091e-01,1.664755056522742915e+00,3.169155519308965441e-01,-4.404177097957618359e-01,-2.508713105178550506e-01,-3.219859254096054529e-02,-6.291781724735713288e-01,2.103990032299264679e-01,-8.493415862488045143e-01,9.919532710668060860e-02,1.498872205178575223e+00,3.468107796006889010e-01,-2.367214035744071576e-01,-4.700109961461577113e-01,-8.381559801902351836e-01,-9.814242149334347909e-01,3.836020888034320508e-01,1.922911141879271923e+00,-2.470618126081354504e-01,-1.381496460100962720e-01,-1.046205991167570293e+00,-6.339637869506589141e-01,2.264252631006673511e+00,4.746745843268607712e-01,9.712164441740391840e-01,8.009430202907186214e-02,8.136563250619609500e-01,2.284727727013362297e-01,1.302003359617777134e-01,6.389528267045623267e-01,4.454589100433624660e-01,9.893834017180509477e-01,2.909136180161848273e+00,7.030096407167543138e-01,2.433949720265111138e-01,1.145304336170801962e+00,4.307449794816174737e+00,1.541479139777465424e+00,9.589665748712463689e-01,-1.505003736411562598e-01,3.639245486661727425e-01,7.272135928617342593e-01,-5.770894503443936285e-01,-3.524180373982416237e-01,-1.432522464468062307e+00,5.379565949603863917e-01,-3.372445807094905934e-01,5.104870076908827325e-01,2.529452582126460181e-01,4.553869410471822476e-02,1.007997022686862199e+00,2.655311702996138723e-01,-1.962337802638867146e-01,3.273132821307511708e-01,-2.082372100244180846e-01,9.010563789000947121e-02,2.608224324125350879e+00,-5.743584671917467688e-01,-6.828586977937615154e-01,1.311234091446686345e-02,2.569151513713383017e-01,5.898072835038579154e-01,5.702174900643125488e-02,1.661924872488746985e-01,-1.159108159084158762e+00,-2.744618198668513642e-01,1.242316192846052658e+00,-6.646450778670612292e-02,-3.050877292545397523e-01,1.158101885822766519e+00,6.759081166081351011e-01,-7.303992258148168659e-01,2.514779829182042237e-01,5.209296684300217528e-01,9.034683153953240176e-01,-1.090459933610029797e+00,1.728142926170884053e+00,-1.127550267733396172e+00,1.826511775704898088e+00,2.061102308624531976e-01,-8.939109783382657159e-01,-2.234436955790608248e-01
8.894492536986199349e-01,1.459687231810345764e+00,4.063857822715455370e-01,-9.214162104299425948e-01,-5.651631934248148303e-02,-3.718865896094980528e-02,-1.679514284811399194e-01,7.449279497428129559e-03,1.840909711949710204e+00,1.031272128548591238e-01,-5.217854972014017712e-01,1.618218228614036192e-01,-5.830249937528061421e-01,-2.098422967317333798e-01,-1.229021626946863455e-01,1.029287501222337031e+00,-6.600939453288785508e-01,4.111126505677284992e-01,-2.442699055391907570e-01,2.350530896093547817e-01,-1.012328985220964039e+00,2.446113791830885620e-01,-5.380842506490484123e-01,3.220953154237563010e-02,1.713551916141526243e+00,4.357745564283158624e-01,1.850485852376743123e-01,-6.747134901562753528e-01,-1.530417902110744244e+00,-1.198340824166724827e+00,1.801097013371601441e-01,2.737522108831260681e+00,-5.652773218058253502e-01,-2.965978135576008423e-02,-7.573300678518396500e-01,-2.227021184597186010e-01,1.945543243670830869e+00,7.988127844333380301e-01,1.509355069200267740e+00,9.927527433509613086e-01,6.005808591208419145e-01,6.391289920708944639e-01,2.839876707968214120e-01,-5.234365450101663431e-02,9.190463156325540117e-01,8.601073546098475520e-01,2.898778915973547310e+00,1.899957295188771378e-01,2.436148654445857709e-03,8.883571339936258138e-01,3.389337331974747514e+00,1.749158414945575890e+00,3.630420610840169315e-01,-2.023653963193688954e-02,-2.292732390628138550e-01,1.358003522334120916e+00,1.394944239276774134e-02,-2.980436602689127135e-01,-8.352991655204896615e-01,1.121105119120022975e+00,-4.862806835785296600e-02,4.454148127344792485e-01,3.035898200668651903e-01,8.706384843982498678e-01,1.731728233822150020e+00,9.810662761246826680e-01,-1.842334643937672545e-01,1.064016452618102404e+00,3.751683187321705470e-01,-1.748616883459318538e-01,1.895854852930704659e+00,-6.732533639034519179e-01,-9.219639596488769795e-02,-4.601713005933706357e-01,1.394196628007850214e-02,4.444996012369088478e-01,-3.960274260371871025e-02,1.213912470056311421e-01,-1.678482528917635275e+00,3.024881625312836331e-02,5.291627471032568364e-01,-9.303255856728298578e-02,-4.079867996454907830e-01,1.854228435339084324e+00,6.668870711784850025e-01,-1.065111999736836124e+00,4.049326436762619719e-01,9.892607345091632975e-01,8.296742556452720851e-01,-5.801934378530008152e-01,1.696791660673025781e+00,-8.106397376023466439e-01,1.334224138070498000e+00,3.760100511839888915e-01,-6.845038877845752712e-01,-1.733929863431235563e-01
8.952386469942348324e-01,5.473471148430217870e-01,4.960627481658739235e-01,-2.952719270208402635e-01,-2.299433375709853400e-01,1.955265604091039333e-01,-6.752984451008292588e-01,1.491076898028998732e-01,2.381564900429228970e+00,8.079968896340536944e-01,2.640961186091647650e-01,2.012390468703615376e-01,-6.069161945887630027e-01,-3.027953214022059414e-01,1.459665008029902289e-01,1.798261293251609994e+00,-7.835575905894939241e-01,7.063449829296361004e-01,2.104457342829989530e-01,6.471089167344400428e-01,-1.401287499844608320e+00,5.032405137027762265e-01,-1.067236740101531467e-01,1.413972394238333652e-01,1.130901191629991143e+00,-9.870139540573732440e-01,3.967615532571657777e-01,-6.890594601641950590e-01,9.629494269063076928e-02,-1.205848515915648456e-01,4.377474142833384652e-01,2.974342311151598750e+00,-4.104448523088431999e-01,-6.913186668115096634e-01,-3.597020489513106933e-01,-5.137217116660655059e-01,1.103770769455341805e+00,1.536523819113084111e+00,1.061569645529479189e+00,2.372830243667031436e+00,1.088845194551310680e+00,4.503660260311819208e-01,5.737270518426593746e-01,6.839330670637920606e-02,6.435862456801746401e-01,5.536580195364297907e-01,3.426627088269837529e+00,-3.463627419581760680e-01,5.266645767503264769e-02,1.418335985157174184e+00,3.618224451091080152e+00,1.008448959072508311e+00,6.912674993868844764e-01,-4.849739160930779946e-01,-1.138628965327140641e+00,1.726503997797983914e+00,7.990604626287669543e-01,-3.997678095147498833e-01,-1.079484890405623121e-01,1.532394616059864045e+00,1.644374037952311518e+00,3.107359271283710589e-02,-6.133298344390967216e-01,1.554248904322819591e+00,8.035357828744025266e-01,-2.512366468603111080e-02,-3.554094095159732181e-02,1.800899494933484668e+00,2.004431162320144122e-01,-1.247296441083455942e+00,3.008576119624556178e+00,-6.922300278617441460e-01,5.235209171452979149e-01,4.729695634464807785e-01,-1.782952386740198070e-01,1.557244237331794956e+00,7.728185093281623175e-01,8.726201880549733225e-01,-6.605317492201387974e-01,-2.355867773669928500e-02,-3.730192257608690998e-01,3.944577564007646919e-01,-6.853589146962543732e-02,1.196066429249545537e+00,5.619951841342228915e-01,-7.185633111908522608e-01,6.024143802909839862e-02,2.903993603404358748e+00,5.011915720517350348e-01,-1.090645707097643302e-01,2.601427280044878998e+00,-3.582434652397374353e-01,1.283403250773784254e+00,4.062263228038456297e-01,6.456145276448246317e-01,1.289858949281039724e-01
8.264539480336083876e-01,6.019545935922172575e-01,-4.926504501629951072e-03,-2.680463089234580432e-01,-6.528309447756883155e-02,3.669633023996444199e-01,2.303290445690058530e-01,-4.671562160958966925e-02,8.478138742657859162e-01,4.397331053330781891e-01,7.013227909705732621e-01,3.731820957554111973e-02,-4.290907361135853360e-01,1.021681292458360563e-01,-2.063220697524666969e-01,1.764798384042538526e+00,-3.989921192681822326e-01,-1.214510238115521501e-01,2.197665514839095557e-01,2.436629890047621871e-01,-8.464680130475956688e-01,2.903180889874143467e-01,-4.124759293990777342e-01,2.995577304506469307e-01,1.330222399358287344e+00,-5.555129121542058401e-01,2.585120674589956868e-01,-6.394595793521979932e-01,-2.315684773039962119e-01,-5.478119708282304101e-01,4.702590010349643190e-01,2.432734008738087095e+00,-1.242372983565284139e-01,-2.211082841600788274e-01,-5.561010663428213041e-01,-7.626421512978990291e-01,1.186420949178272233e+00,1.174026401961222987e+00,1.528179700930200280e+00,1.416128973605014441e+00,8.140153449707636657e-01,2.894401680202015048e-01,6.228965336812052056e-02,1.951404417133908442e-01,3.844325149044180989e-01,7.698112961404834920e-01,2.617048213776891341e+00,-1.744620285382044722e-01,1.825886625265857877e-01,9.757462746710139356e-01,4.031275736669758913e+00,1.377155777544681436e+00,4.672363895376782095e-01,-5.700160534767497733e-01,-6.869757028346409333e-01,1.503091091174001637e+00,4.723440195607797598e-01,-1.465180995124469310e-01,-4.209431417723324964e-01,1.374862114366169230e+00,1.059190603684669219e+00,-4.386526022495154109e-01,-4.406218872881746407e-01,7.953402336651822502e-01,5.821769298253260949e-01,-2.110519920018067985e-01,-5.381601854668862650e-01,9.908835939782485447e-01,-2.220949804592836641e-01,-5.316260348257162427e-03,2.674076502778856668e+00,-3.758860982168082954e-01,2.770977244448804000e-01,7.600279103043329210e-01,-1.582012482050358659e-01,1.435524146979421767e+00,2.887521941851012297e-02,7.065503453244940113e-01,-4.940865812864720930e-01,-5.028876121200385185e-01,2.090555043547026037e-01,1.921244278970538066e-01,-9.290045035139110619e-02,1.325881078557807458e+00,6.434535234135122517e-01,-8.926399792596193539e-01,1.852767707917403472e-01,1.772538366911501351e+00,6.425946103008610688e-01,-1.183766459608527333e-01,1.856139637909695939e+00,-3.949372030188079696e-01,9.026327503212732140e-01,3.260679982010549205e-01,6.368673128895485647e-01,-2.000747386887136714e-01
9.310126922361189328e-01,9.860387979371983969e-01,1.918013527457139156e-01,-2.995832754927969521e-01,-1.657775859987918599e-02,2.497144082408175592e-01,2.562917844969692105e-02,2.387003783652050237e-02,1.398019379042108712e+00,2.853023997274677370e-01,1.121993294350213111e-01,1.382975399760866253e-02,-5.313691834664129310e-01,8.035780548239061793e-02,1.402999531824788981e-02,1.452991625734954440e+00,-5.500125125431402084e-01,-1.877687329819871520e-02,1.615455469847437708e-01,3.489676364453025426e-01,-1.049747907208495423e+00,9.554132049149777206e-02,-4.910337759203884378e-01,2.582065891053567652e-01,1.265691417775010041e+00,-3.093223266511948566e-01,2.059303023572303937e-01,-6.408487672638920607e-01,-3.834647752929090103e-01,-4.830619869090293506e-01,4.983085086487887283e-01,2.503639161570201388e+00,-1.707959052886774409e-01,-3.263769395617083791e-01,-6.363666162602246157e-01,-6.244972762774723130e-01,1.400918678116400251e+00,1.078241142149066523e+00,1.124016144781305959e+00,1.158334247027112518e+00,8.751000155321009277e-01,4.155310879643941968e-01,1.470826193939395177e-01,2.619100973976236646e-01,6.506939594746308231e-01,8.465687723573440682e-01,2.811379068949600768e+00,2.568602395701365115e-02,2.188844739556625729e-01,1.077710294544422576e+00,3.907969577772372638e+00,1.290532825995184041e+00,5.034018724953168711e-01,-4.010526118641838944e-01,-4.506184944372840229e-01,1.256550243012231949e+00,3.987829803225023673e-02,-3.078440423145900051e-01,-4.192934303688629072e-01,8.610999674099268919e-01,9.231934710741823702e-01,-1.479905567880818729e-01,-3.363988858635068580e-01,6.753825618470815639e-01,7.930776070963441171e-01,7.573939665803575139e-02,-2.864543725639023819e-01,1.208179679913812254e+00,-2.696918067502525052e-01,-2.338933382548720186e-01,2.605841814576323134e+00,-5.720039197085190485e-01,8.994651176120400937e-02,5.874727801011965234e-01,-2.475455626452711250e-02,1.292456678811517046e+00,2.368327343440445598e-01,3.262769162121053057e-01,-6.526675191192052861e-01,-4.008759184112400953e-01,1.207311230837551097e-01,-6.091523404499465943e-02,-1.561403480109907482e-01,1.340162488492602222e+00,3.828770072065878494e-01,-7.153118480243150223e-01,2.243150327433212077e-01,1.734857390329165305e+00,7.307266083252428324e-01,-2.958873678733888735e-01,1.846593252872420710e+00,-6.669680061182607922e-01,1.286244569296625118e+00,4.286876260331978217e-01,-2.181761591971553838e-02,-9.142106151325768426e-02
1.194044676145469275e+00,1.211637923773800640e+00,-5.233479460520781279e-01,4.064833600976447414e-02,-3.290691064632049190e-01,7.472340752161896749e-01,2.901077760457489996e-01,5.505360696640293483e-01,1.599259646663326206e+00,1.746179860006047968e-01,4.527692595755791749e-01,6.152552304727371135e-02,-4.153575444771051006e-01,3.939942181547121947e-01,-2.218000238278675096e-01,2.011817456598885556e+00,1.092503901219594176e-01,-8.100326146448896258e-01,1.746264287146164773e-01,1.346683327220805915e-01,-7.304449345155200612e-01,4.159711955454988841e-01,-6.092159169445837685e-01,2.433218167835841383e-01,1.169562549524095774e+00,-5.835482809425459605e-01,-2.771307638306019783e-01,-5.565364948134111645e-01,-1.127832518307432252e-01,-4.401007461018865419e-01,7.788326137248029468e-01,2.105574989936373154e+00,2.057877489567885854e-01,-1.996752063836358393e-01,-8.328166808006357558e-01,-9.359584363119269890e-01,1.823551073302293490e+00,6.921102069641554833e-01,9.419562304263370267e-01,6.357043689223895733e-01,1.278863883537223023e+00,2.112727415001957043e-01,6.456635630932117120e-02,7.790629256329993924e-01,2.093659721666091267e-01,8.184113698352184496e-01,2.711505920623439980e+00,5.185318118676296439e-01,5.881191543327445315e-01,6.057490578512954027e-01,5.099245260492034859e+00,1.678760144357775763e+00,1.227503445685758976e+00,-5.016609015197446286e-01,-1.147528072914958397e-01,9.067433078823903259e-01,-2.842266969630812268e-01,-5.440809677594941052e-01,-8.578157211877522892e-01,1.275825638720279098e+00,5.116629930411891181e-01,-4.517883743147333431e-01,-5.681698064800867476e-01,-2.189358214184461415e-01,1.836838465128584064e-01,-4.869621200570718456e-01,-3.166771071653277092e-01,8.767859128664465818e-01,-8.467409463951459658e-01,-1.160235391142564465e-01,3.316445562295660565e+00,-1.977486340544206134e-01,-2.548244663115976638e-01,8.379935741024012730e-01,3.814867298040102717e-01,1.134710599031945710e+00,9.379929533119713003e-02,2.708902541143852760e-01,-4.168688491995689027e-01,-8.118474304644425210e-01,7.830278540695387868e-01,1.966449591287388055e-01,-2.980950818420467496e-01,9.719587434966900918e-01,4.367453050534407244e-01,-7.410511360276116344e-01,-1.271605193450000559e-01,1.594947440013894546e+00,1.034103249342215980e+00,-1.317741241485708370e+00,2.106356196112370238e+00,-4.838013246252588218e-01,1.679452137284434432e+00,4.112524750112344640e-01,-4.974987939946068916e-01,-4.609880998844608224e-01
8.121659075958113094e-01,8.482989081708171009e-01,4.931876273781107267e-01,-1.100813750379087130e-01,4.357443110340242787e-01,-4.264979301308480242e-03,1.866123402349815774e-01,-4.342452323192350638e-01,4.483135709549471715e-01,2.064902973919569285e-01,1.777865288005360256e-01,-2.037579798977205425e-01,-5.549549320730730040e-01,3.116105640097618923e-01,2.993857979457724694e-01,1.157304124299019854e+00,-8.314445472411471361e-01,-5.655656937613668528e-02,4.372132452318475693e-01,4.748459313711052010e-01,-1.184789193269764507e+00,-5.749428311590143448e-01,-5.904907471684908149e-01,5.164803876152114226e-01,1.016028165423767060e+00,-2.907848520132260139e-01,5.313297934826328728e-01,-6.320076860904829674e-01,1.621894531439251885e-01,-7.145943759497108694e-02,5.371490843216254474e-01,2.334560770021247400e+00,-7.140357485725287723e-02,-5.621683479416419438e-01,-5.415629191345693316e-01,-7.480720333543647849e-01,7.697163640415498609e-01,1.401207588195016562e+00,8.623483121529238460e-01,1.027486006354491499e+00,6.313134612538837676e-01,3.551170188532977168e-01,-9.741046492919766542e-02,2.314348707451401310e-01,8.231010797300717385e-01,1.039745877058685375e+00,2.588704729291990247e+00,-3.000930162472716933e-01,1.437348023355343452e-01,1.632340788658950270e+00,3.412725990241625595e+00,5.964574996857860967e-01,-8.109344044882349500e-02,-5.680283861394518352e-01,-4.896604778492247845e-01,1.145676621954581087e+00,-1.442789659642182976e-01,-6.060456379296465246e-02,8.236972238156536896e-02,-2.834884570682607574e-01,1.701438256329254717e+00,-3.328477331402610595e-01,-4.724582090791814570e-01,8.375386358919314489e-01,5.374108165655715474e-01,-1.394111299266164172e-01,-4.231550216107906603e-01,1.248470988366593648e+00,-5.383531390595834853e-01,9.778540501287047437e-02,2.400290705891142018e+00,-8.263717851520471225e-01,2.313165004408622716e-01,1.296309082167385274e+00,-3.331904995666425950e-01,2.019858216755867630e+00,4.046308304939716938e-01,2.568645376145830550e-01,1.745371923345961918e-02,-5.470119300352032088e-01,-5.068993255803440068e-01,-5.381220789425495976e-01,1.657819958965770502e-01,1.222859438890465000e+00,-1.019621213382670977e-02,-3.110827540047342854e-01,4.913445631152973947e-01,1.816304494236925304e+00,4.716160246986292881e-01,7.626424030598195625e-01,1.353217332056233735e+00,-9.933177266254020754e-01,1.003396690715293360e+00,4.720182318202540417e-01,5.572314345873781161e-01,2.570979238208969120e-01
7.925610393066222503e-01,9.543244435180864293e-02,-1.734190662229856406e-01,7.011010813093188077e-02,-2.345641325942716682e-01,8.926447636668728425e-01,9.259830044153245510e-01,-5.139767810028176426e-02,8.421628738861105523e-01,3.706393216378478517e-01,5.102572755484036104e-01,-2.782483101350442523e-01,-4.799611146863469457e-01,1.625241156579155383e-03,-1.640490497327664610e-01,1.425756485583450806e+00,-7.080755314629466612e-01,-5.514684377416525507e-01,3.320539035742918754e-01,2.670772403697165842e-01,-8.973903394673666822e-01,2.891801953744251308e-01,-4.361557956217461673e-01,3.220554716540663942e-01,1.314458707754228683e+00,-5.190966479610246154e-01,3.767127741073542091e-02,-7.421314307326608573e-01,-6.504829108606503540e-01,-6.165091279489627318e-01,7.491660307891069293e-01,2.626408926533215116e+00,2.037377714581675159e-01,5.979683171803377995e-02,-6.153734270927846417e-01,-7.628583441209370042e-01,1.433046018940360877e+00,8.787406241636742665e-01,1.513880045924311579e+00,1.075064920908147981e+00,1.091367476473568132e+00,5.207154349382809855e-01,-7.370222997386323416e-02,2.817912740672379179e-01,5.168058669903775604e-01,7.946287299410852434e-01,2.267709759054356233e+00,1.059296527804331617e-01,5.479839745243136884e-01,6.729118495858665838e-02,4.651494854710893634e+00,1.999299644309173285e+00,6.199071572084300374e-01,-5.108282815015727785e-01,-5.160944982640726098e-01,1.342389983675897014e+00,4.484934866952550170e-02,-4.484685496461491283e-01,-2.459248671176731404e-01,1.706288302364838083e+00,7.909551593892617527e-01,-9.897928264402933163e-01,-6.838147812850714491e-01,4.504574508664505039e-02,4.905385791589478295e-01,-1.233369848879472541e-01,-5.406304997508846188e-01,1.370227707822303298e+00,-7.749257523901030842e-01,1.691967969294142227e-01,2.699523651581142936e+00,-8.677264078981958284e-02,2.527226757725084538e-01,8.428659842448530393e-01,2.177182112682295445e-01,1.151713132873647627e+00,-2.782656354934454068e-01,7.565929389280418027e-02,-5.393040951949932271e-01,-9.343828093232927623e-01,2.019912016392209075e-01,4.283851556455177401e-02,-3.846907124463697647e-01,1.592449958731895654e+00,2.862806340574369779e-01,-1.043880466124389450e+00,-1.128830292995358642e-02,1.792834479809335413e+00,1.076771019320956313e+00,-8.791905552908818589e-01,1.778034061014180045e+00,-1.176105615569604801e-01,1.075924995268732642e+00,6.197448801160349019e-01,-3.034011903146007216e-01,-5.914265595861384339e-01
9.438963839470195794e-01,8.987809075601788100e-01,-6.372457390744910855e-02,-4.070285848055683608e-01,-2.913577133695698373e-01,4.613998706997302635e-01,9.490728978504719970e-02,2.331131060814102263e-01,1.668398549087711125e+00,3.592118331189921854e-01,2.664429995352530778e-01,1.199191412370338161e-01,-4.795951692532124944e-01,-5.288779276783608929e-02,-2.472032746424940586e-01,1.676839635797744421e+00,-3.596159861996139906e-01,-6.955652234715142823e-02,1.583324128751922161e-02,2.188817293595117508e-01,-8.781699305869279382e-01,5.396204457220088457e-01,-4.208293281768371585e-01,1.259365361702083630e-01,1.465491858874737874e+00,-3.457511878244299286e-01,2.821419928831506163e-02,-6.546985191443618346e-01,-7.481849019083367525e-01,-8.047484055095641686e-01,4.659700194381812821e-01,2.582648596090330262e+00,-1.989247017803862094e-01,-9.555541488635171943e-02,-6.749691388346418242e-01,-5.915005360096543541e-01,1.717408321255732284e+00,8.862356624171875419e-01,1.472665952884393281e+00,1.262244966027105564e+00,9.745162081036160551e-01,4.280543111041373305e-01,2.266819046464809695e-01,2.380872982515619962e-01,4.730568483424539283e-01,7.214846853250631575e-01,2.803402494834516645e+00,1.604652157515887023e-01,2.625380494468300685e-01,6.335024312537483882e-01,4.249347701608058969e+00,1.797668909415731209e+00,7.973236045495292190e-01,-3.487990889563039043e-01,-4.805199708843362894e-01,1.403985091400447693e+00,2.670743296133905598e-01,-3.913167976458721276e-01,-7.164308119691317200e-01,1.728130140520425462e+00,4.451712121368337494e-01,-1.828764286176985387e-01,-2.716335755367776938e-01,5.653765007087183658e-01,9.017938130173143163e-01,1.453459422766768261e-01,-3.240342669226402572e-01,1.093068762391844917e+00,-1.161797818186383890e-01,-2.602243461796303059e-01,2.680954038288017927e+00,-3.289237427442568973e-01,6.663412625959286295e-02,2.127997038372745064e-01,1.215177759137736485e-01,8.674542041023879380e-01,-8.694457717132231256e-03,4.447674383102723228e-01,-1.025149058353252318e+00,-3.822654888628472802e-01,5.428857111348476261e-01,2.771428854460742386e-01,-3.477936821109606225e-01,1.463371282291816566e+00,6.946740144397614003e-01,-1.049817469159627814e+00,6.637896131223680607e-02,1.615142716975828785e+00,8.823849298721236911e-01,-8.777004476583200043e-01,2.073713519539068795e+00,-3.696458663400739031e-01,1.287689445327963034e+00,3.816262081803892814e-01,-1.940062689347566427e-01,-3.724268374697431994e-01
1.056191066310148363e+00,6.238316742490727096e-01,-2.223334582679573068e-01,1.762004117988947849e-01,-3.154042989510537076e-01,7.644652349974386807e-01,2.088442125883140377e-01,3.593800924616761261e-01,1.702587880561285072e+00,4.569767521294407775e-01,5.186090480580014539e-01,-3.218414541490294267e-02,-4.888414447676717178e-01,1.638007242500365557e-01,-3.329325817233047546e-02,1.923277430337983596e+00,-3.276511707568219300e-01,-4.576065722033240135e-01,3.411822142776521627e-01,3.711299246556639675e-01,-1.013180989149464528e+00,3.960934030264293138e-01,-4.035205874059761277e-01,2.807690934590797438e-01,1.037342105385977487e+00,-9.266502826132921866e-01,-5.283627998161685713e-02,-6.353698993332035361e-01,1.409917060329717309e-01,-1.527808519667899212e-01,8.083582563715322467e-01,2.447593274467588564e+00,1.696112544356379037e-01,-3.747331159038448933e-01,-6.224574609260550284e-01,-8.797118389841316333e-01,1.436111533484357716e+00,1.023331753583439641e+00,9.190700595008698404e-01,1.271873906922495578e+00,1.339024538922801710e+00,3.172827037351092505e-01,1.694803929390479857e-01,5.880796659428750850e-01,3.503146846223128552e-01,7.214711462808476305e-01,2.830078141047312812e+00,1.907680433937843367e-01,5.379781118692477104e-01,6.936412566813934255e-01,4.816387895735735114e+00,1.480800656752743416e+00,1.059483665042026956e+00,-5.883999630689442650e-01,-5.428384322587813671e-01,1.174505233626723211e+00,4.257773206684345446e-02,-5.601124250157263340e-01,-3.749653309846522342e-01,1.411834831201832063e+00,1.156688437365358757e+00,-6.170154020238973747e-01,-8.324695413622449358e-01,2.157647746069430439e-01,1.503578253354359573e-01,-5.207920735027565806e-01,-2.599337521857775224e-01,1.388318469680097866e+00,-7.717186689247287346e-01,-4.837774260894320832e-01,3.360124676730382731e+00,-2.719884387291848782e-01,1.160800990604332200e-01,1.017763226019221312e+00,2.438770475125000559e-01,1.459561898936316160e+00,3.169163704678112370e-01,3.800876854814399519e-01,-2.398049606255878707e-01,-7.576626321570356648e-01,1.963399925096579457e-01,2.298480299114455672e-01,-2.212039803021573214e-01,1.023976176121593529e+00,3.041712079088217946e-01,-6.953580429590215939e-01,-1.478069831576377946e-01,2.305642038955380002e+00,9.198397589824514053e-01,-9.452981157871038764e-01,2.285681984911208886e+00,-3.010893614505577021e-01,1.515678526712783247e+00,5.122242371514674764e-01,-1.062361217784966727e-01,-3.268315552414274294e-01
1.338772517847236276e+00,1.670940937885621702e+00,-7.679677083786093927e-01,-1.534085612635656126e-01,-4.558205205167942808e-01,5.936210272591473380e-01,-2.294517480063204551e-01,8.830062639852532813e-01,1.898693376768233021e+00,2.641989740196435399e-01,8.404280252553975039e-01,4.173059096893048103e-01,-3.063541466939884161e-01,5.222271824979072274e-01,-4.612769231858982466e-01,2.669740172446364745e+00,7.200203584620772368e-01,-7.349067836189803193e-01,2.281348309179289519e-02,-7.721859023934941890e-03,-5.064966730366389225e-01,7.839395513703246721e-01,-5.752287944236911255e-01,1.487014262642032680e-01,1.218205928454072939e+00,-8.054653010835383098e-01,-3.547338473707006834e-01,-4.422600794553471770e-01,2.440940964600057939e-01,-4.724854829439589787e-01,6.383565919130552713e-01,1.844934876110519095e+00,4.969112805240361030e-02,-3.187100130501583362e-01,-8.589201719373862343e-01,-1.043501999846485173e+00,1.906195241526900341e+00,7.368302492163834039e-01,1.022451600884378475e+00,8.571783734722759895e-01,1.274590909409696993e+00,-6.611708104198638081e-02,2.196423014196989265e-01,8.979318598335150892e-01,-1.704573510094034017e-01,7.047378230855155801e-01,3.021847760889808665e+00,5.151308333564630360e-01,4.352220378358372943e-01,1.022900952392827634e+00,5.196661747466107428e+00,1.506040595739839727e+00,1.550971903889711179e+00,-5.787975429857373788e-01,-1.905774126268047763e-01,1.000658124218992029e+00,1.101534749352665876e-01,-4.301189039762327582e-01,-1.300022490624914262e+00,1.604513298097667517e+00,4.185573082870940320e-01,-1.034725759112581356e-01,-4.519401891692350626e-01,7.448655044933027991e-02,5.314161769486824838e-02,-7.788821207444669437e-01,-3.205012967975346960e-01,4.101966914832743671e-01,-5.072307370302430174e-01,-3.178288339726108580e-01,3.665409779944039492e+00,-1.921348531054440922e-01,-3.546112399603300602e-01,6.968105855870377896e-01,2.823451546023127423e-01,1.146909000169665793e+00,2.376057063994151952e-01,8.892967827854347806e-01,-4.434330744875026875e-01,-5.728940276720042579e-01,1.214431659240954531e+00,6.226463937834673112e-01,-1.841560835715681521e-01,6.267025755174000512e-01,9.196059877964702922e-01,-7.682638366742455815e-01,-1.911703358393446184e-01,1.566502038679732811e+00,8.362460158082003492e-01,-1.338624387443359653e+00,2.450572037787278390e+00,-4.887088229230546754e-01,1.700518359938583579e+00,1.282340848712998915e-01,8.906660863060111843e-02,-3.849365344362490338e-01
1.109603113350497328e+00,2.042397283727984458e+00,-4.144945953837974595e-01,-5.382734380827813858e-01,1.805255193267437663e-01,7.607668823270447023e-02,3.197436700591028691e-01,1.615487722007614979e-01,3.289679819074289857e-01,-2.724151819586417833e-01,3.967502257641133401e-01,1.692881380747267572e-01,-3.093620659205140733e-01,7.313994819055279484e-01,-4.037518346912048472e-01,1.735344070986174492e+00,4.057823028664095388e-01,-8.138032116052706932e-01,-4.775069698715066202e-02,-1.803150225520266936e-01,-3.574639041336219458e-01,-8.130014679320818338e-02,-9.433180748770528812e-01,3.295883032135527024e-01,1.479296649232052063e+00,3.066023741839150052e-01,-5.464498193957917360e-02,-4.476966948333330198e-01,-5.230034320188204910e-01,-9.475447226958320091e-01,3.903562684827076579e-01,1.592569609829340260e+00,-6.240590869119155837e-02,-2.915891503294121279e-02,-9.929805217011782315e-01,-8.947402599561682379e-01,1.763399649906159716e+00,6.141832734797162408e-01,1.308179681860081711e+00,-1.016006616666407236e-01,5.320182727775687459e-01,4.048444774341203312e-02,-2.448454735801067761e-01,6.062107328379315874e-01,2.440869685148104318e-01,1.108218630080530787e+00,2.358998732867447767e+00,4.132494466630975416e-01,2.116452423240126057e-01,1.231004593913289202e+00,4.256860931465436870e+00,1.342531002643548854e+00,5.220852799397778243e-01,-4.071794073826553451e-01,3.006246612589476008e-01,7.918414691877706524e-01,-4.380777141030759436e-01,3.040085526799615745e-03,-1.256058438415790235e+00,2.547729697105765023e-01,1.375596438984164060e-02,2.061788514514234505e-02,1.541576817219737772e-01,-1.253467170625410798e-02,6.272411092046089598e-01,-1.426527960301831044e-01,-6.431250479679920806e-01,-9.515495207937818556e-02,-4.550170750620381455e-01,8.741601989569249831e-01,2.429900783784253004e+00,-4.565928656072358871e-01,-5.334823913253020633e-01,6.409249062638868732e-01,-2.016560922953102020e-02,1.071674223838301243e+00,-2.640543646541781420e-01,3.795877732159628204e-01,-6.040745721307028138e-01,-5.939453200141322498e-01,1.153132305484414033e+00,-1.990345140743026708e-01,-8.082965061353997172e-02,1.127113148281151389e+00,6.940293665011184610e-01,-7.051568606608767942e-01,4.146581604138671606e-01,2.177239966694887174e-01,7.317140603479850292e-01,-3.496178151863552075e-01,1.208422857888395763e+00,-1.105861240800822376e+00,1.228942894380580464e+00,1.201454819516839523e-01,-3.793559357430426049e-02,-2.224567681986893142e-01
1.054200348506877383e+00,1.851731151686085930e+00,1.466581570374863031e-01,-9.034349110270227801e-01,-1.516995885882024830e-01,1.732783273150240166e-03,-3.142275392067814255e-01,2.915380493767673609e-01,2.077289324829284745e+00,2.541318470443307276e-02,-4.390379143678422857e-01,2.951408314621267737e-01,-5.296138756198465192e-01,-3.513797775208964136e-02,-2.227943928431073972e-01,1.340333176800362569e+00,-2.541441052809296774e-01,1.919546525335505405e-01,-3.110998005366534813e-01,1.301516733186082742e-01,-8.682048041178505038e-01,3.773543618910715214e-01,-6.110355396234261605e-01,-4.064075586991788835e-03,1.683920415337297971e+00,3.795518664883613669e-01,-1.310831088144531753e-03,-5.991707204183849278e-01,-1.352076226692421557e+00,-1.184614323822064996e+00,2.175380065560283405e-01,2.494377331763939942e+00,-5.135793794883256602e-01,-6.037332024741678960e-02,-8.627101488527575412e-01,-3.314377714253379237e-01,2.156182134295795638e+00,6.618301406970269474e-01,1.363406241072261826e+00,7.719725987258830857e-01,7.095879521382164601e-01,4.952277299949532363e-01,3.102152915246458864e-01,1.793585833831977672e-01,7.175160641013612617e-01,8.548650671283263280e-01,3.005535983391371957e+00,4.002362440274835897e-01,6.458046648171902882e-02,9.579944749839846008e-01,3.738446643075637787e+00,1.751220176847295029e+00,6.811520949826646021e-01,-3.493088403967409272e-02,-5.074000590912797204e-02,1.187094537351538914e+00,-1.004709513747947813e-01,-3.492121580837828088e-01,-1.144586618253705446e+00,1.132587277475201493e+00,-2.580815137838875506e-01,5.665198173083449973e-01,3.262909024928064561e-01,6.468154927783827945e-01,1.547719418343235009e+00,7.746304637501171264e-01,-1.438433876576012960e-01,7.990431067765710882e-01,2.909744141778938809e-01,-2.100940624017995084e-01,2.193969968173905993e+00,-6.227093823232339176e-01,-3.109948926948284398e-01,-4.555421428852232113e-01,1.259980467851051222e-01,3.784970347428270876e-01,1.238398037516413863e-02,2.136305099042653532e-01,-1.634953894494450610e+00,8.154933700600663915e-03,8.800867204661551035e-01,3.447326467154909757e-02,-4.110582763811300167e-01,1.610268868741094206e+00,7.781501435552640178e-01,-1.013078890877595839e+00,3.098339807974820337e-01,8.533688319780815545e-01,8.643935117253187528e-01,-9.025406692514921225e-01,1.841724579201734713e+00,-8.738183433456460092e-01,1.557146285862175628e+00,2.861856049202600727e-01,-7.874423675749822049e-01,-2.161007356134522495e-01
1.171584867178673939e+00,2.032788322611329246e+00,-2.890984003892700938e-01,-4.725467633055738248e-01,4.794335419177712942e-02,1.854535786505320527e-01,2.095339923505864510e-01,2.918732193367000738e-01,1.070937043787205889e+00,-2.529574715819891129e-01,-3.749909900014974928e-02,1.231056131704968276e-01,-4.133996003660266871e-01,5.510427536092360468e-01,-2.397279780201430621e-01,1.531885344001461480e+00,1.676602592322908314e-01,-6.868870476452528795e-01,-7.140778643934941883e-02,-3.735466231930408693e-02,-5.896594903762067963e-01,-2.671563341904148459e-02,-8.906982018944836765e-01,2.466555240451195341e-01,1.427751287083678378e+00,3.096036051235011022e-01,-1.501208242324129916e-01,-4.975950145528683644e-01,-7.126286261995156135e-01,-8.847186535913508232e-01,4.791289172392854678e-01,1.853160227515572966e+00,-6.272208047925234564e-02,-7.273059608899648532e-02,-1.004906408001899010e+00,-7.538942076851675722e-01,1.988193749881975503e+00,5.333290918848486717e-01,1.049044899766190309e+00,-5.235299409352500710e-02,7.479257241922271371e-01,2.219705189362223829e-01,-9.078956148431019391e-02,6.282643387655160172e-01,4.495627860951845189e-01,1.068354617479708724e+00,2.561963686673336404e+00,5.811756199456915573e-01,3.208439549614249264e-01,1.019485192272758356e+00,4.355340129794281090e+00,1.502040676876192027e+00,7.118766749868894461e-01,-2.730498073782200441e-01,3.399713615404297284e-01,7.113132647402986564e-01,-6.495055390519220984e-01,-2.593907323345822080e-01,-1.173500711045094347e+00,3.323256412959405548e-01,-7.365375302077278863e-02,1.051303908267339771e-01,9.062952149831106363e-02,-1.272710890294673769e-01,7.802892644459340499e-01,8.724046584964575968e-02,-3.913553648557639431e-01,3.312473064387303490e-01,-5.103645656718801549e-01,4.721737965366936129e-01,2.515048877349071788e+00,-4.955279071638298283e-01,-5.693372495854713833e-01,4.308877082263851133e-01,1.902814994652822778e-01,8.593087498392770751e-01,-1.068039649131606872e-01,6.263421515473166501e-02,-8.148778613890895750e-01,-5.488846888108747102e-01,1.034311297185296130e+00,-2.445936990526723087e-01,-2.373658641506378175e-01,1.207354177909188753e+00,4.935948281301230089e-01,-6.873405200514468572e-01,3.028543373126139082e-01,4.941619508404652139e-01,9.062807814262922035e-01,-7.974920390249853330e-01,1.430930888822827818e+00,-1.077458265263356418e+00,1.576472847122758703e+00,2.767849565802429357e-01,-6.918007798931233854e-01,-2.626626048495592225e-01
9.802485076018848664e-01,1.245752797249438437e+00,2.224838129678158860e-01,-4.491184701879191721e-01,6.901191856031145544e-02,-1.499259581078163928e-01,-7.306834919857152499e-01,1.195215323244809835e-01,1.381134038755712057e+00,5.450044840129422141e-01,7.268175094593660734e-01,3.720592271374391080e-01,-4.334755918936379349e-01,2.316336215203599336e-01,-6.716100491386428617e-02,2.171291999675680096e+00,-9.724636982434595178e-02,3.468328620393342221e-01,1.700429555969991680e-01,3.541624056338785742e-01,-9.742012701278005560e-01,2.513801880891125551e-01,-3.663840529052643791e-01,2.742283660203346241e-01,1.146278012904295984e+00,-7.909501036025721188e-01,4.326930265111011975e-01,-5.189211580897004072e-01,5.407104147387025161e-01,-1.650619714692832529e-01,2.975026417627254505e-01,2.258064799585339344e+00,-4.086819241174932671e-01,-7.330486278474510620e-01,-4.895385630397079413e-01,-7.861545085180058345e-01,9.384485327993353776e-01,1.534120527526970479e+00,1.117418281148507830e+00,1.823999977221760993e+00,7.336136488625792929e-01,5.140428976596683741e-02,3.155681793987458184e-01,2.636677680502334531e-01,2.976684989691598116e-01,7.271689803992558154e-01,3.229501158427229512e+00,-3.804035358627094743e-01,-1.122820490729488779e-01,2.078694674311773127e+00,3.519309356609474637e+00,5.274498190166674316e-01,5.130270258661109306e-01,-6.405841645550813812e-01,-8.548368269808397368e-01,1.523397032296741838e+00,7.453139990042039198e-01,5.851325792780082136e-03,-5.044154785819752185e-01,7.919947155923774407e-01,1.585966840706229952e+00,2.101656082975817408e-01,-3.569705132776058720e-01,1.525625044286263998e+00,5.096870460668938563e-01,-4.314719560989203062e-01,-3.308370161629681228e-01,8.509103060179709077e-01,1.949903924289297374e-01,-5.732027342387592261e-01,2.968037940485444892e+00,-7.728682174435110852e-01,2.560715221975664591e-01,8.199083355714051891e-01,-4.497763887287433704e-01,1.883055455714065074e+00,6.721696425891403592e-01,1.275445425253097564e+00,-2.705782375093835901e-01,-5.151326672010725360e-02,4.538203835357601523e-02,3.170928733875380545e-01,2.366997396691715716e-01,8.341844220419712963e-01,8.185917930002609699e-01,-5.201248927683200796e-01,2.921440735083009610e-01,2.139951514879705918e+00,2.087823403137953893e-01,5.322786471796632224e-01,2.172976319695107073e+00,-7.592787806032839093e-01,1.037327490644125216e+00,8.820901121219926200e-02,1.416457471827395009e+00,3.123714096879989244e-01
1.027993522518363179e+00,1.073737454625302234e+00,-4.586636624841110288e-02,-3.767911054136924842e-01,-2.511191247911777058e-01,2.514032440256130929e-01,-4.494517265888237634e-01,3.609307511510155275e-01,1.830559803214336423e+00,5.442359576546600408e-01,6.287315059780156368e-01,3.311599104695220896e-01,-4.371538550864120798e-01,7.986929258490556294e-02,-2.125143249711826665e-01,2.178717274465072240e+00,-7.340712138525384844e-02,1.214129440180343189e-01,8.209020110728471042e-02,2.838861537397252555e-01,-9.048272907179066848e-01,6.046249511864014714e-01,-3.345556821317565710e-01,1.548802087776899039e-01,1.272371351855787536e+00,-7.828186108146754085e-01,1.446170067510371138e-01,-5.698109061296555700e-01,5.624452204087204699e-02,-4.225502363229316494e-01,4.175675639641988068e-01,2.416302374057466285e+00,-2.871364067414818311e-01,-4.597270136100072846e-01,-5.748662427580234491e-01,-7.369755719359778467e-01,1.392576822223617894e+00,1.208991939764319845e+00,1.260795607798756102e+00,1.698499296483590548e+00,9.946385627105871485e-01,1.835241789791905442e-01,3.619471541662441227e-01,3.341194194415200713e-01,2.513814038328372469e-01,6.418902072575070061e-01,3.152687343801982678e+00,-6.502077871511638407e-02,1.127030454668938031e-01,1.331468273838924521e+00,4.112284681251654916e+00,1.205867371863976079e+00,8.998786341021780544e-01,-5.323794428030242942e-01,-7.384545977277772177e-01,1.495220341044181112e+00,6.283520595763150141e-01,-2.640073117738710451e-01,-6.982008589276555988e-01,1.560312321076045006e+00,1.031841036816753432e+00,1.890216109332834571e-02,-4.056034277667400767e-01,1.045623727755403687e+00,5.766992071269043674e-01,-2.988332570269732757e-01,-2.778983840294377838e-01,9.819341650601309812e-01,4.752564667484695388e-02,-6.257140542939699790e-01,3.095535497030056149e+00,-4.827822904955351158e-01,1.607240728983425071e-01,5.062093328443174611e-01,-1.018952620858008529e-01,1.364560242067743623e+00,4.129545274845011771e-01,1.009840515536955419e+00,-6.290874748030449437e-01,-2.047738950490742282e-01,3.980650045032531614e-01,4.985591349764534885e-01,-7.342270407150272571e-02,1.018198912712169779e+00,8.590230219883765450e-01,-8.107390230046052082e-01,5.365888619813968807e-02,2.077859960200400202e+00,5.604623249192568490e-01,-4.027656075747999553e-01,2.379932901880672969e+00,-4.486830065879762741e-01,1.260444184809581980e+00,2.026794754168694812e-01,6.644978121656011094e-01,-7.450298653041326213e-02
1.160806079086712517e+00,2.100412928786652866e+00,-3.738647376902627384e-01,-5.576067678423058949e-01,1.401119335253038223e-01,-6.857828129176130050e-02,-1.766926106858553447e-01,2.939038347416261243e-01,6.474346631153817810e-01,-5.433537256968720697e-02,6.733199003066148158e-01,3.682301801947944764e-01,-2.868367330295401585e-01,7.335340627032673755e-01,-3.972904490869610949e-01,2.155468069213752891e+00,5.877994009656113406e-01,-5.473397992891066988e-01,-2.801674049258483928e-02,-1.075038386040563787e-01,-4.094217394353420469e-01,9.176560819229884203e-02,-8.126364166017467916e-01,3.057235676645103650e-01,1.366196979066299999e+00,-8.474749613927937131e-02,3.831467525426043852e-02,-3.989675010690455492e-01,2.857652252596998288e-02,-6.905261272784443127e-01,3.270566646941201472e-01,1.571519098621498411e+00,-1.850770951422651134e-01,-3.035055459762941998e-01,-8.860194370924583396e-01,-9.583253549684077610e-01,1.544366082779661475e+00,8.830395457666825321e-01,1.212951106176247462e+00,4.126051786964968215e-01,5.784173324301123964e-01,-1.159436994334379079e-01,-6.545175936908129155e-02,6.234022751210424040e-01,7.527378315585553370e-02,9.894312258800471716e-01,2.706036014151090185e+00,2.134191868620340382e-01,7.292036509142560408e-02,1.717480951925976829e+00,4.128710879183556948e+00,9.601558766824446201e-01,6.511289097757939626e-01,-5.288106984491727225e-01,9.665856042688991678e-03,9.585273022678840737e-01,-2.791061978379399955e-02,7.120184030275514275e-02,-1.245730122059087952e+00,3.652600028600423432e-01,4.467844560284047750e-01,2.118626542259508527e-01,5.064466120772545543e-02,4.684779523584633454e-01,4.537442714841272151e-01,-4.254820213598713430e-01,-5.728588399597805969e-01,-9.965048434260415089e-02,-2.137775181303440686e-01,4.541087222311180893e-01,2.763614760023277661e+00,-5.588731539427829187e-01,-4.045503608550036767e-01,7.391291711890451976e-01,-1.863729962102039228e-01,1.378862162652553902e+00,7.648806727365614622e-02,8.767534384955235627e-01,-4.150242025800321422e-01,-3.860350954501014509e-01,1.038914885625398021e+00,7.227732547918888639e-02,9.405272732621139387e-02,8.281970628021809722e-01,8.921053012903137347e-01,-5.946604109308168962e-01,3.689276814995049447e-01,6.866729790501897579e-01,4.878667737547436323e-01,-6.115134133920219206e-02,1.566520900650170578e+00,-1.079840676063196003e+00,1.205700227443333716e+00,-1.903584547861353338e-02,6.353702818515110096e-01,-1.394765192184399538e-02
8.402333576302875029e-01,1.348069823694961089e+00,-1.994179248181043307e-01,-7.720970395761607152e-01,1.625892379732155058e-01,-1.367311869902905763e-01,-3.437612387847732709e-02,-8.559901772359666816e-02,-1.675087437164823889e-03,2.580661125373747145e-01,1.174105814302396800e+00,3.723452964560355349e-01,-2.381246199946884246e-01,4.396732849559408240e-01,-5.875627714232131149e-01,2.180992925005401428e+00,3.105549998400924383e-01,-1.325649654220413531e-01,-1.336510132498590353e-02,-1.146961616144084317e-01,-3.508177640035301526e-01,2.967806531250375413e-01,-5.871152647681620040e-01,3.072380043204024913e-01,1.592595653959531177e+00,-2.172046668679836479e-01,3.609921115405012038e-01,-4.816713996203491055e-01,-1.823243168314070406e-01,-9.316761930754677845e-01,1.068675526892744754e-01,1.862164814902343313e+00,-3.864584727403849729e-01,-1.499851106113580523e-01,-6.568879944217906885e-01,-8.741650828035171239e-01,1.131019333054580356e+00,1.181272067865527742e+00,1.977224409710713227e+00,1.160411965086533659e+00,2.959957975217734627e-01,-7.759832256188303745e-02,-7.125643546535143091e-02,1.535020543578540231e-01,2.417708160557041630e-02,8.549585476470872303e-01,2.523668237276893045e+00,-3.116688677255257667e-01,-1.830796455864650008e-01,1.645844751043006982e+00,3.612439040944731783e+00,1.066399216146689755e+00,2.271459662678550484e-01,-6.299192281302212759e-01,-5.421574587997961547e-01,1.575237225309694455e+00,8.034973162830382210e-01,3.585698559502649152e-01,-1.013616416866728542e+00,1.121110625462931942e+00,7.041001101104622517e-01,7.044592053108533758e-03,8.023440117243293979e-02,1.164234153999422094e+00,6.871520605413430349e-01,-3.150517255710900688e-01,-8.574410716563347634e-01,-8.681538285715828529e-02,2.825328836249128561e-01,6.082710112483333820e-01,2.372765547926417362e+00,-4.626475290183471034e-01,8.061212979561609149e-02,6.052282799676423908e-01,-5.399865153910433646e-01,1.457397363596935946e+00,-1.902867367762254847e-01,1.363081482003550837e+00,-5.664230502007613355e-01,-2.376366127773456571e-01,8.134224483698717645e-01,3.300771319997841680e-01,1.568451649737713782e-01,1.166372202609519126e+00,1.258190075499173499e+00,-9.525571074688057305e-01,4.806219193477573315e-01,8.380511428376689054e-01,2.715250786562400931e-01,5.630012874922245558e-01,1.506078890753420829e+00,-7.105877926410946177e-01,4.790183416306357800e-01,-1.106255706726200216e-01,1.604755193660879709e+00,-3.460422484355696326e-02
8.503332009507390543e-01,1.861898703011427569e-01,5.306279848121815412e-01,-1.209996117175902164e-01,-3.510488068164157593e-01,5.288995984535368455e-01,-2.285426994448433446e-01,1.064394634778743909e-01,2.612131254701592908e+00,7.475461760869074324e-01,-1.402851914499921304e-01,-5.209079272318783982e-02,-7.009896830094202169e-01,-4.987181983751443615e-01,2.567276605341362039e-01,1.343049334424966101e+00,-1.199018733532446257e+00,5.605048134047290187e-01,2.499755390885576856e-01,7.288382070288225156e-01,-1.555488280167434123e+00,4.701247630106273334e-01,-1.049175444738535967e-01,1.172119788615290509e-01,1.155038725690153978e+00,-8.347653160044140597e-01,2.636017906796427335e-01,-7.969262774756834533e-01,-4.304996681708930240e-01,-2.242857776417654936e-01,6.113652728048057927e-01,3.273522797205711043e+00,-2.464963128426191363e-01,-4.814916078814558964e-01,-3.974475842798282366e-01,-3.886199412300032630e-01,1.356280611421489368e+00,1.308840555821591201e+00,1.017888490092837106e+00,2.160282633136165309e+00,1.281705691059843666e+00,7.344470124211988082e-01,5.359329647417190312e-01,4.440611285177638312e-02,9.039479757275237226e-01,5.736577871778044679e-01,3.240012780133572079e+00,-1.267912835863738708e-01,2.960366604498186893e-01,7.128785837860721619e-01,3.902683353150254941e+00,1.514291405841988514e+00,7.447953379680334329e-01,-3.449114432119122498e-01,-1.006792689926718776e+00,1.622536494183894451e+00,4.258108402822360361e-01,-6.780836301193452487e-01,7.479493133919967729e-02,1.739186711929995299e+00,1.374936130104360776e+00,-2.617363884763545534e-01,-7.216027550134628266e-01,1.075802799498564610e+00,9.559045853522314395e-01,2.822779402029810258e-01,5.652635023899599265e-02,2.253467659675749690e+00,-1.086987277211929337e-01,-1.238915270169029803e+00,2.880085149153759794e+00,-5.521183966944986921e-01,5.152636953173388434e-01,3.435151053284051237e-01,1.229979974133979109e-01,1.218819363267861888e+00,5.822296753383369161e-01,2.633214733161715060e-01,-8.852217467051595179e-01,-2.451620166556330305e-01,-4.721935921922764123e-01,2.091716344909077541e-01,-3.424770412236052275e-01,1.524012342168529210e+00,2.323508858917432418e-01,-8.476267349900503678e-01,-5.233417933084483220e-02,2.939478040359514210e+00,8.559383463832678229e-01,-7.078932247039204650e-01,2.544934479522075854e+00,-1.923601239652977801e-01,1.480767201711003622e+00,6.798289201795912895e-01,-2.902852578774618997e-01,-1.340107734974956832e-01
1.060734021915153313e+00,2.037257548448733413e+00,2.361196861668583002e-01,-7.195944658972186492e-01,1.602969578767775571e-01,-4.652896473193762761e-02,9.169226007462472072e-02,4.592038134877733657e-02,1.463891094989643316e+00,-3.127286091900426390e-01,-7.844858727598500447e-01,2.364409706238386477e-02,-5.732075651357528834e-01,2.244547603603949115e-01,5.186813012843072279e-03,8.401319456379305883e-01,-4.388666875567238668e-01,-1.783827537441080024e-01,-1.744045323574322237e-01,1.420414782851549540e-01,-9.168052257704675245e-01,-2.443355012598251719e-01,-8.618964034372726957e-01,1.710310886378432482e-01,1.545385814918725398e+00,7.577785891516867212e-01,1.577995633506781847e-02,-5.941370507626974051e-01,-1.362609293748764383e+00,-1.055953244041879291e+00,3.524698053466980285e-01,2.279521273192392172e+00,-3.010184187425716251e-01,-5.206447004620173846e-02,-9.743929468707546171e-01,-3.897357777166680082e-01,2.086548348977599776e+00,5.471880200356017410e-01,1.009709704228532789e+00,1.554498713211005523e-02,6.042211339992751284e-01,5.505507620283104364e-01,2.295811532700527818e-02,3.154870124709188151e-01,9.617717155438247900e-01,1.117679737244983151e+00,2.672867449938276518e+00,5.392311269442991994e-01,1.996500780454418256e-01,9.885574184653274088e-01,3.693063096268334622e+00,1.560447424507069858e+00,3.662213710881342399e-01,-6.491980158442878235e-03,3.566508925817362119e-01,7.681534109118344222e-01,-8.197779071906760029e-01,-3.340763573629624839e-01,-9.538702814810458008e-01,4.906797918493599475e-02,-2.206724641219894589e-01,4.104007329763152967e-01,3.373707150372388108e-01,1.463519712369127923e-01,1.450442840132774913e+00,8.219762119208724460e-01,-1.858396483663391496e-01,7.811107873545893865e-01,-2.126440608881727812e-01,2.771417370152889914e-01,1.938615043682228034e+00,-7.457438813152961199e-01,-5.097616699955070940e-01,-5.958499749724469052e-02,1.758943560673338902e-01,5.605469599586316853e-01,-5.081777078012983395e-02,-3.618373982370136632e-01,-1.321224767776891573e+00,-2.769050981390711597e-01,6.862123439441862871e-01,-5.578284008205449673e-01,-3.592172632480502559e-01,1.637491259330070559e+00,2.755305628715042365e-01,-7.181366954967011162e-01,4.830364458501339442e-01,4.507924396315752258e-01,9.534863924008682989e-01,-6.691818732374112955e-01,1.273053025694816487e+00,-1.248343559362371957e+00,1.653520727987824568e+00,4.345868600459628084e-01,-1.265576405155290907e+00,-1.419889641842907724e-01
1.058534072059212683e+00,5.242623160208270683e-01,-1.937458781017487586e-01,3.253050034512328104e-01,-3.295264491418349317e-01,9.657355632266340084e-01,5.674678234378220942e-01,3.154313774030087503e-01,1.791138086376853344e+00,3.055059851308007945e-01,1.139709305715952969e-01,-2.488759679541279191e-01,-5.642187925704412743e-01,1.140219312636308463e-01,9.775131368258760389e-02,1.505023574709229317e+00,-6.081794116857850430e-01,-6.609551550996372038e-01,3.788566062508761934e-01,4.198002914766834071e-01,-1.123265092908613649e+00,2.262540483148561266e-01,-4.821274732995097789e-01,2.948207001061203814e-01,1.019306443304142995e+00,-7.036112442311581727e-01,-1.687523059605093578e-01,-6.964103537030673641e-01,-2.251762169729341068e-01,-1.983488662558313687e-01,9.588030240643973245e-01,2.570547922568346078e+00,3.273527101591267585e-01,-2.386544102657013333e-01,-6.993001360525451515e-01,-8.064417209399097342e-01,1.646220626243255936e+00,8.095794065263623995e-01,7.575561195579170182e-01,8.867000197040864062e-01,1.456415693163839897e+00,5.154081972797661670e-01,8.624337869084996999e-02,6.373060835589998696e-01,5.833115156419853564e-01,8.056863915543271970e-01,2.655030640692940480e+00,4.213468343322538945e-01,7.414516971827738168e-01,2.430845155869018059e-01,5.024265384276760393e+00,1.775125291401536742e+00,1.062183276845922952e+00,-4.682563766421119489e-01,-3.047942487192105143e-01,9.593669284695828248e-01,-4.366869013266297950e-01,-7.624162382474836130e-01,-2.579378260170888115e-01,1.247842380585855171e+00,9.245734043302499261e-01,-7.989264019538986350e-01,-8.771315595818397481e-01,-2.656985897535836250e-01,2.386632966074270223e-01,-2.907405155244315864e-01,-1.809306668526355910e-01,1.663247806116120220e+00,-1.105594252408686806e+00,-3.790977697882912389e-01,3.232625513062728828e+00,-2.192510851397450888e-01,1.151107453815551629e-02,9.941729374061150093e-01,4.851575199643398673e-01,1.239599338129189876e+00,1.916640033241106544e-01,-1.917811781856531006e-01,-3.404398224869558121e-01,-9.626094957176397626e-01,1.333414755099161519e-01,-4.372347165832557447e-02,-4.024357005408655263e-01,1.227597034293786082e+00,-3.994335282517968988e-02,-6.945411854176893884e-01,-1.867367264219249035e-01,2.191410451159369721e+00,1.193333949837423358e+00,-1.353932685139648262e+00,2.123401655148226208e+00,-3.165565325705300137e-01,1.734668661574461757e+00,7.263917499283315538e-01,-9.319416755577407674e-01,-4.836346396243983436e-01
9.977513365214347729e-01,1.013211665960700225e+00,1.022449576186508641e-01,-5.189903753662993280e-01,-3.185168749822967493e-01,1.415799676518744721e-01,-7.668995597785712715e-01,3.881313264367507454e-01,2.195885804720569823e+00,7.116344318317072704e-01,6.310276532086553924e-01,4.503518593141345727e-01,-4.602081568617150120e-01,-9.865519547186631100e-02,-2.138168258745318795e-01,2.269498607210675978e+00,-1.423040904226827441e-01,4.849694176914725041e-01,2.014565638018044752e-02,3.559936775872338255e-01,-9.991595604553835663e-01,7.865236396523340723e-01,-2.005329829184571144e-01,7.535918440325489742e-02,1.317237410745134563e+00,-9.008534007212604111e-01,2.353347405521959423e-01,-5.850577082738671608e-01,5.490402756948675744e-02,-4.309911477482817332e-01,3.090755283287400235e-01,2.603240629421744945e+00,-4.693419156670047832e-01,-5.450268967146931764e-01,-4.873580311753421546e-01,-6.340524745822566643e-01,1.345288987585163687e+00,1.352835920235011535e+00,1.351904608470058999e+00,2.143566782525621939e+00,9.838341700799515532e-01,2.083015142422356969e-01,5.378205969734521918e-01,1.899839412296535635e-01,2.678649173520100124e-01,5.349348817877044304e-01,3.391608788892820137e+00,-2.104151428300040649e-01,-2.227801464884369975e-02,1.484419531131812686e+00,3.863150037247176094e+00,1.145792713314571554e+00,9.135877776011246398e-01,-5.105300989668299927e-01,-9.742353668973491310e-01,1.715968095240566260e+00,9.640335997397529999e-01,-2.507892700869783775e-01,-6.771986330025269174e-01,1.854654257323818944e+00,1.140142302705294375e+00,2.114529654249363566e-01,-3.696157823638539508e-01,1.467291953767598578e+00,7.484996740958047567e-01,-1.938648876619484263e-01,-1.960868851607365793e-01,1.111160582890537540e+00,3.848318643406996586e-01,-9.568907099348102907e-01,3.098447646835321923e+00,-5.526271916950182828e-01,2.998299861049061321e-01,2.801398208929071210e-01,-1.959663779446523257e-01,1.337890542882796741e+00,5.533769062895488311e-01,1.247998190382219708e+00,-8.051337297113878577e-01,3.514931436042445512e-02,3.046582294540189362e-01,6.818725276606147911e-01,-5.806711258849736601e-02,1.044767539878263207e+00,1.026132799625339320e+00,-8.802871711000670452e-01,4.747284806431661952e-02,2.345245085421892917e+00,4.521611189611554060e-01,-2.991440093176695458e-01,2.615493365066983600e+00,-3.686620239309001956e-01,1.213063776853804621e+00,1.516385221666969318e-01,9.166858273036426752e-01,1.254310557039073348e-02
1.066555754690900359e+00,6.303621884515776541e-01,-9.241589129486693643e-03,5.356163233087718467e-02,-4.215462046360274329e-01,6.823951725887700270e-01,-1.582964241810067008e-01,4.447267572336269792e-01,2.403416651781340008e+00,5.927273597837665609e-01,2.644833222525724281e-01,6.090109062320486766e-02,-5.638586385516668464e-01,-7.525994846079238354e-02,5.433624270988657301e-02,1.881412235191514570e+00,-5.003064640206971170e-01,-5.427387989200419677e-02,2.588954953450572916e-01,5.027647450026195841e-01,-1.213519015207425333e+00,5.604551694243835591e-01,-2.728825215279666594e-01,1.661959626634817722e-01,1.058678971659347656e+00,-9.859127796455227077e-01,-1.399904279093389103e-02,-6.683139479125125293e-01,2.718588849747338720e-02,-1.415143566148155951e-01,7.396649379269812918e-01,2.729662456179561936e+00,-1.206469026434991987e-02,-4.789720738863074145e-01,-5.606286205563136837e-01,-7.060802520426554540e-01,1.518418366716157042e+00,1.105943052492081691e+00,8.557980142957792857e-01,1.659318772766065431e+00,1.413749252762306563e+00,4.287249219717440551e-01,4.037014957120769187e-01,4.686013422670429751e-01,4.832082774423909211e-01,6.190706926204098126e-01,3.155685658333455379e+00,1.522231433620360175e-01,4.557670936347818502e-01,7.669540698168016979e-01,4.598892809165277207e+00,1.481470066617520898e+00,1.147624576840455823e+00,-4.873551190425071677e-01,-7.066679031053062499e-01,1.313883270012539572e+00,2.108855975486456091e-01,-6.686705776001059531e-01,-3.347538747404334436e-01,1.644723566189400188e+00,1.184764332053706903e+00,-3.550350176540684743e-01,-7.960116969519553942e-01,5.467242045652055404e-01,4.118921446228975825e-01,-2.823053258945729116e-01,-5.302437918718050369e-02,1.692289777111674276e+00,-4.766084298935988617e-01,-9.701187431903179892e-01,3.373641466319392546e+00,-3.800072168432870878e-01,1.995057439726872217e-01,6.869893668274644760e-01,2.559938419794920428e-01,1.319080660618946466e+00,5.293218580919145655e-01,4.246313555367121628e-01,-5.221076752338524862e-01,-4.974067112305567973e-01,6.385764279568684199e-02,3.464941280959661918e-01,-2.791292358333640200e-01,1.088378109984283082e+00,3.529636376664696540e-01,-7.341216151981041493e-01,-1.869668909869368623e-01,2.634642127422106128e+00,8.996722611460635788e-01,-1.049546148662148681e+00,2.582572088367596219e+00,-2.582204423481128108e-01,1.658108467739864977e+00,5.363828146446862899e-01,-2.236794558426867252e-01,-2.482016320034113877e-01
7.728502628272648778e-01,1.172958678765329221e+00,3.721728981327432351e-01,-7.017548872156875728e-01,3.321784042282528437e-01,-3.390960724113132874e-01,-3.089499060070646785e-01,-3.158903901224480171e-01,4.218339544116453399e-01,3.515769632180633097e-01,6.518779010604415225e-01,2.354162699431067707e-01,-4.120969357464446259e-01,2.286212608890730857e-01,-1.499321898826805333e-01,1.706605924674393648e+00,-3.154972153700186244e-01,3.517112117251363079e-01,1.135591155975005373e-01,2.273501445031493318e-01,-8.366952434577040743e-01,-4.859596588636971859e-02,-4.900822963768508012e-01,3.433894324043688107e-01,1.392150848191802126e+00,-2.401961008981280676e-01,6.125488223918137409e-01,-5.560084979489694490e-01,-4.825420534079838397e-02,-5.671243648091711664e-01,1.273443712738643041e-01,2.231566416831903599e+00,-4.929862282950704389e-01,-4.525947182124120949e-01,-5.162759898109425816e-01,-6.814605364378913954e-01,8.510156420761199048e-01,1.471483785428535862e+00,1.558820104859615530e+00,1.497664704491718624e+00,3.127305122629762124e-01,1.399364708580475014e-01,6.794053374473958684e-02,-1.087605907667411886e-02,4.691698844259537537e-01,8.797962244148643807e-01,2.785503293854687534e+00,-5.140473430616603334e-01,-2.518914423468128772e-01,1.973628507060763315e+00,3.031003547385740404e+00,6.519248489324560580e-01,-6.186293676233067806e-02,-5.608898365785568441e-01,-7.282354175230640880e-01,1.594385869224270058e+00,6.872213401579818637e-01,2.664297160310886703e-01,-4.767531229873704368e-01,5.150701930061112321e-01,1.296570690779106361e+00,1.538524656354852693e-01,-3.547782304579788493e-02,1.558502644391774883e+00,8.874313058303783253e-01,-4.568691629561150158e-02,-5.930290639330879632e-01,5.852964088608640925e-01,3.327348976679379566e-01,1.235529605747642257e-01,2.228762635286261506e+00,-7.977314110285363968e-01,2.802952124992137972e-01,6.794365982991674713e-01,-6.337119218544950972e-01,1.736978075680913891e+00,2.399404733375550269e-01,1.103345703752609319e+00,-4.841130326206282142e-01,-6.619362155911479029e-02,5.927372982293843684e-02,1.567702934347117716e-02,2.354086403291689722e-01,1.243387614777468952e+00,8.381936163773558990e-01,-6.773475410066369662e-01,5.871946964477516850e-01,1.428286748165335407e+00,1.741753987494646383e-01,1.012065376773742198e+00,1.538127841076526003e+00,-8.903552101072536029e-01,6.060388081616896461e-01,7.486563949263391748e-02,1.480285557997517376e+00,2.851830552053423729e-01
1.046835885185040560e+00,1.316504287743181401e+00,-1.467239631742429107e-01,-4.635944982428464867e-01,-1.793960915886448348e-01,1.978995930699287142e-01,-3.181185225003704820e-01,3.408410655533601341e-01,1.529505137329038922e+00,3.754163668563705869e-01,6.064917104446698737e-01,3.340562985216984360e-01,-3.979355126219368266e-01,2.086461652780224885e-01,-2.981494252369060183e-01,2.127455635128566502e+00,7.842652985692649681e-02,-5.495123615878388934e-02,1.893928905002578017e-02,1.580368354164724820e-01,-7.532502424478904057e-01,5.147202644801008864e-01,-4.590800359062169322e-01,1.712679430230882316e-01,1.356308813704037775e+00,-5.348119927451253641e-01,9.420584895081848820e-02,-5.380935163121369769e-01,-1.132147991242935525e-01,-5.928968001586623071e-01,3.800395528997611017e-01,2.233737143911540102e+00,-2.717729084205133816e-01,-3.454537973338587808e-01,-6.697283516065422049e-01,-7.611753572586383854e-01,1.505708486440526128e+00,1.068664742293917058e+00,1.333214289524119023e+00,1.336050237770120885e+00,8.770238191690257201e-01,1.400843386382193412e-01,2.477351868664258161e-01,3.766904251953481775e-01,2.195817840032590618e-01,7.271281269927150070e-01,2.997285088386200336e+00,3.836509908281257597e-02,1.089290709256405532e-01,1.310124683895333764e+00,4.133915722366181100e+00,1.268916179128462218e+00,8.374703990558056699e-01,-4.965442968007933167e-01,-5.225518563651730952e-01,1.375773355636083162e+00,4.572538892950668288e-01,-1.904910592832641525e-01,-8.810217145432808206e-01,1.371383166217082561e+00,7.443711532247967444e-01,6.110485376048047090e-02,-2.431567234453294868e-01,8.557113617784285475e-01,6.258872714627887746e-01,-2.457438653190083810e-01,-3.664280052391180598e-01,6.940677213023022096e-01,9.394533367608724761e-03,-3.012405749364548413e-01,2.939334582861804712e+00,-4.651651213690981002e-01,4.751540569523635127e-03,4.625586728063593167e-01,-9.345079371152886782e-02,1.249077085129107534e+00,2.421962565541910251e-01,9.308689843691360100e-01,-6.878117062776996082e-01,-2.510350780142074356e-01,6.302459283008833291e-01,4.000321408796396194e-01,-8.337727348914047987e-02,1.051396348696394423e+00,8.977819905847060911e-01,-8.303401812179848074e-01,1.315068774651771688e-01,1.630907622014691416e+00,5.878829750191063575e-01,-4.134621969522334073e-01,2.149448582726956936e+00,-5.749083000156127721e-01,1.234715495873865976e+00,1.548610694216678574e-01,5.497485011830655077e-01,-1.194095645329475430e-01
9.472124345834188608e-01,7.734859169188113004e-01,1.665957755651601424e-01,-4.359108611933194544e-01,-4.341340892026462339e-01,4.988827360957057144e-01,-1.335309429205144283e-01,3.095801414110440630e-01,2.466403764424415002e+00,4.829954982339852432e-01,-1.211972982784189079e-01,1.196642385383683560e-01,-5.908827333380368696e-01,-3.469454605997965846e-01,-9.731154477893233512e-02,1.491050643457223268e+00,-6.795628008737673031e-01,2.767474637283443006e-01,-3.128535736241011556e-02,3.962341501385662212e-01,-1.151126050086136887e+00,6.751950475579977518e-01,-2.864867818472998096e-01,1.313991371750894421e-02,1.461654740064036950e+00,-3.918780040139129839e-01,2.434539263422616506e-02,-7.226708175017853009e-01,-9.721770887421971041e-01,-7.753497062135656925e-01,4.752526100575184542e-01,2.962356174607766679e+00,-3.085491517314663534e-01,-1.596808493257217965e-01,-6.193315070581689730e-01,-3.894539753959607720e-01,1.859318530298398553e+00,9.107415181708073959e-01,1.344637482970360898e+00,1.589186852171826203e+00,1.136163115429811299e+00,6.301107835772166155e-01,4.509225503774066945e-01,1.301601602972449756e-01,6.951503152532745311e-01,6.262854555367705078e-01,3.081744492221900167e+00,1.919064948490988576e-01,2.742810742812720748e-01,4.946055627978098723e-01,4.143680551054741201e+00,1.929012529351311622e+00,9.144036319940807012e-01,-2.142031263557715448e-01,-6.084362496749441407e-01,1.493444679918891849e+00,2.946898371985304799e-01,-6.045371970424333607e-01,-5.837488220627975455e-01,1.988191216020572361e+00,4.448030646664350440e-01,-3.368140645117351228e-02,-3.070608219099537628e-01,7.302892880159823630e-01,1.172079710011226572e+00,4.499284147584851068e-01,-7.306971811912554848e-02,1.580238775185631717e+00,4.024348572524606010e-02,-7.753960689234791204e-01,2.693685341861010940e+00,-3.991530903116003448e-01,1.531124160517047250e-01,-1.099606498693594669e-01,2.375235658942759231e-01,6.606717121364520384e-01,1.776398799775361081e-01,2.803785875275108808e-01,-1.330398006436733116e+00,-2.102087141649918445e-01,3.377565506679361396e-01,3.222722241552884448e-01,-4.844338621799955669e-01,1.606173228474979453e+00,6.007087689626805505e-01,-1.098695536743919732e+00,-2.007211690702304097e-02,2.015001181467907188e+00,9.767421015020840702e-01,-1.170727733882925614e+00,2.369029781039705185e+00,-2.765614919332348709e-01,1.516712736660414507e+00,5.071199688507136427e-01,-6.165477423196656925e-01,-3.658206336020566329e-01
9.556125874554389776e-01,1.354970984125015043e+00,-1.379813270627897048e-01,-4.802842596524503627e-01,1.580028513639744614e-01,-9.377125106841621704e-02,-2.857238133448036232e-01,4.849095706837677766e-02,4.258303320832230177e-01,3.518799104071116957e-01,1.136811320717718843e+00,3.537788034612836530e-01,-2.912020549312970830e-01,5.171172080729761200e-01,-3.479962522518478263e-01,2.318462634322990379e+00,2.820902491713674354e-01,-1.375187177391246629e-01,1.512892012223582272e-01,6.937381557810848309e-02,-5.700416293086785213e-01,1.974450036688642218e-01,-5.414607501992337868e-01,3.607943634271181255e-01,1.280766568596144239e+00,-5.924826080475381618e-01,3.543005234953945370e-01,-4.608854352600950666e-01,4.525855051999640999e-01,-4.297036493541681601e-01,2.746018188301159180e-01,1.854719572409195383e+00,-2.726845688828650194e-01,-4.747733246143141517e-01,-6.034177897208338193e-01,-9.754184320913065198e-01,9.616236376842786093e-01,1.348911969006298062e+00,1.454163187644728739e+00,1.316086739436395758e+00,5.395749015502783186e-01,-1.257135078940583850e-01,2.488019479361169850e-02,3.536304534555867463e-01,3.627408577093182984e-02,8.334537191007544976e-01,2.785916410897791184e+00,-3.136866793779412577e-01,-8.470452193543716313e-02,1.932321782720290759e+00,3.764331477925804581e+00,6.858230101399012124e-01,4.159867137964120554e-01,-7.296293599842156308e-01,-6.225250532657436997e-01,1.432923394925685656e+00,6.785728307204201837e-01,2.184440603706012396e-01,-7.824806306825510260e-01,7.692795855442399189e-01,1.247582556367783813e+00,-1.499512463088170655e-02,-2.282186000122267966e-01,1.166235039055065092e+00,3.283152265279629667e-01,-6.374766357325736266e-01,-6.670808386345994379e-01,2.232920636534564407e-01,2.736260198241029923e-02,1.716036830388670831e-01,2.830802361739860551e+00,-5.775500615896069778e-01,1.062257654469582341e-01,9.942928098209191656e-01,-4.932888605892103984e-01,1.851058241929691706e+00,2.405284404796890763e-01,1.358280343087930886e+00,-1.439868326469166959e-01,-2.913509115531995874e-01,4.845973176565964713e-01,2.972002320586231150e-01,2.699459179517366136e-01,8.307231845495823830e-01,9.970791935758804847e-01,-6.343585258101565039e-01,3.677564071890868647e-01,1.441397311536044556e+00,2.231538967212601809e-01,5.960542173428657886e-01,1.776210750710674136e+00,-7.771111686533440643e-01,7.572586828348156773e-01,-3.927104768519629197e-02,1.643174532041146829e+00,1.399578431918179211e-01
1.053135019617445378e+00,1.671115121223964994e+00,-5.821097054623382006e-01,-4.373562454299467772e-01,3.209680632448577708e-02,3.552070644859121051e-01,6.486325227055728115e-01,1.745440571227230842e-01,2.226306327664229201e-01,-2.076445273388637103e-01,5.633433838721647602e-01,8.765520796707856888e-02,-2.853556118827889065e-01,6.448657815750133970e-01,-5.215906676260143593e-01,1.763360468652517721e+00,3.612295644009296258e-01,-9.813543690427262156e-01,-2.141974532006146043e-02,-2.270527819846986928e-01,-2.810033978814739930e-01,1.022659707661132678e-01,-8.922113106948352801e-01,3.157016156417134511e-01,1.547848020269806391e+00,2.160398417404737204e-01,-1.453027336169563644e-01,-4.943295061764029774e-01,-7.218130994835438852e-01,-1.072461376952182688e+00,4.675554916919251180e-01,1.688579552293906882e+00,5.289349725296360605e-02,1.616524123321234907e-01,-9.834044339635714671e-01,-9.211323369632576918e-01,1.842426675012584392e+00,5.101868260872131078e-01,1.540517063451318336e+00,-6.428872771867188973e-02,6.343162898722387588e-01,9.593642287073295138e-02,-2.919084638023708433e-01,5.866780899446097930e-01,1.698466991142639215e-01,1.051346040992866993e+00,2.174415333027301944e+00,4.584682239396275505e-01,3.330248528307627742e-01,7.566925329826019730e-01,4.577918709883924464e+00,1.722647640319059814e+00,6.243517263357494240e-01,-4.290782570481461722e-01,2.453248951598392402e-01,8.800085405175401831e-01,-3.591188393795398115e-01,-7.183229838035590231e-02,-1.243707450164954764e+00,7.919379714900518508e-01,-1.325053261694418005e-01,-2.866042276017152779e-01,4.195761337473288138e-02,-2.322145641720947395e-01,5.676491090041033694e-01,-1.750157609849587459e-01,-7.347946174862747259e-01,-2.927245190486826854e-02,-5.775808843941980797e-01,9.837796240994088892e-01,2.469257833751107079e+00,-2.295900211341707908e-01,-4.596667989553168687e-01,6.239814133330039425e-01,9.686660501118692090e-02,9.149461118712323149e-01,-4.998139075639473350e-01,3.190227869996031806e-01,-6.710855228931448258e-01,-7.660684821722444360e-01,1.255651318839827058e+00,-7.591373237033963162e-02,-2.130736609632627176e-01,1.265254911473028487e+00,7.331117012038288472e-01,-9.119085407188888270e-01,2.923010616652881311e-01,2.431987354329941953e-01,8.899677917209398714e-01,-6.899289696689379081e-01,1.251997525392888555e+00,-8.245893987957759741e-01,1.146990338559819023e+00,1.842389868507162132e-01,-1.770571764348441435e-01,-4.652440591271591597e-01
9.337411611316226434e-01,1.188189015421321937e+00,3.429440697032387630e-01,-2.979073792569976176e-01,2.243756114505137123e-01,-1.006048965356082237e-02,-1.331328156714405853e-01,-1.182301834782205907e-01,1.074034371645829822e+00,2.274815832578619135e-01,1.341614100431937073e-01,1.860553249919261187e-02,-5.304191263170774384e-01,2.511181915341227366e-01,1.422771688233073206e-01,1.428789899131827301e+00,-5.317263119582154030e-01,3.626763862892953827e-02,2.392807798465856339e-01,3.911210709134358421e-01,-1.092847450182146574e+00,-2.147900004789037309e-01,-5.588924034993685286e-01,3.603254295234369908e-01,1.138872651625279397e+00,-2.882950792599077161e-01,3.663767741820458945e-01,-5.938321066563950756e-01,-3.230186490323028181e-03,-2.632339675647862309e-01,4.569081057078173136e-01,2.328987140934508648e+00,-2.022175362329847736e-01,-5.273904413697005911e-01,-6.112411508625108514e-01,-6.887626168285767569e-01,1.117380240095248389e+00,1.260925995783957809e+00,9.220958787860258354e-01,1.098822079226943860e+00,7.208984436482661629e-01,3.124356831350419417e-01,8.269025237281840690e-02,2.854330926318874861e-01,6.871935370532784582e-01,9.402258938021950119e-01,2.842818945772159545e+00,-1.254520461484113780e-01,1.089034646581972243e-01,1.596882403989090982e+00,3.579252991942916573e+00,7.970984417506192798e-01,2.647002473489874497e-01,-4.755702545728814346e-01,-4.408097681208654195e-01,1.175284639127312625e+00,-1.965696955358992026e-02,-1.463205614615181172e-01,-2.984986621846265065e-01,1.756499482239455290e-01,1.289649562627401824e+00,-3.000664392112262213e-02,-3.182423097000788292e-01,8.759691809947803831e-01,6.837444612898202490e-01,-5.547223686335212012e-02,-3.096539827897957786e-01,1.097167418580501153e+00,-2.796837005907641949e-01,-1.567530661817547744e-01,2.558300364294140206e+00,-7.785450146584876885e-01,8.879633311004704599e-02,8.768107570653744798e-01,-2.231435045117321492e-01,1.671393325799285234e+00,4.299315763959053460e-01,4.252550527312689566e-01,-3.386688643878392746e-01,-3.516950469798714174e-01,-1.032666759040795634e-01,-2.517054845129851892e-01,6.004418228910957112e-02,1.165926957517187335e+00,2.812608254469169955e-01,-4.535970346675882725e-01,3.842932202173598988e-01,1.728694180130726288e+00,5.180067342744097969e-01,2.999073374391008628e-01,1.663761343696798622e+00,-9.403405386169847446e-01,1.207444850145614312e+00,3.671138104997303531e-01,3.807537708420195011e-01,1.755028614723976865e-01
9.462319543643067377e-01,1.051232689623246008e+00,-1.068416898251393493e-01,-3.119185272520500485e-01,3.380398862430596119e-02,1.261148959708348061e-01,-1.657434312818629185e-01,8.620381683407457585e-02,7.548799310939298124e-01,4.330282330972228810e-01,9.996123583538527591e-01,2.439865181756807055e-01,-3.514422446850164472e-01,3.710355444274099912e-01,-2.527865220102042954e-01,2.199498473987526737e+00,4.706154302193560346e-02,-1.424500261695103298e-01,2.168419176083501432e-01,1.787805907916628079e-01,-7.215018473958435541e-01,2.639078689856485527e-01,-4.647789241228362234e-01,3.398735153237726347e-01,1.218718487668110084e+00,-7.235608036240135377e-01,2.938155139418937578e-01,-5.223804198831556445e-01,3.749022498022367422e-01,-3.428947707536182943e-01,4.014808014459529950e-01,2.077718367734539218e+00,-1.797823420948255202e-01,-4.596697330422759298e-01,-5.693910120822094356e-01,-9.308703828894295818e-01,1.022362335745117257e+00,1.319664856447401391e+00,1.357784334598261644e+00,1.431499969991995025e+00,7.397282161205748219e-01,1.082170422506900653e-02,8.130042307769323739e-02,3.590181961973407665e-01,1.387650766459397333e-01,7.824544928103925878e-01,2.808362178132848275e+00,-2.505074918827576158e-01,5.458959969499444648e-02,1.611595844377284870e+00,3.967335423612288636e+00,8.822600624575624995e-01,5.403765437000355165e-01,-7.030066311639178167e-01,-6.869117912331932363e-01,1.437274315083900023e+00,6.022726849882390487e-01,2.604493593307882771e-02,-6.058380605958574305e-01,1.006515664589358483e+00,1.307988484672599760e+00,-1.948658196718738855e-01,-4.107882345137046087e-01,1.017716273334206445e+00,3.057615764647010348e-01,-5.903339920064469837e-01,-5.644622999528544627e-01,5.981585855152813380e-01,-1.329064917174631044e-01,-4.565771946980023976e-02,2.945559729286172601e+00,-5.035513398173682154e-01,1.822751665880772420e-01,9.974985238679789923e-01,-3.357923053392752877e-01,1.780665361629845123e+00,2.734419728728748056e-01,1.140683016632508817e+00,-1.724785739594820733e-01,-3.896397912703363775e-01,3.252595229525202525e-01,3.003030390036627306e-01,1.497773947054427679e-01,9.145118992172144301e-01,8.233163847422526604e-01,-6.701529185152970136e-01,2.370108435677854286e-01,1.763475520259584872e+00,3.809139287063110224e-01,2.668307826136864791e-01,1.932856415396787764e+00,-6.083627788720274987e-01,8.978630122451419782e-01,1.131210299091677807e-01,1.277179365534919508e+00,3.270599905387028272e-02
1.001697374427992449e+00,5.906739685284816410e-01,3.117996335991182755e-02,5.766667669396408069e-02,-2.613815471066527896e-01,5.940228250405515942e-01,-1.497629102223646536e-02,2.612549917318135462e-01,1.885535002032024510e+00,5.358843807556251670e-01,3.683843426409959543e-01,-2.469923739635573878e-03,-5.406419822095743788e-01,2.376161038431655326e-02,6.408897597344986874e-02,1.798054301215946449e+00,-5.306677030829922703e-01,-1.194766128847709052e-01,3.192857056098666324e-01,4.743734319292054469e-01,-1.163538447699029144e+00,3.598077394972724607e-01,-3.301504265768311353e-01,2.530635572217419527e-01,1.048569863670286928e+00,-9.038242557031853641e-01,9.033234592672034768e-02,-6.601222085650588767e-01,1.018121249644963200e-01,-1.244487255787505298e-01,7.151017991233861171e-01,2.621472312882382916e+00,1.322716828779829656e-02,-4.714652142323622619e-01,-5.477909386981454354e-01,-7.574414646573830456e-01,1.330245582806202753e+00,1.170565034345998789e+00,9.152283887687033825e-01,1.546979474657901088e+00,1.262484673449460582e+00,3.867301702638981098e-01,2.722164177681953845e-01,4.312319991798995167e-01,4.931968677034899162e-01,6.947858058548489479e-01,2.984625895576526133e+00,4.071791461879309404e-02,4.097225967661750623e-01,8.949279629782597167e-01,4.434228158274931886e+00,1.329847057570390234e+00,9.090888380863855200e-01,-5.436345698608232579e-01,-6.911676521220495584e-01,1.303992321205927896e+00,1.894351045993834526e-01,-5.269687946921306487e-01,-2.460640770252605636e-01,1.342469365499312506e+00,1.317736372903568487e+00,-4.401891735379662163e-01,-7.730129355797605850e-01,5.754389366121623883e-01,3.604461490012808023e-01,-3.359657403052243030e-01,-1.798653469260891868e-01,1.562985534600754622e+00,-5.291213130695556766e-01,-6.937655070924642065e-01,3.215338262118104140e+00,-4.178448512239038570e-01,2.317327413546769188e-01,8.791272440788958642e-01,1.298692974109026399e-01,1.497568387702661319e+00,4.574676061646662517e-01,4.397036485931501426e-01,-3.521323916192005132e-01,-5.607700129296525615e-01,-2.994382081670188267e-02,2.069033083538739382e-01,-1.811778355077162395e-01,1.100787813504434665e+00,3.069485019528930270e-01,-6.737644175645118860e-01,-6.975762511284094858e-02,2.477949824277128066e+00,8.133365038314385176e-01,-6.806046490495289980e-01,2.330692894133262971e+00,-3.496457617020968800e-01,1.466741517810324025e+00,5.138281169444729457e-01,3.003117698234412936e-02,-1.815029749352557731e-01
1.195900028363804157e+00,1.527014451062917999e+00,-3.162219397605086635e-01,-2.284547008472924134e-01,-3.010704616099467712e-01,5.911007816061606412e-01,2.154913263309532478e-01,5.164791551090738286e-01,1.948189637478963343e+00,1.007204660101179705e-03,-1.364829652489042977e-01,6.137700181258158583e-02,-4.943748711929575324e-01,2.443778083763124553e-01,-1.630076889595052370e-01,1.583627795008081929e+00,-8.740334203777277988e-02,-6.020560952006657196e-01,-1.287220220547236060e-02,1.381772195989759699e-01,-8.191365050573184980e-01,3.374653981772931521e-01,-6.783485611823829586e-01,1.412418472383763224e-01,1.344806785334617283e+00,-9.075235488828928276e-02,-2.999115399354241873e-01,-5.882092980160683604e-01,-7.642479988580294092e-01,-7.459937846450483967e-01,6.663714385670418405e-01,2.266524112066209629e+00,3.575144634316973491e-02,-7.920223840674278648e-02,-9.238441913219375135e-01,-6.834306323715342302e-01,2.152809777506671018e+00,5.077342838210793241e-01,9.453126273398433366e-01,3.896964873361128401e-01,1.170760686525695204e+00,4.044967406662028919e-01,1.258560261018618620e-01,6.488836588676176742e-01,4.969217449232815609e-01,8.811846408623532634e-01,2.766067729329372504e+00,6.834229223532872766e-01,5.298873027874508868e-01,4.915210102558502658e-01,4.802173361515649219e+00,1.884555995843564480e+00,1.121621630187207064e+00,-2.458389915838804507e-01,1.116284569686676331e-01,8.271984697390011299e-01,-5.496506517082846432e-01,-6.174739076141313454e-01,-9.890014519759564582e-01,1.116490935122103512e+00,8.269838768088150216e-03,-1.194380071598939719e-01,-2.423595917216237183e-01,-2.437044858468508934e-01,7.177694777109917545e-01,8.935682450483775630e-02,-1.755034388482834551e-01,9.508704274131574152e-01,-6.335939315117474768e-01,-1.217006344693665199e-01,2.898996982106117226e+00,-3.219306769500215326e-01,-4.100412822642040545e-01,3.144610333522401824e-01,4.701397162329026269e-01,6.819888579800081896e-01,1.525399124994447630e-02,-8.263690607378537667e-02,-9.447803667126367655e-01,-6.189048661691833875e-01,8.818258400060736690e-01,2.520426161806865739e-03,-4.569044956369494592e-01,1.268450971554600404e+00,3.844800151390852516e-01,-8.245436882075076745e-01,-1.316315479737434346e-02,1.209856569543898974e+00,1.149166207521228777e+00,-1.516414745200495018e+00,1.959795761005355574e+00,-6.684174329617516008e-01,1.851121075340314226e+00,4.709074919865951503e-01,-1.168676372235006644e+00,-4.705052806779808083e-01
1.205859304022168565e+00,2.398806995466958192e+00,-4.650841573384854599e-01,-8.553621085322493656e-01,-7.513588040852819949e-02,4.920917801765292698e-02,-2.127552376064384410e-02,4.662650682694559068e-01,1.191806671416289376e+00,-2.700653549857386926e-01,1.094845856883949198e-01,3.920535192033182126e-01,-3.257872073495876597e-01,5.234508145483721675e-01,-5.564368109202131318e-01,1.821218669059597950e+00,5.637761636216096495e-01,-5.704166526420735295e-01,-3.381367778191518569e-01,-2.488472752793687848e-01,-3.217558334022918021e-01,3.328770266048594051e-01,-8.930719061055204522e-01,1.020764538406421229e-01,1.711110310621940744e+00,4.849799760040208740e-01,-2.291039727762389788e-01,-4.446768907860033648e-01,-1.054317058818778463e+00,-1.313678813751408825e+00,2.547037051692336851e-01,1.749463038693119143e+00,-2.862466811003264722e-01,9.111135431211492275e-02,-1.077471614663598309e+00,-6.928727717912593898e-01,2.272363013839043155e+00,3.981009378509219321e-01,1.449884634353167501e+00,-1.646191130159935234e-02,6.002868125518986409e-01,1.188687781753718364e-01,-2.412080475416446268e-03,5.528800126378491386e-01,2.387695741884431622e-01,9.953553256428647744e-01,2.649526061259832144e+00,6.390144989207078297e-01,1.515904413048800581e-01,1.043072264680595884e+00,4.303700969017773659e+00,1.730500224467762305e+00,8.450677130937231940e-01,-1.925876358414803091e-01,3.768463895050978563e-01,8.650301353983784747e-01,-3.366327967377330532e-01,-1.405254824160174776e-01,-1.674876115245585995e+00,8.577099399734817720e-01,-6.379334250548333030e-01,4.388916669152387318e-01,4.337008371551621666e-01,6.133897907303187402e-02,1.056344485515734011e+00,2.381219791963995469e-01,-4.623084614530297287e-01,-1.393458876336366448e-01,-4.885237715024328548e-02,5.539067198608034204e-01,2.399572256238987400e+00,-4.250407811696695903e-01,-6.874381742930161243e-01,-8.559622013198059376e-02,1.425646386206748661e-01,4.617915940193834667e-01,-3.005571543466698525e-01,4.123845970879022049e-01,-1.272009691777797213e+00,-2.958969960746250516e-01,1.590392756458239187e+00,6.914968595204863677e-02,-2.965698319913379621e-01,1.261354714464629101e+00,1.001249849418773818e+00,-9.594020882085161350e-01,3.252773633852751312e-01,3.885734792038986196e-02,8.520656293642081547e-01,-9.737570303398817018e-01,1.522547434914113040e+00,-1.039876074527870342e+00,1.482563560497850208e+00,5.617394701665323620e-02,-5.183005695094027310e-01,-3.523221329941830793e-01
1.236464198418071536e+00,9.076109149993889513e-01,-3.911723874871010920e-01,2.191692770331478135e-01,-5.574475133917026204e-01,9.456309702569329900e-01,6.698498861259821746e-02,7.273094833448933150e-01,2.523188691586893739e+00,4.043384927670977125e-01,2.391355848999498490e-01,4.232614481822852270e-02,-5.206624591084607623e-01,1.271922497400251317e-01,-4.142401926302174964e-02,2.016088765633736735e+00,-1.690118296160291467e-01,-5.681319436278158275e-01,2.318558526101343054e-01,3.650634441144350317e-01,-1.040639256771543009e+00,6.307275699071388519e-01,-4.170991143835817705e-01,1.561969140992029159e-01,1.030067022078400951e+00,-9.357137590820894246e-01,-3.296097825390787994e-01,-6.230661533878809610e-01,-1.089685319866617874e-02,-1.922149861675097604e-01,9.081136216395951921e-01,2.483387512710991452e+00,2.155030682329968639e-01,-3.537411923083628174e-01,-7.368126442863921488e-01,-8.380825148180115480e-01,1.882899583300435831e+00,7.762628664976382042e-01,6.821408442586121001e-01,1.105283918182306202e+00,1.618083638259183221e+00,3.675173826315473735e-01,3.155638830509967518e-01,7.840872406787939841e-01,3.319018194136987288e-01,6.686967217513030137e-01,3.043618335427321409e+00,5.468349810461964333e-01,6.992836279558434232e-01,4.285566074585961394e-01,5.265217512076675987e+00,1.766296871018466552e+00,1.521912178488308509e+00,-4.664096044694477916e-01,-3.441253982387569854e-01,9.889126078659906671e-01,-2.102090202785827922e-01,-8.390798380878038421e-01,-6.269314868198775370e-01,1.669941706865499587e+00,7.622543126625322962e-01,-4.762804070828950964e-01,-8.381814092142021444e-01,-1.296155120914684877e-01,1.713975751472603948e-01,-4.536851389632082787e-01,-3.918560112594060563e-02,1.493562531063840293e+00,-8.713654686862309928e-01,-8.005073355394194401e-01,3.649734676386316767e+00,-1.978093589787344730e-01,-1.078351972768125527e-01,7.532795378265166875e-01,5.540791132287646859e-01,1.104672943935006257e+00,3.949946291133496490e-01,1.743016408597553024e-01,-4.821656727265222209e-01,-7.541686621457730499e-01,4.912335763955462120e-01,3.448051937112206478e-01,-4.120606260417544187e-01,9.523139364858415057e-01,2.834453713966814670e-01,-7.272123524036834263e-01,-3.452043563357015121e-01,2.342778217811233965e+00,1.148058914962454713e+00,-1.728385237672915631e+00,2.597019930657377351e+00,-2.647597726699722487e-01,1.978725071167141358e+00,5.696752099885566967e-01,-8.265060460998825409e-01,-4.785826032849466172e-01
1.063108658262698736e+00,1.004259313928679953e+00,-2.756769407188084942e-01,9.894387709650109830e-02,-8.353796213525151171e-02,6.499380912706695934e-01,5.470514369228000051e-01,1.996785082665774036e-01,1.054001732749477505e+00,9.661821537144546501e-02,3.061341204458533083e-01,-1.437062373997151643e-01,-4.635936875202415486e-01,4.045488771623963475e-01,-4.882542959930591397e-02,1.596399207432082301e+00,-2.529683057162308013e-01,-7.888134448663521869e-01,2.988850377088768107e-01,2.163587617823609088e-01,-8.479951717437536063e-01,1.678978015105070387e-02,-6.636826147513564811e-01,3.656075302127954618e-01,1.118408060770403001e+00,-4.002259521716046153e-01,-9.015606277128287993e-02,-6.011156882037005378e-01,-1.639109989782736587e-01,-3.631404028280877938e-01,7.904692050584185559e-01,2.158429040630348794e+00,2.467098772780894067e-01,-2.044632803866914261e-01,-7.867643401254615920e-01,-9.013658798527209859e-01,1.559542862743878322e+00,7.952771072236713978e-01,9.066257084694506752e-01,5.057151813464833001e-01,1.112037673354820289e+00,3.091592893002643727e-01,-9.225898295889908840e-02,6.558260235414421491e-01,4.445946598419611151e-01,9.419693344459175721e-01,2.485896363998972625e+00,3.660102948189387084e-01,5.663665801533716015e-01,6.682158006160049402e-01,4.753329996807370783e+00,1.504393810616164728e+00,8.039640190309924606e-01,-5.080411326128377869e-01,-1.025036673846570490e-01,8.724604574709804439e-01,-4.610397597925761648e-01,-4.485049549308829375e-01,-5.259540914966366332e-01,7.302315564414770810e-01,7.683595238645782866e-01,-6.021820140123843590e-01,-5.806381871639678671e-01,-1.957839360261706130e-01,2.473129800677549284e-01,-3.603942924960299443e-01,-3.922380431342573082e-01,1.022014087391655446e+00,-9.786377383274923458e-01,1.468812431823758313e-01,2.978562340245339612e+00,-3.129971678220814790e-01,-1.548990517982489767e-01,1.064711246818093038e+00,2.615093131464288345e-01,1.346736779165976117e+00,4.902471589452678247e-02,2.509773859365627136e-02,-2.483414152905314420e-01,-9.053910616906719611e-01,4.041835830847167466e-01,-1.566155984480114283e-01,-2.236982191015988164e-01,1.131509348190374409e+00,1.552706687502094507e-01,-6.237277195238127847e-01,4.742939540713236868e-02,1.529376833705911043e+00,9.898427041552241290e-01,-8.361058834097471193e-01,1.726854643863364736e+00,-6.231272391962974222e-01,1.497363734270839242e+00,5.148873347480419360e-01,-4.683403862998186118e-01,-3.515190077427580162e-01
1.358405448952529682e+00,1.943864408052500270e+00,-8.875375147155848410e-01,-2.317718208749441899e-02,-1.883275078321152707e-01,6.193003395150755708e-01,3.538891464245472185e-01,6.905706574625433136e-01,1.057131828896783698e+00,-1.592150475236600859e-01,6.254696476717601650e-01,1.707019908265581809e-01,-2.880805112558115777e-01,8.597916258095151809e-01,-4.041025747523327993e-01,2.258759946162360421e+00,7.410507748041101905e-01,-1.315482106419947339e+00,9.337704867678164877e-02,-1.445950286489471326e-01,-3.571512966500081099e-01,2.535552324462432838e-01,-8.922861407066786654e-01,3.105244984023951549e-01,1.191528051252523479e+00,-3.141145404243042560e-01,-4.402548231568367276e-01,-4.159588513761083295e-01,5.450259409756563755e-02,-5.514155597640618689e-01,7.578376254325405181e-01,1.490920916532794571e+00,3.042600016438747335e-01,-1.422260635721303568e-01,-1.046687730572370745e+00,-1.151006112162665573e+00,1.987696711464658650e+00,4.626558101922882971e-01,8.584388306822876569e-01,-1.286637632026257361e-01,1.129656061607347883e+00,-6.408839302859581366e-02,-1.520493002445885700e-01,1.078985012738955751e+00,-5.527952490042431499e-02,9.849697317620449422e-01,2.529839403892329752e+00,7.623236164050001262e-01,6.029170838160113899e-01,8.642075819119811042e-01,5.351707113794801352e+00,1.533894364333736382e+00,1.300333184466039516e+00,-5.439535072496555212e-01,3.480442034270485596e-01,5.481190708406303846e-01,-6.362428872303417249e-01,-3.779724296745881063e-01,-1.329589231077683564e+00,7.091430310676902771e-01,1.298012502531893098e-01,-3.177065364433823702e-01,-3.468077613074996846e-01,-6.383875622055789067e-01,-5.422679958135145917e-02,-7.528808954249288643e-01,-4.770923354072998945e-01,1.172241482125810919e-01,-1.041353810645027300e+00,4.423429890667360809e-01,3.368374949628631487e+00,-1.839107510926647482e-01,-6.590895789294825002e-01,1.017063901190834008e+00,3.844727296596867627e-01,1.152409162292471034e+00,-5.577317521556474089e-02,3.270588738725073163e-01,-2.222932539541986330e-01,-9.380370503197620335e-01,1.336943411060723896e+00,9.213957672884126593e-02,-1.907704539379868058e-01,6.914749911023752027e-01,5.540866016142480532e-01,-6.013840261612769522e-01,-3.169651127573308580e-02,8.169107085998725815e-01,9.956262978425992616e-01,-1.300600729022530100e+00,1.786024723113498469e+00,-8.198456615453723062e-01,1.743210249580752436e+00,2.220447236179667050e-01,-4.571092378462451866e-01,-4.588463382711968075e-01
9.976406501124349679e-01,8.971716403338382273e-01,-2.889906883793639802e-01,-4.970859339067195126e-01,-4.751929817689203861e-01,3.929272585763421421e-01,-4.347598447062610005e-01,5.024562317766873010e-01,1.868337665823925464e+00,6.967084575382284095e-01,1.015976473414830883e+00,4.744129907236256938e-01,-3.522369574323845898e-01,-2.341412758598508670e-02,-5.080434089519467733e-01,2.537096113298317412e+00,1.652743950913055371e-01,1.323342656466222345e-01,-2.432395571709628987e-02,1.485903857755069002e-01,-6.966307688684024724e-01,1.053031471704111821e+00,-2.269534719831737823e-01,5.759787960394588402e-02,1.455450571021617012e+00,-9.410917054782256264e-01,6.361522664538797611e-02,-5.695409233721930864e-01,-1.027579556383084736e-01,-6.824780459898491802e-01,3.392618629757714332e-01,2.448608358328374202e+00,-3.469579290770467561e-01,-2.857091846175292549e-01,-5.530559975694464558e-01,-7.585829677791118275e-01,1.512967714636845651e+00,1.153931262094983978e+00,1.702019051167022123e+00,1.983802434007639448e+00,1.019521778212904906e+00,1.159803736120172402e-01,4.282167656923887011e-01,2.651056359116307215e-01,-1.148398069947798028e-02,4.957622395140054983e-01,3.141060513237643015e+00,-9.268079896864878098e-02,7.563012564759860612e-02,1.071542096185865489e+00,4.332788539860955801e+00,1.550746606900551994e+00,1.103509767095879113e+00,-5.683138798022383531e-01,-9.102140823571447381e-01,1.754954056935495998e+00,1.072968181451204206e+00,-2.291179617013378300e-01,-9.437798121630395221e-01,2.441610241906417400e+00,7.710822544484772223e-01,-4.287534876621115765e-02,-3.731210119911010370e-01,1.146947459785782497e+00,5.968527357997864824e-01,-3.687852931799362466e-01,-3.973152504505441107e-01,7.805063782671782802e-01,2.859904127001435259e-01,-6.217560585370768278e-01,3.191068852322110239e+00,-2.554680648174137425e-01,2.404609468212512424e-01,2.570457471783391679e-01,-9.653050624999325036e-02,1.130243575150600810e+00,1.969206418051897001e-01,1.362284725925422713e+00,-8.607151535595813918e-01,-1.551094013873135502e-01,7.471122601572872668e-01,9.070604008644258531e-01,-1.589103873775874753e-01,1.073096152825387062e+00,1.266743619034470747e+00,-1.129709471440266011e+00,-6.695488171884023121e-02,2.044011634070029615e+00,5.781665601748269268e-01,-6.833067235504033388e-01,2.605595501562294025e+00,-1.267707285947058393e-01,1.082956307996961520e+00,8.474207758114585265e-02,9.435849317993985075e-01,-2.798271206949973222e-01
9.250938352694911826e-01,1.157074484082600385e+00,-5.021392495703287384e-01,-2.525297877940684832e-01,1.559093572242521430e-01,2.927201177539113242e-01,5.696662970020877070e-01,-3.393227870061300833e-02,-3.415165152641088664e-01,9.369460330123979830e-02,1.216625940331044209e+00,8.527802098999483216e-02,-2.319295777354755950e-01,7.009278738864501701e-01,-4.852121979026773335e-01,2.101818472343218946e+00,3.250923091868599957e-01,-8.468718897473663798e-01,2.246334647992855316e-01,-1.238567523634541978e-01,-3.180035360923625376e-01,5.442639341462240932e-02,-7.348245194325867535e-01,4.614024360107866762e-01,1.350724374282213924e+00,-3.368921883970406039e-01,1.376657372336323459e-01,-4.858647739096686458e-01,7.631424851627288675e-02,-6.608690740050489065e-01,4.685732589421167105e-01,1.654046431735051836e+00,8.074782792202328530e-02,-8.990250809023730971e-02,-7.560659035264266636e-01,-1.115193619353074928e+00,1.164343548295382780e+00,9.759307819525655514e-01,1.618730896150990306e+00,5.607186398081285272e-01,5.719496792087203074e-01,-8.368055535697477287e-02,-3.227793048405254162e-01,5.075737150718143686e-01,-1.620970343643801659e-02,9.752562257678416557e-01,2.178095801434376089e+00,-2.916266181996644835e-02,2.091974279668063486e-01,1.207465370416538342e+00,4.362559597990469662e+00,1.204481725052187979e+00,4.088795553873803001e-01,-7.360079312374591121e-01,-2.460120521119491532e-01,1.171860433307229998e+00,1.938221388639031484e-01,1.609447166657481387e-01,-8.548016658415704683e-01,7.863692124221266511e-01,7.879864734119064185e-01,-5.578466465301492594e-01,-2.817737812938096997e-01,2.929677029568265034e-01,1.353138388723283958e-01,-6.996271983537682981e-01,-9.091080860689368937e-01,1.597173359133086112e-02,-5.524967337198961603e-01,9.101933550651061244e-01,2.700414291972030867e+00,-2.631921012725511599e-01,-7.314098862742059171e-02,1.217933817294388543e+00,-2.476699132704343609e-01,1.637503815914852501e+00,-2.935164352092747286e-01,8.738893931225200085e-01,-5.473379394802613263e-02,-8.002574618810192053e-01,7.884427717332521679e-01,7.599446282164186439e-02,9.449953268142163854e-02,1.017218489113075108e+00,7.985080907214791024e-01,-7.712422634571487468e-01,3.179681938354618209e-01,8.542537007662187598e-01,5.542221637438332627e-01,1.324182429926837323e-01,1.339211372961776947e+00,-6.774045989569705828e-01,7.118073999774823246e-01,9.342179209056802880e-02,1.039898087862359821e+00,-2.428172333665916116e-01
1.045501123327716275e+00,1.739164640231714021e+00,6.682101852975726175e-02,-6.215865246315588344e-01,3.315345056443491645e-02,5.828456768631790075e-02,-2.317298495861680463e-02,1.456442218501789732e-01,1.411116268432186960e+00,-5.288485841115528330e-02,-2.115535820464765071e-01,1.369829417024225615e-01,-4.960626846161101389e-01,2.284942373348402556e-01,-1.333113626693449016e-01,1.341906575343389418e+00,-2.266632510177498672e-01,-1.591424454640652519e-01,-9.807930228445235765e-02,1.304780176889112076e-01,-8.274272960286208622e-01,4.933658943379859441e-02,-7.125848874613954775e-01,1.775585294777614065e-01,1.485400688228827093e+00,2.680086726749919546e-01,4.558855904085686028e-02,-5.723710435423176035e-01,-8.958095885308881012e-01,-8.997513108732091425e-01,3.612385497301356940e-01,2.245711744239591745e+00,-2.800694399254272660e-01,-1.412252057581582787e-01,-8.592745615823411676e-01,-5.437923894776397482e-01,1.856591603147895952e+00,7.397348518154818198e-01,1.173509507557926268e+00,5.054233922437747495e-01,6.948915072932232428e-01,3.850751598247866836e-01,8.845633834488599023e-02,3.353172481743648126e-01,6.592940889569742779e-01,9.710381868693397367e-01,2.759497331348716553e+00,3.415250997500144936e-01,1.662745468902857848e-01,1.087851666419570762e+00,3.876578288795839544e+00,1.469319487366846921e+00,5.338288504128068102e-01,-2.034460653351814752e-01,2.128154958243433370e-02,1.008938831984625750e+00,-3.180900122347821712e-01,-2.627779053171541146e-01,-9.341829358046946918e-01,5.801255150909265801e-01,1.340206085934805003e-01,2.465781761100693248e-01,1.174280546358404953e-01,4.018523321550196981e-01,1.123330051893695947e+00,3.994131092731210142e-01,-2.841489800386242104e-01,7.139940569043010665e-01,-1.355828307307338776e-01,1.081731499004092711e-01,2.307841980619823374e+00,-6.181427541143406090e-01,-3.091159826620495932e-01,1.531399560892533207e-01,6.632734232788468909e-02,8.233363623049909652e-01,2.389916797279373339e-02,1.442480419923102275e-01,-1.071127280434028606e+00,-2.862236389776580125e-01,6.860705217443268111e-01,-1.859409669270441490e-01,-2.531654521031844185e-01,1.422669095417481655e+00,5.295131658524889762e-01,-7.789575228059397727e-01,3.517379084152296165e-01,8.666505644828279564e-01,8.146567346944917354e-01,-5.622468776285186598e-01,1.583044147462113083e+00,-9.763580922707293386e-01,1.458970322833876843e+00,3.210579522871336855e-01,-5.407550908819864777e-01,-1.506123585578534596e-01
1.172149639644149532e+00,5.597927153153586799e-01,-6.381994051318239380e-01,5.056025102935235438e-01,-5.453161435751460173e-01,1.358854772573482528e+00,9.598117121287996767e-01,5.763380564279267926e-01,1.833119388262121063e+00,1.756796588585054497e-01,1.944139478340594362e-01,-3.022980412613286427e-01,-5.075153307458545315e-01,2.334271852950968174e-01,-7.722637762215484036e-02,1.645988938297520798e+00,-3.286889100448630030e-01,-1.205817758241120696e+00,3.533670696974759995e-01,2.571442090188587049e-01,-9.092894946431822056e-01,4.186436946342697030e-01,-5.787789481412640713e-01,2.683817778752214389e-01,1.057740334041155972e+00,-6.940265266509220154e-01,-5.048756979940480782e-01,-6.837597744003010014e-01,-4.168760087426545136e-01,-3.529350751838112865e-01,1.138740666659938228e+00,2.411257489607407933e+00,5.827887397240840706e-01,3.625063200254519113e-03,-8.532667607498720663e-01,-9.303356852521085241e-01,2.034811327199926634e+00,4.450553969813754729e-01,7.769543307391892917e-01,4.202394236445039510e-01,1.685573010865555332e+00,4.943909097543194298e-01,-1.665485572760547206e-02,8.927276131366168599e-01,3.985703221456644574e-01,8.118594828306430200e-01,2.443415257169321286e+00,7.996574394699969002e-01,1.018884965613246374e+00,-3.507342501954618941e-01,5.796450228235635826e+00,2.278869612944959488e+00,1.454496671819117903e+00,-4.545050675221437020e-01,-1.525047304746807164e-02,7.378827419468758642e-01,-7.431601274147116021e-01,-9.505297217858622583e-01,-5.358323703280871708e-01,1.629814729189379197e+00,4.215381794804078375e-01,-1.073729744518687079e+00,-9.571369829433731269e-01,-9.846299095424447811e-01,1.775845459164804296e-02,-4.404096712440224159e-01,-2.302124444184484586e-01,1.502826242961756265e+00,-1.497530362830286288e+00,-1.514477343930973330e-01,3.479591022739023209e+00,8.386339647663626495e-02,-2.202538781360020570e-01,1.003584308169284123e+00,8.162831973181927658e-01,9.236149630533029287e-01,-8.903407299269344710e-02,-4.361349468962379961e-01,-3.827611349258750462e-01,-1.277976868479010264e+00,6.042813606548548266e-01,4.358481482022621978e-02,-6.071349496136404511e-01,1.205866324723336103e+00,-4.865438455651527327e-02,-8.354590615520168795e-01,-3.960852830853389128e-01,1.914128487012419777e+00,1.508047391447726149e+00,-2.169425477513342582e+00,2.160507080567376725e+00,-1.485216710321685119e-01,1.957751432908521938e+00,7.840174038814833324e-01,-1.546568039775318315e+00,-8.423569808747248810e-01
8.440981493613278763e-01,1.517925580719101442e+00,1.172708696340158813e-01,-7.968400503734653917e-01,3.305428429358030495e-01,-3.437202592344888452e-01,-2.045689189558633214e-01,-2.106529974349305168e-01,1.738126069973171539e-01,1.781551088341180866e-01,7.511666295815286887e-01,3.082095503687196647e-01,-3.327953348595249494e-01,4.128018675375434987e-01,-3.344729247555356944e-01,1.840405829375932001e+00,3.796796372848526557e-02,7.476057063447832940e-02,1.110022827384523486e-02,3.020043176207829611e-02,-5.814189683917813101e-01,-1.097256804139262742e-02,-6.263576752980293261e-01,3.342646272080624925e-01,1.499605443680922967e+00,-4.236646646272617528e-02,4.765349239752197930e-01,-4.956184533983462037e-01,-1.777316107659231426e-01,-7.833453882405914115e-01,9.299722638511692674e-02,1.953040248413946189e+00,-4.591802485187537197e-01,-3.089054310863913466e-01,-6.477750266761990172e-01,-7.593330236964579427e-01,1.058488976880374910e+00,1.266446396540237274e+00,1.669241288868073436e+00,1.091290601763384771e+00,2.365824281705338206e-01,2.560270186887309007e-02,-3.714762878539588226e-02,1.084744883503114127e-01,3.053712881298955018e-01,9.396617090389290938e-01,2.647076607457013342e+00,-3.383315770008913370e-01,-2.346797873541898172e-01,1.919215461350324947e+00,3.236554841296036766e+00,7.850852343411702794e-01,2.624045749876402489e-02,-5.437244562072701681e-01,-4.737240158064942586e-01,1.457131262686814033e+00,5.532965221993858540e-01,3.335168687935397003e-01,-8.198655736282931539e-01,4.934366499601430256e-01,8.822435245109243596e-01,2.097673990840276392e-01,1.372588936477659449e-01,1.287872707051763266e+00,8.579162345113989785e-01,-9.539598895566336889e-02,-7.023586804487838009e-01,1.474293313324006593e-01,2.926285086051269024e-01,4.629718253632515435e-01,2.199471257290831705e+00,-7.097618932774996114e-01,5.768052089339621713e-02,6.086457271550809178e-01,-5.836775042153596882e-01,1.560075990296473591e+00,3.302002676033566342e-02,1.123763346625583415e+00,-5.556262047361695267e-01,-1.269856171795733513e-01,4.927956346624583484e-01,3.744862289146580481e-02,2.102194153394835174e-01,1.196167211179678169e+00,9.935437394211202866e-01,-7.393021265622768956e-01,6.080463389116681494e-01,9.099827039894803349e-01,2.197210654036696464e-01,8.341142996659529629e-01,1.388507689928018873e+00,-9.762462033474617051e-01,6.174948130058265372e-01,-2.889706475433989619e-02,1.389404123481025710e+00,1.788500841842642908e-01
7.827896547363194513e-01,4.231294579720962235e-01,-2.019396578429315525e-01,-2.741199477061277978e-01,-1.597309854587624089e-01,5.288097117225037946e-01,4.852024149271556563e-01,-3.500262648294706624e-02,5.977974327840559488e-01,4.534366286175900984e-01,9.292673480723931956e-01,2.637922325136293766e-02,-3.709915598279528437e-01,9.133427717363644394e-02,-3.884850273599871340e-01,1.863753568926557636e+00,-2.977518573808869418e-01,-2.878244684028536948e-01,1.938528777092179967e-01,1.278510286159829090e-01,-6.780647197090425848e-01,4.582964606213987269e-01,-4.059384179730633480e-01,2.859610753075251255e-01,1.446379019459319792e+00,-5.591679145952347385e-01,1.854567815567095268e-01,-6.509592354012773141e-01,-4.200023858652375264e-01,-7.443241043995253436e-01,4.733465811429640735e-01,2.406297965555547425e+00,-6.630500529383731578e-02,-2.662246339129842321e-02,-5.744711821267440843e-01,-8.063890939900153487e-01,1.266542562324541210e+00,1.065983780824568461e+00,1.820973779276482407e+00,1.376985027233497139e+00,8.109758841107095328e-01,2.720680260204225709e-01,-8.128310911294962804e-03,1.760301091808746388e-01,2.498269610923640749e-01,7.377605397517494890e-01,2.427916422874043079e+00,-1.435587956255109099e-01,2.291080433510013226e-01,6.591936773129210003e-01,4.256660130918644924e+00,1.677280286789059716e+00,5.225976569416741491e-01,-5.948446888272698185e-01,-6.924964592606615010e-01,1.585007863821821017e+00,5.879854032979647815e-01,-1.243404544582814575e-01,-5.355548102277891687e-01,1.811292670416977835e+00,8.326637652560211489e-01,-6.292118633918105663e-01,-4.361910510131672414e-01,6.440273454002566345e-01,5.531377330785937074e-01,-2.521918675204030125e-01,-6.796969677826298906e-01,8.389235906234454587e-01,-2.444810088306915707e-01,2.188564403981605455e-01,2.650018943245179948e+00,-1.830652316943532365e-01,2.932616090294186684e-01,7.050944516939813278e-01,-1.137906217400552478e-01,1.279872807854568695e+00,-2.345517030372515910e-01,7.609509155508531464e-01,-5.798551397204771973e-01,-6.125617435480696926e-01,4.340809936282915005e-01,3.254391906302270820e-01,-1.731138807053260176e-01,1.424087466753818587e+00,7.934296331861395712e-01,-1.094112634541064111e+00,1.287363054728160594e-01,1.597023251980937975e+00,7.258689470911514618e-01,-3.224387805373590266e-01,1.824431376977698749e+00,-2.042987646642534516e-01,7.601112246313028731e-01,3.030369456352690061e-01,6.616043008942342762e-01,-3.968174853172770078e-01
1.243304004844123067e+00,1.891888786325895300e+00,-4.944273107004396040e-01,-3.556036379608176201e-01,-1.966498555189272746e-01,4.124321959749263078e-01,1.217293030378322483e-01,5.494360229224793946e-01,1.503072804870912993e+00,-9.229776058625074886e-02,1.770184145798675002e-01,2.067952353963133094e-01,-3.883202765830646719e-01,4.939485709926271784e-01,-3.326447416302623639e-01,1.877821477754193946e+00,3.353476269564547585e-01,-7.440002425152023591e-01,-6.888871914067898339e-02,-3.578743960559733345e-02,-5.630406545093984416e-01,3.174008419322413843e-01,-7.820042015987958006e-01,1.790764025828622263e-01,1.389830645593800096e+00,-3.339949789170811728e-02,-2.921602378467447192e-01,-4.944994965106926932e-01,-5.441209719468961259e-01,-8.148771881530366690e-01,5.617178614841435991e-01,1.904586247641294694e+00,-2.121899040401276082e-03,-8.928086124142814439e-02,-9.828309960827015246e-01,-8.210615327614744219e-01,2.093737635632461291e+00,5.110938558595332637e-01,1.052627736277122139e+00,2.026707029276202388e-01,9.904662875364247387e-01,1.751089458321495873e-01,3.170669520303914801e-02,7.331449989095273345e-01,2.587447889168837389e-01,9.313535530350506297e-01,2.708649368451928385e+00,6.520397178317498543e-01,4.163725547734196120e-01,8.328366679295589048e-01,4.766028136910689383e+00,1.675116451717494570e+00,1.085017531581770500e+00,-3.305072789459416183e-01,2.087973601143342517e-01,7.865011393774127280e-01,-4.572202605593607139e-01,-3.969313824920718270e-01,-1.261304792100018446e+00,9.164059490105529449e-01,-6.570305557885028347e-02,1.080834756239087979e-02,-8.992890039842366123e-02,-1.857289551262301108e-01,5.838083504757469733e-01,-1.325304321611585623e-01,-3.347651709783457386e-01,4.134394485985873335e-01,-5.435105095297573241e-01,1.789439500085524271e-01,2.912845531533183152e+00,-3.369604109019218030e-01,-5.329138448461960831e-01,4.165616305499276750e-01,3.184317937334723014e-01,8.051718205494832192e-01,-4.621336006254944673e-02,2.364435293572165753e-01,-8.052547085909632640e-01,-5.843085637230099882e-01,1.173098532469036170e+00,6.826831948022193952e-02,-3.063924035519725031e-01,1.072551765421032588e+00,6.255000107300278112e-01,-7.796213676839802709e-01,8.362062065324110671e-02,8.298899971788569196e-01,9.802674533207600405e-01,-1.226813370468526010e+00,1.818596737203681535e+00,-8.219029678499500946e-01,1.699870980862307590e+00,2.664444252692929060e-01,-6.790397722662018243e-01,-3.942574303119896761e-01
1.351181759565182716e+00,2.043695108372336477e+00,-8.431209688913213762e-01,-2.859775538087873104e-01,-2.174137883177880148e-01,2.783708964847615985e-01,-3.783753404404235909e-01,7.927589061890332189e-01,1.202781714980866834e+00,1.748736669690297285e-01,1.217267765172814764e+00,5.540604218815303739e-01,-1.973191423931162092e-01,8.321532153791990627e-01,-5.725934783916883930e-01,2.943642162571011411e+00,1.107725675334141568e+00,-8.110546314206129592e-01,2.087072427096119814e-02,-1.528313453924498577e-01,-2.757350312302412898e-01,6.085442028978972351e-01,-6.904270923860951203e-01,2.469800586901017836e-01,1.209599511386265647e+00,-7.594350897196950889e-01,-2.250393186847069182e-01,-3.348488217761992347e-01,6.560501649283725367e-01,-4.347878284710616770e-01,4.979662710539423665e-01,1.425253576071626505e+00,-1.573449976376345427e-02,-4.232074064591993534e-01,-8.770936301062104423e-01,-1.209861765776863329e+00,1.641068855228855483e+00,8.734311446965912218e-01,1.091804275766835364e+00,7.168987067151124659e-01,9.886945415814792915e-01,-3.422427963591710420e-01,8.579097528347007229e-02,9.474938403263953868e-01,-3.882292592902492068e-01,7.927191838726667106e-01,2.954907121814955850e+00,3.451196276872890434e-01,2.439813340777713946e-01,1.626301269275333805e+00,4.936965023673747233e+00,1.040731584447039060e+00,1.337692825837243582e+00,-7.180143474271503123e-01,-1.492846227801324643e-01,9.776804348919095888e-01,2.488194101172242489e-01,-9.776535633306517037e-02,-1.463551106348984332e+00,1.106212227303103424e+00,5.879201757875551770e-01,4.979858353593480391e-02,-3.017812059535909253e-01,3.030406196264201490e-01,-1.268591149193640799e-01,-1.066486336835877236e+00,-5.218608183148456536e-01,-1.670748835287938494e-01,-3.896691930511078095e-01,4.014057540589505146e-02,3.617407878162273605e+00,-3.063145300094659018e-01,-4.206355836934351222e-01,9.600473341277521167e-01,-9.871498256466354482e-03,1.494787223170913393e+00,2.544055744935664332e-01,1.299383346310948983e+00,-1.345552717769122886e-01,-5.090713779584918885e-01,1.342284213408092342e+00,6.037280013804581236e-01,8.929894132387194983e-02,3.733152501038603521e-01,1.126610088570021428e+00,-6.141523940222245459e-01,4.352409100017440302e-04,1.216836705392225992e+00,5.347559900005520728e-01,-6.614598842724830341e-01,2.201769631613415434e+00,-7.460992833530584178e-01,1.431270836318762729e+00,-1.097210964283433232e-01,8.900035546198372671e-01,-1.684579292568466613e-01
1.126492722622807419e+00,1.952521209088739162e+00,1.369130521424372082e-01,-6.736858761974378051e-01,-4.311944417897863036e-02,3.821442830144222702e-02,-2.223002714680028524e-01,2.862057508058008515e-01,1.974314953876031398e+00,-8.592158760132004303e-02,-5.379780290754745398e-01,1.813993958445121457e-01,-5.530897044075194779e-01,1.473544109068639085e-01,-5.665811608809756539e-02,1.256463269743171463e+00,-2.673361888871761405e-01,-4.511127754838815257e-02,-1.797841697330944122e-01,1.857029125475381237e-01,-9.385908469084121020e-01,1.008230867140262332e-01,-7.099363679009776940e-01,9.648515140738320173e-02,1.485726963447240312e+00,3.488570303743643297e-01,-3.438300288636578217e-02,-5.770299664690958785e-01,-1.043324492302736717e+00,-9.136117951205346976e-01,3.659804904307597528e-01,2.347744789629619078e+00,-3.413323228886182004e-01,-1.832293043695339407e-01,-9.029433858045419203e-01,-4.376873886720775153e-01,2.076445515354712779e+00,6.573773885255549398e-01,9.906673192042172449e-01,4.739090973405689633e-01,7.933148514522792016e-01,4.664023553398365385e-01,2.141542449779118562e-01,3.682674597125430438e-01,7.702031510169242701e-01,9.550916329735184007e-01,2.957562187644716900e+00,4.903338232623997150e-01,1.896381027883623505e-01,1.066335612455543203e+00,3.887093609469886690e+00,1.531151562239336572e+00,6.846430674529440097e-01,-8.482237626967131794e-02,1.116156515601054444e-01,9.248271895594388781e-01,-4.689061158674182606e-01,-4.071436705749095220e-01,-1.010156536644171821e+00,5.615290448942900081e-01,-3.785160618723112935e-02,4.581064652193518327e-01,1.801403803807486159e-01,3.658765198369020033e-01,1.285463245935091425e+00,5.873763619388547852e-01,-9.892225258678122302e-02,8.668961264183459026e-01,-7.822452056892323369e-02,-1.582444213980198633e-01,2.345132129530961063e+00,-6.869319691127107053e-01,-4.112752131533257138e-01,-8.444533637299392326e-02,1.894796540632456838e-01,6.254845388109806503e-01,1.490320104067264784e-01,-1.129972807711643323e-02,-1.284960027254980153e+00,-1.744878703801019115e-01,7.248510332399503708e-01,-1.998095081780179028e-01,-3.425692077759991960e-01,1.437110856595593678e+00,4.742011498660418933e-01,-7.558973221948263044e-01,3.086477535287459606e-01,9.160743564055058297e-01,8.961271126374972251e-01,-8.530892688857528716e-01,1.730457402423335456e+00,-1.043635797536254239e+00,1.729607888304522945e+00,3.666722636215263842e-01,-9.679481033993952988e-01,-1.404619769114966166e-01
1.023530197176447665e+00,1.526634333233248597e+00,-1.123445843738968275e-03,-5.560497335269665165e-01,-1.074569249635991264e-01,3.183376206816821430e-01,3.001029808019554657e-01,1.733418298625507559e-01,1.576380964449033195e+00,-9.773923267745057708e-02,-4.219775127126740855e-01,8.052208772338573239e-03,-5.333700065669474411e-01,9.069381613223929939e-02,-1.522378653672258331e-01,1.112204650946484907e+00,-4.075952396602621208e-01,-2.957202837453450361e-01,-1.238006284488111508e-01,1.237017166394609458e-01,-8.495533158335257795e-01,1.379992607855699549e-01,-7.124871044134857279e-01,1.287963395585089155e-01,1.570338669674776089e+00,3.932047279224373248e-01,-9.566862787305666083e-02,-6.384941613923963422e-01,-1.354580030352597220e+00,-1.082928362583949866e+00,4.549706748297316916e-01,2.423851536102016979e+00,-1.817522250959293650e-01,7.440013646849011342e-02,-9.091858157624350678e-01,-4.614301354463375970e-01,2.120524291510721415e+00,5.204705502218804902e-01,1.257465295581983611e+00,3.412740652749808312e-01,8.235823855268908922e-01,5.584818127728026216e-01,6.691872751254521190e-02,3.207698569652416842e-01,7.659571123370412238e-01,9.627268968368962732e-01,2.612614634682913994e+00,5.330035705264206669e-01,3.305048220243296808e-01,5.174632239632958042e-01,4.155060969044012786e+00,1.938684145610497289e+00,6.386281150557928665e-01,-9.632187904686750901e-02,1.306383334845220290e-01,9.658771365543072918e-01,-5.154278582568526668e-01,-4.472598130422603679e-01,-9.328344487644848471e-01,9.221063811930783061e-01,-2.150895306472682955e-01,5.796571978536879666e-02,9.378643609283533744e-02,3.933846900755777476e-02,1.255348751418853270e+00,6.180643182953042825e-01,-2.534361965741686040e-01,9.159946285185445181e-01,-2.936408175275458943e-01,1.623663973410230388e-01,2.222795452341299161e+00,-4.582836452145128692e-01,-3.459272085117107154e-01,-3.774740875156309960e-02,2.967190811181958376e-01,4.747622411704613965e-01,-1.939479818108409692e-01,-2.159935258608122188e-01,-1.323820038987260306e+00,-4.289680015265293078e-01,7.808590419879609668e-01,-2.232196921182508786e-01,-4.794870266634917444e-01,1.667775598975044016e+00,4.173254794908324294e-01,-9.571130395333550256e-01,2.498915257539193746e-01,7.808249398542719266e-01,1.083510288728966708e+00,-1.100502166127973691e+00,1.572005993309215643e+00,-8.091027358089901700e-01,1.576538816926694064e+00,4.709729301360661147e-01,-1.190835042136088706e+00,-4.020611275050297584e-01
1.199713967470372511e+00,1.790807472683635382e+00,-6.333011509534604011e-01,-2.857232403990628833e-01,-1.141760659203493872e-01,4.470876650270642072e-01,3.569067809262129187e-01,4.497441463316423915e-01,9.051022940371309389e-01,-1.233327758894166293e-01,4.912774228211679306e-01,1.623722643956385103e-01,-3.189158960193980707e-01,6.461615029838153612e-01,-4.244015560195381620e-01,1.979924942213354466e+00,4.617046151151936173e-01,-9.690093199055982431e-01,4.711685871107790247e-03,-1.283071297236740571e-01,-4.057689726361634053e-01,2.381974885952934939e-01,-8.349417876154958673e-01,2.684751576144217000e-01,1.382304452235284309e+00,-6.888438195161247779e-02,-2.640430148648449382e-01,-4.719572640298468347e-01,-3.891732405908763237e-01,-8.107992906077796658e-01,5.790095073714867091e-01,1.715744858625667391e+00,9.852774564078042863e-02,-3.096343625033709523e-02,-9.834226722877598137e-01,-9.595398834874251381e-01,1.934098669827699624e+00,5.298660435828419502e-01,1.187176650608230188e+00,7.626809276799606518e-02,9.016418845504823310e-01,6.685961742666457486e-02,-1.283653551690814298e-01,7.689140685680726506e-01,1.202003953802348035e-01,9.766114455623946533e-01,2.478659690728878040e+00,5.792973741600225823e-01,4.269656549797671841e-01,8.425364167925929459e-01,4.850547243983543311e+00,1.625203085187091556e+00,9.770383587250875967e-01,-4.454416361225346788e-01,2.180711492868023793e-01,7.836303222655583989e-01,-4.164818111230702558e-01,-2.615435182394059144e-01,-1.255684470022485399e+00,8.451934837396235523e-01,2.183788283764212523e-02,-1.989738150096492242e-01,-1.352600645178159700e-01,-2.810209182995472288e-01,3.752316158528214984e-01,-3.556840763526695204e-01,-5.266971524771554281e-01,1.758298819541944669e-01,-6.783101620335938442e-01,5.202314697346912542e-01,2.904476089355749746e+00,-2.545830168208844668e-01,-5.122371637446990755e-01,6.840219713183978145e-01,2.347790229346870539e-01,9.815211590415313658e-01,-1.953843321919752352e-01,3.432964569203600380e-01,-5.648620970979232325e-01,-7.415221124391426777e-01,1.224973644010411977e+00,5.062976455818096744e-02,-2.228537271540982079e-01,1.017858616328525923e+00,6.629547634131840450e-01,-7.765240525252943282e-01,1.222827776366551822e-01,6.672942260507642720e-01,9.284876350524222666e-01,-1.011261524538425327e+00,1.629966497357471455e+00,-8.023515374139529310e-01,1.485069096823770973e+00,2.144538042686015278e-01,-3.473782934245894238e-01,-4.255900627002247028e-01
8.686008814949970347e-01,6.647223019699650681e-01,9.777357394703399540e-02,-2.387885252767995570e-01,-1.703890970377004987e-01,5.727337466987827419e-01,5.078712859643137456e-01,2.552332338054491556e-03,1.433400445269221724e+00,2.238466880960673921e-01,-9.286800551919660585e-02,-1.627924207722190042e-01,-5.640002001144865940e-01,-8.960418920581925128e-02,-4.449881998401800098e-02,1.147331087595315990e+00,-7.843902356731878855e-01,-2.068901245092259478e-01,1.306202984627162778e-01,3.136070004409585721e-01,-1.038049934065582214e+00,1.953945619190446958e-01,-4.966333504145503119e-01,2.099874087429227099e-01,1.406722212659848648e+00,-1.187520439508167880e-01,5.235932411854747615e-02,-7.281805180106315500e-01,-1.009372107562280796e+00,-7.655786779416190457e-01,5.962379971806355261e-01,2.715618282678951001e+00,-4.814145335807787363e-02,-1.013504836043832569e-02,-6.938018234472245194e-01,-5.263632119829224632e-01,1.699936001692654575e+00,8.041579279995441087e-01,1.324450738588787368e+00,9.407251972368658732e-01,9.848128580239497998e-01,6.293529768638047583e-01,8.088632814629714840e-02,2.073021446880981000e-01,7.729686496667333984e-01,8.449420238638720715e-01,2.551795968472530873e+00,2.310439729877839521e-01,4.085007635818053706e-01,3.318240346607710944e-01,4.223717261742034879e+00,1.907849885442211457e+00,5.684989646207827541e-01,-2.771287997502575040e-01,-3.238632141943304510e-01,1.236337606881616757e+00,-1.689341586770427561e-01,-4.937997815887541497e-01,-4.145184213632178705e-01,1.319679842142568615e+00,4.657565774892031829e-01,-4.289913389257022369e-01,-3.440908543376226536e-01,2.302799323636285367e-01,9.743124034570094238e-01,3.592459901546362078e-01,-3.066617324419095292e-01,1.407952048342786089e+00,-4.528240519113798657e-01,-5.896816666701121257e-02,2.425686432277103677e+00,-3.490006333747921463e-01,6.667557136311248744e-02,3.540757637473301855e-01,2.316630807251982005e-01,8.534769729892848211e-01,-1.114221549202403794e-01,-1.059651672062921213e-01,-9.743802135358260452e-01,-5.976439973133935712e-01,2.528833182018854209e-01,-1.134955244271437791e-01,-4.349555511954835141e-01,1.692590673706223736e+00,2.715914187840766658e-01,-9.774436243880947339e-01,1.233158394143984704e-01,1.550630634452460299e+00,1.057542813792362146e+00,-9.037302457226092933e-01,1.761792188521695390e+00,-4.388829240356150740e-01,1.343230672667364178e+00,6.053707430563011194e-01,-7.618262607406025566e-01,-4.257439029175522638e-01
9.057967074381236827e-01,9.797024725057297267e-01,4.516348306740582130e-02,-5.910094058577963771e-01,-1.945277119298354229e-01,1.378294929168409622e-01,-3.722857664694069757e-01,1.843864702546633705e-01,1.522672111613064816e+00,5.478175373697611317e-01,6.619606311405616950e-01,3.427061565392444664e-01,-4.203865164730030135e-01,-2.128341957674644014e-02,-3.133432808163886252e-01,2.052315259044558360e+00,-1.662752215979823589e-01,2.836596260139280234e-01,3.290210261448149598e-03,2.242208486380168897e-01,-8.358472911758448864e-01,6.231760016388168122e-01,-3.180289147028631525e-01,1.340190874356273487e-01,1.453585269494966914e+00,-5.841308283414899938e-01,2.555363154518913715e-01,-5.953568356641540937e-01,-2.799843030210886763e-01,-6.835969309136337158e-01,2.695390402116047968e-01,2.492279727028962277e+00,-4.209885343196817509e-01,-3.190477426861775267e-01,-5.478438504381102359e-01,-6.415737836189978616e-01,1.358828086578108829e+00,1.224764858333065476e+00,1.608829883104586411e+00,1.780001151049982688e+00,7.847427331132547090e-01,2.276973021592721969e-01,3.281165423413178739e-01,1.202779977820966489e-01,2.947878895448095005e-01,6.433685449104253884e-01,3.031856017439039430e+00,-1.961550739002798083e-01,-2.209363833886733575e-02,1.288372611255510058e+00,3.804651955719834167e+00,1.316421082875594228e+00,6.600669685219515692e-01,-4.867738397541432338e-01,-8.073891860206667825e-01,1.676075291813052814e+00,8.284332343345125471e-01,-1.233920548662317540e-01,-7.271054062920432326e-01,1.725709660228335274e+00,8.731242260603525596e-01,6.461957964462194948e-02,-2.193367098510915214e-01,1.260897403248490534e+00,8.498129484213768903e-01,-6.762509685561912676e-02,-3.954413059502554506e-01,8.659054651484590082e-01,3.107400629131127912e-01,-4.197633685424571048e-01,2.742490866154877249e+00,-4.801071704133906826e-01,2.459717886566461509e-01,2.814337231770175363e-01,-2.303874721797684044e-01,1.225574279939483091e+00,2.124152382481038770e-01,1.091191983397093779e+00,-8.655460908022346578e-01,-9.737947374357802666e-02,4.375567426892348899e-01,5.068754415104391731e-01,-8.780573242883868423e-02,1.249042802053119683e+00,1.021602696240162533e+00,-9.849646524995483432e-01,1.745220413696559614e-01,1.825613526882372550e+00,5.031264704578783942e-01,-1.814440906126372766e-01,2.208491175290284936e+00,-4.165190976494350661e-01,9.926620563860779622e-01,1.516900256850656215e-01,8.488372673133353086e-01,-9.343606124951964187e-02
1.252079590459216574e+00,1.974446504017214998e+00,-1.300170320858313189e-01,-8.586679364459647301e-01,-5.186218344521300594e-01,1.029353080544233578e-01,-9.854464842726939899e-01,8.360012329309692847e-01,3.050940868465659150e+00,3.647073428451965693e-01,2.152116644636198339e-02,6.587871744558675413e-01,-4.647151947549363338e-01,-6.383204992615880424e-02,-3.798324123737095714e-01,2.218826399452306308e+00,2.692828880059047747e-01,3.485758305976022209e-01,-3.696021005982965679e-01,1.459076102700877786e-01,-8.260826749449372564e-01,1.015272412867217922e+00,-3.961575320616849694e-01,-1.501748173829825228e-01,1.574127964623332154e+00,-3.216054095824507075e-01,-1.574268475549801261e-01,-5.212776037898234627e-01,-6.971347061889272556e-01,-9.392291465167649234e-01,2.276689998596975462e-01,2.463295053604225959e+00,-5.914080708059086255e-01,-3.217502607145756310e-01,-7.942682278332693357e-01,-4.627721671952284010e-01,2.227478682914802999e+00,8.018656123994383211e-01,1.257020121723667838e+00,1.448053710034591379e+00,1.047429553540864644e+00,2.600721017848459660e-01,6.557121617700202298e-01,3.753640097406333309e-01,2.872994426419890335e-01,5.817478880250882556e-01,3.570370423237918089e+00,4.010119584228813427e-01,4.015564059128143293e-02,1.218641427699833191e+00,4.168505317152752632e+00,1.639987426828322326e+00,1.354368755959613368e+00,-1.741184924097940456e-01,-3.779575658371453484e-01,1.373237708076857633e+00,4.613947294196437676e-01,-4.656243783402639336e-01,-1.418397620274338689e+00,1.946771082868629321e+00,-4.325890739860693834e-02,7.729599284653823066e-01,1.093116818093430032e-01,9.739505449319381114e-01,1.198185614717582448e+00,2.799435644746672280e-01,2.382100220808691660e-02,7.648326688294121434e-01,5.321800807599958993e-01,-9.677309526714947818e-01,3.011196696192857569e+00,-5.327041837703191396e-01,-2.614808836819490501e-01,-5.115340066587732437e-01,1.677540474302427476e-01,4.749780603279573077e-01,4.020596666328699054e-01,9.024387910057174444e-01,-1.556030234705811699e+00,2.155938978006722850e-01,1.127515691919520169e+00,7.049479491259755815e-01,-3.563716826001596671e-01,1.128648309467929378e+00,1.201141821151741729e+00,-1.033217669799148197e+00,-4.827866959986104600e-03,1.544444634941019912e+00,7.428634642484829298e-01,-1.295207309149458030e+00,2.679261028634445374e+00,-6.011872696309767949e-01,1.783228123851812175e+00,9.705994385340951935e-02,-2.593910549808155497e-01,-1.935421031747166787e-01
