﻿ArrayTaskID,model,forecasting_horizon,stock_target,n_epochs
1,TFT,7,Price,20
2,DSS,7,Price,20
3,DeepAR,7,Price,20
4,LSTM,7,Price,20
5,Transformer,7,Price,20
6,TFT,7,Return,20
7,DSS,7,Return,20
8,DeepAR,7,Return,20
9,LSTM,7,Return,20
10,Transformer,7,Return,20
