,Date,Return,Price,Open,High,Low,Index,TE(XY),TE(YX),Z(XY),Z(YX)
0,2020-03-02 00:00:00,0.0681016231474947,28.34,28.34,28.34,28.34,0.8,,,,
1,2020-03-03 00:00:00,0.0029732408325074,30.27,30.27,30.27,30.27,1.0,,,,
2,2020-03-04 00:00:00,-0.0576416337285902,30.36,30.36,30.36,30.36,0.6,,,,
3,2020-03-05 00:00:00,-0.0695560992659908,28.61,28.61,28.61,28.61,1.0,,,,
4,2020-03-06 00:00:00,-0.1277235161532683,26.62,26.62,26.62,26.62,1.0,,,,
5,2020-03-07 00:00:00,-0.1277235161532683,26.62,26.62,26.62,26.62,1.0,,,,
6,2020-03-08 00:00:00,-0.1277235161532683,26.62,26.62,26.62,26.62,1.0,,,,
7,2020-03-09 00:00:00,0.0723514211886304,23.22,23.22,23.22,23.22,1.0,,,,
8,2020-03-10 00:00:00,-0.0389558232931726,24.9,24.9,24.9,24.9,1.0,,,,
9,2020-03-11 00:00:00,-0.1073965733389051,23.93,23.93,23.93,23.93,0.9,,,,
10,2020-03-12 00:00:00,0.021067415730337,21.36,21.36,21.36,21.36,1.0,-0.12259062374969076,0.3629484175827429,-1.4194432409860385,1.176436895215861
11,2020-03-13 00:00:00,-0.1283814763869783,21.81,21.81,21.81,21.81,1.0,0.0028717026436080317,-0.019946499876110746,-0.26791669140300367,-1.0117020177277263
12,2020-03-14 00:00:00,-0.1283814763869783,21.81,21.81,21.81,21.81,1.0,0.14061133450110042,-0.03596241489652785,0.9828829819240699,-0.7115831890966939
13,2020-03-15 00:00:00,-0.1283814763869783,21.81,21.81,21.81,21.81,1.0,0.26565987112697,-0.0756153184458559,1.2062027151724235,-0.9327001099130285
14,2020-03-16 00:00:00,0.0005260389268804,19.01,19.01,19.01,19.01,1.0,0.28560539611881275,-0.040057037028541576,0.9816370613135929,-0.7109342684248294
15,2020-03-17 00:00:00,-0.0184016824395372,19.02,19.02,19.02,19.02,1.0,0.01713096683960824,0.06328498928218806,-0.15652866844552704,-0.026067396409805915
16,2020-03-18 00:00:00,0.0760578468130689,18.67,18.67,18.67,18.67,1.0,0.19688247052835983,0.53089274871291,0.9836296616019338,2.1079691193615866
17,2020-03-19 00:00:00,0.0497760079641612,20.09,18.66,20.8,18.65,1.0,0.2024232695147976,0.5684414874034274,1.0153151049429767,2.89979441536354
18,2020-03-20 00:00:00,-0.0820293978188715,21.09,20.09,21.73,20.06,1.0,0.0,0.0,0.0,0.0
19,2020-03-21 00:00:00,-0.0820293978188715,21.09,20.09,21.73,20.06,1.0,0.0,0.0,0.0,0.0
20,2020-03-22 00:00:00,-0.0820293978188715,21.09,20.09,21.73,20.06,1.0,0.0,0.0,0.0,0.0
21,2020-03-23 00:00:00,0.0785123966942148,19.36,21.08,21.1,19.35,1.0,0.0,0.0,0.0,0.0
22,2020-03-24 00:00:00,0.0004789272030652,20.88,19.36,21.11,19.34,1.0,0.0,0.0,0.0,0.0
23,2020-03-25 00:00:00,0.0622307324078506,20.89,20.87,20.93,20.85,1.0,0.0,0.0,0.0,0.0
24,2020-03-26 00:00:00,-0.0401081568273997,22.19,20.88,22.31,20.7,0.5,0.0,0.0,0.0,0.0
25,2020-03-27 00:00:00,0.0215962441314554,21.3,22.19,22.21,21.18,1.0,0.0,0.0,0.0,0.0
26,2020-03-28 00:00:00,0.0215962441314554,21.3,22.19,22.21,21.18,1.0,-0.054712826386751345,0.001305494848419464,-0.6030295074115561,-0.33847192270337495
27,2020-03-29 00:00:00,0.0215962441314554,21.3,22.19,22.21,21.18,1.0,-0.06812820763614091,-0.0402926342600507,-0.5464809209724145,-0.4797492249407681
28,2020-03-30 00:00:00,-0.0082720588235295,21.76,21.3,21.81,20.85,1.0,-0.07344315261965484,-0.04056389256031867,-0.54155624979305,-0.7396568628016884
29,2020-03-31 00:00:00,-0.0518999073215939,21.58,21.76,22.69,21.52,0.0,-0.08281220680263335,-0.041633569221487754,-0.8577223551515287,-0.6513754819951026
30,2020-04-01 00:00:00,0.0171065493646137,20.46,21.57,21.59,20.43,1.0,0.05524487008945389,0.1721255562114834,-0.30318962793057447,0.16810441525537784
31,2020-04-02 00:00:00,-0.0076886112445939,20.81,20.46,21.0,20.31,0.8333333333333334,0.3304372900121928,0.005627628774423243,0.9042438105121605,-0.788472226861351
32,2020-04-03 00:00:00,0.0828087167070218,20.65,20.8,21.02,20.44,1.0,0.37947325641069796,-0.02888156176627721,1.3116636013705145,-0.7902745766588872
33,2020-04-04 00:00:00,0.0828087167070218,20.65,20.8,21.02,20.44,1.0,1.0744911620254909,0.06072486293915258,5.774243105933887,-0.3991334533086849
34,2020-04-05 00:00:00,0.0828087167070218,20.65,20.8,21.02,20.44,1.0,0.9337490772032151,0.28530122323663587,6.901449217455938,1.1845916167270654
35,2020-04-06 00:00:00,0.0308586762075134,22.36,20.65,22.37,20.64,1.0,0.8969046028611869,0.3571801513734547,8.069142600685634,0.9331258069864556
36,2020-04-07 00:00:00,0.0121475054229933,23.05,22.36,23.29,22.34,1.0,0.26269584509173693,0.5169368952228393,1.421964326039664,2.360067577702433
37,2020-04-08 00:00:00,-0.0055722246035147,23.33,23.05,23.47,22.63,1.0,0.3554533644154185,0.09155834229825821,0.9593569078270042,-0.12455277535911742
38,2020-04-09 00:00:00,0.0,23.2,23.33,24.01,22.98,0.6,0.4762883398629132,0.08611345453650365,1.5153486293354246,0.410446231728557
39,2020-04-10 00:00:00,0.0017241379310344,23.2,23.2,23.21,23.19,1.0,0.002758410190150329,0.01684869763469443,-0.4969487779743863,-0.45927815538148536
40,2020-04-11 00:00:00,0.0017241379310344,23.2,23.2,23.21,23.19,1.0,-0.0014519017009941848,0.20969330047435175,-0.35593497714695865,0.8659140615913966
41,2020-04-12 00:00:00,0.0017241379310344,23.2,23.2,23.21,23.19,1.0,-0.09772189124996089,0.23251707115204834,-0.7554473578058596,0.2549959070529419
42,2020-04-13 00:00:00,0.0292598967297763,23.24,23.2,23.25,23.19,1.0,-0.1109107856864684,0.15844863107347074,-0.5245590630974134,-0.15619108181444863
43,2020-04-14 00:00:00,-0.0346989966555184,23.92,23.25,23.92,23.15,1.0,-0.01707067482619884,0.12466619216470409,-0.3731943527537629,-0.2464531965154984
44,2020-04-15 00:00:00,-0.0086617583369423,23.09,23.92,23.93,23.01,1.0,0.01567220599862562,0.16157216680395514,-0.24567807150260423,0.2207014620921352
45,2020-04-16 00:00:00,0.0004368719965049,22.89,23.09,23.28,22.86,0.875,-0.007764300880200192,-0.08672065191749923,-0.37438829275586094,-0.5616930181206075
46,2020-04-17 00:00:00,0.0004366812227074,22.9,22.89,22.94,22.88,1.0,-0.06120198996822879,-0.010516234921088774,-0.6995425777962164,-0.3898815769526395
47,2020-04-18 00:00:00,0.0004366812227074,22.9,22.89,22.94,22.88,1.0,-0.04900304982440673,0.01516072117890932,-0.5534783187442347,-0.5268593969356512
48,2020-04-19 00:00:00,0.0004366812227074,22.9,22.89,22.94,22.88,1.0,0.04783860706727783,0.047851002994415026,-0.2365429655657805,-0.2499832709437477
49,2020-04-20 00:00:00,-0.0379746835443038,22.91,22.91,22.92,22.84,1.0,-0.0034669199519052896,-0.0035910497096098837,-0.4803281770795651,-0.5431207285403776
50,2020-04-21 00:00:00,0.0049909255898366,22.04,22.91,22.92,22.02,0.6,-0.04378009113098713,-0.04752412677922635,-0.4769478409005904,-0.5464495776497539
51,2020-04-22 00:00:00,0.0338600451467268,22.15,22.05,22.42,22.03,1.0,-0.08887074484875779,0.11752432544270075,-0.879029769732214,-0.18870276608412
52,2020-04-23 00:00:00,-0.0096069868995632,22.9,22.14,22.98,22.14,1.0,-0.08082060799922441,0.03570610555051257,-1.0806598692309803,-0.2587106295081426
53,2020-04-24 00:00:00,0.0308641975308641,22.68,22.9,23.06,22.5,1.0,-0.028995374378508743,-0.033003343590405354,-0.35714938334196483,-0.43761064202186734
54,2020-04-25 00:00:00,0.0308641975308641,22.68,22.9,23.06,22.5,1.0,-0.03236790280143964,-0.08060509238246949,-0.6850029296110337,-0.6190967937609915
55,2020-04-26 00:00:00,0.0308641975308641,22.68,22.9,23.06,22.5,1.0,0.01473233666388829,-0.056216786845897815,-0.25779445438287063,-0.4990740518951059
56,2020-04-27 00:00:00,0.020530367835757,23.38,22.68,23.4,22.67,1.0,0.04791217105297374,-0.026445406392182846,-0.3836420622839702,-0.5173717983021092
57,2020-04-28 00:00:00,0.0176026823134954,23.86,23.39,23.9,23.34,1.0,0.15502242158486634,0.00783808713945433,0.41211890872663215,-0.36771107770707223
58,2020-04-29 00:00:00,-0.021828665568369,24.28,23.85,24.31,23.59,1.0,0.06747125415766408,-0.0560846971067237,-0.09378014962572971,-0.7769942077372267
59,2020-04-30 00:00:00,-0.0033684210526315,23.75,24.28,24.39,23.72,1.0,0.0,0.0,0.0,0.0
60,2020-05-01 00:00:00,-0.0354879594423322,23.67,23.75,23.76,23.65,1.0,0.0,0.0,0.0,0.0
61,2020-05-02 00:00:00,-0.0354879594423322,23.67,23.75,23.76,23.65,1.0,0.0,0.0,0.0,0.0
62,2020-05-03 00:00:00,-0.0354879594423322,23.67,23.75,23.76,23.65,1.0,0.0,0.0,0.0,0.0
63,2020-05-04 00:00:00,0.0113885238720981,22.83,23.67,23.68,22.71,0.5,0.0,0.0,0.0,0.0
64,2020-05-05 00:00:00,-0.0177566045907319,23.09,22.84,23.28,22.82,0.0,0.0,0.0,0.0,0.0
65,2020-05-06 00:00:00,0.0013227513227513,22.68,23.09,23.11,22.65,0.8,-0.03133091983402103,-0.05378691104771249,-0.7781448143392391,-0.9706534319015282
66,2020-05-07 00:00:00,-0.0004403346543373,22.71,22.68,22.9,22.45,1.0,0.05377776203601492,0.3577972503073683,-0.4252290717263082,0.600592535787589
67,2020-05-08 00:00:00,-0.0136563876651981,22.7,22.71,22.95,22.68,1.0,0.027582890454148412,0.05513119433781721,-0.4071359386141347,-0.23687586177402176
68,2020-05-09 00:00:00,-0.0136563876651981,22.7,22.71,22.95,22.68,1.0,0.028029262052712056,-0.01824789903271462,-0.3572031746627379,-0.5790953434164656
69,2020-05-10 00:00:00,-0.0136563876651981,22.7,22.71,22.95,22.68,1.0,0.01360982457346438,-0.027423150452507095,-0.6125438528517084,-0.8633847242834782
70,2020-05-11 00:00:00,-0.0022331397945511,22.39,22.71,23.02,22.38,1.0,-0.03328052503698142,-0.020930629890625774,-0.6688830238801956,-0.7132535922447759
71,2020-05-12 00:00:00,-0.014771709937332,22.34,22.39,22.76,22.2,1.0,0.024064805687785906,0.022605567414550443,-0.3728637058604614,-0.48820350832604514
72,2020-05-13 00:00:00,0.003180372557928,22.01,22.34,22.34,21.87,1.0,-0.042929360947052686,-0.07239943500813428,-0.6362249641167034,-0.55626408719304
73,2020-05-14 00:00:00,0.0076992753623189,22.08,22.0,22.24,21.82,1.0,0.16587916713385997,-0.06501750515202476,0.4522711036219341,-0.426496821350845
74,2020-05-15 00:00:00,0.0323595505617977,22.25,22.08,22.57,22.07,1.0,0.0,0.0,0.0,0.0
75,2020-05-16 00:00:00,0.0323595505617977,22.25,22.08,22.57,22.07,1.0,0.0,0.0,0.0,0.0
76,2020-05-17 00:00:00,0.0323595505617977,22.25,22.08,22.57,22.07,1.0,0.0,0.0,0.0,0.0
77,2020-05-18 00:00:00,-0.0139312146277753,22.97,22.25,22.99,22.23,1.0,0.0,0.0,0.0,0.0
78,2020-05-19 00:00:00,0.0132450331125828,22.65,22.97,23.26,22.55,1.0,0.0,0.0,0.0,0.0
79,2020-05-20 00:00:00,-0.0021786492374727,22.95,22.64,23.03,22.47,1.0,0.0,0.0,0.0,0.0
80,2020-05-21 00:00:00,-0.0008733624454148,22.9,22.94,23.14,22.81,1.0,0.0,0.0,0.0,0.0
81,2020-05-22 00:00:00,0.021416083916084,22.88,22.91,23.1,22.67,1.0,0.0,0.0,0.0,0.0
82,2020-05-23 00:00:00,0.021416083916084,22.88,22.91,23.1,22.67,1.0,0.0,0.0,0.0,0.0
83,2020-05-24 00:00:00,0.021416083916084,22.88,22.91,23.1,22.67,1.0,0.0,0.0,0.0,0.0
84,2020-05-25 00:00:00,0.027813436029097,23.37,22.88,23.43,22.88,1.0,0.0,0.0,0.0,0.0
85,2020-05-26 00:00:00,0.0503746877601998,24.02,23.37,24.13,23.36,1.0,0.0,0.0,0.0,0.0
86,2020-05-27 00:00:00,-0.0007927070947284,25.23,24.02,25.24,23.89,1.0,0.0,0.0,0.0,0.0
87,2020-05-28 00:00:00,-0.0273700912336374,25.21,25.22,25.46,24.9,0.75,0.0,0.0,0.0,0.0
88,2020-05-29 00:00:00,0.0114192495921697,24.52,25.21,25.22,24.46,1.0,0.0,0.0,0.0,0.0
89,2020-05-30 00:00:00,0.0114192495921697,24.52,25.21,25.22,24.46,1.0,0.3398340592521887,0.9000112420389339,2.065687287120535,4.255024228524505
90,2020-05-31 00:00:00,0.0114192495921697,24.52,25.21,25.22,24.46,1.0,0.2090143986423687,0.5442557845359852,0.9721495741116858,3.77766837753164
91,2020-06-01 00:00:00,0.0189516129032257,24.8,24.53,25.0,24.5,1.0,0.13936438322713673,0.44522454505010156,0.4669455191336528,1.4119605459426054
92,2020-06-02 00:00:00,0.0067273446774832,25.27,24.8,25.28,24.79,1.0,0.17413839973722833,0.44487135501451736,0.4652420803949407,2.1862137028609805
93,2020-06-03 00:00:00,-0.005503144654088,25.44,25.27,25.49,25.19,0.0,0.11197022367974263,0.4683107490273368,0.478123731489664,3.164113385907892
94,2020-06-04 00:00:00,0.025296442687747,25.3,25.43,25.47,24.82,1.0,0.18228489320426622,0.634021940821154,1.1375444985436,3.7900229877903016
95,2020-06-05 00:00:00,0.0034695451040863,25.94,25.3,26.01,25.29,1.0,-0.03042261996969664,0.4973385121833056,-0.6657124759514793,2.5451026785749287
96,2020-06-06 00:00:00,0.0034695451040863,25.94,25.3,26.01,25.29,1.0,0.1324838554015928,0.27886018004904223,0.6477344656961743,1.3703242463588035
97,2020-06-07 00:00:00,0.0034695451040863,25.94,25.3,26.01,25.29,1.0,0.17066110714139082,-0.021453416065977393,0.9655396084404427,-0.780291227906672
98,2020-06-08 00:00:00,-0.0053784095274683,26.03,25.93,26.04,25.93,1.0,0.11779821373468469,-0.07507808773469726,0.31305229192111544,-0.9910891588358971
99,2020-06-09 00:00:00,-0.0297412128234839,25.89,26.03,26.29,25.74,1.0,0.3025721672534569,-0.08824691365959136,1.2901659455444925,-0.8802605879407995
100,2020-06-10 00:00:00,-0.0246815286624204,25.12,25.88,26.13,25.1,1.0,0.34199192116421084,-0.01189222222928521,0.5355219527220284,-0.5581310426757813
101,2020-06-11 00:00:00,0.0057142857142857,24.5,25.13,25.14,24.35,1.0,-0.019278010026159365,0.4544056533115963,-0.5181227425122664,2.1913768452294042
102,2020-06-12 00:00:00,0.0040584415584414,24.64,24.5,24.82,24.24,1.0,0.0,0.0,0.0,0.0
103,2020-06-13 00:00:00,0.0040584415584414,24.64,24.5,24.82,24.24,1.0,0.0,0.0,0.0,0.0
104,2020-06-14 00:00:00,0.0040584415584414,24.64,24.5,24.82,24.24,1.0,0.0,0.0,0.0,0.0
105,2020-06-15 00:00:00,0.040016168148747,24.74,24.63,24.76,23.99,1.0,0.0,0.0,0.0,0.0
106,2020-06-16 00:00:00,-0.0034978624174115,25.73,24.74,25.82,24.72,1.0,0.0,0.0,0.0,0.0
107,2020-06-17 00:00:00,-0.0128705148205928,25.64,25.73,25.98,25.54,1.0,0.0,0.0,0.0,0.0
108,2020-06-18 00:00:00,0.0122481232714343,25.31,25.64,25.68,25.17,1.0,0.0,0.0,0.0,0.0
109,2020-06-19 00:00:00,0.003903200624512,25.62,25.3,25.8,25.3,1.0,0.0,0.0,0.0,0.0
110,2020-06-20 00:00:00,0.003903200624512,25.62,25.3,25.8,25.3,1.0,0.0,0.0,0.0,0.0
111,2020-06-21 00:00:00,0.003903200624512,25.62,25.3,25.8,25.3,1.0,0.0,0.0,0.0,0.0
112,2020-06-22 00:00:00,0.0066096423017107,25.72,25.62,25.83,25.49,1.0,0.0,0.0,0.0,0.0
113,2020-06-23 00:00:00,-0.0154499806875242,25.89,25.72,26.09,25.66,1.0,0.0,0.0,0.0,0.0
114,2020-06-24 00:00:00,-0.0262848175755197,25.49,25.9,25.9,25.38,1.0,0.0,0.0,0.0,0.0
115,2020-06-25 00:00:00,-0.0141015310233683,24.82,25.48,25.5,24.8,1.0,0.0,0.0,0.0,0.0
116,2020-06-26 00:00:00,-0.0061299550469962,24.47,24.82,25.12,24.45,0.5,0.0,0.0,0.0,0.0
117,2020-06-27 00:00:00,-0.0061299550469962,24.47,24.82,25.12,24.45,0.5,0.0,0.0,0.0,0.0
118,2020-06-28 00:00:00,-0.0061299550469962,24.47,24.82,25.12,24.45,0.5,0.1070850679235198,0.9807033605605646,-0.20261493031532654,2.931106888430916
119,2020-06-29 00:00:00,0.0045230263157894,24.32,24.47,24.57,24.23,1.0,0.1695117695748367,0.9504036392760762,1.6473670335179025,3.739979391789997
120,2020-06-30 00:00:00,0.004502660663119,24.43,24.32,24.6,24.2,1.0,0.1417398910918335,0.2965544830023008,1.2373655201666043,0.8134924732532877
121,2020-07-01 00:00:00,0.0358598207008966,24.54,24.43,24.72,24.32,1.0,-0.013465547245493426,0.01943278193907183,-0.48122929995470914,-0.4263737018977134
122,2020-07-02 00:00:00,-0.0027537372147915,25.42,24.54,25.46,24.52,1.0,-0.013011100278738752,-0.05560097649575013,-0.45237307405483174,-0.5976144324920483
123,2020-07-03 00:00:00,-0.0023668639053255,25.35,25.42,25.51,25.2,1.0,0.05341457106315595,-0.03254285907378662,-0.14773725310397942,-0.44901598843101076
124,2020-07-04 00:00:00,-0.0023668639053255,25.35,25.42,25.51,25.2,1.0,0.0031550001909952385,-0.024525387809997135,-0.30246130964037476,-0.4325556968665226
125,2020-07-05 00:00:00,-0.0023668639053255,25.35,25.42,25.51,25.2,1.0,0.07469165821250545,-0.11086541296457764,0.11320872983657486,-1.311446882360934
126,2020-07-06 00:00:00,-0.0229339659944641,25.29,25.35,25.74,25.25,1.0,0.05926825697015392,-0.11414825494746772,0.2671260820016379,-1.1211036607699407
127,2020-07-07 00:00:00,-0.0089032780250911,24.71,25.29,25.3,24.68,1.0,0.0,0.0,0.0,0.0
128,2020-07-08 00:00:00,-0.0097999183340138,24.49,24.7,24.83,24.45,1.0,0.0,0.0,0.0,0.0
129,2020-07-09 00:00:00,-0.0041237113402062,24.25,24.49,24.63,24.2,0.8,0.0,0.0,0.0,0.0
130,2020-07-10 00:00:00,-0.005383022774327,24.15,24.24,24.27,23.98,1.0,0.0,0.0,0.0,0.0
131,2020-07-11 00:00:00,-0.005383022774327,24.15,24.24,24.27,23.98,1.0,0.02584840639913555,0.6344440527689659,0.16018546663623515,2.639054202932231
132,2020-07-12 00:00:00,-0.005383022774327,24.15,24.24,24.27,23.98,1.0,-0.047260804267475365,0.1367192912220787,-0.5556241554743582,0.16636879919333042
133,2020-07-13 00:00:00,0.0054121565362197,24.02,24.15,24.42,23.71,1.0,-0.07005327670089301,0.015737937187562778,-0.8476925325293849,-0.4254891093120052
134,2020-07-14 00:00:00,0.0078674948240166,24.15,24.02,24.22,23.61,1.0,-0.10274221498034031,-0.05283421107868058,-0.8778298635495662,-0.7845848351093965
135,2020-07-15 00:00:00,0.0041084634346754,24.34,24.15,24.55,24.12,1.0,-0.0016648942644321707,-0.08759609361609222,-0.34695334357164287,-0.7063354795338945
136,2020-07-16 00:00:00,0.0045008183306055,24.44,24.34,24.53,24.12,0.8,-0.0212327798832046,0.06396249584861113,-0.5628078092872423,-0.3431141647370227
137,2020-07-17 00:00:00,0.0199592668024439,24.55,24.44,24.67,24.27,1.0,-0.027867939466206693,0.905130096610991,-0.7769099450094008,6.116161863105663
138,2020-07-18 00:00:00,0.0199592668024439,24.55,24.44,24.67,24.27,1.0,0.09860179780208167,0.5327069111065041,0.36217529157706085,3.9729157176634593
139,2020-07-19 00:00:00,0.0199592668024439,24.55,24.44,24.67,24.27,1.0,-0.03406499013238484,0.0958291867178449,-0.4834282624473177,0.07517569636923264
140,2020-07-20 00:00:00,-0.0247603833865813,25.04,24.55,25.05,24.48,0.8461538461538461,-0.006480968883596283,-0.020740562879558055,-0.4175606789026654,-0.6899835698447941
141,2020-07-21 00:00:00,0.0159705159705158,24.42,25.03,25.29,24.13,1.0,-0.06257774059923715,0.12161304453908084,-0.7467704425060334,0.38581465552887895
142,2020-07-22 00:00:00,-0.0100765820233776,24.81,24.42,24.83,24.1,1.0,0.015601483953387785,-0.036217292551990354,-0.5351633169527911,-0.8880032784712445
143,2020-07-23 00:00:00,-0.0114006514657979,24.56,24.8,24.81,24.3,1.0,0.025620531953020276,-0.0721815622751123,-0.25181077075523695,-0.8642181907146854
144,2020-07-24 00:00:00,-0.0131795716639209,24.28,24.56,24.57,24.04,1.0,0.03289318735631497,0.03275099753899724,-0.4389242858592194,-0.2934950086854807
145,2020-07-25 00:00:00,-0.0131795716639209,24.28,24.56,24.57,24.04,1.0,-0.02085690992567546,-0.0948912849690382,-0.5626034463073241,-0.9647845719163585
146,2020-07-26 00:00:00,-0.0131795716639209,24.28,24.56,24.57,24.04,1.0,0.015217131594225108,-0.013724854953274246,-0.312568607858523,-0.7580578984952658
147,2020-07-27 00:00:00,0.0087646076794658,23.96,24.27,24.55,23.93,0.0,0.05935636998178939,0.00025659516619969125,-0.24603034951630093,-0.5542939650513303
148,2020-07-28 00:00:00,0.0028961522548612,24.17,23.97,24.41,23.95,1.0,0.05753380308852929,0.05628981114389786,-0.296590124539202,-0.23782877362603064
149,2020-07-29 00:00:00,-0.0243399339933993,24.24,24.17,24.32,24.02,1.0,-0.08045139329351869,0.07300004348884315,-0.7902411181539819,-0.15308572279457205
150,2020-07-30 00:00:00,-0.00507399577167,23.65,24.25,24.25,23.62,1.0,-0.07022337393881894,0.046130567821435875,-0.911710819219905,-0.2642543815103183
151,2020-07-31 00:00:00,-0.0025499362515938,23.53,23.65,23.89,23.41,1.0,0.06838847566298867,0.016026729005636398,0.06226809062705752,-0.3831403588963774
152,2020-08-01 00:00:00,-0.0025499362515938,23.53,23.65,23.89,23.41,1.0,0.11123518792164866,-0.0647607990674457,0.13969540168092542,-0.7807310041016525
153,2020-08-02 00:00:00,-0.0025499362515938,23.53,23.65,23.89,23.41,1.0,0.070033187636791,0.04767641134997813,0.5303668317550393,0.024043178764292024
154,2020-08-03 00:00:00,0.02002556455049,23.47,23.53,23.67,23.43,1.0,0.1044278268418255,0.09060421030376098,0.4478013217101969,0.0686939504034769
155,2020-08-04 00:00:00,0.0079365079365078,23.94,23.47,23.96,23.46,1.0,0.26011098518590625,0.17888473286055984,1.4090667791729974,0.17341449248712815
156,2020-08-05 00:00:00,0.0053874844591795,24.13,23.94,24.29,23.93,1.0,0.0,0.0,0.0,0.0
157,2020-08-06 00:00:00,-0.0065952184666117,24.26,24.14,24.34,24.11,0.7777777777777778,0.0,0.0,0.0,0.0
158,2020-08-07 00:00:00,-0.0219917012448133,24.1,24.26,24.34,23.98,1.0,0.0,0.0,0.0,0.0
159,2020-08-08 00:00:00,-0.0219917012448133,24.1,24.26,24.34,23.98,1.0,0.06298657142880959,0.6408037359307746,0.13923823597490223,3.160634710618831
160,2020-08-09 00:00:00,-0.0219917012448133,24.1,24.26,24.34,23.98,1.0,0.038763662075306016,0.32559482107687066,-0.3050136406276316,0.981047602042272
161,2020-08-10 00:00:00,0.0152736529486635,23.57,24.1,24.11,23.4,1.0,-0.008786870640695277,0.19512129428812708,-0.4817666504025058,0.1800444255887261
162,2020-08-11 00:00:00,0.0171333054743,23.93,23.57,23.96,23.56,1.0,-0.08738571165956088,0.12250883760359654,-0.7736634576479059,-0.08645567747623033
163,2020-08-12 00:00:00,0.0073952341824157,24.34,23.92,24.34,23.92,1.0,-0.08090660349349932,0.13018992651832573,-0.8288119065726535,-0.08751981700300059
164,2020-08-13 00:00:00,-0.0061174551386622,24.52,24.34,24.55,24.12,0.8333333333333334,-0.08673091610905814,0.1311855370232431,-1.1041155932897062,0.09482888835217837
165,2020-08-14 00:00:00,0.0012310217480507,24.37,24.52,24.53,24.22,1.0,-0.05315498107703398,0.3020249376481825,-0.7106278976376651,1.4397128000554988
166,2020-08-15 00:00:00,0.0012310217480507,24.37,24.52,24.53,24.22,1.0,-0.00995384952110534,0.25639232070193607,-0.5796519611446963,0.8331319504617629
167,2020-08-16 00:00:00,0.0012310217480507,24.37,24.52,24.53,24.22,1.0,-0.07715050678903612,0.22190618486730873,-1.3276025461524799,0.6326109121077977
168,2020-08-17 00:00:00,0.0053278688524591,24.4,24.37,24.51,24.24,1.0,-0.09908806728333275,0.14936467864541436,-1.0050364713535094,0.09465253836741079
169,2020-08-18 00:00:00,0.0044843049327354,24.53,24.4,24.61,24.34,0.8333333333333334,-0.11950092198777806,0.09120224718646774,-0.7655700092132185,-0.05356569004250991
170,2020-08-19 00:00:00,-0.0121753246753247,24.64,24.54,24.76,24.46,1.0,0.11407280774971529,0.17338242192525666,0.0566395675093531,0.6179475579257944
171,2020-08-20 00:00:00,-0.0069843878389481,24.34,24.63,24.65,24.24,1.0,-0.015339106112113754,0.10184367025357854,-0.7075646989417326,-0.2518084341989418
172,2020-08-21 00:00:00,-0.0028961522548614,24.17,24.34,24.52,24.07,1.0,-0.027197110446206096,-0.004226098308026671,-0.6171289490845242,-0.5052047869866427
173,2020-08-22 00:00:00,-0.0028961522548614,24.17,24.34,24.52,24.07,1.0,-0.03893084108495248,-0.09031225736724569,-0.38124039414754285,-0.8726398316274238
174,2020-08-23 00:00:00,-0.0028961522548614,24.17,24.34,24.52,24.07,1.0,0.060084132189969,-0.047708866876524425,-0.04938323853761668,-0.7415808400007123
175,2020-08-24 00:00:00,0.0012448132780081,24.1,24.17,24.41,24.09,1.0,0.054954704585852276,-0.03783511618926827,-0.09603505578653232,-0.7591369855647615
176,2020-08-25 00:00:00,0.0078740157480315,24.13,24.1,24.27,23.87,1.0,0.13706845104206877,-0.023952736447484746,0.5474409017527356,-0.6615765388429085
177,2020-08-26 00:00:00,-0.0069901315789474,24.32,24.13,24.42,24.02,1.0,0.21009927114016147,0.040871045962432184,0.6410853557990736,-0.21952519535438564
178,2020-08-27 00:00:00,0.0045548654244307,24.15,24.31,24.34,24.06,0.7142857142857143,0.0,0.0,0.0,0.0
179,2020-08-28 00:00:00,-0.003709810387469,24.26,24.15,24.29,24.02,1.0,0.0,0.0,0.0,0.0
180,2020-08-29 00:00:00,-0.003709810387469,24.26,24.15,24.29,24.02,1.0,0.02791796804659974,0.1215417046737235,-0.3621154354936206,0.22766744531443797
181,2020-08-30 00:00:00,-0.003709810387469,24.26,24.15,24.29,24.02,1.0,0.004667595902469124,0.28287286594496575,-0.25279736860462826,0.639521986629022
182,2020-08-31 00:00:00,0.0099296648738104,24.17,24.25,24.56,24.17,1.0,-0.010837838076522388,0.16091447505879497,-0.5014039022937639,0.20068752128653736
183,2020-09-01 00:00:00,0.0081933633756656,24.41,24.17,24.43,24.15,1.0,-0.026005486195684213,0.1113859798603194,-0.5140457029074071,0.19866776183335474
184,2020-09-02 00:00:00,-0.0008126777732628,24.61,24.42,24.67,24.41,0.8571428571428571,-0.05928143141320419,0.11138597986031851,-0.7414143319990313,0.05406163202658961
185,2020-09-03 00:00:00,-0.0105734038226922,24.59,24.62,24.71,24.47,1.0,-0.05051123733352991,0.10578665988401603,-0.6434552924221056,-0.14855567830203945
186,2020-09-04 00:00:00,0.0024660912453761,24.33,24.59,24.6,24.29,1.0,-0.04960377123395521,-0.10379774723340951,-0.753757468600334,-1.2277554989742785
187,2020-09-05 00:00:00,0.0024660912453761,24.33,24.59,24.6,24.29,1.0,-0.01587088012722937,-0.11242523943692806,-0.5070211372186173,-1.3822183544486295
188,2020-09-06 00:00:00,0.0024660912453761,24.33,24.59,24.6,24.29,1.0,0.034828014016468956,0.08217746662015601,-0.012764479342112974,-0.002979093389962575
189,2020-09-07 00:00:00,-0.021320213202132,24.39,24.33,24.56,24.31,0.0,0.04004775818787287,0.061812887928393234,-0.26462366034976287,-0.1594029680297662
190,2020-09-08 00:00:00,0.0046082949308755,23.87,24.39,24.41,23.68,0.6666666666666666,0.05794087642847234,-0.06565449760381048,0.06422645142630815,-0.7399295716187215
191,2020-09-09 00:00:00,0.0141784820683903,23.98,23.87,24.02,23.77,0.6666666666666666,0.48230632962151,-0.04074232904822672,0.8807707628826053,-0.6298500058884312
192,2020-09-10 00:00:00,0.0004111842105262,24.32,23.98,24.34,23.92,0.9,0.5921923674610232,-0.013709560543592403,3.343787121492516,-0.792060627180256
193,2020-09-11 00:00:00,0.0406905055487053,24.33,24.32,24.46,24.26,1.0,0.3830210440387196,-0.009644503374841129,1.623529211448848,-0.6519672303802202
194,2020-09-12 00:00:00,0.0406905055487053,24.33,24.32,24.46,24.26,1.0,0.5258863673162217,-0.014665785526505104,2.776652249162928,-0.5920803644527061
195,2020-09-13 00:00:00,0.0406905055487053,24.33,24.32,24.46,24.26,1.0,0.5346876468498376,-0.023854634455140022,2.146181714813225,-0.6063206496921058
196,2020-09-14 00:00:00,0.0023696682464454,25.32,24.33,25.36,24.32,1.0,0.5346876468498358,-0.0238546344551418,3.4712202992139787,-0.5166455115294247
197,2020-09-15 00:00:00,-0.0031520882584711,25.38,25.31,25.52,25.18,1.0,0.2830653418420628,-0.02385463445514091,0.34386259631185834,-0.4993078946923919
198,2020-09-16 00:00:00,0.0019762845849802,25.3,25.38,25.49,25.19,0.9166666666666666,0.22626891428965834,0.026190491665135873,0.3550516984326719,-0.16520079718805541
199,2020-09-17 00:00:00,-0.0035502958579881,25.35,25.29,25.36,25.07,0.7142857142857143,-0.05472840658857958,0.04193332818883988,-0.6203027288362721,-0.42780339132725875
200,2020-09-18 00:00:00,-0.0451306413301662,25.26,25.34,25.4,25.1,1.0,-0.01903700852793655,0.31444476408564004,-0.6577935927513845,1.241060265439872
201,2020-09-19 00:00:00,-0.0451306413301662,25.26,25.34,25.4,25.1,1.0,-0.07902101496001102,0.12992908943698955,-0.8702009134790443,-0.08626069300459298
202,2020-09-20 00:00:00,-0.0451306413301662,25.26,25.34,25.4,25.1,1.0,-0.11804853598275411,0.08385482556817614,-0.8383390445635033,-0.14620991440413714
203,2020-09-21 00:00:00,-0.0132669983416252,24.12,25.26,25.27,24.11,1.0,-0.11542312409038935,0.02840890157908582,-0.7650487749176883,-0.38004144241302934
204,2020-09-22 00:00:00,-0.0084033613445377,23.8,24.12,24.39,23.79,1.0,0.01919609295649316,-0.008920288014812261,-0.47453010396964146,-0.4772444292087577
205,2020-09-23 00:00:00,-0.002542372881356,23.6,23.8,24.07,23.5,1.0,-0.04483213485775339,-0.012194500150773724,-0.5929945902963965,-0.33372524249685126
206,2020-09-24 00:00:00,0.0012744265080714,23.54,23.6,23.68,23.38,1.0,-0.045764833957580464,0.05776960251358121,-0.6841469218724773,-0.11422373958120195
207,2020-09-25 00:00:00,0.0089096308867204,23.57,23.54,23.91,23.48,1.0,-0.049914067675964624,0.038913191488626264,-0.7265950568938532,-0.3031464454540405
208,2020-09-26 00:00:00,0.0089096308867204,23.57,23.54,23.91,23.48,1.0,0.0,0.0,0.0,0.0
209,2020-09-27 00:00:00,0.0089096308867204,23.57,23.54,23.91,23.48,1.0,0.0,0.0,0.0,0.0
210,2020-09-28 00:00:00,-0.0004205214465938,23.78,23.57,24.04,23.57,0.0,0.0,0.0,0.0,0.0
211,2020-09-29 00:00:00,0.002103491796382,23.77,23.78,23.86,23.63,1.0,0.0,0.0,0.0,0.0
212,2020-09-30 00:00:00,0.0067170445004198,23.82,23.77,23.99,23.61,1.0,0.1353095390377037,0.02113101347931412,1.0773232698852735,-0.3927126063663801
213,2020-10-01 00:00:00,-0.0104253544620517,23.98,23.82,24.11,23.81,1.0,-0.05589144917654565,-0.09131490589146729,-0.7923647597537675,-0.6717417676632734
214,2020-10-02 00:00:00,0.014749262536873,23.73,23.98,23.99,23.63,1.0,0.03804096538567059,-0.07136560091566935,-0.2853112629513884,-1.1492593345372266
215,2020-10-03 00:00:00,0.014749262536873,23.73,23.98,23.99,23.63,1.0,-0.05907943321181186,0.045056427269322796,-0.8263263775693787,-0.26276805701057887
216,2020-10-04 00:00:00,0.014749262536873,23.73,23.98,23.99,23.63,1.0,-0.06669531988807975,0.13696684147210814,-0.9537744779294459,0.26020760589821545
217,2020-10-05 00:00:00,0.0161960132890365,24.08,23.73,24.15,23.72,1.0,-0.07315812213195105,0.21438162425769036,-0.741633699977193,0.5475247437288924
218,2020-10-06 00:00:00,-0.006538618716796,24.47,24.09,24.54,24.07,1.0,-0.02685545045797788,0.3668031535825653,-0.6288100619577103,0.6946112050377747
219,2020-10-07 00:00:00,0.0127519539284246,24.31,24.48,24.55,24.27,1.0,0.0,0.0,0.0,0.0
220,2020-10-08 00:00:00,0.0020308692120227,24.62,24.29,24.67,24.29,1.0,0.0,0.0,0.0,0.0
221,2020-10-09 00:00:00,-0.0210782326712607,24.67,24.62,24.81,24.54,1.0,0.0,0.0,0.0,0.0
222,2020-10-10 00:00:00,-0.0210782326712607,24.67,24.62,24.81,24.54,1.0,0.0,0.0,0.0,0.0
223,2020-10-11 00:00:00,-0.0210782326712607,24.67,24.62,24.81,24.54,1.0,0.0,0.0,0.0,0.0
224,2020-10-12 00:00:00,-0.0016563146997929,24.15,24.68,24.68,24.07,1.0,0.0,0.0,0.0,0.0
225,2020-10-13 00:00:00,-0.0087100788054749,24.11,24.14,24.28,23.99,1.0,0.0,0.0,0.0,0.0
226,2020-10-14 00:00:00,-0.0196652719665271,23.9,24.1,24.24,23.85,1.0,0.0,0.0,0.0,0.0
227,2020-10-15 00:00:00,-0.0046948356807511,23.43,23.9,23.91,23.35,0.8571428571428571,0.0,0.0,0.0,0.0
228,2020-10-16 00:00:00,-0.0038593481989708,23.32,23.44,23.57,23.31,1.0,0.0,0.0,0.0,0.0
229,2020-10-17 00:00:00,-0.0038593481989708,23.32,23.44,23.57,23.31,1.0,0.08411703421739869,0.37451728565265174,0.30587502063683014,1.5117592548549366
230,2020-10-18 00:00:00,-0.0038593481989708,23.32,23.44,23.57,23.31,1.0,-0.027321033001315165,0.035254610894796645,-0.6389793875194044,-0.25862518025972875
231,2020-10-19 00:00:00,0.011192423590185,23.23,23.31,23.36,23.1,1.0,-0.0431585292543204,-0.051832554817416554,-0.7628781088730466,-0.7291717287103917
232,2020-10-20 00:00:00,-0.0089399744572157,23.49,23.23,23.51,23.14,1.0,-0.10030567867812312,-0.10014388193448154,-0.9873047382233914,-0.8709320375092137
233,2020-10-21 00:00:00,-0.0193298969072166,23.28,23.49,23.55,23.27,0.75,0.005537653015034394,-0.07380863424213002,-0.28867282347272116,-0.7019425399741791
234,2020-10-22 00:00:00,0.0043802014892685,22.83,23.28,23.29,22.78,1.0,-0.034417979843294866,-0.06284728071993051,-0.5768040604778689,-0.8100709660008715
235,2020-10-23 00:00:00,-0.0279110335804623,22.93,22.82,23.09,22.78,1.0,0.18885012971774984,0.012097248031858854,0.4526280655793994,-0.6195373664608066
236,2020-10-24 00:00:00,-0.0279110335804623,22.93,22.82,23.09,22.78,1.0,0.3502547659802415,0.27959200488941605,1.3868227920104597,1.0928812326992654
237,2020-10-25 00:00:00,-0.0279110335804623,22.93,22.82,23.09,22.78,1.0,0.5415249428644788,0.262653311551694,3.084422091568498,0.6976050806938273
238,2020-10-26 00:00:00,0.0008972633467922,22.29,22.93,22.94,22.2,1.0,0.5616465788573839,0.3018765091619491,3.7397781344782217,1.0772625346226576
239,2020-10-27 00:00:00,-0.0044822949350066,22.31,22.29,22.47,22.2,1.0,0.0957016364524712,0.4036782695142067,0.05105839447847711,1.245427405265055
240,2020-10-28 00:00:00,-0.0544799639801891,22.21,22.32,22.33,22.2,1.0,0.12251654485017038,0.45485611865812015,0.07252678093147374,1.8959879822097077
241,2020-10-29 00:00:00,0.0057142857142857,21.0,22.2,22.22,20.8,1.0,0.10242167428880578,0.49091213966364666,0.15683594486391153,2.547872701571095
242,2020-10-30 00:00:00,0.0085227272727272,21.12,20.99,21.28,20.43,1.0,0.0,0.0,0.0,0.0
243,2020-10-31 00:00:00,0.0085227272727272,21.12,20.99,21.28,20.43,1.0,0.0,0.0,0.0,0.0
244,2020-11-01 00:00:00,0.0085227272727272,21.12,20.99,21.28,20.43,1.0,0.0,0.0,0.0,0.0
245,2020-11-02 00:00:00,0.0286384976525821,21.3,21.12,21.69,21.11,1.0,0.0,0.0,0.0,0.0
246,2020-11-03 00:00:00,0.0077590141487904,21.91,21.3,21.96,21.28,0.8333333333333334,0.0,0.0,0.0,0.0
247,2020-11-04 00:00:00,0.0027173913043479,22.08,21.87,22.18,21.74,1.0,0.0,0.0,0.0,0.0
248,2020-11-05 00:00:00,-0.0013550135501355,22.14,22.03,22.17,21.49,1.0,-0.022019823404626493,-0.09425592325600718,-0.48286612021538733,-0.6733265221068068
249,2020-11-06 00:00:00,0.109452736318408,22.11,22.16,22.16,21.86,1.0,-0.018140252731937423,-0.09733922820934104,-0.6364992074884159,-0.8442407714250515
250,2020-11-07 00:00:00,0.109452736318408,22.11,22.16,22.16,21.86,1.0,-0.021452836199642,-0.10717670942981394,-0.33161254590002864,-1.0860201565942171
251,2020-11-08 00:00:00,0.109452736318408,22.11,22.16,22.16,21.86,1.0,0.0004933476830846217,-0.0986229715795135,-0.14365923802340605,-1.046635225307876
252,2020-11-09 00:00:00,-0.0016306563391766,24.53,22.07,24.67,22.07,1.0,0.009072129979755594,-0.059605721680926926,-0.3130077939090391,-0.5036019313526211
253,2020-11-10 00:00:00,0.0024499795835035,24.49,24.52,24.92,24.28,1.0,-0.042129097302386675,0.08487213903397706,-0.4411318288467291,-0.23847229085003072
254,2020-11-11 00:00:00,-0.0073319755600814,24.55,24.49,24.79,24.34,0.7142857142857143,-0.09497071038756921,0.28157061762028146,-0.4701206518195543,0.3654310678523857
255,2020-11-12 00:00:00,-0.0061551087402544,24.37,24.55,24.74,24.23,1.0,-0.12303062879009996,0.09682271621846628,-1.050255312106652,0.5833660758164336
256,2020-11-13 00:00:00,0.0573905862923204,24.22,24.37,24.43,24.06,1.0,-0.14206949005417258,0.476263271328242,-0.47527075054575607,2.3320012880466887
257,2020-11-14 00:00:00,0.0573905862923204,24.22,24.37,24.43,24.06,1.0,-0.13940417553589235,0.25355731776194457,-0.5729943422405607,0.37121726058114657
258,2020-11-15 00:00:00,0.0573905862923204,24.22,24.37,24.43,24.06,1.0,-0.1348626983895933,0.15852634068671012,-0.6005284581381308,0.09946679347647855
259,2020-11-16 00:00:00,-0.0031237797735258,25.61,24.22,25.72,24.2,1.0,-0.12787132395463452,0.10204839425766377,-0.6560094819912495,-0.3484449016993677
260,2020-11-17 00:00:00,0.0246768507638072,25.53,25.62,25.97,25.4,0.6666666666666666,-0.0550534976511452,0.07403875014954142,-0.6472279703853625,-0.14418022335519048
261,2020-11-18 00:00:00,-0.0118501529051987,26.16,25.55,26.2,25.48,0.75,-0.0674144292439669,0.20581221791442328,-0.692622129193761,0.5546846972008113
262,2020-11-19 00:00:00,0.0007736943907156,25.85,26.16,26.17,25.68,0.3333333333333333,0.00786345874718819,0.5159949115555182,-0.5378682064979156,3.1701831337204
263,2020-11-20 00:00:00,0.0050251256281406,25.87,25.78,26.1,25.75,1.0,-0.024919782555490322,1.323793752038597,-0.9018835506833304,7.503520516877366
264,2020-11-21 00:00:00,0.0050251256281406,25.87,25.78,26.1,25.75,1.0,-0.03188818272678251,1.2357742761116288,-0.8487770438533118,5.485602580769991
265,2020-11-22 00:00:00,0.0050251256281406,25.87,25.78,26.1,25.75,1.0,-0.015257497549819199,0.3731807479006042,-0.7371984015325346,1.1112231766837233
266,2020-11-23 00:00:00,0.0065384615384616,26.0,25.88,26.25,25.84,1.0,0.01633518890329544,0.15874907215310774,-0.4415883231016905,0.14007989309247307
267,2020-11-24 00:00:00,0.0034390523500191,26.17,25.96,26.25,25.88,0.7142857142857143,-0.002519497314358965,0.03851014347172654,-0.5444642649133029,-0.5194583510931711
268,2020-11-25 00:00:00,0.0350342726580349,26.26,26.17,26.41,26.04,1.0,-0.032482496275587636,0.09537884447859124,-1.012522112400764,-0.07098975690075567
269,2020-11-26 00:00:00,0.0187637969094923,27.18,26.22,27.19,26.22,1.0,0.0018441558038109207,0.08765194699419876,-0.5245917257675381,0.22706952401337663
270,2020-11-27 00:00:00,0.0046948356807511,27.69,27.16,27.7,27.16,1.0,0.07256855913395555,-0.03861286727389679,-0.23792446596571373,-0.7031618173599516
271,2020-11-28 00:00:00,0.0046948356807511,27.69,27.16,27.7,27.16,1.0,0.01277173727428682,0.023138233043964895,-0.33001729555242343,-0.3404664786631659
272,2020-11-29 00:00:00,0.0046948356807511,27.69,27.16,27.7,27.16,1.0,-0.09808666874620897,0.05392916552379923,-1.1670828266835844,0.023249419618756744
273,2020-11-30 00:00:00,0.0262401150251617,27.82,27.69,27.89,27.44,1.0,-0.08810303708162426,0.11108518427754621,-0.8550746922500818,0.008379206931859378
274,2020-12-01 00:00:00,0.0021015761821365,28.55,27.87,28.74,27.81,0.0,-0.001230769320501146,0.20963763387181622,-0.461936069718056,0.8760561670772595
275,2020-12-02 00:00:00,0.012233484795526,28.61,28.55,28.92,28.43,1.0,0.07949277212783734,-0.007187783773575873,-0.17855992973299373,-0.684252421714038
276,2020-12-03 00:00:00,0.024171270718232,28.96,28.6,28.98,28.26,0.8,0.005739381658425913,0.022123386416501134,-0.3747574349565655,-0.4325992407521284
277,2020-12-04 00:00:00,-0.0016857720836143,29.66,29.0,29.89,28.75,1.0,-0.061585837033536706,0.09322711008359441,-1.009158955205296,0.07818515698282724
278,2020-12-05 00:00:00,-0.0016857720836143,29.66,29.0,29.89,28.75,1.0,0.05377176484284796,-0.0682181957649104,0.04434431403759833,-0.9845071237795541
279,2020-12-06 00:00:00,-0.0016857720836143,29.66,29.0,29.89,28.75,1.0,0.015843250162804523,0.030344283358750612,-0.5318243364075838,-0.5207925736070925
280,2020-12-07 00:00:00,0.005741303613644,29.61,29.67,30.07,29.49,1.0,-0.035846615205650245,0.09501337958463152,-0.51492782754196,-0.15332794153591742
281,2020-12-08 00:00:00,0.0020147750167897,29.78,29.62,29.83,29.39,1.0,-0.027000032194991697,0.23282269938741473,-0.5069353674605716,0.34694623688421034
282,2020-12-09 00:00:00,-0.0264745308310991,29.84,29.79,30.29,29.76,1.0,0.15528608085154083,0.8867257115915952,0.42965370356353144,1.9281797062430241
283,2020-12-10 00:00:00,0.0024096385542168,29.05,29.84,29.84,28.87,1.0,0.07668088715296939,1.0190498418416705,0.1653999773135906,2.1811230845511487
284,2020-12-11 00:00:00,0.0078983516483516,29.12,29.05,29.46,28.43,1.0,0.08460772816900786,1.8573758914795664,-0.07849316646556904,4.325294877449857
285,2020-12-12 00:00:00,0.0078983516483516,29.12,29.05,29.46,28.43,1.0,0.0,0.0,0.0,0.0
286,2020-12-13 00:00:00,0.0078983516483516,29.12,29.05,29.46,28.43,1.0,0.0,0.0,0.0,0.0
287,2020-12-14 00:00:00,-0.0003407155025554,29.35,29.12,29.93,29.11,1.0,0.0,0.0,0.0,0.0
288,2020-12-15 00:00:00,0.0071574642126789,29.34,29.29,29.51,29.07,1.0,0.0,0.0,0.0,0.0
289,2020-12-16 00:00:00,-0.0040609137055837,29.55,29.35,29.92,29.31,1.0,0.0,0.0,0.0,0.0
290,2020-12-17 00:00:00,0.0129119945633706,29.43,29.53,29.77,29.3,1.0,0.0,0.0,0.0,0.0
291,2020-12-18 00:00:00,-0.0369003690036899,29.81,29.39,29.86,29.38,1.0,0.0,0.0,0.0,0.0
292,2020-12-19 00:00:00,-0.0369003690036899,29.81,29.39,29.86,29.38,1.0,0.0,0.0,0.0,0.0
293,2020-12-20 00:00:00,-0.0369003690036899,29.81,29.39,29.86,29.38,1.0,0.0,0.0,0.0,0.0
294,2020-12-21 00:00:00,0.014977359804946,28.71,29.87,29.87,27.94,1.0,0.0,0.0,0.0,0.0
295,2020-12-22 00:00:00,0.008236101578586,29.14,28.71,29.44,28.7,1.0,0.0,0.0,0.0,0.0
296,2020-12-23 00:00:00,-0.0003403675970046,29.38,29.14,29.46,29.07,1.0,0.0,0.0,0.0,0.0
297,2020-12-24 00:00:00,0.0,29.37,29.38,29.4,29.35,1.0,0.0,0.0,0.0,0.0
298,2020-12-25 00:00:00,0.0323459312223356,29.37,29.37,29.4,29.33,1.0,0.0,0.0,0.0,0.0
299,2020-12-26 00:00:00,0.0323459312223356,29.37,29.37,29.4,29.33,1.0,0.0,0.0,0.0,0.0
300,2020-12-27 00:00:00,0.0323459312223356,29.37,29.37,29.4,29.33,1.0,0.0,0.0,0.0,0.0
301,2020-12-28 00:00:00,-0.0036279683377308,30.32,29.36,30.37,29.36,1.0,0.0,0.0,0.0,0.0
302,2020-12-29 00:00:00,0.0003310162197947,30.21,30.33,30.6,30.09,1.0,0.0,0.0,0.0,0.0
303,2020-12-30 00:00:00,0.0,30.22,30.21,30.31,29.93,1.0,0.0,0.0,0.0,0.0
304,2020-12-31 00:00:00,0.0,30.22,30.22,30.4,30.08,0.0,0.0,0.0,0.0,0.0
305,2021-01-01 00:00:00,0.0148908007941761,30.22,30.22,30.22,30.22,1.0,0.0,0.0,0.0,0.0
306,2021-01-02 00:00:00,0.0148908007941761,30.22,30.22,30.22,30.22,1.0,-0.1300289570680997,0.17606821358512192,-1.2050989360940627,0.042033495478221536
307,2021-01-03 00:00:00,0.0148908007941761,30.22,30.22,30.22,30.22,1.0,-0.12466204134492465,0.08207841035991414,-1.3701042884122068,-0.1427777071061636
308,2021-01-04 00:00:00,-0.005868927290512,30.67,30.18,30.79,30.18,0.0,0.0,0.0,0.0,0.0
309,2021-01-05 00:00:00,-0.0006559527714004,30.49,30.66,30.67,30.08,0.8666666666666667,-0.031798316008079475,0.028141800445601106,-0.3703810424563438,-0.31065780970151186
310,2021-01-06 00:00:00,0.0082047915982934,30.47,30.49,30.52,30.42,1.0,-0.069422952962098,-0.09737293194980534,-0.3815093965650489,-0.6358757945318274
311,2021-01-07 00:00:00,0.0,30.72,30.46,30.89,30.45,1.0,-0.003610348682169473,-0.017132305892888944,-0.5418859661004127,-0.38462320919931065
312,2021-01-08 00:00:00,-0.0179036458333332,30.72,30.71,30.98,30.34,1.0,0.04980858765986529,0.06921853118788857,-0.1938481805219022,-0.15728911929620712
313,2021-01-09 00:00:00,-0.0179036458333332,30.72,30.71,30.98,30.34,1.0,0.049400826566669664,0.02421811294777676,-0.05502335019564309,-0.611063488007839
314,2021-01-10 00:00:00,-0.0179036458333332,30.72,30.71,30.98,30.34,1.0,0.0085633145284012,-0.0008207669000781515,-0.5171647139868408,-0.6913183986456813
315,2021-01-11 00:00:00,-0.0023201856148491,30.17,30.88,30.88,30.0,0.0,0.0024404533384254634,0.036403310564061986,-0.7669140561280722,-0.49527735725583133
316,2021-01-12 00:00:00,0.0053156146179402,30.1,30.16,30.42,29.93,1.0,-0.13053970861063657,0.057623697146899744,-0.8864579742713142,-0.20873537026396974
317,2021-01-13 00:00:00,-0.0056179775280899,30.26,30.09,30.55,30.02,0.0,0.008584289394817368,0.05058366634245459,-0.21154585515617585,-0.3429617610483257
318,2021-01-14 00:00:00,-0.0063143901628448,30.09,30.26,30.64,30.03,1.0,-0.017290581339902467,0.18843815464457947,-0.4605928642884175,0.34704253499589927
319,2021-01-15 00:00:00,-0.0023411371237458,29.9,30.05,30.1,29.76,1.0,0.08097909208490872,0.16707665606671185,0.3642747019167456,-0.08582061809507421
320,2021-01-16 00:00:00,-0.0023411371237458,29.9,30.05,30.1,29.76,1.0,0.0003911755217060886,0.07224226426795433,-0.5432477230280041,-0.3707894528687676
321,2021-01-17 00:00:00,-0.0023411371237458,29.9,30.05,30.1,29.76,1.0,0.004525002395747713,0.01154932414659271,-0.49378720760800576,-0.3911636958845014
322,2021-01-18 00:00:00,0.0150854844116662,29.83,29.96,30.16,29.8,0.6666666666666666,0.0008950364130022592,0.025420846951018206,-0.40248211434593745,-0.35113170045828507
323,2021-01-19 00:00:00,0.0,30.28,29.83,30.51,29.82,1.0,0.0830323927013783,0.1413028500190716,-0.22824288357048697,0.4150714024149335
324,2021-01-20 00:00:00,-0.0069352708058124,30.28,30.28,30.62,30.2,1.0,0.08496494010067845,0.18575078900932596,-0.12780114066255446,0.4349502417549527
325,2021-01-21 00:00:00,-0.0242766877286332,30.07,30.28,30.57,30.05,1.0,-0.021675168240402165,-0.012525399421593253,-0.5033064009665319,-0.36620450940601007
326,2021-01-22 00:00:00,-0.0221540558963871,29.34,30.03,30.08,29.13,1.0,-0.04691759927751704,-0.07966291983678753,-0.6700682008253942,-1.051082541167004
327,2021-01-23 00:00:00,-0.0221540558963871,29.34,30.03,30.08,29.13,1.0,0.3026856909454132,0.18401169183184685,1.1611411437771317,0.2942673512459217
328,2021-01-24 00:00:00,-0.0221540558963871,29.34,30.03,30.08,29.13,1.0,0.3132970269264028,-0.07114974191446422,1.34655813931179,-0.9709040801830228
329,2021-01-25 00:00:00,0.0,28.69,29.34,29.41,28.49,0.5,0.32620151423714994,-0.08538653442144373,1.8751279104563499,-1.3317687175636588
330,2021-01-26 00:00:00,-0.0320669222725688,28.69,28.69,29.08,28.64,1.0,0.38144721059585684,0.05765960107157042,1.7350982431613946,-0.30594333414687863
331,2021-01-27 00:00:00,0.0162045372704356,27.77,28.7,28.91,27.76,0.0,0.3132289353967561,0.05556033850524589,1.3839032233894004,-0.2983638691395312
332,2021-01-28 00:00:00,-0.0024805102763997,28.22,27.77,28.35,27.12,0.75,0.09055579832889205,0.6548615279053216,0.03464741108379266,3.0266010245747315
333,2021-01-29 00:00:00,0.0,28.15,28.21,28.42,27.73,1.0,0.3750640446779512,0.5750579283828641,1.5166768964567285,2.227154674895428
334,2021-01-30 00:00:00,0.0,28.15,28.21,28.42,27.73,1.0,0.25767274683475705,0.21210158617155273,1.298796991110708,0.8022643804133254
335,2021-01-31 00:00:00,0.0,28.15,28.21,28.42,27.73,1.0,0.20677460691317595,0.031570501691365216,1.1400885010336588,-0.41668619713817007
336,2021-02-01 00:00:00,0.016696269982238,28.15,28.15,28.37,27.9,1.0,0.15185095386785452,0.009948001362555026,0.006013045351293747,-0.6281100272926451
337,2021-02-02 00:00:00,0.0094339622641509,28.62,28.15,28.95,28.14,1.0,0.2802172636800897,0.0671398704257582,0.3592160076836116,-0.14212979091450437
338,2021-02-03 00:00:00,-0.0048459674627899,28.89,28.6,28.94,28.56,1.0,0.04642881333120208,0.17402195380220942,-0.21280624872254375,0.3308514206439866
339,2021-02-04 00:00:00,0.008,28.75,28.89,28.97,28.6,0.8571428571428571,-0.026603736142099876,0.3303413009195282,-0.6816485625356059,0.6461596888851606
340,2021-02-05 00:00:00,0.0158730158730159,28.98,28.75,29.17,28.74,1.0,-0.02826272100183136,0.4763152194684084,-0.6028092206143436,1.4818890003992327
341,2021-02-06 00:00:00,0.0158730158730159,28.98,28.75,29.17,28.74,1.0,0.0658477261547139,0.19387052774944902,0.19210088653719556,0.6017975339363442
342,2021-02-07 00:00:00,0.0158730158730159,28.98,28.75,29.17,28.74,1.0,0.1027326424143693,0.1979099560960642,0.2869531218073382,0.72964429752289
343,2021-02-08 00:00:00,-0.0292119565217392,29.44,28.93,29.59,28.93,1.0,0.11127477001831565,0.0798516867777006,0.18324361750420998,-0.23075368104702004
344,2021-02-09 00:00:00,0.0066480055983205,28.58,29.44,29.45,28.54,1.0,-0.02313278021309806,0.016791413321100013,-0.4577925902107214,-0.4505200474009353
345,2021-02-10 00:00:00,0.0125130344108446,28.77,28.58,28.93,28.39,1.0,-0.1046396747894569,-0.055630070274243604,-0.9793754574971507,-0.7518467665304361
346,2021-02-11 00:00:00,0.0061791967044284,29.13,28.77,29.27,28.74,1.0,-0.07984793677971425,-0.04969193580622333,-0.8738264202967992,-0.7876810361923697
347,2021-02-12 00:00:00,0.0255885363357216,29.31,29.13,29.33,29.04,1.0,-0.05986514411863819,-0.033811359463251645,-0.5462020807673774,-0.7770367796873324
348,2021-02-13 00:00:00,0.0255885363357216,29.31,29.13,29.33,29.04,1.0,0.0,0.0,0.0,0.0
349,2021-02-14 00:00:00,0.0255885363357216,29.31,29.13,29.33,29.04,1.0,0.0,0.0,0.0,0.0
350,2021-02-15 00:00:00,0.0029940119760478,30.06,29.31,30.15,29.29,1.0,0.0,0.0,0.0,0.0
351,2021-02-16 00:00:00,-0.0102819237147594,30.15,30.06,30.37,30.02,0.6666666666666666,0.0,0.0,0.0,0.0
352,2021-02-17 00:00:00,-0.0170911528150134,29.84,30.15,30.2,29.69,1.0,0.0,0.0,0.0,0.0
353,2021-02-18 00:00:00,0.0020456870098875,29.33,29.84,30.02,29.32,1.0,0.11364514475189491,0.6709072789746999,0.19588461873241372,3.0052682362708873
354,2021-02-19 00:00:00,0.0047635250085063,29.39,29.33,29.6,29.31,1.0,-0.05843797083605562,0.5145163804498747,-0.6454314877801574,1.1979884249824233
355,2021-02-20 00:00:00,0.0047635250085063,29.39,29.33,29.6,29.31,1.0,-0.09321647755148366,0.6607198893604371,-1.057885046611047,1.492309481153029
356,2021-02-21 00:00:00,0.0047635250085063,29.39,29.33,29.6,29.31,1.0,-0.09114807487729149,0.6910694260332866,-0.9744089034499291,1.1432895224270836
357,2021-02-22 00:00:00,-0.0128682695563834,29.53,29.39,29.81,29.2,1.0,-0.09105960192457463,0.6947075206362445,-0.9237875948992988,1.3891993762471186
358,2021-02-23 00:00:00,0.0041166380789022,29.15,29.52,29.83,29.08,1.0,-0.08554090596985642,0.7114034799076343,-0.9649317750645412,1.669305272604206
359,2021-02-24 00:00:00,0.0174239836009566,29.27,29.15,29.66,29.14,1.0,-0.012396151468242245,0.6628128315940351,-0.5897852851308676,1.4178062271407557
360,2021-02-25 00:00:00,0.0147750167897917,29.78,29.27,29.87,29.26,-0.5,0.0,0.0,0.0,0.0
361,2021-02-26 00:00:00,0.0089344804765056,30.22,29.94,30.25,29.44,1.0,0.0,0.0,0.0,0.0
362,2021-02-27 00:00:00,0.0089344804765056,30.22,29.94,30.25,29.44,1.0,0.38472524428268606,0.06321451248706689,1.6236933235796613,-0.00208542677068145
363,2021-02-28 00:00:00,0.0089344804765056,30.22,29.94,30.25,29.44,1.0,0.09861338193724212,-0.0007231370531441961,0.06786386419867795,-0.577743836409813
364,2021-03-01 00:00:00,0.0262381108560183,30.49,30.21,30.96,30.2,1.0,0.1648131084385689,-0.0022240605405614566,0.7368324518520196,-0.6334254073169395
365,2021-03-02 00:00:00,-0.001278363694471,31.29,30.5,31.35,30.48,1.0,0.08514613483016209,0.014422072466201197,-0.15673495895491854,-0.4842773374036532
366,2021-03-03 00:00:00,-0.0019199999999999,31.25,31.29,31.77,31.2,1.0,0.00032370602657660896,0.15268329264010694,-0.48960611621755196,0.18660113580190377
367,2021-03-04 00:00:00,0.0092978518756011,31.19,31.25,31.45,30.99,1.0,-0.022995353782472527,0.2668127497827597,-0.47488618628242585,1.069754143604636
368,2021-03-05 00:00:00,-0.0009529860228717,31.48,31.19,31.49,30.96,1.0,-0.0593072441186413,0.46382238034082235,-0.7713658583525992,1.7502966938613032
369,2021-03-06 00:00:00,-0.0009529860228717,31.48,31.19,31.49,30.96,1.0,0.0,0.0,0.0,0.0
370,2021-03-07 00:00:00,-0.0009529860228717,31.48,31.19,31.49,30.96,1.0,0.0,0.0,0.0,0.0
371,2021-03-08 00:00:00,0.0133545310015898,31.45,31.48,31.78,31.43,0.75,0.0,0.0,0.0,0.0
372,2021-03-09 00:00:00,0.0094132412927518,31.87,31.47,32.03,31.43,0.5,0.0,0.0,0.0,0.0
373,2021-03-10 00:00:00,0.0139881877525643,32.17,31.87,32.19,31.71,1.0,0.346129388410386,0.09026434561662278,2.011118519652286,0.06662090192142306
374,2021-03-11 00:00:00,0.0006131207847947,32.62,32.17,32.63,32.16,0.8571428571428571,0.6143366350354587,-0.013295246829256868,3.1474711381739677,-0.675138279354116
375,2021-03-12 00:00:00,0.000612745098039,32.64,32.62,32.68,32.39,1.0,0.009929165584689592,-0.06400471633369698,-0.5578554836767581,-0.9355587076185425
376,2021-03-13 00:00:00,0.000612745098039,32.64,32.62,32.68,32.39,1.0,0.04791632661376788,-0.004923152421405064,-0.34179302891288504,-0.6501900828529943
377,2021-03-14 00:00:00,0.000612745098039,32.64,32.62,32.68,32.39,1.0,0.18210520914071449,0.10292236208185734,0.5348744332126426,-0.21361195154726867
378,2021-03-15 00:00:00,0.0104102878138396,32.66,32.65,32.67,32.6,1.0,0.17644773331719588,0.22899751427521675,0.7189047175204777,0.5037902622564989
379,2021-03-16 00:00:00,-0.0021212121212121,33.0,32.65,33.1,32.65,1.0,0.13174968068097037,0.6355094452572816,-0.0428209517274229,2.064485128797878
380,2021-03-17 00:00:00,-0.0112359550561796,32.93,32.99,33.05,32.79,1.0,0.05877577458599781,1.0852756014861216,-0.3188127378663033,1.5017476345277099
381,2021-03-18 00:00:00,-0.0089066339066338,32.56,32.92,33.15,32.43,1.0,0.08396243703420492,0.7804594529982536,-0.17715093696914086,1.1393986263620264
382,2021-03-19 00:00:00,-0.0018593120545398,32.27,32.56,32.57,31.96,1.0,-0.05470515326356118,0.5265402745529051,-0.5682324773860582,1.3593316169398382
383,2021-03-20 00:00:00,-0.0018593120545398,32.27,32.56,32.57,31.96,1.0,0.0,0.0,0.0,0.0
384,2021-03-21 00:00:00,-0.0018593120545398,32.27,32.56,32.57,31.96,1.0,0.0,0.0,0.0,0.0
385,2021-03-22 00:00:00,-0.0121080409810618,32.21,32.28,32.36,31.95,1.0,0.0,0.0,0.0,0.0
386,2021-03-23 00:00:00,0.008485229415462,31.82,32.21,32.39,31.8,0.75,0.0,0.0,0.0,0.0
387,2021-03-24 00:00:00,0.0040511062636333,32.09,31.83,32.2,31.75,0.6666666666666666,0.0,0.0,0.0,0.0
388,2021-03-25 00:00:00,0.0180012414649285,32.22,32.09,32.25,32.02,1.0,0.14241415637241328,-0.0034812771068679638,0.3976593913619278,-0.6958802418331547
389,2021-03-26 00:00:00,0.0079268292682928,32.8,32.23,32.88,32.21,1.0,0.1335063455743768,0.14424851533370564,0.48856899997870123,0.12138017529650928
390,2021-03-27 00:00:00,0.0079268292682928,32.8,32.23,32.88,32.21,1.0,-0.04403974967121904,0.2844551299562532,-0.8010055480669916,0.9419471165695799
391,2021-03-28 00:00:00,0.0079268292682928,32.8,32.23,32.88,32.21,1.0,0.00028123576408933815,0.12883078203613962,-0.752396187277295,0.04385037197625832
392,2021-03-29 00:00:00,0.0093768905021172,33.06,32.8,33.45,32.79,1.0,0.023807634289156887,0.11748926465140741,-0.44355964850335783,-0.1361752993866464
393,2021-03-30 00:00:00,-0.0083907701528317,33.37,33.05,33.38,33.01,0.0,0.08153678480433424,0.18587136762477297,-0.24433883268496778,0.6464993633643602
394,2021-03-31 00:00:00,0.0139014808099121,33.09,33.37,33.42,33.0,1.0,0.12021763945986041,0.06436075731321633,0.10416375311749838,-0.4824613803684177
395,2021-04-01 00:00:00,0.0,33.55,33.09,33.61,33.07,1.0,0.3008679162656209,0.04764299001045824,1.0377373921977464,-0.40705622719879697
396,2021-04-02 00:00:00,-0.0011922503725782,33.55,33.55,33.57,33.53,1.0,0.2690614799025868,0.039210562748216216,1.0438519147272203,-0.6317361557261623
397,2021-04-03 00:00:00,-0.0011922503725782,33.55,33.55,33.57,33.53,1.0,0.17524501846048945,0.008716005943573357,0.4597360486797311,-0.3008199991018906
398,2021-04-04 00:00:00,-0.0011922503725782,33.55,33.55,33.57,33.53,1.0,0.23094171926238882,-0.10361521077001257,0.8849514148412195,-1.10114531139979
399,2021-04-05 00:00:00,0.0047746941211579,33.51,33.55,33.56,33.49,0.5,0.25812491329778986,-0.1096151971287993,1.304846659736744,-0.8442159661504337
400,2021-04-06 00:00:00,0.0068310068310067,33.67,33.51,34.0,33.51,1.0,0.4960506277206944,-0.007991805838075905,0.8482863090238146,-0.44064919895129206
401,2021-04-07 00:00:00,0.0020648967551622,33.9,33.67,33.95,33.57,1.0,0.24892686088559213,0.0563321215894419,0.5278768873841284,-0.22830811618925537
402,2021-04-08 00:00:00,0.0088313217544893,33.97,33.9,34.12,33.82,1.0,0.10996133468976055,-0.06407494773226752,-0.03348447526566358,-0.7448515896711435
403,2021-04-09 00:00:00,0.0070032098044935,34.27,33.98,34.27,33.88,1.0,-0.06958468604967027,-0.06225704814351385,-0.6535384336212706,-0.44297021653520385
404,2021-04-10 00:00:00,0.0070032098044935,34.27,33.98,34.27,33.88,1.0,0.14966562697426333,0.12007966066133147,0.44755674328163714,0.324789480971087
405,2021-04-11 00:00:00,0.0070032098044935,34.27,33.98,34.27,33.88,1.0,-0.041440185708162325,0.20768460088064034,-0.7603634083560642,1.0091520807596772
406,2021-04-12 00:00:00,0.0026079397276152,34.51,34.27,34.77,34.27,1.0,-0.057698047713159895,0.2688128943245478,-0.5487569210949153,1.6817913435396994
407,2021-04-13 00:00:00,0.0020231213872832,34.6,34.51,34.73,34.43,1.0,-0.04892782035247745,0.40933688211726516,-0.7990316082342939,3.3533136829713737
408,2021-04-14 00:00:00,0.0034612056533024,34.67,34.6,34.74,34.33,1.0,0.0,0.0,0.0,0.0
409,2021-04-15 00:00:00,-0.0040241448692153,34.79,34.67,34.87,34.63,1.0,0.0,0.0,0.0,0.0
410,2021-04-16 00:00:00,-0.027128427128427,34.65,34.79,34.93,34.54,1.0,0.0,0.0,0.0,0.0
411,2021-04-17 00:00:00,-0.027128427128427,34.65,34.79,34.93,34.54,1.0,0.0,0.0,0.0,0.0
412,2021-04-18 00:00:00,-0.027128427128427,34.65,34.79,34.93,34.54,1.0,0.0,0.0,0.0,0.0
413,2021-04-19 00:00:00,0.0011865915158706,33.71,34.65,34.66,33.57,1.0,0.0,0.0,0.0,0.0
414,2021-04-20 00:00:00,0.0002962962962962,33.75,33.71,34.01,33.45,1.0,0.0,0.0,0.0,0.0
415,2021-04-21 00:00:00,0.01718009478673,33.76,33.75,33.96,33.47,1.0,0.0,0.0,0.0,0.0
416,2021-04-22 00:00:00,0.0072801397786837,34.34,33.76,34.54,33.75,1.0,0.0,0.0,0.0,0.0
417,2021-04-23 00:00:00,0.0185024573576176,34.59,34.33,34.65,34.24,1.0,0.0,0.0,0.0,0.0
418,2021-04-24 00:00:00,0.0185024573576176,34.59,34.33,34.65,34.24,1.0,0.0,0.0,0.0,0.0
419,2021-04-25 00:00:00,0.0185024573576176,34.59,34.33,34.65,34.24,1.0,0.0,0.0,0.0,0.0
420,2021-04-26 00:00:00,-0.0082316207777462,35.23,34.59,35.47,34.58,1.0,0.0,0.0,0.0,0.0
421,2021-04-27 00:00:00,0.0071551230681167,34.94,35.23,35.53,34.92,1.0,0.0,0.0,0.0,0.0
422,2021-04-28 00:00:00,0.0005683432793408,35.19,34.94,35.24,34.69,1.0,0.0,0.0,0.0,0.0
423,2021-04-29 00:00:00,0.0017040613462085,35.21,35.19,35.63,35.18,1.0,0.0,0.0,0.0,0.0
424,2021-04-30 00:00:00,0.0062375956903883,35.27,35.21,35.31,35.2,1.0,0.0,0.0,0.0,0.0
425,2021-05-01 00:00:00,0.0062375956903883,35.27,35.21,35.31,35.2,1.0,0.0,0.0,0.0,0.0
426,2021-05-02 00:00:00,0.0062375956903883,35.27,35.21,35.31,35.2,1.0,0.0,0.0,0.0,0.0
427,2021-05-03 00:00:00,-0.0014088475626938,35.49,35.27,35.54,35.26,1.0,0.0,0.0,0.0,0.0
428,2021-05-04 00:00:00,0.0005643340857788,35.44,35.49,35.56,35.36,1.0,0.0,0.0,0.0,0.0
429,2021-05-05 00:00:00,0.0016920473773266,35.46,35.45,35.69,35.37,1.0,0.0,0.0,0.0,0.0
430,2021-05-06 00:00:00,0.0028153153153151,35.52,35.46,35.73,35.29,1.0,0.0,0.0,0.0,0.0
431,2021-05-07 00:00:00,0.0092644581695678,35.62,35.52,35.65,35.32,1.0,0.0,0.0,0.0,0.0
432,2021-05-08 00:00:00,0.0092644581695678,35.62,35.52,35.65,35.32,1.0,0.0,0.0,0.0,0.0
433,2021-05-09 00:00:00,0.0092644581695678,35.62,35.52,35.65,35.32,1.0,0.0,0.0,0.0,0.0
434,2021-05-10 00:00:00,-0.0108484005563282,35.95,35.62,36.26,35.61,0.75,0.0,0.0,0.0,0.0
435,2021-05-11 00:00:00,-0.0092800899887515,35.56,35.96,35.97,35.12,1.0,0.0,0.0,0.0,0.0
436,2021-05-12 00:00:00,0.003406187908033,35.23,35.56,35.78,35.22,1.0,0.45069965904675335,0.14186224993983032,1.3704202630087114,-0.09914083431713551
437,2021-05-13 00:00:00,0.0099009900990099,35.35,35.24,35.64,34.64,1.0,0.0987450923476274,0.10373319977564588,-0.22947351863523113,-0.12331898373686735
438,2021-05-14 00:00:00,-0.0053221288515407,35.7,35.35,35.71,35.3,1.0,0.08625637031705935,0.054650801557214024,-0.05930764377603526,-0.3562557317236711
439,2021-05-15 00:00:00,-0.0053221288515407,35.7,35.35,35.71,35.3,1.0,-0.009119451260207079,0.06829893132654963,-0.347027068656831,-0.2482373657528129
440,2021-05-16 00:00:00,-0.0053221288515407,35.7,35.35,35.71,35.3,1.0,0.000579452140114789,0.027769967521646954,-0.3726424342982853,-0.3565057393057304
441,2021-05-17 00:00:00,-0.0030977189524077,35.51,35.7,35.94,35.48,1.0,0.00934537746970765,0.017565103893093514,-0.3718951689573768,-0.3610865464824748
442,2021-05-18 00:00:00,-0.01864406779661,35.4,35.51,35.79,35.36,0.6666666666666666,-0.027936269450025364,0.00743590217007295,-0.5964038922418058,-0.5338308155757402
443,2021-05-19 00:00:00,0.0063327576280943,34.74,35.41,35.41,34.59,1.0,-0.07617265421221031,-0.020775807378126565,-0.9259377063614997,-0.7175944664190708
444,2021-05-20 00:00:00,-0.0280320366132724,34.96,34.75,35.06,34.52,0.6666666666666666,0.2944673584119242,-0.07278071478660486,0.9274170624578528,-0.8418291743003232
445,2021-05-21 00:00:00,0.0203060623896411,33.98,34.96,35.04,33.31,1.0,0.7229423763055065,0.04430220257613371,2.8282551089653842,-0.4938112534531561
446,2021-05-22 00:00:00,0.0203060623896411,33.98,34.96,35.04,33.31,1.0,0.8456637651764147,0.10561077378012929,3.7855267554435637,-0.03611375077488021
447,2021-05-23 00:00:00,0.0203060623896411,33.98,34.96,35.04,33.31,1.0,1.2655804229210927,-0.006938569552880303,6.72536712793845,-0.5085765136083696
448,2021-05-24 00:00:00,-0.0207672339198153,34.67,33.98,34.68,33.97,0.4285714285714285,1.2803941584341683,0.029584554495568405,8.745728730709205,-0.2932736940822016
449,2021-05-25 00:00:00,0.0082474226804121,33.95,34.66,34.8,33.94,1.0,0.6750819610666063,0.028826092008797488,1.8734472682048802,-0.5309420776752869
450,2021-05-26 00:00:00,0.0131463628396144,34.23,33.94,34.44,33.94,1.0,0.6467888813472173,0.02709376352919879,3.2512338112283024,-0.40050231282917076
451,2021-05-27 00:00:00,0.0057670126874279,34.68,34.23,34.84,34.22,1.0,0.419314131442305,-0.06386416372810277,1.7198842690626612,-0.7986749829303967
452,2021-05-28 00:00:00,0.0091743119266055,34.88,34.69,35.06,34.68,1.0,0.32708295064384973,-0.002792795361638234,0.6030783225600015,-0.45743503096630156
453,2021-05-29 00:00:00,0.0091743119266055,34.88,34.69,35.06,34.68,1.0,0.27741909672458664,-0.0802773300818691,1.5482743348793562,-0.945910348348624
454,2021-05-30 00:00:00,0.0091743119266055,34.88,34.69,35.06,34.68,1.0,0.3447103169512653,-0.024018604136108124,1.245706375810206,-0.5068563217519414
455,2021-05-31 00:00:00,0.0022727272727272,35.2,34.88,35.21,34.87,0.6666666666666666,0.43718495437351645,-0.013036672043931219,3.8393910459070453,-0.3509611135159872
456,2021-06-01 00:00:00,0.0045351473922901,35.28,35.2,35.33,34.98,1.0,0.9043969684676414,0.032247900469979385,2.433382860890267,-0.3553011745005284
457,2021-06-02 00:00:00,-0.0070541760722347,35.44,35.27,35.62,35.27,1.0,0.5717390359829997,0.018398487020928833,3.5391582758701556,-0.4581208826131882
458,2021-06-03 00:00:00,0.0099460073884626,35.19,35.44,35.46,35.12,1.0,-0.026129168211517673,0.0224642942846609,-0.8409068729178094,-0.48120018550397065
459,2021-06-04 00:00:00,0.0014068655036579,35.54,35.2,35.6,35.18,1.0,-0.015496456048413876,-0.06161077108213853,-0.528407552075938,-0.9588034263262736
460,2021-06-05 00:00:00,0.0014068655036579,35.54,35.2,35.6,35.18,1.0,-0.07841290393389411,-0.03440377190248256,-0.7487716229509425,-0.7278203496525247
461,2021-06-06 00:00:00,0.0014068655036579,35.54,35.2,35.6,35.18,1.0,-0.06269574740107586,0.13533797965864558,-1.0250894608586523,0.6510976143384745
462,2021-06-07 00:00:00,0.0148918235459397,35.59,35.54,35.72,35.49,1.0,-0.06932016656391227,0.20664300574679473,-0.7558039283614857,0.6366036319498665
463,2021-06-08 00:00:00,0.0,36.12,35.59,36.14,35.58,1.0,-0.0014848372288387424,0.4759859026440161,-0.4681371174499437,4.6607079321138585
464,2021-06-09 00:00:00,0.0132890365448506,36.12,36.13,36.21,35.99,1.0,0.0,0.0,0.0,0.0
465,2021-06-10 00:00:00,0.0065573770491803,36.6,36.12,36.63,36.08,1.0,0.0,0.0,0.0,0.0
466,2021-06-11 00:00:00,-0.0032573289902281,36.84,36.6,36.84,36.54,1.0,0.0,0.0,0.0,0.0
467,2021-06-12 00:00:00,-0.0032573289902281,36.84,36.6,36.84,36.54,1.0,0.0,0.0,0.0,0.0
468,2021-06-13 00:00:00,-0.0032573289902281,36.84,36.6,36.84,36.54,1.0,0.0,0.0,0.0,0.0
469,2021-06-14 00:00:00,-0.0051742919389977,36.72,36.84,36.93,36.62,1.0,0.0,0.0,0.0,0.0
470,2021-06-15 00:00:00,-0.0057486996988776,36.53,36.72,36.73,36.38,1.0,0.0,0.0,0.0,0.0
471,2021-06-16 00:00:00,0.0002753303964757,36.32,36.52,36.54,36.13,1.0,0.0,0.0,0.0,0.0
472,2021-06-17 00:00:00,-0.0112854390311036,36.33,36.32,36.55,36.28,1.0,0.0,0.0,0.0,0.0
473,2021-06-18 00:00:00,0.0008351893095768,35.92,36.33,36.38,35.88,1.0,0.0,0.0,0.0,0.0
474,2021-06-19 00:00:00,0.0008351893095768,35.92,36.33,36.38,35.88,1.0,0.0,0.0,0.0,0.0
475,2021-06-20 00:00:00,0.0008351893095768,35.92,36.33,36.38,35.88,1.0,0.0,0.0,0.0,0.0
476,2021-06-21 00:00:00,0.0022253129346313,35.95,35.92,35.99,35.9,1.0,0.0,0.0,0.0,0.0
477,2021-06-22 00:00:00,0.0016652789342215,36.03,35.95,36.21,35.82,0.0,0.0,0.0,0.0,0.0
478,2021-06-23 00:00:00,0.0016625103906898,36.09,36.03,36.28,36.02,1.0,0.0,0.0,0.0,0.0
479,2021-06-24 00:00:00,-0.0038727524204702,36.15,36.09,36.2,35.98,0.4,-0.10847141870285792,0.11816437744160346,-1.0575386201945114,0.013560842145271921
480,2021-06-25 00:00:00,-0.0061094140516522,36.01,36.15,36.16,35.8,1.0,-0.12173505223974512,0.029209356628372873,-1.3543886650673524,-0.441617121755576
481,2021-06-26 00:00:00,-0.0061094140516522,36.01,36.15,36.16,35.8,1.0,0.03251837147560721,0.0034880411996143224,-0.37535478264735356,-0.35692955535466775
482,2021-06-27 00:00:00,-0.0061094140516522,36.01,36.15,36.16,35.8,1.0,-0.02019795199533192,-0.018017362852863705,-0.8045938171518354,-0.4700088073463517
483,2021-06-28 00:00:00,-0.009499860296172,35.79,36.02,36.14,35.74,1.0,-0.011501912229280542,-0.02922534536678434,-0.41083326065130576,-0.7435831620978511
484,2021-06-29 00:00:00,-0.0118476727785614,35.45,35.79,35.83,35.33,1.0,-0.017082843152965488,-0.03989394404138391,-0.7424809493003213,-1.0694219822440498
485,2021-06-30 00:00:00,0.0005709391949756,35.03,35.47,35.55,34.98,1.0,-0.01495281798066106,-0.0066022727413521665,-0.5948357213638535,-0.41186214582090946
486,2021-07-01 00:00:00,-0.0039942938659058,35.05,35.02,35.32,35.01,0.8181818181818182,-0.014773123180128245,0.1586189156576543,-0.5412148731420194,0.06398636329177818
487,2021-07-02 00:00:00,-0.0111715840733312,34.91,35.05,35.19,34.88,1.0,-0.11744322398665563,0.03276901873194671,-1.1140348218496159,-0.34846803227418344
488,2021-07-03 00:00:00,-0.0111715840733312,34.91,35.05,35.19,34.88,1.0,-0.04063485761901031,0.08470222459689358,-0.6084818779769355,0.10884661946100714
489,2021-07-04 00:00:00,-0.0111715840733312,34.91,35.05,35.19,34.88,1.0,0.011911156239836629,0.26095059046311775,-0.1699580451725882,0.8277105458646324
490,2021-07-05 00:00:00,0.0014484356894553,34.52,34.92,34.92,34.45,1.0,0.0017849679897148363,0.13337115610309258,-0.47311626040797977,0.283383260535229
491,2021-07-06 00:00:00,-0.003471217818918,34.57,34.53,34.58,34.23,1.0,-0.02513590421648626,0.06447500730838929,-0.5910080000463075,-0.2420130120420778
492,2021-07-07 00:00:00,-0.0174165457184325,34.45,34.56,34.75,34.39,1.0,-0.05818020336926999,-0.05049827378351823,-0.7238007235732475,-0.7627209768943304
493,2021-07-08 00:00:00,0.0180206794682422,33.85,34.48,34.48,33.69,1.0,-0.05075443950232117,-0.03189771333573699,-0.6205939359238576,-0.6700181035139292
494,2021-07-09 00:00:00,0.003482298316889,34.46,33.84,34.51,33.83,1.0,-0.06304805202967856,0.3201502195533168,-0.7066520560155256,2.0443589113657237
495,2021-07-10 00:00:00,0.003482298316889,34.46,33.84,34.51,33.83,1.0,0.0,0.0,0.0,0.0
496,2021-07-11 00:00:00,0.003482298316889,34.46,33.84,34.51,33.83,1.0,0.0,0.0,0.0,0.0
497,2021-07-12 00:00:00,-0.0147484094852515,34.58,34.46,34.98,34.44,1.0,0.0,0.0,0.0,0.0
498,2021-07-13 00:00:00,0.0,34.07,34.57,34.58,34.05,1.0,0.0,0.0,0.0,0.0
499,2021-07-14 00:00:00,-0.0123275609040211,34.07,34.07,34.21,33.81,1.0,0.0,0.0,0.0,0.0
500,2021-07-15 00:00:00,-0.0005943536404159,33.65,34.08,34.08,33.62,1.0,0.0,0.0,0.0,0.0
501,2021-07-16 00:00:00,-0.0380612548319952,33.63,33.65,33.9,33.63,1.0,0.0,0.0,0.0,0.0
502,2021-07-17 00:00:00,-0.0380612548319952,33.63,33.65,33.9,33.63,1.0,0.0,0.0,0.0,0.0
503,2021-07-18 00:00:00,-0.0380612548319952,33.63,33.65,33.9,33.63,1.0,0.0,0.0,0.0,0.0
504,2021-07-19 00:00:00,0.0049459041731065,32.35,33.62,33.64,32.13,1.0,0.0,0.0,0.0,0.0
505,2021-07-20 00:00:00,0.0187634573977237,32.51,32.35,32.73,32.34,1.0,0.0,0.0,0.0,0.0
506,2021-07-21 00:00:00,0.0036231884057972,33.12,32.52,33.13,32.5,0.8,0.0,0.0,0.0,0.0
507,2021-07-22 00:00:00,0.0048134777376653,33.24,33.12,33.42,33.11,1.0,0.0,0.0,0.0,0.0
508,2021-07-23 00:00:00,0.0080838323353294,33.4,33.24,33.49,33.23,1.0,-0.12250724082625641,0.25909720370917233,-1.3842706800993003,0.6346096614990465
509,2021-07-24 00:00:00,0.0080838323353294,33.4,33.24,33.49,33.23,1.0,-0.11105390094794565,0.13725398553325796,-0.8977103934596055,0.22921457603588818
510,2021-07-25 00:00:00,0.0080838323353294,33.4,33.24,33.49,33.23,1.0,-0.10687045005113571,0.13472017473128872,-1.2976389301118139,-0.05792474331215571
511,2021-07-26 00:00:00,0.0062370062370062,33.67,33.41,33.71,33.26,0.2,-0.1029001498595914,0.1492151464848348,-0.779495395718033,0.02691003177993284
512,2021-07-27 00:00:00,0.0047225501770955,33.88,33.67,33.96,33.53,1.0,-0.10686285847040278,-0.03862643062403759,-0.9573086277846508,-0.7528846899135585
513,2021-07-28 00:00:00,0.0067567567567568,34.04,33.88,34.09,33.69,1.0,0.024723245530799076,0.041646747219814095,-0.572350883453891,-0.2855965766221354
514,2021-07-29 00:00:00,0.0081704114385758,34.27,34.04,34.29,33.98,1.0,-0.023912528657543675,-0.05681054058656532,-0.7725114901461172,-1.0003808660847715
515,2021-07-30 00:00:00,0.0124457308248914,34.55,34.27,34.58,34.22,1.0,-0.009627316465165237,-0.06726224635631484,-0.5240836381191619,-1.409563574180411
516,2021-07-31 00:00:00,0.0124457308248914,34.55,34.27,34.58,34.22,1.0,-0.03445339627525179,0.03996629919770189,-0.5933268382545395,-0.32428007168105566
517,2021-08-01 00:00:00,0.0124457308248914,34.55,34.27,34.58,34.22,1.0,-0.048411324237989994,0.21576662092606647,-0.5211213204567436,1.02545841499391
518,2021-08-02 00:00:00,-0.0034305317324184,34.98,34.56,35.03,34.54,1.0,-0.07524299917098443,0.2923676939622659,-0.9395123937225257,0.7496562237169135
519,2021-08-03 00:00:00,-0.0034423407917383,34.86,34.98,35.07,34.69,0.7142857142857143,-0.1118208306307098,0.5169228916516584,-1.068535528716583,2.1854850421092062
520,2021-08-04 00:00:00,0.0109383995394356,34.74,34.85,34.96,34.72,0.875,-0.1171426580712307,0.2103078231943707,-1.2012378016913638,0.9992932340620824
521,2021-08-05 00:00:00,-0.0088268792710704,35.12,34.74,35.13,34.73,0.8461538461538461,0.002404218327496821,0.34322446355217107,-0.5120849272736244,1.3091330415226852
522,2021-08-06 00:00:00,-0.0011490950876184,34.81,35.12,35.13,34.57,1.0,-0.014405435380830944,0.4538469137241279,-0.8431449388604951,1.6478605801211215
523,2021-08-07 00:00:00,-0.0011490950876184,34.81,35.12,35.13,34.57,1.0,-0.062018645391103355,0.17161202441153023,-1.1045491537245111,0.14682837838685306
524,2021-08-08 00:00:00,-0.0011490950876184,34.81,35.12,35.13,34.57,1.0,-0.020689364831278034,0.07692335663544014,-0.9743418870741162,-0.22234649696912873
525,2021-08-09 00:00:00,0.0077653149266607,34.77,34.81,34.96,34.64,1.0,0.005414417499556734,0.041281172926952436,-0.5966351755986212,-0.5725483353390198
526,2021-08-10 00:00:00,0.0054223744292236,35.04,34.76,35.06,34.76,1.0,0.040646307812633786,0.031231340026995014,-0.2672430248001961,-0.4096913019222851
527,2021-08-11 00:00:00,-0.0059608288390574,35.23,35.04,35.23,34.94,0.9047619047619048,0.02641501325486484,0.09672417306100378,-0.43841479012178985,-0.07435820746179789
528,2021-08-12 00:00:00,0.0011422044545973,35.02,35.23,35.24,34.94,0.8571428571428571,0.019472367199321994,0.12024590949930314,-0.6528372408703875,0.06891509676367953
529,2021-08-13 00:00:00,0.0062749572162007,35.06,35.02,35.13,34.92,1.0,0.05722127261354171,0.0973361009058138,-0.36452442526727863,-0.10567152145486435
530,2021-08-14 00:00:00,0.0062749572162007,35.06,35.02,35.13,34.92,1.0,0.07512451933043351,1.5833876368524038,-0.1200995974784818,4.817627271454418
531,2021-08-15 00:00:00,0.0062749572162007,35.06,35.02,35.13,34.92,1.0,-0.032301522847851594,0.4816008034809789,-0.826556560278491,0.6417612132741464
532,2021-08-16 00:00:00,0.002267573696145,35.28,35.06,35.29,34.85,1.0,-0.04585131810069143,0.22083533906734676,-0.828695590824989,0.2596756343208324
533,2021-08-17 00:00:00,0.0,35.36,35.28,35.42,35.15,1.0,-0.019793169585434534,0.13047442091955208,-0.724121475735409,0.15663238878834498
534,2021-08-18 00:00:00,-0.021210407239819,35.36,35.36,35.42,35.23,1.0,0.25062471414993404,0.03284100140300339,1.5684712675721275,-0.3513118960374485
535,2021-08-19 00:00:00,0.0020225368390638,34.61,35.36,35.38,34.56,1.0,0.18372921863926894,0.026378463588803136,0.8365862278616286,-0.24487000317522647
536,2021-08-20 00:00:00,0.0201845444059977,34.68,34.61,34.79,34.49,1.0,-0.08058689220030768,-0.05578346999017203,-0.8776612924717002,-0.8744255453164022
537,2021-08-21 00:00:00,0.0201845444059977,34.68,34.61,34.79,34.49,1.0,0.0,0.0,0.0,0.0
538,2021-08-22 00:00:00,0.0201845444059977,34.68,34.61,34.79,34.49,1.0,0.0,0.0,0.0,0.0
539,2021-08-23 00:00:00,0.0124364047484453,35.38,34.69,35.41,34.67,1.0,0.0,0.0,0.0,0.0
540,2021-08-24 00:00:00,0.0108877721943048,35.82,35.38,35.89,35.37,1.0,0.0,0.0,0.0,0.0
541,2021-08-25 00:00:00,0.0027616680475007,36.21,35.82,36.26,35.81,1.0,0.0,0.0,0.0,0.0
542,2021-08-26 00:00:00,0.0030294684659873,36.31,36.22,36.33,36.08,1.0,0.0,0.0,0.0,0.0
543,2021-08-27 00:00:00,0.0134541460735858,36.42,36.3,36.42,36.16,1.0,0.0,0.0,0.0,0.0
544,2021-08-28 00:00:00,0.0134541460735858,36.42,36.3,36.42,36.16,1.0,0.0,0.0,0.0,0.0
545,2021-08-29 00:00:00,0.0134541460735858,36.42,36.3,36.42,36.16,1.0,0.0,0.0,0.0,0.0
546,2021-08-30 00:00:00,-0.0037930100243834,36.91,36.42,36.93,36.41,0.6666666666666666,0.0,0.0,0.0,0.0
547,2021-08-31 00:00:00,-0.0062550992657058,36.77,36.91,37.11,36.63,1.0,0.0,0.0,0.0,0.0
548,2021-09-01 00:00:00,0.0027367268746579,36.54,36.77,36.97,36.46,0.75,-0.00887982243723684,0.08518853233438595,-0.3743440034385538,-0.04091917615063151
549,2021-09-02 00:00:00,-0.0019104803493449,36.64,36.54,36.67,36.34,1.0,-0.05749284676744004,0.2948206390076642,-1.1161110957283822,0.9586337501398754
550,2021-09-03 00:00:00,0.0027344818156959,36.57,36.64,36.72,36.39,1.0,0.03997058753098415,0.18053271508922641,-0.463932970805948,0.12165538974020884
551,2021-09-04 00:00:00,0.0027344818156959,36.57,36.64,36.72,36.39,1.0,-0.006090848433433216,0.04208587055959434,-0.5868398798096415,-0.3833406728129579
552,2021-09-05 00:00:00,0.0027344818156959,36.57,36.64,36.72,36.39,1.0,0.012158485502712146,0.02018803643264988,-0.5200702278774578,-0.481381747067005
553,2021-09-06 00:00:00,-0.0079083719661848,36.67,36.57,36.77,36.36,1.0,0.04180492691470228,0.02052487690562188,-0.36143702602955374,-0.5127815126296036
554,2021-09-07 00:00:00,-0.0071467839472238,36.38,36.67,36.76,36.33,1.0,0.017997443325487694,0.024213084490485315,-0.5204798003324043,-0.4482286069771674
555,2021-09-08 00:00:00,-0.0005537098560353,36.12,36.38,36.39,35.8,0.75,0.20561919246691218,0.0784479785442036,0.4648142131535219,-0.3529752953315363
556,2021-09-09 00:00:00,0.0063711911357339,36.1,36.12,36.15,35.76,1.0,0.13339837343464733,0.17438189160009898,0.19901844588409542,0.18290693831521085
557,2021-09-10 00:00:00,0.0060556014313239,36.33,36.1,36.48,36.07,1.0,0.215876350797239,0.17488225194912577,0.3872783978557084,0.08260135481984654
558,2021-09-11 00:00:00,0.0060556014313239,36.33,36.1,36.48,36.07,1.0,0.04128078575054328,0.06384962948053907,-0.22350528035281683,0.025401607054964602
559,2021-09-12 00:00:00,0.0060556014313239,36.33,36.1,36.48,36.07,1.0,0.016257617102202637,0.0034262485973730605,-0.2728453593727919,-0.7234750203148116
560,2021-09-13 00:00:00,0.0019151846785225,36.55,36.33,36.65,36.33,1.0,0.026850981643123717,-0.0300470462555813,-0.18643010908610227,-0.6689640293104039
561,2021-09-14 00:00:00,0.0005461496450028,36.62,36.55,36.68,36.31,1.0,0.04370156649213719,-0.05386059301537571,-0.015856625319605588,-0.7858709483521885
562,2021-09-15 00:00:00,0.0051855895196505,36.64,36.62,36.64,36.39,1.0,0.03407504737983302,-0.05441078023860069,-0.18211952579681046,-0.9317950286545511
563,2021-09-16 00:00:00,0.0027151778441488,36.83,36.63,36.95,36.63,1.0,0.03200256034392268,-0.06088934810769686,-0.2110277755148826,-0.8888528401768
564,2021-09-17 00:00:00,-0.0300568643379366,36.93,36.83,37.03,36.62,1.0,0.0,0.0,0.0,0.0
565,2021-09-18 00:00:00,-0.0300568643379366,36.93,36.83,37.03,36.62,1.0,0.0,0.0,0.0,0.0
566,2021-09-19 00:00:00,-0.0300568643379366,36.93,36.83,37.03,36.62,1.0,0.0,0.0,0.0,0.0
567,2021-09-20 00:00:00,0.0002791736460077,35.82,36.93,36.95,35.69,1.0,0.0,0.0,0.0,0.0
568,2021-09-21 00:00:00,0.0036282444878594,35.83,35.82,36.03,35.61,1.0,0.0,0.0,0.0,0.0
569,2021-09-22 00:00:00,-0.0038932146829811,35.96,35.84,36.07,35.7,1.0,0.0,0.0,0.0,0.0
570,2021-09-23 00:00:00,-0.0142378559463986,35.82,35.96,36.25,35.69,1.0,0.0,0.0,0.0,0.0
571,2021-09-24 00:00:00,0.0067969413763804,35.31,35.84,35.84,34.99,1.0,0.0,0.0,0.0,0.0
572,2021-09-25 00:00:00,0.0067969413763804,35.31,35.84,35.84,34.99,1.0,0.0,0.0,0.0,0.0
573,2021-09-26 00:00:00,0.0067969413763804,35.31,35.84,35.84,34.99,1.0,0.0,0.0,0.0,0.0
574,2021-09-27 00:00:00,-0.0137834036568212,35.55,35.31,35.62,35.28,1.0,0.0,0.0,0.0,0.0
575,2021-09-28 00:00:00,0.0077010838562463,35.06,35.55,35.58,34.92,1.0,0.0,0.0,0.0,0.0
576,2021-09-29 00:00:00,0.004811774695726,35.33,35.05,35.36,34.87,1.0,0.0,0.0,0.0,0.0
577,2021-09-30 00:00:00,0.007887323943662,35.5,35.32,35.65,35.21,1.0,0.0,0.0,0.0,0.0
578,2021-10-01 00:00:00,-0.0111794298490776,35.78,35.5,35.82,35.07,1.0,0.0,0.0,0.0,0.0
579,2021-10-02 00:00:00,-0.0111794298490776,35.78,35.5,35.82,35.07,1.0,0.0,0.0,0.0,0.0
580,2021-10-03 00:00:00,-0.0111794298490776,35.78,35.5,35.82,35.07,1.0,0.0,0.0,0.0,0.0
581,2021-10-04 00:00:00,0.0141322781232334,35.38,35.77,35.99,35.32,1.0,0.0,0.0,0.0,0.0
582,2021-10-05 00:00:00,-0.0033444816053512,35.88,35.38,35.97,35.27,1.0,0.0,0.0,0.0,0.0
583,2021-10-06 00:00:00,0.0089485458612975,35.76,35.88,35.89,35.56,1.0,0.0,0.0,0.0,0.0
584,2021-10-07 00:00:00,-0.0002771618625276,36.08,35.76,36.36,35.75,1.0,0.0,0.0,0.0,0.0
585,2021-10-08 00:00:00,-0.0066537288605489,36.07,36.08,36.34,36.01,1.0,0.0,0.0,0.0,0.0
586,2021-10-09 00:00:00,-0.0066537288605489,36.07,36.08,36.34,36.01,1.0,0.0,0.0,0.0,0.0
587,2021-10-10 00:00:00,-0.0066537288605489,36.07,36.08,36.34,36.01,1.0,0.0,0.0,0.0,0.0
588,2021-10-11 00:00:00,0.0036282444878594,35.83,36.08,36.1,35.81,1.0,0.0,0.0,0.0,0.0
589,2021-10-12 00:00:00,-0.0130700778642936,35.96,35.83,36.03,35.62,1.0,0.0,0.0,0.0,0.0
590,2021-10-13 00:00:00,0.0014088475626936,35.49,35.96,36.09,35.44,1.0,0.0,0.0,0.0,0.0
591,2021-10-14 00:00:00,0.0081598199212155,35.54,35.49,35.76,35.48,1.0,0.0,0.0,0.0,0.0
592,2021-10-15 00:00:00,0.0011163829193413,35.83,35.54,35.91,35.52,1.0,0.0,0.0,0.0,0.0
593,2021-10-16 00:00:00,0.0011163829193413,35.83,35.54,35.91,35.52,1.0,0.0,0.0,0.0,0.0
594,2021-10-17 00:00:00,0.0011163829193413,35.83,35.54,35.91,35.52,1.0,0.0,0.0,0.0,0.0
595,2021-10-18 00:00:00,0.0105938109841093,35.87,35.83,36.03,35.64,0.0,0.0,0.0,0.0,0.0
596,2021-10-19 00:00:00,0.010206896551724,36.25,35.87,36.35,35.83,1.0,0.0,0.0,0.0,0.0
597,2021-10-20 00:00:00,-0.0054614964500271,36.62,36.26,36.64,36.23,1.0,0.2938227148009762,-0.008962710093884496,0.9116436558493861,-0.5296578287838932
598,2021-10-21 00:00:00,-0.00109829763866,36.42,36.62,36.65,36.35,1.0,0.05784997873792985,-0.06141320368241665,-0.016939151014722324,-0.7898462495008899
599,2021-10-22 00:00:00,-0.0019241341396371,36.38,36.42,36.63,36.33,1.0,0.24332776485398,-0.042345279784646195,1.8278505196574166,-0.5562883607952187
600,2021-10-23 00:00:00,-0.0019241341396371,36.38,36.42,36.63,36.33,1.0,0.15214279311435863,0.024532028817786156,0.8004912036661818,-0.25767242771091464
601,2021-10-24 00:00:00,-0.0019241341396371,36.38,36.42,36.63,36.33,1.0,0.22774169372662634,0.28179093641427233,1.1574683145992442,0.7748924228201175
602,2021-10-25 00:00:00,-0.0038556871385293,36.31,36.39,36.48,36.16,1.0,0.16965458376254805,0.45035168338763576,0.34635445390127556,0.739133668650574
603,2021-10-26 00:00:00,-0.0011058888581697,36.17,36.31,36.54,36.1,0.5,0.058738173904666624,0.9798788631170936,-0.22763580441806341,2.3522083556315274
604,2021-10-27 00:00:00,0.0022142264046498,36.13,36.17,36.38,36.1,1.0,0.04142745913981116,0.051973822658172075,-0.21614115719133828,-0.42633374297350585
605,2021-10-28 00:00:00,-0.0085611709472522,36.21,36.13,36.23,36.1,1.0,0.14438565878995302,0.09324864959294565,0.4225807107584889,-0.05379088025685743
606,2021-10-29 00:00:00,-0.0085611709472522,36.21,36.13,36.23,36.1,1.0,-0.0060898144090710815,0.023221268049142374,-0.5371833955658725,-0.40608378250604943
607,2021-10-30 00:00:00,-0.0085611709472522,36.21,36.13,36.23,36.1,1.0,0.06959712506809801,-0.06726950591629066,0.1748650092503315,-0.9921589072699264
608,2021-10-31 00:00:00,-0.0085611709472522,36.21,36.13,36.23,36.1,1.0,0.10200807004789691,-0.0851157132120628,0.1089889082035521,-0.9935451575240329
