,Date,Return,Price,Open,High,Low,Index,TE(XY),TE(YX),Z(XY),Z(YX)
0,2020-03-02 00:00:00,0.0297146605444407,457.35,457.35,457.35,457.35,0.5,,,,
1,2020-03-03 00:00:00,0.0017836667091348,470.94,470.94,470.94,470.94,1.0,,,,
2,2020-03-04 00:00:00,-0.0208147865530543,471.78,471.78,471.78,471.78,1.0,,,,
3,2020-03-05 00:00:00,-0.0444194302537015,461.96,461.96,461.96,461.96,1.0,,,,
4,2020-03-06 00:00:00,-0.0851984414642987,441.44,441.44,441.44,441.44,1.0,,,,
5,2020-03-07 00:00:00,-0.0851984414642987,441.44,441.44,441.44,441.44,1.0,,,,
6,2020-03-08 00:00:00,-0.0851984414642987,441.44,441.44,441.44,441.44,1.0,,,,
7,2020-03-09 00:00:00,0.0061411980288735,403.83,403.83,403.83,403.83,1.0,,,,
8,2020-03-10 00:00:00,-0.0372375772193645,406.31,406.31,406.31,406.31,1.0,,,,
9,2020-03-11 00:00:00,-0.0850759241270004,391.18,391.18,391.18,391.18,0.75,,,,
10,2020-03-12 00:00:00,0.037412685107572,357.9,357.9,357.9,357.9,0.6666666666666666,0.0,0.0,0.0,0.0
11,2020-03-13 00:00:00,-0.0494761507177677,371.29,371.29,371.29,371.29,1.0,0.1064664902556407,0.13960128784638925,0.21497640970156076,0.10115606059347873
12,2020-03-14 00:00:00,-0.0494761507177677,371.29,371.29,371.29,371.29,1.0,-0.0679838258505967,0.002817427603927669,-1.3017976135554983,-0.5964457559435312
13,2020-03-15 00:00:00,-0.0494761507177677,371.29,371.29,371.29,371.29,1.0,0.009550879290651793,-0.03955010151648075,-0.5993806691729279,-1.0086040344585276
14,2020-03-16 00:00:00,0.0136574861158335,352.92,352.92,352.92,352.92,1.0,0.05913661293475769,-0.02586544020640602,-0.3615847756084692,-0.8504959940381128
15,2020-03-17 00:00:00,-0.0102029406831778,357.74,357.74,357.74,357.74,1.0,-0.01587046042479745,0.04829148374950698,-0.9334429050451555,-0.3560560839655804
16,2020-03-18 00:00:00,0.0512016718913272,354.09,354.09,354.09,354.09,0.75,0.08068755667927885,0.2991963528883641,0.17206304682998674,0.8246687113114042
17,2020-03-19 00:00:00,-0.002068669066681,372.22,353.87,374.14,352.34,1.0,0.07764306935426823,0.16745082696205138,-0.20481690489200546,0.27785734902630277
18,2020-03-20 00:00:00,-0.0489971732400053,371.45,372.23,392.03,368.35,1.0,0.07647566807718231,0.07937847696141809,0.038595028628586964,0.24756619171496783
19,2020-03-21 00:00:00,-0.0489971732400053,371.45,372.23,392.03,368.35,1.0,0.0,0.0,0.0,0.0
20,2020-03-22 00:00:00,-0.0489971732400053,371.45,372.23,392.03,368.35,1.0,0.0,0.0,0.0,0.0
21,2020-03-23 00:00:00,0.0581174805378626,353.25,371.98,373.41,351.93,1.0,0.0,0.0,0.0,0.0
22,2020-03-24 00:00:00,0.0162662528760234,373.78,353.33,374.24,351.91,1.0,0.0,0.0,0.0,0.0
23,2020-03-25 00:00:00,0.0144790185857947,379.86,373.63,384.32,367.13,1.0,0.0,0.0,0.0,0.0
24,2020-03-26 00:00:00,-0.040040481627569,385.36,379.8,386.51,370.6,0.0,0.0,0.0,0.0,0.0
25,2020-03-27 00:00:00,0.0285189089827805,369.93,385.32,388.93,367.27,1.0,0.0,0.0,0.0,0.0
26,2020-03-28 00:00:00,0.0285189089827805,369.93,385.32,388.93,367.27,1.0,0.0,0.0,0.0,0.0
27,2020-03-29 00:00:00,0.0285189089827805,369.93,385.32,388.93,367.27,1.0,0.0,0.0,0.0,0.0
28,2020-03-30 00:00:00,0.0295153490328005,380.48,370.02,381.82,358.42,1.0,0.0,0.0,0.0,0.0
29,2020-03-31 00:00:00,0.0161854433126548,391.71,380.96,393.63,379.92,0.6666666666666666,0.0,0.0,0.0,0.0
30,2020-04-01 00:00:00,-0.0088933551061424,398.05,391.73,399.36,380.86,1.0,0.4491599896445333,0.4479319466726617,1.9831689139362023,2.594157482771693
31,2020-04-02 00:00:00,5.069579985293608e-05,394.51,398.07,405.56,390.13,1.0,1.0796276279110986,0.05655662718461718,8.561985162902882,-0.36746035593318566
32,2020-04-03 00:00:00,0.021747395635313,394.53,394.55,398.82,390.72,1.0,0.4699816811143842,-0.061276573656866784,4.217895378369074,-0.8857710387549109
33,2020-04-04 00:00:00,0.021747395635313,394.53,394.55,398.82,390.72,1.0,0.0,0.0,0.0,0.0
34,2020-04-05 00:00:00,0.021747395635313,394.53,394.55,398.82,390.72,1.0,0.0,0.0,0.0,0.0
35,2020-04-06 00:00:00,0.0160998238694153,403.11,394.61,404.11,393.21,1.0,0.0,0.0,0.0,0.0
36,2020-04-07 00:00:00,-0.013818359375,409.6,402.27,413.75,402.03,1.0,0.0,0.0,0.0,0.0
37,2020-04-08 00:00:00,0.0003465861266524,403.94,409.6,410.29,401.33,1.0,0.0,0.0,0.0,0.0
38,2020-04-09 00:00:00,-9.89902989506128e-05,404.08,403.93,404.78,403.06,0.0,0.0,0.0,0.0,0.0
39,2020-04-10 00:00:00,-0.0004702504702504,404.04,404.06,404.84,402.9,1.0,0.0,0.0,0.0,0.0
40,2020-04-11 00:00:00,-0.0004702504702504,404.04,404.06,404.84,402.9,1.0,0.0,0.0,0.0,0.0
41,2020-04-12 00:00:00,-0.0004702504702504,404.04,404.06,404.84,402.9,1.0,0.0,0.0,0.0,0.0
42,2020-04-13 00:00:00,0.0262473690726754,403.85,404.07,404.78,403.04,0.8333333333333334,0.0,0.0,0.0,0.0
43,2020-04-14 00:00:00,-0.0240318494390155,414.45,403.86,414.77,403.09,1.0,-0.07068179560181242,-0.042832649416248536,-0.5541889808784307,-0.5421252709825313
44,2020-04-15 00:00:00,-0.0148334940295186,404.49,414.45,414.84,402.48,1.0,-0.04806138675450633,-0.0022912146251128362,-0.45121594153376865,-0.2659212278115283
45,2020-04-16 00:00:00,0.0269768375617957,398.49,404.48,407.37,398.11,1.0,-0.12417870709792922,0.1641023862577642,-0.6117356080474339,-0.27275672642547394
46,2020-04-17 00:00:00,-0.0098963933144365,409.24,398.48,409.78,397.36,1.0,-0.10055510801874412,0.05246734194587166,-0.42423018482609254,-0.28939227432435893
47,2020-04-18 00:00:00,-0.0098963933144365,409.24,398.48,409.78,397.36,1.0,0.0,0.0,0.0,0.0
48,2020-04-19 00:00:00,-0.0098963933144365,409.24,398.48,409.78,397.36,1.0,0.0,0.0,0.0,0.0
49,2020-04-20 00:00:00,-0.021792245613169,405.19,409.2,410.86,398.41,1.0,0.0,0.0,0.0,0.0
50,2020-04-21 00:00:00,0.0169542839842566,396.36,405.2,405.8,393.13,1.0,0.0,0.0,0.0,0.0
51,2020-04-22 00:00:00,0.0138930237173762,403.08,400.99,404.06,390.19,1.0,0.0,0.0,0.0,0.0
52,2020-04-23 00:00:00,-0.0146324752862876,408.68,403.07,409.06,401.22,1.0,0.0,0.0,0.0,0.0
53,2020-04-24 00:00:00,0.006754407747703,402.7,408.7,409.53,401.25,1.0,0.0,0.0,0.0,0.0
54,2020-04-25 00:00:00,0.006754407747703,402.7,408.7,409.53,401.25,1.0,0.0,0.0,0.0,0.0
55,2020-04-26 00:00:00,0.006754407747703,402.7,408.7,409.53,401.25,1.0,0.0,0.0,0.0,0.0
56,2020-04-27 00:00:00,0.0211385723447289,405.42,402.7,407.15,402.06,1.0,0.0,0.0,0.0,0.0
57,2020-04-28 00:00:00,0.0203869658687407,413.99,405.2,415.01,404.1,1.0,0.0,0.0,0.0,0.0
58,2020-04-29 00:00:00,0.003953317709443,422.43,414.0,423.02,413.6,1.0,0.0,0.0,0.0,0.0
59,2020-04-30 00:00:00,-0.0008960150907804,424.1,422.49,426.32,418.06,0.8666666666666667,0.0,0.0,0.0,0.0
60,2020-05-01 00:00:00,-0.0337723024638912,423.72,424.05,428.73,418.98,1.0,0.0,0.0,0.0,0.0
61,2020-05-02 00:00:00,-0.0337723024638912,423.72,424.05,428.73,418.98,1.0,0.0,0.0,0.0,0.0
62,2020-05-03 00:00:00,-0.0337723024638912,423.72,424.05,428.73,418.98,1.0,0.0,0.0,0.0,0.0
63,2020-05-04 00:00:00,0.0097457316626363,409.41,423.76,424.23,408.94,1.0,0.0,0.0,0.0,0.0
64,2020-05-05 00:00:00,-0.0156748911465891,413.4,409.47,415.47,409.08,0.75,0.0,0.0,0.0,0.0
65,2020-05-06 00:00:00,0.0128280743143614,406.92,413.43,414.23,406.5,1.0,-0.05872244030684204,-0.03861681197451272,-0.9270519801962273,-0.8184630394385523
66,2020-05-07 00:00:00,0.0116465278788761,412.14,406.92,413.13,406.24,0.8,0.07164967141997813,0.12569588511663632,-0.18691260454858372,0.008328031245759445
67,2020-05-08 00:00:00,-0.0072912169616731,416.94,412.13,417.59,411.69,1.0,0.13347942963025705,0.4566262661904119,0.29563718225887653,0.9446447874525054
68,2020-05-09 00:00:00,-0.0072912169616731,416.94,412.13,417.59,411.69,1.0,-0.007028418410175874,0.7452369378589463,-0.6387318561406301,2.8004291420607768
69,2020-05-10 00:00:00,-0.0072912169616731,416.94,412.13,417.59,411.69,1.0,-0.025860374386464713,0.9135968246546993,-0.8352274609962543,2.8756442038661776
70,2020-05-11 00:00:00,0.0049528871708142,413.9,416.96,420.79,411.95,1.0,-0.003456396819318641,0.7704778176743092,-0.7378460220378809,4.056134294247038
71,2020-05-12 00:00:00,-0.0189926673879071,415.95,413.9,417.96,411.14,1.0,0.06156701222339578,0.8359145551354112,-0.30677165921618427,3.950358988146146
72,2020-05-13 00:00:00,-0.027594657517461,408.05,416.06,416.53,406.53,0.0,0.12647900840430815,0.7317951316383322,0.1683957606420131,2.921062269288063
73,2020-05-14 00:00:00,0.0175659668842459,396.79,408.03,408.34,396.16,0.0,0.04392168911148353,-0.06762471225912137,-0.2231279321261544,-1.1804774954285413
74,2020-05-15 00:00:00,0.0267485635030711,403.76,396.8,405.04,396.42,1.0,0.1754757896436212,-0.03452797244055006,0.11707066906030121,-0.5387300609376318
75,2020-05-16 00:00:00,0.0267485635030711,403.76,396.8,405.04,396.42,1.0,0.43938462965926206,0.2746143612069556,1.394245937482632,0.2633269600183797
76,2020-05-17 00:00:00,0.0267485635030711,403.76,396.8,405.04,396.42,1.0,0.11439329893107164,0.12179450809455084,0.16422575033603534,0.08431804961936902
77,2020-05-18 00:00:00,0.0108066383635662,414.56,403.08,414.94,403.08,1.0,0.09251208506739506,0.12045115752921376,-0.09359101909032826,-0.005860287930925889
78,2020-05-19 00:00:00,0.010905880106911,419.04,414.6,421.5,414.24,0.0,0.10715991105394629,0.21059910983025354,0.11681723209838099,0.3947833912949759
79,2020-05-20 00:00:00,-0.0001416397157763,423.61,419.01,423.83,415.99,0.9285714285714286,0.11722038688704473,0.6434180759378023,0.06623425595801752,4.166954382885529
80,2020-05-21 00:00:00,-0.0199031991500413,423.55,423.61,423.99,422.94,1.0,0.044566484834136944,0.2272508101819284,-0.45610916784065547,0.779884214524392
81,2020-05-22 00:00:00,0.0200905762189245,415.12,423.54,424.23,412.81,1.0,0.052349046094954055,0.008718395179363014,-0.08632714926477919,-0.5503646154379519
82,2020-05-23 00:00:00,0.0200905762189245,415.12,423.54,424.23,412.81,1.0,0.05184841688122077,-0.07535113466416465,0.026089043988844894,-1.009516495584377
83,2020-05-24 00:00:00,0.0200905762189245,415.12,423.54,424.23,412.81,1.0,0.1344518863119326,-0.0673742494464693,0.7537810189618467,-1.0093807768329714
84,2020-05-25 00:00:00,0.0144287536012846,423.46,415.21,423.64,414.94,0.0,0.19396297692701925,-0.07533573025054707,0.47630165331438834,-0.7881383200601436
85,2020-05-26 00:00:00,0.0026072584212119,429.57,423.46,429.95,423.21,1.0,-0.010197053663818956,-0.011465228045979714,-0.5159264164791629,-0.5520289637848359
86,2020-05-27 00:00:00,0.0002089670064314,430.69,429.55,433.41,427.79,1.0,0.060807310078592636,0.05091989423409515,0.031711129616116114,-0.17989430455573055
87,2020-05-28 00:00:00,-0.0117461349180554,430.78,430.73,432.58,429.33,0.0,0.1090591400901495,0.1650640196082378,0.4234109757411824,0.7165809040358128
88,2020-05-29 00:00:00,-0.0013858874377525,425.72,430.76,431.06,423.36,1.0,0.10234775757368642,0.08201368184949942,0.21446499392347687,0.2797392803610031
89,2020-05-30 00:00:00,-0.0013858874377525,425.72,430.76,431.06,423.36,1.0,-0.028499276770070026,0.057718330203355706,-1.148031498275207,-0.2907989369412507
90,2020-05-31 00:00:00,-0.0013858874377525,425.72,430.76,431.06,423.36,1.0,0.008891569334941174,0.048636332194739396,-0.5407239745349666,-0.29881303138461485
91,2020-06-01 00:00:00,0.0246748053536565,425.13,425.29,425.78,423.9,1.0,0.026369391773393147,0.04416164036712811,-0.3934543758854808,-0.49437890616664354
92,2020-06-02 00:00:00,0.0201781369083146,435.62,425.13,435.92,424.85,1.0,0.07947178620750428,0.06016628773791055,-0.11447376584164186,-0.22412460043708368
93,2020-06-03 00:00:00,-0.0004950383654733,444.41,436.16,445.66,435.17,1.0,0.0,0.0,0.0,0.0
94,2020-06-04 00:00:00,0.0224678628514825,444.19,444.43,444.95,438.91,1.0,0.0,0.0,0.0,0.0
95,2020-06-05 00:00:00,0.0075082017746658,454.17,444.15,455.01,443.66,1.0,0.0,0.0,0.0,0.0
96,2020-06-06 00:00:00,0.0075082017746658,454.17,444.15,455.01,443.66,1.0,0.0,0.0,0.0,0.0
97,2020-06-07 00:00:00,0.0075082017746658,454.17,444.15,455.01,443.66,1.0,0.0,0.0,0.0,0.0
98,2020-06-08 00:00:00,-0.0226845578915162,457.58,453.93,460.92,453.7,1.0,0.0,0.0,0.0,0.0
99,2020-06-09 00:00:00,-0.0018559928443649,447.2,457.55,458.72,446.84,1.0,0.0,0.0,0.0,0.0
100,2020-06-10 00:00:00,-0.0314537267289468,446.37,447.17,452.14,444.25,1.0,0.0,0.0,0.0,0.0
101,2020-06-11 00:00:00,0.008072537182245,432.33,446.5,446.88,431.93,0.75,0.0,0.0,0.0,0.0
102,2020-06-12 00:00:00,-0.0211784681749346,435.82,432.45,438.16,424.56,1.0,0.0,0.0,0.0,0.0
103,2020-06-13 00:00:00,-0.0211784681749346,435.82,432.45,438.16,424.56,1.0,0.0,0.0,0.0,0.0
104,2020-06-14 00:00:00,-0.0211784681749346,435.82,432.45,438.16,424.56,1.0,0.0,0.0,0.0,0.0
105,2020-06-15 00:00:00,0.0262781593567595,426.59,435.83,436.15,420.78,0.0,0.0,0.0,0.0,0.0
106,2020-06-16 00:00:00,-0.0072407492005482,437.8,426.55,438.65,426.16,1.0,-0.011447740654949357,0.21536105087561586,-0.5875024285453939,0.04213824146038033
107,2020-06-17 00:00:00,-0.0079147780871085,434.63,437.87,439.81,434.09,1.0,0.19966414369988783,0.06781945727938643,0.6617615148709219,-0.3403248257010099
108,2020-06-18 00:00:00,0.0023887381432779,431.19,434.63,435.75,430.5,1.0,0.09040637173838828,-0.05114291550110961,-0.20507658824275515,-0.7271050529145646
109,2020-06-19 00:00:00,-0.0116375919670538,432.22,431.19,436.35,430.6,1.0,0.06627897242867764,-0.14138422761452274,0.008062494558843837,-1.495177899196428
110,2020-06-20 00:00:00,-0.0116375919670538,432.22,431.19,436.35,430.6,1.0,0.0,0.0,0.0,0.0
111,2020-06-21 00:00:00,-0.0116375919670538,432.22,431.19,436.35,430.6,1.0,0.0,0.0,0.0,0.0
112,2020-06-22 00:00:00,0.0080292141669983,427.19,432.22,432.64,426.8,1.0,0.0,0.0,0.0,0.0
113,2020-06-23 00:00:00,-0.0132135061074729,430.62,427.24,434.77,426.85,1.0,0.0,0.0,0.0,0.0
114,2020-06-24 00:00:00,-0.0036241263266891,424.93,430.66,431.81,424.48,0.0,0.0,0.0,0.0,0.0
115,2020-06-25 00:00:00,-0.007321854554902,423.39,424.93,425.29,416.92,1.0,0.0,0.0,0.0,0.0
116,2020-06-26 00:00:00,0.0071855147636155,420.29,423.38,426.63,419.62,1.0,0.0,0.0,0.0,0.0
117,2020-06-27 00:00:00,0.0071855147636155,420.29,423.38,426.63,419.62,1.0,0.0,0.0,0.0,0.0
118,2020-06-28 00:00:00,0.0071855147636155,420.29,423.38,426.63,419.62,1.0,0.0,0.0,0.0,0.0
119,2020-06-29 00:00:00,-0.0071578748434953,423.31,420.3,423.89,417.78,1.0,0.0,0.0,0.0,0.0
120,2020-06-30 00:00:00,0.0107547349386124,420.28,423.3,424.44,419.0,1.0,0.0,0.0,0.0,0.0
121,2020-07-01 00:00:00,0.0026365348399246,424.8,419.17,425.32,419.17,1.0,0.0,0.0,0.0,0.0
122,2020-07-02 00:00:00,-0.0090627347858753,425.92,424.8,427.58,422.64,1.0,0.0,0.0,0.0,0.0
123,2020-07-03 00:00:00,0.0098090318912002,422.06,425.93,426.58,421.55,1.0,0.0,0.0,0.0,0.0
124,2020-07-04 00:00:00,0.0098090318912002,422.06,425.93,426.58,421.55,1.0,0.0,0.0,0.0,0.0
125,2020-07-05 00:00:00,0.0098090318912002,422.06,425.93,426.58,421.55,1.0,0.0,0.0,0.0,0.0
126,2020-07-06 00:00:00,-0.0022055373064289,426.2,422.1,427.93,421.87,0.0,0.0,0.0,0.0,0.0
127,2020-07-07 00:00:00,0.000658420730847,425.26,426.23,426.76,421.94,1.0,0.0,0.0,0.0,0.0
128,2020-07-08 00:00:00,-0.0142172298726324,425.54,425.13,426.03,422.3,0.8571428571428571,0.0,0.0,0.0,0.0
129,2020-07-09 00:00:00,0.0027891010512765,419.49,425.58,426.32,419.01,1.0,-0.10994318890367616,-0.08602390160277285,-0.8459173725382781,-0.9900706032762397
130,2020-07-10 00:00:00,0.0247943707507249,420.66,419.55,421.66,415.03,1.0,-0.017437621873417797,-0.028690779379819453,-0.6711704059381695,-0.744469659202853
131,2020-07-11 00:00:00,0.0247943707507249,420.66,419.55,421.66,415.03,1.0,-0.022326804275972556,-0.09960160581716382,-0.4151080537366567,-1.157086797577511
132,2020-07-12 00:00:00,0.0247943707507249,420.66,419.55,421.66,415.03,1.0,-0.05494909386653912,-0.05614914660577908,-0.629641603952272,-0.7312380210981634
133,2020-07-13 00:00:00,0.0079333781808903,431.09,420.68,431.89,420.41,1.0,-0.05750150092341055,-0.048394462363229085,-0.6916020760052344,-1.0703783145294943
134,2020-07-14 00:00:00,0.0223930404363536,434.51,431.11,434.96,429.36,0.0,-0.0849838414804358,-0.04025171434860697,-1.0545370465495976,-0.9811085507665951
135,2020-07-15 00:00:00,-0.0066180443003781,444.24,434.62,444.48,433.93,0.0,-0.05907966868599246,0.726701833627323,-1.0954326849608549,5.464444957660336
136,2020-07-16 00:00:00,0.0094720145026059,441.3,444.16,444.74,439.7,1.0,-0.08680407050642458,0.5629639973990201,-1.0773635531787904,4.060106439741925
137,2020-07-17 00:00:00,0.0064873843943611,445.48,441.33,446.23,441.0,1.0,-0.03138476053895367,0.2061529417808332,-0.6483325131721117,0.14493670450176416
138,2020-07-18 00:00:00,0.0064873843943611,445.48,441.33,446.23,441.0,1.0,-0.02975833527579841,0.015265515288776399,-0.8647290005512099,-0.41184141378143024
139,2020-07-19 00:00:00,0.0064873843943611,445.48,441.33,446.23,441.0,1.0,-0.009916003655785488,-0.04567499793912688,-0.6069137880545774,-0.539287934966429
140,2020-07-20 00:00:00,0.0121105337109976,448.37,445.95,449.32,444.12,1.0,0.01960615905865737,-0.03785187177994054,-0.29344899431372407,-0.6473872084589511
141,2020-07-21 00:00:00,-0.0070295284266196,453.8,448.31,459.23,447.98,1.0,0.09417048325611344,0.08780591360114975,-0.15659859924802252,0.06716607117671024
142,2020-07-22 00:00:00,-0.0059918776769268,450.61,453.78,456.24,447.07,1.0,0.09540215108111028,0.8215408016392285,0.0807265032687101,4.379643452410391
143,2020-07-23 00:00:00,-0.0007144292380166,447.91,450.66,452.78,447.6,0.0,0.0,0.0,0.0,0.0
144,2020-07-24 00:00:00,-0.0035523581849459,447.59,447.98,448.56,441.77,1.0,0.0,0.0,0.0,0.0
145,2020-07-25 00:00:00,-0.0035523581849459,447.59,447.98,448.56,441.77,1.0,0.0,0.0,0.0,0.0
146,2020-07-26 00:00:00,-0.0035523581849459,447.59,447.98,448.56,441.77,1.0,0.0,0.0,0.0,0.0
147,2020-07-27 00:00:00,-2.242152466365674e-05,446.0,447.58,449.74,443.76,0.0,0.0,0.0,0.0,0.0
148,2020-07-28 00:00:00,0.0026457992331666,445.99,446.06,447.42,444.61,0.5,-0.0655305108192481,-0.011072394946296527,-1.1331096194618338,-0.8197184363869865
149,2020-07-29 00:00:00,-0.0259632801842699,447.17,446.1,447.56,443.55,1.0,-0.03916929186440843,0.05751257675158161,-0.8378204840961773,-0.39831886868760613
150,2020-07-30 00:00:00,0.0059922857930021,435.56,447.23,447.46,434.17,1.0,0.020491032806288167,0.018763677338490048,-0.5753619767366127,-0.5083638128019986
151,2020-07-31 00:00:00,0.0201748179930163,438.17,435.57,442.79,435.26,1.0,0.07831737508285386,0.0010168595840260863,-0.08791725035547966,-0.49206030996725264
152,2020-08-01 00:00:00,0.0201748179930163,438.17,435.57,442.79,435.26,1.0,0.007284401687982722,-0.02613616615681824,-0.33055606294281775,-0.74885995838137
153,2020-08-02 00:00:00,0.0201748179930163,438.17,435.57,442.79,435.26,1.0,-0.010194379266507347,0.04235150153654921,-0.6527278913830957,-0.25171280014171604
154,2020-08-03 00:00:00,0.0084785575266773,447.01,438.17,447.31,437.28,1.0,0.009689816474164559,0.10529107790755887,-0.6059303098281286,-0.16486911024272963
155,2020-08-04 00:00:00,0.0100931677018633,450.8,447.02,451.01,445.97,1.0,0.05940605924669029,0.2088697439441205,-0.2218292268786413,0.4992958249307093
156,2020-08-05 00:00:00,0.0010102119248928,455.35,450.8,455.86,450.51,1.0,0.0,0.0,0.0,0.0
157,2020-08-06 00:00:00,0.0002413286237687,455.81,455.26,456.77,451.85,1.0,0.0,0.0,0.0,0.0
158,2020-08-07 00:00:00,0.0028952447797859,455.92,455.76,457.32,452.35,1.0,0.0,0.0,0.0,0.0
159,2020-08-08 00:00:00,0.0028952447797859,455.92,455.76,457.32,452.35,1.0,0.0,0.0,0.0,0.0
160,2020-08-09 00:00:00,0.0028952447797859,455.92,455.76,457.32,452.35,1.0,0.0,0.0,0.0,0.0
161,2020-08-10 00:00:00,0.0173213192196658,457.24,455.95,459.11,454.04,0.0,0.0,0.0,0.0,0.0
162,2020-08-11 00:00:00,0.0070513371743055,465.16,457.27,467.43,456.86,0.0,0.0,0.0,0.0,0.0
163,2020-08-12 00:00:00,-0.0002348219622577,468.44,465.16,468.59,463.77,1.0,1.3136483791649463,-0.06655716908587817,8.591555241296666,-0.5907975066782875
164,2020-08-13 00:00:00,-0.0093737321973821,468.33,468.41,469.71,466.06,1.0,1.834999762996409,0.08116965470094417,4.72982372389235,-0.1964887999265206
165,2020-08-14 00:00:00,0.000668189852136,463.94,468.35,468.7,459.56,1.0,1.1082843320051854,0.053689195647200094,4.145570380048126,-0.2061890374188265
166,2020-08-15 00:00:00,0.000668189852136,463.94,468.35,468.7,459.56,1.0,1.0340982039151996,0.016081935222869603,6.778615656696848,-0.3467922616209648
167,2020-08-16 00:00:00,0.000668189852136,463.94,468.35,468.7,459.56,1.0,0.9016424677407118,0.07434798024069167,5.63013377401701,-0.061067521682812036
168,2020-08-17 00:00:00,-0.007108239095315,464.25,463.91,465.76,462.49,1.0,0.8718217799001113,0.19590015887003354,4.051421462755563,0.0807633122897631
169,2020-08-18 00:00:00,0.0017789348085475,460.95,464.21,464.71,460.19,1.0,0.8483477761430915,0.6532074524027802,4.4701106320009565,3.585729751243913
170,2020-08-19 00:00:00,-0.0082292050154838,461.77,461.06,462.73,458.96,1.0,0.0,0.0,0.0,0.0
171,2020-08-20 00:00:00,-0.0022272201235889,457.97,461.8,462.32,457.74,1.0,0.0,0.0,0.0,0.0
172,2020-08-21 00:00:00,0.018842324105482,456.95,458.11,460.06,454.4,1.0,0.0,0.0,0.0,0.0
173,2020-08-22 00:00:00,0.018842324105482,456.95,458.11,460.06,454.4,1.0,0.0,0.0,0.0,0.0
174,2020-08-23 00:00:00,0.018842324105482,456.95,458.11,460.06,454.4,1.0,0.0,0.0,0.0,0.0
175,2020-08-24 00:00:00,-0.0028138156198986,465.56,456.94,465.68,456.48,0.0,0.0,0.0,0.0,0.0
176,2020-08-25 00:00:00,-0.005751211631664,464.25,465.56,469.39,463.72,1.0,0.0,0.0,0.0,0.0
177,2020-08-26 00:00:00,-0.0020364833831621,461.58,464.26,464.66,459.57,1.0,0.0,0.0,0.0,0.0
178,2020-08-27 00:00:00,-0.0051233067037165,460.64,461.52,462.85,459.0,1.0,0.0,0.0,0.0,0.0
179,2020-08-28 00:00:00,-0.005913415379244,458.28,460.56,461.71,456.17,1.0,0.0,0.0,0.0,0.0
180,2020-08-29 00:00:00,-0.005913415379244,458.28,460.56,461.71,456.17,1.0,0.0,0.0,0.0,0.0
181,2020-08-30 00:00:00,-0.005913415379244,458.28,460.56,461.71,456.17,1.0,0.0,0.0,0.0,0.0
182,2020-08-31 00:00:00,0.0010755756524793,455.57,458.3,461.77,454.88,1.0,0.0,0.0,0.0,0.0
183,2020-09-01 00:00:00,-0.0084199447441125,456.06,455.63,457.81,453.1,0.0,0.0,0.0,0.0,0.0
184,2020-09-02 00:00:00,-0.0012383353235151,452.22,456.12,457.61,451.07,1.0,0.0,0.0,0.0,0.0
185,2020-09-03 00:00:00,-0.0080591595447904,451.66,452.22,454.99,450.95,0.0,0.0,0.0,0.0,0.0
186,2020-09-04 00:00:00,0.0077228695147538,448.02,451.66,452.24,444.18,1.0,0.4385329675963181,0.626508710205691,1.401772862616231,1.8973551472367145
187,2020-09-05 00:00:00,0.0077228695147538,448.02,451.66,452.24,444.18,1.0,0.5144035724045688,0.5189854372259664,3.7800412271917505,2.479496534192211
188,2020-09-06 00:00:00,0.0077228695147538,448.02,451.66,452.24,444.18,1.0,0.9374536481328848,0.017008802305360504,7.3130026582595296,-0.3946044684948463
189,2020-09-07 00:00:00,-0.014972977762027,451.48,448.03,451.67,447.13,0.0,1.021627892492683,-0.0006575797544172701,10.307290559113513,-0.45312164794348064
190,2020-09-08 00:00:00,0.0204847994243568,444.72,451.46,453.02,443.01,1.0,0.5549878778285429,0.037159072332654475,2.6060490139351007,-0.3878349005812091
191,2020-09-09 00:00:00,-0.0030407861974748,453.83,444.74,454.03,443.58,0.0,0.7155389391139959,0.09484633398113118,5.045144654483364,-0.14354948436266673
192,2020-09-10 00:00:00,0.0052160459719306,452.45,453.84,455.58,451.17,0.5,0.1124648833690447,-0.04790570566922625,0.02686812339757781,-0.7904823897284144
193,2020-09-11 00:00:00,-0.003298080517139,454.81,452.49,455.29,450.47,1.0,0.05122580385039033,0.04313919455935,-0.5549569709143155,-0.39310368475815055
194,2020-09-12 00:00:00,-0.003298080517139,454.81,452.49,455.29,450.47,1.0,0.16765994447120125,0.027327716362494314,0.15160054236346115,-0.6865386701996161
195,2020-09-13 00:00:00,-0.003298080517139,454.81,452.49,455.29,450.47,1.0,0.0927046733547785,0.025191990279076926,-0.19342596090318634,-0.5404564545409988
196,2020-09-14 00:00:00,0.0102137610024045,453.31,454.81,458.2,453.11,1.0,0.08231415026372435,0.0716773810817779,-0.05069843481817099,-0.14272444851343233
197,2020-09-15 00:00:00,0.0022492029523519,457.94,453.38,459.15,452.81,1.0,0.08652206817793129,0.3616672951200508,-0.1919116141189099,2.039347155280297
198,2020-09-16 00:00:00,-0.0007625770747543,458.97,457.94,461.05,457.31,1.0,0.19099193738601805,0.2732119350688835,0.12655762683611557,0.5751557715590604
199,2020-09-17 00:00:00,0.0022894771270332,458.62,458.97,459.41,454.69,1.0,0.20748062538510048,0.46973935069828165,0.651927207853795,1.6343794069810949
200,2020-09-18 00:00:00,-0.0339373898666435,459.67,458.61,460.92,455.92,1.0,0.0,0.0,0.0,0.0
201,2020-09-19 00:00:00,-0.0339373898666435,459.67,458.61,460.92,455.92,1.0,0.0,0.0,0.0,0.0
202,2020-09-20 00:00:00,-0.0339373898666435,459.67,458.61,460.92,455.92,1.0,0.0,0.0,0.0,0.0
203,2020-09-21 00:00:00,0.0093904114216227,444.07,459.65,459.98,443.83,0.75,0.0,0.0,0.0,0.0
204,2020-09-22 00:00:00,0.002342495091915,448.24,444.09,450.85,443.65,1.0,0.0,0.0,0.0,0.0
205,2020-09-23 00:00:00,-0.0074562086848138,449.29,448.23,453.4,447.64,1.0,0.0,0.0,0.0,0.0
206,2020-09-24 00:00:00,-0.0016369915235233,445.94,449.35,450.28,442.73,1.0,0.0,0.0,0.0,0.0
207,2020-09-25 00:00:00,0.0141955481682801,445.21,445.94,450.11,444.02,1.0,0.0,0.0,0.0,0.0
208,2020-09-26 00:00:00,0.0141955481682801,445.21,445.94,450.11,444.02,1.0,0.0,0.0,0.0,0.0
209,2020-09-27 00:00:00,0.0141955481682801,445.21,445.94,450.11,444.02,1.0,0.0,0.0,0.0,0.0
210,2020-09-28 00:00:00,-0.0017717538148073,451.53,445.23,451.8,444.99,0.0,0.0,0.0,0.0,0.0
211,2020-09-29 00:00:00,0.0044372462449803,450.73,451.55,452.15,448.92,1.0,-0.0846657020402084,-0.058563932041141076,-1.0873700982361607,-0.6726421209445644
212,2020-09-30 00:00:00,-0.00614052525788,452.73,450.68,453.33,447.43,0.75,0.0,0.0,0.0,0.0
213,2020-10-01 00:00:00,6.66740748972765e-05,449.95,452.69,454.07,449.6,1.0,-0.09359261113263795,-0.00743357412624146,-1.1951397552872167,-0.5468103893264138
214,2020-10-02 00:00:00,0.0178230143561935,449.98,449.99,450.85,445.16,1.0,-0.09235962598352998,-0.047365976800100906,-0.9891294289511141,-0.776108228272833
215,2020-10-03 00:00:00,0.0178230143561935,449.98,449.99,450.85,445.16,1.0,-0.08953934355925242,-0.04743511361649544,-0.6209150496262775,-0.7260046099783009
216,2020-10-04 00:00:00,0.0178230143561935,449.98,449.99,450.85,445.16,1.0,-0.08411957750078347,-0.01393071327826112,-0.9445937438258196,-0.5698668875776021
217,2020-10-05 00:00:00,0.0102620087336244,458.0,449.67,458.23,449.26,1.0,-0.08081658035348838,0.06201642210854219,-0.7134308465195408,-0.21891015088544585
218,2020-10-06 00:00:00,-0.0058785390101577,462.7,457.98,463.5,457.65,1.0,-0.033366982502818665,0.4468489374909077,-0.6418388634381907,0.5017355015784611
219,2020-10-07 00:00:00,0.0017392060524369,459.98,462.77,463.96,459.61,1.0,0.0,0.0,0.0,0.0
220,2020-10-08 00:00:00,-0.0024089587221666,460.78,458.99,461.82,458.99,1.0,0.0,0.0,0.0,0.0
221,2020-10-09 00:00:00,-0.0010877368547001,459.67,460.71,462.69,459.1,1.0,0.0,0.0,0.0,0.0
222,2020-10-10 00:00:00,-0.0010877368547001,459.67,460.71,462.69,459.1,1.0,0.0,0.0,0.0,0.0
223,2020-10-11 00:00:00,-0.0010877368547001,459.67,460.71,462.69,459.1,1.0,0.0,0.0,0.0,0.0
224,2020-10-12 00:00:00,-0.0011324781671277,459.17,459.7,461.8,458.99,1.0,0.0,0.0,0.0,0.0
225,2020-10-13 00:00:00,0.0037065300337949,458.65,459.11,461.04,457.56,1.0,0.0,0.0,0.0,0.0
226,2020-10-14 00:00:00,-0.0149885956337569,460.35,458.71,461.65,457.58,1.0,0.0,0.0,0.0,0.0
227,2020-10-15 00:00:00,0.0074098577571948,453.45,460.34,461.06,452.54,1.0,0.0,0.0,0.0,0.0
228,2020-10-16 00:00:00,0.0031522952649898,456.81,453.32,461.01,450.1,1.0,0.0,0.0,0.0,0.0
229,2020-10-17 00:00:00,0.0031522952649898,456.81,453.32,461.01,450.1,1.0,0.0,0.0,0.0,0.0
230,2020-10-18 00:00:00,0.0031522952649898,456.81,453.32,461.01,450.1,1.0,0.0,0.0,0.0,0.0
231,2020-10-19 00:00:00,-0.0058265139116203,458.25,456.84,459.93,456.27,1.0,0.0,0.0,0.0,0.0
232,2020-10-20 00:00:00,-0.0081873655559944,455.58,458.29,460.95,454.57,0.0,0.0,0.0,0.0,0.0
233,2020-10-21 00:00:00,-0.0101139758769504,451.85,455.59,458.74,449.88,1.0,0.0,0.0,0.0,0.0
234,2020-10-22 00:00:00,0.0139957073868718,447.28,451.91,452.25,446.45,1.0,0.0,0.0,0.0,0.0
235,2020-10-23 00:00:00,-0.0295453543237642,453.54,447.27,455.17,446.92,1.0,0.0,0.0,0.0,0.0
236,2020-10-24 00:00:00,-0.0295453543237642,453.54,447.27,455.17,446.92,1.0,0.0,0.0,0.0,0.0
237,2020-10-25 00:00:00,-0.0295453543237642,453.54,447.27,455.17,446.92,1.0,0.0,0.0,0.0,0.0
238,2020-10-26 00:00:00,-0.0112009815058845,440.14,453.54,454.54,439.92,0.6666666666666666,0.0,0.0,0.0,0.0
239,2020-10-27 00:00:00,-0.0274809861905746,435.21,440.12,441.71,434.92,1.0,-0.08352894223990681,0.36039197369200604,-0.7932866644100822,0.5285092522462839
240,2020-10-28 00:00:00,0.0124276432368576,423.25,435.23,435.5,422.99,0.0,-0.019957473538852355,0.22707486044550462,-0.47632535227075434,0.10062135068625443
241,2020-10-29 00:00:00,-0.0019602809736061,428.51,423.16,429.63,421.24,1.0,-0.00986264584541452,0.07027724680154135,-0.5048019544556769,-0.38607472660791253
242,2020-10-30 00:00:00,0.0162508476161526,427.67,428.51,429.33,424.8,1.0,0.18982171480099996,0.649589817792823,0.7495628541324236,2.7638119448219203
243,2020-10-31 00:00:00,0.0162508476161526,427.67,428.51,429.33,424.8,1.0,0.02752574295130117,0.12508283934580566,-0.29752139656359217,0.003811500619997393
244,2020-11-01 00:00:00,0.0162508476161526,427.67,428.51,429.33,424.8,1.0,0.044435568878189,0.013387314587660182,-0.3666968331162348,-0.39039478799046584
245,2020-11-02 00:00:00,0.0064194008559201,434.62,427.72,434.94,426.65,1.0,0.02055805658092691,-0.04723934872675484,-0.2822047590278899,-0.7872918205556195
246,2020-11-03 00:00:00,0.0120253309252188,437.41,433.68,440.27,433.68,1.0,0.039790955223142355,-0.07304676086501738,-0.40737145874591923,-0.8503781709429092
247,2020-11-04 00:00:00,0.003117446404771,442.67,437.41,443.34,432.35,0.0,0.0,0.0,0.0,0.0
248,2020-11-05 00:00:00,-0.0010809593514244,444.05,442.7,445.2,440.34,1.0,-0.041810346379340224,0.5016663917523072,-0.6486649165281776,1.3493907275120862
249,2020-11-06 00:00:00,0.0483576436639087,443.57,445.63,445.63,440.7,1.0,0.0,0.0,0.0,0.0
250,2020-11-07 00:00:00,0.0483576436639087,443.57,445.63,445.63,440.7,1.0,0.0,0.0,0.0,0.0
251,2020-11-08 00:00:00,0.0483576436639087,443.57,445.63,445.63,440.7,1.0,0.0,0.0,0.0,0.0
252,2020-11-09 00:00:00,-0.0039998279643885,465.02,441.69,465.56,441.17,1.0,0.0,0.0,0.0,0.0
253,2020-11-10 00:00:00,0.0133215303566801,463.16,465.65,465.65,458.8,0.0,0.0,0.0,0.0,0.0
254,2020-11-11 00:00:00,-0.0029403617923422,469.33,463.14,470.3,462.78,1.0,-0.09477785167549069,0.08510957212807657,-0.5570144260740815,-0.18985997452845432
255,2020-11-12 00:00:00,0.0023934181002243,467.95,468.93,470.06,464.49,1.0,0.00280297387235251,0.08170586732625562,-0.3128207242573692,-0.14936938821744417
256,2020-11-13 00:00:00,0.0199543778114141,469.07,467.85,470.28,464.84,1.0,0.0,0.0,0.0,0.0
257,2020-11-14 00:00:00,0.0199543778114141,469.07,467.85,470.28,464.84,1.0,0.0,0.0,0.0,0.0
258,2020-11-15 00:00:00,0.0199543778114141,469.07,467.85,470.28,464.84,1.0,0.0,0.0,0.0,0.0
259,2020-11-16 00:00:00,-0.0029262379031415,478.43,469.07,480.5,467.85,1.0,0.0,0.0,0.0,0.0
260,2020-11-17 00:00:00,0.0029977150284049,477.03,478.38,479.38,475.72,0.5,0.0,0.0,0.0,0.0
261,2020-11-18 00:00:00,-0.013418049575722,478.46,477.03,479.24,475.37,1.0,0.06424462524557573,0.05438308590129992,-0.19145160454677135,-0.10411843762771641
262,2020-11-19 00:00:00,0.0045546987543428,472.04,478.51,478.99,471.05,1.0,0.0,0.0,0.0,0.0
263,2020-11-20 00:00:00,0.0109028026740336,474.19,470.88,476.77,470.87,1.0,0.0,0.0,0.0,0.0
264,2020-11-21 00:00:00,0.0109028026740336,474.19,470.88,476.77,470.87,1.0,0.0,0.0,0.0,0.0
265,2020-11-22 00:00:00,0.0109028026740336,474.19,470.88,476.77,470.87,1.0,0.0,0.0,0.0,0.0
266,2020-11-23 00:00:00,0.0226343457943924,479.36,474.19,481.19,473.78,0.0,0.0,0.0,0.0,0.0
267,2020-11-24 00:00:00,-0.0010607698741355,490.21,479.46,490.58,478.91,0.0,0.13655924708769263,0.0992591245880341,-0.04056845231753146,-0.14606663162168732
268,2020-11-25 00:00:00,0.0001225264963548,489.69,490.18,492.4,486.28,0.0,0.31678626755095074,-0.014453259390823092,1.26618388742218,-0.6709286116792361
269,2020-11-26 00:00:00,0.0084941296579888,489.75,489.69,490.8,488.09,1.0,0.5271947943041262,-0.08942468146801641,4.474450839975305,-0.724179292693601
270,2020-11-27 00:00:00,-0.0190318074143063,493.91,490.04,494.28,487.76,0.0,0.9595425217394844,0.01553707562696971,3.7386556525382693,-0.5033314978373513
271,2020-11-28 00:00:00,-0.0190318074143063,493.91,490.04,494.28,487.76,0.0,0.0,0.0,0.0,0.0
272,2020-11-29 00:00:00,-0.0190318074143063,493.91,490.04,494.28,487.76,0.0,0.12157502203901505,0.030663355389534352,0.21064624805237353,-0.4278515418248066
273,2020-11-30 00:00:00,0.0043549152752265,484.51,493.89,494.73,484.24,0.0,0.11794244176481428,-0.003773892789779687,-0.02436036342526077,-0.4604487184435658
274,2020-12-01 00:00:00,-0.0056101269984793,486.62,486.0,490.26,481.89,1.0,0.0,0.0,0.0,0.0
275,2020-12-02 00:00:00,-0.0010952902519167,483.89,486.64,487.03,481.45,1.0,0.1175507770269082,0.009868978938397888,0.03354140134734065,-0.5206657780091982
276,2020-12-03 00:00:00,0.008006454816286,483.36,483.89,486.76,482.07,1.0,0.04357834902806612,0.33935038394324746,-0.5033798939937366,1.2263293019265031
277,2020-12-04 00:00:00,-0.0048847566857541,487.23,483.44,487.47,482.97,1.0,0.0,0.0,0.0,0.0
278,2020-12-05 00:00:00,-0.0048847566857541,487.23,483.44,487.47,482.97,1.0,0.0,0.0,0.0,0.0
279,2020-12-06 00:00:00,-0.0048847566857541,487.23,483.44,487.47,482.97,1.0,-0.091012273049496,0.7521735254979838,-0.9278232548783094,5.258448812870966
280,2020-12-07 00:00:00,0.0006599979375064,484.85,487.23,488.46,483.79,1.0,-0.10710160385932355,0.5974356944493113,-1.118848229565692,2.8875118011665264
281,2020-12-08 00:00:00,0.009254488117567,485.17,484.92,486.89,483.64,1.0,0.0,0.0,0.0,0.0
282,2020-12-09 00:00:00,-0.0002859126741004,489.66,485.16,490.14,484.52,1.0,0.0,0.0,0.0,0.0
283,2020-12-10 00:00:00,-0.0076197091027944,489.52,489.72,491.11,485.96,1.0,0.0,0.0,0.0,0.0
284,2020-12-11 00:00:00,-0.000761645978715,485.79,489.52,489.92,483.87,1.0,0.0,0.0,0.0,0.0
285,2020-12-12 00:00:00,-0.000761645978715,485.79,489.52,489.92,483.87,1.0,0.0,0.0,0.0,0.0
286,2020-12-13 00:00:00,-0.000761645978715,485.79,489.52,489.92,483.87,1.0,0.0,0.0,0.0,0.0
287,2020-12-14 00:00:00,0.0007004243747681,485.42,485.95,490.6,483.96,0.0,0.0,0.0,0.0,0.0
288,2020-12-15 00:00:00,0.004014328063241,485.76,484.84,487.6,482.57,1.0,0.0,0.0,0.0,0.0
289,2020-12-16 00:00:00,0.001681327018105,487.71,484.88,488.69,484.77,0.2,0.0,0.0,0.0,0.0
290,2020-12-17 00:00:00,0.0086176898041062,488.53,486.54,491.6,486.54,1.0,-0.030765468159593468,0.14991171373073975,-0.5136221804100723,0.199010814049066
291,2020-12-18 00:00:00,-0.024028899622519,492.74,488.14,493.48,487.4,1.0,-0.009007620089054313,0.24222517419779876,-0.607129650078855,0.44623320950705614
292,2020-12-19 00:00:00,-0.024028899622519,492.74,488.14,493.48,487.4,1.0,-0.06935301598651744,0.2439659321840466,-0.9536383491847821,0.06622116403828406
293,2020-12-20 00:00:00,-0.024028899622519,492.74,488.14,493.48,487.4,1.0,-0.04760967315422082,0.2853785133092046,-0.9821365952883263,0.6950593253880808
294,2020-12-21 00:00:00,0.0085672697026408,480.9,494.76,494.76,478.36,1.0,-0.037870265149568816,0.48901496952063184,-0.7698260399565643,1.3861895025347202
295,2020-12-22 00:00:00,0.0161642818852831,485.02,480.86,486.27,480.43,0.6666666666666666,-0.09474023172315515,1.0348784089762653,-1.3592530230696869,4.144031819021193
296,2020-12-23 00:00:00,0.0,492.86,485.02,493.84,484.22,1.0,-0.061598869120377486,0.24895475348098373,-0.7422373853007465,0.902108684940032
297,2020-12-24 00:00:00,0.0,492.86,492.91,495.04,490.74,0.0,-0.005876628524527305,0.15987972503239867,-0.5779688822675015,0.38498462814007944
298,2020-12-25 00:00:00,0.0093129894899159,492.86,492.86,494.37,490.37,1.0,-0.017085444104554703,0.03671366247255747,-0.6220244999970933,-0.4221006331616654
299,2020-12-26 00:00:00,0.0093129894899159,492.86,492.86,494.37,490.37,1.0,0.08171860006334786,0.06411948466380446,-0.2256857742965895,-0.2677918648352564
300,2020-12-27 00:00:00,0.0093129894899159,492.86,492.86,494.37,490.37,1.0,0.09907286862136644,0.029507846887211198,-0.198922344320779,-0.33505903935612436
301,2020-12-28 00:00:00,0.0035179415016584,497.45,492.96,498.69,492.49,1.0,0.09807228599279849,0.02907203430208183,-0.2657595635002024,-0.33163582413494097
302,2020-12-29 00:00:00,0.0022636217948717,499.2,497.45,501.92,495.49,1.0,-0.0015771112276645738,0.028637249047801294,-0.5059009509623394,-0.36952988595203334
303,2020-12-30 00:00:00,1.9986808706235694e-05,500.33,499.16,501.44,497.99,0.5,-0.06533135243192323,-0.01387485479788575,-0.7801766261886541,-0.649533531765409
304,2020-12-31 00:00:00,-3.9972818483394914e-05,500.34,500.32,501.01,499.55,1.0,0.04792524843314716,-0.036468074691423435,-0.3861664969929299,-0.5390110395213796
305,2021-01-01 00:00:00,-0.0129716981132075,500.32,500.32,503.75,496.79,1.0,0.006721063727798793,-0.014997209686118396,-0.45046598544879507,-0.46148317139062994
306,2021-01-02 00:00:00,-0.0129716981132075,500.32,500.32,503.75,496.79,1.0,0.0,0.0,0.0,0.0
307,2021-01-03 00:00:00,-0.0129716981132075,500.32,500.32,503.75,496.79,1.0,0.0,0.0,0.0,0.0
308,2021-01-04 00:00:00,-0.0035032298564282,493.83,499.81,504.88,493.13,1.0,0.0,0.0,0.0,0.0
309,2021-01-05 00:00:00,0.0154846575899207,492.1,495.04,495.61,490.91,1.0,0.0,0.0,0.0,0.0
310,2021-01-06 00:00:00,0.0115464660209717,499.72,492.1,500.85,491.28,1.0,0.0,0.0,0.0,0.0
311,2021-01-07 00:00:00,0.0081702902134562,505.49,499.77,505.99,499.2,1.0,0.0,0.0,0.0,0.0
312,2021-01-08 00:00:00,-0.0049252384129351,509.62,505.55,512.2,505.1,1.0,0.0,0.0,0.0,0.0
313,2021-01-09 00:00:00,-0.0049252384129351,509.62,505.55,512.2,505.1,1.0,0.0,0.0,0.0,0.0
314,2021-01-10 00:00:00,-0.0049252384129351,509.62,505.55,512.2,505.1,1.0,0.0,0.0,0.0,0.0
315,2021-01-11 00:00:00,0.0089921318846009,507.11,513.54,513.54,505.02,1.0,0.0,0.0,0.0,0.0
316,2021-01-12 00:00:00,-0.0107491156409404,511.67,507.1,512.43,506.45,0.0,0.0,0.0,0.0,0.0
317,2021-01-13 00:00:00,0.0101151786949048,506.17,511.66,517.16,504.76,1.0,0.0,0.0,0.0,0.0
318,2021-01-14 00:00:00,-0.0085665669189696,511.29,506.19,512.89,505.84,1.0,0.0,0.0,0.0,0.0
319,2021-01-15 00:00:00,0.0074174902842713,506.91,510.79,511.64,506.39,1.0,0.0,0.0,0.0,0.0
320,2021-01-16 00:00:00,0.0074174902842713,506.91,510.79,511.64,506.39,1.0,0.0,0.0,0.0,0.0
321,2021-01-17 00:00:00,0.0074174902842713,506.91,510.79,511.64,506.39,1.0,0.0,0.0,0.0,0.0
322,2021-01-18 00:00:00,0.0075978616327568,510.67,508.13,511.04,503.11,0.0,0.0,0.0,0.0,0.0
323,2021-01-19 00:00:00,-0.0009522884073462,514.55,510.69,515.32,510.23,1.0,-0.06794158118895499,-0.027387968065445634,-0.7386219202618686,-0.4246578640891997
324,2021-01-20 00:00:00,-0.0014200676963776,514.06,514.57,517.43,513.43,0.0,0.05283062414825945,-0.060207524723467465,-0.33640409407736915,-0.9705720462727586
325,2021-01-21 00:00:00,-0.0088442132741122,513.33,513.83,517.44,512.33,0.0,0.027638557486661774,0.10206896629908435,-0.3208443562262769,-0.15354457471784608
326,2021-01-22 00:00:00,-0.0088052045048055,508.79,513.32,513.76,507.3,1.0,0.06281344588936744,0.09498387183452195,-0.24309059115477982,0.20388811358976486
327,2021-01-23 00:00:00,-0.0088052045048055,508.79,513.32,513.76,507.3,1.0,0.01931392432783774,0.06290976165058204,-0.29429454330282534,-0.0070526652820780125
328,2021-01-24 00:00:00,-0.0088052045048055,508.79,513.32,513.76,507.3,1.0,0.014007822976182638,0.08635573087758353,-0.5402514143093802,-0.09960896307891615
329,2021-01-25 00:00:00,-0.006880688465428,504.31,508.74,510.82,499.04,0.0,0.028643837175273745,0.08611439659713938,-0.5254701776554607,-0.15118356401562494
330,2021-01-26 00:00:00,-0.0088451401645235,500.84,504.34,506.04,498.64,1.0,0.0,0.0,0.0,0.0
331,2021-01-27 00:00:00,0.0032634314377227,496.41,500.76,503.56,494.31,0.0,0.004529636879384569,0.05576230164061702,-0.6359414692835679,0.04059783818778961
332,2021-01-28 00:00:00,0.0012850631488063,498.03,496.41,499.99,489.81,1.0,0.0,0.0,0.0,0.0
333,2021-01-29 00:00:00,0.003910401668438,498.67,498.03,499.47,491.53,1.0,-0.009756143651847182,-0.00121219854971244,-0.5925972506807344,-0.5947419111484122
334,2021-01-30 00:00:00,0.003910401668438,498.67,498.03,499.47,491.53,1.0,-0.026031713409280677,-0.04914470405756788,-1.001799305361573,-1.0006385314740212
335,2021-01-31 00:00:00,0.003910401668438,498.67,498.03,499.47,491.53,1.0,-0.03924234390959036,-0.018666075369941026,-0.7776014835027072,-0.47527871671796007
336,2021-02-01 00:00:00,0.0130038751947584,500.62,498.72,502.26,497.09,0.0,-0.05152568528888857,-0.006095167826863701,-0.8434878677497445,-0.8057304306909723
337,2021-02-02 00:00:00,0.0067832705617888,507.13,500.61,508.31,500.1,1.0,-0.03231419627338816,-0.02558380621952061,-0.6436852229950033,-0.7193387445667027
338,2021-02-03 00:00:00,0.0030749946138629,510.57,505.85,513.04,505.85,1.0,0.04180318274849526,-0.06674115337134978,-0.06343426466488333,-0.7862271325169743
339,2021-02-04 00:00:00,-0.0030460420978638,512.14,510.58,514.0,509.52,0.0,0.39507260974481007,-0.003243842028249233,0.931570762011255,-0.5765498640845845
340,2021-02-05 00:00:00,0.0029574209722277,510.58,512.14,514.06,510.13,1.0,0.5783407066906756,-0.014432049454829787,1.6107878093412649,-0.7349949447196491
341,2021-02-06 00:00:00,0.0029574209722277,510.58,512.14,514.06,510.13,1.0,0.1649925429767043,0.02151708123871643,0.7657843578362942,-0.42247548021718295
342,2021-02-07 00:00:00,0.0029574209722277,510.58,512.14,514.06,510.13,1.0,0.11194997445044841,0.003244525966342948,0.2988530825225193,-0.49270578169870166
343,2021-02-08 00:00:00,-0.0081235720283544,512.09,509.81,513.59,509.81,1.0,0.08597940921924874,0.0019422849851347124,-0.18719670688849208,-0.41570983663690586
344,2021-02-09 00:00:00,-0.0021656527474258,507.93,512.03,512.97,507.78,1.0,0.03958551835201263,0.025910698126875076,-0.2549035121109059,-0.3093709002960808
345,2021-02-10 00:00:00,0.0023873882761478,506.83,507.94,510.19,505.72,1.0,0.0,0.0,0.0,0.0
346,2021-02-11 00:00:00,-0.0022832847807259,508.04,506.83,508.65,503.72,1.0,0.0,0.0,0.0,0.0
347,2021-02-12 00:00:00,0.0049518623737373,506.88,508.03,509.67,505.41,1.0,0.0,0.0,0.0,0.0
348,2021-02-13 00:00:00,0.0049518623737373,506.88,508.03,509.67,505.41,1.0,0.0,0.0,0.0,0.0
349,2021-02-14 00:00:00,0.0049518623737373,506.88,508.03,509.67,505.41,1.0,0.0,0.0,0.0,0.0
350,2021-02-15 00:00:00,0.0019631323740159,509.39,506.95,511.68,506.37,0.0,0.0,0.0,0.0,0.0
351,2021-02-16 00:00:00,-0.002037657477615,510.39,509.74,510.88,508.3,1.0,0.0,0.0,0.0,0.0
352,2021-02-17 00:00:00,-0.0089918523608521,509.35,510.35,512.58,508.29,0.0,0.0,0.0,0.0,0.0
353,2021-02-18 00:00:00,0.0126790419398934,504.77,509.35,511.03,504.51,1.0,0.07055141454116054,0.15783170498946042,0.007809469471766641,0.6252469103712196
354,2021-02-19 00:00:00,0.0137136373417844,511.17,504.76,511.58,504.32,1.0,0.029992484340323422,0.16723593490632993,-0.184266755719799,0.18308183884532558
355,2021-02-20 00:00:00,0.0137136373417844,511.17,504.76,511.58,504.32,1.0,0.03313858014409554,0.20101967433135393,-0.3462919577988044,0.494156171303661
356,2021-02-21 00:00:00,0.0137136373417844,511.17,504.76,511.58,504.32,1.0,0.02051248349002499,0.05996891780958613,-0.6109329240209304,-0.30669654297414917
357,2021-02-22 00:00:00,0.0113860048631751,518.18,511.17,518.58,509.47,1.0,0.022424310033163586,0.0044362458848929975,-0.3945976172481513,-0.561420206937429
358,2021-02-23 00:00:00,0.001869943520073,524.08,518.18,526.02,515.0,1.0,0.10658754041961593,-0.0031353276949630526,0.1664989652701581,-0.5977912777865513
359,2021-02-24 00:00:00,0.0132175370433856,525.06,524.12,527.7,518.9,0.0,0.0,0.0,0.0,0.0
360,2021-02-25 00:00:00,-0.0208646616541353,532.0,520.63,532.79,520.63,1.0,0.23798011697726995,0.02176581818074208,1.1396868907860538,-0.40626359987150373
361,2021-02-26 00:00:00,0.0200806296794011,520.9,539.23,539.23,519.7,1.0,0.0,0.0,0.0,0.0
362,2021-02-27 00:00:00,0.0200806296794011,520.9,539.23,539.23,519.7,1.0,0.0,0.0,0.0,0.0
363,2021-02-28 00:00:00,0.0200806296794011,520.9,539.23,539.23,519.7,1.0,0.0,0.0,0.0,0.0
364,2021-03-01 00:00:00,0.0031428786510086,531.36,520.93,532.03,520.07,0.0,0.0,0.0,0.0,0.0
365,2021-03-02 00:00:00,0.0023450837663921,533.03,531.67,533.48,527.92,0.0,0.1330172803207379,0.02617429994638254,0.13933003117570922,-0.357764988863761
366,2021-03-03 00:00:00,-0.0016657932170397,534.28,533.0,536.69,531.4,1.0,0.19583795580496854,0.048896931547576905,0.6544394990739658,-0.3033557134390846
367,2021-03-04 00:00:00,0.0150733984514144,533.39,534.29,535.2,531.35,0.0,0.2684064657670131,0.0010688066295667653,2.0855631501740164,-0.6135951878941933
368,2021-03-05 00:00:00,0.0092532737380642,541.43,533.54,542.63,532.59,1.0,0.10866035492478243,0.015470511573900225,0.00165572323593337,-0.25382468155049764
369,2021-03-06 00:00:00,0.0092532737380642,541.43,533.54,542.63,532.59,1.0,0.0564741677263747,-0.003942355486911353,-0.25493020105972736,-0.6773982303181402
370,2021-03-07 00:00:00,0.0092532737380642,541.43,533.54,542.63,532.59,1.0,-0.027002687324167773,-0.012045353586950469,-0.93528052857143,-0.6878370981468392
371,2021-03-08 00:00:00,0.0021960325012808,546.44,541.45,546.8,541.08,1.0,-4.643925534519866e-05,0.009481696175351217,-0.6801781596676498,-0.38939303610050297
372,2021-03-09 00:00:00,0.008965743919363,547.64,546.39,550.45,544.73,1.0,-0.012653621720090769,0.18921405932091595,-0.7524249384076758,0.3509582536942757
373,2021-03-10 00:00:00,-0.00101348294272,552.55,547.61,553.05,546.41,1.0,0.204637301559095,0.43751527180422745,0.3035658908079785,1.814718926649469
374,2021-03-11 00:00:00,-0.0002898603235565,551.99,552.56,554.84,549.41,0.875,0.0,0.0,0.0,0.0
375,2021-03-12 00:00:00,0.0011054128989,551.83,551.99,552.73,548.02,1.0,0.3647558258096879,0.3794984763958258,1.391420656091115,1.6653871012472665
376,2021-03-13 00:00:00,0.0011054128989,551.83,551.99,552.73,548.02,1.0,0.0,0.0,0.0,0.0
377,2021-03-14 00:00:00,0.0011054128989,551.83,551.99,552.73,548.02,1.0,0.0,0.0,0.0,0.0
378,2021-03-15 00:00:00,-0.0045615813482008,552.44,551.8,555.46,550.75,1.0,0.0,0.0,0.0,0.0
379,2021-03-16 00:00:00,3.6368926389466645e-05,549.92,552.4,554.66,549.22,0.8,0.0,0.0,0.0,0.0
380,2021-03-17 00:00:00,-0.0013819689420665,549.94,549.92,553.04,546.77,1.0,-0.08133720604618944,0.3315855462202908,-0.7511915756700412,1.0987105567949393
381,2021-03-18 00:00:00,-0.004588659455916,549.18,549.95,551.62,547.92,0.3333333333333333,0.0010921467615592206,0.15900765029916286,-0.5128772780072066,0.2720845291814183
382,2021-03-19 00:00:00,-0.0009329382065634,546.66,549.13,550.85,545.84,1.0,-0.03559971861432043,0.3182988227662724,-0.6053010563523821,1.2664434245087008
383,2021-03-20 00:00:00,-0.0009329382065634,546.66,549.13,550.85,545.84,1.0,0.0539923817391994,0.32026284645651826,-0.2176256004868114,0.8045893268395985
384,2021-03-21 00:00:00,-0.0009329382065634,546.66,549.13,550.85,545.84,1.0,0.19096124099701672,-0.0259268584554464,0.8171388298265699,-0.7067310717024679
385,2021-03-22 00:00:00,-0.0118465622997345,546.15,546.61,548.79,543.44,0.0,0.2552869702739553,-0.03447619756492948,1.108542517090199,-0.7261710788564788
386,2021-03-23 00:00:00,0.0051882597094575,539.68,546.18,549.28,536.75,0.0,0.252499467452731,0.04854929968442523,1.45520492763617,-0.4708439851135897
387,2021-03-24 00:00:00,-0.0092169296563928,542.48,539.68,542.98,536.03,1.0,0.5621191555154237,0.021848682935320163,3.6970506330312753,-0.4667910677834202
388,2021-03-25 00:00:00,0.0164099129269925,537.48,542.54,543.24,533.46,1.0,0.20059924239269833,-0.005502081147447768,0.9179334227032004,-0.7067214129127523
389,2021-03-26 00:00:00,0.0053633534687901,546.3,537.48,547.81,535.96,1.0,0.09738279246076242,0.05496152300604873,-0.23832421355837555,-0.09502086085285963
390,2021-03-27 00:00:00,0.0053633534687901,546.3,537.48,547.81,535.96,1.0,0.0653518046392989,-0.004306762245316342,-0.17714001118900646,-0.49458507563375553
391,2021-03-28 00:00:00,0.0053633534687901,546.3,537.48,547.81,535.96,1.0,0.12391341389479749,0.09435280634709287,0.17564720839641262,-0.2364871013387338
392,2021-03-29 00:00:00,-0.0023669500937677,549.23,546.26,551.06,543.78,0.0,0.12527785041569928,0.10101256274754,0.1901098091623207,-0.16470446798288102
393,2021-03-30 00:00:00,-0.0011862829193509,547.93,549.4,552.07,547.61,0.0,0.1359743554246995,0.13692269470595164,-0.053598888857412166,0.20806507276183678
394,2021-03-31 00:00:00,0.0,547.28,547.93,550.11,546.94,1.0,0.04042236936544885,0.1264354763664315,-0.45462757703536194,0.3521935039719766
395,2021-04-01 00:00:00,0.0,547.28,547.26,547.81,546.55,1.0,-0.023777114546550848,0.06725162023347586,-0.6098824270219154,-0.13993214270868415
396,2021-04-02 00:00:00,0.0,547.28,547.28,548.14,546.41,1.0,-0.07603543463975093,-0.013868777637236818,-1.191825273426232,-0.6935965697317151
397,2021-04-03 00:00:00,0.0,547.28,547.28,548.14,546.41,1.0,-0.06966014711020652,-0.047027620384729296,-1.0102008360780355,-0.8216232331193226
398,2021-04-04 00:00:00,0.0,547.28,547.28,548.14,546.41,1.0,-0.05535738825610004,0.056705715833365034,-0.9623807162949314,-0.31591140742241663
399,2021-04-05 00:00:00,0.0097025288700483,547.28,547.32,547.52,546.83,1.0,-0.028418034384590563,0.09717231155179995,-0.6431195244632951,0.028698161352054295
400,2021-04-06 00:00:00,-0.0028954559438281,552.59,547.24,555.17,547.02,1.0,0.0,0.0,0.0,0.0
401,2021-04-07 00:00:00,-0.0032305486487957,550.99,552.59,554.41,550.26,1.0,0.0,0.0,0.0,0.0
402,2021-04-08 00:00:00,-0.002021084830939,549.21,550.98,554.16,548.52,1.0,0.0,0.0,0.0,0.0
403,2021-04-09 00:00:00,-0.0028826856413064,548.1,549.3,550.14,546.64,1.0,0.0,0.0,0.0,0.0
404,2021-04-10 00:00:00,-0.0028826856413064,548.1,549.3,550.14,546.64,1.0,0.0,0.0,0.0,0.0
405,2021-04-11 00:00:00,-0.0028826856413064,548.1,549.3,550.14,546.64,1.0,0.0,0.0,0.0,0.0
406,2021-04-12 00:00:00,0.0035863280392301,546.52,548.18,549.37,543.37,1.0,0.0,0.0,0.0,0.0
407,2021-04-13 00:00:00,0.0015679696616102,548.48,546.58,550.04,544.41,1.0,0.0,0.0,0.0,0.0
408,2021-04-14 00:00:00,0.0068627807914952,549.34,548.48,550.36,545.23,1.0,0.0,0.0,0.0,0.0
409,2021-04-15 00:00:00,0.0091121115148884,553.11,549.33,555.52,545.23,1.0,0.0,0.0,0.0,0.0
410,2021-04-16 00:00:00,-0.0047119949834273,558.15,553.03,558.56,551.89,1.0,0.0,0.0,0.0,0.0
411,2021-04-17 00:00:00,-0.0047119949834273,558.15,553.03,558.56,551.89,1.0,0.0,0.0,0.0,0.0
412,2021-04-18 00:00:00,-0.0047119949834273,558.15,553.03,558.56,551.89,1.0,0.0,0.0,0.0,0.0
413,2021-04-19 00:00:00,-0.0138248847926266,555.52,558.18,559.93,554.63,0.0,0.0,0.0,0.0,0.0
414,2021-04-20 00:00:00,-0.0045633761682242,547.84,555.52,557.72,547.13,1.0,0.0,0.0,0.0,0.0
415,2021-04-21 00:00:00,0.0066013862911211,545.34,547.86,549.44,542.84,1.0,0.0,0.0,0.0,0.0
416,2021-04-22 00:00:00,0.0016941742266913,548.94,545.34,550.2,545.03,1.0,0.0,0.0,0.0,0.0
417,2021-04-23 00:00:00,0.0090385000090931,549.87,548.95,551.12,546.79,0.75,0.0,0.0,0.0,0.0
418,2021-04-24 00:00:00,0.0090385000090931,549.87,548.95,551.12,546.79,0.75,0.41060975160306334,0.15330665622432704,1.3744291786621448,0.09610695212893176
419,2021-04-25 00:00:00,0.0090385000090931,549.87,548.95,551.12,546.79,0.75,0.6775339455543143,0.14695003598921064,4.584388830245262,0.06650431616458742
420,2021-04-26 00:00:00,-0.0015860428231562,554.84,549.87,557.05,547.15,1.0,0.6255984666492456,0.29255475984463564,6.176990837668669,0.4275752717361613
421,2021-04-27 00:00:00,0.0105242255758537,553.96,554.82,556.97,551.33,1.0,0.08288424573270792,1.2039627247786915,-0.3250200531676532,5.372989401498483
422,2021-04-28 00:00:00,-0.0031976276818091,559.79,553.96,560.52,553.75,1.0,0.041421263643711015,-0.01880892108656873,-0.3571962793878481,-0.8056311367333029
423,2021-04-29 00:00:00,-0.0116129032258064,558.0,559.78,564.99,555.46,0.0,-0.03273380044898211,-0.040797147895297314,-0.7728587784609524,-0.8309814754241601
424,2021-04-30 00:00:00,0.0070894981143022,551.52,558.05,558.25,551.1,0.6666666666666666,-0.0648954785983511,0.1862024553000996,-1.104377717219973,0.4784515121194772
425,2021-05-01 00:00:00,0.0070894981143022,551.52,558.05,558.25,551.1,0.6666666666666666,0.2126060157660996,0.13128442452187095,1.0785532918270397,0.40824321870811436
426,2021-05-02 00:00:00,0.0070894981143022,551.52,558.05,558.25,551.1,0.6666666666666666,0.27941370279664657,0.0881733412838619,1.6650838949055369,-0.14814963453871333
427,2021-05-03 00:00:00,-0.000882199377059,555.43,551.5,555.92,548.89,0.0,0.3168088507737439,0.10484652632717051,1.7591548145487075,-0.25051831817499615
428,2021-05-04 00:00:00,0.005910548888168,554.94,555.46,560.78,553.82,1.0,0.2719593293404028,0.02690564866593803,2.6693668203316743,-0.4706560391957104
429,2021-05-05 00:00:00,-0.0016660098169181,558.22,554.94,560.34,554.64,0.0,0.05719562345954188,0.05466648906847027,-0.2076564195553248,-0.2627567140217279
430,2021-05-06 00:00:00,0.00753647113711,557.29,558.22,564.05,555.06,1.0,0.1666446462877813,0.04404232086473847,0.3537474883424372,-0.40597232214339224
431,2021-05-07 00:00:00,0.0016206878127837,561.49,557.28,564.69,554.77,1.0,0.06860234079867134,0.14614447118769913,-0.08267985454499463,0.603937475030088
432,2021-05-08 00:00:00,0.0016206878127837,561.49,557.28,564.69,554.77,1.0,0.35946655411312367,0.02146208599112942,1.2987600245471769,-0.4418227237183053
433,2021-05-09 00:00:00,0.0016206878127837,561.49,557.28,564.69,554.77,1.0,0.2866706237341754,0.24204527947937216,0.6029782267159174,0.7688958347464955
434,2021-05-10 00:00:00,-0.0141536273115219,562.4,561.55,564.18,559.18,1.0,0.3442354196453259,0.33438483135804464,1.8067735429512501,2.0126571381803537
435,2021-05-11 00:00:00,-0.004202438496501,554.44,562.43,562.69,550.8,1.0,0.948554555914165,0.6439724207733963,5.02870531807447,3.1917945530074334
436,2021-05-12 00:00:00,0.0,552.11,554.52,554.95,546.96,1.0,0.0,0.0,0.0,0.0
437,2021-05-13 00:00:00,0.0032602198837187,552.11,552.1,553.75,550.62,0.5,0.0,0.0,0.0,0.0
438,2021-05-14 00:00:00,0.0,553.91,552.2,554.16,546.93,1.0,0.0,0.0,0.0,0.0
439,2021-05-15 00:00:00,0.0,553.91,552.2,554.16,546.93,1.0,0.0,0.0,0.0,0.0
440,2021-05-16 00:00:00,0.0,553.91,552.2,554.16,546.93,1.0,0.0,0.0,0.0,0.0
441,2021-05-17 00:00:00,0.0081782238991895,553.91,553.94,554.33,553.37,1.0,0.0,0.0,0.0,0.0
442,2021-05-18 00:00:00,-0.0201633120836618,558.44,553.91,562.13,553.64,1.0,0.0,0.0,0.0,0.0
443,2021-05-19 00:00:00,0.0116415073650352,547.18,558.39,558.65,544.69,1.0,0.0,0.0,0.0,0.0
444,2021-05-20 00:00:00,0.0170174329328878,553.55,547.15,553.75,546.73,1.0,0.0,0.0,0.0,0.0
445,2021-05-21 00:00:00,-0.0001776293585804,562.97,553.55,563.45,553.3,1.0,0.0,0.0,0.0,0.0
446,2021-05-22 00:00:00,-0.0001776293585804,562.97,553.55,563.45,553.3,1.0,0.0,0.0,0.0,0.0
447,2021-05-23 00:00:00,-0.0001776293585804,562.97,553.55,563.45,553.3,1.0,0.0,0.0,0.0,0.0
448,2021-05-24 00:00:00,-0.0058628102403751,562.87,562.95,563.19,562.52,1.0,0.0,0.0,0.0,0.0
449,2021-05-25 00:00:00,-0.0019479242990153,559.57,562.93,565.01,558.55,0.5,0.0,0.0,0.0,0.0
450,2021-05-26 00:00:00,0.009131929522991,558.48,559.56,561.13,555.93,1.0,0.0,0.0,0.0,0.0
451,2021-05-27 00:00:00,0.0089250860569927,563.58,558.39,564.14,557.44,1.0,0.0,0.0,0.0,0.0
452,2021-05-28 00:00:00,-0.0061026010798262,568.61,563.59,570.02,561.99,1.0,0.0,0.0,0.0,0.0
453,2021-05-29 00:00:00,-0.0061026010798262,568.61,563.59,570.02,561.99,1.0,0.0,0.0,0.0,0.0
454,2021-05-30 00:00:00,-0.0061026010798262,568.61,563.59,570.02,561.99,1.0,0.0,0.0,0.0,0.0
455,2021-05-31 00:00:00,0.0184025197296244,565.14,568.61,570.26,560.64,1.0,0.0,0.0,0.0,0.0
456,2021-06-01 00:00:00,0.0025541230844077,575.54,565.22,575.93,564.73,1.0,0.0,0.0,0.0,0.0
457,2021-06-02 00:00:00,0.0017504029392904,577.01,575.58,580.81,575.37,1.0,0.0,0.0,0.0,0.0
458,2021-06-03 00:00:00,0.0077159959862981,578.02,576.96,581.96,573.19,1.0,0.0,0.0,0.0,0.0
459,2021-06-04 00:00:00,-0.0003776953715149,582.48,578.01,582.78,577.83,1.0,0.0,0.0,0.0,0.0
460,2021-06-05 00:00:00,-0.0003776953715149,582.48,578.01,582.78,577.83,1.0,0.0,0.0,0.0,0.0
461,2021-06-06 00:00:00,-0.0003776953715149,582.48,578.01,582.78,577.83,1.0,0.0,0.0,0.0,0.0
462,2021-06-07 00:00:00,-0.0031257513825437,582.26,582.41,584.32,580.29,0.0,0.0,0.0,0.0,0.0
463,2021-06-08 00:00:00,-0.0011887533595204,580.44,582.36,583.03,579.2,0.0,0.0,0.0,0.0,0.0
464,2021-06-09 00:00:00,-0.0001897369555843,579.75,580.45,581.89,578.44,0.0,-0.0009965052150855414,-0.015412683576045083,-0.3832213806579033,-0.3583121282415637
465,2021-06-10 00:00:00,0.0008626043751293,579.64,579.8,580.21,577.38,0.75,0.20070304425396568,0.012434428303353506,0.12018464072349565,-0.5056753083345921
466,2021-06-11 00:00:00,0.0071017340641914,580.14,579.7,581.96,578.92,1.0,0.2869911781143166,0.02831325026245146,1.0480294305496565,-0.2665822649214354
467,2021-06-12 00:00:00,0.0071017340641914,580.14,579.7,581.96,578.92,1.0,0.47288909021131875,0.07752629443198433,4.143144411418142,-0.11660390475460901
468,2021-06-13 00:00:00,0.0071017340641914,580.14,579.7,581.96,578.92,1.0,0.715117728060112,0.08171125851369876,1.7309106068602003,0.08030061394803971
469,2021-06-14 00:00:00,-0.0083695614965939,584.26,580.15,585.28,579.8,1.0,0.5452221039065233,0.176542357224303,1.6818971036749195,0.12489855794599017
470,2021-06-15 00:00:00,-0.0002934221654555,579.37,584.35,585.46,577.6,1.0,0.10443544485723688,0.6572766625270647,-0.07614416857556214,3.238063948077839
471,2021-06-16 00:00:00,-0.0059564917127072,579.2,579.32,580.86,578.01,1.0,0.009092877772621577,0.02207983892099019,-0.49574314174824025,-0.36674214174656417
472,2021-06-17 00:00:00,-0.0130785931393833,575.75,579.16,579.71,575.04,-1.0,0.06228334414733849,-0.0999624688144749,-0.3548802006870358,-0.7285847893944271
473,2021-06-18 00:00:00,0.0105944880504029,568.22,575.7,576.83,567.62,0.0,-0.0494327201509952,0.13271200911331915,-0.48264100123844494,-0.06126420006603619
474,2021-06-19 00:00:00,0.0105944880504029,568.22,575.7,576.83,567.62,0.0,0.09591610338459411,0.05725058376982961,-0.028368419354630036,-0.14208195569600818
475,2021-06-20 00:00:00,0.0105944880504029,568.22,575.7,576.83,567.62,0.0,0.304871931613639,-0.022794096803030683,0.8458642814943614,-0.657058106570194
476,2021-06-21 00:00:00,0.0079931735859571,574.24,568.22,574.65,561.25,0.0,0.3938538878821207,0.009278092150854178,1.0922484968764534,-0.6593452804666944
477,2021-06-22 00:00:00,0.0083098664547448,578.83,574.23,579.4,573.68,1.0,0.2775030555297864,0.015126811002724061,0.8187872665114098,-0.5615369302337055
478,2021-06-23 00:00:00,-0.0007881570831335,583.64,578.9,585.17,577.76,1.0,0.06691945495443363,0.06955289833088507,-0.23261441545609285,-0.19089724477233902
479,2021-06-24 00:00:00,0.0056929249974279,583.18,583.64,585.5,581.87,0.0,0.12415654086652061,0.04977371025713673,0.4052104511184133,-0.4823885617387165
480,2021-06-25 00:00:00,-0.0133503836317136,586.5,583.18,586.85,582.9,1.0,0.1035339353740179,-0.033479107068764336,-0.015618577395282815,-1.0842636668099472
481,2021-06-26 00:00:00,-0.0133503836317136,586.5,583.18,586.85,582.9,1.0,0.20941341135651914,0.06885233926498202,0.3283624798479892,-0.31157547917834555
482,2021-06-27 00:00:00,-0.0133503836317136,586.5,583.18,586.85,582.9,1.0,0.0,0.0,0.0,0.0
483,2021-06-28 00:00:00,-0.0022983738572933,578.67,586.51,586.92,578.24,0.0,0.011411872468426232,0.10991717732523831,-0.5761839300463762,0.08551120414456251
484,2021-06-29 00:00:00,-0.0077597256382721,577.34,578.71,581.58,576.72,0.0,0.008119586794636646,0.02180926600563815,-0.6381169260598475,-0.4407337340846634
485,2021-06-30 00:00:00,0.0115385958174772,572.86,577.82,579.08,572.33,1.0,0.01769354574134674,0.026804309162592688,-0.38235305626729094,-0.3488019094382274
486,2021-07-01 00:00:00,0.0052461732272593,579.47,572.86,580.71,572.41,0.0,0.06721453212492268,0.01071086354093076,-0.14556668678576357,-0.624817348889292
487,2021-07-02 00:00:00,0.0076221867435753,582.51,579.58,584.24,578.85,1.0,0.024517754182272533,0.005611524246530664,-0.4750034148721417,-0.5120063975442892
488,2021-07-03 00:00:00,0.0076221867435753,582.51,579.58,584.24,578.85,1.0,-0.02069144022477154,-0.001397419337894057,-0.7902537841578481,-0.5185785732857399
489,2021-07-04 00:00:00,0.0076221867435753,582.51,579.58,584.24,578.85,1.0,-0.029612177298293574,0.0030016385358777598,-0.819005678529496,-0.37617280116595564
490,2021-07-05 00:00:00,-0.003611891983985,586.95,582.42,587.42,582.08,0.0,-0.01766977520757873,0.014955490584801723,-0.7425719594835388,-0.5785089546549596
491,2021-07-06 00:00:00,-0.0016415026588923,584.83,586.83,588.15,584.51,1.0,0.0,0.0,0.0,0.0
492,2021-07-07 00:00:00,-0.0137701885693732,583.87,584.78,587.64,582.59,1.0,0.105486720365076,0.003563204571618961,0.12477325867935722,-0.6525638697655999
493,2021-07-08 00:00:00,0.0129552124759042,575.83,584.42,584.42,575.27,0.0,0.01301579056531299,0.029817929111240815,-0.3294336344564514,-0.40618750923975394
494,2021-07-09 00:00:00,0.0082120386085824,583.29,575.75,584.39,575.06,1.0,-0.04064052664943407,-0.06068852282359938,-1.1244127922651186,-1.3288372564491553
495,2021-07-10 00:00:00,0.0082120386085824,583.29,575.75,584.39,575.06,1.0,-0.04860788071072797,-0.1003997317186478,-0.6394752882442692,-0.97553549026861
496,2021-07-11 00:00:00,0.0082120386085824,583.29,575.75,584.39,575.06,1.0,-0.03934928345770494,-0.09550046513633603,-0.6589284182840988,-1.0708331427814772
497,2021-07-12 00:00:00,-0.0008332199700721,588.08,583.29,588.33,581.72,1.0,-0.04562949790795301,-0.09894326525054087,-0.6058310031146595,-0.8738547917809573
498,2021-07-13 00:00:00,0.0038802566415357,587.59,588.08,589.05,584.15,1.0,-0.07042787970041875,-0.10169612658366844,-0.7430111008801848,-0.7765694497145923
499,2021-07-14 00:00:00,-0.0083577737467576,589.87,587.57,590.9,585.96,1.0,0.0,0.0,0.0,0.0
500,2021-07-15 00:00:00,-0.0129927855848463,584.94,589.89,590.24,582.48,1.0,0.0,0.0,0.0,0.0
501,2021-07-16 00:00:00,-0.0230193646724635,577.34,584.91,587.07,577.02,1.0,0.0,0.0,0.0,0.0
502,2021-07-17 00:00:00,-0.0230193646724635,577.34,584.91,587.07,577.02,1.0,0.0,0.0,0.0,0.0
503,2021-07-18 00:00:00,-0.0230193646724635,577.34,584.91,587.07,577.02,1.0,0.0,0.0,0.0,0.0
504,2021-07-19 00:00:00,0.0143072422657566,564.05,577.29,577.77,563.43,0.5,0.0,0.0,0.0,0.0
505,2021-07-20 00:00:00,0.0083024540306229,572.12,564.05,574.01,563.58,0.3333333333333333,0.0,0.0,0.0,0.0
506,2021-07-21 00:00:00,-0.0020801913776068,576.87,572.22,578.14,571.67,1.0,0.2078230441872,0.05432951265452246,0.7679589601095634,-0.2841507092654233
507,2021-07-22 00:00:00,0.0013028297462087,575.67,576.86,578.42,574.28,1.0,0.1509093850649057,0.25956865928112904,-0.01364159392800008,0.9000284587464765
508,2021-07-23 00:00:00,0.0059852191110649,576.42,575.7,578.57,574.85,1.0,0.1309142676835915,0.1638854472160638,0.2989490893344497,0.4275015913530446
509,2021-07-24 00:00:00,0.0059852191110649,576.42,575.7,578.57,574.85,1.0,-0.004098428336759774,0.17970855129180574,-0.6450352667484665,0.19447946419376907
510,2021-07-25 00:00:00,0.0059852191110649,576.42,575.7,578.57,574.85,1.0,-0.08156931981832694,0.2712153909595285,-0.5657680965211798,0.8546862847264466
511,2021-07-26 00:00:00,-0.0023625985134599,579.87,576.67,580.26,573.04,1.0,-0.08580093497705121,0.26273570369781396,-1.0149471324243593,0.14234042935157531
512,2021-07-27 00:00:00,-0.0036473638720829,578.5,579.91,580.32,575.37,0.6666666666666666,-0.08747211575770741,0.2605382796456608,-1.0385369752504259,0.379382921569973
513,2021-07-28 00:00:00,0.0071132392997797,576.39,578.45,579.63,573.86,1.0,0.1691637124856813,0.2316243719743687,0.18269921854691018,0.7558518463667383
514,2021-07-29 00:00:00,-0.0038932625885028,580.49,576.51,581.37,576.02,1.0,0.0,0.0,0.0,0.0
515,2021-07-30 00:00:00,0.0077650761807585,578.23,580.52,580.88,574.6,1.0,0.0,0.0,0.0,0.0
516,2021-07-31 00:00:00,0.0077650761807585,578.23,580.52,580.88,574.6,1.0,0.0,0.0,0.0,0.0
517,2021-08-01 00:00:00,0.0077650761807585,578.23,580.52,580.88,574.6,1.0,0.0,0.0,0.0,0.0
518,2021-08-02 00:00:00,0.0005319879187258,582.72,578.27,583.46,578.06,1.0,0.0,0.0,0.0,0.0
519,2021-08-03 00:00:00,0.0082500042879441,583.03,582.72,584.86,580.44,0.75,0.0,0.0,0.0,0.0
520,2021-08-04 00:00:00,0.0001190800217745,587.84,582.95,588.55,582.7,1.0,0.1303728539807203,0.1693430476715534,0.28476891546635863,0.5809873301894
521,2021-08-05 00:00:00,-0.0014968277457433,587.91,587.87,589.53,586.01,1.0,0.0,0.0,0.0,0.0
522,2021-08-06 00:00:00,0.0001022094271162,587.03,587.91,589.38,585.55,1.0,0.0,0.0,0.0,0.0
523,2021-08-07 00:00:00,0.0001022094271162,587.03,587.91,589.38,585.55,1.0,0.0,0.0,0.0,0.0
524,2021-08-08 00:00:00,0.0001022094271162,587.03,587.91,589.38,585.55,1.0,0.0,0.0,0.0,0.0
525,2021-08-09 00:00:00,0.0056720434686333,587.09,587.02,587.76,584.89,1.0,0.0,0.0,0.0,0.0
526,2021-08-10 00:00:00,0.0004573015819248,590.42,587.07,591.02,586.52,0.0,0.0,0.0,0.0,0.0
527,2021-08-11 00:00:00,0.0043000558668674,590.69,590.43,592.15,588.56,1.0,0.3721779399081999,-0.059918423044650115,1.4604904515482187,-0.7666896318271696
528,2021-08-12 00:00:00,0.0032028049828902,593.23,590.7,594.58,590.45,1.0,0.0,0.0,0.0,0.0
529,2021-08-13 00:00:00,-0.0059482802076856,595.13,593.23,595.37,592.37,1.0,0.0,0.0,0.0,0.0
530,2021-08-14 00:00:00,-0.0059482802076856,595.13,593.23,595.37,592.37,1.0,0.0,0.0,0.0,0.0
531,2021-08-15 00:00:00,-0.0059482802076856,595.13,593.23,595.37,592.37,1.0,0.0,0.0,0.0,0.0
532,2021-08-16 00:00:00,0.0030088405821598,591.59,595.07,595.34,589.79,1.0,0.0,0.0,0.0,0.0
533,2021-08-17 00:00:00,-0.0012639668335102,593.37,591.56,593.87,588.45,1.0,0.0,0.0,0.0,0.0
534,2021-08-18 00:00:00,-0.0178023016435489,592.62,593.32,593.64,591.07,0.0,0.0,0.0,0.0,0.0
535,2021-08-19 00:00:00,-0.000584122184617,582.07,592.65,593.05,577.71,0.3333333333333333,0.0,0.0,0.0,0.0
536,2021-08-20 00:00:00,0.0132191910336409,581.73,582.13,583.59,577.83,1.0,0.9513004068877438,-0.052364908528681475,3.8093008216523754,-0.5687442759002109
537,2021-08-21 00:00:00,0.0132191910336409,581.73,582.13,583.59,577.83,1.0,1.1062081723436599,0.03413256739823556,4.689751752437375,-0.5161435733493192
538,2021-08-22 00:00:00,0.0132191910336409,581.73,582.13,583.59,577.83,1.0,0.6534718725694244,-0.0003725787703077188,2.9720576438368727,-0.5300119832360619
539,2021-08-23 00:00:00,0.0003732482779682,589.42,581.63,589.62,580.75,0.0,0.5551950523453648,0.007025692453184185,1.4260579780765559,-0.43725753066551865
540,2021-08-24 00:00:00,0.0040024421681025,589.64,589.32,591.61,587.47,1.0,0.4035624860031044,0.010786871658143404,1.6591574820283115,-0.7107244135893451
541,2021-08-25 00:00:00,0.00125,592.0,589.64,594.97,588.74,1.0,0.064965136684493,0.066931959052698,-0.2539531727830822,-0.27618350139968456
542,2021-08-26 00:00:00,0.0077099571481592,592.74,592.0,593.2,587.96,1.0,0.058318803376042894,0.08031660063463075,-0.2524478416840784,-0.11871757195730168
543,2021-08-27 00:00:00,-0.0071989419229545,597.31,592.73,597.57,591.6,1.0,0.070970677135902,0.01664730845357365,0.019120934399861147,-0.4609326072117522
544,2021-08-28 00:00:00,-0.0071989419229545,597.31,592.73,597.57,591.6,1.0,0.0,0.0,0.0,0.0
545,2021-08-29 00:00:00,-0.0071989419229545,597.31,592.73,597.57,591.6,1.0,0.0,0.0,0.0,0.0
546,2021-08-30 00:00:00,-0.0187517917067165,593.01,597.29,598.71,592.28,0.0,0.0,0.0,0.0,0.0
547,2021-08-31 00:00:00,0.0084208355531113,581.89,592.97,594.62,581.6,1.0,0.13618633512050948,0.11590707843285841,0.3130609153146429,-0.0380501791357619
548,2021-09-01 00:00:00,0.0137868743502786,586.79,581.89,589.14,581.32,1.0,0.0,0.0,0.0,0.0
549,2021-09-02 00:00:00,-0.0059675901022054,594.88,586.79,595.01,586.12,1.0,0.0,0.0,0.0,0.0
550,2021-09-03 00:00:00,0.0124634298953207,591.33,594.9,596.79,590.0,1.0,0.0,0.0,0.0,0.0
551,2021-09-04 00:00:00,0.0124634298953207,591.33,594.9,596.79,590.0,1.0,0.0,0.0,0.0,0.0
552,2021-09-05 00:00:00,0.0124634298953207,591.33,594.9,596.79,590.0,1.0,0.0,0.0,0.0,0.0
553,2021-09-06 00:00:00,-0.0083013195256389,598.7,591.37,599.11,591.07,0.0,0.0,0.0,0.0,0.0
554,2021-09-07 00:00:00,-0.0013810991528136,593.73,598.7,599.5,593.0,0.0,0.40539761168952904,0.1678501260088705,1.5930947858692481,0.31460178224243196
555,2021-09-08 00:00:00,-0.0096136007151168,592.91,593.73,594.24,587.78,1.0,0.2302896114675459,0.05207518699509084,0.8051243685169828,-0.28628416292617637
556,2021-09-09 00:00:00,1.702968273699512e-05,587.21,592.95,593.32,586.58,0.0,-0.0046562672616339285,0.039773288522817474,-0.47461643673912324,-0.18178315102852677
557,2021-09-10 00:00:00,-0.0002724702837098,587.22,587.21,589.89,586.66,1.0,0.03985922789312557,0.09022527671479352,-0.38120175955047453,-0.30715674650558494
558,2021-09-11 00:00:00,-0.0002724702837098,587.22,587.21,589.89,586.66,1.0,-0.03156542140557761,0.0009076721859901937,-0.9818785340119859,-0.7436112195214872
559,2021-09-12 00:00:00,-0.0002724702837098,587.22,587.21,589.89,586.66,1.0,-0.012504765485727098,0.10005375096637437,-0.5820616617791334,-0.12803968196795207
560,2021-09-13 00:00:00,-0.0032023983919871,587.06,587.2,591.74,586.76,1.0,0.005811100468696928,0.21410824202162715,-0.49193768070978733,0.2121005812841969
561,2021-09-14 00:00:00,0.0072798113401006,585.18,587.06,589.7,584.91,1.0,0.048079551148565436,0.5779563530431719,-0.21704471271937753,2.905274388516577
562,2021-09-15 00:00:00,-0.0010348805646037,589.44,585.19,593.18,584.2,0.75,0.29047193951654826,0.6571795477602072,0.26298949307264624,2.015810271825862
563,2021-09-16 00:00:00,-0.0076422736613283,588.83,589.44,593.58,587.91,0.0,0.018022755288492398,0.250595051995381,-0.4671030478856252,0.1611982650481273
564,2021-09-17 00:00:00,-0.0203823182106003,584.33,588.87,591.47,583.92,0.75,-0.042691128632701414,0.35662543847341155,-0.8344200582455439,1.051020051825405
565,2021-09-18 00:00:00,-0.0203823182106003,584.33,588.87,591.47,583.92,0.75,-0.003241573079942661,0.3439809305520498,-0.4632247152513786,1.2328400285940058
566,2021-09-19 00:00:00,-0.0203823182106003,584.33,588.87,591.47,583.92,0.75,0.2641425669108646,0.07318307410338143,1.3962839528558735,-0.11346939459955058
567,2021-09-20 00:00:00,0.0063589671919219,572.42,584.28,584.83,567.71,1.0,0.3108325991183918,0.07514898783187718,1.427029513149011,-0.2199598485918573
568,2021-09-21 00:00:00,0.0190605145297365,576.06,572.44,582.05,572.01,0.0,-0.03937554577936808,0.1116892343270166,-0.7056805007428603,0.010182838254958249
569,2021-09-22 00:00:00,0.0130144453529571,587.04,576.06,587.83,575.59,0.0,0.00996034959206149,0.13341747287129913,-0.4545477880461937,0.36658227736369337
570,2021-09-23 00:00:00,-0.0024046546041567,594.68,587.04,595.31,586.39,1.0,-0.012614202737329272,0.19421569534327432,-0.5017583715448655,0.6981820272552804
571,2021-09-24 00:00:00,0.0037926675094816,593.25,596.01,596.01,589.7,1.0,0.1605922330079892,0.17567106268259902,-0.051516377496588876,0.2062257714791763
572,2021-09-25 00:00:00,0.0037926675094816,593.25,596.01,596.01,589.7,1.0,0.10222866085037818,0.6730665134043523,-0.15649843467111876,2.9632114340644575
573,2021-09-26 00:00:00,0.0037926675094816,593.25,596.01,596.01,589.7,1.0,0.2851825881663501,0.643191032730468,1.0626591021201472,2.862849560244027
574,2021-09-27 00:00:00,-0.0032745591939547,595.5,593.23,597.42,592.86,1.0,0.2602344762237543,0.5691893311767391,0.5275043468603977,2.6999444148421774
575,2021-09-28 00:00:00,0.0008423890152472,593.55,595.5,597.43,593.05,1.0,0.22954895217787996,0.570110077533573,1.0028479241399735,1.4473612275592254
576,2021-09-29 00:00:00,0.0091406447268749,594.05,593.56,595.74,591.52,1.0,1.3565910193517983,1.2168032215600366,3.3353415174261354,5.960887685238993
577,2021-09-30 00:00:00,0.0027523854006805,599.48,594.01,603.66,593.74,0.75,0.0,0.0,0.0,0.0
578,2021-10-01 00:00:00,0.0055894731588841,601.13,599.52,603.44,589.2,1.0,0.0,0.0,0.0,0.0
579,2021-10-02 00:00:00,0.0055894731588841,601.13,599.52,603.44,589.2,1.0,0.0,0.0,0.0,0.0
580,2021-10-03 00:00:00,0.0055894731588841,601.13,599.52,603.44,589.2,1.0,0.0,0.0,0.0,0.0
581,2021-10-04 00:00:00,0.0041853463250011,604.49,601.13,607.12,599.28,1.0,0.0,0.0,0.0,0.0
582,2021-10-05 00:00:00,-0.0173470396362557,607.02,604.5,607.35,598.75,1.0,0.0,0.0,0.0,0.0
583,2021-10-06 00:00:00,0.0036882428875589,596.49,607.0,607.27,594.03,1.0,0.0,0.0,0.0,0.0
584,2021-10-07 00:00:00,0.0066645509362105,598.69,596.56,601.29,591.78,1.0,0.0,0.0,0.0,0.0
585,2021-10-08 00:00:00,0.0060728744939272,602.68,598.67,603.06,598.42,1.0,0.0,0.0,0.0,0.0
586,2021-10-09 00:00:00,0.0060728744939272,602.68,598.67,603.06,598.42,1.0,0.0,0.0,0.0,0.0
587,2021-10-10 00:00:00,0.0060728744939272,602.68,598.67,603.06,598.42,1.0,0.0,0.0,0.0,0.0
588,2021-10-11 00:00:00,0.0017152092885179,606.34,602.99,607.78,600.46,0.0,0.0,0.0,0.0,0.0
589,2021-10-12 00:00:00,0.0085448977575818,607.38,606.32,608.32,600.06,1.0,0.0,0.0,0.0,0.0
590,2021-10-13 00:00:00,0.0152309123855231,612.57,607.38,613.12,604.05,0.8333333333333334,0.0,0.0,0.0,0.0
591,2021-10-14 00:00:00,-0.0008361472905611,621.9,612.56,622.2,612.09,0.875,-0.07409096445371777,-0.021920662255327628,-0.8920285766930981,-0.6749755408743349
592,2021-10-15 00:00:00,0.0062763526344587,621.38,621.62,624.78,618.54,1.0,0.11579834492487606,-0.025899568244458493,0.15919192098637133,-0.7568705580563008
593,2021-10-16 00:00:00,0.0062763526344587,621.38,621.62,624.78,618.54,1.0,-0.043119825119050326,-0.01359120041220896,-0.5846737163205474,-0.6929266445868703
594,2021-10-17 00:00:00,0.0062763526344587,621.38,621.62,624.78,618.54,1.0,-0.08278509176523485,0.1480600465560049,-1.1229996283445314,0.5923289605206747
595,2021-10-18 00:00:00,-0.0003358495394062,625.28,621.4,628.81,620.44,1.0,-0.08540368543551313,0.29638525382626435,-0.827427809053494,1.2880365960001687
596,2021-10-19 00:00:00,0.010942774409266,625.07,625.18,629.71,623.27,1.0,0.007758200072586874,0.672407578637618,-0.48315888714501715,1.6105759309937204
597,2021-10-20 00:00:00,-0.0063141903119115,631.91,625.09,632.28,624.44,1.0,0.10119265049468318,1.3481208645567868,-0.17762248005552259,7.661173712521232
598,2021-10-21 00:00:00,0.0050165626194421,627.92,631.65,633.33,624.27,1.0,0.023105173223148867,1.2128194468069236,-0.4990354097591194,4.113359610826945
599,2021-10-22 00:00:00,-0.0005704596954379,631.07,627.83,631.72,624.08,1.0,0.0,0.0,0.0,0.0
600,2021-10-23 00:00:00,-0.0005704596954379,631.07,627.83,631.72,624.08,1.0,0.0,0.0,0.0,0.0
601,2021-10-24 00:00:00,-0.0005704596954379,631.07,627.83,631.72,624.08,1.0,0.0,0.0,0.0,0.0
602,2021-10-25 00:00:00,-0.0020294588638202,630.71,631.04,632.21,629.4,0.0,0.0,0.0,0.0,0.0
603,2021-10-26 00:00:00,-0.0048297666142382,629.43,630.69,631.72,625.81,1.0,0.0,0.0,0.0,0.0
604,2021-10-27 00:00:00,-0.0157729210236434,626.39,629.43,629.71,619.84,1.0,0.0,0.0,0.0,0.0
605,2021-10-28 00:00:00,-0.0099268462798657,616.51,626.38,626.58,612.39,1.0,0.0,0.0,0.0,0.0
606,2021-10-29 00:00:00,-0.0099268462798657,616.51,626.38,626.58,612.39,1.0,0.0,0.0,0.0,0.0
607,2021-10-30 00:00:00,-0.0099268462798657,616.51,626.38,626.58,612.39,1.0,0.0,0.0,0.0,0.0
608,2021-10-31 00:00:00,-0.0099268462798657,616.51,626.38,626.58,612.39,1.0,0.0,0.0,0.0,0.0
