,Date,Return,Price,Open,High,Low,Index,TE(XY),TE(YX),Z(XY),Z(YX)
0,2020-03-02 00:00:00,0.0051550242809114,267.7,265.91,268.1,264.34,1.0,,,,
1,2020-03-03 00:00:00,0.0091422625241565,269.08,267.48,271.15,267.48,1.0,,,,
2,2020-03-04 00:00:00,-0.0022464461957723,271.54,269.63,271.61,268.25,0.8,,,,
3,2020-03-05 00:00:00,-0.0210017347654375,270.93,271.81,273.43,270.53,1.0,,,,
4,2020-03-06 00:00:00,-0.062170110088976,265.24,270.54,270.96,264.64,1.0,,,,
5,2020-03-07 00:00:00,-0.062170110088976,265.24,270.54,270.96,264.64,1.0,,,,
6,2020-03-08 00:00:00,-0.062170110088976,265.24,270.54,270.96,264.64,1.0,,,,
7,2020-03-09 00:00:00,0.0258492462311558,248.75,265.3,265.35,248.63,1.0,,,,
8,2020-03-10 00:00:00,-0.0222979857355592,255.18,249.01,255.26,246.28,1.0,,,,
9,2020-03-11 00:00:00,-0.0499017996713295,249.49,255.34,256.57,249.28,1.0,,,,
10,2020-03-12 00:00:00,-0.0207138035774552,237.04,250.22,250.22,236.9,1.0,-0.11096200459463912,0.16939304884010964,-1.5859114629529796,0.994939167874241
11,2020-03-13 00:00:00,-0.0611295394821867,232.13,237.05,237.23,222.03,1.0,0.0,0.0,0.0,0.0
12,2020-03-14 00:00:00,-0.0611295394821867,232.13,237.05,237.23,222.03,1.0,0.0,0.0,0.0,0.0
13,2020-03-15 00:00:00,-0.0611295394821867,232.13,237.05,237.23,222.03,1.0,0.0,0.0,0.0,0.0
14,2020-03-16 00:00:00,-0.0176654124988528,217.94,232.08,232.29,217.56,0.5,0.0,0.0,0.0,0.0
15,2020-03-17 00:00:00,-0.0170956139941146,214.09,217.89,218.08,212.79,0.8888888888888888,0.0,0.0,0.0,0.0
16,2020-03-18 00:00:00,-0.045335741101554,210.43,214.1,220.13,208.9,1.0,-0.03855103439143903,0.13568035692144864,-0.7655173331211431,0.6791101564317843
17,2020-03-19 00:00:00,0.0304146547862014,200.89,209.67,210.99,199.38,1.0,0.010969602417771895,-0.009263873769705722,-0.5369676419608399,-0.8330354890834386
18,2020-03-20 00:00:00,-0.0653140096618358,207.0,201.36,208.59,200.73,1.0,-0.08248280963626353,-0.06523761621591229,-1.073690617761116,-1.1073086254355573
19,2020-03-21 00:00:00,-0.0653140096618358,207.0,201.36,208.59,200.73,1.0,-0.03538695012417392,0.019060563043262757,-0.5727056801992481,-0.6079883533806231
20,2020-03-22 00:00:00,-0.0653140096618358,207.0,201.36,208.59,200.73,1.0,-0.02842810969477938,0.1292431857243268,-0.70880332257967,0.26086859894704456
21,2020-03-23 00:00:00,0.0716353111432707,193.48,207.32,207.32,190.84,1.0,-0.043699923959641396,0.2557376540764902,-0.8345446674995134,0.43373396294170924
22,2020-03-24 00:00:00,0.0687276936432912,207.34,193.46,207.68,193.37,0.8571428571428571,0.008443642903011472,0.9022038972175657,-0.46492521774958373,2.986543717826789
23,2020-03-25 00:00:00,-0.0104246581524437,221.59,207.25,222.31,207.25,1.0,0.26287097877462173,0.834279102469071,0.46457102331814176,3.750499534251835
24,2020-03-26 00:00:00,0.0120850054724553,219.28,221.56,221.68,214.01,1.0,0.6121774401081472,0.30936605662374017,3.3165726138116525,1.0290812438710408
25,2020-03-27 00:00:00,-0.0381201279682783,221.93,219.32,225.88,219.19,1.0,0.2698260793534839,0.35594812248013286,1.2238018729925613,0.7705766647511266
26,2020-03-28 00:00:00,-0.0381201279682783,221.93,219.32,225.88,219.19,1.0,0.25141043987210754,0.2801336005210868,0.6988622029919674,1.0597417369139392
27,2020-03-29 00:00:00,-0.0381201279682783,221.93,219.32,225.88,219.19,1.0,0.2791287766674655,0.34351552320922396,1.4135005387270898,1.3475394620825727
28,2020-03-30 00:00:00,0.0219703002763854,213.47,221.63,222.02,212.65,0.8,0.2709781667517852,0.4133707377703062,1.0458159550239938,0.8074684725389506
29,2020-03-31 00:00:00,-0.0197103043637696,218.16,213.45,218.86,213.4,0.875,0.2266976881405336,0.10286524993232682,0.7817895888293143,0.0481010816657186
30,2020-04-01 00:00:00,0.0049565136070325,213.86,218.15,218.21,212.81,1.0,0.09604931902781466,0.0328792695063882,-0.25279933609273686,-0.4165247401979238
31,2020-04-02 00:00:00,-0.0327563744649171,214.92,213.88,215.1,209.42,1.0,0.26097866410759174,-0.018174323103369083,0.6732567959012856,-0.7250228979439728
32,2020-04-03 00:00:00,0.0379064845102943,207.88,214.93,215.02,207.58,1.0,-0.00498002008122711,-0.013586005607620244,-0.9468026711224146,-0.6097170416299096
33,2020-04-04 00:00:00,0.0379064845102943,207.88,214.93,215.02,207.58,1.0,-0.03172202097997534,0.011812869625162925,-0.8973311634886033,-0.4915610272772246
34,2020-04-05 00:00:00,0.0379064845102943,207.88,214.93,215.02,207.58,1.0,0.042826883587870235,0.02145198034038298,-0.5411363034614932,-0.5187767452500905
35,2020-04-06 00:00:00,0.0396273637374861,215.76,207.78,215.89,207.46,1.0,0.09365999716755447,0.05377020014821898,-0.19454389182217674,-0.43717686911414455
36,2020-04-07 00:00:00,-0.0093174624403727,224.31,215.78,225.11,215.68,1.0,0.11783999840695358,0.14057137362052163,0.31497599573539997,-0.037723443956230215
37,2020-04-08 00:00:00,0.014040140401404,222.22,224.32,224.41,219.55,0.0,-0.03569792625095758,0.08015006382831391,-0.6523155744447697,0.14131719690975741
38,2020-04-09 00:00:00,0.0,225.34,222.2,227.31,222.11,1.0,-0.010693794864589101,0.4938478736402434,-0.38544500066376924,2.887520624077061
39,2020-04-10 00:00:00,0.0006212833939823,225.34,225.26,225.56,225.01,1.0,-0.025464853039043334,0.6162683185309703,-0.379688280511604,3.2598829949280375
40,2020-04-11 00:00:00,0.0006212833939823,225.34,225.26,225.56,225.01,1.0,-0.025507222168758226,0.27229112870879923,-0.3933673583928906,0.9931689565446586
41,2020-04-12 00:00:00,0.0006212833939823,225.34,225.26,225.56,225.01,1.0,0.02406488830092446,0.1506428570131746,-0.394044834125971,0.06897574577787735
42,2020-04-13 00:00:00,0.0275412453432677,225.48,224.8,225.85,223.18,1.0,0.028998172106283526,0.07560095565629155,-0.1790515640557405,-0.03445636751598535
43,2020-04-14 00:00:00,-0.0143294919936121,231.69,225.42,232.0,225.38,1.0,0.08709861774202565,0.027148211915011267,0.028938145185121767,-0.30438467530422914
44,2020-04-15 00:00:00,0.0053859964093356,228.37,231.51,232.78,227.89,0.5,-0.07603458498975613,-0.08909363353885347,-0.6016150065914913,-0.6133726968646506
45,2020-04-16 00:00:00,0.0024390243902439,229.6,228.58,230.31,226.27,0.7142857142857143,-0.06589884091964127,-0.058435884627566104,-0.7175921306853211,-0.7274645113570852
46,2020-04-17 00:00:00,-4.344803614872656e-05,230.16,229.12,234.73,229.12,1.0,-0.03232490090208362,2.736981981593507,-0.6424564891287665,9.672310592708994
47,2020-04-18 00:00:00,-4.344803614872656e-05,230.16,229.12,234.73,229.12,1.0,0.06411992910592978,0.40255356179872415,-0.24232354348068835,1.1119038380428259
48,2020-04-19 00:00:00,-4.344803614872656e-05,230.16,229.12,234.73,229.12,1.0,0.03142818879537046,0.13930383511108957,-0.42769425046894594,0.050255836724953186
49,2020-04-20 00:00:00,-0.0205952639582881,230.15,230.38,231.59,229.58,0.7333333333333333,0.010054921269270878,0.06988462429663045,-0.6525362525458654,-0.31303448554460434
50,2020-04-21 00:00:00,0.0014639989352735,225.41,230.34,230.34,224.93,0.8,-0.021221067564080265,0.11147350028746139,-0.719756863178583,0.3563456450955962
51,2020-04-22 00:00:00,-0.001550456277133,225.74,225.61,226.03,221.31,1.0,0.022257713039303795,0.09897964445918994,-0.6036698005964573,0.12080402577273296
52,2020-04-23 00:00:00,-0.0060339855361816,225.39,225.79,227.01,224.9,1.0,-0.000829698712252025,0.11591171126628463,-0.6016952766124002,0.2810475659176396
53,2020-04-24 00:00:00,0.0179886622327366,224.03,225.44,225.51,222.49,1.0,-0.010836579128747026,0.04070285591883405,-0.5551234244303347,-0.3106293329112727
54,2020-04-25 00:00:00,0.0179886622327366,224.03,225.44,225.51,222.49,1.0,0.01657897115111151,0.08692812928102178,-0.4509781445237592,-0.10827507704365182
55,2020-04-26 00:00:00,0.0179886622327366,224.03,225.44,225.51,222.49,1.0,0.1843001914315181,0.1838735330861967,0.5194483776939329,0.5857939512965992
56,2020-04-27 00:00:00,0.0076295711654828,228.06,223.98,228.27,223.96,1.0,0.15754943843009706,0.3163485362749352,0.5416638603338001,1.3075676891033057
57,2020-04-28 00:00:00,0.0090948651000869,229.8,228.22,230.63,227.05,1.0,0.04858607012474536,1.2007708176694027,-0.0266164872306421,7.190016961894697
58,2020-04-29 00:00:00,0.0203113545215404,231.89,229.76,231.98,229.2,1.0,0.053604915928678665,0.14719820216898594,-0.24517339362117666,0.3527868180192446
59,2020-04-30 00:00:00,-0.0021978021978021,236.6,231.64,237.25,231.64,1.0,0.0,0.0,0.0,0.0
60,2020-05-01 00:00:00,-0.0260928498813962,236.08,237.3,237.3,235.87,1.0,0.0,0.0,0.0,0.0
61,2020-05-02 00:00:00,-0.0260928498813962,236.08,237.3,237.3,235.87,1.0,0.0,0.0,0.0,0.0
62,2020-05-03 00:00:00,-0.0260928498813962,236.08,237.3,237.3,235.87,1.0,0.0,0.0,0.0,0.0
63,2020-05-04 00:00:00,0.0086551844119694,229.92,236.68,236.68,228.3,1.0,0.0,0.0,0.0,0.0
64,2020-05-05 00:00:00,0.0088396360657151,231.91,229.88,232.86,229.84,0.75,0.0,0.0,0.0,0.0
65,2020-05-06 00:00:00,-0.0002137117455975,233.96,231.96,234.47,231.6,1.0,0.0,0.0,0.0,0.0
66,2020-05-07 00:00:00,0.0029498525073746,233.91,234.3,234.3,233.16,1.0,-0.11368139779556774,0.24555497394476156,-1.4399356307300046,1.123888947320713
67,2020-05-08 00:00:00,0.0099317988064791,234.6,233.06,235.22,232.86,1.0,-0.1078198039296856,0.49151543952703225,-1.1876095512061235,1.9683348474010958
68,2020-05-09 00:00:00,0.0099317988064791,234.6,233.06,235.22,232.86,1.0,-0.09385897903590568,0.7846040214720587,-0.8385300423311475,4.348181900096322
69,2020-05-10 00:00:00,0.0099317988064791,234.6,233.06,235.22,232.86,1.0,-0.08578162574296577,0.7688316376237685,-0.7266649897027804,3.8942167249852933
70,2020-05-11 00:00:00,-0.0081458658675558,236.93,234.65,237.16,234.59,1.0,-0.07931124526792566,0.8364780544513142,-0.8140550765697193,1.7374681420502738
71,2020-05-12 00:00:00,-0.0083404255319149,235.0,236.95,237.05,234.05,1.0,-0.09191155849423716,1.078141161288169,-0.8730496334718133,4.081454937657989
72,2020-05-13 00:00:00,-0.0166924133196017,233.04,235.05,235.13,232.46,1.0,-0.060514847069077504,0.8667370673421333,-0.5383575703411843,1.95149298685245
73,2020-05-14 00:00:00,0.0017019419594151,229.15,233.29,233.29,228.41,0.0,0.0,0.0,0.0,0.0
74,2020-05-15 00:00:00,0.016554848828091,229.54,228.87,231.04,228.76,1.0,0.0,0.0,0.0,0.0
75,2020-05-16 00:00:00,0.016554848828091,229.54,228.87,231.04,228.76,1.0,0.030807954698659046,0.37765074160854084,-0.3715609837346393,0.9135174861740709
76,2020-05-17 00:00:00,0.016554848828091,229.54,228.87,231.04,228.76,1.0,-0.04174593594102216,0.03153932085739175,-0.7748005250614716,-0.3107474831950476
77,2020-05-18 00:00:00,0.0149995714408159,233.34,229.54,233.42,229.48,1.0,-0.07696176797672472,-0.055633855832773804,-0.9463833842649778,-0.9731680845824835
78,2020-05-19 00:00:00,-0.0005488937679445,236.84,232.86,238.32,232.86,1.0,-0.0471383417764617,-0.10363028548947462,-0.6637847117106203,-1.0836825028999808
79,2020-05-20 00:00:00,0.0031261881627306,236.71,237.12,237.15,234.93,0.6666666666666666,-0.054254850696208834,-0.10792796876371025,-0.7881007951819047,-1.3019797661759138
80,2020-05-21 00:00:00,-0.015540113708149,237.45,236.72,238.47,236.33,0.5,-0.06530182502328241,-0.09042957310542654,-0.801783346795945,-1.1110975890028802
81,2020-05-22 00:00:00,-0.0001283367556468,233.76,237.45,237.51,232.7,1.0,-0.019760255429811302,0.09083859520873538,-0.8013243434483079,0.3480319724583061
82,2020-05-23 00:00:00,-0.0001283367556468,233.76,237.45,237.51,232.7,1.0,0.04423195345954234,0.15960918031690863,-0.2392619393471775,0.7014689448443816
83,2020-05-24 00:00:00,-0.0001283367556468,233.76,237.45,237.51,232.7,1.0,0.15102810643965547,0.15393400195742135,0.12433313068241343,0.40391794755385385
84,2020-05-25 00:00:00,0.0184400804346896,233.73,233.76,233.8,233.66,0.0,0.09178715402044269,0.1383127588114048,-0.2174735872173245,0.316180309985998
85,2020-05-26 00:00:00,-0.0058393547302973,238.04,233.81,238.28,233.65,0.3333333333333333,0.03440221406981614,0.12478743603623688,-0.41897932706728896,0.0511218450499892
86,2020-05-27 00:00:00,-0.0052398056201141,236.65,238.16,238.87,235.41,0.0,0.08108264709358792,-0.020401646850392474,-0.14384128925499348,-1.0056518066795612
87,2020-05-28 00:00:00,0.0058621129093921,235.41,236.62,237.5,235.38,1.0,0.05621751250013585,-0.01179173467255712,-0.44961850989239155,-0.7981544067729955
88,2020-05-29 00:00:00,0.0146121035516702,236.79,235.44,236.83,233.28,1.0,0.04126294629540439,-0.002863331163172944,-0.2832160653802323,-0.532174833962738
89,2020-05-30 00:00:00,0.0146121035516702,236.79,235.44,236.83,233.28,1.0,0.07063170500186633,0.021039849665235977,-0.25350093615935904,-0.5013748724571505
90,2020-05-31 00:00:00,0.0146121035516702,236.79,235.44,236.83,233.28,1.0,0.035688205531546835,0.036531675639533745,-0.3564286903348098,-0.29687537668166775
91,2020-06-01 00:00:00,0.0235171696149844,240.25,236.77,241.67,236.68,1.0,0.021080708371666645,0.0594781726883733,-0.41529299382828405,-0.10004195359512003
92,2020-06-02 00:00:00,0.031272875152501,245.9,240.37,245.95,240.16,1.0,0.03867461999265576,0.11438001129750841,-0.20999880861972134,0.24213247030550344
93,2020-06-03 00:00:00,-0.0007098071690524,253.59,246.05,253.64,245.79,1.0,0.0753737530373515,0.07261766841391104,-0.35280287289806816,-0.2955981749416011
94,2020-06-04 00:00:00,0.0180340160214672,253.41,253.74,257.84,252.03,1.0,0.5161365892642857,-0.1269718851052044,3.3997458888493908,-0.746213176614128
95,2020-06-05 00:00:00,0.015698891386929,257.98,253.44,258.08,253.33,1.0,0.0,0.0,0.0,0.0
96,2020-06-06 00:00:00,0.015698891386929,257.98,253.44,258.08,253.33,1.0,0.0,0.0,0.0,0.0
97,2020-06-07 00:00:00,0.015698891386929,257.98,253.44,258.08,253.33,1.0,0.0,0.0,0.0,0.0
98,2020-06-08 00:00:00,-0.0029767583864441,262.03,257.9,262.62,257.88,0.0,0.0,0.0,0.0,0.0
99,2020-06-09 00:00:00,0.0033684210526315,261.25,261.8,265.15,260.71,1.0,0.0,0.0,0.0,0.0
100,2020-06-10 00:00:00,-0.0354022813107999,262.13,261.4,263.82,261.22,1.0,-0.02978715808897281,0.15083857189543615,-0.5464548941262289,0.002155250311598417
101,2020-06-11 00:00:00,-0.0031243820446904,252.85,261.8,262.2,252.56,0.0,-0.09757934988072314,0.051401916003302794,-1.287453104202247,-0.31548619707748565
102,2020-06-12 00:00:00,-0.0192414504483059,252.06,252.99,253.08,244.88,0.7142857142857143,-0.02860694585634249,0.18559441782798114,-0.6045652862173416,0.11067806635025286
103,2020-06-13 00:00:00,-0.0192414504483059,252.06,252.99,253.08,244.88,0.7142857142857143,0.008250158423669163,-0.005916909590058417,-0.5081099854926975,-0.3763360711823468
104,2020-06-14 00:00:00,-0.0192414504483059,252.06,252.99,253.08,244.88,0.7142857142857143,-0.030042388772354656,-0.029357925605842716,-0.9425731587924562,-0.7211814057699569
105,2020-06-15 00:00:00,0.0240281542008818,247.21,252.42,252.42,245.45,0.0,-0.021017656244858074,-0.009618855981788244,-0.6546653074600927,-0.5606488735034217
106,2020-06-16 00:00:00,0.0060043452498517,253.15,246.53,253.97,246.53,1.0,-0.013688041673279194,0.01946487849839329,-0.6972973431321676,-0.4995757887200673
107,2020-06-17 00:00:00,-0.0030235206345465,254.67,253.13,254.93,251.31,1.0,0.10292783902012648,-0.012181649427105867,-0.09515783314492647,-0.5142641734087231
108,2020-06-18 00:00:00,-0.0093343836155967,253.9,254.68,255.02,252.68,0.5,-0.03728978832718077,0.006869755523815968,-0.7645336909943309,-0.4410224394424881
109,2020-06-19 00:00:00,0.0029419949906572,251.53,254.08,254.08,251.28,1.0,-0.09231694839725524,0.14387933031207734,-1.0125748136380286,0.14505048281918548
110,2020-06-20 00:00:00,0.0029419949906572,251.53,254.08,254.08,251.28,1.0,-0.04631868074758394,-0.03314635751371853,-0.7669491118293876,-0.8482613992487016
111,2020-06-21 00:00:00,0.0029419949906572,251.53,254.08,254.08,251.28,1.0,-0.07779464608812336,0.06092583929137163,-1.0335677653270847,-0.3485380752847048
112,2020-06-22 00:00:00,0.0030126451817496,252.27,251.91,252.37,250.58,1.0,-0.0693951959864405,0.06922232176961707,-0.9432044940280974,-0.10895051508886049
113,2020-06-23 00:00:00,-0.0112239655376832,253.03,251.99,254.35,249.63,1.0,-0.0472508319740621,0.07452819231667807,-0.7712784695985654,-0.21434899709406804
114,2020-06-24 00:00:00,-0.0120708261721092,250.19,253.09,254.23,249.41,1.0,0.08954516939339818,0.20254462705639042,0.3339837529849038,0.4190556282389194
115,2020-06-25 00:00:00,0.0062709875793988,247.17,250.77,250.77,245.63,0.0,0.10079999742660295,0.5401220872780197,0.19547628569627998,3.0180031395794438
116,2020-06-26 00:00:00,-0.0067947893213251,248.72,247.14,249.84,247.11,1.0,0.015789072790776792,0.14406062481767012,-0.397605741720269,-0.061079324505677574
117,2020-06-27 00:00:00,-0.0067947893213251,248.72,247.14,249.84,247.11,1.0,-0.041674723271869496,0.042362784220255634,-0.7325161334457904,-0.3294230259593551
118,2020-06-28 00:00:00,-0.0067947893213251,248.72,247.14,249.84,247.11,1.0,0.01924131763198922,0.12946723042218,-0.4444677331326174,0.3334849984271834
119,2020-06-29 00:00:00,0.0036837631056956,247.03,248.53,248.76,245.0,1.0,-0.010167913659883787,0.026097632394058934,-0.4640623346036318,-0.6177011833667277
120,2020-06-30 00:00:00,0.0148019682181173,247.94,246.84,250.22,246.84,0.75,0.002783673446150381,-0.02440313896130686,-0.55362195925771,-0.8309924666230252
121,2020-07-01 00:00:00,0.0132745121418066,251.61,247.77,252.31,247.77,0.0,-0.055381896247507,-0.009260143347779248,-0.729382273603821,-0.6083440052974803
122,2020-07-02 00:00:00,0.0050598156501275,254.95,251.66,255.49,250.81,1.0,-0.09208528886595069,0.005360833025867429,-1.2170239423250997,-0.7147048561228673
123,2020-07-03 00:00:00,0.0083515454261629,256.24,254.94,256.78,254.91,1.0,0.042465452546635696,-0.04205518494224769,-0.35768807482631537,-0.9839972057458761
124,2020-07-04 00:00:00,0.0083515454261629,256.24,254.94,256.78,254.91,1.0,0.19349026513682777,0.06768651155494965,0.624490979174424,-0.21205946508938525
125,2020-07-05 00:00:00,0.0083515454261629,256.24,254.94,256.78,254.91,1.0,0.3479360439858086,0.08256342490897284,2.0233665235196696,-0.04004487974441268
126,2020-07-06 00:00:00,-0.0116108057899218,258.38,256.24,260.8,256.19,0.0,0.3916786991133625,0.09661854473721343,2.3723143000148847,0.34059609860350054
127,2020-07-07 00:00:00,0.015897877672488,255.38,258.41,259.93,255.09,0.0,0.2754098757803094,0.0377808493639904,2.3459510137541084,-0.4656808867794742
128,2020-07-08 00:00:00,-0.006359851988899,259.44,255.43,260.03,254.92,1.0,0.02388491124307901,0.030318128162456937,-0.2646048584154593,-0.3730580051035084
129,2020-07-09 00:00:00,-0.0025602234376819,257.79,259.22,260.2,256.74,1.0,0.08075532444642075,0.05991343488392342,-0.21965856982212456,-0.2191394178635378
130,2020-07-10 00:00:00,-0.0126784116983626,257.13,257.71,257.89,256.41,1.0,0.10593450179285213,0.06126530071225833,0.10345384498425687,-0.20075378564736146
131,2020-07-11 00:00:00,-0.0126784116983626,257.13,257.71,257.89,256.41,1.0,0.11695982517388348,0.002826642623693587,0.19107954040486433,-0.5450841244786235
132,2020-07-12 00:00:00,-0.0126784116983626,257.13,257.71,257.89,256.41,1.0,0.0931947805669866,0.016886898941194772,0.018896637593327898,-0.6645830293030119
133,2020-07-13 00:00:00,-0.0037026824752826,253.87,257.15,258.89,253.91,1.0,0.08685798642673248,0.034135132446632355,-0.018527521364410028,-0.42114158599430007
134,2020-07-14 00:00:00,0.0110702565927331,252.93,254.38,254.38,250.79,1.0,0.00689534577288331,0.056102022291364406,-0.6330234981759519,-0.3868296691739195
135,2020-07-15 00:00:00,-0.014624799593321,255.73,252.45,256.54,252.45,1.0,0.07379714014895544,0.10336798176033923,0.24841812803974947,0.04244579323011087
136,2020-07-16 00:00:00,0.0005555776022857,251.99,255.86,256.81,251.47,0.0,0.0,0.0,0.0,0.0
137,2020-07-17 00:00:00,0.006623567207393,252.13,252.56,253.58,251.75,1.0,0.0,0.0,0.0,0.0
138,2020-07-18 00:00:00,0.006623567207393,252.13,252.56,253.58,251.75,1.0,-0.011574050783829115,-0.03872735108985914,-0.44735118464660817,-0.7617963639694675
139,2020-07-19 00:00:00,0.006623567207393,252.13,252.56,253.58,251.75,1.0,-0.0378717386756815,-0.10886517204840374,-0.4937209538803258,-0.9815444558775664
140,2020-07-20 00:00:00,0.0055555555555555,253.8,252.04,254.52,250.32,1.0,-0.035595311594139645,-0.11633407779643967,-0.5029811609901494,-1.388425788611351
141,2020-07-21 00:00:00,-0.0115199247678382,255.21,253.8,256.7,253.76,1.0,0.04378665212118449,-0.05650354039730843,0.03773644157937421,-0.7112298059419836
142,2020-07-22 00:00:00,0.0015459626590557,252.27,254.69,255.21,251.85,1.0,0.058781093091356595,0.230397040753604,0.0442930623257779,1.2570077009282297
143,2020-07-23 00:00:00,-0.0140900815324942,252.66,252.55,254.85,252.14,0.6666666666666666,0.07645609340131632,0.054043784830541064,0.024369873534769968,-0.20363243221251606
144,2020-07-24 00:00:00,0.0067442794058611,249.1,252.8,252.8,247.77,1.0,0.037296279698510126,-0.00022894547622076544,-0.39813077453288476,-0.36242329454900724
145,2020-07-25 00:00:00,0.0067442794058611,249.1,252.8,252.8,247.77,1.0,-0.04841278275967564,0.10323159263546744,-0.5907722351352933,-0.08016426216454997
146,2020-07-26 00:00:00,0.0067442794058611,249.1,252.8,252.8,247.77,1.0,0.4110254173103254,-0.05750320216461935,3.5202614348327956,-0.7295029913317699
147,2020-07-27 00:00:00,0.0032697982295238,250.78,249.1,251.07,248.19,1.0,0.42443808385851334,-0.06468887565676251,3.628598890041834,-0.7126821451547974
148,2020-07-28 00:00:00,0.0019872813990461,251.6,250.77,253.03,250.72,1.0,0.41581385471775967,-0.06600195934848241,2.2112609585841665,-1.0450132626254276
149,2020-07-29 00:00:00,-0.0102340341134469,252.1,251.82,252.42,250.18,1.0,0.4706545696375741,-0.05550110169722444,2.626744966180602,-0.8471933908542574
150,2020-07-30 00:00:00,-0.0010820775889708,249.52,251.77,252.19,246.71,1.0,0.42074502906450206,-0.02523745676264788,1.0227392458133346,-0.4481366223584357
151,2020-07-31 00:00:00,0.0011233701103309,249.25,248.7,250.53,248.7,1.0,0.34439911697837733,0.2604724711772328,1.317126017467109,1.2010727955754974
152,2020-08-01 00:00:00,0.0011233701103309,249.25,248.7,250.53,248.7,1.0,0.0,0.0,0.0,0.0
153,2020-08-02 00:00:00,0.0011233701103309,249.25,248.7,250.53,248.7,1.0,0.0,0.0,0.0,0.0
154,2020-08-03 00:00:00,0.0137859175249468,249.53,249.81,249.96,246.09,1.0,0.0,0.0,0.0,0.0
155,2020-08-04 00:00:00,0.0153773174684745,252.97,249.53,253.26,249.48,1.0,0.0,0.0,0.0,0.0
156,2020-08-05 00:00:00,0.000155726855096,256.86,252.52,257.14,252.52,1.0,0.0,0.0,0.0,0.0
157,2020-08-06 00:00:00,-0.0145192681977422,256.9,257.13,259.6,256.65,1.0,0.0,0.0,0.0,0.0
158,2020-08-07 00:00:00,-0.0067543547813721,253.17,256.87,256.92,252.73,0.0,0.0,0.0,0.0,0.0
159,2020-08-08 00:00:00,-0.0067543547813721,253.17,256.87,256.92,252.73,0.0,0.0,0.0,0.0,0.0
160,2020-08-09 00:00:00,-0.0067543547813721,253.17,256.87,256.92,252.73,0.0,-0.0517760105641365,0.15238944204650462,-1.4267781599035647,0.7078208456875509
161,2020-08-10 00:00:00,-0.0036586335798934,251.46,253.19,254.95,250.88,0.0,0.011147785426534718,0.14159510903901662,-0.5444572881583026,0.6588493660587877
162,2020-08-11 00:00:00,0.0140496527500599,250.54,251.56,252.6,249.42,1.0,0.0,0.0,0.0,0.0
163,2020-08-12 00:00:00,0.0110997402188459,254.06,250.7,254.55,248.87,0.0,0.1309611527857264,0.11140643036843034,0.08251027188164677,0.4756734347693697
164,2020-08-13 00:00:00,-0.005138586110246,256.88,254.12,257.67,254.02,1.0,0.18212699905564378,0.020697973860118957,0.5022861118176976,-0.44136374956110475
165,2020-08-14 00:00:00,0.0033651588668023,255.56,257.19,257.67,255.03,1.0,-0.008253966296303261,-0.029296118941637417,-1.0000233881369054,-0.5772105111146003
166,2020-08-15 00:00:00,0.0033651588668023,255.56,257.19,257.67,255.03,1.0,-0.0001914144263803763,-0.029202128342184608,-0.7885077075729714,-0.8238063324581522
167,2020-08-16 00:00:00,0.0033651588668023,255.56,257.19,257.67,255.03,1.0,0.054040763292142024,0.060823925849257776,-0.37165924709622256,-0.12083304835802579
168,2020-08-17 00:00:00,0.0074097184306995,256.42,255.57,256.53,254.0,1.0,0.07732148938986771,0.08739067972526726,-0.028021997471328167,-0.08670543396526875
169,2020-08-18 00:00:00,0.0043744193248683,258.32,256.38,260.14,255.03,1.0,0.1048338335345056,0.16197757382035238,-0.08479255300477173,0.26402089109518834
170,2020-08-19 00:00:00,-0.0093659664675274,259.45,258.28,260.29,257.77,0.0,0.034935987126770485,0.9339332052754923,-0.04652138454637017,2.395513009993009
171,2020-08-20 00:00:00,-0.0045521749280211,257.02,259.6,259.64,254.95,0.0,0.06733437550388288,0.1607654566658807,-0.3634117740554341,0.20711490140271455
172,2020-08-21 00:00:00,0.0037912839554426,255.85,256.71,258.72,255.41,1.0,-0.04345289613104786,0.6153276659192066,-0.9342281918631898,2.4205397445199317
173,2020-08-22 00:00:00,0.0037912839554426,255.85,256.71,258.72,255.41,1.0,0.27760183345144807,0.8276216511821204,0.7394704378067651,3.9968987869405983
174,2020-08-23 00:00:00,0.0037912839554426,255.85,256.71,258.72,255.41,1.0,0.5792515074317457,1.5014609256219975,3.7597902985735088,5.67974246637156
175,2020-08-24 00:00:00,0.0105521376839809,256.82,255.69,257.3,255.29,1.0,0.5602830824455065,1.5495141970780004,3.1513879678041326,9.545937799753693
176,2020-08-25 00:00:00,0.0001155935729974,259.53,256.95,260.01,256.79,1.0,0.6000286317165759,1.6983498483938249,2.849009421800204,12.500664606053157
177,2020-08-26 00:00:00,-0.0137925720449992,259.56,259.49,260.52,257.23,1.0,0.418276632781339,1.1205675076872215,2.8915433019634023,7.557306695077694
178,2020-08-27 00:00:00,0.0061723572154075,255.98,259.51,260.12,255.33,0.6666666666666666,0.3377108277611036,0.15009036526297592,1.932032036447559,0.25078198321621364
179,2020-08-28 00:00:00,-0.0009318217114459,257.56,255.94,260.53,255.92,1.0,0.05588658869084284,0.17257506166386882,-0.07319728691198474,0.3942437698095612
180,2020-08-29 00:00:00,-0.0009318217114459,257.56,255.94,260.53,255.92,1.0,0.0009868829559991354,0.1224201648252401,-0.5717645378593347,0.17997842251510582
181,2020-08-30 00:00:00,-0.0009318217114459,257.56,255.94,260.53,255.92,1.0,-0.09997183406177257,0.022748320584382586,-0.7387052311810114,-0.2107983732997349
182,2020-08-31 00:00:00,0.0115031866936109,257.32,257.51,259.46,256.74,0.0,-0.08832884650475847,0.031603748245379926,-0.94137907226623,-0.48340543498298266
183,2020-09-01 00:00:00,-0.0010757645612416,260.28,257.51,260.39,255.4,1.0,-0.06940436384604887,-0.06627928244062531,-0.8278840794976168,-0.957885656485104
184,2020-09-02 00:00:00,-0.0133076923076922,260.0,260.57,261.83,258.73,1.0,0.17494864638790464,-0.08941161411406151,0.4286956811331716,-1.0698801657847334
185,2020-09-03 00:00:00,-0.0102907928588134,256.54,260.0,260.34,255.72,1.0,0.41137364204147,-0.035760905980242175,2.91366131212464,-0.6137925588863689
186,2020-09-04 00:00:00,0.0016148089799133,253.9,256.66,256.66,252.23,1.0,0.24499685476778144,-0.032703215142375175,0.722544329333187,-0.901062661515748
187,2020-09-05 00:00:00,0.0016148089799133,253.9,256.66,256.66,252.23,1.0,0.489622190210083,-0.06095531346629057,2.149377416386116,-0.6236501536988733
188,2020-09-06 00:00:00,0.0016148089799133,253.9,256.66,256.66,252.23,1.0,0.4022268821524353,-0.06387349289860023,2.4855857329775173,-0.7342069392522109
189,2020-09-07 00:00:00,-0.0093193346702843,254.31,253.47,254.88,253.42,0.0,0.4246238854600062,-0.07136263125023845,2.9806392448432537,-0.7504694248349771
190,2020-09-08 00:00:00,0.0021433674684448,251.94,254.32,255.77,251.52,0.0,0.46217155223013595,0.0018824145773956857,1.6265721776940043,-0.7784202028088193
191,2020-09-09 00:00:00,-0.0053469581749049,252.48,252.34,252.79,249.53,1.0,0.14365908363375812,0.07090359426042525,0.27771526989867934,-0.2709077339583852
192,2020-09-10 00:00:00,0.0003583801218492,251.13,252.47,253.51,250.83,1.0,0.06228442587760341,-0.019236876561562255,-0.043102680227301154,-0.6625699790677605
193,2020-09-11 00:00:00,0.0078815380941007,251.22,251.66,252.12,250.09,1.0,0.11028418301252074,-0.04805082176789188,0.025338713805095652,-1.073056804964969
194,2020-09-12 00:00:00,0.0078815380941007,251.22,251.66,252.12,250.09,1.0,0.004807879607324317,0.008625488300104678,-0.6484696852974107,-0.47998526988496404
195,2020-09-13 00:00:00,0.0078815380941007,251.22,251.66,252.12,250.09,1.0,0.036651699317750364,0.09338510773956266,-0.3669080030339452,-0.30138936875436545
196,2020-09-14 00:00:00,0.0043443917851501,253.2,251.35,253.45,250.7,1.0,0.030465920504661348,0.20280482046375425,-0.40397835761722317,0.6667952775825265
197,2020-09-15 00:00:00,0.000432559968541,254.3,253.24,254.7,253.03,1.0,0.004999547365943435,0.8461762251981924,-0.5315595997953874,4.657372484328067
198,2020-09-16 00:00:00,0.0014150387170316,254.41,254.28,255.43,254.23,0.0,0.002390740648448464,0.12085336380703282,-0.3970116473660674,0.21301883266941513
199,2020-09-17 00:00:00,-0.0019233033716685,254.77,254.63,255.97,252.68,0.0,-0.08413205530792123,0.2496370837758839,-0.7588017995581599,1.219408076997644
200,2020-09-18 00:00:00,-0.0023202768601541,254.28,254.68,255.49,253.31,1.0,-0.07303496337332582,0.22391990695946795,-0.8458671114670001,0.04981288129542059
201,2020-09-19 00:00:00,-0.0023202768601541,254.28,254.68,255.49,253.31,1.0,0.012448553305632437,0.1370860455715377,-0.23784698511141347,0.0003008550302969234
202,2020-09-20 00:00:00,-0.0023202768601541,254.28,254.68,255.49,253.31,1.0,-0.05051703226657711,0.028042667926549747,-0.5149117825343232,-0.35446527691547325
203,2020-09-21 00:00:00,-0.0050849461941739,253.69,254.57,255.45,251.14,1.0,-0.07601231071912107,-0.022387293818153964,-1.218212189651059,-0.508438090608451
204,2020-09-22 00:00:00,0.0017432646592709,252.4,253.67,253.73,250.5,0.0,0.03904736247226026,-0.0535766682096952,-0.3479515157443076,-1.096377753481025
205,2020-09-23 00:00:00,-0.004469229552286,252.84,252.34,255.45,252.09,1.0,0.026966296433147185,0.025568698054922123,-0.37812463895633824,-0.20493184242746823
206,2020-09-24 00:00:00,0.0116006515434428,251.71,253.23,253.23,249.14,1.0,0.06365773639476746,-0.03763213160769219,-0.2350598965955236,-0.7390393483430254
207,2020-09-25 00:00:00,0.0097396221969132,254.63,251.59,255.41,251.57,1.0,0.16213682456988288,-0.030688838817359176,0.46732015534223365,-0.917314844274204
208,2020-09-26 00:00:00,0.0097396221969132,254.63,251.59,255.41,251.57,1.0,-0.02767392858510309,-0.08330829789450167,-0.5214638021390757,-0.8375785252435741
209,2020-09-27 00:00:00,0.0097396221969132,254.63,251.59,255.41,251.57,1.0,-0.058398717273728806,-0.07100044703543418,-0.7938512579618032,-0.913703356531601
210,2020-09-28 00:00:00,-0.0105402356967835,257.11,254.17,257.65,254.17,0.0,-0.05893398491416235,-0.07361364097109924,-0.8686702431515336,-1.317127790908941
211,2020-09-29 00:00:00,-0.002437106918239,254.4,256.73,258.43,254.15,0.0,-0.009497392629816304,-0.01861716149450654,-0.5220322746966591,-0.6045461489619646
212,2020-09-30 00:00:00,0.0182047442666875,253.78,254.21,256.13,253.74,1.0,0.004943281405969557,0.029207960788093956,-0.538177516271712,-0.20861988284128516
213,2020-10-01 00:00:00,-0.0075077399380804,258.4,253.76,258.41,253.71,1.0,0.10777050502755792,0.13102609595349346,0.038620124429891836,0.15042932881019652
214,2020-10-02 00:00:00,0.0063167745457381,256.46,258.21,258.79,255.91,1.0,0.055585775832926565,0.1709185880456614,-0.18714047457230054,0.2297807553885303
215,2020-10-03 00:00:00,0.0063167745457381,256.46,258.21,258.79,255.91,1.0,0.1657915265029306,0.018220614637566968,0.41417453630378237,-0.4601112268784521
216,2020-10-04 00:00:00,0.0063167745457381,256.46,258.21,258.79,255.91,1.0,0.23356411584104553,-0.000530032697991345,0.7335290350754138,-0.44954426433288325
217,2020-10-05 00:00:00,0.0111980781153132,258.08,256.6,259.36,256.36,1.0,0.4028320024727048,0.021277945576644086,2.166471077380921,-0.46795473750699795
218,2020-10-06 00:00:00,0.0057477871019657,260.97,258.13,262.53,258.05,0.5,0.670890945095465,0.05420123037027835,2.066956836414645,-0.24996763105474645
219,2020-10-07 00:00:00,0.0046100506724577,262.47,261.74,263.71,260.31,1.0,0.3636715876356549,0.2728005146524328,2.490955976013755,0.8896151287492347
220,2020-10-08 00:00:00,0.0004930218446601,263.68,262.48,264.47,261.89,-1.0,0.07896018143265415,-0.07835491951321671,0.248932497864693,-1.0040583443087698
221,2020-10-09 00:00:00,0.0013267124066563,263.81,263.55,264.14,262.12,1.0,-0.1584889681250088,0.8682268802249045,-1.6713752138506306,3.5953906539573888
222,2020-10-10 00:00:00,0.0013267124066563,263.81,263.55,264.14,262.12,1.0,0.02813800584275228,0.8315483849394876,-0.13911139769187322,3.830055160188593
223,2020-10-11 00:00:00,0.0013267124066563,263.81,263.55,264.14,262.12,1.0,0.022274598089309983,0.24788572216787763,-0.21186717002599678,0.8099405403756574
224,2020-10-12 00:00:00,0.0123031496062992,264.16,263.99,266.76,263.81,1.0,-0.02351996507703369,0.07012098431802327,-0.5203452376626211,-0.23849673665991664
225,2020-10-13 00:00:00,-0.0105829998878128,267.41,264.28,267.42,263.95,1.0,-0.045492506475270034,-0.0330294090892056,-0.6851214888372011,-0.46160956453060326
226,2020-10-14 00:00:00,-0.0049890392319902,264.58,267.37,267.51,264.24,0.0,0.04265520483186336,-0.09418329769799705,-0.4280778015894966,-0.8892859009241302
227,2020-10-15 00:00:00,0.0013674694218643,263.26,264.69,264.71,260.71,1.0,-0.04329875161070351,-0.015695986978015775,-0.5515283226126574,-0.47760489147288204
228,2020-10-16 00:00:00,-0.0008724679462863,263.62,263.03,266.01,263.03,1.0,0.09117272028296597,0.09673433438928569,-0.33914806431190925,-0.21903934029030586
229,2020-10-17 00:00:00,-0.0008724679462863,263.62,263.03,266.01,263.03,1.0,0.10400385110060917,0.9545257731246952,-0.16873440291367042,1.6989670200429547
230,2020-10-18 00:00:00,-0.0008724679462863,263.62,263.03,266.01,263.03,1.0,0.07698745907274951,1.6274735821034536,-0.21995045032324176,3.4628005856109256
231,2020-10-19 00:00:00,-0.0004555981624207,263.39,263.61,264.98,263.18,1.0,0.07077000227155938,1.61475705339788,-0.41828957536231454,3.2834562715018465
232,2020-10-20 00:00:00,-0.0005697572833971,263.27,263.64,264.28,261.75,1.0,0.05643885039935448,1.6353474827732395,-0.2336531394659705,4.3995215995911305
233,2020-10-21 00:00:00,-0.0073350562480997,263.12,263.28,264.82,261.81,1.0,0.029729674575103893,1.614984157755532,-0.46942673547973024,5.937574830708536
234,2020-10-22 00:00:00,0.0045943565986446,261.19,263.14,263.74,260.56,1.0,0.5289237432971956,2.3884468471739986,2.0610836561125914,9.754801524422422
235,2020-10-23 00:00:00,-0.0087274667479704,262.39,261.14,262.31,260.92,1.0,0.0,0.0,0.0,0.0
236,2020-10-24 00:00:00,-0.0087274667479704,262.39,261.14,262.31,260.92,1.0,0.0,0.0,0.0,0.0
237,2020-10-25 00:00:00,-0.0087274667479704,262.39,261.14,262.31,260.92,1.0,0.0,0.0,0.0,0.0
238,2020-10-26 00:00:00,0.007420222991157,260.1,262.33,262.41,259.12,0.0,0.0,0.0,0.0,0.0
239,2020-10-27 00:00:00,-0.019119948097546,262.03,260.15,262.15,258.35,0.0,0.0,0.0,0.0,0.0
240,2020-10-28 00:00:00,-0.0063030114387984,257.02,262.17,262.19,256.49,0.0,-0.04782956353692569,-0.05443969438456531,-0.795796312483566,-1.037638050123574
241,2020-10-29 00:00:00,-0.0196162881754111,255.4,257.25,257.25,253.8,1.0,0.25912216461404025,-0.07188881070014475,0.869531089491328,-1.457950185319815
242,2020-10-30 00:00:00,0.0053915891209713,250.39,255.15,255.38,249.65,1.0,0.16591488391155185,0.2510088500593044,0.20514214984276685,1.0721691086280662
243,2020-10-31 00:00:00,0.0053915891209713,250.39,255.15,255.38,249.65,1.0,0.0835513291761707,0.08224038155605484,-0.16946840461958151,-0.05337481171722135
244,2020-11-01 00:00:00,0.0053915891209713,250.39,255.15,255.38,249.65,1.0,-0.023756013260750386,0.06108277247391403,-0.6474890420882753,-0.24121342686424663
245,2020-11-02 00:00:00,0.0241121792325414,251.74,250.79,253.61,250.22,1.0,-0.052089546078609494,0.11197538106583238,-0.8847453402743491,1.0935070831484799
246,2020-11-03 00:00:00,0.0192001861836235,257.81,251.67,258.73,251.64,1.0,-0.04429844742243905,0.3835674558882305,-0.9706596165955266,2.5483617362770534
247,2020-11-04 00:00:00,0.0326153143553051,262.76,257.72,262.95,257.7,1.0,0.06442153693606745,0.18053207487084677,-0.20215569545478465,0.37159288778118393
248,2020-11-05 00:00:00,0.000221132937751,271.33,262.67,272.17,262.67,0.0,0.12626533847432064,0.043224561608148804,0.9921085001848127,-0.13674356423636805
249,2020-11-06 00:00:00,-0.0109436604149009,271.39,271.38,271.67,269.09,0.0,0.18065286615394704,0.4319790826210905,0.5345272907483422,0.9577723026573595
250,2020-11-07 00:00:00,-0.0109436604149009,271.39,271.38,271.67,269.09,0.0,0.2577721129325772,0.4486744515154708,2.3015301706318967,0.9714184075126767
251,2020-11-08 00:00:00,-0.0109436604149009,271.39,271.38,271.67,269.09,0.0,1.13037408222585,0.5972319841772045,7.35239384115519,5.522122329039555
252,2020-11-09 00:00:00,0.0073019894195662,268.42,271.3,274.91,267.32,0.0,0.0,0.0,0.0,0.0
253,2020-11-10 00:00:00,0.0181966121754568,270.38,268.44,274.94,268.38,1.0,1.0240326525997494,0.5782928791009088,12.094017510355362,3.6332461960277747
254,2020-11-11 00:00:00,0.0082092262985833,275.3,270.37,275.93,268.13,1.0,0.5629989826253938,0.5490268182681799,2.033884213502974,1.259367005055999
255,2020-11-12 00:00:00,0.0035667963683528,277.56,274.93,277.93,273.63,1.0,0.5628276787562587,0.02772290967588198,4.16320190164506,-0.44553517606073867
256,2020-11-13 00:00:00,0.0076108418596302,278.55,277.73,279.09,275.79,1.0,1.0138995759629514,0.1211710001757016,5.575570764375267,0.13290756356553307
257,2020-11-14 00:00:00,0.0076108418596302,278.55,277.73,279.09,275.79,1.0,0.8835386242137844,0.10074839205488217,4.02156054535369,-0.0624275931821717
258,2020-11-15 00:00:00,0.0076108418596302,278.55,277.73,279.09,275.79,1.0,0.8950365507010405,0.0409488392196824,7.3739524765930184,-0.4831490028144715
259,2020-11-16 00:00:00,-0.0016389354045677,280.67,278.17,282.08,278.17,0.0,0.9576478612075752,0.0088522315989632,3.027836244359699,-0.5351570277072318
260,2020-11-17 00:00:00,-0.0013204382427465,280.21,280.63,285.15,279.65,1.0,0.8400171826198841,0.050220423694169014,2.752143564145434,-0.43956364860144853
261,2020-11-18 00:00:00,0.0054674099485421,279.84,280.13,282.81,279.84,1.0,0.195200750818862,-0.040175962276419064,0.5749553903164301,-0.7984268017765284
262,2020-11-19 00:00:00,0.0199737001101752,281.37,280.34,281.8,278.17,0.0,-0.019049126075047162,0.03776374487928713,-0.4422068189178904,-0.2942106027991537
263,2020-11-20 00:00:00,0.0104881703195232,286.99,281.25,287.32,281.25,1.0,-0.04445491743879515,0.14035143614456125,-0.9256178353683941,-0.015837040979251208
264,2020-11-21 00:00:00,0.0104881703195232,286.99,281.25,287.32,281.25,1.0,-0.11678532625589977,0.06594491195001151,-0.9823108006312251,-0.10111866134540645
265,2020-11-22 00:00:00,0.0104881703195232,286.99,281.25,287.32,281.25,1.0,0.1066715002109837,0.07347358798122361,0.1270897270661084,-0.22113415045286655
266,2020-11-23 00:00:00,0.007103448275862,290.0,287.01,290.57,286.9,0.5,0.1423195180902317,0.23843942931585538,0.16429908725876496,0.7355337303510525
267,2020-11-24 00:00:00,-0.0057522426898582,292.06,289.92,293.8,289.85,1.0,0.13324473265800574,0.2957488822652916,-0.1954589491820662,0.7701403565849538
268,2020-11-25 00:00:00,-0.0028927612094496,290.38,291.78,294.4,289.37,1.0,0.16167586044532545,0.14665589422707814,0.8116131553436124,0.1546734217118151
269,2020-11-26 00:00:00,0.0063549077847619,289.54,290.28,290.41,288.09,0.0,0.7839792155720655,0.18514855959332976,3.0430918178368023,0.5122007776638986
270,2020-11-27 00:00:00,-0.0162674171185393,291.38,289.58,291.44,288.94,1.0,0.7880443432436364,0.08940155653381332,4.290580175117612,-0.03791377440808421
271,2020-11-28 00:00:00,-0.0162674171185393,291.38,289.58,291.44,288.94,1.0,0.37401011446294774,-0.040752119968140654,1.792773004454397,-0.5476636736708631
272,2020-11-29 00:00:00,-0.0162674171185393,291.38,289.58,291.44,288.94,1.0,0.3757634228474007,-0.004098464339644892,1.8629419694324107,-0.47430897882630385
273,2020-11-30 00:00:00,-0.0022327658386826,286.64,291.32,292.16,284.6,0.5,0.3542859357706112,-0.0017145207235120807,1.182520293395551,-0.563169448974975
274,2020-12-01 00:00:00,0.0065034965034965,286.0,286.66,287.75,285.43,0.0,0.15000609313076652,-0.004956899625012667,0.29595057277595704,-0.6519266349766012
275,2020-12-02 00:00:00,-0.0003126519836032,287.86,285.68,288.05,284.82,1.0,0.3263665144183179,0.5531056830480479,0.7397432782143141,3.233093167533974
276,2020-12-03 00:00:00,0.0230739826945131,287.77,287.43,290.46,286.62,0.8333333333333334,0.3547797449592984,0.36412807605879305,2.1862085378505585,0.3227248132120327
277,2020-12-04 00:00:00,-0.0053666655344588,294.41,287.82,295.82,287.77,1.0,0.23330626604434368,0.06383956071322494,0.48574726162703064,-0.2723524217225005
278,2020-12-05 00:00:00,-0.0053666655344588,294.41,287.82,295.82,287.77,1.0,-0.008966101336064014,0.030428710406983583,-0.5681722602673195,-0.40186955578462336
279,2020-12-06 00:00:00,-0.0053666655344588,294.41,287.82,295.82,287.77,1.0,-0.0291512250643855,0.02370012709563163,-0.7764615942785901,-0.3417877141981946
280,2020-12-07 00:00:00,0.0057712666051975,292.83,294.66,295.22,291.89,0.0,-0.03056921850331218,0.04396701181414997,-0.938302351029667,-0.2985953563258888
281,2020-12-08 00:00:00,0.0012902349585766,294.52,293.06,295.08,291.82,1.0,-0.019374884826292238,0.008821959473443997,-1.0345480281656467,-0.5256334736922643
282,2020-12-09 00:00:00,-0.0089860969820277,294.9,294.58,297.99,294.37,1.0,0.016960494383451596,0.008912818240761844,-0.35044038358775104,-0.4961628308887081
283,2020-12-10 00:00:00,-0.0063644140290847,292.25,294.96,294.97,290.79,1.0,0.029995239534128082,-0.02778909545264252,-0.3551705493513337,-0.5944545712799554
284,2020-12-11 00:00:00,0.0091256585970592,290.39,292.01,293.56,289.4,1.0,0.09507983570287326,-0.04462261246848431,-0.203571827725958,-0.6010110243806623
285,2020-12-12 00:00:00,0.0091256585970592,290.39,292.01,293.56,289.4,1.0,0.037283749928299414,-0.020647928030616214,-0.4040438368793932,-0.4823670558419869
286,2020-12-13 00:00:00,0.0091256585970592,290.39,292.01,293.56,289.4,1.0,0.22906451003089945,-0.0033632076938827637,1.8399447191886285,-0.5682822811711842
287,2020-12-14 00:00:00,-0.0040950040950042,293.04,290.27,294.46,290.25,1.0,0.25955354787563945,0.01808693993877064,2.3458173060764707,-0.4003704379166124
288,2020-12-15 00:00:00,0.0113760964912282,291.84,292.97,292.98,291.11,1.0,0.12802917495352606,0.06195621737193591,0.5583566583156627,-0.035971308119301854
289,2020-12-16 00:00:00,0.0019650359127252,295.16,291.8,296.12,291.78,1.0,0.0,0.0,0.0,0.0
290,2020-12-17 00:00:00,0.0015216068167985,295.74,295.12,295.86,293.44,1.0,0.0,0.0,0.0,0.0
291,2020-12-18 00:00:00,-0.0048279820385563,296.19,295.79,296.43,294.82,1.0,0.0,0.0,0.0,0.0
292,2020-12-19 00:00:00,-0.0048279820385563,296.19,295.79,296.43,294.82,1.0,0.0,0.0,0.0,0.0
293,2020-12-20 00:00:00,-0.0048279820385563,296.19,295.79,296.43,294.82,1.0,0.0,0.0,0.0,0.0
294,2020-12-21 00:00:00,-0.000305333152395,294.76,296.3,296.51,293.41,1.0,0.0,0.0,0.0,0.0
295,2020-12-22 00:00:00,-0.0041062883904029,294.67,294.4,295.19,291.53,1.0,0.0,0.0,0.0,0.0
296,2020-12-23 00:00:00,-0.0005792953043002,293.46,294.59,295.57,292.97,0.0,0.0,0.0,0.0,0.0
297,2020-12-24 00:00:00,0.0,293.29,293.39,294.51,292.73,0.0,0.0,0.0,0.0,0.0
298,2020-12-25 00:00:00,-0.0136383783968086,293.29,293.34,293.63,293.1,1.0,-0.04345787888919883,0.08471336089604975,-0.44199955495380905,-0.08798434416069233
299,2020-12-26 00:00:00,-0.0136383783968086,293.29,293.34,293.63,293.1,1.0,0.0362227118080769,0.09469186965019283,-0.260733183839539,-0.058478310541409194
300,2020-12-27 00:00:00,-0.0136383783968086,293.29,293.34,293.63,293.1,1.0,-0.02081779597348099,-0.03433894333328613,-0.7757808776155959,-0.6544150863827115
301,2020-12-28 00:00:00,0.0097134363441529,289.29,293.23,293.85,288.97,0.0,-0.047830186838252686,-0.07322371817464912,-0.8375597666474975,-0.5380359427207905
302,2020-12-29 00:00:00,0.0148236905169461,292.1,289.11,293.16,289.07,0.0,0.0917470431812113,-0.02314264426435919,0.27837881321528685,-0.2765929578713521
303,2020-12-30 00:00:00,-0.0032385386094524,296.43,292.06,296.73,291.81,0.0,0.010471087879595942,-0.038555863390019596,-0.42127861127580357,-0.5442780236934952
304,2020-12-31 00:00:00,0.0,295.47,296.52,296.52,293.84,1.0,0.03367011383009455,-0.03867287902965355,-0.45489746622736965,-0.5984971562858725
305,2021-01-01 00:00:00,0.0009137983551628,295.47,295.49,295.49,295.47,1.0,0.04928692695732817,0.054216390766805844,-0.34237958557765286,-0.1495085939073528
306,2021-01-02 00:00:00,0.0009137983551628,295.47,295.49,295.49,295.47,1.0,0.06355527778334125,0.11238762068127883,-0.26296941214483355,0.19635169849749254
307,2021-01-03 00:00:00,0.0009137983551628,295.47,295.49,295.49,295.47,1.0,0.17471200844053314,0.13199179513782955,0.1715550073393995,0.24611244172253524
308,2021-01-04 00:00:00,0.0064583756001892,295.74,295.25,298.38,294.27,1.0,0.16989553646019484,0.22778465375218637,0.5789715797846136,0.15773968163998422
309,2021-01-05 00:00:00,-0.0058793885435914,297.65,296.07,298.19,293.59,1.0,0.15738189724270057,0.5201016295737668,0.46093478642431585,4.912448171938812
310,2021-01-06 00:00:00,0.024907063197026,295.9,297.48,299.12,295.53,0.0,-0.0043438087019112,0.800592373415073,-0.4479538217854123,2.2973354506291903
311,2021-01-07 00:00:00,0.025521812246513,303.27,295.74,303.78,295.69,1.0,-0.042122625028122584,0.13357108061696543,-0.5810737279678003,0.07922421090354803
312,2021-01-08 00:00:00,-0.0044371563615317,311.01,303.0,312.36,303.0,1.0,0.10114558529300766,1.3829080549701915,-0.26061497818610135,2.365348851938638
313,2021-01-09 00:00:00,-0.0044371563615317,311.01,303.0,312.36,303.0,1.0,0.8164474546795244,-0.13182343232151705,3.0066381697703877,-0.5880399737780704
314,2021-01-10 00:00:00,-0.0044371563615317,311.01,303.0,312.36,303.0,1.0,0.33855197246521307,-0.028880092935533064,2.3024563970893297,-0.5635973799643781
315,2021-01-11 00:00:00,0.008074153021348,309.63,312.45,312.45,308.94,1.0,0.31077929250627623,0.03468224407128062,1.790234672460845,-0.20691786610061322
316,2021-01-12 00:00:00,0.0111492006535738,312.13,309.51,312.13,308.41,1.0,0.25942929772616363,0.11917615413068905,1.1117759137312155,0.3252711616388883
317,2021-01-13 00:00:00,0.0092202401698297,315.61,311.07,316.85,311.07,0.5,0.16839607461369788,0.2823701519078643,0.45240305286205135,1.8493706661491356
318,2021-01-14 00:00:00,-0.003390681903805,318.52,315.48,321.17,315.45,1.0,0.11021381666727326,0.26168893037464525,0.03961594327425283,0.581327901197244
319,2021-01-15 00:00:00,-0.0026461693548386,317.44,318.13,320.1,316.01,1.0,0.12151767852579454,-0.04300789452454801,0.5691720823568791,-0.6473418631348543
320,2021-01-16 00:00:00,-0.0026461693548386,317.44,318.13,320.1,316.01,1.0,0.011312185151749254,-0.026273313431595113,-0.3138389158651507,-0.615793814506841
321,2021-01-17 00:00:00,-0.0026461693548386,317.44,318.13,320.1,316.01,1.0,0.16026281873413684,-0.08388583239808867,1.0765212091855256,-0.8848438776308658
322,2021-01-18 00:00:00,0.0077384712571067,316.6,317.79,317.79,315.68,0.0,0.19462380322102657,-0.07135012312916711,0.6703022871356986,-1.0360396444389108
323,2021-01-19 00:00:00,0.0020686412787963,319.05,316.58,320.31,316.43,0.0,0.2485559290712933,0.008205484980576827,0.21326371603557315,-0.46103718024150453
324,2021-01-20 00:00:00,0.0040036282881362,319.71,318.86,321.53,318.06,0.6666666666666666,0.701826390270508,-0.04989602115419345,3.1052817979365424,-0.8750736362828893
325,2021-01-21 00:00:00,-0.00323997632325,320.99,319.68,322.03,319.02,0.0,1.083867874009714,-0.00844031634639908,5.690382109334908,-0.8744441120080398
326,2021-01-22 00:00:00,-0.0119081106422878,319.95,320.98,321.06,317.64,1.0,0.37332443146968153,0.02865790385068223,0.861150727599948,-0.3454958321258192
327,2021-01-23 00:00:00,-0.0119081106422878,319.95,320.98,321.06,317.64,1.0,0.27029386232229946,0.02355068678304839,0.3923966685361848,-0.5696818682148008
328,2021-01-24 00:00:00,-0.0119081106422878,319.95,320.98,321.06,317.64,1.0,0.13037297627636946,0.019412208186484925,0.09979826124687799,-0.5182656387327464
329,2021-01-25 00:00:00,-0.0230910356171316,316.14,320.09,321.02,314.99,0.6666666666666666,0.08837433776215153,0.0574315664571845,-0.2661459636490649,-0.37823093356815857
330,2021-01-26 00:00:00,-0.0084833570780985,308.84,315.83,316.12,308.54,0.0,0.051378322071311544,0.26602437267503376,-0.2901304520272626,2.3533069578404198
331,2021-01-27 00:00:00,0.0070864084645025,306.22,308.96,312.44,305.51,1.0,0.1104398922962968,0.26151808371959806,0.2345677223838627,1.4068995153823562
332,2021-01-28 00:00:00,-0.0093063977431174,308.39,306.34,311.44,302.7,0.0,0.04354950050085504,-0.028960198998164266,-0.2193072457029482,-0.6563411713905173
333,2021-01-29 00:00:00,0.0209478921183557,305.52,308.34,310.92,303.73,1.0,-0.003655182149049807,0.004334493123757888,-0.555187048845526,-0.3439867833169214
334,2021-01-30 00:00:00,0.0209478921183557,305.52,308.34,310.92,303.73,1.0,0.040333002015587205,0.027027843752094327,-0.3157184272263059,-0.5075126019985148
335,2021-01-31 00:00:00,0.0209478921183557,305.52,308.34,310.92,303.73,1.0,0.19407600534349623,0.014961353380087417,0.24591620992230998,-0.4936883176359758
336,2021-02-01 00:00:00,0.0109964093357271,311.92,306.28,313.11,303.62,1.0,0.22656273748525635,-0.003945305651662068,0.19486030865822979,-0.5330883773497913
337,2021-02-02 00:00:00,0.0075471698113207,315.35,311.76,316.45,311.76,1.0,0.22125453408636275,0.036594282529392785,1.133566672204054,-0.48030296829475305
338,2021-02-03 00:00:00,-0.0026437541308659,317.73,315.25,318.73,315.18,0.0,0.1537176993128675,0.0800888281683374,0.5876022934352761,-0.12855086128136842
339,2021-02-04 00:00:00,0.0135693773864748,316.89,317.29,318.37,314.39,0.0,0.5786746270453529,0.04091738798841682,4.8545503658704465,-0.44054665808678956
340,2021-02-05 00:00:00,0.014633083221769,321.19,316.74,321.84,316.39,1.0,0.4977293731262069,0.11453564579010411,3.366355856471147,-0.019884918338330674
341,2021-02-06 00:00:00,0.014633083221769,321.19,316.74,321.84,316.39,1.0,0.2386709022539364,0.2269715631674396,1.201466621109813,0.6056544457148635
342,2021-02-07 00:00:00,0.014633083221769,321.19,316.74,321.84,316.39,1.0,-0.05454075115148349,0.0037459732611031527,-1.0535708933756138,-0.5253747217812915
343,2021-02-08 00:00:00,0.0128264138206143,325.89,320.87,327.82,320.87,0.0,-0.03617178825634859,-0.05193461377222164,-0.6975785380463868,-0.9341019018731693
344,2021-02-09 00:00:00,-0.0061199139576452,330.07,325.87,331.3,325.75,1.0,0.032758047149703096,-0.0011390171986445097,-0.4507862969548013,-0.5380262397690546
345,2021-02-10 00:00:00,0.0046944063404967,328.05,329.63,331.95,326.12,1.0,0.007247619668426353,0.0019967090129746623,-0.596396087036724,-0.5728930077478723
346,2021-02-11 00:00:00,0.0021238508449893,329.59,328.18,330.5,327.16,1.0,0.05478426469387543,0.09718564431824017,-0.3028417962042239,0.09904399060389875
347,2021-02-12 00:00:00,0.0011202276787066,330.29,329.67,330.8,327.83,1.0,0.058891545060474115,0.06198216528612566,-0.2721999862783322,-0.11059263415754673
348,2021-02-13 00:00:00,0.0011202276787066,330.29,329.67,330.8,327.83,1.0,0.2572847106978928,0.030505348663457,1.2921635962732196,-0.08553140912305751
349,2021-02-14 00:00:00,0.0011202276787066,330.29,329.67,330.8,327.83,1.0,0.3282015793457065,0.11326581810712266,1.7173631690110294,-0.011165801819067466
350,2021-02-15 00:00:00,0.0052924454122058,330.66,330.34,331.98,330.27,1.0,0.33006814880840807,0.26686369282598577,0.2810485541879615,0.4363483979990954
351,2021-02-16 00:00:00,-0.0111909990674168,332.41,330.7,334.79,330.55,0.0,0.39202045414219633,1.4676539006047795,0.4597499077947855,8.587379955844343
352,2021-02-17 00:00:00,-0.0045027229304208,328.69,333.21,333.21,327.31,1.0,0.006194108123216857,0.09333973401028395,-0.4732907345192665,-0.3054131909454145
353,2021-02-18 00:00:00,0.0070291250267412,327.21,328.53,328.64,322.98,0.5,0.1852319154784663,0.11164819408716653,0.6871681089219321,-0.16160330865725892
354,2021-02-19 00:00:00,-0.0294073017510849,329.51,326.71,329.81,324.42,1.0,0.43381695653149066,0.012994125068869877,2.1040518900717107,-0.5743419187581541
355,2021-02-20 00:00:00,-0.0294073017510849,329.51,326.71,329.81,324.42,1.0,0.08827393577589682,-0.07988518282959056,-0.08447532938884189,-0.7595434524814888
356,2021-02-21 00:00:00,-0.0294073017510849,329.51,326.71,329.81,324.42,1.0,0.07768794468365758,-0.07783700445650688,-0.28169937591019384,-1.011463304681266
357,2021-02-22 00:00:00,-0.0019073228691139,319.82,329.47,330.66,319.09,0.0,0.06834999979624001,-0.06437722545004654,-0.23183383761472662,-0.72552402600861
358,2021-02-23 00:00:00,0.0020362770589894,319.21,319.7,321.07,311.22,0.0,-0.04951201108447911,-0.04126129722501837,-0.7727254330746359,-0.8970785829206179
359,2021-02-24 00:00:00,-0.0018758206715438,319.86,319.18,322.46,317.32,1.0,-0.02048054616053996,-0.013926641265613604,-0.6002589244446633,-0.613992072564308
360,2021-02-25 00:00:00,-0.0030695984464073,319.26,319.6,324.86,318.4,0.0,5.623112903130334e-05,-0.022882101071285632,-0.701110832137452,-0.45395095508595656
361,2021-02-26 00:00:00,0.0210506472288552,318.28,319.83,321.04,314.57,1.0,-0.003311720810014407,0.06618742626154095,-0.3063866918131913,-0.2360720880910882
362,2021-02-27 00:00:00,0.0210506472288552,318.28,319.83,321.04,314.57,1.0,-0.03050784003032625,0.04615284780642703,-0.4093291914972598,-0.15846775505060345
363,2021-02-28 00:00:00,0.0210506472288552,318.28,319.83,321.04,314.57,1.0,-0.10746536077618085,-0.015683192641374077,-0.5013874206898435,-0.24628470284625634
364,2021-03-01 00:00:00,-0.0007692781094221,324.98,318.13,326.31,318.13,1.0,-0.10132677634276543,-0.024974424884132596,-0.8143726484638755,-0.44297376574076974
365,2021-03-02 00:00:00,0.0078218827949372,324.73,324.73,334.02,323.65,0.0,0.030265552344069135,0.03801951509046919,-0.2781651171438932,-0.3095327262377148
366,2021-03-03 00:00:00,-0.0216640694228006,327.27,324.48,330.66,324.48,1.0,-0.055816848183543044,0.09484746656470744,-0.6817142235409724,-0.04564023715391572
367,2021-03-04 00:00:00,0.0015616215878568,320.18,327.46,328.32,316.59,1.0,-0.007279909129179529,0.0379053390333457,-0.5044384656217825,-0.20792151504077827
368,2021-03-05 00:00:00,-0.0220157166022202,320.68,320.64,321.42,313.02,1.0,0.03575951432642466,-0.00998096656415104,-0.39088903508594597,-0.5784442914524236
369,2021-03-06 00:00:00,-0.0220157166022202,320.68,320.64,321.42,313.02,1.0,0.04401013713017132,0.012909229204329797,-0.30931304231301937,-0.48621606646732257
370,2021-03-07 00:00:00,-0.0220157166022202,320.68,320.64,321.42,313.02,1.0,0.11373395190552049,0.16451137247173087,0.3504968444582294,0.3417740524765406
371,2021-03-08 00:00:00,0.0308972642050889,313.62,320.0,323.33,313.2,0.5,0.16024518090915318,0.1648551380534462,0.7764533432693722,0.5694203371264004
372,2021-03-09 00:00:00,-0.0179703689957007,323.31,313.66,323.81,313.42,1.0,0.1534857910614864,0.1326885250432257,-0.06149657457373814,-0.03507728472016467
373,2021-03-10 00:00:00,0.0281889763779527,317.5,323.18,323.3,316.53,1.0,0.306775580482876,-0.002478226380258519,1.0494560822775583,-0.6740238555992827
374,2021-03-11 00:00:00,-0.0031245213662122,326.45,317.13,327.3,317.13,0.0,0.436376878050031,-0.10165309552888857,1.3883053768089904,-1.0066382160426575
375,2021-03-12 00:00:00,-0.0004302000430199,325.43,326.35,327.22,321.19,1.0,-0.04229546484340041,0.3820854650157939,-0.739386053643333,1.412202236058775
376,2021-03-13 00:00:00,-0.0004302000430199,325.43,326.35,327.22,321.19,1.0,0.17719297512018262,-0.01944729213959384,0.35416386817170376,-0.700495091150929
377,2021-03-14 00:00:00,-0.0004302000430199,325.43,326.35,327.22,321.19,1.0,0.06665088464752955,-0.007815670655370255,-0.21806509123691192,-0.6809964266108057
378,2021-03-15 00:00:00,0.0018752497771218,325.29,325.45,327.36,322.34,0.0,0.01620735455612632,0.01608707341175375,-0.4554198329099306,-0.5682501441804378
379,2021-03-16 00:00:00,-0.0077324332617366,325.9,325.06,329.12,324.22,0.0,-0.032017407364753225,-0.03870499356475854,-0.8588874059566854,-0.6071693146085453
380,2021-03-17 00:00:00,-0.0112561073659471,323.38,325.88,326.93,319.82,1.0,-0.04910655092159111,-0.009299428727845616,-0.6838337472189662,-0.4175801390877815
381,2021-03-18 00:00:00,0.0035028460624257,319.74,321.67,325.14,319.31,1.0,-0.022372687143355385,0.021536581046162517,-0.6780402511040727,-0.294554736543221
382,2021-03-19 00:00:00,0.0014024808327619,320.86,320.08,322.2,318.72,1.0,-0.017405290002616702,0.02178377351381844,-0.4875699957733218,-0.2691993279386949
383,2021-03-20 00:00:00,0.0014024808327619,320.86,320.08,322.2,318.72,1.0,-0.08125040929116967,-0.04286987973981038,-0.9476001549907516,-0.6865865978654292
384,2021-03-21 00:00:00,0.0014024808327619,320.86,320.08,322.2,318.72,1.0,-0.0885368099787236,-0.006017258615354848,-1.4972822882912757,-0.5109137159977498
385,2021-03-22 00:00:00,-0.0023030717998195,321.31,321.09,323.02,319.92,1.0,-0.09034175872919459,0.05420705725446062,-0.9216216444689359,-0.41194044139140684
386,2021-03-23 00:00:00,-0.0202139938235019,320.57,321.41,323.15,319.95,0.0,-0.049316318127927694,0.1611579626849,-0.902240403493672,0.13090778848733506
387,2021-03-24 00:00:00,0.0112069788914006,314.09,321.1,321.56,313.92,1.0,0.775261571219839,-0.03914215943304278,2.6707658702327564,-0.8046225496667623
388,2021-03-25 00:00:00,0.0114291111740814,317.61,314.35,318.22,312.79,0.0,0.3461736899557373,-0.08575319427232753,0.454947453906224,-0.6189383510283201
389,2021-03-26 00:00:00,-0.001992279915328,321.24,317.43,322.6,317.43,1.0,1.0393808635756017,0.0836319586657881,7.939470937338388,-0.20156932908783473
390,2021-03-27 00:00:00,-0.001992279915328,321.24,317.43,322.6,317.43,1.0,0.1516593100526089,0.054607433675641026,0.47316477237912785,-0.2224282278685847
391,2021-03-28 00:00:00,-0.001992279915328,321.24,317.43,322.6,317.43,1.0,0.1635576818678839,0.06413562773317238,0.3015508008499219,-0.36611224800220815
392,2021-03-29 00:00:00,0.0163443543356205,320.6,321.19,323.02,319.08,0.0,0.16550347618864514,0.0668060474705694,1.0846337051713975,-0.17192543187371565
393,2021-03-30 00:00:00,0.0041431377363123,325.84,320.36,326.93,320.36,0.0,0.1645463889072305,-0.04391921779361496,0.5420166077597479,-0.9558961531674646
394,2021-03-31 00:00:00,0.019224303921269,327.19,325.86,328.96,323.83,1.0,0.0,0.0,0.0,0.0
395,2021-04-01 00:00:00,0.0,333.48,327.56,334.78,327.19,1.0,0.10620530412380091,-0.009843050951528376,0.12814274999874245,-0.7465993108698625
396,2021-04-02 00:00:00,0.0042581264243731,333.48,333.58,333.65,333.24,1.0,0.1430551152398909,0.0373055900369037,0.4325667665655368,-0.28948896815274483
397,2021-04-03 00:00:00,0.0042581264243731,333.48,333.58,333.65,333.24,1.0,0.15590029336405742,0.028631214230343538,0.41891746012324627,-0.2848863159963952
398,2021-04-04 00:00:00,0.0042581264243731,333.48,333.58,333.65,333.24,1.0,0.07186862817210571,0.07516170360111296,0.11345772414079548,0.14387090102069194
399,2021-04-05 00:00:00,0.0128396536279486,334.9,333.9,336.84,333.39,0.0,0.06089294415827773,0.1487486144911152,0.009218979353462383,0.30016091621712776
400,2021-04-06 00:00:00,-0.0043337264150942,339.2,334.86,340.17,333.9,1.0,0.07087823022698458,0.11010922966185888,-0.12357992284170494,0.14485303985264056
401,2021-04-07 00:00:00,0.0068397832588162,337.73,339.14,340.54,336.81,1.0,0.10397640427162802,-0.009783196773039293,0.06495109719370956,-0.7717612951197731
402,2021-04-08 00:00:00,-0.0022938477826138,340.04,338.39,341.94,337.09,0.0,0.19622600021517655,-0.07828965221229911,0.8351865215221174,-0.8555822483629713
403,2021-04-09 00:00:00,-0.0090491068796792,339.26,340.01,340.39,338.44,1.0,0.14106129679641288,0.05035938517321803,0.13967762586466623,-0.3441228022592437
404,2021-04-10 00:00:00,-0.0090491068796792,339.26,340.01,340.39,338.44,1.0,0.1924868648404603,-0.019078816530197606,0.7025507788343188,-0.7782107086365826
405,2021-04-11 00:00:00,-0.0090491068796792,339.26,340.01,340.39,338.44,1.0,0.14117896167855726,-0.02507473203558508,0.29997725069155246,-0.5918479543893851
406,2021-04-12 00:00:00,0.0033611945625985,336.19,339.38,339.4,334.59,1.0,0.12158665956272419,-0.002144110015787959,0.08959272650306976,-0.5460395169556235
407,2021-04-13 00:00:00,-0.0015415629076247,337.32,336.13,339.36,335.57,0.0,0.0513931134840826,0.11271560034186834,-0.3202335751529479,-0.012487049234636472
408,2021-04-14 00:00:00,0.0070368171021377,336.8,337.15,339.16,335.95,1.0,0.008467162588011945,0.1481706434755079,-0.4102688325711812,-0.04645146444563181
409,2021-04-15 00:00:00,0.0059557154229441,339.17,336.83,340.7,336.7,0.0,-0.0021639983398307194,0.30743242542591087,-0.6661552927832299,1.679645765070387
410,2021-04-16 00:00:00,-0.0014068407632111,341.19,339.26,341.84,339.12,1.0,0.030212487818299216,0.3653302824644795,-0.3460702139689893,1.1137318404295504
411,2021-04-17 00:00:00,-0.0014068407632111,341.19,339.26,341.84,339.12,1.0,0.03244511309451159,0.44986627521452416,-0.3713277342019056,3.2215648180847145
412,2021-04-18 00:00:00,-0.0014068407632111,341.19,339.26,341.84,339.12,1.0,0.07029140316285076,0.7446956586771183,-0.20418177398227771,3.642243831844292
413,2021-04-19 00:00:00,-0.0188723547885298,340.71,341.29,344.75,339.98,0.0,0.05636361580570792,0.6957129179820978,-0.22199898685348798,3.247569880726994
414,2021-04-20 00:00:00,-0.0038590403254755,334.28,340.59,340.68,332.89,0.0,0.055531224483777564,0.17529612835871156,-0.2570586231837009,0.05750558313061589
415,2021-04-21 00:00:00,0.0132436409501785,332.99,334.31,334.37,328.57,1.0,0.0627911650706654,0.05592664378754186,-0.2830778735294508,-0.3405033212216955
416,2021-04-22 00:00:00,0.0129519857735625,337.4,333.06,339.45,332.92,1.0,0.18083198550609403,0.02694516379541323,0.5955094723373352,-0.29342553716415926
417,2021-04-23 00:00:00,0.0164145477953009,341.77,337.5,341.85,335.92,1.0,0.2558857154723331,0.0075665439797303335,1.1218644681487175,-0.4647741788093528
418,2021-04-24 00:00:00,0.0164145477953009,341.77,337.5,341.85,335.92,1.0,0.20059079391978418,0.08453875550192347,0.9395944007520667,0.2506978579913095
419,2021-04-25 00:00:00,0.0164145477953009,341.77,337.5,341.85,335.92,1.0,1.215022381235821,0.0665424662710894,6.060493916817598,-0.2512097887793047
420,2021-04-26 00:00:00,-0.0031377741954055,347.38,341.51,347.47,341.23,1.0,1.2065712663429142,0.057144508876582734,7.900322440345213,-0.2825302243582995
421,2021-04-27 00:00:00,0.0004042854255103,346.29,347.38,350.05,346.32,1.0,0.6472031841111585,0.04859015134423572,4.756373403922744,-0.44778089965645484
422,2021-04-28 00:00:00,-0.0096700632162342,346.43,346.36,348.08,345.88,0.0,0.6543508657348012,-0.00557212922767647,3.006029495936445,-0.6564617730054613
423,2021-04-29 00:00:00,-0.0052465897166841,343.08,346.32,347.72,342.47,0.5,0.22202058417362736,0.025733633379636522,0.6241838322392866,-0.4846215922223628
424,2021-04-30 00:00:00,-0.0066807313642755,341.28,343.1,344.07,341.18,0.0,0.13674139619133108,0.1552693620293688,-0.08334706430868799,0.16389390810991322
425,2021-05-01 00:00:00,-0.0066807313642755,341.28,343.1,344.07,341.18,0.0,0.26692115289130847,0.0355266385912012,0.9364381464395553,-0.436034971317588
426,2021-05-02 00:00:00,-0.0066807313642755,341.28,343.1,344.07,341.18,0.0,0.1583350585283041,0.05133903507158877,0.4086659333862841,-0.3166291037522164
427,2021-05-03 00:00:00,-0.0110914454277285,339.0,341.28,341.35,337.37,1.0,0.18152683410341552,0.041238787342715355,0.399688894567903,-0.25480119570367155
428,2021-05-04 00:00:00,-0.0040567951318458,335.24,339.1,339.64,332.78,1.0,0.4107296398032023,-0.009341288949310744,1.1043112647625837,-0.5081519101671176
429,2021-05-05 00:00:00,-0.0026057266083622,333.88,335.22,336.04,332.24,1.0,0.09963898114466208,0.0031847062159604533,-0.025377382584559564,-0.5573138479127093
430,2021-05-06 00:00:00,0.0061860004204078,333.01,333.9,335.64,331.43,1.0,0.031045132625688865,0.05811774597769226,-0.47326154656590025,-0.18232592187141036
431,2021-05-07 00:00:00,-0.0232190288596411,335.07,332.93,338.07,332.68,1.0,0.31760248857609596,0.0004870378377157536,0.8289298658486268,-0.7686560851778633
432,2021-05-08 00:00:00,-0.0232190288596411,335.07,332.93,338.07,332.68,1.0,0.17875323230220364,0.015560969726022833,0.3897149208962284,-0.5152687544902479
433,2021-05-09 00:00:00,-0.0232190288596411,335.07,332.93,338.07,332.68,1.0,0.4522937064653023,-0.09121135481192688,1.9646971969052616,-0.7212178387796347
434,2021-05-10 00:00:00,-0.0025970851538391,327.29,334.9,335.71,326.78,0.0,0.39111842791831464,-0.09259118738116445,1.3509370538259093,-0.642630886811625
435,2021-05-11 00:00:00,-0.0215659845607156,326.44,327.79,327.79,320.7,0.3333333333333333,0.03890184247491568,-0.040340904051237025,-0.30169111354775535,-0.48544330885076775
436,2021-05-12 00:00:00,-0.0111145898559798,319.4,326.48,326.62,319.45,0.3333333333333333,-0.03756993092142924,-0.025684100968780932,-0.695761390960313,-0.4756423269494994
437,2021-05-13 00:00:00,-0.0007281937628621,315.85,319.76,321.05,315.05,0.0,-0.015235613820884453,-0.08700835440910826,-0.6353957893663261,-1.246261584347791
438,2021-05-14 00:00:00,0.009948672454217,315.62,315.87,316.22,308.65,1.0,-0.042690433613561396,0.01145199514565931,-1.0095330870625605,-0.5905959676274269
439,2021-05-15 00:00:00,0.009948672454217,315.62,315.87,316.22,308.65,1.0,-0.08176367847929811,-0.03150457378611815,-1.3018344002821063,-1.2996265508417035
440,2021-05-16 00:00:00,0.009948672454217,315.62,315.87,316.22,308.65,1.0,-0.05723334159351268,-0.0041916142058529005,-1.0418460377494767,-0.6534407961329407
441,2021-05-17 00:00:00,0.0238737608231899,318.76,315.54,319.81,313.78,1.0,-0.01974096682208959,0.04723842040837667,-0.4861462732027062,-0.36183015520490136
442,2021-05-18 00:00:00,-0.0097435426050188,326.37,318.76,326.39,318.23,1.0,0.01474863412282712,0.39177717057319583,-0.31823310188367826,2.2117730120667423
443,2021-05-19 00:00:00,0.0215972028837526,323.19,326.45,326.46,319.89,1.0,0.12363878522233929,0.09302736710591741,-0.13796557420969907,0.0023312809033852314
444,2021-05-20 00:00:00,0.0023018445043462,330.17,323.87,330.35,323.0,1.0,0.23017164398573264,-0.025932311313189516,0.40552335738894374,-0.7684969346997094
445,2021-05-21 00:00:00,0.0094581935756806,330.93,330.07,332.26,329.48,0.0,0.1263208255461512,-0.11596391596452449,0.5376911092940609,-0.7811071638924451
446,2021-05-22 00:00:00,0.0094581935756806,330.93,330.07,332.26,329.48,0.0,-0.06075888891708647,0.062442783975704685,-0.8015531650714726,-0.0658960200691027
447,2021-05-23 00:00:00,0.0094581935756806,330.93,330.07,332.26,329.48,0.0,0.008551619022193258,0.1347625776461756,-0.4575371676431809,0.28692812720552346
448,2021-05-24 00:00:00,-0.0001496737113093,334.06,331.07,335.79,330.86,0.0,0.05444832695208213,0.12178916974547604,-0.3362303474358055,0.06908245855278877
449,2021-05-25 00:00:00,-0.0033232537947966,334.01,333.9,337.16,333.9,1.0,0.0,0.0,0.0,0.0
450,2021-05-26 00:00:00,0.0194052267948333,332.9,333.86,335.64,332.66,1.0,-0.05325847344107615,0.06226470511349813,-0.7809094144038574,-0.07474281522090313
451,2021-05-27 00:00:00,-0.0046558227251297,339.36,332.94,339.65,332.16,1.0,0.0,0.0,0.0,0.0
452,2021-05-28 00:00:00,-0.0031381372490968,337.78,339.4,341.65,337.3,1.0,0.0,0.0,0.0,0.0
453,2021-05-29 00:00:00,-0.0031381372490968,337.78,339.4,341.65,337.3,1.0,0.0,0.0,0.0,0.0
454,2021-05-30 00:00:00,-0.0031381372490968,337.78,339.4,341.65,337.3,1.0,0.04420091553593508,0.07891066041455908,-0.3709256634326076,-0.009631787261620601
455,2021-05-31 00:00:00,0.0109289617486337,336.72,337.73,338.91,336.11,1.0,0.06578057929977277,0.06278844591580146,0.03148836545610092,-0.22639369901831466
456,2021-06-01 00:00:00,-0.0045828437132785,340.4,336.76,342.32,336.61,0.0,0.11150329027357131,0.031182729726793923,0.3072612614263437,-0.2757773882966878
457,2021-06-02 00:00:00,-0.0067583520245542,338.84,340.84,340.84,337.91,0.5,0.006203853997652331,-0.07074628578448205,-0.39268994998196255,-0.8779822578766547
458,2021-06-03 00:00:00,0.0045461298469765,336.55,338.85,340.08,336.29,1.0,-0.03862723814910485,0.004322121195747819,-0.6376126772930704,-0.49560274736808263
459,2021-06-04 00:00:00,0.0058861807856129,338.08,336.62,339.29,335.34,1.0,0.012355315490289343,-0.017073359217017803,-0.39404181710909747,-0.7416480321381951
460,2021-06-05 00:00:00,0.0058861807856129,338.08,336.62,339.29,335.34,1.0,-0.004672223501180461,0.0989776088958374,-0.6119722191030211,-0.32989068211949635
461,2021-06-06 00:00:00,0.0058861807856129,338.08,336.62,339.29,335.34,1.0,0.025974037696855135,0.21333759910025485,-0.4171103475452576,0.4740012510571865
462,2021-06-07 00:00:00,0.0057341135648542,340.07,338.01,340.32,337.99,1.0,0.01144094756104952,0.20923628070515932,-0.5581081405169759,0.22786819178290085
463,2021-06-08 00:00:00,-0.0037717092567685,342.02,340.05,344.19,338.91,0.0,-0.023155778070522715,0.21320100426081368,-0.586098099922986,0.5407909447756436
464,2021-06-09 00:00:00,0.0105362016846182,340.73,342.11,343.0,340.49,0.0,0.22137446921970305,0.15362555153354585,0.33971761023318164,0.2586427806168089
465,2021-06-10 00:00:00,0.0060118494423791,344.32,340.77,344.64,340.66,1.0,0.5875652543896788,0.9384918566764986,2.694456503187122,6.613703432192545
466,2021-06-11 00:00:00,-0.0027425733999249,346.39,343.96,346.68,343.59,0.5,0.005627146176585107,0.8046411056121228,-0.5401368343900588,5.537303069800774
467,2021-06-12 00:00:00,-0.0027425733999249,346.39,343.96,346.68,343.59,0.5,0.033153525831450814,0.13734525936570297,-0.5478015190732836,-0.10703012132656077
468,2021-06-13 00:00:00,-0.0027425733999249,346.39,343.96,346.68,343.59,0.5,0.10413815676191263,0.03482776403912968,0.09993788969607288,-0.5262157692373007
469,2021-06-14 00:00:00,-0.0011289949050485,345.44,346.35,347.47,344.81,0.0,0.14567780705878608,0.06751307195585188,0.4861883437282893,-0.1540426285774676
470,2021-06-15 00:00:00,-0.0054774670337631,345.05,345.49,347.9,344.47,1.0,0.19442549311470003,0.054701517502197206,0.25054504910586634,-0.3468859007995306
471,2021-06-16 00:00:00,0.0099953374519173,343.16,345.01,345.07,341.3,1.0,0.1532335067642574,0.008535971125033903,0.1004839210875278,-0.7851066417641248
472,2021-06-17 00:00:00,-0.0012695115265876,346.59,343.94,347.36,342.28,0.0,0.021166201677047525,0.02022182845176257,-0.3868668443150164,-0.6167331465754002
473,2021-06-18 00:00:00,-0.0057489527661417,346.15,346.91,347.79,345.51,1.0,0.08429475284677057,-0.0077883931908173665,-0.1376989116531132,-0.7969026069906522
474,2021-06-19 00:00:00,-0.0057489527661417,346.15,346.91,347.79,345.51,1.0,0.008589041528519914,0.02472717699023086,-0.505086453999539,-0.4826515775044373
475,2021-06-20 00:00:00,-0.0057489527661417,346.15,346.91,347.79,345.51,1.0,-0.023608100731828507,0.012821443336668459,-0.5211786901787111,-0.5099447697766555
476,2021-06-21 00:00:00,-0.0012203626220363,344.16,345.97,346.22,341.18,1.0,-0.03557357311079379,0.007809513233398846,-0.5479806364079303,-0.5579249193965578
477,2021-06-22 00:00:00,0.0015418630360155,343.74,343.66,345.31,341.92,1.0,-0.009853776714874307,0.0342199262677747,-0.6898922064418168,-0.4158902117258047
478,2021-06-23 00:00:00,0.0094693118773055,344.27,343.17,346.08,343.17,0.5,-0.04726584754579566,0.17971079175781668,-0.6160604237232951,0.32908430730072447
479,2021-06-24 00:00:00,-0.0066469081805885,347.53,344.33,350.43,344.06,1.0,-0.03765522094599749,0.31903483293772084,-0.8170529246782163,1.1596155062118827
480,2021-06-25 00:00:00,-0.0004345055327038,345.22,347.43,348.29,345.01,0.6666666666666666,0.10638304596960602,0.2291499301914115,-0.18569953348723253,0.35622034931595636
481,2021-06-26 00:00:00,-0.0004345055327038,345.22,347.43,348.29,345.01,0.6666666666666666,0.08754530789620674,0.0915760495931881,-0.014854806284238626,0.010270613812195245
482,2021-06-27 00:00:00,-0.0004345055327038,345.22,347.43,348.29,345.01,0.6666666666666666,0.12172177253295491,0.04768996384238111,-0.09614602074424136,-0.3967041116036783
483,2021-06-28 00:00:00,-0.0009853073289476,345.07,345.39,347.63,345.02,0.0,0.18655861511369043,0.025446205708019143,0.30835246137399486,-0.631630152641
484,2021-06-29 00:00:00,-0.0054825515620921,344.73,345.1,345.14,340.95,0.0,0.4696333266578403,-0.03501786761256653,2.032590697309628,-0.8300295839885542
485,2021-06-30 00:00:00,-0.0029459806323649,342.84,344.74,348.4,342.79,0.5,0.005046354694144384,-0.006609645628989469,-0.5511525435678422,-0.5865653372965433
486,2021-07-01 00:00:00,0.0037152970774947,341.83,342.86,344.27,340.98,1.0,0.057464045374388206,-0.026677323456128832,-0.3186877525478998,-0.8197532708815694
487,2021-07-02 00:00:00,0.0017196152725152,343.1,341.96,345.27,341.94,1.0,0.013965120256341557,0.1892162528315744,-0.5946167504305101,0.7579761252412497
488,2021-07-03 00:00:00,0.0017196152725152,343.1,341.96,345.27,341.94,1.0,0.15296927952916217,0.17497400625479465,0.14348580421393078,0.44015573254831586
489,2021-07-04 00:00:00,0.0017196152725152,343.1,341.96,345.27,341.94,1.0,0.5634835412850849,0.28084838737130813,1.676154292495166,0.6514447488337287
490,2021-07-05 00:00:00,0.0130059064854957,343.69,342.82,343.77,342.82,1.0,0.4785404869859615,0.3525264306115776,2.4678138258241797,1.6496410873787022
491,2021-07-06 00:00:00,-0.0193301930147059,348.16,343.59,349.51,343.59,0.0,0.4406505776326499,0.679388290171353,2.642323459221247,4.178022452955461
492,2021-07-07 00:00:00,-0.0087279969539876,341.43,348.37,348.37,340.16,1.0,0.5055427429908583,0.38550160806266565,2.396351658937621,1.1207810851786664
493,2021-07-08 00:00:00,0.0162210075343477,338.45,341.89,341.93,333.37,0.5,0.13148015764709964,-0.026472478873162508,-0.025501998069741398,-0.5391577806613325
494,2021-07-09 00:00:00,0.0042158516020235,343.94,338.45,344.86,337.69,1.0,0.29492730052886795,0.017587908483585046,0.5901733916350417,-0.5438459263936901
495,2021-07-10 00:00:00,0.0042158516020235,343.94,338.45,344.86,337.69,1.0,-0.031848923882400904,-0.08252204589435674,-0.6031270977184732,-0.8326349714213136
496,2021-07-11 00:00:00,0.0042158516020235,343.94,338.45,344.86,337.69,1.0,-0.022919168027878634,-0.09723898321368729,-0.7168906999170794,-1.1010691538481079
497,2021-07-12 00:00:00,0.0107125278670488,345.39,343.79,347.28,343.79,0.0,-0.01645332937312549,-0.09616179176537365,-0.6055228426893583,-0.8315147964008484
498,2021-07-13 00:00:00,-0.0087942937351399,349.09,345.44,351.12,345.4,0.0,-0.0014805902030010643,-0.06408557420045291,-0.6935243309216591,-1.036025892045314
499,2021-07-14 00:00:00,-0.0102306225073694,346.02,349.68,350.71,345.46,1.0,0.015244622597048618,-0.008100637100059593,-0.6281676838263401,-0.6831818069045658
500,2021-07-15 00:00:00,0.0011387526278906,342.48,345.79,346.15,341.19,1.0,0.02781686676956241,-0.011936798691284167,-0.38800249872248055,-0.7906250013272714
501,2021-07-16 00:00:00,-0.0024207425554874,342.87,342.49,344.64,341.92,1.0,0.21152409896617552,-0.000625681590680216,1.1861713136819503,-0.7379470722519454
502,2021-07-17 00:00:00,-0.0024207425554874,342.87,342.49,344.64,341.92,1.0,0.2320903270764143,-0.02534740396452939,0.8005200762681126,-0.7327792537756703
503,2021-07-18 00:00:00,-0.0024207425554874,342.87,342.49,344.64,341.92,1.0,0.510489478552647,0.10489186562248776,2.7564744371321264,0.286344372529873
504,2021-07-19 00:00:00,0.0086831949479592,342.04,342.92,343.11,337.31,1.0,0.4697407055006835,0.08948725425311999,1.7628065617433246,-0.1130599849142485
505,2021-07-20 00:00:00,0.0152749195675487,345.01,342.14,345.95,341.58,1.0,0.46423027410846807,0.08435671178679449,2.5310698260347326,0.09633964414690911
506,2021-07-21 00:00:00,0.0066518214000229,350.28,344.47,350.73,344.2,0.75,0.9079388061821279,0.3336738092587659,5.337576998859571,0.42142154334913096
507,2021-07-22 00:00:00,0.0038853123847877,352.61,349.93,354.36,349.93,0.6666666666666666,0.018970014422454717,0.23110412294426297,-0.27922119394861383,0.26842736820722923
508,2021-07-23 00:00:00,-0.0119215774902537,353.98,352.61,354.71,351.77,1.0,0.11482296541776993,0.1432309731406054,-0.1189736799037549,0.12057289733680746
509,2021-07-24 00:00:00,-0.0119215774902537,353.98,352.61,354.71,351.77,1.0,0.43636542754748575,0.34146659424083037,1.1126835430636022,0.3804145019231723
510,2021-07-25 00:00:00,-0.0119215774902537,353.98,352.61,354.71,351.77,1.0,0.020771849446496127,-0.07998856290620715,-0.6636263181740579,-0.9588820308294365
511,2021-07-26 00:00:00,-0.0194704940530649,349.76,353.91,354.26,348.17,0.0,0.04446042626378688,-0.07459446293550087,-0.2992985520929746,-0.8702158820163028
512,2021-07-27 00:00:00,0.0075812800699811,342.95,349.99,351.79,337.47,1.0,0.14214681348860303,0.11764065961663839,-0.12294226589918424,0.13561308525356833
513,2021-07-28 00:00:00,0.0179424106496888,345.55,343.02,345.68,341.73,1.0,0.2779526834822299,0.058079272663145165,1.462111387498667,-0.33755847147500617
514,2021-07-29 00:00:00,-0.0095522388059701,351.75,344.93,353.16,344.93,1.0,0.25785935341796673,0.04728266593658237,1.350364536274946,-0.4139811034523596
515,2021-07-30 00:00:00,0.0030425672378656,348.39,351.7,352.64,347.32,0.5,0.23362182793523445,0.11978517456216942,0.9389203195829966,0.1037161927455492
516,2021-07-31 00:00:00,0.0030425672378656,348.39,351.7,352.64,347.32,0.5,0.1587228642826206,0.1590859685767314,-0.13352750458525106,0.21524047836401342
517,2021-08-01 00:00:00,0.0030425672378656,348.39,351.7,352.64,347.32,0.5,0.30939780916139537,0.09764661112135364,0.7134332424531731,-0.01778412022618562
518,2021-08-02 00:00:00,-0.0003147803691515,349.45,348.57,351.58,346.58,0.0,0.3190346873106762,0.1661436969795842,1.0986068636917357,0.06570620376790218
519,2021-08-03 00:00:00,0.0178622545371271,349.34,349.55,349.6,347.01,1.0,0.17835703879655007,0.14880460060286893,0.5736837166048779,0.13978756323893654
520,2021-08-04 00:00:00,0.0091118735586928,355.58,349.24,355.75,349.19,1.0,0.015392928426898322,0.06564313106387765,-0.5611946538922978,-0.19398720358379867
521,2021-08-05 00:00:00,0.0003344295189788,358.82,355.66,360.16,354.56,1.0,0.1575800847209683,0.024175545180522562,0.028350668547343187,-0.3032757318252807
522,2021-08-06 00:00:00,0.0054048030311472,358.94,359.0,359.49,356.66,1.0,0.3218282686320144,0.013799136365831188,0.7128838720731685,-0.38265901343995035
523,2021-08-07 00:00:00,0.0054048030311472,358.94,359.0,359.49,356.66,1.0,0.11032859208862433,0.3002777738105138,-0.17342103110166562,0.16015986163278229
524,2021-08-08 00:00:00,0.0054048030311472,358.94,359.0,359.49,356.66,1.0,0.4312786557948636,0.2522473573396784,2.184868996294343,0.7474872176675363
525,2021-08-09 00:00:00,-0.0033529150964308,360.88,358.93,362.4,357.58,1.0,0.513781724240534,0.21540254834563566,4.208350637643353,0.7243762362926289
526,2021-08-10 00:00:00,-0.0060055050462925,359.67,360.98,364.37,359.32,0.0,0.7714462476230457,0.0898064254578852,3.610996375351456,-0.06671963471463095
527,2021-08-11 00:00:00,0.0104892170848367,357.51,359.86,360.16,355.85,1.0,1.0366753928207215,0.0155999398694604,2.3348432874000773,-0.3281995321526673
528,2021-08-12 00:00:00,-0.0040137297237446,361.26,357.59,362.06,357.45,0.0,0.5091259834950446,0.2430714954233757,1.6174682479785842,0.3359670785699334
529,2021-08-13 00:00:00,-0.0211500514160251,359.81,361.24,362.84,358.59,1.0,0.17745852868368317,0.08853098940725701,0.4141245384481005,-0.05307145735557126
530,2021-08-14 00:00:00,-0.0211500514160251,359.81,361.24,362.84,358.59,1.0,0.0468800930450195,0.1230999587167263,-0.36686953565550084,0.16773775269320795
531,2021-08-15 00:00:00,-0.0211500514160251,359.81,361.24,362.84,358.59,1.0,0.06259218416075996,0.10498588638966666,-0.17600273753943343,0.11919102421135885
532,2021-08-16 00:00:00,0.0134298693923907,352.2,359.59,359.84,350.48,1.0,0.07345308557534569,0.09123102139510131,-0.09306568727977782,-0.271920962267102
533,2021-08-17 00:00:00,0.0131398313394783,356.93,352.41,360.23,349.77,1.0,-0.04505770818075838,0.07906040582204632,-0.6093651839948951,-0.1408665408804908
534,2021-08-18 00:00:00,-0.0057795475913943,361.62,356.92,364.82,356.85,1.0,-0.047625265346749934,0.03888351483024266,-0.7686451545966004,-0.32403795123107565
535,2021-08-19 00:00:00,-0.0095124189914609,359.53,361.69,362.06,355.53,1.0,-0.056282182946655546,-0.06765450274328089,-0.6577199008576641,-0.8871543922552915
536,2021-08-20 00:00:00,0.0015725478082614,356.11,359.66,361.57,355.62,1.0,-0.0856712054692359,-0.09141695486064094,-0.8633010726293169,-0.7719760410186943
537,2021-08-21 00:00:00,0.0015725478082614,356.11,359.66,361.57,355.62,1.0,0.0,0.0,0.0,0.0
538,2021-08-22 00:00:00,0.0015725478082614,356.11,359.66,361.57,355.62,1.0,0.0,0.0,0.0,0.0
539,2021-08-23 00:00:00,-0.0011214848459361,356.67,355.95,357.03,353.38,1.0,0.0,0.0,0.0,0.0
540,2021-08-24 00:00:00,0.0091784320880232,356.27,356.59,359.72,355.94,1.0,0.0,0.0,0.0,0.0
541,2021-08-25 00:00:00,0.0012237859487122,359.54,356.51,359.71,356.19,0.0,0.0,0.0,0.0,0.0
542,2021-08-26 00:00:00,-0.0078059892216234,359.98,359.45,360.46,356.89,1.0,0.0,0.0,0.0,0.0
543,2021-08-27 00:00:00,0.0152028445838116,357.17,360.15,360.19,356.08,1.0,0.05900542931709296,-0.0063399341384684504,-0.09272113166148577,-0.539659971750212
544,2021-08-28 00:00:00,0.0152028445838116,357.17,360.15,360.19,356.08,1.0,0.14338131274930355,-0.08260185398409092,0.036893252607927564,-0.6083776288322278
545,2021-08-29 00:00:00,0.0152028445838116,357.17,360.15,360.19,356.08,1.0,0.09480270805603475,-0.06768008845620876,0.22637669546125175,-0.6170302297486646
546,2021-08-30 00:00:00,-0.002095973524545,362.6,357.15,364.7,357.06,0.0,0.11591728710748939,-0.03986212619159968,0.2474648704318846,-0.6231389783068191
547,2021-08-31 00:00:00,0.0066327658633651,361.84,362.92,364.1,358.99,0.0,-0.06225569371573503,-0.043007068107274726,-0.6643237978184743,-0.7413427415915774
548,2021-09-01 00:00:00,0.0002470898308806,364.24,361.8,367.55,361.69,1.0,0.022233014670134388,0.04032493578399343,-0.366895223259843,-0.4350380506668229
549,2021-09-02 00:00:00,0.013668926522658,364.33,364.49,365.96,362.59,1.0,0.05990644457212646,0.030382684525258163,-0.23188303408905694,-0.4526369284651007
550,2021-09-03 00:00:00,0.0044407137635048,369.31,364.26,369.53,363.47,1.0,-0.03327211384712303,-0.01279242494959032,-0.779991072916231,-0.6047764397738388
551,2021-09-04 00:00:00,0.0044407137635048,369.31,364.26,369.53,363.47,1.0,-0.048399083683867694,-0.018992107122514312,-1.004907427665932,-0.810761594175841
552,2021-09-05 00:00:00,0.0044407137635048,369.31,364.26,369.53,363.47,1.0,-0.03009598887143472,0.014388879068809146,-0.5009193319892467,-0.6328690192379333
553,2021-09-06 00:00:00,-0.0026688232915487,370.95,369.31,371.03,368.86,1.0,-0.015031215942654441,0.04553558898694554,-0.400537771593609,-0.2847196634009515
554,2021-09-07 00:00:00,-0.0152719212887879,369.96,370.83,373.17,368.98,0.6666666666666666,0.11129415768085149,0.12340313987462537,0.40886848219128374,-0.005972165208850488
555,2021-09-08 00:00:00,-0.0219318712085861,364.31,370.04,370.04,363.83,1.0,0.04306667536378406,0.015373860210042167,-0.4105852440903393,-0.5163000775660221
556,2021-09-09 00:00:00,0.0084474629546474,356.32,364.13,365.02,354.57,1.0,0.18464180006297326,0.03920728851778721,0.5137734775691107,-0.24496902175814583
557,2021-09-10 00:00:00,-0.006400801491665,359.33,356.34,363.81,356.25,1.0,0.04551174737451458,0.2760421293734212,-0.18159749672735204,0.598000678713598
558,2021-09-11 00:00:00,-0.006400801491665,359.33,356.34,363.81,356.25,1.0,0.048095734424277836,0.25131743939899476,-0.2064421435152346,1.865633751281939
559,2021-09-12 00:00:00,-0.006400801491665,359.33,356.34,363.81,356.25,1.0,0.1123383485407139,0.23869937361822924,0.32967208355539435,1.147405568112638
560,2021-09-13 00:00:00,0.0125479651569896,357.03,360.12,360.12,354.26,0.3333333333333333,0.09544281455019821,0.32319212908383754,0.5306354080839591,1.1317238220318595
561,2021-09-14 00:00:00,0.0003596027772398,361.51,357.15,362.31,357.01,0.75,0.03483525478046534,0.04314313497616684,-0.5352493372256297,-0.12619507853913894
562,2021-09-15 00:00:00,0.0072724256166353,361.64,361.69,361.9,358.93,0.0,0.013582826008252447,0.001930834042378038,-0.6366043847662991,-0.4062488114417832
563,2021-09-16 00:00:00,0.0002196173168255,364.27,361.61,364.37,361.16,1.0,0.32369750477690484,0.007678298239651049,1.233231673889521,-0.6676548857121858
564,2021-09-17 00:00:00,-0.015836421023741,364.35,364.21,366.99,362.63,0.5,0.5600688770281792,0.02977721296355451,2.9895004813920214,-0.5234319060592726
565,2021-09-18 00:00:00,-0.015836421023741,364.35,364.21,366.99,362.63,0.5,0.44982033857173764,0.04607967312780392,1.828235103409066,-0.3858921473486504
566,2021-09-19 00:00:00,-0.015836421023741,364.35,364.21,366.99,362.63,0.5,0.6139954862623442,0.006990054756000674,1.6346730915760816,-0.6502173401057305
567,2021-09-20 00:00:00,0.0049361369847733,358.58,364.36,364.71,355.95,1.0,0.6092026727251234,-0.001776071995380768,2.374385957420509,-0.5594243892722209
568,2021-09-21 00:00:00,0.004828638823366,360.35,358.67,362.67,358.58,1.0,0.1225167974453738,-0.012323151550495126,0.028337247113601093,-0.9872658278407629
569,2021-09-22 00:00:00,0.0101079842028225,362.09,360.41,362.92,358.55,1.0,0.05251298539450122,0.029254130027954517,-0.3538836969109481,-0.4622419516096704
570,2021-09-23 00:00:00,-0.0030075187969925,365.75,362.72,366.15,362.27,1.0,0.030942033266657454,0.14274147329636655,-0.41827715543819105,0.17888228566800393
571,2021-09-24 00:00:00,0.0038392979569451,364.65,365.9,366.9,362.91,0.0,-0.05533848623663662,0.29965939575137845,-0.8065421332911774,1.6565305424976593
572,2021-09-25 00:00:00,0.0038392979569451,364.65,365.9,366.9,362.91,0.0,0.03918212783310526,0.5693403836935556,-0.43762644550276925,2.1143192140922413
573,2021-09-26 00:00:00,0.0038392979569451,364.65,365.9,366.9,362.91,0.0,-0.04272238662507544,0.15899169124732282,-0.9900814530358673,0.2043137533261967
574,2021-09-27 00:00:00,-0.0215271137822701,366.05,364.57,367.79,364.19,0.0,-0.05368087508648678,0.0840302240222659,-0.9752206435780945,-0.021133696206304713
575,2021-09-28 00:00:00,-0.0057793785074126,358.17,366.16,366.25,357.25,0.0,0.0,0.0,0.0,0.0
576,2021-09-29 00:00:00,0.0064588598708226,356.1,358.13,359.59,355.82,1.0,-0.04730258469933446,0.42522645686563454,-1.1129166945617752,1.3826879764633626
577,2021-09-30 00:00:00,-0.0057477678571428,358.4,356.01,360.68,355.93,1.0,0.030415853796942116,1.1010584730783686,-0.18979607796824174,9.463324819098123
578,2021-10-01 00:00:00,0.0058371218499187,356.34,358.37,358.61,352.46,1.0,0.07971574918493474,0.5707838338881714,-0.14530359333076803,5.887782087789089
579,2021-10-02 00:00:00,0.0058371218499187,356.34,358.37,358.61,352.46,1.0,-0.04707707633300817,1.3288848749856488,-0.7523607183943645,3.5369977627390305
580,2021-10-03 00:00:00,0.0058371218499187,356.34,358.37,358.61,352.46,1.0,0.0,0.0,0.0,0.0
581,2021-10-04 00:00:00,-0.0016740137269126,358.42,356.12,360.34,355.4,1.0,-0.02070480870790803,0.9887248952138457,-0.6106784405573941,2.474876818842406
582,2021-10-05 00:00:00,-0.0007545693365378,357.82,358.38,359.0,355.41,1.0,-0.024455329409168947,0.9780461237415956,-0.6527789667681833,3.7272042686437614
583,2021-10-06 00:00:00,0.0122500349601454,357.55,357.58,359.63,356.5,0.0,0.0634841593748936,0.7294750644451078,0.1562043996416863,3.742067539059688
584,2021-10-07 00:00:00,0.0008012599121377,361.93,357.49,364.69,357.4,1.0,0.03630079945088127,0.0669031032423959,-0.15448153450642754,0.15512065179340825
585,2021-10-08 00:00:00,-0.0066810225829606,362.22,362.12,365.38,361.44,1.0,0.49019549128031326,0.019767486146594848,1.3234767851819438,-0.49447909773094006
586,2021-10-09 00:00:00,-0.0066810225829606,362.22,362.12,365.38,361.44,1.0,0.5202960343910608,-0.07227694194463297,3.0236632532161862,-0.9316605249784199
587,2021-10-10 00:00:00,-0.0066810225829606,362.22,362.12,365.38,361.44,1.0,0.9879993934978435,-0.05468701631273731,9.52152883595731,-0.6661453092143713
588,2021-10-11 00:00:00,0.007615341856587,359.8,362.46,363.25,359.8,1.0,1.0119773358455877,0.003956498653311158,7.410924481491771,-0.3180882229049365
589,2021-10-12 00:00:00,0.0300656479285043,362.54,360.01,364.34,358.17,1.0,0.46551959906310447,0.1080520365280373,2.6479960309377453,0.32847802178935176
590,2021-10-13 00:00:00,-0.0012853470437018,373.44,362.78,374.26,362.53,0.5,0.27557638809489315,0.42413171074822564,0.9985994692632145,1.671808242586974
591,2021-10-14 00:00:00,0.009411196911197,372.96,373.28,375.59,371.6,1.0,-0.07547962167870015,0.2854416510255904,-0.9685238215230736,0.17653757531531813
592,2021-10-15 00:00:00,0.0020984407788136,376.47,372.9,377.59,372.86,1.0,-0.046596997824649655,-0.12959604902302146,-0.5436898136508916,-0.650624749873736
593,2021-10-16 00:00:00,0.0020984407788136,376.47,372.9,377.59,372.86,1.0,-0.035329473555383295,-0.1032282437256109,-0.6269739464930802,-0.5990282441259657
594,2021-10-17 00:00:00,0.0020984407788136,376.47,372.9,377.59,372.86,1.0,-0.0773733737397464,-0.07730328395343022,-0.8701327005461615,-0.7212011296080698
595,2021-10-18 00:00:00,0.0122196893389174,377.26,376.55,378.76,375.6,1.0,-0.0990395100406154,-0.07967558011316545,-0.7717814429446249,-1.0194257959704534
596,2021-10-19 00:00:00,-0.0067562259407651,381.87,377.2,383.8,377.1,1.0,-0.09519211006791561,-0.053631938620050335,-0.9124939606167247,-0.46177987459493397
597,2021-10-20 00:00:00,0.0014500777768988,379.29,382.09,383.02,378.03,1.0,0.0628287846452622,0.07626653256656724,-0.08829627258889197,-0.245583828410125
598,2021-10-21 00:00:00,-0.0039490311710193,379.84,379.3,381.29,378.5,1.0,0.3647101689627519,0.7840203858530561,1.4238602644726646,3.0980844391411138
599,2021-10-22 00:00:00,-0.0062377755458052,378.34,380.45,381.4,377.58,1.0,0.0,0.0,0.0,0.0
600,2021-10-23 00:00:00,-0.0062377755458052,378.34,380.45,381.4,377.58,1.0,0.0,0.0,0.0,0.0
601,2021-10-24 00:00:00,-0.0062377755458052,378.34,380.45,381.4,377.58,1.0,0.0,0.0,0.0,0.0
602,2021-10-25 00:00:00,-0.0047608915367839,375.98,378.59,378.62,371.85,1.0,0.0,0.0,0.0,0.0
603,2021-10-26 00:00:00,-0.0013896683503032,374.19,376.09,378.14,371.7,0.0,0.0,0.0,0.0,0.0
604,2021-10-27 00:00:00,0.0058072630931034,373.67,374.24,376.75,373.19,1.0,0.0,0.0,0.0,0.0
605,2021-10-28 00:00:00,-0.0089133673903787,375.84,373.77,376.03,372.16,1.0,-0.08165719136413419,0.5160389671506156,-1.1013241914127234,2.736320277608549
606,2021-10-29 00:00:00,-0.0089133673903787,375.84,373.77,376.03,372.16,1.0,0.050191535257356534,0.1333249491039865,0.03021277915326282,0.29372917371761326
607,2021-10-30 00:00:00,-0.0089133673903787,375.84,373.77,376.03,372.16,1.0,0.009001101563756109,0.060676796224452545,-0.21611618317160255,-0.11711782763593466
608,2021-10-31 00:00:00,-0.0089133673903787,375.84,373.77,376.03,372.16,1.0,0.08728830296816703,-0.032150439929779395,-0.12367922363011954,-0.644486617448244
