,Date,Return,Price,Open,High,Low,Index,TE(XY),TE(YX),Z(XY),Z(YX)
0,2020-03-02 00:00:00,0.0099047220186367,477.55,477.55,477.55,477.55,0.0,,,,
1,2020-03-03 00:00:00,0.0066973542340549,482.28,482.28,482.28,482.28,1.0,,,,
2,2020-03-04 00:00:00,-0.0152828983955016,485.51,485.51,485.51,485.51,1.0,,,,
3,2020-03-05 00:00:00,-0.0348260787717793,478.09,478.09,478.09,478.09,1.0,,,,
4,2020-03-06 00:00:00,-0.0760228848821081,461.44,461.44,461.44,461.44,1.0,,,,
5,2020-03-07 00:00:00,-0.0760228848821081,461.44,461.44,461.44,461.44,1.0,,,,
6,2020-03-08 00:00:00,-0.0760228848821081,461.44,461.44,461.44,461.44,1.0,,,,
7,2020-03-09 00:00:00,-0.0018998029833943,426.36,426.36,426.36,426.36,1.0,,,,
8,2020-03-10 00:00:00,0.0064857243567148,425.55,425.55,425.55,425.55,0.0,,,,
9,2020-03-11 00:00:00,-0.1453620041558684,428.31,428.31,428.31,428.31,1.0,,,,
10,2020-03-12 00:00:00,0.0224832673132084,366.05,366.05,366.05,366.05,1.0,0.0,0.0,0.0,0.0
11,2020-03-13 00:00:00,-0.0878753874104947,374.28,374.28,374.28,374.28,1.0,0.0,0.0,0.0,0.0
12,2020-03-14 00:00:00,-0.0878753874104947,374.28,374.28,374.28,374.28,1.0,0.0,0.0,0.0,0.0
13,2020-03-15 00:00:00,-0.0878753874104947,374.28,374.28,374.28,374.28,1.0,0.0,0.0,0.0,0.0
14,2020-03-16 00:00:00,-0.006737162775711,341.39,341.39,341.39,341.39,0.0,0.0,0.0,0.0,0.0
15,2020-03-17 00:00:00,0.0010026836533074,339.09,339.09,339.09,339.09,1.0,0.1261428349111311,-0.010213575689139276,0.035008032868493855,-0.38615033644270985
16,2020-03-18 00:00:00,0.0470494652800281,339.43,339.43,339.43,339.43,1.0,-0.024514119700069337,-0.021749350220821917,-0.6975044933028434,-0.6315063754091331
17,2020-03-19 00:00:00,0.0693021947101857,355.4,339.43,358.38,336.42,1.0,0.0,0.0,0.0,0.0
18,2020-03-20 00:00:00,-0.039575822961345,380.03,355.4,388.38,355.17,1.0,0.0,0.0,0.0,0.0
19,2020-03-21 00:00:00,-0.039575822961345,380.03,355.4,388.38,355.17,1.0,0.0,0.0,0.0,0.0
20,2020-03-22 00:00:00,-0.039575822961345,380.03,355.4,388.38,355.17,1.0,0.0,0.0,0.0,0.0
21,2020-03-23 00:00:00,0.0541110715362064,364.99,380.03,380.38,355.5,1.0,0.0,0.0,0.0,0.0
22,2020-03-24 00:00:00,0.0217549513957477,384.74,364.99,385.9,364.69,1.0,0.0,0.0,0.0,0.0
23,2020-03-25 00:00:00,0.0327389280354099,393.11,384.74,405.8,381.17,0.6666666666666666,0.0,0.0,0.0,0.0
24,2020-03-26 00:00:00,-0.0491896152519829,405.98,393.11,405.98,382.08,1.0,0.0,0.0,0.0,0.0
25,2020-03-27 00:00:00,0.0002331545814876,386.01,405.98,406.23,377.46,0.0,0.0,0.0,0.0,0.0
26,2020-03-28 00:00:00,0.0002331545814876,386.01,405.98,406.23,377.46,0.0,0.24112298697356227,0.6860019899119325,0.6881854262461045,1.9366718351800398
27,2020-03-29 00:00:00,0.0002331545814876,386.01,405.98,406.23,377.46,0.0,-0.000354590521491005,0.21060299825607665,-0.7161441153237922,0.7679816955212835
28,2020-03-30 00:00:00,0.032141932141932,386.1,386.01,388.81,374.06,1.0,-0.01221569321796867,0.18224048473231047,-0.8897029280956674,1.4615176323340073
29,2020-03-31 00:00:00,-0.0223080976637976,398.51,386.07,400.73,385.79,0.0,0.01230343707878756,0.04725108572891834,-0.7046996322639633,-0.23498527578703834
30,2020-04-01 00:00:00,0.0176325650633951,389.62,398.51,398.66,387.76,1.0,0.09997061087810888,-0.012119167265570496,0.26848134516627736,-0.8522852609008558
31,2020-04-02 00:00:00,-0.0114756992610154,396.49,389.62,400.2,387.66,1.0,0.09141913181048089,0.027688595444004704,-0.0446365012294536,-0.4701535484068104
32,2020-04-03 00:00:00,0.0352604990559779,391.94,396.49,397.4,389.59,1.0,0.1567835174199681,0.037449939755202166,0.20411860199477372,-0.13216683111721453
33,2020-04-04 00:00:00,0.0352604990559779,391.94,396.49,397.4,389.59,1.0,0.0,0.0,0.0,0.0
34,2020-04-05 00:00:00,0.0352604990559779,391.94,396.49,397.4,389.59,1.0,0.49930219798096687,0.18731394135954105,1.6930554503541801,0.5669476963117175
35,2020-04-06 00:00:00,0.0189274447949527,405.76,391.87,406.55,391.83,1.0,0.37914343751028046,0.18360607833706943,2.576280896963114,0.40243658350204825
36,2020-04-07 00:00:00,0.009094427244582,413.44,405.8,417.71,405.42,0.5,0.0,0.0,0.0,0.0
37,2020-04-08 00:00:00,0.0086529242569511,417.2,413.4,417.64,409.82,1.0,0.19534138317011696,0.1327916748648983,0.8718622894540723,0.08290152379598242
38,2020-04-09 00:00:00,0.0,420.81,417.16,427.26,416.19,0.5,0.0,0.0,0.0,0.0
39,2020-04-10 00:00:00,0.0,420.81,420.77,421.04,420.58,1.0,-0.10924853672400925,1.0591234005836556,-1.885894449909189,6.817460538807668
40,2020-04-11 00:00:00,0.0,420.81,420.77,421.04,420.58,1.0,-0.05353526288492194,0.9105058012159564,-0.9651686011557205,1.8670028619293784
41,2020-04-12 00:00:00,0.0,420.81,420.77,421.04,420.58,1.0,-0.06887193546687165,0.23491780767126968,-0.6431054385858402,0.4916552641426307
42,2020-04-13 00:00:00,-0.0041586464199995,420.81,420.81,421.04,420.62,1.0,-0.08914943151299859,0.0507817342919239,-0.7173802358608934,-0.23013388410697738
43,2020-04-14 00:00:00,-0.0396124659953229,419.06,420.77,429.74,416.36,0.0,-0.00066137406258715,-0.01260826904250223,-0.37430916637673306,-0.4692007708404829
44,2020-04-15 00:00:00,0.0033295234309,402.46,419.1,420.42,401.69,0.7142857142857143,-0.029289399260942872,-0.05540367629515508,-0.3717786001204518,-0.6123300145921292
45,2020-04-16 00:00:00,0.0220406141654283,403.8,402.43,409.7,402.28,1.0,0.5002774881467671,-0.09645222685267019,1.267413736506416,-1.0173269657607649
46,2020-04-17 00:00:00,0.0032469105888055,412.7,403.8,414.91,403.72,1.0,0.6273383552574643,-0.03320975358032996,2.296832678698171,-0.7072674532302966
47,2020-04-18 00:00:00,0.0032469105888055,412.7,403.8,414.91,403.72,1.0,0.6575954905840637,0.012665325603009592,2.5660214427524357,-0.3796777387468492
48,2020-04-19 00:00:00,0.0032469105888055,412.7,403.8,414.91,403.72,1.0,1.4660419724658693,0.05135864703207904,9.24588238182893,-0.48837555184049647
49,2020-04-20 00:00:00,-0.0397787653366825,414.04,412.7,415.24,407.93,1.0,1.2989143215956407,0.1050805423543153,8.768767194786621,-0.021618715414657437
50,2020-04-21 00:00:00,0.0113690670825263,397.57,414.0,414.19,397.57,1.0,1.3661522137128204,0.17374667621628426,7.014635180432762,0.28648734454853314
51,2020-04-22 00:00:00,0.0227063592727997,402.09,397.68,402.89,396.74,1.0,0.18214047233914865,0.27853818910551187,0.2792098484735839,0.6132890678350794
52,2020-04-23 00:00:00,-0.02514469140606,411.22,402.05,413.34,400.76,1.0,0.0,0.0,0.0,0.0
53,2020-04-24 00:00:00,0.0348233885452005,400.88,411.18,411.41,400.83,1.0,0.0,0.0,0.0,0.0
54,2020-04-25 00:00:00,0.0348233885452005,400.88,411.18,411.41,400.83,1.0,0.0,0.0,0.0,0.0
55,2020-04-26 00:00:00,0.0348233885452005,400.88,411.18,411.41,400.83,1.0,0.0,0.0,0.0,0.0
56,2020-04-27 00:00:00,0.0309999035772828,414.84,400.88,414.84,400.81,0.0,0.0,0.0,0.0,0.0
57,2020-04-28 00:00:00,0.0282674772036474,427.7,414.88,427.7,414.33,0.8,0.0,0.0,0.0,0.0
58,2020-04-29 00:00:00,-0.0337433775210896,439.79,427.78,440.11,427.25,1.0,0.3174381019628614,-0.05056686795985588,0.6683594126754961,-0.846180479239087
59,2020-04-30 00:00:00,0.0,424.95,439.75,440.8,423.08,0.8333333333333334,-0.056851380485839265,-0.04179829613350172,-0.8209945089159113,-0.5228769288109252
60,2020-05-01 00:00:00,-0.0522179079891751,424.95,424.98,425.14,424.67,1.0,0.14698427719096951,0.033190033701901545,0.5210566862831816,-0.3799432800796799
61,2020-05-02 00:00:00,-0.0522179079891751,424.95,424.98,425.14,424.67,1.0,0.1925319396337839,0.07742668864817359,0.5482002321344158,-0.1955688552543185
62,2020-05-03 00:00:00,-0.0522179079891751,424.95,424.98,425.14,424.67,1.0,0.22587878224501523,0.10321219946452809,0.850751854757191,0.07367234842706152
63,2020-05-04 00:00:00,0.0156668984010328,402.76,425.02,425.06,402.72,0.7777777777777778,0.1969875374095258,0.18695454604675232,0.3050470498109234,0.055721930257363994
64,2020-05-05 00:00:00,0.0032268315936147,409.07,402.76,411.13,402.65,1.0,0.06223948914009103,0.5488862666267909,-0.24037678330611098,2.1071721151089204
65,2020-05-06 00:00:00,0.0131338482906503,410.39,409.03,413.55,407.89,0.8571428571428571,0.1499545522639547,0.06913020091282629,-0.02531404023699096,-0.25668625138542106
66,2020-05-07 00:00:00,0.0010823031410843,415.78,410.47,419.42,410.24,0.75,0.2025949099391875,-0.04963171555673007,0.578864160438118,-0.6150515639337789
67,2020-05-08 00:00:00,0.0001441510703217,416.23,415.74,421.22,414.46,1.0,0.106698488415085,-0.003922144180372733,0.025621705380519576,-0.6066782069577952
68,2020-05-09 00:00:00,0.0001441510703217,416.23,415.74,421.22,414.46,1.0,0.0020775667587287217,0.013274799348469202,-0.6008504895263987,-0.4687000224665814
69,2020-05-10 00:00:00,0.0001441510703217,416.23,415.74,421.22,414.46,1.0,-0.04196591806446115,-0.002174165336377598,-1.0012532687055653,-0.47550919118497736
70,2020-05-11 00:00:00,-0.0070623843954935,416.29,416.31,420.06,412.63,1.0,-0.03450531096909071,-0.009690017151473995,-0.786224167083408,-0.7295390747557325
71,2020-05-12 00:00:00,-0.0272650296359018,413.35,416.37,416.44,411.74,1.0,-0.020646527186509722,-0.01808640691124097,-0.6839044543467372,-0.683120692706715
72,2020-05-13 00:00:00,-0.0336748905690409,402.08,413.35,413.46,402.08,1.0,0.22550677775809014,0.0065046820030101316,0.7672194103682676,-0.5823185592509664
73,2020-05-14 00:00:00,0.0130488495393009,388.54,402.11,402.19,384.08,1.0,0.1397043363282,0.5068665730777777,-0.01751637939858441,0.687500238970607
74,2020-05-15 00:00:00,0.028403749904728,393.61,388.54,396.9,387.82,1.0,0.0,0.0,0.0,0.0
75,2020-05-16 00:00:00,0.028403749904728,393.61,388.54,396.9,387.82,1.0,0.0,0.0,0.0,0.0
76,2020-05-17 00:00:00,0.028403749904728,393.61,388.54,396.9,387.82,1.0,0.0,0.0,0.0,0.0
77,2020-05-18 00:00:00,-0.0245312384199214,404.79,393.65,405.06,393.43,1.0,0.0,0.0,0.0,0.0
78,2020-05-19 00:00:00,0.013245200830674,394.86,404.72,408.9,390.88,1.0,0.0,0.0,0.0,0.0
79,2020-05-20 00:00:00,-0.0214201804593966,400.09,394.86,400.55,389.52,1.0,0.0,0.0,0.0,0.0
80,2020-05-21 00:00:00,0.0074581119738455,391.52,400.09,400.39,390.23,0.0,0.0,0.0,0.0,0.0
81,2020-05-22 00:00:00,0.0148058006287394,394.44,391.48,395.88,385.17,1.0,0.0,0.0,0.0,0.0
82,2020-05-23 00:00:00,0.0148058006287394,394.44,391.48,395.88,385.17,1.0,0.0,0.0,0.0,0.0
83,2020-05-24 00:00:00,0.0148058006287394,394.44,391.48,395.88,385.17,1.0,0.0,0.0,0.0,0.0
84,2020-05-25 00:00:00,0.0391725791945638,400.28,394.44,400.28,394.33,1.0,0.0,0.0,0.0,0.0
85,2020-05-26 00:00:00,0.0214924511972305,415.96,400.28,417.0,400.13,1.0,0.0,0.0,0.0,0.0
86,2020-05-27 00:00:00,0.0141445045893152,424.9,416.0,430.38,415.69,1.0,0.0,0.0,0.0,0.0
87,2020-05-28 00:00:00,-0.0232067020955651,430.91,424.9,433.97,424.67,1.0,0.0,0.0,0.0,0.0
88,2020-05-29 00:00:00,0.020099308640802,420.91,430.91,431.14,420.06,1.0,0.0,0.0,0.0,0.0
89,2020-05-30 00:00:00,0.020099308640802,420.91,430.91,431.14,420.06,1.0,0.0,0.0,0.0,0.0
90,2020-05-31 00:00:00,0.020099308640802,420.91,430.91,431.14,420.06,1.0,0.0,0.0,0.0,0.0
91,2020-06-01 00:00:00,0.0137177725504809,429.37,420.98,429.61,420.64,0.8,0.0,0.0,0.0,0.0
92,2020-06-02 00:00:00,0.039470661213987,435.26,429.33,436.49,428.63,1.0,0.0,0.0,0.0,0.0
93,2020-06-03 00:00:00,0.0029175139244982,452.44,435.22,452.7,435.1,1.0,0.0,0.0,0.0,0.0
94,2020-06-04 00:00:00,0.0234264809590973,453.76,452.44,456.54,446.92,0.0,0.0,0.0,0.0,0.0
95,2020-06-05 00:00:00,-0.0025409677210965,464.39,453.72,465.72,453.56,1.0,-0.07418141099519548,0.284158447789963,-0.9336137789666542,0.5890659012947465
96,2020-06-06 00:00:00,-0.0025409677210965,464.39,453.72,465.72,453.56,1.0,0.023907771537314382,0.5827396095933985,-0.36632151835250565,2.3036238611673436
97,2020-06-07 00:00:00,-0.0025409677210965,464.39,453.72,465.72,453.56,1.0,0.1558224462084814,0.10829896474985867,0.4959495074092798,0.01928760316089061
98,2020-06-08 00:00:00,-0.0150255823492583,463.21,464.39,467.72,460.77,1.0,0.19779814958061337,0.0003586386669991448,0.8315286829053036,-0.43667347239478166
99,2020-06-09 00:00:00,-0.0160657534246575,456.25,463.21,464.33,452.45,1.0,0.23922214603695924,-0.04215862259397474,0.7610389906177537,-0.7773036412122527
100,2020-06-10 00:00:00,-0.0506549051055867,448.92,456.17,461.25,448.04,1.0,0.0,0.0,0.0,0.0
101,2020-06-11 00:00:00,0.0108639541977568,426.18,448.88,449.08,426.18,1.0,0.0,0.0,0.0,0.0
102,2020-06-12 00:00:00,0.0095865926974768,430.81,426.22,438.04,420.08,1.0,0.0,0.0,0.0,0.0
103,2020-06-13 00:00:00,0.0095865926974768,430.81,426.22,438.04,420.08,1.0,0.0,0.0,0.0,0.0
104,2020-06-14 00:00:00,0.0095865926974768,430.81,426.22,438.04,420.08,1.0,0.0,0.0,0.0,0.0
105,2020-06-15 00:00:00,0.0344875155193819,434.94,430.77,438.81,421.55,0.75,0.0,0.0,0.0,0.0
106,2020-06-16 00:00:00,-0.0043339111881583,449.94,434.94,456.88,434.83,1.0,0.0,0.0,0.0,0.0
107,2020-06-17 00:00:00,-0.0044643853657447,447.99,449.86,455.5,445.08,0.0,0.0,0.0,0.0,0.0
108,2020-06-18 00:00:00,-0.0059866813157246,445.99,447.95,452.71,441.31,1.0,0.32094878490559253,0.0023823159608902245,1.3336938547236452,-0.40671830394126657
109,2020-06-19 00:00:00,-0.0050302264729766,443.32,446.03,449.83,443.32,0.0,0.03411375755024704,0.4160715907622392,-0.19537263629940146,1.8856468923840009
110,2020-06-20 00:00:00,-0.0050302264729766,443.32,446.03,449.83,443.32,0.0,-0.12159573778900867,1.6100381328861744,-1.4616119978731321,9.948181670027127
111,2020-06-21 00:00:00,-0.0050302264729766,443.32,446.03,449.83,443.32,0.0,-0.10674074421429847,0.2704682853496756,-1.0513850772769557,1.2940589426200646
112,2020-06-22 00:00:00,0.0160058038042123,441.09,443.32,445.28,437.14,1.0,-0.10291792891039986,0.14867375326689203,-1.1302970889379769,0.6699484491319885
113,2020-06-23 00:00:00,-0.0386924020975119,448.15,441.13,451.3,440.9,1.0,-0.06340510179548797,0.06266630965455366,-1.1906469205342722,-0.26358710161394006
114,2020-06-24 00:00:00,0.0140201016689492,430.81,448.19,448.31,430.81,1.0,0.0,0.0,0.0,0.0
115,2020-06-25 00:00:00,-0.0133226507954676,436.85,430.77,437.32,423.99,0.0,0.0,0.0,0.0,0.0
116,2020-06-26 00:00:00,0.0026912279887711,431.03,436.81,440.99,431.03,1.0,0.0,0.0,0.0,0.0
117,2020-06-27 00:00:00,0.0026912279887711,431.03,436.81,440.99,431.03,1.0,0.0,0.0,0.0,0.0
118,2020-06-28 00:00:00,0.0026912279887711,431.03,436.81,440.99,431.03,1.0,0.07139343829219857,0.0042216880506380505,-0.2611379520123803,-0.5865555747869952
119,2020-06-29 00:00:00,0.0036326615608875,432.19,431.07,434.53,424.38,1.0,0.06807563608858214,-0.01184012424592673,-0.021423325347127882,-0.5528933736626451
120,2020-06-30 00:00:00,-0.0022823681298414,433.76,432.23,436.34,429.83,1.0,0.0,0.0,0.0,0.0
121,2020-07-01 00:00:00,0.0194329551493865,432.77,433.8,436.95,428.42,1.0,0.0,0.0,0.0,0.0
122,2020-07-02 00:00:00,-0.0028333106668479,441.18,432.77,444.55,432.69,1.0,0.0,0.0,0.0,0.0
123,2020-07-03 00:00:00,0.0239810879003478,439.93,441.14,442.88,438.11,1.0,0.0,0.0,0.0,0.0
124,2020-07-04 00:00:00,0.0239810879003478,439.93,441.14,442.88,438.11,1.0,0.0,0.0,0.0,0.0
125,2020-07-05 00:00:00,0.0239810879003478,439.93,441.14,442.88,438.11,1.0,0.0,0.0,0.0,0.0
126,2020-07-06 00:00:00,-0.0022864500088794,450.48,439.97,450.48,439.81,1.0,0.0,0.0,0.0,0.0
127,2020-07-07 00:00:00,-0.0077872955834909,449.45,450.44,450.66,447.15,0.0,0.0,0.0,0.0,0.0
128,2020-07-08 00:00:00,-0.0104944500504541,445.95,449.41,449.61,444.69,1.0,0.0,0.0,0.0,0.0
129,2020-07-09 00:00:00,0.0164978357921454,441.27,445.99,448.34,440.56,1.0,0.0,0.0,0.0,0.0
130,2020-07-10 00:00:00,0.0062423364173448,448.55,441.3,448.55,438.74,1.0,0.0,0.0,0.0,0.0
131,2020-07-11 00:00:00,0.0062423364173448,448.55,441.3,448.55,438.74,1.0,0.0,0.0,0.0,0.0
132,2020-07-12 00:00:00,0.0062423364173448,448.55,441.3,448.55,438.74,1.0,0.0,0.0,0.0,0.0
133,2020-07-13 00:00:00,-0.0060706768583139,451.35,448.55,454.16,448.21,0.0,0.0,0.0,0.0,0.0
134,2020-07-14 00:00:00,0.0108111722877331,448.61,451.31,451.51,442.68,1.0,-0.06244827548822318,0.3139988745861588,-0.9342063083539911,1.4451228893312995
135,2020-07-15 00:00:00,-0.0005072112203942,453.46,448.61,458.19,448.53,1.0,-0.004190874697970415,0.2877297350655317,-0.5808740708160686,0.8683615351680827
136,2020-07-16 00:00:00,-0.0028462370099067,453.23,453.43,454.02,448.55,1.0,0.0,0.0,0.0,0.0
137,2020-07-17 00:00:00,0.0107315130327035,451.94,453.19,453.35,449.06,1.0,0.0,0.0,0.0,0.0
138,2020-07-18 00:00:00,0.0107315130327035,451.94,453.19,453.35,449.06,1.0,0.0,0.0,0.0,0.0
139,2020-07-19 00:00:00,0.0107315130327035,451.94,453.19,453.35,449.06,1.0,0.0,0.0,0.0,0.0
140,2020-07-20 00:00:00,0.013572976641345,456.79,451.9,457.04,445.43,1.0,0.0,0.0,0.0,0.0
141,2020-07-21 00:00:00,-0.0147303397481586,462.99,456.75,464.99,456.55,1.0,0.0,0.0,0.0,0.0
142,2020-07-22 00:00:00,-0.0037705241466997,456.17,462.99,463.11,454.28,1.0,0.0,0.0,0.0,0.0
143,2020-07-23 00:00:00,-0.0141489712839696,454.45,456.17,457.81,453.16,1.0,0.0,0.0,0.0,0.0
144,2020-07-24 00:00:00,-0.0094192223561447,448.02,454.41,454.57,445.29,1.0,0.0,0.0,0.0,0.0
145,2020-07-25 00:00:00,-0.0094192223561447,448.02,454.41,454.57,445.29,1.0,0.0,0.0,0.0,0.0
146,2020-07-26 00:00:00,-0.0094192223561447,448.02,454.41,454.57,445.29,1.0,0.0,0.0,0.0,0.0
147,2020-07-27 00:00:00,0.0143307796304642,443.8,447.98,448.21,441.47,1.0,0.0,0.0,0.0,0.0
148,2020-07-28 00:00:00,-0.0067087257863871,450.16,443.8,450.48,443.65,1.0,0.0,0.0,0.0,0.0
149,2020-07-29 00:00:00,-0.008252448897437,447.14,450.16,452.6,446.86,1.0,0.0,0.0,0.0,0.0
150,2020-07-30 00:00:00,-0.0229338144097418,443.45,447.14,461.49,440.3,1.0,0.0,0.0,0.0,0.0
151,2020-07-31 00:00:00,0.0100858567208271,433.28,443.49,445.68,433.28,1.0,0.0,0.0,0.0,0.0
152,2020-08-01 00:00:00,0.0100858567208271,433.28,443.49,445.68,433.28,1.0,0.0,0.0,0.0,0.0
153,2020-08-02 00:00:00,0.0100858567208271,433.28,443.49,445.68,433.28,1.0,0.0,0.0,0.0,0.0
154,2020-08-03 00:00:00,0.0057808751285274,437.65,433.24,437.65,428.94,1.0,0.0,0.0,0.0,0.0
155,2020-08-04 00:00:00,0.001703848425644,440.18,437.68,443.59,437.5,1.0,0.0,0.0,0.0,0.0
156,2020-08-05 00:00:00,-0.0166466332524437,440.93,440.14,444.61,438.67,1.0,0.0,0.0,0.0,0.0
157,2020-08-06 00:00:00,0.0050277912313476,433.59,441.0,442.48,430.54,0.8,0.0,0.0,0.0,0.0
158,2020-08-07 00:00:00,0.0042683066755398,435.77,433.56,436.9,429.57,1.0,0.0,0.0,0.0,0.0
159,2020-08-08 00:00:00,0.0042683066755398,435.77,433.56,436.9,429.57,1.0,0.0,0.0,0.0,0.0
160,2020-08-09 00:00:00,0.0042683066755398,435.77,433.56,436.9,429.57,1.0,0.0,0.0,0.0,0.0
161,2020-08-10 00:00:00,0.0226218495075748,437.63,435.73,440.14,435.29,0.0,0.0,0.0,0.0,0.0
162,2020-08-11 00:00:00,0.0088932585524993,447.53,437.59,448.08,437.52,0.0,-0.058187203204892235,-0.025697705444903463,-0.7789004439521854,-0.8394791200884428
163,2020-08-12 00:00:00,-0.0035436645921462,451.51,447.57,452.28,445.16,0.0,0.39805296975492954,-0.017390555825507192,1.0635099070033152,-0.580584332402159
164,2020-08-13 00:00:00,-0.0066457735991642,449.91,451.51,451.67,448.07,1.0,0.7111702478596378,-0.05997001453083595,4.290570376003754,-0.8911424859144048
165,2020-08-14 00:00:00,-0.0013425221516155,446.92,449.95,450.06,442.08,0.0,1.0937769785647422,0.00322830722978118,4.747806170672234,-0.6774507195736971
166,2020-08-15 00:00:00,-0.0013425221516155,446.92,449.95,450.06,442.08,0.0,0.0,0.0,0.0,0.0
167,2020-08-16 00:00:00,-0.0013425221516155,446.92,449.95,450.06,442.08,0.0,0.5012344464301774,0.035912294939897116,3.3560603575564336,-0.29428715162164165
168,2020-08-17 00:00:00,-0.0066992292525542,446.32,446.96,448.75,443.82,1.0,0.3738803291971937,0.027832906982540706,1.1282685023590113,-0.48774837521084524
169,2020-08-18 00:00:00,-0.0035639365709516,443.33,446.36,448.74,442.53,1.0,0.19768932023955177,0.01868051156498929,0.5024129193015516,-0.35323532425727444
170,2020-08-19 00:00:00,-0.0123372948500282,441.75,443.37,445.59,435.51,1.0,0.21484261723757836,0.009662894590112714,0.5077045723758252,-0.6427357845071773
171,2020-08-20 00:00:00,-0.0099472839789136,436.3,441.79,441.87,434.93,0.0,0.0,0.0,0.0,0.0
172,2020-08-21 00:00:00,0.0214371701083434,431.96,436.37,438.06,430.23,1.0,0.0,0.0,0.0,0.0
173,2020-08-22 00:00:00,0.0214371701083434,431.96,436.37,438.06,430.23,1.0,0.0,0.0,0.0,0.0
174,2020-08-23 00:00:00,0.0214371701083434,431.96,436.37,438.06,430.23,1.0,0.09089452195665526,0.03900495852607477,0.1005795900876582,-0.3511488431809025
175,2020-08-24 00:00:00,-0.0033996645664294,441.22,431.92,441.52,431.89,1.0,0.06248327541223553,0.011046847148543648,-0.3345457480404919,-0.28453876432011577
176,2020-08-25 00:00:00,0.0111207131811152,439.72,441.26,445.87,439.29,1.0,0.0,0.0,0.0,0.0
177,2020-08-26 00:00:00,-0.0055554306021007,444.61,439.72,445.04,438.49,0.5,0.0,0.0,0.0,0.0
178,2020-08-27 00:00:00,-4.523454109553945e-05,442.14,444.61,445.13,441.33,1.0,0.09717248704688064,0.07600629403748194,-0.015740382765031816,-0.26855647570367014
179,2020-08-28 00:00:00,-0.0106758346150367,442.12,442.14,444.58,439.16,1.0,0.07496491665517979,0.10199064356299559,-0.2763996257251363,-0.012392634222847159
180,2020-08-29 00:00:00,-0.0106758346150367,442.12,442.14,444.58,439.16,1.0,0.0,0.0,0.0,0.0
181,2020-08-30 00:00:00,-0.0106758346150367,442.12,442.14,444.58,439.16,1.0,0.0,0.0,0.0,0.0
182,2020-08-31 00:00:00,-0.0062414266117968,437.4,442.12,446.04,436.66,1.0,0.0,0.0,0.0,0.0
183,2020-09-01 00:00:00,0.0175995582855959,434.67,437.4,440.48,432.36,1.0,0.0,0.0,0.0,0.0
184,2020-09-02 00:00:00,-0.0072119732320491,442.32,434.71,443.13,434.57,0.5,0.0,0.0,0.0,0.0
185,2020-09-03 00:00:00,-0.0116138728850227,439.13,442.36,449.2,437.11,0.0,-0.06512286753749308,0.07686738981875951,-0.8704289204919087,-0.23059235133533607
186,2020-09-04 00:00:00,0.0133400916987305,434.03,439.05,442.35,431.16,1.0,-0.06330623169996574,0.2226638141842976,-0.3951052065178141,0.5065809539624997
187,2020-09-05 00:00:00,0.0133400916987305,434.03,439.05,442.35,431.16,1.0,0.09886550404513006,0.024420745968972923,-0.04577928348791435,-0.5867105331590824
188,2020-09-06 00:00:00,0.0133400916987305,434.03,439.05,442.35,431.16,1.0,0.08561430991449459,-0.011895284670986328,-0.0845298498975337,-0.7184261237427028
189,2020-09-07 00:00:00,-0.0206902823882496,439.82,433.99,440.89,433.92,1.0,0.06225748857640134,-0.0036858288122338934,-0.21128537980069778,-0.4067759716580712
190,2020-09-08 00:00:00,0.0166929791976225,430.72,439.86,441.65,428.64,1.0,0.0071356225778735904,0.03786240598096313,-0.5788575982340047,-0.3736734463928761
191,2020-09-09 00:00:00,0.0,437.91,430.76,438.32,430.58,1.0,-0.05341367448056822,0.0661533066728861,-0.7706044657256792,-0.22069255802479595
192,2020-09-10 00:00:00,-0.0025347674179626,437.91,437.95,440.58,436.32,1.0,-0.025783808497424232,0.1760303872937179,-0.5932517413576295,0.31645100981641855
193,2020-09-11 00:00:00,-0.0037316849816849,436.8,437.91,439.84,434.81,1.0,0.0,0.0,0.0,0.0
194,2020-09-12 00:00:00,-0.0037316849816849,436.8,437.91,439.84,434.81,1.0,0.0,0.0,0.0,0.0
195,2020-09-13 00:00:00,-0.0037316849816849,436.8,437.91,439.84,434.81,1.0,0.0,0.0,0.0,0.0
196,2020-09-14 00:00:00,0.0037686421398533,435.17,436.76,439.86,434.52,1.0,0.0,0.0,0.0,0.0
197,2020-09-15 00:00:00,0.0107369336782582,436.81,435.2,439.1,433.23,0.3333333333333333,0.0,0.0,0.0,0.0
198,2020-09-16 00:00:00,0.003850509626274,441.5,436.81,441.5,436.49,1.0,0.0,0.0,0.0,0.0
199,2020-09-17 00:00:00,-0.0028880866425992,443.2,441.54,444.85,435.97,0.75,0.0,0.0,0.0,0.0
200,2020-09-18 00:00:00,-0.0385137581462709,441.92,443.2,445.07,441.5,1.0,0.675446924421105,0.1319503043686594,2.796484038429784,0.0274478939142265
201,2020-09-19 00:00:00,-0.0385137581462709,441.92,443.2,445.07,441.5,1.0,0.4193671303669184,0.021153469575688533,1.8345089832822477,-0.28434326049643627
202,2020-09-20 00:00:00,-0.0385137581462709,441.92,443.2,445.07,441.5,1.0,0.3486965816528125,0.0553761365688521,1.7491205588911105,-0.196017558424086
203,2020-09-21 00:00:00,-0.0035302424099788,424.9,441.92,442.07,424.46,1.0,0.3032688843996514,0.1219771773440037,0.6033534757205791,-0.02202918638358418
204,2020-09-22 00:00:00,-0.0042276806802077,423.4,424.9,428.55,422.84,1.0,0.04509219114415508,0.2360782311606533,-0.2908707512346393,0.029776446994587813
205,2020-09-23 00:00:00,-0.0169113635824577,421.61,423.43,429.35,421.61,1.0,0.008478204114909182,-0.05350501829013776,-0.41691989230975757,-0.9442601315514711
206,2020-09-24 00:00:00,-0.0003377726307663,414.48,421.68,421.87,413.08,1.0,0.0,0.0,0.0,0.0
207,2020-09-25 00:00:00,0.0278756576724429,414.34,414.45,418.1,410.54,1.0,0.0,0.0,0.0,0.0
208,2020-09-26 00:00:00,0.0278756576724429,414.34,414.45,418.1,410.54,1.0,0.0,0.0,0.0,0.0
209,2020-09-27 00:00:00,0.0278756576724429,414.34,414.45,418.1,410.54,1.0,0.0,0.0,0.0,0.0
210,2020-09-28 00:00:00,-0.0088285707577073,425.89,414.3,426.36,414.23,0.6666666666666666,0.0,0.0,0.0,0.0
211,2020-09-29 00:00:00,-0.0019425295525075,422.13,425.89,426.07,420.82,1.0,0.0,0.0,0.0,0.0
212,2020-09-30 00:00:00,-0.0008307422088249,421.31,422.13,425.42,419.25,0.75,0.0,0.0,0.0,0.0
213,2020-10-01 00:00:00,0.0014015583428354,420.96,421.35,424.39,419.51,1.0,-0.12393890442864564,-0.008316766864314928,-1.0312137227352416,-0.5390432595265193
214,2020-10-02 00:00:00,0.0151346222274937,421.55,420.92,421.55,415.1,1.0,-0.05856107967509061,0.011991193711008208,-0.7786871829429081,-0.4201872801132368
215,2020-10-03 00:00:00,0.0151346222274937,421.55,420.92,421.55,415.1,1.0,-0.09246587053177091,0.020498124237786186,-1.031415246441634,-0.45389267703407643
216,2020-10-04 00:00:00,0.0151346222274937,421.55,420.92,421.55,415.1,1.0,-0.07309404111502271,-0.0068983764692820415,-1.0208888798098046,-0.479540653422603
217,2020-10-05 00:00:00,0.0153997149066435,427.93,421.52,428.18,421.44,1.0,-0.06807435842661125,-0.01633379075111918,-0.5309022770128567,-0.45923044907809957
218,2020-10-06 00:00:00,-0.0031068765534381,434.52,427.93,436.85,427.82,1.0,-0.006248063294751027,0.07966531836960122,-0.536594785525037,-0.20103099582609832
219,2020-10-07 00:00:00,0.0140822309947594,433.17,434.52,438.91,432.8,1.0,0.0,0.0,0.0,0.0
220,2020-10-08 00:00:00,0.004803423862317,439.27,433.17,440.76,433.1,1.0,0.0,0.0,0.0,0.0
221,2020-10-09 00:00:00,0.0004078118627939,441.38,439.23,443.43,438.54,1.0,0.0,0.0,0.0,0.0
222,2020-10-10 00:00:00,0.0004078118627939,441.38,439.23,443.43,438.54,1.0,0.0,0.0,0.0,0.0
223,2020-10-11 00:00:00,0.0004078118627939,441.38,439.23,443.43,438.54,1.0,0.0,0.0,0.0,0.0
224,2020-10-12 00:00:00,-0.0153546516894646,441.56,441.38,443.29,439.62,0.0,0.0,0.0,0.0,0.0
225,2020-10-13 00:00:00,-0.0030820184921108,434.78,441.53,441.71,433.7,1.0,0.0,0.0,0.0,0.0
226,2020-10-14 00:00:00,-0.0261627906976743,433.44,434.78,435.66,431.49,0.0,0.0,0.0,0.0,0.0
227,2020-10-15 00:00:00,0.0040985548448234,422.1,433.44,433.55,420.54,1.0,0.30176654535499203,-0.0012496332869389448,0.5965124829295292,-0.5469188447271562
228,2020-10-16 00:00:00,0.0024302196635444,423.83,422.1,424.76,419.59,1.0,0.6809036638468582,-0.02613074431124307,3.3033549661847705,-0.6378052710169264
229,2020-10-17 00:00:00,0.0024302196635444,423.83,422.1,424.76,419.59,1.0,1.3082533461007237,-0.0028798468726405346,6.602828094122711,-0.5642260564819903
230,2020-10-18 00:00:00,0.0024302196635444,423.83,422.1,424.76,419.59,1.0,1.4491925352957065,0.10104632887243703,7.363506395936125,-0.27674128763682515
231,2020-10-19 00:00:00,-0.0002589088170221,424.86,423.83,427.59,423.22,1.0,1.4089816056336364,0.2983786168948823,5.7434594500994365,1.0270771962728518
232,2020-10-20 00:00:00,-0.0201530311948204,424.75,424.83,427.82,423.01,1.0,1.314223436199545,0.9881314348154513,7.5600790190116935,3.383851166129353
233,2020-10-21 00:00:00,0.0028832984934765,416.19,424.72,425.31,416.05,1.0,0.0,0.0,0.0,0.0
234,2020-10-22 00:00:00,0.0168667193751647,417.39,416.15,417.42,411.61,1.0,0.0,0.0,0.0,0.0
235,2020-10-23 00:00:00,-0.012204603821596,424.43,417.35,425.98,417.0,1.0,0.0,0.0,0.0,0.0
236,2020-10-24 00:00:00,-0.012204603821596,424.43,417.35,425.98,417.0,1.0,0.0,0.0,0.0,0.0
237,2020-10-25 00:00:00,-0.012204603821596,424.43,417.35,425.98,417.0,1.0,0.0,0.0,0.0,0.0
238,2020-10-26 00:00:00,-0.0186762075134167,419.25,424.47,425.11,418.4,1.0,0.0,0.0,0.0,0.0
239,2020-10-27 00:00:00,-0.0337368139614019,411.42,419.25,420.58,411.16,0.6666666666666666,0.0,0.0,0.0,0.0
240,2020-10-28 00:00:00,-0.0004779393268601,397.54,411.45,411.52,394.54,1.0,0.0,0.0,0.0,0.0
241,2020-10-29 00:00:00,-0.002768340254184,397.35,397.51,404.3,392.14,1.0,0.0,0.0,0.0,0.0
242,2020-10-30 00:00:00,0.0065867507886435,396.25,397.32,399.24,392.93,1.0,0.0,0.0,0.0,0.0
243,2020-10-31 00:00:00,0.0065867507886435,396.25,397.32,399.24,392.93,1.0,0.0,0.0,0.0,0.0
244,2020-11-01 00:00:00,0.0065867507886435,396.25,397.32,399.24,392.93,1.0,0.0,0.0,0.0,0.0
245,2020-11-02 00:00:00,0.023191094619666,398.86,396.47,399.21,392.51,1.0,0.0,0.0,0.0,0.0
246,2020-11-03 00:00:00,0.0128886819729974,408.11,398.71,408.28,398.71,1.0,0.0,0.0,0.0,0.0
247,2020-11-04 00:00:00,0.0116118731402859,413.37,408.11,414.28,400.43,1.0,0.0,0.0,0.0,0.0
248,2020-11-05 00:00:00,-0.003013128631896,418.17,412.51,418.83,411.82,1.0,0.0,0.0,0.0,0.0
249,2020-11-06 00:00:00,0.0703269290734211,416.91,418.51,421.44,415.09,1.0,0.0,0.0,0.0,0.0
250,2020-11-07 00:00:00,0.0703269290734211,416.91,418.51,421.44,415.09,1.0,0.0,0.0,0.0,0.0
251,2020-11-08 00:00:00,0.0703269290734211,416.91,418.51,421.44,415.09,1.0,0.0,0.0,0.0,0.0
252,2020-11-09 00:00:00,0.0411447011630772,446.23,416.27,448.96,416.27,1.0,0.0,0.0,0.0,0.0
253,2020-11-10 00:00:00,0.0023461546740137,464.59,446.15,464.59,444.89,1.0,0.0,0.0,0.0,0.0
254,2020-11-11 00:00:00,-0.0086325373647139,465.68,464.59,467.47,461.12,1.0,0.0,0.0,0.0,0.0
255,2020-11-12 00:00:00,0.0036607026816271,461.66,464.81,465.8,459.91,1.0,0.0,0.0,0.0,0.0
256,2020-11-13 00:00:00,0.0199848926297614,463.35,461.62,464.23,455.8,1.0,0.0,0.0,0.0,0.0
257,2020-11-14 00:00:00,0.0199848926297614,463.35,461.62,464.23,455.8,1.0,0.0,0.0,0.0,0.0
258,2020-11-15 00:00:00,0.0199848926297614,463.35,461.62,464.23,455.8,1.0,0.0,0.0,0.0,0.0
259,2020-11-16 00:00:00,-0.0009521592856689,472.61,462.37,478.86,462.37,1.0,0.0,0.0,0.0,0.0
260,2020-11-17 00:00:00,0.0032192477126397,472.16,471.68,473.72,468.7,1.0,0.0,0.0,0.0,0.0
261,2020-11-18 00:00:00,-0.0141867927714913,473.68,472.61,473.71,468.97,1.0,0.0,0.0,0.0,0.0
262,2020-11-19 00:00:00,0.0018845297241733,466.96,473.76,473.88,466.85,1.0,0.0,0.0,0.0,0.0
263,2020-11-20 00:00:00,0.005578830369357,467.84,465.94,470.06,465.94,1.0,0.0,0.0,0.0,0.0
264,2020-11-21 00:00:00,0.005578830369357,467.84,465.94,470.06,465.94,1.0,0.0,0.0,0.0,0.0
265,2020-11-22 00:00:00,0.005578830369357,467.84,465.94,470.06,465.94,1.0,0.0,0.0,0.0,0.0
266,2020-11-23 00:00:00,0.0269104049314486,470.45,467.88,474.33,467.76,1.0,0.0,0.0,0.0,0.0
267,2020-11-24 00:00:00,-0.0037672579743743,483.11,470.49,483.19,470.37,1.0,0.0,0.0,0.0,0.0
268,2020-11-25 00:00:00,-0.0045502711462943,481.29,482.07,486.97,477.33,1.0,0.0,0.0,0.0,0.0
269,2020-11-26 00:00:00,0.0059277812565225,479.1,480.62,483.01,478.38,1.0,0.0,0.0,0.0,0.0
270,2020-11-27 00:00:00,-0.0157280989334771,481.94,478.74,483.04,476.83,1.0,0.0,0.0,0.0,0.0
271,2020-11-28 00:00:00,-0.0157280989334771,481.94,478.74,483.04,476.83,1.0,0.0,0.0,0.0,0.0
272,2020-11-29 00:00:00,-0.0157280989334771,481.94,478.74,483.04,476.83,1.0,0.0,0.0,0.0,0.0
273,2020-11-30 00:00:00,0.0129015937262838,474.36,480.99,482.02,474.36,0.0,0.0,0.0,0.0,0.0
274,2020-12-01 00:00:00,-0.0031843156843157,480.48,474.36,480.48,474.28,0.6666666666666666,0.0,0.0,0.0,0.0
275,2020-12-02 00:00:00,0.0068691930264119,478.95,478.95,480.6,476.01,0.6,-0.08908646850924384,-0.0406927426256809,-0.7770873175499321,-0.6446749229500305
276,2020-12-03 00:00:00,0.0036703715992036,482.24,477.53,483.12,477.53,0.6666666666666666,-0.01326847534644493,0.05041158308188365,-0.506386401981398,-0.4398590175364209
277,2020-12-04 00:00:00,-0.0046899857440961,484.01,482.88,487.45,482.09,1.0,-0.0028906348082093913,0.11128492205560381,-0.4252621934785142,-0.18001592004896674
278,2020-12-05 00:00:00,-0.0046899857440961,484.01,482.88,487.45,482.09,1.0,0.025462432515499067,0.03635043044218822,-0.41087895239596095,-0.3807919680685469
279,2020-12-06 00:00:00,-0.0046899857440961,484.01,482.88,487.45,482.09,1.0,0.21913601434582297,0.14100598634848538,0.05856788774544441,0.3267206211285179
280,2020-12-07 00:00:00,-0.0011832108606302,481.74,484.01,484.13,478.9,1.0,0.3122382220096611,0.3052436733104873,2.0842426462666084,2.0812661822297605
281,2020-12-08 00:00:00,0.0020159195294801,481.17,481.78,482.42,477.27,1.0,0.563649545471435,0.7974414000662202,4.218689799974995,3.451444432812794
282,2020-12-09 00:00:00,0.0005807441821878,482.14,481.13,483.66,480.86,0.6666666666666666,0.1487177275424667,0.16220017384894092,-0.11244368836097657,0.16881955677180183
283,2020-12-10 00:00:00,-0.01187761701422,482.42,482.24,486.34,479.71,1.0,0.08550219961445382,0.38243117175173147,-0.1181201236983137,2.233166510722924
284,2020-12-11 00:00:00,0.0044053787576832,476.69,482.42,483.01,473.06,1.0,0.11978456562729889,0.6585450964386599,0.2959549817106393,5.035750723036184
285,2020-12-12 00:00:00,0.0044053787576832,476.69,482.42,483.01,473.06,1.0,0.0,0.0,0.0,0.0
286,2020-12-13 00:00:00,0.0044053787576832,476.69,482.42,483.01,473.06,1.0,0.0,0.0,0.0,0.0
287,2020-12-14 00:00:00,0.0059107333068777,478.79,476.69,482.69,476.61,0.5,0.0,0.0,0.0,0.0
288,2020-12-15 00:00:00,-0.0082845396785847,481.62,477.85,482.42,477.85,0.0,-0.004960584618792119,0.012025190783877093,-0.951476688255518,-0.49543203253648865
289,2020-12-16 00:00:00,0.0087306073739087,477.63,481.52,483.16,476.22,1.0,0.13074805346461194,0.04519866982754639,0.17969260132270756,-0.22816504389332323
290,2020-12-17 00:00:00,-0.0084267330842673,481.8,477.26,482.41,477.09,1.0,0.04449941962058812,-0.02733663661281316,-0.2855854104467671,-0.7500198027622453
291,2020-12-18 00:00:00,-0.0221040733453342,477.74,481.13,481.95,477.62,1.0,0.018757869678577954,0.009237927299696302,-0.49817492453910356,-0.7099964455224399
292,2020-12-19 00:00:00,-0.0221040733453342,477.74,481.13,481.95,477.62,1.0,-0.04457658446673207,-0.024535635013656076,-0.7136648633410261,-0.6681098079909267
293,2020-12-20 00:00:00,-0.0221040733453342,477.74,481.13,481.95,477.62,1.0,-0.033526144651129464,-0.02535712276931612,-0.8178166067460462,-0.6110144972684649
294,2020-12-21 00:00:00,0.0087974656449334,467.18,478.62,478.62,456.96,0.6,-0.01654476899851698,0.0062039181655570985,-0.6676968723044528,-0.47568502622284564
295,2020-12-22 00:00:00,0.0140465530777228,471.29,467.21,471.86,466.25,0.0,0.029932705593628484,0.04650747176826364,-0.5265779086768386,-0.21035467438996655
296,2020-12-23 00:00:00,-0.000690506580737,477.91,471.29,478.42,471.03,1.0,0.004926001429065963,0.07238329709913671,-0.4576831790226522,-0.3671431251347923
297,2020-12-24 00:00:00,0.0,477.58,477.91,479.34,475.76,1.0,-0.023105616083021197,0.29067993010489257,-0.661649473888406,0.4289113673200803
298,2020-12-25 00:00:00,0.0040202688554797,477.58,477.58,478.21,476.96,1.0,0.012028017150465864,0.7095247203634187,-0.42292052129495955,2.9368369513849673
299,2020-12-26 00:00:00,0.0040202688554797,477.58,477.58,478.21,476.96,1.0,0.07240643342753916,0.7051089776760797,-0.20590480001124198,0.558664447331568
300,2020-12-27 00:00:00,0.0040202688554797,477.58,477.58,478.21,476.96,1.0,0.04699015114535854,0.9690435306145968,0.0042043811790201625,0.8468545647077695
301,2020-12-28 00:00:00,0.004045881126173,479.5,476.78,480.84,476.78,1.0,0.04604328263940172,0.9555114717346278,-0.15108904200207177,0.8760022108696432
302,2020-12-29 00:00:00,-0.0035518444666001,481.44,479.5,482.3,479.38,1.0,0.04249710302051213,0.9436455152714096,-0.25293905912357534,4.5823155975947945
303,2020-12-30 00:00:00,-0.0123611197965522,479.73,481.02,481.55,478.17,1.0,0.0,0.0,0.0,0.0
304,2020-12-31 00:00:00,0.0,473.8,479.73,479.84,473.61,1.0,0.0,0.0,0.0,0.0
305,2021-01-01 00:00:00,0.0117138032925285,473.8,473.8,473.8,473.8,1.0,0.0,0.0,0.0,0.0
306,2021-01-02 00:00:00,0.0117138032925285,473.8,473.8,473.8,473.8,1.0,0.0,0.0,0.0,0.0
307,2021-01-03 00:00:00,0.0117138032925285,473.8,473.8,473.8,473.8,1.0,0.0,0.0,0.0,0.0
308,2021-01-04 00:00:00,-0.0054448732658809,479.35,473.24,485.38,473.24,1.0,0.0,0.0,0.0,0.0
309,2021-01-05 00:00:00,0.0210806729034694,476.74,480.1,481.76,475.4,1.0,0.0,0.0,0.0,0.0
310,2021-01-06 00:00:00,0.0039236631812485,486.79,476.81,488.73,476.16,1.0,0.0,0.0,0.0,0.0
311,2021-01-07 00:00:00,0.0018825455289544,488.7,486.83,489.74,484.14,1.0,0.0,0.0,0.0,0.0
312,2021-01-08 00:00:00,-0.0106613291940689,489.62,488.74,490.77,487.28,1.0,0.0,0.0,0.0,0.0
313,2021-01-09 00:00:00,-0.0106613291940689,489.62,488.74,490.77,487.28,1.0,0.0,0.0,0.0,0.0
314,2021-01-10 00:00:00,-0.0106613291940689,489.62,488.74,490.77,487.28,1.0,0.0,0.0,0.0,0.0
315,2021-01-11 00:00:00,0.0061519405450041,484.4,492.35,492.35,482.91,1.0,0.0,0.0,0.0,0.0
316,2021-01-12 00:00:00,0.0010258935532849,487.38,484.4,488.63,484.17,1.0,0.0,0.0,0.0,0.0
317,2021-01-13 00:00:00,0.0042428466016233,487.88,485.37,488.94,485.31,1.0,0.0,0.0,0.0,0.0
318,2021-01-14 00:00:00,-0.0074293295234207,489.95,487.88,491.73,487.1,1.0,0.0,0.0,0.0,0.0
319,2021-01-15 00:00:00,0.006539038884662,486.31,489.31,490.59,483.93,1.0,0.0,0.0,0.0,0.0
320,2021-01-16 00:00:00,0.006539038884662,486.31,489.31,490.59,483.93,1.0,0.0,0.0,0.0,0.0
321,2021-01-17 00:00:00,0.006539038884662,486.31,489.31,490.59,483.93,1.0,0.0,0.0,0.0,0.0
322,2021-01-18 00:00:00,-0.0087233651351406,489.49,487.34,489.81,484.3,1.0,0.0,0.0,0.0,0.0
323,2021-01-19 00:00:00,0.0047195086764765,485.22,489.49,492.03,485.05,1.0,0.0,0.0,0.0,0.0
324,2021-01-20 00:00:00,-0.0026255871674426,487.51,485.22,489.2,484.98,1.0,0.0,0.0,0.0,0.0
325,2021-01-21 00:00:00,-0.0068486107397734,486.23,487.51,491.2,486.23,0.3333333333333333,0.0,0.0,0.0,0.0
326,2021-01-22 00:00:00,-0.0170014495754814,482.9,485.61,486.35,478.48,1.0,0.0,0.0,0.0,0.0
327,2021-01-23 00:00:00,-0.0170014495754814,482.9,485.61,486.35,478.48,1.0,0.0,0.0,0.0,0.0
328,2021-01-24 00:00:00,-0.0170014495754814,482.9,485.61,486.35,478.48,1.0,0.0,0.0,0.0,0.0
329,2021-01-25 00:00:00,0.0088689460490003,474.69,482.9,485.04,473.74,0.0,0.0,0.0,0.0,0.0
330,2021-01-26 00:00:00,-0.0149718103988305,478.9,474.69,480.42,473.23,1.0,-0.04237464789018208,0.018894658924509145,-0.7013819507060809,-0.3837041254376615
331,2021-01-27 00:00:00,0.0064443643609691,471.73,478.86,480.39,466.69,1.0,-0.012502205270560118,-0.017699793716096757,-0.6096005309864496,-0.7835885426409864
332,2021-01-28 00:00:00,-0.0153548033784779,474.77,471.73,475.53,461.54,1.0,0.07027612658105387,0.010787981356451759,-0.15345952315795225,-0.6514689130738464
333,2021-01-29 00:00:00,0.010545905707196,467.48,474.83,474.89,465.95,1.0,0.026372837094613466,0.07350058743005494,-0.4368831575585626,-0.32788384054852254
334,2021-01-30 00:00:00,0.010545905707196,467.48,474.83,474.89,465.95,1.0,0.0,0.0,0.0,0.0
335,2021-01-31 00:00:00,0.010545905707196,467.48,474.83,474.89,465.95,1.0,0.0,0.0,0.0,0.0
336,2021-02-01 00:00:00,0.0234330348637835,472.41,467.56,474.77,467.37,0.6666666666666666,0.0,0.0,0.0,0.0
337,2021-02-02 00:00:00,-0.0035989079175974,483.48,472.41,484.0,472.25,1.0,0.21495368583820973,0.14613601867149573,1.1304255244894268,0.034058470815389146
338,2021-02-03 00:00:00,0.0047120853572466,481.74,483.48,488.19,481.25,1.0,0.0,0.0,0.0,0.0
339,2021-02-04 00:00:00,0.0048552715852978,484.01,481.7,484.49,478.87,0.8,0.0,0.0,0.0,0.0
340,2021-02-05 00:00:00,-0.0028579652931984,486.36,484.05,488.29,483.85,1.0,0.40465868453521026,0.04307316046568488,1.8961114776711527,-0.36452052364146104
341,2021-02-06 00:00:00,-0.0028579652931984,486.36,484.05,488.29,483.85,1.0,0.4267674485150721,-0.006752976553443091,1.4023825031231585,-0.7762166691525211
342,2021-02-07 00:00:00,-0.0028579652931984,486.36,484.05,488.29,483.85,1.0,0.7908716248043168,0.022940523361418386,5.0398473333764,-0.3799668038665399
343,2021-02-08 00:00:00,-0.0041652060952224,484.97,485.41,488.3,484.97,1.0,0.819941820254761,0.11819301158694095,2.647132347742563,0.0578665331509862
344,2021-02-09 00:00:00,-0.0040790972150325,482.95,484.75,485.14,481.08,0.5,0.9576570541469263,0.5391069460941242,3.189411560227082,1.764766656721114
345,2021-02-10 00:00:00,-0.0089400806686348,480.98,482.91,485.16,478.58,1.0,0.4265822252823872,-0.052368058894174396,2.57714147141947,-0.7776740391005934
346,2021-02-11 00:00:00,-0.0013635982210288,476.68,481.39,481.39,475.71,1.0,-0.007996399256732012,0.04751046266896708,-0.5888739823712438,-0.4141027924825647
347,2021-02-12 00:00:00,0.0099993697876185,476.03,476.68,477.07,473.43,1.0,-0.00590528375866306,-0.03045505115822067,-0.5672754791619826,-0.7298139531033814
348,2021-02-13 00:00:00,0.0099993697876185,476.03,476.68,477.07,473.43,1.0,0.0,0.0,0.0,0.0
349,2021-02-14 00:00:00,0.0099993697876185,476.03,476.68,477.07,473.43,1.0,0.0,0.0,0.0,0.0
350,2021-02-15 00:00:00,-0.0046589987312548,480.79,475.93,481.46,475.79,1.0,0.0,0.0,0.0,0.0
351,2021-02-16 00:00:00,-0.0045972207710792,478.55,480.79,482.58,478.07,1.0,0.0,0.0,0.0,0.0
352,2021-02-17 00:00:00,-0.0148210349532906,476.35,478.55,481.07,476.22,1.0,0.0,0.0,0.0,0.0
353,2021-02-18 00:00:00,0.0135523876494277,469.29,475.82,476.49,468.39,0.6,0.0,0.0,0.0,0.0
354,2021-02-19 00:00:00,-0.0016188373804267,475.65,468.55,476.83,468.55,1.0,0.0,0.0,0.0,0.0
355,2021-02-20 00:00:00,-0.0016188373804267,475.65,468.55,476.83,468.55,1.0,0.0,0.0,0.0,0.0
356,2021-02-21 00:00:00,-0.0016188373804267,475.65,468.55,476.83,468.55,1.0,0.0,0.0,0.0,0.0
357,2021-02-22 00:00:00,0.0019162735849057,474.88,475.65,475.85,470.13,0.6,0.0,0.0,0.0,0.0
358,2021-02-23 00:00:00,0.0067256562769288,475.79,473.84,477.52,470.6,1.0,-0.022463452333687073,0.09201770362974315,-0.5058849282365614,0.0552525710009699
359,2021-02-24 00:00:00,-0.0128812710077454,478.99,475.79,480.39,475.11,0.0,0.06703675145181975,0.04865910454094369,-0.12022788503538448,-0.25789842204019053
360,2021-02-25 00:00:00,-0.0293980796074615,472.82,477.12,479.1,471.48,0.0,-0.05736212387650319,-0.014596589432272822,-0.6410880937639759,-0.5564442060089274
361,2021-02-26 00:00:00,0.0219428222783927,458.92,475.39,475.39,457.6,1.0,-0.013757785425063673,0.09318112274472856,-0.75869834652635,-0.14906229322818101
362,2021-02-27 00:00:00,0.0219428222783927,458.92,475.39,475.39,457.6,1.0,0.1923674437534313,0.12737630538813427,0.16709702136792107,0.32831148251840025
363,2021-02-28 00:00:00,0.0219428222783927,458.92,475.39,475.39,457.6,1.0,0.7215184886153603,0.08886052215892182,5.065554168767898,0.13281521110419015
364,2021-03-01 00:00:00,-0.0069084628670121,468.99,458.92,471.41,458.77,0.0,0.811347008949264,0.11769512877426358,5.700217362044545,0.13400223910650022
365,2021-03-02 00:00:00,-0.0010091250670961,465.75,468.99,469.18,464.86,1.0,0.46350702878428773,0.04984856595557208,0.8501689993758001,-0.2969200659862163
366,2021-03-03 00:00:00,0.0044489339752408,465.28,464.84,469.18,461.83,0.0,0.42297685862971157,0.07999796815575255,1.1044161057443225,0.019140745400916623
367,2021-03-04 00:00:00,-0.0093719910131592,467.35,465.32,467.66,461.62,1.0,0.0,0.0,0.0,0.0
368,2021-03-05 00:00:00,0.0189429120677365,462.97,470.2,470.2,460.75,1.0,-0.0158239267965552,0.3791490925326553,-0.5557450142978437,3.044402919170817
369,2021-03-06 00:00:00,0.0189429120677365,462.97,470.2,470.2,460.75,1.0,-0.01340874690219973,-0.011407037309984602,-0.5083930707383424,-0.5432998262614368
370,2021-03-07 00:00:00,0.0189429120677365,462.97,470.2,470.2,460.75,1.0,-0.0034961048143280493,0.004979436727429842,-0.5362554191115039,-0.623291054918512
371,2021-03-08 00:00:00,0.0026073684656802,471.74,462.97,472.62,462.77,0.0,0.09193889871952443,-0.0020306347080429887,-0.20903420695453778,-0.5875032918466921
372,2021-03-09 00:00:00,0.0030868765460811,472.97,471.74,474.25,469.18,0.6666666666666666,0.025737885826178974,-0.03115264914614979,-0.3564640918477053,-0.5853366901674999
373,2021-03-10 00:00:00,-0.0053116371224416,474.43,473.0,476.14,471.4,1.0,0.00019345133918147184,0.007528560295178899,-0.47003506145072266,-0.6929630303463411
374,2021-03-11 00:00:00,0.0068869064016443,471.91,474.43,474.99,470.49,1.0,-0.004666202850455825,-0.018484825846425856,-0.5361402110390723,-0.9703541105774333
375,2021-03-12 00:00:00,-0.0013679602660157,475.16,471.91,475.16,470.77,1.0,0.048112934654855444,0.004209483356646615,-0.21595652537772086,-0.3415089343259739
376,2021-03-13 00:00:00,-0.0013679602660157,475.16,471.91,475.16,470.77,1.0,-0.05048122314705239,0.016363281907944227,-0.6190244290483857,-0.42139926814887063
377,2021-03-14 00:00:00,-0.0013679602660157,475.16,471.91,475.16,470.77,1.0,-0.01714350849041235,0.033340427347615886,-0.5478839242261087,-0.3907721106095749
378,2021-03-15 00:00:00,-0.0007165286295335,474.51,475.2,480.02,473.69,1.0,-0.022798935379302776,0.1505696880598375,-0.5236620800135164,-0.1225453922885615
379,2021-03-16 00:00:00,0.0114937680578695,474.17,474.55,477.58,473.49,1.0,0.03477702378134673,0.9672570093814059,-0.3140534212069453,4.192737217876363
380,2021-03-17 00:00:00,0.0051916100246028,479.62,474.17,480.1,474.01,0.8333333333333334,0.0,0.0,0.0,0.0
381,2021-03-18 00:00:00,-0.0063263570554438,482.11,479.62,483.5,478.66,1.0,0.0,0.0,0.0,0.0
382,2021-03-19 00:00:00,0.0016490627478813,479.06,482.15,482.27,476.35,1.0,0.0,0.0,0.0,0.0
383,2021-03-20 00:00:00,0.0016490627478813,479.06,482.15,482.27,476.35,1.0,0.0,0.0,0.0,0.0
384,2021-03-21 00:00:00,0.0016490627478813,479.06,482.15,482.27,476.35,1.0,0.0,0.0,0.0,0.0
385,2021-03-22 00:00:00,-0.0016880275085964,479.85,479.06,481.32,475.81,1.0,0.0,0.0,0.0,0.0
386,2021-03-23 00:00:00,0.000250501002004,479.04,479.89,480.44,475.47,1.0,0.0,0.0,0.0,0.0
387,2021-03-24 00:00:00,-0.0081601135320144,479.16,479.04,479.6,473.77,0.5,0.0,0.0,0.0,0.0
388,2021-03-25 00:00:00,0.0116780641767491,475.25,479.2,479.28,470.4,0.75,1.1901156028225914,-0.05016666356310617,1.67585695453378,-0.9323884900049372
389,2021-03-26 00:00:00,0.0072795341098169,480.8,475.16,481.04,475.04,1.0,0.24424749198330975,0.05923130700358925,1.204766634881643,-0.2057688477643313
390,2021-03-27 00:00:00,0.0072795341098169,480.8,475.16,481.04,475.04,1.0,0.8749030724767568,-0.07579350353629977,3.809361796073014,-0.7103265792026502
391,2021-03-28 00:00:00,0.0072795341098169,480.8,475.16,481.04,475.04,1.0,0.5868054108460008,-0.05693471258033611,2.856062422391418,-0.7711172662253675
392,2021-03-29 00:00:00,0.011542432376626,484.3,480.84,485.87,480.69,0.0,0.40625389082748775,-0.05960690776001343,1.0885974697560616,-0.89344063725859
393,2021-03-30 00:00:00,-0.0109412317050766,489.89,484.34,490.64,484.01,1.0,0.2667500321217746,-0.03891305282166613,0.46342268174304063,-0.5998560619816106
394,2021-03-31 00:00:00,0.0072234949332342,484.53,489.94,490.02,484.28,0.0,0.02041679625519599,-0.012619546002058613,-0.4959330235686392,-0.6692466822530995
395,2021-04-01 00:00:00,0.0,488.03,484.53,488.36,484.13,1.0,0.12776008500916802,0.08261977216302352,0.45126774860977353,0.028735007015921365
396,2021-04-02 00:00:00,0.0,488.03,488.03,488.36,487.69,1.0,0.11859566242012587,0.0962658902442115,0.019651691447201466,-0.09671849888253364
397,2021-04-03 00:00:00,0.0,488.03,488.03,488.36,487.69,1.0,0.3837266363829528,0.05212269858026097,1.6071604470432517,-0.31392348212830473
398,2021-04-04 00:00:00,0.0,488.03,488.03,488.36,487.69,1.0,0.39210786520795615,0.05764403809551055,2.250715612609361,-0.302857404800642
399,2021-04-05 00:00:00,-0.0001229432616846,488.03,488.03,488.11,487.94,1.0,0.3467685090904489,0.07520822699429086,2.1928450361818155,-0.31800279732446185
400,2021-04-06 00:00:00,-0.0021927577515012,487.97,488.07,491.58,487.74,1.0,0.10821817754289142,0.1439207822984061,0.19372198050632913,-0.10110191470319554
401,2021-04-07 00:00:00,0.004703224481413,486.9,487.93,490.58,486.24,1.0,0.0,0.0,0.0,0.0
402,2021-04-08 00:00:00,0.0019624276865839,489.19,486.9,489.19,486.24,1.0,0.0,0.0,0.0,0.0
403,2021-04-09 00:00:00,-0.0022442109558297,490.15,489.19,490.85,487.96,1.0,0.0,0.0,0.0,0.0
404,2021-04-10 00:00:00,-0.0022442109558297,490.15,489.19,490.85,487.96,1.0,0.0,0.0,0.0,0.0
405,2021-04-11 00:00:00,-0.0022442109558297,490.15,489.19,490.85,487.96,1.0,0.0,0.0,0.0,0.0
406,2021-04-12 00:00:00,-0.004048665780595,489.05,490.19,491.6,487.17,1.0,0.0,0.0,0.0,0.0
407,2021-04-13 00:00:00,0.0042499024780832,487.07,489.05,490.43,484.25,1.0,0.0,0.0,0.0,0.0
408,2021-04-14 00:00:00,0.0075438524757738,489.14,487.03,490.2,486.25,1.0,0.0,0.0,0.0,0.0
409,2021-04-15 00:00:00,0.0090294827831097,492.83,489.14,496.65,489.01,1.0,0.0,0.0,0.0,0.0
410,2021-04-16 00:00:00,0.0057110682110682,497.28,492.79,498.62,492.71,1.0,0.0,0.0,0.0,0.0
411,2021-04-17 00:00:00,0.0057110682110682,497.28,492.79,498.62,492.71,1.0,0.0,0.0,0.0,0.0
412,2021-04-18 00:00:00,0.0057110682110682,497.28,492.79,498.62,492.71,1.0,0.0,0.0,0.0,0.0
413,2021-04-19 00:00:00,-0.0144365352315444,500.12,497.28,501.96,497.11,1.0,0.0,0.0,0.0,0.0
414,2021-04-20 00:00:00,0.0118279569892473,492.9,500.17,500.33,492.21,0.0,0.0,0.0,0.0,0.0
415,2021-04-21 00:00:00,0.0110280111483167,498.73,492.9,499.45,492.77,1.0,0.0,0.0,0.0,0.0
416,2021-04-22 00:00:00,-0.0062273168990342,504.23,498.73,505.45,498.16,1.0,0.0,0.0,0.0,0.0
417,2021-04-23 00:00:00,0.0095392045341156,501.09,504.27,504.32,498.82,1.0,0.0,0.0,0.0,0.0
418,2021-04-24 00:00:00,0.0095392045341156,501.09,504.27,504.32,498.82,1.0,0.0,0.0,0.0,0.0
419,2021-04-25 00:00:00,0.0095392045341156,501.09,504.27,504.32,498.82,1.0,0.0,0.0,0.0,0.0
420,2021-04-26 00:00:00,-0.0025895981180935,505.87,501.09,506.88,500.02,0.3333333333333333,0.0,0.0,0.0,0.0
421,2021-04-27 00:00:00,0.0056881243063263,504.56,505.87,505.96,503.0,1.0,-0.088499711825202,0.06427305014251417,-1.0171410575922368,-0.4081434285039222
422,2021-04-28 00:00:00,0.0015962792897542,507.43,504.52,510.37,504.32,1.0,-0.022012109428828808,-0.07521109098738155,-0.7803805929604036,-1.1541461707912788
423,2021-04-29 00:00:00,-0.0077522430347867,508.24,507.43,511.15,507.3,1.0,0.0,0.0,0.0,0.0
424,2021-04-30 00:00:00,0.0033511798532619,504.3,508.28,510.1,504.21,1.0,0.0,0.0,0.0,0.0
425,2021-05-01 00:00:00,0.0033511798532619,504.3,508.28,510.1,504.21,1.0,0.0,0.0,0.0,0.0
426,2021-05-02 00:00:00,0.0033511798532619,504.3,508.28,510.1,504.21,1.0,0.0,0.0,0.0,0.0
427,2021-05-03 00:00:00,-0.0112057550544477,505.99,504.3,506.06,501.35,0.0,0.0,0.0,0.0,0.0
428,2021-05-04 00:00:00,0.0131315957787016,500.32,505.99,507.93,499.39,0.5,0.0340062682281701,0.1036201872555278,-0.27212849571016545,-0.2987757944227613
429,2021-05-05 00:00:00,0.0149933910710411,506.89,500.27,507.15,500.23,1.0,0.21625503200941676,0.03014298516370406,0.7677857746441339,-0.4100995751288041
430,2021-05-06 00:00:00,0.0024101537444848,514.49,506.85,517.25,506.8,1.0,0.19904728102399005,-0.06152737804642605,0.8276995432288129,-0.7613289905467103
431,2021-05-07 00:00:00,0.0054098074573904,515.73,514.45,518.04,513.53,1.0,0.1448203449373704,-0.05070060030146806,0.23899798167659317,-0.7621547820810544
432,2021-05-08 00:00:00,0.0054098074573904,515.73,514.45,518.04,513.53,1.0,0.07202701768157027,-0.07079016903959712,-0.2956849060068254,-0.8908063587087532
433,2021-05-09 00:00:00,0.0054098074573904,515.73,514.45,518.04,513.53,1.0,0.1167844595691303,-0.06479565810929522,0.1012404454285074,-0.8585518892625446
434,2021-05-10 00:00:00,-0.0129792486307181,518.52,515.65,519.04,514.57,0.0,0.2062825738089753,-0.02380077444661488,0.4704962906620415,-0.695167635089834
435,2021-05-11 00:00:00,0.0088122081322416,511.79,518.56,518.69,509.3,0.0,0.5218375362184648,-0.014289637336567296,2.7578789697314665,-0.7647499725299234
436,2021-05-12 00:00:00,0.0008328491187295,516.3,511.79,517.19,510.64,0.0,0.8852723938707241,0.16753534237351264,2.1565079671227205,0.21437114196733617
437,2021-05-13 00:00:00,0.0081280359181776,516.73,516.26,517.77,506.91,0.0,0.1446919796976065,0.14507978979927483,0.6144482686795176,0.027874101374673884
438,2021-05-14 00:00:00,-0.0022267867083868,520.93,516.73,521.32,516.6,1.0,0.0,0.0,0.0,0.0
439,2021-05-15 00:00:00,-0.0022267867083868,520.93,516.73,521.32,516.6,1.0,0.0,0.0,0.0,0.0
440,2021-05-16 00:00:00,-0.0022267867083868,520.93,516.73,521.32,516.6,1.0,0.012736787108956094,-0.04316734876276751,-0.6422675676439206,-0.7993247436224838
441,2021-05-17 00:00:00,-0.0021932777959481,519.77,521.01,521.39,517.5,1.0,0.0,0.0,0.0,0.0
442,2021-05-18 00:00:00,-0.0107976784991227,518.63,519.82,523.06,516.64,1.0,0.1152276965481338,0.18821391599955284,0.5170644017689771,0.7326689114704306
443,2021-05-19 00:00:00,0.0078357990760773,513.03,518.54,518.8,508.91,1.0,0.18957797451724012,-0.10298240413575144,0.4112186292585432,-1.0978541832537647
444,2021-05-20 00:00:00,0.0064790639203172,517.05,513.08,517.05,512.38,1.0,0.2912594941331399,-0.00527127561165841,0.9452872035091964,-0.6002997279144962
445,2021-05-21 00:00:00,0.002075326671791,520.4,517.05,521.3,516.11,1.0,0.0,0.0,0.0,0.0
446,2021-05-22 00:00:00,0.002075326671791,520.4,517.05,521.3,516.11,1.0,0.0,0.0,0.0,0.0
447,2021-05-23 00:00:00,0.002075326671791,520.4,517.05,521.3,516.11,1.0,0.0,0.0,0.0,0.0
448,2021-05-24 00:00:00,-0.0011313952596456,521.48,520.36,522.25,519.96,0.0,0.0,0.0,0.0,0.0
449,2021-05-25 00:00:00,-0.0022845514408031,520.89,521.48,522.73,520.65,1.0,0.0,0.0,0.0,0.0
450,2021-05-26 00:00:00,0.0003463536655761,519.7,520.89,521.62,517.65,1.0,0.0,0.0,0.0,0.0
451,2021-05-27 00:00:00,0.0041740401631144,519.88,519.74,522.31,518.34,1.0,0.0,0.0,0.0,0.0
452,2021-05-28 00:00:00,-0.006723493918207,522.05,519.88,523.28,519.71,1.0,0.0,0.0,0.0,0.0
453,2021-05-29 00:00:00,-0.006723493918207,522.05,519.88,523.28,519.71,1.0,0.0,0.0,0.0,0.0
454,2021-05-30 00:00:00,-0.006723493918207,522.05,519.88,523.28,519.71,1.0,0.0,0.0,0.0,0.0
455,2021-05-31 00:00:00,0.0102402900451268,518.54,522.05,522.36,518.54,1.0,0.0,0.0,0.0,0.0
456,2021-06-01 00:00:00,0.0037224396296648,523.85,518.54,524.58,518.37,1.0,0.0,0.0,0.0,0.0
457,2021-06-02 00:00:00,-0.0038798022061619,525.8,523.85,526.75,523.05,0.6666666666666666,0.0,0.0,0.0,0.0
458,2021-06-03 00:00:00,0.0011073774247747,523.76,525.85,526.2,521.12,0.5,0.0,0.0,0.0,0.0
459,2021-06-04 00:00:00,0.0112903841019185,524.34,523.76,524.86,522.68,1.0,-0.044616163768565364,0.2385342288698591,-1.0470115027121782,0.8087782986155394
460,2021-06-05 00:00:00,0.0112903841019185,524.34,523.76,524.86,522.68,1.0,0.04840843502648706,0.3819651858170774,-0.3441626420632692,1.1031940722949936
461,2021-06-06 00:00:00,0.0112903841019185,524.34,523.76,524.86,522.68,1.0,-0.010112784570745603,0.21087255635551738,-0.6894549518508343,0.34151968821352763
462,2021-06-07 00:00:00,0.0012258137517443,530.26,524.34,530.58,523.62,0.0,-0.05280511199913729,0.12346612425028791,-0.7792399322434693,-0.06384406088629925
463,2021-06-08 00:00:00,0.0018082160818218,530.91,530.26,531.92,529.22,1.0,-0.03349955741585209,0.28156284778950624,-0.6730861125644465,0.8006604222161878
464,2021-06-09 00:00:00,5.640476056174012e-05,531.87,530.87,532.01,529.57,1.0,-0.00721785595375124,0.17293717041641088,-0.6171999321270953,0.6367745168564082
465,2021-06-10 00:00:00,0.0008836247414928,531.9,531.87,533.8,528.91,0.8333333333333334,-0.009452826085402322,-0.024899227401710355,-0.6985318698672296,-0.6899651307487539
466,2021-06-11 00:00:00,0.003568946409452,532.37,531.9,532.66,530.4,1.0,-0.04956054593612702,-0.013679807258484722,-0.5783175010639284,-0.9029990308598558
467,2021-06-12 00:00:00,0.003568946409452,532.37,531.9,532.66,530.4,1.0,-0.0489611814511175,-0.04764692706132401,-0.5719882688916288,-0.6047945225420267
468,2021-06-13 00:00:00,0.003568946409452,532.37,531.9,532.66,530.4,1.0,-0.09501374965909992,0.002172124676790066,-1.007663850877052,-0.4200910371914087
469,2021-06-14 00:00:00,0.0037995769929061,534.27,532.32,535.38,532.28,1.0,-0.09140883657066734,0.13055331623230026,-0.6631887042602993,-0.26925114426732255
470,2021-06-15 00:00:00,-0.0011560693641618,536.3,534.27,538.01,534.13,0.6666666666666666,0.203559938190073,1.3021995534583657,0.39052171576085426,5.67798826586096
471,2021-06-16 00:00:00,-0.006235065710872,535.68,536.3,537.49,534.49,1.0,0.09958776022980942,0.2263671180914839,-0.12925442525525588,0.5815188957657251
472,2021-06-17 00:00:00,-0.0205132058458881,532.34,535.64,535.95,530.77,0.5,0.2879056474362107,0.28350650903761565,1.2995127509309918,0.8068098316415128
473,2021-06-18 00:00:00,0.0040849986575121,521.42,532.34,532.57,520.74,0.6666666666666666,0.01981309188790803,0.5182604109173701,-0.5878313391558625,1.0245425602973568
474,2021-06-19 00:00:00,0.0040849986575121,521.42,532.34,532.57,520.74,0.6666666666666666,0.24700840885977815,0.1682330803612997,0.8654755761350563,0.4295769799772494
475,2021-06-20 00:00:00,0.0040849986575121,521.42,532.34,532.57,520.74,0.6666666666666666,0.320578684136267,-0.05330656211706053,2.3394483237539934,-0.7312485219667858
476,2021-06-21 00:00:00,0.001088721230064,523.55,521.47,523.55,515.63,0.5,0.3231456629913323,-0.026148830651222532,1.9374059559563184,-0.6011707626252335
477,2021-06-22 00:00:00,-0.0091391284438677,524.12,523.59,524.78,520.92,0.5,0.292769443143003,0.00813551536648216,1.6160044049975875,-0.6288045532697194
478,2021-06-23 00:00:00,0.0069705197080854,519.33,524.08,524.76,519.33,0.75,0.09395983898151705,0.1113166807480157,-0.028581114396556632,0.07438725462907601
479,2021-06-24 00:00:00,0.0056028300984796,522.95,519.38,524.06,519.2,0.0,0.1209368874551,0.1119273534277383,-0.01177392692161686,0.3918329090960102
480,2021-06-25 00:00:00,-0.0096980299688142,525.88,522.95,525.98,522.25,1.0,0.4693023518083752,0.0792922114006318,1.1144115293530275,-0.2530020717238365
481,2021-06-26 00:00:00,-0.0096980299688142,525.88,522.95,525.98,522.25,1.0,0.22756696739034776,0.012164718310557987,0.7371342427548131,-0.5733389560505469
482,2021-06-27 00:00:00,-0.0096980299688142,525.88,522.95,525.98,522.25,1.0,0.046703908947329786,0.3634098763400937,-0.2490617408882271,1.3147257984128986
483,2021-06-28 00:00:00,0.0006528668535658,520.78,525.84,526.36,520.54,1.0,0.022855162838342657,0.5273469996818037,-0.5227698066703045,3.5407843498614144
484,2021-06-29 00:00:00,-0.0066971139085047,521.12,520.78,524.47,520.53,1.0,0.008153214942574927,0.8465872912767001,-0.7245611223888093,3.327680426549524
485,2021-06-30 00:00:00,0.0101810173289801,517.63,521.12,521.25,514.64,1.0,0.03261652708582563,0.2379869652915909,-0.4369802011076447,0.6492797094385525
486,2021-07-01 00:00:00,-0.0044176706827308,522.9,517.58,523.44,517.41,1.0,0.038753735373529885,0.1498067233397018,-0.19943914228357654,0.22813590163511663
487,2021-07-02 00:00:00,0.0039186307843023,520.59,522.9,524.69,519.83,1.0,0.0,0.0,0.0,0.0
488,2021-07-03 00:00:00,0.0039186307843023,520.59,522.9,524.69,519.83,1.0,0.0,0.0,0.0,0.0
489,2021-07-04 00:00:00,0.0039186307843023,520.59,522.9,524.69,519.83,1.0,0.0,0.0,0.0,0.0
490,2021-07-05 00:00:00,-0.0093373897403516,522.63,520.54,523.64,518.54,1.0,0.0,0.0,0.0,0.0
491,2021-07-06 00:00:00,0.0050024142926123,517.75,522.58,522.76,516.35,1.0,0.0,0.0,0.0,0.0
492,2021-07-07 00:00:00,-0.0153745627858707,520.34,517.75,522.86,517.62,1.0,0.0,0.0,0.0,0.0
493,2021-07-08 00:00:00,0.0146582347659757,512.34,520.38,520.47,510.14,1.0,0.0,0.0,0.0,0.0
494,2021-07-09 00:00:00,0.0037703183610655,519.85,512.38,519.85,512.25,1.0,0.0,0.0,0.0,0.0
495,2021-07-10 00:00:00,0.0037703183610655,519.85,512.38,519.85,512.25,1.0,0.0,0.0,0.0,0.0
496,2021-07-11 00:00:00,0.0037703183610655,519.85,512.38,519.85,512.25,1.0,0.0,0.0,0.0,0.0
497,2021-07-12 00:00:00,0.0047526877599126,521.81,519.8,521.95,516.32,1.0,0.0,0.0,0.0,0.0
498,2021-07-13 00:00:00,-0.0043487382936923,524.29,521.76,524.69,520.74,0.0,0.0,0.0,0.0,0.0
499,2021-07-14 00:00:00,-0.009386793356449,522.01,524.25,524.47,520.72,1.0,0.0,0.0,0.0,0.0
500,2021-07-15 00:00:00,-0.0010442652433717,517.11,522.01,522.14,516.27,0.7142857142857143,0.0,0.0,0.0,0.0
501,2021-07-16 00:00:00,-0.0260564879880752,516.57,517.16,520.62,513.53,1.0,0.0006809862968548686,0.24544670701712556,-0.476055922070901,0.5409423784814261
502,2021-07-17 00:00:00,-0.0260564879880752,516.57,517.16,520.62,513.53,1.0,0.015236448129800628,0.2671298346024278,-0.19709200934181695,0.7890763216589352
503,2021-07-18 00:00:00,-0.0260564879880752,516.57,517.16,520.62,513.53,1.0,0.0972958123872889,0.21167536051886238,0.1885471982099897,1.1603235200322641
504,2021-07-19 00:00:00,0.0118065631770388,503.11,516.61,516.7,499.67,0.6666666666666666,0.11218925084756481,0.24675847412286078,0.14177400543722343,1.0415826562685395
505,2021-07-20 00:00:00,0.0212159905706708,509.05,503.11,510.48,502.94,0.6666666666666666,-0.05708464396312163,0.2035664796982486,-0.8965285159489828,0.31839863050997586
506,2021-07-21 00:00:00,0.0015773780898334,519.85,509.14,520.41,508.84,1.0,-0.03348432915462585,0.01871988964102611,-0.77691761021196,-0.35735786756449234
507,2021-07-22 00:00:00,0.0039180286937985,520.67,519.85,526.43,519.71,1.0,0.10223005761190862,0.027350186747027827,0.08530283659284246,-0.5494300465663311
508,2021-07-23 00:00:00,0.0041131793920146,522.71,520.67,525.26,520.53,1.0,0.07913096733108027,0.06392659554055857,-0.3123036169283193,-0.12451095076127422
509,2021-07-24 00:00:00,0.0041131793920146,522.71,520.67,525.26,520.53,1.0,0.12713916901809785,0.17828706120606075,0.027980250537105865,0.46878759718108753
510,2021-07-25 00:00:00,0.0041131793920146,522.71,520.67,525.26,520.53,1.0,0.5604852796617932,0.25435087025925984,2.0592876536604545,0.7926628517978709
511,2021-07-26 00:00:00,-0.0020957969744313,524.86,522.76,525.05,517.75,1.0,0.660694149062631,0.42398270084579703,3.805644438239371,0.8704737048024108
512,2021-07-27 00:00:00,0.0026347945623949,523.76,524.86,526.7,520.83,1.0,1.0611463613024394,1.1774192058794304,3.7796325951085397,3.5752185443796063
513,2021-07-28 00:00:00,-0.0125680770842061,525.14,523.71,525.56,522.45,1.0,0.0,0.0,0.0,0.0
514,2021-07-29 00:00:00,-0.0099317313996991,518.54,525.14,525.28,513.98,1.0,0.0,0.0,0.0,0.0
515,2021-07-30 00:00:00,0.0044995033015837,513.39,518.5,519.74,513.22,1.0,0.0,0.0,0.0,0.0
516,2021-07-31 00:00:00,0.0044995033015837,513.39,518.5,519.74,513.22,1.0,0.0,0.0,0.0,0.0
517,2021-08-01 00:00:00,0.0044995033015837,513.39,518.5,519.74,513.22,1.0,0.0,0.0,0.0,0.0
518,2021-08-02 00:00:00,-0.0020166763622262,515.7,513.43,516.84,513.3,1.0,0.0,0.0,0.0,0.0
519,2021-08-03 00:00:00,0.00536276376637,514.66,515.7,516.18,512.74,1.0,0.0,0.0,0.0,0.0
520,2021-08-04 00:00:00,0.0064744308298867,517.42,514.7,518.46,514.57,1.0,0.0,0.0,0.0,0.0
521,2021-08-05 00:00:00,0.0023042802004724,520.77,517.46,521.47,513.46,1.0,0.0,0.0,0.0,0.0
522,2021-08-06 00:00:00,-0.0018583443492921,521.97,520.72,523.3,518.94,1.0,0.0,0.0,0.0,0.0
523,2021-08-07 00:00:00,-0.0018583443492921,521.97,520.72,523.3,518.94,1.0,0.0,0.0,0.0,0.0
524,2021-08-08 00:00:00,-0.0018583443492921,521.97,520.72,523.3,518.94,1.0,0.0,0.0,0.0,0.0
525,2021-08-09 00:00:00,0.0053550863723607,521.0,521.97,522.06,519.67,1.0,0.0,0.0,0.0,0.0
526,2021-08-10 00:00:00,0.0022337196204587,523.79,520.96,524.42,520.7,0.0,0.0,0.0,0.0,0.0
527,2021-08-11 00:00:00,0.0010476988722949,524.96,523.75,525.14,522.71,1.0,0.0,0.0,0.0,0.0
528,2021-08-12 00:00:00,0.0028733991741355,525.51,524.96,525.91,523.57,1.0,0.0,0.0,0.0,0.0
529,2021-08-13 00:00:00,-0.0028082425714394,527.02,525.55,527.39,524.15,1.0,0.0,0.0,0.0,0.0
530,2021-08-14 00:00:00,-0.0028082425714394,527.02,525.55,527.39,524.15,1.0,0.0,0.0,0.0,0.0
531,2021-08-15 00:00:00,-0.0028082425714394,527.02,525.55,527.39,524.15,1.0,0.0,0.0,0.0,0.0
532,2021-08-16 00:00:00,-0.0038626936103816,525.54,526.97,527.11,522.59,0.0,0.0,0.0,0.0,0.0
533,2021-08-17 00:00:00,0.0019865905140302,523.51,525.5,525.63,521.68,1.0,-0.04812026318912732,0.08588874293909043,-0.7133791908804584,-0.10199839510917288
534,2021-08-18 00:00:00,-0.0193880468973405,524.55,523.51,525.31,522.02,0.0,0.10637732322794413,0.07504736934103828,0.13700070118103214,-0.06286552454729949
535,2021-08-19 00:00:00,0.0020607333100043,514.38,524.55,524.73,512.04,1.0,0.07648279812842951,0.09442582594219129,-0.23821180578138068,0.013369654292132783
536,2021-08-20 00:00:00,0.005277044854881,515.44,514.38,515.63,510.91,1.0,0.24930779527807445,0.09948477945329426,0.49476742066223084,0.06621737587890782
537,2021-08-21 00:00:00,0.005277044854881,515.44,514.38,515.63,510.91,1.0,0.4681807776361584,0.03430600017941732,1.2472018855424454,-0.3212987441411982
538,2021-08-22 00:00:00,0.005277044854881,515.44,514.38,515.63,510.91,1.0,0.47064952703594365,0.17213110179673663,2.259686724250074,0.09386778955891008
539,2021-08-23 00:00:00,0.0002701868148834,518.16,515.48,519.01,515.35,1.0,0.4413580428166979,0.44723856370172843,3.26450919024216,1.1099132598649215
540,2021-08-24 00:00:00,-0.0024696121937101,518.3,518.16,520.72,516.89,0.75,0.31751657294343705,1.8320526448157777,1.0707735338465678,4.408424871620035
541,2021-08-25 00:00:00,-0.0020115276004796,517.02,518.3,520.07,516.23,1.0,0.3143135790696707,2.1521125903097404,0.513268657308387,11.525757266703549
542,2021-08-26 00:00:00,0.003255940152719,515.98,516.98,517.28,514.1,1.0,1.324261483190976,2.1549228159465907,4.77042835589151,6.421990559212046
543,2021-08-27 00:00:00,-0.0002124946876328,517.66,515.98,518.34,513.02,1.0,0.0,0.0,0.0,0.0
544,2021-08-28 00:00:00,-0.0002124946876328,517.66,515.98,518.34,513.02,1.0,0.0,0.0,0.0,0.0
545,2021-08-29 00:00:00,-0.0002124946876328,517.66,515.98,518.34,513.02,1.0,0.0,0.0,0.0,0.0
546,2021-08-30 00:00:00,3.864360931329437e-05,517.55,517.7,518.55,516.1,1.0,0.0,0.0,0.0,0.0
547,2021-08-31 00:00:00,0.0052746488397702,517.57,517.55,519.15,515.6,1.0,0.0,0.0,0.0,0.0
548,2021-09-01 00:00:00,-0.0035940803382663,520.3,517.61,523.68,517.44,1.0,0.0,0.0,0.0,0.0
549,2021-09-02 00:00:00,-0.0101074397700748,518.43,520.3,520.66,517.79,0.6666666666666666,0.0,0.0,0.0,0.0
550,2021-09-03 00:00:00,0.0010717278201055,513.19,518.43,518.56,512.23,1.0,0.0,0.0,0.0,0.0
551,2021-09-04 00:00:00,0.0010717278201055,513.19,518.43,518.56,512.23,1.0,0.0,0.0,0.0,0.0
552,2021-09-05 00:00:00,0.0010717278201055,513.19,518.43,518.56,512.23,1.0,0.0,0.0,0.0,0.0
553,2021-09-06 00:00:00,-0.0017129287188071,513.74,513.23,514.95,512.05,1.0,0.0,0.0,0.0,0.0
554,2021-09-07 00:00:00,-0.0124595406153725,512.86,513.74,514.06,510.65,1.0,0.0,0.0,0.0,0.0
555,2021-09-08 00:00:00,-0.0054297391750745,506.47,512.9,513.03,505.95,1.0,0.0,0.0,0.0,0.0
556,2021-09-09 00:00:00,-0.0078019534662114,503.72,506.47,506.6,499.98,1.0,0.0,0.0,0.0,0.0
557,2021-09-10 00:00:00,0.0075431681306148,499.79,503.72,504.49,499.75,1.0,0.0,0.0,0.0,0.0
558,2021-09-11 00:00:00,0.0075431681306148,499.79,503.72,504.49,499.75,1.0,0.0,0.0,0.0,0.0
559,2021-09-12 00:00:00,0.0075431681306148,499.79,503.72,504.49,499.75,1.0,0.0,0.0,0.0,0.0
560,2021-09-13 00:00:00,-0.0066923504646914,503.56,499.75,504.93,499.67,1.0,0.0,0.0,0.0,0.0
561,2021-09-14 00:00:00,-0.0092964673424098,500.19,503.52,503.88,499.73,1.0,0.0,0.0,0.0,0.0
562,2021-09-15 00:00:00,0.006639221858982,495.54,500.19,500.66,495.4,1.0,0.0,0.0,0.0,0.0
563,2021-09-16 00:00:00,-0.0047110237956818,498.83,495.54,501.44,495.42,0.0,0.0,0.0,0.0,0.0
564,2021-09-17 00:00:00,-0.0121052207541089,496.48,498.88,504.28,496.14,1.0,0.0,0.0,0.0,0.0
565,2021-09-18 00:00:00,-0.0121052207541089,496.48,498.88,504.28,496.14,1.0,0.0,0.0,0.0,0.0
566,2021-09-19 00:00:00,-0.0121052207541089,496.48,498.88,504.28,496.14,1.0,0.0,0.0,0.0,0.0
567,2021-09-20 00:00:00,0.0125593818174403,490.47,496.53,496.61,485.94,1.0,0.0,0.0,0.0,0.0
568,2021-09-21 00:00:00,0.0088999859049997,496.63,490.43,498.66,490.22,1.0,0.0,0.0,0.0,0.0
569,2021-09-22 00:00:00,0.0072248278614908,501.05,496.63,501.56,496.46,0.0,0.0,0.0,0.0,0.0
570,2021-09-23 00:00:00,-0.0058454039273188,504.67,501.05,507.35,500.92,1.0,-0.08334264194799523,-0.0037191623798964457,-1.0378411309295152,-0.5784650651451083
571,2021-09-24 00:00:00,0.0149685083313401,501.72,504.67,504.9,501.58,1.0,-0.055439375885643294,0.03947869268621407,-0.8194190868300183,-0.4281438393011161
572,2021-09-25 00:00:00,0.0149685083313401,501.72,504.67,504.9,501.58,1.0,0.0,0.0,0.0,0.0
573,2021-09-26 00:00:00,0.0149685083313401,501.72,504.67,504.9,501.58,1.0,0.0,0.0,0.0,0.0
574,2021-09-27 00:00:00,-0.0103882332148538,509.23,501.76,510.34,501.59,1.0,0.0,0.0,0.0,0.0
575,2021-09-28 00:00:00,-0.0030757629876572,503.94,509.18,511.12,503.94,1.0,0.0,0.0,0.0,0.0
576,2021-09-29 00:00:00,0.0050558331176974,502.39,503.94,506.22,501.03,0.0,0.0,0.0,0.0,0.0
577,2021-09-30 00:00:00,-0.0057235656427623,504.93,502.39,507.36,502.26,0.75,-0.059689339606319614,0.10213331206290821,-0.7268119425710629,-0.12398500641547021
578,2021-10-01 00:00:00,-0.0021910604732691,502.04,504.93,505.07,496.86,1.0,-0.013216601722012555,-0.08010854154177505,-0.5617396855985505,-0.786538628506971
579,2021-10-02 00:00:00,-0.0021910604732691,502.04,504.93,505.07,496.86,1.0,-0.060949152861057954,-0.03901509641418466,-0.5503489463231576,-0.7104253809736103
580,2021-10-03 00:00:00,-0.0021910604732691,502.04,504.93,505.07,496.86,1.0,-0.0305724302373358,-0.05892126019575139,-0.513153782318422,-0.773597053364104
581,2021-10-04 00:00:00,0.0063480656366032,500.94,502.04,504.57,499.97,1.0,-0.031723028691883925,-0.056697343096762776,-0.5734956000245952,-0.6306654901350595
582,2021-10-05 00:00:00,-0.0102554947234785,504.12,500.94,504.12,500.82,0.0,-0.012328357307961113,-0.0543412908866876,-0.552148981079419,-0.5700943967267296
583,2021-10-06 00:00:00,0.009499949894779,498.95,504.12,504.25,494.74,0.0,0.21393077313551156,0.07751530359517211,1.078323042680119,-0.1317862064984479
584,2021-10-07 00:00:00,-0.0007147253270861,503.69,498.95,504.97,498.82,1.0,0.1624577468162558,0.04718512330783753,0.15362463161259457,-0.3925171701162115
585,2021-10-08 00:00:00,0.0022450479804501,503.33,503.69,505.18,502.24,1.0,0.05590405290205602,0.024981266203590202,-0.24762317464121547,-0.4884094895343704
586,2021-10-09 00:00:00,0.0022450479804501,503.33,503.69,505.18,502.24,1.0,0.05011127838511076,0.03790409351567536,-0.17091572414728412,-0.5934678124185874
587,2021-10-10 00:00:00,0.0022450479804501,503.33,503.69,505.18,502.24,1.0,0.03807186156095188,0.07696662754336536,-0.200916581788171,-0.09079949534164054
588,2021-10-11 00:00:00,-0.0012885065218252,504.46,503.38,504.81,501.2,1.0,0.06530596002121669,0.09276967765040478,-0.11777016339262134,-0.0019229660157896314
589,2021-10-12 00:00:00,0.0031956491534507,503.81,504.46,504.59,499.01,0.0,0.12914703132588556,0.1172762195249275,-0.12729320317090184,-0.016239200995262302
590,2021-10-13 00:00:00,0.0098927624549879,505.42,503.85,505.9,501.29,1.0,0.6190264725943777,0.08752114908988506,5.420242685238136,0.5129399019508517
591,2021-10-14 00:00:00,7.836683515529097e-05,510.42,505.42,511.86,505.33,0.0,0.16374143768964,0.19517581095244374,0.015002068145586786,0.2471269607510436
592,2021-10-15 00:00:00,-0.0053872977314579,510.46,510.42,512.96,509.48,1.0,-0.014854603678356781,0.13464648697003145,-0.4691309548348132,0.007140322285550386
593,2021-10-16 00:00:00,-0.0053872977314579,510.46,510.42,512.96,509.48,1.0,0.03855577379088837,-0.016984109942023373,-0.22386479261988593,-0.43087334486542866
594,2021-10-17 00:00:00,-0.0053872977314579,510.46,510.42,512.96,509.48,1.0,-0.01828162799948796,-0.0675061198389093,-0.676844932374427,-0.5489739967381775
595,2021-10-18 00:00:00,0.0043331823284947,507.71,510.46,510.72,506.07,1.0,-0.03931538338247176,-0.02882935507781248,-0.5215514191875539,-0.45530605927862033
596,2021-10-19 00:00:00,0.0086681963483752,509.91,507.71,510.39,506.86,1.0,-0.01306630773546491,0.07977874470136204,-0.6565414104977702,0.004531057715357079
597,2021-10-20 00:00:00,-0.0055217467384753,514.33,509.91,514.71,509.64,1.0,-0.03863887234440799,0.26926420216697355,-0.6497128129953769,0.6967762220755925
598,2021-10-21 00:00:00,0.0063344346908053,511.49,514.33,514.5,509.19,1.0,0.0,0.0,0.0,0.0
599,2021-10-22 00:00:00,0.0016902065160375,514.73,511.49,516.23,511.23,1.0,0.0,0.0,0.0,0.0
600,2021-10-23 00:00:00,0.0016902065160375,514.73,511.49,516.23,511.23,1.0,0.0,0.0,0.0,0.0
601,2021-10-24 00:00:00,0.0016902065160375,514.73,511.49,516.23,511.23,1.0,0.0,0.0,0.0,0.0
602,2021-10-25 00:00:00,0.0040729247478666,515.6,514.68,516.83,513.43,1.0,0.0,0.0,0.0,0.0
603,2021-10-26 00:00:00,-0.000482905157427,517.7,515.6,519.62,515.01,1.0,0.0,0.0,0.0,0.0
604,2021-10-27 00:00:00,0.0316359068509034,517.45,517.7,519.31,515.88,0.0,0.0,0.0,0.0,0.0
605,2021-10-28 00:00:00,-0.0129819040125886,533.82,517.45,535.09,516.96,1.0,0.0,0.0,0.0,0.0
606,2021-10-29 00:00:00,-0.0129819040125886,533.82,517.45,535.09,516.96,1.0,0.0,0.0,0.0,0.0
607,2021-10-30 00:00:00,-0.0129819040125886,533.82,517.45,535.09,516.96,1.0,0.0,0.0,0.0,0.0
608,2021-10-31 00:00:00,-0.0129819040125886,533.82,517.45,535.09,516.96,1.0,0.0,0.0,0.0,0.0
