,Date,Return,Price,Open,High,Low,Index,TE(XY),TE(YX),Z(XY),Z(YX)
0,2020-03-02 00:00:00,0.0043904492692607,166.27,166.27,166.27,166.27,0.8888888888888888,,,,
1,2020-03-03 00:00:00,0.0083832335329341,167.0,167.0,167.0,167.0,0.9583333333333334,,,,
2,2020-03-04 00:00:00,-0.0188242280285036,168.4,168.4,168.4,168.4,0.7894736842105263,,,,
3,2020-03-05 00:00:00,-0.0346789323972643,165.23,165.23,165.23,165.23,0.9666666666666668,,,,
4,2020-03-06 00:00:00,-0.1100940438871473,159.5,159.5,159.5,159.5,1.0,,,,
5,2020-03-07 00:00:00,-0.1100940438871473,159.5,159.5,159.5,159.5,1.0,,,,
6,2020-03-08 00:00:00,-0.1100940438871473,159.5,159.5,159.5,159.5,1.0,,,,
7,2020-03-09 00:00:00,-0.0325489643511343,141.94,141.94,141.94,141.94,0.8148148148148148,,,,
8,2020-03-10 00:00:00,0.0023303233323623,137.32,137.32,137.32,137.32,0.65,,,,
9,2020-03-11 00:00:00,-0.1660127869805288,137.64,137.64,137.64,137.64,0.7551020408163265,,,,
10,2020-03-12 00:00:00,0.0698667131283212,114.79,114.79,114.79,114.79,0.7857142857142857,0.08114600594621812,0.07613883043671521,-0.14842283771377693,-0.46610174407152516
11,2020-03-13 00:00:00,-0.0612327986320331,122.81,122.81,122.81,122.81,0.9012345679012346,0.008070166144007906,0.24848020597805753,-0.6742417317408398,0.7638501925316106
12,2020-03-14 00:00:00,-0.0612327986320331,122.81,122.81,122.81,122.81,0.9012345679012346,-0.07049016186421486,0.022019778776940058,-0.9436849542980672,-0.5701175803341971
13,2020-03-15 00:00:00,-0.0612327986320331,122.81,122.81,122.81,122.81,0.9012345679012346,-0.039153698531648295,0.08925182013760402,-0.6679654349478853,-0.44907184364595304
14,2020-03-16 00:00:00,0.0210772833723652,115.29,115.29,115.29,115.29,1.0,-0.014578275968350596,0.20353719092822775,-0.6675353803926525,0.279484907151733
15,2020-03-17 00:00:00,-0.0123173632347944,117.72,117.72,117.72,117.72,0.8613861386138614,0.059751963555600085,0.5583360800260362,-0.35834452615849094,2.439670148651403
16,2020-03-18 00:00:00,0.0234798314268513,116.27,116.27,116.27,116.27,0.8484848484848485,-0.01338890817975269,0.31824907937860925,-0.5880539339213884,1.0430554823077094
17,2020-03-19 00:00:00,0.0178991596638655,119.0,116.27,121.71,115.82,0.902439024390244,0.06118841960088428,-0.03334674753420508,-0.3768087717625024,-0.8759787464471592
18,2020-03-20 00:00:00,-0.0113927185668289,121.13,119.0,124.39,118.92,1.0,-0.024398274615057503,0.0021334812450763962,-0.640661207070514,-0.7011980180487387
19,2020-03-21 00:00:00,-0.0113927185668289,121.13,119.0,124.39,118.92,1.0,-0.04624380703145903,-0.009719740920785647,-0.6421806254918696,-0.7758423104936357
20,2020-03-22 00:00:00,-0.0113927185668289,121.13,119.0,124.39,118.92,1.0,-0.04844338014149052,0.016699397183216114,-0.7829780833380584,-0.5841794211682613
21,2020-03-23 00:00:00,0.0857620041753654,119.75,121.12,121.46,116.26,0.9375,-0.028279965671812235,0.07025043028577205,-0.9616542431660475,-0.4188194123891072
22,2020-03-24 00:00:00,0.0159206275957544,130.02,119.75,130.11,119.68,0.9452054794520548,0.043270242168699014,0.22570943647259245,-0.3044840417922857,0.7836689108097036
23,2020-03-25 00:00:00,0.0081762434703609,132.09,130.03,136.62,127.34,0.9,-0.12069468471575995,0.13928960846330263,-1.6687624610418939,0.20271064133155697
24,2020-03-26 00:00:00,-0.0292858751971163,133.17,132.08,133.23,129.19,0.8787878787878788,-0.01603144542885726,0.0764251748804563,-0.6807309670279333,-0.3249010339206392
25,2020-03-27 00:00:00,0.003016941285681,129.27,133.16,133.26,128.02,0.9743589743589745,0.05708950538262503,0.24008539741469992,-0.19160638620789228,0.7007523825836036
26,2020-03-28 00:00:00,0.003016941285681,129.27,133.16,133.26,128.02,0.9743589743589745,0.017652862974533612,0.09342758053160782,-0.8242305203850825,-0.3135485267634213
27,2020-03-29 00:00:00,0.003016941285681,129.27,133.16,133.26,128.02,0.9743589743589745,0.17178725976204223,-0.04833484615712624,0.23414334315951552,-0.8951577474997446
28,2020-03-30 00:00:00,0.0107974703069567,129.66,129.26,130.03,125.45,1.0,0.14540128402364694,-0.03393983845809423,-0.0764589145320729,-0.7630148639254706
29,2020-03-31 00:00:00,-0.0283839462841446,131.06,129.65,132.9,128.56,0.8333333333333334,0.13586965723097322,-0.010447468442247754,0.30409402173641636,-0.6212495069042575
30,2020-04-01 00:00:00,0.0167268729385895,127.34,131.06,131.11,126.96,0.9411764705882352,0.039661005379026726,-0.05827747453198029,-0.3577425912093159,-1.224172627990357
31,2020-04-02 00:00:00,-0.0254112921912411,129.47,127.34,129.84,126.4,0.8076923076923077,0.2280810889257472,-0.004023318980673984,0.3662038795352811,-0.9317382203286848
32,2020-04-03 00:00:00,0.0381201458234268,126.18,129.47,129.53,126.14,0.96,0.21647168366659653,0.02988994468346995,1.1049830577542268,-0.36990098451043085
33,2020-04-04 00:00:00,0.0381201458234268,126.18,129.47,129.53,126.14,0.96,1.1613556205905118,0.026089490897099665,5.067426350693742,-0.5668302522039587
34,2020-04-05 00:00:00,0.0381201458234268,126.18,129.47,129.53,126.14,0.96,0.7147325267985405,0.00749339391658399,2.8402518559557564,-0.6772184503449792
35,2020-04-06 00:00:00,0.02084128559432,130.99,126.15,131.13,126.14,1.0,0.6680593501331815,-0.010603135255935925,4.032139332283084,-0.5876223916948945
36,2020-04-07 00:00:00,-0.0013460963206701,133.72,130.99,137.34,130.92,0.9069767441860463,0.2342061166090561,0.022851121756209736,0.5684414135277936,-0.5477824106672183
37,2020-04-08 00:00:00,0.0143028306125505,133.54,133.72,133.79,132.15,0.8571428571428571,0.4442032733395065,0.055262172830627065,1.2265341456707384,-0.28539159958799976
38,2020-04-09 00:00:00,0.0,135.45,133.54,136.44,133.51,0.9183673469387756,0.5942468350517434,0.16458723044168533,2.096085138009179,-0.006735265885017727
39,2020-04-10 00:00:00,-0.0001476559616093,135.45,135.44,135.51,135.37,1.0,0.35387293396550223,0.14247506159497014,0.9333178267757051,0.3481662837885371
40,2020-04-11 00:00:00,-0.0001476559616093,135.45,135.44,135.51,135.37,1.0,0.359635937246499,0.12770170665780078,1.2315584635070915,1.000848043445292
41,2020-04-12 00:00:00,-0.0001476559616093,135.45,135.44,135.51,135.37,1.0,-0.03492066658331705,-0.027695866246140177,-0.7926170584849874,-0.5618948271988224
42,2020-04-13 00:00:00,-0.0028797164586872,135.43,135.45,135.52,135.38,0.9230769230769232,-0.07098527751338057,-0.052768017932166345,-0.8932714389591728,-0.9416626523918925
43,2020-04-14 00:00:00,-0.0460604265402843,135.04,135.42,137.03,134.64,0.9047619047619048,0.052702510345857156,-0.008061867782474863,-0.34784460560906477,-0.6983402929400874
44,2020-04-15 00:00:00,0.0027169694146871,128.82,135.05,135.09,128.78,0.9545454545454546,0.04805796482748992,0.09348865463261014,-0.3009723336174749,-0.061527527994932996
45,2020-04-16 00:00:00,0.0167221491058297,129.17,128.82,132.06,128.75,0.92,0.05739068141606829,0.06578531855287473,-0.4159500961571132,0.27936862386547734
46,2020-04-17 00:00:00,0.0009137287748418,131.33,129.18,133.28,129.13,0.8636363636363636,-0.005699357918945935,0.044342291360170094,-0.5584118017240489,-0.4579063906626058
47,2020-04-18 00:00:00,0.0009137287748418,131.33,129.18,133.28,129.13,0.8636363636363636,0.037668077682496914,0.06710222469088745,-0.2245793809030268,-0.26251549019817955
48,2020-04-19 00:00:00,0.0009137287748418,131.33,129.18,133.28,129.13,0.8636363636363636,0.04351246316275237,0.1657885563525987,-0.46426393889696693,0.4304411000492438
49,2020-04-20 00:00:00,-0.0344617725370862,131.45,131.33,132.15,129.41,1.0,-0.0021121016155207784,0.18910902426354959,-0.4008481837593558,1.0519590802466674
50,2020-04-21 00:00:00,0.0174913331232271,126.92,131.45,131.5,126.88,0.75,-0.033785000255382336,-0.0013571725787118183,-0.7646483302315988,-0.5900414478074287
51,2020-04-22 00:00:00,0.0133963140777452,129.14,126.99,129.2,126.84,0.8947368421052632,0.19777616144505483,0.018161172354003163,0.10050539172262188,-0.42189215957846316
52,2020-04-23 00:00:00,-0.0087109345151678,130.87,129.14,131.85,129.1,0.9545454545454546,0.1814991149144909,0.03679499306302958,0.5278251284743657,-0.6350574274676762
53,2020-04-24 00:00:00,0.0289832729515148,129.73,130.86,131.93,128.22,1.0,0.2035135900061098,0.02819791955776907,0.12062130592161224,-0.5047437151095793
54,2020-04-25 00:00:00,0.0289832729515148,129.73,130.86,131.93,128.22,1.0,0.20188442081947144,-0.04227610260468939,0.6247805406569131,-0.7554760580512412
55,2020-04-26 00:00:00,0.0289832729515148,129.73,130.86,131.93,128.22,1.0,0.28364154870407,0.07004353007678166,0.4350167976303809,-0.3159450925266542
56,2020-04-27 00:00:00,0.0164057232751516,133.49,129.74,133.54,129.66,1.0,0.2269978094080125,0.06367126855066996,0.4078916803716237,-0.1851326974617119
57,2020-04-28 00:00:00,0.0213001179245282,135.68,133.49,137.6,133.44,1.0,-5.878213377030761e-05,0.04939140708057188,-0.478837209590916,-0.3576626517950897
58,2020-04-29 00:00:00,-0.0193404055711915,138.57,135.7,138.64,135.22,1.0,0.011225009747083625,0.05246912770647505,-0.49822457228208783,-0.3249973604583852
59,2020-04-30 00:00:00,-0.000147177864449,135.89,138.55,140.34,135.61,1.0,0.10969116435762949,-0.06671899202473508,-0.0856336812875157,-0.9629314877142207
60,2020-05-01 00:00:00,-0.0354014867152425,135.87,135.9,135.93,135.78,1.0,0.0,0.0,0.0,0.0
61,2020-05-02 00:00:00,-0.0354014867152425,135.87,135.9,135.93,135.78,1.0,0.0,0.0,0.0,0.0
62,2020-05-03 00:00:00,-0.0354014867152425,135.87,135.9,135.93,135.78,1.0,0.0,0.0,0.0,0.0
63,2020-05-04 00:00:00,0.0193804364413245,131.06,135.89,135.89,131.01,0.8857142857142857,0.0,0.0,0.0,0.0
64,2020-05-05 00:00:00,-0.0123502994011976,133.6,131.05,133.71,131.03,0.8666666666666667,0.0,0.0,0.0,0.0
65,2020-05-06 00:00:00,0.0042440318302387,131.95,133.59,134.56,131.88,1.0,-0.0695822413613918,-0.06249854972160307,-0.557688883267537,-0.8654281185722225
66,2020-05-07 00:00:00,0.0116217643951401,132.51,131.97,133.44,131.42,0.9333333333333332,0.06458938003937043,0.17567959641594122,-0.31110196707554605,-0.0367732060211005
67,2020-05-08 00:00:00,-0.0042521447221187,134.05,132.5,134.19,132.47,1.0,-0.05715955090142355,0.15348614268743255,-0.7546755518973749,-0.05378001638365926
68,2020-05-09 00:00:00,-0.0042521447221187,134.05,132.5,134.19,132.47,1.0,0.025141437494379915,0.06628593414700301,-0.547139265384987,-0.2670318823116461
69,2020-05-10 00:00:00,-0.0042521447221187,134.05,132.5,134.19,132.47,1.0,0.0260940973594721,0.07179802436335248,-0.5931754466272279,-0.056171599090147614
70,2020-05-11 00:00:00,0.0087653581060834,133.48,134.07,135.81,132.97,1.0,0.06659735227777208,0.0905551314835682,-0.21919602725772253,-0.046581228878355564
71,2020-05-12 00:00:00,-0.0203490531006313,134.65,133.47,135.05,133.42,1.0,0.16414542238356056,0.12505398120673483,0.31212401178283694,-0.2707852288933796
72,2020-05-13 00:00:00,-0.0175877492229549,131.91,134.66,134.7,131.87,0.8823529411764706,0.2153921445619318,0.5356630095502464,0.5444436345149578,1.6606795277791209
73,2020-05-14 00:00:00,-0.0010031638243691,129.59,131.92,131.96,127.19,0.9411764705882352,0.13589228985989088,0.09918870879503672,0.13560511160728492,-0.294705818175654
74,2020-05-15 00:00:00,0.0319017457129615,129.46,129.57,131.45,129.05,1.0,0.006353337719461116,0.1121493919982175,-0.5611803065352524,0.11454822341464499
75,2020-05-16 00:00:00,0.0319017457129615,129.46,129.57,131.45,129.05,1.0,-0.025607940320824696,0.07555455541276324,-0.7844754628673952,-0.04694277012001568
76,2020-05-17 00:00:00,0.0319017457129615,129.46,129.57,131.45,129.05,1.0,0.22637293036119033,0.020738414418806528,1.2279244092882473,-0.4089987994270996
77,2020-05-18 00:00:00,-0.0208099408638371,133.59,129.45,133.92,129.42,0.9,0.23378886450343472,0.023313401801610567,0.4839074964163039,-0.22198788095366037
78,2020-05-19 00:00:00,0.010167418393089,130.81,133.55,135.11,130.05,0.9230769230769232,0.17020480970675678,0.012399690139686115,0.18112396406875844,-0.6089991618949442
79,2020-05-20 00:00:00,-0.006886635386711,132.14,130.81,132.34,128.13,0.9666666666666668,0.18489488882795158,0.1050732057512409,0.53769410435501,-0.02946050704271211
80,2020-05-21 00:00:00,0.0124971424217024,131.23,132.1,132.68,130.28,0.9130434782608696,-0.01753782109448654,0.3302769263115284,-0.6124155015704338,1.262762896879196
81,2020-05-22 00:00:00,0.0161059682396326,132.87,131.25,133.38,129.3,1.0,-0.013620083280512674,0.30665953258786427,-0.7168497036052873,2.2313593384720067
82,2020-05-23 00:00:00,0.0161059682396326,132.87,131.25,133.38,129.3,1.0,0.023633843782734587,0.3462598935061383,-0.4528459308336248,1.655775217510116
83,2020-05-24 00:00:00,0.0161059682396326,132.87,131.25,133.38,129.3,1.0,0.02036062770916569,0.06813742271847012,-0.4885009074478293,-0.17124835781388065
84,2020-05-25 00:00:00,0.0148877860899194,135.01,132.87,135.03,132.78,0.7777777777777778,0.010499226418082763,0.04155120272155699,-0.5912546462146606,-0.42224739353281815
85,2020-05-26 00:00:00,0.0037220843672455,137.02,135.0,137.26,134.97,1.0,0.15279563125101436,0.017265675828753047,0.08774543815141901,-0.5719795689194025
86,2020-05-27 00:00:00,0.022976805060714,137.53,137.04,139.84,136.1,1.0,-0.020161941144587914,0.0013198801770775148,-0.7523944830242737,-0.48823944777568934
87,2020-05-28 00:00:00,-0.0071789039732745,140.69,137.53,141.22,137.46,1.0,0.11698871960062718,-0.010376783308653437,-0.10710285071704684,-0.6269245101852199
88,2020-05-29 00:00:00,0.01696735395189,139.68,140.69,141.13,139.31,0.9411764705882352,0.0002865031296197529,0.039070167836602554,-0.6256400352335311,-0.2794448792448113
89,2020-05-30 00:00:00,0.01696735395189,139.68,140.69,141.13,139.31,0.9411764705882352,0.02045530319610389,-0.020507682454357745,-0.44234009327533674,-0.6854354945938645
90,2020-05-31 00:00:00,0.01696735395189,139.68,140.69,141.13,139.31,0.9411764705882352,0.053225930468259186,0.08751108151888243,-0.004344503717996037,0.18746407012702304
91,2020-06-01 00:00:00,0.0245688137979583,142.05,139.7,142.12,139.63,1.0,0.0491884420476385,0.10956220859586052,-0.13075286280227433,0.04887326253770649
92,2020-06-02 00:00:00,0.0344922358114608,145.54,142.04,146.13,142.02,1.0,-0.05660358748635286,0.15920501163016,-1.053247689483262,0.6425665301174612
93,2020-06-03 00:00:00,6.641870350684714e-05,150.56,145.66,150.61,145.48,0.9411764705882352,0.0015133185734788057,0.08209274430608104,-0.7668597457173112,-0.11344129839743453
94,2020-06-04 00:00:00,0.0276283456199773,150.57,150.54,152.21,148.75,0.9166666666666666,0.0,0.0,0.0,0.0
95,2020-06-05 00:00:00,0.0032314354036062,154.73,150.55,154.79,150.5,1.0,0.20429983142043717,0.1017326667065852,0.2119442549710028,-0.09051296758666715
96,2020-06-06 00:00:00,0.0032314354036062,154.73,150.55,154.79,150.5,1.0,0.08703336200507827,0.02634344589941584,-0.33511338256265694,-0.39403128247576746
97,2020-06-07 00:00:00,0.0032314354036062,154.73,150.55,154.79,150.5,1.0,0.09499335976436019,0.03886891891840527,0.09724304920414074,-0.4353154932480725
98,2020-06-08 00:00:00,-0.0152032467950781,155.23,154.71,156.4,153.73,1.0,0.05160905317387865,0.011118083496380216,-0.46998065019265584,-0.587164944340317
99,2020-06-09 00:00:00,-0.0093543533721463,152.87,155.22,155.6,151.11,1.0,0.05185724814816606,-0.036957906732983936,-0.2579032246459668,-0.7667594090787968
100,2020-06-10 00:00:00,-0.0474775488642366,151.44,152.84,154.7,151.0,0.9285714285714286,0.02586800786526844,0.0037668598719147184,-0.34599053729175244,-0.4507079425188607
101,2020-06-11 00:00:00,0.0045753899480069,144.25,151.41,151.47,144.19,1.0,0.09472478749483049,0.08647426074401388,0.010606935603065379,-0.15895995976546975
102,2020-06-12 00:00:00,0.0031743841004762,144.91,144.25,146.9,142.34,1.0,-0.05719708400989987,1.4372740271244133,-0.9663607051559142,3.7394232643206435
103,2020-06-13 00:00:00,0.0031743841004762,144.91,144.25,146.9,142.34,1.0,0.0,0.0,0.0,0.0
104,2020-06-14 00:00:00,0.0031743841004762,144.91,144.25,146.9,142.34,1.0,0.0,0.0,0.0,0.0
105,2020-06-15 00:00:00,0.0342574121207951,145.37,144.9,146.09,140.58,0.8571428571428571,0.0,0.0,0.0,0.0
106,2020-06-16 00:00:00,-0.0027934818756234,150.35,145.37,152.25,145.31,0.9285714285714286,1.5235060013844377,-0.010410728975665862,7.7929178646240755,-0.5814807073509705
107,2020-06-17 00:00:00,-0.0043353564996998,149.93,150.32,152.18,149.21,1.0,0.21516153797624682,0.03026196868255493,0.3637599485609404,-0.5906823173614045
108,2020-06-18 00:00:00,0.0060959271168274,149.28,149.92,151.64,148.11,0.9285714285714286,0.14295267667735168,0.04042273351075121,-0.0853787147057407,-0.35365267368956094
109,2020-06-19 00:00:00,-0.0069245622211864,150.19,149.25,151.17,149.22,1.0,0.17258119652561987,-0.02891252117669385,0.27968211861900066,-1.0393869520755263
110,2020-06-20 00:00:00,-0.0069245622211864,150.19,149.25,151.17,149.22,1.0,1.2705379631290317,-0.014887791065391731,10.549344228665504,-0.626654429140337
111,2020-06-21 00:00:00,-0.0069245622211864,150.19,149.25,151.17,149.22,1.0,0.8428700763409331,0.03083408911594976,4.461246452389876,-0.17997595099248204
112,2020-06-22 00:00:00,0.0187060006704659,149.15,150.21,150.59,147.85,1.0,0.6732028961421044,0.12504050030595248,4.209781467876491,-0.16950223491864516
113,2020-06-23 00:00:00,-0.0332368040015796,151.94,149.16,152.27,149.08,1.0,0.6025561065530249,0.6753645304729243,2.564646564706108,2.7363401210516365
114,2020-06-24 00:00:00,0.003880454762067,146.89,151.93,152.4,146.81,1.0,0.10257587983716387,0.03957397826337594,-0.06941986287213232,-0.36623787085827886
115,2020-06-25 00:00:00,-0.005425200054252,147.46,146.86,148.14,144.72,1.0,0.0,0.0,0.0,0.0
116,2020-06-26 00:00:00,0.0164325651165961,146.66,147.47,149.84,146.61,1.0,0.0,0.0,0.0,0.0
117,2020-06-27 00:00:00,0.0164325651165961,146.66,147.47,149.84,146.61,1.0,0.0,0.0,0.0,0.0
118,2020-06-28 00:00:00,0.0164325651165961,146.66,147.47,149.84,146.61,1.0,0.0,0.0,0.0,0.0
119,2020-06-29 00:00:00,-0.0038907895619506,149.07,146.63,149.77,146.5,0.8571428571428571,0.0,0.0,0.0,0.0
120,2020-06-30 00:00:00,-0.0022897164792242,148.49,149.05,149.77,147.39,0.9090909090909092,0.0,0.0,0.0,0.0
121,2020-07-01 00:00:00,0.0283496456294295,148.15,148.48,149.13,145.76,1.0,-0.07819655192912744,0.003472539334415714,-0.8270283550619891,-0.5159603247703468
122,2020-07-02 00:00:00,-0.007745323268789,152.35,148.15,153.05,148.13,0.9411764705882352,0.14459724578641442,-0.02954285013645297,0.13840357900939362,-0.7335739699367513
123,2020-07-03 00:00:00,0.0143547000066151,151.17,152.32,153.0,150.41,1.0,0.35061535941657773,-0.008714163022621513,1.1895688010305776,-0.5112017673411656
124,2020-07-04 00:00:00,0.0143547000066151,151.17,152.32,153.0,150.41,1.0,0.08032930068321598,-0.015537053201343909,-0.2768110248368513,-0.6296146400346841
125,2020-07-05 00:00:00,0.0143547000066151,151.17,152.32,153.0,150.41,1.0,0.1115241383300507,0.03739499262638013,-0.16173611611804314,-0.3453626412124493
126,2020-07-06 00:00:00,-0.0012390765618885,153.34,151.15,154.84,151.13,0.8571428571428571,0.17128248543113678,0.1390943216648992,0.20675329347840127,-0.12524319946197063
127,2020-07-07 00:00:00,-0.0047012732615083,153.15,153.32,153.59,151.95,0.9166666666666666,0.42634589970392156,0.04497505842485694,1.5742936823584839,-0.3814770493380499
128,2020-07-08 00:00:00,-0.0190251262874762,152.43,153.14,153.84,151.96,1.0,0.11663308048022447,-0.026432396940519354,-0.22851623705525675,-0.6442334968272206
129,2020-07-09 00:00:00,0.0129071089413496,149.53,152.44,153.22,149.47,1.0,0.08452901197338392,-0.0418290427246939,-0.2888887208001059,-0.7379542087620007
130,2020-07-10 00:00:00,0.0119503499273735,151.46,149.53,151.51,148.77,1.0,0.4059524209922172,-0.07523259860191,1.5776580856501803,-1.5390723141386473
131,2020-07-11 00:00:00,0.0119503499273735,151.46,149.53,151.51,148.77,1.0,0.31857843047826595,-0.04541510770193291,1.268015153979595,-0.7660247363057384
132,2020-07-12 00:00:00,0.0119503499273735,151.46,149.53,151.51,148.77,1.0,0.372246961100573,-0.03195065828696464,1.9316819651354087,-0.5658646742818895
133,2020-07-13 00:00:00,-0.0063939453252431,153.27,151.46,153.69,151.25,0.8571428571428571,0.3685798891732128,-0.028598436651694037,1.552986188044895,-0.660883531549408
134,2020-07-14 00:00:00,0.0196992579946155,152.29,153.26,153.33,150.82,1.0,0.2206770588822744,-0.000683439302196831,0.46594858007691,-0.4299168455542502
135,2020-07-15 00:00:00,0.0043145083392363,155.29,152.3,155.89,152.25,1.0,0.2213871313222855,-0.02874541707926337,0.3981860021461426,-0.809226629605883
136,2020-07-16 00:00:00,0.0035265452680173,155.96,155.29,156.18,154.51,1.0,0.0,0.0,0.0,0.0
137,2020-07-17 00:00:00,0.0083700721998594,156.51,155.94,156.56,155.3,0.9411764705882352,0.0,0.0,0.0,0.0
138,2020-07-18 00:00:00,0.0083700721998594,156.51,155.94,156.56,155.3,0.9411764705882352,0.26059114604425915,0.014267751825515873,1.2063465597613492,-0.47306944846338195
139,2020-07-19 00:00:00,0.0083700721998594,156.51,155.94,156.56,155.3,0.9411764705882352,0.26088725324775197,0.11476442639577744,0.7490964223686819,-0.2136500600009569
140,2020-07-20 00:00:00,0.0055126093017361,157.82,156.5,158.26,154.93,1.0,0.3915552068856156,0.1283505716373341,1.5033053360461126,0.046268837519599364
141,2020-07-21 00:00:00,-0.0061755624172915,158.69,157.81,161.82,157.78,1.0,0.49158199999167174,0.05012898956367007,3.293741789008131,-0.21657326365355797
142,2020-07-22 00:00:00,-0.0069748272145076,157.71,158.7,159.13,156.98,1.0,0.3686739472416587,-0.004139400422457307,2.7226869088750583,-0.5019168343254342
143,2020-07-23 00:00:00,-0.018134218759977,156.61,157.72,158.37,155.92,0.9411764705882352,-0.02313296662502573,-0.05430393365568964,-0.8380411734570056,-1.0214275065162082
144,2020-07-24 00:00:00,-0.0036418026923327,153.77,156.61,156.65,152.91,1.0,0.0,0.0,0.0,0.0
145,2020-07-25 00:00:00,-0.0036418026923327,153.77,156.61,156.65,152.91,1.0,-0.09627302425436834,0.03112001912740503,-1.4255991985733798,-0.3384071193059762
146,2020-07-26 00:00:00,-0.0036418026923327,153.77,156.61,156.65,152.91,1.0,-0.03878565707515502,-0.06402267893420444,-0.9553602597532008,-0.7307893114322042
147,2020-07-27 00:00:00,-0.0056132106259383,153.21,153.76,154.38,152.41,1.0,0.004098166575748685,-0.048607681451466433,-0.4465301649601588,-0.9402285878710587
148,2020-07-28 00:00:00,-0.0005251066622906,152.35,153.19,154.01,150.82,1.0,0.0,0.0,0.0,0.0
149,2020-07-29 00:00:00,-0.0311289157417745,152.27,152.35,152.77,150.97,1.0,0.0,0.0,0.0,0.0
150,2020-07-30 00:00:00,-0.006913848030909,147.53,152.26,153.14,146.73,0.8,0.0,0.0,0.0,0.0
151,2020-07-31 00:00:00,0.0144700020476418,146.51,147.54,149.8,146.44,1.0,0.09956764739662116,0.02593178762235393,0.15782057067021873,-0.49376270907267394
152,2020-08-01 00:00:00,0.0144700020476418,146.51,147.54,149.8,146.44,1.0,0.0,0.0,0.0,0.0
153,2020-08-02 00:00:00,0.0144700020476418,146.51,147.54,149.8,146.44,1.0,0.0,0.0,0.0,0.0
154,2020-08-03 00:00:00,0.0127834219202045,148.63,146.5,148.83,145.32,1.0,0.0,0.0,0.0,0.0
155,2020-08-04 00:00:00,0.0060453065834052,150.53,148.63,150.85,148.58,1.0,0.0,0.0,0.0,0.0
156,2020-08-05 00:00:00,-0.012810353935552,151.44,150.52,152.62,150.49,1.0,0.0,0.0,0.0,0.0
157,2020-08-06 00:00:00,0.0020735785953177,149.5,151.47,152.14,148.55,0.9090909090909092,0.0,0.0,0.0,0.0
158,2020-08-07 00:00:00,0.0076763900941192,149.81,149.49,150.18,147.82,1.0,0.040547901954825605,0.286970850244888,-0.24666205740372502,0.9485799523400718
159,2020-08-08 00:00:00,0.0076763900941192,149.81,149.49,150.18,147.82,1.0,0.0,0.0,0.0,0.0
160,2020-08-09 00:00:00,0.0076763900941192,149.81,149.49,150.18,147.82,1.0,0.0,0.0,0.0,0.0
161,2020-08-10 00:00:00,0.0269607843137254,150.96,149.8,151.14,149.35,1.0,0.0,0.0,0.0,0.0
162,2020-08-11 00:00:00,0.0112236341353287,155.03,150.98,155.77,150.93,1.0,0.0,0.0,0.0,0.0
163,2020-08-12 00:00:00,-0.0086113414556357,156.77,155.05,156.98,154.56,1.0,0.0,0.0,0.0,0.0
164,2020-08-13 00:00:00,-0.0110024449877749,155.42,156.77,157.05,155.41,1.0,0.0,0.0,0.0,0.0
165,2020-08-14 00:00:00,-0.0047492030446946,153.71,155.42,155.49,152.12,1.0,0.0,0.0,0.0,0.0
166,2020-08-15 00:00:00,-0.0047492030446946,153.71,155.42,155.49,152.12,1.0,0.0,0.0,0.0,0.0
167,2020-08-16 00:00:00,-0.0047492030446946,153.71,155.42,155.49,152.12,1.0,0.0,0.0,0.0,0.0
168,2020-08-17 00:00:00,-0.0050333376912013,152.98,153.72,154.39,152.33,1.0,0.0,0.0,0.0,0.0
169,2020-08-18 00:00:00,0.0101176006832664,152.21,152.98,154.63,151.3,0.9090909090909092,0.0,0.0,0.0,0.0
170,2020-08-19 00:00:00,-0.0140487804878048,153.75,152.22,153.91,151.35,1.0,0.0,0.0,0.0,0.0
171,2020-08-20 00:00:00,-0.0036941750775117,151.59,153.78,153.81,151.19,1.0,0.0,0.0,0.0,0.0
172,2020-08-21 00:00:00,0.0205919353770773,151.03,151.59,152.34,149.42,1.0,0.0,0.0,0.0,0.0
173,2020-08-22 00:00:00,0.0205919353770773,151.03,151.59,152.34,149.42,1.0,0.0,0.0,0.0,0.0
174,2020-08-23 00:00:00,0.0205919353770773,151.03,151.59,152.34,149.42,1.0,0.0,0.0,0.0,0.0
175,2020-08-24 00:00:00,-0.0045413260672115,154.14,151.04,154.26,150.98,0.9,0.0,0.0,0.0,0.0
176,2020-08-25 00:00:00,0.0054092805005214,153.44,154.15,156.03,153.4,1.0,0.07513794681785058,0.0016630761288141116,0.13094597336107427,-0.5920209752184952
177,2020-08-26 00:00:00,-0.0134180333182084,154.27,153.44,154.32,152.74,1.0,0.1490339409505852,-0.013619010566838341,0.35930684179451045,-0.7828775054725994
178,2020-08-27 00:00:00,0.0002628120893562,152.2,154.28,154.34,152.16,0.7777777777777778,0.0,0.0,0.0,0.0
179,2020-08-28 00:00:00,-0.01077246452969,152.24,152.19,153.32,151.04,1.0,-0.10137838369808527,0.1695209558877897,-1.2753428375744387,0.18501610697776247
180,2020-08-29 00:00:00,-0.01077246452969,152.24,152.19,153.32,151.04,1.0,-0.0717625280168237,0.0838700496610425,-1.269320738730491,0.08504166001993523
181,2020-08-30 00:00:00,-0.01077246452969,152.24,152.19,153.32,151.04,1.0,-0.0619933021181156,0.0751260801519642,-0.8546717924039303,-0.18002892655442335
182,2020-08-31 00:00:00,-0.0027224435590969,150.6,152.24,153.98,150.43,1.0,-0.059536002864144955,0.0796912047418834,-0.8667092750991532,-0.4495619614201147
183,2020-09-01 00:00:00,0.013316465809974,150.19,150.58,152.37,149.01,1.0,-0.05981922104287296,0.09948718605939977,-0.8945392966237401,0.07699034502901661
184,2020-09-02 00:00:00,-0.0137985412970628,152.19,150.18,153.47,150.15,0.8333333333333334,0.0,0.0,0.0,0.0
185,2020-09-03 00:00:00,-0.0085282164034912,150.09,152.19,154.44,149.41,0.6,-0.08279822037049289,0.14412356785919478,-1.0913783374903574,-0.1095402193424876
186,2020-09-04 00:00:00,0.0173375445198574,148.81,150.07,151.72,147.79,1.0,0.004688534898204644,-0.0048774069847761226,-0.4836691045817648,-0.26489839645981533
187,2020-09-05 00:00:00,0.0173375445198574,148.81,150.07,151.72,147.79,1.0,0.020871295951853774,-0.023983589779966508,-0.5568999723648825,-0.7477869035071668
188,2020-09-06 00:00:00,0.0173375445198574,148.81,150.07,151.72,147.79,1.0,0.17627350817326448,-0.017592408127163672,0.8280350581743452,-0.7628846982335443
189,2020-09-07 00:00:00,-0.0173062949996695,151.39,148.8,151.54,148.8,1.0,0.18228196873837188,0.013551075717940897,0.42205908735798164,-0.47321526231565125
190,2020-09-08 00:00:00,0.0195603952409759,148.77,151.41,151.99,147.42,0.8571428571428571,0.1435184691060689,0.10598392074483431,0.6533933564914904,-0.04943460819098634
191,2020-09-09 00:00:00,0.0016482067510548,151.68,148.77,151.89,148.67,1.0,0.04362353855826395,0.40437037658651587,-0.371079253239459,1.75423958513954
192,2020-09-10 00:00:00,0.0001316395708548,151.93,151.7,153.05,151.01,0.9090909090909092,-0.013579873059155645,0.7624740016553426,-0.7509615236367168,3.2855429293125873
193,2020-09-11 00:00:00,-0.0017769002961499,151.95,151.94,152.41,151.01,1.0,-0.017154486328520235,0.3820166399190663,-0.5300416676284964,0.8740898788207072
194,2020-09-12 00:00:00,-0.0017769002961499,151.95,151.94,152.41,151.01,1.0,-0.0011582468775310772,0.20924864915131458,-0.38362500926995613,0.8944872628143165
195,2020-09-13 00:00:00,-0.0017769002961499,151.95,151.94,152.41,151.01,1.0,0.1119274360125555,0.048616201187181574,0.618077436524053,-0.24380867066822567
196,2020-09-14 00:00:00,0.0077136075949366,151.68,151.94,153.03,151.21,0.9230769230769232,0.07271642730475136,-0.038846170076864084,-0.16535434948362548,-0.58347653216223
197,2020-09-15 00:00:00,-0.0001962708537782,152.85,151.7,153.46,151.06,0.8,0.01841245684380688,-0.022520295784731914,-0.29583500037813765,-0.7055188377831736
198,2020-09-16 00:00:00,-0.0110587619421541,152.82,152.85,153.29,151.59,0.8571428571428571,0.2112987207150221,-0.01663223157105609,0.7649489082566323,-0.6642701880173159
199,2020-09-17 00:00:00,-0.0108515847283794,151.13,152.83,152.93,150.38,1.0,0.14929796879072832,0.05618542540536531,-0.06696047438888936,-0.29925574219911943
200,2020-09-18 00:00:00,-0.0359221352598836,149.49,151.11,151.55,149.4,1.0,0.25107408186518576,0.289426661861917,0.48878526373170167,1.1230051858792538
201,2020-09-19 00:00:00,-0.0359221352598836,149.49,151.11,151.55,149.4,1.0,0.013378435609023853,0.07601201715191941,-0.4942257017886222,-0.22147267310736193
202,2020-09-20 00:00:00,-0.0359221352598836,149.49,151.11,151.55,149.4,1.0,-0.06979672720204988,-0.011716386450342675,-0.96713321857678,-0.8483493307803355
203,2020-09-21 00:00:00,0.0055509297807381,144.12,149.49,149.53,144.0,1.0,-0.08936175927690027,-0.03102887046896452,-1.4083181051448068,-0.6988311090116079
204,2020-09-22 00:00:00,0.0020701076455976,144.92,144.11,146.36,144.08,1.0,-0.00941092739629834,-0.006253593602528085,-0.5861152260519055,-0.5863731148649004
205,2020-09-23 00:00:00,-0.0019969701143092,145.22,144.93,147.45,144.87,0.7894736842105263,-0.04574972497425289,-0.06977370784930592,-0.8223771572371088,-0.8104906523206439
206,2020-09-24 00:00:00,-0.0101428275719312,144.93,145.27,146.44,143.04,1.0,-0.042248166497221185,0.16944050015695566,-1.167394992664529,0.5894525999013251
207,2020-09-25 00:00:00,0.0235605743761326,143.46,144.92,145.25,142.29,1.0,0.0,0.0,0.0,0.0
208,2020-09-26 00:00:00,0.0235605743761326,143.46,144.92,145.25,142.29,1.0,0.0,0.0,0.0,0.0
209,2020-09-27 00:00:00,0.0235605743761326,143.46,144.92,145.25,142.29,1.0,0.0,0.0,0.0,0.0
210,2020-09-28 00:00:00,-0.0053119041133206,146.84,143.45,146.97,143.43,1.0,0.0,0.0,0.0,0.0
211,2020-09-29 00:00:00,-0.0026016705463507,146.06,146.84,147.33,145.59,1.0,0.0,0.0,0.0,0.0
212,2020-09-30 00:00:00,0.0027457440966502,145.68,146.06,146.71,144.69,1.0,0.0,0.0,0.0,0.0
213,2020-10-01 00:00:00,0.0001369112814894,146.08,145.71,147.53,145.34,1.0,0.0,0.0,0.0,0.0
214,2020-10-02 00:00:00,0.009719370294319,146.1,146.06,146.21,144.26,1.0,0.0,0.0,0.0,0.0
215,2020-10-03 00:00:00,0.009719370294319,146.1,146.06,146.21,144.26,1.0,0.0,0.0,0.0,0.0
216,2020-10-04 00:00:00,0.009719370294319,146.1,146.06,146.21,144.26,1.0,0.0,0.0,0.0,0.0
217,2020-10-05 00:00:00,0.0079989154013013,147.52,146.08,147.55,146.07,1.0,0.0,0.0,0.0,0.0
218,2020-10-06 00:00:00,0.0006724949562879,148.7,147.52,149.39,147.01,0.9,0.0,0.0,0.0,0.0
219,2020-10-07 00:00:00,0.0075268817204299,148.8,148.7,149.01,148.17,1.0,0.0,0.0,0.0,0.0
220,2020-10-08 00:00:00,-0.0002001067235859,149.92,148.72,150.29,148.72,1.0,0.0,0.0,0.0,0.0
221,2020-10-09 00:00:00,0.0065381279605044,149.89,149.9,150.58,148.98,1.0,0.0,0.0,0.0,0.0
222,2020-10-10 00:00:00,0.0065381279605044,149.89,149.9,150.58,148.98,1.0,0.0,0.0,0.0,0.0
223,2020-10-11 00:00:00,0.0065381279605044,149.89,149.9,150.58,148.98,1.0,0.0,0.0,0.0,0.0
224,2020-10-12 00:00:00,-0.0071584808112945,150.87,149.91,151.19,149.64,0.9047619047619048,0.0,0.0,0.0,0.0
225,2020-10-13 00:00:00,0.0022698444488951,149.79,150.86,151.03,149.24,1.0,0.23045965169321292,-0.004460015445661547,0.9702521037273227,-0.6825466807791987
226,2020-10-14 00:00:00,-0.0279091454073136,150.13,149.79,151.03,149.41,1.0,0.4168236331314965,-0.005619447359041629,1.382556212850603,-0.3715899412152896
227,2020-10-15 00:00:00,0.0158969439495682,145.94,150.1,150.16,145.17,0.8571428571428571,0.0,0.0,0.0,0.0
228,2020-10-16 00:00:00,-0.0009442870632671,148.26,145.94,148.74,145.68,1.0,-0.003911396731060002,0.16721132117036852,-0.3757094238441501,0.14975677025369213
229,2020-10-17 00:00:00,-0.0009442870632671,148.26,145.94,148.74,145.68,1.0,-0.08533643643695932,-0.10341993461316967,-1.091437750349142,-0.8536576556352153
230,2020-10-18 00:00:00,-0.0009442870632671,148.26,145.94,148.74,145.68,1.0,-0.05521396649896815,-0.017019765620784,-0.9144882104215891,-0.6351111261198211
231,2020-10-19 00:00:00,0.0058061031596002,148.12,148.26,149.79,147.68,1.0,-0.034503189193174855,0.04624492651154455,-0.6256032445670261,-0.4384480595643502
232,2020-10-20 00:00:00,-0.0189287152637937,148.98,148.11,149.66,147.2,1.0,-0.01977665589033606,0.1154065983906607,-0.6173522104164505,0.045835699137533034
233,2020-10-21 00:00:00,-0.0012999452654624,146.16,148.97,149.43,146.11,0.8333333333333334,0.0,0.0,0.0,0.0
234,2020-10-22 00:00:00,0.0104816058094129,145.97,146.16,146.66,144.32,1.0,0.061379208059591406,0.21970006975578737,-0.35228806908940397,0.218631786239037
235,2020-10-23 00:00:00,-0.0174915254237289,147.5,145.95,148.1,145.91,1.0,1.013807301358736,0.5629541992347136,2.0640134209073957,1.7797226095199832
236,2020-10-24 00:00:00,-0.0174915254237289,147.5,145.95,148.1,145.91,1.0,0.0,0.0,0.0,0.0
237,2020-10-25 00:00:00,-0.0174915254237289,147.5,145.95,148.1,145.91,1.0,0.0,0.0,0.0,0.0
238,2020-10-26 00:00:00,-0.015801821694728,144.92,147.51,147.53,144.72,0.9,0.0,0.0,0.0,0.0
239,2020-10-27 00:00:00,-0.0408749912360652,142.63,144.92,145.43,142.58,0.9230769230769232,-0.027713301681848712,0.03780280264715685,-0.8466930300085517,-0.5046666558593556
240,2020-10-28 00:00:00,-0.0017543859649123,136.8,142.65,142.67,136.4,1.0,-0.0300132220925855,0.09996951396007248,-0.8896754411302673,0.10897095116679226
241,2020-10-29 00:00:00,0.0032220269478617,136.56,136.78,138.13,134.79,0.75,-0.007583400463735401,0.07935116934430386,-0.6981367589417217,-0.08134832085825075
242,2020-10-30 00:00:00,0.0249635036496349,137.0,136.55,137.24,135.04,1.0,0.05233650467349715,0.16150454974574302,-0.26123454006165037,0.1487010135757364
243,2020-10-31 00:00:00,0.0249635036496349,137.0,136.55,137.24,135.04,1.0,-0.038851230267751724,0.2738997411035129,-1.0018847238649475,1.6046477830787444
244,2020-11-01 00:00:00,0.0249635036496349,137.0,136.55,137.24,135.04,1.0,-0.05077113478719131,0.11101838610314552,-0.8458405313857797,0.1856516605008633
245,2020-11-02 00:00:00,0.0309784930921522,140.42,137.07,140.46,135.95,1.0,-0.06948774857218698,0.0605468363231676,-0.8061209412855481,-0.12028312804886229
246,2020-11-03 00:00:00,0.0193410236927539,144.77,140.42,144.8,140.4,0.8888888888888888,-0.020734001400571245,0.05927180635839768,-0.7069611212117352,-0.3301676297505897
247,2020-11-04 00:00:00,0.0195161618215084,147.57,144.52,147.84,141.71,0.8333333333333334,-0.023526255252757977,0.0077545778447127844,-0.8292684507488098,-0.6535622114585901
248,2020-11-05 00:00:00,-0.0020604852110335,150.45,147.27,150.86,147.27,1.0,-0.0426846744362992,0.05946650617389437,-1.1758590766535337,-0.2516256457403559
249,2020-11-06 00:00:00,0.0538164379912082,150.14,150.57,151.2,148.63,1.0,0.09013383659819318,-0.049461059785704364,0.0467796889709309,-0.9758580690712085
250,2020-11-07 00:00:00,0.0538164379912082,150.14,150.57,151.2,148.63,1.0,0.11480469914164448,-0.03717611765197493,0.006847191289738007,-0.7055025188817521
251,2020-11-08 00:00:00,0.0538164379912082,150.14,150.57,151.2,148.63,1.0,0.20673372239939702,-0.07056059526598357,0.5567550491695489,-1.0681042110960477
252,2020-11-09 00:00:00,0.0050562507900392,158.22,149.91,159.44,149.91,0.8,0.2883603764859428,-0.039560812943322254,0.6576844044436776,-0.503122091902813
253,2020-11-10 00:00:00,0.0075462206011821,159.02,158.24,159.61,157.04,1.0,0.03143616148477957,-0.01717989051363933,-0.5162925964556362,-0.7209420895829501
254,2020-11-11 00:00:00,-0.0088628136312569,160.22,159.0,160.65,158.86,0.8,0.09454273005725611,0.0686591501681244,-0.2151262873489083,-0.03887308823357654
255,2020-11-12 00:00:00,0.0039042821158688,158.8,159.94,160.28,158.01,0.9090909090909092,0.02519565727376527,0.018991942941297246,-0.5789955027215297,-0.5609610816789716
256,2020-11-13 00:00:00,0.0190691255802284,159.42,158.81,159.87,157.99,1.0,-0.02161957662121239,0.10730819729241503,-1.0163581570167135,0.2671452918031987
257,2020-11-14 00:00:00,0.0190691255802284,159.42,158.81,159.87,157.99,1.0,-0.05084591951480455,0.12791764073973155,-1.212458723219616,0.44878612583137556
258,2020-11-15 00:00:00,0.0190691255802284,159.42,158.81,159.87,157.99,1.0,-0.0677552391453764,0.03626830838482675,-0.59002514661999,-0.2991262205602107
259,2020-11-16 00:00:00,0.0055398251877385,162.46,159.42,163.34,159.35,0.8571428571428571,-0.07014834126477076,-0.0006822411685032392,-0.9963319119452845,-0.46441362005768444
260,2020-11-17 00:00:00,0.0085088148873652,163.36,162.14,163.78,161.98,1.0,0.2726366985719637,-0.03738583754559599,1.0074980185943812,-0.8230262285477056
261,2020-11-18 00:00:00,-0.0029742033383915,164.75,163.52,164.99,162.81,0.9047619047619048,0.15816921599054368,-0.06348198254521531,0.015198982972189261,-1.0690071798898173
262,2020-11-19 00:00:00,0.0079142822354804,164.26,165.17,165.34,163.34,1.0,0.3025494866788021,-0.031178844957975294,0.8221283750190941,-1.1983298952024073
263,2020-11-20 00:00:00,-0.0013892244503502,165.56,163.83,166.04,163.82,1.0,0.2235728108838595,-0.016132737643153483,1.2630317972847094,-1.0364355626034596
264,2020-11-21 00:00:00,-0.0013892244503502,165.56,163.83,166.04,163.82,1.0,0.035619441176862665,-0.060480456682114436,-0.3042641779597353,-0.9558190583482544
265,2020-11-22 00:00:00,-0.0013892244503502,165.56,163.83,166.04,163.82,1.0,-0.031691589006756615,-0.005156754008610598,-0.7445026465228474,-0.5556748670561192
266,2020-11-23 00:00:00,0.0209883263775479,165.33,165.39,167.63,165.26,1.0,0.008710374714961944,0.08991297847621826,-0.5404351146164191,-0.2726725226585492
267,2020-11-24 00:00:00,0.0074052132701421,168.8,165.0,168.88,165.0,1.0,0.648149986192327,0.6204976954797772,2.8547291102796475,1.858784742270579
268,2020-11-25 00:00:00,-0.0039400176418701,170.05,168.43,170.34,168.12,0.8571428571428571,0.0,0.0,0.0,0.0
269,2020-11-26 00:00:00,0.006789467469595,169.38,170.05,170.69,169.32,1.0,0.10834172181093216,0.18424872825240346,0.14369401188903524,0.030700446567565164
270,2020-11-27 00:00:00,-0.0129595965519263,170.53,169.25,170.8,169.1,1.0,0.0,0.0,0.0,0.0
271,2020-11-28 00:00:00,-0.0129595965519263,170.53,169.25,170.8,169.1,1.0,0.0,0.0,0.0,0.0
272,2020-11-29 00:00:00,-0.0129595965519263,170.53,169.25,170.8,169.1,1.0,0.0,0.0,0.0,0.0
273,2020-11-30 00:00:00,0.002851711026616,168.32,170.2,170.57,168.29,0.8571428571428571,0.0,0.0,0.0,0.0
274,2020-12-01 00:00:00,-0.0062203791469194,168.8,168.66,169.62,168.1,0.9230769230769232,-0.07893111081397386,0.07899793527783405,-0.9689978131527041,-0.1652030104174806
275,2020-12-02 00:00:00,0.0006557377049181,167.75,168.27,168.84,166.39,1.0,0.16088215495155467,-0.020566845410051826,0.45796527088713196,-0.7202281625414263
276,2020-12-03 00:00:00,0.0075062552126771,167.86,167.26,168.19,167.11,1.0,0.025372830583568096,0.060281348836823234,-0.4741035128371094,-0.32696312678534506
277,2020-12-04 00:00:00,-0.0031338694418164,169.12,168.09,169.24,167.83,1.0,-0.01055633940306322,0.01943252426023978,-0.725183501716641,-0.3958304691209854
278,2020-12-05 00:00:00,-0.0031338694418164,169.12,168.09,169.24,167.83,1.0,-0.02518367433722446,0.009740626722356538,-0.6392613189118942,-0.41584521759709214
279,2020-12-06 00:00:00,-0.0031338694418164,169.12,168.09,169.24,167.83,1.0,0.0009339185468277833,0.013621915495168224,-0.6122412202584814,-0.42444995455592205
280,2020-12-07 00:00:00,-0.0016608339759179,168.59,169.12,169.18,167.5,1.0,0.03151378043629993,0.06046767537505371,-0.22149725097786574,-0.001296318835987672
281,2020-12-08 00:00:00,-0.0028518804586773,168.31,168.62,168.72,167.1,1.0,0.0010898333657660686,0.19799414142540694,-0.7751981641568776,0.40422469970925995
282,2020-12-09 00:00:00,-0.0017875230888399,167.83,168.31,169.99,167.75,0.6666666666666666,0.0,0.0,0.0,0.0
283,2020-12-10 00:00:00,-0.0100877454784217,167.53,167.87,168.76,166.29,1.0,0.0,0.0,0.0,0.0
284,2020-12-11 00:00:00,0.0028943560057886,165.84,167.53,167.65,164.98,1.0,0.0,0.0,0.0,0.0
285,2020-12-12 00:00:00,0.0028943560057886,165.84,167.53,167.65,164.98,1.0,0.0,0.0,0.0,0.0
286,2020-12-13 00:00:00,0.0028943560057886,165.84,167.53,167.65,164.98,1.0,0.0,0.0,0.0,0.0
287,2020-12-14 00:00:00,0.0075757575757576,166.32,165.84,168.12,165.78,0.8,0.0,0.0,0.0,0.0
288,2020-12-15 00:00:00,0.0027449576321755,167.58,166.0,167.79,165.69,0.8333333333333334,-0.11922629366190307,0.020665239209636255,-1.254638000604136,-0.6053887747851548
289,2020-12-16 00:00:00,0.0010711735301119,168.04,167.55,169.43,167.3,0.5555555555555556,0.05718947635503735,0.06509547112799208,-0.2508733702322504,-0.1791331516737673
290,2020-12-17 00:00:00,-0.0018428248721911,168.22,167.9,169.23,167.89,1.0,0.2057307996447575,0.061597733433947255,0.4046938454356858,-0.2996555096730525
291,2020-12-18 00:00:00,-0.0253111786075873,167.91,167.99,169.21,167.46,1.0,0.4415239945891827,0.033252623374387724,0.9685885491331204,-0.37364507829425725
292,2020-12-19 00:00:00,-0.0253111786075873,167.91,167.99,169.21,167.46,1.0,0.2809168781411291,0.005521772671619907,1.5113906043470553,-0.4459007797674991
293,2020-12-20 00:00:00,-0.0253111786075873,167.91,167.99,169.21,167.46,1.0,0.27341447692046383,-0.0020200370468375084,1.4809558085839647,-0.5615130474747008
294,2020-12-21 00:00:00,0.0194916289869241,163.66,168.22,168.22,161.2,0.8333333333333334,0.3051072931296197,0.005832829116029892,1.5357043466195306,-0.4311118838590085
295,2020-12-22 00:00:00,0.0132454300269703,166.85,163.67,166.92,163.57,0.7142857142857143,0.16879504998099826,0.004100524551810203,-0.05160998718339309,-0.5925246536870458
296,2020-12-23 00:00:00,0.0002957529871052,169.06,166.85,169.29,166.81,0.9761904761904762,0.09176889499183227,-0.002725634838910196,0.18045443331619726,-0.6874171371174946
297,2020-12-24 00:00:00,0.0,169.11,168.95,169.17,168.95,1.0,0.1457019467721521,-0.017151309479354282,0.306201818331874,-0.581684510053565
298,2020-12-25 00:00:00,0.0069185737094198,169.11,169.11,169.33,168.89,1.0,0.10384845194518988,0.4712332400513528,0.0894495359304073,0.9931352792785987
299,2020-12-26 00:00:00,0.0069185737094198,169.11,169.11,169.33,168.89,1.0,0.19004572460879388,0.46759430652034784,0.22380213687713907,1.6512500134449966
300,2020-12-27 00:00:00,0.0069185737094198,169.11,169.11,169.33,168.89,1.0,0.1833896038256242,0.5054973141613797,0.6757905491314808,2.1384359585905175
301,2020-12-28 00:00:00,-0.0011745360582569,170.28,168.83,170.82,168.83,0.4444444444444444,0.17463923565364414,0.7193719436776265,-0.052307812517057836,2.4467612409851016
302,2020-12-29 00:00:00,-0.000881937911571,170.08,170.28,171.12,169.67,1.0,0.12589636896946388,0.11035922327604286,0.2852890342880132,-0.1345149958078025
303,2020-12-30 00:00:00,0.0003530865650562,169.93,169.94,170.79,169.92,1.0,0.09401463433149626,0.04718455053411574,-0.11657182333085457,-0.40787374784920893
304,2020-12-31 00:00:00,-5.882698982304445e-05,169.99,169.94,170.06,169.91,1.0,-0.060501839759639964,-0.12930237326447536,-0.7650846796420017,-1.3902495761339573
305,2021-01-01 00:00:00,0.0040593010942463,169.98,169.99,169.99,169.98,1.0,0.0,0.0,0.0,0.0
306,2021-01-02 00:00:00,0.0040593010942463,169.98,169.99,169.99,169.98,1.0,0.0,0.0,0.0,0.0
307,2021-01-03 00:00:00,0.0040593010942463,169.98,169.99,169.99,169.98,1.0,0.0,0.0,0.0,0.0
308,2021-01-04 00:00:00,-0.0046288158434405,170.67,169.78,171.99,169.78,1.0,0.0,0.0,0.0,0.0
309,2021-01-05 00:00:00,0.0247233341182011,169.88,170.9,170.9,169.05,0.9,0.0,0.0,0.0,0.0
310,2021-01-06 00:00:00,-5.744485294128749e-05,174.08,169.87,174.48,169.63,1.0,0.0,0.0,0.0,0.0
311,2021-01-07 00:00:00,0.0022404779686333,174.07,173.24,174.91,173.17,0.875,0.0,0.0,0.0,0.0
312,2021-01-08 00:00:00,-0.0024647483663877,174.46,173.9,176.01,173.71,1.0,1.3678271559408444,0.29662566830867476,5.18255699248919,0.3206279517949031
313,2021-01-09 00:00:00,-0.0024647483663877,174.46,173.9,176.01,173.71,1.0,0.38957353265505823,0.13042310587730732,3.036847525383609,0.1845761734502885
314,2021-01-10 00:00:00,-0.0024647483663877,174.46,173.9,176.01,173.71,1.0,0.2797564610927248,-0.005272186989493832,2.021010727126243,-0.34748953728017706
315,2021-01-11 00:00:00,-0.0042521404355571,174.03,175.44,175.44,172.31,1.0,0.2667661900603946,-0.038610730395879145,0.6137375580639431,-0.6689490234899494
316,2021-01-12 00:00:00,0.004731952218824,173.29,174.03,174.77,172.69,1.0,0.2941196752255353,-0.04301309489239458,0.3281562599792615,-0.46860601990752354
317,2021-01-13 00:00:00,-0.0052265808971341,174.11,172.58,174.64,172.58,0.8620689655172413,0.28331572411618744,0.006564086348726406,0.6574088836546884,-0.41135887447567365
318,2021-01-14 00:00:00,-0.0108545034642032,173.2,174.11,174.97,172.99,0.9,0.07470779564795471,-0.09432638445049779,0.007301595386908317,-1.1948782471796906
319,2021-01-15 00:00:00,0.0039691804809713,171.32,172.99,173.98,170.26,1.0,0.04559409362025946,0.12327780129996047,-0.279537900905057,0.4076467232241529
320,2021-01-16 00:00:00,0.0039691804809713,171.32,172.99,173.98,170.26,1.0,0.008972640267361776,0.07573934123817327,-0.25358795219269537,0.01082519018439643
321,2021-01-17 00:00:00,0.0039691804809713,171.32,172.99,173.98,170.26,1.0,0.39098415537435116,-0.007894376451957008,1.5845442746129546,-0.6510054481592232
322,2021-01-18 00:00:00,-0.002267441860465,172.0,171.33,172.11,170.23,1.0,0.4191336409425963,-0.02395461609073468,1.8625098985303692,-0.3816937525586896
323,2021-01-19 00:00:00,0.0090903793485226,171.61,171.99,173.19,171.5,1.0,0.3281093822099308,0.009680937736823658,1.1383500732680274,-0.3681036306386228
324,2021-01-20 00:00:00,-0.0094704625512501,173.17,171.43,173.26,171.43,1.0,0.31007289685669903,0.14662113076408811,0.6877983006082665,0.3071003934767526
325,2021-01-21 00:00:00,-0.0145747099632717,171.53,173.2,174.54,171.49,1.0,0.31892296699334644,0.7899136340028496,0.7359532553999985,5.825521842546138
326,2021-01-22 00:00:00,-0.0150860793941904,169.03,171.54,171.57,167.84,1.0,0.0,0.0,0.0,0.0
327,2021-01-23 00:00:00,-0.0150860793941904,169.03,171.54,171.57,167.84,1.0,0.0,0.0,0.0,0.0
328,2021-01-24 00:00:00,-0.0150860793941904,169.03,171.54,171.57,167.84,1.0,0.0,0.0,0.0,0.0
329,2021-01-25 00:00:00,0.0109322441134071,166.48,169.0,170.24,165.97,0.7142857142857143,0.0,0.0,0.0,0.0
330,2021-01-26 00:00:00,-0.0146761734997029,168.3,166.29,168.73,165.83,0.75,0.0,0.0,0.0,0.0
331,2021-01-27 00:00:00,0.0119399384912258,165.83,168.32,168.38,164.0,1.0,0.05591879309476955,0.057613279749001656,-0.5883966549345301,-0.24452499424041332
332,2021-01-28 00:00:00,-0.0155533043322806,167.81,165.86,168.02,163.21,1.0,-0.015052958489533808,0.12750207188626206,-0.7035243828021754,0.13627521784550725
333,2021-01-29 00:00:00,0.0112590799031477,165.2,167.82,167.84,164.89,1.0,0.011923993989692683,0.006393087266125974,-0.5378133883216518,-0.5253217237910238
334,2021-01-30 00:00:00,0.0112590799031477,165.2,167.82,167.84,164.89,1.0,-0.04628212486863337,-0.0008260607780066209,-0.8084265272482389,-0.6029863529488231
335,2021-01-31 00:00:00,0.0112590799031477,165.2,167.82,167.84,164.89,1.0,-0.009704724460807945,0.01760564009336818,-0.5462220453883772,-0.4137408659607446
336,2021-02-01 00:00:00,0.0104154196097211,167.06,165.17,167.48,165.14,1.0,-0.0012337831601385574,0.05779727457973394,-0.7037535430545004,-0.3531816674388614
337,2021-02-02 00:00:00,0.0210308056872036,168.8,167.26,169.49,167.01,0.6428571428571429,0.01722968496543853,0.1308961447314836,-0.41444852437298785,0.07541467467599629
338,2021-02-03 00:00:00,0.0157818392805337,172.35,168.68,173.93,168.68,1.0,-0.012196867926599353,0.0286679735912454,-0.5314541486213216,-0.4041088106955264
339,2021-02-04 00:00:00,0.007082881133261,175.07,172.33,175.61,172.04,1.0,0.0,0.0,0.0,0.0
340,2021-02-05 00:00:00,0.0147467528784526,176.31,175.08,177.74,175.0,1.0,0.0,0.0,0.0,0.0
341,2021-02-06 00:00:00,0.0147467528784526,176.31,175.08,177.74,175.0,1.0,0.0,0.0,0.0,0.0
342,2021-02-07 00:00:00,0.0147467528784526,176.31,175.08,177.74,175.0,1.0,0.0,0.0,0.0,0.0
343,2021-02-08 00:00:00,-0.0051422502934435,178.91,176.31,179.58,176.28,0.8,0.0,0.0,0.0,0.0
344,2021-02-09 00:00:00,-0.0012360244957581,177.99,178.83,179.44,177.63,0.8888888888888888,0.18932001825935973,0.08871236015488115,0.28043019941777336,-0.19703133105272805
345,2021-02-10 00:00:00,0.0018563312144905,177.77,177.97,178.85,176.74,0.7391304347826086,-0.03268827932755247,0.07030730793903661,-0.8432232477634641,-0.4108328991486828
346,2021-02-11 00:00:00,0.0041549691184728,178.1,177.92,178.57,177.65,1.0,-0.01972661077637472,0.19855168739631335,-0.8928189296543628,0.6836073651500308
347,2021-02-12 00:00:00,0.0076045627376425,178.84,178.12,178.87,176.26,1.0,0.03272346473731158,0.22599140534075524,-0.4571289043170646,0.4012735213441911
348,2021-02-13 00:00:00,0.0076045627376425,178.84,178.12,178.87,176.26,1.0,-0.024772528758490786,0.12288717498264301,-0.6846770495876628,0.3866195507740205
349,2021-02-14 00:00:00,0.0076045627376425,178.84,178.12,178.87,176.26,1.0,-0.03649769527261171,0.04336693227291111,-0.6297073808830174,-0.521721697371347
350,2021-02-15 00:00:00,-0.0072142064372918,180.2,178.84,180.55,178.81,1.0,-0.020613969732417026,0.045409651749037216,-0.7150921027717295,-0.1829159443472977
351,2021-02-16 00:00:00,-0.01078814980436,178.9,180.2,180.49,178.8,1.0,0.4023401253675454,0.09965305024295379,1.4371683854178874,-0.3174224569768026
352,2021-02-17 00:00:00,-0.0107362829858168,176.97,178.91,178.97,176.55,1.0,0.33335993676283593,-0.0032032742555783145,1.3221201786278256,-0.6744654483011
353,2021-02-18 00:00:00,0.0091963214714115,175.07,176.77,177.78,174.75,1.0,0.0,0.0,0.0,0.0
354,2021-02-19 00:00:00,-0.0050373556712701,176.68,175.07,177.07,174.46,1.0,0.0,0.0,0.0,0.0
355,2021-02-20 00:00:00,-0.0050373556712701,176.68,175.07,177.07,174.46,1.0,0.0,0.0,0.0,0.0
356,2021-02-21 00:00:00,-0.0050373556712701,176.68,175.07,177.07,174.46,1.0,0.0,0.0,0.0,0.0
357,2021-02-22 00:00:00,-0.0032425052619602,175.79,176.68,176.74,174.55,0.9230769230769232,0.0,0.0,0.0,0.0
358,2021-02-23 00:00:00,0.006391964387627,175.22,175.41,176.98,172.89,1.0,0.0,0.0,0.0,0.0
359,2021-02-24 00:00:00,-0.0020415107179313,176.34,175.2,176.62,174.7,0.875,0.0,0.0,0.0,0.0
360,2021-02-25 00:00:00,-0.0086373451528581,175.98,175.66,177.82,175.66,1.0,0.062288864106755604,0.20012793777931215,-0.19584948280418576,0.5889233142376683
361,2021-02-26 00:00:00,0.0180557147770262,174.46,175.95,176.08,173.08,1.0,0.008570737853854205,0.051303771609129356,-0.5120706901081994,-0.3222512740001595
362,2021-02-27 00:00:00,0.0180557147770262,174.46,175.95,176.08,173.08,1.0,-0.05096804890467599,0.0338292398848683,-0.8962738810656826,-0.5100522751138492
363,2021-02-28 00:00:00,0.0180557147770262,174.46,175.95,176.08,173.08,1.0,0.0011238869852379096,0.0020279933370108694,-0.5039456010300366,-0.5565493847655336
364,2021-03-01 00:00:00,-0.008107651596194,177.61,174.44,177.67,174.4,1.0,0.005813931109131865,0.04014659505767426,-0.6245656560065793,-0.18770881043198692
365,2021-03-02 00:00:00,-0.0021002440824202,176.17,177.61,178.09,176.12,1.0,-0.06151890011236194,0.16603944660093006,-0.972931833789783,0.2809802485062972
366,2021-03-03 00:00:00,0.0022753128555175,175.8,175.82,178.16,174.16,0.7647058823529411,0.0,0.0,0.0,0.0
367,2021-03-04 00:00:00,-0.00522133938706,176.2,175.8,176.97,174.07,0.9230769230769232,-0.11827797538045282,0.02593918501351311,-1.6914677234218363,-0.43205068549210884
368,2021-03-05 00:00:00,0.0306937471474212,175.28,177.25,177.64,174.57,1.0,-0.025982892680457503,-0.04509439565525675,-0.5315451046431826,-0.691681640431906
369,2021-03-06 00:00:00,0.0306937471474212,175.28,177.25,177.64,174.57,1.0,-0.04106856011265503,-0.046098979539863194,-0.6394576034318014,-0.735466296678557
370,2021-03-07 00:00:00,0.0306937471474212,175.28,177.25,177.64,174.57,1.0,-0.035251494003472494,-0.03054168281487435,-0.807801723370516,-0.8839928274520442
371,2021-03-08 00:00:00,0.0068637219085575,180.66,175.03,181.04,175.03,1.0,-0.023814999421235328,-0.02978591588827051,-0.6912603218003198,-0.65569144561544
372,2021-03-09 00:00:00,0.0056074766355139,181.9,180.77,182.35,180.41,1.0,-0.009128457657073596,-0.021305326494156063,-0.4153297475426718,-0.6531399634980274
373,2021-03-10 00:00:00,0.0091843428821343,182.92,181.9,183.1,181.37,1.0,-0.02538356109408557,-0.02822099691715607,-0.5626113513593882,-0.5924308518399243
374,2021-03-11 00:00:00,-0.0003250270855904,184.6,182.49,185.33,182.49,0.8888888888888888,-0.03237023220712665,-0.0038219021393555153,-0.8166515328941277,-0.5207134358413498
375,2021-03-12 00:00:00,0.0011379646689065,184.54,184.62,185.16,183.87,1.0,0.017193446655381805,0.09798594174007391,-0.5105606149063752,-0.28243071720982377
376,2021-03-13 00:00:00,0.0011379646689065,184.54,184.62,185.16,183.87,1.0,0.0,0.0,0.0,0.0
377,2021-03-14 00:00:00,0.0011379646689065,184.54,184.62,185.16,183.87,1.0,0.0,0.0,0.0,0.0
378,2021-03-15 00:00:00,0.0049797023004058,184.75,184.56,186.87,184.12,1.0,0.0,0.0,0.0,0.0
379,2021-03-16 00:00:00,0.0007540259600367,185.67,184.73,186.1,184.68,0.8666666666666667,0.0,0.0,0.0,0.0
380,2021-03-17 00:00:00,0.0025294655831225,185.81,185.67,186.3,185.17,0.8888888888888888,0.024043256741022034,0.050281962899336285,-0.27854739566105646,-0.15647645920152434
381,2021-03-18 00:00:00,-0.0061198196263689,186.28,185.8,187.11,185.54,1.0,0.0016760933382027332,0.023244231643657187,-0.6198556350304877,-0.2071997780111284
382,2021-03-19 00:00:00,0.002592632602355,185.14,186.26,186.34,183.62,1.0,-0.036627490847273236,-0.008203636517050583,-0.8943492967523942,-0.4125116805427386
383,2021-03-20 00:00:00,0.002592632602355,185.14,186.26,186.34,183.62,1.0,0.06934384937023719,-0.06345199054734607,-0.16435718125704038,-0.9237824055998343
384,2021-03-21 00:00:00,0.002592632602355,185.14,186.26,186.34,183.62,1.0,0.15620319634232338,-0.04530204129533644,0.4722582214064399,-0.917267274839707
385,2021-03-22 00:00:00,-0.0059260855511259,185.62,185.14,185.8,183.88,1.0,0.20933234657965283,-0.020737161810762572,0.7582134235211831,-0.8301162702663958
386,2021-03-23 00:00:00,0.0032516800346845,184.52,185.62,185.66,183.89,0.9333333333333332,0.1570406848347803,0.01936885151673806,1.0501797709128236,-0.683267942194487
387,2021-03-24 00:00:00,0.0009723422644771,185.12,184.52,185.23,183.18,0.8333333333333334,0.3553030374381416,0.029432659700772135,1.569328612840406,-0.5690642216406808
388,2021-03-25 00:00:00,0.0072315164597947,185.3,185.13,185.63,183.57,0.8333333333333334,0.21298567236920984,0.1351456168463141,1.6139805673777599,0.25295451064378865
389,2021-03-26 00:00:00,0.0009108444063438,186.64,185.27,186.92,185.25,1.0,0.07627101990760377,0.1811244476306868,-0.07762684884170498,0.13339673225395898
390,2021-03-27 00:00:00,0.0009108444063438,186.64,185.27,186.92,185.25,1.0,0.05971738519378622,0.019634324054861985,-0.31756963342795874,-0.5142474636269037
391,2021-03-28 00:00:00,0.0009108444063438,186.64,185.27,186.92,185.25,1.0,0.1590307468597265,0.0017610143535717881,0.3602881877202615,-0.5152185458747967
392,2021-03-29 00:00:00,0.0085113216637225,186.81,186.63,187.32,186.14,1.0,0.1813067933410677,0.03523485698318751,0.21501965529817077,-0.4467704663286456
393,2021-03-30 00:00:00,0.0004777070063694,188.4,186.83,188.9,186.76,1.0,0.19784306392190665,0.12604652960969354,0.46273294304396123,0.2603246177897505
394,2021-03-31 00:00:00,0.0027587670433443,188.49,188.38,189.48,188.35,0.8461538461538461,0.24709395828711767,0.473310660605641,0.5329689864223027,0.7326721702283511
395,2021-04-01 00:00:00,5.290725358456869e-05,189.01,188.49,189.32,188.44,1.0,-0.043256886316326515,0.10277757741776838,-0.9641169205615517,0.3468202548675453
396,2021-04-02 00:00:00,-0.0001058089091102,189.02,189.01,189.05,188.98,1.0,0.009262805795739126,0.07393272579608912,-0.3268315053401274,-0.1627169200083471
397,2021-04-03 00:00:00,-0.0001058089091102,189.02,189.01,189.05,188.98,1.0,0.0,0.0,0.0,0.0
398,2021-04-04 00:00:00,-0.0001058089091102,189.02,189.01,189.05,188.98,1.0,0.0,0.0,0.0,0.0
399,2021-04-05 00:00:00,0.0020105820105819,189.0,189.02,189.05,188.98,1.0,0.0,0.0,0.0,0.0
400,2021-04-06 00:00:00,-0.0009504699545886,189.38,188.98,190.74,188.96,1.0,0.0,0.0,0.0,0.0
401,2021-04-07 00:00:00,-0.0065539112050738,189.2,189.38,189.98,188.22,1.0,0.0,0.0,0.0,0.0
402,2021-04-08 00:00:00,-0.0059055118110236,187.96,189.18,190.22,187.6,0.9,0.0,0.0,0.0,0.0
403,2021-04-09 00:00:00,0.0009633395772009,186.85,187.96,188.74,186.8,1.0,0.0,0.0,0.0,0.0
404,2021-04-10 00:00:00,0.0009633395772009,186.85,187.96,188.74,186.8,1.0,0.0,0.0,0.0,0.0
405,2021-04-11 00:00:00,0.0009633395772009,186.85,187.96,188.74,186.8,1.0,0.0,0.0,0.0,0.0
406,2021-04-12 00:00:00,0.0058814093995615,187.03,186.86,187.93,186.18,1.0,0.0,0.0,0.0,0.0
407,2021-04-13 00:00:00,-0.0008504757348641,188.13,187.03,188.42,187.0,1.0,0.0,0.0,0.0,0.0
408,2021-04-14 00:00:00,-0.0018619992552002,187.97,188.12,188.48,186.91,1.0,0.0,0.0,0.0,0.0
409,2021-04-15 00:00:00,0.0086344739366805,187.62,187.97,188.46,187.17,1.0,0.0,0.0,0.0,0.0
410,2021-04-16 00:00:00,-0.0022194039315156,189.24,187.6,189.42,187.56,1.0,0.0,0.0,0.0,0.0
411,2021-04-17 00:00:00,-0.0022194039315156,189.24,187.6,189.42,187.56,1.0,0.0,0.0,0.0,0.0
412,2021-04-18 00:00:00,-0.0022194039315156,189.24,187.6,189.42,187.56,1.0,0.0,0.0,0.0,0.0
413,2021-04-19 00:00:00,-0.0239911026374324,188.82,189.24,189.71,188.57,1.0,0.0,0.0,0.0,0.0
414,2021-04-20 00:00:00,0.002550328286939,184.29,188.84,189.05,183.97,1.0,0.0,0.0,0.0,0.0
415,2021-04-21 00:00:00,0.0099047412859927,184.76,184.29,185.55,182.93,1.0,0.0,0.0,0.0,0.0
416,2021-04-22 00:00:00,-0.0001071868803259,186.59,184.76,186.74,184.69,1.0,0.0,0.0,0.0,0.0
417,2021-04-23 00:00:00,0.0052527201586536,186.57,186.59,186.66,185.37,1.0,0.0,0.0,0.0,0.0
418,2021-04-24 00:00:00,0.0052527201586536,186.57,186.59,186.66,185.37,1.0,0.0,0.0,0.0,0.0
419,2021-04-25 00:00:00,0.0052527201586536,186.57,186.59,186.66,185.37,1.0,0.0,0.0,0.0,0.0
420,2021-04-26 00:00:00,-0.0018128499066915,187.55,186.59,187.82,186.17,0.8,0.0,0.0,0.0,0.0
421,2021-04-27 00:00:00,-0.000320495700016,187.21,187.55,187.71,186.31,1.0,0.0,0.0,0.0,0.0
422,2021-04-28 00:00:00,-0.007053165909698,187.15,187.19,187.85,186.36,0.8333333333333334,0.0,0.0,0.0,0.0
423,2021-04-29 00:00:00,-0.0052198245708443,185.83,187.15,187.86,184.92,1.0,-0.0691120328981194,0.2605459038926323,-0.864502834154164,0.7191127340719818
424,2021-04-30 00:00:00,0.0109271881423779,184.86,185.81,186.72,184.47,1.0,0.09477681283484074,0.21026965254238217,0.3212408734580694,0.14883512523422107
425,2021-05-01 00:00:00,0.0109271881423779,184.86,185.81,186.72,184.47,1.0,0.45706446060873596,0.23472989255876175,1.56237194121381,0.846099522758641
426,2021-05-02 00:00:00,0.0109271881423779,184.86,185.81,186.72,184.47,1.0,0.2500411979219992,0.32646385352065277,0.6042611053470356,1.350634365224004
427,2021-05-03 00:00:00,-0.0174978595890409,186.88,184.86,187.23,184.78,1.0,0.21673347085790695,0.49251390910217285,1.4159451418274556,1.5499233779282497
428,2021-05-04 00:00:00,0.0196612384946352,183.61,186.88,187.65,183.37,0.9375,0.00903880564151116,0.96913962304055,-0.5787471519618248,5.764643356419406
429,2021-05-05 00:00:00,0.0004807178720222,187.22,183.61,187.29,183.6,1.0,0.07148114567605823,0.9529666531778718,-0.09562810096869645,5.3251389959486595
430,2021-05-06 00:00:00,0.0049116437990496,187.31,187.19,188.67,186.4,1.0,0.09040627396964851,0.43663772088774433,0.2055253535836991,1.4020283884065232
431,2021-05-07 00:00:00,0.0079689741273973,188.23,187.3,188.4,186.73,1.0,0.0,0.0,0.0,0.0
432,2021-05-08 00:00:00,0.0079689741273973,188.23,187.3,188.4,186.73,1.0,0.0,0.0,0.0,0.0
433,2021-05-09 00:00:00,0.0079689741273973,188.23,187.3,188.4,186.73,1.0,0.0,0.0,0.0,0.0
434,2021-05-10 00:00:00,-0.0154429979444472,189.73,188.25,189.82,188.2,1.0,0.0,0.0,0.0,0.0
435,2021-05-11 00:00:00,0.0023019271948606,186.8,189.74,189.78,185.67,1.0,0.0,0.0,0.0,0.0
436,2021-05-12 00:00:00,0.0016023073225445,187.23,186.8,187.88,185.68,0.8571428571428571,0.0,0.0,0.0,0.0
437,2021-05-13 00:00:00,0.0109849090812136,187.53,187.21,188.09,183.08,1.0,0.0,0.0,0.0,0.0
438,2021-05-14 00:00:00,0.0043251226330502,189.59,187.54,189.62,187.11,1.0,0.0,0.0,0.0,0.0
439,2021-05-15 00:00:00,0.0043251226330502,189.59,187.54,189.62,187.11,1.0,0.0,0.0,0.0,0.0
440,2021-05-16 00:00:00,0.0043251226330502,189.59,187.54,189.62,187.11,1.0,0.0,0.0,0.0,0.0
441,2021-05-17 00:00:00,0.0003676277506433,190.41,189.62,190.84,189.29,1.0,0.0,0.0,0.0,0.0
442,2021-05-18 00:00:00,-0.0152246955060897,190.48,190.41,192.24,190.01,0.9230769230769232,0.0,0.0,0.0,0.0
443,2021-05-19 00:00:00,0.0083697622347797,187.58,190.45,190.52,185.86,1.0,-0.0747238828568646,0.195446640949144,-1.0572731450664181,0.39577700890923706
444,2021-05-20 00:00:00,0.0106264869151466,189.15,187.57,189.17,186.88,0.9333333333333332,0.2253337935522497,0.07133990806255586,0.7161974726584938,-0.1383730592991263
445,2021-05-21 00:00:00,-0.0028771709562669,191.16,189.15,191.2,189.12,1.0,0.5622908764987846,0.0051499764598448294,2.6037187945709945,-0.5779286909735019
446,2021-05-22 00:00:00,-0.0028771709562669,191.16,189.15,191.2,189.12,1.0,0.1472124433713029,0.05868284916684452,0.30309097033802873,-0.39608597385689925
447,2021-05-23 00:00:00,-0.0028771709562669,191.16,189.15,191.2,189.12,1.0,0.17240987120102158,0.036294920593952895,0.3390579903641427,-0.5097222083925368
448,2021-05-24 00:00:00,-0.0001049262892818,190.61,191.15,191.25,189.85,0.8333333333333334,0.17337154716283987,0.02907895624688095,0.22106658570562193,-0.33796894248712156
449,2021-05-25 00:00:00,-0.0037777427986777,190.59,190.59,191.5,190.5,1.0,0.18044324335800965,0.02666849254359782,0.578161542345115,-0.35304419508400253
450,2021-05-26 00:00:00,0.0110601990835834,189.87,190.59,191.37,189.09,1.0,-0.023400969398521987,0.03342409965539073,-0.6454590032617858,-0.49918075883175017
451,2021-05-27 00:00:00,0.0043235922279523,191.97,189.89,192.3,189.39,1.0,0.0016985089994321356,0.03139217119738191,-0.5769918394535912,-0.49349904144747975
452,2021-05-28 00:00:00,5.186721991696527e-05,192.8,191.96,192.94,191.87,1.0,-0.040169806487974746,0.06740725771013079,-1.016007863830881,-0.1701491405281929
453,2021-05-29 00:00:00,5.186721991696527e-05,192.8,191.96,192.94,191.87,1.0,0.0,0.0,0.0,0.0
454,2021-05-30 00:00:00,5.186721991696527e-05,192.8,191.96,192.94,191.87,1.0,0.0,0.0,0.0,0.0
455,2021-05-31 00:00:00,0.0060681499922202,192.81,192.8,193.65,192.62,1.0,0.0,0.0,0.0,0.0
456,2021-06-01 00:00:00,0.0023198267862667,193.98,192.79,195.66,192.72,1.0,0.0,0.0,0.0,0.0
457,2021-06-02 00:00:00,0.0025201872139072,194.43,193.99,194.62,193.47,0.9310344827586208,0.0,0.0,0.0,0.0
458,2021-06-03 00:00:00,0.0044120664888159,194.92,194.44,195.12,193.06,0.9090909090909092,0.0,0.0,0.0,0.0
459,2021-06-04 00:00:00,0.0100623148431913,195.78,194.92,195.82,194.84,1.0,0.005723160992043397,0.15539970192336927,-0.5839562313447897,-0.032824074442951885
460,2021-06-05 00:00:00,0.0100623148431913,195.78,194.92,195.82,194.84,1.0,-0.13176628239377042,0.2230899258770398,-1.0834570593037711,0.25983491282250293
461,2021-06-06 00:00:00,0.0100623148431913,195.78,194.92,195.82,194.84,1.0,0.11106498189273406,-0.04651708513740793,-0.04579717961297608,-0.7467806755520152
462,2021-06-07 00:00:00,-0.0008091024020227,197.75,195.76,197.81,195.4,1.0,0.21691561844699692,-0.06878015076311428,1.3637809980749849,-1.0437045971813386
463,2021-06-08 00:00:00,-0.0026317121311807,197.59,197.75,198.53,196.81,1.0,0.038933333383779356,-0.04870891997287963,-0.6043104919159937,-0.8937846109805887
464,2021-06-09 00:00:00,-0.004465418379256,197.07,197.58,198.12,196.73,1.0,-0.023546864660274558,0.0611097690118676,-0.5494297513585426,-0.4486100478469334
465,2021-06-10 00:00:00,0.0040776798001937,196.19,197.07,197.23,195.36,1.0,-0.030094325902974894,0.2195410603918555,-0.9177920210139238,0.9219252631786552
466,2021-06-11 00:00:00,0.0016244479415198,196.99,196.2,197.14,196.07,1.0,0.0,0.0,0.0,0.0
467,2021-06-12 00:00:00,0.0016244479415198,196.99,196.2,197.14,196.07,1.0,0.0,0.0,0.0,0.0
468,2021-06-13 00:00:00,0.0016244479415198,196.99,196.2,197.14,196.07,1.0,0.0,0.0,0.0,0.0
469,2021-06-14 00:00:00,-0.0011149967056915,197.31,196.97,198.12,196.84,1.0,0.0,0.0,0.0,0.0
470,2021-06-15 00:00:00,0.0011669795524886,197.09,197.31,197.91,196.43,0.8,0.0,0.0,0.0,0.0
471,2021-06-16 00:00:00,-0.0023312385972024,197.32,197.09,197.78,196.82,1.0,0.0,0.0,0.0,0.0
472,2021-06-17 00:00:00,-0.0185410951945545,196.86,197.31,197.53,196.59,0.9285714285714286,0.0,0.0,0.0,0.0
473,2021-06-18 00:00:00,0.0067801873609026,193.21,196.86,197.15,193.17,1.0,0.16809003350600182,0.41490949707969804,0.180347587858935,0.861263851303361
474,2021-06-19 00:00:00,0.0067801873609026,193.21,196.86,197.15,193.17,1.0,-0.07040259843571572,0.4444820786341168,-0.591581768207792,0.3952540244437744
475,2021-06-20 00:00:00,0.0067801873609026,193.21,196.86,197.15,193.17,1.0,0.0062865922271884145,0.20610739274789314,-0.3252718556530606,0.6970230261891854
476,2021-06-21 00:00:00,-0.0032901501130989,194.52,193.26,194.56,190.79,0.8571428571428571,-0.01795236633990882,0.2960749071332538,-0.4624231004458307,1.160474883964649
477,2021-06-22 00:00:00,-0.0092325149577057,193.88,194.54,194.78,193.1,0.7777777777777778,-0.02933986198655525,0.06773084394475237,-0.8732865800628158,-0.224341422232441
478,2021-06-23 00:00:00,0.0128064969545525,192.09,193.88,194.66,192.06,1.0,-0.010929270973257132,0.03326381036177928,-0.6761982497622878,-0.4136791241560864
479,2021-06-24 00:00:00,0.0033924441017733,194.55,192.09,194.63,192.04,1.0,0.0681114914838874,-0.025292197936471972,-0.2815830378297373,-0.6371040070741665
480,2021-06-25 00:00:00,-0.0108600993801547,195.21,194.55,195.31,194.52,1.0,0.27775425906204365,-0.03667955085013386,0.38400203581276654,-0.8266703480590952
481,2021-06-26 00:00:00,-0.0108600993801547,195.21,194.55,195.31,194.52,1.0,0.14868074092962935,0.012684478840710334,0.3261845916659323,-0.3742404056261476
482,2021-06-27 00:00:00,-0.0108600993801547,195.21,194.55,195.31,194.52,1.0,0.34493603137816997,-0.022537425202166617,1.2153871639029685,-0.7205856108148441
483,2021-06-28 00:00:00,0.0048164068569061,193.09,195.22,195.69,193.04,0.8571428571428571,0.5307843337025373,-0.046801552117619494,2.2052896355195952,-0.7357211030109891
484,2021-06-29 00:00:00,-0.0094835583960416,194.02,193.09,194.84,193.04,1.0,0.2945932349525595,-0.039900646698343145,0.48080483164267035,-1.0675550734998507
485,2021-06-30 00:00:00,0.0070766989280881,192.18,194.12,194.41,191.04,0.9,0.2746770112113541,0.07311988033754258,0.9410369680404171,-0.363745881301229
486,2021-07-01 00:00:00,-5.166890565253129e-05,193.54,192.17,194.42,191.69,1.0,0.04187722528874982,0.006987363243315947,-0.4076407844315653,-0.5110753835629012
487,2021-07-02 00:00:00,0.0064589469332919,193.53,193.55,194.35,193.14,1.0,-0.05970456329402296,-0.0782817280523691,-0.9447183706111425,-0.9611147352192767
488,2021-07-03 00:00:00,0.0064589469332919,193.53,193.55,194.35,193.14,1.0,0.01402486124655411,-0.06380737583924656,-0.447636119317542,-0.7821380630265035
489,2021-07-04 00:00:00,0.0064589469332919,193.53,193.55,194.35,193.14,1.0,0.06564441310203328,-0.024737409136108113,-0.5069544760774783,-0.7318785424448697
490,2021-07-05 00:00:00,-0.0083684156484238,194.78,193.52,195.31,192.68,0.9230769230769232,0.03830276353237405,0.07203809902860492,-0.22223307434815712,-0.2978176522586136
491,2021-07-06 00:00:00,0.0018120631633445,193.15,194.78,194.87,192.64,1.0,-0.047101511149683084,0.2689733948135089,-0.6457884305233047,1.4804541679057237
492,2021-07-07 00:00:00,-0.0254780361757106,193.5,193.15,194.68,192.61,0.9090909090909092,-0.034185444087349026,-0.08576160037573377,-0.7443227522306266,-1.0896105766172093
493,2021-07-08 00:00:00,0.0166516413003129,188.57,193.65,193.65,187.24,1.0,-0.05027099538980906,-0.1002284320325666,-1.4225040289561,-0.879803845350105
494,2021-07-09 00:00:00,0.0089197224975221,191.71,188.59,191.92,188.49,1.0,0.12490236163015123,-0.08312410668101755,0.2563950594959523,-0.4737337333175354
495,2021-07-10 00:00:00,0.0089197224975221,191.71,188.59,191.92,188.49,1.0,0.5374178307420205,0.04900664224508411,2.5692805290932657,-0.241415585097754
496,2021-07-11 00:00:00,0.0089197224975221,191.71,188.59,191.92,188.49,1.0,0.4864745729916793,0.14905401362643822,2.1334110045126224,0.32134870749810623
497,2021-07-12 00:00:00,-0.0048598903939613,193.42,191.7,193.55,191.03,0.8461538461538461,0.46654473408622543,0.2700185166221267,1.150376713794433,0.7711522662390531
498,2021-07-13 00:00:00,0.0011429758935993,192.48,193.42,193.74,191.89,1.0,0.432033726101106,0.20096037470804262,2.3030036210146663,1.0316815823538688
499,2021-07-14 00:00:00,-0.0126621691748832,192.7,192.47,193.71,192.02,1.0,-0.020044803426057634,0.03146658662884505,-0.6754194123010234,-0.5886914611106705
500,2021-07-15 00:00:00,-0.0037842951750236,190.26,192.7,192.77,189.95,0.8888888888888888,-0.05714792448311812,0.10199098490220226,-0.7269375383598404,-0.11132566441067561
501,2021-07-16 00:00:00,-0.0333966445077555,189.54,190.28,191.18,188.79,1.0,-0.04179261879434648,0.08380437041593858,-1.0252015121589702,-0.3104454744384647
502,2021-07-17 00:00:00,-0.0333966445077555,189.54,190.28,191.18,188.79,1.0,0.12825191121113289,0.0718571223501101,-0.06361201437174455,-0.22115081683609933
503,2021-07-18 00:00:00,-0.0333966445077555,189.54,190.28,191.18,188.79,1.0,0.1035578558138619,0.015836633819406032,-0.02595603309597975,-0.5612111299363095
504,2021-07-19 00:00:00,0.0056219638666011,183.21,189.56,189.59,182.21,0.8333333333333334,0.1251150335618938,0.060991772577967396,0.29680661304326417,-0.11129583860872938
505,2021-07-20 00:00:00,0.0231762917933129,184.24,183.21,185.2,182.05,1.0,-0.039495442284187554,0.011112080201181485,-0.8707125295094884,-0.4923217851857423
506,2021-07-21 00:00:00,0.0055169487029866,188.51,184.27,188.56,184.15,0.7272727272727273,0.03201979134242805,-0.057187413775576346,-0.39923187464815074,-1.0469375249565827
507,2021-07-22 00:00:00,0.0122395146399366,189.55,188.51,190.9,188.48,0.8666666666666667,0.050097023611267666,0.24213508989564847,-0.46167700240061,0.15459059138501813
508,2021-07-23 00:00:00,0.0067233022358888,191.87,189.55,192.17,189.48,1.0,0.02952910796232988,0.0373042502664811,-0.3980020903926364,-0.4728183957927473
509,2021-07-24 00:00:00,0.0067233022358888,191.87,189.55,192.17,189.48,1.0,0.045415449952509235,0.01709339703965007,-0.4712624609246832,-0.5022712385052189
510,2021-07-25 00:00:00,0.0067233022358888,191.87,189.55,192.17,189.48,1.0,0.05177494146574091,0.0673437125654539,-0.5243505358838518,-0.29063714698981197
511,2021-07-26 00:00:00,-0.0081279768067922,193.16,191.89,193.18,190.73,0.6428571428571429,0.047097609268003104,0.08493195048464042,-0.2628766312539322,-0.18652398232468728
512,2021-07-27 00:00:00,0.0068375176157419,191.59,193.16,193.27,191.02,0.75,0.040469843288102325,-0.005314988761107919,-0.31917567452083195,-0.659444857935856
513,2021-07-28 00:00:00,0.0099533437013996,192.9,191.58,193.23,191.39,1.0,0.18077930229465977,0.021699498965043418,0.2671735204994674,-0.39741438397255274
514,2021-07-29 00:00:00,-0.0046196489066831,194.82,192.92,195.07,192.87,1.0,0.14077223969969577,0.0067991460987757435,0.3189228566331386,-0.6211830562672268
515,2021-07-30 00:00:00,-0.0001031353135312,193.92,194.82,195.12,193.78,1.0,0.10329981065945315,0.0017279933123157676,-0.11196747536699686,-0.5564414462745291
516,2021-07-31 00:00:00,-0.0001031353135312,193.92,194.82,195.12,193.78,1.0,0.07448300028449051,-0.022522124556966006,-0.038428204408194694,-0.6899568595197637
517,2021-08-01 00:00:00,-0.0001031353135312,193.92,194.82,195.12,193.78,1.0,0.08902164155912384,-0.014523413531010831,-0.02275955858760768,-0.6890888800013514
518,2021-08-02 00:00:00,0.0004125838060855,193.9,193.92,196.28,193.86,1.0,0.18962493882114018,0.04084117789727415,0.5538693815013982,-0.36609989750152844
519,2021-08-03 00:00:00,0.0050005155170636,193.98,193.9,194.85,193.36,0.875,0.6420172112622407,0.12471168936203725,3.0964694879478185,-0.18170793535594715
520,2021-08-04 00:00:00,0.0066683765067966,194.95,193.99,195.45,193.91,0.9230769230769232,1.817770714401231,0.2284164892518632,5.235242966410261,0.14568746420671955
521,2021-08-05 00:00:00,0.0127898089171974,196.25,194.97,196.32,194.81,0.7647058823529411,0.16878105531773446,0.09066047761983143,0.04512043946946156,-0.1515516721485118
522,2021-08-06 00:00:00,0.0051821292010464,198.76,196.23,199.01,196.14,1.0,0.11450933933150953,0.049044178312188436,-0.0962480968767485,-0.17207709276741692
523,2021-08-07 00:00:00,0.0051821292010464,198.76,196.23,199.01,196.14,1.0,0.7547215511019534,-0.0040417008385968956,1.737598452791316,-0.49554006072992823
524,2021-08-08 00:00:00,0.0051821292010464,198.76,196.23,199.01,196.14,1.0,1.6137826835703377,0.03514086475538214,12.175733695535238,-0.28778893567800484
525,2021-08-09 00:00:00,0.0024025226487813,199.79,198.76,199.95,198.6,1.0,1.7485169076224976,0.08682791802740208,15.543237687376218,-0.2146068102356224
526,2021-08-10 00:00:00,0.0097368552454186,200.27,199.78,200.92,199.69,1.0,1.2378113073257317,0.1870711575581634,6.136863111612858,0.7094061307701655
527,2021-08-11 00:00:00,0.0035110275937098,202.22,200.25,202.41,200.22,0.9166666666666666,1.1119893531910447,0.5365530051134808,6.750311797813897,2.493210257364961
528,2021-08-12 00:00:00,0.0033509091805056,202.93,202.22,203.11,202.1,0.9333333333333332,0.5764991556999775,0.2669439192340768,2.237452700090073,1.2272869511449438
529,2021-08-13 00:00:00,-0.0073670251952261,203.61,202.95,203.89,202.81,1.0,0.4225778907576512,0.0913118026742108,1.6329815253452695,-0.22526534812287063
530,2021-08-14 00:00:00,-0.0073670251952261,203.61,202.95,203.89,202.81,1.0,0.2689281270626376,0.066228931630258,0.9573553937643299,-0.18104293340421407
531,2021-08-15 00:00:00,-0.0073670251952261,203.61,202.95,203.89,202.81,1.0,0.06149015511159295,-0.04967618781584893,-0.07195418825455835,-0.7152513501859998
532,2021-08-16 00:00:00,-0.0087081292365544,202.11,203.6,203.7,201.66,0.8,0.0836490277947819,-0.06979760342600816,-0.08597364540613496,-0.7333437206569778
533,2021-08-17 00:00:00,0.0054404791614674,200.35,202.09,202.15,199.91,1.0,0.13004370926216335,0.04906689575800183,0.39911311311382375,-0.363165060127839
534,2021-08-18 00:00:00,-0.017325258141382,201.44,200.33,201.62,199.94,1.0,0.15870507648182386,0.019450209928888462,0.49090107565036917,-0.4143098638019925
535,2021-08-19 00:00:00,-0.001363980803233,197.95,201.44,201.49,196.36,0.875,0.15125589025431196,0.019921214846323032,0.1949420716899141,-0.5889717159515262
536,2021-08-20 00:00:00,0.0056151355726425,197.68,197.95,198.01,196.12,1.0,0.03302356822876362,0.008060428162496969,-0.35487109901117575,-0.6508786267710495
537,2021-08-21 00:00:00,0.0056151355726425,197.68,197.95,198.01,196.12,1.0,0.07270259713330951,-0.045999734007101445,-0.15611760863916516,-0.6808025600527303
538,2021-08-22 00:00:00,0.0056151355726425,197.68,197.95,198.01,196.12,1.0,0.10738257090532422,0.024124496568480147,0.09972097749108404,-0.4523877117291308
539,2021-08-23 00:00:00,-0.0002012173650585,198.79,197.67,199.76,197.65,1.0,0.09909992671820245,0.1554549739134794,-0.012344252473036681,-0.007789903700813433
540,2021-08-24 00:00:00,0.0016603773584906,198.75,198.77,199.56,197.71,1.0,0.08082090993124957,0.5364604754443283,-0.14610354293494163,2.1917621925432647
541,2021-08-25 00:00:00,-0.0075848904962829,199.08,198.75,199.09,198.35,0.875,0.0,0.0,0.0,0.0
542,2021-08-26 00:00:00,0.0053651870223212,197.57,199.08,199.14,197.35,1.0,0.0057496630914091185,-0.029967647897167993,-0.4774381471918069,-0.8029446204066586
543,2021-08-27 00:00:00,0.0004531037607612,198.63,197.55,198.68,197.17,1.0,0.17826254561460164,0.09714845541537098,0.5219407021679011,-0.19074829990137124
544,2021-08-28 00:00:00,0.0004531037607612,198.63,197.55,198.68,197.17,1.0,0.0,0.0,0.0,0.0
545,2021-08-29 00:00:00,0.0004531037607612,198.63,197.55,198.68,197.17,1.0,0.0,0.0,0.0,0.0
546,2021-08-30 00:00:00,-0.0003522544283413,198.72,198.63,199.15,198.11,0.75,0.0,0.0,0.0,0.0
547,2021-08-31 00:00:00,0.0064938333752831,198.65,198.72,200.14,197.74,1.0,0.9154162160523702,0.15063547856465842,2.875144693912594,0.03195621794951913
548,2021-09-01 00:00:00,0.0021006301890567,199.94,198.66,201.6,198.6,1.0,-0.09472357490296845,0.0005997622111770795,-0.5620107931815626,-0.344703471405775
549,2021-09-02 00:00:00,-0.0063885006987422,200.36,199.94,200.59,199.73,0.9,0.004039018982912701,0.019724070596904397,-0.5249195847114498,-0.2634829758992362
550,2021-09-03 00:00:00,0.0071830419931684,199.08,200.36,200.58,198.38,0.8571428571428571,0.12300336684737267,0.01769227977838117,0.0011275993917186893,-0.4923881146764563
551,2021-09-04 00:00:00,0.0071830419931684,199.08,200.36,200.58,198.38,0.8571428571428571,0.10346153790845847,0.2256949426839352,0.005815776743984982,0.4062856813031005
552,2021-09-05 00:00:00,0.0071830419931684,199.08,200.36,200.58,198.38,0.8571428571428571,0.05417568365402747,0.00735559596037394,-0.4133030810120655,-0.6177105747695039
553,2021-09-06 00:00:00,-0.0067328312802353,200.51,199.09,200.78,199.0,1.0,0.1427648916020443,-0.011377765866882328,-0.09333706563497177,-0.6776154998878375
554,2021-09-07 00:00:00,-0.0070797348865233,199.16,200.51,200.59,198.87,1.0,0.05689212824482581,-0.043012799196151974,-0.275203008351035,-0.8152578690018428
555,2021-09-08 00:00:00,0.0011630847029076,197.75,199.16,199.25,196.54,0.7777777777777778,0.20066159339748335,-0.008303608367068449,0.6760118337683828,-0.6599024271441115
556,2021-09-09 00:00:00,-0.0083846853217496,197.98,197.75,198.68,196.01,1.0,0.03347679387517477,0.009990047046525063,-0.5144677707352356,-0.6047036521393109
557,2021-09-10 00:00:00,0.0088121434392828,196.32,197.99,198.61,195.99,1.0,0.11724321870104948,0.015422012707568378,-0.12508432217224738,-0.484444825667414
558,2021-09-11 00:00:00,0.0088121434392828,196.32,197.99,198.61,195.99,1.0,0.5112807336310752,0.02247163247945938,3.0838170709258588,-0.5044836324829255
559,2021-09-12 00:00:00,0.0088121434392828,196.32,197.99,198.61,195.99,1.0,0.44115955572944987,0.09516078344022727,1.2806101831167211,0.054903584093026286
560,2021-09-13 00:00:00,0.002928553395607,198.05,196.3,198.72,196.24,0.7142857142857143,0.31828879426684065,0.0706560047448912,1.2368182499474594,-0.273897247507451
561,2021-09-14 00:00:00,-0.0095655238382923,198.63,198.07,199.43,197.84,0.9130434782608696,0.12673926140885428,0.00855774544211041,0.18173434895644233,-0.6985233897823235
562,2021-09-15 00:00:00,0.007116352361104,196.73,198.63,198.89,196.13,0.8571428571428571,0.22457787708165267,0.0018950347012456348,0.556218176957769,-0.6739130884434109
563,2021-09-16 00:00:00,-0.0094887195275828,198.13,196.73,199.27,196.66,1.0,0.21971230350169524,0.12894004202568166,0.6294707545766197,-0.09419552610750341
564,2021-09-17 00:00:00,-0.0254267515923567,196.25,198.15,199.66,196.09,0.9333333333333332,0.5577373785378432,0.05575296074592728,2.0436198489153816,-0.3918066151983641
565,2021-09-18 00:00:00,-0.0254267515923567,196.25,198.15,199.66,196.09,0.9333333333333332,0.5781131432543924,0.09283365459338278,3.024434021461103,-0.06463546850791378
566,2021-09-19 00:00:00,-0.0254267515923567,196.25,198.15,199.66,196.09,0.9333333333333332,0.2792811527723815,0.050902897728628105,1.2272936859216688,-0.2627197336111074
567,2021-09-20 00:00:00,0.0117118059186448,191.26,196.26,196.3,190.4,1.0,0.19319431420994349,0.0223673657495409,0.34777303054770603,-0.5132487006642559
568,2021-09-21 00:00:00,0.0148320413436692,193.5,191.26,194.14,191.19,1.0,0.05956281026271526,0.022324821827525376,-0.5275899770652004,-0.5390237002983231
569,2021-09-22 00:00:00,0.0141569486174059,196.37,193.5,196.63,193.44,1.0,0.16469668974408425,0.27241370962271727,0.35517886601948284,0.8634018480596128
570,2021-09-23 00:00:00,-0.0044187798142103,199.15,196.37,199.21,196.34,1.0,0.0006661035765134216,0.3632615624291047,-0.5748567090258194,1.484433631427775
571,2021-09-24 00:00:00,0.0062540979472435,198.27,199.26,199.26,197.86,1.0,-0.0160475670311353,0.05654478494808224,-0.6671392714468362,-0.22239565377987608
572,2021-09-25 00:00:00,0.0062540979472435,198.27,199.26,199.26,197.86,1.0,0.08172613517715543,-0.011433729789975366,-0.016083470879736574,-0.5346184681783711
573,2021-09-26 00:00:00,0.0062540979472435,198.27,199.26,199.26,197.86,1.0,0.17409645492706183,-0.10214018482558718,0.7790402960223533,-1.3121611073018622
574,2021-09-27 00:00:00,-0.0215528043707081,199.51,198.29,199.89,198.21,1.0,0.0,0.0,0.0,0.0
575,2021-09-28 00:00:00,0.0064545873674503,195.21,199.51,200.12,195.15,1.0,0.0,0.0,0.0,0.0
576,2021-09-29 00:00:00,-0.0018832391713747,196.47,195.21,197.18,195.14,0.8571428571428571,0.0,0.0,0.0,0.0
577,2021-09-30 00:00:00,-0.0020907700152983,196.1,196.47,198.08,195.21,1.0,0.0,0.0,0.0,0.0
578,2021-10-01 00:00:00,-0.0060299453216822,195.69,196.1,196.54,193.01,0.8947368421052632,0.0,0.0,0.0,0.0
579,2021-10-02 00:00:00,-0.0060299453216822,195.69,196.1,196.54,193.01,0.8947368421052632,-0.070518225028672,1.440939082810086,-1.2961146358928706,5.601366333723369
580,2021-10-03 00:00:00,-0.0060299453216822,195.69,196.1,196.54,193.01,0.8947368421052632,-0.022799475039670725,1.1352895100091303,-0.8934035275366036,4.900403663439488
581,2021-10-04 00:00:00,0.0189707470052953,194.51,195.69,196.46,194.15,0.8333333333333334,-0.011776580478778165,1.015114928491153,-0.7492404104608007,5.42161181433081
582,2021-10-05 00:00:00,-0.0138244197780019,198.2,194.51,198.25,194.46,0.9090909090909092,-0.025970093547662998,0.5705673810372414,-0.9994709701436209,2.1824515440588885
583,2021-10-06 00:00:00,0.0157065384221835,195.46,198.2,198.3,193.41,0.8571428571428571,-0.010080279843022844,0.49441235672805384,-0.4498628298621927,3.6564145886943544
584,2021-10-07 00:00:00,0.0020148088450108,198.53,195.45,198.96,195.45,1.0,0.03129386211286356,-0.0031008156834522183,-0.4761658009636117,-0.5081107517936725
585,2021-10-08 00:00:00,-0.0043231287387523,198.93,198.54,199.29,198.18,1.0,0.07683472732172358,-0.014959523799682017,-0.3781608852934622,-0.6906184588748887
586,2021-10-09 00:00:00,-0.0043231287387523,198.93,198.54,199.29,198.18,1.0,0.02385073545604577,0.01728215494735519,-0.35598329823122865,-0.47132867839980735
587,2021-10-10 00:00:00,-0.0043231287387523,198.93,198.54,199.29,198.18,1.0,0.05952526377798151,0.05210794403105279,-0.42353330769763087,-0.37776997770646714
588,2021-10-11 00:00:00,0.0027263088806988,198.07,198.96,199.0,197.07,1.0,0.07408125860804926,0.06078668775977292,-0.31175756325808235,-0.33200709244728427
589,2021-10-12 00:00:00,-0.0008559488444691,198.61,198.06,198.65,195.62,0.9,0.14670152095164646,0.100821172916441,0.007150206638584002,0.09688551325848213
590,2021-10-13 00:00:00,0.0120439427534771,198.44,198.62,199.18,197.61,1.0,0.8776077652835097,0.16617543178284944,5.762307958562574,0.2962644873968183
591,2021-10-14 00:00:00,0.0081163172832743,200.83,198.44,201.15,198.39,1.0,0.17503643051760598,-0.03340455594182057,0.057217093433740894,-0.47193956290133354
592,2021-10-15 00:00:00,-0.0085942902301689,202.46,200.83,202.94,200.8,1.0,0.0,0.0,0.0,0.0
593,2021-10-16 00:00:00,-0.0085942902301689,202.46,200.83,202.94,200.8,1.0,0.0,0.0,0.0,0.0
594,2021-10-17 00:00:00,-0.0085942902301689,202.46,200.83,202.94,200.8,1.0,0.0,0.0,0.0,0.0
595,2021-10-18 00:00:00,0.0020924671183737,200.72,202.46,202.52,199.91,1.0,0.0,0.0,0.0,0.0
596,2021-10-19 00:00:00,0.0094958735209308,201.14,200.72,201.54,200.63,1.0,0.0,0.0,0.0,0.0
597,2021-10-20 00:00:00,-0.0017237133710909,203.05,201.14,203.28,200.56,0.8888888888888888,0.0,0.0,0.0,0.0
598,2021-10-21 00:00:00,0.0017760236803158,202.7,203.05,203.5,201.59,1.0,0.0,0.0,0.0,0.0
599,2021-10-22 00:00:00,0.0089136215896779,203.06,202.71,203.91,202.64,1.0,0.0,0.0,0.0,0.0
600,2021-10-23 00:00:00,0.0089136215896779,203.06,202.71,203.91,202.64,1.0,0.0,0.0,0.0,0.0
601,2021-10-24 00:00:00,0.0089136215896779,203.06,202.71,203.91,202.64,1.0,0.0,0.0,0.0,0.0
602,2021-10-25 00:00:00,0.006101430175233,204.87,203.03,204.93,202.95,0.8,0.0,0.0,0.0,0.0
603,2021-10-26 00:00:00,-0.005918882204541,206.12,204.87,206.68,204.82,1.0,-0.044765816617760024,-0.027087127032197067,-1.0254331748613734,-0.71753850021868
604,2021-10-27 00:00:00,0.0031234748657881,204.9,206.12,206.16,204.54,0.8571428571428571,-0.04544407452673038,-0.013913793872217362,-0.6136273739448994,-0.6120897591198184
605,2021-10-28 00:00:00,-0.0003405663131263,205.54,204.9,205.88,204.53,1.0,0.004448296184357936,0.0029887523558675966,-0.7334566502657465,-0.8188941831539087
606,2021-10-29 00:00:00,-0.0003405663131263,205.54,204.9,205.88,204.53,1.0,0.10242791262802786,0.05979306291818798,0.22357417838909902,-0.13892810567957214
607,2021-10-30 00:00:00,-0.0003405663131263,205.54,204.9,205.88,204.53,1.0,0.3269994239870151,0.06237884534060534,0.9394851656698847,-0.1490511360974484
608,2021-10-31 00:00:00,-0.0003405663131263,205.54,204.9,205.88,204.53,1.0,0.3348752332607585,0.06456573390205378,1.0747018294090604,-0.3984626727622743
