,Date,Return,Price,Open,High,Low,Index,TE(XY),TE(YX),Z(XY),Z(YX)
0,2020-03-02 00:00:00,0.0068820094540735,431.56,417.49,433.48,417.49,0.8387096774193549,,,,
1,2020-03-03 00:00:00,0.0074333187581985,434.53,431.56,439.84,431.56,0.8709677419354839,,,,
2,2020-03-04 00:00:00,0.0202394005847953,437.76,434.53,437.81,432.01,0.8444444444444444,,,,
3,2020-03-05 00:00:00,-0.0137477049841027,446.62,437.76,447.26,437.76,0.925,,,,
4,2020-03-06 00:00:00,-0.0325326916091537,440.48,446.62,446.62,439.9,0.9393939393939394,,,,
5,2020-03-07 00:00:00,-0.0325326916091537,440.48,446.62,446.62,439.9,0.9393939393939394,,,,
6,2020-03-08 00:00:00,-0.0325326916091537,440.48,446.62,446.62,439.9,0.9393939393939394,,,,
7,2020-03-09 00:00:00,0.019875630646486,426.15,440.47,440.47,426.11,0.7222222222222222,,,,
8,2020-03-10 00:00:00,-0.0108140444526252,434.62,426.15,435.2,420.8,0.8387096774193549,,,,
9,2020-03-11 00:00:00,-0.0162588388537402,429.92,434.62,436.28,429.92,0.8235294117647058,,,,
10,2020-03-12 00:00:00,-0.0122715342964556,422.93,429.92,429.92,420.42,0.851063829787234,0.0807573378708577,0.1707765353058983,-0.273928263378585,0.4923559098944788
11,2020-03-13 00:00:00,-0.0376071240484512,417.74,422.94,422.94,404.03,0.8947368421052632,0.26940523739542144,0.1155688812842639,1.438459856066259,-0.13225901477845267
12,2020-03-14 00:00:00,-0.0376071240484512,417.74,422.94,422.94,404.03,0.8947368421052632,0.2755556370944774,-0.030156208485962566,2.078538062662726,-0.789235090110596
13,2020-03-15 00:00:00,-0.0376071240484512,417.74,422.94,422.94,404.03,0.8947368421052632,0.22145305579555075,0.03507808148044056,0.734962605255285,-0.4909160433996359
14,2020-03-16 00:00:00,-0.0020645225480685,402.03,417.74,419.18,401.38,0.8461538461538461,0.27973848120074596,0.1612790028821225,0.8312983577126289,0.410391515367735
15,2020-03-17 00:00:00,-0.0201645064805582,401.2,402.03,408.1,391.22,0.8585858585858586,0.43468741824645285,0.5736361134937349,1.0165763722584626,1.9699921929743978
16,2020-03-18 00:00:00,-0.0098191345933708,393.11,401.2,406.93,393.11,0.8780487804878049,0.23962446203600063,-0.01926765146240328,0.24498183914942637,-0.870691525140791
17,2020-03-19 00:00:00,0.0175979447655748,389.25,393.12,394.37,380.76,0.8876404494382022,0.0996842238153226,-0.01622841935719066,-0.1811099652711813,-0.9884617202677127
18,2020-03-20 00:00:00,-0.0309517798535724,396.1,389.26,396.97,389.26,0.9759036144578314,0.10236851105938793,-0.010644353660461014,0.21977645448324815,-0.75470373395834
19,2020-03-21 00:00:00,-0.0309517798535724,396.1,389.26,396.97,389.26,0.9759036144578314,0.039698712409125037,0.11270909951557329,-0.1871971230184055,-0.05850394588313248
20,2020-03-22 00:00:00,-0.0309517798535724,396.1,389.26,396.97,389.26,0.9759036144578314,-0.07554349729681498,0.27145913354397866,-1.2549187455510105,0.06299321467226535
21,2020-03-23 00:00:00,0.0245675281367236,383.84,396.1,396.1,383.23,0.84375,-0.06563452093226552,0.34989625110092426,-1.593963301956599,1.3152406029823533
22,2020-03-24 00:00:00,0.0221476339410584,393.27,383.84,393.56,383.84,0.8481012658227848,0.002694069987057013,0.1553799297902696,-0.40129653786833014,0.12671403343467166
23,2020-03-25 00:00:00,-0.0058211851335888,401.98,393.27,403.15,393.27,0.8611111111111112,-0.002026860383330664,-0.01947903335897916,-0.6450462151189739,-0.7789379066829291
24,2020-03-26 00:00:00,0.0028775898308478,399.64,401.99,403.42,397.86,0.8769230769230769,-0.005888407591493561,-0.033166871583042656,-0.7747803737421497,-0.7077021343280351
25,2020-03-27 00:00:00,-0.0087078020908705,400.79,399.63,405.92,399.63,1.0,0.05372358855052273,-0.03553797378843271,-0.29691330668107535,-0.7485931316814565
26,2020-03-28 00:00:00,-0.0087078020908705,400.79,399.63,405.92,399.63,1.0,0.22733976686645008,-0.019362285914506394,0.6767289943740076,-0.9988626426943504
27,2020-03-29 00:00:00,-0.0087078020908705,400.79,399.63,405.92,399.63,1.0,0.11045717600700034,0.0015428885141295368,0.37885549899781545,-0.6002651402456326
28,2020-03-30 00:00:00,0.0014346841177951,397.3,400.8,400.8,393.6,0.9032258064516128,0.06644527178047621,0.01686068064806001,-0.0602955155618009,-0.5142796300528693
29,2020-03-31 00:00:00,-0.0054037751024203,397.87,397.3,401.12,396.91,0.7931034482758621,0.07151766025126616,0.08143377830775211,-0.08131247072681853,-0.16904490528581773
30,2020-04-01 00:00:00,0.0162488628323055,395.72,397.87,401.67,395.23,0.8904109589041096,0.05020939951846426,-0.05943232991998748,-0.41564314324914514,-0.9458539917872927
31,2020-04-02 00:00:00,-0.0057192589829664,402.15,395.72,402.15,393.5,0.8620689655172413,0.021088988297679023,0.010832025109759336,-0.6660983479632855,-0.7614615532940395
32,2020-04-03 00:00:00,0.0,399.85,402.14,402.25,398.34,0.9666666666666668,0.0070275167753957035,0.06955832137582973,-0.8209420594331918,-0.15834505277992028
33,2020-04-04 00:00:00,0.0,399.85,402.14,402.25,398.34,0.9666666666666668,0.004254244879366986,0.25939494541573094,-0.8749982179132796,1.0476081188979096
34,2020-04-05 00:00:00,0.0,399.85,402.14,402.25,398.34,0.9666666666666668,0.06375442355707062,0.29765739222498144,-0.4701366123332777,0.6043035299227042
35,2020-04-06 00:00:00,0.0221332999874952,399.85,402.14,402.25,398.34,0.9130434782608696,0.07647671247625532,0.30934780522208083,-0.3836073008619093,0.6188941709768716
36,2020-04-07 00:00:00,-0.0014925373134328,408.7,399.85,409.24,399.85,0.971830985915493,0.0871972955421203,0.2673311863267358,-0.1372756106993819,0.9190148802799123
37,2020-04-08 00:00:00,0.0042637653458796,408.09,408.7,409.36,405.93,0.8840579710144928,0.01309861516384725,0.4273352405175208,-0.6888617017414669,1.5426022795535062
38,2020-04-09 00:00:00,-0.0095161408388843,409.83,408.09,410.87,408.09,0.8695652173913043,0.0005139015790769363,0.06140787957211735,-0.8213143883260521,-0.39003595722284096
39,2020-04-10 00:00:00,-0.0054935580026113,405.93,409.82,411.63,404.97,1.0,0.023886642816257186,0.0829483740470831,-0.3951874781195137,-0.07541207659705608
40,2020-04-11 00:00:00,-0.0054935580026113,405.93,409.82,411.63,404.97,1.0,-0.011583467628852873,0.12325264341058428,-0.7344842607237376,0.40613661819957314
41,2020-04-12 00:00:00,-0.0054935580026113,405.93,409.82,411.63,404.97,1.0,0.04238050761749257,0.04159394655750415,-0.4148995848090283,-0.47777420421462397
42,2020-04-13 00:00:00,0.0176368590537528,403.7,405.93,405.93,402.41,0.8974358974358975,0.037222937180528604,0.015932193352266033,-0.45701179269435405,-0.3225622904954155
43,2020-04-14 00:00:00,-0.0066209045323985,410.82,403.7,410.83,403.7,0.926829268292683,0.10490272176481863,-0.02115485098101111,-0.3571978121913649,-1.0062639740382242
44,2020-04-15 00:00:00,0.0029649595687331,408.1,410.82,411.31,407.84,0.8333333333333334,0.252826360735507,0.02643186717609236,0.9995423391495011,-0.592847426113831
45,2020-04-16 00:00:00,0.0069873689868315,409.31,408.11,409.85,405.94,0.8918918918918919,0.21180469614232322,0.05891928526686385,0.1608831941452856,-0.40158796828078447
46,2020-04-17 00:00:00,0.0053861270834848,412.17,409.31,414.81,409.31,0.9154929577464788,0.3743557174623353,0.03811505969921125,1.5658535111224616,-0.5366648098940935
47,2020-04-18 00:00:00,0.0053861270834848,412.17,409.31,414.81,409.31,0.9154929577464788,0.17566854839657342,0.009167188888437927,0.43052471899736017,-0.5922897618897829
48,2020-04-19 00:00:00,0.0053861270834848,412.17,409.31,414.81,409.31,0.9154929577464788,0.29306543786037675,0.015724816158975585,0.9570923739851636,-0.8570756844885797
49,2020-04-20 00:00:00,-0.0094596877337772,414.39,412.17,414.43,411.61,0.9285714285714286,0.24914688987341815,-0.01754405461811359,1.0068899526248452,-0.6571204254267836
50,2020-04-21 00:00:00,0.0067239993178551,410.47,414.39,414.39,407.58,0.813953488372093,0.19064318867566676,-0.06075120210535534,0.767637209990991,-0.8226649924147209
51,2020-04-22 00:00:00,-0.0023473610338069,413.23,410.47,413.23,407.67,0.8840579710144928,0.018853169503011635,-0.020559845707105673,-0.36908824985782873,-0.619701180201427
52,2020-04-23 00:00:00,-0.0099936933003444,412.26,413.23,414.92,411.93,0.9183673469387756,0.067969507201175,-0.0038253750285131005,-0.24402680106697525,-0.7129376205710338
53,2020-04-24 00:00:00,0.0042142402116921,408.14,412.26,412.26,407.15,1.0,-0.005530627869385185,0.0217367449107968,-0.6814926442814117,-0.4589126036624926
54,2020-04-25 00:00:00,0.0042142402116921,408.14,412.26,412.26,407.15,1.0,-0.011074958038972404,0.04446991511016307,-0.42528892423596826,-0.28426578436350175
55,2020-04-26 00:00:00,0.0042142402116921,408.14,412.26,412.26,407.15,1.0,0.08069515953324835,0.17176051297349204,-0.14463808734730554,-0.0501389045338277
56,2020-04-27 00:00:00,-0.0002439857512321,409.86,408.14,412.33,407.64,1.0,0.11119809615309073,0.16219186697679433,-0.20839798332276574,0.28003604167390056
57,2020-04-28 00:00:00,0.0039535337758688,409.76,409.86,411.16,402.08,0.896551724137931,0.087350425262259,0.14720496871777033,-0.22982605479947574,0.2771895778165081
58,2020-04-29 00:00:00,0.0125917643055083,411.38,409.76,412.94,408.12,1.0,0.28021377372064116,0.11355881229535925,0.4215242967572858,-0.09824212407995037
59,2020-04-30 00:00:00,0.0,416.56,411.38,417.54,411.38,0.9117647058823528,0.37719188082557764,0.0028972777990921017,1.2365327971444473,-0.4888143849390534
60,2020-05-01 00:00:00,0.0,416.56,411.38,417.54,411.38,0.9722222222222222,0.1108201313083148,0.3667274272367598,0.22390617427376408,2.0485026353610865
61,2020-05-02 00:00:00,0.0,416.56,411.38,417.54,411.38,0.9722222222222222,0.19668020582213952,0.12698410882337274,0.3651188800353026,-0.06239912955041151
62,2020-05-03 00:00:00,0.0,416.56,411.38,417.54,411.38,0.9722222222222222,0.025954486239590402,0.013195479991297887,-0.3634636389953668,-0.3799898878087009
63,2020-05-04 00:00:00,0.0,416.56,411.38,417.54,411.38,1.0,0.011777397888670826,0.006555392595178233,-0.7089492779970148,-0.8522363082565414
64,2020-05-05 00:00:00,0.0070818129441136,416.56,411.38,417.54,411.38,0.8620689655172413,-0.001154240633454151,0.012270623197019326,-0.5482858843349454,-0.43270092342367694
65,2020-05-06 00:00:00,-0.002502920073419,419.51,416.56,419.65,412.25,1.0,0.0070966361470707895,0.02540352485054953,-0.391454519179194,-0.35995485523043347
66,2020-05-07 00:00:00,0.0085073842183243,418.46,419.51,420.09,417.51,1.0,0.1596455755005195,-0.03584792059428121,0.0005345499977126178,-0.5049082454637702
67,2020-05-08 00:00:00,-0.0010189090564428,422.02,418.46,423.46,418.46,1.0,0.09595525890176493,0.07213681213450229,-0.2693837843756477,-0.08540827065014694
68,2020-05-09 00:00:00,-0.0010189090564428,422.02,418.46,423.46,418.46,1.0,0.07495350460703953,0.49839836862496156,-0.2856301174853231,1.2560068274518301
69,2020-05-10 00:00:00,-0.0010189090564428,422.02,418.46,423.46,418.46,1.0,0.1812310588139061,0.5089530750492055,0.9372133171876169,2.378221244797528
70,2020-05-11 00:00:00,-0.0012334258402713,421.59,422.02,425.02,420.11,1.0,0.20794169402873486,0.45779007209656397,1.638504020028603,2.1596706925033304
71,2020-05-12 00:00:00,0.0014724392618804,421.07,421.59,422.24,418.01,0.9666666666666668,0.20090012439345983,0.4023184167826641,0.8297872353914217,2.243179057989913
72,2020-05-13 00:00:00,-0.0103393488107377,421.69,421.07,422.05,418.37,0.8181818181818182,0.17835422478882546,0.4587282480211172,0.5558823864851837,1.3920412203304091
73,2020-05-14 00:00:00,-0.0009105504037572,417.33,421.69,421.69,417.25,0.84,0.11615931591415496,0.023698042590358792,0.15652523809359364,-0.5896312679166346
74,2020-05-15 00:00:00,0.0035975536635088,416.95,417.33,419.39,416.25,1.0,0.27700415012503665,-0.05285303197180813,0.6565071508751282,-0.8803760802233401
75,2020-05-16 00:00:00,0.0035975536635088,416.95,417.33,419.39,416.25,1.0,1.119165494423127,0.06082502164164616,6.290940346416501,-0.21898694379263245
76,2020-05-17 00:00:00,0.0035975536635088,416.95,417.33,419.39,416.25,1.0,0.39334418952469363,0.034960323488013145,1.6426773652848918,-0.1525296561045229
77,2020-05-18 00:00:00,0.0080774286055681,418.45,416.95,420.72,416.24,0.875,0.3162173468978198,0.02230172000045272,1.2263622956495184,-0.3693656682841166
78,2020-05-19 00:00:00,-0.0053339022829101,421.83,418.45,422.31,418.45,0.8983050847457628,0.3316467720862759,0.023630434669396294,1.5362309220989057,-0.4346144421903663
79,2020-05-20 00:00:00,-0.005457838791172,419.58,421.83,421.83,418.44,0.945945945945946,0.06705710727794134,0.09999841704471191,-0.26983817269735283,-0.04922043610341084
80,2020-05-21 00:00:00,-0.0206091686836493,417.29,419.58,420.97,416.77,0.896551724137931,0.0738395093738422,0.08878742415626117,0.05319769048752681,-0.2614551543754208
81,2020-05-22 00:00:00,0.0017861949154616,408.69,417.29,417.29,407.91,1.0,0.04005882633400404,0.03557505948046913,-0.5378926417117332,-0.4633843753962837
82,2020-05-23 00:00:00,0.0017861949154616,408.69,417.29,417.29,407.91,1.0,0.023269876537895584,-0.011993428969893749,-0.43039628144975506,-0.6086011911631025
83,2020-05-24 00:00:00,0.0017861949154616,408.69,417.29,417.29,407.91,1.0,0.20453752149803162,0.05036376908419449,1.2318796340524496,-0.29489778812899625
84,2020-05-25 00:00:00,0.0105515118948756,409.42,408.69,409.99,406.92,1.0,0.15952900682525506,0.13281072870381827,0.1949409883903178,0.1272788240738972
85,2020-05-26 00:00:00,-0.0042538792478367,413.74,409.42,413.99,409.42,1.0,0.13498975425272963,0.5149042704536875,0.11536314760776671,2.741171392757085
86,2020-05-27 00:00:00,0.0038836836739646,411.98,413.74,414.16,411.28,0.9629629629629628,0.0724250777148665,0.2538478792718877,-0.25123475374891735,0.46032318911446685
87,2020-05-28 00:00:00,0.0023211954156391,413.58,411.99,416.18,409.81,0.9384615384615383,0.34959877773018544,1.2984448551680634,1.5256691605374741,2.4730282111466853
88,2020-05-29 00:00:00,0.0237612775606695,414.54,413.58,415.1,411.16,0.8571428571428571,0.16846109480862648,0.2558669296161682,0.14945337852683765,0.16903191056275094
89,2020-05-30 00:00:00,0.0237612775606695,414.54,413.58,415.1,411.16,0.8571428571428571,-0.06806490078028737,-0.14394029392438323,-1.091198598470536,-1.4111549752053578
90,2020-05-31 00:00:00,0.0237612775606695,414.54,413.58,415.1,411.16,0.8571428571428571,0.10433011518154256,0.2902960122536502,0.04780877425447377,1.0359014867366774
91,2020-06-01 00:00:00,0.0024741393529536,424.39,414.54,424.77,414.54,0.9285714285714286,0.12441285876018515,0.3049808705485608,0.02257862927101374,1.6214297500429353
92,2020-06-02 00:00:00,-0.0004465964648363,425.44,424.39,426.22,423.5,0.8857142857142857,-0.020561417285530403,0.1079706017797788,-0.9196759494381358,0.1685174317364281
93,2020-06-03 00:00:00,-0.0015285126396236,425.25,425.43,428.72,425.18,0.9230769230769232,0.053477944490296636,0.03669100965818206,-0.5154989564218272,-0.2869387410321895
94,2020-06-04 00:00:00,0.0039331135186056,424.6,425.25,426.74,423.31,0.8,0.07982169418557206,-0.031333768718695865,-0.11359827004968559,-0.7593609936595154
95,2020-06-05 00:00:00,0.0019236634058225,426.27,424.6,426.27,423.01,1.0,0.02914652928372341,0.0008100180695489456,-0.5102312224382157,-0.5515269893473996
96,2020-06-06 00:00:00,0.0019236634058225,426.27,424.6,426.27,423.01,1.0,-0.041837303205459975,0.10941067217506006,-0.9846368343303571,-0.0032954018575526885
97,2020-06-07 00:00:00,0.0019236634058225,426.27,424.6,426.27,423.01,1.0,-0.06385099430753005,0.018882556291559105,-0.586436356220213,-0.3225483589432271
98,2020-06-08 00:00:00,0.0062984382682806,427.09,426.27,429.24,426.27,1.0,-0.07240393826445413,-0.038830065316220796,-0.8750650038065334,-0.7292022895386099
99,2020-06-09 00:00:00,-0.0038391735306435,429.78,427.09,430.02,426.54,0.9047619047619048,0.09341666596921794,-0.08798431528928585,-0.10834198215963292,-1.1247364625528393
100,2020-06-10 00:00:00,-0.0082685165720692,428.13,429.79,429.79,426.98,0.75,0.11435550543388029,0.0013685449874927258,-0.02532303262724099,-0.5639446473400126
101,2020-06-11 00:00:00,0.0006830118467227,424.59,428.13,429.37,423.25,0.8,-0.003152550035336432,0.15281616242543006,-0.6558595497421438,0.05893725065173192
102,2020-06-12 00:00:00,-0.0105676897006213,424.88,424.59,425.89,417.61,1.0,0.19500640864892382,0.23724833615917706,0.4028911741075256,0.46182221475579477
103,2020-06-13 00:00:00,-0.0105676897006213,424.88,424.59,425.89,417.61,1.0,0.17053895694054333,1.9370203045042054,0.10184569545459314,7.580953386687894
104,2020-06-14 00:00:00,-0.0105676897006213,424.88,424.59,425.89,417.61,1.0,0.3295941047297237,1.2610552291423751,0.47414606845447727,2.914980817967488
105,2020-06-15 00:00:00,0.0148671471728632,420.39,424.88,425.32,420.38,0.7777777777777778,0.3127047769882969,1.1940114847827505,0.7066422856908774,6.6140286634635554
106,2020-06-16 00:00:00,0.0027657978623664,426.64,420.38,426.68,420.38,0.92,0.0919500051023654,0.2265678918532359,-0.003195755719513307,0.24921733095476034
107,2020-06-17 00:00:00,0.0022906829975223,427.82,426.64,427.92,425.12,1.0,0.012733215800638575,0.1671237601238218,-0.5798560488193799,0.4398275224511698
108,2020-06-18 00:00:00,0.0092350746268656,428.8,427.82,429.34,425.55,0.9322033898305084,0.040957819707028165,0.08392346190849675,-0.3837366550810307,-0.1979434277977461
109,2020-06-19 00:00:00,-0.0002079674646454,432.76,428.8,433.87,428.5,0.90625,0.013130736221600436,0.030462374220210364,-0.6676143500348848,-0.3781710420040373
110,2020-06-20 00:00:00,-0.0002079674646454,432.76,428.8,433.87,428.5,0.90625,0.22544679062188333,0.0472926882214999,0.5007256260472385,-0.4469055485193014
111,2020-06-21 00:00:00,-0.0002079674646454,432.76,428.8,433.87,428.5,0.90625,0.49278190057524895,0.014314066137398385,3.109129742566483,-0.5494677222279889
112,2020-06-22 00:00:00,0.0026348025053735,432.67,432.75,435.44,431.65,0.9444444444444444,0.42272036474655916,0.02464153561534488,1.60650920200523,-0.49170722494555374
113,2020-06-23 00:00:00,0.0026048269979945,433.81,432.67,434.09,430.44,0.9642857142857144,0.38387606546206055,0.02188618688523203,1.5971540850724055,-0.60192753312061
114,2020-06-24 00:00:00,0.0,434.94,433.8,435.74,433.8,0.9629629629629628,0.10932242357109256,0.04112570876325883,-0.15533230777640034,-0.33641679581467454
115,2020-06-25 00:00:00,0.0,434.94,433.8,435.74,433.8,0.85,0.03868767326630973,0.10986805326949778,-0.4780914368361542,0.10053977817068356
116,2020-06-26 00:00:00,-0.006414677886605,434.94,433.8,435.74,433.8,1.0,0.07024339931563883,0.052553891684696374,-0.22287451106705944,-0.29555077002601815
117,2020-06-27 00:00:00,-0.006414677886605,434.94,433.8,435.74,433.8,1.0,0.24862571387635857,-0.02910231596124291,0.8218286137155958,-0.6195690420915949
118,2020-06-28 00:00:00,-0.006414677886605,434.94,433.8,435.74,433.8,1.0,0.07468814418199266,0.07148196789841155,-0.3129939620615783,-0.3533033907204538
119,2020-06-29 00:00:00,0.0111303945389332,432.15,434.94,434.94,430.69,0.8666666666666667,-0.01785708709621847,0.07676758857323929,-0.607535399691594,-0.13028206310921342
120,2020-06-30 00:00:00,0.0169809593555474,436.96,432.15,438.05,432.15,0.9117647058823528,-0.032811890365386454,-0.006140363846244057,-0.6448576076034657,-0.5306649649311661
121,2020-07-01 00:00:00,0.0214681128763671,444.38,436.96,444.38,436.96,0.9393939393939394,0.06300370527116161,0.018379320641875196,-0.1661181138714657,-0.4467140894690959
122,2020-07-02 00:00:00,0.019518857948537,453.92,444.38,454.36,443.73,0.9565217391304348,0.12432719127393277,-0.03638402455286904,0.25996564391257787,-0.8479301826788033
123,2020-07-03 00:00:00,0.0586239681922296,462.78,453.92,462.78,453.92,0.875,0.3262652398512742,-0.039884313415241124,2.0985258459209652,-0.7231472578824147
124,2020-07-04 00:00:00,0.0586239681922296,462.78,453.92,462.78,453.92,0.875,0.28513794757923705,0.026700448287318324,1.4122530217910432,-0.5433043697332172
125,2020-07-05 00:00:00,0.0586239681922296,462.78,453.92,462.78,453.92,0.875,0.10332551553784253,0.1015543314447136,-0.10446438132212797,-0.14164653354635504
126,2020-07-06 00:00:00,0.0035720846686126,489.91,462.78,490.79,462.78,1.0,0.03444547946092946,0.09836516180522281,-0.2742407055853929,-0.017651972944123014
127,2020-07-07 00:00:00,0.0186307610950656,491.66,489.9,500.91,489.9,0.8947368421052632,-0.0028323167789867654,0.02440980016558214,-0.6803386474472979,-0.6357317053283383
128,2020-07-08 00:00:00,0.0127590751168084,500.82,491.66,503.95,489.71,0.8888888888888888,0.08622490381840553,0.07568991860711982,-0.07498675497748378,-0.34251575556056035
129,2020-07-09 00:00:00,-0.019005934425583,507.21,500.82,508.25,499.48,0.8,0.09957876955091027,0.06326660948141072,-0.17918680397621545,-0.1607299540622982
130,2020-07-10 00:00:00,0.0184295676990172,497.57,507.21,507.21,495.84,1.0,0.08667809847387176,0.12015391544381071,-0.3044036618746344,-0.23448986203502226
131,2020-07-11 00:00:00,0.0184295676990172,497.57,507.21,507.21,495.84,1.0,0.022505337685531757,0.01744273490250592,-0.4367067644488357,-0.4974057278728006
132,2020-07-12 00:00:00,0.0184295676990172,497.57,507.21,507.21,495.84,1.0,-0.02356948982488749,0.013909132787598644,-0.7183517618505117,-0.4561512287055846
133,2020-07-13 00:00:00,-0.0099853968504558,506.74,497.56,509.16,495.62,0.9285714285714286,-0.02180111531418305,-0.002627260845343038,-0.621431826179633,-0.5926849759353381
134,2020-07-14 00:00:00,-0.0151490990272684,501.68,506.74,508.05,494.53,0.8461538461538461,0.043650073198807426,0.030572728340517052,-0.36574415027346785,-0.40526370360272884
135,2020-07-15 00:00:00,-0.0447903173575129,494.08,501.68,504.76,491.87,0.7857142857142857,0.03283846953318381,-0.027921358659666495,-0.4824291117878913,-0.6570755735632478
136,2020-07-16 00:00:00,0.0023519440618709,471.95,494.07,496.61,471.95,0.8260869565217391,0.0014500483173103262,-0.035876079033006825,-0.6437134231907472,-0.5829677627895882
137,2020-07-17 00:00:00,0.0334841246353527,473.06,471.95,478.87,467.94,1.0,0.37791427250843324,0.021605280262094517,2.323447031994047,-0.4604852049352153
138,2020-07-18 00:00:00,0.0334841246353527,473.06,471.95,478.87,467.94,1.0,0.4940419334220616,0.20799421480162916,1.3238631985782343,0.61285168811031
139,2020-07-19 00:00:00,0.0334841246353527,473.06,471.95,478.87,467.94,1.0,0.4598803250453454,0.5065010040601683,1.9981062578609428,2.287914969015766
140,2020-07-20 00:00:00,0.0013908774800572,488.9,473.06,488.9,473.06,0.9523809523809524,0.4396301500933566,0.5000759165636159,1.190186721277183,1.521361749647744
141,2020-07-21 00:00:00,0.0036561951060092,489.58,488.9,492.15,486.76,0.9615384615384616,0.4546324973086673,0.6165969943040652,1.3670365907412987,2.7519215211015116
142,2020-07-22 00:00:00,-0.0015263447096892,491.37,489.57,499.15,488.33,0.9375,0.36361576693775266,0.5287297019103914,2.2333266131736447,4.133013432607794
143,2020-07-23 00:00:00,-0.0402551873140108,490.62,491.37,492.22,480.08,0.9230769230769232,0.2902628826520166,0.38534344533724063,0.7324782118968727,2.0376988108787555
144,2020-07-24 00:00:00,0.0036740501624652,470.87,490.62,490.62,468.65,1.0,0.20830291609717744,0.27362226523457167,0.6744378560941635,1.821633601233363
145,2020-07-25 00:00:00,0.0036740501624652,470.87,490.62,490.62,468.65,1.0,-0.03868892073964414,0.05050146934263733,-0.6827491115250282,-0.4477971484038795
146,2020-07-26 00:00:00,0.0036740501624652,470.87,490.62,490.62,468.65,1.0,0.5638514438696429,0.3977749756117248,2.859373319091753,1.5882833786781656
147,2020-07-27 00:00:00,0.0068556919170544,472.6,470.87,474.89,468.0,1.0,0.6373019605921337,0.45746440716648085,9.061498367449165,1.8809769652238089
148,2020-07-28 00:00:00,0.0203009414929388,475.84,472.6,478.51,472.6,1.0,0.7757006365226937,0.5716560341134933,8.084747281515371,3.8051155903202307
149,2020-07-29 00:00:00,-0.0019155509783728,485.5,475.84,485.61,473.13,0.85,1.1290561571331965,0.6863378171792016,9.834473708564376,2.6563569344666704
150,2020-07-30 00:00:00,0.0073260829188765,484.57,485.5,488.44,483.88,0.8214285714285714,1.3706873548483651,0.536022895932704,8.181607293867614,2.614538164781579
151,2020-07-31 00:00:00,0.0167172006883552,488.12,484.57,491.84,480.55,0.9285714285714286,-0.029410721715849242,0.017168498949715172,-0.6863690929416416,-0.5698116318237354
152,2020-08-01 00:00:00,0.0167172006883552,488.12,484.57,491.84,480.55,0.9285714285714286,0.21044725289632638,0.04773826599309139,0.511194150054165,-0.3313984754958948
153,2020-08-02 00:00:00,0.0167172006883552,488.12,484.57,491.84,480.55,0.9285714285714286,0.10116138892713611,0.0831968845506843,-0.08506221345137313,-0.2022548041537074
154,2020-08-03 00:00:00,0.002498589505924,496.28,488.12,496.28,488.12,0.95,0.05926116145525828,-0.003384410362603063,-0.3224846791473363,-0.7822015117634329
155,2020-08-04 00:00:00,0.0021506673098568,497.52,496.28,500.34,494.54,1.0,0.05071531876379076,-0.020101292692146444,-0.3408979956510646,-0.9647383523486989
156,2020-08-05 00:00:00,0.0027076355322008,498.59,497.51,499.4,491.8,0.9333333333333332,0.048664696998624635,0.1150423748071594,-0.45522554173715796,-0.009593770369032336
157,2020-08-06 00:00:00,-0.0090210825299035,499.94,498.58,501.11,491.97,0.9565217391304348,0.04216086779192718,0.28233525773663626,-0.42565517822944376,0.5870737469468914
158,2020-08-07 00:00:00,0.0058736854853359,495.43,499.94,499.94,488.34,0.9130434782608696,-0.04438464681531418,-0.01006193653047216,-1.2109461461771058,-0.456300183440933
159,2020-08-08 00:00:00,0.0058736854853359,495.43,499.94,499.94,488.34,0.9130434782608696,-0.05408017359619066,0.019012686082847452,-1.2872229137855493,-0.4934650116864001
160,2020-08-09 00:00:00,0.0058736854853359,495.43,499.94,499.94,488.34,0.9130434782608696,-0.056955832844113985,-0.04247453698183801,-0.8495985891096357,-0.971588883754728
161,2020-08-10 00:00:00,-0.0112373078621021,498.34,495.43,501.7,492.02,0.9090909090909092,-0.03390021484887118,-0.05216710432316418,-0.6737634105039317,-0.7976181211830753
162,2020-08-11 00:00:00,-0.0070828428785972,492.74,498.34,503.37,492.09,1.0,-0.05669893955998084,-0.04099851321949188,-0.9193457411857947,-1.1940507063016814
163,2020-08-12 00:00:00,0.0004701073071027,489.25,492.74,492.74,480.76,1.0,0.1696004929587609,0.034518684763964025,0.5468421675292998,-0.5025028399882586
164,2020-08-13 00:00:00,0.0122170466617634,489.48,489.25,492.03,487.79,0.75,0.005113622614207891,0.04693101010665046,-0.5736938146428722,-0.30473672919528394
165,2020-08-14 00:00:00,0.0229483712105921,495.46,489.48,495.78,487.1,0.9090909090909092,0.05141696748461122,0.16242297291095387,-0.3276945167385665,0.18820031111988886
166,2020-08-15 00:00:00,0.0229483712105921,495.46,489.48,495.78,487.1,0.9090909090909092,0.23843995748496916,0.22181280521670654,0.5848357396548864,0.6210101271417969
167,2020-08-16 00:00:00,0.0229483712105921,495.46,489.48,495.78,487.1,0.9090909090909092,0.2685075397123997,0.2903823652768329,0.7869646262717258,1.0935140384051047
168,2020-08-17 00:00:00,0.0027819979085689,506.83,495.46,509.27,495.46,0.9411764705882352,0.2699977266091933,0.2828661630656919,2.4184703119110997,0.8645667254393902
169,2020-08-18 00:00:00,-0.0127695576892806,508.24,506.83,509.43,505.66,0.9444444444444444,-0.0015763785075453285,0.2824258062063949,-0.6620401423088595,0.8668747379323216
170,2020-08-19 00:00:00,-0.0128948679621325,501.75,508.24,508.86,501.47,0.8571428571428571,0.024432526463770365,0.18674940154604247,-0.270226099034632,0.6094348956828339
171,2020-08-20 00:00:00,0.0053303182038443,495.28,501.75,501.75,493.64,1.0,0.10536050265033126,0.05492013000090257,0.316743017174878,-0.26986592748979177
172,2020-08-21 00:00:00,0.002892030848329,497.92,495.28,499.97,494.29,0.9,-0.03171285765549925,0.307209028166894,-0.7744898759763957,1.0360366488873833
173,2020-08-22 00:00:00,0.002892030848329,497.92,495.28,499.97,494.29,0.9,0.033954840275006504,0.12160408597204242,-0.5767936507437535,0.09023248508561468
174,2020-08-23 00:00:00,0.002892030848329,497.92,495.28,499.97,494.29,0.9,-0.0010620825873317585,0.018407727662840045,-0.6930333797321249,-0.7638761230850517
175,2020-08-24 00:00:00,-0.0029637936558795,499.36,497.92,501.2,496.86,0.9230769230769232,-0.00037187336781308034,0.01403582566640793,-0.7575292400549695,-0.7333547333381519
176,2020-08-25 00:00:00,-0.0126335663212019,497.88,499.36,503.23,496.41,0.8571428571428571,0.005467439063591151,0.012370591706347689,-0.6552092431600579,-0.5684673593467532
177,2020-08-26 00:00:00,0.0056347769482699,491.59,497.88,499.68,490.01,0.8928571428571429,0.10064979949676722,0.039110184589628005,0.2972886976174873,-0.45663842573688473
178,2020-08-27 00:00:00,0.0191560805890443,494.36,491.59,494.48,488.96,0.967741935483871,0.40115791300126347,0.06728005911311374,1.1656992001818043,-0.34513051364037095
179,2020-08-28 00:00:00,-0.0023817557509477,503.83,494.36,504.19,493.19,1.0,0.3007794408727502,0.1513564158410663,0.7302057199548501,0.1574542149555991
180,2020-08-29 00:00:00,-0.0023817557509477,503.83,494.36,504.19,493.19,1.0,0.28200692586262477,0.5027694465395154,0.4919677267256509,2.3506050890889045
181,2020-08-30 00:00:00,-0.0023817557509477,503.83,494.36,504.19,493.19,1.0,0.8906026067982546,0.37833091177332,4.341664701216743,0.8873618627325933
182,2020-08-31 00:00:00,0.0044167678013648,502.63,503.83,510.37,502.62,0.7142857142857143,0.8630501045625056,0.31638622161177476,4.581628038201886,2.1762884098972965
183,2020-09-01 00:00:00,-0.0018223234624146,504.85,502.63,504.85,500.44,0.9523809523809524,0.8411716076428091,0.09927472740335386,4.196803610722991,-0.16301831919616294
184,2020-09-02 00:00:00,-0.0056357033715,503.93,504.85,506.75,499.49,0.85,0.048195207853058974,0.04856061849754134,-0.29141100635788325,-0.42278392651310476
185,2020-09-03 00:00:00,-0.0090003791734019,501.09,503.93,507.55,499.39,0.8,0.018585285064799173,0.07129970289869103,-0.605629159100476,-0.13426750314720634
186,2020-09-04 00:00:00,-0.01798300374562,496.58,501.09,501.09,492.66,1.0,-0.03992173266151777,0.14991718028533896,-0.5898710820741209,0.533378301415795
187,2020-09-05 00:00:00,-0.01798300374562,496.58,501.09,501.09,492.66,1.0,0.04768130270645621,0.21754871668786802,-0.3325830485733142,0.739314346397975
188,2020-09-06 00:00:00,-0.01798300374562,496.58,501.09,501.09,492.66,1.0,0.1450126804657499,0.2397409526206733,0.0746159929969952,0.3914417495351718
189,2020-09-07 00:00:00,0.0078539936429817,487.65,496.58,499.19,486.37,1.0,0.1465877793150412,0.40931880025118517,0.34740156118443627,1.4505333241592406
190,2020-09-08 00:00:00,-0.0185561976072271,491.48,487.65,492.58,485.43,0.6666666666666666,-0.03046062988671583,1.0451000943543924,-0.8097513827275965,6.344964445492787
191,2020-09-09 00:00:00,-0.0052865080023219,482.36,491.49,491.49,479.9,0.9375,-0.06077730816587401,0.08726187128271867,-1.076381039093682,-0.36091612109290977
192,2020-09-10 00:00:00,0.0076488610074821,479.81,482.36,487.32,478.81,0.8333333333333334,0.33823575378455306,0.08137159415087325,1.3210950542588156,-0.27178198751717453
193,2020-09-11 00:00:00,0.0061636468933564,483.48,479.81,483.86,477.67,0.9629629629629628,0.36898737901801937,0.0521549136811128,1.6672628189991565,-0.36132202157907234
194,2020-09-12 00:00:00,0.0061636468933564,483.48,479.81,483.86,477.67,0.9629629629629628,0.15752724128194817,0.1063129684073072,0.36423190544630013,0.14788347971144516
195,2020-09-13 00:00:00,0.0061636468933564,483.48,479.81,483.86,477.67,0.9629629629629628,0.20950322862939252,0.05618944797334091,1.2353140422544673,-0.18833431489616867
196,2020-09-14 00:00:00,0.0064136825227151,486.46,483.47,487.45,483.47,0.9666666666666668,0.2081391475282306,0.01406430802351899,0.2768386305753181,-0.505006745049087
197,2020-09-15 00:00:00,-0.0043915192614076,489.58,486.46,489.86,484.24,0.896551724137931,0.1390124614615269,-0.006538355127076123,0.6749637904235414,-0.5847363580642565
198,2020-09-16 00:00:00,-0.0053751307880105,487.43,489.58,490.56,485.51,1.0,0.28394552904256454,0.07615799331809647,1.1885359488374772,-0.25111702427963034
199,2020-09-17 00:00:00,0.0218023555619727,484.81,487.42,487.97,481.78,0.8421052631578947,0.20459097758810518,-0.007605224441612712,0.12719605233841005,-0.7250956772718681
200,2020-09-18 00:00:00,-0.0069845371230166,495.38,484.81,495.42,484.71,0.9285714285714286,-0.023496669051324304,0.023960353798807787,-0.9240693058027739,-0.37094038928417433
201,2020-09-19 00:00:00,-0.0069845371230166,495.38,484.81,495.42,484.71,0.9285714285714286,0.19945328466610857,0.08185685446970936,0.41629202978801805,-0.3313513453389903
202,2020-09-20 00:00:00,-0.0069845371230166,495.38,484.81,495.42,484.71,0.9285714285714286,0.2467433364085725,0.06289153250211932,0.09112384677208524,-0.34605010598625036
203,2020-09-21 00:00:00,-0.0134778012684989,491.92,495.38,497.31,491.44,0.9166666666666666,0.2517983033943292,0.0581052581953756,0.17703083040933718,-0.38823441623665417
204,2020-09-22 00:00:00,0.0020812297801314,485.29,491.93,492.63,483.94,0.9642857142857144,0.1974386925345435,0.04812408182308481,0.22638549568283126,-0.47156549048041096
205,2020-09-23 00:00:00,-0.0192679415998355,486.3,485.29,487.69,483.98,0.9565217391304348,0.012831214519543721,0.0181580174697773,-0.6440577134811971,-0.5727104213393934
206,2020-09-24 00:00:00,0.0001467720629861,476.93,486.31,486.31,476.79,0.7894736842105263,0.055916844563252965,0.05506739255219095,-0.29637260070562144,-0.22418375822276612
207,2020-09-25 00:00:00,-0.000293501048218,477.0,476.93,479.85,475.25,1.0,0.15476233813815465,0.04686434477120205,0.622548370008881,-0.09751204955535787
208,2020-09-26 00:00:00,-0.000293501048218,477.0,476.93,479.85,475.25,1.0,0.1842318118836861,0.07182344494364568,0.4081221300789643,-0.15453654843238512
209,2020-09-27 00:00:00,-0.000293501048218,477.0,476.93,479.85,475.25,1.0,-0.06496163357112561,0.06487413542789167,-1.2023429321094214,-0.2891187204053976
210,2020-09-28 00:00:00,0.0010065847418528,476.86,477.01,480.37,475.89,1.0,-0.09808324104234512,0.07352560916397177,-1.4914799666786251,-0.38267661602217895
211,2020-09-29 00:00:00,-0.0024510830854316,477.34,476.86,480.38,476.86,1.0,-0.1098158704385952,0.05468159172810516,-1.0921721621033156,-0.379159350826207
212,2020-09-30 00:00:00,0.0,476.17,477.34,480.65,473.8,0.9285714285714286,-0.14432581100099906,-0.0036079321631858896,-0.5698052324485198,-0.4248813671793832
213,2020-10-01 00:00:00,0.0,476.17,477.34,480.65,473.8,0.8444444444444444,-0.14960519974736552,0.1424061036387867,-0.6565460836124518,-0.10143194443412423
214,2020-10-02 00:00:00,0.0,476.17,477.34,480.65,473.8,1.0,-0.03090207442862969,0.16307978007096136,-0.7880107321812831,0.24037022210120726
215,2020-10-03 00:00:00,0.0,476.17,477.34,480.65,473.8,1.0,-0.03974560689647877,0.12712629496111472,-0.7346683764861144,-0.1240942196343279
216,2020-10-04 00:00:00,0.0,476.17,477.34,480.65,473.8,1.0,0.004656551006813281,-0.0066329190493430445,-0.5379158138753544,-0.5444044681707199
217,2020-10-05 00:00:00,0.0,476.17,477.34,480.65,473.8,0.9375,-0.035369117590761334,-0.02885224611568038,-0.6971502957206628,-0.29138870919673493
218,2020-10-06 00:00:00,0.0,476.17,477.34,480.65,473.8,0.85,-0.05472903365051618,-0.03780811458327715,-0.8133541204276364,-0.5435236269109105
219,2020-10-07 00:00:00,0.0,476.17,477.34,480.65,473.8,0.9473684210526316,0.0,0.0,0.0,0.0
220,2020-10-08 00:00:00,0.0183967910620156,476.17,477.34,480.65,473.8,1.0,0.0,0.0,0.0,0.0
221,2020-10-09 00:00:00,0.0283339863485451,484.93,476.17,486.15,476.17,1.0,0.0,0.0,0.0,0.0
222,2020-10-10 00:00:00,0.0283339863485451,484.93,476.17,486.15,476.17,1.0,0.0,0.0,0.0,0.0
223,2020-10-11 00:00:00,0.0283339863485451,484.93,476.17,486.15,476.17,1.0,0.0,0.0,0.0,0.0
224,2020-10-12 00:00:00,0.000661760282351,498.67,484.92,498.73,484.92,1.0,-0.04169653247298033,2.277226917435371e-05,-0.6690069604120751,-0.41809089089350443
225,2020-10-13 00:00:00,-0.0057715430861723,499.0,498.67,499.5,495.29,1.0,0.11285028218963511,0.06505596276841885,-0.13514465577852747,-0.23709349484093484
226,2020-10-14 00:00:00,-0.002761428686608,496.12,499.0,499.0,495.17,0.9393939393939394,0.03155468217339852,-0.0327776658281671,-0.3514936222597938,-0.7196973568855256
227,2020-10-15 00:00:00,0.0008287013643254,494.75,496.11,498.07,494.39,0.782608695652174,0.023069820000259256,0.24848564397036732,-0.4858120209423831,0.5682050645026303
228,2020-10-16 00:00:00,-0.0080378059617093,495.16,494.75,497.52,492.69,1.0,-0.0032464949744523963,0.3035571946930862,-0.49585105129190554,1.2976797972560716
229,2020-10-17 00:00:00,-0.0080378059617093,495.16,494.75,497.52,492.69,1.0,-0.12720814260692226,0.15837561464581285,-1.4540701689155227,0.10761570694569188
230,2020-10-18 00:00:00,-0.0080378059617093,495.16,494.75,497.52,492.69,1.0,-0.10588855368265282,0.04039811747782274,-1.083936151499429,-0.3684730075932927
231,2020-10-19 00:00:00,0.0051305020562726,491.18,495.16,500.75,490.39,0.8064516129032258,-0.11024751401726274,0.017535967447986245,-1.1563857667617339,-0.5324013814351005
232,2020-10-20 00:00:00,-0.0010532712173384,493.7,491.18,493.71,488.7,0.9069767441860463,-0.07606850824618405,0.007846043854129903,-0.8316571462508311,-0.3498151443219647
233,2020-10-21 00:00:00,-0.0028995498600916,493.18,493.7,494.52,490.2,1.0,0.06524682876770349,0.03442680551790023,-0.17844351425761265,-0.34482970852654415
234,2020-10-22 00:00:00,-0.0100050838840874,491.75,493.18,493.18,486.84,1.0,0.11332419784586456,-0.01365333153785464,-0.10095925449744361,-0.6990328230018094
235,2020-10-23 00:00:00,-0.0091202267732062,486.83,491.76,494.06,486.61,1.0,0.16393379900197136,0.08390228611175754,0.008409148200477818,-0.12680214270582824
236,2020-10-24 00:00:00,-0.0091202267732062,486.83,491.76,494.06,486.61,1.0,0.3278858216250562,0.0662925519672477,1.881278271396041,-0.2346968500649582
237,2020-10-25 00:00:00,-0.0091202267732062,486.83,491.76,494.06,486.61,1.0,0.29556507024190015,-0.0027532992095045117,1.2032857864671176,-0.5731018757726699
238,2020-10-26 00:00:00,-0.0002694914902879,482.39,486.83,486.83,479.03,0.9047619047619048,0.3528981438804255,0.028815550325053785,1.7561358373258409,-0.29914140842420517
239,2020-10-27 00:00:00,0.0042715547629909,482.26,482.39,482.94,479.41,0.9545454545454546,0.6003895568420257,0.04571161810009361,1.5765424623503623,-0.40828517738656145
240,2020-10-28 00:00:00,0.0022092831185992,484.32,482.26,485.46,479.89,0.9375,0.34447378789984207,0.009723832925697451,1.0614709276296748,-0.7031000904023698
241,2020-10-29 00:00:00,-0.0150188508209892,485.39,484.32,488.11,478.6,0.875,0.04049591797850027,0.1753141339561104,-0.2961383357042257,0.6306949908905188
242,2020-10-30 00:00:00,-0.0002509935160008,478.1,485.39,486.48,477.19,0.9473684210526316,0.026460684842215088,0.02965151965444246,-0.46065588409607006,-0.4682617235986874
243,2020-10-31 00:00:00,-0.0002509935160008,478.1,485.39,486.48,477.19,0.9473684210526316,0.22583508269919594,0.03272700467870848,0.42220813448518957,-0.46517244363517196
244,2020-11-01 00:00:00,-0.0002509935160008,478.1,485.39,486.48,477.19,0.9473684210526316,0.133195167298104,-0.027627557275575754,0.06397558853844419,-0.7472100928642047
245,2020-11-02 00:00:00,0.0146031214695174,477.98,478.11,480.83,475.82,1.0,0.08509397184868384,0.013723236950915485,-0.08326263484016043,-0.4721507987973517
246,2020-11-03 00:00:00,0.0042065324975256,484.96,477.98,486.47,477.98,0.9864864864864864,0.07554899606912091,0.2731348525889352,-0.3087991075614935,1.873970338877042
247,2020-11-04 00:00:00,0.0145379876796714,487.0,484.96,488.08,482.97,0.9333333333333332,1.0642211523811875,0.24024088392767595,4.607676890024085,1.360474395099495
248,2020-11-05 00:00:00,-0.0019227655440414,494.08,486.99,494.13,486.99,0.8888888888888888,1.2331117650954733,0.1741258928513716,3.3658667684493206,0.6804754974123691
249,2020-11-06 00:00:00,0.0184535518017561,493.13,494.08,495.14,489.94,1.0,0.6567909768905125,0.258321332840036,2.283067215153584,1.0620230415537182
250,2020-11-07 00:00:00,0.0184535518017561,493.13,494.08,495.14,489.94,1.0,0.6932465403690617,0.051498986261650614,5.517372558802637,-0.3310987105613434
251,2020-11-08 00:00:00,0.0184535518017561,493.13,494.08,495.14,489.94,1.0,0.06785539028302434,0.0022514257054018216,-0.11958345502870482,-0.6254121707083103
252,2020-11-09 00:00:00,-0.0035840152917986,502.23,493.13,503.51,493.13,0.9090909090909092,0.008249889653770381,-0.010692277521803462,-0.80996111429352,-0.5643407054067597
253,2020-11-10 00:00:00,-0.0049957036948224,500.43,502.24,504.22,498.4,0.9411764705882352,0.007346131463170202,-0.008341619433217318,-0.6340522627683924,-0.6271256793307389
254,2020-11-11 00:00:00,-0.0009639909224188,497.93,500.43,501.51,497.54,0.8461538461538461,-0.00831366812448664,0.03020623874780881,-0.7008654313957159,-0.36294803654908503
255,2020-11-12 00:00:00,-0.0104935169363754,497.45,497.94,499.25,496.05,0.8666666666666667,0.012291967987125396,0.006261391702658159,-0.5207103688998914,-0.6533129494987263
256,2020-11-13 00:00:00,0.0125957377648659,492.23,497.45,497.45,489.28,1.0,0.0261874487096998,0.017581223098052767,-0.4825286623600023,-0.4231951007190728
257,2020-11-14 00:00:00,0.0125957377648659,492.23,497.45,497.45,489.28,1.0,0.043612994285957996,0.049031031119349144,-0.6023843013981929,-0.4455006393338705
258,2020-11-15 00:00:00,0.0125957377648659,492.23,497.45,497.45,489.28,1.0,0.019589420001492996,0.0395465531845165,-0.5585686386832741,-0.30759445277150893
259,2020-11-16 00:00:00,-0.0012840318600405,498.43,492.23,498.43,492.23,0.8235294117647058,0.02327994800321509,0.047517844292109146,-0.48888630822738405,-0.3349320421357236
260,2020-11-17 00:00:00,0.0024910102653728,497.79,498.43,498.69,495.3,0.9285714285714286,0.03745014207350472,-0.004150259638219467,-0.43110892034247666,-0.5804818761660001
261,2020-11-18 00:00:00,0.0048694467266497,499.03,497.79,500.96,496.85,0.9166666666666666,-0.009222461080844013,-0.012205008541243956,-0.626357284718899,-0.7486904557340279
262,2020-11-19 00:00:00,0.004905675427751,501.46,499.03,502.21,496.26,0.9230769230769232,-0.024792269979570847,0.07536925729071964,-0.7069668271409434,-0.12839676156820165
263,2020-11-20 00:00:00,0.0128393395777106,503.92,501.46,504.28,500.44,1.0,0.184427629991478,-0.03634218243094711,0.14634475396360486,-1.1827998157064525
264,2020-11-21 00:00:00,0.0128393395777106,503.92,501.46,504.28,500.44,1.0,0.39466173769397095,-0.0138106283346211,0.9662593508388647,-0.6633864986585174
265,2020-11-22 00:00:00,0.0128393395777106,503.92,501.46,504.28,500.44,1.0,0.08082244422093421,0.06611757358140213,-0.277587368981392,-0.10400889170366702
266,2020-11-23 00:00:00,-0.0040949078155919,510.39,503.92,513.08,503.92,0.9615384615384616,0.09786096992434601,0.24398322516406967,-0.04185058753219566,1.0715877161540222
267,2020-11-24 00:00:00,-0.012866417469998,508.3,510.4,510.4,507.16,1.0,0.25806000118567685,1.1773976863990105,1.2151033240656801,3.0860825777609326
268,2020-11-25 00:00:00,0.0034080038265306,501.76,508.3,511.21,501.76,0.8536585365853658,0.03718389215871554,0.14792528024378004,-0.5247720271288984,0.056861098975316174
269,2020-11-26 00:00:00,0.0103283214491429,503.47,501.76,503.61,499.02,1.0,0.0010543681360895008,0.09694401780246853,-0.6155163882123278,-0.05098209881729681
270,2020-11-27 00:00:00,-0.005563528417245,508.67,503.47,508.67,502.18,1.0,-0.013681143370220639,0.09621982745440061,-0.6909777665993062,-0.07887353602076727
271,2020-11-28 00:00:00,-0.005563528417245,508.67,503.47,508.67,502.18,1.0,0.009983021451571261,-0.02324045750470738,-0.4298773219701818,-0.6525132123935794
272,2020-11-29 00:00:00,-0.005563528417245,508.67,503.47,508.67,502.18,1.0,-0.046035082251916215,-0.034384182268006214,-0.6172646898164507,-1.131796750325639
273,2020-11-30 00:00:00,0.0195714059781749,505.84,508.67,516.3,505.84,0.4666666666666667,-0.031503344908492714,-0.057271414260572584,-0.6017062371746947,-0.9923933275820027
274,2020-12-01 00:00:00,-0.0001357273044558,515.74,505.84,516.46,505.5,1.0,0.020919071930643796,-0.052304715861329676,-0.44009229963396973,-0.6940971476107625
275,2020-12-02 00:00:00,-0.002365854131518,515.67,515.74,518.17,513.58,0.90625,0.28450601800729114,-0.056518272505067024,0.5767713459355513,-0.834897392295275
276,2020-12-03 00:00:00,0.0019438235008261,514.45,515.67,516.01,512.26,0.8636363636363636,0.3979960494480421,-0.11586180914525235,2.2308656726947937,-0.9765712253894162
277,2020-12-04 00:00:00,-0.0085556310020371,515.45,514.45,515.86,510.68,1.0,0.5966979425866414,-0.05535888523324761,2.0884014221557297,-1.1178615670217422
278,2020-12-05 00:00:00,-0.0085556310020371,515.45,514.45,515.86,510.68,1.0,0.6710159191913609,-0.007226419681037655,2.12348145983277,-0.6993329139001028
279,2020-12-06 00:00:00,-0.0085556310020371,515.45,514.45,515.86,510.68,1.0,1.0701971990704235,0.060252151860385794,6.014106148385481,-0.2810484309490718
280,2020-12-07 00:00:00,-0.0018002504696305,511.04,515.45,516.2,510.42,0.9230769230769232,0.9969334593381616,0.17330661971425965,3.606706877930528,0.191606757945914
281,2020-12-08 00:00:00,-0.0115070963694817,510.12,511.04,513.08,508.92,0.8823529411764706,0.7493740882850206,0.6871116816248897,1.8973002654576208,1.6789679413732876
282,2020-12-09 00:00:00,1.983143282100328e-05,504.25,510.12,512.17,504.25,0.9523809523809524,0.4060383337819502,0.049367935174560174,1.4482744507287635,-0.3984595083371745
283,2020-12-10 00:00:00,-0.0108674096696149,504.26,504.26,506.13,502.04,0.8947368421052632,0.02806328042116668,-0.0028892592328659816,-0.46821108920572124,-0.6403028834153477
284,2020-12-11 00:00:00,0.0091022093909138,498.78,504.26,505.87,495.58,0.8947368421052632,0.006380075361045456,-0.020235441313384506,-0.5874874751157547,-1.147097384030711
285,2020-12-12 00:00:00,0.0091022093909138,498.78,504.26,505.87,495.58,0.8947368421052632,0.03575394711014823,0.1957033491735114,-0.36097811904529387,0.9494543329113624
286,2020-12-13 00:00:00,0.0091022093909138,498.78,504.26,505.87,495.58,0.8947368421052632,0.2088598363170977,0.14436974766669675,0.5138569240641134,0.16713330329031484
287,2020-12-14 00:00:00,0.0003178892156084,503.32,498.78,503.56,498.23,0.9166666666666666,0.19955776007168335,0.137013874334861,0.9682171478050752,0.20053084664739385
288,2020-12-15 00:00:00,0.0011718439659966,503.48,503.33,504.41,500.3,0.9148936170212766,0.08486571187319125,0.15061392889249792,-0.015654505103269843,0.21883775052693902
289,2020-12-16 00:00:00,0.012557779673458,504.07,503.48,505.58,502.51,0.9545454545454546,0.11027296556643584,0.05546525643220512,-0.1664780485449153,-0.3355235743917652
290,2020-12-17 00:00:00,-0.0038009404388714,510.4,504.07,510.7,502.58,0.9375,0.14219135779172198,0.05262334020568904,0.16359619859718594,-0.35056803187125746
291,2020-12-18 00:00:00,0.0078472249537821,508.46,510.4,511.75,506.46,1.0,0.25315998536752904,-0.010080527318291566,0.8498013035476232,-0.9068759931631967
292,2020-12-19 00:00:00,0.0078472249537821,508.46,510.4,511.75,506.46,1.0,0.9191229027895389,0.17564851999046205,3.7307841493597067,0.2616482750305807
293,2020-12-20 00:00:00,0.0078472249537821,508.46,510.4,511.75,506.46,1.0,0.1218889271943393,0.5512622345251694,0.008412191221375953,2.423269322706525
294,2020-12-21 00:00:00,-0.017991999219436,512.45,508.46,513.0,506.27,0.8461538461538461,0.03344176925575404,0.5399085310698659,-0.5572376190727939,2.248366455165553
295,2020-12-22 00:00:00,0.008226854519802,503.23,512.45,512.45,502.74,1.0,0.07949561559958518,0.07088026240087864,-0.42086341736492333,-0.31688915783264643
296,2020-12-23 00:00:00,-0.0053215602026134,507.37,503.23,509.4,503.23,0.9775280898876404,0.4048652169695899,0.1680029502190381,1.0924392003038759,0.17443746880296165
297,2020-12-24 00:00:00,0.0108387659262487,504.67,507.37,509.36,503.18,0.9583333333333334,0.309930169997795,0.0319284747094013,0.7746775267143164,-0.5189432046955127
298,2020-12-25 00:00:00,0.001254557572431,510.14,504.67,510.22,502.47,0.8888888888888888,0.08353466145470634,-0.045824139259982744,-0.35002688364211465,-0.9614705107197791
299,2020-12-26 00:00:00,0.001254557572431,510.14,504.67,510.22,502.47,0.8888888888888888,0.09517194999079415,0.0008335169923121555,0.01729972722712478,-0.5536670928696116
300,2020-12-27 00:00:00,0.001254557572431,510.14,504.67,510.22,502.47,0.8888888888888888,-0.025696124851119606,0.011675413744061558,-0.8018649558322392,-0.5443857481058929
301,2020-12-28 00:00:00,-0.0055797016327968,510.78,510.15,513.31,508.76,0.9333333333333332,-0.01663694885120215,0.0030216869375987443,-0.8215003093715055,-0.5424597876930933
302,2020-12-29 00:00:00,0.0125410981828203,507.93,510.78,512.41,507.58,1.0,0.03821580107448597,0.033013555861914234,-0.354878267363043,-0.37131084649664686
303,2020-12-30 00:00:00,0.0177328407544235,514.3,507.93,514.3,507.55,0.9523809523809524,0.13577128847527753,0.23170860861978948,0.5882882042195889,2.0502418016168558
304,2020-12-31 00:00:00,0.0,523.42,514.3,523.76,514.3,0.92,0.11140869394805897,0.25628483979025063,-0.265692072686666,0.7839065365901848
305,2021-01-01 00:00:00,0.0084444614267702,523.42,514.3,523.76,514.3,1.0,0.13677788488824483,0.08217406169562658,-0.04132618482923404,-0.037109943779129795
306,2021-01-02 00:00:00,0.0084444614267702,523.42,514.3,523.76,514.3,1.0,0.3260045339510329,0.1387141175362272,1.294062910997299,0.6953807855315255
307,2021-01-03 00:00:00,0.0084444614267702,523.42,514.3,523.76,514.3,1.0,0.06156421993998329,0.10822799101175828,-0.35374199604651807,-0.08436139886852864
308,2021-01-04 00:00:00,0.0088663231282205,527.84,523.42,529.43,520.95,1.0,0.000672820840005528,0.11535605348210964,-0.6595636418765844,0.12627744691972398
309,2021-01-05 00:00:00,0.006309622173815,532.52,527.84,532.52,525.11,1.0,-0.0028999139481902247,0.09649449353950246,-0.6677641607803161,-0.24425215064886327
310,2021-01-06 00:00:00,0.0106367097111294,535.88,532.52,536.93,529.33,0.8421052631578947,-0.051166135449742356,0.1772384412552226,-0.9655414561055792,0.235286279752205
311,2021-01-07 00:00:00,-0.0023265260903282,541.58,535.88,541.58,533.35,0.9411764705882352,-0.012077557132422534,0.06805714010183994,-0.6959059136268115,-0.12623098463326116
312,2021-01-08 00:00:00,-0.0106788569736454,540.32,541.59,543.82,535.97,0.8888888888888888,-0.09846273416991114,0.14102487590816626,-1.1995068733761454,0.21987258851370042
313,2021-01-09 00:00:00,-0.0106788569736454,540.32,541.59,543.82,535.97,0.8888888888888888,-0.019845911599063903,0.5199970701129075,-0.8638078491398002,1.6496260574473904
314,2021-01-10 00:00:00,-0.0106788569736454,540.32,541.59,543.82,535.97,0.8888888888888888,0.06515673053939164,0.6129915180109444,-0.15535985129843097,2.7952839620345036
315,2021-01-11 00:00:00,0.024151155177252,534.55,540.32,545.26,532.38,0.9375,0.11820231954305616,0.574507876413799,0.024254880744257922,1.4082808116478365
316,2021-01-12 00:00:00,-0.0056625141562854,547.46,534.55,547.46,532.34,1.0,0.06043062072708594,0.3703626105422151,-0.27748108314863107,1.6243319274004289
317,2021-01-13 00:00:00,-0.013263281651848,544.36,547.45,549.81,540.75,0.6,-0.0323254946237066,0.197441590465667,-0.979331494739194,0.03713981631346561
318,2021-01-14 00:00:00,0.000335108165469,537.14,544.36,544.36,536.09,0.9411764705882352,0.02343505417399694,0.4258981868645595,-0.4075720154066103,1.4083387761750152
319,2021-01-15 00:00:00,0.0100870989354573,537.32,537.14,541.45,532.16,1.0,0.09728230097613366,0.8003160878737265,0.202735160033742,3.561874554386715
320,2021-01-16 00:00:00,0.0100870989354573,537.32,537.14,541.45,532.16,1.0,0.05717141449135532,1.39584274427675,-0.1564003828290589,6.566651222255936
321,2021-01-17 00:00:00,0.0100870989354573,537.32,537.14,541.45,532.16,1.0,0.008179695333409676,1.40624975808187,-0.3738983457114957,3.8772189931871903
322,2021-01-18 00:00:00,-0.0086966134797509,542.74,537.32,544.82,534.31,0.9166666666666666,-0.002503580571180386,1.2907034899615795,-0.5250096668296294,3.381833163702775
323,2021-01-19 00:00:00,0.0044050407048065,538.02,542.74,544.19,535.93,1.0,0.05063951938136846,1.2016787525405395,-0.20920906013226914,8.021247626882179
324,2021-01-20 00:00:00,0.0120468550491311,540.39,538.02,541.96,536.66,0.9032258064516128,0.06389050309369448,0.5516090689393378,-0.2582230075802038,1.9530285375254637
325,2021-01-21 00:00:00,-0.0026147376119947,546.9,540.39,549.62,540.39,0.9333333333333332,0.2827082061336865,0.572762364068955,0.6281739287739574,3.3101052549075223
326,2021-01-22 00:00:00,0.0062514895411296,545.47,546.9,547.19,542.12,0.9130434782608696,0.08383659882725514,0.09336980733348632,0.011683897417168444,-0.12362718087833179
327,2021-01-23 00:00:00,0.0062514895411296,545.47,546.9,547.19,542.12,0.9130434782608696,0.03236205615930743,0.023827065286502247,-0.4728923379278252,-0.49809422804096976
328,2021-01-24 00:00:00,0.0062514895411296,545.47,546.9,547.19,542.12,0.9130434782608696,0.08249460481341764,-6.190672086514581e-05,-0.16337617830962162,-0.4197287207781466
329,2021-01-25 00:00:00,-0.0174719428654715,548.88,545.47,550.88,543.31,0.8888888888888888,0.08649647450915499,0.017295386747367303,-0.30548903852090115,-0.535919794581791
330,2021-01-26 00:00:00,0.0021324333846355,539.29,548.88,548.88,538.43,0.9545454545454546,0.06230908001028279,0.07947026781670186,-0.44237698982344315,-0.07011189293629076
331,2021-01-27 00:00:00,-0.0204648064540005,540.44,539.28,541.03,535.43,0.95,-0.011480266387625448,0.050429100206910604,-0.9014657733906084,-0.3808275357057025
332,2021-01-28 00:00:00,-0.0078015792058634,529.38,540.45,540.45,527.95,0.8333333333333334,0.043950471455628914,0.07691805166662746,-0.5405523257590631,-0.28100612129720187
333,2021-01-29 00:00:00,0.0083769633507852,525.25,529.37,533.4,519.49,1.0,0.07570008630798064,-0.024810340244091122,-0.15496687929498026,-0.7018014695432637
334,2021-01-30 00:00:00,0.0083769633507852,525.25,529.37,533.4,519.49,1.0,0.009379329631078015,0.006144938322942828,-0.6999488501828623,-0.6595664326336701
335,2021-01-31 00:00:00,0.0083769633507852,525.25,529.37,533.4,519.49,1.0,-0.06194386835098431,0.16610460115218473,-1.0926071177290075,0.4318049775568275
336,2021-02-01 00:00:00,0.008854904182007,529.65,525.24,529.78,523.33,0.8,-0.05356395447961759,0.2099251784623517,-1.0890050878445445,0.9066951103054217
337,2021-02-02 00:00:00,-0.0021709024216792,534.34,529.65,534.6,528.03,1.0,-0.02098780652476062,0.045272033084307495,-0.9175677715539231,-0.30603818808494937
338,2021-02-03 00:00:00,-0.0032634382384933,533.18,534.34,537.04,530.99,0.8787878787878788,-0.00427098335409859,-0.020905322449810804,-0.6339028442496439,-0.6610782566383875
339,2021-02-04 00:00:00,-0.0002069847960259,531.44,533.18,535.32,525.75,0.9444444444444444,0.0019050305818621993,0.0918786491128527,-0.638272605545013,-0.10971341127340672
340,2021-02-05 00:00:00,0.0123651967703685,531.33,531.45,537.08,530.75,1.0,0.03082797154896788,0.22666778013897293,-0.34621464711757716,0.40655112234317553
341,2021-02-06 00:00:00,0.0123651967703685,531.33,531.45,537.08,530.75,1.0,0.08267678686616442,0.09543378051059914,-0.024218094635871823,-0.12638538547512376
342,2021-02-07 00:00:00,0.0123651967703685,531.33,531.45,537.08,530.75,1.0,0.15177693770748935,0.10077868661371614,0.3134832596854843,0.008156758028850195
343,2021-02-08 00:00:00,0.0202639895891429,537.9,531.33,539.21,530.9,0.7368421052631579,0.16757676600105942,0.07972896547640662,-0.02409326488749072,-0.18495779108061292
344,2021-02-09 00:00:00,0.0145043731778426,548.8,537.9,548.84,536.99,0.96,0.03752759824658103,-0.045409321963682636,-0.3005380212951804,-1.0844413554232486
345,2021-02-10 00:00:00,0.0,556.76,548.8,558.12,548.8,0.8928571428571429,-0.010339175630481812,-0.06728555159956251,-0.5696678523854682,-0.9046270084725517
346,2021-02-11 00:00:00,0.0,556.76,548.8,558.12,548.8,0.9565217391304348,0.1601002280621615,-0.06453785187853,0.35081913628965716,-0.8731958203287785
347,2021-02-12 00:00:00,0.0,556.76,548.8,558.12,548.8,1.0,0.10341547140746599,-0.054107478081726335,0.23770347201188874,-1.0062727832254423
348,2021-02-13 00:00:00,0.0,556.76,548.8,558.12,548.8,1.0,0.2729740184019489,-0.022717334644035247,1.5047519978979662,-0.663691927084674
349,2021-02-14 00:00:00,0.0,556.76,548.8,558.12,548.8,1.0,0.35621686347718207,0.024001274068458756,1.7818814628148387,-0.4127060440665692
350,2021-02-15 00:00:00,0.0,556.76,548.8,558.12,548.8,0.8571428571428571,0.3312582410003353,0.15325167015364372,0.9109800358468217,0.11080182484767521
351,2021-02-16 00:00:00,0.0,556.76,548.8,558.12,548.8,0.9230769230769232,0.24034419452340838,0.4118851757442794,0.28261006503412817,0.919311870993321
352,2021-02-17 00:00:00,0.0061247216035634,556.76,548.8,558.12,548.8,1.0,0.0,0.0,0.0,0.0
353,2021-02-18 00:00:00,0.0052662584572541,560.17,556.77,568.67,556.77,0.9565217391304348,0.0,0.0,0.0,0.0
354,2021-02-19 00:00:00,-0.0183797414405455,563.12,560.18,563.79,553.44,1.0,0.0,0.0,0.0,0.0
355,2021-02-20 00:00:00,-0.0183797414405455,563.12,560.18,563.79,553.44,1.0,0.09961759309144025,0.012972660938153524,-0.035725440423830745,-0.5827759343154769
356,2021-02-21 00:00:00,-0.0183797414405455,563.12,560.18,563.79,553.44,1.0,-0.0021815248206564775,0.1571722606418655,-0.7011550211928774,0.2931032153846053
357,2021-02-22 00:00:00,-0.0005608119109212,552.77,563.12,566.2,552.77,1.0,-0.048143827422876484,0.20762576633346175,-0.8492837939499117,0.7573077546412871
358,2021-02-23 00:00:00,-0.02139521413315,552.46,552.77,558.17,548.89,0.9473684210526316,-0.10953188887306631,0.3479140468508204,-0.8448911799494818,1.2240039896287056
359,2021-02-24 00:00:00,0.0062333530630364,540.64,552.46,553.97,535.56,0.925925925925926,-0.07803561618398458,0.25127180917009984,-1.4282051237606639,0.6422262394671355
360,2021-02-25 00:00:00,-0.0230694288707927,544.01,540.64,548.1,540.64,0.9393939393939394,-0.007426079553702891,0.9945109001391614,-0.7755118683623258,4.422107859578341
361,2021-02-26 00:00:00,0.0128513905091632,531.46,544.01,544.01,530.37,1.0,-0.0038837333008068242,0.5705560587541214,-0.8386475518196517,2.8966858329872527
362,2021-02-27 00:00:00,0.0128513905091632,531.46,544.01,544.01,530.37,1.0,-0.013966045610880329,0.10114161942273636,-0.75786532061167,-0.03672462100946497
363,2021-02-28 00:00:00,0.0128513905091632,531.46,544.01,544.01,530.37,1.0,0.03539819512021314,-0.037933294068667855,-0.4445387492123494,-1.182401810645712
364,2021-03-01 00:00:00,-0.0136543498857491,538.29,531.46,538.52,531.46,0.945945945945946,0.09221110927324894,-0.019457196174431424,-0.1637970215843882,-0.6613000056559845
365,2021-03-02 00:00:00,0.0215843598146681,530.94,538.29,540.75,527.25,1.0,0.09706396236825121,0.010831740027468229,-0.0870595248693003,-0.7222995355628815
366,2021-03-03 00:00:00,-0.0231194690265486,542.4,530.94,542.57,529.58,0.7777777777777778,0.15228976555099027,0.026844262886535297,-0.03808032807544685,-0.5802370472147773
367,2021-03-04 00:00:00,-0.0036047257766201,529.86,542.4,542.4,527.23,0.9444444444444444,0.007154276394267356,-0.07944232977451282,-0.47587994957805774,-0.7882650735074669
368,2021-03-05 00:00:00,-0.0259304858414623,527.95,529.86,531.65,521.03,1.0,0.005068803277277212,-0.021366608660225772,-0.5605354363479248,-0.6826222925499459
369,2021-03-06 00:00:00,-0.0259304858414623,527.95,529.86,531.65,521.03,1.0,0.09275670665908375,-0.03599720766814274,-0.13948239440022223,-0.7780356246410293
370,2021-03-07 00:00:00,-0.0259304858414623,527.95,529.86,531.65,521.03,1.0,0.21772389051296326,0.029706875264574606,0.027532564889291525,-0.5447165245074943
371,2021-03-08 00:00:00,-0.018881499630537,514.26,527.95,534.13,514.25,0.9130434782608696,0.24009074191102542,0.034347820177794475,0.6059430839128384,-0.4155599656757534
372,2021-03-09 00:00:00,0.001327915964721,504.55,514.27,515.78,499.58,1.0,0.09041949091952173,0.051955752838523495,0.06326707866097861,-0.3072293999226437
373,2021-03-10 00:00:00,0.0266022722774235,505.22,504.55,510.8,504.33,0.9411764705882352,0.21412561760647542,0.002343775867601927,0.34577670689408585,-0.5861798292692394
374,2021-03-11 00:00:00,0.0048008329155901,518.66,505.22,518.67,505.22,1.0,0.3404901915256451,0.06699064110020458,0.9806417488248708,-0.19541985791788158
375,2021-03-12 00:00:00,-0.0118008250983401,521.15,518.66,521.36,515.5,1.0,-0.012265463334385274,0.026605685868980267,-0.5803196427686736,-0.24957553262502327
376,2021-03-13 00:00:00,-0.0118008250983401,521.15,518.66,521.36,515.5,1.0,0.021664812752637097,0.0008081237556218923,-0.27757716769608326,-0.5995599882144717
377,2021-03-14 00:00:00,-0.0118008250983401,521.15,518.66,521.36,515.5,1.0,0.05348849087167995,0.07592773583407286,-0.34666804521605654,-0.14379918658784305
378,2021-03-15 00:00:00,0.0076310679611649,515.0,521.15,521.57,510.8,0.9166666666666666,0.07436981627178696,0.07736490635993842,-0.2347361358574964,-0.2920329297602137
379,2021-03-16 00:00:00,-0.0006166534985449,518.93,515.0,519.75,512.58,0.8148148148148148,0.06425921336617524,-0.05517746945168156,-0.210316070048107,-1.3608789892827353
380,2021-03-17 00:00:00,0.00551474132778,518.61,518.93,520.43,512.98,0.8571428571428571,0.050330584291332414,-0.021327106276935126,-0.4705575599886954,-0.8018294680787071
381,2021-03-18 00:00:00,-0.0188313805204518,521.47,518.61,523.65,518.61,0.9322033898305084,0.03597024828547202,0.022781959991359457,-0.28636085925269916,-0.3816757230715602
382,2021-03-19 00:00:00,0.0118244893970488,511.65,521.47,521.47,509.21,1.0,0.021131999276997604,0.07409115582327175,-0.5975628159206382,-0.2805902275015545
383,2021-03-20 00:00:00,0.0118244893970488,511.65,521.47,521.47,509.21,1.0,-0.02940636221933346,0.19768117865969703,-0.45534485251385204,0.3542365164935749
384,2021-03-21 00:00:00,0.0118244893970488,511.65,521.47,521.47,509.21,1.0,0.013807878542789531,0.08378130612736623,-0.4991619135118335,0.003188472627019378
385,2021-03-22 00:00:00,-0.0097740003863242,517.7,511.65,518.03,511.65,0.8095238095238095,0.0657627072125786,0.018827245972460105,-0.24843066749086004,-0.7103624748909944
386,2021-03-23 00:00:00,-0.0159566167290886,512.64,517.7,517.89,509.07,1.0,0.17274444221282437,0.04151848165282068,0.5231785230748762,-0.39614128494504325
387,2021-03-24 00:00:00,-0.0008127502676128,504.46,512.64,513.29,503.71,0.7560975609756098,0.09216248162898388,0.017314449433317947,-0.0069398097758707105,-0.6013724275331604
388,2021-03-25 00:00:00,0.0176569784743577,504.05,504.46,506.77,501.11,0.8709677419354839,0.030891458116159676,0.00556256810753375,-0.5854272719806154,-0.6275818824272025
389,2021-03-26 00:00:00,0.0030997173213761,512.95,504.05,513.86,504.05,1.0,-0.01325851305568726,0.03549362534061906,-0.8340660631875992,-0.5349814003129332
390,2021-03-27 00:00:00,0.0030997173213761,512.95,504.05,513.86,504.05,1.0,0.006057901513617736,0.02099672091226701,-0.7202916030863757,-0.33539213083131497
391,2021-03-28 00:00:00,0.0030997173213761,512.95,504.05,513.86,504.05,1.0,-0.013538377043737171,-0.0545530136079968,-0.705041768049861,-1.1596559968036155
392,2021-03-29 00:00:00,0.0076378901543127,514.54,512.95,517.13,510.69,0.8823529411764706,-0.012449105637388769,-0.05382071720440251,-1.0838156929014995,-0.7788670028431853
393,2021-03-30 00:00:00,-0.0068277817424346,518.47,514.54,518.53,512.48,0.8666666666666667,-0.003464564693629768,-0.03365322616924438,-0.6272411721637707,-1.0002513168920764
394,2021-03-31 00:00:00,0.008486590410347,514.93,518.47,518.47,511.64,0.8666666666666667,0.019566071286986286,-0.03249239711692109,-0.47669701070401,-0.7199266107273061
395,2021-04-01 00:00:00,0.0053533602927018,519.3,514.93,519.84,514.79,1.0,0.04430056062191223,0.03444293927616826,-0.15205637767229419,-0.48825530024756125
396,2021-04-02 00:00:00,0.0,522.08,519.3,522.62,518.58,1.0,-0.004545119822570776,0.06427004957445082,-0.6710380064872863,-0.05860991388972556
397,2021-04-03 00:00:00,0.0,522.08,519.3,522.62,518.58,1.0,0.13931645746824817,0.03547144189362328,0.30051151935511605,-0.5867738152803259
398,2021-04-04 00:00:00,0.0,522.08,519.3,522.62,518.58,1.0,0.12352953899955033,-0.010807085386414172,-0.11713279671646008,-0.5728387409282325
399,2021-04-05 00:00:00,-0.0009193993257738,522.08,519.3,522.62,518.58,0.9375,0.10634110070586456,0.03120816271138338,-0.17518538428031205,-0.37542330717019123
400,2021-04-06 00:00:00,-0.0030483128834356,521.6,522.08,523.62,519.97,0.9130434782608696,0.08824123527922012,0.03279717883258648,-0.16919145877195116,-0.3331940158945638
401,2021-04-07 00:00:00,0.0015768927520625,520.01,521.6,521.62,516.13,0.9,0.4256544587899631,0.10076801013169678,0.9107679947568186,0.022496329182060328
402,2021-04-08 00:00:00,-0.0103104659869823,520.83,520.01,522.78,516.8,0.9444444444444444,0.3725836514424863,0.5975393809554381,1.5847186753809404,3.9710818078593957
403,2021-04-09 00:00:00,-0.0131338998176386,515.46,520.83,520.83,513.98,1.0,0.8010237559214008,0.6933498696183591,5.480715525001994,4.767654524214038
404,2021-04-10 00:00:00,-0.0131338998176386,515.46,520.83,520.83,513.98,1.0,0.005839735356892639,0.18060288614267073,-0.711756907154793,0.3387512845435356
405,2021-04-11 00:00:00,-0.0131338998176386,515.46,520.83,520.83,513.98,1.0,-0.029773933027735566,0.025366185426689114,-0.5271925721819679,-0.3347075538364789
406,2021-04-12 00:00:00,-0.0046000511116789,508.69,515.46,515.98,507.23,0.9565217391304348,-0.05409361539531954,0.08854867406505207,-0.8786848909487468,0.2814313269432272
407,2021-04-13 00:00:00,0.0060827490866001,506.35,508.69,511.23,505.01,0.9574468085106383,-0.04608842030892557,0.0487116988079066,-0.8320399591953724,-0.43691729830818016
408,2021-04-14 00:00:00,-0.0057711559978799,509.43,506.35,510.03,505.64,0.85,-0.016593978263972353,-0.06516618520004869,-0.6234277933553845,-0.8917583234882138
409,2021-04-15 00:00:00,0.007226203873719,506.49,509.43,509.43,502.26,0.9523809523809524,0.040499910896902414,0.19639245011714745,-0.39412731191983397,0.23048408732540002
410,2021-04-16 00:00:00,0.0170930118592571,510.15,506.49,511.07,505.28,1.0,0.024229720917080755,0.1651274756891068,-0.525815695734754,0.20713318380344609
411,2021-04-17 00:00:00,0.0170930118592571,510.15,506.49,511.07,505.28,1.0,0.07529814820435199,0.18957496105790472,-0.1635260723239076,0.4147885178428984
412,2021-04-18 00:00:00,0.0170930118592571,510.15,506.49,511.07,505.28,1.0,0.12776748005936778,0.05453350916814337,0.14973378393559314,-0.1419597645236887
413,2021-04-19 00:00:00,-0.0005589068552815,518.87,510.15,519.09,507.62,0.85,0.20375836460698782,0.025902977532362925,0.2850772605526531,-0.41289010908559026
414,2021-04-20 00:00:00,0.0008870376798178,518.58,518.86,521.82,516.56,0.9473684210526316,0.28196569133383775,-0.042197378427532684,0.7174057048675235,-0.8404786562179581
415,2021-04-21 00:00:00,-0.0033330764488286,519.04,518.58,520.35,515.13,1.0,0.14812366287657142,-0.037707218693302735,0.16170432714220884,-0.7020724172162369
416,2021-04-22 00:00:00,0.0043107614389824,517.31,519.03,520.62,515.95,0.9629629629629628,0.1660052399750267,-0.0143793010385167,0.6821332955755365,-0.45228580293237614
417,2021-04-23 00:00:00,-0.0097201370443083,519.54,517.31,520.67,516.03,1.0,0.052454705114381106,-0.06803681976634479,-0.3263872168289315,-0.9015759108227124
418,2021-04-24 00:00:00,-0.0097201370443083,519.54,517.31,520.67,516.03,1.0,-0.0520893748821587,-0.054951969978834114,-0.8073670993397827,-0.8935356443899228
419,2021-04-25 00:00:00,-0.0097201370443083,519.54,517.31,520.67,516.03,1.0,-0.06908625294953641,-0.04008576599238012,-0.839835957045944,-0.48026307343255703
420,2021-04-26 00:00:00,0.0007385955023421,514.49,519.54,523.93,514.02,1.0,-0.06367380548197321,0.029516928627712602,-0.7139720045986216,-0.3602369120936322
421,2021-04-27 00:00:00,0.003534872880533,514.87,514.49,515.21,511.18,1.0,0.10344948565960799,0.47760895606608855,-0.02378109711911573,2.065089680407954
422,2021-04-28 00:00:00,0.0070448431361164,516.69,514.87,516.69,511.75,0.9166666666666666,0.020111478914233594,0.01445112063303089,-0.5973774576435443,-0.39000130027102853
423,2021-04-29 00:00:00,-0.0077643034228279,520.33,516.68,520.73,515.42,0.9090909090909092,0.13995239528320536,0.06146894672029557,0.03596400488048949,-0.24506193240568844
424,2021-04-30 00:00:00,0.0,516.29,520.34,520.34,513.23,1.0,0.3287241617755079,0.043736414792814315,1.0539272535822435,-0.4901450568569882
425,2021-05-01 00:00:00,0.0,516.29,520.34,520.34,513.23,1.0,0.07439039421719684,0.12496163901004831,-0.21786886594174174,-0.02925349826347322
426,2021-05-02 00:00:00,0.0,516.29,520.34,520.34,513.23,1.0,0.07718176914047348,0.1437929863772327,0.040933566886499066,0.09228432898406133
427,2021-05-03 00:00:00,0.0,516.29,520.34,520.34,513.23,1.0,0.12387379251378139,0.12457333671330506,0.2951002363347498,0.23303272949084822
428,2021-05-04 00:00:00,0.0,516.29,520.34,520.34,513.23,0.9090909090909092,0.5268308368425769,0.20217105174698613,1.7958887078472971,0.2632849474088073
429,2021-05-05 00:00:00,-0.0026535474248968,516.29,520.34,520.34,513.23,1.0,0.49648018146311834,0.15991992072946015,5.190909880028515,0.2749546230162895
430,2021-05-06 00:00:00,-0.0063893420337139,514.92,516.29,520.19,512.69,0.95,0.2115128258881609,0.04882038088177332,0.30346210442075333,0.0798585738099591
431,2021-05-07 00:00:00,0.0016222660907297,511.63,514.92,517.96,511.26,1.0,0.2604016581747297,0.011759742003516926,0.6118229496429871,-0.27932005319352304
432,2021-05-08 00:00:00,0.0016222660907297,511.63,514.92,517.96,511.26,1.0,0.0,0.0,0.0,0.0
433,2021-05-09 00:00:00,0.0016222660907297,511.63,514.92,517.96,511.26,1.0,0.1591435731180444,0.2023532792500804,0.37061026607646363,0.06115524164708284
434,2021-05-10 00:00:00,0.0039417710650587,512.46,511.63,513.12,508.36,0.75,0.12258831419852889,0.3632559183959687,0.01972180120897248,2.0163254168085873
435,2021-05-11 00:00:00,0.0052674545171824,514.48,512.46,515.73,505.58,0.8421052631578947,0.08054712535544528,-0.03941698905951174,0.2290604904482849,-0.8020039159687447
436,2021-05-12 00:00:00,-0.0108084069684255,517.19,514.48,517.81,512.31,0.8235294117647058,0.1361477731749403,0.013373472260258978,0.5627633615115063,-0.48473180023943946
437,2021-05-13 00:00:00,0.0191555903049256,511.6,517.19,517.19,509.98,0.8235294117647058,0.2444480742486821,0.017034820000926487,0.2548892355287752,-0.6968318868667317
438,2021-05-14 00:00:00,0.0089374760260835,521.4,511.6,521.48,510.45,1.0,0.06480805607325824,-0.00825532442848953,-0.33187462868443246,-0.5964975676436375
439,2021-05-15 00:00:00,0.0089374760260835,521.4,511.6,521.48,510.45,1.0,0.35050573412322983,0.00016734447341715253,1.4218901723958834,-0.7364857510594403
440,2021-05-16 00:00:00,0.0089374760260835,521.4,511.6,521.48,510.45,1.0,0.019987640467574508,-0.0048849861992028565,-0.6258458798035167,-0.5781611142407792
441,2021-05-17 00:00:00,0.0025472379576474,526.06,521.4,527.91,521.33,1.0,-0.008791968986099796,0.028469087150458705,-0.7532219983859878,-0.5853928107872126
442,2021-05-18 00:00:00,-0.0056503602578688,527.4,526.06,527.44,524.7,0.8947368421052632,0.031424655846617355,0.10148728365119908,-0.4394205684422943,-0.05044890368117798
443,2021-05-19 00:00:00,-0.0007436787307882,524.42,527.4,527.4,523.31,0.875,0.23728858768166194,0.794050966156802,0.7047183170975571,5.834481699658857
444,2021-05-20 00:00:00,-0.0066408411732153,524.03,524.43,525.65,520.58,0.8571428571428571,0.0013976109956175264,0.24103345672246945,-0.8640330543886855,0.29788387718765974
445,2021-05-21 00:00:00,0.0035923542407069,520.55,524.03,526.2,519.56,0.9565217391304348,-0.02124761652318874,0.5804749446595787,-0.8196022052542281,3.1335172874461765
446,2021-05-22 00:00:00,0.0035923542407069,520.55,524.03,526.2,519.56,0.9565217391304348,0.057908650974924925,0.5507569479953389,-0.23816531637713328,1.6228909234268163
447,2021-05-23 00:00:00,0.0035923542407069,520.55,524.03,526.2,519.56,0.9565217391304348,0.27011916920702017,0.3287982862291541,0.5651694582190633,0.8565709698620239
448,2021-05-24 00:00:00,0.0268366448451439,522.42,520.55,522.42,518.04,0.9285714285714286,0.34140686250874275,0.2523662527297752,0.9343364489000362,0.923919865987133
449,2021-05-25 00:00:00,0.0037842069942583,536.44,522.42,536.89,522.42,0.9285714285714286,0.4803617441175838,0.177861741613639,1.160247239056922,0.056286570981963505
450,2021-05-26 00:00:00,0.0032499489293739,538.47,536.44,540.15,536.44,0.8666666666666667,-0.04897651199429909,0.18372108016030797,-1.1922642804853942,0.2581261855465275
451,2021-05-27 00:00:00,-0.001314279367665,540.22,538.47,543.64,536.0,1.0,0.03861447556155806,0.20679031490349242,-0.4428808998030808,0.4201053709756878
452,2021-05-28 00:00:00,0.0027803006431762,539.51,540.22,542.93,536.5,0.9090909090909092,0.05779237727379982,0.11067210953226159,-0.142747531603171,-0.08556163284888314
453,2021-05-29 00:00:00,0.0027803006431762,539.51,540.22,542.93,536.5,0.9090909090909092,-0.01385326253292618,0.10201242734754334,-0.8962419224333664,0.053553524026165644
454,2021-05-30 00:00:00,0.0027803006431762,539.51,540.22,542.93,536.5,0.9090909090909092,-0.0050609007034641,0.13753198041005543,-0.5015421066737377,0.49053837785841764
455,2021-05-31 00:00:00,0.0013123602151532,541.01,539.51,541.02,535.99,0.9,-0.018128140198002463,0.1257357941863182,-0.6764380646399516,0.11674013193961684
456,2021-06-01 00:00:00,-0.0081222771911688,541.72,541.01,541.93,535.04,0.9444444444444444,-0.03148956020860272,0.06912274362616433,-0.5634745469120171,-0.15284171110266942
457,2021-06-02 00:00:00,-0.0041688379364252,537.32,541.73,542.59,535.37,1.0,0.15851630009277518,0.000527447990425145,0.5508204651007717,-0.681085082859227
458,2021-06-03 00:00:00,0.0033266053674216,535.08,537.31,540.33,535.08,0.9130434782608696,0.09144920464611239,0.30296273930407924,-0.11264661721577107,0.9159341111369089
459,2021-06-04 00:00:00,0.0010989829750773,536.86,535.08,541.23,531.96,0.9285714285714286,0.2431980996358929,0.1195975813702761,0.6327741805981207,-0.13273056970574548
460,2021-06-05 00:00:00,0.0010989829750773,536.86,535.08,541.23,531.96,0.9285714285714286,0.18271535572297015,0.12815643182013847,0.21949846932661185,-0.0005840415272265837
461,2021-06-06 00:00:00,0.0010989829750773,536.86,535.08,541.23,531.96,0.9285714285714286,0.6719739481593638,0.11547673645873147,3.0555743938610807,-0.13184838286949763
462,2021-06-07 00:00:00,-0.0059168294725091,537.45,536.85,537.52,534.55,0.8888888888888888,0.6914313695836256,0.1296982811567844,4.1999926600386726,0.2453441803836173
463,2021-06-08 00:00:00,0.0021524697250453,534.27,537.45,541.21,531.56,0.9047619047619048,0.7004223292152076,0.1670730806706766,1.9922999735461713,0.32163824197216034
464,2021-06-09 00:00:00,0.0057711702962161,535.42,534.27,536.68,533.08,0.8983050847457628,0.14682362836313967,0.29414059651651847,-0.09467075509451114,0.9982086175266371
465,2021-06-10 00:00:00,-0.0078550073350541,538.51,535.42,540.85,534.56,0.85,0.15995944166652798,0.34144658234356395,0.630360743272613,1.4817209860018892
466,2021-06-11 00:00:00,0.0,534.28,538.52,539.1,533.82,1.0,0.05195269635644806,-0.05553509302253268,-0.4426995947381123,-1.0878138483670656
467,2021-06-12 00:00:00,0.0,534.28,538.52,539.1,533.82,1.0,0.16731461166782235,0.04199185809814221,0.09343586175108941,-0.2784285320735564
468,2021-06-13 00:00:00,0.0,534.28,538.52,539.1,533.82,1.0,0.015797571936390753,0.05153622383385148,-0.55582064403204,-0.4270987038555431
469,2021-06-14 00:00:00,-0.0131766115145615,534.28,538.52,539.1,533.82,0.9130434782608696,-0.009359317649709986,0.01532033127846244,-0.8625636658987433,-0.6691160172391782
470,2021-06-15 00:00:00,-0.0114748501631134,527.24,534.28,534.28,526.18,0.9411764705882352,0.002010163974058621,0.004056136481368711,-0.4771691913426606,-0.6231586585873958
471,2021-06-16 00:00:00,0.0016308831712041,521.19,527.25,527.64,520.49,1.0,0.04609655943105739,0.0414894481544712,-0.36652098653937354,-0.5366414672548881
472,2021-06-17 00:00:00,-0.0004597348862156,522.04,521.19,524.29,520.1,0.9310344827586208,0.06557551129078476,0.03195767143096795,-0.3775658204532039,-0.39700504208530346
473,2021-06-18 00:00:00,-0.0011690302798004,521.8,522.05,523.42,518.43,1.0,0.1726058894671052,-0.02842782566972879,0.3073762156856583,-0.6439131425040785
474,2021-06-19 00:00:00,-0.0011690302798004,521.8,522.05,523.42,518.43,1.0,0.38407918265779717,0.03788001021296328,2.8730975680786806,-0.24730436689167634
475,2021-06-20 00:00:00,-0.0011690302798004,521.8,522.05,523.42,518.43,1.0,0.656736111626298,0.06696611734279756,2.3795351042683786,-0.16121335084802033
476,2021-06-21 00:00:00,0.0086724610986396,521.19,521.8,523.55,518.49,1.0,0.6199599620980658,0.08651682920713011,2.0298852829438654,-0.21459529703706087
477,2021-06-22 00:00:00,0.0031576344372371,525.71,521.19,525.92,521.19,0.72,0.5117901342138174,0.23302203236313623,2.5169636574749616,0.8852009366785314
478,2021-06-23 00:00:00,0.001175645182699,527.37,525.71,528.91,524.9,0.9629629629629628,0.045780467692472016,-0.07478717213405606,-0.3490546347812875,-0.6813979131902723
479,2021-06-24 00:00:00,0.0122918994677929,527.99,527.37,528.39,524.79,0.9393939393939394,0.22218540801028652,-0.020659155046930167,1.3881241370581912,-0.6917599917965103
480,2021-06-25 00:00:00,-0.0017212992067057,534.48,527.99,535.51,527.46,1.0,-0.07614902704307003,-0.059144195003264954,-0.901081017661485,-1.114387998032863
481,2021-06-26 00:00:00,-0.0017212992067057,534.48,527.99,535.51,527.46,1.0,-0.042922150931439695,-0.04672482374516562,-0.6871581020900708,-1.000295657834058
482,2021-06-27 00:00:00,-0.0017212992067057,534.48,527.99,535.51,527.46,1.0,-0.03101057515912231,0.09038922254595816,-0.6607945067293017,-0.17385878788882025
483,2021-06-28 00:00:00,-0.0096708898718044,533.56,534.48,535.45,531.7,0.9090909090909092,-0.045674913822151275,0.1638491943538476,-0.737301467500076,0.3946218280575297
484,2021-06-29 00:00:00,0.005545041635125,528.4,533.56,533.56,528.03,1.0,-0.06791989001541143,0.17420330998393307,-0.662227066778569,0.346760581336141
485,2021-06-30 00:00:00,0.0007716485046957,531.33,528.4,531.77,527.88,0.95,-0.050523611932537627,0.3994577521253233,-0.7156358451198592,0.9905158449252465
486,2021-07-01 00:00:00,-0.0219280099296648,531.74,531.33,534.41,528.72,0.9583333333333334,0.0928066652647308,0.1401317317473918,-0.2585440974151265,0.6522505803408566
487,2021-07-02 00:00:00,0.0022881095216119,520.08,531.74,531.74,519.45,1.0,0.1319115426382007,0.03261815761206588,-0.07521805933262028,-0.41626638082268924
488,2021-07-03 00:00:00,0.0022881095216119,520.08,531.74,531.74,519.45,1.0,-0.007597078909371113,-0.033472913395752535,-0.49488968291114466,-0.5668596404883725
489,2021-07-04 00:00:00,0.0022881095216119,520.08,531.74,531.74,519.45,1.0,0.13193828840703503,0.06119710646480847,0.12408201633135073,-0.23076535471874482
490,2021-07-05 00:00:00,0.0008249083968002,521.27,520.08,521.54,517.6,0.9375,0.1285202399213876,0.2974562856024283,0.641333286365587,0.8109977285266152
491,2021-07-06 00:00:00,0.0073413839371284,521.7,521.27,522.26,516.59,0.9090909090909092,0.10596637589465274,0.2739172569407353,0.08627258194949892,1.0682579205538514
492,2021-07-07 00:00:00,-0.0104275683595608,525.53,521.7,526.12,517.95,0.9,0.03747464782500032,0.08327308766580543,-0.42975115236713324,-0.20856319846541072
493,2021-07-08 00:00:00,0.0008268435727335,520.05,525.53,526.32,519.47,0.8888888888888888,-0.04429386517202882,0.10193702391155224,-1.1283536038993427,-0.05776828051513432
494,2021-07-09 00:00:00,0.008876421764525,520.48,520.05,521.34,514.26,0.9285714285714286,0.0020991989469365535,0.4023499734148821,-0.46420145996759293,2.6673401808582264
495,2021-07-10 00:00:00,0.008876421764525,520.48,520.05,521.34,514.26,0.9285714285714286,0.017765248678079715,0.19798009323251442,-0.408024092433968,0.549076844057467
496,2021-07-11 00:00:00,0.008876421764525,520.48,520.05,521.34,514.26,0.9285714285714286,0.03757047553941373,0.1795850541303725,-0.28236090751672394,0.3980820654358477
497,2021-07-12 00:00:00,0.0048371738716434,525.1,520.48,527.85,520.48,0.8,-0.01723457008685303,0.2798709004285991,-0.4154168987804805,0.5091828630816859
498,2021-07-13 00:00:00,-0.0118072928511864,527.64,525.1,527.73,523.92,0.7777777777777778,-0.03629105443463754,-0.09900918831190264,-0.6102176729408894,-1.0098680166920075
499,2021-07-14 00:00:00,0.013559387046662,521.41,527.64,527.64,520.9,0.8636363636363636,0.06790647037060182,-0.023324339710120157,-0.1780687434103594,-1.0187439272915124
500,2021-07-15 00:00:00,-0.0065092340296701,528.48,521.41,528.68,520.06,0.875,0.09333218904122553,-0.027364097447662772,-0.39278713702857043,-0.8878844331346263
501,2021-07-16 00:00:00,0.0005332927015086,525.04,528.48,528.89,524.68,1.0,0.21320207252539713,-0.05227982911020046,0.5389465965816785,-0.7289998936985732
502,2021-07-17 00:00:00,0.0005332927015086,525.04,528.48,528.89,524.68,1.0,0.0007306539218747687,0.24423929479850592,-0.7447398587135932,0.546748944149203
503,2021-07-18 00:00:00,0.0005332927015086,525.04,528.48,528.89,524.68,1.0,-0.0026483173528104587,0.39896139165108835,-0.886507244199652,2.370346890714688
504,2021-07-19 00:00:00,-0.0008566207264144,525.32,525.04,526.08,519.85,0.8333333333333334,0.025051423712373122,0.4394789993721133,-0.5466661507957498,2.6130680232665826
505,2021-07-20 00:00:00,0.0067826318898011,524.87,525.32,525.32,521.01,0.8,0.08531383830836692,0.1697295512408985,-0.26353277571790906,0.38428079646799956
506,2021-07-21 00:00:00,0.0028007493897016,528.43,524.87,529.42,524.87,0.8095238095238095,0.021970506946152213,0.13176066537325326,-0.571660719427083,0.07447934323371096
507,2021-07-22 00:00:00,-0.0073031269460851,529.91,528.43,530.35,527.59,0.7222222222222222,0.024833787756334047,0.11892495919142654,-0.5514293825687319,0.0021187582104294257
508,2021-07-23 00:00:00,-0.0266139457075507,526.04,529.91,529.91,525.0,1.0,0.21285509583999662,0.02317736202783216,0.5850413136516834,-0.4524064721045247
509,2021-07-24 00:00:00,-0.0266139457075507,526.04,529.91,529.91,525.0,1.0,0.0888695273722373,0.13328000923635752,-0.04808247098161245,0.04562463612602908
510,2021-07-25 00:00:00,-0.0266139457075507,526.04,529.91,529.91,525.0,1.0,0.028361945628527785,0.07497448478259727,-0.42611744428724796,0.01232453150536168
511,2021-07-26 00:00:00,-0.0295680024998046,512.04,526.04,526.04,506.2,0.8148148148148148,0.016888024993715334,0.10453604118100035,-0.4489954050948141,0.06249200069043571
512,2021-07-27 00:00:00,-0.0033608371905815,496.9,512.04,514.33,496.67,0.75,0.04837311092233598,0.04830429213791376,-0.23104587046719327,-0.05463039698814996
513,2021-07-28 00:00:00,0.0148819740322678,495.23,496.9,498.58,487.92,0.84,0.13481272184872717,-0.005643135902919205,0.37774944048486814,-0.5968368289582342
514,2021-07-29 00:00:00,-0.0061679267807401,502.6,495.23,503.24,495.23,0.925925925925926,0.027184009042383828,-0.015577933571545799,-0.4113284374965076,-0.9097932837875246
515,2021-07-30 00:00:00,0.0225425425425425,499.5,502.6,502.6,495.55,0.9,-0.045076063728358484,0.042414988407086796,-1.122764326126833,-0.268441843873022
516,2021-07-31 00:00:00,0.0225425425425425,499.5,502.6,502.6,495.55,0.9,-0.02362336878771565,0.037502430071845616,-0.6737554693774699,-0.40236014972829987
517,2021-08-01 00:00:00,0.0225425425425425,499.5,502.6,502.6,495.55,0.9,0.15714536914969202,0.19858410588626896,0.5185937601601014,0.569794724368845
518,2021-08-02 00:00:00,-0.0027997493930613,510.76,499.5,511.07,495.09,0.9,0.18991182959031416,0.3690751479303156,0.33677959491915627,0.8948246297403526
519,2021-08-03 00:00:00,0.0081283254471561,509.33,510.76,512.42,506.73,0.85,0.2116663317968035,1.6099612972644435,0.757579367362829,10.335037214487372
520,2021-08-04 00:00:00,-0.0038171655598185,513.47,509.33,513.51,508.21,0.9090909090909092,0.11047149783394339,1.3555825115399136,0.09961704316399232,4.198191897146799
521,2021-08-05 00:00:00,-0.0017985963128775,511.51,513.47,515.33,509.08,0.8947368421052632,0.01771703139226144,0.17263446225012746,-0.5876785564413741,0.08394462821512971
522,2021-08-06 00:00:00,0.012025304060009,510.59,511.51,511.51,507.54,1.0,0.2559689732700914,0.1562632882425694,1.7727366855869724,0.42163757159475146
523,2021-08-07 00:00:00,0.012025304060009,510.59,511.51,511.51,507.54,1.0,0.19981708259613384,0.019613493362300005,1.0612651533229844,-0.34456736860859655
524,2021-08-08 00:00:00,0.012025304060009,510.59,511.51,511.51,507.54,1.0,-0.031939031805473306,0.002177960518650046,-0.8113683672762609,-0.4418971680283728
525,2021-08-09 00:00:00,0.0107793238248213,516.73,510.6,518.05,507.58,0.9333333333333332,-0.05584076099235791,-0.024263052170545585,-0.9601129870774741,-0.7702141313917857
526,2021-08-10 00:00:00,0.0001531686770056,522.3,516.73,522.31,513.41,0.8947368421052632,0.06876385607278124,-0.07620259808288221,-0.09481151036723617,-1.115928297649987
527,2021-08-11 00:00:00,-0.0029480454841302,522.38,522.31,524.58,521.33,0.875,0.09245184232728487,-0.008446406185761646,-0.09633208508511644,-0.6258743824925418
528,2021-08-12 00:00:00,-0.0012863835342909,520.84,522.38,522.69,518.97,1.0,0.04940254328121263,0.17305292649192783,-0.2943216354511246,0.623579442751103
529,2021-08-13 00:00:00,-0.0009227752465538,520.17,520.84,523.32,517.62,0.9523809523809524,0.21746879893772242,0.031856382644830816,0.34054934485833127,-0.47682386644230246
530,2021-08-14 00:00:00,-0.0009227752465538,520.17,520.84,523.32,517.62,0.9523809523809524,0.0030535181540569667,0.023678848126650998,-0.5326536167414367,-0.44832004356115984
531,2021-08-15 00:00:00,-0.0009227752465538,520.17,520.84,523.32,517.62,0.9523809523809524,-0.039663771436582174,-0.06797567201483012,-0.6995934424234234,-1.4005155736313843
532,2021-08-16 00:00:00,-0.0198964767457523,519.69,520.17,523.03,518.75,1.0,0.015166582554159369,-0.02589158340519937,-0.47194840937393673,-0.7138121003483071
533,2021-08-17 00:00:00,0.0132129184254442,509.35,519.69,522.11,507.96,0.8095238095238095,0.11484683066096935,0.02089353657907722,-0.1694361092292253,-0.44533636147089695
534,2021-08-18 00:00:00,-0.0080220120911487,516.08,509.35,516.75,507.92,0.6875,0.25076660519340876,0.0059108605940148,0.9196192438350012,-0.5751870411186055
535,2021-08-19 00:00:00,-0.012423330859085,511.94,516.08,516.08,509.34,0.7857142857142857,0.24714979050640196,0.17995429773471372,0.9509235581378158,0.3904536043919266
536,2021-08-20 00:00:00,0.0125796115352664,505.58,511.94,511.94,500.4,1.0,0.058762972223144416,0.5382234485152777,-0.30975307870888674,2.393420213532795
537,2021-08-21 00:00:00,0.0125796115352664,505.58,511.94,511.94,500.4,1.0,0.007999885124035266,0.07684661076152821,-0.5074195674527083,-0.41337284472240365
538,2021-08-22 00:00:00,0.0125796115352664,505.58,511.94,511.94,500.4,1.0,0.00590590004697944,0.001504804764223877,-0.6542633837898592,-0.7653827380443895
539,2021-08-23 00:00:00,0.0118568582255732,511.94,505.58,512.64,505.58,1.0,0.002274005896652831,-0.00797102157583307,-0.5468481683438248,-0.7219037316194233
540,2021-08-24 00:00:00,0.0071620238991525,518.01,511.94,519.28,511.94,1.0,-0.012469266608939655,0.0017449002867255814,-0.7685666618602157,-0.6936229304490483
541,2021-08-25 00:00:00,-0.0123821206777582,521.72,518.01,521.72,517.14,1.0,-0.0008849344217152222,0.04666243545755666,-0.7429667677752424,-0.1879446560308625
542,2021-08-26 00:00:00,0.0070255793191786,515.26,521.72,521.72,514.98,1.0,0.11929995639504387,-0.04486355273760889,-0.01385790237407696,-0.9359756803624218
543,2021-08-27 00:00:00,0.0015417823003391,518.88,515.26,520.01,514.07,1.0,0.254782148747986,-0.11797950064192797,1.4848031416148355,-1.2616148054455545
544,2021-08-28 00:00:00,0.0015417823003391,518.88,515.26,520.01,514.07,1.0,0.0,0.0,0.0,0.0
545,2021-08-29 00:00:00,0.0015417823003391,518.88,515.26,520.01,514.07,1.0,0.0,0.0,0.0,0.0
546,2021-08-30 00:00:00,0.0058112684729065,519.68,518.88,521.28,517.24,0.9,0.0,0.0,0.0,0.0
547,2021-08-31 00:00:00,0.0082647790319493,522.7,519.68,522.7,514.99,1.0,0.0,0.0,0.0,0.0
548,2021-09-01 00:00:00,0.0107206557625896,527.02,522.7,529.95,519.27,0.8125,0.304689162744773,0.0019317264982805504,0.6746396778800582,-0.6675749604594401
549,2021-09-02 00:00:00,-0.0047121106876677,532.67,527.02,532.7,525.9,0.8421052631578947,-0.038396016130240795,0.24700460521384215,-0.6676123125940929,0.24195028908971553
550,2021-09-03 00:00:00,0.0105817111815301,530.16,532.67,535.67,528.51,1.0,0.06027111414117581,0.31869565471297,-0.38726276572242163,0.9477232108593903
551,2021-09-04 00:00:00,0.0105817111815301,530.16,532.67,535.67,528.51,1.0,0.016084643251422115,0.11982695011079958,-0.5738533910736453,0.015398387741489657
552,2021-09-05 00:00:00,0.0105817111815301,530.16,532.67,535.67,528.51,1.0,0.06203370729444657,-0.010827615070959418,-0.31913707957151305,-0.9019357875476158
553,2021-09-06 00:00:00,0.0170035649625772,535.77,530.16,536.47,530.16,1.0,0.06768764812688666,0.004083829800979544,-0.24606621344736593,-0.5044830771101523
554,2021-09-07 00:00:00,-0.0012296285420642,544.88,535.77,545.64,534.77,0.9473684210526316,0.0030747988480017696,0.09165261468755048,-0.6892874517738741,-0.15458169345447823
555,2021-09-08 00:00:00,0.0038036787269619,544.21,544.88,547.41,542.24,0.8571428571428571,0.0317761917697128,0.04775912982096919,-0.4831724688651505,-0.3326582239703142
556,2021-09-09 00:00:00,0.0054916892436113,546.28,544.21,546.3,541.85,1.0,0.004009974183164289,0.09477496166585109,-0.7272539911851446,-0.20270790409981435
557,2021-09-10 00:00:00,0.0032041945819982,549.28,546.28,552.67,545.91,1.0,0.05130940740229306,0.11734095558385782,-0.2980654244644465,0.08539268182083931
558,2021-09-11 00:00:00,0.0032041945819982,549.28,546.28,552.67,545.91,1.0,0.1826952246176825,0.10217312864095351,0.5908621240755009,-0.0038313491144885154
559,2021-09-12 00:00:00,0.0032041945819982,549.28,546.28,552.67,545.91,1.0,-0.022044296025408805,-0.004077651453452624,-0.6825093913725208,-0.6143301016030988
560,2021-09-13 00:00:00,-0.0172038327526132,551.04,549.28,551.37,547.58,0.7142857142857143,-0.04107647634884515,-0.05940599307539163,-0.9301971102776919,-0.6479344190848163
561,2021-09-14 00:00:00,-0.0033975921412215,541.56,551.04,551.3,540.57,0.9545454545454546,0.002768220769370444,0.09359691478693666,-0.6334615212206575,-0.2255486585570354
562,2021-09-15 00:00:00,-0.0138960942711035,539.72,541.56,543.51,537.02,0.9523809523809524,0.5796955383022571,0.022299552956699387,2.974801527377711,-0.6197037217779572
563,2021-09-16 00:00:00,0.0034947953853669,532.22,539.71,542.83,532.2,0.9444444444444444,0.2867605033662297,0.019698184252790796,1.0196331087791888,-0.30595242709913323
564,2021-09-17 00:00:00,0.0,534.08,532.23,534.58,527.49,0.7894736842105263,0.1619519106006706,0.05323481440612721,0.5590123074419615,-0.20494982308328918
565,2021-09-18 00:00:00,0.0,534.08,532.23,534.58,527.49,0.7894736842105263,0.5079200731782825,0.1268124937178401,2.2517585785161347,0.05251266968106117
566,2021-09-19 00:00:00,0.0,534.08,532.23,534.58,527.49,0.7894736842105263,0.23983130927807572,0.1714335418319859,1.054592916031998,0.0025137011947457873
567,2021-09-20 00:00:00,0.0,534.08,532.23,534.58,527.49,0.9047619047619048,0.1694539306378715,0.16151306564901358,0.21343787380567783,0.018305742439309318
568,2021-09-21 00:00:00,0.0013106650689034,534.08,532.23,534.58,527.49,0.8461538461538461,0.12079672976740241,0.10237602393954859,-0.06875889608818174,-0.06501811118289241
569,2021-09-22 00:00:00,0.004057743371106,534.78,534.09,535.21,525.52,0.9166666666666666,0.09016319207342427,0.49828384555569993,-0.276281253194409,3.456548364152319
570,2021-09-23 00:00:00,-0.0073004935282616,536.95,534.78,541.04,534.78,0.8823529411764706,-0.1031489230822924,0.1938755466560078,-1.4745088458361992,1.515292473038984
571,2021-09-24 00:00:00,-0.0092114890343882,533.03,536.95,538.61,532.26,0.9166666666666666,-0.0006108831876003862,0.14777747870521996,-0.5780226978900552,0.5584038699160366
572,2021-09-25 00:00:00,-0.0092114890343882,533.03,536.95,538.61,532.26,0.9166666666666666,0.009603600730645923,0.1417278679025964,-0.4676028832758931,0.7170701886512104
573,2021-09-26 00:00:00,-0.0092114890343882,533.03,536.95,538.61,532.26,0.9166666666666666,0.03146523412248481,-0.012608163697943375,-0.37016598154416214,-0.7549311862797862
574,2021-09-27 00:00:00,0.0038248882829659,528.12,533.03,536.66,524.91,0.7777777777777778,-0.006434770885736185,-0.04297654518102245,-0.5206080455344889,-0.8241084202463901
575,2021-09-28 00:00:00,-0.0160146376428868,530.14,528.12,531.54,525.89,0.9130434782608696,-0.020024459042954135,0.0715751238617397,-0.6071885827809853,-0.33620509930773484
576,2021-09-29 00:00:00,0.0088373430461037,521.65,530.14,530.14,518.61,0.813953488372093,-0.009240579892740186,0.08323285710700556,-0.7055339554196661,-0.25931359265670745
577,2021-09-30 00:00:00,0.0,526.26,521.65,526.99,521.65,0.875,0.17060245165747645,0.15500378343793564,-0.2700371711851305,-0.06847440302139507
578,2021-10-01 00:00:00,0.0,526.26,521.65,526.99,521.65,1.0,0.08284156780754959,0.10816817040663107,-0.14733884280569032,-0.04120039634423101
579,2021-10-02 00:00:00,0.0,526.26,521.65,526.99,521.65,1.0,0.1875264772647638,-0.01780869617903491,0.8316236846900807,-1.0142062020820604
580,2021-10-03 00:00:00,0.0,526.26,521.65,526.99,521.65,1.0,0.026940063534271808,0.1162554737037027,-0.4674489392271805,-0.007314948824247952
581,2021-10-04 00:00:00,0.0,526.26,521.65,526.99,521.65,0.84,0.031877515366716125,0.18348270665414557,-0.4918050688977368,0.284794097767356
582,2021-10-05 00:00:00,0.0,526.26,521.65,526.99,521.65,0.5909090909090909,0.043200069351772896,0.1447577655224599,-0.3739742112910901,0.2499587125792923
583,2021-10-06 00:00:00,0.0,526.26,521.65,526.99,521.65,1.0,0.03383696563289362,-0.015474345834486591,-0.371948152147287,-0.652750501701892
584,2021-10-07 00:00:00,0.0068597271310759,526.26,521.65,526.99,521.65,0.9629629629629628,-0.10422579358936979,-0.03848945822032057,-1.1497173106266074,-0.5734441735754848
585,2021-10-08 00:00:00,0.0005095589484212,529.87,526.26,532.48,526.26,1.0,0.0,0.0,0.0,0.0
586,2021-10-09 00:00:00,0.0005095589484212,529.87,526.26,532.48,526.26,1.0,0.0,0.0,0.0,0.0
587,2021-10-10 00:00:00,0.0005095589484212,529.87,526.26,532.48,526.26,1.0,-0.09617226451130811,-0.02260855488179292,-1.1372686726428587,-0.319407152911695
588,2021-10-11 00:00:00,-0.0128645263515296,530.14,529.87,533.68,529.5,0.9333333333333332,-0.1067312024184357,0.037892313499389374,-0.4506010407039678,-0.3175336672531088
589,2021-10-12 00:00:00,0.0077390506764502,523.32,530.15,530.15,518.6,0.8888888888888888,-0.08062153148243478,0.060031121067832593,-1.3297816493193861,0.028625045976369345
590,2021-10-13 00:00:00,-0.0017065817168211,527.37,523.32,528.38,520.2,0.9473684210526316,-0.08929169116461111,-0.007863904365750685,-1.1686869186309126,-0.8052969922875666
591,2021-10-14 00:00:00,0.0038178813607612,526.47,527.36,528.15,524.88,0.9230769230769232,-0.05782789465868987,0.07508433264310632,-1.0847640107605554,-0.2981142813391543
592,2021-10-15 00:00:00,-0.0032167726309416,528.48,526.47,529.4,523.9,1.0,0.24130050104449463,0.22486774624120098,0.10800884076697757,0.775308688083898
593,2021-10-16 00:00:00,-0.0032167726309416,528.48,526.47,529.4,523.9,1.0,1.0049245317555462,0.32974630632248036,2.573082280905573,0.8034100723566474
594,2021-10-17 00:00:00,-0.0032167726309416,528.48,526.47,529.4,523.9,1.0,0.5139986887410641,0.23466808425782126,3.230447393847596,1.6324499156857535
595,2021-10-18 00:00:00,0.0073844868825695,526.78,528.48,528.48,522.75,0.8888888888888888,0.4323860842092877,0.3092234611638869,1.3591191638772668,1.4054856895349335
596,2021-10-19 00:00:00,-0.00086682872595,530.67,526.78,531.24,526.03,1.0,0.2854531035330883,0.0808153510978844,1.037234640457285,-0.048884610235114964
597,2021-10-20 00:00:00,0.0025084400520547,530.21,530.67,531.9,528.45,0.9411764705882352,0.07201251448475432,-0.004816802229477446,-0.04817992783373938,-0.7282169081416546
598,2021-10-21 00:00:00,-0.0014109944689016,531.54,530.21,534.01,528.77,1.0,0.4627205853192988,-0.009422828427033458,2.0024143106558734,-0.4253948098229265
599,2021-10-22 00:00:00,0.0066881440871155,530.79,531.54,534.61,530.08,1.0,0.5839674010245943,0.030479276038122727,3.019414333560953,-0.5526251850324768
600,2021-10-23 00:00:00,0.0066881440871155,530.79,531.54,534.61,530.08,1.0,1.2900468268351517,0.01044098629284207,4.135704546601265,-0.4860774221920505
601,2021-10-24 00:00:00,0.0066881440871155,530.79,531.54,534.61,530.08,1.0,1.212515071330623,0.07366640579861894,4.41137535028306,-0.33737042857157024
602,2021-10-25 00:00:00,-0.0029194894636374,534.34,530.79,534.52,527.86,0.8888888888888888,1.1928717992952826,0.19185843701038152,2.9056291691163256,0.05713596196252175
603,2021-10-26 00:00:00,-0.0099102819174893,532.78,534.35,536.71,531.59,1.0,0.3456291663933708,0.2692888970281171,2.173566752737164,0.9924101912695099
604,2021-10-27 00:00:00,-0.0105971563981043,527.5,532.78,532.78,526.05,0.875,-0.011929283426312054,-0.09329603274777831,-0.426228026759472,-0.9730386247644408
605,2021-10-28 00:00:00,0.0100208848268858,521.91,527.51,527.51,520.53,0.8823529411764706,0.14416835564455166,0.04693406099111286,0.15498595521036954,-0.46091774044941125
606,2021-10-29 00:00:00,0.0100208848268858,521.91,527.51,527.51,520.53,0.8823529411764706,-0.03939019360909146,-0.0118218999508235,-0.8675823292313513,-0.6350599983378228
607,2021-10-30 00:00:00,0.0100208848268858,521.91,527.51,527.51,520.53,0.8823529411764706,-0.0128819276167631,-0.006296410640405092,-0.6828620104996331,-0.544002623404134
608,2021-10-31 00:00:00,0.0100208848268858,521.91,527.51,527.51,520.53,0.8823529411764706,0.01683244156290442,0.023100246558430015,-0.5161208917480593,-0.5248995231219378
