module gitlab.com/etke.cc/tools/opmlmd

go 1.20

require (
	github.com/JohannesKaufmann/html-to-markdown v1.3.6
	github.com/gilliek/go-opml v1.0.0
	github.com/mmcdole/gofeed v1.2.0
)

require (
	github.com/PuerkitoBio/goquery v1.8.0 // indirect
	github.com/andybalholm/cascadia v1.3.1 // indirect
	github.com/json-iterator/go v1.1.12 // indirect
	github.com/mmcdole/goxpp v0.0.0-20200921145534-2f3784f67354 // indirect
	github.com/modern-go/concurrent v0.0.0-20180306012644-bacd9c7ef1dd // indirect
	github.com/modern-go/reflect2 v1.0.2 // indirect
	github.com/stretchr/testify v1.8.1 // indirect
	github.com/yuin/goldmark v1.5.4 // indirect
	golang.org/x/net v0.6.0 // indirect
	golang.org/x/text v0.7.0 // indirect
)
