module gitlab.com/etke.cc/docker-registry-proxy

go 1.21.0

toolchain go1.21.4

require (
	github.com/VictoriaMetrics/metrics v1.34.0
	github.com/getsentry/sentry-go v0.28.1
	github.com/hashicorp/golang-lru/v2 v2.0.7
	github.com/labstack/echo/v4 v4.12.0
	github.com/mileusna/useragent v1.3.4
	github.com/rs/zerolog v1.33.0
	github.com/ziflex/lecho/v3 v3.7.0
	gitlab.com/etke.cc/go/apm v1.2.5
	gitlab.com/etke.cc/go/echo-basic-auth v1.1.0
	gitlab.com/etke.cc/go/env v1.2.0
	gitlab.com/etke.cc/go/healthchecks/v2 v2.2.0
)

require (
	github.com/archdx/zerolog-sentry v1.8.3 // indirect
	github.com/buger/jsonparser v1.1.1 // indirect
	github.com/golang-jwt/jwt v3.2.2+incompatible // indirect
	github.com/google/uuid v1.6.0 // indirect
	github.com/labstack/gommon v0.4.2 // indirect
	github.com/mattn/go-colorable v0.1.13 // indirect
	github.com/mattn/go-isatty v0.0.20 // indirect
	github.com/valyala/bytebufferpool v1.0.0 // indirect
	github.com/valyala/fastrand v1.1.0 // indirect
	github.com/valyala/fasttemplate v1.2.2 // indirect
	github.com/valyala/histogram v1.2.0 // indirect
	golang.org/x/crypto v0.24.0 // indirect
	golang.org/x/net v0.26.0 // indirect
	golang.org/x/sys v0.21.0 // indirect
	golang.org/x/text v0.16.0 // indirect
	golang.org/x/time v0.5.0 // indirect
)
