module gitlab.com/etke.cc/go/apm

go 1.21.0

require (
	github.com/archdx/zerolog-sentry v1.8.3
	github.com/getsentry/sentry-go v0.27.0
	github.com/labstack/echo/v4 v4.12.0
	github.com/rs/zerolog v1.33.0
	github.com/ziflex/lecho/v3 v3.6.0
)

require (
	github.com/buger/jsonparser v1.1.1 // indirect
	github.com/golang-jwt/jwt v3.2.2+incompatible // indirect
	github.com/labstack/gommon v0.4.2 // indirect
	github.com/mattn/go-colorable v0.1.13 // indirect
	github.com/mattn/go-isatty v0.0.20 // indirect
	github.com/valyala/bytebufferpool v1.0.0 // indirect
	github.com/valyala/fasttemplate v1.2.2 // indirect
	golang.org/x/crypto v0.23.0 // indirect
	golang.org/x/net v0.25.0 // indirect
	golang.org/x/sys v0.20.0 // indirect
	golang.org/x/text v0.15.0 // indirect
	golang.org/x/time v0.5.0 // indirect
)
