{
  "files": {
    "main.css": "/static/css/main.8c8b27cf.chunk.css",
    "main.js": "/static/js/main.5fd8cffc.chunk.js",
    "main.js.map": "/static/js/main.5fd8cffc.chunk.js.map",
    "runtime-main.js": "/static/js/runtime-main.0c6b8502.js",
    "runtime-main.js.map": "/static/js/runtime-main.0c6b8502.js.map",
    "static/js/2.572a2715.chunk.js": "/static/js/2.572a2715.chunk.js",
    "static/js/2.572a2715.chunk.js.map": "/static/js/2.572a2715.chunk.js.map",
    "static/js/3.72b98ebb.chunk.js": "/static/js/3.72b98ebb.chunk.js",
    "static/js/3.72b98ebb.chunk.js.map": "/static/js/3.72b98ebb.chunk.js.map",
    "index.html": "/index.html",
    "static/css/main.8c8b27cf.chunk.css.map": "/static/css/main.8c8b27cf.chunk.css.map",
    "static/js/2.572a2715.chunk.js.LICENSE.txt": "/static/js/2.572a2715.chunk.js.LICENSE.txt"
  },
  "entrypoints": [
    "static/js/runtime-main.0c6b8502.js",
    "static/js/2.572a2715.chunk.js",
    "static/css/main.8c8b27cf.chunk.css",
    "static/js/main.5fd8cffc.chunk.js"
  ]
}