module gitlab.com/ethan.reesor/go-gl-tests

go 1.12

require (
	github.com/go-gl/gl v0.0.0-20190320180904-bf2b1f2f34d7
	github.com/go-gl/glfw v0.0.0-20190409004039-e6da0acd62b1
	github.com/go-gl/mathgl v0.0.0-20190416160123-c4601bc793c7
	golang.org/x/image v0.0.0-20190321063152-3fc05d484e9f
	golang.org/x/xerrors v0.0.0-20190513163551-3ee3066db522
)
