<?xml version="1.0" encoding="UTF-8" standalone="no"?>
<svg xmlns:xlink="http://www.w3.org/1999/xlink" height="56.0px" width="208.5px" xmlns="http://www.w3.org/2000/svg">
  <g transform="matrix(1.0, 0.0, 0.0, 1.0, 103.5, 28.5)">
    <path d="M104.5 27.0 L-103.0 27.0 -103.0 -28.0 104.5 -28.0 104.5 27.0" fill="url(#gradient0)" fill-rule="evenodd" stroke="none"/>
    <path d="M104.5 27.0 L-103.0 27.0 -103.0 -28.0 104.5 -28.0 104.5 27.0 Z" fill="none" stroke="#ffffff" stroke-linecap="round" stroke-linejoin="round" stroke-width="1.0"/>
  </g>
  <defs>
    <linearGradient gradientTransform="matrix(0.0, -0.0336, 0.1266, 0.0, 0.75, -0.5)" gradientUnits="userSpaceOnUse" id="gradient0" spreadMethod="pad" x1="-819.2" x2="819.2">
      <stop offset="0.0" stop-color="#086c7d"/>
      <stop offset="1.0" stop-color="#398890"/>
    </linearGradient>
  </defs>
</svg>
