<?xml version="1.0" encoding="UTF-8" standalone="no"?>
<svg xmlns:xlink="http://www.w3.org/1999/xlink" height="1.5px" width="3.0px" xmlns="http://www.w3.org/2000/svg">
  <g transform="matrix(1.0, 0.0, 0.0, 1.0, 0.5, 0.25)">
    <path d="M1.0 -0.25 L2.5 -0.25 2.5 1.25 1.0 1.25 1.0 -0.25" fill="#00b1ff" fill-rule="evenodd" stroke="none"/>
    <path d="M1.0 -0.25 L1.0 1.25 -0.5 1.25 -0.5 -0.25 1.0 -0.25" fill="#ffe000" fill-rule="evenodd" stroke="none"/>
  </g>
</svg>
