<?xml version="1.0" encoding="UTF-8" standalone="no"?>
<svg xmlns:xlink="http://www.w3.org/1999/xlink" height="19.0px" width="22.0px" xmlns="http://www.w3.org/2000/svg">
  <g transform="matrix(1.0, 0.0, 0.0, 1.0, 12.0, 15.0)">
    <pattern height="19" id="PatternID_148_1" overflow="visible" patternTransform="matrix(1.0, 0.0, 0.0, 1.0, -12.0, -15.0)" patternUnits="userSpaceOnUse" viewBox="0 0 22 19" width="22">
      <image height="19" width="22" xlink:href="data:image/PNG;base64,iVBORw0KGgoAAAANSUhEUgAAABYAAAATCAYAAACUef2IAAAAY0lEQVR42mNgoAz8R8NUAf9xYJoZ/J9WhtLU4P9Dw+Cq0lIMg0m1Fauh6AaT6x18rv1PSQyTHQwkuxqvwdi8RG62hguaGBqCDQ7y86NuYgcZiC12B6/BNAsKXMlmUJatVK8NANXqwk3v/fpEAAAAAElFTkSuQmCC"/>
    </pattern>
    <path d="M-12.0 -15.0 L10.0 -15.0 10.0 4.0 -12.0 4.0 -12.0 -15.0" style="fill:url(#PatternID_148_1)"/>
  </g>
</svg>
