<?xml version="1.0" encoding="UTF-8" standalone="no"?>
<svg xmlns:xlink="http://www.w3.org/1999/xlink" height="7.0px" width="7.0px" xmlns="http://www.w3.org/2000/svg">
  <g transform="matrix(1.0, 0.0, 0.0, 1.0, 3.0, 3.0)">
    <pattern height="7" id="PatternID_218_1" overflow="visible" patternTransform="matrix(1.0, 0.0, 0.0, 1.0, -3.0, -3.0)" patternUnits="userSpaceOnUse" viewBox="0 0 7 7" width="7">
      <image height="7" width="7" xlink:href="data:image/PNG;base64,iVBORw0KGgoAAAANSUhEUgAAAAcAAAAHCAYAAADEUlfTAAAAHklEQVR42mNgQAL/gYABF8AriVU1TAcyTbopREsCADlXI91m2/buAAAAAElFTkSuQmCC"/>
    </pattern>
    <path d="M-3.0 -3.0 L4.0 -3.0 4.0 4.0 -3.0 4.0 -3.0 -3.0" style="fill:url(#PatternID_218_1)"/>
  </g>
</svg>
