<?xml version="1.0" encoding="UTF-8" standalone="no"?>
<svg xmlns:xlink="http://www.w3.org/1999/xlink" height="17.0px" width="14.0px" xmlns="http://www.w3.org/2000/svg">
  <g transform="matrix(1.0, 0.0, 0.0, 1.0, 16.0, 25.0)">
    <pattern height="17" id="PatternID_178_1" overflow="visible" patternTransform="matrix(1.0, 0.0, 0.0, 1.0, -16.0, -25.0)" patternUnits="userSpaceOnUse" viewBox="0 0 14 17" width="14">
      <image height="17" width="14" xlink:href="data:image/PNG;base64,iVBORw0KGgoAAAANSUhEUgAAAA4AAAARCAYAAADtyJ2fAAAAnUlEQVR42mNgQAPW1hb/0TEDIaCqqvgfhLFpxmsATCPJBoAUc02oBmNcBujoaIAxVo15/19iNQCmCadGZAwzhCiNIMXItlqf2EhYI9xfQMXIBuDVCAIyMlIo/kL2K0GNMIwePTg1YdOMbABQyhGKIQCLSY4wTUiKHVE0CgsLo7gd3QAMDeiSyAbA2AxEAgwDCAYGPgOwOZEoA3BJAgAyRtNfx66j3QAAAABJRU5ErkJggg=="/>
    </pattern>
    <path d="M-16.0 -25.0 L-2.0 -25.0 -2.0 -8.0 -16.0 -8.0 -16.0 -25.0" style="fill:url(#PatternID_178_1)"/>
  </g>
</svg>
