<?xml version="1.0" encoding="UTF-8" standalone="no"?>
<svg xmlns:xlink="http://www.w3.org/1999/xlink" height="1.0px" width="2.0px" xmlns="http://www.w3.org/2000/svg">
  <g transform="matrix(1.0, 0.0, 0.0, 1.0, 1.0, 0.0)">
    <pattern height="1" id="PatternID_498_1" overflow="visible" patternTransform="matrix(1.0, 0.0, 0.0, 1.0, -1.0, 0.0)" patternUnits="userSpaceOnUse" viewBox="0 0 2 1" width="2">
      <image height="1" width="2" xlink:href="data:image/PNG;base64,iVBORw0KGgoAAAANSUhEUgAAAAIAAAABCAIAAAB7QOjdAAAADUlEQVR42mPYysAARAAGZAFr+zMwMAAAAABJRU5ErkJggg=="/>
    </pattern>
    <path d="M1.0 1.0 L-1.0 1.0 -1.0 0.0 1.0 0.0 1.0 1.0" style="fill:url(#PatternID_498_1)"/>
  </g>
</svg>
