<?xml version="1.0" encoding="UTF-8" standalone="no"?>
<svg xmlns:xlink="http://www.w3.org/1999/xlink" height="4.0px" width="5.5px" xmlns="http://www.w3.org/2000/svg">
  <g transform="matrix(1.0, 0.0, 0.0, 1.0, -12.0, 16.5)">
    <path d="M17.5 -16.5 L17.5 -12.5 12.0 -12.5 12.0 -14.0 14.5 -14.0 14.5 -16.5 17.5 -16.5" fill="#00ff00" fill-opacity="0.11764706" fill-rule="evenodd" stroke="none"/>
  </g>
</svg>
