<?xml version="1.0" encoding="UTF-8" standalone="no"?>
<svg xmlns:xlink="http://www.w3.org/1999/xlink" height="6.0px" width="4.0px" xmlns="http://www.w3.org/2000/svg">
  <g transform="matrix(1.0, 0.0, 0.0, 1.0, -3.0, 16.0)">
    <path d="M4.0 -15.0 L3.0 -15.0 3.0 -16.0 4.0 -16.0 4.0 -15.0" fill="#ffc57b" fill-rule="evenodd" stroke="none"/>
    <path d="M4.0 -12.0 L6.0 -12.0 6.0 -10.0 4.0 -10.0 4.0 -12.0 M6.0 -16.0 L7.0 -16.0 7.0 -15.0 6.0 -15.0 6.0 -16.0" fill="#fd9964" fill-rule="evenodd" stroke="none"/>
    <path d="M4.0 -12.0 L3.0 -12.0 3.0 -13.0 4.0 -13.0 4.0 -12.0 M6.0 -12.0 L6.0 -13.0 7.0 -13.0 7.0 -12.0 6.0 -12.0" fill="#465172" fill-rule="evenodd" stroke="none"/>
  </g>
</svg>
