<?xml version="1.0" encoding="UTF-8" standalone="no"?>
<svg xmlns:xlink="http://www.w3.org/1999/xlink" height="37.0px" width="393.55px" xmlns="http://www.w3.org/2000/svg">
  <g transform="matrix(1.0, 0.0, 0.0, 1.0, 0.0, 18.5)">
    <path d="M393.55 -18.5 L393.55 18.5 0.0 18.5 0.0 -18.5 393.55 -18.5" fill="#00cc00" fill-opacity="0.9882353" fill-rule="evenodd" stroke="none"/>
  </g>
</svg>
