<?xml version="1.0" encoding="UTF-8" standalone="no"?>
<svg xmlns:xlink="http://www.w3.org/1999/xlink" height="48.0px" width="46.0px" xmlns="http://www.w3.org/2000/svg">
  <g transform="matrix(1.0, 0.0, 0.0, 1.0, 4.0, 9.0)">
    <path d="M42.0 39.0 L-4.0 39.0 -4.0 -9.0 9.75 -9.0 9.75 4.0 14.0 4.0 14.0 2.0 15.0 2.0 15.0 1.0 22.0 1.0 22.0 2.0 23.0 2.0 23.0 6.0 25.3 6.0 25.3 1.0 32.8 1.0 32.8 6.0 42.0 6.0 42.0 39.0" fill="#00ff00" fill-rule="evenodd" stroke="none"/>
  </g>
</svg>
