<?xml version="1.0" encoding="UTF-8" standalone="no"?>
<svg xmlns:xlink="http://www.w3.org/1999/xlink" height="5.0px" width="6.0px" xmlns="http://www.w3.org/2000/svg">
  <g transform="matrix(1.0, 0.0, 0.0, 1.0, 2.0, 14.0)">
    <path d="M-1.0 -9.0 L-2.0 -9.0 -2.0 -10.0 -1.0 -10.0 -1.0 -9.0" fill="#281c3c" fill-rule="evenodd" stroke="none"/>
    <path d="M3.0 -13.0 L3.0 -14.0 4.0 -14.0 4.0 -13.0 3.0 -13.0" fill="#281c3c" fill-rule="evenodd" stroke="none"/>
  </g>
</svg>
