<?xml version="1.0" encoding="UTF-8" standalone="no"?>
<svg xmlns:xlink="http://www.w3.org/1999/xlink" height="23.85px" width="396.0px" xmlns="http://www.w3.org/2000/svg">
  <g transform="matrix(1.0, 0.0, 0.0, 1.0, -6.85, -6.85)">
    <path d="M396.9 13.8 Q392.35 16.7 387.45 19.2 380.65 22.65 375.95 27.6 L376.9 27.5 378.35 27.1 M394.5 10.95 Q386.3 14.9 379.2 20.8 L375.9 23.2 372.75 25.4 Q371.4 26.35 370.35 27.7 M385.0 11.9 Q381.45 13.95 378.0 16.4 L375.35 18.35 369.9 22.55 367.3 24.65 364.8 26.9 365.95 26.65 M397.85 25.2 Q395.4 25.6 393.05 26.95 L391.75 27.75 390.65 28.45 M398.8 18.05 Q390.1 22.05 383.8 28.05 M365.5 13.8 Q359.75 17.45 354.45 21.8 L351.25 24.35 Q348.5 26.55 345.5 28.55 L344.15 29.6 M347.9 13.8 Q346.7 14.95 345.15 15.6 343.85 16.15 342.6 17.0 337.15 20.8 331.85 24.95 L328.3 28.0 Q327.35 28.9 328.35 29.0 M341.7 11.9 Q334.75 15.45 328.75 20.3 L326.1 22.45 324.1 24.25 321.85 26.3 Q321.5 26.65 321.5 27.1 M357.4 12.85 Q349.3 18.25 341.35 24.0 L339.3 25.7 Q338.6 26.4 338.2 27.25 M374.5 13.8 Q366.2 18.9 358.35 24.75 L356.5 26.2 354.8 27.8 M305.05 11.4 Q298.0 17.3 289.95 21.65 288.15 22.6 286.6 23.9 L284.6 25.7 283.9 26.75 M312.2 11.4 L296.4 21.7 289.5 26.35 289.2 26.75 Q289.6 27.1 290.3 27.1 M324.1 13.3 L308.9 24.35 305.95 26.6 304.05 27.95 Q303.15 28.5 302.95 29.55 M333.1 12.35 Q325.0 17.7 317.4 23.8 L314.25 26.35 Q313.85 26.65 313.6 27.1 M318.85 11.4 L303.15 22.35 295.8 27.85 M279.35 10.45 L268.25 18.8 265.15 21.05 Q260.55 24.05 257.0 27.1 M260.8 11.4 L245.5 22.3 241.7 24.65 Q239.0 26.2 238.2 28.05 L238.9 28.05 M269.85 11.9 Q261.7 16.65 254.05 22.2 252.25 23.55 250.25 24.7 248.45 25.7 247.0 27.1 L247.95 27.35 248.9 27.1 M286.95 11.4 Q281.35 14.55 275.95 18.9 270.75 23.1 265.6 26.9 M295.55 11.9 L278.9 22.35 Q275.4 24.55 275.05 28.05 M245.55 9.5 Q240.0 12.65 234.9 17.4 L231.85 20.1 224.9 25.45 M227.0 10.95 Q219.55 16.3 211.75 21.35 208.0 23.75 204.6 26.6 L203.5 27.8 M254.15 10.0 Q246.65 15.9 238.4 21.3 L230.85 26.7 Q230.35 27.15 230.15 27.7 L231.3 27.6 M234.6 10.95 Q227.0 17.0 218.75 22.15 215.3 24.3 212.5 27.35 M173.2 10.45 Q169.65 11.85 166.4 14.6 L163.65 16.6 Q156.65 20.9 151.9 26.75 M180.85 10.45 L176.1 13.9 172.15 16.95 161.4 24.4 159.8 25.6 159.1 26.3 M187.5 11.4 Q179.85 16.5 171.35 21.0 168.8 22.35 166.45 24.15 L164.35 25.85 Q162.85 27.15 163.7 27.6 M209.4 9.5 Q201.85 15.65 193.65 20.85 L186.05 26.1 Q184.6 27.2 185.6 27.6 M216.55 11.4 L201.3 22.85 196.2 26.25 195.2 27.2 M198.0 12.35 Q189.35 16.95 181.2 22.7 L175.6 27.1 M163.7 10.45 Q157.9 13.75 152.6 17.85 L149.5 20.1 146.45 22.2 Q144.2 23.7 142.65 25.6 141.7 26.75 142.75 27.1 M156.1 9.95 Q152.85 10.7 150.2 13.15 L146.0 16.5 Q141.65 19.45 137.8 23.05 L135.75 24.9 135.15 25.7 M134.65 10.9 L125.55 17.45 114.35 26.35 113.25 27.6 M145.6 9.95 Q137.3 15.3 129.4 21.35 127.15 23.1 125.65 25.2 M128.5 9.5 Q123.6 11.8 119.4 15.65 116.45 18.35 112.95 20.2 111.15 21.15 109.45 22.3 107.0 24.0 104.85 25.85 L104.2 26.65 M119.45 9.95 Q111.7 15.25 104.1 20.75 100.9 23.05 99.0 26.15 M111.85 10.45 Q103.6 14.45 96.2 20.6 L91.35 24.25 Q89.8 25.35 90.9 25.7 M102.3 10.45 L86.95 20.7 83.35 22.9 Q80.75 24.4 79.45 26.65 M94.2 9.5 Q89.1 12.35 84.15 16.0 L72.85 24.3 Q71.15 25.5 70.45 27.3 L70.9 27.6 M75.2 10.9 Q72.65 13.5 69.1 15.4 L65.55 17.45 62.0 19.7 56.7 23.4 Q54.5 25.0 53.1 27.3 M68.05 11.4 Q64.15 12.9 60.75 15.5 L54.15 20.25 Q50.35 22.8 47.7 26.2 L47.1 27.1 M53.75 9.95 Q47.8 13.55 42.45 18.15 L37.75 21.6 34.8 23.8 32.0 26.75 M60.9 10.45 Q52.5 14.9 45.2 21.4 L38.8 27.35 Q38.55 27.6 38.55 28.05 M84.25 10.45 L68.1 21.5 Q64.45 24.0 61.05 26.85 60.45 27.35 60.45 28.05 M44.25 9.95 Q40.5 11.7 37.2 14.4 L34.6 16.45 Q30.45 19.65 26.5 23.15 24.7 24.75 23.8 26.65 M35.7 10.9 Q32.15 12.4 29.3 15.0 L27.25 16.8 22.25 20.75 17.2 24.75 Q15.85 25.95 16.65 26.15 M20.0 10.45 Q15.85 12.05 12.3 16.1 L10.9 17.5 Q9.05 19.05 8.1 20.9 M14.25 8.55 L8.2 15.3 M27.1 9.95 L12.45 22.5" fill="none" stroke="#cc0000" stroke-linecap="round" stroke-linejoin="round" stroke-width="1.5"/>
    <path d="M402.1 9.0 L399.7 9.0 399.5 18.55 399.25 25.2 399.25 28.05 401.4 28.05 M399.7 7.6 L399.7 9.0 383.05 9.0 365.95 9.0 350.7 9.0 333.1 9.0 316.9 9.0 303.1 9.0 288.85 9.0 273.6 9.0 257.9 9.0 242.2 9.0 227.45 9.0 212.7 9.0 198.45 9.0 178.9 9.0 160.85 9.0 145.15 9.0 127.05 9.0 108.5 9.0 89.0 9.0 69.95 9.0 50.45 9.0 30.95 9.0 11.9 9.0 9.05 9.0 8.8 27.1 M399.25 28.05 L399.25 29.95 M8.55 28.05 L26.65 28.05 46.15 28.05 65.65 28.05 83.3 28.05 102.3 28.05 118.5 28.05 137.05 28.05 155.6 28.05 174.15 28.05 193.2 28.05 212.7 28.05 230.8 28.05 248.9 28.05 267.9 28.05 286.45 28.05 305.05 28.05 323.6 28.05 343.55 28.05 362.6 28.05 382.1 28.05 399.25 28.05 M9.05 8.55 L9.05 9.0 7.6 9.0" fill="none" stroke="#cc0000" stroke-linecap="round" stroke-linejoin="round" stroke-width="1.5"/>
  </g>
</svg>
