<?xml version="1.0" encoding="UTF-8" standalone="no"?>
<svg xmlns:xlink="http://www.w3.org/1999/xlink" height="7.0px" width="10.0px" xmlns="http://www.w3.org/2000/svg">
  <g transform="matrix(1.0, 0.0, 0.0, 1.0, 7.0, 3.0)">
    <pattern height="7" id="PatternID_1226_1" overflow="visible" patternTransform="matrix(1.0, 0.0, 0.0, 1.0, -7.0, -3.0)" patternUnits="userSpaceOnUse" viewBox="0 0 10 7" width="10">
      <image height="7" width="10" xlink:href="data:image/PNG;base64,iVBORw0KGgoAAAANSUhEUgAAAAoAAAAHCAYAAAAxrNxjAAAAPElEQVR42mNgAII/f/6sg2EGXAAk+evXr6z/QACicSqGKYRhvKZjk5ylrPYfGeN0EtEKkRWDAAMxAKQQABRWWxneux+lAAAAAElFTkSuQmCC"/>
    </pattern>
    <path d="M3.0 0.0 L-1.15 0.0 -1.15 4.0 -7.0 4.0 -7.0 -3.0 3.0 -3.0 3.0 0.0" style="fill:url(#PatternID_1226_1)"/>
  </g>
</svg>
