<?xml version="1.0" encoding="UTF-8" standalone="no"?>
<svg xmlns:xlink="http://www.w3.org/1999/xlink" height="18.0px" width="13.0px" xmlns="http://www.w3.org/2000/svg">
  <g transform="matrix(1.0, 0.0, 0.0, 1.0, 6.0, 18.0)">
    <pattern height="18" id="PatternID_254_1" overflow="visible" patternTransform="matrix(1.0, 0.0, 0.0, 1.0, -6.0, -18.0)" patternUnits="userSpaceOnUse" viewBox="0 0 13 18" width="13">
      <image height="18" width="13" xlink:href="data:image/PNG;base64,iVBORw0KGgoAAAANSUhEUgAAAA0AAAASCAYAAACAa1QyAAAAUElEQVR42mNgIAL8v8TwH4QZBl7x0UYEJsnkKUnC/0GYgRQA0kC082AA5LRRTYNXEywlwDThTU7XZjL8B2FkTcgYZMC7XTg0w9IgOmagBgAAzUKHtjtRLacAAAAASUVORK5CYII="/>
    </pattern>
    <path d="M-6.0 -18.0 L7.0 -18.0 7.0 0.0 -6.0 0.0 -6.0 -18.0" style="fill:url(#PatternID_254_1)"/>
  </g>
</svg>
