<?xml version="1.0" encoding="UTF-8" standalone="no"?>
<svg xmlns:xlink="http://www.w3.org/1999/xlink" height="38.0px" width="42.0px" xmlns="http://www.w3.org/2000/svg">
  <g transform="matrix(1.0, 0.0, 0.0, 1.0, 0.0, -1.0)">
    <path d="M42.0 39.0 L0.0 39.0 0.0 4.0 14.0 4.0 14.0 2.0 15.0 2.0 15.0 1.0 22.0 1.0 22.0 2.0 23.0 2.0 23.0 6.0 27.15 6.0 27.15 12.6 42.0 12.6 42.0 39.0" fill="#00ff00" fill-rule="evenodd" stroke="none"/>
  </g>
</svg>
