<?xml version="1.0" encoding="UTF-8" standalone="no"?>
<svg xmlns:xlink="http://www.w3.org/1999/xlink" height="22.0px" width="33.0px" xmlns="http://www.w3.org/2000/svg">
  <g transform="matrix(1.0, 0.0, 0.0, 1.0, 16.5, 22.0)">
    <pattern height="22" id="PatternID_1867_1" overflow="visible" patternTransform="matrix(1.0, 0.0, 0.0, 1.0, -16.5, -22.0)" patternUnits="userSpaceOnUse" viewBox="0 0 33 22" width="33">
      <image height="22" width="33" xlink:href="data:image/PNG;base64,iVBORw0KGgoAAAANSUhEUgAAACEAAAAWCAYAAABOm/V6AAAAaElEQVR42u3VMQoAIAgFUI/Z/ZeOYVNRIIKZ+oeEVv8bUokc1bjzfFRRO6AEIgHSIFp4OMYSHoLxANyQF+HXmIhwEyYDoEIyASKkAnBAKgEL8hFQCIiPCTOiMMsKZm3DHDCoU+5BWXsOYUQZNd5BmV0AAAAASUVORK5CYII="/>
    </pattern>
    <path d="M-16.5 -22.0 L16.5 -22.0 16.5 0.0 -16.5 0.0 -16.5 -22.0" style="fill:url(#PatternID_1867_1)"/>
  </g>
</svg>
