<?xml version="1.0" encoding="UTF-8" standalone="no"?>
<svg xmlns:xlink="http://www.w3.org/1999/xlink" height="10.65px" width="13.0px" xmlns="http://www.w3.org/2000/svg">
  <g transform="matrix(1.0, 0.0, 0.0, 1.0, 5.0, 27.65)">
    <pattern height="14" id="PatternID_286_1" overflow="visible" patternTransform="matrix(1.0, 0.0, 0.0, 1.0, -5.0, -31.0)" patternUnits="userSpaceOnUse" viewBox="0 0 13 14" width="13">
      <image height="14" width="13" xlink:href="data:image/PNG;base64,iVBORw0KGgoAAAANSUhEUgAAAA0AAAAOCAYAAAD0f5bSAAAAVUlEQVR42mNgIBJoyNj8Z6AqoL6JpNhM0HaYImQ8adKk/3l5ef9xavD28v6PTSNWP8M0gEzEpgmrEwlpwNBISCGGJpgf8AUGuhhRIUh08BM0mdQkBQD34mrRwvG3rgAAAABJRU5ErkJggg=="/>
    </pattern>
    <path d="M8.0 -17.0 L-5.0 -17.0 -5.0 -27.65 6.65 -27.65 6.65 -23.7 8.0 -23.7 8.0 -17.0" style="fill:url(#PatternID_286_1)"/>
    <path d="M5.0 -26.0 L5.0 -25.0 4.0 -25.0 4.0 -26.0 5.0 -26.0" fill="#281c3c" fill-rule="evenodd" stroke="none"/>
  </g>
</svg>
