<?xml version="1.0" encoding="UTF-8" standalone="no"?>
<svg xmlns:xlink="http://www.w3.org/1999/xlink" height="24.2px" width="13.0px" xmlns="http://www.w3.org/2000/svg">
  <g transform="matrix(1.0, 0.0, 0.0, 1.0, 6.0, 27.2)">
    <pattern height="18" id="PatternID_274_1" overflow="visible" patternTransform="matrix(1.0, 0.0, 0.0, 1.0, -6.0, -21.0)" patternUnits="userSpaceOnUse" viewBox="0 0 13 18" width="13">
      <image height="18" width="13" xlink:href="data:image/PNG;base64,iVBORw0KGgoAAAANSUhEUgAAAA0AAAASCAYAAACAa1QyAAAAUElEQVR42mNgIAL8v8TwH4QZBl7x0UYEJsnkKUnC/0GYgRQA0kC082AA5LRRTYNXEywlwDThTU7XZjL8B2FkTcgYZMC7XTg0w9IgOmagBgAAzUKHtjtRLacAAAAASUVORK5CYII="/>
    </pattern>
    <path d="M7.0 -3.0 L-6.0 -3.0 -6.0 -21.0 7.0 -21.0 7.0 -3.0" style="fill:url(#PatternID_274_1)"/>
    <pattern height="14" id="PatternID_274_2" overflow="visible" patternTransform="matrix(1.0, 0.0, 0.0, 1.0, -6.0, -30.0)" patternUnits="userSpaceOnUse" viewBox="0 0 13 14" width="13">
      <image height="14" width="13" xlink:href="data:image/PNG;base64,iVBORw0KGgoAAAANSUhEUgAAAA0AAAAOCAYAAAD0f5bSAAAAVUlEQVR42mNgIBJoyNj8Z6AqoL6JpNhM0HaYImQ8adKk/3l5ef9xavD28v6PTSNWP8M0gEzEpgmrEwlpwNBISCGGJpgf8AUGuhhRIUh08BM0mdQkBQD34mrRwvG3rgAAAABJRU5ErkJggg=="/>
    </pattern>
    <path d="M7.0 -16.0 L-6.0 -16.0 -6.0 -27.2 -2.8 -27.2 Q-2.7 -27.05 -2.4 -27.05 L-2.7 -26.5 Q-2.7 -25.95 -2.15 -25.95 -1.7 -25.95 -0.55 -27.1 L-0.45 -27.2 5.6 -27.2 5.6 -22.45 7.0 -22.45 7.0 -16.0" style="fill:url(#PatternID_274_2)"/>
  </g>
</svg>
