<?xml version="1.0" encoding="UTF-8" standalone="no"?>
<svg xmlns:xlink="http://www.w3.org/1999/xlink" height="33.45px" width="24.55px" xmlns="http://www.w3.org/2000/svg">
  <g transform="matrix(1.0, 0.0, 0.0, 1.0, 11.15, 15.9)">
    <path d="M-11.15 -14.9 Q-11.15 -16.05 -10.15 -15.85 -9.15 -15.6 -9.15 -14.85 -9.15 -14.0 -10.15 -14.0 -11.15 -14.0 -11.15 -14.9 M-3.3 -7.8 Q-3.95 -6.45 -5.4 -6.45 -6.9 -6.45 -7.7 -7.8 L-8.25 -9.15 Q-8.25 -11.95 -5.55 -12.05 -2.85 -12.2 -2.85 -9.45 -2.85 -8.6 -3.3 -7.8 M4.35 0.85 Q7.95 0.4 7.95 4.5 7.95 5.85 7.35 6.8 6.45 8.25 4.4 8.25 1.9 8.25 1.1 6.15 0.65 5.1 0.75 3.95 0.75 1.35 4.35 0.85 M9.0 10.95 Q9.0 11.85 8.05 11.85 7.3 11.85 7.2 10.95 7.2 10.05 8.1 10.05 9.0 10.1 9.0 10.95 M9.85 14.8 Q10.6 13.8 11.7 13.8 13.4 13.8 13.4 15.65 13.4 16.25 13.0 16.75 12.45 17.55 11.4 17.55 9.35 17.55 9.35 16.0 9.35 15.5 9.85 14.8" fill="#393987" fill-rule="evenodd" stroke="none"/>
  </g>
</svg>
