<?xml version="1.0" encoding="UTF-8" standalone="no"?>
<svg xmlns:xlink="http://www.w3.org/1999/xlink" height="9.75px" width="529.4px" xmlns="http://www.w3.org/2000/svg">
  <g transform="matrix(1.0, 0.0, 0.0, 1.0, 1.35, 7.9)">
    <path d="M0.7 -0.05 Q0.7 0.85 0.0 0.8 -0.15 0.65 -0.4 0.6 -1.15 0.25 -0.65 -0.25 -0.2 -0.55 0.65 -0.25 L0.7 -0.05 M88.35 1.1 Q99.6 -11.8 114.15 -5.1 L123.85 -0.85 Q129.9 1.8 139.35 1.25 L527.55 0.95 M0.1 1.35 L87.8 1.3" fill="none" stroke="#393987" stroke-linecap="round" stroke-linejoin="round" stroke-width="1.0"/>
  </g>
</svg>
