<?xml version="1.0" encoding="UTF-8" standalone="no"?>
<svg xmlns:xlink="http://www.w3.org/1999/xlink" height="25.65px" width="18.55px" xmlns="http://www.w3.org/2000/svg">
  <g transform="matrix(1.0, 0.0, 0.0, 1.0, 9.55, 27.8)">
    <pattern height="18" id="PatternID_278_1" overflow="visible" patternTransform="matrix(0.943, 0.3328, -0.3328, 0.943, -3.55, -23.45)" patternUnits="userSpaceOnUse" viewBox="0 0 13 18" width="13">
      <image height="18" width="13" xlink:href="data:image/PNG;base64,iVBORw0KGgoAAAANSUhEUgAAAA0AAAASCAYAAACAa1QyAAAAUElEQVR42mNgIAL8v8TwH4QZBl7x0UYEJsnkKUnC/0GYgRQA0kC082AA5LRRTYNXEywlwDThTU7XZjL8B2FkTcgYZMC7XTg0w9IgOmagBgAAzUKHtjtRLacAAAAASUVORK5CYII="/>
    </pattern>
    <path d="M2.7 -2.15 L-9.55 -6.5 -3.55 -23.45 8.7 -19.1 2.7 -2.15" style="fill:url(#PatternID_278_1)"/>
    <pattern height="14" id="PatternID_278_2" overflow="visible" patternTransform="matrix(1.0, 0.0, 0.0, 1.0, -4.0, -31.0)" patternUnits="userSpaceOnUse" viewBox="0 0 13 14" width="13">
      <image height="14" width="13" xlink:href="data:image/PNG;base64,iVBORw0KGgoAAAANSUhEUgAAAA0AAAAOCAYAAAD0f5bSAAAAVUlEQVR42mNgIBJoyNj8Z6AqoL6JpNhM0HaYImQ8adKk/3l5ef9xavD28v6PTSNWP8M0gEzEpgmrEwlpwNBISCGGJpgf8AUGuhhRIUh08BM0mdQkBQD34mrRwvG3rgAAAABJRU5ErkJggg=="/>
    </pattern>
    <path d="M9.0 -17.0 L-4.0 -17.0 -4.0 -27.8 7.55 -27.8 7.55 -23.65 9.0 -23.65 9.0 -17.0" style="fill:url(#PatternID_278_2)"/>
  </g>
</svg>
