<?xml version="1.0" encoding="UTF-8" standalone="no"?>
<svg xmlns:xlink="http://www.w3.org/1999/xlink" height="15.0px" width="14.0px" xmlns="http://www.w3.org/2000/svg">
  <g transform="matrix(1.0, 0.0, 0.0, 1.0, -1.0, -3.0)">
    <pattern height="15" id="PatternID_1637_1" overflow="visible" patternTransform="matrix(1.0, 0.0, 0.0, 1.0, 1.0, 3.0)" patternUnits="userSpaceOnUse" viewBox="0 0 14 15" width="14">
      <image height="15" width="14" xlink:href="data:image/PNG;base64,iVBORw0KGgoAAAANSUhEUgAAAA4AAAAPCAYAAADUFP50AAAAmElEQVR42mNgIAA0BTn/gzADuQCvZpjpMEXyPGz/0cWwagpRFIJjmGIQu8VEGrsBII69BC+KJnRD0A1kgDkJpBFmMi4DUDQi24ZNIUGNIAzTCDMI2fkwPlaNyBg5MLCJMaBLoisgSiO6YhD9d2YKVnkGdNPRNe4r9saIQ7hG9FSDbgNIc6KayH+CyQ0ZgzTh1YhLM0gDNk0ASNnYpdH0an8AAAAASUVORK5CYII="/>
    </pattern>
    <path d="M1.0 3.0 L15.0 3.0 15.0 18.0 1.0 18.0 1.0 3.0" style="fill:url(#PatternID_1637_1)"/>
  </g>
</svg>
