<?xml version="1.0" encoding="UTF-8" standalone="no"?>
<svg xmlns:xlink="http://www.w3.org/1999/xlink" height="1.0px" width="4.0px" xmlns="http://www.w3.org/2000/svg">
  <g transform="matrix(1.0, 0.0, 0.0, 1.0, 2.0, 0.0)">
    <path d="M2.0 1.0 L-2.0 1.0 -2.0 0.0 2.0 0.0 2.0 1.0" fill="#3c2417" fill-rule="evenodd" stroke="none"/>
  </g>
</svg>
