<?xml version="1.0" encoding="UTF-8" standalone="no"?>
<svg xmlns:xlink="http://www.w3.org/1999/xlink" height="2.0px" width="2.0px" xmlns="http://www.w3.org/2000/svg">
  <g transform="matrix(1.0, 0.0, 0.0, 1.0, -1.0, 0.0)">
    <pattern height="2" id="PatternID_809_1" overflow="visible" patternTransform="matrix(1.0, 0.0, 0.0, 1.0, 1.0, 0.0)" patternUnits="userSpaceOnUse" viewBox="0 0 2 2" width="2">
      <image height="2" width="2" xlink:href="data:image/PNG;base64,iVBORw0KGgoAAAANSUhEUgAAAAIAAAACCAYAAABytg0kAAAAFUlEQVR42mPYX+Lz/0l39H8GMAEEAFhoCBFJInR/AAAAAElFTkSuQmCC"/>
    </pattern>
    <path d="M1.0 0.0 L3.0 0.0 3.0 2.0 1.0 2.0 1.0 0.0" style="fill:url(#PatternID_809_1)"/>
  </g>
</svg>
