<?xml version="1.0" encoding="UTF-8" standalone="no"?>
<svg xmlns:xlink="http://www.w3.org/1999/xlink" height="6.0px" width="15.5px" xmlns="http://www.w3.org/2000/svg">
  <g transform="matrix(1.0, 0.0, 0.0, 1.0, 0.0, 6.0)">
    <path d="M3.0 -5.0 L2.0 -5.0 2.0 -6.0 3.0 -6.0 3.0 -5.0 M2.0 -3.5 L2.0 -2.5 1.0 -2.5 1.0 -3.5 0.0 -3.5 0.0 -4.5 1.0 -4.5 1.0 -3.5 2.0 -3.5" fill="#0f62b9" fill-rule="evenodd" stroke="none"/>
    <path d="M14.5 -4.0 L15.5 -4.0 15.5 -3.0 14.5 -3.0 14.5 -4.0 13.5 -4.0 13.5 -5.0 14.5 -5.0 14.5 -4.0 M14.0 -1.0 L13.0 -1.0 13.0 -2.0 14.0 -2.0 14.0 -1.0" fill="#23cdff" fill-rule="evenodd" stroke="none"/>
    <path d="M14.5 -2.5 L14.5 -1.5 13.5 -1.5 13.5 -2.5 14.5 -2.5 14.5 -3.5 15.5 -3.5 15.5 -2.5 14.5 -2.5 M13.5 -5.0 L13.5 -4.0 12.5 -4.0 12.5 -5.0 13.5 -5.0" fill="#0f62b9" fill-rule="evenodd" stroke="none"/>
    <path d="M1.5 -1.0 L2.5 -1.0 2.5 0.0 1.5 0.0 1.5 -1.0 M1.0 -4.0 L2.0 -4.0 2.0 -3.0 1.0 -3.0 1.0 -4.0 M1.0 -3.0 L1.0 -2.0 0.0 -2.0 0.0 -3.0 1.0 -3.0" fill="#23cdff" fill-rule="evenodd" stroke="none"/>
  </g>
</svg>
