<?xml version="1.0" encoding="UTF-8" standalone="no"?>
<svg xmlns:xlink="http://www.w3.org/1999/xlink" height="9.0px" width="8.0px" xmlns="http://www.w3.org/2000/svg">
  <g transform="matrix(1.0, 0.0, 0.0, 1.0, 4.0, 9.0)">
    <pattern height="9" id="PatternID_770_1" overflow="visible" patternTransform="matrix(1.0, 0.0, 0.0, 1.0, -4.0, -9.0)" patternUnits="userSpaceOnUse" viewBox="0 0 8 9" width="8">
      <image height="9" width="8" xlink:href="data:image/PNG;base64,iVBORw0KGgoAAAANSUhEUgAAAAgAAAAJCAYAAAAPU20uAAAAQUlEQVR42mNgAIL/OABIjuHZ4zn/8QHiFKArAtna1NCAqgAkAHMOMhvsRpACZF0YVsAUoVvHAAPIipCMxlSEzQQA6tnYrE7RzawAAAAASUVORK5CYII="/>
    </pattern>
    <path d="M-4.0 -9.0 L4.0 -9.0 4.0 0.0 -4.0 0.0 -4.0 -9.0" style="fill:url(#PatternID_770_1)"/>
  </g>
</svg>
