<?xml version="1.0" encoding="UTF-8" standalone="no"?>
<svg xmlns:xlink="http://www.w3.org/1999/xlink" height="30.0px" width="20.0px" xmlns="http://www.w3.org/2000/svg">
  <g transform="matrix(1.0, 0.0, 0.0, 1.0, 3.0, 0.0)">
    <pattern height="30" id="PatternID_1455_1" overflow="visible" patternTransform="matrix(1.0, 0.0, 0.0, 1.0, -3.0, 0.0)" patternUnits="userSpaceOnUse" viewBox="0 0 20 30" width="20">
      <image height="30" width="20" xlink:href="data:image/PNG;base64,iVBORw0KGgoAAAANSUhEUgAAABQAAAAeCAYAAAAsEj5rAAAAcElEQVR42u2U4QrAIAiEff+XvhH0Y4zMmXfbjxIkCvrUPDOLDd0pRgNJgHiUi8FZGhS5RUGw4NMnqgJLIBcKAlgLdEtvNtu/Bdr9srdmdbmSIVjiBnNaUvNeziqboexz+BYIdoc3BEq6TBf1Af4MvAB5dU7A1E7hOQAAAABJRU5ErkJggg=="/>
    </pattern>
    <path d="M17.0 30.0 L-3.0 30.0 -3.0 0.0 17.0 0.0 17.0 30.0" style="fill:url(#PatternID_1455_1)"/>
  </g>
</svg>
