<?xml version="1.0" encoding="UTF-8" standalone="no"?>
<svg xmlns:xlink="http://www.w3.org/1999/xlink" height="154.8px" width="108.6px" xmlns="http://www.w3.org/2000/svg">
  <g transform="matrix(1.0, 0.0, 0.0, 1.0, 31.9, 57.45)">
    <path d="M50.0 -51.2 Q48.8 -49.15 48.7 -47.35 48.7 -45.8 49.45 -44.35 L50.1 -42.35 50.9 -40.55 52.1 -37.75 Q51.2 -36.5 46.65 -33.25 L43.55 -31.15 Q39.15 -28.3 34.4 -26.15 L33.75 -25.85 Q28.65 -23.6 24.0 -22.45 L23.05 -23.65 Q19.95 -27.0 20.35 -27.65 L21.3 -28.65 Q23.9 -29.25 26.0 -30.4 L27.35 -31.15 Q28.55 -31.55 29.7 -32.05 L33.55 -33.75 Q40.95 -36.7 42.55 -44.2 L42.65 -45.35 Q42.7 -47.95 40.85 -49.3 45.1 -48.2 46.85 -43.9 L47.4 -42.6 47.85 -41.15 Q48.35 -39.4 47.15 -37.85 44.55 -34.75 40.5 -33.25 36.95 -32.05 33.75 -32.7 L33.0 -32.6 32.65 -32.0 32.8 -31.3 33.3 -30.85 Q37.05 -30.0 41.1 -31.45 43.15 -32.3 44.8 -33.25 47.0 -34.65 48.65 -36.65 50.35 -38.8 49.75 -41.2 L49.65 -41.65 49.65 -41.75 48.6 -44.65 Q46.25 -50.25 40.5 -51.3 L38.1 -52.0 37.95 -51.95 37.2 -52.2 Q35.3 -52.5 33.55 -52.15 24.35 -54.6 15.4 -50.85 10.35 -48.85 8.25 -43.65 L8.25 -42.9 8.85 -42.4 Q9.2 -42.25 9.55 -42.4 L10.0 -42.85 Q11.85 -47.3 16.1 -49.1 23.2 -52.05 30.5 -50.9 L30.4 -50.8 Q30.3 -50.4 30.5 -49.9 L31.0 -49.5 31.75 -49.55 33.6 -50.2 35.6 -49.45 36.35 -49.3 Q37.5 -48.8 38.6 -48.4 40.1 -47.85 40.5 -46.6 40.85 -45.8 40.65 -44.6 39.7 -40.25 36.4 -37.55 L37.55 -39.15 Q38.25 -40.35 38.55 -41.65 L38.5 -41.55 Q39.0 -43.1 37.9 -44.1 L37.95 -43.95 Q34.65 -47.35 30.25 -47.25 L24.5 -47.0 Q24.15 -46.95 23.8 -46.55 23.55 -46.3 23.65 -45.9 23.7 -45.55 24.05 -45.25 24.35 -45.0 24.7 -45.1 L30.2 -45.35 Q33.95 -45.35 36.65 -42.6 L36.7 -42.15 36.7 -42.0 Q36.5 -41.0 35.95 -40.1 34.45 -37.7 32.0 -36.55 L32.15 -36.8 Q34.35 -40.55 30.95 -42.65 27.6 -44.75 23.55 -45.1 16.8 -45.95 11.25 -42.5 10.9 -42.35 10.95 -41.95 10.85 -41.55 11.0 -41.2 L11.6 -40.8 12.3 -40.95 Q17.15 -44.0 23.35 -43.3 26.95 -42.9 29.9 -41.05 31.75 -39.85 30.5 -37.75 L28.95 -35.4 26.45 -32.8 24.05 -32.55 Q25.1 -36.0 21.25 -37.4 20.85 -38.25 19.65 -38.8 L17.4 -39.8 Q13.4 -41.7 10.45 -39.45 L9.45 -38.5 Q9.15 -38.2 9.25 -37.75 9.3 -37.4 9.6 -37.1 9.75 -36.9 10.2 -36.9 L9.1 -36.5 8.95 -39.15 8.3 -40.7 6.65 -42.35 4.5 -42.9 2.7 -42.75 1.75 -43.45 Q0.35 -44.35 -1.0 -44.85 L-0.3 -45.7 Q4.8 -50.85 12.65 -53.95 23.1 -58.1 34.55 -57.3 L39.75 -56.6 Q46.55 -55.4 50.55 -51.95 L50.0 -51.2 M10.35 -22.0 Q6.55 -22.8 3.2 -24.75 -1.3 -27.4 -3.8 -29.55 -0.35 -30.5 2.35 -28.9 L8.15 -23.45 10.35 -22.0 M10.9 -37.2 Q11.55 -37.95 12.35 -38.35 14.25 -39.25 16.5 -38.05 L16.6 -38.0 13.35 -37.75 10.85 -37.1 10.9 -37.2" fill="#393987" fill-opacity="0.047058824" fill-rule="evenodd" stroke="none"/>
    <path d="M70.55 22.9 Q66.8 27.45 60.8 29.0 L58.9 29.5 60.1 28.6 Q62.75 26.1 62.4 22.6 61.85 18.0 57.5 16.5 51.1 14.15 44.0 14.2 L43.4 14.5 Q43.1 14.65 43.15 15.15 43.1 15.55 43.4 15.85 L44.05 16.05 Q50.8 16.2 56.85 18.3 60.15 19.45 60.5 22.85 60.75 25.4 58.8 27.25 57.55 28.25 55.95 28.7 L55.9 28.8 53.8 29.35 52.95 29.5 Q50.1 29.85 47.1 29.6 48.05 28.05 48.1 26.0 L48.15 25.9 47.85 24.8 Q49.95 19.85 45.05 17.0 41.3 14.95 37.15 14.5 L37.55 14.15 Q40.5 9.0 37.95 8.0 L38.2 7.9 Q48.1 6.05 59.65 8.1 70.55 10.0 76.7 14.4 75.7 16.5 76.15 20.65 L76.2 21.8 74.5 21.45 73.45 21.85 73.7 21.25 Q74.2 19.65 73.5 18.15 71.4 13.15 66.3 10.95 60.45 8.6 54.5 10.05 54.15 10.2 54.0 10.5 53.8 10.85 53.85 11.15 L54.3 11.75 55.05 11.85 Q60.45 10.5 65.6 12.7 69.95 14.5 71.8 18.85 L71.95 20.7 71.9 20.6 Q71.5 21.8 70.6 22.85 L70.55 22.9 M46.35 23.4 Q41.15 19.9 34.8 21.35 34.45 21.35 34.2 21.75 34.0 22.1 34.1 22.5 L34.55 23.05 35.2 23.25 Q41.25 21.8 46.1 25.5 L46.3 25.95 46.2 25.9 Q46.0 29.8 42.1 30.65 L42.0 30.6 38.55 31.35 38.4 31.35 36.1 31.55 Q35.7 31.5 35.4 31.8 35.1 31.9 35.05 32.35 L35.3 33.15 35.9 33.35 38.75 33.2 42.5 32.5 42.55 32.4 Q44.6 31.95 45.95 30.8 L46.1 31.1 46.7 31.35 Q50.1 31.8 53.5 31.35 53.65 31.3 53.85 31.2 L61.25 30.85 Q66.35 29.55 70.0 26.3 L68.15 31.35 Q67.8 32.35 67.7 33.4 64.95 34.5 61.95 35.3 41.95 41.05 26.1 31.8 L24.65 30.9 24.05 30.35 Q24.4 30.1 24.9 29.9 L25.35 29.65 Q28.4 27.95 29.35 26.3 31.2 23.2 30.15 21.4 29.85 20.75 29.2 20.4 L31.85 18.55 34.95 16.25 Q39.8 16.3 44.05 18.65 47.05 20.4 46.35 23.4" fill="#393987" fill-opacity="0.02745098" fill-rule="evenodd" stroke="none"/>
    <path d="M7.2 68.95 Q2.45 66.15 -1.7 68.55 -2.15 68.75 -2.15 69.15 L-2.15 69.75 -1.55 70.25 -0.75 70.15 Q2.5 68.3 6.2 70.6 L9.25 72.5 Q14.7 76.15 15.65 82.6 L15.7 82.5 Q15.8 83.15 15.3 83.75 L15.25 83.8 Q12.65 87.95 7.5 88.95 L4.45 89.4 Q6.2 88.7 7.55 87.05 10.55 83.25 8.05 78.9 L8.1 78.85 Q5.9 75.4 2.4 73.65 0.65 72.85 -1.15 72.5 L-7.9 70.7 -8.6 70.75 -9.0 71.4 -8.95 72.0 Q-12.3 70.2 -15.95 72.85 L-16.0 72.95 -17.45 72.2 -10.35 69.85 Q-6.35 68.25 -5.1 66.1 L-4.3 64.5 Q0.8 64.6 6.2 66.25 16.45 69.35 22.15 75.55 28.1 82.1 25.6 88.85 23.4 94.7 4.45 97.35 4.7 92.45 -7.0 91.75 -11.0 91.5 -15.05 91.9 -13.8 88.45 -16.8 86.35 -14.95 84.3 -12.3 83.65 L-11.65 83.2 -11.6 82.5 Q-11.65 82.1 -12.0 81.9 L-12.7 81.85 Q-14.1 82.15 -15.3 82.9 -14.5 82.25 -13.7 80.9 -12.95 79.6 -12.8 78.2 -9.8 78.3 -6.7 79.35 -4.5 79.9 -3.75 81.25 -3.15 82.5 -3.95 84.5 -5.85 89.25 -10.95 89.75 L-11.65 89.9 -11.85 90.7 -11.6 91.3 Q-11.3 91.6 -10.9 91.6 -7.15 91.2 -4.85 89.1 L-4.8 89.25 -4.5 89.9 -3.85 90.15 -1.6 90.05 0.2 89.85 -0.1 90.45 0.1 91.15 0.75 91.4 Q2.15 91.6 3.55 91.4 L7.8 90.75 Q13.8 89.7 16.85 84.85 17.75 83.55 17.6 82.35 16.5 75.0 10.35 70.9 L7.2 68.95 M-30.9 95.0 L-31.3 94.6 -31.9 93.95 Q-31.2 94.05 -30.6 94.4 L-30.8 94.75 -30.9 95.0 M-18.85 85.0 Q-18.45 84.65 -16.45 83.45 L-18.5 85.3 -18.8 85.15 -18.85 85.0" fill="#393987" fill-opacity="0.08627451" fill-rule="evenodd" stroke="none"/>
  </g>
</svg>
