<?xml version="1.0" encoding="UTF-8" standalone="no"?>
<svg xmlns:xlink="http://www.w3.org/1999/xlink" height="4.0px" width="6.0px" xmlns="http://www.w3.org/2000/svg">
  <g transform="matrix(1.0, 0.0, 0.0, 1.0, -12.0, -4.0)">
    <path d="M15.0 4.0 L16.0 4.0 16.0 6.0 15.0 6.0 15.0 4.0" fill="#ff3300" fill-rule="evenodd" stroke="none"/>
    <path d="M18.0 7.0 L18.0 8.0 17.0 8.0 17.0 7.0 18.0 7.0 M13.0 5.0 L13.0 6.0 12.0 6.0 12.0 5.0 13.0 5.0" fill="#ffffff" fill-rule="evenodd" stroke="none"/>
  </g>
</svg>
