<?xml version="1.0" encoding="UTF-8" standalone="no"?>
<svg xmlns:xlink="http://www.w3.org/1999/xlink" height="27.75px" width="57.8px" xmlns="http://www.w3.org/2000/svg">
  <g transform="matrix(1.0, 0.0, 0.0, 1.0, -10.25, 41.25)">
    <path d="M23.75 -41.25 L62.2 -17.25 61.65 -16.75 64.05 -16.75 64.05 -28.5 68.05 -28.5 68.05 -16.0 64.05 -16.0 64.05 -16.25 61.1 -16.25 58.15 -13.5 10.25 -34.75 23.75 -41.25" fill="#ff0000" fill-rule="evenodd" stroke="none"/>
  </g>
</svg>
