<?xml version="1.0" encoding="UTF-8" standalone="no"?>
<svg xmlns:xlink="http://www.w3.org/1999/xlink" height="8.0px" width="5.0px" xmlns="http://www.w3.org/2000/svg">
  <g transform="matrix(1.0, 0.0, 0.0, 1.0, 0.0, 0.0)">
    <pattern height="8" id="PatternID_1460_1" overflow="visible" patternTransform="matrix(1.0, 0.0, 0.0, 1.0, 0.0, 0.0)" patternUnits="userSpaceOnUse" viewBox="0 0 5 8" width="5">
      <image height="8" width="5" xlink:href="data:image/PNG;base64,iVBORw0KGgoAAAANSUhEUgAAAAUAAAAICAYAAAAx8TU7AAAAPElEQVR42mNgQALnGBj+M6ADDEEMAQtevv8gQRANF/g7KxUs+P9YDUQCRIA4IAkQhgvCBOCCMCNgGMQHAH+ZL+qg4nCTAAAAAElFTkSuQmCC"/>
    </pattern>
    <path d="M0.0 0.0 L5.0 0.0 5.0 8.0 0.0 8.0 0.0 0.0" style="fill:url(#PatternID_1460_1)"/>
  </g>
</svg>
