<?xml version="1.0" encoding="UTF-8" standalone="no"?>
<svg xmlns:xlink="http://www.w3.org/1999/xlink" height="43.6px" width="72.65px" xmlns="http://www.w3.org/2000/svg">
  <g transform="matrix(1.0, 0.0, 0.0, 1.0, 35.75, 22.0)">
    <path d="M11.2 -18.05 Q14.25 -16.3 16.15 -13.4 L16.8 -12.05 16.85 -11.8 16.85 -11.35 16.85 -11.1 Q16.55 -9.6 15.5 -8.6 14.5 -5.7 14.25 -2.5 L14.3 4.8 Q14.6 6.2 15.45 7.4 L15.5 7.45 15.6 7.5 15.85 7.6 15.85 7.55 17.45 8.05 17.45 8.0 17.95 8.15 18.0 8.2 18.95 8.45 19.0 8.45 19.85 8.65 21.8 9.05 28.35 10.35 Q30.1 10.7 31.6 11.45 35.65 13.5 36.9 16.3 L11.8 14.75 11.8 1.95 -2.1 1.95 -2.1 13.65 -35.6 11.0 Q-34.5 8.2 -31.15 7.4 L-28.05 6.6 Q-23.9 5.5 -19.5 5.85 L-19.05 5.4 Q-14.35 0.9 -11.6 -5.2 L-11.4 -5.65 -11.5 -5.55 -10.15 -8.75 -9.35 -10.65 -9.35 -10.6 -9.15 -11.15 -9.15 -11.2 -8.9 -11.9 -8.9 -11.95 -8.85 -12.2 Q-8.05 -15.1 -8.4 -18.1 L-8.4 -18.15 -8.45 -18.2 -8.6 -18.45 -8.4 -18.25 -8.4 -18.35 -8.65 -18.8 -8.5 -18.25 -8.75 -18.6 -8.85 -19.2 -8.4 -20.3 -7.7 -21.05 -7.45 -21.15 -7.25 -21.2 -7.2 -21.2 -5.8 -21.6 -4.0 -21.95 -3.7 -22.0 Q3.25 -21.6 9.75 -18.75 L9.8 -18.75 11.15 -18.05 11.2 -18.05" fill="#833b29" fill-rule="evenodd" stroke="none"/>
    <path d="M17.1 9.25 L17.7 9.4 17.65 9.4 17.55 9.45 17.45 9.65 17.45 10.1 17.1 9.25 M18.65 9.65 L19.0 9.75 19.35 9.85 19.0 10.0 18.95 10.0 18.85 9.9 18.65 9.65 M21.35 10.25 L27.9 11.55 Q29.4 11.85 30.7 12.5 35.45 14.9 35.85 18.45 L35.85 19.35 30.8 20.6 28.25 21.05 28.05 20.35 Q27.55 19.4 26.3 18.9 22.35 17.35 20.15 14.75 L20.15 14.3 20.0 13.15 20.2 12.8 21.8 10.35 21.35 10.25 M22.75 21.5 L19.0 21.6 18.2 21.6 17.95 21.6 5.15 21.1 -9.8 19.45 -19.2 18.3 -21.05 18.3 Q-20.9 17.55 -20.2 16.9 -18.45 15.35 -16.35 14.35 -14.05 11.7 -9.75 11.9 L-4.25 12.4 -2.65 12.65 -4.4 12.0 6.2 11.55 5.9 10.9 4.85 8.5 2.4 3.35 0.55 -0.45 -0.5 -2.3 -1.15 -6.1 Q3.75 0.8 7.35 8.55 9.1 12.25 11.8 15.1 L11.7 15.1 11.85 15.15 7.45 13.8 8.0 14.0 7.45 13.35 7.05 13.9 Q5.75 15.3 4.75 13.6 3.05 14.05 1.45 13.25 L1.45 13.7 1.35 14.15 Q5.0 14.2 13.15 16.7 14.6 15.65 17.45 16.25 L17.95 16.4 19.0 16.75 Q23.15 17.9 22.95 20.9 L22.75 21.5 M-31.05 16.45 L-32.95 15.75 -34.75 14.65 Q-35.75 13.85 -35.75 13.2 -35.8 12.55 -34.95 12.05 L-34.9 12.0 Q-34.0 9.35 -30.95 8.6 L-27.85 7.8 Q-23.85 6.75 -19.65 7.1 L-19.55 7.1 -18.9 6.85 -18.4 6.4 Q-13.55 1.75 -10.75 -4.55 L-10.6 -4.9 -9.25 -8.1 -6.35 -6.15 -6.9 -6.5 -7.7 -4.45 Q-8.95 0.65 -11.55 5.2 L-12.1 5.75 Q-12.4 6.5 -12.95 7.05 -14.0 8.2 -15.4 8.95 L-20.4 8.3 -23.0 8.45 Q-25.1 9.35 -27.1 10.6 -30.5 12.8 -31.05 16.45 M-8.0 -11.35 L-7.9 -11.7 -7.9 -11.65 -7.55 -11.45 -7.55 -11.3 -8.0 -11.35 M-5.9 0.15 Q-5.2 0.35 -5.05 0.55 L-5.95 2.7 -6.1 2.55 -6.8 1.8 -6.9 1.35 -6.85 0.8 -6.75 0.65 -6.5 0.35 -6.2 0.2 -5.9 0.15 M10.65 9.6 L10.95 11.65 5.7 1.5 10.2 4.05 10.65 9.6 M11.75 20.25 L10.0 20.35 11.75 20.3 11.75 20.25" fill="#f1926d" fill-rule="evenodd" stroke="none"/>
    <path d="M-7.9 -11.7 Q-7.0 -15.05 -7.5 -18.5 L-7.7 -18.55 -7.75 -18.65 -7.9 -18.8 -7.55 -19.55 -7.25 -19.95 -7.15 -19.95 -7.0 -20.0 -6.95 -20.0 -5.7 -20.35 -3.8 -20.75 Q3.0 -20.35 9.3 -17.6 L10.65 -16.95 Q13.5 -15.3 15.25 -12.6 L15.8 -11.5 15.8 -11.05 Q15.6 -9.75 14.6 -8.95 13.45 -5.75 13.2 -2.25 L13.25 5.15 Q13.6 6.75 14.6 8.2 L15.25 8.7 15.5 8.8 17.1 9.25 17.45 10.1 17.45 9.65 17.55 9.45 17.65 9.4 17.7 9.4 17.95 9.45 18.65 9.65 18.85 9.9 18.95 10.0 19.0 10.0 19.35 9.85 21.35 10.25 21.8 10.35 20.2 12.8 20.0 13.15 20.15 14.3 20.15 14.75 Q22.35 17.35 26.3 18.9 27.55 19.4 28.05 20.35 L28.25 21.05 26.6 21.2 26.15 21.25 22.75 21.5 22.95 20.9 Q23.15 17.9 19.0 16.75 L17.95 16.4 17.45 16.25 Q14.6 15.65 13.15 16.7 5.0 14.2 1.35 14.15 L1.45 13.7 1.45 13.25 Q3.05 14.05 4.75 13.6 5.75 15.3 7.05 13.9 L7.45 13.35 8.0 14.0 7.45 13.8 11.85 15.15 11.7 15.1 11.8 15.1 Q9.1 12.25 7.35 8.55 3.75 0.8 -1.15 -6.1 L-0.5 -2.3 0.55 -0.45 2.4 3.35 4.85 8.5 5.9 10.9 6.2 11.55 -4.4 12.0 -2.65 12.65 -4.25 12.4 -9.75 11.9 Q-14.05 11.7 -16.35 14.35 -18.45 15.35 -20.2 16.9 -20.9 17.55 -21.05 18.3 L-22.55 18.2 Q-26.0 18.1 -23.85 18.05 L-24.95 17.9 -29.5 16.9 -31.05 16.45 Q-30.5 12.8 -27.1 10.6 -25.1 9.35 -23.0 8.45 L-20.4 8.3 -15.4 8.95 Q-14.0 8.2 -12.95 7.05 -12.4 6.5 -12.1 5.75 L-11.55 5.2 Q-8.95 0.65 -7.7 -4.45 L-6.9 -6.5 -6.35 -6.15 -9.25 -8.1 -8.5 -10.0 -8.25 -10.6 -8.0 -11.35 -7.55 -11.3 -7.55 -11.45 -7.9 -11.65 -7.9 -11.7 M-5.9 0.15 L-6.2 0.2 -6.5 0.35 -6.75 0.65 -6.85 0.8 -6.9 1.35 -6.8 1.8 -6.1 2.55 -5.95 2.7 -5.05 0.55 Q-5.2 0.35 -5.9 0.15 M10.65 9.6 L10.2 4.05 5.7 1.5 10.95 11.65 10.65 9.6 M11.75 20.25 L11.75 20.3 10.0 20.35 11.75 20.25" fill="#e07e5a" fill-rule="evenodd" stroke="none"/>
    <path d="M18.9 19.65 L19.0 19.5 19.15 19.7 19.3 19.7 18.9 19.65" fill="#e07e5a" fill-rule="evenodd" stroke="none"/>
    <path d="M14.2 2.25 L14.3 2.45 14.35 2.6 14.25 9.9 14.35 14.1 14.35 14.45 14.15 14.45 13.85 10.3 13.8 9.9 Q13.05 3.0 13.55 2.25 L13.6 2.2 13.85 2.15 14.05 2.2 14.2 2.25" fill="#833b29" fill-rule="evenodd" stroke="none"/>
    <path d="M18.9 19.65 L17.4 19.5 16.95 19.45 16.6 18.2 16.25 16.9 Q16.15 16.3 16.5 15.8 16.7 15.5 16.95 15.5 17.6 15.75 17.9 16.35 L17.95 16.5 Q20.75 18.1 22.55 20.6 L22.2 20.45 21.95 20.35 Q20.9 19.9 19.65 19.75 L19.55 19.75 19.3 19.7 19.15 19.7 19.0 19.5 18.9 19.65" fill="#f1926d" fill-rule="evenodd" stroke="none"/>
  </g>
</svg>
