<?xml version="1.0" encoding="UTF-8" standalone="no"?>
<svg xmlns:xlink="http://www.w3.org/1999/xlink" height="11.25px" width="12.95px" xmlns="http://www.w3.org/2000/svg">
  <g transform="matrix(1.0, 0.0, 0.0, 1.0, 6.75, 5.0)">
    <path d="M5.15 -2.25 Q6.1 -1.05 6.05 0.45 L6.05 0.65 Q5.85 1.7 5.05 2.5 2.5 4.85 -1.0 4.7 L-3.55 4.15 Q-5.25 3.5 -6.3 2.0 L-6.75 0.7 -6.75 0.65 Q-6.8 -0.6 -6.0 -1.7 -4.25 -4.1 -1.3 -4.7 L-0.65 -4.5 -0.65 -4.45 Q1.7 -4.35 3.75 -3.35 4.55 -2.95 5.15 -2.25" fill="#000000" fill-opacity="0.2" fill-rule="evenodd" stroke="none"/>
    <path d="M3.75 -3.45 Q5.35 -2.0 5.35 0.0 L5.3 0.65 Q5.05 2.2 3.75 3.4 2.2 4.85 0.0 4.85 -2.2 4.85 -3.8 3.4 -5.1 2.2 -5.3 0.65 L-5.35 0.0 Q-5.35 -2.0 -3.8 -3.45 -2.2 -4.9 0.0 -4.85 2.2 -4.9 3.75 -3.45 M4.2 -1.55 Q3.25 -3.45 1.25 -3.85 -1.9 -4.45 -3.1 -1.6 -3.6 -0.4 -3.45 0.65 -3.25 1.8 -2.2 2.8 0.2 5.1 2.95 3.3 4.65 2.25 4.75 0.65 4.8 -0.35 4.2 -1.55" fill="#e4eef3" fill-rule="evenodd" stroke="none"/>
    <path d="M4.2 -1.55 Q4.8 -0.35 4.75 0.65 4.65 2.25 2.95 3.3 0.2 5.1 -2.2 2.8 -3.25 1.8 -3.45 0.65 -3.6 -0.4 -3.1 -1.6 -1.9 -4.45 1.25 -3.85 3.25 -3.45 4.2 -1.55" fill="#ffffff" fill-rule="evenodd" stroke="none"/>
    <path d="M1.0 -1.5 Q2.6 -1.3 2.7 0.2 L2.7 0.65 2.45 1.1 1.5 1.95 0.9 2.0 Q-0.25 1.6 -0.4 0.65 L-0.4 -0.25 -0.05 -0.9 0.65 -1.4 1.0 -1.5 M1.8 -0.4 L1.75 -0.3 1.75 -0.2 Q1.85 0.0 2.1 -0.05 L2.15 -0.15 2.15 -0.25 2.15 -0.35 2.05 -0.45 1.95 -0.45 1.8 -0.4 M1.0 -0.9 Q0.3 -0.85 0.15 -0.2 0.05 0.1 0.25 0.3 L1.15 0.25 Q1.75 -0.5 1.0 -0.9" fill="#000000" fill-rule="evenodd" stroke="none"/>
    <path d="M1.0 -0.9 Q1.75 -0.5 1.15 0.25 L0.25 0.3 Q0.05 0.1 0.15 -0.2 0.3 -0.85 1.0 -0.9 M1.8 -0.4 L1.95 -0.45 2.05 -0.45 2.15 -0.35 2.15 -0.25 2.15 -0.15 2.1 -0.05 Q1.85 0.0 1.75 -0.2 L1.75 -0.3 1.8 -0.4" fill="#ececec" fill-rule="evenodd" stroke="none"/>
    <path d="M-4.5 2.65 Q-4.95 3.35 -4.05 3.85 -0.6 5.85 3.25 4.35 4.55 3.85 5.4 2.8 L5.4 2.75 Q5.35 2.35 5.0 2.3 L5.2 2.25 5.2 2.2 Q5.85 2.6 5.65 3.2 5.7 3.8 5.0 4.35 L4.25 4.85 Q1.9 6.0 -0.8 5.6 L-4.0 4.8 -4.7 4.35 Q-5.25 3.9 -5.05 3.3 -5.15 2.4 -4.5 2.65" fill="#cc7251" fill-rule="evenodd" stroke="none"/>
    <path d="M5.0 2.3 Q5.35 2.35 5.4 2.75 L5.4 2.8 Q4.55 3.85 3.25 4.35 -0.6 5.85 -4.05 3.85 -4.95 3.35 -4.5 2.65 -5.35 1.95 -3.55 3.0 -1.8 4.05 1.35 3.7 4.5 3.3 4.95 2.3 L5.0 2.3 M1.45 4.65 L1.55 4.5 1.55 4.45 1.5 4.3 -0.2 3.95 -0.3 3.95 -0.45 3.95 -0.65 4.05 -0.7 4.1 -0.7 4.15 -0.75 4.2 -0.95 4.25 -1.1 4.2 -1.3 4.3 -1.3 4.35 -1.25 4.4 -1.1 4.55 1.45 4.65" fill="#e07e5a" fill-rule="evenodd" stroke="none"/>
    <path d="M1.45 4.65 L-1.1 4.55 -1.25 4.4 -1.3 4.35 -1.3 4.3 -1.1 4.2 -0.95 4.25 -0.75 4.2 -0.7 4.15 -0.7 4.1 -0.65 4.05 -0.45 3.95 -0.3 3.95 -0.2 3.95 1.5 4.3 1.55 4.45 1.55 4.5 1.45 4.65" fill="#f1926d" fill-rule="evenodd" stroke="none"/>
    <path d="M-4.0 4.8 L-0.8 5.6 Q1.9 6.0 4.25 4.85 2.5 6.05 1.3 6.2 -1.4 6.45 -4.0 4.8" fill="#7d3726" fill-rule="evenodd" stroke="none"/>
    <path d="M2.6 -3.65 L2.8 -3.75 2.8 -3.85 2.8 -3.95 2.75 -4.0 2.75 -4.05 2.65 -4.05 Q1.15 -4.75 -0.55 -4.55 L-2.4 -4.2 -2.55 -4.05 -2.6 -3.95 -2.6 -3.85 -2.55 -3.85 -2.55 -3.8 -2.5 -3.75 -2.4 -3.75 -0.35 -3.9 -0.9 -3.85 -3.95 -3.0 -4.0 -3.0 Q-4.25 -3.1 -4.05 -3.35 L-3.65 -3.75 -3.6 -3.8 -3.5 -3.85 -3.45 -3.9 -3.4 -3.9 -3.3 -4.0 -1.7 -4.75 0.45 -5.0 1.45 -4.9 Q2.2 -4.8 2.9 -4.35 L3.1 -4.15 3.3 -4.0 4.25 -3.0 4.6 -2.5 Q4.25 -2.35 3.9 -2.75 L2.6 -3.65" fill="#e07e5a" fill-rule="evenodd" stroke="none"/>
    <path d="M-0.35 -3.9 L-2.4 -3.75 -2.5 -3.75 -2.55 -3.8 -2.55 -3.85 -2.6 -3.85 -2.6 -3.95 -2.55 -4.05 -2.4 -4.2 -0.55 -4.55 Q1.15 -4.75 2.65 -4.05 L2.75 -4.05 2.75 -4.0 2.8 -3.95 2.8 -3.85 2.8 -3.75 2.6 -3.65 2.0 -3.8 -0.35 -3.9" fill="#f1926d" fill-rule="evenodd" stroke="none"/>
    <path d="M4.25 -3.0 L3.3 -4.0 3.1 -4.15 2.9 -4.35 3.9 -3.75 4.25 -3.45 6.2 -0.6 Q6.0 0.05 5.6 -0.75 5.2 -1.6 3.9 -2.2 0.85 -3.35 -2.4 -2.65 L-4.7 -1.95 -5.0 -1.8 -5.15 -1.7 -5.2 -1.65 -5.25 -1.6 -5.3 -1.5 -5.4 -1.5 -5.5 -1.55 -5.55 -1.55 -5.55 -1.6 -5.6 -1.65 -5.6 -1.7 -5.4 -2.05 -5.25 -2.2 -5.3 -2.25 -5.35 -2.3 -5.4 -2.4 -5.45 -2.4 -5.45 -2.5 -5.45 -2.6 -3.45 -3.9 -3.5 -3.85 -3.6 -3.8 -3.65 -3.75 -4.05 -3.35 Q-4.25 -3.1 -4.0 -3.0 L-3.95 -3.0 -3.1 -2.95 Q0.35 -3.95 4.9 -2.05 L4.25 -3.0" fill="#7d3726" fill-rule="evenodd" stroke="none"/>
    <path d="M2.6 -3.65 L3.9 -2.75 Q4.25 -2.35 4.6 -2.5 L4.25 -3.0 4.9 -2.05 Q0.35 -3.95 -3.1 -2.95 L-3.95 -3.0 -0.9 -3.85 -0.35 -3.9 2.0 -3.8 2.6 -3.65" fill="#cc7251" fill-rule="evenodd" stroke="none"/>
  </g>
</svg>
