<?xml version="1.0" encoding="UTF-8" standalone="no"?>
<svg xmlns:xlink="http://www.w3.org/1999/xlink" height="90.0px" width="290.0px" xmlns="http://www.w3.org/2000/svg">
  <g transform="matrix(1.0, 0.0, 0.0, 1.0, 0.05, 0.0)">
    <path d="M-0.05 31.5 L-0.05 0.0 289.95 0.0 289.95 41.2 Q282.25 44.5 274.1 41.6 273.0 37.15 273.95 32.65 274.95 27.95 272.85 23.65 267.95 13.35 254.75 15.4 230.45 18.5 216.95 38.25 215.9 37.05 214.65 36.65 195.3 30.4 177.2 40.45 171.4 43.65 169.8 48.65 149.6 56.2 130.35 43.8 119.2 36.55 105.6 36.0 93.45 35.5 82.05 39.45 59.85 47.2 38.75 58.05 37.25 58.8 35.7 58.45 22.95 55.55 13.1 46.05 L8.6 41.05 Q4.45 35.85 -0.05 31.5" fill="#fcdba7" fill-rule="evenodd" stroke="none"/>
    <path d="M-0.05 31.5 Q4.45 35.85 8.6 41.05 L13.1 46.05 Q22.95 55.55 35.7 58.45 37.25 58.8 38.75 58.05 59.85 47.2 82.05 39.45 93.45 35.5 105.6 36.0 119.2 36.55 130.35 43.8 149.6 56.2 169.8 48.65 171.4 43.65 177.2 40.45 195.3 30.4 214.65 36.65 215.9 37.05 216.95 38.25 230.45 18.5 254.75 15.4 267.95 13.35 272.85 23.65 274.95 27.95 273.95 32.65 273.0 37.15 274.1 41.6 282.25 44.5 289.95 41.2 L289.95 54.7 285.35 56.05 Q283.0 56.7 281.0 55.6 269.95 49.4 258.1 52.75 254.5 50.4 255.5 46.05 256.35 42.5 257.7 39.1 261.75 28.75 250.25 26.85 L244.5 27.6 Q236.75 29.0 231.5 34.75 220.5 46.65 228.4 59.95 L227.75 63.0 Q227.15 67.85 223.25 70.7 211.6 71.7 206.25 62.75 L209.85 59.1 Q211.3 57.8 211.4 55.95 212.0 47.15 201.7 45.2 L194.85 44.5 Q182.0 44.25 172.15 52.85 169.35 55.2 166.85 58.3 165.2 60.3 162.7 60.7 144.75 63.7 128.5 54.55 95.95 36.35 62.6 52.65 57.4 55.2 53.4 59.4 41.85 71.45 26.1 69.55 L20.3 68.6 Q10.1 66.4 0.7 62.95 L-0.05 63.5 -0.05 31.5" fill="#e6ebb8" fill-rule="evenodd" stroke="none"/>
    <path d="M289.95 54.7 L289.95 72.3 289.55 72.3 Q287.1 68.1 282.85 65.55 279.75 63.7 276.35 62.7 264.55 59.3 252.4 60.8 L250.9 58.1 Q249.75 56.3 247.7 56.55 L246.9 56.9 Q245.55 57.55 244.45 58.55 243.95 59.0 243.8 59.65 243.85 62.5 242.75 65.1 241.7 67.5 241.9 69.9 242.3 73.9 240.1 77.2 231.1 87.9 216.4 84.6 213.45 83.95 210.7 82.85 200.1 78.55 196.3 69.3 197.95 66.25 197.6 63.05 196.75 55.5 188.0 57.9 183.3 59.2 179.45 62.25 167.15 72.0 151.8 71.85 143.9 71.8 137.6 67.4 123.2 57.3 106.25 53.8 93.75 53.9 81.2 55.75 74.45 56.8 69.15 60.75 59.1 68.25 48.55 74.7 28.55 86.9 4.95 88.15 L4.6 88.5 4.35 88.85 4.15 89.15 4.05 89.85 4.05 90.0 -0.05 90.0 -0.05 63.5 0.7 62.95 Q10.1 66.4 20.3 68.6 L26.1 69.55 Q41.85 71.45 53.4 59.4 57.4 55.2 62.6 52.65 95.95 36.35 128.5 54.55 144.75 63.7 162.7 60.7 165.2 60.3 166.85 58.3 169.35 55.2 172.15 52.85 182.0 44.25 194.85 44.5 L201.7 45.2 Q212.0 47.15 211.4 55.95 211.3 57.8 209.85 59.1 L206.25 62.75 Q211.6 71.7 223.25 70.7 227.15 67.85 227.75 63.0 L228.4 59.95 Q220.5 46.65 231.5 34.75 236.75 29.0 244.5 27.6 L250.25 26.85 Q261.75 28.75 257.7 39.1 256.35 42.5 255.5 46.05 254.5 50.4 258.1 52.75 269.95 49.4 281.0 55.6 283.0 56.7 285.35 56.05 L289.95 54.7 M248.35 63.95 L248.4 63.65 248.6 64.0 248.35 63.95" fill="#bbecb7" fill-rule="evenodd" stroke="none"/>
    <path d="M289.95 72.3 L289.95 81.3 Q279.45 70.8 264.75 66.05 258.45 65.95 253.1 69.7 L252.7 69.65 Q251.45 69.15 250.45 70.05 L250.15 70.75 249.8 72.85 Q249.75 73.9 250.0 74.9 L246.95 85.6 Q246.25 87.8 246.0 90.0 L212.3 90.0 Q210.8 88.15 207.55 87.9 201.9 87.45 198.0 83.5 194.45 79.9 190.5 76.75 178.6 67.4 165.3 76.05 L165.2 76.1 Q158.95 80.75 149.2 79.5 144.55 78.9 140.55 76.4 131.1 70.5 122.0 64.3 116.45 63.15 110.75 63.55 95.15 64.65 88.15 77.2 84.75 83.25 83.5 90.0 L4.05 90.0 4.05 89.85 4.15 89.15 4.35 88.85 4.6 88.5 4.95 88.15 Q28.55 86.9 48.55 74.7 59.1 68.25 69.15 60.75 74.45 56.8 81.2 55.75 93.75 53.9 106.25 53.8 123.2 57.3 137.6 67.4 143.9 71.8 151.8 71.85 167.15 72.0 179.45 62.25 183.3 59.2 188.0 57.9 196.75 55.5 197.6 63.05 197.95 66.25 196.3 69.3 200.1 78.55 210.7 82.85 213.45 83.95 216.4 84.6 231.1 87.9 240.1 77.2 242.3 73.9 241.9 69.9 241.7 67.5 242.75 65.1 243.85 62.5 243.8 59.65 243.95 59.0 244.45 58.55 245.55 57.55 246.9 56.9 L247.7 56.55 Q249.75 56.3 250.9 58.1 L252.4 60.8 Q264.55 59.3 276.35 62.7 279.75 63.7 282.85 65.55 287.1 68.1 289.55 72.3 L289.95 72.3 M248.35 63.95 L248.6 64.0 248.4 63.65 248.35 63.95" fill="#c5dde9" fill-rule="evenodd" stroke="none"/>
    <path d="M289.95 81.3 L289.95 90.0 268.65 90.0 267.05 89.5 266.7 90.0 246.0 90.0 Q246.25 87.8 246.95 85.6 L250.0 74.9 Q249.75 73.9 249.8 72.85 L250.15 70.75 250.45 70.05 Q251.45 69.15 252.7 69.65 L253.1 69.7 Q258.45 65.95 264.75 66.05 279.45 70.8 289.95 81.3 M212.3 90.0 L83.5 90.0 Q84.75 83.25 88.15 77.2 95.15 64.65 110.75 63.55 116.45 63.15 122.0 64.3 131.1 70.5 140.55 76.4 144.55 78.9 149.2 79.5 158.95 80.75 165.2 76.1 L165.3 76.05 Q178.6 67.4 190.5 76.75 194.45 79.9 198.0 83.5 201.9 87.45 207.55 87.9 210.8 88.15 212.3 90.0" fill="#dbcbe2" fill-rule="evenodd" stroke="none"/>
  </g>
</svg>
