<?xml version="1.0" encoding="UTF-8" standalone="no"?>
<svg xmlns:xlink="http://www.w3.org/1999/xlink" height="35.7px" width="49.35px" xmlns="http://www.w3.org/2000/svg">
  <g transform="matrix(1.0, 0.0, 0.0, 1.0, 4.65, 9.5)">
    <path d="M28.4 21.35 L29.1 21.35 29.3 21.4 29.45 21.35 30.0 21.35 30.25 21.4 30.45 21.6 30.5 21.7 Q30.7 21.5 31.0 21.45 L31.05 21.45 31.3 21.5 32.1 21.85 32.05 21.7 31.9 20.7 31.95 20.45 32.1 20.25 32.35 20.15 32.8 20.2 32.95 20.15 34.0 20.15 34.25 20.2 34.45 20.4 34.4 20.35 34.8 20.95 35.05 21.3 35.3 20.5 Q35.65 19.85 36.2 19.9 L36.25 19.9 36.8 20.1 36.7 19.85 36.8 19.55 36.8 19.6 Q36.9 19.45 37.05 19.4 L37.0 19.4 37.35 19.3 37.4 18.35 Q37.4 18.15 37.55 18.05 37.65 17.9 37.85 17.9 L38.0 17.9 38.25 17.75 38.6 17.7 38.5 17.35 37.7 17.0 37.75 17.0 37.5 16.85 37.4 16.6 37.35 15.75 37.4 15.5 37.4 15.45 37.6 15.25 37.85 15.2 39.0 15.2 39.25 15.25 39.3 15.3 39.45 15.5 39.4 15.45 39.85 16.15 Q39.85 15.7 40.2 15.35 40.55 15.0 41.05 15.0 L41.15 15.0 41.05 14.9 41.0 14.6 41.1 14.35 41.15 14.3 41.4 14.15 41.35 14.15 43.2 13.65 43.25 13.65 43.45 13.65 43.5 13.65 43.65 13.75 44.0 14.2 Q44.35 14.65 43.95 15.1 L44.2 15.3 44.65 16.1 44.7 16.5 44.45 16.8 44.1 16.85 42.25 16.45 41.9 16.95 Q41.55 17.3 41.05 17.3 L40.55 17.2 40.65 17.35 40.75 17.6 40.7 17.85 40.5 18.05 40.4 18.1 40.75 18.25 40.8 18.15 40.8 18.1 41.05 17.95 41.0 17.95 42.15 17.45 42.35 17.4 42.55 17.45 43.3 17.85 Q44.1 18.15 43.8 19.1 L43.8 19.15 43.75 19.2 43.7 19.3 43.7 19.35 43.5 19.5 43.5 19.45 42.7 19.8 42.65 20.8 42.7 20.75 42.45 21.05 42.4 21.05 42.05 21.05 41.6 20.9 41.9 21.35 42.0 21.7 41.95 21.9 41.85 22.1 41.65 22.3 41.65 22.25 41.4 22.3 41.35 22.3 41.0 22.25 40.9 22.25 40.05 21.9 39.45 22.35 39.2 22.45 38.95 22.4 38.8 22.6 38.8 22.55 38.1 23.3 37.85 23.45 37.55 23.4 37.5 23.4 37.3 23.15 37.0 22.45 36.25 22.8 36.2 22.8 35.7 22.65 35.8 23.2 35.8 23.25 35.6 23.7 35.4 23.9 35.2 24.05 35.15 24.05 34.95 24.05 34.9 24.3 34.9 24.35 34.75 24.55 34.55 24.7 34.5 24.7 34.2 24.65 34.25 24.65 33.55 24.4 33.25 25.05 33.05 25.3 32.7 25.35 Q31.35 25.1 30.75 24.15 L30.65 24.25 30.6 24.35 30.9 25.05 30.9 25.7 30.4 26.1 30.45 26.05 30.05 26.05 29.6 25.75 28.85 24.8 28.85 24.75 28.65 24.25 28.65 23.7 Q28.65 23.5 28.8 23.35 L28.4 23.35 28.05 23.2 27.9 22.85 27.9 21.85 28.05 21.5 28.4 21.35 M25.9 21.5 Q26.0 21.35 26.2 21.35 L26.25 21.35 26.95 21.4 27.05 21.45 27.15 21.6 27.75 23.9 27.75 23.85 28.1 24.8 28.15 25.1 28.15 25.15 28.1 25.25 28.05 25.3 28.0 25.35 27.45 26.0 26.9 26.15 26.6 25.75 Q26.1 24.65 25.75 23.4 25.45 23.95 25.4 24.65 25.35 25.5 24.6 25.6 L24.5 25.6 24.4 25.55 24.05 25.25 22.9 26.05 22.75 26.1 22.65 26.05 22.55 25.95 21.8 24.35 20.5 25.25 20.35 25.25 20.25 25.2 19.4 24.5 19.3 24.35 19.35 24.15 21.4 21.55 20.25 21.45 19.85 22.45 19.75 22.55 19.65 22.6 19.5 22.6 18.7 22.15 17.7 22.3 17.55 22.3 17.45 22.15 17.15 21.45 16.3 21.6 16.15 21.6 16.05 21.45 Q15.5 20.35 16.7 19.4 L16.7 19.35 Q17.3 18.8 17.9 19.1 L17.9 18.65 18.0 18.5 18.15 18.4 19.4 18.3 19.55 18.35 19.65 18.5 19.85 19.4 20.1 19.15 20.2 19.05 20.3 19.05 21.9 19.4 22.05 19.5 22.1 19.7 22.0 21.0 22.35 21.05 22.5 21.15 22.7 21.65 22.6 22.45 23.25 21.45 23.4 21.4 23.55 21.4 23.65 21.5 24.1 22.2 24.3 21.6 24.4 21.45 24.55 21.4 25.65 21.4 25.7 21.45 25.85 21.55 25.9 21.5 M33.1 21.7 L33.1 21.55 33.05 21.6 33.0 21.6 33.1 21.7 33.05 21.75 33.05 21.8 33.0 21.9 33.05 21.9 33.2 21.85 33.25 21.9 33.2 21.85 33.1 21.7 M32.15 21.85 L32.3 21.95 32.3 22.0 32.35 21.95 32.35 21.9 32.1 21.85 32.15 21.85 M40.25 13.25 Q40.6 13.6 40.6 14.05 L40.25 14.85 40.2 14.9 39.45 15.15 38.75 14.9 38.7 14.85 Q38.3 14.5 38.3 14.05 38.3 13.6 38.7 13.25 L38.75 13.25 Q39.0 12.95 39.45 12.95 L40.2 13.2 40.25 13.25 M37.3 20.5 L37.25 20.5 37.15 20.5 37.25 20.7 37.65 20.65 37.55 20.55 37.3 20.5 M17.9 20.55 Q18.15 20.4 18.45 20.3 L18.1 20.25 18.0 20.2 17.9 20.55" fill="#2e3663" fill-rule="evenodd" stroke="none"/>
    <path d="M-0.75 -5.25 L1.95 -7.2 Q5.0 -8.8 8.25 -8.45 L9.8 -8.2 9.85 -8.15 8.25 -8.45 Q7.85 -7.5 7.75 -6.3 7.55 -2.65 8.7 0.8 10.75 7.05 16.0 11.0 L17.15 11.75 18.9 12.4 19.0 12.4 18.2 13.15 18.1 13.35 Q17.7 13.75 17.6 14.3 L17.65 14.35 Q17.8 14.75 18.25 14.65 19.35 13.65 20.55 12.75 L20.8 12.55 21.15 12.55 21.35 12.5 20.65 13.35 20.65 13.55 21.0 13.85 21.25 13.75 22.8 12.35 22.85 12.3 21.85 14.6 Q22.05 14.95 22.45 14.75 L22.6 14.6 23.4 13.4 23.7 13.35 23.75 13.35 23.85 13.15 24.7 11.7 25.2 11.55 25.6 11.45 25.35 12.25 Q25.55 12.8 26.1 12.65 L26.15 12.5 Q26.35 11.85 26.85 11.35 L26.85 11.25 26.85 11.2 26.95 11.15 27.5 12.25 27.8 12.4 28.1 12.55 28.25 12.5 29.1 11.85 29.1 11.8 28.5 10.9 30.5 10.65 Q30.4 11.3 30.65 11.95 L31.15 12.0 31.25 11.85 31.5 10.55 32.2 10.55 32.8 10.9 Q33.3 11.0 33.55 11.45 L33.6 11.65 33.6 11.7 33.65 11.8 33.75 11.9 34.55 11.7 Q35.05 11.45 35.05 10.95 L35.0 10.85 34.7 10.55 36.25 10.65 36.6 11.95 36.9 12.05 37.1 12.05 37.15 12.0 37.4 10.8 38.6 10.95 38.8 11.45 39.8 12.75 40.15 12.4 40.25 12.15 40.7 13.35 Q41.55 16.85 39.6 19.75 L39.25 19.75 Q38.5 19.4 37.8 19.4 38.75 17.9 38.25 16.35 L38.05 16.35 37.8 16.4 37.4 17.2 Q36.95 18.55 35.75 19.35 32.0 21.95 27.3 22.05 L23.25 21.55 Q22.3 21.3 21.55 20.6 L19.2 18.45 17.8 17.35 16.6 16.6 Q10.7 13.55 4.4 11.45 1.3 10.4 -0.2 7.65 L-0.75 6.75 -1.45 5.65 Q-3.25 3.2 -2.75 0.15 -2.5 -1.25 -3.1 -2.15 L-1.9 -4.0 -0.75 -5.25 M36.9 20.3 L37.0 20.2 36.8 20.0 37.0 20.2 37.3 20.35 36.9 20.3" fill="#f1926d" fill-rule="evenodd" stroke="none"/>
    <path d="M9.8 -8.2 L10.05 -8.15 Q10.55 -8.55 11.4 -8.6 L11.8 -8.6 22.45 -9.1 Q27.7 -9.0 32.75 -7.5 L37.05 -5.75 38.4 -5.05 Q35.5 0.95 39.7 5.65 L40.45 6.35 41.55 7.55 41.8 10.25 41.85 12.5 41.7 16.55 Q41.25 20.4 39.05 20.45 L38.85 20.45 38.7 20.45 37.3 20.35 37.0 20.2 36.8 20.0 37.0 20.2 36.9 20.3 36.65 20.2 36.6 20.15 36.55 20.15 Q33.85 22.0 28.4 22.9 22.95 23.8 18.85 20.6 14.65 17.3 8.75 15.05 2.8 12.75 1.35 11.55 L-0.75 9.55 Q-2.75 7.15 -3.6 4.0 L-3.65 4.95 -3.8 5.05 -3.9 5.1 -4.65 4.7 Q-4.85 1.05 -3.1 -2.15 -2.5 -1.25 -2.75 0.15 -3.25 3.2 -1.45 5.65 L-0.75 6.75 -0.2 7.65 Q1.3 10.4 4.4 11.45 10.7 13.55 16.6 16.6 L17.8 17.35 19.2 18.45 21.55 20.6 Q22.3 21.3 23.25 21.55 L27.3 22.05 Q32.0 21.95 35.75 19.35 36.95 18.55 37.4 17.2 L37.8 16.4 38.05 16.35 38.25 16.35 Q38.75 17.9 37.8 19.4 38.5 19.4 39.25 19.75 L39.6 19.75 Q41.55 16.85 40.7 13.35 L40.25 12.15 40.15 12.4 39.8 12.75 38.8 11.45 38.6 10.95 37.4 10.8 37.15 12.0 37.1 12.05 36.9 12.05 36.6 11.95 36.25 10.65 34.7 10.55 35.0 10.85 35.05 10.95 Q35.05 11.45 34.55 11.7 L33.75 11.9 33.65 11.8 33.6 11.7 33.6 11.65 33.55 11.45 Q33.3 11.0 32.8 10.9 L32.2 10.55 31.5 10.55 31.25 11.85 31.15 12.0 30.65 11.95 Q30.4 11.3 30.5 10.65 L28.5 10.9 29.1 11.8 29.1 11.85 28.25 12.5 28.1 12.55 27.8 12.4 27.5 12.25 26.95 11.15 26.85 11.2 26.85 11.25 26.85 11.35 Q26.35 11.85 26.15 12.5 L26.1 12.65 Q25.55 12.8 25.35 12.25 L25.6 11.45 25.2 11.55 24.7 11.7 23.85 13.15 23.75 13.35 23.7 13.35 23.4 13.4 22.6 14.6 22.45 14.75 Q22.05 14.95 21.85 14.6 L22.85 12.3 22.8 12.35 21.25 13.75 21.0 13.85 20.65 13.55 20.65 13.35 21.35 12.5 21.15 12.55 Q22.15 11.5 23.35 10.95 L24.2 10.6 23.9 11.05 23.35 11.85 24.1 11.95 25.05 10.9 25.6 10.75 25.7 10.75 25.75 10.95 25.8 11.1 26.25 11.1 26.3 11.1 26.35 11.0 26.4 10.8 26.4 10.6 Q26.9 10.45 27.35 11.0 L27.75 11.3 27.95 11.3 27.95 11.25 28.0 11.05 27.95 10.8 27.8 10.45 28.5 9.95 Q29.5 9.25 30.55 9.5 L30.5 9.65 30.6 10.1 30.7 10.25 30.75 10.35 31.05 10.2 31.2 9.85 31.2 9.45 31.25 9.3 31.85 9.25 Q32.75 9.75 33.3 10.55 L33.6 10.75 33.6 10.65 33.75 10.45 33.8 10.15 33.8 9.85 33.25 8.9 Q35.45 8.5 36.65 10.25 L36.9 10.45 37.05 10.25 37.1 10.15 37.15 9.85 37.1 9.65 37.1 9.6 37.1 9.5 37.15 9.4 37.1 9.3 41.35 9.2 Q41.7 8.85 41.3 8.55 L40.85 8.0 39.55 6.35 37.05 4.45 Q35.5 3.65 33.65 3.45 L32.45 3.05 Q31.85 2.9 31.85 2.6 L28.5 1.7 27.5 1.45 26.2 1.1 26.0 1.05 Q24.1 0.6 22.5 -0.2 L21.75 -0.05 19.2 -0.1 Q18.25 -0.4 17.5 0.2 15.25 1.95 15.55 4.85 L15.6 5.3 Q15.85 6.7 16.6 7.9 L16.75 8.1 17.0 8.4 Q17.95 9.6 19.35 10.4 L17.15 11.75 16.0 11.0 Q10.75 7.05 8.7 0.8 7.55 -2.65 7.75 -6.3 7.85 -7.5 8.25 -8.45 L9.85 -8.15 9.8 -8.2 M18.75 -4.15 L18.7 -4.15 18.75 -4.1 18.75 -4.15 M18.9 12.4 L20.85 11.25 21.1 11.4 21.25 11.4 20.95 11.8 20.35 12.45 Q20.2 12.75 20.55 12.75 19.35 13.65 18.25 14.65 17.8 14.75 17.65 14.35 L17.6 14.3 Q17.7 13.75 18.1 13.35 L18.2 13.15 19.0 12.4 18.9 12.4" fill="#e07e5a" fill-rule="evenodd" stroke="none"/>
    <path d="M19.35 10.4 Q17.95 9.6 17.0 8.4 L16.75 8.1 16.6 7.9 16.6 7.85 Q16.75 7.7 16.9 7.7 L17.45 6.6 Q17.75 5.9 18.2 5.5 17.5 4.5 16.05 4.5 L15.85 4.6 15.55 4.85 Q15.25 1.95 17.5 0.2 18.25 -0.4 19.2 -0.1 L21.75 -0.05 22.5 -0.2 Q24.1 0.6 26.0 1.05 L26.2 1.1 27.5 1.45 Q26.8 1.95 26.95 2.8 27.3 4.2 28.75 3.85 L29.1 3.7 29.1 3.8 Q29.15 5.25 30.4 5.45 L30.35 5.35 30.35 5.3 30.65 4.9 30.75 4.85 Q31.1 5.15 30.95 5.75 L30.95 5.8 31.8 6.6 33.35 6.8 32.4 7.15 31.9 7.55 31.85 7.8 31.8 8.0 31.8 8.75 31.05 8.8 31.05 8.5 31.05 8.35 30.45 7.45 30.15 7.4 30.1 7.4 29.4 7.35 28.6 7.45 27.85 7.65 27.4 7.85 27.6 8.55 27.6 8.6 27.65 8.95 27.75 9.4 27.6 9.45 27.25 9.55 27.05 9.6 Q26.95 8.85 26.45 8.45 L26.55 8.15 26.55 8.1 26.55 8.05 Q26.4 7.8 25.85 7.7 24.95 7.75 24.3 8.3 L24.2 8.5 24.2 8.6 24.25 8.8 24.2 8.85 23.95 9.9 23.85 10.0 23.65 10.45 22.5 10.75 21.2 11.0 19.6 10.55 19.35 10.4 M28.5 1.7 L31.85 2.6 Q31.85 2.9 32.45 3.05 L33.65 3.45 Q35.15 4.2 36.35 5.45 L37.05 6.5 37.75 8.35 35.6 8.5 35.7 7.95 35.55 7.35 35.15 6.95 35.05 6.45 34.6 5.9 34.25 5.65 33.65 5.35 33.6 5.05 Q33.4 4.4 32.95 4.2 L32.75 4.15 32.25 4.2 32.1 4.25 32.05 4.25 32.0 3.8 Q31.75 3.0 30.65 2.75 L30.15 2.9 29.5 3.2 29.55 2.9 29.45 2.0 28.5 1.7 M22.05 8.7 L21.65 9.4 21.7 9.6 21.75 10.0 22.9 10.1 23.1 9.2 23.15 8.75 22.7 8.5 22.7 8.45 22.65 8.4 22.65 8.3 22.6 8.3 22.55 8.25 22.5 8.25 22.35 8.2 22.2 8.2 21.85 8.5 21.9 8.55 22.05 8.7 M21.25 7.85 L20.85 7.35 Q20.15 6.55 19.1 6.45 L19.0 6.5 18.95 6.55 Q18.8 7.4 18.3 8.05 L18.35 8.35 19.65 9.0 20.0 9.25 20.15 9.4 20.4 9.4 20.5 9.4 21.15 8.25 21.25 7.85" fill="#a31818" fill-rule="evenodd" stroke="none"/>
    <path d="M17.15 11.75 L19.35 10.4 19.6 10.55 21.2 11.0 22.5 10.75 23.65 10.45 27.05 9.6 27.25 9.55 27.6 9.45 27.75 9.4 27.8 9.35 31.05 8.8 31.8 8.75 32.3 8.75 31.95 8.7 32.1 8.65 35.6 8.5 37.75 8.35 37.05 6.5 36.35 5.45 Q35.15 4.2 33.65 3.45 35.5 3.65 37.05 4.45 L39.55 6.35 40.85 8.0 41.3 8.55 Q41.7 8.85 41.35 9.2 L37.1 9.3 37.15 9.4 37.1 9.5 37.1 9.6 37.1 9.65 37.15 9.85 37.1 10.15 37.05 10.25 36.9 10.45 36.65 10.25 Q35.45 8.5 33.25 8.9 L33.8 9.85 33.8 10.15 33.75 10.45 33.6 10.65 33.6 10.75 33.3 10.55 Q32.75 9.75 31.85 9.25 L31.25 9.3 31.2 9.45 31.2 9.85 31.05 10.2 30.75 10.35 30.7 10.25 30.6 10.1 30.5 9.65 30.55 9.5 Q29.5 9.25 28.5 9.95 L27.8 10.45 27.95 10.8 28.0 11.05 27.95 11.25 27.95 11.3 27.75 11.3 27.35 11.0 Q26.9 10.45 26.4 10.6 L26.4 10.8 26.35 11.0 26.3 11.1 26.25 11.1 25.8 11.1 25.75 10.95 25.7 10.75 25.6 10.75 25.05 10.9 24.1 11.95 23.35 11.85 23.9 11.05 24.2 10.6 23.35 10.95 Q22.15 11.5 21.15 12.55 L20.8 12.55 20.55 12.75 Q20.2 12.75 20.35 12.45 L20.95 11.8 21.25 11.4 21.1 11.4 20.85 11.25 18.9 12.4 17.15 11.75" fill="#cc7251" fill-rule="evenodd" stroke="none"/>
    <path d="M11.8 -8.6 L11.4 -8.6 Q10.55 -8.55 10.05 -8.15 L9.8 -8.2 8.25 -8.45 Q5.0 -8.8 1.95 -7.2 L-0.75 -5.25 -0.75 -5.65 1.5 -8.05 Q4.8 -9.85 8.35 -9.45 L10.05 -9.15 11.45 -8.75 11.8 -8.6 M-0.75 9.55 L1.35 11.55 Q2.8 12.75 8.75 15.05 14.65 17.3 18.85 20.6 22.95 23.8 28.4 22.9 33.85 22.0 36.55 20.15 L36.6 20.15 36.65 20.2 36.9 20.3 37.3 20.35 38.7 20.45 38.85 20.45 39.05 20.45 Q41.25 20.4 41.7 16.55 L41.85 12.5 41.8 10.25 41.55 7.55 40.45 6.35 39.7 5.65 Q35.5 0.95 38.4 -5.05 L38.85 -5.3 39.35 -4.65 38.85 -3.2 Q37.25 1.6 40.65 5.2 L40.8 5.3 40.75 5.3 42.35 6.95 42.55 7.45 42.8 10.2 42.85 12.5 42.7 16.65 Q42.1 21.55 39.05 21.45 L38.85 21.45 38.7 21.45 37.15 21.35 36.7 21.25 Q33.85 23.0 28.7 24.05 23.55 25.05 19.3 22.15 L9.5 16.05 Q6.7 15.45 3.65 13.9 0.55 12.3 -0.75 9.75 L-0.75 9.55 M18.75 -4.15 L18.7 -4.15 18.75 -4.15" fill="#7d3726" fill-rule="evenodd" stroke="none"/>
    <path d="M28.6 7.55 L28.6 7.45 29.4 7.35 28.6 7.55 M22.5 8.25 L22.55 8.25 22.5 8.25" fill="#da9e3d" fill-rule="evenodd" stroke="none"/>
    <path d="M16.6 7.9 Q15.85 6.7 15.6 5.3 L15.55 4.85 15.85 4.6 16.05 4.5 Q17.5 4.5 18.2 5.5 17.75 5.9 17.45 6.6 L16.9 7.7 Q16.75 7.7 16.6 7.85 L16.6 7.9 M27.5 1.45 L28.5 1.7 29.45 2.0 29.55 2.9 29.5 3.2 30.15 2.9 30.65 2.75 Q31.75 3.0 32.0 3.8 L32.05 4.25 32.1 4.25 32.25 4.2 32.75 4.15 32.95 4.2 Q33.4 4.4 33.6 5.05 L33.65 5.35 34.25 5.65 34.6 5.9 35.05 6.45 35.15 6.95 35.55 7.35 35.7 7.95 35.6 8.5 32.1 8.65 31.95 8.7 32.3 8.75 31.8 8.75 31.8 8.0 31.85 7.8 31.9 7.55 32.4 7.15 33.35 6.8 31.8 6.6 30.95 5.8 30.95 5.75 Q31.1 5.15 30.75 4.85 L30.65 4.9 30.35 5.3 30.35 5.35 30.4 5.45 Q29.15 5.25 29.1 3.8 L29.1 3.7 28.75 3.85 Q27.3 4.2 26.95 2.8 26.8 1.95 27.5 1.45 M32.0 4.55 L31.9 4.6 31.85 4.6 31.8 4.7 31.75 4.7 31.75 4.85 31.8 4.95 32.1 5.0 32.15 5.0 32.2 4.95 32.25 4.85 32.2 4.7 32.2 4.65 32.0 4.55 M33.35 7.55 L33.35 7.5 32.9 7.1 Q32.25 7.2 32.25 7.7 32.9 8.1 33.35 7.55 M32.8 5.7 L32.45 6.0 32.4 6.05 32.4 6.15 32.5 6.3 32.7 6.4 32.8 6.4 32.9 6.3 33.0 6.2 33.05 6.15 33.15 6.15 33.4 6.15 33.55 6.25 33.85 6.15 Q34.3 5.4 33.2 5.55 L32.8 5.7 M30.15 7.4 L30.45 7.45 31.05 8.35 31.05 8.5 31.05 8.8 27.8 9.35 27.75 9.4 27.65 8.95 27.6 8.6 27.6 8.55 27.4 7.85 27.85 7.65 28.6 7.45 28.6 7.55 28.4 7.7 Q28.15 8.45 29.1 8.1 L29.75 8.2 30.05 8.0 Q30.45 7.55 30.15 7.4 M22.7 8.45 L22.7 8.5 23.15 8.75 23.1 9.2 22.9 10.1 21.75 10.0 21.7 9.6 21.65 9.4 22.05 8.7 Q22.35 8.9 22.7 8.45 M22.2 8.2 L22.35 8.2 22.3 8.2 22.2 8.2 M24.25 8.8 Q24.45 9.2 25.1 8.65 L26.2 8.75 26.35 8.6 26.45 8.45 Q26.95 8.85 27.05 9.6 L23.65 10.45 23.85 10.0 23.95 9.9 24.2 8.85 24.25 8.8 M21.25 7.85 L21.15 8.25 20.5 9.4 20.4 9.4 20.15 9.4 20.0 9.25 19.65 9.0 18.35 8.35 18.3 8.05 Q18.8 7.4 18.95 6.55 L19.0 6.5 19.1 6.45 Q20.15 6.55 20.85 7.35 L21.25 7.85 M19.6 7.05 Q19.2 7.15 19.15 7.5 19.65 7.8 19.85 7.25 L19.8 7.15 19.7 7.05 19.6 7.05" fill="#fbcb7d" fill-rule="evenodd" stroke="none"/>
    <path d="M32.0 4.55 L32.2 4.65 32.2 4.7 32.25 4.85 32.2 4.95 32.15 5.0 32.1 5.0 31.8 4.95 31.75 4.85 31.75 4.7 31.8 4.7 31.85 4.6 31.9 4.6 32.0 4.55 M32.8 5.7 L33.2 5.55 Q34.3 5.4 33.85 6.15 L33.55 6.25 33.4 6.15 33.15 6.15 33.05 6.15 33.0 6.2 32.9 6.3 32.8 6.4 32.7 6.4 32.5 6.3 32.4 6.15 32.4 6.05 32.45 6.0 32.8 5.7 M33.35 7.55 Q32.9 8.1 32.25 7.7 32.25 7.2 32.9 7.1 L33.35 7.5 33.35 7.55 M30.15 7.4 Q30.45 7.55 30.05 8.0 L29.75 8.2 29.1 8.1 Q28.15 8.45 28.4 7.7 L28.6 7.55 29.4 7.35 30.1 7.4 30.15 7.4 M22.7 8.45 Q22.35 8.9 22.05 8.7 L21.9 8.55 21.85 8.5 22.2 8.2 22.3 8.2 22.35 8.2 22.5 8.25 22.55 8.25 22.6 8.3 22.65 8.3 22.65 8.4 22.7 8.45 M24.25 8.8 L24.2 8.6 24.2 8.5 24.3 8.3 Q24.95 7.75 25.85 7.7 26.4 7.8 26.55 8.05 L26.55 8.1 26.55 8.15 26.45 8.45 26.35 8.6 26.2 8.75 25.1 8.65 Q24.45 9.2 24.25 8.8 M19.6 7.05 L19.7 7.05 19.8 7.15 19.85 7.25 Q19.65 7.8 19.15 7.5 19.2 7.15 19.6 7.05" fill="#fcdba7" fill-rule="evenodd" stroke="none"/>
    <path d="M43.7 14.55 L43.7 14.6 42.0 14.55 Q42.65 14.15 43.5 14.2 43.8 14.3 43.7 14.55 M40.85 15.3 L40.8 15.2 40.8 15.1 Q41.3 14.7 41.95 14.75 42.3 14.8 42.5 15.0 L42.55 15.0 42.5 15.1 42.45 15.25 42.4 15.25 40.9 15.45 40.85 15.3 M42.35 15.35 L42.5 15.3 42.6 15.3 Q43.6 15.25 44.2 15.85 L44.25 15.85 44.2 16.1 44.0 16.25 42.35 15.95 42.25 15.75 42.25 15.55 42.25 15.5 42.3 15.45 42.35 15.35 M41.25 15.6 Q41.6 15.7 41.75 16.0 L41.75 16.05 41.65 16.3 41.5 16.4 40.9 16.05 40.85 15.9 40.9 15.75 41.15 15.6 41.25 15.6 M40.7 16.95 L40.75 16.8 40.95 16.7 Q42.5 16.7 43.75 17.45 L43.75 17.5 43.75 17.6 43.6 17.75 Q42.05 17.7 40.7 17.0 L40.7 16.95 M41.7 18.25 L41.8 18.1 41.85 18.1 41.95 18.05 42.15 18.0 43.3 18.6 43.35 18.65 43.3 18.75 43.25 18.85 43.2 18.9 Q42.3 18.85 41.7 18.35 L41.7 18.25 M42.15 20.3 L40.0 19.15 40.0 19.25 Q38.95 19.35 38.8 18.2 38.9 18.0 39.1 18.0 L39.25 18.05 39.35 18.1 39.9 18.9 39.95 18.8 40.4 18.65 Q41.8 18.95 42.45 20.05 L42.45 20.1 42.35 20.2 42.15 20.3 M41.4 21.5 Q40.3 21.1 40.2 20.05 L40.2 20.0 40.35 19.95 40.4 19.9 41.65 21.3 41.5 21.45 41.4 21.5 M25.95 16.7 L26.35 16.85 26.35 16.9 26.1 17.25 25.95 17.3 25.65 17.1 25.65 17.05 Q25.6 16.85 25.85 16.75 L25.95 16.7 M27.35 17.85 L27.2 17.6 27.2 17.5 Q27.3 17.3 27.5 17.3 L27.8 17.6 27.8 17.65 Q27.7 18.0 27.35 17.85 M29.3 16.1 L29.35 16.35 29.25 16.5 28.85 16.55 28.8 16.5 28.7 16.4 28.65 16.3 28.7 16.15 28.75 16.1 28.85 16.0 28.9 15.95 29.0 15.9 29.25 16.05 29.3 16.1 M20.95 17.7 L20.95 17.75 20.8 18.0 20.7 18.05 Q20.4 17.95 20.45 17.7 L20.6 17.5 20.7 17.5 20.95 17.7 M22.7 18.0 Q22.35 18.1 22.3 17.8 22.3 17.55 22.55 17.55 22.9 17.65 22.75 17.95 L22.7 18.0 M24.15 18.1 Q24.25 17.95 24.45 17.95 L24.7 18.0 24.8 18.05 24.85 18.15 24.9 18.3 24.9 18.4 24.8 18.6 24.1 18.45 24.05 18.3 24.15 18.1 M23.4 19.5 L23.65 19.65 23.7 19.7 23.45 20.15 23.4 20.15 23.1 20.15 23.0 20.0 23.0 19.85 23.15 19.65 23.25 19.55 23.3 19.55 23.4 19.5 M24.75 21.0 Q25.05 20.2 25.7 19.5 L25.8 19.45 26.05 19.55 26.05 19.6 Q25.9 20.8 24.8 21.0 L24.75 21.0 M21.15 19.85 L21.05 20.0 21.0 20.1 Q20.65 20.2 20.35 20.4 L20.1 20.15 20.1 20.1 Q20.4 19.65 20.85 19.6 L21.1 19.8 21.15 19.85 M20.75 20.65 L21.75 19.75 Q22.0 20.35 21.2 20.85 L21.1 20.9 20.65 20.9 20.8 20.7 20.75 20.65 M22.25 21.6 L22.5 21.75 22.55 21.8 21.8 23.0 21.7 23.05 21.6 23.0 21.55 22.9 Q21.65 23.4 21.1 24.0 L20.55 24.35 20.3 24.1 Q20.8 23.3 21.5 22.75 L21.45 22.8 Q21.65 22.25 22.0 21.8 L22.1 21.7 22.15 21.65 22.25 21.6 M22.65 23.75 Q22.9 22.75 23.5 21.9 L23.55 21.85 23.65 21.8 23.75 21.75 Q24.05 22.35 23.75 23.05 L23.85 23.15 23.85 23.2 23.45 25.05 23.4 25.2 23.05 25.15 Q22.9 24.45 23.1 23.85 L23.05 23.85 22.8 23.9 22.7 23.8 22.65 23.75 M25.05 22.85 Q24.95 22.0 25.4 21.45 26.0 22.2 25.4 23.0 L25.3 23.05 25.05 22.85 M25.2 23.2 L25.05 24.55 24.9 24.7 24.55 24.6 24.5 24.55 24.6 23.7 24.65 23.4 Q24.5 23.2 24.65 23.05 24.75 22.95 24.8 22.95 L25.2 23.15 25.2 23.2 M29.35 18.85 L28.9 19.35 28.8 19.35 28.55 19.15 Q28.5 18.75 28.95 18.6 L29.05 18.55 29.35 18.8 29.35 18.85 M30.05 19.7 L30.2 20.4 30.15 20.65 29.7 20.7 29.45 20.0 29.45 19.85 29.6 19.65 29.75 19.6 30.0 19.65 30.05 19.7 M27.95 19.35 Q28.25 19.85 27.75 20.4 L27.65 20.45 27.45 20.25 27.65 19.55 27.7 19.5 Q27.8 19.4 27.95 19.4 L27.95 19.35 M29.35 21.1 L29.25 22.3 29.25 22.4 28.85 22.35 Q28.65 21.6 29.1 21.0 L29.15 20.95 29.3 21.05 29.35 21.1 M26.7 21.75 Q27.5 22.55 27.2 23.8 L27.2 23.85 27.05 24.0 26.95 24.05 26.6 23.95 Q26.35 22.85 26.6 21.85 L26.7 21.75 M27.2 23.95 L27.5 24.1 27.55 24.15 27.6 24.95 27.5 25.15 27.1 25.15 Q26.95 24.6 27.1 24.05 L27.2 23.95 M29.95 21.75 L30.2 21.6 Q30.7 22.25 30.7 23.3 L30.65 23.35 30.25 23.5 Q29.85 22.75 29.9 21.85 L29.95 21.75 M28.5 23.15 L28.65 23.2 28.7 23.25 28.95 24.15 28.95 24.3 28.9 24.35 28.85 24.45 28.85 24.65 28.8 24.75 Q28.15 24.3 28.25 23.35 L28.25 23.3 28.4 23.15 28.5 23.15 M29.85 23.5 L29.95 23.55 30.55 24.9 30.55 25.05 30.25 25.15 Q29.45 24.5 29.6 23.55 L29.7 23.45 29.85 23.5 M39.45 13.6 L39.5 13.6 39.6 13.6 39.6 13.55 Q39.85 13.55 39.95 13.7 L40.0 13.75 40.05 13.9 39.95 14.15 39.35 14.1 39.3 14.0 39.3 13.8 39.35 13.75 39.35 13.7 39.45 13.6 M37.35 14.2 L37.35 14.3 37.15 14.5 37.05 14.55 36.8 14.25 Q36.8 14.05 36.95 14.0 L37.05 14.0 Q37.3 14.0 37.35 14.2 M36.4 17.85 L36.4 17.7 36.5 17.5 36.65 17.4 36.8 17.4 36.8 17.35 37.05 17.45 37.1 17.5 Q37.3 17.9 37.1 18.3 L37.0 18.4 36.6 18.35 36.4 17.85 M37.9 18.3 L38.2 19.35 38.15 19.5 Q38.0 19.75 37.7 19.65 37.2 19.15 37.4 18.45 L37.45 18.35 37.7 18.2 37.85 18.25 37.9 18.3 M39.5 16.35 L39.4 16.5 39.2 16.6 Q37.9 16.35 38.35 15.6 L38.35 15.55 39.1 15.75 39.15 15.8 39.3 16.0 39.5 16.35 M39.8 16.75 L40.25 17.1 40.25 17.15 40.25 17.35 40.05 17.5 Q39.6 17.6 39.45 17.15 L39.45 17.05 39.6 16.85 39.8 16.75 M33.35 15.35 L33.25 15.35 Q32.95 15.3 33.0 15.0 L33.15 14.85 33.25 14.85 33.5 15.05 33.5 15.1 33.35 15.35 M31.9 16.8 L31.75 17.05 31.6 17.05 Q31.3 17.0 31.35 16.7 L31.5 16.55 31.6 16.55 31.85 16.75 31.9 16.8 M35.1 15.9 L35.4 16.05 35.4 16.1 35.45 16.35 35.35 16.5 34.95 16.55 34.9 16.5 34.8 16.4 34.8 16.3 34.8 16.15 34.85 16.1 34.95 16.0 35.0 15.95 35.1 15.9 M35.1 17.7 L34.95 17.85 34.5 17.75 34.4 17.5 34.4 17.3 34.8 17.05 34.95 17.1 35.05 17.15 35.15 17.25 35.2 17.4 35.1 17.7 M33.15 18.35 Q33.7 18.55 33.85 19.05 L33.85 19.15 33.8 19.35 33.65 19.5 33.25 19.45 32.7 18.8 32.65 18.75 32.7 18.65 32.8 18.45 33.15 18.35 M34.7 19.3 L34.7 19.1 34.85 18.95 34.95 18.95 35.7 19.75 35.7 19.8 35.7 20.0 35.6 20.15 35.2 20.15 35.15 20.1 34.7 19.3 M33.3 19.8 Q34.7 21.0 35.35 22.8 L35.4 22.85 35.3 23.1 35.15 23.25 34.75 23.2 33.1 20.2 33.1 19.95 33.3 19.8 M31.9 19.8 L32.0 19.85 32.1 19.9 32.6 21.15 32.65 21.25 32.55 21.5 32.4 21.6 32.0 21.55 Q31.6 20.95 31.6 20.2 L31.6 20.05 Q31.65 19.9 31.85 19.85 L31.9 19.8 M31.25 19.25 Q30.9 19.4 30.8 19.05 L30.8 18.95 30.9 18.8 31.1 18.7 31.4 18.95 31.4 19.0 31.35 19.15 31.25 19.25 M32.8 24.5 L31.2 22.35 31.2 22.2 31.3 22.05 31.45 22.0 Q32.75 22.45 33.0 23.8 L33.0 23.85 33.15 24.1 33.15 24.4 32.9 24.5 32.8 24.5 M33.3 22.1 L34.65 23.45 34.65 23.5 34.65 23.6 34.55 23.8 34.2 23.85 Q33.35 23.3 33.05 22.4 L33.05 22.3 33.15 22.15 33.3 22.1 M38.7 19.6 Q39.7 20.2 39.85 21.35 L39.85 21.4 39.4 21.55 38.6 20.3 38.55 20.05 38.35 19.9 38.35 19.8 38.45 19.65 38.7 19.6 M38.05 21.2 Q38.45 21.75 38.35 22.4 L38.3 22.5 38.1 22.55 37.95 22.55 37.5 21.35 37.45 21.25 Q37.55 21.1 37.75 21.1 L37.85 21.1 38.0 21.15 38.05 21.2 M36.15 20.55 L36.35 20.6 36.45 20.65 36.8 21.4 36.85 21.55 36.8 21.8 36.7 21.9 36.55 21.9 36.4 21.85 Q35.8 21.25 36.1 20.6 L36.15 20.55 M19.45 19.1 L19.5 19.15 19.15 19.5 19.05 19.5 18.75 19.3 18.75 19.25 18.9 18.95 19.05 18.9 19.45 19.1 M17.95 21.2 Q18.5 20.6 19.3 20.35 19.45 20.85 18.65 21.25 L18.15 21.45 17.95 21.2 M20.15 21.35 L20.15 21.4 Q19.75 21.85 19.25 21.55 L19.3 21.45 19.35 21.35 19.65 21.2 19.85 21.0 19.9 21.0 20.15 21.35 M17.5 20.1 L17.55 20.15 Q17.2 20.8 16.55 20.75 L16.45 20.7 Q16.6 20.2 17.2 20.0 L17.3 20.0 17.5 20.1 M17.2 19.9 L17.75 19.55 Q17.95 19.95 17.2 19.9" fill="#cccee8" fill-rule="evenodd" stroke="none"/>
    <path d="M43.7 14.85 L43.6 14.95 43.0 15.2 Q43.9 15.3 44.2 16.1 L44.2 16.3 44.1 16.4 43.95 16.45 42.1 16.1 42.05 16.1 41.8 15.8 41.8 15.75 41.8 15.55 41.9 15.3 42.0 15.25 42.2 15.2 41.6 14.85 41.5 14.75 41.5 14.6 41.55 14.55 41.65 14.45 Q42.35 14.0 43.3 14.05 L43.35 14.1 43.7 14.35 43.7 14.7 43.7 14.85 M41.45 15.55 L41.55 15.65 41.65 15.8 41.75 16.1 41.55 16.55 41.05 16.75 Q40.75 16.75 40.55 16.55 L40.35 16.1 40.55 15.65 40.6 15.6 Q40.7 15.5 40.9 15.5 L41.05 15.45 41.45 15.55 M41.2 18.35 L41.3 18.2 Q41.85 17.55 42.75 17.95 43.45 18.25 43.3 18.9 L43.25 19.0 43.2 19.1 43.05 19.2 Q42.0 19.45 41.25 18.5 L41.2 18.35 M40.1 14.0 L39.9 14.45 39.45 14.6 39.05 14.45 38.8 14.0 Q38.8 13.75 39.05 13.55 39.2 13.4 39.45 13.4 L39.9 13.55 40.1 14.0 M36.75 14.75 L36.65 14.55 36.7 14.6 Q36.45 13.95 36.75 13.9 36.9 13.7 37.3 14.25 L37.35 14.4 37.35 14.5 37.1 14.85 Q36.85 14.95 36.75 14.75 M38.1 15.4 L39.0 15.65 39.05 15.7 39.1 15.75 39.25 15.95 39.5 16.45 39.5 16.55 39.45 16.65 39.6 16.6 Q40.1 16.7 40.25 17.15 L40.25 17.2 40.25 17.55 39.9 17.85 39.85 17.85 Q39.2 18.0 39.0 17.35 L38.95 17.25 38.95 17.15 39.0 17.05 39.05 16.95 38.9 16.95 Q38.15 16.8 37.9 16.5 37.55 16.15 37.85 15.65 L37.95 15.5 Q38.0 15.4 38.1 15.4 M37.05 17.45 L37.2 18.0 37.2 18.1 37.45 18.05 37.65 18.1 37.9 18.35 38.2 19.4 38.2 19.45 38.2 19.6 38.4 19.55 38.55 19.6 Q39.35 20.1 39.75 20.85 L39.8 21.65 Q39.7 21.95 39.15 21.9 L39.0 21.85 38.95 21.8 37.9 20.05 37.85 20.0 37.4 20.0 37.3 19.95 Q36.75 19.4 36.85 18.7 L36.55 18.8 36.1 18.55 35.9 18.0 36.1 17.45 Q36.3 17.2 36.55 17.2 L37.05 17.45 M39.2 18.0 L39.8 18.65 40.1 18.55 40.2 18.5 Q41.95 18.85 42.35 20.25 L42.35 20.45 42.2 20.55 42.0 20.55 39.7 19.5 38.95 19.4 38.8 19.35 38.5 19.0 Q38.2 18.45 38.35 18.2 38.45 17.85 39.05 17.9 L39.2 18.0 M40.35 19.85 L41.45 21.4 41.5 21.6 41.45 21.75 41.25 21.8 41.0 21.7 40.2 21.25 40.15 21.25 Q39.7 20.9 39.7 20.55 39.6 20.15 40.0 19.85 L40.1 19.75 40.25 19.8 40.35 19.85 M36.85 21.3 L36.7 21.95 Q36.45 22.25 36.2 22.25 L35.75 21.95 35.55 21.3 35.75 20.7 Q35.95 20.35 36.2 20.35 L36.7 20.7 36.85 21.3 M37.1 21.15 L37.65 21.1 Q38.2 21.35 38.35 21.7 38.5 22.1 38.25 22.6 L38.25 22.55 38.05 22.85 37.9 22.9 37.75 22.9 37.65 22.75 37.0 21.45 37.0 21.3 37.1 21.15 M20.7 18.3 L20.6 18.35 20.5 18.4 20.4 18.4 Q19.85 18.2 19.95 17.75 L20.0 17.75 Q20.05 17.45 20.25 17.4 L20.35 17.35 20.45 17.35 Q20.85 17.35 20.95 17.75 L20.95 17.85 20.7 18.3 M21.8 17.9 Q21.8 17.4 22.3 17.4 L22.4 17.4 22.75 17.7 22.75 18.15 22.7 18.25 22.65 18.3 22.55 18.35 22.1 18.35 21.8 17.95 21.8 17.9 M24.75 17.95 L24.95 18.4 24.75 18.85 24.25 19.05 Q23.95 19.05 23.75 18.85 L23.55 18.4 23.75 17.95 24.25 17.75 24.75 17.95 M25.45 16.65 L25.65 16.55 Q26.05 16.45 26.3 16.8 L26.35 16.95 Q26.45 17.35 26.0 17.55 L25.7 17.65 25.2 17.3 25.15 17.2 Q25.05 16.8 25.45 16.65 M19.45 19.55 L19.4 19.75 19.2 19.8 18.5 19.8 18.35 19.75 18.25 19.55 18.25 19.0 18.35 18.85 Q18.4 18.75 18.5 18.75 L19.2 18.75 19.4 18.85 19.45 19.0 19.45 19.55 M20.6 19.45 Q20.95 19.45 21.1 19.8 L21.15 19.9 21.35 19.7 Q21.4 19.6 21.5 19.6 L21.65 19.65 21.75 19.75 21.75 19.9 21.55 20.8 21.5 20.95 21.35 21.0 20.6 21.05 20.45 21.05 20.35 20.9 20.3 20.75 20.4 20.65 20.25 20.7 20.1 20.75 Q19.6 20.75 19.6 20.25 L19.6 20.2 19.65 20.05 Q20.0 19.5 20.6 19.45 M19.3 20.4 Q19.45 20.8 19.1 21.2 L19.8 21.0 19.95 21.05 20.05 21.1 20.1 21.25 20.1 21.4 20.05 21.55 19.7 22.0 19.55 22.05 19.4 22.05 18.95 21.85 18.85 21.75 18.8 21.6 18.9 21.35 18.5 21.6 18.0 21.8 17.9 21.8 17.55 21.65 17.45 21.25 17.55 21.15 Q18.1 20.45 19.0 20.2 L19.2 20.25 19.3 20.4 M17.6 20.15 L17.4 20.25 Q17.4 20.95 16.75 21.15 L16.6 21.15 16.4 21.1 16.25 21.0 16.2 20.85 Q16.2 20.4 16.7 20.05 L16.75 19.9 Q16.95 19.45 17.5 19.4 L17.65 19.45 17.75 19.55 Q17.95 20.0 17.6 20.15 M19.8 24.2 L19.85 24.05 21.8 21.55 Q21.85 21.45 21.95 21.45 L22.15 21.5 22.4 21.85 22.4 21.95 21.65 23.2 21.55 23.25 21.5 23.6 21.45 23.7 21.0 24.25 20.4 24.7 Q20.05 24.75 19.85 24.3 L19.8 24.2 M23.7 19.9 L23.55 20.35 23.1 20.5 22.7 20.35 22.5 19.9 22.7 19.5 Q22.85 19.3 23.1 19.3 L23.55 19.5 23.7 19.9 M24.25 21.1 L24.35 20.95 25.65 19.5 25.75 19.4 25.9 19.45 26.05 19.55 26.05 19.7 25.9 20.3 Q25.4 21.45 24.5 21.35 L24.35 21.3 24.25 21.1 M23.5 21.7 L23.65 21.85 23.8 22.45 23.8 22.5 23.9 23.25 Q24.1 24.95 23.15 25.55 L23.05 25.6 22.9 25.6 22.65 25.25 22.35 24.3 22.35 24.25 22.2 24.0 22.15 23.9 22.2 23.75 23.2 21.8 23.35 21.65 23.5 21.7 M25.1 21.3 L25.25 21.3 25.35 21.4 Q26.05 22.3 25.35 23.25 L25.25 23.35 25.2 23.35 25.15 23.4 25.2 23.9 25.1 24.6 24.6 25.05 Q24.3 25.1 24.15 24.6 L24.0 23.9 Q24.0 23.5 24.15 23.2 24.3 22.75 24.55 22.75 24.5 21.95 24.95 21.4 L25.1 21.3 M33.5 15.15 L33.5 15.5 Q33.35 15.75 33.1 15.65 L33.0 15.55 32.95 15.5 Q32.5 15.05 32.65 14.9 L33.4 14.95 33.45 15.0 33.5 15.15 M31.35 16.4 Q31.7 16.4 31.85 16.75 L31.9 16.85 31.9 17.0 31.7 17.35 31.5 17.4 31.35 17.4 31.3 17.4 Q30.75 17.3 30.85 16.75 L30.9 16.7 Q30.95 16.5 31.15 16.45 L31.25 16.4 31.35 16.4 M33.05 18.25 L33.55 18.55 33.6 18.6 33.65 18.7 33.8 19.4 33.8 19.55 33.65 19.7 33.55 19.85 33.4 19.85 33.35 19.85 34.4 21.2 35.25 22.9 35.25 22.85 35.3 23.2 35.3 23.35 35.15 23.45 35.05 23.5 34.9 23.5 34.75 23.4 32.8 20.35 32.8 20.3 Q32.65 20.15 32.85 19.8 L32.95 19.7 33.05 19.65 32.65 19.4 32.7 19.45 Q32.05 19.05 32.15 18.75 32.15 18.4 32.85 18.2 L33.05 18.25 M35.1 17.1 L35.3 17.55 35.1 18.0 34.6 18.2 Q34.3 18.2 34.1 18.0 L33.9 17.55 34.1 17.1 Q34.3 16.9 34.6 16.9 L34.65 16.9 34.5 16.8 34.3 16.35 34.5 15.95 Q34.65 15.75 34.9 15.75 L35.35 15.95 35.5 16.35 35.35 16.8 34.9 16.95 35.1 17.1 M26.75 17.5 L27.25 17.15 27.3 17.15 27.8 17.65 27.8 17.75 27.8 17.85 27.5 18.2 27.0 18.2 27.05 18.2 Q26.7 18.1 26.7 17.7 L26.7 17.6 26.75 17.5 M28.85 18.4 L29.35 18.85 29.35 18.95 29.35 19.05 28.8 19.7 28.65 19.7 28.55 19.7 Q28.15 19.7 28.05 19.3 27.95 18.7 28.55 18.5 L28.8 18.4 28.85 18.4 M28.75 16.95 L28.35 16.8 28.15 16.35 28.35 15.95 28.75 15.75 29.2 15.95 29.35 16.35 29.2 16.8 28.75 16.95 M30.3 19.25 L30.3 19.15 30.3 19.05 30.35 18.95 30.5 18.75 30.55 18.7 30.75 18.6 30.9 18.55 31.4 19.0 31.4 19.1 31.3 19.45 31.2 19.55 31.1 19.6 30.6 19.6 30.3 19.25 M30.05 19.85 L29.95 20.95 29.9 21.05 29.8 21.15 29.65 21.15 29.35 21.0 29.3 20.95 Q28.85 20.2 28.95 19.9 29.05 19.45 29.85 19.55 L30.0 19.65 30.05 19.85 M29.3 21.05 L29.3 21.2 29.05 22.65 29.0 22.8 28.85 22.85 28.7 22.85 28.6 22.75 Q28.1 21.9 28.7 21.05 28.75 20.9 29.0 20.9 L29.15 20.95 29.3 21.05 M29.75 21.6 L29.9 21.7 30.5 22.4 Q30.85 22.8 30.8 23.15 L30.4 23.85 30.25 23.9 30.1 23.85 30.0 23.75 29.45 21.95 29.5 21.75 29.6 21.65 29.75 21.6 M27.85 19.3 L27.95 19.45 28.05 19.95 28.05 20.05 28.0 20.15 27.6 20.7 27.45 20.8 27.3 20.8 27.2 20.65 27.15 20.5 27.45 19.45 27.55 19.3 27.7 19.25 27.85 19.3 M26.45 21.6 L26.6 21.65 Q27.35 22.3 27.3 23.35 L27.3 23.4 27.25 23.95 27.4 24.1 27.45 24.15 Q27.95 25.05 27.2 25.55 L27.05 25.6 26.9 25.55 26.8 25.4 26.75 24.4 26.65 24.4 26.55 24.25 Q26.2 23.6 26.15 23.05 26.1 22.4 26.2 21.8 L26.3 21.65 26.45 21.6 M28.25 23.0 L28.4 23.05 28.5 23.2 28.85 24.7 28.85 24.85 28.75 24.95 Q28.4 25.15 28.15 24.95 L27.85 24.4 Q27.6 23.55 28.05 23.1 L28.25 23.0 M29.3 23.35 L29.45 23.3 29.6 23.35 29.7 23.45 30.45 25.2 30.45 25.35 30.4 25.5 30.25 25.55 30.1 25.55 29.9 25.4 Q28.9 24.55 29.2 23.5 L29.3 23.35 M35.75 19.65 L35.55 20.25 34.95 20.45 34.4 20.25 34.15 19.65 Q34.15 19.3 34.4 19.1 34.6 18.85 34.95 18.85 35.3 18.85 35.55 19.1 L35.75 19.65 M31.9 19.6 Q32.3 19.6 32.55 20.0 L32.7 20.8 32.55 21.6 31.9 22.0 31.3 21.6 31.1 20.8 31.3 20.0 Q31.5 19.6 31.9 19.6 M33.1 22.15 Q34.45 22.55 34.55 23.9 L34.55 24.05 34.4 24.15 34.25 24.2 34.05 24.15 33.25 23.7 33.25 23.75 Q33.45 24.35 32.8 24.8 L32.6 24.85 32.45 24.75 30.85 22.5 Q30.7 22.25 30.85 22.1 30.9 21.95 31.1 21.9 L31.2 21.85 31.3 21.9 31.95 22.25 32.65 22.8 32.55 22.45 32.6 22.35 32.65 22.25 33.1 22.15" fill="#cccee8" fill-rule="evenodd" stroke="none"/>
  </g>
</svg>
