<?xml version="1.0" encoding="UTF-8" standalone="no"?>
<svg xmlns:xlink="http://www.w3.org/1999/xlink" height="64.45px" width="63.85px" xmlns="http://www.w3.org/2000/svg">
  <g transform="matrix(1.0, 0.0, 0.0, 1.0, 32.9, 31.0)">
    <path d="M12.25 -29.35 Q17.95 -27.8 21.7 -23.2 L21.7 -23.25 Q26.85 -17.05 28.0 -9.4 29.9 -6.95 29.55 -5.35 L29.4 -4.45 Q30.1 -2.55 29.75 -0.35 30.3 1.0 30.25 2.55 30.05 5.85 29.3 8.85 L29.3 8.9 28.4 11.6 28.7 12.0 Q30.75 15.2 30.95 18.2 31.05 19.8 30.6 21.4 L30.65 21.4 Q29.45 25.45 30.15 29.05 L30.1 29.65 11.0 32.65 -8.95 19.95 -23.35 19.95 Q-28.4 12.9 -31.4 4.65 -34.35 -3.6 -31.5 -11.75 -28.7 -19.8 -21.8 -24.95 -14.15 -30.7 -4.5 -30.95 3.9 -31.2 12.2 -29.35 L12.25 -29.35" fill="#7d3726" fill-rule="evenodd" stroke="none"/>
    <path d="M8.55 -27.75 Q0.15 -29.8 -8.4 -27.95 -15.6 -26.4 -21.85 -22.05 L-21.7 -21.6 Q-12.2 -26.2 -1.65 -26.85 7.45 -26.85 15.2 -22.2 L18.9 -19.4 19.95 -20.1 Q17.85 -23.55 14.35 -25.5 11.6 -27.2 8.55 -27.75 M-10.15 21.45 L-11.45 21.45 Q-20.75 21.85 -22.45 19.5 -27.45 12.5 -30.45 4.3 -33.3 -3.6 -30.55 -11.45 -27.85 -19.2 -21.2 -24.15 -13.8 -29.7 -4.5 -29.95 3.8 -30.2 11.95 -28.4 17.35 -26.9 20.9 -22.6 25.95 -16.55 27.0 -9.05 28.75 -6.85 28.55 -5.5 L28.3 -4.45 Q29.15 -2.55 28.7 -0.25 29.3 1.05 29.25 2.5 29.05 5.7 28.35 8.6 L27.85 8.25 27.25 7.95 Q27.1 5.2 25.0 3.55 23.75 4.6 22.95 5.8 L21.35 5.75 Q18.7 6.05 16.15 5.15 L16.1 5.15 Q12.45 3.05 8.15 2.75 L7.15 3.0 5.6 3.4 Q3.45 3.8 1.7 5.1 -1.1 7.1 -2.0 10.2 L-2.0 10.15 Q-1.45 8.25 -0.1 6.75 L-0.2 6.7 -0.3 6.65 -0.4 6.7 -2.2 8.55 -3.4 10.35 Q-5.05 11.5 -7.25 11.55 L-6.65 10.75 -6.3 10.75 -5.9 10.7 Q-5.45 10.1 -6.3 10.05 -7.95 9.3 -9.8 9.05 -10.15 9.0 -10.3 9.3 L-10.3 9.45 -7.5 10.6 -8.05 11.55 -8.8 11.45 -8.9 11.55 -9.05 11.7 -9.1 11.9 -8.9 12.2 -8.25 12.3 -8.25 12.4 -10.15 12.25 -10.85 12.4 -10.85 12.45 -12.95 12.45 -15.15 12.75 -15.75 12.7 -16.65 12.8 -16.7 12.8 -17.05 12.85 -17.1 12.9 -17.15 12.95 -17.2 13.0 -17.2 13.1 Q-16.95 13.35 -16.55 13.4 L-16.15 13.45 -14.2 13.45 -9.15 13.2 -9.1 13.2 -8.9 13.2 -8.25 13.2 -8.2 13.2 -5.5 13.15 -5.4 13.25 -5.1 13.35 -5.1 13.4 -5.05 14.2 -5.1 14.3 -5.15 14.35 -5.05 14.3 -4.65 16.05 -3.95 17.85 Q-3.65 18.6 -3.0 18.65 -2.8 18.3 -3.05 17.95 L-3.35 17.25 Q-3.95 15.75 -3.85 14.1 L-3.55 14.15 -3.1 12.75 -2.95 12.6 -2.95 12.95 -3.2 13.1 -3.2 13.2 -1.95 15.9 Q-1.2 17.15 -0.1 18.05 1.8 19.65 4.05 20.7 5.0 21.1 5.35 20.4 4.5 19.6 3.25 19.2 2.6 19.0 2.1 18.55 L0.95 17.55 0.75 17.4 Q4.5 19.6 9.1 19.15 L12.2 18.75 Q14.7 18.4 16.35 16.55 L16.45 16.5 16.35 16.75 15.9 17.75 14.45 19.6 Q13.25 20.9 11.7 21.65 L10.7 21.9 Q9.8 21.9 10.1 22.55 L12.2 22.35 13.9 21.55 Q16.45 19.9 17.65 17.15 18.8 14.4 19.45 11.5 L19.9 10.1 20.0 9.55 19.7 9.75 Q20.0 9.45 20.55 9.5 21.85 9.9 21.75 11.35 L21.7 12.05 22.05 13.7 23.0 16.45 26.55 20.05 26.75 20.1 27.4 20.5 27.75 21.3 28.2 23.0 28.25 22.85 28.0 23.75 27.15 24.0 Q24.0 25.25 20.75 24.5 L20.05 24.4 19.45 24.65 19.3 24.9 19.2 25.05 19.15 25.1 19.0 25.15 20.55 25.55 20.65 25.7 20.75 25.8 21.05 26.15 21.05 26.25 18.1 26.35 Q17.05 26.0 16.1 25.45 15.3 25.0 15.3 24.35 L15.05 23.8 15.1 23.75 Q16.25 22.2 16.15 20.75 L16.05 20.8 Q14.4 22.3 13.9 24.4 15.6 25.0 17.1 26.15 19.2 27.75 21.8 28.4 23.45 29.6 25.4 29.6 L25.5 29.5 25.55 28.8 26.4 29.0 27.25 28.5 27.8 27.65 27.7 28.95 26.65 29.95 25.85 30.05 25.55 30.1 Q24.85 30.3 24.3 31.05 L23.85 31.05 Q22.15 30.25 20.85 31.7 L20.25 31.8 Q19.65 30.9 18.85 31.5 17.6 31.3 16.55 31.85 L15.85 31.8 Q15.6 31.35 15.15 31.35 L13.85 32.05 12.2 32.2 12.1 32.15 11.85 31.9 11.85 31.6 11.65 30.85 11.4 30.85 Q10.7 31.3 10.9 32.05 L9.05 31.9 8.95 31.8 8.8 31.65 8.55 30.75 8.2 29.8 Q7.2 27.4 5.15 26.0 4.8 25.5 3.95 25.3 L3.35 25.0 2.95 24.85 1.5 24.3 Q-1.3 27.4 -4.95 25.9 -8.65 24.35 -9.15 21.45 L-9.3 18.45 -9.9 19.85 -10.15 21.45 M21.7 7.7 Q21.5 8.2 21.75 8.55 20.35 8.55 19.7 7.3 L19.75 7.25 21.3 6.95 21.75 7.0 21.8 7.15 21.85 7.25 21.7 7.7 M21.6 9.95 L21.8 8.7 Q21.65 9.2 21.65 9.75 L21.6 9.95 M26.0 16.05 L26.3 15.55 27.35 15.55 27.85 16.15 27.9 16.2 27.95 16.25 28.6 18.25 28.75 20.05 28.4 19.6 Q27.55 18.75 27.05 17.65 26.65 16.7 26.0 16.05 M18.85 10.05 L18.8 9.95 18.9 10.0 18.85 10.05 M0.3 22.95 L0.4 22.85 0.5 22.75 0.65 22.6 0.65 22.5 Q0.1 19.8 -2.85 19.25 L-3.0 19.3 -3.15 19.35 -3.25 19.45 -3.35 19.65 -3.4 19.8 -3.2 20.2 -1.4 21.45 -1.4 21.65 -1.35 21.85 -1.3 22.05 -1.0 22.3 Q-0.45 22.9 0.3 22.95 M17.55 24.9 L17.3 24.9 17.55 24.9 M-7.2 14.25 L-7.2 14.2 -7.25 14.15 -7.4 14.05 -7.2 14.25 M-6.15 13.7 L-6.2 13.65 -6.35 13.55 -6.4 13.55 -6.15 13.7 M-2.4 10.7 L-2.0 10.2 -2.15 10.65 -2.2 10.65 -2.35 10.7 -2.4 10.7 M-7.25 7.4 L-7.35 7.4 -7.45 7.5 -7.5 7.65 -7.45 7.75 -7.05 8.2 -5.35 9.2 Q-4.5 9.6 -4.55 8.75 L-4.5 8.65 -3.55 7.3 -3.55 7.25 Q-3.55 6.9 -3.95 6.9 L-5.45 8.2 Q-6.45 7.9 -7.25 7.4 M-7.05 8.6 Q-7.4 8.8 -6.95 9.1 L-5.85 9.75 -4.8 9.95 -4.8 9.85 -4.8 9.75 -4.85 9.7 -7.05 8.6" fill="#f1926d" fill-rule="evenodd" stroke="none"/>
    <path d="M-10.15 21.45 L-9.9 19.85 -9.3 18.45 -9.15 21.45 Q-8.65 24.35 -4.95 25.9 -1.3 27.4 1.5 24.3 L2.95 24.85 3.35 25.0 3.95 25.3 Q4.8 25.5 5.15 26.0 7.2 27.4 8.2 29.8 L8.55 30.75 8.8 31.65 8.95 31.8 9.05 31.9 10.9 32.05 Q10.7 31.3 11.4 30.85 L11.65 30.85 11.85 31.6 11.85 31.9 12.1 32.15 12.2 32.2 13.85 32.05 15.15 31.35 Q15.6 31.35 15.85 31.8 L16.55 31.85 Q17.6 31.3 18.85 31.5 19.65 30.9 20.25 31.8 L20.85 31.7 Q22.15 30.25 23.85 31.05 L24.3 31.05 Q24.85 30.3 25.55 30.1 L25.85 30.05 26.0 30.05 26.15 30.2 26.65 29.95 27.7 28.95 27.8 27.65 27.25 28.5 26.4 29.0 25.55 28.8 25.5 29.5 25.4 29.6 Q23.45 29.6 21.8 28.4 19.2 27.75 17.1 26.15 15.6 25.0 13.9 24.4 14.4 22.3 16.05 20.8 L16.15 20.75 Q16.25 22.2 15.1 23.75 L15.05 23.8 15.3 24.35 Q15.3 25.0 16.1 25.45 17.05 26.0 18.1 26.35 L21.05 26.25 21.05 26.15 20.75 25.8 20.65 25.7 20.55 25.55 19.0 25.15 19.15 25.1 19.2 25.05 19.3 24.9 19.45 24.65 20.05 24.4 20.75 24.5 Q24.0 25.25 27.15 24.0 L28.0 23.75 28.25 22.85 28.2 23.0 27.75 21.3 27.4 20.5 26.75 20.1 26.55 20.05 23.0 16.45 22.05 13.7 21.7 12.05 21.75 11.35 Q21.85 9.9 20.55 9.5 20.0 9.45 19.7 9.75 L20.0 9.55 19.9 10.1 19.45 11.5 Q18.8 14.4 17.65 17.15 16.45 19.9 13.9 21.55 L12.2 22.35 10.1 22.55 Q9.8 21.9 10.7 21.9 L11.7 21.65 Q13.25 20.9 14.45 19.6 L15.9 17.75 16.35 16.75 16.45 16.5 16.35 16.55 Q14.7 18.4 12.2 18.75 L9.1 19.15 Q4.5 19.6 0.75 17.4 L0.95 17.55 2.1 18.55 Q2.6 19.0 3.25 19.2 4.5 19.6 5.35 20.4 5.0 21.1 4.05 20.7 1.8 19.65 -0.1 18.05 -1.2 17.15 -1.95 15.9 L-3.2 13.2 -3.2 13.1 -2.95 12.95 -2.95 12.6 -3.1 12.75 -3.55 14.15 -3.85 14.1 Q-3.95 15.75 -3.35 17.25 L-3.05 17.95 Q-2.8 18.3 -3.0 18.65 -3.65 18.6 -3.95 17.85 L-4.65 16.05 -5.05 14.3 -5.15 14.35 -5.1 14.3 -5.05 14.2 -5.1 13.4 -5.1 13.35 -5.4 13.25 -5.5 13.15 -8.2 13.2 -8.25 13.2 -8.9 13.2 -9.1 13.2 -9.15 13.2 -14.2 13.45 -16.15 13.45 -16.55 13.4 Q-16.95 13.35 -17.2 13.1 L-17.2 13.0 -17.15 12.95 -17.1 12.9 -17.05 12.85 -16.7 12.8 -16.65 12.8 -15.75 12.7 -15.15 12.75 -12.95 12.45 -10.85 12.45 -10.85 12.4 -10.15 12.25 -8.25 12.4 -8.25 12.3 -8.9 12.2 -9.1 11.9 -9.05 11.7 -8.9 11.55 -8.8 11.45 -8.05 11.55 -7.5 10.6 -10.3 9.45 -10.3 9.3 Q-10.15 9.0 -9.8 9.05 -7.95 9.3 -6.3 10.05 -5.45 10.1 -5.9 10.7 L-6.3 10.75 -6.65 10.75 -7.25 11.55 Q-5.05 11.5 -3.4 10.35 L-2.2 8.55 -0.4 6.7 -0.3 6.65 -0.2 6.7 -0.1 6.75 Q-1.45 8.25 -2.0 10.15 L-2.0 10.2 Q-1.1 7.1 1.7 5.1 3.45 3.8 5.6 3.4 L7.15 3.0 8.15 2.75 Q12.45 3.05 16.1 5.15 L16.15 5.15 Q18.7 6.05 21.35 5.75 L22.95 5.8 Q23.75 4.6 25.0 3.55 27.1 5.2 27.25 7.95 L27.85 8.25 28.35 8.6 27.3 11.75 27.85 12.55 Q29.75 15.5 29.95 18.25 30.05 19.7 29.65 21.15 28.45 25.45 29.2 29.25 L28.2 29.25 28.2 29.85 28.1 29.75 Q27.3 30.75 25.85 30.9 L25.6 30.85 Q24.65 32.4 23.2 31.45 21.9 31.65 20.85 32.4 L20.25 32.5 Q19.75 32.45 19.45 32.05 18.45 32.6 17.05 32.5 L16.9 32.55 15.3 32.45 Q13.75 33.4 11.95 33.15 L11.4 32.95 10.5 33.45 8.1 32.95 Q6.6 32.55 6.45 31.45 3.2 27.85 -2.3 27.8 -7.8 27.7 -10.15 21.45 M24.35 6.2 Q23.7 6.65 23.45 7.4 22.3 10.75 23.55 13.95 24.05 15.3 25.0 14.5 25.5 14.05 25.6 13.45 L26.1 8.5 Q26.2 6.6 24.55 6.1 L24.35 6.2 M21.7 7.7 L21.85 7.25 21.8 7.15 21.75 7.0 21.3 6.95 19.75 7.25 19.7 7.3 Q20.35 8.55 21.75 8.55 21.5 8.2 21.7 7.7 M26.0 16.05 Q26.65 16.7 27.05 17.65 27.55 18.75 28.4 19.6 L28.75 20.05 28.6 18.25 27.95 16.25 27.9 16.2 27.85 16.15 27.35 15.55 26.3 15.55 26.0 16.05 M21.6 9.95 L21.65 9.75 Q21.65 9.2 21.8 8.7 L21.6 9.95 M18.85 10.05 L18.9 10.0 18.8 9.95 18.85 10.05 M9.3 4.5 L6.7 5.0 Q2.05 5.9 0.05 10.25 -0.8 12.2 0.15 14.1 1.1 15.95 3.05 16.7 7.35 18.3 11.75 17.1 13.1 16.75 14.2 15.9 17.5 13.45 15.95 9.65 14.15 5.15 9.3 4.5 M17.55 24.9 L17.3 24.9 17.55 24.9 M27.2 25.15 L27.1 24.95 27.0 24.85 26.9 24.8 26.7 24.75 Q25.45 24.95 24.75 25.8 24.95 26.25 25.45 26.15 L25.5 26.2 Q26.65 26.25 27.2 25.15 M23.85 25.85 L23.85 25.65 23.75 25.4 23.5 25.3 23.4 25.3 Q22.05 25.55 20.75 24.8 L20.65 24.85 20.5 24.95 20.4 25.1 Q20.3 25.2 20.35 25.35 20.55 25.55 20.85 25.55 L20.9 25.6 Q21.85 26.45 22.85 26.35 23.5 26.35 23.85 25.85 M-7.05 8.6 L-4.85 9.7 -4.8 9.75 -4.8 9.85 -4.8 9.95 -5.85 9.75 -6.95 9.1 Q-7.4 8.8 -7.05 8.6 M-7.25 7.4 Q-6.45 7.9 -5.45 8.2 L-3.95 6.9 Q-3.55 6.9 -3.55 7.25 L-3.55 7.3 -4.5 8.65 -4.55 8.75 Q-4.5 9.6 -5.35 9.2 L-7.05 8.2 -7.45 7.75 -7.5 7.65 -7.45 7.5 -7.35 7.4 -7.25 7.4 M-2.4 10.7 L-2.35 10.7 -2.2 10.65 -2.15 10.65 -2.0 10.2 -2.4 10.7 M-6.15 13.7 L-6.4 13.55 -6.35 13.55 -6.2 13.65 -6.15 13.7 M-7.2 14.25 L-7.4 14.05 -7.25 14.15 -7.2 14.2 -7.2 14.25" fill="#e07e5a" fill-rule="evenodd" stroke="none"/>
    <path d="M4.05 -28.15 L3.25 -27.45 7.9 -25.9 Q12.5 -23.6 17.5 -22.35 L17.3 -23.35 Q11.05 -27.2 4.05 -28.15 M8.55 -27.75 Q11.6 -27.2 14.35 -25.5 17.85 -23.55 19.95 -20.1 L18.9 -19.4 15.2 -22.2 Q7.45 -26.85 -1.65 -26.85 -12.2 -26.2 -21.7 -21.6 L-21.85 -22.05 Q-15.6 -26.4 -8.4 -27.95 0.15 -29.8 8.55 -27.75 M0.3 22.95 Q-0.45 22.9 -1.0 22.3 L-1.3 22.05 -1.35 21.85 -1.4 21.65 -1.4 21.45 -3.2 20.2 -3.4 19.8 -3.35 19.65 -3.25 19.45 -3.15 19.35 -3.0 19.3 -2.85 19.25 Q0.1 19.8 0.65 22.5 L0.65 22.6 0.5 22.75 0.4 22.85 0.3 22.95" fill="#fba97d" fill-rule="evenodd" stroke="none"/>
    <path d="M24.35 6.2 L24.55 6.1 Q26.2 6.6 26.1 8.5 L25.6 13.45 Q25.5 14.05 25.0 14.5 24.05 15.3 23.55 13.95 22.3 10.75 23.45 7.4 23.7 6.65 24.35 6.2 M9.3 4.5 Q14.15 5.15 15.95 9.65 17.5 13.45 14.2 15.9 13.1 16.75 11.75 17.1 7.35 18.3 3.05 16.7 1.1 15.95 0.15 14.1 -0.8 12.2 0.05 10.25 2.05 5.9 6.7 5.0 L9.3 4.5 M27.2 25.15 Q26.65 26.25 25.5 26.2 L25.45 26.15 Q24.95 26.25 24.75 25.8 25.45 24.95 26.7 24.75 L26.9 24.8 27.0 24.85 27.1 24.95 27.2 25.15 M23.85 25.85 Q23.5 26.35 22.85 26.35 21.85 26.45 20.9 25.6 L20.85 25.55 Q20.55 25.55 20.35 25.35 20.3 25.2 20.4 25.1 L20.5 24.95 20.65 24.85 20.75 24.8 Q22.05 25.55 23.4 25.3 L23.5 25.3 23.75 25.4 23.85 25.65 23.85 25.85" fill="#cc7251" fill-rule="evenodd" stroke="none"/>
    <path d="M4.05 -28.15 Q11.05 -27.2 17.3 -23.35 L17.5 -22.35 Q12.5 -23.6 7.9 -25.9 L3.25 -27.45 4.05 -28.15" fill="#fccab8" fill-rule="evenodd" stroke="none"/>
    <path d="M23.25 17.3 Q25.4 18.25 27.05 19.9 27.4 20.2 27.4 20.8 L27.4 20.9 27.3 21.1 27.25 21.25 27.1 21.35 26.95 21.4 26.25 21.25 Q25.45 19.5 23.4 19.15 L23.2 19.05 22.7 18.2 Q22.55 17.85 22.8 17.55 L23.0 17.4 23.25 17.3" fill="#fba97d" fill-rule="evenodd" stroke="none"/>
  </g>
</svg>
