<?xml version="1.0" encoding="UTF-8" standalone="no"?>
<svg xmlns:xlink="http://www.w3.org/1999/xlink" height="3.0px" width="3.0px" xmlns="http://www.w3.org/2000/svg">
  <g transform="matrix(1.0, 0.0, 0.0, 1.0, 1.5, 1.5)">
    <path d="M1.5 0.0 L1.05 1.05 0.0 1.5 -1.05 1.05 -1.5 0.0 -1.05 -1.05 0.0 -1.5 1.05 -1.05 1.5 0.0" fill="#ff0000" fill-rule="evenodd" stroke="none"/>
  </g>
</svg>
