<?xml version="1.0" encoding="UTF-8" standalone="no"?>
<svg xmlns:xlink="http://www.w3.org/1999/xlink" height="13.6px" width="28.8px" xmlns="http://www.w3.org/2000/svg">
  <g transform="matrix(1.0, 0.0, 0.0, 1.0, 6.65, 5.05)">
    <path d="M18.5 8.2 L18.45 8.25 Q18.05 8.65 17.4 8.55 L11.35 7.95 7.95 7.5 7.25 7.25 Q5.05 6.5 4.45 4.65 -1.4 1.7 -6.65 -2.1 L-3.9 -1.8 Q-1.15 -1.45 6.5 -5.05 L7.95 -4.65 9.2 -4.15 Q9.8 -4.6 10.55 -4.85 L10.65 -4.8 11.45 -4.4 Q12.2 -3.85 12.0 -2.75 11.95 -2.5 12.25 -2.3 14.85 -0.65 18.55 -1.1 L19.6 -1.0 20.55 -0.5 Q18.3 0.8 16.55 2.4 L16.55 2.35 Q16.15 1.05 14.65 1.05 L14.55 1.45 15.2 3.25 Q13.65 3.1 13.75 4.0 L14.7 4.2 14.8 4.35 15.2 4.85 15.2 5.35 14.85 7.05 15.65 7.25 16.1 7.05 16.9 5.95 17.75 7.35 18.5 8.2" fill="#f1926d" fill-rule="evenodd" stroke="none"/>
    <path d="M20.55 -0.5 L20.7 -0.6 21.4 -0.9 22.05 -0.7 22.15 -0.65 22.05 -0.45 21.9 -0.35 21.4 -0.1 Q20.65 1.55 19.1 2.9 L18.85 3.15 Q19.2 5.6 20.4 7.9 L20.15 8.25 18.5 8.2 17.75 7.35 16.9 5.95 16.1 7.05 15.65 7.25 14.85 7.05 15.2 5.35 15.2 4.85 14.8 4.35 14.7 4.2 13.75 4.0 Q13.65 3.1 15.2 3.25 L14.55 1.45 14.65 1.05 Q16.15 1.05 16.55 2.35 L16.55 2.4 Q18.3 0.8 20.55 -0.5" fill="#e07e5a" fill-rule="evenodd" stroke="none"/>
  </g>
</svg>
