<?xml version="1.0" encoding="UTF-8" standalone="no"?>
<svg xmlns:xlink="http://www.w3.org/1999/xlink" height="9.8px" width="12.65px" xmlns="http://www.w3.org/2000/svg">
  <g transform="matrix(1.0, 0.0, 0.0, 1.0, 6.05, 5.0)">
    <path d="M-5.2 1.45 Q-5.7 2.15 -4.7 2.6 -0.9 4.45 3.3 3.05 4.75 2.6 5.7 1.6 L5.7 1.55 5.25 1.15 5.45 1.1 5.45 1.05 Q6.15 1.45 5.95 2.0 6.0 2.55 5.25 3.05 L4.4 3.55 Q1.85 4.6 -1.15 4.25 L-4.65 3.5 -5.4 3.05 Q-6.0 2.65 -5.8 2.1 -5.9 1.25 -5.2 1.45" fill="#cc7251" fill-rule="evenodd" stroke="none"/>
    <path d="M5.25 1.15 L5.7 1.55 5.7 1.6 Q4.75 2.6 3.3 3.05 -0.9 4.45 -4.7 2.6 -5.7 2.15 -5.2 1.45 -6.1 0.8 -4.15 1.8 -2.25 2.8 1.25 2.45 4.7 2.1 5.2 1.15 L5.25 1.15 M1.35 3.35 L1.45 3.2 1.45 3.15 1.4 3.0 -0.45 2.7 -0.6 2.7 -0.75 2.7 -0.95 2.8 -1.0 2.85 -1.0 2.9 -1.05 2.9 -1.3 2.95 -1.45 2.9 -1.7 3.0 -1.7 3.05 -1.6 3.1 -1.45 3.25 1.35 3.35" fill="#e07e5a" fill-rule="evenodd" stroke="none"/>
    <path d="M1.35 3.35 L-1.45 3.25 -1.6 3.1 -1.7 3.05 -1.7 3.0 -1.45 2.9 -1.3 2.95 -1.05 2.9 -1.0 2.9 -1.0 2.85 -0.95 2.8 -0.75 2.7 -0.6 2.7 -0.45 2.7 1.4 3.0 1.45 3.15 1.45 3.2 1.35 3.35" fill="#f1926d" fill-rule="evenodd" stroke="none"/>
    <path d="M-4.65 3.5 L-1.15 4.25 Q1.85 4.6 4.4 3.55 2.5 4.65 1.2 4.8 -1.8 5.0 -4.65 3.5" fill="#7d3726" fill-rule="evenodd" stroke="none"/>
    <path d="M2.9 -4.35 L3.1 -4.15 3.3 -4.0 4.25 -3.0 4.6 -2.55 4.6 -2.5 4.95 -2.25 5.15 -2.1 5.4 -1.85 5.55 -1.65 Q5.8 -1.15 4.9 -1.05 4.45 -1.0 4.15 -1.35 L4.05 -1.45 4.15 -1.4 4.2 -1.45 4.25 -1.45 4.35 -1.55 4.35 -1.6 4.4 -1.65 4.4 -1.7 4.4 -1.8 4.35 -1.85 Q3.2 -2.85 1.6 -2.9 -1.5 -2.95 -4.45 -1.95 L-4.45 -1.9 -4.5 -1.85 -4.5 -1.8 -3.5 -1.75 -4.2 -1.5 -5.4 -1.45 -5.5 -1.5 -5.6 -1.8 -5.5 -1.9 -5.5 -1.95 -5.25 -2.2 -4.7 -2.6 Q-2.4 -3.7 0.1 -3.75 1.9 -3.85 3.4 -3.2 L2.6 -3.65 2.8 -3.75 2.8 -3.85 2.8 -3.95 2.75 -4.0 2.75 -4.05 2.65 -4.05 Q1.15 -4.75 -0.55 -4.55 L-2.4 -4.2 -2.55 -4.05 -2.6 -3.95 -2.6 -3.85 -2.55 -3.85 -2.55 -3.8 -2.5 -3.75 -2.4 -3.75 -0.35 -3.9 -0.9 -3.85 -3.6 -3.1 -3.6 -3.15 -3.5 -3.5 -3.55 -3.6 -3.6 -3.7 -3.7 -3.75 -3.65 -3.75 -3.6 -3.8 -3.5 -3.85 -3.45 -3.9 -3.4 -3.9 -3.3 -4.0 -1.7 -4.75 0.45 -5.0 1.45 -4.9 Q2.2 -4.8 2.9 -4.35" fill="#e07e5a" fill-rule="evenodd" stroke="none"/>
    <path d="M-0.35 -3.9 L-2.4 -3.75 -2.5 -3.75 -2.55 -3.8 -2.55 -3.85 -2.6 -3.85 -2.6 -3.95 -2.55 -4.05 -2.4 -4.2 -0.55 -4.55 Q1.15 -4.75 2.65 -4.05 L2.75 -4.05 2.75 -4.0 2.8 -3.95 2.8 -3.85 2.8 -3.75 2.6 -3.65 2.0 -3.8 -0.35 -3.9 M-3.5 -1.75 L-4.5 -1.8 -4.5 -1.85 -4.45 -1.9 -4.45 -1.95 Q-1.5 -2.95 1.6 -2.9 3.2 -2.85 4.35 -1.85 L4.4 -1.8 4.4 -1.7 4.4 -1.65 4.35 -1.6 4.35 -1.55 4.25 -1.45 4.2 -1.45 4.15 -1.4 4.05 -1.45 Q0.6 -2.75 -3.1 -1.8 L-3.5 -1.75" fill="#f1926d" fill-rule="evenodd" stroke="none"/>
    <path d="M4.95 -2.25 L4.6 -2.5 4.6 -2.55 4.25 -3.0 3.3 -4.0 3.1 -4.15 2.9 -4.35 3.9 -3.75 4.25 -3.45 5.8 -1.35 5.55 -1.65 5.4 -1.85 4.95 -2.25 M-3.45 -3.9 L-3.5 -3.85 -3.6 -3.8 -3.65 -3.75 -3.7 -3.75 -3.45 -3.9 M-5.25 -2.2 L-5.3 -2.25 -5.35 -2.3 -5.4 -2.4 -5.45 -2.4 -5.45 -2.5 -5.45 -2.6 -5.1 -2.85 -5.25 -2.2" fill="#7d3726" fill-rule="evenodd" stroke="none"/>
    <path d="M-3.7 -3.75 L-3.6 -3.7 -3.55 -3.6 -3.5 -3.5 -3.6 -3.15 -3.6 -3.1 -0.9 -3.85 -0.35 -3.9 2.0 -3.8 2.6 -3.65 3.4 -3.2 Q1.9 -3.85 0.1 -3.75 -2.4 -3.7 -4.7 -2.6 L-5.25 -2.2 -5.1 -2.85 -4.65 -3.35 -4.0 -3.7 -3.95 -3.75 -3.8 -3.75 -3.7 -3.75 M-5.4 -1.45 L-4.2 -1.5 -3.5 -1.75 -3.1 -1.8 Q0.6 -2.75 4.05 -1.45 L4.15 -1.35 Q4.45 -1.0 4.9 -1.05 5.8 -1.15 5.55 -1.65 L5.8 -1.35 6.15 -0.85 6.25 -0.7 6.2 -0.65 6.15 -0.65 6.05 -0.55 6.0 -0.5 5.35 -0.6 Q2.3 -1.85 -1.1 -1.55 L-3.8 -1.1 Q-5.05 -0.8 -5.8 0.05 L-5.85 0.0 -5.85 -0.2 -5.8 -0.35 -6.05 -0.8 -6.05 -0.9 -5.45 -1.35 -5.4 -1.45 M5.4 -1.85 L5.15 -2.1 4.95 -2.25 5.4 -1.85 M4.4 -0.15 L3.4 -0.6 4.2 -0.35 4.4 -0.15" fill="#cc7251" fill-rule="evenodd" stroke="none"/>
    <path d="M6.25 -0.7 L6.3 -0.7 6.4 -0.65 6.55 -0.5 6.6 -0.4 6.55 -0.25 6.5 -0.2 6.45 -0.1 6.4 -0.05 6.2 0.1 6.15 0.15 5.15 0.15 4.4 -0.15 4.2 -0.35 3.4 -0.6 Q-0.15 -1.55 -3.7 -0.5 L-4.75 -0.05 -4.75 0.0 -5.2 0.4 Q-5.7 0.65 -5.95 0.2 L-5.8 0.05 Q-5.05 -0.8 -3.8 -1.1 L-1.1 -1.55 Q2.3 -1.85 5.35 -0.6 L6.0 -0.5 6.05 -0.55 6.15 -0.65 6.2 -0.65 6.25 -0.7" fill="#833f2e" fill-rule="evenodd" stroke="none"/>
  </g>
</svg>
