<?xml version="1.0" encoding="UTF-8" standalone="no"?>
<svg xmlns:xlink="http://www.w3.org/1999/xlink" height="18.0px" width="290.0px" xmlns="http://www.w3.org/2000/svg">
  <g transform="matrix(1.0, 0.0, 0.0, 1.0, 0.0, 0.0)">
    <path d="M290.0 0.0 L290.0 18.0 0.0 18.0 0.0 0.0 290.0 0.0" fill="#e2ebb9" fill-rule="evenodd" stroke="none"/>
    <path d="M290.0 18.0 L0.0 18.0 0.0 0.0 290.0 0.0 290.0 18.0 M289.0 17.0 L289.0 1.0 1.0 1.0 1.0 17.0 289.0 17.0" fill="#ffffff" fill-rule="evenodd" stroke="none"/>
  </g>
</svg>
