<?xml version="1.0" encoding="UTF-8" standalone="no"?>
<svg xmlns:xlink="http://www.w3.org/1999/xlink" height="31.5px" width="88.5px" xmlns="http://www.w3.org/2000/svg">
  <g transform="matrix(1.0, 0.0, 0.0, 1.0, 0.25, 0.25)">
    <path d="M88.25 0.0 L88.25 31.0 88.15 31.15 88.0 31.25 0.0 31.25 -0.2 31.15 -0.25 31.0 -0.25 0.0 -0.2 -0.2 0.0 -0.25 88.0 -0.25 88.15 -0.2 88.25 0.0 M86.75 1.25 L1.25 1.25 1.25 29.75 86.75 29.75 86.75 1.25" fill="#ffffff" fill-rule="evenodd" stroke="none"/>
  </g>
</svg>
