<?xml version="1.0" encoding="UTF-8" standalone="no"?>
<svg xmlns:xlink="http://www.w3.org/1999/xlink" height="7.35px" width="24.6px" xmlns="http://www.w3.org/2000/svg">
  <g transform="matrix(1.0, 0.0, 0.0, 1.0, 14.95, 4.9)">
    <path d="M-9.0 0.7 L-9.3 0.25 -9.55 -0.45 -9.2 0.25 -9.0 0.7 M8.05 1.0 L8.05 0.9 8.25 0.85 8.05 1.0" fill="#fee38b" fill-rule="evenodd" stroke="none"/>
    <path d="M0.75 -0.4 L0.85 -0.35 0.75 -0.35 0.75 -0.4 M-2.7 1.55 L-3.0 1.9 -3.0 1.85 -2.7 1.55 M-6.3 0.9 L-6.4 0.95 -6.35 0.9 -6.3 0.9 M2.9 -0.3 L2.95 -0.3 3.0 -0.25 2.9 -0.3 M-14.45 -4.6 L-13.9 -4.9 -13.45 -4.6 -14.15 -4.8 -14.45 -4.6 M-13.55 -2.1 Q-13.8 -1.9 -14.1 -2.1 L-14.15 -2.15 -13.55 -2.1" fill="#edcd61" fill-rule="evenodd" stroke="none"/>
    <path d="M2.0 1.7 L-0.2 1.8 0.75 0.9 2.1 1.1 2.0 1.7 M-3.1 1.95 Q-3.7 2.4 -4.65 2.45 L-5.25 2.35 -5.65 1.85 -5.7 1.8 Q-5.25 1.75 -4.7 1.3 -3.85 2.0 -3.1 1.95 M4.65 -0.25 L4.65 -0.2 4.65 0.2 4.9 0.2 6.45 0.45 6.7 1.5 Q5.45 1.6 4.9 0.75 L4.7 0.35 Q4.55 0.05 4.65 -0.25" fill="#fef1d6" fill-rule="evenodd" stroke="none"/>
    <path d="M3.15 0.7 L2.0 1.7 2.1 1.1 0.75 0.9 -0.2 1.8 -0.35 1.75 0.55 0.85 0.7 0.6 3.15 0.7 M-1.05 1.9 L-1.25 1.9 -1.8 1.75 -2.05 1.65 -1.75 0.95 -0.55 0.75 -0.45 0.85 -0.35 0.9 -0.6 1.1 -1.05 1.45 -1.1 1.75 -1.05 1.9 M-3.0 1.9 L-3.1 1.95 Q-3.85 2.0 -4.7 1.3 -5.25 1.75 -5.7 1.8 L-6.1 0.65 -6.3 0.9 -6.35 0.9 -6.25 0.75 -6.25 0.55 -6.25 0.35 -6.35 0.15 -6.45 0.1 -6.6 0.05 -6.7 0.1 -6.8 0.15 -6.85 0.2 -7.7 1.4 Q-8.45 1.4 -9.0 0.7 L-9.2 0.25 -9.55 -0.45 -9.6 -0.95 -9.6 -1.0 -9.6 -1.1 -9.5 -1.45 -9.25 -1.95 -9.0 -2.1 Q-8.1 -1.9 -8.25 -0.95 L-8.25 -0.9 Q-7.45 -0.85 -7.25 -0.1 -6.7 -0.7 -6.1 -0.35 L-6.1 0.15 -5.95 -0.25 Q-4.7 -0.35 -3.6 0.5 -2.75 -0.25 -1.7 -0.2 L-0.85 0.05 -2.65 0.3 -2.7 0.8 -2.65 1.0 -2.9 1.45 -3.0 1.85 -3.0 1.9 M4.65 -0.2 L4.65 -0.15 4.9 -0.15 8.5 -0.55 8.55 -0.4 Q8.65 -0.05 8.9 0.2 L8.3 0.8 8.25 0.85 8.05 0.9 8.05 1.0 6.8 1.45 6.7 1.5 6.45 0.45 4.9 0.2 4.65 0.2 4.65 -0.2" fill="#fee8b6" fill-rule="evenodd" stroke="none"/>
    <path d="M0.75 -0.4 L0.75 -0.35 0.85 -0.35 0.75 -0.4 M-5.95 -0.25 L-4.6 -1.3 -3.55 -1.65 Q-2.3 -1.25 -2.15 -0.25 L-1.65 -0.5 -1.1 -0.35 Q-1.1 -1.45 0.15 -1.85 L0.75 -2.05 1.5 -2.2 2.15 -1.85 2.25 -1.8 Q3.7 -2.45 3.65 -0.9 L3.35 0.35 3.35 0.4 3.2 0.6 3.15 0.65 3.15 0.7 0.7 0.6 0.55 0.85 -0.35 1.75 -0.4 1.7 -0.6 1.55 Q-0.75 1.8 -1.05 1.9 L-1.1 1.75 -1.05 1.45 -0.6 1.1 -0.35 0.9 -0.45 0.85 -0.55 0.75 -1.75 0.95 -2.05 1.65 -2.55 1.35 -2.6 1.4 -2.7 1.55 -3.0 1.85 -2.9 1.45 -2.65 1.0 -2.7 0.8 -2.65 0.3 -0.85 0.05 -1.7 -0.2 Q-2.75 -0.25 -3.6 0.5 -4.7 -0.35 -5.95 -0.25 M-6.4 0.95 L-6.6 1.1 -7.7 1.4 -6.85 0.2 -6.8 0.15 -6.7 0.1 -6.6 0.05 -6.45 0.1 -6.35 0.15 -6.25 0.35 -6.25 0.55 -6.25 0.75 -6.35 0.9 -6.4 0.95 M-9.25 -1.95 Q-8.85 -2.5 -8.05 -2.65 -6.35 -1.95 -6.1 -0.35 -6.7 -0.7 -7.25 -0.1 -7.45 -0.85 -8.25 -0.9 L-8.25 -0.95 Q-8.1 -1.9 -9.0 -2.1 L-9.25 -1.95 M2.9 -0.3 L3.0 -0.25 2.95 -0.3 2.9 -0.3 M8.9 0.2 Q8.65 -0.05 8.55 -0.4 L8.5 -0.55 4.9 -0.15 4.65 -0.15 4.65 -0.2 4.65 -0.25 4.8 -0.7 4.85 -0.85 4.85 -0.9 Q4.75 -1.55 4.9 -2.0 5.15 -2.85 6.1 -3.2 L6.75 -3.0 7.8 -2.45 7.95 -2.25 8.0 -2.15 8.0 -2.25 8.05 -2.5 Q8.1 -3.3 8.7 -3.9 L8.8 -3.95 Q9.7 -3.2 9.65 -1.8 L9.6 -1.65 Q9.5 -0.6 8.9 0.2 M-11.25 -4.1 Q-9.2 -3.65 -9.8 -1.6 L-9.85 -1.45 -9.85 -1.35 -10.5 -0.55 Q-11.45 0.1 -12.0 -0.4 L-12.5 -1.25 Q-13.0 -2.7 -11.9 -3.75 L-11.25 -4.1 M-14.15 -2.15 Q-15.1 -2.7 -14.9 -3.9 L-14.85 -4.05 -14.8 -4.15 -14.7 -4.35 -14.6 -4.45 -14.45 -4.6 -14.15 -4.8 -13.45 -4.6 Q-12.45 -3.75 -13.35 -2.3 L-13.35 -2.25 -13.5 -2.15 -13.55 -2.1 -14.15 -2.15" fill="#fbcb7d" fill-rule="evenodd" stroke="none"/>
  </g>
</svg>
