<?xml version="1.0" encoding="UTF-8" standalone="no"?>
<!-- Created with Inkscape (http://www.inkscape.org/) -->

<svg
  xmlns:dc="http://purl.org/dc/elements/1.1/"
  xmlns:cc="http://creativecommons.org/ns#"
  xmlns:rdf="http://www.w3.org/1999/02/22-rdf-syntax-ns#"
  xmlns:svg="http://www.w3.org/2000/svg"
  xmlns="http://www.w3.org/2000/svg"
  xmlns:xlink="http://www.w3.org/1999/xlink"
  xmlns:sodipodi="http://sodipodi.sourceforge.net/DTD/sodipodi-0.dtd"
  xmlns:inkscape="http://www.inkscape.org/namespaces/inkscape"
  width="40.000004"
  height="46"
  viewBox="0 0 40.000004 46.000004"
  version="1.1"
  id="svg8"
  inkscape:version="0.92.4 (5da689c313, 2019-01-14)"
  sodipodi:docname="fond.svg"
  inkscape:export-filename="C:\Autres\Twin\Naturalchimie\fond.png"
  inkscape:export-xdpi="96"
  inkscape:export-ydpi="96">
 <defs
   id="defs2">
  <linearGradient
    inkscape:collect="always"
    id="linearGradient2657">
   <stop
     style="stop-color:#afa295;stop-opacity:1"
     offset="0"
     id="stop2653" />
   <stop
     style="stop-color:#756553;stop-opacity:1"
     offset="1"
     id="stop2655" />
  </linearGradient>
  <linearGradient
    id="linearGradient2596"
    inkscape:collect="always">
   <stop
     id="stop2592"
     offset="0"
     style="stop-color:#7b6b5a;stop-opacity:1" />
   <stop
     id="stop2594"
     offset="1"
     style="stop-color:#91806f;stop-opacity:1" />
  </linearGradient>
  <linearGradient
    inkscape:collect="always"
    id="linearGradient2539">
   <stop
     style="stop-color:#796958;stop-opacity:1"
     offset="0"
     id="stop2535" />
   <stop
     style="stop-color:#91806f;stop-opacity:1"
     offset="1"
     id="stop2537" />
  </linearGradient>
  <linearGradient
    inkscape:collect="always"
    id="linearGradient2299">
   <stop
     style="stop-color:#342c24;stop-opacity:1"
     offset="0"
     id="stop2295" />
   <stop
     style="stop-color:#4d4236;stop-opacity:1"
     offset="1"
     id="stop2297" />
  </linearGradient>
  <linearGradient
    inkscape:collect="always"
    id="linearGradient2284">
   <stop
     style="stop-color:#f6f5f3;stop-opacity:1"
     offset="0"
     id="stop2280" />
   <stop
     style="stop-color:#c0b5a9;stop-opacity:1"
     offset="1"
     id="stop2282" />
  </linearGradient>
  <linearGradient
    id="linearGradient2216"
    inkscape:collect="always">
   <stop
     id="stop2212"
     offset="0"
     style="stop-color:#4b4135;stop-opacity:1" />
   <stop
     id="stop2214"
     offset="1"
     style="stop-color:#756553;stop-opacity:1" />
  </linearGradient>
  <linearGradient
    inkscape:collect="always"
    id="linearGradient1724">
   <stop
     style="stop-color:#796958;stop-opacity:1"
     offset="0"
     id="stop1720" />
   <stop
     style="stop-color:#41382d;stop-opacity:1"
     offset="1"
     id="stop1722" />
  </linearGradient>
  <linearGradient
    inkscape:collect="always"
    id="linearGradient1059">
   <stop
     style="stop-color:#d2b998;stop-opacity:1"
     offset="0"
     id="stop1055" />
   <stop
     style="stop-color:#635a67;stop-opacity:1"
     offset="1"
     id="stop1057" />
  </linearGradient>
  <linearGradient
    inkscape:collect="always"
    id="linearGradient936">
   <stop
     style="stop-color:#dddddd;stop-opacity:1"
     offset="0"
     id="stop932" />
   <stop
     style="stop-color:#9b9b9b;stop-opacity:1"
     offset="1"
     id="stop934" />
  </linearGradient>
  <linearGradient
    inkscape:collect="always"
    xlink:href="#linearGradient2299"
    id="linearGradient873"
    x1="77.631836"
    y1="105.66691"
    x2="77.884377"
    y2="110.84394"
    gradientUnits="userSpaceOnUse" />
  <linearGradient
    inkscape:collect="always"
    xlink:href="#linearGradient936"
    id="linearGradient938"
    x1="76.671875"
    y1="102.9375"
    x2="80.503906"
    y2="113.69922"
    gradientUnits="userSpaceOnUse" />
  <linearGradient
    inkscape:collect="always"
    xlink:href="#linearGradient1059"
    id="linearGradient1061-3-0"
    x1="88.367867"
    y1="82.354485"
    x2="90.931129"
    y2="84.917747"
    gradientUnits="userSpaceOnUse"
    gradientTransform="translate(5.5061624,20.554255)" />
  <linearGradient
    inkscape:collect="always"
    xlink:href="#linearGradient1059"
    id="linearGradient1061-0"
    x1="88.367867"
    y1="82.354485"
    x2="90.931129"
    y2="84.917747"
    gradientUnits="userSpaceOnUse"
    gradientTransform="translate(-0.42265661,20.554253)" />
  <linearGradient
    inkscape:collect="always"
    xlink:href="#linearGradient936"
    id="linearGradient938-7"
    x1="76.671875"
    y1="102.9375"
    x2="80.503906"
    y2="113.69922"
    gradientUnits="userSpaceOnUse" />
  <linearGradient
    inkscape:collect="always"
    xlink:href="#linearGradient1059"
    id="linearGradient1444"
    gradientUnits="userSpaceOnUse"
    gradientTransform="translate(5.5061624,20.554255)"
    x1="88.367867"
    y1="82.354485"
    x2="90.931129"
    y2="84.917747" />
  <linearGradient
    inkscape:collect="always"
    xlink:href="#linearGradient1059"
    id="linearGradient1446"
    gradientUnits="userSpaceOnUse"
    gradientTransform="translate(-0.42265661,20.554253)"
    x1="88.367867"
    y1="82.354485"
    x2="90.931129"
    y2="84.917747" />
  <linearGradient
    inkscape:collect="always"
    xlink:href="#linearGradient1059"
    id="linearGradient1512"
    gradientUnits="userSpaceOnUse"
    gradientTransform="translate(5.5061624,20.554255)"
    x1="88.367867"
    y1="82.354485"
    x2="90.931129"
    y2="84.917747" />
  <linearGradient
    inkscape:collect="always"
    xlink:href="#linearGradient1059"
    id="linearGradient1514"
    gradientUnits="userSpaceOnUse"
    gradientTransform="translate(-0.42265661,20.554253)"
    x1="88.367867"
    y1="82.354485"
    x2="90.931129"
    y2="84.917747" />
  <linearGradient
    inkscape:collect="always"
    xlink:href="#linearGradient1059"
    id="linearGradient1637"
    gradientUnits="userSpaceOnUse"
    gradientTransform="translate(5.5061624,20.554255)"
    x1="88.367867"
    y1="82.354485"
    x2="90.931129"
    y2="84.917747" />
  <linearGradient
    inkscape:collect="always"
    xlink:href="#linearGradient1059"
    id="linearGradient1639"
    gradientUnits="userSpaceOnUse"
    gradientTransform="translate(-0.42265661,20.554253)"
    x1="88.367867"
    y1="82.354485"
    x2="90.931129"
    y2="84.917747" />
  <linearGradient
    inkscape:collect="always"
    xlink:href="#linearGradient1724"
    id="linearGradient1726"
    x1="70.977463"
    y1="86.844826"
    x2="76.015594"
    y2="91.661995"
    gradientUnits="userSpaceOnUse"
    gradientTransform="translate(2.390689,53.134798)" />
  <linearGradient
    inkscape:collect="always"
    xlink:href="#linearGradient1724"
    id="linearGradient1836"
    gradientUnits="userSpaceOnUse"
    gradientTransform="matrix(-1,0,0,1,180.18229,56.134812)"
    x1="70.977463"
    y1="86.844826"
    x2="76.015594"
    y2="91.661995" />
  <linearGradient
    inkscape:collect="always"
    xlink:href="#linearGradient2216"
    id="linearGradient2210"
    x1="91.252182"
    y1="106.8804"
    x2="91.614357"
    y2="136.8804"
    gradientUnits="userSpaceOnUse"
    gradientTransform="matrix(1,0,0,0.86152496,0,14.915112)" />
  <linearGradient
    inkscape:collect="always"
    xlink:href="#linearGradient2284"
    id="linearGradient2286"
    x1="76.564667"
    y1="107.29114"
    x2="78.916229"
    y2="109.38493"
    gradientUnits="userSpaceOnUse"
    gradientTransform="matrix(1.1291151,0,0,1.1291151,-9.963701,-13.960335)" />
  <linearGradient
    inkscape:collect="always"
    xlink:href="#linearGradient2299"
    id="linearGradient873-9"
    x1="77.631836"
    y1="105.66691"
    x2="77.884377"
    y2="110.84394"
    gradientUnits="userSpaceOnUse" />
  <linearGradient
    inkscape:collect="always"
    xlink:href="#linearGradient2299"
    id="linearGradient873-2"
    x1="77.631836"
    y1="105.66691"
    x2="77.884377"
    y2="110.84394"
    gradientUnits="userSpaceOnUse" />
  <linearGradient
    inkscape:collect="always"
    xlink:href="#linearGradient2299"
    id="linearGradient873-20"
    x1="77.631836"
    y1="105.66691"
    x2="77.884377"
    y2="110.84394"
    gradientUnits="userSpaceOnUse" />
  <linearGradient
    inkscape:collect="always"
    xlink:href="#linearGradient2284"
    id="linearGradient2286-4"
    x1="76.564667"
    y1="107.29114"
    x2="78.916229"
    y2="109.38493"
    gradientUnits="userSpaceOnUse"
    gradientTransform="matrix(-1.1291151,0,0,1.1291151,165.63091,-13.86616)" />
  <linearGradient
    inkscape:collect="always"
    xlink:href="#linearGradient2284"
    id="linearGradient2286-2"
    x1="76.564667"
    y1="107.29114"
    x2="78.916229"
    y2="109.38493"
    gradientUnits="userSpaceOnUse"
    gradientTransform="matrix(1.1291151,0,0,1.1291151,-10.034498,-13.951583)" />
  <linearGradient
    inkscape:collect="always"
    xlink:href="#linearGradient2284"
    id="linearGradient2286-9"
    x1="76.564667"
    y1="107.29114"
    x2="78.916229"
    y2="109.38493"
    gradientUnits="userSpaceOnUse"
    gradientTransform="matrix(1.1291151,0,0,1.1291151,-10.072772,-13.95176)" />
  <linearGradient
    inkscape:collect="always"
    xlink:href="#linearGradient2539"
    id="linearGradient2541"
    x1="2.0820312"
    y1="38.138672"
    x2="4.3310289"
    y2="39.238293"
    gradientUnits="userSpaceOnUse" />
  <linearGradient
    inkscape:collect="always"
    xlink:href="#linearGradient2596"
    id="linearGradient1836-0"
    gradientUnits="userSpaceOnUse"
    gradientTransform="matrix(-1,0,0,1,180.18326,56.135517)"
    x1="76.016563"
    y1="86.799927"
    x2="73.708939"
    y2="88.2211" />
  <linearGradient
    inkscape:collect="always"
    xlink:href="#linearGradient2657"
    id="linearGradient2659"
    x1="75.032509"
    y1="105.37141"
    x2="80.16748"
    y2="111.20879"
    gradientUnits="userSpaceOnUse" />
  <linearGradient
    inkscape:collect="always"
    xlink:href="#linearGradient2657"
    id="linearGradient2693"
    gradientUnits="userSpaceOnUse"
    x1="75.032509"
    y1="105.37141"
    x2="80.16748"
    y2="111.20879" />
  <linearGradient
    inkscape:collect="always"
    xlink:href="#linearGradient1059"
    id="linearGradient1637-1"
    gradientUnits="userSpaceOnUse"
    gradientTransform="translate(5.5061624,20.554255)"
    x1="88.367867"
    y1="82.354485"
    x2="90.931129"
    y2="84.917747" />
  <linearGradient
    inkscape:collect="always"
    xlink:href="#linearGradient1059"
    id="linearGradient1639-5"
    gradientUnits="userSpaceOnUse"
    gradientTransform="translate(-0.42265661,20.554253)"
    x1="88.367867"
    y1="82.354485"
    x2="90.931129"
    y2="84.917747" />
  <linearGradient
    inkscape:collect="always"
    xlink:href="#linearGradient1059"
    id="linearGradient2838"
    gradientUnits="userSpaceOnUse"
    gradientTransform="translate(5.5061624,20.554255)"
    x1="88.367867"
    y1="82.354485"
    x2="90.931129"
    y2="84.917747" />
  <linearGradient
    inkscape:collect="always"
    xlink:href="#linearGradient1059"
    id="linearGradient2840"
    gradientUnits="userSpaceOnUse"
    gradientTransform="translate(-0.42265661,20.554253)"
    x1="88.367867"
    y1="82.354485"
    x2="90.931129"
    y2="84.917747" />
  <linearGradient
    inkscape:collect="always"
    xlink:href="#linearGradient1059"
    id="linearGradient3011"
    gradientUnits="userSpaceOnUse"
    gradientTransform="translate(-0.42265661,20.554253)"
    x1="88.367867"
    y1="82.354485"
    x2="90.931129"
    y2="84.917747" />
  <linearGradient
    inkscape:collect="always"
    xlink:href="#linearGradient1059"
    id="linearGradient3038"
    gradientUnits="userSpaceOnUse"
    gradientTransform="translate(5.5061624,20.554255)"
    x1="88.367867"
    y1="82.354485"
    x2="90.931129"
    y2="84.917747" />
  <linearGradient
    inkscape:collect="always"
    xlink:href="#linearGradient1059"
    id="linearGradient3117"
    gradientUnits="userSpaceOnUse"
    gradientTransform="translate(5.5061624,20.554255)"
    x1="88.367867"
    y1="82.354485"
    x2="90.931129"
    y2="84.917747" />
  <linearGradient
    inkscape:collect="always"
    xlink:href="#linearGradient1059"
    id="linearGradient3145"
    gradientUnits="userSpaceOnUse"
    gradientTransform="translate(-0.42265661,20.554253)"
    x1="88.367867"
    y1="82.354485"
    x2="90.931129"
    y2="84.917747" />
  <linearGradient
    inkscape:collect="always"
    xlink:href="#linearGradient1059"
    id="linearGradient3263"
    gradientUnits="userSpaceOnUse"
    gradientTransform="translate(5.5061624,20.554255)"
    x1="88.367867"
    y1="82.354485"
    x2="90.931129"
    y2="84.917747" />
  <linearGradient
    inkscape:collect="always"
    xlink:href="#linearGradient1059"
    id="linearGradient3287"
    gradientUnits="userSpaceOnUse"
    gradientTransform="translate(5.5061624,20.554255)"
    x1="88.367867"
    y1="82.354485"
    x2="90.931129"
    y2="84.917747" />
  <linearGradient
    inkscape:collect="always"
    xlink:href="#linearGradient1059"
    id="linearGradient3289"
    gradientUnits="userSpaceOnUse"
    gradientTransform="translate(-0.42265661,20.554253)"
    x1="88.367867"
    y1="82.354485"
    x2="90.931129"
    y2="84.917747" />
 </defs>
 <sodipodi:namedview
   id="base"
   pagecolor="#ffffff"
   bordercolor="#666666"
   borderopacity="1.0"
   inkscape:pageopacity="0.0"
   inkscape:pageshadow="2"
   inkscape:zoom="4"
   inkscape:cx="49.671325"
   inkscape:cy="28.333312"
   inkscape:document-units="px"
   inkscape:current-layer="layer1"
   showgrid="false"
   units="px"
   fit-margin-top="0"
   fit-margin-left="0"
   fit-margin-right="0"
   fit-margin-bottom="0"
   inkscape:snap-global="true"
   inkscape:window-width="1366"
   inkscape:window-height="705"
   inkscape:window-x="-8"
   inkscape:window-y="-8"
   inkscape:window-maximized="1" />
 <metadata
   id="metadata5">
  <rdf:RDF>
   <cc:Work
     rdf:about="">
    <dc:format>image/svg+xml</dc:format>
    <dc:type
      rdf:resource="http://purl.org/dc/dcmitype/StillImage" />
    <dc:title></dc:title>
   </cc:Work>
  </rdf:RDF>
 </metadata>
 <g
   inkscape:label="Calque 1"
   inkscape:groupmode="layer"
   id="layer1"
   transform="translate(-71.286819,-101.84099)">
  <g
    id="g1242-8-4-1"
    transform="matrix(0,0.98864638,-1.0022335,0,178.04441,43.562223)">
   <path
     inkscape:connector-curvature="0"
     id="path1017-6-3-7-1"
     d="m 89.39587,102.50709 a 2.0992234,1.74567 0 0 0 -2.058596,1.41407 h -2.050782 v 0.68555 h 2.052735 a 2.0992234,1.74567 0 0 0 2.056643,1.39257 a 2.0992234,1.74567 0 0 0 2.09961,-1.74609 a 2.0992234,1.74567 0 0 0 -2.09961,-1.7461 z m -0.06641,1.01759 a 1.4584079,0.72920394 0 0 1 1.458983,0.72851 a 1.4584079,0.72920394 0 0 1 -1.458983,0.72852 a 1.4584079,0.72920394 0 0 1 -1.458984,-0.72852 a 1.4584079,0.72920394 0 0 1 1.458984,-0.72851 z"
     style="opacity:1;vector-effect:none;fill:url(#linearGradient3289);fill-opacity:1;stroke:none;stroke-width:0.32837549;stroke-linecap:square;stroke-linejoin:round;stroke-miterlimit:4;stroke-dasharray:none;stroke-dashoffset:0;stroke-opacity:1;paint-order:markers fill stroke" />
  </g>
  <g
    id="g1242-8-4-2"
    transform="matrix(0,0.98864638,-1.0022335,0,178.04439,19.56222)">
   <path
     inkscape:connector-curvature="0"
     id="path1017-5-6-0-5-3"
     d="m 95.32469,102.50709 a 2.0992234,1.74567 0 0 0 -2.0586,1.41407 h -2.05078 v 0.68555 h 2.05274 a 2.0992234,1.74567 0 0 0 2.05664,1.39258 a 2.0992234,1.74567 0 0 0 2.09961,-1.7461 a 2.0992234,1.74567 0 0 0 -2.09961,-1.7461 z m -0.0664,1.01759 a 1.4584079,0.72920394 0 0 1 1.45898,0.72851 a 1.4584079,0.72920394 0 0 1 -1.45898,0.72852 a 1.4584079,0.72920394 0 0 1 -1.45899,-0.72852 a 1.4584079,0.72920394 0 0 1 1.45899,-0.72851 z"
     style="opacity:1;vector-effect:none;fill:url(#linearGradient3263);fill-opacity:1;stroke:none;stroke-width:0.32837549;stroke-linecap:square;stroke-linejoin:round;stroke-miterlimit:4;stroke-dasharray:none;stroke-dashoffset:0;stroke-opacity:1;paint-order:markers fill stroke" />
  </g>
  <g
    id="g2961-7-7"
    transform="rotate(-90,97.286819,115.88039)">
   <g
     id="g1242-8-1-4"
     transform="matrix(0,0.98864638,-1.0022335,0,213.52285,31.561882)">
    <path
      sodipodi:nodetypes="ccccc"
      inkscape:connector-curvature="0"
      id="path1017-6-3-6-2"
      d="m 87.337274,103.92116 h -2.050782 v 0.68555 h 2.052735 c 7.050952,2.50494 7.137495,-2.63783 -0.002,-0.68555 z"
      style="opacity:1;vector-effect:none;fill:url(#linearGradient3145);fill-opacity:1;stroke:none;stroke-width:0.32837549;stroke-linecap:square;stroke-linejoin:round;stroke-miterlimit:4;stroke-dasharray:none;stroke-dashoffset:0;stroke-opacity:1;paint-order:markers fill stroke" />
   </g>
  </g>
  <g
    id="g2961-7-0"
    transform="rotate(-90,85.286819,127.88039)">
   <g
     id="g1242-8-1-5"
     transform="matrix(0,0.98864638,-1.0022335,0,213.52285,31.561882)">
    <path
      sodipodi:nodetypes="cccccccc"
      inkscape:connector-curvature="0"
      id="path1017-5-6-0-0-2"
      d="m 95.32469,102.50709 c -5.943912,1.21098 -4.175532,3.40174 0,3.4922 c 1.159722,1.8e-4 2.099896,-0.7817 2.09961,-1.7461 c 2.86e-4,-0.9644 -0.939888,-1.74628 -2.09961,-1.7461 z m -0.0664,1.01759 c 0.805138,-1.6e-4 1.458214,0.32594 1.45898,0.72851 c -7.55e-4,0.40257 -0.653834,0.72868 -1.45898,0.72852 c -2.063045,-0.32863 -1.292218,-1.12493 0,-1.45703 z"
      style="opacity:1;vector-effect:none;fill:url(#linearGradient3117);fill-opacity:1;stroke:none;stroke-width:0.32837549;stroke-linecap:square;stroke-linejoin:round;stroke-miterlimit:4;stroke-dasharray:none;stroke-dashoffset:0;stroke-opacity:1;paint-order:markers fill stroke" />
   </g>
  </g>
  <g
    id="g1242-8-1-39"
    transform="matrix(0,0.98864638,-1.0022335,0,213.52285,19.561882)">
   <path
     sodipodi:nodetypes="cccccccc"
     inkscape:connector-curvature="0"
     id="path1017-5-6-0-0-5"
     d="m 95.32469,102.50709 c -5.943912,1.21098 -4.175532,3.40174 0,3.4922 c 1.159722,1.8e-4 2.099896,-0.7817 2.09961,-1.7461 c 2.86e-4,-0.9644 -0.939888,-1.74628 -2.09961,-1.7461 z m -0.0664,1.01759 c 0.805138,-1.6e-4 1.458214,0.32594 1.45898,0.72851 c -7.55e-4,0.40257 -0.653834,0.72868 -1.45898,0.72852 c -2.063045,-0.32863 -1.292218,-1.12493 0,-1.45703 z"
     style="opacity:1;vector-effect:none;fill:url(#linearGradient3038);fill-opacity:1;stroke:none;stroke-width:0.32837549;stroke-linecap:square;stroke-linejoin:round;stroke-miterlimit:4;stroke-dasharray:none;stroke-dashoffset:0;stroke-opacity:1;paint-order:markers fill stroke" />
  </g>
  <g
    id="g1242-8-1-3"
    transform="matrix(0,0.98864638,-1.0022335,0,213.52285,43.561882)">
   <path
     inkscape:connector-curvature="0"
     id="path1017-6-3-6-7"
     d="m 89.39587,102.50709 a 2.0992234,1.74567 0 0 0 -2.058596,1.41407 h -2.050782 v 0.68555 h 2.052735 a 2.0992234,1.74567 0 0 0 2.056643,1.39257 a 2.0992234,1.74567 0 0 0 2.09961,-1.74609 a 2.0992234,1.74567 0 0 0 -2.09961,-1.7461 z m -0.06641,1.01759 a 1.4584079,0.72920394 0 0 1 1.458983,0.72851 a 1.4584079,0.72920394 0 0 1 -1.458983,0.72852 a 1.4584079,0.72920394 0 0 1 -1.458984,-0.72852 a 1.4584079,0.72920394 0 0 1 1.458984,-0.72851 z"
     style="opacity:1;vector-effect:none;fill:url(#linearGradient3011);fill-opacity:1;stroke:none;stroke-width:0.32837549;stroke-linecap:square;stroke-linejoin:round;stroke-miterlimit:4;stroke-dasharray:none;stroke-dashoffset:0;stroke-opacity:1;paint-order:markers fill stroke" />
  </g>
  <g
    id="g1242-8-8"
    transform="matrix(-0.98864638,0,0,1.0022335,193.605,30.904955)">
   <path
     inkscape:connector-curvature="0"
     id="path1017-5-6-0-76"
     d="m 95.32469,102.50709 a 2.0992234,1.74567 0 0 0 -2.0586,1.41407 h -2.05078 v 0.68555 h 2.05274 a 2.0992234,1.74567 0 0 0 2.05664,1.39258 a 2.0992234,1.74567 0 0 0 2.09961,-1.7461 a 2.0992234,1.74567 0 0 0 -2.09961,-1.7461 z m -0.0664,1.01759 a 1.4584079,0.72920394 0 0 1 1.45898,0.72851 a 1.4584079,0.72920394 0 0 1 -1.45898,0.72852 a 1.4584079,0.72920394 0 0 1 -1.45899,-0.72852 a 1.4584079,0.72920394 0 0 1 1.45899,-0.72851 z"
     style="opacity:1;vector-effect:none;fill:url(#linearGradient2838);fill-opacity:1;stroke:none;stroke-width:0.32837549;stroke-linecap:square;stroke-linejoin:round;stroke-miterlimit:4;stroke-dasharray:none;stroke-dashoffset:0;stroke-opacity:1;paint-order:markers fill stroke" />
   <path
     inkscape:connector-curvature="0"
     id="path1017-6-3-3"
     d="m 89.39587,102.50709 c -1.004712,9.6e-4 -1.867746,0.59378 -2.058596,1.41407 h -0.02781 v 0.68555 h 0.02977 c 0.201465,0.81114 1.060633,1.39289 2.056643,1.39257 c 1.159717,1.8e-4 2.099889,-0.78169 2.09961,-1.74609 c 2.86e-4,-0.9644 -0.939888,-1.74628 -2.09961,-1.7461 z m -0.06641,1.01759 c 0.805139,-1.6e-4 1.458217,0.32594 1.458983,0.72851 c -7.55e-4,0.40257 -0.653836,0.72868 -1.458983,0.72852 c -0.805147,1.6e-4 -1.458229,-0.32595 -1.458984,-0.72852 c 7.66e-4,-0.40257 0.653844,-0.72867 1.458984,-0.72851 z"
     style="opacity:1;vector-effect:none;fill:url(#linearGradient2840);fill-opacity:1;stroke:none;stroke-width:0.32837549;stroke-linecap:square;stroke-linejoin:round;stroke-miterlimit:4;stroke-dasharray:none;stroke-dashoffset:0;stroke-opacity:1;paint-order:markers fill stroke"
     sodipodi:nodetypes="ccccccccccccc" />
  </g>
  <g
    id="g1242-8-3"
    transform="matrix(-0.98864638,0,0,1.0022335,169.605,30.904954)">
   <path
     inkscape:connector-curvature="0"
     id="path1017-5-6-0-7"
     d="m 95.32469,102.50709 a 2.0992234,1.74567 0 0 0 -2.0586,1.41407 h -2.05078 v 0.68555 h 2.05274 a 2.0992234,1.74567 0 0 0 2.05664,1.39258 a 2.0992234,1.74567 0 0 0 2.09961,-1.7461 a 2.0992234,1.74567 0 0 0 -2.09961,-1.7461 z m -0.0664,1.01759 a 1.4584079,0.72920394 0 0 1 1.45898,0.72851 a 1.4584079,0.72920394 0 0 1 -1.45898,0.72852 a 1.4584079,0.72920394 0 0 1 -1.45899,-0.72852 a 1.4584079,0.72920394 0 0 1 1.45899,-0.72851 z"
     style="opacity:1;vector-effect:none;fill:url(#linearGradient1637-1);fill-opacity:1;stroke:none;stroke-width:0.32837549;stroke-linecap:square;stroke-linejoin:round;stroke-miterlimit:4;stroke-dasharray:none;stroke-dashoffset:0;stroke-opacity:1;paint-order:markers fill stroke" />
   <path
     inkscape:connector-curvature="0"
     id="path1017-6-3-2"
     d="m 89.39587,102.50709 a 2.0992234,1.74567 0 0 0 -2.058596,1.41407 h -2.050782 v 0.68555 h 2.052735 a 2.0992234,1.74567 0 0 0 2.056643,1.39257 a 2.0992234,1.74567 0 0 0 2.09961,-1.74609 a 2.0992234,1.74567 0 0 0 -2.09961,-1.7461 z m -0.06641,1.01759 a 1.4584079,0.72920394 0 0 1 1.458983,0.72851 a 1.4584079,0.72920394 0 0 1 -1.458983,0.72852 a 1.4584079,0.72920394 0 0 1 -1.458984,-0.72852 a 1.4584079,0.72920394 0 0 1 1.458984,-0.72851 z"
     style="opacity:1;vector-effect:none;fill:url(#linearGradient1639-5);fill-opacity:1;stroke:none;stroke-width:0.32837549;stroke-linecap:square;stroke-linejoin:round;stroke-miterlimit:4;stroke-dasharray:none;stroke-dashoffset:0;stroke-opacity:1;paint-order:markers fill stroke" />
  </g>
  <rect
    style="opacity:1;vector-effect:none;fill:url(#linearGradient2210);fill-opacity:1;stroke:none;stroke-width:0.26152638;stroke-linecap:square;stroke-linejoin:round;stroke-miterlimit:4;stroke-dasharray:none;stroke-dashoffset:0;stroke-opacity:1;paint-order:markers fill stroke"
    id="rect2118"
    width="30"
    height="25.845749"
    x="76.286819"
    y="106.99524" />
  <rect
    style="opacity:1;vector-effect:none;fill:#4d4236;fill-opacity:1;stroke:none;stroke-width:0.24133292;stroke-linecap:square;stroke-linejoin:round;stroke-miterlimit:4;stroke-dasharray:none;stroke-dashoffset:0;stroke-opacity:1;paint-order:markers fill stroke"
    id="rect2118-0"
    width="28"
    height="23.58058"
    x="77.286819"
    y="108.26041" />
  <path
    style="opacity:1;vector-effect:none;fill:#383027;fill-opacity:1;stroke:none;stroke-width:0.29681259;stroke-linecap:square;stroke-linejoin:round;stroke-miterlimit:4;stroke-dasharray:none;stroke-dashoffset:0;stroke-opacity:1;paint-order:markers fill stroke"
    d="M 6 6 L 6 25.503906 L 6 30 L 9.1484375 30 L 10.234375 30 L 29.763672 30 L 30.626953 30 L 34 30 L 34 6.0800781 L 34 6 L 33.957031 6 L 6 6 z M 13.988281 7 L 26.011719 7 L 26.042969 9.7578125 L 29.271484 14 L 33 14 L 33 26.005859 L 31.230469 26.894531 A 1.1886558 1.1943825 0 0 1 31.228516 26.896484 C 30.428226 27.300054 29.840103 28.102334 29.695312 28.990234 C 29.694779 28.993506 29.695829 28.996729 29.695312 29 L 10.304688 29 C 10.304171 28.996728 10.305221 28.993507 10.304688 28.990234 C 10.159907 28.102344 9.5717744 27.300054 8.7714844 26.896484 A 1.1886558 1.1943825 0 0 0 8.7695312 26.894531 L 7 26.005859 L 7 14 L 10.730469 14 L 13.957031 9.7597656 L 13.988281 7 z "
    transform="translate(71.286819,101.84099)"
    id="rect828-2" />
  <path
    style="opacity:1;vector-effect:none;fill:#574b3d;fill-opacity:1;stroke:none;stroke-width:0.29991075;stroke-linecap:square;stroke-linejoin:round;stroke-miterlimit:4;stroke-dasharray:none;stroke-dashoffset:0;stroke-opacity:1;paint-order:markers fill stroke"
    d="m 76.201263,101.84099 l -4.914444,4.91855 v 8.08145 h 9.737339 l 3.262661,-4.2844 v -8.7156 z"
    id="rect828"
    inkscape:connector-curvature="0" />
  <path
    sodipodi:type="inkscape:offset"
    inkscape:radius="-1.1059171"
    inkscape:original="M 76.214844 101.83203 L 71.287109 106.74023 L 71.287109 114.80469 L 81.050781 114.80469 L 84.322266 110.5293 L 84.322266 101.83203 L 76.214844 101.83203 z "
    style="opacity:1;vector-effect:none;fill:url(#linearGradient938);fill-opacity:1;stroke:none;stroke-width:0.30000001;stroke-linecap:square;stroke-linejoin:round;stroke-miterlimit:4;stroke-dasharray:none;stroke-dashoffset:0;stroke-opacity:1;paint-order:markers fill stroke"
    id="rect828-8"
    d="m 76.671875,102.9375 l -4.279297,4.26172 v 6.5 h 8.111328 l 2.712891,-3.54492 v -7.2168 z"
    transform="matrix(0.99730299,0,0,1.0021078,0.19226126,-0.20522219)" />
  <path
    sodipodi:type="inkscape:offset"
    inkscape:radius="1.6636688"
    inkscape:original="M 77.669922 105.69727 L 75.169922 107.30469 L 76.376953 108.28711 L 75.126953 109.35742 L 77.804688 110.83203 L 80.482422 109.35742 L 79.009766 108.28711 L 80.617188 107.16992 L 77.669922 105.69727 z "
    style="fill:#847564;fill-opacity:1;fill-rule:evenodd;stroke:none;stroke-width:1px;stroke-linecap:butt;stroke-linejoin:miter;stroke-opacity:1"
    id="path835-9"
    d="m 77.609375,104.03516 a 1.6638351,1.6638351 0 0 0 -0.839844,0.26367 l -2.5,1.60742 a 1.6638351,1.6638351 0 0 0 -0.427734,2.39648 a 1.6638351,1.6638351 0 0 0 0.482422,2.51172 l 2.677734,1.47461 a 1.6638351,1.6638351 0 0 0 1.605469,0 l 2.677734,-1.47461 a 1.6638351,1.6638351 0 0 0 0.511719,-2.47461 a 1.6638351,1.6638351 0 0 0 -0.435547,-2.6582 l -2.947266,-1.47266 a 1.6638351,1.6638351 0 0 0 -0.804687,-0.17382 z"
    transform="matrix(0.99730299,0,0,1.0021078,0.19226126,-0.20522219)" />
  <ellipse
    style="opacity:1;vector-effect:none;fill:#5f5f5f;fill-opacity:1;stroke:none;stroke-width:0.29991075;stroke-linecap:square;stroke-linejoin:round;stroke-miterlimit:4;stroke-dasharray:none;stroke-dashoffset:0;stroke-opacity:1;paint-order:markers fill stroke"
    id="path915"
    cx="73.600761"
    cy="112.5173"
    rx="0.61390156"
    ry="0.60104227" />
  <ellipse
    style="opacity:1;vector-effect:none;fill:#5f5f5f;fill-opacity:1;stroke:none;stroke-width:0.29991075;stroke-linecap:square;stroke-linejoin:round;stroke-miterlimit:4;stroke-dasharray:none;stroke-dashoffset:0;stroke-opacity:1;paint-order:markers fill stroke"
    id="path915-1"
    cx="81.801849"
    cy="104.07108"
    rx="0.61390156"
    ry="0.60104227" />
  <g
    id="g1242"
    transform="matrix(0.98864638,0,0,1.0022335,0.96831044,-0.35563954)">
   <path
     inkscape:connector-curvature="0"
     id="path1017-5-6"
     d="m 95.32469,102.50709 a 2.0992234,1.74567 0 0 0 -2.0586,1.41407 h -2.05078 v 0.68555 h 2.05274 a 2.0992234,1.74567 0 0 0 2.05664,1.39258 a 2.0992234,1.74567 0 0 0 2.09961,-1.7461 a 2.0992234,1.74567 0 0 0 -2.09961,-1.7461 z m -0.0664,1.01759 a 1.4584079,0.72920394 0 0 1 1.45898,0.72851 a 1.4584079,0.72920394 0 0 1 -1.45898,0.72852 a 1.4584079,0.72920394 0 0 1 -1.45899,-0.72852 a 1.4584079,0.72920394 0 0 1 1.45899,-0.72851 z"
     style="opacity:1;vector-effect:none;fill:url(#linearGradient1061-3-0);fill-opacity:1;stroke:none;stroke-width:0.32837549;stroke-linecap:square;stroke-linejoin:round;stroke-miterlimit:4;stroke-dasharray:none;stroke-dashoffset:0;stroke-opacity:1;paint-order:markers fill stroke" />
   <path
     inkscape:connector-curvature="0"
     id="path1017-6"
     d="m 89.39587,102.50709 a 2.0992234,1.74567 0 0 0 -2.058596,1.41407 h -2.050782 v 0.68555 h 2.052735 a 2.0992234,1.74567 0 0 0 2.056643,1.39257 a 2.0992234,1.74567 0 0 0 2.09961,-1.74609 a 2.0992234,1.74567 0 0 0 -2.09961,-1.7461 z m -0.06641,1.01759 a 1.4584079,0.72920394 0 0 1 1.458983,0.72851 a 1.4584079,0.72920394 0 0 1 -1.458983,0.72852 a 1.4584079,0.72920394 0 0 1 -1.458984,-0.72852 a 1.4584079,0.72920394 0 0 1 1.458984,-0.72851 z"
     style="opacity:1;vector-effect:none;fill:url(#linearGradient1061-0);fill-opacity:1;stroke:none;stroke-width:0.32837549;stroke-linecap:square;stroke-linejoin:round;stroke-miterlimit:4;stroke-dasharray:none;stroke-dashoffset:0;stroke-opacity:1;paint-order:markers fill stroke" />
  </g>
  <g
    id="g1242-0"
    transform="matrix(0,0.98864638,1.0022335,0,-30.949215,31.562222)">
   <path
     inkscape:connector-curvature="0"
     id="path1017-5-6-9"
     d="m 95.32469,102.50709 a 2.0992234,1.74567 0 0 0 -2.0586,1.41407 h -2.05078 v 0.68555 h 2.05274 a 2.0992234,1.74567 0 0 0 2.05664,1.39258 a 2.0992234,1.74567 0 0 0 2.09961,-1.7461 a 2.0992234,1.74567 0 0 0 -2.09961,-1.7461 z m -0.0664,1.01759 a 1.4584079,0.72920394 0 0 1 1.45898,0.72851 a 1.4584079,0.72920394 0 0 1 -1.45898,0.72852 a 1.4584079,0.72920394 0 0 1 -1.45899,-0.72852 a 1.4584079,0.72920394 0 0 1 1.45899,-0.72851 z"
     style="opacity:1;vector-effect:none;fill:url(#linearGradient1444);fill-opacity:1;stroke:none;stroke-width:0.32837549;stroke-linecap:square;stroke-linejoin:round;stroke-miterlimit:4;stroke-dasharray:none;stroke-dashoffset:0;stroke-opacity:1;paint-order:markers fill stroke" />
   <path
     inkscape:connector-curvature="0"
     id="path1017-6-7"
     d="m 89.39587,102.50709 a 2.0992234,1.74567 0 0 0 -2.058596,1.41407 h -2.050782 v 0.68555 h 2.052735 a 2.0992234,1.74567 0 0 0 2.056643,1.39257 a 2.0992234,1.74567 0 0 0 2.09961,-1.74609 a 2.0992234,1.74567 0 0 0 -2.09961,-1.7461 z m -0.06641,1.01759 a 1.4584079,0.72920394 0 0 1 1.458983,0.72851 a 1.4584079,0.72920394 0 0 1 -1.458983,0.72852 a 1.4584079,0.72920394 0 0 1 -1.458984,-0.72852 a 1.4584079,0.72920394 0 0 1 1.458984,-0.72851 z"
     style="opacity:1;vector-effect:none;fill:url(#linearGradient1446);fill-opacity:1;stroke:none;stroke-width:0.32837549;stroke-linecap:square;stroke-linejoin:round;stroke-miterlimit:4;stroke-dasharray:none;stroke-dashoffset:0;stroke-opacity:1;paint-order:markers fill stroke" />
  </g>
  <g
    id="g1242-0-4"
    transform="matrix(0,0.98864638,-1.0022335,0,213.52285,31.561882)">
   <path
     inkscape:connector-curvature="0"
     id="path1017-5-6-9-2"
     d="m 95.32469,102.50709 a 2.0992234,1.74567 0 0 0 -2.0586,1.41407 h -2.05078 v 0.68555 h 2.05274 a 2.0992234,1.74567 0 0 0 2.05664,1.39258 a 2.0992234,1.74567 0 0 0 2.09961,-1.7461 a 2.0992234,1.74567 0 0 0 -2.09961,-1.7461 z m -0.0664,1.01759 a 1.4584079,0.72920394 0 0 1 1.45898,0.72851 a 1.4584079,0.72920394 0 0 1 -1.45898,0.72852 a 1.4584079,0.72920394 0 0 1 -1.45899,-0.72852 a 1.4584079,0.72920394 0 0 1 1.45899,-0.72851 z"
     style="opacity:1;vector-effect:none;fill:url(#linearGradient1512);fill-opacity:1;stroke:none;stroke-width:0.32837549;stroke-linecap:square;stroke-linejoin:round;stroke-miterlimit:4;stroke-dasharray:none;stroke-dashoffset:0;stroke-opacity:1;paint-order:markers fill stroke" />
   <path
     inkscape:connector-curvature="0"
     id="path1017-6-7-9"
     d="m 89.39587,102.50709 a 2.0992234,1.74567 0 0 0 -2.058596,1.41407 h -2.050782 v 0.68555 h 2.052735 a 2.0992234,1.74567 0 0 0 2.056643,1.39257 a 2.0992234,1.74567 0 0 0 2.09961,-1.74609 a 2.0992234,1.74567 0 0 0 -2.09961,-1.7461 z m -0.06641,1.01759 a 1.4584079,0.72920394 0 0 1 1.458983,0.72851 a 1.4584079,0.72920394 0 0 1 -1.458983,0.72852 a 1.4584079,0.72920394 0 0 1 -1.458984,-0.72852 a 1.4584079,0.72920394 0 0 1 1.458984,-0.72851 z"
     style="opacity:1;vector-effect:none;fill:url(#linearGradient1514);fill-opacity:1;stroke:none;stroke-width:0.32837549;stroke-linecap:square;stroke-linejoin:round;stroke-miterlimit:4;stroke-dasharray:none;stroke-dashoffset:0;stroke-opacity:1;paint-order:markers fill stroke" />
  </g>
  <g
    id="g1242-8"
    transform="matrix(-0.98864638,0,0,1.0022335,181.605,30.90495)">
   <path
     inkscape:connector-curvature="0"
     id="path1017-5-6-0"
     d="m 95.32469,102.50709 a 2.0992234,1.74567 0 0 0 -2.0586,1.41407 h -2.05078 v 0.68555 h 2.05274 a 2.0992234,1.74567 0 0 0 2.05664,1.39258 a 2.0992234,1.74567 0 0 0 2.09961,-1.7461 a 2.0992234,1.74567 0 0 0 -2.09961,-1.7461 z m -0.0664,1.01759 a 1.4584079,0.72920394 0 0 1 1.45898,0.72851 a 1.4584079,0.72920394 0 0 1 -1.45898,0.72852 a 1.4584079,0.72920394 0 0 1 -1.45899,-0.72852 a 1.4584079,0.72920394 0 0 1 1.45899,-0.72851 z"
     style="opacity:1;vector-effect:none;fill:url(#linearGradient1637);fill-opacity:1;stroke:none;stroke-width:0.32837549;stroke-linecap:square;stroke-linejoin:round;stroke-miterlimit:4;stroke-dasharray:none;stroke-dashoffset:0;stroke-opacity:1;paint-order:markers fill stroke" />
   <path
     inkscape:connector-curvature="0"
     id="path1017-6-3"
     d="m 89.39587,102.50709 a 2.0992234,1.74567 0 0 0 -2.058596,1.41407 h -2.050782 v 0.68555 h 2.052735 a 2.0992234,1.74567 0 0 0 2.056643,1.39257 a 2.0992234,1.74567 0 0 0 2.09961,-1.74609 a 2.0992234,1.74567 0 0 0 -2.09961,-1.7461 z m -0.06641,1.01759 a 1.4584079,0.72920394 0 0 1 1.458983,0.72851 a 1.4584079,0.72920394 0 0 1 -1.458983,0.72852 a 1.4584079,0.72920394 0 0 1 -1.458984,-0.72852 a 1.4584079,0.72920394 0 0 1 1.458984,-0.72851 z"
     style="opacity:1;vector-effect:none;fill:url(#linearGradient1639);fill-opacity:1;stroke:none;stroke-width:0.32837549;stroke-linecap:square;stroke-linejoin:round;stroke-miterlimit:4;stroke-dasharray:none;stroke-dashoffset:0;stroke-opacity:1;paint-order:markers fill stroke" />
  </g>
  <g
    id="g1737"
    transform="translate(12.706372,51.573245)" />
  <g
    id="g2303">
   <path
     transform="matrix(0.99730299,0,0,1.0021078,0.19226126,-0.20522219)"
     d="m 77.632812,104.6875 a 1.0103471,1.0103471 0 0 0 -0.509765,0.16016 l -2.5,1.60742 a 1.0103471,1.0103471 0 0 0 -0.0918,1.63281 l 0.269531,0.21875 l -0.330078,0.2832 a 1.0103471,1.0103471 0 0 0 0.167969,1.65235 l 2.677734,1.47461 a 1.0103471,1.0103471 0 0 0 0.976563,0 l 2.677734,-1.47461 a 1.0103471,1.0103471 0 0 0 0.105469,-1.70117 l -0.322266,-0.23438 L 81.193359,108 a 1.0103471,1.0103471 0 0 0 -0.125,-1.73438 l -2.947265,-1.47265 a 1.0103471,1.0103471 0 0 0 -0.488282,-0.10547 z"
     id="path835-8"
     style="fill:url(#linearGradient873);fill-opacity:1;fill-rule:evenodd;stroke:none;stroke-width:1px;stroke-linecap:butt;stroke-linejoin:miter;stroke-opacity:1"
     inkscape:original="M 77.669922 105.69727 L 75.169922 107.30469 L 76.376953 108.28711 L 75.126953 109.35742 L 77.804688 110.83203 L 80.482422 109.35742 L 79.009766 108.28711 L 80.617188 107.16992 L 77.669922 105.69727 z "
     inkscape:radius="1.010246"
     sodipodi:type="inkscape:offset" />
   <path
     inkscape:connector-curvature="0"
     id="path2275"
     d="m 77.717178,105.40623 l -1.230559,1.77747 l -1.585613,0.0397 l 1.730297,1.10995 l -1.781019,1.21443 h 1.777474 l 1.23938,1.66721 l 1.274666,-1.66721 h 1.742189 l -1.7194,-1.19004 l 1.869361,-1.28651 l -2.004621,0.0507 z"
     style="fill:url(#linearGradient2286);fill-opacity:1;fill-rule:evenodd;stroke:none;stroke-width:1.1291151px;stroke-linecap:butt;stroke-linejoin:miter;stroke-opacity:1"
     sodipodi:nodetypes="ccccccccccccc" />
  </g>
  <g
    id="g2392">
   <path
     inkscape:connector-curvature="0"
     id="rect828-4"
     d="m 106.37238,101.84099 l 4.91444,4.91855 v 8.08145 h -9.73734 l -3.26266,-4.2844 v -8.7156 z"
     style="opacity:1;vector-effect:none;fill:#574b3d;fill-opacity:1;stroke:none;stroke-width:0.29991075;stroke-linecap:square;stroke-linejoin:round;stroke-miterlimit:4;stroke-dasharray:none;stroke-dashoffset:0;stroke-opacity:1;paint-order:markers fill stroke" />
   <path
     transform="matrix(-0.99730299,0,0,1.0021078,182.38138,-0.20522035)"
     d="m 76.671875,102.9375 l -4.279297,4.26172 v 6.5 h 8.111328 l 2.712891,-3.54492 v -7.2168 z"
     id="rect828-8-7"
     style="opacity:1;vector-effect:none;fill:url(#linearGradient938-7);fill-opacity:1;stroke:none;stroke-width:0.30000001;stroke-linecap:square;stroke-linejoin:round;stroke-miterlimit:4;stroke-dasharray:none;stroke-dashoffset:0;stroke-opacity:1;paint-order:markers fill stroke"
     inkscape:original="M 76.214844 101.83203 L 71.287109 106.74023 L 71.287109 114.80469 L 81.050781 114.80469 L 84.322266 110.5293 L 84.322266 101.83203 L 76.214844 101.83203 z "
     inkscape:radius="-1.1059171"
     sodipodi:type="inkscape:offset" />
   <ellipse
     transform="scale(-1,1)"
     ry="0.60104227"
     rx="0.61390156"
     cy="112.51732"
     cx="-108.97289"
     id="path915-12"
     style="opacity:1;vector-effect:none;fill:#5f5f5f;fill-opacity:1;stroke:none;stroke-width:0.29991075;stroke-linecap:square;stroke-linejoin:round;stroke-miterlimit:4;stroke-dasharray:none;stroke-dashoffset:0;stroke-opacity:1;paint-order:markers fill stroke" />
   <ellipse
     transform="scale(-1,1)"
     ry="0.60104227"
     rx="0.61390156"
     cy="104.07109"
     cx="-100.77179"
     id="path915-1-1"
     style="opacity:1;vector-effect:none;fill:#5f5f5f;fill-opacity:1;stroke:none;stroke-width:0.29991075;stroke-linecap:square;stroke-linejoin:round;stroke-miterlimit:4;stroke-dasharray:none;stroke-dashoffset:0;stroke-opacity:1;paint-order:markers fill stroke" />
   <path
     transform="matrix(-0.99730299,0,0,1.0021078,182.38138,-0.20522035)"
     d="m 77.609375,104.03516 a 1.6638351,1.6638351 0 0 0 -0.839844,0.26367 l -2.5,1.60742 a 1.6638351,1.6638351 0 0 0 -0.427734,2.39648 a 1.6638351,1.6638351 0 0 0 0.482422,2.51172 l 2.677734,1.47461 a 1.6638351,1.6638351 0 0 0 1.605469,0 l 2.677734,-1.47461 a 1.6638351,1.6638351 0 0 0 0.511719,-2.47461 a 1.6638351,1.6638351 0 0 0 -0.435547,-2.6582 l -2.947266,-1.47266 a 1.6638351,1.6638351 0 0 0 -0.804687,-0.17382 z"
     id="path835-9-3"
     style="fill:#847564;fill-opacity:1;fill-rule:evenodd;stroke:none;stroke-width:1px;stroke-linecap:butt;stroke-linejoin:miter;stroke-opacity:1"
     inkscape:original="M 77.669922 105.69727 L 75.169922 107.30469 L 76.376953 108.28711 L 75.126953 109.35742 L 77.804688 110.83203 L 80.482422 109.35742 L 79.009766 108.28711 L 80.617188 107.16992 L 77.669922 105.69727 z "
     inkscape:radius="1.6636688"
     sodipodi:type="inkscape:offset" />
   <g
     id="g2303-8"
     transform="matrix(-1,0,0,1,182.5744,-0.0012848)">
    <path
      sodipodi:type="inkscape:offset"
      inkscape:radius="1.010246"
      inkscape:original="M 77.669922 105.69727 L 75.169922 107.30469 L 76.376953 108.28711 L 75.126953 109.35742 L 77.804688 110.83203 L 80.482422 109.35742 L 79.009766 108.28711 L 80.617188 107.16992 L 77.669922 105.69727 z "
      style="fill:url(#linearGradient873-9);fill-opacity:1;fill-rule:evenodd;stroke:none;stroke-width:1px;stroke-linecap:butt;stroke-linejoin:miter;stroke-opacity:1"
      id="path835-8-9"
      d="m 77.632812,104.6875 a 1.0103471,1.0103471 0 0 0 -0.509765,0.16016 l -2.5,1.60742 a 1.0103471,1.0103471 0 0 0 -0.0918,1.63281 l 0.269531,0.21875 l -0.330078,0.2832 a 1.0103471,1.0103471 0 0 0 0.167969,1.65235 l 2.677734,1.47461 a 1.0103471,1.0103471 0 0 0 0.976563,0 l 2.677734,-1.47461 a 1.0103471,1.0103471 0 0 0 0.105469,-1.70117 l -0.322266,-0.23438 L 81.193359,108 a 1.0103471,1.0103471 0 0 0 -0.125,-1.73438 l -2.947265,-1.47265 a 1.0103471,1.0103471 0 0 0 -0.488282,-0.10547 z"
      transform="matrix(0.99730299,0,0,1.0021078,0.19226126,-0.20522219)" />
    <path
      inkscape:connector-curvature="0"
      id="path2275-6"
      d="m 77.950026,105.50039 l 1.23056,1.77747 l 1.58561,0.0397 l -1.7303,1.10995 l 1.78102,1.21443 h -1.77747 l -1.23938,1.66721 l -1.27467,-1.66721 h -1.74219 l 1.7194,-1.19004 l -1.86936,-1.28651 l 2.00462,0.0507 z"
      style="fill:url(#linearGradient2286-4);fill-opacity:1;fill-rule:evenodd;stroke:none;stroke-width:1.1291151px;stroke-linecap:butt;stroke-linejoin:miter;stroke-opacity:1"
      sodipodi:nodetypes="ccccccccccccc" />
   </g>
  </g>
  <g
    id="g2140">
   <rect
     transform="matrix(-0.73073531,0.6826609,0.6826609,0.73073531,0,0)"
     y="175.26721"
     x="17.718609"
     height="1.8899506"
     width="1.8899506"
     id="rect1728-6"
     style="opacity:1;vector-effect:none;fill:#4d4236;fill-opacity:1;stroke:none;stroke-width:0.23116063;stroke-linecap:square;stroke-linejoin:round;stroke-miterlimit:4;stroke-dasharray:none;stroke-dashoffset:0;stroke-opacity:1;paint-order:markers fill stroke" />
   <rect
     transform="scale(-1,1)"
     y="135.00372"
     x="-107.15347"
     height="9.5149784"
     width="0.99896711"
     id="rect1714-3"
     style="opacity:1;vector-effect:none;fill:#4d4236;fill-opacity:1;stroke:none;stroke-width:0.42625672;stroke-linecap:square;stroke-linejoin:round;stroke-miterlimit:4;stroke-dasharray:none;stroke-dashoffset:0;stroke-opacity:1;paint-order:markers fill stroke" />
   <path
     inkscape:connector-curvature="0"
     id="path1718-8"
     d="m 109.20483,142.97964 l -5.03813,-0.0442 l 2.60745,4.90555 z"
     style="fill:url(#linearGradient1836);fill-opacity:1;fill-rule:evenodd;stroke:none;stroke-width:1px;stroke-linecap:butt;stroke-linejoin:miter;stroke-opacity:1" />
   <path
     id="path1718-8-7"
     d="m 104.1667,142.93544 l 1.52734,2.87109 l 1.49219,-2.84375 z"
     style="fill:url(#linearGradient1836-0);fill-opacity:1;fill-rule:evenodd;stroke:none;stroke-width:1px;stroke-linecap:butt;stroke-linejoin:miter;stroke-opacity:1"
     inkscape:connector-curvature="0" />
  </g>
  <path
    sodipodi:type="inkscape:offset"
    inkscape:radius="1.6636688"
    inkscape:original="M 77.669922 105.69727 L 75.169922 107.30469 L 76.376953 108.28711 L 75.126953 109.35742 L 77.804688 110.83203 L 80.482422 109.35742 L 79.009766 108.28711 L 80.617188 107.16992 L 77.669922 105.69727 z "
    style="fill:url(#linearGradient2693);fill-opacity:1;fill-rule:evenodd;stroke:none;stroke-width:1px;stroke-linecap:butt;stroke-linejoin:miter;stroke-opacity:1"
    id="path835-9-32-4"
    d="m 77.609375,104.03516 a 1.6638351,1.6638351 0 0 0 -0.839844,0.26367 l -2.5,1.60742 a 1.6638351,1.6638351 0 0 0 -0.427734,2.39648 a 1.6638351,1.6638351 0 0 0 0.482422,2.51172 l 2.677734,1.47461 a 1.6638351,1.6638351 0 0 0 1.605469,0 l 2.677734,-1.47461 a 1.6638351,1.6638351 0 0 0 0.511719,-2.47461 a 1.6638351,1.6638351 0 0 0 -0.435547,-2.6582 l -2.947266,-1.47266 a 1.6638351,1.6638351 0 0 0 -0.804687,-0.17382 z"
    transform="matrix(0.99730299,0,0,1.0021078,29.001371,23.937017)" />
  <g
    transform="translate(28.80911,24.142237)"
    id="g2303-02">
   <path
     transform="matrix(0.99730299,0,0,1.0021078,0.19226126,-0.20522219)"
     d="m 77.632812,104.6875 a 1.0103471,1.0103471 0 0 0 -0.509765,0.16016 l -2.5,1.60742 a 1.0103471,1.0103471 0 0 0 -0.0918,1.63281 l 0.269531,0.21875 l -0.330078,0.2832 a 1.0103471,1.0103471 0 0 0 0.167969,1.65235 l 2.677734,1.47461 a 1.0103471,1.0103471 0 0 0 0.976563,0 l 2.677734,-1.47461 a 1.0103471,1.0103471 0 0 0 0.105469,-1.70117 l -0.322266,-0.23438 L 81.193359,108 a 1.0103471,1.0103471 0 0 0 -0.125,-1.73438 l -2.947265,-1.47265 a 1.0103471,1.0103471 0 0 0 -0.488282,-0.10547 z"
     id="path835-8-8"
     style="fill:url(#linearGradient873-20);fill-opacity:1;fill-rule:evenodd;stroke:none;stroke-width:1px;stroke-linecap:butt;stroke-linejoin:miter;stroke-opacity:1"
     inkscape:original="M 77.669922 105.69727 L 75.169922 107.30469 L 76.376953 108.28711 L 75.126953 109.35742 L 77.804688 110.83203 L 80.482422 109.35742 L 79.009766 108.28711 L 80.617188 107.16992 L 77.669922 105.69727 z "
     inkscape:radius="1.010246"
     sodipodi:type="inkscape:offset" />
   <path
     sodipodi:nodetypes="ccccccccccccc"
     style="fill:url(#linearGradient2286-9);fill-opacity:1;fill-rule:evenodd;stroke:none;stroke-width:1.1291151px;stroke-linecap:butt;stroke-linejoin:miter;stroke-opacity:1"
     d="m 77.608107,105.41481 l -1.230559,1.77747 l -1.585613,0.0397 l 1.730297,1.10995 l -1.781019,1.21443 h 1.777474 l 1.23938,1.66721 l 1.274666,-1.66721 h 1.742189 l -1.7194,-1.19004 l 1.869361,-1.28651 l -2.004621,0.0507 z"
     id="path2275-7"
     inkscape:connector-curvature="0" />
  </g>
  <rect
    transform="rotate(43.051927)"
    y="48.360531"
    x="149.00932"
    height="1.8899506"
    width="1.8899506"
    id="rect1728"
    style="opacity:1;vector-effect:none;fill:#4d4236;fill-opacity:1;stroke:none;stroke-width:0.23116063;stroke-linecap:square;stroke-linejoin:round;stroke-miterlimit:4;stroke-dasharray:none;stroke-dashoffset:0;stroke-opacity:1;paint-order:markers fill stroke" />
  <rect
    y="135.00374"
    x="75.419518"
    height="8.4524784"
    width="0.99896711"
    id="rect1714"
    style="opacity:1;vector-effect:none;fill:#4d4236;fill-opacity:1;stroke:none;stroke-width:0.40175322;stroke-linecap:square;stroke-linejoin:round;stroke-miterlimit:4;stroke-dasharray:none;stroke-dashoffset:0;stroke-opacity:1;paint-order:markers fill stroke" />
  <path
    inkscape:connector-curvature="0"
    id="path1718"
    d="m 73.368149,139.97963 l 5.038136,-0.0442 l -2.607457,4.90554 z"
    style="fill:url(#linearGradient1726);fill-opacity:1;fill-rule:evenodd;stroke:none;stroke-width:1px;stroke-linecap:butt;stroke-linejoin:miter;stroke-opacity:1" />
  <path
    sodipodi:type="inkscape:offset"
    inkscape:radius="1.6636688"
    inkscape:original="M 77.669922 105.69727 L 75.169922 107.30469 L 76.376953 108.28711 L 75.126953 109.35742 L 77.804688 110.83203 L 80.482422 109.35742 L 79.009766 108.28711 L 80.617188 107.16992 L 77.669922 105.69727 z "
    style="fill:url(#linearGradient2659);fill-opacity:1;fill-rule:evenodd;stroke:none;stroke-width:1px;stroke-linecap:butt;stroke-linejoin:miter;stroke-opacity:1"
    id="path835-9-32"
    d="m 77.609375,104.03516 a 1.6638351,1.6638351 0 0 0 -0.839844,0.26367 l -2.5,1.60742 a 1.6638351,1.6638351 0 0 0 -0.427734,2.39648 a 1.6638351,1.6638351 0 0 0 0.482422,2.51172 l 2.677734,1.47461 a 1.6638351,1.6638351 0 0 0 1.605469,0 l 2.677734,-1.47461 a 1.6638351,1.6638351 0 0 0 0.511719,-2.47461 a 1.6638351,1.6638351 0 0 0 -0.435547,-2.6582 l -2.947266,-1.47266 a 1.6638351,1.6638351 0 0 0 -0.804687,-0.17382 z"
    transform="matrix(0.99730299,0,0,1.0021078,-1.6192714,23.93684)" />
  <g
    transform="translate(-1.8115324,24.14206)"
    id="g2303-0">
   <path
     transform="matrix(0.99730299,0,0,1.0021078,0.19226126,-0.20522219)"
     d="m 77.632812,104.6875 a 1.0103471,1.0103471 0 0 0 -0.509765,0.16016 l -2.5,1.60742 a 1.0103471,1.0103471 0 0 0 -0.0918,1.63281 l 0.269531,0.21875 l -0.330078,0.2832 a 1.0103471,1.0103471 0 0 0 0.167969,1.65235 l 2.677734,1.47461 a 1.0103471,1.0103471 0 0 0 0.976563,0 l 2.677734,-1.47461 a 1.0103471,1.0103471 0 0 0 0.105469,-1.70117 l -0.322266,-0.23438 L 81.193359,108 a 1.0103471,1.0103471 0 0 0 -0.125,-1.73438 l -2.947265,-1.47265 a 1.0103471,1.0103471 0 0 0 -0.488282,-0.10547 z"
     id="path835-8-7"
     style="fill:url(#linearGradient873-2);fill-opacity:1;fill-rule:evenodd;stroke:none;stroke-width:1px;stroke-linecap:butt;stroke-linejoin:miter;stroke-opacity:1"
     inkscape:original="M 77.669922 105.69727 L 75.169922 107.30469 L 76.376953 108.28711 L 75.126953 109.35742 L 77.804688 110.83203 L 80.482422 109.35742 L 79.009766 108.28711 L 80.617188 107.16992 L 77.669922 105.69727 z "
     inkscape:radius="1.010246"
     sodipodi:type="inkscape:offset" />
   <path
     sodipodi:nodetypes="ccccccccccccc"
     style="fill:url(#linearGradient2286-2);fill-opacity:1;fill-rule:evenodd;stroke:none;stroke-width:1.1291151px;stroke-linecap:butt;stroke-linejoin:miter;stroke-opacity:1"
     d="m 77.646381,105.41498 l -1.230559,1.77747 l -1.585613,0.0397 l 1.730297,1.10995 l -1.781019,1.21443 h 1.777474 l 1.23938,1.66721 l 1.274666,-1.66721 h 1.742189 l -1.7194,-1.19004 l 1.869361,-1.28651 l -2.004621,0.0507 z"
     id="path2275-2"
     inkscape:connector-curvature="0" />
  </g>
  <path
    id="rect1728-9"
    d="m 75.431941,137.53444 l -0.849609,0.9082 l 0.837891,0.78321 l 0.849609,-0.91016 z"
    style="opacity:1;vector-effect:none;fill:#847463;fill-opacity:1;stroke:none;stroke-width:0.23116063;stroke-linecap:square;stroke-linejoin:round;stroke-miterlimit:4;stroke-dasharray:none;stroke-dashoffset:0;stroke-opacity:1;paint-order:markers fill stroke"
    inkscape:connector-curvature="0" />
  <path
    id="rect1728-9-7"
    d="m 106.16901,140.55174 l -0.8496,0.9082 l 0.83789,0.78321 l 0.84961,-0.91016 z"
    style="opacity:1;vector-effect:none;fill:#847463;fill-opacity:1;stroke:none;stroke-width:0.23116063;stroke-linecap:square;stroke-linejoin:round;stroke-miterlimit:4;stroke-dasharray:none;stroke-dashoffset:0;stroke-opacity:1;paint-order:markers fill stroke"
    inkscape:connector-curvature="0" />
  <path
    style="fill:url(#linearGradient2541);fill-rule:evenodd;stroke:none;stroke-width:1px;stroke-linecap:butt;stroke-linejoin:miter;stroke-opacity:1;fill-opacity:1"
    d="M 5.1289062 38.111328 L 2.0820312 38.138672 L 3.5625 41.099609 L 5.1289062 38.111328 z "
    transform="translate(71.286819,101.84099)"
    id="path2528" />
  <g
    id="g2961-7"
    transform="rotate(-90,91.286819,121.88039)" />
 </g>
</svg>
