<?xml version="1.0" encoding="UTF-8" standalone="no"?>
<svg
   xmlns:dc="http://purl.org/dc/elements/1.1/"
   xmlns:cc="http://creativecommons.org/ns#"
   xmlns:rdf="http://www.w3.org/1999/02/22-rdf-syntax-ns#"
   xmlns:svg="http://www.w3.org/2000/svg"
   xmlns="http://www.w3.org/2000/svg"
   xmlns:xlink="http://www.w3.org/1999/xlink"
   xmlns:sodipodi="http://sodipodi.sourceforge.net/DTD/sodipodi-0.dtd"
   xmlns:inkscape="http://www.inkscape.org/namespaces/inkscape"
   height="335.5"
   width="203.05"
   version="1.1"
   id="svg43"
   sodipodi:docname="AvatarForeground.svg"
   inkscape:version="0.92.4 (5da689c313, 2019-01-14)">
  <metadata
     id="metadata47">
    <rdf:RDF>
      <cc:Work
         rdf:about="">
        <dc:format>image/svg+xml</dc:format>
        <dc:type
           rdf:resource="http://purl.org/dc/dcmitype/StillImage" />
      </cc:Work>
    </rdf:RDF>
  </metadata>
  <sodipodi:namedview
     pagecolor="#ffffff"
     bordercolor="#666666"
     borderopacity="1"
     objecttolerance="10"
     gridtolerance="10"
     guidetolerance="10"
     inkscape:pageopacity="0"
     inkscape:pageshadow="2"
     inkscape:window-width="1519"
     inkscape:window-height="908"
     id="namedview45"
     showgrid="false"
     inkscape:zoom="1.581197"
     inkscape:cx="139.24613"
     inkscape:cy="147.53627"
     inkscape:window-x="0"
     inkscape:window-y="0"
     inkscape:window-maximized="0"
     inkscape:current-layer="svg43" />
  <g
     transform="translate(3.7,1.5)"
     id="g4">
    <use
       height="335.5"
       transform="translate(-3.7,-1.5)"
       width="203.05"
       xlink:href="#shape0"
       id="use2"
       x="0"
       y="0" />
  </g>
  <defs
     id="defs41">
    <g
       id="shape0"
       transform="translate(3.7,1.5)">
      <path
         d="m 197.85,-1.5 h 1.5 V 324.15 H 199 l -0.35,3.2 H -0.05 l 0.45,-3.2 H -0.7 V 257.8 l 1.5,-8.1 0.45,-2.35 -1.95,-6.7 v -39.95 -3.9 l -2.55,-17.85 -0.45,-2.65 1.6,-5 1.4,-4.25 V 95.3 l 0.6,-0.4 0.25,-0.15 0.85,2.2 0.2,0.9 0.15,-0.9 L 1.2,94.6 1.15,94.2 0.95,92.25 0.9,92.15 0.65,90.65 -0.1,86.05 -0.7,82.75 V -1.5 h 1.5 l 1.55,20.25 v 0.3 L 2.4,19.5 2.5,21.4 2.55,23 2.6,24.5 v 0.1 l 0.15,3.5 0.2,5.15 0.05,1.35 0.1,5.5 v 0.4 q 0,2.4 -0.75,6 Q 1.5,50 1.5,52.45 l 1,9.8 0.6,8.75 -0.35,5.25 -0.05,0.85 -0.4,6.25 0.3,2.7 0.3,1.7 0.5,2.9 0.1,1.6 v 0.1 l -0.2,8 -0.05,1.5 -0.1,4.05 -1.9,-4.55 -0.1,1.2 -0.1,1.9 0.3,5.45 0.1,1.5 0.05,0.55 0.15,3.8 -0.4,7 -0.2,3.95 -0.4,7.45 H 0.7 v 0.05 l -0.1,0.25 -0.2,0.55 -0.05,0.35 -0.05,0.5 1,1.35 q 1.75,2.5 1.75,3.3 0,0.45 -0.6,1.15 -0.65,0.7 -0.65,1.7 v 3.7 q 0,1.4 0.65,4.4 l 0.6,3.35 v 0.55 l -1.1,5.6 -0.5,3.65 -0.1,0.5 -0.1,1.05 q -0.95,7.4 -0.95,12.05 0,6.35 1.75,16.9 l 0.4,2.4 H 2.6 l 0.05,0.45 -0.1,0.15 -1.25,2.9 v 1.6 l 1.05,4.15 0.1,0.35 -0.2,0.2 q -0.8,0.95 -0.8,1.65 0,0.65 0.4,1.2 l 0.3,0.35 0.35,0.5 -1.25,1.25 0.5,1.7 0.8,2.95 0.25,0.75 -0.75,4.55 -0.75,4.45 v 13.75 0.2 l 0.3,1.6 0.5,2.55 0.55,4.95 -0.15,2.05 -1,7 -0.2,1.3 -0.15,1.05 -0.6,4.3 -0.05,0.15 0.8,4.05 0.05,0.2 0.1,0.5 v 12.9 1.7 h 0.2 l 1.65,-4.15 q -0.1,4.75 -1.35,16.1 l -0.2,1.5 -0.45,3.8 v 20.3 l 0.15,0.05 0.75,0.75 0.2,1 -0.1,1.15 h 33.9 11.45 111.6 7.4 6.7 2.5 17.9 3.1 L 197,324 q 0.05,-0.6 0.35,-1 v -4.15 -14.95 -1.4 -59.9 -11.45 -15.1 -5.15 -29.05 -3.95 -9.45 -8.9 V 129.4 127.2 95 89.65 23.1 l -1.65,-6 0.05,-0.7 v -0.5 q 0,-1.4 0.35,-3.7 l 0.45,-3.1 0.15,-1.8 1.15,-8.8 m -15.9,58.75 -0.05,-0.15 q 0,-0.35 0.7,-1.8 l 0.4,-0.95 0.3,-2.1 V 51.4 q -2.4,-6.05 -9.2,-11.3 -5.7,-4.35 -14.5,-8.2 -14.9,-6.45 -33.5,-9.1 l -2.9,-0.35 q -1.6,-0.65 -3,-1.05 -2.6,-0.8 -6.2,-1.25 l 0.55,1 0.2,0.4 -16.4,-0.6 -14.3,0.5 q -10.7,0.7 -20.4,2.5 -6.4,1.2 -12.35,2.9 l -4.1,1.25 q -5.3,1.7 -10.15,3.8 l -1.25,0.6 -0.3,0.15 Q 35.15,32.3 34.8,32.1 l 0.7,-1.6 0.3,-0.95 -0.15,0.15 -1.4,1.4 -3.9,4.1 -4.7,2.75 Q 24,39 22.65,40.1 12.7,47.7 12.2,56.9 v 3.7 9.75 l -0.6,1.2 -1.1,2.4 0.15,3.35 0.05,0.75 0.1,0.8 q 0.35,3.9 1.4,8.55 v 29.75 l 0.4,0.35 0.5,0.75 0.2,0.45 0.25,1.5 -0.25,2.1 -0.05,0.05 -0.35,2.4 v 0.15 l -0.1,0.65 -0.15,1.15 -0.05,0.55 -0.05,0.15 -0.35,2.4 v 3.85 4.95 l -0.5,1.25 -0.25,1.15 0.25,2.7 0.5,2.3 0.15,0.55 0.15,0.6 0.6,2.45 q 0.4,1.9 0.4,3.05 l -0.15,2.3 q -0.3,2.45 -1.15,5.55 l -0.25,0.9 -0.35,0.75 q -0.9,7.05 -0.9,8.25 l 0.15,2.05 q 0.3,2.35 1.35,5.3 l 0.35,0.95 1.75,4.65 -0.1,3.55 -1.05,17.55 -0.95,12.9 v 0.45 q -0.45,0.45 -1,2.3 -0.55,2.05 -0.55,2.9 0,1.15 0.35,1.9 0.35,0.95 1.2,1.35 l 0.9,0.2 q 2.5,0.35 2.5,4.1 l -0.25,1.9 -0.35,2.05 -0.3,1.5 -1.1,5.1 -0.25,1.1 -1,4.85 -0.15,0.7 v 3.9 29.05 l -2.7,9.15 q 0,0.7 0.6,2 l 2.1,3.55 v 0.3 h 0.2 l 0.8,1.15 1.75,2.4 0.75,0.85 0.2,0.2 v 0.05 l -1.45,2.1 -0.45,0.6 -0.45,0.65 H 13.5 l -1.05,1.75 q 0.35,0.8 1.5,1.55 4.9,3.25 23.1,5.8 l 14.15,1.6 47.15,1.9 47.1,-1.9 14.15,-1.6 q 10.85,-1.5 17,-3.3 l 1.45,-3.1 0.15,-0.5 0.4,-3.2 0.05,-2.15 -0.25,-3.7 -0.1,-0.65 -0.25,-1.3 -0.5,-1.8 -0.2,-0.5 -0.25,-0.65 q 5.85,-5.55 6.6,-13.25 0.55,-5.45 0.65,-11.75 v -2.9 q 0,-4.2 -1.95,-16.05 l -1.25,-7.25 -0.35,-1.8 -0.6,-2.85 -0.1,-0.35 v -0.1 h 0.05 l 0.2,-0.15 2,-2.6 0.1,-0.1 0.05,-0.05 0.35,-0.65 1.65,-3.05 V 229 l 0.35,-1.25 q 0,-1.25 -0.35,-2.55 -0.4,-1.55 -1.3,-3.15 l -0.85,-1.65 -0.4,-0.75 -0.35,-1 -0.1,-0.65 q 0,-1.65 1.4,-4.5 l 0.4,-0.9 1.2,-2.65 0.2,-0.65 0.4,-2.25 q 0,-0.85 -0.6,-2.1 l -1.75,-2.85 -1.2,-1.85 -0.45,-0.7 -0.55,-1.25 -0.15,-0.7 q 0,-1.15 2.5,-5 l 1.6,-3 0.5,-1.3 0.05,-0.25 0.15,-0.7 0.15,-1.6 q 0,-2.05 -0.5,-3.85 l -0.35,-1.1 v -0.7 l -0.2,-1.75 -0.6,-5.35 -0.2,-2.1 1,-7.85 0.7,-5.25 1.25,-10.2 0.25,-1.95 0.15,-2.5 -0.4,-2.35 -1.35,-4.65 -0.6,-1.8 -0.4,-1.3 -0.4,-1.2 -0.25,-0.8 -0.05,-0.25 -0.1,-0.35 q 0,-1.5 0.4,-2.45 l 0.8,-2.75 v -1.65 l 0.85,-4.2 0.5,-7.2 v -0.05 -0.2 -2.25 l -0.3,-6.6 -1.05,-7.35 -0.45,-2.15 V 93.45 L 184,93.3 183.85,92.55 183.4,90.65 V 90.6 l -0.2,-0.85 0.1,-0.15 0.15,-0.25 0.65,-1.2 v -0.1 -0.1 l -0.2,-0.5 -0.45,-0.5 -0.15,-0.15 -0.4,-0.45 -0.65,-0.6 -0.1,-0.55 -0.05,-0.15 0.1,-0.1 0.15,-0.25 2.15,-3.05 0.65,-0.9 0.7,-1.1 V 79.3 l -0.1,-0.35 v -0.1 l -0.05,-0.15 -1.2,-3.7 -0.4,-1.2 -0.75,-2.75 -0.2,-0.9 -0.35,-1.6 -0.25,-1.8 -0.05,-0.8 q 0,-0.75 0.6,-1.7 h 0.05 q 0.55,-0.9 0.55,-1.65 V 62.5 62.4 62.35 L 183.65,62.25 183,60.15 182.6,59 v -0.05 l -0.55,-1.45 -0.1,-0.25 m -172.7,58.9 0.15,0.15 v -0.15 -0.05 -0.3 -0.2 l 0.2,-12.5 0.3,-9.65 v -0.6 L 9.85,90.65 9.7,87.45 9.15,81.25 8.9,78.85 8.8,78.05 8.35,72.15 q 0,-0.9 0.55,-2.6 l 0.5,-2.7 q 0,-2.1 -0.7,-4.6 L 8.6,61.9 7.8,58.85 q 0,-0.85 1.55,-4 l 1.9,-3.5 q 2,-6 8.25,-11.25 l 2.75,-2.15 q 3.65,-2.65 8.4,-5.1 l 1.1,-1.05 0.35,-0.35 1,-0.95 2.95,-2.4 1.25,-0.8 -0.2,0.8 -0.25,0.95 -0.3,0.9 v 0.1 l -0.05,0.05 0.1,-0.05 4.9,-1.95 q 10.3,-3.85 22.15,-6.05 9.7,-1.8 20.4,-2.5 l 14.3,-0.45 q 5.85,0 11.45,0.3 l -0.65,-0.45 -0.05,-0.05 11.85,0.5 2.1,0.35 4.2,0.75 -2.35,0.5 h -0.1 l -0.7,0.15 0.75,0.1 q 20.4,2.45 35.55,9 10.45,4.55 16.75,9.85 4.7,4 7.05,8.45 1.1,2.05 1.65,4.15 l 0.15,0.7 -2.5,4.6 q 0,0.7 1.5,4.15 l 0.05,0.1 q 1.4,3.3 1.4,3.8 v 0.05 q 0,0.5 -1,1.65 -0.95,1.1 -0.95,1.8 0,1.05 1.95,6.35 l 1.1,2.95 0.75,2.55 0.15,0.95 -0.25,0.7 -0.95,1.2 -0.6,0.55 -0.2,0.2 q -1.55,1.55 -1.55,1.95 l 0.05,0.2 0.2,0.3 1.3,2.45 v 0.95 l -0.4,-0.2 -0.2,-0.1 -1.15,-0.25 v 1.5 l 0.55,1.65 1.2,3.8 0.9,2.85 0.1,0.3 0.3,0.9 0.1,1.8 0.2,8.6 v 0.5 0.05 0.5 q -0.05,4.6 -0.55,7.55 l -1.05,4.45 v 1.6 l -0.8,1.6 q -0.75,1.65 -0.75,2.4 l 1.55,4.25 q 3.4,9.1 3.4,10.7 0,1.25 -1.65,9.35 l -1.75,7.95 v 24.2 q 1,-0.3 2.45,-1.2 l 0.75,-0.45 3,-1.8 v 0.3 l -5.05,6.55 -0.15,0.2 -1,1.35 q -3.4,4.7 -3.4,5.5 l 1.65,3.35 1.75,3.15 V 204 h 0.15 l 2.6,3.75 -1.55,2.55 -1.7,3.2 -0.5,0.9 q -2.05,3.9 -2.05,4.9 0,0.95 1.3,4.25 l 1.4,3.6 0.35,1.7 v 0.75 l -1.65,3.3 -0.95,1.9 -0.15,0.25 1.7,2.15 0.35,0.35 0.7,0.85 0.75,0.9 0.65,1.35 -1.4,1.8 -0.5,0.5 -0.05,0.1 q -1.8,1.8 -1.8,2.15 l 2.35,7.6 v 46.2 0.35 5.5 0.35 q -0.2,1.5 -1.95,2.85 -1.35,1 -3.7,1.95 l -1.35,0.55 -1.7,0.55 -2.1,0.6 h -0.05 q -6.1,1.65 -15.7,3.05 l -14.25,1.55 -47.3,1.9 L 51,316.3 36.8,314.75 q -18.15,-2.6 -23.9,-6.2 l -0.05,-0.05 -0.4,-0.25 v 0.1 l -1.25,-0.6 -0.65,-0.35 -3.95,-2.1 -0.25,-0.05 q 0.6,-0.45 1.1,-0.75 H 7.5 L 11.25,301.7 11.2,301.65 7.6,298.1 7.5,296.85 7.05,293.9 6.5,290.4 q 0,-1.95 1.8,-7.95 1.2,-4 1.6,-6.55 l 0.2,-2.15 h 0.1 V 250.3 l 0.9,-3.45 0.05,-0.15 1.05,-4.95 0.35,-2.45 0.3,-5.45 q 0,-1.25 -0.65,-2.2 -0.65,-0.9 -1.95,-1.55 H 10.2 q -2.6,-1.25 -2.6,-2.75 l 0.05,-1 q 0.1,-2.35 1.05,-4.9 l 1.5,-4.5 v -16.7 l 0.4,3 q 1.6,-10.4 1.6,-11.8 0,-0.85 -2.45,-6 l -1.3,-2.75 q 0.15,-5.55 0.8,-14.25 0.9,-12.05 0.9,-19 h 0.05 v -0.1 H 10.15 L 9.35,147.7 9.1,147.15 q -1.05,-2.3 -1.05,-2.75 l 0.55,-1.7 0.65,-2 0.2,-0.55 0.75,-2.3 0.6,-1.85 0.1,-0.45 -0.4,-3.35 0.7,-6.2 -0.1,-1.1 v -0.15 l -0.3,-1.15 -1.1,-3.1 -1.3,-3 -0.05,-0.2 v -1.95 l 0.85,0.75 0.05,0.05 m 175.25,179.3 v -3.9 q -0.75,-1.85 -1.45,-1.85 -1.75,0 -2.15,7.15 -0.15,2.15 -0.15,5 v 1.15 1.05 0.85 l 0.15,3.1 1.1,-0.55 q 2.25,-1.25 2.5,-2.6 v -9.4"
         id="path6"
         inkscape:connector-curvature="0"
         style="fill:#645747;fill-rule:evenodd;stroke:none" />
      <path
         d="m 197.85,-1.5 -1.15,8.8 -0.15,1.8 -0.45,3.1 q -0.35,2.3 -0.35,3.7 v 0.5 l -0.05,0.7 1.65,6 v 66.55 l -1.2,1 -1.3,1.4 v 1.2 l -0.15,0.2 -1.5,1.85 -1.05,1.6 q -1.9,3.15 -2.65,6.2 -0.75,2.8 -0.55,5.6 l -0.75,3.55 -0.15,0.5 v -0.5 -0.05 -0.5 l -0.2,-8.6 -0.1,-1.8 -0.3,-0.9 -0.1,-0.3 -0.9,-2.85 -1.2,-3.8 -0.55,-1.65 v -1.5 l 1.15,0.25 0.2,0.1 0.4,0.2 V 89.9 l -1.3,-2.45 -0.2,-0.3 -0.05,-0.2 q 0,-0.4 1.55,-1.95 l 0.2,-0.2 0.6,-0.55 0.95,-1.2 0.25,-0.7 -0.15,-0.95 -0.75,-2.55 -1.1,-2.95 q -1.95,-5.3 -1.95,-6.35 0,-0.7 0.95,-1.8 1,-1.15 1,-1.65 v -0.05 q 0,-0.5 -1.4,-3.8 L 185,62.15 Q 183.5,58.7 183.5,58 l 2.5,-4.6 -0.15,-0.7 q -0.55,-2.1 -1.65,-4.15 -2.35,-4.45 -7.05,-8.45 -6.3,-5.3 -16.75,-9.85 -15.15,-6.55 -35.55,-9 l -0.75,-0.1 0.7,-0.15 h 0.1 l 2.35,-0.5 -4.2,-0.75 -2.1,-0.35 -11.85,-0.5 0.05,0.05 0.65,0.45 q -5.6,-0.3 -11.45,-0.3 l -14.3,0.45 q -10.7,0.7 -20.4,2.5 -11.85,2.2 -22.15,6.05 l -4.9,1.95 -0.1,0.05 0.05,-0.05 v -0.1 l 0.3,-0.9 0.25,-0.95 0.2,-0.8 -1.25,0.8 -2.95,2.4 -1,0.95 -0.35,0.35 -1.1,1.05 q -4.75,2.45 -8.4,5.1 L 19.5,40.1 q -6.25,5.25 -8.25,11.25 l -1.9,3.5 Q 7.8,58 7.8,58.85 l 0.8,3.05 0.1,0.35 q 0.7,2.5 0.7,4.6 l -0.5,2.7 q -0.55,1.7 -0.55,2.6 l 0.45,5.9 0.1,0.8 0.25,2.4 0.55,6.2 0.15,3.2 0.05,2.2 v 0.6 l -0.3,9.65 -0.2,12.5 v 0.2 0.3 0.05 0.15 L 9.25,116.15 9.05,115.8 8.15,114.05 6,109.75 q -0.75,-1.3 -1.65,-3.8 v -0.7 l -1.1,-3.4 0.05,-1.5 0.2,-8 v -0.1 L 3.4,90.65 2.9,87.75 2.6,86.05 2.3,83.35 2.7,77.1 2.75,76.25 3.1,71 2.5,62.25 1.5,52.45 Q 1.5,50 2.35,46.5 3.1,42.9 3.1,40.5 V 40.1 L 3,34.6 2.95,33.25 2.75,28.1 2.6,24.6 V 24.5 L 2.55,23 2.5,21.4 2.4,19.5 2.35,19.05 v -0.3 L 0.8,-1.5 h 197.05 m -0.5,96.5 v 32.2 H 196 q -2.1,0 -3.6,2.5 -1.2,2.05 -1.2,3.9 0,1.6 0.75,6.4 0.7,4.85 0.7,7 0,2.85 -1.05,9 -1.1,6.2 -1.1,9 0,2.55 0.5,3.4 0.75,1.35 3.15,1.35 1.5,0 3.2,-1.3 v 9.45 q -3,3.85 -7.7,7.2 v 0.05 l -0.75,0.45 q -1.45,0.9 -2.45,1.2 v -24.2 l 1.75,-7.95 q 1.65,-8.1 1.65,-9.35 0,-1.6 -3.4,-10.7 l -1.55,-4.25 q 0,-0.75 0.75,-2.4 l 0.8,-1.6 0.1,0.1 0.85,-1.55 0.1,-0.15 1.25,-2.5 q 2.4,-5.25 2.95,-10.3 0.7,-5.7 3.15,-11.2 v -0.9 l 0.25,-0.6 0.25,-0.55 q 0.95,-2.15 2,-3.7 m 0,34.4 v 30.15 q -1.05,1.15 -2.5,1.15 -0.75,0 -1.25,-1.35 -0.45,-1.15 -0.45,-2.2 0,-1.9 0.95,-6.05 0.9,-4.1 0.9,-5.8 0,-1.75 -0.9,-6.15 -0.95,-4.35 -0.95,-6 0,-1.6 0.95,-2.75 1,-1.15 2.5,-1.15 l 0.75,0.15 m 0,52.45 v 29.05 q -3.4,0.95 -6.1,3.55 -3.5,3.4 -3.5,6.4 0,3.65 2.95,8.7 2.95,5.05 2.95,5.9 0,1.95 -0.75,3.25 -1,1.85 -3.15,1.85 -1.2,0 -2.55,-1.25 l -0.75,-0.9 -0.7,-0.85 -0.35,-0.35 -1.7,-2.15 0.15,-0.25 0.95,-1.9 1.65,-3.3 v -0.75 l -0.35,-1.7 -1.4,-3.6 q -1.3,-3.3 -1.3,-4.25 0,-1 2.05,-4.9 l 0.5,-0.9 1.7,-3.2 1.55,-2.55 -2.6,-3.75 h -0.15 v -0.25 l -1.75,-3.15 -1.65,-3.35 q 0,-0.8 3.4,-5.5 l 1,-1.35 0.15,-0.2 q 3.2,-3.55 8.25,-7.3 0.75,-0.6 1.5,-1.05 m 0,34.2 v 15.1 l -1.95,-3.95 q -3.2,-4.9 -3.2,-7.45 0,-1.2 1.7,-2.4 1.5,-1.1 3.45,-1.3 m 0,26.55 v 59.9 l -0.55,-0.05 q -3.4,0 -7.35,4.1 -3.75,3.8 -3.75,6.25 0,1.65 1.25,2.85 l 2.85,2.1 q 3.6,2.7 3.95,7.65 h -17.9 q -0.45,-1.55 -0.45,-3.35 0,-4.15 2.8,-9.35 l 1.25,-2.15 1.35,-0.55 q 2.35,-0.95 3.7,-1.95 1.75,-1.35 1.95,-2.85 v -0.35 -5.5 -0.35 -46.2 l -2.35,-7.6 q 0,-0.35 1.8,-2.15 3.4,3.65 5.9,3.65 3.2,0 5.05,-3.15 l 0.5,-0.95 m 0,61.3 v 14.95 l -1,-0.7 -4.5,-2.7 q -2,-1.6 -2,-3.65 0,-2.55 2.8,-5.25 2.45,-2.3 4.7,-2.65 m -24,21.5 h -6.7 l 0.7,-0.8 q 2.45,-2.55 4,-2.55 2,0 2,2.95 v 0.4 m -14.1,0 H 47.65 q -1.4,-4.15 -4.7,-6.8 -4.6,-3.65 -10.85,-3.65 -4.2,0 -9.8,1.5 -5.55,1.45 -7.8,1.45 -2.75,0 -4.15,-0.85 Q 8.7,316 8.7,313.5 q 0,-3.15 1.85,-6.1 l 0.65,0.35 1.25,0.6 v -0.1 l 0.4,0.25 0.05,0.05 q 5.75,3.6 23.9,6.2 l 14.2,1.55 47.35,1.9 47.3,-1.9 14.25,-1.55 q 9.6,-1.4 15.7,-3.05 l -3,4.1 q -5.55,6.6 -13.35,9.6 m -123.05,0 H 2.3 l 0.1,-1.15 -0.2,-1 -0.75,-0.75 -0.15,-0.05 v -20.3 l 0.45,-3.8 0.2,-1.5 Q 3.2,285.5 3.3,280.75 l -1.65,4.15 h -0.2 v -1.7 q 3,-9.45 3.05,-21.3 0.35,-7.95 5.4,-17.9 1.25,-2.4 2.65,-4.7 l -0.35,2.45 -1.05,4.95 -0.05,0.15 -0.9,3.45 v 23.45 h -0.1 l -0.2,2.15 q -0.4,2.55 -1.6,6.55 -1.8,6 -1.8,7.95 l 0.55,3.5 0.45,2.95 0.1,1.25 3.6,3.55 0.05,0.05 -3.75,2.8 H 7.45 q -0.5,0.3 -1.1,0.75 l 0.25,0.05 q -4.15,4.25 -4.15,9.15 0,2.8 1.55,4.45 1.6,1.6 4.1,1.6 2.5,0 7.35,-1.8 4.8,-1.85 9.65,-1.85 4.6,0 7.6,1.8 3.5,2.1 3.5,6.15 v 0.6 m -35.05,-64.3 0.15,-1.05 0.2,-1.3 1,-7 0.15,-2.05 -0.55,-4.95 1.15,-3.35 q 3.2,-8.4 5.8,-8.4 2,0 2,2.75 0,1.7 -1.4,4.5 L 7.7,243.9 q -0.75,1.85 -2.95,8.5 -1.35,4 -3.6,8.7 M 1.3,240.4 v -13.75 l 0.75,-4.45 0.75,-4.55 -0.25,-0.75 -0.8,-2.95 -0.5,-1.7 1.25,-1.25 -0.35,-0.5 -0.3,-0.35 q -0.4,-0.55 -0.4,-1.2 0,-0.7 0.8,-1.65 l 0.2,-0.2 -0.1,-0.35 L 1.3,202.6 V 201 l 1.25,-2.9 0.1,-0.15 L 2.6,197.5 H 2.45 l -0.4,-2.4 Q 0.3,184.55 0.3,178.2 q 0,-4.65 0.95,-12.05 l 0.1,-1.05 0.1,-0.5 0.5,-3.65 1.1,-5.6 v -0.55 l -0.6,-3.35 q -0.65,-3 -0.65,-4.4 v -3.7 q 0,-1 0.65,-1.7 0.6,-0.7 0.6,-1.15 0,-0.8 -1.75,-3.3 l -1,-1.35 0.05,-0.5 q 1.4,2.75 4.35,6.75 2.35,3.15 4.4,5.05 l 0.25,0.55 0.8,1.65 h 0.05 v 0.1 h -0.05 q 0,6.95 -0.9,19 -0.65,8.7 -0.8,14.25 l 1.3,2.75 q 2.45,5.15 2.45,6 0,1.4 -1.6,11.8 l -0.4,-3 v 16.7 l -1.5,4.5 q -0.95,2.55 -1.05,4.9 l -1.95,4.1 q -3,6.1 -4.4,9.95 m -0.25,-113.7 0.2,-3.95 0.4,-7 -0.15,-3.8 -0.05,-0.55 -0.1,-1.5 -0.3,-5.45 0.1,-1.9 3.2,7.85 v 0.5 l 0.3,0.7 q 2.95,6.4 6.15,12 l 0.3,1.15 v 0.15 l 0.1,1.1 -0.7,6.2 0.4,3.35 -0.1,0.45 -0.6,1.85 -0.75,2.3 -0.2,0.55 -0.65,2 Q 6.9,140.4 5.2,137.3 2.15,131.75 1.05,126.7 m 188.8,-111.2 0.95,-0.15 0.35,-0.2 -1.3,0.35 M 29.75,30 29.4,30.25 30.25,29.8 29.75,30 m 1.8,-0.85 h -0.1 l -0.05,0.05 0.15,-0.05"
         id="path8"
         inkscape:connector-curvature="0"
         style="fill:#3d332a;fill-rule:evenodd;stroke:none" />
      <path
         d="m -0.7,82.75 0.6,3.3 0.75,4.6 0.25,1.5 0.05,0.1 0.2,1.95 0.05,0.4 0.15,2.35 L 1.2,97.85 1,96.95 0.3,92.25 0,90.65 -0.7,86.6 v -3.85 m -2.55,96.2 2.55,17.85 v 3.9 q -1.9,-14.3 -3,-20.5 l 0.45,-1.25 m 2.55,61.7 1.95,6.7 -0.45,2.35 -1.5,-5.15 v -3.9 m 0,83.5 h 1.1 l -0.45,3.2 h 198.7 l 0.35,-3.2 h 0.35 V 328 H 199 l -0.35,3.2 H -0.05 L 0.1,330.5 0.3,328.95 0.4,328 h -1.1 v -3.85 M 189.85,15.5 l 1.3,-0.35 -0.35,0.2 -0.95,0.15 m -6.7,48.75 -0.7,-2 -0.55,-1.45 0.05,-0.25 V 60.5 l -0.05,-0.25 -0.05,-0.45 0.1,-1.95 v -0.6 l 0.1,0.25 0.55,1.45 V 59 l 0.4,1.15 0.65,2.1 0.05,0.1 v 0.05 0.1 0.1 q 0,0.75 -0.55,1.65 M 183,54.35 q -3.45,-7.8 -14.55,-14.25 -3.95,-2.3 -8.85,-4.4 -14.9,-6.5 -33.5,-9.1 l -2.9,-0.4 q -1.6,-0.7 -3,-1.05 -2.25,-0.75 -5.35,-1.15 l -0.15,1.2 0.05,0.1 h -0.15 -0.1 -0.05 l -16.1,-0.6 -14.3,0.5 q -10.7,0.7 -20.4,2.5 l -2,0.4 q -5.35,1.1 -10.35,2.5 -7.55,2.15 -14.25,5.1 l -1.25,0.5 -0.3,0.15 -0.7,-0.5 0.1,-1.65 -0.65,0.6 -3.9,4.1 -2.1,1.2 -2.6,1.6 Q 12.75,50.05 12.2,60.6 v -3.7 q 0.5,-9.2 10.45,-16.8 1.35,-1.1 3,-2.15 l 4.7,-2.75 3.9,-4.1 1.4,-1.4 0.15,-0.15 -0.3,0.95 -0.7,1.6 q 0.35,0.2 0.7,0.55 l 0.3,-0.15 1.25,-0.6 Q 41.9,29.8 47.2,28.1 l 4.1,-1.25 q 5.95,-1.7 12.35,-2.9 9.7,-1.8 20.4,-2.5 l 14.3,-0.5 16.4,0.6 -0.2,-0.4 -0.55,-1 q 3.6,0.45 6.2,1.25 1.4,0.4 3,1.05 l 2.9,0.35 q 18.6,2.65 33.5,9.1 8.8,3.85 14.5,8.2 6.8,5.25 9.2,11.3 v 0.85 l -0.3,2.1 m -170.8,16 v 3.7 l -0.6,1.25 -0.95,2 -0.15,-3.35 1.1,-2.4 0.6,-1.2 m 1.1,48.35 q 0.6,1.45 0.6,3 v 0.35 0.2 l -0.05,0.5 -0.3,0.9 v 0.25 l -0.1,0.85 v 0.15 l -0.4,2.5 -0.5,3.9 -0.35,2.35 v -3.85 l 0.35,-2.4 0.05,-0.15 0.05,-0.55 0.15,-1.15 0.1,-0.65 v -0.15 l 0.35,-2.4 0.05,-0.05 0.25,-2.1 -0.25,-1.5 m -1.1,19.9 v 3.9 l -0.5,1.2 -0.25,-2.7 0.25,-1.15 0.5,-1.25 m 1.15,16.35 0.15,1.6 q 0,3.2 -1.3,7.85 l -0.25,0.85 -0.35,0.8 -0.75,6.4 -0.15,-2.05 q 0,-1.2 0.9,-8.25 l 0.35,-0.75 0.25,-0.9 q 0.85,-3.1 1.15,-5.55 m 0.85,31.95 0.1,0.3 q 0,6.7 -2.1,34.05 v 0.45 q -0.45,0.4 -1,2.3 l -0.2,0.9 q -0.35,-0.75 -0.35,-1.9 0,-0.85 0.55,-2.9 0.55,-1.85 1,-2.3 v -0.45 l 0.95,-12.9 1.05,-17.55 m 1.4,43.65 0.25,2.1 -0.25,2.05 v 0.05 l -2.25,11.35 -1,4.85 -0.15,0.7 v -3.9 l 0.15,-0.7 1,-4.85 0.25,-1.1 1.1,-5.1 0.3,-1.5 0.35,-2.05 0.25,-1.9 m -3.4,50.15 v 3.9 l -2.1,7.25 q -0.6,-1.3 -0.6,-2 l 2.7,-9.15 m 3.5,19.4 h 0.1 l 0.1,0.1 v 0.1 l -0.2,-0.2 m 0.2,0.25 -0.1,1.5 -0.15,2.9 -0.1,-0.05 -1.6,2.3 q -1.15,-0.75 -1.5,-1.55 l 1.05,-1.75 h 0.05 l 0.45,-0.65 0.45,-0.6 1.45,-2.1 m 162.7,2.35 q -0.2,-3.05 -1.05,-5.7 l -0.05,-0.15 -0.25,-0.75 0.1,-0.65 0.05,-2.35 -0.05,-0.5 0.2,0.5 0.5,1.8 0.25,1.3 0.1,0.65 0.25,3.7 -0.05,2.15 m 5.75,-35.75 q -0.2,-4.45 -1.95,-15.1 -1.6,-9.65 -2.2,-12.1 h -0.05 l -0.15,-0.65 0.1,-3.35 0.1,0.35 0.6,2.85 0.35,1.8 1.25,7.25 q 1.95,11.85 1.95,16.05 v 2.9 m -4.2,-31.3 0.2,-0.2 v 0.05 l -0.2,0.15 m 4.35,-6.6 q -0.4,-1.55 -1.3,-3.1 -1.7,-3 -1.7,-4.1 l 0.05,-0.5 -0.05,-0.9 0.1,-1.8 0.35,1 0.4,0.75 0.85,1.65 q 0.9,1.6 1.3,3.15 0.35,1.3 0.35,2.55 L 184.5,229 v 0.05 m 0.2,-19.75 -0.2,-0.45 -1.75,-2.9 q -2.35,-3.25 -2.35,-4.5 l 0.3,-1.1 -0.15,-2.05 0.55,1.25 0.45,0.7 1.2,1.85 1.75,2.85 q 0.6,1.25 0.6,2.1 l -0.4,2.25 m 0.5,-21.95 -0.35,-1.6 -0.35,-1.05 v -0.75 l -0.2,-1.7 -0.8,-7.5 0.2,-1.75 0.6,5.35 0.2,1.75 v 0.7 l 0.35,1.1 q 0.5,1.8 0.5,3.85 l -0.15,1.6 m 1.5,-41.7 -0.25,-1 -1.35,-4.65 -0.6,-1.8 -1.2,-3.85 0.1,-1.35 v -0.3 l 0.05,-1.65 0.25,0.8 0.4,1.2 0.4,1.3 0.6,1.8 1.35,4.65 0.4,2.35 -0.15,2.5 m -0.85,-33.7 q -0.1,-4.25 -0.7,-8.85 L 184.5,99.5 184,97 183.2,93.5 183.25,93.45 183,92.2 182.9,90.7 v -0.05 l 0.05,-0.5 -0.05,-0.05 -0.65,-0.65 -0.15,-0.65 0.05,-0.1 -0.05,-0.35 -0.05,-0.5 -0.05,-0.4 V 87.2 l 0.15,-2 0.1,0.55 0.65,0.6 0.4,0.45 0.15,0.15 0.45,0.5 0.2,0.5 v 0.1 0.1 l -0.65,1.2 -0.15,0.25 -0.1,0.15 0.2,0.85 v 0.05 l 0.45,1.9 0.15,0.75 0.05,0.15 v 0.15 l 0.45,2.15 1.05,7.35 0.3,6.6 v 2.25 m -0.7,-31.2 -0.6,-1.9 -0.05,-0.15 -0.4,-1.2 q -1.2,-4.05 -1.5,-6.45 -0.35,-1.55 -0.35,-2.15 0,-1.15 0.3,-2.15 l 0.25,1.8 0.35,1.6 v 0.1 l 0.2,0.8 0.75,2.75 0.4,1.2 1.2,3.7 0.05,0.15 v 0.1 l 0.1,0.35 v 0.35 l -0.7,1.1 m -0.65,214.7 q -0.75,-1.85 -1.45,-1.85 -1.2,0 -1.75,3.25 -0.45,2.3 -0.55,6.15 v -1.15 q 0,-2.85 0.15,-5 0.4,-7.15 2.15,-7.15 0.7,0 1.45,1.85 v 3.9 M 31.55,29.15 31.4,29.2 31.45,29.15 h 0.1 M 29.75,30 30.25,29.8 29.4,30.25 29.75,30 M 1.3,133.25 l -0.1,-0.2 0.15,0.05 -0.05,0.15"
         id="path10"
         inkscape:connector-curvature="0"
         style="fill:#2e261f;fill-rule:evenodd;stroke:none" />
      <path
         d="M 197.35,89.65 V 95 q -1.05,1.55 -2,3.7 l -0.25,0.55 -0.25,0.6 v 0.9 q -2.45,5.5 -3.15,11.2 -0.55,5.05 -2.95,10.3 l -1.25,2.5 -0.1,0.15 -0.85,1.55 -0.1,-0.1 v -1.6 l 1.05,-4.45 q 0.5,-2.95 0.55,-7.55 l 0.15,-0.5 0.75,-3.55 q -0.2,-2.8 0.55,-5.6 0.75,-3.05 2.65,-6.2 l 1.05,-1.6 1.5,-1.85 0.15,-0.2 v -1.2 l 1.3,-1.4 1.2,-1 m 0,37.55 v 2.2 l -0.75,-0.15 q -1.5,0 -2.5,1.15 -0.95,1.15 -0.95,2.75 0,1.65 0.95,6 0.9,4.4 0.9,6.15 0,1.7 -0.9,5.8 -0.95,4.15 -0.95,6.05 0,1.05 0.45,2.2 0.5,1.35 1.25,1.35 1.45,0 2.5,-1.15 v 8.9 q -1.7,1.3 -3.2,1.3 -2.4,0 -3.15,-1.35 -0.5,-0.85 -0.5,-3.4 0,-2.8 1.1,-9 1.05,-6.15 1.05,-9 0,-2.15 -0.7,-7 -0.75,-4.8 -0.75,-6.4 0,-1.85 1.2,-3.9 1.5,-2.5 3.6,-2.5 h 1.35 m 0,50.7 v 3.95 q -0.75,0.45 -1.5,1.05 -5.05,3.75 -8.25,7.3 l 5.05,-6.55 v -0.3 l -3,1.8 v -0.05 q 4.7,-3.35 7.7,-7.2 m 0,33 v 5.15 q -1.95,0.2 -3.45,1.3 -1.7,1.2 -1.7,2.4 0,2.55 3.2,7.45 l 1.95,3.95 v 11.45 l -0.5,0.95 q -1.85,3.15 -5.05,3.15 -2.5,0 -5.9,-3.65 l 0.05,-0.1 0.5,-0.5 1.4,-1.8 -0.65,-1.35 q 1.35,1.25 2.55,1.25 2.15,0 3.15,-1.85 0.75,-1.3 0.75,-3.25 0,-0.85 -2.95,-5.9 -2.95,-5.05 -2.95,-8.7 0,-3 3.5,-6.4 2.7,-2.6 6.1,-3.55 m 0,91.6 v 1.4 q -2.25,0.35 -4.7,2.65 -2.8,2.7 -2.8,5.25 0,2.05 2,3.65 l 4.5,2.7 1,0.7 V 323 q -0.3,0.4 -0.35,1 l -0.15,1.4 h -3.1 q -0.35,-4.95 -3.95,-7.65 l -2.85,-2.1 q -1.25,-1.2 -1.25,-2.85 0,-2.45 3.75,-6.25 3.95,-4.1 7.35,-4.1 l 0.55,0.05 m -21.5,22.9 h -2.5 V 325 q 0,-2.95 -2,-2.95 -1.55,0 -4,2.55 l -0.7,0.8 h -7.4 q 7.8,-3 13.35,-9.6 l 3,-4.1 h 0.05 l 2.1,-0.6 1.7,-0.55 -1.25,2.15 q -2.8,5.2 -2.8,9.35 0,1.8 0.45,3.35 m -128.2,0 H 36.2 v -0.6 q 0,-4.05 -3.5,-6.15 -3,-1.8 -7.6,-1.8 -4.85,0 -9.65,1.85 -4.85,1.8 -7.35,1.8 -2.5,0 -4.1,-1.6 -1.55,-1.65 -1.55,-4.45 0,-4.9 4.15,-9.15 l 3.95,2.1 q -1.85,2.95 -1.85,6.1 0,2.5 1.65,3.55 1.4,0.85 4.15,0.85 2.25,0 7.8,-1.45 5.6,-1.5 9.8,-1.5 6.25,0 10.85,3.65 3.3,2.65 4.7,6.8 M 1.45,283.2 v -12.9 l -0.1,-0.5 -0.05,-0.2 -0.8,-4.05 0.05,-0.15 0.6,-4.3 q 2.25,-4.7 3.6,-8.7 2.2,-6.65 2.95,-8.5 l 1.95,-3.65 q 1.4,-2.8 1.4,-4.5 0,-2.75 -2,-2.75 -2.6,0 -5.8,8.4 L 2.1,244.75 1.6,242.2 1.3,240.6 v -0.2 q 1.4,-3.85 4.4,-9.95 l 1.95,-4.1 -0.05,1 q 0,1.5 2.6,2.75 h 0.05 q 1.3,0.65 1.95,1.55 0.65,0.95 0.65,2.2 l -0.3,5.45 q -1.4,2.3 -2.65,4.7 -5.05,9.95 -5.4,17.9 -0.05,11.85 -3.05,21.3 M 0.35,135.35 0.4,135 0.6,134.45 0.7,134.2 v -0.05 H 0.65 l 0.4,-7.45 q 1.1,5.05 4.15,10.6 1.7,3.1 3.4,5.4 l -0.55,1.7 q 0,0.45 1.05,2.75 -2.05,-1.9 -4.4,-5.05 -2.95,-4 -4.35,-6.75 m 0.8,-32.8 0.1,-1.2 1.9,4.55 0.1,-4.05 1.1,3.4 v 0.7 q 0.9,2.5 1.65,3.8 l 2.15,4.3 0.9,1.75 0.2,0.35 -0.05,-0.05 -0.85,-0.75 v 1.95 l 0.05,0.2 1.3,3 1.1,3.1 Q 7.6,118 4.65,111.6 l -0.3,-0.7 v -0.5 l -3.2,-7.85 m 0.15,30.7 0.05,-0.15 -0.15,-0.05 0.1,0.2"
         id="path12"
         inkscape:connector-curvature="0"
         style="fill:#4d4236;fill-rule:evenodd;stroke:none" />
      <path
         d="m 187.8,263.1 q 2.15,-0.4 3.75,1.6 1.8,1.3 2.45,3.45 -0.1,1.7 -1.15,3.6 -0.4,1.2 -1.9,2.65 l -1,1.1 q -3.85,3.4 -4.05,4.1 l -0.05,0.05 0.05,0.4 q -3.1,2.25 -4.55,4.6 l -0.5,-0.55 -0.25,0.45 h -0.45 q 0.05,-0.55 0.4,-1.15 l -0.1,-0.55 q 0,-0.65 0.35,-1.25 -1.3,1.55 -1.3,3.8 l 0.6,0.9 q 0.6,0.5 0.6,0.95 0,0.4 -0.55,1.05 l -1.15,0.75 q -2.1,0 -2.6,-2.55 l -0.05,-2.95 0.3,-0.5 0.2,-0.35 0.6,-0.95 0.9,-1.7 0.25,-0.2 2.65,-2 0.45,-0.35 1.05,-0.8 1.95,-1.55 q 1,-0.4 2.25,-0.85 l 1.05,-0.65 0.7,-1.75 0.2,-0.35 0.15,-0.1 q 0.1,-0.55 0.95,-1.4 l 0.65,-0.55 q 0.6,-1.2 0.6,-2.3 0,-0.3 -0.75,-0.7 -0.95,-0.45 -2.3,-0.45 -0.15,0 -0.55,0.25 -0.3,0.15 -0.4,0.35 l 0.1,0.45 0.25,0.05 1.15,-0.2 q 0.8,0 1.2,0.4 l 0.3,0.55 v 0.1 l 0.1,0.05 -0.2,0.25 -1.05,1.1 -1,0.6 -0.55,0.2 -0.15,0.05 -0.6,0.05 h -0.05 -0.2 l -0.6,-0.35 -0.75,-0.9 q -0.7,-1.15 -0.7,-1.95 0.05,-1.2 0.55,-2.3 0.55,-1.15 1.4,-1.7 h 1.35 m -51.6,54.95 0.25,0.4 h -0.35 l 0.1,-0.4"
         id="path14"
         inkscape:connector-curvature="0"
         style="fill:#000000;fill-opacity:0.51372549;fill-rule:evenodd;stroke:none" />
      <path
         d="m 180.5,308 q 0.9,-0.25 1.85,0.6 l 0.8,2.4 q 0.2,1 1.15,2.95 l 0.35,0.7 1.15,-0.9 0.5,-0.45 q 0.5,-0.45 1.05,-0.75 l 1.2,-0.5 1.5,-0.25 q 2,0 2.5,1.05 0.3,0.55 0.15,1.15 0,1.3 -0.85,2.45 -1.35,1.9 -4.3,1.9 l -1.35,-0.25 -1.35,-0.3 -0.2,0.05 q -0.65,0.2 -1.95,1.45 l -0.45,0.5 q -2,1.9 -5.35,5.8 l -1.4,1.6 -2.05,2.05 q -0.7,0.35 -1.35,0.8 l -0.9,0.15 h -16.9 q 8.25,-0.6 12.3,-2.35 l 3.8,-1.4 0.15,-0.1 3.55,-3.3 1.5,-1.3 q 0.15,-0.65 1.2,-1.6 0.95,-0.9 1.8,-0.9 l 2.15,-1.6 v 0.15 l 1.75,-1.55 -0.4,-0.8 -0.1,-0.15 q -0.75,-0.85 -1.35,-2.3 -1,-2.45 -1,-4 0,-0.8 0.85,-1 m -51.55,21.15 -0.05,0.05 0.05,0.05 v -0.1 m -1.45,-13.5 3.1,0.2 v 0.5 q 0,1.5 1.05,3.65 l 0.25,0.5 0.3,0.75 q 0.5,1.35 0.5,2.45 0,2.1 -1.25,3.65 l -0.8,0.85 0.55,0.65 q 1.15,0.1 2.5,0.85 l 0.2,0.1 2,-0.25 5.05,0.65 H 115.9 q -3.1,-0.95 -4.7,-1.75 l -2.8,-0.7 -2.45,-0.95 -1.8,-0.85 -0.7,0.1 q -3.05,-1.75 -6.95,-3.5 l -0.3,0.2 -0.75,0.2 -1.35,-0.55 -0.2,0.1 -3.1,-1 -0.05,0.1 -0.3,0.1 -5.3,-0.85 -3.2,-0.45 -3.95,-0.5 q -3.35,0 -9.5,1.35 l -5.45,1.3 -0.45,-0.1 -0.8,0.25 0.05,0.4 0.3,1.35 0.05,0.1 1.4,2.7 0.85,1.7 0.95,1.25 h -2.05 l -0.75,-1.15 -1.35,-2.55 -0.75,-1.3 q -0.75,-1.15 -1.55,-1.55 l -0.15,-0.05 -0.55,0.15 -0.15,0.35 -1.05,0.2 q -2.4,1.55 -10.75,3.75 l -1.1,0.4 -0.75,0.35 -2.35,1.4 h -8.05 l 2.9,-1.5 q 2.15,-1.05 12.55,-5.4 l 6.35,-2.6 v -0.1 q 0,-1 2.25,-2.3 2.35,-1.35 4.6,-1.35 l 0.6,0.2 0.55,0.2 1.8,-0.1 2.8,-0.8 5.2,-0.85 q 3.5,-1.6 14.85,1.3 l 6,1.8 0.05,-0.15 -8.3,-5.8 -0.9,-1.05 h 2.45 q 1.2,1.3 3.2,2.6 5.05,3.25 5.05,4 l -0.1,0.9 3.85,1.6 1.9,0.95 5.15,1.85 1.95,0.7 10.05,2.95 0.35,0.05 q 4.45,0 7.3,-1.7 2,-1.25 2.55,-2.7 l 0.05,-0.25 0.15,-1.35 -0.2,-0.35 q -0.95,-1.9 -1.2,-3.65 l -0.35,-1.65 M 74.15,326 h -1.5 l -0.25,0.6 0.2,0.1 0.9,0.35 0.15,0.05 q 0.5,0.1 0.95,0.9 l -0.75,0.85 -0.1,0.05 -1.1,0.3 q -1.65,0 -2.05,-1.05 l -0.05,-1.35 q 0,-0.9 0.5,-1.65 l 0.2,-0.2 q 0.8,-1 2.35,-1 2.2,0 3.25,2.1 0.55,1.05 0.65,2.2 l -0.1,1.25 -0.2,0.7 H 75 q 0.5,-0.95 0.5,-1.95 l -0.45,-1.2 q -0.5,-0.9 -0.9,-1.05 m 114,-10.8 -1.2,0.8 -0.15,0.25 1.2,-0.1 1.55,-1.7 -1.4,0.75 M 20.1,301.55 q -7.4,4.95 -10.25,10.5 l 1,-0.15 0.15,0.2 0.1,0.5 -0.85,3.3 q -0.9,3.35 -0.9,3.8 l 0.2,2 0.75,1.85 q 0.9,2.1 1.65,3.1 l 0.15,0.15 q 1.8,2.15 4.6,3.4 H 11.45 Q 9.85,328.8 8.7,327 L 8.35,326.45 Q 7.4,324.8 6.9,323 L 6.6,321.65 6.35,319 q 0,-4.5 2.7,-9 l 0.55,-0.9 q 3.75,-5.65 10.25,-8.25 l 0.25,0.7"
         id="path16"
         inkscape:connector-curvature="0"
         style="fill:#000000;fill-opacity:0.41176471;fill-rule:evenodd;stroke:none" />
      <path
         d="m 137.75,310.4 h -0.1 l -0.4,-0.05 -0.2,-0.2 v -0.2 l 0.3,-0.55 0.6,-1.4 q 0,-1.1 -1.3,-1.9 -0.3,-0.2 -0.55,-0.25 l 4.6,-1.8 q -0.3,0.7 -2,1.6 l 2.6,-0.65 q 0.75,0 0.75,0.7 l -0.7,0.7 -2.05,0.6 1.4,1.05 0.7,0.55 1.2,0.2 0.1,0.3 -0.7,0.25 -0.35,-0.1 q -0.05,0.55 -0.75,0.55 -0.75,0 -1.55,-0.4 l -1.1,-0.7 v 1.45 q -0.1,0.25 -0.5,0.25 m 5.4,-4.4 0.1,0.1 -0.05,0.05 -0.05,-0.15 m 0.3,6.5 q 1.45,1.35 2.45,2 l -0.05,0.1 -2.2,-1.15 -0.2,-0.95 m -4.1,2.45 -0.35,0.75 -0.3,-1.55 0.65,0.8 m -49.6,-3.65 0.65,0.45 0.1,0.1 0.35,0.3 1.05,0.9 q 1.5,0.9 3.35,1.8 1.05,0.45 1.05,0.7 l -0.1,0.45 -0.45,0.1 -1.35,-0.15 q -1.1,-0.25 -2.35,-0.9 L 92,315 h -0.05 l -0.05,-0.05 -2.15,-1.3 v 0.95 l 0.1,1.3 q 0.1,1.5 -0.5,2.4 -0.3,-0.4 -0.35,-1.4 v -1.35 l -0.05,-0.1 v 0.1 q -0.5,1.05 -0.7,2.8 l -0.35,3.3 -0.35,0.15 q -0.4,-0.45 -0.4,-1.1 0,-1.45 0.4,-3.4 l 0.85,-3.3 -0.05,-0.1 -0.05,0.05 -1.1,1.05 -1.2,0.95 -0.5,-0.2 2.05,-2.25 0.15,-0.1 0.7,-0.7 -0.9,0.5 -0.3,0.15 -0.75,0.35 -2.8,1.1 -1.25,0.45 -1.15,0.3 h -0.2 L 81,315.2 q 0,-0.4 2.15,-1.35 l 1.95,-0.8 0.5,-0.2 0.55,-0.25 0.1,-0.05 -1.75,-0.2 -1.2,-0.3 -0.6,-0.2 -1.2,-0.45 -0.65,-0.3 v -0.45 l 2.15,0.4 0.45,0.1 1.55,0.3 0.45,-0.05 0.9,-0.1 0.35,-0.05 1.3,-0.15 0.4,-0.45 0.05,0.1 h 0.05 v 0.3 h 0.1 L 88.85,311 H 89 l 0.45,0.15 0.3,0.15"
         id="path18"
         inkscape:connector-curvature="0"
         style="fill:#5d6b4a;fill-rule:evenodd;stroke:none" />
      <path
         d="m 137.75,310.4 q 0.4,0 0.5,-0.25 v -1.45 l 1.1,0.7 q 0.8,0.4 1.55,0.4 0.7,0 0.75,-0.55 l 0.35,0.1 0.7,-0.25 -0.1,-0.3 -1.2,-0.2 -0.7,-0.55 -1.4,-1.05 2.05,-0.6 1.8,-0.4 0.05,0.15 -1.55,0.65 -1.85,0.6 0.8,0.5 2,0.65 0.25,0.05 4.25,0.2 0.05,0.1 -3.25,0.95 -2.5,0.1 q 0.15,0.8 2.05,2.55 l 0.2,0.95 q -2.55,-1.5 -4.25,-3.3 v 1.4 q 0.4,0.8 0.4,1.45 l -0.35,1.65 -0.1,0.3 -0.65,-0.8 -0.45,-2 -0.5,-1.75 M 55.6,307.8 h 0.2 l 0.35,4.5 q 0.35,2.5 1.15,3.25 l -2.65,0.1 1.75,1.6 q -0.75,-0.2 -0.95,0.2 l -0.05,0.6 q 0,1.55 2.6,7.3 -1.85,-0.95 -2.95,-4.55 l 0.35,3.75 -0.8,-1.45 -0.35,-1.3 v 1.65 l 0.2,4.65 q -0.2,2.35 -2.4,5.9 l 1,-2.8 q 0.8,-2.15 0.8,-3.3 0,-1.45 -0.4,-3.45 L 52.85,321 q 0.05,1.9 -0.95,4.85 -0.9,2.7 -2,4.2 l 0.8,-1.85 0.2,-1.7 -0.4,-3.35 0.2,-1.05 0.4,-0.85 v -0.05 h -0.2 l -4.7,6.6 -0.05,-0.1 2,-4.25 q 1.1,-2.1 3.5,-4 l -7.65,4.7 q 1.25,-1.55 3.6,-3.3 2.3,-1.7 4.15,-2.55 l 0.1,-0.05 H 51.7 q -1.9,1.15 -5.2,2.3 -3.5,1.2 -6,1.45 l -0.05,-0.2 q 3.6,-0.5 6.95,-2.7 l 1.6,-1.15 0.1,-0.1 h -0.2 l -1.6,0.95 -1.75,0.8 h -4.3 l 5.9,-3.2 q 3.3,-1.45 5.65,-1.15 l 0.05,0.05 h 0.2 l -0.25,-0.05 -3.6,-3.05 0.1,-0.05 q 0.75,0.2 3.3,1.3 l 3.2,1.25 q -0.4,-1.6 -0.4,-3.6 l 0.2,-3.3 m 0.8,-31.9 1.45,0.15 v 0.1 l -0.05,0.1 -1.8,0.35 -1.55,0.4 v 0.2 l 2.75,0.75 2.4,0.65 h -2.3 l -2.05,-0.1 H 55.2 l 0.05,0.1 -0.1,0.1 1.2,1.2 -0.1,0.1 q -0.4,-0.3 -1.65,-0.75 l -1.7,-0.45 q 0.55,1.15 0.55,1.75 h -0.2 q -0.5,-1.5 -1.15,-2.35 l 0.55,-0.65 -0.05,-0.5 -0.2,-0.55 q 0.1,-0.1 0.15,-0.1 l 0.55,0.45 0.05,-0.1 -0.25,-0.55 0.05,-0.1 0.1,-0.05 0.15,0.1 -0.4,-0.75 -0.05,-0.05 h 0.05 l -0.1,-0.3 0.6,-0.05 q 0.3,-0.25 0.9,-0.6 l 1.5,-0.85 0.05,0.1 -0.9,0.95 -0.6,0.5 0.75,-0.25 2.15,-0.5 0.05,0.1 q 0,0.2 -2.1,1.1 l -0.05,0.05 h 0.05 l 1.3,0.3 m 128.25,-4.25 0.05,0.1 -0.25,0.3 0.75,0.9 -1.05,0.1 q -0.6,0.25 -0.65,0.25 l 1.1,0.35 0.05,0.05 -0.75,0.15 2.85,0.6 v 0.2 l -0.9,0.15 -1.65,-0.45 q -1.3,-0.5 -1.8,-0.5 H 182 l 1.9,0.6 q -1.35,0.35 -3.35,1.15 l -1.6,0.6 1,-0.75 1.3,-1.4 -5.45,1.1 q 0.6,-0.9 2.4,-1.45 l 2.3,-0.6 -1.55,-3.4 v -0.95 h 0.2 q -0.05,0.85 0.9,1.8 l 1.4,1.25 -0.8,-1.15 2,0.75 2,0.25 m 8.25,0.4 1.5,1.4 q -3.55,-1.6 -4.25,-2.25 0,1.35 -0.55,2.1 l -0.2,-2.65 -1.05,0.6 -1.2,0.7 -0.05,-0.15 q 0.3,-0.35 0.8,-0.55 l 0.9,-0.6 q -0.1,-0.15 0.85,-0.55 1.05,-0.35 0.7,-1.15 0.45,0.4 4.35,1.5 l -2.1,0.2 -1.3,-0.2 q 0.25,0.65 1.6,1.6 m -108.4,35.15 0.7,0.6 -0.65,-1.15 q -0.3,-0.4 -0.3,-0.8 l 0.15,-0.05 0.9,1.4 h 0.3 q -0.4,-1.6 -0.4,-3 0,-2 1.2,-6.45 -0.15,1.65 0.4,4.55 l 0.95,4.3 q -0.15,-2.3 4.15,-5.3 -1.35,2.05 -1.85,3.75 -0.5,1.55 -0.5,3.7 l 0.05,1.85 0.15,0.7 -0.3,-0.15 -1.7,-2.15 0.7,1.75 -0.05,-0.1 -0.4,0.45 -1.3,0.15 -0.35,0.05 -0.9,0.1 -0.3,-0.2 -2.1,-1.85 0.1,-0.15 q 1.6,0.85 2.45,1.15 h 0.2 q -0.45,-0.6 -1.3,-3.15 m 5.9,4.55 h 0.1 l 0.35,0.4 -0.35,-0.3 -0.1,-0.1 m 4,4.2 4.6,4.65 h -0.4 q -0.35,0 -3.35,-2.5 L 92,315 l 0.05,0.05 q 1.25,0.65 2.35,0.9 m -2.5,-1 v 0.15 q 0.35,1.35 2.05,3.95 l 2.3,3.55 q -4.65,-4.1 -5.1,-7.6 0.15,2.15 -0.95,5.2 h -0.1 l -0.15,-4.3 -0.2,-1.3 v -0.95 l 2.15,1.3 m -3.6,-1 h 0.05 l -1.4,4.05 q -1.55,3.65 -3.35,4.8 2.45,-5.8 3.15,-6.9 -0.55,0.25 -1.9,1.55 -1.2,1.2 -1.75,1.2 h -0.35 l -0.1,-0.2 2.45,-3.05 1.35,-1.7 0.75,-0.35 0.35,0.15 -2.05,2.25 0.5,0.2 1.2,-0.95 1.1,-1.05 m -3.2,-0.9 -6.75,1.6 1.3,-0.95 q 1.05,-0.7 1.5,-0.75 l 0.1,-0.05 h -0.2 l -3.75,0.1 -3.5,0.1 q 1.95,-0.85 4.5,-1.35 l 2.6,-0.2 0.6,-0.15 1.2,0.45 0.6,0.2 1.2,0.3 1.75,0.2 -0.1,0.05 -0.55,0.25 -0.5,0.2 m 3.5,-2 h -0.1 v -0.3 l 0.1,0.3 m -0.9,2.35 -0.2,-0.2 0.9,-0.5 -0.7,0.7"
         id="path20"
         inkscape:connector-curvature="0"
         style="fill:#505c40;fill-rule:evenodd;stroke:none" />
      <path
         d="m 140.6,307.9 1.55,-0.5 1.9,-0.4 h 0.9 l -1.2,0.95 -0.9,0.65 -0.25,-0.05 -2,-0.65 m 3.3,1.95 q 0.75,1 3.2,2.7 v 0.15 l -2.2,-0.65 -1.75,-0.7 0.3,1.15 q -1.9,-1.75 -2.05,-2.55 l 2.5,-0.1 m -0.25,3.6 0.25,1.75 q 0.5,3.35 0.85,4.05 -1.55,-1.55 -3.95,-5.55 v -0.2 0.2 q -0.4,3.05 -0.4,5.35 l -0.6,-2.7 -0.45,-1.4 0.1,-0.3 0.35,-1.65 q 0,-0.65 -0.4,-1.45 v -1.4 q 1.7,1.8 4.25,3.3 m -65.35,-1.7 2.95,-0.4 q -2.15,0 -5.85,-1.25 -3.05,-1 -5.25,-2.2 l 0.05,-0.1 q 1.9,0.95 5.5,1.25 l 5.5,0.5 q -2.5,-1.25 -7.25,-4.1 l 0.1,-0.15 q 1.35,1.05 4.15,1.7 l 4.95,1 h 0.05 v -0.2 q -1.45,-0.9 -3,-2.7 -1.65,-2.05 -2.05,-3.75 l 0.15,-0.05 3.45,3.4 2.75,2.5 q 0.85,2.55 1.3,3.15 h -0.2 q -0.85,-0.3 -2.45,-1.15 l -0.1,0.15 2.1,1.85 0.3,0.2 -0.45,0.05 -1.55,-0.3 -0.45,-0.1 -2.15,-0.4 v 0.45 l 0.65,0.3 -0.6,0.15 -2.6,0.2 m 5.35,3.05 -3.5,2.4 -0.1,-0.15 2.35,-1.8 1.25,-0.45 m -2.4,-5.25 h 0.2 -0.25 0.05 m 83.05,6.15 0.05,0.3 q 0,0.6 -6.45,3 -1.1,0.55 -2,1.3 l -0.25,0.6 q 3.3,-2.5 7.85,-3.15 -2.45,0.75 -4.5,1.85 2.75,-1.2 5.5,-1.4 -4,0.8 -7.9,3.3 l -1.6,1.15 0.05,0.05 0.2,-0.2 0.05,0.2 v 0.2 h 0.05 l 5.3,-1.6 6,-2 0.15,0.1 q -0.65,0.95 -4.15,3 -3.1,1.8 -5.9,3 l 0.6,-0.05 3.8,0.5 4,0.45 6.05,-0.75 h 1.15 q -1.05,1 -3.2,1.7 -2.4,0.75 -5.05,0.75 l -1.8,-0.05 -1.5,-0.5 h -3.25 l -0.15,0.2 q 0.25,0.75 0.95,1.45 l 0.9,0.65 -0.05,0.1 -4.1,-1.1 -0.25,1.05 -0.05,0.1 -0.4,-1.3 -2.5,-0.6 h -2.45 l -0.2,1.6 v 0.15 l -2.85,-0.4 -7.4,-0.75 4.15,-0.85 4.2,-0.1 -5.2,-1.65 q -3.75,-1.3 -5.05,-2.7 l 6.05,1.2 6.1,1.25 v -0.2 l -3.8,-2 -1.95,-1.25 0.05,-0.05 q 1.6,1.2 4.8,1.8 l 3.5,0.65 -0.15,-0.25 -2.7,-1.5 -2.7,-1.3 -3.05,-0.95 0.1,-0.15 2.55,0.9 -3,-1.45 v -0.05 l 5.3,2.2 3.45,1 q -0.5,-1.4 -0.5,-2.75 l 0.2,-1.25 -1.2,-1.75 q 1.25,0.65 2.5,1.95 l -0.6,-4.1 0.1,-0.75 h 0.15 q 0.7,1.85 1.45,5.8 l 1.65,-7.1 h 0.15 l 0.15,1.05 q 0,1.45 -0.55,3.9 l 3.6,-6 -1.8,5.3 -0.5,1.4 q 0.7,-0.4 1.55,-0.8 4.3,-2.15 6.25,-2.4 l 0.05,0.05 m -11.5,5.3 -1.2,-1.5 0.3,1.2 0.35,1.85 0.2,0.15 0.6,-1 -0.05,-0.25 -0.05,-0.25 -0.15,-0.2 m 1.75,2.1 -0.2,0.2 0.2,-0.15 v -0.05 m -18.85,-11.5 -1.25,0.7 -1.95,0.95 -0.2,0.05 h -0.4 l 2.7,-2.05 -0.1,-0.1 -1.15,0.45 -0.8,0.3 -0.05,-0.15 q 1.1,-0.45 1.65,-1 l 0.9,-1.6 0.6,2.1 0.05,0.35"
         id="path22"
         inkscape:connector-curvature="0"
         style="fill:#3e4631;fill-rule:evenodd;stroke:none" />
      <path
         d="m 58.45,315.3 q -0.85,-0.35 -1.25,-0.8 l 1.85,2.45 -0.1,0.1 -0.75,-0.2 0.95,0.6 1,0.4 q -1.4,0.25 -4,1.6 -2.75,1.4 -4.1,1.75 l 0.2,-0.4 q 3.85,-2.15 4.75,-2.55 l -5.6,1.5 -0.1,-0.1 q 2.75,-1.2 4.7,-2.6 l -5.8,0.6 -6,0.4 5,-1.15 5.25,-0.4 -3.15,-1 -2.8,-1 h 1.7 l 4.65,0.6 q -1.7,-1.65 -2.65,-3.85 l -0.7,-2 q 0.7,1 2.25,2.2 2.65,1.95 4.05,2.25 -0.9,-3.05 -1,-4.3 l 1.2,3.45 q 0.75,2.35 1.9,3.1 -0.55,-0.3 -1.45,-0.65"
         id="path24"
         inkscape:connector-curvature="0"
         style="fill:#5d6b4a;fill-rule:evenodd;stroke:none" />
      <path
         d="m 170.15,326.85 -0.3,0.1 -1.9,-0.75 -0.15,-0.05 -1.15,0.4 -3.1,0.6 4.05,0.85 0.1,0.35 q -0.35,0.35 -1.05,0.35 l -0.85,-0.05 h -0.3 l -3.9,-0.35 q 1.15,0.55 2.35,1.6 l 1.65,1.4 q -0.95,-0.1 -2.65,-1.2 -2.15,-1.45 -3.5,-2 l -0.2,-0.05 0.2,0.2 3.85,2.45 v 0.2 l 0.05,0.1 -0.4,0.1 q -1.5,0 -4.6,-2.45 l -1.1,-0.9 -0.35,-0.3 -0.15,0.15 1.85,1.45 q 3.1,2.45 3.1,2.9 l -0.1,0.65 -0.4,0.1 q -1.3,0 -4.25,-2.3 l -2.55,-2.25 -1,0.3 -6.05,-0.2 -5.1,-0.3 -0.05,-0.4 0.05,-0.35 4.85,-0.45 -2.35,-0.7 q -1.85,-0.7 -1.85,-1.1 0,-0.45 0.6,-0.45 l 3.55,0.4 1.25,0.15 -0.05,-0.05 q -1,-1.1 -1.3,-1.85 1.2,0 2.85,0.85 l -0.3,-0.25 q -1.55,-1.25 -1.55,-1.9 0,-0.15 3.65,1.35 l -3.45,-2.95 0.05,-0.35 q 1.85,0.55 4.55,2 l -0.2,-0.85 0.05,-0.65 0.05,-0.2 0.4,1.2 0.45,0.05 q 0.1,0.65 0.35,1.1 0.4,0.2 0.8,0.5 -2,-2.65 -2,-3.55 l 0.1,-0.25 h 0.05 l 1.95,2.45 q 0.35,-2.65 1.4,-4.45 l 0.3,0.45 -0.5,2.8 -0.5,2.05 0.25,0.35 0.9,-0.3 q 2.2,-1.4 4,-2.1 l 1.25,-2.05 0.35,0.1 0.05,-0.05 0.05,0.25 -1.1,1.95 -0.5,0.85 h 0.1 l 1.35,-0.3 1.5,-1.1 0.2,0.05 0.1,0.35 -0.2,0.35 5.85,-0.85 0.05,0.25 q 0,1.25 -5.8,2.25 l 3.35,0.3 q 2.95,0.45 4.8,1.4 v 0.2 0.1 l -0.3,0.1 q -6.4,-1.4 -7.75,-1.4 l 0.3,0.3 -0.65,0.8 1.45,0.05 2.75,-0.1 0.45,0.15 0.4,0.25 -1.7,0.35 0.9,0.45 0.45,-0.1 0.05,-0.05 0.05,0.25 v 0.15 l 1.75,0.8 v 0.3 m -11.4,-1.4 0.1,0.1 0.3,-0.15 h -0.3 l -0.1,0.05 m -1.15,0.1 0.7,0.2 0.15,-0.05 -0.35,-0.2 v -0.05 L 158,325.4 h -0.1 -0.1 l -0.2,0.15 m 3.05,-0.65 0.15,-0.2 -0.4,0.2 h 0.25 m -0.5,1 -0.55,0.1 0.2,0.05 h 0.45 l -0.05,-0.15 h -0.05 m -4.05,-1 v -0.05 -0.05 l -0.05,0.05 0.05,0.05 m -0.35,2.5 -0.4,0.55 -0.05,0.05 q 3.1,2.6 5.65,3.95 l -3.85,-3.25 -1.35,-1.3 m 10.6,-1.55 -2.6,-0.3 0.55,0.65 1.65,-0.3 0.4,-0.05 m -15.4,-4.1 -0.1,-0.05 -0.05,0.05 0.3,0.25 -0.15,-0.25"
         id="path26"
         inkscape:connector-curvature="0"
         style="fill:#505c40;fill-rule:evenodd;stroke:none" />
      <path
         d="m 162.2,321.7 0.1,0.2 -2.5,2.25 4.35,-2.35 5.6,-3.4 q -1.55,2.55 -6.8,4.85 l -3.85,1.45 -0.35,0.2 3.1,-0.95 2.7,-0.7 0.25,0.05 0.1,-0.05 0.05,0.3 q 0,0.3 -1.5,0.85 l 1.9,-0.6 q -0.55,0.5 -2.65,1.35 l -2.75,0.85 0.15,0.05 0.35,0.1 q 3.8,-0.4 5.65,-1.3 l 0.05,0.05 -5.55,2.25 -1.3,0.45 4.8,0.55 0.05,0.25 -0.45,0.05 q -0.4,0.1 -0.4,0.3 l -0.1,0.3 h -0.4 q -3.8,0 -6,-0.8 h -0.05 v 0.2 l -0.2,0.1 -0.25,-0.25 -0.55,0.05 h -0.2 l -1.05,0.55 -1.2,1.25 -1.2,0.95 -0.3,-0.2 q 0.3,-1.4 2.4,-2.85 l 0.05,-0.05 h -0.3 l -0.75,0.2 -5.1,1.3 -0.3,-0.1 4,-1.8 h 0.1 l -0.5,-0.25 -1.5,-0.95 V 326 l -2.05,-0.45 v -0.15 h 1.05 l 5.8,1.15 0.15,0.2 -0.6,-0.7 -0.25,-0.1 q -0.7,-0.2 -5.4,-2.2 l 4.9,1.5 -1,-1 -2.25,-2.4 2.5,1.9 1.85,1.5 -0.6,-1.55 -0.9,-2.1 q 0,-1.5 1.3,1 l 0.8,1.95 q 0.25,-1.45 1.4,-3.5 l 2.35,-3.5 v 1 l -2.6,5.5 2.75,-1.7 2.55,-2.05 h 0.05 l -1.65,2 q -1.9,2.2 -2.85,2.55 h 0.45 l 1.5,-0.85 2.85,-2.35 0.2,0.05 m -5.85,2.35 -0.2,0.05 h 0.15 l 0.05,-0.05"
         id="path28"
         inkscape:connector-curvature="0"
         style="fill:#5d6b4a;fill-rule:evenodd;stroke:none" />
      <path
         d="m 44.3,275.85 q 0,-1.15 0.8,-2.35 1.25,-1.95 3.85,-1.95 2.2,0 3.35,1.5 0.8,1 0.8,1.85 v 0.15 l -0.1,0.2 -0.3,0.25 -0.3,-0.3 -0.15,-0.3 -0.3,-0.55 q -0.85,-1.2 -2.1,-1.2 l -1.3,0.6 q -0.75,0 -1,0.3 -0.3,0 -0.8,0.35 l -0.45,0.4 v -0.4 q -0.95,1.15 -1.3,2.2 l -0.05,-0.05 -0.55,-0.7 h -0.1 m 4.4,7.2 -0.15,-0.55 q 0.6,-0.2 1.2,-0.7 1.25,-1.05 1.45,-3.45 h 0.1 l 0.35,2.1 -0.35,0.85 0.75,-0.45 q 0,0.6 -1.95,1.9 l -0.75,0.55 h -0.2 l -0.45,-0.25 m 0.85,-10.3 q 0.55,0 1.25,0.45 l 0.75,0.45 q 0.4,0 0.4,-0.45 0,-0.8 -1.95,-1.05 -2,-0.3 -2,0.3 -0.1,0.55 0.8,0.55 l 0.75,-0.25 m 1.75,8.55 q -0.05,-0.7 -0.75,-0.1 l -0.75,0.8 0.25,0.25 q 1.25,-0.4 1.25,-0.9 v -0.05 m -3.75,-8.25 q 0,-0.8 -0.8,-0.6 -0.85,0.2 -0.85,0.85 l 0.05,0.35 0.65,0.05 0.65,-0.2 0.3,-0.45 m 8.05,45.25 -0.1,-0.35 -0.1,-0.1 q -1.95,-0.1 -1.95,1 V 319 q -5.5,1.4 -9.5,3.7 -1.05,0.6 -4.25,3.05 h -0.1 q -7.25,3.05 -11.8,5.8 h -3.1 l 0.8,-0.45 4.1,-2.3 1.2,-0.75 1.2,-0.2 q 1.9,-1.3 4.95,-2.75 2.15,-1.05 12.55,-5.4 l 6.35,-2.6 V 317 q 0,-1 2.25,-2.3 2.35,-1.35 4.6,-1.35 l 0.6,0.2 0.55,0.2 1.8,-0.1 2.8,-0.8 5.2,-0.85 q 3.5,-1.6 14.85,1.3 l 6,1.8 1.45,0.5 3.85,1.6 1.9,0.95 5.15,1.85 q 0,0.55 1.15,1.4 l 0.65,0.45 -4.1,-1.5 q -10.5,-4 -11.45,-4.05 v 0.05 L 91.4,315.7 91,315.45 q -1,-0.7 -3.1,-0.7 H 87 l -2.05,-0.3 -0.55,-0.25 q -1.35,-0.5 -3.9,-0.5 l -0.2,-0.2 -0.85,-0.35 v -0.05 l -0.1,-0.4 -0.15,-0.1 -2.4,0.2 q -0.65,0.2 -0.65,0.7 v 0.15 l -2.45,0.05 -1,0.4 -0.1,-0.4 h -0.15 l -2.7,0.35 q -0.15,0.55 -0.75,0.9 l -0.55,0.1 0.9,-0.8 q 0,-1.5 -1.8,-0.7 -1.75,0.8 -1.95,1.65 l 0.2,0.2 -1.7,0.05 H 64.05 L 64,314.75 q -0.2,-0.45 -1.05,-0.45 h -0.2 l -1.15,-0.35 q -0.95,-0.1 -0.95,0.6 v 0.3 q -0.55,0.2 -1.15,0.55 -1.95,1.05 -1.95,1.75 l 0.05,0.8 q -1.1,0 -2,0.35 m -17.9,10 4.75,-2.95 2,-1 q 4.1,-2 8.35,-3 l -0.35,-0.6 0.35,-0.35 1.2,0.05 0.15,0.3 -0.55,0.4 1.45,-0.3 1.45,-0.3 -0.55,-0.45 q -0.55,-0.5 -0.55,-0.75 0,-0.5 0.5,-0.6 l 2.3,0.1 0.1,0.1 0.05,0.35 -0.1,0.85 -0.15,0.35 -1.05,0.2 q -2.4,1.55 -10.75,3.75 l -1.1,0.4 -0.75,0.35 q -1.5,0.7 -3.2,2.05 -2.75,2.2 -6.3,3 1.3,-1 2.75,-1.95 m 24.9,-9.45 q 1.9,-0.6 2.45,-1 1.15,-0.85 8.3,-1.85 l 7.45,-0.85 1.75,0.3 2.15,0.45 0.65,-0.1 0.65,0.1 q 3.8,0.8 4.85,1.35 l 2.65,1.3 0.6,0.25 -0.2,0.1 -3.1,-1 -0.05,0.1 -0.3,0.1 -5.3,-0.85 -3.2,-0.45 -3.95,-0.5 q -3.35,0 -9.5,1.35 l -5.45,1.3 -0.45,-0.1 m 45.8,5.3 q -2.95,-1.7 -8.85,-4.2 L 96.6,318.6 v -0.1 -0.15 l 3,0.7 6.3,2.75 q 2.7,1 5.95,2.85 3,1.25 8.7,1.3 l 0.45,0.1 0.5,-0.1 h 0.1 l 0.15,0.8 q 0.5,0.6 2.7,0.6 l 1.85,-0.15 q 2.1,0.9 8,2 l 10.35,1.45 -1.05,0.2 -3,-0.5 -4.3,0.15 q -4.6,0.15 -15.25,-2.5 -7.1,-1.75 -9.85,-3.15 l -2.8,-0.7 m 45.9,5.95 1.4,-0.5 q 2.45,-1.2 5.1,-0.35 l 1.1,0.2 -6.3,0.65 h -1.3 m 12.05,-1.7 0.05,-0.05 3.4,-1.65 q 2.65,-1.4 3.3,-2.25 l 3.15,-3.2 2.5,-3.2 q 6.5,-4.65 6.5,-5.4 l -0.15,-0.45 -0.2,-0.1 1.4,-1.4 q -1.3,-0.05 -4.2,2.45 l -1.15,1.05 q -0.8,0.35 -2.2,1.4 l -0.05,0.05 h -0.1 l 2.15,-1.6 v 0.15 l 1.85,-1.65 -0.05,-0.05 1.85,-1.35 1.4,-1 0.5,-0.45 q 0.5,-0.45 1.05,-0.75 l 1.2,-0.5 0.5,0.2 H 190 q 1.8,0.2 2.05,1 -0.6,-0.5 -2.2,0.9 l -0.3,0.3 -1.4,0.75 -1.2,0.8 v -0.15 l -1.4,1.1 -0.8,0.8 0.1,0.05 -0.2,0.05 q -0.65,0.2 -1.95,1.45 l -0.45,0.5 q -2,1.9 -5.35,5.8 l -1.4,1.6 -2.05,2.05 q -0.7,0.35 -1.35,0.8 l -0.9,0.15 q -1.55,0.8 -4.4,1.65 l -0.45,0.15 m 8.5,-8.1 -1.3,1 q -1.3,1 -1.85,1.85 -1.25,1.85 -6.35,3.05 l 0.8,-0.3 q 0.75,-0.3 0.75,-0.8 l -0.1,-0.45 -0.35,-0.1 q -0.45,0.1 -1.25,0.5 l -0.85,0.7 0.05,0.5 0.2,0.15 -1.1,0.2 -18.65,2.2 0.15,-0.75 q -0.15,-0.6 -1.3,-0.6 l -1,0.3 -2.05,0.25 q -3.2,0 -8,-1.4 l -3.7,-0.95 v -0.1 l -0.05,0.05 q 0.25,-0.65 1.05,-1.65 1.7,-2.1 1.7,-2.8 0,-1.85 -1,-5.35 l -1,-3.7 0.35,-0.7 -0.05,0.75 q 0,1.75 0.75,2.95 l 0.85,1.3 h 0.1 l 0.25,0.5 0.3,0.75 q 0.5,1.35 0.5,2.45 0,2.1 -1.25,3.65 l -0.8,0.85 0.55,0.65 q 1.15,0.1 2.5,0.85 l 0.2,0.1 2,-0.25 6.6,0.85 9.3,-0.05 q 10.15,-0.5 14.8,-2.5 l 3.8,-1.4 -1.45,0.85 0.1,0.3 h 0.35 q 2,-0.65 3.65,-2.45 l 1.9,-2.25 q -1.5,1.75 -3.9,3.15 l -0.5,0.3 3.55,-3.3 1.5,-1.3 -0.05,0.25 0.4,0.55 q -0.5,0.15 -0.9,0.5 l -0.45,0.55 0.25,0.3 m -35.6,-7.6 -0.7,-0.1 q -0.7,-0.25 -1.55,-1.55 V 310 h 0.85 l -0.65,-1.9 -0.1,0.25 -0.5,0.15 -0.65,-0.45 -0.55,-0.55 q 0,-0.95 0.9,-0.6 l 0.65,0.35 -0.1,-0.25 q -0.15,-0.6 -0.7,-0.9 l 0.15,-0.3 1.15,0.95 q 1.8,1.95 1.8,5.7 v 0.25 m -7.45,-5.9 -0.45,0.2 -0.15,0.1 q -0.4,0.5 -0.65,1.15 l -0.15,0.1 -0.1,-0.15 -0.15,0.05 q -1.25,0.85 -1.25,1.45 l 0.05,0.35 0.15,0.05 0.2,-0.1 q -0.4,1 -0.4,2.15 0,2.65 0.75,5.1 l 0.65,2.75 q -0.5,0.25 -0.65,0.9 l -0.6,-1.6 0.05,-0.25 0.15,-1.35 -0.2,-0.35 q -0.95,-1.9 -1.2,-3.65 -0.4,-1.05 -0.4,-2.1 0,-1.95 1.05,-3.45 l 0.4,0.05 2.3,-1.1 q 0.3,-0.4 0.75,-0.55 l -0.15,0.25 m -2.1,15.45 -1.2,1.25 -0.2,0.2 1.2,-1.75 0.2,0.3 m -6.45,3.2 -0.3,-0.5 h 0.7 l -0.4,0.5 m -13.75,-3.3 -0.25,-0.1 h 0.25 v 0.1 m -39.3,-9.05 0.05,0.35 0.85,0.3 q 0.8,0 1.3,-0.65 -0.6,-0.65 -1.4,-0.55 -0.8,0.05 -0.8,0.55 m -1.7,0.05 -2.1,0.4 1.2,-0.25 0.85,-0.1 0.05,-0.05 m 3.6,8.5 -0.85,-0.3 q 0.8,-1 2.35,-1 2.2,0 3.25,2.1 0.55,1.05 0.65,2.2 l -0.1,1.25 -0.5,-0.8 -0.95,-2 q -0.7,-0.65 -2.3,-1.1 l 0.1,-0.05 0.35,-0.65 q -0.55,-0.4 -1.2,-0.5 -0.8,-0.05 -0.8,0.55 v 0.3 m 1.75,3.6 L 72.8,325 q -1.05,-0.45 -1.05,-1.05 0,-0.35 0.15,-0.55 l 0.1,-0.3 h 0.6 l 0.9,0.35 0.15,0.05 q 0.5,0.1 0.95,0.9 l -0.75,0.85 m -64.3,-7.15 0.75,1.85 q 0.9,2.1 1.65,3.1 l 0.15,0.15 v 0.05 l -0.3,0.4 -0.35,0.3 -0.95,-0.3 q -0.55,-0.45 -0.95,-1.4 -0.45,-0.15 -0.7,-0.7 l -0.25,-0.6 q 0,-0.6 0.2,-0.85 Q 8.85,320 9,320 l -0.25,-2.05 -0.1,0.2 -0.35,0.4 -0.2,0.05 q -1.25,0 -1.4,-2.75 0,-1.2 0.9,-1.9 l 0.3,0.45 0.5,1.25 0.25,0.75 0.3,-2.35 H 9.1 l -0.05,1.7 q 0,0.95 0.5,2.35 m 65.8,-5.65 q -1.45,0 -1.45,0.5 0,0.6 0.1,0.25 l 0.25,0.25 0.5,0.05 0.5,-0.1 0.15,-0.2 0.05,-0.35 -0.1,-0.4 m 113.85,-52.6 -0.95,-0.15 q -2.3,-0.15 -2.3,1.3 l 0.05,0.2 q 0.1,0.25 0.45,0.25 l 0.55,-0.25 1.85,-0.25 2.2,1.05 0.3,-0.3 q -0.4,-0.95 -1.2,-1.45 0.75,0.35 1.4,0.85 1.8,1.3 2.45,3.45 -0.1,1.7 -1.15,3.6 L 193,267.3 q 0,-1.55 -1.1,-3.55 l -0.75,-1.15 -0.15,0.15 q -1.45,-0.9 -1.75,-0.9 l -0.45,0.05 0.1,-0.2 -0.15,-0.25 -0.45,-0.2 -0.35,0.05 -0.05,0.25 0.25,0.3 0.2,0.15 q -0.5,0.1 -1.1,0.35 l 0.05,-0.2 q 0,-0.7 -0.9,-0.5 -0.9,0.25 -0.9,0.7 l 0.05,0.3 0.5,0.05 h 0.15 l -0.7,0.25 -0.25,-0.25 -0.15,0.5 q 0,1.3 0.8,2.05 l -0.05,0.25 0.15,0.6 0.2,0.3 -0.25,-0.05 -0.75,-0.9 q -0.7,-1.15 -0.7,-1.95 0.05,-1.2 0.55,-2.3 0.55,-1.15 1.4,-1.7 h 1.35 l 1.4,0.35 m -0.15,8 L 189,268 q 0,0.35 0.35,0.4 -0.25,1.25 -0.85,2.1 l -0.35,0.5 -0.1,-0.1 -0.35,-0.1 q -0.7,0.25 -1.1,0.45 -0.75,0.4 -0.75,0.8 0,0.65 0.15,0.65 l 0.3,0.05 -0.2,0.3 -0.6,-0.2 -0.3,0.1 q -0.9,-0.1 -2.05,0.45 l -0.8,0.45 v -0.15 l -0.65,0.2 1.05,-0.8 1.95,-1.55 q 1,-0.4 2.25,-0.85 l 1,-0.4 0.05,-0.25 0.7,-1.75 0.2,-0.35 0.15,-0.1 m -10.25,8.4 q -0.6,0.7 -0.6,0.95 v 0.2 0.15 l -0.75,0.6 0.9,-1.7 0.25,-0.2 h 0.2 m -1.8,3.15 -0.3,0.05 h -0.05 l 0.2,-0.35 0.05,0.25 0.1,0.05 m 3.55,0.4 q 1.25,-2.45 6.3,-5.8 l 4.1,-3.2 -1,1.1 q -3.85,3.4 -4.05,4.1 l -0.05,0.05 q -3.65,2.4 -5,4.45 l -0.25,0.45 h -0.45 q 0.05,-0.55 0.4,-1.15 m 9.7,-15.4 0.1,0.05 -0.2,0.25 0.1,-0.3 m -3.5,2.3 h -0.2 v -0.05 l 0.2,0.05 m -0.2,6.55 -0.05,0.05 -0.1,-0.05 h 0.15"
         id="path30"
         inkscape:connector-curvature="0"
         style="fill:#415451;fill-rule:evenodd;stroke:none" />
      <path
         d="M 49.55,272.75 48.8,273 q -0.9,0 -0.8,-0.55 0,-0.6 2,-0.3 1.95,0.25 1.95,1.05 0,0.45 -0.4,0.45 L 50.8,273.2 q -0.7,-0.45 -1.25,-0.45 m 2.7,2.15 0.05,0.3 -0.05,0.45 -0.3,0.05 q -0.35,0 -0.6,-0.55 l -0.2,-0.7 q 0,-0.8 0.6,-0.3 l 0.2,0.2 0.3,0.55 m -4.7,-1.85 -0.3,0.45 -0.65,0.2 -0.65,-0.05 -0.05,-0.35 q 0,-0.65 0.85,-0.85 0.8,-0.2 0.8,0.6 m 3.75,8.25 v 0.05 q 0,0.5 -1.25,0.9 L 49.8,282 l 0.75,-0.8 q 0.7,-0.6 0.75,0.1 m 2.15,37.7 v -0.15 q 0,-1.1 1.95,-1 l 0.1,0.1 0.1,0.35 v 0.15 l -1.55,0.9 -0.45,-0.15 q -0.15,0.25 -0.15,-0.2 m 7.2,-4.15 v -0.3 q 0,-0.7 0.95,-0.6 l 1.15,0.35 0.2,0.2 -0.1,0.4 -0.6,0.1 -1.5,-0.2 -0.1,0.05 m 5.15,0.55 -0.2,-0.2 q 0.2,-0.85 1.95,-1.65 1.8,-0.8 1.8,0.7 l -0.9,0.8 -1.7,0.7 q -0.65,0 -0.95,-0.35 m 10.35,-1.75 v -0.15 q 0,-0.5 0.65,-0.7 l 2.4,-0.2 0.15,0.1 0.1,0.4 v 0.05 q -0.05,1.05 -2.1,1.05 -0.8,0 -1.15,-0.35 l -0.05,-0.2 m 32.5,8.2 -0.65,-0.45 q -1.15,-0.85 -1.15,-1.4 l 1.95,0.7 10.05,2.95 0.35,0.05 q 4.45,0 7.3,-1.7 2,-1.25 2.55,-2.7 l 0.6,1.6 q 0.15,-0.65 0.65,-0.9 l 1.05,-0.15 0.1,-0.05 0.05,0.4 -0.2,0.75 -0.2,0.75 -0.3,0.4 -0.7,0.6 -0.4,-0.45 -0.2,-0.3 -1.2,1.75 -0.75,0.75 q 0.6,-0.4 0.9,-0.4 l -0.35,1.05 q -0.35,0.65 -1.4,0.85 l -0.45,-0.25 0.35,-0.5 h -0.3 q -0.75,0 -1,0.4 l -2.05,0.4 0.1,-0.05 -0.1,-0.5 0.4,-0.5 h -0.7 q -0.6,-0.75 -2.1,-0.85 l -3.55,0.1 q -1.8,0 -7.8,-2.05 v -0.1 h -0.25 l -0.6,-0.2 m 11.9,4.1 -0.3,-0.15 -0.4,-0.35 v -0.6 q 1.1,-0.4 2.05,0.65 l -0.25,0.35 -0.15,0.1 -0.5,0.1 -0.45,-0.1 M 184.9,312.1 184.75,312 q -0.95,0.4 -3.75,2.35 -2.6,1.8 -3.25,2.7 l -0.75,0.85 -0.65,0.95 0.15,-0.05 0.1,0.8 q 0,0.6 -0.35,0.75 l -1,0.35 -0.4,-0.4 -0.25,-0.3 0.45,-0.55 q 0.4,-0.35 0.9,-0.5 l -0.4,-0.55 0.05,-0.25 q 0.15,-0.65 1.2,-1.6 0.95,-0.9 1.8,-0.9 h 0.1 l 0.05,-0.05 q 1.4,-1.05 2.2,-1.4 l 1.15,-1.05 q 2.9,-2.5 4.2,-2.45 l -1.4,1.4 m -19.55,14.1 -0.6,0.25 -0.15,-0.05 -0.2,-0.15 -0.05,-0.5 0.85,-0.7 q 0.8,-0.4 1.25,-0.5 l 0.35,0.1 0.1,0.45 q 0,0.5 -0.75,0.8 l -0.8,0.3 m -29.2,-20.1 -1.5,-0.3 -0.9,0.2 h 0.15 l 0.1,0.05 0.1,0.45 q 0,0.5 -1.7,0.95 h -0.5 q -0.15,-0.05 -0.15,-0.45 l 0.05,-0.2 0.15,-0.25 q -0.45,0.15 -0.75,0.55 l -2.3,1.1 -0.4,-0.05 0.7,-0.85 q 1.05,-1.05 2.35,-1.5 0.9,-0.45 1.95,-0.55 1.55,-0.15 2.8,0.55 l -0.15,0.3 m -5.75,2.25 v 0.25 q 0,0.6 -1.1,1.4 l -0.2,0.1 -0.15,-0.05 -0.05,-0.35 q 0,-0.6 1.25,-1.45 l 0.15,-0.05 0.1,0.15 m -60.2,4.75 q 0,-0.5 0.8,-0.55 0.8,-0.1 1.4,0.55 -0.5,0.65 -1.3,0.65 l -0.85,-0.3 -0.05,-0.35 m 0.05,1.45 q 1.2,-1 1.85,-0.1 -0.4,0.4 -0.8,0.4 l -1.05,-0.3 m 3.4,7.45 -0.5,0.05 -1.05,-0.25 v -0.15 -0.3 q 0,-0.6 0.8,-0.55 0.65,0.1 1.2,0.5 l -0.35,0.65 -0.1,0.05 m 1.7,-9.55 0.1,0.4 -0.05,0.35 -0.15,0.2 -0.5,0.1 -0.5,-0.05 L 74,313.2 q -0.1,0.35 -0.1,-0.25 0,-0.5 1.45,-0.5 m 114.8,-52.2 q 0.8,0.5 1.2,1.45 l -0.3,0.3 -2.2,-1.05 -1.85,0.25 -0.55,0.25 q -0.35,0 -0.45,-0.25 l -0.05,-0.2 q 0,-1.45 2.3,-1.3 l 0.95,0.15 q 0.5,0.15 0.95,0.4 m -3.95,2.45 h -0.15 l -0.5,-0.05 -0.05,-0.3 q 0,-0.45 0.9,-0.7 0.9,-0.2 0.9,0.5 l -0.05,0.2 -0.35,0.2 q -0.2,-0.1 -0.45,0.15 h -0.25 m 2.15,-0.7 -0.2,-0.15 -0.25,-0.3 0.05,-0.25 0.35,-0.05 0.45,0.2 0.15,0.25 -0.1,0.2 -0.05,0.05 -0.2,0.1 -0.2,-0.05 m -0.55,10.05 -0.3,0.25 q -0.6,0.45 -1.2,0.45 L 186,272.7 q -0.15,0 -0.15,-0.65 0,-0.4 0.75,-0.8 0.4,-0.2 1.1,-0.45 l 0.35,0.1 0.1,0.1 q -0.4,0.5 -0.4,0.75 l 0.05,0.3 m -2.6,0.9 h 0.05 l 0.25,0.5 -1.15,0.85 0.5,0.15 v 0.3 l -0.2,0.6 -0.8,0.25 h -1.35 q -0.15,-0.1 -0.15,-0.65 h -0.15 q -0.15,0.05 -0.15,-0.2 l -0.8,0.75 -1.25,0.75 h -1.2 -0.2 l 2.65,-2 0.75,0.3 v -0.2 q 0,-0.25 0.35,-0.5 l 0.8,-0.45 q 1.15,-0.55 2.05,-0.45 m -14.8,49.9 0.15,-0.1 0.5,-0.3 q 2.4,-1.4 3.9,-3.15 l -1.9,2.25 q -1.65,1.8 -3.65,2.45 h -0.35 l -0.1,-0.3 1.45,-0.85 m 7.05,-4.9 0.5,-0.55 q 0.5,-0.45 0.75,-0.45 l 0.1,-0.1 0.05,0.4 q 0,0.45 -1,1.05 h -0.3 l -0.1,-0.35"
         id="path32"
         inkscape:connector-curvature="0"
         style="fill:#566d66;fill-rule:evenodd;stroke:none" />
      <path
         d="m 51.2,278.35 -0.45,-1.55 q -0.7,-2.1 -1.9,-2.1 -2.05,0 -2.3,4.4 -0.25,4.4 -2.7,4.4 l -1.45,-0.65 q -1.05,-0.75 -1.15,-1.5 l 1.3,-0.15 0.65,0.1 q 0.35,0 0.8,-2.35 -0.35,-0.35 -0.3,-1.05 0,-0.55 0.15,-0.95 l 0.45,-1.1 h 0.1 l 0.55,0.7 0.05,0.05 q 0.35,-1.05 1.3,-2.2 v 0.4 q -0.7,0.65 -0.7,1.4 l 0.35,0.6 1.15,-1.25 0.6,-0.75 h 0.15 l 0.25,-0.1 0.25,-0.15 q 2.1,0 3.1,2.9 0.6,1.75 0.6,3.4 l -0.75,0.45 0.35,-0.85 -0.35,-2.1 h -0.1 m 1.9,-3.3 q 0.75,2.05 0.75,5.45 0,2.2 -2.4,3.9 -2.45,1.7 -2.45,2.8 l 0.3,0.9 0.3,0.9 -0.3,0.8 q -0.4,0.45 -0.95,0.45 -1.4,0 -2,-1.45 -0.35,-0.85 -0.35,-1.65 0,-2.25 2.65,-4.1 h 0.05 l 0.45,0.25 h 0.2 q -1.2,0.85 -1.2,1.3 0,0.6 0.7,0.6 0.9,0 2.6,-1.85 1.85,-2 1.85,-3.6 -0.05,-1.8 -0.5,-3.4 l -0.4,-1.15 0.3,0.3 0.3,-0.25 0.1,-0.2 m 2.5,43.25 q 0.9,-0.35 2,-0.35 l -0.05,-0.8 q 0,-0.7 1.95,-1.75 0.6,-0.35 1.15,-0.55 l 0.1,-0.05 1.5,0.2 0.6,-0.1 0.1,-0.4 -0.2,-0.2 h 0.2 q 0.85,0 1.05,0.45 l 0.05,0.7 h 0.05 l 1.7,-0.05 q 0.3,0.35 0.95,0.35 l 1.7,-0.7 0.55,-0.1 q 0.6,-0.35 0.75,-0.9 l 2.7,-0.35 h 0.15 l 0.1,0.4 1,-0.4 2.45,-0.05 0.05,0.2 q 0.35,0.35 1.15,0.35 2.05,0 2.1,-1.05 l 0.85,0.35 0.2,0.2 q 2.55,0 3.9,0.5 l 0.55,0.25 2.05,0.3 h 0.9 q 2.1,0 3.1,0.7 l 0.4,0.25 1.7,0.65 v -0.05 q 0.95,0.05 11.45,4.05 l 4.1,1.5 0.6,0.2 0.25,0.1 q 6,2.05 7.8,2.05 l 3.55,-0.1 q 1.5,0.1 2.1,0.85 l 0.3,0.5 0.1,0.5 -0.1,0.05 2.05,-0.4 q 0.25,-0.4 1,-0.4 h 0.3 l -0.35,0.5 0.45,0.25 q 1.05,-0.2 1.4,-0.85 l 0.35,-1.05 q -0.3,0 -0.9,0.4 l 0.75,-0.75 0.2,-0.2 1.2,-1.25 0.4,0.45 0.7,-0.6 0.3,-0.4 0.2,-0.75 0.2,-0.75 -0.05,-0.4 -0.1,0.05 -1.05,0.15 -0.65,-2.75 q -0.75,-2.45 -0.75,-5.1 0,-1.15 0.4,-2.15 1.1,-0.8 1.1,-1.4 v -0.25 l 0.15,-0.1 q 0.25,-0.65 0.65,-1.15 l 0.15,-0.1 0.45,-0.2 -0.05,0.2 q 0,0.4 0.15,0.45 h 0.5 q 1.7,-0.45 1.7,-0.95 L 134,306.05 133.9,306 h -0.15 l 0.9,-0.2 1.5,0.3 q 0.55,0.3 0.7,0.9 l 0.1,0.25 -0.65,-0.35 q -0.9,-0.35 -0.9,0.6 l 0.55,0.55 0.65,0.45 0.5,-0.15 0.1,-0.25 0.65,1.9 H 137 v 1.05 q 0.85,1.3 1.55,1.55 l 0.7,0.1 -0.2,2.15 h -2.95 l 0.25,-2.35 -0.2,-2.15 q -0.55,-2.15 -2.05,-2.15 -2.4,0 -3.15,2.25 -0.4,1.15 -0.35,2.3 0,1.5 1.05,3.65 h -0.1 l -0.85,-1.3 q -0.75,-1.2 -0.75,-2.95 l 0.05,-0.75 -0.35,0.7 1,3.7 q 1,3.5 1,5.35 0,0.7 -1.7,2.8 -0.8,1 -1.05,1.65 l 0.05,0.05 3.7,0.95 q 4.8,1.4 8,1.4 l 2.05,-0.25 1,-0.3 q 1.15,0 1.3,0.6 l -0.15,0.75 18.65,-2.2 1.1,-0.2 0.15,0.05 0.6,-0.25 q 5.1,-1.2 6.35,-3.05 0.55,-0.85 1.85,-1.85 l 1.3,-1 0.4,0.4 1,-0.35 q 0.35,-0.15 0.35,-0.75 l -0.1,-0.8 -0.15,0.05 0.65,-0.95 0.75,-0.85 q 0.65,-0.9 3.25,-2.7 2.8,-1.95 3.75,-2.35 l 0.15,0.1 0.2,0.1 0.15,0.45 q 0,0.75 -6.5,5.4 l -2.5,3.2 -3.15,3.2 q -0.65,0.85 -3.3,2.25 l -3.4,1.65 -0.05,0.05 q -2.4,1.25 -4.45,1.05 l -1.1,-0.2 q -2.65,-0.85 -5.1,0.35 l -1.4,0.5 -8.45,0.6 -1.2,-0.05 -10.35,-1.45 q -5.9,-1.1 -8,-2 l -1.85,0.15 q -2.2,0 -2.7,-0.6 l -0.15,-0.8 h -0.1 l 0.15,-0.1 0.25,-0.35 q -0.95,-1.05 -2.05,-0.65 v 0.6 l 0.4,0.35 0.3,0.15 q -5.7,-0.05 -8.7,-1.3 -3.25,-1.85 -5.95,-2.85 l -6.3,-2.75 -3,-0.7 v 0.15 0.1 l 2.95,1.35 q 5.9,2.5 8.85,4.2 l -2.45,-0.95 -1.8,-0.85 -0.7,0.1 q -3.05,-1.75 -6.95,-3.5 l -0.3,0.2 -0.75,0.2 -1.35,-0.55 -0.6,-0.25 -2.65,-1.3 Q 89.8,316.7 86,315.9 l -0.65,-0.1 -0.65,0.1 -2.15,-0.45 -1.75,-0.3 -7.45,0.85 q -7.15,1 -8.3,1.85 -0.55,0.4 -2.45,1 l -0.8,0.25 0.05,0.4 -2.9,0.55 -0.15,-0.05 -0.55,0.15 0.1,-0.85 -0.05,-0.35 -0.1,-0.1 -2.3,-0.1 q -0.5,0.1 -0.5,0.6 0,0.25 0.55,0.75 l 0.55,0.45 -1.45,0.3 -1.45,0.3 0.55,-0.4 -0.15,-0.3 -1.2,-0.05 -0.35,0.35 0.35,0.6 q -4.25,1 -8.35,3 l -2,1 -4.75,2.95 -1,0.45 -2.5,0.95 h -0.05 l -1.5,0.6 -2.15,1.25 h -2.7 q 4.55,-2.75 11.8,-5.8 h 0.1 q 3.2,-2.45 4.25,-3.05 4,-2.3 9.5,-3.7 0,0.45 0.15,0.2 l 0.45,0.15 1.55,-0.9 v -0.15 m 12.9,-5.15 -0.05,0.05 -0.85,0.1 -1.2,0.25 2.1,-0.4 m 1.75,1.4 1.05,0.3 q 0.4,0 0.8,-0.4 -0.65,-0.9 -1.85,0.1 m -9,8.35 2.35,0.75 0.85,1.7 q 2.45,3.7 6.15,3.7 2.9,0 4.2,-2.1 0.7,-1.15 0.7,-2.3 l -0.45,-1.2 q -0.5,-0.9 -0.9,-1.05 h -1.5 l -0.25,0.6 0.2,0.1 H 72 l -0.1,0.3 q -0.15,0.2 -0.15,0.55 0,0.6 1.05,1.05 l 1.05,0.25 -0.1,0.05 -1.1,0.3 q -1.65,0 -2.05,-1.05 l -0.05,-1.35 q 0,-0.9 0.5,-1.65 l 0.2,-0.2 0.85,0.3 v 0.15 l 1.05,0.25 0.5,-0.05 q 1.6,0.45 2.3,1.1 l 0.95,2 0.5,0.8 q -0.25,1.2 -1,2.4 -1.8,2.7 -5.75,2.7 -4.85,0 -8.05,-5.55 L 61.25,322.9 M 9.05,306.4 9.6,305.5 q 3.75,-5.65 10.25,-8.25 l 0.25,0.7 q -7.4,4.95 -10.25,10.5 l 1,-0.15 0.15,0.2 0.1,0.5 -0.85,3.3 q -0.9,3.35 -0.9,3.8 l 0.2,2 q -0.5,-1.4 -0.5,-2.35 l 0.05,-1.7 H 8.95 L 8.65,316.4 8.4,315.65 7.9,314.4 q 0.15,-1.35 0.75,-3.5 0.8,-2.85 0.8,-3.65 0,-0.45 -0.4,-0.85 m 3.05,16.8 q 3.7,4.45 11.65,5.05 l -4.55,2.1 q -3,-0.7 -5.35,-2.05 l -3.35,-4.65 0.95,0.3 0.35,-0.3 0.3,-0.4 v -0.05 m -3.8,-4.65 0.35,-0.4 0.1,-0.2 L 9,320 q -0.15,0 -0.2,0.1 l -0.5,-1.55 m 180.9,-58.7 -1.4,-0.35 q 2.15,-0.4 3.75,1.6 -0.65,-0.5 -1.4,-0.85 -0.45,-0.25 -0.95,-0.4 m -3.25,6.5 0.25,0.05 -0.2,-0.3 -0.15,-0.6 0.05,-0.25 q -0.8,-0.75 -0.8,-2.05 l 0.15,-0.5 0.25,0.25 0.7,-0.25 v 0.2 q -0.4,0.5 -0.4,1.05 l 0.2,0.85 q 0.3,0.7 0.85,0.85 l 0.25,0.05 h 0.1 q 0.65,0 1.45,-0.55 l 0.85,-0.75 h 0.05 l -0.3,-0.2 v -0.05 q 0,-0.55 -0.95,-0.6 h -0.4 -0.3 l 1.15,-0.2 q 0.8,0 1.2,0.4 l 0.3,0.55 v 0.1 l -0.1,0.3 -1.05,1.1 -1,0.6 -0.55,0.2 -0.15,0.05 -0.6,0.05 h -0.05 l -0.2,-0.05 v 0.05 l -0.6,-0.35 m 1.3,-4 q 0.6,-0.25 1.1,-0.35 l 0.2,0.05 0.2,-0.1 0.05,-0.05 0.45,-0.05 q 0.3,0 1.75,0.9 l 0.15,-0.15 0.75,1.15 q 1.1,2 1.1,3.55 l -0.15,0.85 q -0.4,1.2 -1.9,2.65 l -4.1,3.2 q -5.05,3.35 -6.3,5.8 l -0.1,-0.55 q 0,-0.65 0.35,-1.25 -1.3,1.55 -1.3,3.8 l 0.6,0.9 q 0.6,0.5 0.6,0.95 0,0.4 -0.55,1.05 l -1.15,0.75 q -2.1,0 -2.6,-2.55 l -0.05,-2.95 0.3,-0.5 h 0.05 l 0.3,-0.05 0.1,0.05 0.6,0.15 q 3.4,-1.4 4.15,-3.4 -1.05,-0.35 -3.1,0.95 l -0.55,0.4 v -0.15 -0.2 q 0,-0.25 0.6,-0.95 h 1.2 l 1.25,-0.75 0.8,-0.75 q 0,0.25 0.15,0.2 h 0.15 q 0,0.55 0.15,0.65 h 1.35 l 0.8,-0.25 0.2,-0.6 v -0.3 l -0.5,-0.15 1.15,-0.85 -0.25,-0.5 h -0.05 l 0.3,-0.1 0.6,0.2 0.2,-0.3 q 0.6,0 1.2,-0.45 l 0.3,-0.25 0.05,0.15 0.35,0.15 0.85,-0.7 q 0.5,-1.45 1.25,-2.3 1.4,-1.65 2,-1.9 l 0.05,-0.15 q -1.05,-0.3 -1.05,-0.7 l 0.2,-0.8 h -0.1 l -0.75,1.25 -1.2,1.35 h -0.1 Q 189,268.35 189,268 l 0.05,-0.15 q 0.1,-0.55 0.95,-1.4 l 0.65,-0.55 q 0.6,-1.2 0.6,-2.3 0,-0.3 -0.75,-0.7 -0.95,-0.45 -2.3,-0.45 -0.15,0 -0.55,0.25 -0.3,0.15 -0.4,0.35 l -0.35,-0.5 0.35,-0.2 m -0.5,2 v -0.05 l 0.05,0.05 h -0.05 m 0.2,6.35 1.05,-0.65 -0.05,0.25 -1,0.4 m -5.25,3.2 0.65,-0.2 v 0.15 q -0.35,0.25 -0.35,0.5 v 0.2 l -0.75,-0.3 0.45,-0.35 m 4.15,2.15 0.05,0.4 q -3.1,2.25 -4.55,4.6 l -0.5,-0.55 q 1.35,-2.05 5,-4.45 m 0.7,-2.8 h -0.15 l 0.1,0.05 0.05,-0.05 m -5.1,37.65 -0.65,-1.35 q 1.25,-0.05 1.9,-0.85 l 0.05,-0.05 0.85,1.2 -2.15,1.05 m 7.1,-2.45 1.5,-0.25 q 2,0 2.5,1.05 0.3,0.55 0.15,1.15 0,1.3 -0.85,2.45 -1.35,1.9 -4.3,1.9 l -1.35,-0.25 -1.35,-0.3 -0.1,-0.05 0.8,-0.8 1.4,-1.1 v 0.15 l -0.15,0.25 1.2,-0.1 -0.75,0.8 q 0,0.65 0.1,0.35 l 0.2,0.25 0.55,0.05 q 1.6,0 3,-1.1 1.3,-1 1.3,-2.05 0,-0.95 -0.35,-1.2 -0.25,-0.8 -2.05,-1 h -0.95 l -0.5,-0.2 m -11.1,9.5 0.1,0.35 h 0.3 q 1,-0.6 1,-1.05 l -0.05,-0.4 -0.1,0.1 q -0.25,0 -0.75,0.45 l -0.5,0.55"
         id="path34"
         inkscape:connector-curvature="0"
         style="fill:#33423f;fill-rule:evenodd;stroke:none" />
      <path
         d="m 52.05,280.85 q 0,-1.65 -0.6,-3.4 -1,-2.9 -3.1,-2.9 l -0.25,0.15 -0.25,0.1 H 47.7 l -0.6,0.75 -1.15,1.25 -0.35,-0.6 q 0,-0.75 0.7,-1.4 l 0.45,-0.4 q 0.5,-0.35 0.8,-0.35 0.25,-0.3 1,-0.3 l 1.3,-0.6 q 1.25,0 2.1,1.2 l -0.2,-0.2 q -0.6,-0.5 -0.6,0.3 l 0.2,0.7 q 0.25,0.55 0.6,0.55 l 0.3,-0.05 0.05,-0.45 -0.05,-0.3 0.15,0.3 0.4,1.15 q 0.45,1.6 0.5,3.4 0,1.6 -1.85,3.6 -1.7,1.85 -2.6,1.85 -0.7,0 -0.7,-0.6 0,-0.45 1.2,-1.3 l 0.75,-0.55 q 1.95,-1.3 1.95,-1.9 m -21.25,47.2 -1.2,0.75 -4.1,2.3 -6.3,-0.75 4.55,-2.1 2.35,0.05 4.7,-0.25 m 28.15,-8 2.9,-0.55 0.3,1.35 0.05,0.1 1.4,2.7 -2.35,-0.75 -0.75,-1.3 q -0.75,-1.15 -1.55,-1.55 M 9.05,306.4 q 0.4,0.4 0.4,0.85 0,0.8 -0.8,3.65 -0.6,2.15 -0.75,3.5 l -0.3,-0.45 q -0.9,0.7 -0.9,1.9 0.15,2.75 1.4,2.75 l 0.2,-0.05 0.5,1.55 q -0.2,0.25 -0.2,0.85 l 0.25,0.6 q 0.25,0.55 0.7,0.7 0.4,0.95 0.95,1.4 l 3.35,4.65 q -3.2,-1.85 -5.15,-4.9 L 8.35,322.85 Q 7.4,321.2 6.9,319.4 L 6.6,318.05 6.35,315.4 q 0,-4.5 2.7,-9 m 180.3,-38 h 0.1 l 1.2,-1.35 0.75,-1.25 h 0.1 l -0.2,0.8 q 0,0.4 1.05,0.7 l -0.05,0.15 q -0.6,0.25 -2,1.9 -0.75,0.85 -1.25,2.3 l -0.85,0.7 -0.35,-0.15 -0.05,-0.15 -0.05,-0.3 q 0,-0.25 0.4,-0.75 l 0.35,-0.5 q 0.6,-0.85 0.85,-2.1 m -11.15,9.15 0.55,-0.4 q 2.05,-1.3 3.1,-0.95 -0.75,2 -4.15,3.4 l -0.6,-0.15 -0.1,-0.05 -0.1,-0.05 -0.05,-0.25 0.6,-0.95 0.75,-0.6 m 9.4,-14 h 0.3 0.4 q 0.95,0.05 0.95,0.6 v 0.05 l 0.3,0.2 h -0.05 l -0.85,0.75 q -0.8,0.55 -1.45,0.55 h -0.1 l -0.25,-0.05 Q 186.3,265.5 186,264.8 l -0.2,-0.85 q 0,-0.55 0.4,-1.05 v -0.2 h 0.25 q 0.25,-0.25 0.45,-0.15 l 0.35,0.5 0.1,0.45 0.25,0.05 m -0.85,0.8 h 0.05 l -0.05,-0.05 v 0.05 m -4.2,48.15 -1.1,-1.6 2.15,-1.05 0.8,1.3 -1.85,1.35 m 9.5,-2.85 q 0.35,0.25 0.35,1.2 0,1.05 -1.3,2.05 -1.4,1.1 -3,1.1 l -0.55,-0.05 -0.2,-0.25 q -0.1,0.3 -0.1,-0.35 l 0.75,-0.8 1.55,-1.7 0.3,-0.3 q 1.6,-1.4 2.2,-0.9"
         id="path36"
         inkscape:connector-curvature="0"
         style="fill:#273330;fill-rule:evenodd;stroke:none" />
      <path
         d="m 95.95,315.6 -1.45,-0.5 0.05,-0.15 -8.3,-5.8 q -2.1,-1.95 -2.1,-5.1 0,-2.25 1.15,-3.6 1.95,-2.25 6.45,-0.25 l 2.45,3.1 2.75,3.35 v 0.3 l -0.75,0.3 q -1.55,0 -3.45,-3.4 -1.85,-3.4 -4.2,-3.4 -1.8,0 -2.4,1.7 -0.3,0.9 -0.25,1.8 0,3.5 5.1,6.75 5.05,3.25 5.05,4 l -0.1,0.9"
         id="path38"
         inkscape:connector-curvature="0"
         style="fill:#293432;fill-rule:evenodd;stroke:none" />
    </g>
  </defs>
</svg>
