<?xml version="1.0" encoding="UTF-8" standalone="no"?>
<svg xmlns:xlink="http://www.w3.org/1999/xlink" height="10.75px" width="19.05px" xmlns="http://www.w3.org/2000/svg">
  <g transform="matrix(1.0, 0.0, 0.0, 1.0, 8.4, 8.8)">
    <path d="M9.3 -3.1 Q7.25 -0.85 3.4 0.6 -0.4 2.1 -3.8 1.95 -7.15 1.8 -8.1 0.1 -9.05 -1.55 -7.0 -3.75 -5.0 -6.0 -1.15 -7.45 2.65 -8.95 6.05 -8.8 9.4 -8.7 10.35 -6.95 11.25 -5.3 9.3 -3.1" fill="url(#gradient0)" fill-rule="evenodd" stroke="none"/>
    <path d="M6.9 -5.75 Q6.3 -2.95 4.05 -1.35 1.7 0.4 -1.15 -0.1 -3.95 -0.55 -5.6 -2.75 L-6.85 -3.4 6.9 -5.75" fill="#a36a6a" fill-rule="evenodd" stroke="none"/>
    <path d="M6.9 -5.75 L-6.85 -3.4 -5.6 -2.75 Q-3.95 -0.55 -1.15 -0.1 1.7 0.4 4.05 -1.35 6.3 -2.95 6.9 -5.75 Z" fill="none" stroke="#a36a6a" stroke-linecap="round" stroke-linejoin="round" stroke-opacity="0.7058824" stroke-width="0.05"/>
  </g>
  <defs>
    <radialGradient cx="0" cy="0" gradientTransform="matrix(0.0116, -0.0045, 0.0028, 0.005, 1.1, -3.45)" gradientUnits="userSpaceOnUse" id="gradient0" r="819.2" spreadMethod="pad">
      <stop offset="0.3333333333333333" stop-color="#cca9a9"/>
      <stop offset="1.0" stop-color="#cca9a9" stop-opacity="0.0"/>
    </radialGradient>
  </defs>
</svg>
