<?xml version="1.0" encoding="UTF-8" standalone="no"?>
<svg xmlns:xlink="http://www.w3.org/1999/xlink" height="11.85px" width="36.75px" xmlns="http://www.w3.org/2000/svg">
  <g transform="matrix(1.0, 0.0, 0.0, 1.0, 11.95, 6.85)">
    <path d="M-6.15 -2.1 L-6.1 -1.5 -4.35 -0.4 -6.15 -2.1 M0.2 3.35 L1.65 2.55 -0.15 2.45 0.2 3.35 M0.6 -2.45 L0.85 -2.0 0.3 -0.55 Q1.9 -0.55 3.35 -1.2 4.85 -1.85 6.25 -1.5 L6.2 -0.35 4.5 0.6 Q8.1 0.7 11.75 -0.2 14.5 -0.75 17.1 -2.15 18.4 -2.85 19.9 -2.95 L21.1 -4.4 Q22.05 -6.05 23.85 -6.85 L24.8 -3.35 23.95 -2.65 21.75 -1.75 17.2 0.2 16.8 0.4 11.2 1.4 3.55 2.6 Q3.25 3.75 2.35 4.4 0.9 5.4 -0.65 4.7 -1.8 4.15 -1.85 2.6 -2.05 3.65 -3.0 4.35 L-6.25 4.5 Q-7.0 4.05 -7.35 3.25 L-7.55 2.4 -7.95 1.0 -8.5 -0.25 Q-10.3 -1.1 -11.4 -2.85 -12.4 -4.4 -11.5 -5.45 L-8.55 -2.4 Q-8.85 -3.2 -8.1 -3.8 L-7.35 -4.15 -6.85 -3.95 -6.4 -3.35 -5.9 -3.3 -4.55 -2.6 Q-3.3 -2.0 -2.2 -1.25 L-1.7 -1.3 0.1 -2.65 0.6 -2.45" fill="#000000" fill-opacity="0.17254902" fill-rule="evenodd" stroke="none"/>
  </g>
</svg>
