<?xml version="1.0" encoding="UTF-8" standalone="no"?>
<svg xmlns:xlink="http://www.w3.org/1999/xlink" height="140.35px" width="43.6px" xmlns="http://www.w3.org/2000/svg">
  <g transform="matrix(1.0, 0.0, 0.0, 1.0, -8.45, -82.9)">
    <path d="M41.9 95.2 L42.3 94.95 Q43.2 94.4 44.0 94.15 L44.6 93.9 44.55 94.15 43.95 94.6 42.25 95.3 42.05 95.3 41.9 95.2 M43.95 97.75 L43.4 100.7 42.75 101.5 43.3 98.4 43.95 97.75 M43.05 102.7 L42.4 106.5 42.1 106.7 41.9 106.8 42.4 103.65 43.05 102.7 M41.9 109.45 L41.3 112.85 40.9 112.8 41.4 109.8 41.45 109.8 41.9 109.45 M40.85 115.5 L40.5 117.45 40.0 117.7 40.45 115.4 40.85 115.5 M40.25 118.85 L40.05 119.9 39.6 120.15 39.8 119.15 40.25 118.85 M39.9 120.65 L39.5 122.95 39.1 123.2 39.45 121.0 39.9 120.65 M39.0 125.9 L38.65 127.85 38.3 128.05 38.6 126.2 39.0 125.9 M38.25 130.2 L37.9 132.05 37.5 132.65 37.85 130.6 38.25 130.2 M37.45 134.8 L37.2 136.2 36.8 136.5 37.0 135.55 37.45 134.8 M34.25 136.2 L34.45 135.2 Q34.6 135.8 35.1 136.05 L35.0 136.7 34.75 136.6 34.25 136.2 M34.8 133.05 L35.35 130.05 Q35.4 130.45 35.8 130.75 L36.0 130.95 35.55 133.35 35.1 133.3 34.8 133.05 M35.8 127.35 L36.3 124.8 Q36.4 125.55 36.85 125.9 L36.45 128.2 36.25 128.1 35.8 127.35 M36.75 122.15 L36.85 121.25 37.0 121.45 37.6 121.75 37.4 122.8 36.75 122.15 M37.2 119.6 L37.45 117.95 Q37.7 118.65 38.1 119.05 L37.85 120.15 37.8 120.1 37.2 119.6 M37.85 115.75 L38.55 111.9 38.6 111.9 Q38.6 113.15 38.95 114.0 L38.4 117.2 Q37.85 116.65 37.85 115.75 M39.1 108.65 L39.4 107.2 Q39.4 108.0 39.9 108.7 L39.4 111.5 Q39.05 110.8 39.05 109.65 L39.1 108.65 M39.65 105.7 L39.85 104.65 39.9 105.0 Q40.0 105.45 40.25 105.45 L40.45 105.4 40.25 106.6 39.65 105.7 M40.25 102.15 L40.35 101.75 40.8 99.2 41.15 99.4 41.5 99.35 40.95 102.55 Q40.5 102.5 40.25 102.15" fill="#d0c2ae" fill-rule="evenodd" stroke="none"/>
    <path d="M44.55 94.15 L43.95 97.75 43.3 98.4 43.95 94.6 44.55 94.15 M43.4 100.7 L43.05 102.7 42.4 103.65 42.75 101.5 43.4 100.7 M42.4 106.5 L41.9 109.45 41.45 109.8 41.4 109.8 41.9 106.8 42.1 106.7 42.4 106.5 M41.3 112.85 L40.85 115.5 40.45 115.4 40.9 112.8 41.3 112.85 M40.5 117.45 L40.25 118.85 39.8 119.15 40.0 117.7 40.5 117.45 M40.05 119.9 L39.9 120.65 39.45 121.0 39.6 120.15 40.05 119.9 M39.5 122.95 L39.0 125.9 38.6 126.2 39.1 123.2 39.5 122.95 M38.65 127.85 L38.25 130.2 37.85 130.6 38.3 128.05 38.65 127.85 M37.9 132.05 L37.45 134.8 37.0 135.55 37.5 132.65 37.9 132.05 M34.45 135.2 L34.8 133.05 35.1 133.3 35.55 133.35 35.1 136.05 Q34.6 135.8 34.45 135.2 M35.35 130.05 L35.8 127.35 36.25 128.1 36.45 128.2 36.0 130.95 35.8 130.75 Q35.4 130.45 35.35 130.05 M36.3 124.8 L36.75 122.15 37.4 122.8 36.85 125.9 Q36.4 125.55 36.3 124.8 M36.85 121.25 L37.2 119.6 37.8 120.1 37.85 120.15 37.6 121.75 37.0 121.45 36.85 121.25 M37.45 117.95 L37.85 115.75 Q37.85 116.65 38.4 117.2 L38.1 119.05 Q37.7 118.65 37.45 117.95 M38.6 111.9 L38.65 111.4 39.1 108.65 39.05 109.65 Q39.05 110.8 39.4 111.5 L38.95 114.0 Q38.6 113.15 38.6 111.9 M39.4 107.2 L39.65 105.7 40.25 106.6 39.9 108.7 Q39.4 108.0 39.4 107.2 M39.85 104.65 L40.25 102.15 Q40.5 102.5 40.95 102.55 L40.45 105.4 40.25 105.45 Q40.0 105.45 39.9 105.0 L39.85 104.65 M40.8 99.2 L40.8 99.1 41.4 95.5 41.9 95.2 42.05 95.3 42.25 95.3 41.5 99.35 41.15 99.4 40.8 99.2" fill="#877e71" fill-rule="evenodd" stroke="none"/>
    <path d="M42.25 95.3 L43.95 94.6 43.3 98.4 42.95 98.65 41.5 99.35 42.25 95.3 M40.95 102.55 L41.05 102.55 Q41.75 102.55 42.7 101.55 L42.75 101.5 42.4 103.65 42.2 103.85 40.45 105.4 40.95 102.55 M40.25 106.6 L41.15 106.85 41.9 106.8 41.4 109.8 Q40.75 109.7 40.1 109.0 L39.9 108.7 40.25 106.6 M40.9 112.8 L40.45 115.4 Q39.55 115.05 39.1 114.3 L38.95 114.0 39.4 111.5 Q39.85 112.5 40.9 112.8 M38.4 117.2 Q38.95 117.7 39.9 117.7 L40.0 117.7 39.8 119.15 39.0 119.35 38.1 119.05 38.4 117.2 M37.6 121.75 L37.85 120.15 38.75 120.35 39.6 120.15 39.45 121.0 39.2 121.2 Q38.25 121.75 37.6 121.75 M37.4 122.8 Q38.0 123.2 38.8 123.2 L39.1 123.2 38.6 126.2 38.05 126.25 Q37.35 126.25 36.85 125.9 L37.4 122.8 M36.45 128.2 L37.15 128.25 38.3 128.05 37.85 130.6 37.75 130.65 36.65 131.1 36.0 130.95 36.45 128.2 M35.55 133.35 Q36.35 133.35 37.05 132.95 L37.5 132.65 37.0 135.55 Q36.45 136.15 35.75 136.15 L35.1 136.05 35.55 133.35" fill="#696258" fill-rule="evenodd" stroke="none"/>
    <path d="M41.5 99.35 L42.95 98.65 43.3 98.4 42.75 101.5 42.7 101.55 Q41.75 102.55 41.05 102.55 L40.95 102.55 41.5 99.35 M40.45 105.4 L42.2 103.85 42.4 103.65 41.9 106.8 41.15 106.85 40.25 106.6 40.45 105.4 M39.4 111.5 L39.9 108.7 40.1 109.0 Q40.75 109.7 41.4 109.8 L40.9 112.8 Q39.85 112.5 39.4 111.5 M38.95 114.0 L39.1 114.3 Q39.55 115.05 40.45 115.4 L40.0 117.7 39.9 117.7 Q38.95 117.7 38.4 117.2 L38.95 114.0 M38.1 119.05 L39.0 119.35 39.8 119.15 39.6 120.15 38.75 120.35 37.85 120.15 38.1 119.05 M37.6 121.75 Q38.25 121.75 39.2 121.2 L39.45 121.0 39.1 123.2 38.8 123.2 Q38.0 123.2 37.4 122.8 L37.6 121.75 M36.85 125.9 Q37.35 126.25 38.05 126.25 L38.6 126.2 38.3 128.05 37.15 128.25 36.45 128.2 36.85 125.9 M37.5 132.65 L37.05 132.95 Q36.35 133.35 35.55 133.35 L36.0 130.95 36.65 131.1 37.75 130.65 37.85 130.6 37.5 132.65 M35.1 136.05 L35.75 136.15 Q36.45 136.15 37.0 135.55 L36.8 136.5 36.7 136.55 35.8 136.8 35.0 136.7 35.1 136.05" fill="#a89c8c" fill-rule="evenodd" stroke="none"/>
    <path d="M37.2 136.2 L24.95 206.95 24.75 208.0 24.45 209.75 Q24.25 210.45 23.25 210.45 L22.2 210.35 35.0 136.7 35.8 136.8 36.7 136.55 36.8 136.5 37.2 136.2" fill="#8a764e" fill-rule="evenodd" stroke="none"/>
    <path d="M11.6 222.8 L10.9 222.35 10.5 222.05 Q9.75 221.3 9.75 219.9 L10.0 218.55 10.55 217.65 11.65 217.15 11.85 216.8 12.0 216.2 Q12.1 215.65 12.85 215.15 13.45 214.75 13.8 214.7 L14.5 214.55 15.4 214.5 16.0 214.5 16.35 214.65 16.8 214.05 17.4 215.0 17.45 215.1 15.25 217.25 Q13.45 218.8 13.45 219.5 13.45 219.9 13.8 220.25 L13.15 221.0 12.2 222.25 11.6 222.8 M21.65 208.35 L34.25 136.2 34.75 136.6 35.0 136.7 22.2 210.35 Q21.45 210.1 21.45 209.45 L21.45 209.3 21.65 208.35" fill="#a18a5b" fill-rule="evenodd" stroke="none"/>
    <path d="M31.45 205.0 Q32.3 205.25 33.05 206.0 L33.6 206.8 31.2 207.95 30.8 207.35 Q30.1 206.35 29.15 206.0 L31.45 205.0 M16.6 211.6 Q17.55 212.0 18.4 212.9 L19.25 214.05 17.55 214.95 17.4 215.0 16.8 214.05 16.6 213.8 Q15.7 212.9 14.7 212.5 L14.65 212.5 16.6 211.6" fill="#79a826" fill-rule="evenodd" stroke="none"/>
    <path d="M27.95 205.8 L27.95 205.7 29.35 205.1 30.55 204.85 31.45 205.0 29.15 206.0 27.95 205.8 M12.25 212.3 L12.25 212.2 14.4 211.35 14.9 211.3 16.6 211.6 14.65 212.5 13.1 212.2 12.25 212.3" fill="#a5f037" fill-rule="evenodd" stroke="none"/>
    <path d="M24.95 206.95 L27.7 205.8 27.95 205.8 29.15 206.0 24.75 208.0 24.95 206.95 M14.9 211.3 L14.85 211.15 21.65 208.35 21.45 209.3 21.45 209.45 16.6 211.6 14.9 211.3" fill="#bfa06c" fill-rule="evenodd" stroke="none"/>
    <path d="M33.6 206.8 Q34.15 207.7 34.2 208.85 L34.2 209.2 31.7 210.5 31.7 210.45 Q31.9 209.25 31.2 207.95 L33.6 206.8 M17.4 215.0 L17.55 214.95 19.25 214.05 Q19.9 215.3 20.0 216.8 L20.0 216.9 18.2 217.9 18.2 217.7 18.05 216.65 17.45 215.1 17.4 215.0" fill="#517019" fill-rule="evenodd" stroke="none"/>
    <path d="M29.15 206.0 Q30.1 206.35 30.8 207.35 L31.2 207.95 19.25 214.05 18.4 212.9 Q17.55 212.0 16.6 211.6 L21.45 209.45 Q21.45 210.1 22.2 210.35 L23.25 210.45 Q24.25 210.45 24.45 209.75 L24.75 208.0 29.15 206.0" fill="#947d54" fill-rule="evenodd" stroke="none"/>
    <path d="M31.2 207.95 Q31.9 209.25 31.7 210.45 L31.7 210.5 20.0 216.9 20.0 216.8 Q19.9 215.3 19.25 214.05 L31.2 207.95" fill="#5e4f35" fill-rule="evenodd" stroke="none"/>
    <path d="M33.8 210.85 L33.3 211.6 32.35 212.4 31.9 212.6 30.0 213.8 31.0 212.7 31.25 212.25 33.8 210.85 M18.75 220.7 L18.6 220.85 16.35 222.25 16.9 221.6 17.45 220.85 17.6 220.55 17.75 220.3 17.8 220.25 Q18.85 219.5 19.7 219.1 L19.4 219.65 19.3 219.95 18.75 220.7" fill="#81b329" fill-rule="evenodd" stroke="none"/>
    <path d="M34.2 209.2 Q34.2 210.05 33.8 210.85 L31.25 212.25 31.7 210.5 34.2 209.2" fill="#749c24" fill-rule="evenodd" stroke="none"/>
    <path d="M31.25 212.25 L30.55 212.55 28.5 213.5 27.55 214.05 27.0 214.1 Q26.75 214.15 26.5 214.35 25.9 214.7 24.45 215.95 L22.55 217.4 21.7 218.2 20.75 218.6 20.3 218.7 Q20.0 218.85 19.7 219.1 L20.0 216.9 31.7 210.5 31.25 212.25" fill="#7a6845" fill-rule="evenodd" stroke="none"/>
    <path d="M30.0 213.8 L18.75 220.75 18.75 220.7 19.3 219.95 19.4 219.65 19.7 219.1 Q20.0 218.85 20.3 218.7 L20.75 218.6 21.7 218.2 22.55 217.4 24.45 215.95 Q25.9 214.7 26.5 214.35 26.75 214.15 27.0 214.1 L27.55 214.05 28.5 213.5 30.55 212.55 31.25 212.25 31.0 212.7 30.0 213.8" fill="#8c764f" fill-rule="evenodd" stroke="none"/>
    <path d="M16.35 222.25 L16.3 222.3 16.25 222.3 16.05 222.45 15.95 222.5 15.75 222.65 Q14.8 223.25 13.6 223.25 L13.55 223.25 11.6 222.8 12.2 222.25 13.15 221.0 13.8 220.25 Q13.45 219.9 13.45 219.5 13.45 218.8 15.25 217.25 L17.45 215.1 18.05 216.65 18.2 217.7 18.2 217.9 Q18.2 219.2 17.75 220.3 L17.6 220.55 17.45 220.85 16.9 221.6 16.35 222.25" fill="#917c52" fill-rule="evenodd" stroke="none"/>
    <path d="M20.0 216.9 L19.7 219.1 Q18.85 219.5 17.8 220.25 L17.75 220.3 Q18.2 219.2 18.2 217.9 L20.0 216.9" fill="#84ab27" fill-rule="evenodd" stroke="none"/>
    <path d="M8.45 217.7 Q8.35 215.5 9.7 213.8 10.45 213.0 11.35 212.55 L11.7 212.45 11.85 212.4 12.15 212.3 12.25 212.3 13.1 212.2 14.65 212.5 14.7 212.5 13.9 212.45 Q12.7 212.45 10.9 213.75 8.55 215.45 8.45 217.7" fill="#c2a66e" fill-rule="evenodd" stroke="none"/>
    <path d="M10.5 222.05 L10.0 221.6 Q8.85 220.3 8.55 218.55 L8.5 218.15 8.45 217.7 Q8.55 215.45 10.9 213.75 12.7 212.45 13.9 212.45 L14.7 212.5 Q15.7 212.9 16.6 213.8 L16.8 214.05 16.35 214.65 16.0 214.5 15.4 214.5 14.5 214.55 13.8 214.7 Q13.45 214.75 12.85 215.15 12.1 215.65 12.0 216.2 L11.85 216.8 11.65 217.15 10.55 217.65 10.0 218.55 9.75 219.9 Q9.75 221.3 10.5 222.05" fill="#b09764" fill-rule="evenodd" stroke="none"/>
    <path d="M48.85 92.55 L48.5 93.8 48.1 95.2 Q47.15 98.55 46.8 101.2 L46.7 101.9 45.45 103.35 Q44.6 104.5 44.75 105.45 L43.85 105.1 43.75 104.6 Q43.75 103.75 44.85 100.95 45.95 98.2 45.95 97.3 L45.9 96.4 45.25 95.75 45.3 95.65 44.05 95.85 43.35 96.1 Q42.5 96.4 41.5 97.0 L41.05 97.25 40.5 97.6 40.35 97.7 36.55 100.25 36.3 100.4 35.45 101.05 34.35 102.0 34.15 102.0 34.15 101.45 Q34.5 100.55 36.1 99.25 L38.45 97.1 38.35 97.0 37.9 96.8 Q37.55 96.8 37.05 97.1 L32.35 100.5 32.15 100.65 32.1 100.65 32.05 100.35 Q32.05 99.95 32.7 98.5 L33.0 98.2 32.85 98.25 Q32.55 98.15 32.9 96.6 L34.5 95.35 37.2 92.85 34.6 93.35 32.9 93.55 31.95 93.45 37.45 91.25 37.55 91.25 37.55 91.3 38.6 90.75 46.5 86.6 46.65 86.5 47.05 86.25 47.2 86.35 46.75 87.15 46.5 88.05 46.8 88.65 47.1 89.2 Q46.95 90.2 47.1 90.5 L47.85 91.9 47.95 92.05 48.85 92.55" fill="#c2a68d" fill-rule="evenodd" stroke="none"/>
    <path d="M47.2 86.35 L47.55 85.9 47.95 85.4 48.15 85.1 50.05 83.95 51.95 82.9 52.0 82.95 52.05 83.3 52.0 83.5 48.85 92.55 47.95 92.05 47.85 91.9 47.1 90.5 Q46.95 90.2 47.1 89.2 L46.8 88.65 46.5 88.05 46.75 87.15 47.2 86.35" fill="#93995a" fill-rule="evenodd" stroke="none"/>
  </g>
</svg>
