<?xml version="1.0" encoding="UTF-8" standalone="no"?>
<svg xmlns:xlink="http://www.w3.org/1999/xlink" height="33.3px" width="56.6px" xmlns="http://www.w3.org/2000/svg">
  <g transform="matrix(1.0, 0.0, 0.0, 1.0, 28.3, 16.65)">
    <path d="M-9.1 -16.65 L-7.35 -16.65 -6.65 -16.35 Q-6.35 -16.1 -6.35 -15.7 L-6.3 -14.6 -6.1 -14.7 -6.05 -14.8 -6.05 -14.75 -6.0 -15.05 -5.95 -15.05 -5.55 -15.55 -4.9 -15.7 -4.55 -15.65 -3.95 -15.3 -3.7 -14.8 -3.45 -14.15 -3.45 -13.7 -3.5 -13.1 -3.5 -13.05 Q-3.55 -12.1 -4.2 -11.85 L-4.3 -11.5 -4.3 -11.45 -4.3 -11.4 -4.25 -11.35 -3.85 -10.2 Q-3.2 -8.8 -0.15 -5.1 L0.55 -4.35 4.85 -5.4 4.95 -5.45 5.45 -5.65 5.6 -5.65 5.65 -5.65 5.65 -5.7 5.75 -5.75 Q8.95 -6.9 11.25 -8.5 L11.2 -8.8 11.2 -8.85 11.35 -9.55 11.4 -9.55 Q11.6 -9.9 12.0 -9.95 L12.0 -10.0 12.4 -10.05 12.6 -10.9 10.55 -10.7 9.85 -10.95 9.8 -11.0 8.25 -10.65 Q6.25 -10.65 5.95 -10.95 L5.7 -11.2 5.35 -11.6 5.2 -12.15 5.4 -12.7 5.45 -12.75 5.95 -13.05 5.9 -13.05 7.1 -13.4 7.1 -13.5 7.25 -14.0 7.65 -14.35 7.65 -14.4 7.85 -14.5 8.3 -14.6 8.75 -14.5 9.4 -14.15 9.8 -14.3 10.95 -14.35 11.4 -14.5 12.2 -14.7 Q12.45 -14.95 13.15 -15.0 L13.6 -15.0 13.6 -15.1 14.0 -15.6 14.05 -15.65 14.65 -15.8 15.3 -15.75 Q15.7 -15.75 15.95 -15.45 L15.95 -15.4 16.2 -14.75 16.2 -14.65 16.4 -14.5 16.7 -13.8 16.7 -12.95 16.6 -11.8 Q16.5 -10.4 15.4 -10.25 L15.1 -8.75 15.15 -8.45 15.2 -8.3 15.95 -6.4 16.0 -6.35 Q17.05 -3.75 23.0 3.55 L25.55 6.2 Q26.25 5.45 27.6 5.9 27.9 6.0 28.1 6.25 L28.3 6.85 28.0 8.05 28.05 8.15 28.1 8.8 27.75 9.35 27.15 9.55 26.75 9.6 26.7 9.6 26.55 9.6 26.35 9.6 Q23.8 9.75 21.45 10.4 L19.35 11.15 19.3 11.15 Q16.65 12.15 14.8 14.15 L14.15 16.0 14.15 16.05 13.75 16.5 13.8 16.45 Q13.55 16.65 13.25 16.65 L12.65 16.65 11.95 16.35 Q-4.25 10.6 -10.2 10.55 L-16.5 11.35 -20.1 12.3 -20.1 12.4 -20.35 13.05 -20.95 13.4 -21.0 13.4 -21.7 13.2 -22.0 12.95 -22.6 12.95 -23.2 12.45 -23.3 12.2 -24.1 10.6 -24.3 10.35 Q-25.0 9.3 -26.1 9.25 L-26.45 9.3 -26.5 9.3 -27.1 9.2 -27.15 9.15 -27.6 8.65 -27.6 7.95 -27.1 7.45 -27.15 7.45 -26.95 7.35 -27.0 7.15 -27.0 7.2 -27.05 6.95 -27.05 5.95 -26.75 5.25 Q-26.45 4.95 -26.05 4.95 L-25.65 4.95 -25.05 5.15 -24.75 5.55 -22.55 3.05 -20.15 -0.1 -19.9 -0.45 -21.55 -0.15 -21.6 -0.15 -21.75 -0.1 -23.3 0.3 -23.55 0.7 -23.55 0.65 Q-23.8 0.95 -24.15 1.0 L-24.2 1.0 -24.9 0.8 -24.95 0.75 -25.25 0.7 -25.75 0.35 -25.9 0.0 -25.95 -0.05 -26.3 -0.75 -26.35 -0.8 -26.4 -0.85 Q-26.65 -1.2 -27.0 -1.25 L-27.25 -1.25 -27.3 -1.25 -27.9 -1.45 -28.25 -2.0 -28.2 -2.65 -27.95 -3.0 -27.95 -3.5 -27.65 -4.2 -26.95 -4.5 -26.75 -4.5 -26.25 -4.35 -25.5 -5.25 -25.4 -5.4 -24.15 -7.05 -23.0 -8.7 -23.05 -8.7 -23.55 -8.7 Q-24.1 -7.95 -24.65 -8.15 L-24.8 -8.2 -25.0 -8.25 -25.55 -8.65 -25.75 -9.3 -25.4 -9.95 -25.35 -9.95 -25.3 -10.2 Q-25.25 -10.8 -24.4 -11.0 L-23.0 -12.0 -22.85 -12.0 -22.5 -12.25 -22.35 -13.0 -22.4 -13.0 -22.1 -13.45 -22.0 -13.85 -22.0 -13.9 -21.65 -14.3 -21.65 -14.35 -21.6 -14.35 -21.4 -14.7 Q-21.1 -15.0 -20.7 -15.0 L-20.5 -15.0 Q-20.1 -15.0 -19.8 -14.7 -19.5 -14.4 -19.5 -14.0 L-19.45 -13.85 -19.25 -13.05 -19.3 -12.6 -19.25 -12.55 -19.25 -12.6 -19.15 -12.9 -19.0 -13.4 -19.0 -13.45 -18.55 -13.8 -18.6 -13.8 -18.05 -13.9 -15.45 -13.6 -15.3 -14.05 -15.25 -14.1 -14.85 -14.45 -14.8 -14.45 -14.3 -14.55 -13.95 -14.5 -13.35 -14.15 -13.1 -13.5 -13.05 -13.25 -12.85 -12.75 -12.8 -12.7 -12.8 -12.65 Q-12.65 -12.3 -12.65 -11.8 -12.65 -11.3 -12.8 -10.95 L-12.8 -10.9 -12.8 -10.85 Q-12.5 -10.6 -12.5 -10.2 L-12.45 -9.55 -10.35 -10.1 -10.25 -10.15 -9.95 -10.25 Q-8.5 -10.75 -7.35 -11.45 L-7.3 -11.5 -7.35 -11.5 Q-8.9 -11.75 -9.0 -12.95 L-9.0 -13.1 -8.9 -14.05 -9.1 -14.05 Q-9.45 -14.05 -9.7 -14.3 L-9.75 -14.3 -10.05 -14.95 -10.1 -15.55 -10.0 -16.1 -9.95 -16.1 -9.6 -16.5 -9.1 -16.65 M-8.85 -14.15 L-8.9 -14.05 -8.85 -14.05 -8.85 -14.15 M-14.75 -9.1 L-14.85 -9.2 -14.9 -9.05 -14.75 -9.1" fill="#ffffff" fill-rule="evenodd" stroke="none"/>
  </g>
</svg>
