<?xml version="1.0" encoding="UTF-8" standalone="no"?>
<svg xmlns:xlink="http://www.w3.org/1999/xlink" height="83.1px" width="65.4px" xmlns="http://www.w3.org/2000/svg">
  <g transform="matrix(1.0, 0.0, 0.0, 1.0, 32.55, 81.7)">
    <path d="M1.4 -76.25 Q1.6 -74.3 2.6 -72.9 L5.5 -68.65 6.75 -66.5 10.45 -72.65 Q9.8 -70.9 9.8 -69.25 L10.0 -65.55 Q10.9 -71.2 13.3 -76.4 12.55 -71.6 13.6 -66.95 14.05 -65.0 14.65 -63.1 L15.75 -69.0 Q15.8 -65.95 16.65 -63.2 L17.45 -61.55 21.2 -54.75 21.5 -54.25 23.3 -58.6 Q22.95 -57.65 23.3 -56.5 23.85 -54.45 24.8 -52.55 L25.8 -50.1 26.1 -51.4 26.15 -52.1 25.95 -52.7 Q27.15 -51.8 27.2 -50.05 L27.25 -47.0 31.9 -51.55 Q31.05 -50.35 30.6 -48.7 L28.95 -42.5 28.85 -41.35 31.05 -43.45 Q27.9 -38.3 27.6 -32.25 L27.45 -29.9 Q27.4 -28.8 27.7 -27.95 L27.05 -25.6 26.75 -24.35 Q25.9 -17.65 24.65 -10.9 L23.85 -7.75 23.45 -10.75 20.4 -4.75 19.75 -8.45 19.55 -1.65 14.35 -6.5 12.65 0.0 10.5 -4.75 9.1 -5.95 6.8 -3.5 5.2 -5.9 Q4.6 -6.95 3.4 -6.65 L-4.8 -5.95 Q-9.2 -6.55 -13.35 -7.75 L-14.15 -4.25 -17.7 -6.25 -16.85 -4.05 Q-17.25 -3.9 -17.65 -4.4 L-19.9 -7.75 -20.0 -8.0 -19.85 -2.75 Q-21.0 -3.45 -21.9 -5.1 L-23.3 -8.15 -23.8 -9.6 Q-24.25 -8.3 -24.85 -7.35 -25.5 -6.15 -26.5 -5.35 -25.3 -9.15 -26.9 -12.65 L-28.4 -16.65 -28.85 -18.1 Q-29.8 -21.3 -29.5 -24.7 -29.2 -28.5 -29.6 -32.3 -29.75 -34.0 -30.05 -35.55 L-31.85 -45.95 -28.75 -40.8 Q-29.1 -46.6 -31.55 -51.4 L-28.05 -49.05 -27.45 -50.05 -26.1 -53.0 -25.25 -54.75 -23.7 -56.2 Q-21.35 -58.5 -19.35 -61.15 -18.5 -62.2 -17.9 -63.5 -17.0 -65.55 -17.15 -67.7 -17.25 -69.75 -17.7 -71.6 -17.9 -72.75 -18.55 -73.75 -16.45 -72.9 -14.9 -71.05 L-14.1 -69.9 Q-13.2 -76.6 -17.2 -80.8 -11.0 -77.4 -7.3 -71.05 L-10.1 -79.95 Q-7.7 -75.6 -3.55 -73.35 L-2.0 -72.5 Q-0.25 -71.5 0.15 -69.25 -0.25 -72.0 0.75 -74.6 L1.4 -76.25" fill="url(#gradient0)" fill-rule="evenodd" stroke="none"/>
    <path d="M1.4 -76.25 Q1.6 -74.3 2.6 -72.9 L5.5 -68.65 6.75 -66.5 10.45 -72.65 Q9.8 -70.9 9.8 -69.25 L10.0 -65.55 Q10.9 -71.2 13.3 -76.4 12.55 -71.6 13.6 -66.95 14.05 -65.0 14.65 -63.1 L15.75 -69.0 Q15.8 -65.95 16.65 -63.2 L17.45 -61.55 21.2 -54.75 21.5 -54.25 23.3 -58.6 Q22.95 -57.65 23.3 -56.5 23.85 -54.45 24.8 -52.55 L25.8 -50.1 26.1 -51.4 26.15 -52.1 25.95 -52.7 Q27.15 -51.8 27.2 -50.05 L27.25 -47.0 31.9 -51.55 Q31.05 -50.35 30.6 -48.7 L28.95 -42.5 28.85 -41.35 31.05 -43.45 Q27.9 -38.3 27.6 -32.25 L27.45 -29.9 Q27.4 -28.8 27.7 -27.95 L27.05 -25.6 26.75 -24.35 Q25.9 -17.65 24.65 -10.9 L23.85 -7.75 23.45 -10.75 20.4 -4.75 19.75 -8.45 19.55 -1.65 14.35 -6.5 12.65 0.0 10.5 -4.75 9.1 -5.95 6.8 -3.5 5.2 -5.9 Q4.6 -6.95 3.4 -6.65 L-4.8 -5.95 Q-9.2 -6.55 -13.35 -7.75 L-14.15 -4.25 -17.7 -6.25 -16.85 -4.05 Q-17.25 -3.9 -17.65 -4.4 L-19.9 -7.75 -20.0 -8.0 -19.85 -2.75 Q-21.0 -3.45 -21.9 -5.1 L-23.3 -8.15 -23.8 -9.6 Q-24.25 -8.3 -24.85 -7.35 -25.5 -6.15 -26.5 -5.35 -25.3 -9.15 -26.9 -12.65 L-28.4 -16.65 -28.85 -18.1 Q-29.8 -21.3 -29.5 -24.7 -29.2 -28.5 -29.6 -32.3 -29.75 -34.0 -30.05 -35.55 L-31.85 -45.95 -28.75 -40.8 Q-29.1 -46.6 -31.55 -51.4 L-28.05 -49.05 -27.45 -50.05 -26.1 -53.0 -25.25 -54.75 -23.7 -56.2 Q-21.35 -58.5 -19.35 -61.15 -18.5 -62.2 -17.9 -63.5 -17.0 -65.55 -17.15 -67.7 -17.25 -69.75 -17.7 -71.6 -17.9 -72.75 -18.55 -73.75 -16.45 -72.9 -14.9 -71.05 L-14.1 -69.9 Q-13.2 -76.6 -17.2 -80.8 -11.0 -77.4 -7.3 -71.05 L-10.1 -79.95 Q-7.7 -75.6 -3.55 -73.35 L-2.0 -72.5 Q-0.25 -71.5 0.15 -69.25 -0.25 -72.0 0.75 -74.6 L1.4 -76.25 Z" fill="none" stroke="#a36a6a" stroke-linecap="butt" stroke-linejoin="miter" stroke-miterlimit="3.0" stroke-opacity="0.69411767" stroke-width="1.0"/>
  </g>
  <defs>
    <linearGradient gradientTransform="matrix(-0.0014, 0.0197, 0.0387, 0.0, -2.15, -19.75)" gradientUnits="userSpaceOnUse" id="gradient0" spreadMethod="pad" x1="-819.2" x2="819.2">
      <stop offset="0.0" stop-color="#e0cbcb"/>
      <stop offset="1.0" stop-color="#a36a6a"/>
    </linearGradient>
  </defs>
</svg>
