<?xml version="1.0" encoding="UTF-8" standalone="no"?>
<svg xmlns:xlink="http://www.w3.org/1999/xlink" height="364.4px" width="42.0px" xmlns="http://www.w3.org/2000/svg">
  <g transform="matrix(1.0, 0.0, 0.0, 1.0, 19.95, 359.2)">
    <path d="M2.7 -341.3 Q7.6 -336.05 9.75 -332.15 13.05 -326.3 13.05 -319.65 13.05 -313.95 9.15 -306.3 L9.15 -306.15 Q9.15 -305.6 8.65 -305.0 L8.25 -304.6 7.6 -303.45 Q4.4 -297.95 1.5 -295.55 L1.95 -302.0 2.9 -303.1 5.5 -306.5 6.1 -307.4 Q9.9 -313.5 9.9 -319.4 9.9 -326.15 6.6 -331.5 5.15 -333.85 2.15 -337.05 L-0.65 -339.8 -2.75 -341.85 Q-6.45 -345.55 -7.95 -347.75 -11.25 -352.65 -11.25 -358.75 L-11.25 -359.2 -8.0 -359.2 -8.0 -358.75 Q-8.0 -354.2 -4.7 -349.6 L-2.55 -347.0 2.55 -341.45 2.7 -341.3 M2.7 -252.0 L2.55 -253.8 8.7 -249.65 Q12.35 -246.7 12.35 -244.25 12.35 -239.45 8.55 -236.5 6.45 -234.9 2.4 -233.4 L2.55 -236.0 2.55 -246.0 2.3 -247.15 2.45 -248.0 Q4.85 -245.05 4.85 -240.6 4.85 -239.0 4.2 -237.1 L4.9 -237.45 Q8.7 -239.5 8.7 -244.4 8.7 -245.8 5.05 -248.1 L2.65 -249.6 2.7 -252.0 M6.9 -215.65 Q10.4 -213.8 10.4 -209.75 10.4 -205.7 2.4 -202.35 L3.2 -206.5 3.5 -206.6 Q6.85 -207.9 6.85 -209.7 6.85 -211.55 3.65 -212.8 L3.35 -212.9 -4.35 -214.9 Q-15.6 -217.8 -15.6 -224.65 -15.6 -230.25 -11.8 -232.7 -9.4 -234.3 -3.45 -235.25 L-2.65 -235.4 -2.95 -231.7 -8.1 -229.9 Q-11.9 -228.05 -11.9 -225.1 -11.9 -221.25 -8.4 -219.55 -6.8 -218.75 -3.15 -218.05 L-0.75 -217.65 2.25 -217.1 Q5.4 -216.4 6.9 -215.65 M22.05 -185.45 Q22.05 -181.1 19.3 -177.15 15.3 -171.45 7.3 -171.45 L2.5 -172.05 2.2 -175.9 5.7 -175.2 5.75 -175.2 7.75 -177.25 Q10.35 -179.7 10.35 -181.6 10.35 -183.15 9.35 -183.5 L6.15 -183.65 1.4 -183.75 1.25 -183.75 -3.2 -183.9 Q-4.9 -184.2 -6.35 -184.9 L-7.65 -185.6 -7.95 -185.85 -10.7 -188.3 Q-12.55 -190.35 -13.7 -193.15 L-14.55 -195.8 Q-14.55 -201.4 -3.85 -204.45 L-2.25 -204.9 -3.05 -200.4 -7.75 -198.7 Q-11.1 -197.2 -11.1 -195.55 -11.1 -193.8 -8.3 -191.4 -6.4 -189.75 -3.85 -188.9 L1.0 -188.1 1.8 -188.1 Q10.1 -188.1 12.25 -189.8 L13.65 -190.95 Q14.6 -191.5 16.7 -191.5 20.5 -191.5 21.65 -188.55 L22.05 -185.45 M12.35 -185.75 L13.35 -184.25 Q13.55 -183.7 13.55 -181.0 13.55 -179.1 12.15 -176.4 14.55 -177.5 16.15 -179.55 18.35 -182.35 18.35 -185.45 L17.95 -186.8 Q17.45 -187.85 16.75 -187.85 15.9 -187.85 12.95 -186.1 L12.35 -185.75 M1.35 -153.45 L-0.2 -153.35 -1.55 -153.4 -1.55 -153.0 Q-1.55 -152.4 -2.0 -152.3 L-2.3 -152.1 Q-0.6 -151.35 1.35 -151.2 L2.0 -151.2 Q4.2 -151.2 5.15 -152.0 6.1 -152.8 6.6 -152.8 9.55 -152.8 10.7 -149.4 L11.25 -146.05 Q11.25 -143.9 10.25 -141.15 L10.2 -141.0 Q9.25 -135.15 2.6 -127.05 L4.7 -128.6 Q11.5 -133.4 13.65 -135.75 17.75 -140.15 17.75 -145.65 17.75 -148.6 16.85 -151.85 15.6 -156.6 13.25 -156.6 11.1 -156.6 6.75 -154.95 3.6 -153.8 1.35 -153.45 M5.85 -157.35 Q10.25 -159.35 13.05 -159.35 17.65 -159.35 19.65 -152.3 L20.7 -145.25 Q20.7 -139.25 16.45 -134.4 14.2 -131.75 7.15 -126.55 3.1 -123.55 0.5 -121.0 L-0.25 -128.6 -0.15 -128.7 Q2.35 -131.4 4.9 -137.0 L6.75 -140.8 8.0 -145.7 Q8.0 -147.6 6.6 -149.0 6.15 -148.7 4.9 -148.3 3.15 -147.75 1.8 -147.75 L1.1 -147.75 -2.0 -148.2 -2.7 -148.15 Q-3.55 -148.15 -4.15 -148.65 L-4.75 -149.3 Q-8.75 -151.5 -11.3 -156.65 -14.1 -162.25 -14.1 -166.35 -14.1 -170.85 -13.3 -172.9 -11.5 -177.75 -5.5 -177.75 L-2.7 -177.05 -2.6 -173.3 -5.4 -174.05 Q-9.25 -174.05 -10.35 -170.3 L-10.65 -166.4 Q-10.65 -164.7 -10.1 -162.8 L-9.95 -162.8 -7.3 -158.65 Q-6.2 -157.1 -4.75 -156.25 L-3.75 -156.15 -3.5 -155.75 -1.1 -155.4 1.45 -155.75 Q3.35 -156.25 5.85 -157.35 M4.3 -109.5 Q8.2 -112.8 12.5 -109.8 15.0 -108.1 15.9 -105.75 16.5 -104.2 16.5 -101.7 16.5 -96.65 13.6 -95.0 7.9 -92.8 2.1 -90.15 L1.95 -94.45 Q4.4 -96.1 6.05 -97.95 4.15 -99.4 1.95 -100.65 L-0.85 -102.05 -3.05 -103.05 -6.6 -104.6 -7.15 -104.85 -7.3 -104.85 -7.45 -105.0 Q-12.0 -107.55 -12.0 -112.2 -12.0 -114.85 -7.0 -121.05 L-4.85 -123.5 -4.2 -117.1 -4.0 -115.25 Q-5.7 -112.15 -6.25 -108.6 L-3.25 -106.7 -2.7 -106.4 -1.65 -105.95 Q-0.75 -105.45 -0.2 -105.45 0.45 -105.45 1.9 -106.8 L4.3 -109.5 M2.3 -103.8 Q9.3 -99.95 9.3 -96.95 L9.25 -96.15 Q13.75 -98.75 13.75 -101.85 13.75 -103.9 12.9 -105.45 11.6 -107.75 8.85 -107.75 6.05 -107.75 3.65 -105.15 L2.3 -103.8 M0.15 -72.3 L1.05 -71.6 3.75 -69.1 Q6.95 -65.65 6.95 -62.4 6.95 -61.2 6.4 -59.9 8.0 -62.0 8.0 -64.8 8.0 -68.95 4.9 -70.75 L3.75 -71.25 0.15 -72.3 M8.1 -71.1 Q11.25 -68.6 11.25 -64.8 11.25 -57.9 3.05 -53.0 L3.4 -59.35 Q4.85 -61.15 4.85 -62.4 4.85 -64.1 3.65 -65.95 2.2 -68.2 -1.1 -70.7 L-2.0 -71.4 -4.65 -73.45 Q-7.45 -74.35 -8.85 -75.45 -12.0 -77.9 -12.0 -83.1 -12.0 -86.5 -10.4 -88.2 -9.25 -89.4 -6.25 -90.5 -4.3 -91.2 -2.55 -92.0 L-2.3 -88.8 -6.15 -87.0 Q-9.0 -85.25 -9.0 -82.9 -9.0 -79.75 -5.85 -77.65 -4.55 -76.8 -1.2 -75.45 L1.15 -74.55 3.7 -73.5 Q6.65 -72.25 8.1 -71.1 M1.65 -29.5 L-3.0 -31.45 Q-7.85 -33.3 -9.9 -35.4 -13.05 -38.55 -13.05 -44.3 -13.05 -48.35 -9.75 -50.95 -7.8 -52.5 -2.5 -54.6 L-1.55 -54.95 -1.8 -50.6 -3.55 -49.75 Q-7.9 -46.05 -7.9 -44.65 -7.9 -42.25 -6.75 -39.55 L-5.65 -36.4 -5.25 -35.95 Q-4.7 -35.45 -2.8 -34.7 L1.85 -33.1 2.75 -32.85 Q8.75 -31.0 10.05 -27.75 10.45 -26.75 10.45 -21.6 10.45 -18.45 9.9 -17.05 8.4 -13.4 3.4 -13.4 L1.5 -13.55 1.2 -15.95 1.2 -17.25 3.35 -17.1 Q6.1 -17.1 6.85 -19.25 7.2 -20.35 7.0 -21.6 7.0 -25.95 3.85 -28.3 3.15 -28.8 1.65 -29.5 M1.25 5.2 L-4.65 5.2 -9.9 -0.55 Q-12.2 -3.7 -13.05 -6.05 -13.95 -8.45 -13.95 -11.4 -13.95 -13.95 -12.8 -16.1 -11.0 -19.5 -6.85 -19.5 L-3.95 -19.1 -4.2 -16.05 -4.15 -15.35 -6.6 -16.05 Q-9.25 -16.05 -10.3 -13.95 L-10.8 -11.75 Q-10.8 -6.8 -3.75 0.3 L-3.55 0.5 0.1 4.1 1.25 5.2 M-3.75 -295.55 L-3.75 -295.1 -3.4 -288.9 -4.55 -287.3 Q-11.1 -278.05 -11.1 -269.7 -11.1 -264.0 -3.0 -257.7 L-2.6 -252.8 -2.9 -253.0 Q-14.55 -260.75 -14.55 -269.75 -14.55 -274.2 -12.8 -279.05 -17.65 -271.65 -17.65 -266.9 -17.65 -261.25 -14.15 -257.95 -12.0 -255.95 -6.4 -253.5 L-2.5 -251.65 -1.7 -246.85 -1.9 -247.0 Q-3.15 -248.0 -9.25 -251.2 -14.3 -253.85 -16.6 -256.6 -19.95 -260.55 -19.95 -266.55 -19.95 -273.35 -14.1 -281.9 -10.9 -286.5 -7.2 -289.85 L-4.05 -294.1 -4.1 -294.6 -3.75 -295.55 M-9.0 -112.1 Q-9.0 -111.35 -8.3 -110.45 -8.1 -113.55 -6.95 -116.25 -9.0 -113.6 -9.0 -112.1" fill="#4d6662" fill-rule="evenodd" stroke="none"/>
  </g>
</svg>
