<?xml version="1.0" encoding="UTF-8" standalone="no"?>
<svg xmlns:xlink="http://www.w3.org/1999/xlink" height="302.9px" width="401.6px" xmlns="http://www.w3.org/2000/svg">
  <g transform="matrix(1.0, 0.0, 0.0, 1.0, 0.6, 1.85)">
    <path d="M396.1 4.9 L2.9 4.9 9.75 295.55 396.1 292.75 396.1 4.9 M401.0 -1.85 L401.0 301.05 -0.6 301.05 -0.6 -1.85 401.0 -1.85" fill="#000000" fill-rule="evenodd" stroke="none"/>
  </g>
</svg>
