<?xml version="1.0" encoding="UTF-8" standalone="no"?>
<svg xmlns:xlink="http://www.w3.org/1999/xlink" height="51.15px" width="76.55px" xmlns="http://www.w3.org/2000/svg">
  <g transform="matrix(1.0, 0.0, 0.0, 1.0, 35.25, 57.7)">
    <path d="M-34.25 -10.65 L41.3 -6.55 5.25 -53.9 -34.25 -10.65" fill="url(#gradient0)" fill-rule="evenodd" stroke="none">
      <animate attributeName="d" dur="2s" repeatCount="indefinite" values="M-34.25 -10.65 L41.3 -6.55 5.25 -53.9 -34.25 -10.65;M-35.25 -17.35 L36.05 -12.75 5.25 -57.7 -35.25 -17.35"/>
    </path>
    <path d="M-34.25 -10.65 L5.25 -53.9 41.3 -6.55 -34.25 -10.65" fill="none" stroke="#000000" stroke-linecap="round" stroke-linejoin="round" stroke-opacity="0.0" stroke-width="1.0">
      <animate attributeName="stroke" dur="2s" repeatCount="indefinite" values="#000000;#000001"/>
      <animate attributeName="stroke-width" dur="2s" repeatCount="indefinite" values="0.0;0.0"/>
      <animate attributeName="fill-opacity" dur="2s" repeatCount="indefinite" values="0.0;0.0"/>
      <animate attributeName="d" dur="2s" repeatCount="indefinite" values="M-34.25 -10.65 L5.25 -53.9 41.3 -6.55 -34.25 -10.65;M-35.25 -17.35 L5.25 -57.7 36.05 -12.75 -35.25 -17.35"/>
    </path>
  </g>
  <defs>
    <linearGradient gradientTransform="matrix(-0.0038, -0.0738, 0.1054, -0.0108, 43.05, -35.6)" gradientUnits="userSpaceOnUse" id="gradient0" spreadMethod="pad" x1="-819.2" x2="819.2">
      <animateTransform additive="replace" attributeName="gradientTransform" dur="2s" from="1" repeatCount="indefinite" to="1" type="scale"/>
      <animateTransform additive="sum" attributeName="gradientTransform" dur="2s" from="43.05 -35.6" repeatCount="indefinite" to="45.6 -29.4" type="translate"/>
      <animateTransform additive="sum" attributeName="gradientTransform" dur="2s" from="-92.9593" repeatCount="indefinite" to="-92.7679" type="rotate"/>
      <animateTransform additive="sum" attributeName="gradientTransform" dur="2s" from="0.0739 0.1059" repeatCount="indefinite" to="0.067 0.1059" type="scale"/>
      <animateTransform additive="sum" attributeName="gradientTransform" dur="2s" from="4.126" repeatCount="indefinite" to="5.4833" type="skewX"/>
      <stop offset="0.0" stop-color="#e35202">
        <animate attributeName="offset" dur="2s" repeatCount="indefinite" values="0.0;0.0"/>
        <animate attributeName="stop-color" dur="2s" repeatCount="indefinite" values="#e35202;#e35203"/>
        <animate attributeName="stop-opacity" dur="2s" repeatCount="indefinite" values="1.0;1.0"/>
      </stop>
      <stop offset="0.36470588235294116" stop-color="#ed8e02">
        <animate attributeName="offset" dur="2s" repeatCount="indefinite" values="0.36470588235294116;0.36470588235294116"/>
        <animate attributeName="stop-color" dur="2s" repeatCount="indefinite" values="#ed8e02;#ed8e03"/>
        <animate attributeName="stop-opacity" dur="2s" repeatCount="indefinite" values="1.0;1.0"/>
      </stop>
      <stop offset="0.6980392156862745" stop-color="#ede102">
        <animate attributeName="offset" dur="2s" repeatCount="indefinite" values="0.6980392156862745;0.6980392156862745"/>
        <animate attributeName="stop-color" dur="2s" repeatCount="indefinite" values="#ede102;#ede103"/>
        <animate attributeName="stop-opacity" dur="2s" repeatCount="indefinite" values="1.0;1.0"/>
      </stop>
      <stop offset="1.0" stop-color="#fefda3">
        <animate attributeName="offset" dur="2s" repeatCount="indefinite" values="1.0;1.0"/>
        <animate attributeName="stop-color" dur="2s" repeatCount="indefinite" values="#fefda3;#fefda4"/>
        <animate attributeName="stop-opacity" dur="2s" repeatCount="indefinite" values="1.0;1.0"/>
      </stop>
    </linearGradient>
  </defs>
</svg>
