<?xml version="1.0" encoding="UTF-8" standalone="no"?>
<svg xmlns:xlink="http://www.w3.org/1999/xlink" height="46.9px" width="77.45px" xmlns="http://www.w3.org/2000/svg">
  <g transform="matrix(1.0, 0.0, 0.0, 1.0, 38.7, 23.45)">
    <path d="M-30.4 -18.3 L-30.0 -18.35 Q-29.1 -18.45 -28.2 -18.9 L-28.1 -18.85 -28.0 -18.25 -28.3 -18.15 -30.35 -17.4 -30.15 -17.05 Q-30.15 -15.15 -30.65 -13.85 -31.35 -12.15 -32.75 -12.15 L-33.05 -12.2 -32.75 -12.65 -32.7 -12.8 -32.6 -13.0 -32.7 -12.8 -32.75 -12.65 -33.05 -12.2 -33.05 -12.05 -32.8 -11.95 -32.45 -11.8 -31.4 -12.0 Q-31.1 -12.15 -30.85 -12.4 L-30.85 -9.95 Q-30.95 -9.6 -33.0 -8.85 L-33.85 -8.55 -31.6 -9.9 -31.95 -10.9 Q-32.0 -11.25 -32.5 -11.25 L-32.8 -11.25 -32.85 -11.25 -35.65 -10.5 Q-37.3 -9.85 -38.3 -9.05 L-37.35 -7.7 -36.3 -6.5 -35.9 -6.1 -35.3 -5.4 -36.0 -5.85 -38.2 -7.3 -38.35 -7.45 -38.35 -7.5 -38.5 -7.75 -38.5 -7.8 -38.55 -7.9 -38.65 -8.85 -38.7 -9.45 -38.7 -9.5 Q-38.65 -10.65 -36.8 -11.25 L-33.9 -11.75 -33.8 -11.75 -33.6 -13.0 -33.8 -13.05 -34.2 -13.1 -34.55 -13.2 -37.4 -12.75 -38.6 -11.3 -38.7 -11.1 -38.7 -11.8 -38.7 -12.4 -38.6 -12.5 -38.25 -13.1 -38.0 -13.25 Q-36.95 -14.5 -35.9 -14.5 L-33.9 -14.2 -33.45 -14.05 -33.25 -14.1 -32.85 -14.15 -32.85 -15.6 Q-33.35 -16.35 -34.75 -16.6 L-35.45 -16.7 -35.8 -16.7 Q-37.3 -16.15 -38.05 -15.45 L-38.7 -14.65 -38.65 -15.75 Q-37.65 -17.05 -36.7 -17.25 L-34.25 -17.3 -33.15 -17.15 -33.15 -18.6 -34.95 -18.95 -35.5 -19.0 -36.5 -19.15 -37.8 -18.45 -38.55 -17.85 -38.5 -18.55 -38.45 -18.65 Q-37.25 -19.85 -35.35 -20.0 L-35.2 -20.0 -34.1 -19.8 -32.7 -19.2 -32.7 -19.75 -33.0 -20.9 -31.15 -20.65 Q-31.05 -19.65 -30.4 -18.3 L-30.8 -18.2 -30.4 -18.3 M-31.9 -17.9 L-30.8 -18.2 -34.4 -19.25 -34.45 -19.25 Q-34.4 -19.2 -33.65 -18.9 L-32.6 -18.4 -32.45 -18.3 -31.9 -17.9 -32.25 -17.8 Q-32.05 -17.6 -31.9 -16.25 -32.05 -17.6 -32.25 -17.8 L-31.9 -17.9 M-31.9 -15.4 L-31.85 -15.9 -31.9 -16.25 -32.7 -16.5 -33.0 -16.6 -34.75 -16.9 -34.9 -16.9 -33.25 -16.2 -32.75 -15.95 -31.9 -15.4 -32.35 -13.75 -32.35 -13.7 -32.4 -13.6 -32.35 -13.7 -32.35 -13.75 -31.9 -15.4 M-32.6 -13.0 L-32.4 -13.6 -34.5 -13.75 -35.6 -13.4 -32.75 -13.0 -32.6 -13.0" fill="#d2b6b6" fill-rule="evenodd" stroke="none"/>
    <path d="M-30.8 -18.2 L-31.9 -17.9 -32.45 -18.3 -32.6 -18.4 -33.65 -18.9 Q-34.4 -19.2 -34.45 -19.25 L-34.4 -19.25 -30.8 -18.2 M-31.9 -16.25 L-31.85 -15.9 -31.9 -15.4 -32.75 -15.95 -33.25 -16.2 -34.9 -16.9 -34.75 -16.9 -33.0 -16.6 -32.7 -16.5 -31.9 -16.25 M-32.4 -13.6 L-32.6 -13.0 -32.75 -13.0 -35.6 -13.4 -34.5 -13.75 -32.4 -13.6 M-33.05 -12.2 L-32.75 -12.15 Q-31.35 -12.15 -30.65 -13.85 -30.15 -15.15 -30.15 -17.05 L-30.35 -17.4 -28.3 -18.15 -28.0 -18.25 -27.75 -17.2 -27.55 -16.5 -27.4 -16.15 -27.2 -14.5 -26.95 -13.5 -26.75 -12.65 -26.85 -12.2 -27.35 -10.9 -27.85 -9.35 -27.95 -9.1 -28.35 -7.5 -28.4 -7.4 -28.6 -6.65 -29.3 -5.2 -29.45 -4.85 -29.8 -4.3 Q-30.2 -3.7 -30.75 -3.7 L-33.15 -4.5 -33.2 -4.55 -33.15 -4.5 -33.2 -4.5 -33.2 -4.55 -33.25 -4.65 -33.55 -4.7 -33.8 -4.75 -34.45 -4.95 -33.8 -4.75 -34.2 -4.85 -34.45 -4.95 -35.3 -5.4 -35.9 -6.1 -36.3 -6.5 -37.35 -7.7 -38.3 -9.05 Q-37.3 -9.85 -35.65 -10.5 L-32.85 -11.25 -32.8 -11.25 -32.5 -11.25 Q-32.0 -11.25 -31.95 -10.9 L-31.6 -9.9 -33.85 -8.55 -34.9 -8.25 -35.55 -8.45 -35.65 -8.45 -36.1 -8.8 -36.55 -8.8 Q-36.55 -8.3 -36.05 -7.8 -35.6 -7.25 -35.15 -7.25 L-33.8 -7.45 -33.65 -7.45 Q-32.3 -7.8 -31.0 -8.9 L-30.1 -9.45 -28.65 -9.8 -29.2 -10.45 -29.45 -11.15 -29.45 -11.35 -29.4 -11.95 -29.25 -12.25 -29.3 -12.5 -29.05 -13.4 -28.15 -15.3 -28.5 -15.3 -28.75 -15.3 -28.4 -15.75 -29.05 -15.5 -29.3 -16.7 Q-29.65 -16.55 -29.95 -15.15 L-30.15 -13.6 -30.15 -13.4 -30.25 -13.4 -30.4 -13.05 -30.85 -12.4 Q-31.1 -12.15 -31.4 -12.0 L-32.45 -11.8 -32.8 -11.95 -33.05 -12.05 -33.05 -12.2 M-30.15 -13.6 L-30.25 -13.4 -30.15 -13.6" fill="#c29c9c" fill-rule="evenodd" stroke="none"/>
    <path d="M-30.15 -13.6 L-29.95 -15.15 Q-29.65 -16.55 -29.3 -16.7 L-29.05 -15.5 -28.4 -15.75 -28.75 -15.3 -28.5 -15.3 -28.15 -15.3 -29.05 -13.4 -29.3 -12.5 -29.25 -12.25 -29.4 -11.95 -29.45 -11.35 -29.45 -11.15 -29.2 -10.45 -28.65 -9.8 -30.1 -9.45 -31.0 -8.9 Q-32.3 -7.8 -33.65 -7.45 L-33.8 -7.45 -35.15 -7.25 Q-35.6 -7.25 -36.05 -7.8 -36.55 -8.3 -36.55 -8.8 L-36.1 -8.8 -35.65 -8.45 -35.55 -8.45 -34.9 -8.25 -33.85 -8.55 -33.0 -8.85 Q-30.95 -9.6 -30.85 -9.95 L-30.85 -12.4 -30.4 -13.05 -30.25 -13.4 -30.15 -13.4 -30.15 -13.6 -29.55 -14.65 -29.4 -14.8 -28.75 -15.3 -29.4 -14.8 -29.55 -14.65 -30.15 -13.6 M-29.55 -14.65 L-29.8 -11.95 -29.45 -11.35 -29.8 -11.95 -29.55 -14.65 M-34.9 -8.25 Q-35.4 -8.15 -35.65 -8.45 -35.4 -8.15 -34.9 -8.25" fill="#b38484" fill-rule="evenodd" stroke="none"/>
    <path d="M-33.5 -4.5 L-33.55 -4.65 -33.25 -4.65 -33.2 -4.55 -33.55 -4.65 -33.2 -4.55 -33.2 -4.5 -33.5 -4.5 M-38.7 -9.5 L-38.7 -11.1 -38.6 -11.3 -37.4 -12.75 -34.55 -13.2 -34.2 -13.1 -33.8 -13.05 -33.6 -13.0 -33.8 -11.75 -33.9 -11.75 -36.8 -11.25 Q-38.65 -10.65 -38.7 -9.5 M-38.7 -12.4 L-38.7 -14.6 -38.7 -14.65 -38.05 -15.45 Q-37.3 -16.15 -35.8 -16.7 L-35.45 -16.7 -34.75 -16.6 Q-33.35 -16.35 -32.85 -15.6 L-32.85 -14.15 -33.25 -14.1 -33.45 -14.05 -33.9 -14.2 -35.9 -14.5 Q-36.95 -14.5 -38.0 -13.25 L-38.25 -13.1 -38.6 -12.5 -38.7 -12.4 M-38.65 -15.75 L-38.55 -17.85 -37.8 -18.45 -36.5 -19.15 -35.5 -19.0 -34.95 -18.95 -33.15 -18.6 -33.15 -17.15 -34.25 -17.3 -36.7 -17.25 Q-37.65 -17.05 -38.65 -15.75 M-38.45 -18.65 L-38.45 -19.0 -38.65 -20.25 -36.8 -22.4 -33.8 -21.15 -33.15 -20.95 -33.0 -20.9 -32.7 -19.75 -32.7 -19.2 -34.1 -19.8 -35.2 -20.0 -35.35 -20.0 Q-37.25 -19.85 -38.45 -18.65 M-28.75 -5.4 L-28.7 -5.35 -28.95 -5.15 -28.75 -5.4" fill="#e0cbcb" fill-rule="evenodd" stroke="none"/>
    <path d="M-28.6 -6.65 L-28.65 -6.4 -26.7 -2.75 -23.25 2.4 -21.0 5.65 -18.95 8.55 Q-17.65 10.45 -17.35 12.8 -17.1 15.1 -17.9 17.05 L-20.7 19.45 -22.4 19.3 -22.6 18.95 Q-24.15 17.75 -25.4 16.0 L-27.4 12.8 -28.75 9.7 -30.0 6.4 -30.95 3.6 -31.2 2.9 -32.35 -0.8 -33.35 -3.95 -33.5 -4.5 -33.2 -4.5 -33.15 -4.5 -30.75 -3.7 Q-30.2 -3.7 -29.8 -4.3 L-29.45 -4.85 -29.3 -5.2 -28.6 -6.65 M-28.75 -5.4 L-28.95 -5.15 -28.7 -5.35 -28.75 -5.4" fill="url(#gradient0)" fill-rule="evenodd" stroke="none"/>
    <path d="M-28.0 -18.25 L-28.1 -18.85 -28.2 -18.9 Q-29.1 -18.45 -30.0 -18.35 L-30.4 -18.3 -30.8 -18.2 -31.9 -17.9 -32.25 -17.8 Q-32.05 -17.6 -31.9 -16.25 L-31.85 -15.9 -31.9 -15.4 -32.35 -13.75 -32.35 -13.7 -32.4 -13.6 -32.6 -13.0 -32.7 -12.8 -32.75 -12.65 -33.05 -12.2 -33.05 -12.05 -32.8 -11.95 -32.45 -11.8 -31.4 -12.0 Q-31.1 -12.15 -30.85 -12.4 L-30.85 -9.95 Q-30.95 -9.6 -33.0 -8.85 L-33.85 -8.55 M-28.0 -18.25 L-27.75 -17.2 -27.55 -16.5 -27.4 -16.15 -27.2 -14.5 -26.95 -13.5 -26.75 -12.65 -26.85 -12.2 -27.35 -10.9 -27.85 -9.35 -27.95 -9.1 -28.35 -7.5 -28.4 -7.4 -28.6 -6.65 -28.65 -6.4 -26.7 -2.75 -23.25 2.4 -21.0 5.65 -18.95 8.55 Q-17.65 10.45 -17.35 12.8 -17.1 15.1 -17.9 17.05 L-20.7 19.45 -22.4 19.3 -22.6 18.95 Q-24.15 17.75 -25.4 16.0 L-27.4 12.8 -28.75 9.7 -30.0 6.4 -30.95 3.6 -31.2 2.9 -32.35 -0.8 -33.35 -3.95 -33.5 -4.5 -33.55 -4.65 -33.7 -4.7 -33.6 -4.7 -33.8 -4.75 M-34.2 -4.85 L-34.45 -4.95 -35.3 -5.4 -36.0 -5.85 -38.2 -7.3 -38.35 -7.45 -38.35 -7.5 -38.5 -7.75 M-38.7 -9.5 L-38.7 -11.1 -38.7 -11.8 M-38.7 -12.4 L-38.7 -14.6 -38.7 -14.65 -38.65 -15.75 -38.55 -17.85 -38.5 -18.55 -38.45 -18.65 -38.45 -19.0 -38.65 -20.25 -36.8 -22.4 -33.8 -21.15 -33.15 -20.95 M-33.0 -20.9 L-31.15 -20.65 Q-31.05 -19.65 -30.4 -18.3 M-34.9 -8.25 L-33.85 -8.55 M-30.15 -13.6 L-29.55 -14.65 -29.4 -14.8 -28.75 -15.3 M-30.25 -13.4 L-30.4 -13.05 -30.85 -12.4 M-30.25 -13.4 L-30.15 -13.6 M-33.2 -4.55 L-33.15 -4.5 M-33.6 -4.7 L-33.55 -4.65 -33.55 -4.7 -33.6 -4.7 M-33.25 -4.65 L-33.55 -4.65 -33.2 -4.55 M-34.45 -4.95 L-33.8 -4.75 M-35.65 -8.45 Q-35.4 -8.15 -34.9 -8.25 M-29.45 -11.35 L-29.8 -11.95 -29.55 -14.65" fill="none" stroke="#8f5555" stroke-linecap="round" stroke-linejoin="round" stroke-opacity="0.5254902" stroke-width="0.05"/>
    <path d="M34.6 -22.55 Q34.8 -21.6 35.75 -21.3 L36.5 -21.25 34.95 -17.45 34.7 -16.85 34.4 -17.0 33.9 -16.65 33.25 -16.2 33.65 -17.15 33.55 -17.15 33.7 -17.3 33.9 -17.7 34.3 -17.95 34.9 -18.6 35.55 -20.25 34.75 -20.6 34.55 -20.7 34.6 -20.9 34.6 -21.7 34.6 -22.55 M36.65 -18.9 L37.65 -18.45 37.9 -18.3 37.15 -17.1 36.35 -18.15 36.4 -18.3 36.65 -18.9 M25.45 -16.95 L25.1 -18.35 24.75 -20.0 26.85 -20.95 29.25 -21.8 29.45 -22.25 29.5 -22.35 31.95 -22.75 32.05 -22.8 33.75 -23.25 32.2 -17.1 31.0 -16.85 31.15 -17.2 Q31.75 -17.8 32.05 -18.85 L32.85 -21.6 31.55 -21.4 31.55 -22.15 30.25 -22.15 30.2 -22.15 30.2 -22.1 29.25 -21.8 30.2 -22.1 30.1 -21.55 30.05 -21.4 27.65 -20.65 26.35 -20.05 26.25 -20.0 26.2 -17.2 26.05 -17.15 25.45 -16.95 M37.0 -16.9 L36.2 -15.55 36.0 -15.8 34.8 -14.9 34.7 -15.0 35.5 -16.35 35.55 -16.3 36.0 -16.5 37.0 -16.9" fill="#d2b6b6" fill-rule="evenodd" stroke="none"/>
    <path d="M34.6 -22.55 L34.6 -21.7 34.6 -20.9 34.55 -20.7 34.2 -19.0 34.05 -18.3 33.9 -17.7 33.7 -17.3 33.55 -17.15 33.65 -17.15 33.25 -16.2 33.9 -16.65 34.4 -17.0 34.7 -16.85 34.95 -17.45 36.5 -21.25 36.7 -21.25 37.0 -21.25 37.0 -19.75 36.65 -18.9 36.4 -18.3 36.35 -18.15 35.85 -17.0 35.5 -16.35 34.7 -15.0 34.8 -14.9 36.0 -15.8 36.2 -15.55 37.0 -16.9 37.15 -17.1 37.9 -18.3 37.95 -18.3 38.35 -18.05 38.75 -17.8 38.35 -17.2 37.1 -15.55 36.65 -15.0 35.5 -13.35 35.4 -13.4 Q33.75 -13.85 33.5 -14.0 L31.55 -14.7 30.25 -15.0 Q28.7 -15.0 26.05 -13.55 23.2 -11.95 23.05 -10.3 L25.3 -9.8 26.0 -9.75 26.75 -10.05 26.75 -9.8 26.6 -7.0 Q26.55 -1.05 26.85 2.35 L27.05 9.15 26.95 13.85 26.85 15.95 Q26.75 16.75 26.25 17.55 L25.65 18.5 24.1 20.75 23.4 21.55 21.85 22.9 21.3 23.15 19.6 23.45 19.05 23.45 Q16.2 19.9 15.85 15.55 15.6 12.9 16.6 10.2 L19.65 0.95 Q21.05 -3.6 20.95 -8.45 L20.95 -9.95 20.9 -10.35 20.8 -11.15 20.8 -11.3 20.8 -11.45 Q20.55 -13.25 22.1 -14.65 L24.35 -16.45 25.45 -16.95 26.05 -17.15 26.2 -17.2 26.8 -17.4 26.9 -17.45 28.05 -17.8 28.1 -17.85 28.15 -17.85 29.6 -18.1 29.6 -18.15 30.05 -21.4 30.1 -21.55 30.2 -22.1 30.25 -22.15 30.2 -22.1 30.2 -22.15 30.25 -22.15 31.55 -22.15 31.55 -21.4 31.55 -21.35 31.55 -21.05 Q31.25 -20.35 31.3 -19.25 L31.35 -17.9 31.15 -17.2 31.0 -16.85 32.2 -17.1 33.75 -23.25 33.9 -23.3 34.4 -23.45 34.6 -22.55 M35.35 -13.1 L35.25 -12.95 34.8 -12.9 35.35 -13.1" fill="url(#gradient1)" fill-rule="evenodd" stroke="none"/>
    <path d="M34.55 -20.7 L34.75 -20.6 35.55 -20.25 34.9 -18.6 34.3 -17.95 33.9 -17.7 34.05 -18.3 34.2 -19.0 34.55 -20.7 M31.15 -17.2 L31.35 -17.9 31.3 -19.25 Q31.25 -20.35 31.55 -21.05 L31.55 -21.35 31.55 -21.4 32.85 -21.6 32.05 -18.85 Q31.75 -17.8 31.15 -17.2 M30.05 -21.4 L29.6 -18.15 29.6 -18.1 28.15 -17.85 28.1 -17.85 28.1 -18.05 28.4 -18.75 28.85 -19.4 28.85 -19.5 28.1 -18.85 27.45 -19.1 Q26.9 -19.35 26.7 -19.55 L26.65 -19.55 Q26.65 -19.2 27.55 -18.45 L27.1 -18.15 26.7 -17.65 26.8 -17.4 26.2 -17.2 26.25 -20.0 26.35 -20.05 27.65 -20.65 30.05 -21.4 M35.5 -16.35 L35.85 -17.0 36.35 -18.15 37.15 -17.1 37.0 -16.9 36.0 -16.5 35.55 -16.3 35.5 -16.35" fill="#c29c9c" fill-rule="evenodd" stroke="none"/>
    <path d="M35.5 -13.35 L35.35 -13.1 34.8 -12.9 28.85 -10.8 27.25 -10.25 26.9 -10.1 26.75 -10.35 26.75 -10.05 26.0 -9.75 25.3 -9.8 23.05 -10.3 Q23.2 -11.95 26.05 -13.55 28.7 -15.0 30.25 -15.0 L31.55 -14.7 33.5 -14.0 Q33.75 -13.85 35.4 -13.4 L35.5 -13.35" fill="#d4b8b8" fill-rule="evenodd" stroke="none"/>
    <path d="M28.1 -17.85 L28.05 -17.8 26.9 -17.45 26.8 -17.4 26.7 -17.65 27.1 -18.15 27.55 -18.45 Q26.65 -19.2 26.65 -19.55 L26.7 -19.55 Q26.9 -19.35 27.45 -19.1 L28.1 -18.85 28.85 -19.5 28.85 -19.4 28.4 -18.75 28.1 -18.05 28.1 -17.85" fill="#b38484" fill-rule="evenodd" stroke="none"/>
    <path d="M36.5 -21.25 L35.75 -21.3 Q34.8 -21.6 34.6 -22.55 L34.6 -21.7 34.6 -20.9 M36.7 -21.25 L37.0 -21.25 37.0 -19.75 36.65 -18.9 37.65 -18.45 37.9 -18.3 M37.95 -18.3 L38.35 -18.05 38.75 -17.8 38.35 -17.2 37.1 -15.55 36.65 -15.0 35.5 -13.35 35.35 -13.1 35.25 -12.95 34.8 -12.9 28.85 -10.8 27.25 -10.25 26.9 -10.1 26.75 -10.05 26.75 -9.8 26.6 -7.0 Q26.55 -1.05 26.85 2.35 L27.05 9.15 26.95 13.85 26.85 15.95 Q26.75 16.75 26.25 17.55 L25.65 18.5 24.1 20.75 23.4 21.55 21.85 22.9 21.3 23.15 19.6 23.45 19.05 23.45 Q16.2 19.9 15.85 15.55 15.6 12.9 16.6 10.2 L19.65 0.95 Q21.05 -3.6 20.95 -8.45 L20.95 -9.95 20.9 -10.35 20.8 -11.15 20.8 -11.3 20.8 -11.45 Q20.55 -13.25 22.1 -14.65 L24.35 -16.45 25.45 -16.95 25.1 -18.35 24.75 -20.0 26.85 -20.95 29.25 -21.8 29.45 -22.25 29.5 -22.35 31.95 -22.75 32.05 -22.8 33.75 -23.25 M33.9 -23.3 L34.4 -23.45 34.6 -22.55 M31.15 -17.2 L31.35 -17.9 31.3 -19.25 Q31.25 -20.35 31.55 -21.05 L31.55 -21.35 M31.55 -21.4 L31.55 -22.15 30.25 -22.15 30.2 -22.1 M28.05 -17.8 L26.9 -17.45 26.8 -17.4 26.2 -17.2 M26.05 -17.15 L25.45 -16.95 M33.9 -17.7 L34.05 -18.3 34.2 -19.0 34.55 -20.7 M35.5 -16.35 L35.85 -17.0 36.35 -18.15 M36.4 -18.3 L36.65 -18.9 M35.35 -13.1 L34.8 -12.9 M29.25 -21.8 L30.2 -22.1 M26.75 -10.05 L26.0 -9.75 25.3 -9.8" fill="none" stroke="#8f5555" stroke-linecap="round" stroke-linejoin="round" stroke-opacity="0.5254902" stroke-width="0.05"/>
  </g>
  <defs>
    <radialGradient cx="0" cy="0" fx="-1424.0" fy="0" gradientTransform="matrix(0.0126, -0.0062, 0.0102, 0.0208, -26.25, 6.05)" gradientUnits="userSpaceOnUse" id="gradient0" r="819.2" spreadMethod="pad">
      <stop offset="0.0" stop-color="#c29c9c"/>
      <stop offset="1.0" stop-color="#e0cdcd"/>
    </radialGradient>
    <radialGradient cx="0" cy="0" fx="-966.4000000000001" fy="0" gradientTransform="matrix(-0.015, 0.0276, -0.0297, -0.0161, 25.35, -0.3)" gradientUnits="userSpaceOnUse" id="gradient1" r="819.2" spreadMethod="pad">
      <stop offset="0.0" stop-color="#e0cbcb"/>
      <stop offset="1.0" stop-color="#c09999"/>
    </radialGradient>
  </defs>
</svg>
