<?xml version="1.0" encoding="UTF-8" standalone="no"?>
<svg xmlns:xlink="http://www.w3.org/1999/xlink" height="340.95px" width="184.0px" xmlns="http://www.w3.org/2000/svg">
  <g transform="matrix(1.0, 0.0, 0.0, 1.0, -8.0, -8.0)">
    <path d="M8.0 348.95 L8.0 8.0 192.0 8.0 192.0 348.95 8.0 348.95" fill="#1a1611" fill-opacity="0.12941177" fill-rule="evenodd" stroke="none"/>
  </g>
</svg>
