<?xml version="1.0" encoding="UTF-8" standalone="no"?>
<svg xmlns:xlink="http://www.w3.org/1999/xlink" height="13.0px" width="13.0px" xmlns="http://www.w3.org/2000/svg">
  <g transform="matrix(1.0, 0.0, 0.0, 1.0, 6.0, 8.0)">
    <pattern height="13" id="PatternID_91_1" overflow="visible" patternTransform="matrix(1.0, 0.0, 0.0, 1.0, -6.0, -8.0)" patternUnits="userSpaceOnUse" viewBox="0 0 13 13" width="13">
      <image height="13" width="13" xlink:href="data:image/PNG;base64,iVBORw0KGgoAAAANSUhEUgAAAA0AAAANCAYAAABy6+R8AAAAnklEQVR42mNgwAL+/5/5H4YZiAEghQ7+iv/tfBXANEGNIAUgxXmVdmDFIBrEx6kRpgGmaP/luP8wMXs/HDbCFIDoltXqcIwsjtOWI9eTUDSB+MguwGrL0kNucBtANIiPYRuIYe8HEWhdrQHXAMMgPkgcWR1ev+D0GzIHFGIwRTBngjBySKJogsUNCMM8D6JhYhhxhhx6+DDWYCeEYWoB0EFb0iAHJXsAAAAASUVORK5CYII="/>
    </pattern>
    <path d="M-6.0 -8.0 L7.0 -8.0 7.0 5.0 -6.0 5.0 -6.0 -8.0" style="fill:url(#PatternID_91_1)"/>
  </g>
</svg>
