<?xml version="1.0" encoding="UTF-8" standalone="no"?>
<svg xmlns:xlink="http://www.w3.org/1999/xlink" height="277.45px" width="187.5px" xmlns="http://www.w3.org/2000/svg">
  <g transform="matrix(1.0, 0.0, 0.0, 1.0, 206.0, 203.0)">
    <path d="M-159.6 -53.6 L-162.65 -46.8 -170.8 -41.55 Q-179.2 -36.45 -182.15 -36.1 L-183.95 -36.3 -184.2 -36.35 -186.2 -36.6 Q-187.15 -36.5 -187.25 -35.75 -185.75 -34.4 -182.7 -33.55 L-179.9 -32.95 Q-179.3 -33.0 -177.45 -33.95 -175.7 -34.75 -171.55 -35.1 -169.35 -35.3 -164.05 -36.65 L-157.9 -38.25 -158.3 -37.7 -159.95 -35.5 -161.6 -32.85 -163.15 -31.4 -163.2 -31.3 -163.25 -31.3 -163.2 -31.3 Q-163.75 -29.65 -165.2 -27.55 -167.9 -23.4 -171.2 -21.4 -169.65 -21.6 -165.8 -23.1 L-161.95 -24.65 -161.95 -24.8 -161.85 -24.65 -160.9 -25.15 Q-165.1 -17.75 -179.95 -11.1 L-186.85 -8.15 -187.15 -8.05 -190.25 -8.05 -192.0 -8.2 -194.0 -8.35 -194.05 -8.2 -194.3 -8.9 Q-194.45 -10.0 -192.0 -10.4 L-185.55 -11.1 -181.55 -13.75 Q-178.7 -15.2 -176.45 -16.5 L-175.55 -17.3 -169.25 -24.8 -163.25 -31.3 -163.05 -31.55 -161.6 -34.35 -162.7 -33.9 -162.8 -33.85 -166.2 -32.3 Q-169.2 -30.9 -170.25 -30.75 -174.25 -30.3 -180.6 -32.2 -182.25 -32.65 -183.7 -33.2 -190.0 -33.45 -194.65 -36.65 -198.05 -39.0 -200.6 -42.5 L-199.8 -43.8 Q-197.3 -41.35 -194.65 -39.9 -189.7 -37.2 -182.6 -38.1 -173.9 -39.15 -165.0 -47.7 -161.95 -50.7 -159.6 -53.6 M-72.1 -62.0 L-72.35 -62.5 -72.65 -63.45 -72.95 -63.65 Q-75.05 -67.5 -78.05 -69.75 L-86.0 -75.95 -83.85 -75.45 Q-81.45 -74.65 -74.2 -70.65 -57.5 -61.4 -52.2 -62.05 -41.0 -63.45 -31.0 -69.0 -22.95 -74.25 -21.65 -74.45 -20.15 -74.6 -19.25 -73.4 -18.7 -72.65 -18.6 -71.9 -17.75 -67.0 -26.25 -62.45 -28.0 -60.6 -30.75 -58.45 -36.5 -53.8 -40.7 -52.25 L-52.75 -53.0 -53.0 -53.0 -51.45 -53.6 Q-45.0 -56.05 -42.4 -57.45 -37.6 -59.95 -37.95 -61.9 L-38.05 -62.35 -38.4 -62.85 Q-39.3 -63.75 -41.45 -63.45 L-46.05 -62.15 Q-49.2 -61.1 -51.95 -60.75 -64.45 -59.25 -71.6 -61.85 L-72.1 -62.0 M-38.65 -52.1 L-38.35 -52.1 -33.15 -51.65 -26.75 -52.3 Q-23.55 -52.7 -22.35 -52.25 -20.75 -51.65 -20.35 -49.35 -20.15 -48.15 -24.55 -45.6 L-29.3 -45.2 -37.2 -44.9 -50.0 -45.5 -49.95 -45.7 -43.7 -46.3 Q-37.4 -47.25 -34.3 -48.05 L-34.7 -48.0 -36.25 -48.3 -47.3 -50.45 -38.65 -52.1 M-55.0 -37.35 Q-52.1 -36.15 -47.2 -34.6 -43.15 -33.2 -41.4 -31.55 -43.65 -32.9 -48.75 -33.8 -58.35 -35.4 -60.45 -37.75 L-59.85 -37.95 -58.7 -37.15 -56.3 -36.95 Q-55.7 -37.0 -55.3 -37.2 L-55.0 -37.35 M-40.35 -27.9 L-40.5 -27.45 -40.65 -27.7 -40.35 -27.9 M-65.85 -29.2 Q-65.15 -27.3 -63.75 -24.95 L-61.6 -21.2 Q-61.35 -19.8 -62.2 -18.8 -62.95 -17.95 -64.4 -17.75 L-65.0 -17.75 -71.55 -26.9 -71.95 -29.3 -71.2 -29.4 -68.8 -27.95 Q-67.15 -27.0 -66.55 -25.95 L-66.6 -26.35 -67.65 -28.8 -68.6 -30.85 -68.25 -30.95 -65.85 -29.2 M-150.3 -18.4 L-147.95 -20.65 -147.65 -20.55 -151.4 -14.6 Q-150.65 -14.7 -147.1 -17.0 L-143.4 -19.4 Q-147.95 -12.05 -156.0 -1.75 L-158.1 0.9 Q-160.15 2.0 -161.6 2.2 -162.8 2.3 -163.25 1.7 L-163.45 0.95 -158.55 -6.25 Q-154.35 -12.4 -151.3 -17.55 L-150.85 -17.95 -150.3 -18.4 M-143.9 -4.8 L-144.1 -5.0 -136.15 -13.35 -126.9 -22.85 -126.8 -14.7 Q-130.5 -7.95 -132.85 -7.65 -135.65 -7.3 -136.55 -9.0 L-136.6 -9.2 Q-138.3 -6.8 -140.35 -4.7 L-141.55 -5.4 -141.8 -5.95 -141.6 -7.0 -143.9 -4.8" fill="#ced2d1" fill-rule="evenodd" stroke="none"/>
    <path d="M-170.8 -41.55 L-171.05 -40.4 Q-171.05 -39.9 -170.65 -39.6 -170.35 -39.35 -170.15 -39.35 -169.15 -39.35 -167.6 -40.75 L-165.85 -42.5 -166.65 -40.35 -165.75 -40.1 Q-164.45 -40.1 -161.1 -42.3 -157.05 -44.95 -154.75 -48.4 -152.1 -52.35 -148.4 -58.85 -147.85 -53.0 -147.15 -50.4 L-146.65 -48.75 -149.8 -45.85 Q-155.15 -40.75 -159.95 -35.5 L-158.3 -37.7 -157.9 -38.25 -164.05 -36.65 Q-169.35 -35.3 -171.55 -35.1 -175.7 -34.75 -177.45 -33.95 -179.3 -33.0 -179.9 -32.95 L-182.7 -33.55 Q-185.75 -34.4 -187.25 -35.75 -187.15 -36.5 -186.2 -36.6 L-184.2 -36.35 -183.95 -36.3 -182.15 -36.1 Q-179.2 -36.45 -170.8 -41.55 M-163.25 -31.3 L-163.2 -31.3 -163.15 -31.4 -163.2 -31.3 -163.25 -31.3 M-186.85 -8.15 L-186.9 -8.1 -187.15 -8.05 -186.85 -8.15 M-186.7 -7.55 Q-183.8 -7.8 -180.75 -8.7 -176.6 -9.9 -172.85 -12.1 L-174.25 -10.85 Q-175.1 -9.95 -175.25 -9.25 -167.85 -12.3 -164.3 -14.1 -158.05 -17.25 -156.25 -21.0 -159.1 -19.35 -161.25 -18.85 L-161.5 -19.1 Q-156.25 -22.3 -153.85 -25.7 -151.6 -28.95 -152.1 -32.15 L-151.95 -31.75 -151.5 -31.3 Q-149.25 -31.3 -145.9 -37.9 L-144.15 -41.6 Q-141.55 -35.7 -138.25 -32.95 L-137.6 -32.45 -138.9 -30.0 Q-139.85 -28.55 -141.0 -27.55 L-143.55 -25.35 -148.9 -20.3 -150.3 -18.4 -150.85 -17.95 -151.3 -17.55 -150.95 -18.15 Q-165.2 -6.25 -177.65 -4.75 L-181.3 -4.85 Q-181.65 -4.95 -182.7 -5.5 -180.9 -5.95 -179.0 -6.55 L-185.9 -6.75 -186.7 -7.55 M-24.55 -45.6 Q-26.35 -44.6 -28.95 -43.3 -31.75 -41.85 -33.95 -40.9 L-35.2 -40.1 -35.9 -40.05 Q-38.4 -39.0 -39.55 -38.85 L-54.8 -38.3 -54.75 -37.8 -54.85 -37.45 -55.0 -37.35 -55.3 -37.2 Q-55.7 -37.0 -56.3 -36.95 L-58.7 -37.15 -59.85 -37.95 -60.45 -37.75 Q-58.35 -35.4 -48.75 -33.8 -43.65 -32.9 -41.4 -31.55 -40.05 -30.7 -39.85 -29.65 -39.75 -29.05 -40.0 -28.4 L-40.35 -27.9 -40.65 -27.7 -40.5 -27.45 Q-41.2 -25.95 -43.45 -25.65 -45.1 -25.45 -54.55 -27.85 L-66.35 -31.05 -65.85 -29.2 -68.25 -30.95 -68.6 -30.85 -67.65 -28.8 -66.6 -26.35 -66.55 -25.95 Q-67.15 -27.0 -68.8 -27.95 L-71.2 -29.4 -71.95 -29.3 -71.55 -26.9 -65.0 -17.75 Q-69.55 -18.3 -81.5 -32.6 L-81.95 -33.1 -79.55 -35.0 -75.9 -34.15 -65.55 -32.6 Q-60.65 -31.9 -55.2 -30.0 L-49.25 -27.65 -47.9 -27.65 -47.9 -28.0 Q-50.05 -28.7 -52.6 -30.25 L-51.5 -30.0 -50.25 -29.75 -47.9 -29.75 -47.9 -30.5 Q-48.25 -30.5 -48.25 -30.8 -50.35 -31.25 -52.4 -32.0 L-56.5 -33.65 -62.05 -35.6 Q-67.1 -37.7 -67.1 -39.35 L-66.3 -40.1 -66.25 -40.3 -66.0 -40.25 -65.3 -40.6 -64.8 -40.45 -64.75 -40.35 -64.75 -40.1 -55.85 -39.5 -54.9 -39.6 -50.25 -39.85 -50.25 -40.1 -51.3 -40.45 -52.35 -40.9 -52.05 -40.9 Q-48.25 -40.0 -47.4 -41.4 L-56.8 -42.35 -69.5 -43.75 -69.5 -44.0 -62.55 -44.6 -56.5 -45.55 Q-55.8 -46.25 -52.7 -46.9 -49.55 -47.6 -49.0 -48.15 L-50.0 -49.15 -48.5 -49.15 -42.45 -48.5 -37.7 -48.15 -36.25 -48.3 -34.7 -48.0 -34.3 -48.05 Q-37.4 -47.25 -43.7 -46.3 L-49.95 -45.7 -50.0 -45.5 -37.2 -44.9 -29.3 -45.2 -24.55 -45.6 M-70.25 -50.0 L-70.05 -51.75 -70.0 -51.75 Q-66.4 -51.75 -61.2 -53.1 L-55.5 -54.85 -56.0 -56.15 -51.2 -57.0 Q-46.7 -57.85 -46.1 -58.5 -46.55 -58.95 -50.25 -60.3 L-50.0 -60.3 -42.05 -61.2 Q-39.85 -61.6 -38.05 -62.35 L-37.95 -61.9 Q-37.6 -59.95 -42.4 -57.45 -45.0 -56.05 -51.45 -53.6 L-53.0 -53.0 -52.75 -53.0 -57.45 -51.55 Q-63.4 -50.15 -70.25 -50.0 M-156.0 -1.75 L-156.0 -1.5 -155.75 -1.25 Q-154.75 -1.2 -150.9 -5.3 L-147.5 -9.25 -147.2 -9.85 -146.75 -10.85 -146.75 -10.55 -147.5 -9.25 -148.0 -8.5 -148.0 -7.25 Q-146.1 -8.05 -142.2 -13.25 -138.5 -18.15 -137.85 -20.15 -138.9 -20.15 -139.4 -19.65 L-140.75 -19.65 -140.75 -21.0 -136.05 -26.4 -133.2 -30.15 Q-128.25 -28.35 -120.65 -28.25 L-123.55 -21.45 Q-125.3 -17.5 -126.8 -14.7 L-126.9 -22.85 -136.15 -13.35 -144.1 -5.0 -143.9 -4.8 -145.3 -3.55 -145.35 -3.55 Q-149.7 0.05 -152.45 0.35 L-152.95 0.45 Q-154.9 0.5 -155.7 -0.55 L-158.1 0.9 -156.0 -1.75 M-133.25 -23.8 L-134.0 -23.8 -134.25 -23.6 -134.9 -22.25 -136.05 -19.9 -136.05 -18.85 Q-134.65 -19.45 -134.05 -20.5 L-133.25 -22.75 -133.25 -23.8 M-78.05 -61.55 L-80.25 -64.4 -81.5 -65.8 Q-79.55 -64.15 -77.95 -61.5 L-78.05 -61.55" fill="#afb3b2" fill-rule="evenodd" stroke="none"/>
    <path d="M-170.8 -41.55 L-162.65 -46.8 -159.6 -53.6 -159.2 -54.45 Q-153.7 -66.6 -149.45 -73.45 -149.0 -64.6 -148.4 -58.85 -152.1 -52.35 -154.75 -48.4 -157.05 -44.95 -161.1 -42.3 -164.45 -40.1 -165.75 -40.1 L-166.65 -40.35 -165.85 -42.5 -167.6 -40.75 Q-169.15 -39.35 -170.15 -39.35 -170.35 -39.35 -170.65 -39.6 -171.05 -39.9 -171.05 -40.4 L-170.8 -41.55 M-163.15 -31.4 L-161.6 -32.85 -159.95 -35.5 Q-155.15 -40.75 -149.8 -45.85 L-146.65 -48.75 -144.5 -42.5 -144.65 -42.25 -144.8 -41.95 -144.3 -41.95 -144.15 -41.6 -145.9 -37.9 Q-149.25 -31.3 -151.5 -31.3 L-151.95 -31.75 -152.1 -32.15 Q-151.6 -28.95 -153.85 -25.7 -156.25 -22.3 -161.5 -19.1 L-161.25 -18.85 Q-159.1 -19.35 -156.25 -21.0 -158.05 -17.25 -164.3 -14.1 -167.85 -12.3 -175.25 -9.25 -175.1 -9.95 -174.25 -10.85 L-172.85 -12.1 Q-176.6 -9.9 -180.75 -8.7 -183.8 -7.8 -186.7 -7.55 L-186.9 -8.1 -186.85 -8.15 -179.95 -11.1 Q-165.1 -17.75 -160.9 -25.15 L-161.85 -24.65 -161.95 -24.8 -161.95 -24.65 -165.8 -23.1 Q-169.65 -21.6 -171.2 -21.4 -167.9 -23.4 -165.2 -27.55 -163.75 -29.65 -163.2 -31.3 L-163.15 -31.4 M-40.7 -52.25 L-38.65 -52.1 -47.3 -50.45 -36.25 -48.3 -37.7 -48.15 -42.45 -48.5 -48.5 -49.15 -50.0 -49.15 -49.0 -48.15 Q-49.55 -47.6 -52.7 -46.9 -55.8 -46.25 -56.5 -45.55 L-62.55 -44.6 -69.5 -44.0 -69.5 -43.75 -56.8 -42.35 -47.4 -41.4 Q-48.25 -40.0 -52.05 -40.9 L-52.35 -40.9 -51.3 -40.45 -50.25 -40.1 -50.25 -39.85 -54.9 -39.6 -55.85 -39.5 -64.75 -40.1 -64.75 -40.35 -64.8 -40.45 -65.3 -40.6 -66.0 -40.25 -66.25 -40.3 -66.3 -40.1 -67.1 -39.35 Q-67.1 -37.7 -62.05 -35.6 L-56.5 -33.65 -52.4 -32.0 Q-50.35 -31.25 -48.25 -30.8 -48.25 -30.5 -47.9 -30.5 L-47.9 -29.75 -50.25 -29.75 -51.5 -30.0 -52.6 -30.25 Q-50.05 -28.7 -47.9 -28.0 L-47.9 -27.65 -49.25 -27.65 -55.2 -30.0 Q-60.65 -31.9 -65.55 -32.6 L-75.9 -34.15 -79.55 -35.0 -77.25 -37.25 Q-75.15 -39.4 -73.65 -41.65 -70.95 -45.75 -70.25 -50.0 -63.4 -50.15 -57.45 -51.55 L-52.75 -53.0 -40.7 -52.25 M-70.05 -51.75 L-70.0 -53.05 Q-70.0 -55.25 -70.6 -57.65 L-70.15 -57.75 -70.65 -57.9 -71.95 -61.6 -72.1 -62.0 -71.6 -61.85 Q-64.45 -59.25 -51.95 -60.75 -49.2 -61.1 -46.05 -62.15 L-41.45 -63.45 Q-39.3 -63.75 -38.4 -62.85 L-38.05 -62.35 Q-39.85 -61.6 -42.05 -61.2 L-50.0 -60.3 -50.25 -60.3 Q-46.55 -58.95 -46.1 -58.5 -46.7 -57.85 -51.2 -57.0 L-56.0 -56.15 -55.5 -54.85 -61.2 -53.1 Q-66.4 -51.75 -70.0 -51.75 L-70.05 -51.75 M-133.2 -30.15 L-136.05 -26.4 -140.75 -21.0 -140.75 -19.65 -139.4 -19.65 Q-138.9 -20.15 -137.85 -20.15 -138.5 -18.15 -142.2 -13.25 -146.1 -8.05 -148.0 -7.25 L-148.0 -8.5 -147.5 -9.25 -146.75 -10.55 -146.75 -10.85 -147.2 -9.85 -147.5 -9.25 -150.9 -5.3 Q-154.75 -1.2 -155.75 -1.25 L-156.0 -1.5 -156.0 -1.75 Q-147.95 -12.05 -143.4 -19.4 L-147.1 -17.0 Q-150.65 -14.7 -151.4 -14.6 L-147.65 -20.55 -147.95 -20.65 -150.3 -18.4 -148.9 -20.3 -143.55 -25.35 -141.0 -27.55 Q-139.85 -28.55 -138.9 -30.0 L-137.6 -32.45 Q-135.75 -31.1 -133.2 -30.15 M-133.25 -23.8 L-133.25 -22.75 -134.05 -20.5 Q-134.65 -19.45 -136.05 -18.85 L-136.05 -19.9 -134.9 -22.25 -134.25 -23.6 -134.0 -23.8 -133.25 -23.8" fill="#878a89" fill-rule="evenodd" stroke="none"/>
    <path d="M-36.9 -34.2 L-36.6 -35.2 Q-35.15 -36.0 -34.9 -38.0 L-37.0 -40.35 -37.55 -40.95 -38.35 -47.35 Q-39.35 -53.1 -41.4 -52.7 -42.25 -51.9 -43.0 -50.25 -43.35 -48.25 -43.3 -45.45 -43.3 -41.1 -42.35 -35.7 L-42.0 -35.75 Q-39.2 -35.55 -36.9 -34.2 M-35.2 -38.8 L-35.1 -38.7 -34.95 -38.95 -35.15 -38.85 -35.2 -38.8 M-28.95 -36.35 L-31.25 -34.3 -33.7 -32.2 -33.85 -32.2 -33.85 -32.15 -34.1 -31.95 -33.75 -31.5 -33.55 -30.95 Q-33.4 -29.95 -33.55 -28.85 -33.6 -28.3 -33.8 -28.0 -34.4 -27.65 -35.15 -27.25 L-35.45 -27.05 Q-37.75 -26.75 -40.15 -27.1 L-40.75 -27.2 -43.3 -29.15 -43.5 -28.55 -43.5 -28.15 Q-43.4 -27.55 -38.9 -25.65 -34.25 -23.05 -33.6 -19.15 L-33.45 -16.75 Q-33.75 -14.55 -35.9 -14.0 L-36.9 -13.65 -37.4 -13.6 -37.25 -13.55 -35.9 -13.2 -33.2 -12.6 -32.75 -12.6 -31.4 -12.8 -31.0 -12.85 -28.85 -13.1 Q-25.85 -13.6 -23.7 -15.1 L-23.55 -15.3 Q-21.25 -17.05 -20.2 -20.1 -19.7 -21.35 -19.5 -22.6 L-19.0 -24.05 Q-18.65 -25.6 -18.6 -27.2 L-18.7 -27.75 -19.65 -26.9 Q-20.6 -26.2 -21.5 -25.75 L-21.6 -22.75 Q-21.75 -20.6 -22.35 -19.65 L-22.65 -19.2 Q-22.95 -18.85 -23.4 -18.75 -24.2 -18.6 -24.75 -19.7 L-25.3 -21.25 -25.2 -23.95 -25.0 -25.95 -24.9 -25.9 -24.95 -26.15 Q-25.05 -27.5 -23.55 -29.7 L-21.95 -32.15 -23.3 -32.75 -24.25 -31.45 Q-25.7 -29.65 -27.15 -28.7 L-27.1 -25.4 Q-27.2 -21.2 -28.45 -20.95 -29.35 -20.8 -30.1 -24.8 L-30.6 -27.55 Q-31.1 -27.6 -31.25 -28.4 L-31.25 -29.45 Q-30.85 -30.9 -29.3 -32.85 L-27.65 -34.6 -28.9 -35.35 -28.9 -36.1 -28.95 -36.35" fill="#eaaa48" fill-rule="evenodd" stroke="none"/>
    <path d="M-41.4 -52.7 Q-39.35 -53.1 -38.35 -47.35 L-37.55 -40.95 -37.0 -40.35 -34.9 -38.0 Q-35.15 -36.0 -36.6 -35.2 L-36.9 -34.2 -36.0 -33.7 -34.1 -31.95 -33.85 -32.15 -33.85 -32.2 -33.7 -32.2 -31.25 -34.3 -28.95 -36.35 -29.1 -37.15 -29.9 -38.25 Q-32.85 -39.7 -34.95 -38.95 L-35.1 -38.7 -35.2 -38.8 -35.5 -40.4 Q-35.4 -43.9 -36.7 -51.5 L-36.85 -52.1 Q-38.1 -53.45 -39.9 -53.55 -40.65 -53.35 -41.4 -52.7 M-18.7 -27.75 Q-19.25 -30.4 -20.15 -31.15 L-21.95 -32.15 -23.55 -29.7 Q-25.05 -27.5 -24.95 -26.15 L-24.9 -25.9 Q-24.75 -25.05 -24.3 -25.0 L-23.2 -25.2 Q-22.35 -25.3 -21.5 -25.75 -20.6 -26.2 -19.65 -26.9 L-18.7 -27.75 M-23.3 -32.75 L-26.7 -34.2 -27.65 -34.6 -29.3 -32.85 Q-30.85 -30.9 -31.25 -29.45 L-31.25 -28.4 Q-31.1 -27.6 -30.6 -27.55 L-29.55 -27.75 Q-28.35 -27.95 -27.15 -28.7 -25.7 -29.65 -24.25 -31.45 L-23.3 -32.75" fill="#ffb84f" fill-rule="evenodd" stroke="none"/>
    <path d="M-96.5 -42.05 L-97.1 -43.6 Q-100.05 -48.0 -103.2 -45.4 -106.05 -43.0 -105.6 -40.25 -105.3 -38.6 -102.4 -33.05 -98.7 -26.1 -97.2 -22.45 L-94.85 -16.75 -94.45 -15.8 Q-97.0 -14.1 -96.3 -10.1 -96.15 -9.1 -95.05 -6.8 -100.85 -12.1 -99.0 -1.5 L-98.8 -0.45 Q-100.85 0.8 -100.35 3.6 -100.0 5.5 -98.0 10.45 -95.0 17.75 -91.05 23.6 L-89.25 26.1 -89.3 27.25 Q-89.0 29.15 -86.8 32.6 -83.95 37.05 -80.0 40.5 -68.3 50.45 -52.15 47.7 -42.75 46.05 -36.65 40.15 -34.8 32.65 -31.8 26.25 -28.85 19.9 -28.9 13.85 -29.05 7.8 -26.85 -1.15 L-23.65 -14.45 -23.7 -15.1 Q-25.85 -13.6 -28.85 -13.1 L-31.0 -12.85 -31.4 -12.8 -32.75 -12.6 -31.6 -12.3 -33.2 -12.6 -35.9 -13.2 -37.25 -13.55 -40.2 -14.15 -40.1 -13.5 -40.2 -12.4 -38.7 -8.2 -37.0 -3.35 Q-40.6 6.1 -42.65 9.45 -47.6 17.55 -55.1 18.85 -67.2 20.9 -79.35 7.0 -91.55 -6.8 -94.9 -26.4 -96.1 -33.2 -96.5 -42.05" fill="#450f0f" fill-rule="evenodd" stroke="none"/>
    <path d="M-36.65 40.15 Q-32.65 36.35 -30.0 30.75 L-27.65 25.7 Q-23.85 16.35 -23.95 10.2 L-23.9 6.7 -23.7 4.4 Q-23.45 2.3 -23.35 -0.2 -23.1 -7.35 -23.65 -14.45 L-26.85 -1.15 Q-29.05 7.8 -28.9 13.85 -28.85 19.9 -31.8 26.25 -34.8 32.65 -36.65 40.15 M-40.2 -12.4 L-40.55 -9.15 Q-42.05 -1.75 -43.55 0.95 -46.4 6.3 -51.4 9.2 -55.05 11.3 -59.75 12.15 L-60.65 12.3 Q-68.4 9.8 -75.0 1.85 -78.75 -2.7 -82.2 -9.05 L-85.9 -16.55 -86.7 -18.15 -89.85 -25.3 Q-92.4 -31.2 -94.35 -34.4 -94.95 -35.5 -95.7 -39.1 L-96.5 -42.05 Q-96.1 -33.2 -94.9 -26.4 -91.55 -6.8 -79.35 7.0 -67.2 20.9 -55.1 18.85 -47.6 17.55 -42.65 9.45 -40.6 6.1 -37.0 -3.35 L-38.7 -8.2 -40.2 -12.4" fill="#851d1d" fill-rule="evenodd" stroke="none"/>
    <path d="M-36.9 -34.2 Q-39.2 -35.55 -42.0 -35.75 L-42.35 -35.7 -45.35 -35.45 Q-46.55 -35.15 -47.4 -34.5 -49.55 -32.95 -49.2 -30.0 -49.5 -27.85 -49.25 -26.5 -48.3 -20.95 -46.1 -17.75 -45.25 -16.6 -41.05 -14.6 L-40.2 -14.15 -37.25 -13.55 -37.4 -13.6 -36.9 -13.65 -35.9 -14.0 Q-33.75 -14.55 -33.45 -16.75 L-33.6 -19.15 Q-34.25 -23.05 -38.9 -25.65 -43.4 -27.55 -43.5 -28.15 L-43.5 -28.55 -43.3 -29.15 -40.75 -27.2 -40.15 -27.1 Q-37.75 -26.75 -35.45 -27.05 L-35.15 -27.25 Q-34.4 -27.65 -33.8 -28.0 -33.6 -28.3 -33.55 -28.85 -33.4 -29.95 -33.55 -30.95 L-33.75 -31.5 -34.1 -31.95 -36.0 -33.7 -36.9 -34.2 M-33.2 -12.6 L-31.6 -12.3 -32.75 -12.6 -33.2 -12.6 M-30.6 -27.55 L-30.1 -24.8 Q-29.35 -20.8 -28.45 -20.95 -27.2 -21.2 -27.1 -25.4 L-27.15 -28.7 Q-28.35 -27.95 -29.55 -27.75 L-30.6 -27.55 M-24.9 -25.9 L-25.0 -25.95 -25.2 -23.95 -25.3 -21.25 -24.75 -19.7 Q-24.2 -18.6 -23.4 -18.75 -22.95 -18.85 -22.65 -19.2 L-22.35 -19.65 Q-21.75 -20.6 -21.6 -22.75 L-21.5 -25.75 Q-22.35 -25.3 -23.2 -25.2 L-24.3 -25.0 Q-24.75 -25.05 -24.9 -25.9" fill="#c78f3d" fill-rule="evenodd" stroke="none"/>
    <path d="M-125.2 -6.8 Q-123.4 -19.45 -123.45 -31.8 -123.3 -33.2 -123.3 -40.7 -122.7 -46.25 -119.45 -40.25 L-118.45 -31.25 -115.65 -38.8 Q-110.7 -53.1 -105.55 -59.75 -100.35 -66.55 -99.95 -58.55 -99.8 -55.65 -102.6 -48.2 L-106.35 -38.25 -103.4 -40.15 Q-101.6 -41.05 -99.85 -41.05 -94.9 -41.05 -91.25 -37.8 -90.8 -46.5 -88.05 -46.15 -87.9 -43.05 -87.45 -42.05 -87.0 -41.1 -86.95 -39.7 L-86.2 -30.8 Q-84.15 -26.7 -84.0 -23.75 -83.9 -21.8 -84.2 -19.5 L-84.4 -18.35 -81.05 -2.65 Q-82.5 3.25 -84.5 7.9 L-85.8 10.75 Q-92.65 24.6 -104.1 24.6 -113.25 24.6 -120.0 9.2 L-120.75 7.45 Q-123.6 0.5 -125.2 -6.8" fill="#450f0f" fill-rule="evenodd" stroke="none"/>
    <path d="M-81.05 -2.65 Q-77.6 11.3 -72.25 27.3 L-63.15 53.1 Q-59.05 64.6 -58.9 67.05 L-58.95 67.9 Q-57.5 68.85 -57.45 70.55 -57.35 72.45 -58.25 73.2 -59.85 74.45 -64.9 74.45 L-65.7 74.45 Q-71.25 46.85 -79.0 27.65 L-85.8 10.75 -84.5 7.9 Q-82.5 3.25 -81.05 -2.65 M-130.4 73.95 L-137.05 73.85 Q-138.55 73.7 -140.3 72.9 -141.05 72.5 -141.7 71.35 -142.35 70.25 -142.4 69.35 -140.7 61.6 -138.25 57.85 -137.5 53.5 -135.6 45.85 L-131.85 31.1 -126.3 -0.3 -125.2 -6.8 Q-123.6 0.5 -120.75 7.45 L-120.0 9.2 Q-120.3 14.45 -120.9 19.5 -122.0 28.7 -125.3 43.7 -128.65 59.05 -129.7 67.3 L-130.4 73.95" fill="#851d1d" fill-rule="evenodd" stroke="none"/>
    <path d="M-65.7 74.45 L-130.4 73.95 -129.7 67.3 Q-128.65 59.05 -125.3 43.7 -122.0 28.7 -120.9 19.5 -120.3 14.45 -120.0 9.2 -113.25 24.6 -104.1 24.6 -92.65 24.6 -85.8 10.75 L-79.0 27.65 Q-71.25 46.85 -65.7 74.45 M-94.8 55.15 L-94.45 55.9 Q-92.95 58.9 -90.05 58.9 -87.7 58.9 -86.6 57.2 -85.75 56.0 -85.8 54.6 -85.95 52.35 -87.5 50.45 -88.95 48.7 -90.85 48.15 -92.85 47.6 -94.05 48.75 -94.7 49.35 -95.0 50.35 L-104.8 51.55 -108.85 52.25 Q-109.95 49.35 -113.55 49.15 -115.5 49.05 -116.85 50.15 -118.3 51.35 -118.2 53.4 L-117.15 56.95 Q-115.5 60.35 -112.4 60.35 -109.75 60.35 -108.8 58.05 -108.35 56.95 -108.3 55.55 L-106.3 55.6 -94.8 55.15 M-94.0 36.2 L-93.85 37.35 Q-92.0 42.1 -86.85 42.1 -84.3 42.1 -82.55 39.5 -81.2 37.45 -81.25 36.05 -81.45 32.45 -83.6 29.75 -85.6 27.35 -88.3 26.6 -91.05 25.9 -92.85 27.3 -94.35 28.5 -94.55 30.95 L-101.65 31.7 -110.5 33.2 -111.35 32.1 Q-113.25 30.0 -116.0 29.7 -118.7 29.45 -120.5 31.05 -122.55 32.75 -122.4 35.8 L-121.55 39.95 Q-119.7 44.05 -114.75 44.05 -110.7 44.05 -109.45 42.1 -108.85 41.0 -108.95 38.45 L-109.05 37.15 -97.5 36.55 -94.0 36.2" fill="#621515" fill-rule="evenodd" stroke="none"/>
    <path d="M-95.0 50.35 Q-94.7 49.35 -94.05 48.75 -92.85 47.6 -90.85 48.15 -88.95 48.7 -87.5 50.45 -85.95 52.35 -85.8 54.6 -85.75 56.0 -86.6 57.2 -87.7 58.9 -90.05 58.9 -92.95 58.9 -94.45 55.9 L-94.8 55.15 -91.0 54.6 Q-87.15 53.75 -87.25 52.1 -87.35 50.1 -90.8 50.1 L-95.0 50.35 M-108.3 55.55 Q-108.35 56.95 -108.8 58.05 -109.75 60.35 -112.4 60.35 -115.5 60.35 -117.15 56.95 L-118.2 53.4 Q-118.3 51.35 -116.85 50.15 -115.5 49.05 -113.55 49.15 -109.95 49.35 -108.85 52.25 -115.2 53.4 -115.2 54.4 -115.1 55.75 -114.85 55.05 L-108.3 55.55 M-94.55 30.95 Q-94.35 28.5 -92.85 27.3 -91.05 25.9 -88.3 26.6 -85.6 27.35 -83.6 29.75 -81.45 32.45 -81.25 36.05 -81.2 37.45 -82.55 39.5 -84.3 42.1 -86.85 42.1 -92.0 42.1 -93.85 37.35 L-94.0 36.2 Q-85.75 35.15 -85.85 33.2 -86.0 30.45 -94.55 30.95 M-109.05 37.15 L-108.95 38.45 Q-108.85 41.0 -109.45 42.1 -110.7 44.05 -114.75 44.05 -119.7 44.05 -121.55 39.95 L-122.4 35.8 Q-122.55 32.75 -120.5 31.05 -118.7 29.45 -116.0 29.7 -113.25 30.0 -111.35 32.1 L-110.5 33.2 Q-117.5 34.7 -118.45 36.35 L-118.05 36.8 -112.4 37.15 -109.05 37.15" fill="#821c1c" fill-rule="evenodd" stroke="none"/>
    <path d="M-94.8 55.15 L-106.3 55.6 -108.3 55.55 -114.85 55.05 Q-115.1 55.75 -115.2 54.4 -115.2 53.4 -108.85 52.25 L-104.8 51.55 -95.0 50.35 -90.8 50.1 Q-87.35 50.1 -87.25 52.1 -87.15 53.75 -91.0 54.6 L-94.8 55.15 M-94.0 36.2 L-97.5 36.55 -109.05 37.15 -112.4 37.15 -118.05 36.8 -118.45 36.35 Q-117.5 34.7 -110.5 33.2 L-101.65 31.7 -94.55 30.95 Q-86.0 30.45 -85.85 33.2 -85.75 35.15 -94.0 36.2" fill="#b02626" fill-rule="evenodd" stroke="none"/>
    <path d="M-149.05 -55.15 Q-152.5 -54.75 -154.7 -52.45 -155.9 -51.2 -156.35 -49.7 L-156.25 -47.7 -155.65 -45.7 -155.1 -47.2 Q-155.25 -48.65 -154.25 -50.2 -152.6 -52.75 -148.65 -53.35 L-150.0 -52.05 Q-151.85 -49.45 -151.35 -46.35 -151.1 -44.85 -150.1 -43.0 -149.05 -41.15 -147.85 -40.05 -147.2 -39.45 -145.55 -38.75 L-142.4 -37.75 -141.9 -37.6 -141.85 -36.95 Q-141.65 -35.75 -140.35 -32.85 L-139.25 -30.3 -139.4 -27.2 Q-139.5 -24.3 -140.85 -24.15 -141.8 -24.0 -142.75 -25.35 L-143.55 -26.95 -143.5 -27.15 -143.45 -27.9 -143.45 -28.0 -143.4 -28.4 Q-143.45 -28.85 -143.85 -28.8 -144.35 -28.75 -144.45 -27.55 L-144.6 -27.0 -144.65 -25.65 Q-144.5 -24.7 -143.85 -23.8 -142.65 -22.1 -140.35 -22.35 -138.45 -22.6 -137.65 -24.1 -137.1 -24.95 -137.1 -26.15 L-137.1 -26.5 -134.45 -24.0 -133.9 -23.5 Q-135.1 -18.1 -140.35 -17.45 -145.5 -16.8 -146.6 -22.95 -146.85 -24.65 -146.6 -28.25 -146.3 -31.8 -146.55 -33.05 -146.9 -35.05 -148.9 -36.3 L-153.1 -38.55 Q-159.2 -41.5 -160.05 -46.55 -160.6 -49.8 -159.85 -51.6 -158.65 -54.55 -153.9 -56.65 L-150.0 -57.05 -149.05 -55.15 M-140.15 -36.85 L-139.2 -36.45 -137.95 -35.85 -138.0 -34.25 -138.6 -33.3 -139.7 -35.85 -140.15 -36.85 M-137.2 -38.05 L-137.0 -39.5 -136.2 -37.9 Q-136.45 -37.45 -136.8 -37.4 L-136.95 -37.5 -137.0 -37.8 -137.2 -38.05 M-136.7 -30.35 L-135.15 -33.8 -134.75 -34.45 Q-134.3 -33.25 -134.15 -32.15 -133.45 -29.5 -133.5 -26.8 L-136.65 -29.95 -136.7 -30.35 M-145.25 -54.9 L-147.05 -55.2 -147.7 -56.65 -147.7 -56.7 -147.1 -56.95 Q-146.35 -57.05 -145.8 -56.6 -145.3 -56.25 -145.2 -55.7 L-145.25 -54.9 M-78.9 -34.55 L-80.0 -32.4 Q-81.3 -35.45 -81.65 -38.65 -82.0 -40.75 -81.7 -43.65 -81.35 -47.4 -79.95 -52.3 L-79.75 -52.95 Q-79.85 -50.8 -80.65 -47.2 L-81.25 -43.7 Q-81.7 -41.3 -81.5 -40.25 L-81.3 -39.05 Q-80.9 -37.95 -79.95 -38.05 -79.5 -38.1 -79.25 -38.55 L-79.25 -38.5 Q-79.15 -38.15 -79.4 -37.65 L-79.6 -37.0 -78.9 -34.55 M-77.8 -59.95 Q-77.5 -61.45 -77.55 -61.7 L-78.25 -62.75 Q-78.9 -63.35 -79.0 -63.85 -79.1 -64.4 -78.7 -64.9 -78.3 -65.5 -77.6 -65.55 L-76.9 -65.45 -76.25 -65.35 -75.95 -65.5 -77.0 -60.6 -77.45 -60.25 -77.8 -59.95 M-76.9 -44.2 L-77.05 -42.2 -76.5 -43.5 -76.7 -41.3 -77.55 -41.7 -77.65 -41.7 -77.65 -41.0 -77.95 -40.6 -77.75 -42.75 -77.65 -43.6 -76.9 -44.2 M-76.85 -40.2 L-76.9 -39.85 -77.1 -40.35 -76.85 -40.2 M-77.3 -38.05 L-77.3 -38.0 -77.45 -38.35 -77.3 -38.05 M-73.05 -63.4 L-72.9 -66.9 -71.0 -66.9 Q-65.7 -66.05 -63.55 -63.5 -62.2 -61.95 -61.65 -58.7 -60.8 -53.65 -65.6 -49.4 L-68.9 -46.2 -69.6 -45.15 Q-70.3 -43.9 -70.05 -42.5 L-68.3 -37.9 Q-66.85 -34.55 -66.6 -32.85 -65.5 -26.7 -70.65 -26.1 -75.55 -25.45 -78.5 -29.75 L-77.25 -32.4 Q-75.7 -30.95 -73.35 -31.25 -71.9 -31.45 -70.75 -32.5 -70.75 -32.4 -70.35 -32.25 L-69.75 -33.75 Q-68.75 -35.15 -68.9 -35.9 L-68.9 -35.95 -68.9 -36.7 Q-69.1 -38.05 -70.1 -39.3 -71.15 -40.65 -70.95 -39.5 L-70.1 -37.6 -70.5 -35.45 -70.5 -35.4 -70.8 -34.85 Q-71.65 -33.25 -72.75 -33.1 -74.9 -32.85 -76.25 -35.2 L-76.25 -35.25 -75.95 -36.15 Q-74.95 -35.3 -73.8 -35.45 -73.2 -35.5 -72.85 -35.95 -72.55 -36.35 -72.6 -36.65 L-73.95 -36.95 Q-74.95 -37.15 -75.45 -37.6 L-74.85 -39.6 -74.15 -39.75 -74.15 -40.05 -74.65 -40.35 Q-74.1 -42.4 -74.2 -43.05 L-74.75 -45.6 -72.25 -46.65 Q-69.5 -47.5 -69.0 -51.1 -68.65 -53.3 -69.1 -55.95 -69.45 -58.1 -70.0 -59.2 -70.8 -60.9 -72.45 -61.35 L-70.75 -61.8 Q-67.55 -62.2 -66.95 -58.95 -66.75 -57.65 -67.15 -55.85 L-67.55 -54.05 Q-67.4 -53.35 -66.6 -53.45 -65.65 -53.55 -65.25 -55.95 -64.9 -57.8 -65.05 -58.5 -65.3 -60.0 -66.05 -61.2 -67.0 -63.0 -68.45 -63.6 L-73.05 -63.4 M-68.65 -52.55 L-68.65 -52.2 Q-68.45 -51.65 -68.05 -51.7 L-67.75 -51.85 Q-68.0 -52.6 -68.65 -52.55 M-68.25 -53.75 L-68.25 -53.4 Q-67.4 -52.1 -67.0 -52.15 L-66.75 -52.35 -66.75 -52.7 -67.2 -53.2 Q-67.75 -53.75 -68.25 -53.75 M-78.9 -45.25 L-78.95 -45.25 -78.95 -45.35 -78.9 -45.25 M-67.2 -31.3 L-67.55 -32.15 -67.6 -32.15 Q-67.55 -31.3 -68.2 -29.75 L-69.3 -27.1 -69.05 -27.0 Q-68.4 -27.1 -67.7 -28.85 -67.1 -30.6 -67.2 -31.3" fill="#c78f3d" fill-rule="evenodd" stroke="none"/>
    <path d="M-141.9 -37.6 L-142.4 -37.75 -145.55 -38.75 Q-147.2 -39.45 -147.85 -40.05 -149.05 -41.15 -150.1 -43.0 -151.1 -44.85 -151.35 -46.35 -151.85 -49.45 -150.0 -52.05 L-148.65 -53.35 Q-152.6 -52.75 -154.25 -50.2 -155.25 -48.65 -155.1 -47.2 L-155.65 -45.7 -156.25 -47.7 -156.35 -49.7 Q-155.9 -51.2 -154.7 -52.45 -152.5 -54.75 -149.05 -55.15 L-147.55 -52.25 -148.15 -51.05 Q-148.75 -49.1 -148.35 -46.75 -148.0 -44.85 -146.9 -43.25 -144.8 -40.4 -141.15 -40.85 -140.05 -41.0 -139.3 -42.6 L-139.1 -43.05 -138.85 -42.65 -138.9 -43.6 Q-138.55 -44.8 -138.8 -46.2 -139.6 -50.8 -143.7 -53.4 L-146.0 -53.5 -146.25 -53.9 -147.05 -55.2 -145.25 -54.9 Q-143.3 -54.45 -141.55 -53.0 L-141.5 -52.95 -140.9 -52.7 Q-137.5 -49.85 -136.0 -47.8 -134.45 -45.6 -134.0 -42.85 -133.65 -41.0 -133.85 -39.15 L-133.95 -38.4 Q-132.85 -39.2 -131.75 -39.35 -130.65 -39.5 -130.15 -38.7 L-129.8 -37.9 Q-129.65 -37.05 -130.3 -37.0 L-130.95 -37.15 -131.4 -37.4 -132.25 -37.15 Q-131.3 -36.9 -131.2 -36.1 -131.05 -35.45 -131.65 -35.4 L-132.7 -35.45 -134.35 -35.0 -134.75 -34.45 -135.15 -33.8 -136.7 -30.35 -136.7 -32.3 -136.95 -37.5 -136.8 -37.4 Q-136.45 -37.45 -136.2 -37.9 -135.85 -38.6 -135.85 -40.05 L-135.95 -42.5 Q-136.25 -44.2 -137.4 -46.0 L-137.1 -44.45 Q-136.8 -42.9 -136.95 -40.4 L-137.0 -39.5 -137.2 -38.05 -137.55 -38.45 -137.95 -35.85 -139.2 -36.45 -140.15 -36.85 Q-141.15 -39.2 -142.15 -40.55 L-142.3 -40.55 -141.9 -37.6 M-137.1 -26.5 L-137.1 -26.15 Q-137.1 -24.95 -137.65 -24.1 -138.45 -22.6 -140.35 -22.35 -142.65 -22.1 -143.85 -23.8 -144.5 -24.7 -144.65 -25.65 L-144.6 -27.0 -144.45 -27.55 Q-144.35 -28.75 -143.85 -28.8 -143.45 -28.85 -143.4 -28.4 L-143.45 -28.0 -143.45 -27.9 -143.5 -27.15 -143.55 -26.95 -142.75 -25.35 Q-141.8 -24.0 -140.85 -24.15 -139.5 -24.3 -139.4 -27.2 L-139.25 -30.3 -138.7 -28.95 -137.9 -27.45 -137.85 -27.05 -137.7 -26.8 -137.4 -26.75 -137.35 -26.75 -137.1 -26.5 M-144.55 -51.25 L-144.8 -51.65 -144.85 -51.7 -144.2 -51.4 -144.55 -51.25 M-140.65 -45.2 L-140.6 -45.15 -140.75 -44.5 -141.05 -43.8 -142.55 -46.5 Q-142.9 -48.15 -143.85 -49.85 L-144.0 -50.2 -140.65 -45.2 M-138.05 -32.1 L-138.6 -33.3 -138.0 -34.25 -138.05 -33.0 -138.05 -32.1 M-79.75 -52.95 L-79.75 -53.35 -81.1 -50.55 Q-82.4 -47.8 -82.8 -47.75 -83.4 -47.7 -83.55 -48.35 -83.8 -49.75 -81.45 -54.2 -80.95 -55.05 -80.45 -56.65 L-80.9 -57.65 Q-81.05 -58.65 -80.05 -58.8 L-79.4 -58.55 -77.8 -59.95 -77.45 -60.25 -77.0 -60.6 -77.35 -58.95 -77.55 -57.2 Q-79.2 -55.05 -79.1 -54.4 -79.05 -53.85 -78.35 -53.95 L-77.75 -54.4 -77.85 -53.35 -77.9 -49.7 -78.25 -48.25 -77.8 -47.6 -77.75 -47.1 -77.25 -44.9 -77.0 -44.95 -76.8 -45.95 -76.9 -44.2 -77.65 -43.6 -77.75 -42.75 -77.95 -40.6 -77.65 -41.0 -77.65 -41.7 -77.55 -41.7 -76.7 -41.3 -76.85 -40.2 -77.1 -40.35 -76.9 -39.85 -77.1 -38.6 -77.3 -38.05 -77.45 -38.35 -77.3 -38.0 -77.3 -37.95 -78.9 -34.55 -79.6 -37.0 -79.4 -37.65 Q-79.15 -38.15 -79.25 -38.5 L-79.25 -38.55 Q-79.5 -38.1 -79.95 -38.05 -80.9 -37.95 -81.3 -39.05 L-81.5 -40.25 Q-81.7 -41.3 -81.25 -43.7 L-80.65 -47.2 Q-79.85 -50.8 -79.75 -52.95 M-73.05 -63.4 L-68.45 -63.6 Q-67.0 -63.0 -66.05 -61.2 -65.3 -60.0 -65.05 -58.5 -64.9 -57.8 -65.25 -55.95 -65.65 -53.55 -66.6 -53.45 -67.4 -53.35 -67.55 -54.05 L-67.15 -55.85 Q-66.75 -57.65 -66.95 -58.95 -67.55 -62.2 -70.75 -61.8 L-72.45 -61.35 Q-70.8 -60.9 -70.0 -59.2 -69.45 -58.1 -69.1 -55.95 -68.65 -53.3 -69.0 -51.1 -69.5 -47.5 -72.25 -46.65 L-74.75 -45.6 -75.25 -47.35 -75.1 -47.95 Q-73.8 -48.5 -72.85 -49.8 -71.2 -52.1 -71.8 -55.55 -72.15 -57.6 -72.45 -58.25 L-73.3 -59.35 -73.2 -61.1 -73.05 -63.4 M-74.65 -40.35 L-74.15 -40.05 -74.15 -39.75 -74.85 -39.6 -74.65 -40.35 M-75.45 -37.6 Q-74.95 -37.15 -73.95 -36.95 L-72.6 -36.65 Q-72.55 -36.35 -72.85 -35.95 -73.2 -35.5 -73.8 -35.45 -74.95 -35.3 -75.95 -36.15 L-75.45 -37.6 M-76.25 -35.2 Q-74.9 -32.85 -72.75 -33.1 -71.65 -33.25 -70.8 -34.85 L-70.5 -35.4 -70.5 -35.45 -70.1 -37.6 -70.95 -39.5 Q-71.15 -40.65 -70.1 -39.3 -69.1 -38.05 -68.9 -36.7 L-68.9 -35.95 -68.9 -35.9 Q-68.75 -35.15 -69.75 -33.75 L-70.35 -32.25 Q-70.75 -32.4 -70.75 -32.5 -71.9 -31.45 -73.35 -31.25 -75.7 -30.95 -77.25 -32.4 L-76.25 -35.2 M-68.25 -53.75 Q-67.75 -53.75 -67.2 -53.2 L-66.75 -52.7 -66.75 -52.35 -67.0 -52.15 Q-67.4 -52.1 -68.25 -53.4 L-68.25 -53.75 M-68.65 -52.55 Q-68.0 -52.6 -67.75 -51.85 L-68.05 -51.7 Q-68.45 -51.65 -68.65 -52.2 L-68.65 -52.55 M-78.9 -45.25 L-78.95 -45.35 -78.95 -45.25 -78.9 -45.25 M-67.2 -31.3 Q-67.1 -30.6 -67.7 -28.85 -68.4 -27.1 -69.05 -27.0 L-69.3 -27.1 -68.2 -29.75 Q-67.55 -31.3 -67.6 -32.15 L-67.55 -32.15 -67.2 -31.3" fill="#ab7834" fill-rule="evenodd" stroke="none"/>
    <path d="M-137.95 -35.85 L-137.55 -38.45 -137.2 -38.05 -137.0 -37.8 -136.95 -37.5 -136.7 -32.3 -136.7 -30.35 -136.65 -29.95 -137.55 -31.15 -138.05 -32.1 -138.05 -33.0 -138.0 -34.25 -137.95 -35.85 M-146.0 -53.5 L-143.7 -53.4 Q-139.6 -50.8 -138.8 -46.2 -138.55 -44.8 -138.9 -43.6 L-139.1 -43.05 -139.3 -42.6 Q-140.05 -41.0 -141.15 -40.85 -144.8 -40.4 -146.9 -43.25 -148.0 -44.85 -148.35 -46.75 -148.75 -49.1 -148.15 -51.05 L-147.55 -52.25 -146.6 -50.4 Q-143.6 -44.55 -142.2 -41.1 L-141.95 -41.15 Q-142.05 -43.8 -142.45 -45.9 L-142.55 -46.5 -141.05 -43.8 -140.75 -44.5 -140.6 -45.15 -140.65 -45.2 Q-140.95 -47.1 -141.85 -48.85 -142.9 -50.8 -144.2 -51.4 L-144.85 -51.7 -144.8 -51.65 -144.55 -51.25 -144.15 -50.5 -146.0 -53.5 M-137.9 -27.45 L-137.35 -26.75 -137.4 -26.75 -137.7 -26.8 -137.85 -27.05 -137.9 -27.45 M-77.55 -57.2 L-77.75 -54.4 -78.35 -53.95 Q-79.05 -53.85 -79.1 -54.4 -79.2 -55.05 -77.55 -57.2 M-77.9 -49.7 L-77.8 -47.6 -78.25 -48.25 -77.9 -49.7 M-73.3 -59.35 L-72.45 -58.25 Q-72.15 -57.6 -71.8 -55.55 -71.2 -52.1 -72.85 -49.8 -73.8 -48.5 -75.1 -47.95 -74.3 -51.2 -73.75 -54.95 L-73.3 -59.35" fill="#96692e" fill-rule="evenodd" stroke="none"/>
    <path d="M-162.4 -48.1 Q-162.7 -52.2 -159.95 -54.9 -158.75 -56.2 -157.2 -57.15 -154.25 -59.1 -150.95 -59.05 L-151.2 -59.6 -151.25 -59.9 -152.2 -62.8 -152.2 -62.85 Q-152.45 -63.75 -152.05 -64.5 L-152.1 -64.45 Q-149.85 -69.45 -145.8 -73.3 L-145.8 -74.2 -145.95 -74.1 -146.4 -74.05 -146.5 -74.1 -146.65 -74.1 -147.2 -74.05 Q-148.05 -73.9 -149.05 -74.6 L-149.4 -74.95 -149.65 -75.5 -149.8 -75.8 Q-150.65 -77.1 -149.65 -78.25 -146.65 -81.6 -142.3 -82.65 L-137.5 -83.95 -137.5 -83.9 Q-134.5 -84.9 -131.15 -84.85 L-131.15 -84.95 -131.25 -85.4 -131.05 -85.8 -131.0 -85.85 -131.4 -86.35 -131.45 -86.4 -132.2 -87.65 Q-132.85 -88.55 -132.1 -89.7 L-131.95 -89.8 Q-130.8 -91.0 -128.95 -90.05 L-128.95 -90.1 Q-126.4 -88.9 -123.5 -88.05 L-121.95 -88.75 -121.85 -88.8 Q-119.35 -89.9 -116.65 -90.4 L-114.35 -90.45 -114.05 -90.3 Q-111.15 -91.45 -108.55 -93.25 -102.75 -97.25 -95.65 -98.15 L-95.2 -98.1 -94.45 -97.85 -94.05 -97.6 -93.8 -97.25 -93.45 -96.6 -93.4 -96.05 -93.6 -95.5 -95.45 -93.4 Q-90.0 -93.75 -85.35 -90.8 L-84.9 -90.25 -84.75 -89.7 Q-84.7 -89.35 -84.8 -89.05 L-85.2 -88.4 -85.25 -88.25 -86.7 -87.15 -86.8 -87.1 -88.05 -86.75 -87.15 -86.45 -87.1 -86.45 Q-85.0 -85.9 -83.95 -84.2 -80.25 -82.2 -77.7 -79.25 -73.6 -74.65 -73.3 -68.8 -68.65 -69.25 -64.5 -66.75 -62.4 -65.5 -61.25 -63.45 L-61.25 -63.5 Q-59.2 -59.85 -59.55 -55.95 L-59.55 -55.9 Q-59.95 -51.9 -62.95 -49.15 L-62.95 -49.1 -66.55 -45.55 -67.05 -45.0 Q-68.55 -43.4 -67.55 -41.2 L-65.7 -36.85 Q-63.9 -32.6 -64.75 -28.25 L-64.75 -28.2 Q-65.25 -25.8 -67.35 -24.9 -70.25 -23.6 -73.45 -24.1 L-73.45 -24.05 Q-75.15 -24.3 -76.55 -25.2 -78.4 -26.4 -79.75 -28.1 -80.35 -27.6 -80.95 -27.5 -81.65 -27.4 -82.0 -27.75 -85.65 -24.75 -87.8 -20.75 -89.2 -18.05 -89.95 -14.95 L-88.95 -11.5 -88.9 -10.9 -89.15 -10.25 -87.4 -1.65 Q-86.9 1.15 -87.3 3.65 -87.95 7.25 -91.0 8.95 L-92.25 9.8 Q-94.65 11.65 -97.35 12.25 -100.7 13.15 -103.85 12.3 -109.15 11.05 -112.45 6.75 -116.25 1.95 -117.15 -4.05 -117.4 -5.8 -117.95 -7.4 -118.4 -9.05 -119.25 -10.5 -122.25 -15.8 -126.75 -19.7 -128.15 -19.6 -130.2 -21.3 -130.85 -21.35 -132.25 -22.3 L-132.6 -21.1 Q-133.45 -18.25 -136.05 -16.7 -139.2 -14.85 -143.05 -15.7 -146.2 -16.4 -147.5 -19.3 L-147.55 -19.35 Q-148.25 -20.9 -148.4 -22.85 -148.7 -27.5 -148.55 -32.2 -148.5 -32.7 -148.75 -33.1 L-148.75 -33.05 Q-149.65 -34.9 -151.6 -35.6 L-151.65 -35.55 Q-155.3 -37.05 -158.15 -39.7 -162.0 -43.05 -162.4 -48.05 L-162.4 -48.1 M-149.05 -55.15 L-150.0 -57.05 -153.9 -56.65 Q-158.65 -54.55 -159.85 -51.6 -160.6 -49.8 -160.05 -46.55 -159.2 -41.5 -153.1 -38.55 L-148.9 -36.3 Q-146.9 -35.05 -146.55 -33.05 -146.3 -31.8 -146.6 -28.25 -146.85 -24.65 -146.6 -22.95 -145.5 -16.8 -140.35 -17.45 -135.1 -18.1 -133.9 -23.5 L-134.45 -24.0 -137.1 -26.5 -137.35 -26.75 -137.9 -27.45 -138.7 -28.95 -139.25 -30.3 -140.35 -32.85 Q-141.65 -35.75 -141.85 -36.95 L-141.9 -37.6 -142.3 -40.55 -142.15 -40.55 Q-141.15 -39.2 -140.15 -36.85 L-139.7 -35.85 -138.6 -33.3 -138.05 -32.1 -137.55 -31.15 -136.65 -29.95 -133.5 -26.8 Q-133.45 -29.5 -134.15 -32.15 -134.3 -33.25 -134.75 -34.45 L-134.35 -35.0 -132.7 -35.45 -131.65 -35.4 Q-131.05 -35.45 -131.2 -36.1 -131.3 -36.9 -132.25 -37.15 L-131.4 -37.4 -130.95 -37.15 -130.3 -37.0 Q-129.65 -37.05 -129.8 -37.9 L-130.15 -38.7 Q-130.65 -39.5 -131.75 -39.35 -132.85 -39.2 -133.95 -38.4 L-133.85 -39.15 Q-133.65 -41.0 -134.0 -42.85 -134.45 -45.6 -136.0 -47.8 -137.5 -49.85 -140.9 -52.7 L-141.5 -52.95 -141.55 -53.0 Q-143.3 -54.45 -145.25 -54.9 L-145.2 -55.7 Q-145.3 -56.25 -145.8 -56.6 -146.35 -57.05 -147.1 -56.95 L-147.7 -56.7 -147.7 -56.65 -147.05 -55.2 -146.25 -53.9 -146.0 -53.5 -144.15 -50.5 -144.55 -51.25 -144.2 -51.4 Q-142.9 -50.8 -141.85 -48.85 -140.95 -47.1 -140.65 -45.2 L-144.0 -50.2 -143.85 -49.85 Q-142.9 -48.15 -142.55 -46.5 L-142.45 -45.9 Q-142.05 -43.8 -141.95 -41.15 L-142.2 -41.1 Q-143.6 -44.55 -146.6 -50.4 L-147.55 -52.25 -149.05 -55.15 M-137.0 -39.5 L-136.95 -40.4 Q-136.8 -42.9 -137.1 -44.45 L-137.4 -46.0 Q-136.25 -44.2 -135.95 -42.5 L-135.85 -40.05 Q-135.85 -38.6 -136.2 -37.9 L-137.0 -39.5 M-138.9 -43.6 L-138.85 -42.65 -139.1 -43.05 -138.9 -43.6 M-79.75 -52.95 L-79.95 -52.3 Q-81.35 -47.4 -81.7 -43.65 -82.0 -40.75 -81.65 -38.65 -81.3 -35.45 -80.0 -32.4 L-78.9 -34.55 -77.3 -37.95 -77.3 -38.0 -77.3 -38.05 -77.1 -38.6 -76.9 -39.85 -76.85 -40.2 -76.7 -41.3 -76.5 -43.5 -77.05 -42.2 -76.9 -44.2 -76.8 -45.95 -77.0 -44.95 -77.25 -44.9 -77.75 -47.1 -77.8 -47.6 -77.9 -49.7 -77.85 -53.35 -77.75 -54.4 -77.55 -57.2 -77.35 -58.95 -77.0 -60.6 -75.95 -65.5 -76.25 -65.35 -76.9 -65.45 -77.6 -65.55 Q-78.3 -65.5 -78.7 -64.9 -79.1 -64.4 -79.0 -63.85 -78.9 -63.35 -78.25 -62.75 L-77.55 -61.7 Q-77.5 -61.45 -77.8 -59.95 L-79.4 -58.55 -80.05 -58.8 Q-81.05 -58.65 -80.9 -57.65 L-80.45 -56.65 Q-80.95 -55.05 -81.45 -54.2 -83.8 -49.75 -83.55 -48.35 -83.4 -47.7 -82.8 -47.75 -82.4 -47.8 -81.1 -50.55 L-79.75 -53.35 -79.75 -52.95 M-77.25 -32.4 L-78.5 -29.75 Q-75.55 -25.45 -70.65 -26.1 -65.5 -26.7 -66.6 -32.85 -66.85 -34.55 -68.3 -37.9 L-70.05 -42.5 Q-70.3 -43.9 -69.6 -45.15 L-68.9 -46.2 -65.6 -49.4 Q-60.8 -53.65 -61.65 -58.7 -62.2 -61.95 -63.55 -63.5 -65.7 -66.05 -71.0 -66.9 L-72.9 -66.9 -73.05 -63.4 -73.2 -61.1 -73.3 -59.35 -73.75 -54.95 Q-74.3 -51.2 -75.1 -47.95 L-75.25 -47.35 -74.75 -45.6 -74.2 -43.05 Q-74.1 -42.4 -74.65 -40.35 L-74.85 -39.6 -75.45 -37.6 -75.95 -36.15 -76.25 -35.25 -76.25 -35.2 -77.25 -32.4" fill="#6e450e" fill-rule="evenodd" stroke="none"/>
    <path d="M-125.6 -82.5 L-126.0 -82.55 -129.65 -82.75 Q-129.25 -83.0 -128.95 -83.2 L-128.15 -83.65 Q-127.25 -83.05 -125.75 -82.55 L-125.6 -82.5 M-135.3 -79.1 L-131.1 -79.85 -129.15 -80.05 -124.5 -79.7 -122.55 -79.25 -119.6 -79.2 -123.5 -78.35 -126.15 -78.45 -125.8 -78.5 -126.3 -78.75 -136.2 -78.4 -135.3 -79.1 M-102.25 -86.0 Q-99.95 -87.2 -98.05 -87.75 L-96.35 -87.5 -95.65 -87.2 Q-98.6 -87.2 -102.25 -86.0 M-93.05 -86.2 L-90.9 -85.35 -90.95 -85.35 Q-94.4 -85.6 -94.15 -84.25 L-93.95 -83.65 -93.8 -83.35 -92.75 -83.3 -87.2 -82.8 -86.25 -83.1 Q-83.05 -81.45 -81.1 -79.8 -77.05 -76.4 -76.1 -72.5 -75.25 -68.75 -75.05 -63.1 L-75.1 -62.95 Q-74.95 -55.35 -75.7 -47.85 -76.35 -44.6 -76.9 -42.9 -78.6 -37.45 -80.4 -34.15 -82.5 -30.25 -85.45 -28.05 -88.4 -25.65 -90.65 -22.55 -93.25 -19.0 -93.6 -15.85 L-94.25 -15.7 Q-94.05 -16.45 -94.15 -17.0 -94.85 -21.05 -98.95 -21.6 L-98.9 -21.25 -98.95 -17.6 -99.0 -16.45 -98.5 -16.6 Q-95.15 -17.15 -94.55 -13.85 -94.4 -12.85 -95.05 -11.5 -95.85 -9.8 -97.2 -9.65 -98.4 -9.5 -99.4 -10.1 -98.65 -8.55 -98.3 -6.4 -97.85 -3.95 -100.4 -1.15 -102.55 -1.2 -103.8 -2.35 -105.25 -3.55 -106.6 -5.6 L-106.25 -4.0 Q-106.05 -2.85 -106.4 -1.85 -106.95 -0.45 -108.6 -0.25 -110.15 -0.05 -111.1 -2.5 L-111.65 -4.6 Q-112.6 -9.95 -109.8 -9.3 -108.75 -9.1 -107.95 -8.15 -107.1 -8.95 -106.9 -9.75 -106.7 -10.45 -106.9 -11.5 -107.0 -12.3 -109.25 -14.25 -108.7 -15.05 -109.0 -16.65 -109.35 -18.65 -111.35 -17.85 -113.35 -16.95 -112.95 -14.7 L-112.6 -13.85 Q-112.1 -13.25 -110.7 -13.45 L-110.5 -13.45 Q-111.0 -12.65 -112.05 -12.5 -113.8 -12.3 -114.65 -13.45 -115.15 -14.0 -115.25 -14.65 -115.65 -16.95 -114.25 -17.8 L-114.5 -17.95 Q-117.55 -19.8 -119.15 -19.85 L-121.65 -21.2 -129.45 -25.0 Q-133.7 -27.4 -135.85 -30.25 -138.6 -33.85 -140.75 -38.0 L-141.0 -37.95 -141.25 -38.9 Q-142.35 -43.75 -144.3 -48.25 L-145.25 -50.6 -147.15 -55.0 -147.7 -56.4 -148.3 -57.8 -150.5 -63.3 -150.25 -64.15 -150.05 -64.5 -149.8 -65.0 Q-147.75 -68.7 -144.5 -71.65 L-142.85 -73.1 -140.4 -74.05 Q-142.7 -72.5 -142.4 -70.85 L-142.15 -70.1 Q-141.65 -69.15 -140.65 -69.3 L-139.05 -70.3 Q-138.45 -70.8 -137.65 -71.1 L-139.25 -69.6 Q-140.9 -67.7 -141.2 -65.25 L-141.4 -65.25 Q-147.7 -66.2 -147.35 -64.2 -147.2 -63.15 -144.5 -61.95 L-145.05 -61.75 Q-146.6 -61.0 -146.45 -60.15 -146.25 -58.85 -144.05 -58.8 -145.15 -57.8 -145.0 -56.95 -144.7 -55.95 -143.95 -55.7 L-144.3 -55.4 Q-144.7 -54.95 -144.6 -54.3 -142.4 -52.2 -139.3 -50.3 -136.3 -48.4 -133.65 -47.55 -135.7 -46.65 -137.25 -45.3 -139.45 -43.35 -139.15 -41.65 L-138.85 -40.8 Q-138.5 -40.25 -137.8 -40.15 L-138.0 -39.4 Q-137.75 -37.9 -135.8 -38.1 L-133.5 -39.1 Q-131.95 -34.4 -126.95 -29.45 -117.6 -20.0 -102.85 -21.8 L-100.75 -22.1 Q-99.8 -24.3 -99.15 -22.45 -89.05 -24.95 -85.1 -33.95 -82.75 -39.3 -82.65 -45.45 L-81.6 -44.85 Q-80.8 -44.45 -80.25 -44.5 -79.2 -44.65 -78.7 -45.5 -78.25 -46.25 -78.4 -47.1 L-78.85 -47.85 Q-78.1 -48.05 -77.65 -48.8 -77.15 -49.6 -77.3 -50.5 -77.8 -53.2 -80.8 -54.35 -83.6 -55.5 -87.15 -54.9 -90.85 -54.3 -93.05 -52.4 L-93.65 -51.75 -94.05 -52.05 Q-96.05 -53.75 -97.85 -54.0 L-97.95 -54.1 Q-100.25 -55.5 -101.05 -56.45 L-101.3 -56.45 -98.25 -53.4 -97.75 -53.0 -95.05 -50.3 -94.75 -50.05 -95.05 -48.85 -97.15 -50.85 -96.2 -50.75 -96.15 -50.9 Q-96.8 -51.65 -98.9 -52.9 L-101.95 -54.9 -102.15 -54.9 Q-101.6 -53.6 -99.9 -52.3 L-98.75 -51.6 -98.85 -50.85 Q-96.7 -47.2 -95.3 -47.35 L-95.05 -47.4 -95.05 -47.2 Q-94.85 -46.1 -92.6 -46.35 L-90.05 -48.1 Q-87.2 -49.9 -85.0 -50.15 L-83.9 -49.95 Q-85.95 -49.5 -87.2 -46.2 L-89.35 -38.85 -89.35 -39.25 Q-89.55 -40.3 -92.0 -41.15 -94.55 -41.95 -94.15 -39.85 L-93.45 -38.75 Q-92.35 -37.45 -90.6 -37.65 -89.8 -37.75 -89.5 -38.45 -90.7 -34.7 -92.65 -32.05 L-92.7 -32.2 -95.3 -34.4 Q-97.85 -35.85 -97.3 -32.7 L-96.55 -31.65 Q-95.55 -30.6 -94.4 -30.7 L-93.7 -30.85 Q-97.4 -26.8 -103.4 -26.05 -112.95 -24.85 -119.4 -28.2 -123.75 -30.5 -126.25 -34.6 L-128.65 -37.9 -129.95 -39.75 -129.9 -39.75 Q-129.1 -39.9 -129.3 -41.0 -129.35 -41.4 -130.8 -42.6 L-132.65 -43.65 -132.8 -43.8 Q-131.35 -44.5 -129.45 -44.7 -128.0 -44.9 -127.05 -43.75 -128.35 -42.95 -128.25 -42.25 -128.05 -41.2 -126.4 -41.4 L-126.3 -41.45 Q-127.95 -39.85 -127.85 -39.1 L-127.65 -38.55 -127.6 -38.4 -127.1 -38.35 -126.6 -38.35 Q-126.1 -38.4 -124.95 -39.2 -126.25 -38.0 -126.1 -37.2 -125.9 -36.15 -124.7 -36.3 L-119.95 -40.4 Q-120.3 -42.5 -122.95 -40.7 L-121.05 -42.5 Q-120.2 -42.85 -119.3 -43.75 L-120.05 -42.6 Q-119.9 -42.0 -119.5 -41.8 L-119.6 -41.05 -119.4 -40.45 -119.0 -40.35 Q-117.8 -41.0 -116.05 -43.5 -114.55 -45.8 -114.6 -46.05 -114.7 -46.65 -115.0 -46.5 L-114.75 -47.0 -115.0 -47.6 -115.3 -47.75 Q-116.2 -47.55 -117.2 -46.4 -115.85 -48.75 -116.0 -49.8 L-116.05 -49.95 -115.85 -50.05 -115.65 -52.0 -115.55 -52.75 -115.55 -52.9 -115.55 -53.1 Q-115.35 -55.05 -115.5 -56.05 -115.65 -56.8 -116.5 -58.2 L-116.65 -58.15 -116.4 -53.95 -116.25 -52.7 -117.5 -50.8 -118.95 -48.8 -120.25 -47.35 -120.95 -46.25 -121.95 -45.0 -123.4 -45.15 Q-123.75 -47.1 -124.9 -48.05 -122.6 -49.4 -120.65 -52.35 L-122.2 -49.0 -121.9 -48.6 -121.7 -48.85 Q-119.95 -50.0 -118.4 -52.8 L-118.2 -53.05 -118.35 -52.4 -118.15 -51.9 -118.1 -51.95 Q-117.75 -52.15 -117.5 -53.4 -117.25 -54.5 -117.3 -55.0 L-117.35 -55.25 -117.4 -55.2 Q-117.1 -56.35 -117.25 -57.15 L-117.45 -57.65 -117.55 -57.75 -118.7 -56.0 -118.0 -58.05 -116.45 -58.4 Q-115.8 -58.7 -115.95 -59.6 -116.25 -61.3 -118.05 -60.95 L-118.7 -60.75 -119.7 -60.3 -119.75 -60.45 -120.25 -61.6 Q-120.7 -62.25 -121.4 -62.4 L-120.9 -63.6 -120.65 -64.7 Q-120.6 -65.35 -120.7 -65.9 -122.5 -76.35 -132.9 -76.2 L-135.75 -75.9 Q-132.0 -77.35 -129.25 -78.0 L-129.7 -77.4 -128.55 -77.1 -126.05 -76.8 Q-124.35 -76.4 -120.95 -76.85 L-118.85 -77.1 -120.7 -76.4 -120.55 -76.15 -118.15 -76.1 -115.55 -76.25 Q-111.8 -76.75 -108.25 -79.05 -107.2 -79.75 -106.5 -80.2 L-104.85 -80.8 -105.25 -80.55 Q-111.1 -76.25 -110.85 -74.75 L-109.95 -73.95 -103.75 -78.8 -97.3 -84.2 -95.45 -85.1 -94.55 -85.25 -94.5 -85.35 -94.45 -85.5 -93.05 -86.2 M-113.6 -88.2 L-115.05 -87.55 -114.95 -88.0 -115.0 -88.1 -113.6 -88.2 M-121.25 -85.95 L-123.25 -85.95 -121.0 -86.8 -121.6 -86.4 -121.35 -85.95 -121.25 -85.95 M-95.25 -78.55 Q-93.9 -79.55 -93.65 -80.15 L-92.75 -80.65 Q-92.15 -81.05 -92.2 -81.4 -92.65 -83.9 -96.5 -82.2 L-97.55 -81.6 Q-102.0 -80.7 -104.1 -76.8 -105.85 -73.65 -105.4 -71.0 L-104.55 -67.95 -104.25 -67.3 Q-107.45 -65.45 -106.9 -62.2 L-106.55 -60.8 Q-105.95 -59.3 -104.25 -59.55 -102.55 -59.75 -101.5 -60.85 L-100.6 -59.95 -101.15 -60.05 Q-103.05 -59.85 -103.6 -59.2 -104.0 -58.8 -103.85 -58.05 L-103.65 -57.4 -103.4 -57.15 -102.75 -57.05 -102.3 -57.35 -101.85 -57.75 -98.25 -55.7 Q-94.65 -53.6 -91.75 -54.0 -87.35 -54.5 -85.8 -57.0 -84.25 -59.45 -83.8 -59.5 L-82.75 -59.1 -84.45 -57.55 Q-85.65 -56.2 -85.5 -55.4 L-85.2 -55.25 Q-84.6 -55.65 -83.3 -56.95 -81.95 -58.25 -81.9 -58.65 L-81.15 -58.65 Q-80.55 -58.75 -80.2 -59.2 L-80.05 -59.4 -79.55 -59.8 Q-79.15 -60.25 -79.25 -60.85 L-79.9 -63.35 Q-79.0 -63.35 -78.55 -64.05 -78.25 -64.55 -78.35 -64.9 -78.5 -66.0 -79.5 -65.95 L-79.5 -66.4 Q-79.6 -66.9 -80.8 -67.6 L-82.05 -68.3 -79.3 -69.15 Q-78.15 -69.5 -78.2 -69.85 L-78.4 -70.4 -78.55 -70.6 -81.4 -70.3 -80.6 -71.3 Q-78.6 -73.85 -78.75 -74.65 -79.15 -76.85 -82.65 -73.65 L-83.0 -73.95 Q-83.6 -77.25 -85.7 -77.1 -87.55 -77.05 -87.55 -75.25 -88.3 -76.25 -89.35 -77.0 -92.0 -78.85 -95.25 -78.55 M-84.3 -61.95 L-84.05 -62.8 -83.4 -61.9 -84.3 -61.95 M-82.25 -64.35 L-82.7 -65.1 Q-82.85 -65.85 -82.45 -65.3 L-81.65 -65.1 -82.25 -64.35 M-90.6 -81.95 L-90.6 -81.35 Q-90.3 -79.65 -87.2 -78.55 L-81.9 -76.95 -81.65 -77.15 -81.5 -77.3 -81.4 -77.55 -81.45 -77.95 Q-81.95 -80.75 -90.6 -81.95 M-108.3 -62.75 L-108.15 -62.1 -108.1 -62.15 -108.3 -62.95 -108.3 -62.75 M-116.7 -50.4 L-116.7 -50.5 -116.15 -51.15 -116.1 -50.05 -116.7 -50.4 M-118.9 -46.05 L-120.6 -43.15 -120.6 -43.25 -120.9 -44.0 -118.9 -46.05 M-99.25 -49.55 L-101.7 -53.45 Q-103.25 -55.95 -104.45 -56.85 -104.75 -57.05 -104.65 -56.3 -104.5 -55.45 -102.1 -52.3 -99.85 -49.3 -99.25 -48.85 L-99.25 -48.8 -98.65 -46.5 Q-97.85 -44.35 -96.7 -44.5 L-96.25 -44.6 -96.4 -44.7 -97.55 -47.15 -98.9 -49.8 -99.2 -49.75 -99.25 -49.55 M-102.05 -50.7 L-103.3 -52.65 -105.9 -56.65 -106.15 -56.6 -106.0 -54.75 Q-105.85 -54.05 -103.95 -51.4 L-102.35 -49.25 -102.3 -49.2 Q-101.55 -46.8 -100.55 -46.9 -100.1 -46.95 -100.05 -47.15 L-100.15 -47.25 Q-101.3 -50.45 -101.7 -51.0 L-102.05 -50.7 M-107.0 -53.45 L-107.0 -52.55 -105.75 -49.7 -104.6 -47.5 -104.3 -47.65 -104.6 -49.25 -106.85 -53.5 -107.0 -53.45 M-84.1 -72.15 L-85.4 -70.6 -86.1 -72.75 Q-85.3 -72.25 -84.1 -72.15 M-81.1 -57.2 L-82.1 -56.1 -80.7 -56.25 -79.4 -57.7 Q-80.25 -57.85 -81.1 -57.2 M-142.45 -55.85 L-141.3 -56.75 -139.05 -53.9 -138.7 -53.6 Q-141.2 -55.4 -142.45 -55.85 M-139.7 -50.5 Q-141.75 -51.95 -142.7 -51.3 -142.2 -50.2 -140.35 -48.9 -138.45 -47.6 -137.4 -47.7 L-136.9 -47.85 -137.05 -47.9 Q-138.15 -49.3 -139.7 -50.5 M-123.1 -46.95 L-122.85 -46.4 -122.5 -46.4 Q-121.55 -46.7 -120.95 -47.35 -120.35 -47.95 -120.4 -48.4 -120.5 -48.85 -120.7 -48.85 L-121.15 -48.85 Q-122.05 -48.55 -122.65 -47.95 -123.15 -47.4 -123.1 -46.95 M-126.45 -25.1 L-126.35 -24.9 -126.35 -24.95 -126.3 -24.95 -126.45 -25.1 M-116.1 -35.5 Q-116.65 -35.6 -117.65 -34.9 L-118.0 -34.6 -117.5 -35.8 Q-117.8 -37.45 -118.8 -36.95 -118.15 -38.0 -118.2 -38.3 -118.6 -40.6 -121.75 -38.45 -125.05 -36.45 -124.75 -34.85 L-124.25 -33.7 Q-123.45 -32.7 -122.1 -32.85 L-121.85 -33.1 -121.85 -33.0 Q-121.8 -31.5 -120.4 -31.7 -120.0 -31.75 -119.2 -32.75 -119.45 -32.05 -119.3 -31.25 -119.1 -30.25 -118.2 -30.4 L-116.7 -32.15 Q-115.35 -34.05 -115.4 -34.45 -115.5 -35.05 -115.75 -35.35 L-115.5 -35.2 Q-113.35 -34.15 -112.25 -32.0 L-112.1 -31.45 Q-112.55 -31.45 -113.2 -31.05 -114.85 -30.1 -114.55 -28.4 -114.6 -26.9 -113.2 -27.05 L-112.1 -28.55 -111.55 -29.55 -111.05 -28.4 Q-109.75 -26.05 -106.6 -26.45 -103.7 -26.8 -103.15 -29.55 L-102.1 -33.25 -97.7 -37.35 Q-96.65 -38.65 -96.95 -40.4 -97.55 -43.8 -100.1 -44.4 -102.65 -44.95 -102.2 -42.35 -101.7 -39.4 -102.95 -38.45 -105.7 -36.4 -107.75 -32.4 L-109.95 -35.55 Q-111.5 -37.5 -114.6 -38.5 L-114.05 -39.5 Q-113.8 -40.0 -113.9 -40.5 L-114.15 -41.2 Q-114.6 -41.8 -115.4 -41.7 -116.95 -41.5 -117.45 -39.75 -117.8 -38.65 -117.65 -37.65 -117.4 -36.25 -116.1 -35.5 M-89.25 -42.25 Q-88.45 -42.35 -88.15 -42.95 L-88.05 -43.85 Q-88.35 -45.35 -91.25 -45.3 -94.2 -45.25 -93.95 -44.0 -93.85 -43.25 -93.15 -42.75 -91.85 -41.9 -89.25 -42.25 M-99.75 -27.05 Q-99.3 -27.1 -99.15 -27.3 L-99.0 -27.45 -99.0 -28.25 Q-99.4 -30.55 -101.05 -31.15 -102.65 -31.7 -102.3 -29.6 L-101.6 -28.3 Q-100.7 -26.95 -99.75 -27.05 M-98.4 -32.25 Q-100.5 -33.15 -100.25 -31.55 -97.4 -28.85 -97.0 -28.9 L-96.35 -29.1 -96.1 -29.3 -96.05 -29.55 -96.1 -30.05 Q-96.35 -31.4 -98.4 -32.25 M-94.65 -35.5 Q-93.2 -34.05 -92.1 -34.15 -91.5 -34.25 -91.1 -34.65 -90.75 -35.05 -90.85 -35.65 -91.0 -36.6 -93.55 -37.75 -96.1 -38.9 -95.75 -36.9 L-94.65 -35.5 M-113.85 -31.95 Q-114.1 -33.35 -115.5 -32.5 -117.05 -31.75 -116.8 -30.2 -116.75 -29.0 -115.55 -29.15 -115.25 -29.15 -114.5 -30.25 -113.75 -31.35 -113.85 -31.95 M-107.55 -16.75 L-107.35 -16.1 Q-107.0 -15.4 -105.8 -15.5 -105.3 -15.6 -104.9 -15.95 -104.45 -16.4 -104.55 -17.05 -104.8 -18.35 -106.3 -18.4 -107.85 -18.5 -107.55 -16.75 M-111.4 -11.05 L-111.65 -11.55 -111.05 -11.25 -111.4 -11.05 M-101.45 -14.5 L-101.8 -16.0 Q-102.25 -18.6 -100.95 -21.65 -102.5 -21.5 -103.5 -20.6 -104.9 -19.35 -104.55 -17.35 -104.15 -15.05 -101.6 -13.0 L-101.3 -12.7 -101.35 -14.15 -101.45 -14.5 M-95.25 -12.75 Q-95.45 -13.95 -96.65 -13.55 -97.9 -13.15 -97.7 -12.05 L-97.4 -11.05 -96.95 -10.85 -96.3 -10.85 Q-95.65 -10.9 -95.4 -11.75 L-95.25 -12.75 M-108.3 -3.0 Q-106.65 -3.2 -107.1 -5.7 -107.45 -7.65 -109.15 -7.45 -110.8 -7.2 -110.35 -4.55 -109.9 -2.8 -108.3 -3.0 M-102.15 -9.7 Q-101.85 -10.4 -101.95 -11.2 -102.25 -12.9 -103.95 -12.9 -105.65 -12.9 -105.25 -10.65 L-104.95 -9.6 Q-104.7 -8.9 -104.1 -8.75 -104.8 -8.1 -104.6 -6.8 -103.4 -3.15 -100.95 -3.45 -99.6 -3.65 -99.25 -5.3 -99.1 -6.25 -99.3 -7.3 -99.7 -9.55 -102.3 -9.35 L-102.15 -9.7 M-96.7 -3.25 Q-95.55 -3.55 -95.3 -2.15 -95.25 -1.9 -95.55 -1.25 -95.85 -0.5 -96.3 -0.45 -97.5 -0.3 -97.8 -1.85 -98.0 -2.95 -96.7 -3.25 M-93.65 -5.05 Q-93.95 -4.35 -94.7 -4.25 -95.65 -4.1 -96.05 -4.9 L-96.35 -5.45 Q-96.55 -6.85 -95.15 -7.05 -93.8 -7.2 -93.6 -5.8 -93.5 -5.45 -93.65 -5.05 M-102.3 2.6 Q-102.65 3.5 -103.55 3.6 -104.75 3.75 -105.3 2.95 L-105.6 2.0 Q-105.9 0.15 -104.2 -0.1 -102.5 -0.3 -102.2 1.25 -102.1 1.95 -102.3 2.6" fill="#eaaa48" fill-rule="evenodd" stroke="none"/>
    <path d="M-147.15 -55.0 L-147.95 -56.2 -147.9 -56.3 -147.7 -56.4 -147.15 -55.0" fill="#170b10" fill-rule="evenodd" stroke="none"/>
    <path d="M-98.9 -90.9 Q-92.6 -92.6 -86.8 -89.55 -87.55 -88.5 -88.9 -88.55 L-95.7 -88.25 -98.05 -87.75 Q-99.95 -87.2 -102.25 -86.0 L-106.5 -84.3 Q-114.5 -80.65 -119.6 -79.2 L-122.55 -79.25 -124.5 -79.7 -129.15 -80.05 -131.1 -79.85 -135.3 -79.1 -140.75 -77.7 -146.7 -76.05 -147.85 -76.1 -147.95 -76.35 -148.15 -76.95 Q-148.3 -77.9 -144.35 -79.65 -139.25 -81.95 -131.4 -82.95 L-129.65 -82.75 -126.0 -82.55 -125.6 -82.5 -116.7 -82.05 Q-115.0 -82.25 -106.5 -86.75 L-98.9 -90.9 M-75.7 -47.85 L-76.4 -42.0 Q-77.15 -36.75 -79.6 -32.2 -88.45 -26.25 -91.3 -18.15 L-92.1 -14.9 -92.1 -14.8 Q-91.45 -13.65 -91.05 -11.35 L-91.35 -10.5 -89.4 -0.7 Q-88.9 2.1 -89.7 4.35 -90.75 7.15 -93.7 8.0 -96.05 10.25 -99.9 10.65 -103.7 11.15 -107.15 9.1 -111.9 6.25 -113.8 1.05 -114.75 -1.6 -115.1 -4.2 -116.2 -11.95 -121.85 -17.65 -126.25 -22.15 -131.85 -25.45 -139.25 -29.7 -141.0 -37.95 L-140.75 -38.0 Q-138.6 -33.85 -135.85 -30.25 -133.7 -27.4 -129.45 -25.0 L-121.65 -21.2 -119.15 -19.85 Q-117.55 -19.8 -114.5 -17.95 L-114.25 -17.8 Q-115.65 -16.95 -115.25 -14.65 -115.15 -14.0 -114.65 -13.45 -113.8 -12.3 -112.05 -12.5 -111.0 -12.65 -110.5 -13.45 -109.65 -13.6 -109.25 -14.25 -107.0 -12.3 -106.9 -11.5 -106.7 -10.45 -106.9 -9.75 -107.1 -8.95 -107.95 -8.15 -108.75 -9.1 -109.8 -9.3 -112.6 -9.95 -111.65 -4.6 L-111.1 -2.5 Q-110.15 -0.05 -108.6 -0.25 -106.95 -0.45 -106.4 -1.85 -106.05 -2.85 -106.25 -4.0 L-106.6 -5.6 Q-105.25 -3.55 -103.8 -2.35 -102.55 -1.2 -100.4 -1.15 -97.85 -3.95 -98.3 -6.4 -98.65 -8.55 -99.4 -10.1 -98.4 -9.5 -97.2 -9.65 -95.85 -9.8 -95.05 -11.5 -94.4 -12.85 -94.55 -13.85 -95.15 -17.15 -98.5 -16.6 L-99.0 -16.45 -98.95 -17.6 -98.9 -21.25 -98.95 -21.6 Q-94.85 -21.05 -94.15 -17.0 -94.05 -16.45 -94.25 -15.7 L-93.6 -15.85 Q-93.25 -19.0 -90.65 -22.55 -88.4 -25.65 -85.45 -28.05 -82.5 -30.25 -80.4 -34.15 -78.6 -37.45 -76.9 -42.9 -76.35 -44.6 -75.7 -47.85 M-113.6 -88.2 Q-110.95 -89.5 -107.45 -91.5 -99.6 -96.15 -96.0 -96.1 L-95.45 -96.1 Q-97.55 -93.8 -101.05 -91.5 -104.45 -90.95 -108.45 -88.6 -115.3 -84.45 -117.55 -84.2 L-124.55 -84.5 -126.4 -84.85 -127.2 -85.2 Q-129.7 -86.6 -130.55 -88.45 -128.95 -88.2 -125.8 -86.65 -124.75 -86.1 -123.25 -85.95 L-121.25 -85.95 -120.3 -85.55 -119.65 -85.35 Q-118.7 -85.5 -116.9 -86.2 -115.4 -86.9 -115.05 -87.55 L-113.6 -88.2 M-95.45 -85.1 L-94.45 -85.5 -94.5 -85.35 -94.55 -85.25 -95.45 -85.1 M-100.6 -59.95 L-101.5 -60.85 Q-102.55 -59.75 -104.25 -59.55 -105.95 -59.3 -106.55 -60.8 L-106.9 -62.2 Q-107.45 -65.45 -104.25 -67.3 L-104.55 -67.95 -105.4 -71.0 Q-105.85 -73.65 -104.1 -76.8 -102.0 -80.7 -97.55 -81.6 L-96.5 -82.2 Q-92.65 -83.9 -92.2 -81.4 -92.15 -81.05 -92.75 -80.65 L-93.65 -80.15 Q-93.9 -79.55 -95.25 -78.55 -96.2 -77.8 -97.7 -76.95 -102.0 -74.35 -101.45 -71.4 L-100.15 -67.35 -100.15 -66.55 -100.15 -66.45 Q-100.1 -66.1 -100.9 -64.8 -100.05 -64.75 -97.3 -62.8 -94.35 -60.65 -92.0 -60.95 -89.35 -61.25 -88.5 -63.95 -88.05 -65.2 -88.15 -66.7 -87.8 -69.65 -85.85 -69.65 -83.95 -69.65 -83.65 -67.75 L-83.5 -66.6 -82.65 -67.2 Q-82.1 -67.9 -82.3 -68.85 -82.5 -69.95 -84.85 -69.8 L-85.3 -69.75 -85.5 -70.4 -85.4 -70.6 -84.1 -72.15 -82.45 -72.25 -81.95 -72.3 -82.1 -72.4 -82.0 -73.0 -82.65 -73.65 Q-79.15 -76.85 -78.75 -74.65 -78.6 -73.85 -80.6 -71.3 L-81.4 -70.3 -78.55 -70.6 -78.4 -70.4 -78.2 -69.85 Q-78.15 -69.5 -79.3 -69.15 L-82.05 -68.3 -80.8 -67.6 Q-79.6 -66.9 -79.5 -66.4 L-79.5 -65.95 -80.8 -65.6 -81.65 -65.1 -82.45 -65.3 Q-82.85 -65.85 -82.7 -65.1 L-82.25 -64.35 Q-82.75 -63.5 -82.55 -62.4 L-82.3 -61.7 -82.55 -61.75 -83.4 -61.9 -84.05 -62.8 -84.3 -61.95 Q-85.6 -61.9 -86.2 -61.15 -87.0 -59.5 -87.65 -58.6 -88.95 -57.05 -92.1 -56.65 -94.95 -56.3 -97.75 -58.25 L-100.6 -59.95 M-106.5 -80.2 Q-107.2 -79.75 -108.25 -79.05 -111.8 -76.75 -115.55 -76.25 L-118.15 -76.1 -120.55 -76.15 -120.7 -76.4 -118.85 -77.1 Q-112.6 -78.1 -106.5 -80.2 M-135.75 -75.9 L-132.9 -76.2 Q-122.5 -76.35 -120.7 -65.9 -120.6 -65.35 -120.65 -64.7 L-120.9 -63.6 -121.4 -62.4 Q-120.7 -62.25 -120.25 -61.6 L-119.75 -60.45 -119.7 -60.3 Q-121.25 -59.15 -121.7 -56.75 -121.9 -55.25 -123.2 -53.45 -125.3 -50.45 -129.3 -49.95 -133.45 -49.45 -137.7 -52.8 L-138.65 -53.55 -138.7 -53.6 -139.05 -53.9 -141.3 -56.75 -142.45 -55.85 -143.25 -56.0 -143.95 -55.7 Q-144.7 -55.95 -145.0 -56.95 -145.15 -57.8 -144.05 -58.8 -146.25 -58.85 -146.45 -60.15 -146.6 -61.0 -145.05 -61.75 L-144.5 -61.95 Q-147.2 -63.15 -147.35 -64.2 -147.7 -66.2 -141.4 -65.25 L-141.2 -65.25 Q-140.9 -67.7 -139.25 -69.6 L-137.65 -71.1 Q-138.45 -70.8 -139.05 -70.3 L-140.65 -69.3 Q-141.65 -69.15 -142.15 -70.1 L-142.4 -70.85 Q-142.7 -72.5 -140.4 -74.05 L-135.75 -75.9 M-132.8 -43.8 L-132.65 -43.65 -130.8 -42.6 Q-129.35 -41.4 -129.3 -41.0 -129.1 -39.9 -129.9 -39.75 L-129.95 -39.75 -128.65 -37.9 -126.25 -34.6 Q-123.75 -30.5 -119.4 -28.2 -112.95 -24.85 -103.4 -26.05 -97.4 -26.8 -93.7 -30.85 -92.6 -31.2 -92.65 -32.05 -90.7 -34.7 -89.5 -38.45 L-89.35 -38.85 -87.2 -46.2 Q-85.95 -49.5 -83.9 -49.95 -83.15 -49.7 -82.05 -49.0 -80.05 -47.7 -79.1 -47.85 L-78.85 -47.85 -78.4 -47.1 Q-78.25 -46.25 -78.7 -45.5 -79.2 -44.65 -80.25 -44.5 -80.8 -44.45 -81.6 -44.85 L-82.65 -45.45 Q-82.75 -39.3 -85.1 -33.95 -89.05 -24.95 -99.15 -22.45 -99.8 -24.3 -100.75 -22.1 L-102.85 -21.8 Q-117.6 -20.0 -126.95 -29.45 -131.95 -34.4 -133.5 -39.1 L-135.8 -38.1 Q-137.75 -37.9 -138.0 -39.4 L-137.8 -40.15 -137.4 -40.15 -135.25 -42.2 Q-134.2 -43.2 -132.8 -43.8 M-108.3 -62.75 L-108.3 -62.95 -108.1 -62.15 -108.15 -62.1 -108.3 -62.75 M-116.1 -35.5 Q-117.4 -36.25 -117.65 -37.65 -117.8 -38.65 -117.45 -39.75 -116.95 -41.5 -115.4 -41.7 -114.6 -41.8 -114.15 -41.2 L-113.9 -40.5 Q-113.8 -40.0 -114.05 -39.5 L-114.6 -38.5 Q-111.5 -37.5 -109.95 -35.55 L-107.75 -32.4 Q-105.7 -36.4 -102.95 -38.45 -101.7 -39.4 -102.2 -42.35 -102.65 -44.95 -100.1 -44.4 -97.55 -43.8 -96.95 -40.4 -96.65 -38.65 -97.7 -37.35 L-102.1 -33.25 -103.15 -29.55 Q-103.7 -26.8 -106.6 -26.45 -109.75 -26.05 -111.05 -28.4 L-111.55 -29.55 Q-111.25 -30.2 -111.3 -30.5 -111.45 -31.4 -112.1 -31.45 L-112.25 -32.0 Q-113.35 -34.15 -115.5 -35.2 L-115.75 -35.35 -116.1 -35.5 M-101.45 -14.5 L-101.35 -14.15 -101.3 -12.7 -101.6 -13.0 Q-104.15 -15.05 -104.55 -17.35 -104.9 -19.35 -103.5 -20.6 -102.5 -21.5 -100.95 -21.65 -102.25 -18.6 -101.8 -16.0 L-101.45 -14.5 M-111.4 -11.05 L-111.05 -11.25 -111.65 -11.55 -111.4 -11.05 M-93.65 -5.05 Q-93.5 -5.45 -93.6 -5.8 -93.8 -7.2 -95.15 -7.05 -96.55 -6.85 -96.35 -5.45 L-96.05 -4.9 Q-95.65 -4.1 -94.7 -4.25 -93.95 -4.35 -93.65 -5.05 M-96.7 -3.25 Q-98.0 -2.95 -97.8 -1.85 -97.5 -0.3 -96.3 -0.45 -95.85 -0.5 -95.55 -1.25 -95.25 -1.9 -95.3 -2.15 -95.55 -3.55 -96.7 -3.25 M-102.3 2.6 Q-102.1 1.95 -102.2 1.25 -102.5 -0.3 -104.2 -0.1 -105.9 0.15 -105.6 2.0 L-105.3 2.95 Q-104.75 3.75 -103.55 3.6 -102.65 3.5 -102.3 2.6" fill="#c78f3d" fill-rule="evenodd" stroke="none"/>
    <path d="M-98.9 -90.9 L-106.5 -86.75 Q-115.0 -82.25 -116.7 -82.05 L-125.6 -82.5 -125.75 -82.55 Q-127.25 -83.05 -128.15 -83.65 L-129.35 -84.85 -128.5 -85.15 -126.4 -84.85 -124.55 -84.5 -117.55 -84.2 Q-115.3 -84.45 -108.45 -88.6 -104.45 -90.95 -101.05 -91.5 L-97.85 -91.55 -98.9 -90.9 M-119.6 -79.2 Q-114.5 -80.65 -106.5 -84.3 L-102.25 -86.0 Q-98.6 -87.2 -95.65 -87.2 L-92.05 -86.75 -93.05 -86.2 -94.45 -85.5 -95.45 -85.1 -97.3 -84.2 -103.75 -78.8 -109.95 -73.95 -110.85 -74.75 Q-111.1 -76.25 -105.25 -80.55 L-104.85 -80.8 -106.5 -80.2 Q-112.6 -78.1 -118.85 -77.1 L-120.95 -76.85 Q-124.35 -76.4 -126.05 -76.8 L-128.55 -77.1 -129.7 -77.4 -129.25 -78.0 Q-132.0 -77.35 -135.75 -75.9 L-140.4 -74.05 -142.85 -73.1 -143.0 -73.1 -143.6 -73.1 -144.05 -73.35 -144.15 -73.95 Q-144.5 -76.0 -139.1 -77.7 L-136.2 -78.4 -126.3 -78.75 -125.8 -78.5 -126.15 -78.45 -123.5 -78.35 -119.6 -79.2 M-90.9 -85.35 Q-87.5 -85.05 -85.75 -83.45 L-86.25 -83.1 -87.2 -82.8 -92.75 -83.3 -93.8 -83.35 -93.95 -83.65 -94.15 -84.25 Q-94.4 -85.6 -90.95 -85.35 L-90.9 -85.35 M-115.05 -87.55 Q-115.4 -86.9 -116.9 -86.2 -118.7 -85.5 -119.65 -85.35 L-120.3 -85.55 -121.25 -85.95 -121.35 -85.95 -121.6 -86.4 -121.0 -86.8 -118.6 -87.85 Q-116.7 -88.5 -115.25 -88.55 -115.1 -88.75 -115.0 -88.1 L-114.95 -88.0 -115.05 -87.55 M-87.55 -75.25 Q-87.55 -77.05 -85.7 -77.1 -83.6 -77.25 -83.0 -73.95 L-82.65 -73.65 -82.0 -73.0 -82.1 -72.4 -81.95 -72.3 -82.45 -72.25 -84.1 -72.15 Q-85.3 -72.25 -86.1 -72.75 L-86.2 -72.85 Q-87.3 -73.55 -87.45 -74.6 L-87.55 -75.25 M-124.9 -48.05 Q-123.75 -47.1 -123.4 -45.15 L-121.95 -45.0 -120.95 -46.25 -120.0 -47.35 -116.95 -51.0 -116.7 -50.5 -116.7 -50.4 -116.65 -50.1 Q-116.45 -49.0 -118.9 -46.1 L-118.9 -46.05 -120.9 -44.0 -120.6 -43.25 -120.6 -43.15 -121.05 -42.5 -122.95 -40.7 Q-120.3 -42.5 -119.95 -40.4 L-124.7 -36.3 Q-125.9 -36.15 -126.1 -37.2 -126.25 -38.0 -124.95 -39.2 -126.1 -38.4 -126.6 -38.35 L-127.1 -38.35 -127.6 -38.4 -127.65 -38.55 -127.85 -39.1 Q-127.95 -39.85 -126.3 -41.45 L-126.4 -41.4 Q-128.05 -41.2 -128.25 -42.25 -128.35 -42.95 -127.05 -43.75 -128.0 -44.9 -129.45 -44.7 -131.35 -44.5 -132.8 -43.8 -134.2 -43.2 -135.25 -42.2 L-137.4 -40.15 -137.8 -40.15 Q-138.5 -40.25 -138.85 -40.8 L-139.15 -41.65 Q-139.45 -43.35 -137.25 -45.3 -135.7 -46.65 -133.65 -47.55 L-132.1 -48.2 Q-127.15 -49.85 -124.9 -48.05 M-117.2 -46.4 Q-116.2 -47.55 -115.3 -47.75 L-115.0 -47.6 -114.75 -47.0 -115.0 -46.5 Q-114.7 -46.65 -114.6 -46.05 -114.55 -45.8 -116.05 -43.5 -117.8 -41.0 -119.0 -40.35 L-119.4 -40.45 -119.6 -41.05 -119.5 -41.8 Q-119.9 -42.0 -120.05 -42.6 L-119.3 -43.75 -117.2 -46.4 M-93.7 -30.85 L-94.4 -30.7 Q-95.55 -30.6 -96.55 -31.65 L-97.3 -32.7 Q-97.85 -35.85 -95.3 -34.4 L-92.7 -32.2 -92.65 -32.05 Q-92.6 -31.2 -93.7 -30.85 M-89.5 -38.45 Q-89.8 -37.75 -90.6 -37.65 -92.35 -37.45 -93.45 -38.75 L-94.15 -39.85 Q-94.55 -41.95 -92.0 -41.15 -89.55 -40.3 -89.35 -39.25 L-89.35 -38.85 -89.5 -38.45 M-83.9 -49.95 L-85.0 -50.15 Q-87.2 -49.9 -90.05 -48.1 L-92.6 -46.35 Q-94.85 -46.1 -95.05 -47.2 L-95.05 -47.4 -95.3 -47.35 Q-96.7 -47.2 -98.85 -50.85 L-98.75 -51.6 -98.35 -51.85 -97.15 -50.85 -95.05 -48.85 -94.75 -50.05 -95.05 -50.3 -97.75 -53.0 -98.6 -54.05 -97.85 -54.0 Q-96.05 -53.75 -94.05 -52.05 L-93.65 -51.75 -93.05 -52.4 Q-90.85 -54.3 -87.15 -54.9 -83.6 -55.5 -80.8 -54.35 -77.8 -53.2 -77.3 -50.5 -77.15 -49.6 -77.65 -48.8 -78.1 -48.05 -78.85 -47.85 L-79.1 -47.85 Q-80.05 -47.7 -82.05 -49.0 -83.15 -49.7 -83.9 -49.95 M-90.6 -81.95 Q-81.95 -80.75 -81.45 -77.95 L-81.4 -77.55 -81.5 -77.3 -81.65 -77.15 -81.9 -76.95 -87.2 -78.55 Q-90.3 -79.65 -90.6 -81.35 L-90.6 -81.95 M-99.25 -49.55 L-99.2 -49.75 -98.9 -49.8 -97.55 -47.15 -96.4 -44.7 -96.25 -44.6 -96.7 -44.5 Q-97.85 -44.35 -98.65 -46.5 L-99.25 -48.8 -99.25 -48.85 -99.25 -49.55 M-102.05 -50.7 L-101.7 -51.0 Q-101.3 -50.45 -100.15 -47.25 L-100.05 -47.15 Q-100.1 -46.95 -100.55 -46.9 -101.55 -46.8 -102.3 -49.2 L-102.35 -49.25 Q-102.5 -50.2 -102.05 -50.7 M-110.5 -13.45 L-110.7 -13.45 Q-112.1 -13.25 -112.6 -13.85 L-112.95 -14.7 Q-113.35 -16.95 -111.35 -17.85 -109.35 -18.65 -109.0 -16.65 -108.7 -15.05 -109.25 -14.25 -109.65 -13.6 -110.5 -13.45 M-115.75 -35.35 Q-115.5 -35.05 -115.4 -34.45 -115.35 -34.05 -116.7 -32.15 L-118.2 -30.4 Q-119.1 -30.25 -119.3 -31.25 -119.45 -32.05 -119.2 -32.75 -120.0 -31.75 -120.4 -31.7 -121.8 -31.5 -121.85 -33.0 L-121.85 -33.1 -122.1 -32.85 Q-123.45 -32.7 -124.25 -33.7 L-124.75 -34.85 Q-125.05 -36.45 -121.75 -38.45 -118.6 -40.6 -118.2 -38.3 -118.15 -38.0 -118.8 -36.95 -117.8 -37.45 -117.5 -35.8 L-118.0 -34.6 -117.65 -34.9 Q-116.65 -35.6 -116.1 -35.5 L-115.75 -35.35 M-111.55 -29.55 L-112.1 -28.55 -113.2 -27.05 Q-114.6 -26.9 -114.55 -28.4 -114.85 -30.1 -113.2 -31.05 -112.55 -31.45 -112.1 -31.45 -111.45 -31.4 -111.3 -30.5 -111.25 -30.2 -111.55 -29.55 M-89.25 -42.25 Q-91.85 -41.9 -93.15 -42.75 -93.85 -43.25 -93.95 -44.0 -94.2 -45.25 -91.25 -45.3 -88.35 -45.35 -88.05 -43.85 L-88.15 -42.95 Q-88.45 -42.35 -89.25 -42.25 M-94.65 -35.5 L-95.75 -36.9 Q-96.1 -38.9 -93.55 -37.75 -91.0 -36.6 -90.85 -35.65 -90.75 -35.05 -91.1 -34.65 -91.5 -34.25 -92.1 -34.15 -93.2 -34.05 -94.65 -35.5 M-98.4 -32.25 Q-96.35 -31.4 -96.1 -30.05 L-96.05 -29.55 -96.1 -29.3 -96.35 -29.1 -97.0 -28.9 Q-97.4 -28.85 -100.25 -31.55 -100.5 -33.15 -98.4 -32.25 M-99.75 -27.05 Q-100.7 -26.95 -101.6 -28.3 L-102.3 -29.6 Q-102.65 -31.7 -101.05 -31.15 -99.4 -30.55 -99.0 -28.25 L-99.0 -27.45 -99.15 -27.3 Q-99.3 -27.1 -99.75 -27.05 M-113.85 -31.95 Q-113.75 -31.35 -114.5 -30.25 -115.25 -29.15 -115.55 -29.15 -116.75 -29.0 -116.8 -30.2 -117.05 -31.75 -115.5 -32.5 -114.1 -33.35 -113.85 -31.95 M-107.55 -16.75 Q-107.85 -18.5 -106.3 -18.4 -104.8 -18.35 -104.55 -17.05 -104.45 -16.4 -104.9 -15.95 -105.3 -15.6 -105.8 -15.5 -107.0 -15.4 -107.35 -16.1 L-107.55 -16.75 M-102.15 -9.7 L-102.3 -9.35 Q-99.7 -9.55 -99.3 -7.3 -99.1 -6.25 -99.25 -5.3 -99.6 -3.65 -100.95 -3.45 -103.4 -3.15 -104.6 -6.8 -104.8 -8.1 -104.1 -8.75 -104.7 -8.9 -104.95 -9.6 L-105.25 -10.65 Q-105.65 -12.9 -103.95 -12.9 -102.25 -12.9 -101.95 -11.2 -101.85 -10.4 -102.15 -9.7 M-108.3 -3.0 Q-109.9 -2.8 -110.35 -4.55 -110.8 -7.2 -109.15 -7.45 -107.45 -7.65 -107.1 -5.7 -106.65 -3.2 -108.3 -3.0 M-95.25 -12.75 L-95.4 -11.75 Q-95.65 -10.9 -96.3 -10.85 L-96.95 -10.85 -97.4 -11.05 -97.7 -12.05 Q-97.9 -13.15 -96.65 -13.55 -95.45 -13.95 -95.25 -12.75" fill="#ffb84f" fill-rule="evenodd" stroke="none"/>
    <path d="M-79.5 -65.95 Q-78.5 -66.0 -78.35 -64.9 -78.25 -64.55 -78.55 -64.05 -79.0 -63.35 -79.9 -63.35 L-79.25 -60.85 Q-79.15 -60.25 -79.55 -59.8 L-80.05 -59.4 -80.2 -59.2 Q-80.55 -58.75 -81.15 -58.65 L-81.9 -58.65 Q-81.95 -58.25 -83.3 -56.95 -84.6 -55.65 -85.2 -55.25 L-85.5 -55.4 Q-85.65 -56.2 -84.45 -57.55 L-82.75 -59.1 -83.8 -59.5 Q-84.25 -59.45 -85.8 -57.0 -87.35 -54.5 -91.75 -54.0 -94.65 -53.6 -98.25 -55.7 L-101.85 -57.75 -102.3 -57.35 -102.75 -57.05 -103.4 -57.15 -103.65 -57.4 -103.85 -58.05 Q-104.0 -58.8 -103.6 -59.2 -103.05 -59.85 -101.15 -60.05 L-100.6 -59.95 -97.75 -58.25 Q-94.95 -56.3 -92.1 -56.65 -88.95 -57.05 -87.65 -58.6 -87.0 -59.5 -86.2 -61.15 -85.6 -61.9 -84.3 -61.95 L-83.4 -61.9 -82.55 -61.75 -82.3 -61.7 -82.55 -62.4 Q-82.75 -63.5 -82.25 -64.35 L-81.65 -65.1 -80.8 -65.6 -79.5 -65.95 M-119.7 -60.3 L-118.7 -60.75 -118.05 -60.95 Q-116.25 -61.3 -115.95 -59.6 -115.8 -58.7 -116.45 -58.4 L-118.0 -58.05 -118.7 -56.0 -117.55 -57.75 -117.45 -57.65 -117.25 -57.15 Q-117.1 -56.35 -117.4 -55.2 L-117.35 -55.25 -117.3 -55.0 Q-117.25 -54.5 -117.5 -53.4 -117.75 -52.15 -118.1 -51.95 L-118.15 -51.9 -118.35 -52.4 -118.2 -53.05 -118.4 -52.8 Q-119.95 -50.0 -121.7 -48.85 L-121.9 -48.6 -122.2 -49.0 -120.65 -52.35 Q-122.6 -49.4 -124.9 -48.05 -127.15 -49.85 -132.1 -48.2 L-133.65 -47.55 Q-136.3 -48.4 -139.3 -50.3 -142.4 -52.2 -144.6 -54.3 -144.7 -54.95 -144.3 -55.4 L-143.95 -55.7 -143.25 -56.0 -142.45 -55.85 Q-141.2 -55.4 -138.7 -53.6 L-138.65 -53.55 -137.7 -52.8 Q-133.45 -49.45 -129.3 -49.95 -125.3 -50.45 -123.2 -53.45 -121.9 -55.25 -121.7 -56.75 -121.25 -59.15 -119.7 -60.3 M-120.95 -46.25 L-120.25 -47.35 -118.95 -48.8 -117.5 -50.8 -116.25 -52.7 -116.4 -53.95 -116.65 -58.15 -116.5 -58.2 Q-115.65 -56.8 -115.5 -56.05 -115.35 -55.05 -115.55 -53.1 L-115.55 -52.9 -115.55 -52.75 -115.65 -52.0 -115.85 -50.05 -116.05 -49.95 -116.0 -49.8 Q-115.85 -48.75 -117.2 -46.4 L-119.3 -43.75 Q-120.2 -42.85 -121.05 -42.5 L-120.6 -43.15 -118.9 -46.05 -118.9 -46.1 Q-116.45 -49.0 -116.65 -50.1 L-116.7 -50.4 -116.1 -50.05 -116.15 -51.15 -116.7 -50.5 -116.95 -51.0 -120.0 -47.35 -120.95 -46.25 M-98.75 -51.6 L-99.9 -52.3 Q-101.6 -53.6 -102.15 -54.9 L-101.95 -54.9 -98.9 -52.9 Q-96.8 -51.65 -96.15 -50.9 L-96.2 -50.75 -97.15 -50.85 -98.35 -51.85 -98.75 -51.6 M-97.75 -53.0 L-98.25 -53.4 -101.3 -56.45 -101.05 -56.45 Q-100.25 -55.5 -97.95 -54.1 L-97.85 -54.0 -98.6 -54.05 -97.75 -53.0 M-99.25 -48.85 Q-99.85 -49.3 -102.1 -52.3 -104.5 -55.45 -104.65 -56.3 -104.75 -57.05 -104.45 -56.85 -103.25 -55.95 -101.7 -53.45 L-99.25 -49.55 -99.25 -48.85 M-102.35 -49.25 L-103.95 -51.4 Q-105.85 -54.05 -106.0 -54.75 L-106.15 -56.6 -105.9 -56.65 -103.3 -52.65 -102.05 -50.7 Q-102.5 -50.2 -102.35 -49.25 M-107.0 -53.45 L-106.85 -53.5 -104.6 -49.25 -104.3 -47.65 -104.6 -47.5 -105.75 -49.7 -107.0 -52.55 -107.0 -53.45 M-81.1 -57.2 Q-80.25 -57.85 -79.4 -57.7 L-80.7 -56.25 -82.1 -56.1 -81.1 -57.2 M-139.7 -50.5 Q-138.15 -49.3 -137.05 -47.9 L-136.9 -47.85 -137.4 -47.7 Q-138.45 -47.6 -140.35 -48.9 -142.2 -50.2 -142.7 -51.3 -141.75 -51.95 -139.7 -50.5 M-123.1 -46.95 Q-123.15 -47.4 -122.65 -47.95 -122.05 -48.55 -121.15 -48.85 L-120.7 -48.85 Q-120.5 -48.85 -120.4 -48.4 -120.35 -47.95 -120.95 -47.35 -121.55 -46.7 -122.5 -46.4 L-122.85 -46.4 -123.1 -46.95" fill="#ffc773" fill-rule="evenodd" stroke="none"/>
    <path d="M-127.05 -68.9 L-127.0 -69.25 Q-127.15 -70.1 -129.15 -70.8 L-133.25 -71.95 Q-134.9 -71.9 -136.2 -70.9 -137.4 -70.05 -137.3 -69.4 -137.2 -68.85 -136.7 -68.9 -136.25 -69.6 -134.2 -69.85 L-132.2 -70.05 -132.9 -69.85 Q-138.0 -68.35 -137.7 -66.45 L-137.6 -66.25 -137.3 -66.25 -136.3 -66.9 -136.15 -66.6 -135.65 -66.55 -135.15 -66.75 -132.6 -67.2 Q-130.35 -67.5 -128.1 -66.6 L-126.15 -65.6 Q-125.55 -65.7 -125.65 -66.35 -125.85 -67.35 -130.25 -68.5 L-129.45 -68.6 -127.95 -68.45 Q-127.7 -68.5 -127.55 -68.6 L-127.45 -68.55 Q-127.15 -68.6 -127.05 -68.9 M-122.4 -59.9 L-123.9 -59.9 -124.2 -59.05 Q-126.1 -54.65 -131.65 -53.95 -136.1 -53.4 -138.55 -57.8 L-138.8 -58.3 Q-140.5 -58.05 -141.45 -59.35 L-142.15 -60.65 Q-142.55 -62.85 -140.15 -63.0 -140.75 -66.9 -138.7 -69.7 -136.75 -72.35 -133.45 -72.95 -130.0 -73.5 -127.3 -71.65 -124.3 -69.6 -123.55 -65.35 L-123.4 -64.45 Q-120.3 -64.6 -119.9 -62.2 -119.55 -60.25 -122.4 -59.9 M-136.8 -63.6 L-138.75 -60.75 -137.8 -60.0 Q-131.0 -59.2 -125.05 -61.55 L-124.8 -62.05 Q-125.25 -64.5 -127.5 -65.3 L-130.35 -65.85 Q-132.8 -66.0 -134.75 -65.05 -135.85 -64.5 -136.8 -63.6 M-136.2 -58.6 L-135.6 -57.9 -129.55 -58.15 -134.1 -57.3 -134.85 -57.4 -134.75 -57.3 Q-134.85 -56.8 -134.55 -56.75 L-130.8 -57.05 -130.7 -57.1 -132.75 -55.9 -132.65 -55.8 -131.45 -55.8 Q-130.3 -55.95 -128.45 -56.95 -126.55 -57.9 -126.6 -58.3 -126.7 -58.6 -127.25 -58.55 L-127.2 -58.6 -126.25 -58.9 Q-125.45 -59.25 -125.5 -59.45 -125.55 -59.85 -126.35 -59.75 L-127.15 -59.5 -130.9 -58.9 -135.0 -58.6 -136.2 -58.6 M-128.8 -62.15 L-133.9 -61.5 Q-134.95 -61.5 -135.05 -62.1 -135.2 -63.05 -131.8 -63.5 -128.4 -63.9 -128.25 -62.95 -128.2 -62.75 -128.4 -62.45 L-128.8 -62.15 M-84.85 -69.8 Q-82.5 -69.95 -82.3 -68.85 -82.1 -67.9 -82.65 -67.2 -83.25 -66.5 -84.45 -66.35 L-84.85 -66.35 Q-84.95 -65.35 -85.3 -64.85 L-86.25 -64.35 -86.35 -64.35 Q-88.35 -60.15 -92.75 -59.65 -97.5 -59.05 -100.65 -63.2 L-101.55 -63.05 Q-103.7 -62.75 -104.45 -63.7 -104.75 -64.15 -104.7 -64.75 -104.85 -65.5 -103.95 -66.0 L-102.8 -66.95 -103.1 -67.95 Q-103.85 -72.2 -101.55 -75.2 -99.45 -77.9 -95.85 -78.45 -92.25 -79.05 -89.35 -77.0 -86.35 -74.9 -85.4 -70.6 L-85.5 -70.4 -85.3 -69.75 -84.85 -69.8 M-93.45 -76.95 L-93.25 -77.15 Q-93.4 -77.9 -94.75 -77.7 -96.45 -77.5 -98.9 -76.05 -101.4 -74.5 -101.25 -73.65 L-101.1 -73.25 -100.6 -73.2 Q-100.4 -73.25 -100.3 -73.45 L-99.7 -74.15 -99.0 -74.6 -99.0 -73.55 -98.9 -73.05 Q-100.35 -72.35 -100.25 -71.7 L-100.0 -71.45 -97.85 -72.5 -97.55 -72.5 -96.45 -72.7 -97.6 -71.5 Q-100.25 -70.2 -100.05 -69.05 -100.0 -68.7 -99.55 -68.75 L-97.9 -69.8 -96.8 -70.45 -96.05 -70.85 Q-93.6 -72.2 -91.4 -72.5 L-91.3 -72.45 -91.05 -72.35 -90.6 -72.2 -90.3 -72.2 Q-89.85 -72.25 -89.65 -72.45 L-89.45 -72.5 Q-89.1 -72.55 -89.2 -73.0 L-89.55 -73.55 Q-89.9 -74.95 -91.7 -74.7 -91.45 -74.95 -91.5 -75.1 -91.75 -76.65 -93.45 -76.95 M-98.3 -68.9 L-98.65 -68.65 Q-101.3 -66.35 -101.15 -65.45 -101.05 -65.0 -100.6 -65.05 L-100.55 -65.1 -99.25 -64.75 -93.4 -65.05 -93.35 -65.1 -91.45 -65.25 Q-93.3 -64.25 -93.2 -63.75 L-93.0 -63.3 -92.9 -63.25 -91.4 -63.15 Q-90.35 -63.3 -89.15 -64.2 -87.9 -65.15 -88.0 -65.8 L-88.05 -66.15 Q-87.25 -66.5 -86.8 -66.8 L-86.6 -66.75 Q-85.95 -66.85 -86.1 -67.5 -86.25 -68.45 -88.25 -69.95 L-88.4 -70.1 Q-90.7 -71.75 -93.05 -71.45 -95.5 -71.15 -98.3 -68.9 M-90.6 -68.5 Q-90.55 -68.05 -90.65 -68.0 -91.1 -67.65 -93.15 -67.4 L-96.0 -67.35 Q-96.3 -67.4 -96.35 -67.8 L-96.2 -68.3 -93.4 -68.95 -90.75 -68.85 -90.6 -68.5 M-88.15 -67.9 L-88.1 -67.95 -88.05 -67.95 -88.15 -67.9" fill="#6e450e" fill-rule="evenodd" stroke="none"/>
    <path d="M-136.8 -63.6 Q-135.85 -64.5 -134.75 -65.05 -132.8 -66.0 -130.35 -65.85 L-127.5 -65.3 -127.1 -64.25 Q-126.9 -63.1 -128.5 -61.85 -130.2 -60.5 -132.35 -60.25 -136.5 -59.75 -136.9 -62.2 -137.05 -62.95 -136.8 -63.6 M-128.8 -62.15 L-128.4 -62.45 Q-128.2 -62.75 -128.25 -62.95 -128.4 -63.9 -131.8 -63.5 -135.2 -63.05 -135.05 -62.1 -134.95 -61.5 -133.9 -61.5 L-128.8 -62.15 M-98.3 -68.9 Q-95.5 -71.15 -93.05 -71.45 -90.7 -71.75 -88.4 -70.1 -88.35 -68.85 -90.15 -67.8 -91.85 -66.9 -94.4 -66.6 -96.15 -66.35 -97.05 -66.6 -98.2 -66.85 -98.4 -68.0 L-98.3 -68.9 M-90.6 -68.5 L-90.75 -68.85 -93.4 -68.95 -96.2 -68.3 -96.35 -67.8 Q-96.3 -67.4 -96.0 -67.35 L-93.15 -67.4 Q-91.1 -67.65 -90.65 -68.0 -90.55 -68.05 -90.6 -68.5" fill="#ffd699" fill-rule="evenodd" stroke="none"/>
    <path d="M-127.05 -68.9 Q-127.15 -68.6 -127.45 -68.55 L-127.55 -68.6 Q-127.7 -68.5 -127.95 -68.45 L-129.45 -68.6 -130.25 -68.5 Q-125.85 -67.35 -125.65 -66.35 -125.55 -65.7 -126.15 -65.6 L-128.1 -66.6 Q-130.35 -67.5 -132.6 -67.2 L-135.15 -66.75 -135.65 -66.55 -136.15 -66.6 -136.3 -66.9 -137.3 -66.25 -137.6 -66.25 -137.7 -66.45 Q-138.0 -68.35 -132.9 -69.85 L-132.2 -70.05 -134.2 -69.85 Q-136.25 -69.6 -136.7 -68.9 -137.2 -68.85 -137.3 -69.4 -137.4 -70.05 -136.2 -70.9 -134.9 -71.9 -133.25 -71.95 L-129.15 -70.8 Q-127.15 -70.1 -127.0 -69.25 L-127.05 -68.9 M-136.2 -58.6 L-135.0 -58.6 -130.9 -58.9 -127.15 -59.5 -126.35 -59.75 Q-125.55 -59.85 -125.5 -59.45 -125.45 -59.25 -126.25 -58.9 L-127.2 -58.6 -127.25 -58.55 Q-126.7 -58.6 -126.6 -58.3 -126.55 -57.9 -128.45 -56.95 -130.3 -55.95 -131.45 -55.8 L-132.65 -55.8 -132.75 -55.9 -130.7 -57.1 -130.8 -57.05 -134.55 -56.75 Q-134.85 -56.8 -134.75 -57.3 L-134.85 -57.4 -134.1 -57.3 -129.55 -58.15 -135.6 -57.9 -136.2 -58.6 M-93.45 -76.95 Q-91.75 -76.65 -91.5 -75.1 -91.45 -74.95 -91.7 -74.7 -89.9 -74.95 -89.55 -73.55 L-89.2 -73.0 Q-89.1 -72.55 -89.45 -72.5 L-89.65 -72.45 Q-89.85 -72.25 -90.3 -72.2 L-90.6 -72.2 -91.05 -72.35 -91.3 -72.45 -91.4 -72.5 Q-93.6 -72.2 -96.05 -70.85 L-96.8 -70.45 -97.9 -69.8 -99.55 -68.75 Q-100.0 -68.7 -100.05 -69.05 -100.25 -70.2 -97.6 -71.5 L-96.45 -72.7 -97.55 -72.5 -97.85 -72.5 -100.0 -71.45 -100.25 -71.7 Q-100.35 -72.35 -98.9 -73.05 L-99.0 -73.55 -99.0 -74.6 -99.7 -74.15 -100.3 -73.45 Q-100.4 -73.25 -100.6 -73.2 L-101.1 -73.25 -101.25 -73.65 Q-101.4 -74.5 -98.9 -76.05 -96.45 -77.5 -94.75 -77.7 -93.4 -77.9 -93.25 -77.15 L-93.45 -76.95 M-88.05 -66.15 L-88.0 -65.8 Q-87.9 -65.15 -89.15 -64.2 -90.35 -63.3 -91.4 -63.15 L-92.9 -63.25 -93.0 -63.3 -93.2 -63.75 Q-93.3 -64.25 -91.45 -65.25 L-89.7 -65.65 -88.05 -66.15" fill="#8a5611" fill-rule="evenodd" stroke="none"/>
    <path d="M-127.5 -65.3 Q-125.25 -64.5 -124.8 -62.05 L-125.05 -61.55 Q-131.0 -59.2 -137.8 -60.0 L-138.75 -60.75 -136.8 -63.6 Q-137.05 -62.95 -136.9 -62.2 -136.5 -59.75 -132.35 -60.25 -130.2 -60.5 -128.5 -61.85 -126.9 -63.1 -127.1 -64.25 L-127.5 -65.3 M-91.45 -65.25 L-93.35 -65.1 -93.4 -65.05 -99.25 -64.75 -100.55 -65.1 -100.6 -65.05 Q-101.05 -65.0 -101.15 -65.45 -101.3 -66.35 -98.65 -68.65 L-98.3 -68.9 -98.4 -68.0 Q-98.2 -66.85 -97.05 -66.6 -96.15 -66.35 -94.4 -66.6 -91.85 -66.9 -90.15 -67.8 -88.35 -68.85 -88.4 -70.1 L-88.25 -69.95 Q-86.25 -68.45 -86.1 -67.5 -85.95 -66.85 -86.6 -66.75 L-86.8 -66.8 Q-87.25 -66.5 -88.05 -66.15 L-89.7 -65.65 -91.45 -65.25 M-88.15 -67.9 L-88.05 -67.95 -88.1 -67.95 -88.15 -67.9" fill="#d6b380" fill-rule="evenodd" stroke="none"/>
    <path d="M-109.1 -64.6 L-108.95 -60.5 -108.35 -55.3 -108.0 -51.75 Q-107.55 -49.2 -105.25 -46.35 L-103.7 -46.55 Q-101.25 -46.65 -99.3 -45.45 -97.2 -44.2 -96.85 -41.95 L-96.75 -41.05 -96.75 -41.0 -97.55 -39.6 Q-99.05 -39.7 -100.65 -38.8 -104.7 -36.5 -104.2 -31.55 -105.1 -30.35 -106.4 -30.0 -106.65 -29.75 -107.0 -29.75 L-107.65 -29.85 Q-109.1 -29.95 -110.05 -31.3 -110.35 -32.8 -111.55 -34.65 -113.55 -37.7 -116.35 -37.35 L-118.1 -37.05 -118.55 -38.6 Q-119.05 -41.25 -117.6 -43.0 -116.4 -44.45 -114.5 -44.85 L-114.05 -46.2 Q-112.65 -50.6 -113.25 -54.25 L-114.35 -60.3 -115.75 -68.4 Q-116.3 -71.85 -114.45 -72.95 L-111.25 -73.1 Q-109.8 -72.25 -109.3 -69.5 -109.15 -68.65 -109.1 -64.6 M-84.85 -51.05 Q-84.65 -49.9 -85.0 -46.55 -85.4 -43.5 -86.15 -40.75 L-84.3 -41.05 Q-80.45 -41.5 -80.0 -38.75 L-80.0 -38.4 -80.2 -38.1 Q-80.7 -38.35 -81.45 -39.55 -82.35 -40.5 -83.95 -40.3 -85.25 -40.15 -86.15 -39.55 L-86.55 -39.3 -87.15 -37.85 -88.75 -34.3 -88.35 -34.1 Q-87.65 -33.45 -87.45 -32.35 -87.4 -32.05 -87.85 -30.6 -88.35 -29.0 -88.75 -28.95 L-89.25 -29.05 -89.35 -29.45 -88.95 -30.75 -88.6 -32.3 -89.4 -32.8 -89.55 -32.85 Q-91.8 -29.4 -94.9 -27.3 -93.75 -26.5 -93.55 -25.4 L-93.6 -23.55 Q-93.75 -21.95 -94.15 -21.55 -94.65 -21.65 -94.7 -22.1 L-94.55 -23.45 -94.5 -25.25 Q-94.6 -25.95 -95.65 -26.6 L-95.8 -26.7 Q-97.75 -25.55 -99.95 -24.9 L-98.05 -22.35 Q-97.9 -21.55 -98.85 -20.6 -100.0 -19.4 -100.35 -18.65 L-100.3 -17.0 -99.9 -15.3 -99.9 -15.2 Q-98.65 -15.9 -97.95 -14.15 L-97.2 -10.7 -96.8 -8.35 -96.7 -5.2 -97.0 -5.15 -97.95 -9.65 Q-98.4 -12.6 -99.0 -14.15 L-99.75 -14.25 -98.8 -8.75 -98.85 -8.35 -99.15 -8.05 Q-100.1 -7.95 -100.5 -11.7 L-101.15 -16.85 Q-101.65 -19.55 -100.45 -20.7 -99.3 -21.75 -99.35 -22.15 L-101.25 -24.5 -103.6 -24.1 -107.05 -23.85 -107.4 -22.55 Q-108.05 -20.4 -109.5 -20.2 -111.0 -20.05 -111.75 -21.15 -112.15 -21.75 -112.25 -22.5 L-112.15 -24.1 -112.1 -24.25 -114.7 -24.85 Q-115.3 -24.15 -115.6 -22.7 L-115.85 -20.15 -113.75 -18.2 Q-111.75 -16.5 -111.5 -15.6 L-110.65 -12.7 -110.15 -10.6 Q-109.8 -8.6 -110.25 -8.2 -111.05 -9.3 -111.55 -11.15 L-112.2 -14.25 Q-112.45 -16.1 -114.55 -17.45 -116.55 -18.85 -116.75 -20.0 -117.15 -22.2 -116.1 -24.9 L-115.95 -25.2 Q-118.8 -26.2 -121.3 -27.95 L-122.3 -26.4 Q-123.2 -24.7 -123.4 -24.7 -124.05 -24.6 -124.05 -25.2 -124.15 -25.8 -123.45 -27.0 L-123.55 -27.1 -124.15 -27.7 -125.0 -26.55 -126.35 -24.95 -126.35 -24.9 -126.45 -25.1 -125.65 -26.9 Q-125.6 -27.75 -124.4 -28.1 -123.45 -28.35 -122.85 -27.85 L-122.55 -28.3 -122.25 -28.6 Q-124.3 -30.2 -126.1 -32.2 L-126.9 -31.25 Q-127.45 -31.2 -128.55 -32.2 L-129.05 -31.3 -129.6 -30.45 Q-130.1 -30.6 -130.2 -31.05 -130.25 -31.6 -128.8 -33.45 -128.35 -33.5 -127.85 -33.1 L-127.3 -32.75 -126.85 -33.15 Q-130.6 -37.75 -132.1 -42.95 L-132.2 -44.2 Q-132.1 -44.75 -131.4 -44.85 -131.15 -44.85 -129.6 -41.8 L-128.25 -39.3 -128.25 -39.35 Q-127.85 -40.2 -127.1 -40.25 L-126.05 -40.15 -124.6 -40.1 Q-124.0 -40.2 -123.05 -41.65 -122.3 -42.8 -121.55 -42.45 L-121.3 -42.1 Q-121.2 -41.5 -122.5 -40.25 -123.85 -39.05 -124.85 -38.9 L-125.85 -39.0 -126.6 -39.15 -127.3 -38.45 -127.5 -38.0 -125.9 -35.75 Q-125.4 -36.3 -124.0 -36.7 -121.75 -37.4 -121.3 -34.95 -121.15 -34.05 -121.4 -33.65 L-122.5 -32.15 -119.65 -30.05 -118.6 -31.0 Q-117.3 -31.95 -116.8 -32.0 L-116.65 -31.75 Q-116.6 -31.35 -117.55 -30.5 L-118.55 -29.45 -118.55 -29.4 Q-112.4 -26.2 -104.15 -27.2 -99.3 -27.8 -95.7 -30.5 L-96.55 -31.7 Q-96.65 -32.25 -94.8 -34.1 -92.9 -35.9 -93.0 -36.35 L-93.45 -37.45 -93.95 -38.6 Q-94.05 -39.05 -93.25 -40.15 -92.4 -41.35 -91.7 -41.5 L-91.55 -41.2 Q-91.5 -41.05 -92.2 -39.9 L-92.9 -38.6 -91.95 -36.4 Q-91.75 -35.45 -95.5 -31.9 L-94.9 -31.1 Q-93.25 -32.6 -91.9 -34.6 -89.95 -37.4 -88.5 -42.35 L-88.4 -42.7 -89.5 -42.45 Q-90.55 -42.35 -91.9 -43.7 L-92.0 -44.2 -90.3 -44.0 -88.4 -43.9 -88.1 -43.9 Q-87.9 -44.8 -87.85 -45.9 L-87.65 -49.4 Q-87.35 -53.1 -86.3 -53.45 -85.35 -53.75 -84.85 -51.05 M-123.3 -35.9 Q-123.85 -35.8 -125.2 -34.9 L-123.15 -32.75 -122.8 -33.35 Q-122.2 -34.35 -122.3 -34.75 L-122.55 -35.35 -123.3 -35.9 M-103.7 -40.85 Q-104.85 -40.65 -104.65 -39.55 L-104.5 -38.95 Q-104.15 -38.55 -103.35 -38.65 -103.0 -38.7 -102.65 -39.0 -102.35 -39.4 -102.45 -39.9 -102.65 -41.05 -103.7 -40.85 M-107.55 -37.8 Q-107.75 -38.85 -109.15 -38.85 -110.7 -38.85 -110.45 -37.3 -109.85 -35.75 -108.65 -35.9 -108.15 -35.95 -107.75 -36.65 -107.45 -37.3 -107.55 -37.8 M-109.7 -42.8 Q-109.65 -42.25 -109.25 -41.75 -108.5 -40.8 -106.65 -41.0 -105.6 -41.15 -105.1 -42.05 -104.85 -42.75 -104.95 -43.4 -105.3 -45.55 -107.75 -45.5 -110.15 -45.45 -109.7 -42.8 M-111.0 -40.45 L-110.85 -41.6 Q-111.15 -43.25 -113.1 -43.0 -115.1 -42.75 -114.75 -40.85 -114.5 -39.25 -112.2 -39.55 -111.35 -39.65 -111.0 -40.45 M-109.8 -21.25 Q-108.55 -21.4 -108.25 -23.25 L-108.15 -23.85 -111.25 -24.1 -111.45 -22.75 Q-111.35 -22.2 -110.85 -21.7 -110.35 -21.2 -109.8 -21.25 M-107.8 -15.75 Q-108.35 -15.5 -108.1 -14.05 L-107.35 -11.55 -106.45 -8.95 -106.7 -8.75 Q-108.2 -10.85 -108.75 -14.05 -109.3 -17.25 -107.5 -16.3 -105.65 -15.35 -104.95 -11.75 L-105.05 -11.65 -105.35 -11.55 -106.0 -11.6 -106.65 -13.8 Q-107.15 -15.05 -107.8 -15.75" fill="#c7780e" fill-rule="evenodd" stroke="none"/>
    <path d="M-111.0 -40.45 Q-111.35 -39.65 -112.2 -39.55 -114.5 -39.25 -114.75 -40.85 -115.1 -42.75 -113.1 -43.0 -111.15 -43.25 -110.85 -41.6 L-111.0 -40.45 M-109.7 -42.8 Q-110.15 -45.45 -107.75 -45.5 -105.3 -45.55 -104.95 -43.4 -104.85 -42.75 -105.1 -42.05 -105.6 -41.15 -106.65 -41.0 -108.5 -40.8 -109.25 -41.75 -109.65 -42.25 -109.7 -42.8 M-107.55 -37.8 Q-107.45 -37.3 -107.75 -36.65 -108.15 -35.95 -108.65 -35.9 -109.85 -35.75 -110.45 -37.3 -110.7 -38.85 -109.15 -38.85 -107.75 -38.85 -107.55 -37.8 M-103.7 -40.85 Q-102.65 -41.05 -102.45 -39.9 -102.35 -39.4 -102.65 -39.0 -103.0 -38.7 -103.35 -38.65 -104.15 -38.55 -104.5 -38.95 L-104.65 -39.55 Q-104.85 -40.65 -103.7 -40.85" fill="#ab670c" fill-rule="evenodd" stroke="none"/>
    <path d="M-91.25 -50.55 Q-89.5 -54.3 -86.1 -53.15 -82.15 -51.75 -80.45 -48.35 L-81.2 -47.95 Q-86.15 -49.95 -91.35 -48.45 L-91.75 -49.35 -91.25 -50.55 M-124.9 -45.25 L-125.0 -44.3 Q-130.5 -44.5 -134.55 -41.35 L-135.4 -41.55 Q-135.05 -45.2 -131.65 -47.5 -128.8 -49.45 -125.85 -46.3 L-124.9 -45.25" fill="#a86915" fill-rule="evenodd" stroke="none"/>
    <path d="M-192.55 -185.35 Q-183.05 -187.85 -173.2 -186.95 -171.7 -186.75 -168.4 -185.4 L-167.9 -184.7 -166.55 -182.5 -169.5 -182.8 -175.45 -182.65 Q-180.6 -182.0 -182.7 -180.85 -183.95 -180.2 -184.4 -179.2 -187.4 -177.85 -191.05 -175.7 -193.45 -174.2 -195.5 -173.15 L-196.2 -173.45 Q-197.35 -174.1 -197.8 -176.55 -198.2 -178.8 -196.65 -181.15 L-195.1 -183.1 -192.55 -185.35 M-174.6 -202.9 L-173.5 -202.9 Q-159.8 -199.55 -155.35 -187.6 L-156.55 -189.0 Q-166.05 -199.55 -170.75 -199.0 -173.15 -198.7 -174.3 -196.0 -174.8 -197.0 -174.95 -198.05 -175.4 -200.6 -174.6 -202.9 M-174.3 -171.95 L-177.0 -168.8 -177.9 -167.6 -179.6 -165.95 Q-183.65 -162.1 -185.35 -159.3 -186.05 -160.3 -186.25 -161.45 -186.65 -163.7 -186.1 -165.6 -185.7 -166.95 -184.85 -167.65 L-183.9 -168.1 -181.2 -169.25 -174.3 -171.95" fill="#9d5915" fill-rule="evenodd" stroke="none"/>
    <path d="M-204.3 -169.6 L-204.35 -169.7 Q-205.25 -170.65 -205.65 -171.7 -206.55 -174.0 -205.05 -176.55 -203.7 -178.85 -201.95 -180.45 -198.75 -183.65 -194.1 -184.95 L-192.55 -185.35 -195.1 -183.1 -196.65 -181.15 Q-198.2 -178.8 -197.8 -176.55 -197.35 -174.1 -196.2 -173.45 L-195.5 -173.15 -196.1 -172.9 Q-201.55 -169.95 -203.75 -169.7 L-204.3 -169.6 M-175.25 -191.9 Q-177.95 -196.7 -175.35 -202.2 L-174.6 -202.9 Q-175.4 -200.6 -174.95 -198.05 -174.8 -197.0 -174.3 -196.0 -175.0 -194.4 -175.25 -191.9 M-185.75 -152.7 Q-187.95 -153.55 -189.55 -156.25 -191.05 -158.8 -189.9 -161.35 L-187.25 -166.65 -184.85 -167.65 Q-185.7 -166.95 -186.1 -165.6 -186.65 -163.7 -186.25 -161.45 -186.05 -160.3 -185.35 -159.3 -186.9 -156.75 -186.6 -155.1 -186.4 -153.85 -185.75 -152.7" fill="#da7a1d" fill-rule="evenodd" stroke="none"/>
    <path d="M-156.85 -175.2 L-156.9 -173.8 Q-156.8 -173.0 -157.25 -172.15 -157.75 -171.25 -158.75 -171.1 L-159.6 -171.15 -160.6 -171.85 -161.35 -173.0 -168.2 -165.85 Q-174.45 -159.55 -176.65 -159.3 -178.9 -159.0 -179.8 -160.9 -180.3 -161.85 -180.25 -163.0 -180.45 -164.15 -177.9 -167.6 L-177.0 -168.8 -174.3 -171.95 -171.2 -174.85 Q-178.6 -174.45 -180.95 -174.75 -184.3 -175.2 -184.65 -177.4 -184.85 -178.4 -184.4 -179.2 -183.95 -180.2 -182.7 -180.85 -180.6 -182.0 -175.45 -182.65 L-169.5 -182.8 -166.55 -182.5 -166.4 -182.5 -166.95 -184.8 Q-167.15 -186.5 -166.75 -188.6 -165.9 -193.1 -161.55 -188.65 L-159.9 -185.7 -158.95 -183.85 Q-156.7 -179.35 -156.55 -178.55 L-156.6 -177.75 -156.75 -176.3 -156.85 -175.2" fill="#5e3a0c" fill-rule="evenodd" stroke="none"/>
    <path d="M-168.4 -185.4 L-168.3 -185.35 -168.5 -185.45 Q-169.8 -187.3 -171.4 -188.45 L-174.25 -190.4 -175.05 -191.55 -175.25 -191.9 Q-175.0 -194.4 -174.3 -196.0 -173.15 -198.7 -170.75 -199.0 -166.05 -199.55 -156.55 -189.0 L-155.35 -187.6 -154.9 -186.3 Q-154.25 -184.3 -153.85 -182.05 -153.7 -181.15 -154.15 -180.15 L-155.3 -177.9 -156.85 -175.2 -156.75 -176.3 -156.6 -177.75 -156.55 -178.55 Q-156.7 -179.35 -158.95 -183.85 L-159.9 -185.7 -161.55 -188.65 Q-165.9 -193.1 -166.75 -188.6 -167.15 -186.5 -166.95 -184.8 L-166.4 -182.5 -166.55 -182.5 -167.9 -184.7 -168.4 -185.4 M-159.6 -171.15 Q-167.35 -160.5 -179.1 -153.75 -182.85 -151.6 -185.75 -152.7 -186.4 -153.85 -186.6 -155.1 -186.9 -156.75 -185.35 -159.3 -183.65 -162.1 -179.6 -165.95 L-177.9 -167.6 Q-180.45 -164.15 -180.25 -163.0 -180.3 -161.85 -179.8 -160.9 -178.9 -159.0 -176.65 -159.3 -174.45 -159.55 -168.2 -165.85 L-161.35 -173.0 -160.6 -171.85 -159.6 -171.15 M-187.25 -166.65 L-186.95 -167.2 Q-197.55 -162.05 -204.3 -169.6 L-203.75 -169.7 Q-201.55 -169.95 -196.1 -172.9 L-195.5 -173.15 Q-193.45 -174.2 -191.05 -175.7 -187.4 -177.85 -184.4 -179.2 -184.85 -178.4 -184.65 -177.4 -184.3 -175.2 -180.95 -174.75 -178.6 -174.45 -171.2 -174.85 L-174.3 -171.95 -181.2 -169.25 -183.9 -168.1 -184.85 -167.65 -187.25 -166.65" fill="#6e450e" fill-rule="evenodd" stroke="none"/>
    <path d="M-140.25 -121.2 L-145.0 -116.45 -145.1 -116.5 -144.65 -117.05 -140.35 -121.35 -140.25 -121.2" fill="#450f0f" fill-rule="evenodd" stroke="none"/>
    <path d="M-129.2 -174.65 Q-122.15 -173.3 -114.8 -167.95 L-117.25 -168.3 Q-145.5 -169.85 -160.6 -148.95 -163.95 -144.4 -166.6 -138.75 -166.65 -143.85 -165.5 -148.35 -164.3 -153.1 -161.9 -157.25 L-162.05 -156.3 -162.4 -152.95 -162.15 -152.7 -149.8 -163.05 Q-143.0 -167.95 -133.4 -169.15 L-127.25 -169.4 -122.8 -169.15 -122.65 -169.3 -127.0 -173.25 Q-128.15 -174.2 -129.2 -174.65 M-116.35 -164.65 Q-111.55 -163.9 -106.4 -161.9 -101.5 -160.0 -97.4 -156.8 L-96.0 -155.7 Q-106.05 -156.55 -115.6 -154.1 -124.75 -151.9 -133.2 -148.65 -130.95 -150.45 -126.75 -152.95 L-126.35 -153.2 Q-118.5 -157.9 -111.65 -159.15 L-111.8 -159.8 -111.95 -160.35 -112.3 -160.8 -115.05 -163.6 -116.35 -164.65 M-145.9 -142.9 Q-158.5 -136.35 -169.45 -126.9 -163.85 -139.85 -154.3 -149.75 L-151.0 -152.95 -151.05 -152.9 -153.15 -149.9 -153.3 -149.2 -149.25 -145.7 -145.9 -142.9 M-178.85 -105.45 Q-178.05 -102.05 -176.25 -100.05 -174.45 -98.1 -172.4 -98.35 -168.85 -98.75 -165.4 -102.45 -163.95 -103.95 -161.55 -107.55 -159.35 -110.8 -151.05 -117.35 -142.25 -124.25 -139.25 -125.9 -135.8 -127.8 -129.55 -129.9 -135.35 -126.0 -140.35 -121.35 L-144.65 -117.05 -145.1 -116.5 Q-154.3 -106.65 -160.3 -93.9 L-162.25 -88.95 Q-164.5 -82.0 -163.95 -74.65 -163.7 -71.55 -162.95 -68.45 L-167.0 -71.85 Q-169.9 -74.55 -172.5 -77.65 -178.3 -84.85 -179.45 -93.35 -180.15 -98.8 -178.95 -104.75 L-178.85 -105.45 M-145.0 -116.45 L-147.05 -112.95 Q-149.75 -108.2 -150.25 -106.7 -150.95 -104.6 -151.35 -101.35 -151.85 -97.7 -151.55 -95.85 -151.2 -93.95 -150.0 -93.45 L-146.7 -93.3 Q-145.55 -93.45 -139.0 -96.35 L-141.35 -93.75 -146.35 -87.5 -147.0 -86.65 Q-154.05 -77.15 -159.45 -66.5 -160.35 -68.05 -160.4 -69.55 L-160.25 -77.75 Q-159.4 -88.9 -155.1 -99.5 L-154.9 -99.95 -151.95 -106.3 Q-149.1 -111.85 -145.0 -116.45 M-66.35 -112.1 L-64.35 -111.7 -63.25 -111.85 Q-63.3 -122.3 -64.2 -127.4 -64.5 -129.2 -66.2 -131.95 -60.4 -126.75 -58.15 -118.75 -55.65 -109.75 -57.35 -100.65 -58.7 -104.25 -61.1 -107.2 -63.55 -110.05 -66.35 -112.1 M-71.05 -111.15 Q-68.0 -109.35 -65.65 -106.5 -63.95 -104.55 -62.7 -102.45 -61.2 -99.9 -60.1 -97.05 -59.5 -95.3 -59.05 -93.3 L-60.35 -90.15 Q-65.4 -79.6 -72.15 -70.15 -73.05 -74.65 -75.05 -78.55 -80.2 -88.3 -92.5 -93.6 -98.35 -96.1 -104.4 -96.3 -126.6 -97.0 -142.65 -81.65 -150.6 -73.8 -151.8 -63.55 L-152.05 -60.45 -156.65 -63.85 Q-157.15 -67.25 -150.5 -78.7 -148.5 -82.3 -145.15 -85.8 -142.35 -89.0 -138.55 -92.15 -132.4 -97.2 -123.85 -102.4 -115.45 -107.45 -106.4 -110.4 L-108.65 -108.9 Q-112.7 -106.1 -113.7 -104.85 L-107.95 -106.3 -101.85 -107.55 -81.75 -106.95 -79.9 -106.65 Q-68.35 -104.95 -65.9 -101.5 L-65.75 -101.6 -68.6 -107.15 Q-69.8 -109.55 -71.05 -111.15 M-161.05 -178.1 L-160.7 -177.15 -160.0 -176.1 Q-165.2 -170.15 -168.0 -162.65 L-165.55 -171.55 Q-164.2 -175.8 -161.05 -178.1 M-162.05 -169.0 L-162.55 -167.5 -158.7 -166.4 Q-164.15 -160.3 -167.35 -151.55 -166.65 -159.45 -163.35 -166.55 L-162.05 -169.0" fill="#621515" fill-rule="evenodd" stroke="none"/>
    <path d="M-129.2 -174.65 Q-128.15 -174.2 -127.0 -173.25 L-122.65 -169.3 -122.8 -169.15 -127.25 -169.4 -133.4 -169.15 Q-143.0 -167.95 -149.8 -163.05 L-162.15 -152.7 -162.4 -152.95 -162.05 -156.3 -161.9 -157.25 Q-159.0 -162.25 -154.35 -166.4 -143.5 -176.15 -131.8 -175.05 L-129.2 -174.65 M-116.35 -164.65 L-115.05 -163.6 -112.3 -160.8 -111.95 -160.35 -111.8 -159.8 -111.65 -159.15 Q-118.5 -157.9 -126.35 -153.2 L-126.75 -152.95 Q-130.95 -150.45 -133.2 -148.65 -139.75 -146.15 -145.9 -142.9 L-149.25 -145.7 -153.3 -149.2 -153.15 -149.9 -151.05 -152.9 -151.0 -152.95 -148.1 -155.5 Q-133.75 -167.5 -116.35 -164.65 M-159.15 -131.6 Q-151.0 -137.55 -141.9 -141.95 -122.3 -151.35 -100.35 -151.2 L-99.1 -152.15 -92.65 -150.15 -87.1 -148.25 Q-78.4 -144.9 -70.45 -139.75 L-70.55 -139.6 Q-78.45 -142.1 -86.15 -142.65 -104.2 -143.95 -121.4 -134.75 L-129.55 -129.9 Q-135.8 -127.8 -139.25 -125.9 -142.25 -124.25 -151.05 -117.35 -159.35 -110.8 -161.55 -107.55 -163.95 -103.95 -165.4 -102.45 -168.85 -98.75 -172.4 -98.35 -174.45 -98.1 -176.25 -100.05 -178.05 -102.05 -178.85 -105.45 -175.85 -118.7 -159.1 -131.45 L-159.15 -131.6 M-140.25 -121.2 Q-132.65 -127.9 -121.8 -132.05 L-120.3 -132.65 Q-100.45 -140.15 -87.7 -138.9 L-85.45 -138.65 Q-74.2 -137.4 -70.8 -135.3 -68.3 -133.85 -66.2 -131.95 -64.5 -129.2 -64.2 -127.4 -63.3 -122.3 -63.25 -111.85 L-64.35 -111.7 -66.35 -112.1 Q-73.05 -117.1 -81.8 -117.5 L-82.6 -117.55 Q-105.7 -118.25 -125.35 -106.9 -133.05 -102.6 -139.0 -96.35 -145.55 -93.45 -146.7 -93.3 L-150.0 -93.45 Q-151.2 -93.95 -151.55 -95.85 -151.85 -97.7 -151.35 -101.35 -150.95 -104.6 -150.25 -106.7 -149.75 -108.2 -147.05 -112.95 L-145.0 -116.45 -140.25 -121.2 M-71.05 -111.15 Q-69.8 -109.55 -68.6 -107.15 L-65.75 -101.6 -65.9 -101.5 Q-68.35 -104.95 -79.9 -106.65 L-81.75 -106.95 -101.85 -107.55 -107.95 -106.3 -113.7 -104.85 Q-112.7 -106.1 -108.65 -108.9 L-106.4 -110.4 Q-94.3 -114.3 -81.25 -114.3 L-80.65 -114.3 -79.0 -114.05 Q-74.6 -113.35 -71.05 -111.15 M-139.85 -155.8 L-139.95 -155.7 -139.85 -155.8 M-160.0 -176.1 L-160.7 -177.15 -161.05 -178.1 Q-158.85 -179.8 -155.75 -180.45 L-160.0 -176.1 M-158.7 -166.4 L-162.55 -167.5 -162.05 -169.0 Q-152.95 -185.35 -134.45 -179.9 -149.6 -176.85 -158.7 -166.4" fill="#851d1d" fill-rule="evenodd" stroke="none"/>
    <path d="M-139.85 -155.8 L-139.95 -155.7 -139.85 -155.8" fill="#b02626" fill-rule="evenodd" stroke="none"/>
    <path d="M-146.95 -62.05 L-148.45 -57.4 -147.3 -55.25 Q-155.75 -57.15 -162.75 -62.2 -166.55 -64.9 -169.85 -68.55 -173.6 -72.6 -176.75 -77.8 -191.25 -101.35 -175.35 -122.65 -173.3 -125.35 -171.9 -128.35 L-169.85 -133.1 Q-171.5 -140.4 -171.1 -147.65 -170.8 -152.8 -169.55 -157.95 -172.9 -183.95 -146.45 -185.7 -146.1 -185.85 -146.1 -185.55 L-146.05 -185.35 Q-131.15 -184.3 -118.25 -174.5 -108.2 -166.85 -96.75 -162.0 -92.95 -160.45 -90.2 -157.7 L-88.4 -155.6 -86.95 -153.4 Q-48.35 -138.8 -55.0 -98.95 -55.35 -96.65 -55.85 -94.5 -58.6 -83.05 -65.5 -73.35 -69.5 -67.7 -72.5 -61.35 L-73.1 -60.15 -74.0 -59.85 -75.3 -64.4 Q-76.8 -68.85 -78.95 -72.55 -87.7 -87.45 -107.5 -90.1 -118.9 -91.85 -128.4 -85.4 -140.6 -76.95 -146.05 -64.25 L-146.95 -62.05 M-161.9 -157.25 Q-164.3 -153.1 -165.5 -148.35 -166.65 -143.85 -166.6 -138.75 -163.95 -144.4 -160.6 -148.95 -145.5 -169.85 -117.25 -168.3 L-114.8 -167.95 Q-122.15 -173.3 -129.2 -174.65 L-131.8 -175.05 Q-143.5 -176.15 -154.35 -166.4 -159.0 -162.25 -161.9 -157.25 M-133.2 -148.65 Q-124.75 -151.9 -115.6 -154.1 -106.05 -156.55 -96.0 -155.7 L-97.4 -156.8 Q-101.5 -160.0 -106.4 -161.9 -111.55 -163.9 -116.35 -164.65 -133.75 -167.5 -148.1 -155.5 L-151.0 -152.95 -154.3 -149.75 Q-163.85 -139.85 -169.45 -126.9 -158.5 -136.35 -145.9 -142.9 -139.75 -146.15 -133.2 -148.65 M-70.45 -139.75 Q-78.4 -144.9 -87.1 -148.25 L-92.65 -150.15 -99.1 -152.15 -100.35 -151.2 Q-122.3 -151.35 -141.9 -141.95 -151.0 -137.55 -159.15 -131.6 L-163.25 -128.45 -159.1 -131.45 Q-175.85 -118.7 -178.85 -105.45 L-178.95 -104.75 Q-180.15 -98.8 -179.45 -93.35 -178.3 -84.85 -172.5 -77.65 -169.9 -74.55 -167.0 -71.85 L-162.95 -68.45 Q-163.7 -71.55 -163.95 -74.65 -164.5 -82.0 -162.25 -88.95 L-160.3 -93.9 Q-154.3 -106.65 -145.1 -116.5 L-145.0 -116.45 Q-149.1 -111.85 -151.95 -106.3 L-154.9 -99.95 -155.1 -99.5 Q-159.4 -88.9 -160.25 -77.75 L-160.4 -69.55 Q-160.35 -68.05 -159.45 -66.5 -154.05 -77.15 -147.0 -86.65 L-146.35 -87.5 -141.35 -93.75 -139.0 -96.35 Q-133.05 -102.6 -125.35 -106.9 -105.7 -118.25 -82.6 -117.55 L-81.8 -117.5 Q-73.05 -117.1 -66.35 -112.1 -63.55 -110.05 -61.1 -107.2 -58.7 -104.25 -57.35 -100.65 -55.65 -109.75 -58.15 -118.75 -60.4 -126.75 -66.2 -131.95 -68.3 -133.85 -70.8 -135.3 -74.2 -137.4 -85.45 -138.65 L-87.7 -138.9 Q-100.45 -140.15 -120.3 -132.65 L-121.8 -132.05 Q-132.65 -127.9 -140.25 -121.2 L-140.35 -121.35 Q-135.35 -126.0 -129.55 -129.9 L-121.4 -134.75 Q-104.2 -143.95 -86.15 -142.65 -78.45 -142.1 -70.55 -139.6 L-69.25 -138.95 -70.45 -139.75 M-106.4 -110.4 Q-115.45 -107.45 -123.85 -102.4 -132.4 -97.2 -138.55 -92.15 -142.35 -89.0 -145.15 -85.8 -148.5 -82.3 -150.5 -78.7 -157.15 -67.25 -156.65 -63.85 L-152.05 -60.45 -151.8 -63.55 Q-150.6 -73.8 -142.65 -81.65 -126.6 -97.0 -104.4 -96.3 -98.35 -96.1 -92.5 -93.6 -80.2 -88.3 -75.05 -78.55 -73.05 -74.65 -72.15 -70.15 -65.4 -79.6 -60.35 -90.15 L-59.05 -93.3 Q-59.5 -95.3 -60.1 -97.05 -61.2 -99.9 -62.7 -102.45 -63.95 -104.55 -65.65 -106.5 -68.0 -109.35 -71.05 -111.15 -74.6 -113.35 -79.0 -114.05 L-80.65 -114.3 -81.25 -114.3 Q-94.3 -114.3 -106.4 -110.4 M-160.0 -176.1 L-155.75 -180.45 Q-158.85 -179.8 -161.05 -178.1 -164.2 -175.8 -165.55 -171.55 L-168.0 -162.65 Q-165.2 -170.15 -160.0 -176.1 M-158.7 -166.4 Q-149.6 -176.85 -134.45 -179.9 -152.95 -185.35 -162.05 -169.0 L-163.35 -166.55 Q-166.65 -159.45 -167.35 -151.55 -164.15 -160.3 -158.7 -166.4" fill="#571313" fill-rule="evenodd" stroke="none"/>
    <path d="M-75.3 -64.4 Q-81.15 -70.25 -90.7 -74.5 -103.75 -80.35 -115.2 -78.95 -119.6 -78.4 -126.05 -76.1 -132.5 -73.85 -135.9 -71.65 -137.75 -70.4 -140.25 -68.25 L-144.75 -64.45 Q-146.0 -63.6 -146.95 -62.05 L-146.05 -64.25 Q-140.6 -76.95 -128.4 -85.4 -118.9 -91.85 -107.5 -90.1 -87.7 -87.45 -78.95 -72.55 -76.8 -68.85 -75.3 -64.4" fill="#571313" fill-opacity="0.47058824" fill-rule="evenodd" stroke="none"/>
  </g>
</svg>
