<?xml version="1.0" encoding="UTF-8" standalone="no"?>
<svg xmlns:xlink="http://www.w3.org/1999/xlink" height="254.3px" width="333.45px" xmlns="http://www.w3.org/2000/svg">
  <g transform="matrix(1.0, 0.0, 0.0, 1.0, -68.45, 26.5)">
    <path d="M142.45 -11.2 L147.45 -11.2 146.2 6.95 143.75 43.2 Q143.35 40.45 143.05 34.1 L142.45 23.0 142.45 -11.2 M249.45 -11.2 L262.6 -11.2 259.5 12.85 Q254.95 48.6 254.8 54.05 L254.8 53.7 254.9 52.25 254.9 52.2 Q256.2 32.3 256.2 21.6 L255.5 22.3 Q254.3 25.7 252.15 34.8 250.2 42.95 249.95 45.45 L249.9 45.3 249.2 28.85 Q248.5 15.9 248.5 6.2 L249.45 -11.2 M313.25 -11.2 L330.6 -11.2 327.7 31.3 Q324.9 70.55 324.65 78.9 L324.6 78.8 Q323.55 77.35 323.3 74.15 L323.2 65.85 324.2 45.95 Q325.2 28.15 325.2 21.5 L324.55 8.5 Q323.9 -4.25 323.9 -8.4 L323.2 -8.4 318.6 -2.05 314.1 4.1 Q313.05 3.35 312.8 1.8 L312.7 -2.15 Q312.7 -5.3 313.25 -11.2 M316.6 194.15 L311.95 195.25 311.3 195.1 309.95 194.8 310.6 176.55 Q310.6 172.45 312.35 162.55 L314.1 152.25 316.25 187.85 316.6 194.15 M281.35 200.6 L278.75 201.3 Q277.75 201.5 274.7 202.75 L271.85 204.0 271.6 204.0 271.5 202.45 Q271.5 194.2 272.9 168.5 L274.3 141.75 Q275.2 143.6 275.8 158.55 276.4 173.85 277.1 175.85 277.1 159.6 279.55 117.55 L281.85 77.85 282.35 77.9 282.7 81.6 282.35 100.9 282.0 113.4 280.6 146.65 Q280.5 149.15 280.55 153.8 L280.6 161.95 280.6 168.95 281.05 189.65 281.35 200.6 M229.85 205.0 L221.05 205.4 220.65 184.35 220.55 164.75 Q220.55 131.35 222.15 104.4 223.7 79.0 226.85 55.8 L227.0 55.65 Q227.5 62.25 226.85 77.4 226.85 78.3 227.2 80.35 L227.55 83.0 232.3 53.75 Q236.25 30.9 238.7 23.0 238.7 46.3 238.15 79.45 237.5 118.7 236.6 130.55 L235.9 130.55 234.5 85.1 Q227.55 133.15 227.55 170.25 227.55 178.9 229.85 205.0 M197.15 203.0 Q191.1 202.8 186.45 201.5 L186.1 190.95 185.65 172.7 Q185.65 160.55 186.35 158.45 187.4 159.45 188.4 169.15 189.25 177.35 189.2 179.85 L192.95 123.75 Q196.25 77.45 198.85 70.4 L198.85 70.05 199.2 75.8 199.55 81.6 Q199.55 98.25 198.2 156.65 L197.15 203.0 M158.3 194.65 L153.0 192.95 Q141.0 189.1 132.7 184.8 132.8 171.0 133.35 164.05 133.35 166.65 133.8 171.0 134.2 175.3 134.75 177.95 L136.15 177.95 Q135.85 175.35 136.4 171.3 137.05 166.85 138.25 165.45 139.35 167.6 140.2 172.2 141.1 176.9 141.05 180.75 L141.75 180.75 143.65 150.5 Q144.65 137.75 147.25 119.35 L148.15 134.4 149.35 156.35 149.35 157.05 Q151.15 147.2 154.9 116.4 L158.45 86.5 Q158.45 88.15 160.15 105.35 161.85 122.6 161.85 137.55 161.85 147.75 159.8 172.95 158.8 185.25 158.3 194.65" fill="#f0b040" fill-rule="evenodd" stroke="none"/>
    <path d="M147.45 -11.2 L164.8 -11.2 164.4 -3.55 164.4 69.45 166.85 56.4 Q169.0 44.7 171.0 40.2 170.25 55.55 169.55 104.5 169.55 117.8 172.45 158.6 L175.4 197.3 Q175.8 171.85 180.75 119.5 184.5 80.0 187.1 59.9 L186.35 59.9 183.35 69.2 Q180.55 77.6 180.45 80.8 L179.75 50.9 179.05 27.0 Q179.05 11.7 180.35 -11.2 L213.75 -11.2 Q212.3 11.2 211.4 33.3 209.7 75.05 209.7 123.15 L209.8 144.35 Q210.0 165.35 210.45 171.8 L210.45 172.55 Q211.15 167.15 227.7 -11.2 L249.45 -11.2 248.5 6.2 Q248.5 15.9 249.2 28.85 L249.9 45.3 249.95 45.45 Q250.2 42.95 252.15 34.8 254.3 25.7 255.5 22.3 L256.2 21.6 Q256.2 32.3 254.9 52.2 L254.9 52.25 254.8 53.7 254.8 54.05 Q254.95 48.6 259.5 12.85 L262.6 -11.2 284.4 -11.2 284.65 -7.85 Q286.5 15.65 286.5 28.5 286.5 31.9 285.4 45.5 L284.3 59.5 Q284.3 68.0 284.5 69.0 284.65 69.9 286.5 72.35 L286.5 73.1 293.95 18.0 297.9 -11.2 313.25 -11.2 Q312.7 -5.3 312.7 -2.15 L312.8 1.8 Q313.05 3.35 314.1 4.1 L318.6 -2.05 323.2 -8.4 323.9 -8.4 Q323.9 -4.25 324.55 8.5 L325.2 21.5 Q325.2 28.15 324.2 45.95 L323.2 65.85 323.3 74.15 Q323.55 77.35 324.6 78.8 L324.65 78.9 Q324.9 70.55 327.7 31.3 L330.6 -11.2 341.8 -11.2 Q340.85 11.4 336.7 56.8 332.5 102.75 331.0 114.05 L330.8 114.3 Q329.8 111.5 329.2 99.1 L328.1 81.15 328.1 80.4 Q327.3 81.65 323.35 90.8 319.25 100.2 318.65 102.35 L318.6 102.5 Q317.95 97.45 314.75 61.4 311.3 22.45 311.3 18.9 L311.3 18.25 Q309.15 32.8 307.6 55.2 306.15 76.2 306.15 89.9 306.15 99.1 304.35 122.6 302.5 146.1 302.5 158.6 L302.9 166.45 303.25 176.25 303.25 177.0 305.85 145.35 Q308.4 114.05 309.15 111.05 310.2 113.45 310.85 131.45 L311.3 152.8 312.05 153.45 317.95 128.0 Q323.1 105.95 323.7 102.35 L324.45 102.35 Q324.45 109.1 325.0 128.4 325.55 148.7 325.95 152.8 L325.95 153.45 Q327.65 152.45 332.6 137.45 L337.65 121.3 335.45 162.55 334.5 188.1 Q328.65 191.1 324.0 192.95 L323.7 193.0 316.6 194.15 316.25 187.85 314.1 152.25 312.35 162.55 Q310.6 172.45 310.6 176.55 L309.95 194.8 307.15 194.15 Q296.85 198.8 293.0 200.05 L292.25 199.95 284.85 199.4 281.35 200.6 281.05 189.65 280.6 168.95 280.6 161.95 280.55 153.8 Q280.5 149.15 280.6 146.65 L282.0 113.4 282.35 100.9 282.7 81.6 282.35 77.9 281.85 77.85 279.55 117.55 Q277.1 159.6 277.1 175.85 276.4 173.85 275.8 158.55 275.2 143.6 274.3 141.75 L272.9 168.5 Q271.5 194.2 271.5 202.45 L271.6 204.0 Q270.9 203.9 270.05 203.4 269.0 202.75 268.6 202.75 L264.5 203.65 260.75 204.45 259.9 204.4 259.35 204.25 259.3 204.25 259.3 204.4 Q247.0 203.8 230.1 205.0 L229.85 205.0 Q227.55 178.9 227.55 170.25 227.55 133.15 234.5 85.1 L235.9 130.55 236.6 130.55 Q237.5 118.7 238.15 79.45 238.7 46.3 238.7 23.0 236.25 30.9 232.3 53.75 L227.55 83.0 227.2 80.35 Q226.85 78.3 226.85 77.4 227.5 62.25 227.0 55.65 L226.85 55.8 Q223.7 79.0 222.15 104.4 220.55 131.35 220.55 164.75 L220.65 184.35 221.05 205.4 220.45 205.4 219.75 205.1 Q212.85 201.95 210.85 201.95 L204.8 202.5 199.0 203.0 197.15 203.0 198.2 156.65 Q199.55 98.25 199.55 81.6 L199.2 75.8 198.85 70.05 198.85 70.4 Q196.25 77.45 192.95 123.75 L189.2 179.85 Q189.25 177.35 188.4 169.15 187.4 159.45 186.35 158.45 185.65 160.55 185.65 172.7 L186.1 190.95 186.45 201.5 182.75 200.2 178.95 198.25 Q177.15 197.35 175.95 197.35 L175.4 197.3 173.1 197.15 169.05 197.75 158.3 194.65 Q158.8 185.25 159.8 172.95 161.85 147.75 161.85 137.55 161.85 122.6 160.15 105.35 158.45 88.15 158.45 86.5 L154.9 116.4 Q151.15 147.2 149.35 157.05 L149.35 156.35 148.15 134.4 147.25 119.35 Q144.65 137.75 143.65 150.5 L141.75 180.75 141.05 180.75 Q141.1 176.9 140.2 172.2 139.35 167.6 138.25 165.45 137.05 166.85 136.4 171.3 135.85 175.35 136.15 177.95 L134.75 177.95 Q134.2 175.3 133.8 171.0 133.35 166.65 133.35 164.05 132.8 171.0 132.7 184.8 124.95 180.75 121.9 173.7 L121.8 155.55 Q121.7 138.45 124.2 129.35 125.9 131.2 127.2 136.9 L129.3 147.65 Q131.5 109.45 131.5 60.65 L132.25 60.65 Q132.45 65.95 134.75 91.3 137.05 116.65 137.3 122.8 L138.05 57.75 Q137.3 44.5 137.3 14.6 136.3 17.35 134.05 31.5 131.95 44.45 130.75 46.0 129.6 41.55 129.4 37.95 L129.35 37.95 Q128.85 39.5 127.6 45.15 126.95 48.1 125.7 48.9 126.5 39.2 125.05 10.85 L123.8 -11.2 142.45 -11.2 142.45 23.0 143.05 34.1 Q143.35 40.45 143.75 43.2 L146.2 6.95 147.45 -11.2 M258.0 61.4 L257.25 61.4 Q255.65 87.5 253.1 120.4 249.8 163.45 247.75 179.05 L247.0 178.4 246.55 170.15 245.5 163.0 244.75 163.0 Q243.95 166.75 242.25 178.2 240.45 190.0 240.45 191.9 L240.45 192.25 Q243.6 188.95 244.75 187.1 244.8 188.9 246.2 192.9 L248.5 199.55 Q252.85 164.05 255.8 144.0 255.6 146.1 257.15 159.3 258.75 173.05 258.75 175.5 L260.15 175.5 Q260.6 159.5 266.0 98.8 271.8 33.4 272.6 18.9 267.45 46.2 264.85 61.1 260.8 84.35 257.85 108.9 L257.25 91.45 257.7 91.5 Q258.1 91.7 258.0 90.65 257.0 83.35 257.25 78.9 258.0 66.75 258.0 61.4 M129.4 37.95 L129.35 37.2 129.35 37.95 129.4 37.95" fill="#f8d060" fill-rule="evenodd" stroke="none"/>
    <path d="M164.8 -11.2 L180.35 -11.2 Q179.05 11.7 179.05 27.0 L179.75 50.9 180.45 80.8 Q180.55 77.6 183.35 69.2 L186.35 59.9 187.1 59.9 Q184.5 80.0 180.75 119.5 175.8 171.85 175.4 197.3 L172.45 158.6 Q169.55 117.8 169.55 104.5 170.25 55.55 171.0 40.2 169.0 44.7 166.85 56.4 L164.4 69.45 164.4 -3.55 164.8 -11.2 M213.75 -11.2 L227.7 -11.2 Q211.15 167.15 210.45 172.55 L210.45 171.8 Q210.0 165.35 209.8 144.35 L209.7 123.15 Q209.7 75.05 211.4 33.3 212.3 11.2 213.75 -11.2 M284.4 -11.2 L297.9 -11.2 293.95 18.0 286.5 73.1 286.5 72.35 Q284.65 69.9 284.5 69.0 284.3 68.0 284.3 59.5 L285.4 45.5 Q286.5 31.9 286.5 28.5 286.5 15.65 284.65 -7.85 L284.4 -11.2 M341.8 -11.2 L355.2 -11.2 355.2 176.2 Q343.5 183.45 334.5 188.1 L335.45 162.55 337.65 121.3 332.6 137.45 Q327.65 152.45 325.95 153.45 L325.95 152.8 Q325.55 148.7 325.0 128.4 324.45 109.1 324.45 102.35 L323.7 102.35 Q323.1 105.95 317.95 128.0 L312.05 153.45 311.3 152.8 310.85 131.45 Q310.2 113.45 309.15 111.05 308.4 114.05 305.85 145.35 L303.25 177.0 303.25 176.25 302.9 166.45 302.5 158.6 Q302.5 146.1 304.35 122.6 306.15 99.1 306.15 89.9 306.15 76.2 307.6 55.2 309.15 32.8 311.3 18.25 L311.3 18.9 Q311.3 22.45 314.75 61.4 317.95 97.45 318.6 102.5 L318.65 102.35 Q319.25 100.2 323.35 90.8 327.3 81.65 328.1 80.4 L328.1 81.15 329.2 99.1 Q329.8 111.5 330.8 114.3 L331.0 114.05 Q332.5 102.75 336.7 56.8 340.85 11.4 341.8 -11.2 M121.9 173.7 L121.5 172.7 121.1 172.65 119.8 162.25 119.8 -11.2 123.8 -11.2 125.05 10.85 Q126.5 39.2 125.7 48.9 126.95 48.1 127.6 45.15 128.85 39.5 129.35 37.95 L129.4 37.95 Q129.6 41.55 130.75 46.0 131.95 44.45 134.05 31.5 136.3 17.35 137.3 14.6 137.3 44.5 138.05 57.75 L137.3 122.8 Q137.05 116.65 134.75 91.3 132.45 65.95 132.25 60.65 L131.5 60.65 Q131.5 109.45 129.3 147.65 L127.2 136.9 Q125.9 131.2 124.2 129.35 121.7 138.45 121.8 155.55 L121.9 173.7 M258.0 61.4 Q258.0 66.75 257.25 78.9 257.0 83.35 258.0 90.65 258.1 91.7 257.7 91.5 L257.25 91.45 257.85 108.9 Q260.8 84.35 264.85 61.1 267.45 46.2 272.6 18.9 271.8 33.4 266.0 98.8 260.6 159.5 260.15 175.5 L258.75 175.5 Q258.75 173.05 257.15 159.3 255.6 146.1 255.8 144.0 252.85 164.05 248.5 199.55 L246.2 192.9 Q244.8 188.9 244.75 187.1 243.6 188.95 240.45 192.25 L240.45 191.9 Q240.45 190.0 242.25 178.2 243.95 166.75 244.75 163.0 L245.5 163.0 246.55 170.15 247.0 178.4 247.75 179.05 Q249.8 163.45 253.1 120.4 255.65 87.5 257.25 61.4 L258.0 61.4 M129.4 37.95 L129.35 37.95 129.35 37.2 129.4 37.95" fill="#f8f090" fill-rule="evenodd" stroke="none"/>
    <path d="M113.05 -2.5 Q113.05 -9.35 113.3 -10.75 113.7 -12.85 115.3 -16.6 146.4 -21.75 160.9 -23.45 186.45 -26.5 212.5 -26.5 220.15 -26.5 231.85 -24.5 L249.2 -21.6 266.2 -20.5 286.9 -20.2 Q311.05 -19.85 335.2 -19.0 L358.75 -17.9 357.75 0.15 Q356.7 19.45 356.7 23.25 L357.05 61.95 357.4 103.25 Q357.4 120.3 358.9 141.0 L361.05 171.25 Q357.85 178.7 355.45 181.95 350.8 188.35 341.3 191.25 335.85 192.9 322.7 195.8 L302.2 200.35 Q286.05 204.35 272.4 208.65 L255.95 213.8 Q248.85 215.7 240.7 216.4 232.0 217.15 214.6 217.15 202.1 217.15 182.0 211.35 158.75 204.6 152.85 203.85 146.8 203.1 139.15 195.5 L133.45 189.7 Q130.4 186.7 128.45 185.65 121.75 182.15 118.4 179.4 112.35 174.45 112.35 169.3 112.35 166.3 113.9 164.5 115.55 162.55 115.85 157.75 L116.65 150.05 117.25 144.2 Q117.25 136.25 115.15 116.65 113.05 97.0 113.05 88.6 113.05 82.0 114.1 76.6 115.15 71.25 115.15 66.55 115.15 60.95 112.35 50.35 109.55 39.8 109.55 37.6 109.55 34.95 112.35 26.5 115.15 18.1 115.15 14.95 115.15 11.75 114.1 7.8 113.05 3.8 113.05 -2.5 M147.45 -11.2 L142.45 -11.2 123.8 -11.2 119.8 -11.2 119.8 162.25 121.1 172.65 121.5 172.7 121.9 173.7 Q124.95 180.75 132.7 184.8 141.0 189.1 153.0 192.95 L158.3 194.65 169.05 197.75 173.1 197.15 175.4 197.3 175.95 197.35 Q177.15 197.35 178.95 198.25 L182.75 200.2 186.45 201.5 Q191.1 202.8 197.15 203.0 L199.0 203.0 204.8 202.5 210.85 201.95 Q212.85 201.95 219.75 205.1 L220.45 205.4 221.05 205.4 229.85 205.0 230.1 205.0 Q247.0 203.8 259.3 204.4 L259.35 204.25 259.9 204.4 260.75 204.45 264.5 203.65 268.6 202.75 Q269.0 202.75 270.05 203.4 270.9 203.9 271.6 204.0 L271.85 204.0 274.7 202.75 Q277.75 201.5 278.75 201.3 L281.35 200.6 284.85 199.4 292.25 199.95 293.0 200.05 Q296.85 198.8 307.15 194.15 L309.95 194.8 311.3 195.1 311.95 195.25 316.6 194.15 323.7 193.0 324.0 192.95 Q328.65 191.1 334.5 188.1 343.5 183.45 355.2 176.2 L355.2 -11.2 341.8 -11.2 330.6 -11.2 313.25 -11.2 297.9 -11.2 284.4 -11.2 262.6 -11.2 249.45 -11.2 227.7 -11.2 213.75 -11.2 180.35 -11.2 164.8 -11.2 147.45 -11.2" fill="#f7ed8f" fill-opacity="0.4" fill-rule="evenodd" stroke="none"/>
    <path d="M283.9 -2.25 Q294.4 7.5 294.4 22.7 294.4 33.45 289.3 42.25 286.35 47.3 281.4 52.25 282.35 49.65 282.75 46.55 282.75 35.05 274.55 26.9 266.3 18.65 254.55 18.65 242.45 18.65 235.8 26.15 229.9 32.8 230.05 43.1 222.95 39.0 220.45 37.85 216.7 36.2 210.3 36.2 197.15 36.2 191.65 39.65 184.55 44.15 184.55 56.6 184.55 61.75 186.95 67.9 188.35 71.55 190.45 75.1 183.5 70.25 177.75 62.15 170.6 51.95 170.6 43.1 170.6 29.5 181.1 17.55 191.4 5.75 202.65 5.75 212.25 5.75 218.1 8.45 221.75 10.15 225.35 13.6 229.9 2.5 237.9 -4.05 247.15 -11.6 259.3 -11.6 273.9 -11.6 283.9 -2.25 M365.75 38.55 Q358.95 44.65 353.1 44.65 348.8 44.65 347.45 42.35 346.9 41.35 346.9 39.05 346.9 35.65 350.85 31.65 354.5 27.95 359.55 25.55 364.75 23.1 368.25 23.65 372.2 24.25 372.2 28.7 372.2 32.7 365.75 38.55 M357.65 56.0 Q355.7 54.25 354.3 53.55 L360.55 51.5 Q369.15 49.0 375.6 49.0 383.9 49.0 391.4 52.45 401.9 57.25 401.9 66.55 401.9 80.3 381.15 87.95 366.4 93.4 352.9 93.4 355.4 100.55 347.8 102.2 L331.2 102.75 307.35 100.75 Q293.5 99.3 284.6 100.25 287.6 99.35 297.35 97.95 L318.2 94.6 Q345.85 89.1 345.85 79.35 345.85 75.45 345.6 75.15 L342.45 74.1 352.75 69.15 Q359.95 64.85 359.95 59.5 359.95 58.1 357.65 56.0 M374.95 138.95 Q396.0 146.65 396.0 156.5 396.0 164.25 386.65 168.35 378.9 171.75 367.4 171.75 363.1 171.75 347.4 168.15 332.7 164.8 328.0 162.8 L328.3 162.4 338.5 164.0 346.4 164.7 Q357.85 164.7 365.7 162.45 378.6 158.7 378.6 149.5 378.6 144.95 374.8 139.1 L374.95 138.95 M331.35 183.55 Q334.5 184.7 336.65 187.45 339.05 190.55 339.05 194.55 339.05 198.95 335.2 198.95 331.55 198.95 327.25 193.65 323.65 189.15 323.65 187.8 323.65 184.55 326.05 183.45 328.25 182.4 331.35 183.55 M219.35 103.35 Q222.05 105.8 222.05 110.55 222.05 114.25 220.05 116.75 217.7 119.6 213.4 119.6 207.65 119.6 205.65 114.85 205.05 113.35 204.9 111.6 L204.85 110.25 Q204.85 106.5 207.55 104.0 210.0 101.65 213.45 101.4 217.0 101.15 219.35 103.35 M172.65 101.45 Q169.05 103.35 163.65 105.3 154.2 108.65 149.5 108.65 134.05 108.65 120.35 103.95 100.45 97.15 100.45 83.5 100.45 73.8 105.7 68.6 109.6 64.75 122.6 58.35 119.15 62.9 118.0 66.15 116.7 69.6 116.7 73.6 116.7 87.2 133.1 95.75 146.45 102.75 160.55 102.75 L169.85 101.95 172.65 101.45 M233.8 191.8 Q235.75 190.0 238.7 190.15 241.55 190.3 243.6 192.15 245.85 194.15 245.85 197.15 245.85 199.2 245.05 200.85 243.65 203.75 240.35 203.75 234.45 203.75 232.45 200.9 231.55 199.6 231.55 197.7 231.55 193.85 233.8 191.8 M244.1 127.25 Q241.45 131.1 241.45 135.85 241.45 140.55 243.65 142.35 246.3 144.5 253.8 144.5 266.8 144.5 274.9 136.95 279.55 132.6 280.85 128.2 282.75 130.9 282.75 133.65 282.75 144.05 273.4 149.6 265.65 154.2 254.55 154.2 247.2 154.2 243.05 150.75 238.3 146.85 238.3 139.0 238.3 130.25 245.45 125.2 L246.75 124.4 Q245.25 125.6 244.1 127.25 M68.45 124.4 Q68.45 121.95 73.4 120.05 78.05 118.3 84.35 118.0 90.9 117.7 95.25 119.2 100.2 121.0 100.2 124.7 100.2 127.8 98.85 128.9 95.9 131.3 85.65 131.3 74.05 131.3 70.3 128.6 68.45 127.25 68.45 124.4 M127.8 166.3 Q120.3 174.7 120.3 184.55 120.3 193.3 126.1 198.65 131.05 203.25 137.25 203.25 144.4 203.25 151.3 200.95 L151.75 201.7 Q147.2 205.05 147.2 209.15 147.2 213.3 160.0 216.2 170.3 218.5 178.65 218.5 L187.5 218.3 183.1 220.35 Q165.95 227.8 147.75 227.8 135.3 227.8 123.8 220.95 110.95 213.3 110.95 202.65 110.95 179.85 125.25 166.3 130.7 161.15 137.2 158.0 131.15 162.45 127.8 166.3" fill="#983010" fill-rule="evenodd" stroke="none"/>
  </g>
</svg>
