<?xml version="1.0" encoding="UTF-8" standalone="no"?>
<svg xmlns:xlink="http://www.w3.org/1999/xlink" height="117.9px" width="79.25px" xmlns="http://www.w3.org/2000/svg">
  <g transform="matrix(1.0, 0.0, 0.0, 1.0, 40.25, 58.95)">
    <path d="M7.65 -55.15 L7.9 -55.1 8.15 -54.9 7.65 -55.15 M38.75 40.6 L38.75 41.05 38.75 41.15 38.6 41.15 38.7 40.95 38.75 40.6 M-18.3 -7.05 L-18.25 -6.8 -18.3 -7.0 -18.3 -7.05" fill="#3a5f73" fill-opacity="0.3254902" fill-rule="evenodd" stroke="none"/>
    <path d="M-14.1 -58.7 L-11.5 -58.95 -2.5 -57.8 4.55 -56.1 6.2 -55.6 6.55 -51.2 Q6.55 -49.6 7.3 -49.15 L9.65 -48.3 11.8 -47.05 13.85 -45.35 16.6 -42.7 17.25 -41.45 17.35 -41.25 17.4 -41.2 18.6 -38.75 18.8 -38.45 Q20.5 -36.05 20.75 -32.95 L20.75 -32.55 20.75 -32.3 20.75 -31.5 Q17.45 -29.9 14.2 -30.35 10.95 -30.8 9.6 -31.6 8.2 -32.45 7.75 -33.35 6.95 -34.45 6.95 -36.0 L7.0 -36.25 7.6 -38.35 8.5 -40.55 6.0 -40.55 4.0 -40.5 3.75 -40.55 2.0 -41.1 1.95 -40.95 3.65 -38.45 3.85 -38.15 4.2 -37.1 4.6 -36.25 4.9 -35.65 5.15 -35.2 5.4 -34.7 5.95 -33.0 Q4.35 -29.0 -2.5 -29.0 -7.05 -29.0 -9.35 -32.65 -11.4 -35.85 -11.4 -41.35 L-11.5 -51.0 Q-11.8 -53.85 -12.7 -56.1 L-14.1 -58.7 M15.25 -23.45 Q14.75 -17.9 17.3 -9.8 L17.9 -8.05 12.7 -5.4 10.65 -4.45 8.65 -4.05 Q8.5 -4.05 7.4 -4.55 L4.65 -5.05 Q2.8 -5.1 2.1 -5.7 1.75 -6.0 1.35 -6.8 0.75 -7.5 -0.05 -10.55 L-0.95 -14.1 Q0.3 -14.55 4.45 -17.0 3.7 -18.55 0.95 -19.35 L-1.1 -20.0 -1.55 -20.2 -0.7 -22.25 -0.4 -22.25 -0.25 -22.3 Q4.05 -22.95 5.8 -24.55 6.55 -23.8 8.85 -22.9 L10.85 -22.25 11.2 -22.2 Q13.85 -22.2 15.25 -23.45 M38.6 41.15 Q37.95 42.85 36.4 43.85 34.65 41.45 32.6 36.65 L31.9 34.8 30.05 29.85 28.0 24.7 28.05 24.6 31.25 29.85 31.9 31.0 33.3 33.3 Q36.05 37.5 38.7 40.95 L38.6 41.15 M29.8 47.4 Q29.5 48.7 27.9 49.5 L25.5 50.55 23.8 45.25 21.55 38.2 Q20.1 33.35 19.3 29.7 L18.55 25.85 18.55 24.3 21.05 29.75 23.55 35.6 Q25.75 40.4 28.55 45.25 L29.8 47.4 M3.8 52.8 Q2.55 53.6 1.1 55.0 -0.4 56.45 -2.25 57.3 -4.15 58.3 -6.25 58.75 L-7.0 58.85 -3.45 45.25 -2.4 41.0 Q0.25 30.0 1.45 23.8 L2.05 20.6 2.3 18.7 2.5 18.7 2.4 20.5 2.3 25.9 2.3 26.9 Q2.3 34.15 2.8 40.8 L3.15 45.25 3.8 52.8 M13.15 -37.5 L13.7 -37.1 Q15.45 -35.95 16.5 -35.95 17.45 -35.95 17.9 -36.7 L18.35 -37.5 16.2 -40.0 14.1 -41.9 13.1 -41.35 12.55 -40.75 Q11.8 -39.75 11.8 -39.4 11.8 -38.55 13.15 -37.5 M1.5 -40.1 Q-1.0 -42.7 -2.95 -42.7 -3.95 -42.7 -4.65 -42.3 -5.4 -41.85 -5.4 -41.05 L0.75 -35.75 Q1.35 -35.75 1.95 -36.5 2.5 -37.2 2.5 -37.75 L1.85 -39.0 1.6 -39.45 1.5 -40.1 M14.1 -21.85 L13.15 -21.85 Q11.9 -21.2 8.65 -20.45 L7.8 -20.25 6.25 -19.8 5.65 -19.6 4.7 -19.05 4.05 -18.55 4.25 -18.35 8.4 -18.0 8.6 -18.0 10.95 -18.35 Q11.5 -18.55 11.95 -18.85 13.15 -19.7 14.1 -21.85 M4.65 -2.5 L16.6 -5.8 16.65 -5.7 Q13.1 -3.5 12.2 -3.05 10.35 -2.15 8.6 -2.15 L4.65 -2.5 M4.85 3.65 L5.0 4.4 Q5.5 7.5 6.0 13.5 L5.5 19.4 4.65 25.55 4.35 21.3 4.25 19.8 4.05 14.25 Q4.4 6.75 4.75 4.4 L4.85 3.65 M-13.55 -12.7 L-13.55 -12.75 -13.35 -12.25 -13.55 -12.7" fill="#e0cece" fill-rule="evenodd" stroke="none"/>
    <path d="M20.75 -31.5 L20.75 -32.3 20.75 -32.55 20.75 -32.95 20.8 -32.35 20.8 -32.3 20.8 -31.55 Q20.7 -29.95 20.05 -28.55 20.6 -29.9 20.75 -31.5" fill="#e0cdcd" fill-rule="evenodd" stroke="none"/>
    <path d="M5.15 -35.2 L4.9 -35.65 4.6 -36.25 4.2 -37.1 3.85 -38.15 3.65 -38.45 1.95 -40.95 2.0 -41.1 3.75 -40.55 4.65 -38.4 5.6 -39.2 5.15 -35.2 M15.25 -23.85 L15.25 -23.45 Q13.85 -22.2 11.2 -22.2 L10.85 -22.25 8.85 -22.9 Q6.55 -23.8 5.8 -24.55 4.05 -22.95 -0.25 -22.3 L-0.4 -22.25 -0.7 -22.25 -1.3 -22.15 Q-2.75 -21.35 -4.3 -19.45 L-5.15 -18.4 -5.35 -18.15 3.3 -16.65 -0.6 -15.85 -2.4 -15.45 -5.4 -16.3 -6.35 -16.6 Q-7.9 -13.95 -7.9 -11.65 L-7.5 -8.0 -6.6 -1.35 -6.55 -1.05 -6.5 -0.8 -6.45 -0.95 -6.4 -0.95 Q-5.5 -0.2 -3.9 0.55 -0.3 2.3 0.6 3.05 L-1.75 3.05 Q-4.0 2.7 -4.85 2.1 L-5.0 2.1 -3.1 3.35 -2.05 3.8 Q0.2 4.7 1.65 4.45 L-2.55 5.25 -5.2 5.5 -6.0 5.55 -6.0 9.65 -6.0 10.25 Q-6.1 11.3 -6.75 13.7 L-6.65 16.65 Q-6.55 19.3 -7.15 21.85 L-8.05 25.4 -7.85 23.15 -7.8 22.7 -8.0 21.3 -8.1 20.35 -7.55 16.0 -9.6 23.7 -11.8 31.45 -14.5 39.2 Q-15.4 41.6 -18.4 45.25 L-20.45 47.6 Q-23.3 50.7 -24.55 52.6 L-25.5 52.5 Q-29.5 51.85 -33.35 49.5 L-36.4 46.9 -36.4 46.75 -36.05 45.65 -36.1 45.65 -35.9 45.25 -35.9 45.2 -34.8 43.0 -34.65 42.7 -34.45 42.25 -34.2 41.75 -30.1 33.8 -29.7 33.0 -28.6 30.8 -28.15 29.95 -27.85 28.9 -27.8 28.75 -27.45 27.25 -27.65 27.2 -31.25 31.35 -33.1 33.4 -38.9 40.35 -39.75 39.1 -40.25 37.95 -40.1 37.7 -39.25 36.3 -37.6 33.8 -33.85 28.4 -33.65 28.15 -32.35 26.4 -27.9 20.6 Q-23.6 15.2 -20.25 10.1 L-18.95 9.25 -18.75 12.15 Q-17.65 11.85 -15.1 7.6 L-12.55 3.65 -12.35 3.45 -9.85 3.75 Q-9.05 3.85 -6.95 2.9 L-6.95 2.5 -7.85 2.35 -9.85 2.1 -11.3 1.55 -12.15 0.75 -10.8 0.55 -6.55 0.35 Q-9.05 -0.45 -10.0 -1.25 -11.7 -2.75 -11.6 -5.6 -11.4 -10.85 -12.4 -16.5 L-12.55 -17.2 Q-12.7 -18.1 -16.9 -27.9 -20.85 -37.15 -20.85 -39.6 L-20.7 -41.2 -20.5 -41.3 Q-18.9 -42.3 -17.45 -42.3 -16.05 -42.3 -15.35 -41.85 L-15.05 -41.55 -14.75 -41.2 -14.9 -41.9 -15.05 -42.0 Q-15.05 -43.45 -16.8 -46.35 -13.65 -44.75 -12.5 -41.2 -11.8 -39.1 -11.55 -34.4 L-11.4 -32.25 -11.2 -30.4 Q-10.2 -27.95 -8.35 -26.45 -5.8 -24.35 -2.0 -24.35 L1.4 -24.75 Q3.05 -25.15 3.85 -25.55 L3.8 -25.45 4.05 -25.7 5.3 -27.4 5.6 -28.1 5.7 -28.3 5.75 -28.25 6.7 -26.2 Q7.25 -25.25 7.95 -24.8 8.4 -24.3 9.1 -23.95 9.95 -23.5 11.2 -23.35 L11.45 -23.35 11.6 -23.35 13.55 -23.4 15.25 -23.85 M34.8 44.55 L31.9 45.2 31.5 45.25 29.7 45.45 29.65 45.25 28.95 43.65 23.45 29.75 19.95 20.95 19.35 19.55 19.15 18.5 18.8 16.6 18.35 14.7 17.2 10.45 16.6 8.1 16.45 7.15 16.45 6.2 Q20.65 17.7 24.3 25.4 L26.5 29.8 Q28.9 34.6 31.9 39.7 L34.8 44.55 M22.15 51.2 L21.75 51.2 Q18.55 51.2 16.05 50.35 13.5 49.5 11.0 49.5 L10.35 45.25 9.65 37.4 9.35 29.45 9.2 29.6 9.3 27.8 9.4 24.9 9.5 21.25 9.5 20.2 9.85 18.05 10.25 14.7 Q11.0 8.8 11.0 6.95 11.35 10.8 12.8 17.3 L14.85 25.6 15.95 29.7 20.4 45.25 22.15 51.2 M-6.5 -23.85 Q-4.8 -23.15 -2.9 -23.05 L-0.45 -23.2 Q2.05 -23.65 3.8 -25.45 2.05 -23.65 -0.45 -23.2 L-2.9 -23.05 Q-4.8 -23.15 -6.5 -23.85 M10.35 -20.15 Q11.75 -20.6 12.5 -21.0 L11.95 -20.3 10.8 -18.55 5.4 -18.55 5.4 -18.75 8.15 -19.5 10.1 -20.05 10.35 -20.15 M16.35 -2.4 L14.1 -0.35 Q10.95 2.0 7.9 1.7 L13.85 -1.15 16.35 -2.4 M-14.15 -40.65 L-13.6 -39.95 -13.5 -39.4 -13.45 -38.55 -13.45 -38.5 -13.55 -36.2 Q-13.95 -34.8 -13.75 -33.1 -13.4 -29.2 -10.2 -26.2 L-9.1 -25.3 -10.2 -26.2 Q-13.4 -29.2 -13.75 -33.1 -13.95 -34.8 -13.55 -36.2 L-13.45 -38.5 -13.45 -38.55 -13.5 -39.4 -13.6 -39.95 -14.15 -40.65 M-12.75 22.05 L-7.75 11.2 Q-8.75 11.9 -11.0 12.6 -11.55 12.8 -12.05 13.15 L-13.2 13.9 -13.6 14.25 -25.2 37.1 -25.5 37.65 -25.0 37.3 Q-17.8 31.75 -13.85 24.5 L-12.75 22.05" fill="#c29c9c" fill-rule="evenodd" stroke="none"/>
    <path d="M-14.1 -58.7 L-12.7 -56.1 Q-11.8 -53.85 -11.5 -51.0 L-11.4 -41.35 Q-11.4 -35.85 -9.35 -32.65 -7.05 -29.0 -2.5 -29.0 4.35 -29.0 5.95 -33.0 L5.4 -34.7 5.15 -35.2 5.6 -39.2 4.65 -38.4 3.75 -40.55 4.0 -40.5 6.0 -40.55 8.5 -40.55 7.6 -38.35 7.0 -36.25 6.95 -36.0 Q6.95 -34.45 7.75 -33.35 8.2 -32.45 9.6 -31.6 10.95 -30.8 14.2 -30.35 17.45 -29.9 20.75 -31.5 20.6 -29.9 20.05 -28.55 L19.35 -27.2 18.1 -25.75 Q16.95 -24.6 15.65 -24.0 L15.25 -23.85 13.55 -23.4 11.6 -23.35 11.45 -23.35 11.2 -23.35 Q9.95 -23.5 9.1 -23.95 8.4 -24.3 7.95 -24.8 7.25 -25.25 6.7 -26.2 L5.75 -28.25 5.7 -28.3 5.6 -28.1 5.3 -27.4 4.05 -25.7 3.8 -25.45 3.85 -25.55 Q3.05 -25.15 1.4 -24.75 L-2.0 -24.35 Q-5.8 -24.35 -8.35 -26.45 -10.2 -27.95 -11.2 -30.4 L-11.4 -32.25 -11.55 -34.4 Q-11.8 -39.1 -12.5 -41.2 -13.65 -44.75 -16.8 -46.35 -15.05 -43.45 -15.05 -42.0 L-14.9 -41.9 -14.75 -41.2 -15.05 -41.55 -15.35 -41.85 Q-16.05 -42.3 -17.45 -42.3 -18.9 -42.3 -20.5 -41.3 L-20.7 -41.2 -22.0 -40.25 -22.65 -39.6 -22.75 -42.15 Q-22.75 -49.7 -21.25 -52.55 -20.5 -53.95 -18.15 -56.1 L-15.8 -58.1 -15.0 -58.4 -14.1 -58.7 M17.9 -8.05 Q20.7 0.1 26.5 12.4 L28.65 17.0 31.9 23.7 35.0 29.9 38.2 36.15 38.95 37.75 39.0 38.45 38.85 40.2 38.75 40.6 38.7 40.95 Q36.05 37.5 33.3 33.3 L31.9 31.0 31.25 29.85 28.05 24.6 28.0 24.7 30.05 29.85 31.9 34.8 32.6 36.65 Q34.65 41.45 36.4 43.85 L36.05 44.05 34.8 44.55 31.9 39.7 Q28.9 34.6 26.5 29.8 L24.3 25.4 Q20.65 17.7 16.45 6.2 L16.45 7.15 16.6 8.1 17.2 10.45 18.35 14.7 18.8 16.6 19.15 18.5 19.35 19.55 19.95 20.95 23.45 29.75 28.95 43.65 29.65 45.25 29.7 45.45 Q30.0 46.5 29.8 47.4 L28.55 45.25 Q25.75 40.4 23.55 35.6 L21.05 29.75 18.55 24.3 18.55 25.85 19.3 29.7 Q20.1 33.35 21.55 38.2 L23.8 45.25 25.5 50.55 22.15 51.2 20.4 45.25 15.95 29.7 14.85 25.6 12.8 17.3 Q11.35 10.8 11.0 6.95 11.0 8.8 10.25 14.7 L9.85 18.05 9.5 20.2 9.5 21.25 9.4 24.9 9.3 27.8 9.2 29.6 8.75 35.7 Q8.5 40.05 8.4 45.25 L8.35 48.15 8.3 49.9 8.35 51.5 8.25 51.7 8.25 51.75 8.2 51.75 6.95 51.5 Q6.0 51.5 4.75 52.2 L3.8 52.8 3.15 45.25 2.8 40.8 Q2.3 34.15 2.3 26.9 L2.3 25.9 2.4 20.5 2.5 18.7 2.3 18.7 2.05 20.6 1.45 23.8 Q0.25 30.0 -2.4 41.0 L-3.45 45.25 -7.0 58.85 Q-12.9 59.6 -15.8 55.35 L-15.4 54.75 -13.1 52.25 -12.85 51.95 Q-12.45 51.4 -12.65 50.55 L-12.9 50.55 -11.75 45.25 -9.85 36.45 Q-8.55 30.3 -8.05 25.4 L-7.15 21.85 Q-6.55 19.3 -6.65 16.65 L-6.75 13.7 Q-6.1 11.3 -6.0 10.25 L-6.0 9.65 -6.0 5.55 -5.2 5.5 -2.55 5.25 1.65 4.45 Q0.2 4.7 -2.05 3.8 L-3.1 3.35 -5.0 2.1 -4.85 2.1 Q-4.0 2.7 -1.75 3.05 L0.6 3.05 Q-0.3 2.3 -3.9 0.55 -5.5 -0.2 -6.4 -0.95 L-6.45 -0.95 -6.5 -0.8 -6.55 -1.05 -6.6 -1.35 -7.5 -8.0 -7.9 -11.65 Q-7.9 -13.95 -6.35 -16.6 L-5.4 -16.3 -2.4 -15.45 -0.6 -15.85 3.3 -16.65 -5.35 -18.15 -5.15 -18.4 -4.3 -19.45 Q-2.75 -21.35 -1.3 -22.15 L-0.7 -22.25 -1.55 -20.2 -1.1 -20.0 0.95 -19.35 Q3.7 -18.55 4.45 -17.0 0.3 -14.55 -0.95 -14.1 L-0.05 -10.55 Q0.75 -7.5 1.35 -6.8 1.75 -6.0 2.1 -5.7 2.8 -5.1 4.65 -5.05 L7.4 -4.55 Q8.5 -4.05 8.65 -4.05 L10.65 -4.45 12.7 -5.4 17.9 -8.05 M6.2 -29.0 L6.05 -29.75 6.15 -31.3 6.1 -32.0 5.95 -33.0 6.1 -32.0 6.15 -31.3 6.05 -29.75 6.2 -29.0 M10.35 -20.15 L10.1 -20.05 8.15 -19.5 5.4 -18.75 5.4 -18.55 10.8 -18.55 11.95 -20.3 12.5 -21.0 Q11.75 -20.6 10.35 -20.15 M14.1 -21.85 Q13.15 -19.7 11.95 -18.85 11.5 -18.55 10.95 -18.35 L8.6 -18.0 8.4 -18.0 4.25 -18.35 4.05 -18.55 4.7 -19.05 5.65 -19.6 6.25 -19.8 7.8 -20.25 8.65 -20.45 Q11.9 -21.2 13.15 -21.85 L14.1 -21.85 M4.65 -2.5 L8.6 -2.15 Q10.35 -2.15 12.2 -3.05 13.1 -3.5 16.65 -5.7 L16.6 -5.8 4.65 -2.5 M16.35 -2.4 L13.85 -1.15 7.9 1.7 Q10.95 2.0 14.1 -0.35 L16.35 -2.4 M4.85 3.65 L4.75 4.4 Q4.4 6.75 4.05 14.25 L4.25 19.8 4.35 21.3 4.65 25.55 5.5 19.4 6.0 13.5 Q5.5 7.5 5.0 4.4 L4.85 3.65 M-12.75 22.05 L-13.85 24.5 Q-17.8 31.75 -25.0 37.3 L-25.5 37.65 -25.2 37.1 -13.6 14.25 -13.2 13.9 -12.05 13.15 Q-11.55 12.8 -11.0 12.6 -8.75 11.9 -7.75 11.2 L-12.75 22.05" fill="#d2b6b6" fill-rule="evenodd" stroke="none"/>
    <path d="M16.6 -42.7 L13.85 -45.35 11.8 -47.05 9.65 -48.3 7.3 -49.15 Q6.55 -49.6 6.55 -51.2 L6.2 -55.6 7.65 -55.15 8.15 -54.9 Q12.85 -52.3 14.05 -51.65 L13.8 -48.1 16.6 -42.7 M1.5 -40.1 L1.6 -39.45 1.85 -39.0 2.5 -37.75 Q2.5 -37.2 1.95 -36.5 1.35 -35.75 0.75 -35.75 L-5.4 -41.05 Q-5.4 -41.85 -4.65 -42.3 -3.95 -42.7 -2.95 -42.7 -1.0 -42.7 1.5 -40.1 M13.15 -37.5 Q11.8 -38.55 11.8 -39.4 11.8 -39.75 12.55 -40.75 L13.1 -41.35 14.1 -41.9 16.2 -40.0 18.35 -37.5 17.9 -36.7 Q17.45 -35.95 16.5 -35.95 15.45 -35.95 13.7 -37.1 L13.15 -37.5" fill="#f2eaea" fill-rule="evenodd" stroke="none"/>
    <path d="M11.0 49.5 L9.0 49.6 8.3 49.9 8.35 48.15 8.4 45.25 Q8.5 40.05 8.75 35.7 L9.2 29.6 9.35 29.45 9.65 37.4 10.35 45.25 11.0 49.5 M-12.9 50.55 L-13.55 50.7 -14.95 51.3 -17.05 52.0 -19.15 52.45 -24.55 52.6 Q-23.3 50.7 -20.45 47.6 L-18.4 45.25 Q-15.4 41.6 -14.5 39.2 L-11.8 31.45 -9.6 23.7 -7.55 16.0 -8.1 20.35 -8.0 21.3 -7.8 22.7 -7.85 23.15 -8.05 25.4 Q-8.55 30.3 -9.85 36.45 L-11.75 45.25 -12.9 50.55 M-34.8 43.0 Q-36.25 43.05 -38.0 41.35 L-38.9 40.35 -33.1 33.4 -31.25 31.35 -27.65 27.2 -27.45 27.25 -27.8 28.75 -27.85 28.9 -28.15 29.95 -28.6 30.8 -29.7 33.0 -30.1 33.8 -34.2 41.75 -34.45 42.25 -34.65 42.7 -34.8 43.0 M-20.25 10.1 Q-17.45 5.75 -15.3 1.65 L-13.8 -5.0 -13.55 -12.7 Q-15.95 -18.5 -19.1 -24.95 -21.25 -30.1 -22.1 -35.2 L-22.65 -39.6 -22.0 -40.25 -20.7 -41.2 -20.85 -39.6 Q-20.85 -37.15 -16.9 -27.9 -12.7 -18.1 -12.55 -17.2 L-12.4 -16.5 Q-11.4 -10.85 -11.6 -5.6 -11.7 -2.75 -10.0 -1.25 -9.05 -0.45 -6.55 0.35 L-10.8 0.55 -12.15 0.75 -11.3 1.55 -9.85 2.1 -7.85 2.35 -6.95 2.5 -6.95 2.9 Q-9.05 3.85 -9.85 3.75 L-12.35 3.45 -12.55 3.65 -15.1 7.6 Q-17.65 11.85 -18.75 12.15 L-18.95 9.25 -20.25 10.1 M-13.35 -12.25 L-13.55 -12.75 -13.55 -12.7 -13.35 -12.25 -13.3 -12.1 -13.05 -11.5 -13.0 -11.45 -12.65 -10.5 -13.0 -11.45 -13.05 -11.5 -13.3 -12.1 -13.35 -12.25 M-16.9 8.05 L-15.3 1.65 -16.9 8.05" fill="#b38484" fill-rule="evenodd" stroke="none"/>
    <path d="M6.2 -55.6 L4.55 -56.1 -2.5 -57.8 -11.5 -58.95 -14.1 -58.7 -15.0 -58.4 -15.8 -58.1 -18.15 -56.1 Q-20.5 -53.95 -21.25 -52.55 -22.75 -49.7 -22.75 -42.15 L-22.65 -39.6 -22.1 -35.2 Q-21.25 -30.1 -19.1 -24.95 -15.95 -18.5 -13.55 -12.7 L-13.55 -12.75 -13.35 -12.25 -13.3 -12.1 -13.05 -11.5 -13.0 -11.45 -12.65 -10.5 M5.95 -33.0 L5.4 -34.7 M5.15 -35.2 L4.9 -35.65 4.6 -36.25 4.2 -37.1 3.85 -38.15 3.65 -38.45 M20.75 -31.5 L20.75 -32.3 20.75 -32.55 20.75 -32.95 Q20.5 -36.05 18.8 -38.45 L18.6 -38.75 17.4 -41.2 17.35 -41.25 17.25 -41.45 16.6 -42.7 M6.2 -55.6 L7.65 -55.15 7.9 -55.1 M8.15 -54.9 Q12.85 -52.3 14.05 -51.65 L13.8 -48.1 16.6 -42.7 M8.15 -54.9 L7.65 -55.15 M20.75 -32.95 L20.8 -32.35 20.8 -32.3 20.8 -31.55 Q20.7 -29.95 20.05 -28.55 L19.35 -27.2 18.1 -25.75 Q16.95 -24.6 15.65 -24.0 L15.25 -23.85 15.25 -23.45 Q14.75 -17.9 17.3 -9.8 L17.9 -8.05 Q20.7 0.1 26.5 12.4 L28.65 17.0 31.9 23.7 35.0 29.9 38.2 36.15 38.95 37.75 39.0 38.45 38.85 40.2 38.75 40.6 38.7 40.95 38.6 41.15 Q37.95 42.85 36.4 43.85 L36.05 44.05 34.8 44.55 31.9 45.2 31.5 45.25 29.7 45.45 Q30.0 46.5 29.8 47.4 29.5 48.7 27.9 49.5 L25.5 50.55 22.15 51.2 21.75 51.2 Q18.55 51.2 16.05 50.35 13.5 49.5 11.0 49.5 L9.0 49.6 8.3 49.9 8.35 51.5 8.25 51.7 8.25 51.75 8.2 51.75 6.95 51.5 Q6.0 51.5 4.75 52.2 L3.8 52.8 Q2.55 53.6 1.1 55.0 -0.4 56.45 -2.25 57.3 -4.15 58.3 -6.25 58.75 L-7.0 58.85 Q-12.9 59.6 -15.8 55.35 L-15.4 54.75 -13.1 52.25 -12.85 51.95 Q-12.45 51.4 -12.65 50.55 L-12.9 50.55 -13.55 50.7 -14.95 51.3 -17.05 52.0 -19.15 52.45 -24.55 52.6 -25.5 52.5 Q-29.5 51.85 -33.35 49.5 L-36.4 46.9 -36.45 46.85 -36.65 46.75 -36.6 46.7 -36.15 45.65 -36.1 45.65 -35.9 45.25 -35.9 45.2 -34.8 43.0 Q-36.25 43.05 -38.0 41.35 L-38.9 40.35 -39.75 39.1 -40.25 37.95 -40.1 37.7 -39.25 36.3 -37.6 33.8 -33.85 28.4 -33.65 28.15 -32.35 26.4 -27.9 20.6 Q-23.6 15.2 -20.25 10.1 -17.45 5.75 -15.3 1.65 L-13.8 -5.0 -13.55 -12.7 -13.6 -11.95 -13.8 -9.6 -13.9 -9.6 -13.6 -11.95 M5.95 -33.0 L6.1 -32.0 6.15 -31.3 6.05 -29.75 6.2 -29.0 M3.8 -25.45 L4.05 -25.7 5.3 -27.4 M5.6 -28.1 L5.7 -28.3 M3.8 -25.45 Q2.05 -23.65 -0.45 -23.2 L-2.9 -23.05 Q-4.8 -23.15 -6.5 -23.85 M20.05 -28.55 Q20.6 -29.9 20.75 -31.5 M19.95 20.95 L23.45 29.75 28.95 43.65 29.65 45.25 29.7 45.45 M9.5 21.25 L9.4 24.9 M9.3 27.8 L9.2 29.6 8.75 35.7 Q8.5 40.05 8.4 45.25 L8.35 48.15 8.3 49.9 M-9.1 -25.3 L-10.2 -26.2 Q-13.4 -29.2 -13.75 -33.1 -13.95 -34.8 -13.55 -36.2 L-13.45 -38.5 -13.45 -38.55 -13.5 -39.4 -13.6 -39.95 -14.15 -40.65 M-13.35 -12.25 L-13.55 -12.7 M-15.3 1.65 L-16.9 8.05 M-34.8 43.0 L-34.65 42.7 -34.45 42.25 -34.2 41.75 -30.1 33.8 -29.7 33.0 -28.6 30.8 -28.15 29.95 -27.85 28.9" fill="none" stroke="#a36a6a" stroke-linecap="round" stroke-linejoin="round" stroke-opacity="0.4" stroke-width="0.05"/>
  </g>
</svg>
