<?xml version="1.0" encoding="UTF-8" standalone="no"?>
<svg xmlns:xlink="http://www.w3.org/1999/xlink" height="7.65px" width="75.35px" xmlns="http://www.w3.org/2000/svg">
  <g transform="matrix(1.0, 0.0, 0.0, 1.0, -0.1, 1.1)">
    <path d="M1.1 -1.1 L74.45 -1.1 75.15 -0.8 75.45 -0.1 75.45 5.55 75.15 6.25 74.45 6.55 1.1 6.55 0.4 6.25 Q0.1 5.95 0.1 5.55 L0.1 -0.1 Q0.1 -0.5 0.4 -0.8 L1.1 -1.1 M73.95 5.05 L73.95 0.4 1.6 0.4 1.6 5.05 73.95 5.05" fill="#1c323b" fill-rule="evenodd" stroke="none"/>
  </g>
</svg>
