<?xml version="1.0" encoding="UTF-8" standalone="no"?>
<svg xmlns:xlink="http://www.w3.org/1999/xlink" height="19.05px" width="16.05px" xmlns="http://www.w3.org/2000/svg">
  <g transform="matrix(1.0, 0.0, 0.0, 1.0, 11.4, 37.2)">
    <path d="M4.65 -35.8 Q4.6 -35.0 4.0 -35.0 L2.9 -35.35 Q1.95 -35.75 1.65 -36.05 2.05 -37.0 3.35 -36.8 4.65 -36.6 4.65 -35.8 M1.3 -20.9 Q1.15 -21.25 1.25 -21.65 1.25 -22.2 1.6 -22.75 2.1 -23.5 3.05 -23.5 4.4 -23.5 4.65 -21.7 4.65 -21.1 4.05 -20.65 3.45 -20.2 2.75 -20.2 1.55 -20.2 1.3 -20.9 M-2.6 -35.35 L-6.4 -31.3 Q-7.4 -31.3 -7.25 -32.55 -7.25 -34.2 -4.9 -35.65 -2.6 -37.1 -2.6 -35.35 M-7.45 -36.05 Q-7.7 -35.65 -8.1 -35.65 -8.75 -35.65 -8.9 -36.4 -8.9 -37.2 -8.1 -37.2 -7.3 -37.2 -7.3 -36.4 L-7.45 -36.05 M-6.35 -21.85 L-6.25 -22.25 Q-1.0 -19.6 -1.0 -19.05 -1.0 -18.6 -1.55 -18.35 L-2.45 -18.15 Q-4.0 -18.15 -5.3 -19.8 -6.35 -21.1 -6.35 -21.85 M-9.45 -22.3 Q-9.75 -22.0 -10.2 -22.0 -11.15 -22.0 -11.35 -22.55 L-11.35 -23.15 Q-11.35 -24.65 -10.2 -24.45 -9.05 -24.2 -9.05 -23.2 -9.05 -22.65 -9.45 -22.3" fill="#ffff00" fill-rule="evenodd" stroke="none"/>
  </g>
</svg>
