<?xml version="1.0" encoding="UTF-8" standalone="no"?>
<svg xmlns:xlink="http://www.w3.org/1999/xlink" height="25.65px" width="6.55px" xmlns="http://www.w3.org/2000/svg">
  <g transform="matrix(1.0, 0.0, 0.0, 1.0, 6.55, 11.15)">
    <path d="M0.0 -7.3 L-6.55 -7.3 -6.55 -11.15 0.0 -11.15 0.0 -7.3 M-6.55 10.65 L0.0 10.65 0.0 14.5 -6.55 14.5 -6.55 10.65 M0.0 3.6 L-6.55 3.6 -6.55 -0.15 0.0 -0.15 0.0 3.6" fill="url(#gradient0)" fill-rule="evenodd" stroke="none"/>
  </g>
  <defs>
    <linearGradient gradientTransform="matrix(0.0, 0.0153, -0.004, 0.0, -14.25, -0.35)" gradientUnits="userSpaceOnUse" id="gradient0" spreadMethod="pad" x1="-819.2" x2="819.2">
      <stop offset="0.0" stop-color="#475861"/>
      <stop offset="0.25098039215686274" stop-color="#5e7680"/>
      <stop offset="0.3843137254901961" stop-color="#7e9cab"/>
      <stop offset="0.5176470588235295" stop-color="#5e7680"/>
      <stop offset="1.0" stop-color="#3c4a52"/>
    </linearGradient>
  </defs>
</svg>
