<?xml version="1.0" encoding="UTF-8" standalone="no"?>
<svg xmlns:xlink="http://www.w3.org/1999/xlink" height="21.45px" width="30.55px" xmlns="http://www.w3.org/2000/svg">
  <g transform="matrix(1.0, 0.0, 0.0, 1.0, -12.35, -24.0)">
    <path d="M41.15 26.3 Q42.9 27.95 42.9 30.4 L42.2 31.6 Q41.45 32.9 41.25 33.45 L40.95 37.5 Q41.1 39.7 40.75 41.8 40.35 44.2 39.3 45.45 L39.75 42.45 Q39.75 39.35 39.9 36.95 L40.05 33.95 Q40.05 32.8 40.65 32.25 L41.25 31.5 Q39.8 28.85 38.9 28.85 38.75 28.85 38.0 29.2 L36.75 29.55 37.8 28.4 36.9 28.7 37.25 27.5 37.05 27.15 Q36.85 26.85 36.65 26.85 33.35 28.7 32.45 28.7 L32.4 28.55 33.05 27.6 31.0 28.55 29.5 28.65 26.75 30.0 26.7 29.85 Q28.2 28.35 28.2 27.9 27.2 28.2 26.6 28.65 L26.55 28.55 27.05 27.3 25.75 28.0 24.55 28.55 23.55 28.3 22.8 28.05 22.55 28.05 22.6 28.45 22.55 29.0 Q21.1 28.6 20.45 28.1 20.05 27.75 18.8 27.75 17.85 27.75 16.4 28.4 14.7 29.2 14.7 30.05 14.7 31.15 15.2 32.25 15.65 33.3 15.65 35.35 15.65 38.5 14.4 45.45 14.0 44.0 13.8 39.05 13.65 35.45 12.8 33.25 L12.9 32.6 12.9 32.5 12.65 31.4 Q12.35 30.8 12.35 30.35 12.35 28.2 15.15 26.05 17.85 24.0 20.05 24.0 L22.0 24.3 24.55 24.6 27.4 24.15 32.4 24.45 37.25 24.75 Q39.45 24.65 41.15 26.3" fill="#000000" fill-opacity="0.16470589" fill-rule="evenodd" stroke="none"/>
  </g>
</svg>
