<?xml version="1.0" encoding="UTF-8" standalone="no"?>
<svg xmlns:xlink="http://www.w3.org/1999/xlink" height="43.35px" width="53.6px" xmlns="http://www.w3.org/2000/svg">
  <g transform="matrix(1.0, 0.0, 0.0, 1.0, 26.8, 21.65)">
    <path d="M9.85 -15.5 L9.9 -15.55 11.55 -18.2 11.6 -18.3 11.8 -18.45 Q11.9 -18.65 12.25 -18.65 L12.45 -18.6 14.75 -17.75 14.8 -17.7 15.35 -17.15 15.35 -17.0 15.35 -16.9 15.4 -14.15 15.4 -14.1 Q15.4 -13.45 15.05 -13.25 L14.7 -13.2 14.3 -13.25 13.85 -11.2 14.8 -12.35 14.8 -12.4 15.15 -12.65 15.5 -12.65 16.35 -12.45 16.8 -12.7 16.8 -13.05 16.9 -13.3 17.55 -14.05 Q17.9 -14.4 18.4 -14.65 L18.8 -14.7 19.3 -14.75 19.4 -14.8 20.35 -15.6 Q20.8 -16.7 21.75 -17.25 L21.85 -17.3 24.35 -17.2 24.5 -17.05 24.95 -16.45 24.95 -16.4 25.15 -15.35 25.15 -15.3 25.15 -15.0 25.65 -14.7 25.75 -14.65 25.8 -14.6 25.9 -14.45 26.2 -13.8 26.25 -13.6 26.25 -13.5 26.25 -13.4 26.25 -13.35 26.3 -13.3 26.35 -13.25 26.65 -12.8 26.7 -12.75 26.8 -12.35 26.8 -12.25 26.8 -12.2 26.8 -12.05 26.5 -11.35 26.15 -10.8 26.2 -10.45 26.15 -10.05 25.8 -9.55 25.9 -9.3 25.9 -9.0 25.75 -8.65 25.7 -8.6 25.7 -8.55 Q25.45 -8.05 24.95 -7.9 L24.65 -7.5 24.6 -7.45 Q24.25 -6.7 23.3 -6.65 L23.15 -6.65 22.7 -6.6 22.65 -6.55 22.4 -6.1 22.4 -6.05 22.4 -0.6 22.6 0.5 23.2 1.15 23.3 1.35 23.3 1.55 23.15 3.45 23.35 3.4 23.65 3.45 23.8 3.55 24.0 3.65 24.1 3.75 24.2 3.9 24.25 3.9 24.35 4.1 24.35 4.15 24.5 4.45 24.5 4.65 24.45 4.85 24.05 5.6 23.85 5.8 23.45 5.9 22.1 6.4 22.05 6.95 22.0 7.15 21.85 7.35 21.3 7.5 17.9 8.85 17.85 8.85 17.65 8.9 18.0 12.35 18.0 12.4 17.9 13.1 17.7 13.3 17.4 13.4 14.55 13.45 14.7 14.45 14.7 14.65 14.55 14.85 14.0 15.1 9.55 15.15 9.5 15.15 9.55 15.2 10.2 15.4 10.75 15.65 10.9 15.85 10.95 16.05 10.9 16.7 10.85 17.15 10.75 17.3 10.65 17.45 10.5 17.6 10.2 17.65 9.4 17.7 9.15 17.65 8.9 17.8 8.7 17.85 7.8 17.9 7.6 17.9 7.4 17.75 7.2 17.55 6.8 17.5 6.55 17.45 6.35 17.35 6.05 17.1 5.9 16.65 5.85 16.6 Q5.65 15.6 6.45 15.2 L-6.4 15.1 -7.15 14.85 -7.3 14.6 -7.3 14.35 -5.85 9.0 -12.5 8.65 -12.8 8.55 -13.0 8.25 -12.95 7.95 -11.0 3.7 -11.05 3.7 -11.9 3.6 -13.15 3.85 -13.2 3.9 -13.65 4.85 -13.9 5.9 -13.9 5.95 -14.05 9.15 -13.8 12.25 -13.3 12.4 Q-13.1 12.45 -13.0 12.6 -12.8 12.9 -12.75 13.55 -12.65 14.5 -12.8 15.45 L-12.8 15.5 -12.8 15.75 -11.9 15.75 -11.65 15.8 -11.5 16.0 -11.3 16.25 -10.9 16.1 -10.8 16.05 -10.35 16.05 -10.2 16.1 -9.7 16.4 -9.55 16.6 -8.75 16.7 -8.5 16.85 -8.4 16.95 -8.35 17.05 -8.25 17.4 -8.25 17.45 -8.25 17.95 -8.3 18.3 -8.4 18.55 -8.55 18.7 -8.65 18.8 -8.7 18.8 -8.7 19.1 -8.8 19.55 -8.85 19.6 -8.9 19.7 -8.95 19.75 -9.15 20.0 Q-9.7 20.45 -10.55 20.0 L-10.6 20.0 -11.1 19.6 -18.95 19.35 -19.25 19.6 -19.4 19.65 -19.3 19.8 -19.25 20.3 -19.25 20.35 Q-19.2 21.1 -19.55 21.55 L-19.75 21.65 -20.0 21.7 -21.2 21.6 -21.4 21.55 -21.6 21.35 Q-22.0 20.55 -21.75 20.0 L-21.65 19.8 -21.5 19.6 -21.45 19.5 -21.4 19.5 -21.35 19.45 -21.1 19.4 -20.5 19.45 -20.8 19.15 -20.8 19.1 -20.75 18.8 -20.75 18.7 Q-20.8 18.2 -21.15 18.25 -21.5 18.0 -21.9 18.65 L-21.9 18.7 -21.95 18.75 -21.95 18.8 -21.95 19.05 -21.85 19.0 -21.6 18.9 -21.45 18.9 -21.4 18.9 -21.25 18.8 -20.95 18.65 -20.9 18.6 -20.9 18.7 -21.05 18.95 -21.15 19.05 -21.05 19.15 -21.25 19.1 -21.3 19.1 -21.35 19.1 -21.45 19.15 -21.6 19.15 -22.0 19.2 -22.0 19.1 -22.0 19.2 -22.05 19.2 -22.05 19.25 -22.15 19.4 -22.2 19.5 -22.3 19.6 -22.55 19.65 -24.25 19.75 -24.55 19.7 -24.75 19.5 -24.8 19.3 -26.1 19.4 -26.45 19.3 -26.6 19.05 -26.8 18.15 -26.8 18.1 -26.8 18.0 -26.7 17.75 -26.5 17.3 -26.25 17.1 -24.85 17.05 -24.75 16.9 -24.5 16.8 -23.55 16.65 -23.35 16.7 -23.15 16.8 -23.1 16.85 -23.05 16.85 -23.0 16.8 Q-22.85 16.65 -22.7 16.65 L-22.55 16.6 -22.5 16.6 -22.4 16.6 -21.45 16.75 -21.35 16.7 -20.5 16.55 -19.65 16.45 -19.35 16.25 -19.7 14.6 Q-19.85 13.85 -19.4 13.2 -18.9 12.2 -17.7 12.1 -17.15 8.0 -17.2 3.9 L-17.2 3.6 -17.2 3.5 Q-17.25 2.85 -17.6 2.4 L-18.2 2.05 -18.3 2.2 -18.5 2.3 -18.7 2.35 -20.6 2.25 -20.85 2.2 -21.0 2.05 -21.2 1.75 Q-22.6 1.6 -23.3 0.45 -23.65 0.0 -23.5 -0.75 L-23.4 -0.95 -23.1 -1.35 -23.4 -1.65 -23.45 -1.7 -23.8 -2.05 -23.8 -2.15 -23.85 -2.3 -23.9 -2.3 -24.0 -2.65 -23.95 -2.75 -23.8 -3.25 -23.75 -3.35 -23.7 -3.4 -23.85 -3.55 Q-25.55 -4.8 -24.6 -6.7 L-24.45 -6.9 -23.95 -7.2 -24.0 -7.15 -23.85 -7.25 -23.95 -7.95 -23.95 -8.05 -23.85 -8.5 Q-23.3 -10.15 -21.85 -11.1 L-21.85 -11.7 -21.85 -11.75 Q-21.95 -12.65 -21.65 -13.6 L-21.65 -13.65 Q-21.15 -15.25 -19.3 -15.9 L-19.25 -15.9 Q-17.25 -16.45 -15.55 -15.35 L-15.45 -15.25 -14.9 -14.45 Q-14.45 -13.85 -13.6 -13.5 L-13.55 -13.5 -12.8 -12.85 -11.3 -13.15 -11.25 -13.15 Q-9.1 -13.25 -8.5 -11.4 L-8.45 -11.05 -8.3 -11.55 -8.15 -11.8 -7.9 -11.95 -5.7 -12.25 -5.5 -12.2 -5.3 -12.1 -5.0 -11.75 -5.0 -11.7 -3.75 -8.65 -3.75 -8.6 -3.75 -7.9 -3.85 -7.65 -3.9 -7.65 -3.9 -7.6 -2.5 -8.85 -2.5 -14.65 -3.3 -14.85 -4.05 -15.05 -4.2 -15.25 -4.3 -15.5 -4.15 -16.05 -4.1 -16.1 -1.95 -20.3 -1.65 -20.5 1.8 -21.6 1.95 -21.65 2.0 -21.65 2.25 -21.6 2.45 -21.4 2.65 -20.9 2.65 -20.95 4.4 -16.0 4.4 -15.95 4.5 -15.55 4.5 -15.3 4.35 -15.1 4.15 -14.9 Q4.0 -14.75 3.85 -14.75 L2.75 -14.65 2.8 -12.6 9.9 -11.55 10.6 -14.4 10.1 -14.6 9.95 -14.7 9.85 -14.9 Q9.7 -15.3 9.85 -15.5 M-3.7 -6.05 L-3.8 -6.1 -3.8 -5.75 -3.2 -5.95 -3.7 -6.05 M-8.15 -3.8 L-7.25 -3.65 -7.35 -4.0 -7.7 -3.85 -7.5 -4.35 -7.9 -4.55 -7.85 -4.3 -7.85 -4.25 -8.15 -3.8 M-13.7 -1.8 L-13.65 -1.65 -13.65 -1.55 -13.55 -1.55 -13.5 -1.6 -13.4 -1.75 -13.35 -1.85 -13.45 -1.85 -13.5 -1.75 -13.55 -1.65 -13.6 -1.6 -13.6 -1.65 -13.5 -1.85 -13.55 -1.85 -13.7 -2.1 -13.8 -1.85 -13.8 -1.8 -13.7 -1.8 M20.35 -8.95 L20.65 -8.3 20.9 -8.4 20.55 -9.05 20.35 -8.95 M-21.95 18.75 L-21.95 18.7 -22.4 19.2 -22.1 19.2 -22.0 19.1 -22.0 19.05 -22.0 19.0 -21.95 18.75 M-11.3 16.25 L-11.65 16.6 -11.8 16.9 -10.95 16.8 -11.05 16.65 -11.3 16.25 -11.4 16.3 -11.3 16.25" fill="#ffffff" fill-rule="evenodd" stroke="none"/>
  </g>
</svg>
