<?xml version="1.0" encoding="UTF-8" standalone="no"?>
<svg xmlns:xlink="http://www.w3.org/1999/xlink" height="9.45px" width="16.85px" xmlns="http://www.w3.org/2000/svg">
  <g transform="matrix(1.0, 0.0, 0.0, 1.0, 14.4, 0.05)">
    <path d="M-4.3 6.85 L-4.05 6.45 -3.9 6.3 Q-4.05 6.7 -3.65 6.5 L-1.85 5.75 -1.8 5.7 -1.45 5.5 -1.35 5.45 0.5 4.05 Q1.25 3.65 1.3 2.9 L1.2 2.8 2.15 2.15 Q2.6 2.0 2.4 2.45 L1.5 4.15 0.7 5.0 -0.35 5.85 -1.65 6.55 -3.0 6.95 -4.2 7.05 -4.3 6.85 M-1.6 0.45 Q-2.7 0.4 -4.1 1.25 -5.7 2.3 -6.2 3.45 -6.3 2.7 -5.25 1.5 -4.1 0.2 -3.3 0.2 L-2.4 -0.05 -1.6 0.45 M-9.35 7.9 L-9.5 7.75 -9.55 7.7 -9.7 7.6 -9.7 7.55 -9.6 7.6 -9.5 7.6 -9.4 7.65 -9.4 7.75 -9.35 7.9 M-13.1 7.55 L-13.0 7.5 -12.95 7.35 -12.85 7.35 -12.8 7.3 -12.7 7.45 -12.75 7.45 -12.6 7.85 Q-12.6 8.2 -11.8 8.55 L-10.6 8.85 -9.9 8.75 -9.7 8.65 -9.15 8.45 -9.25 8.35 -9.2 8.3 -9.15 8.45 -9.1 8.5 -8.85 8.65 -9.25 8.85 -9.55 9.0 -9.8 9.1 -9.85 9.1 -10.75 9.4 Q-10.85 9.3 -10.9 9.35 -11.55 9.35 -12.1 8.8 L-13.0 7.8 -13.1 7.55 M-11.55 2.65 L-10.8 3.2 -10.2 3.85 Q-9.6 4.55 -9.7 4.8 L-10.5 4.05 Q-11.25 3.5 -11.45 3.5 L-11.9 3.45 Q-12.45 3.45 -13.4 4.05 -14.3 4.6 -14.4 4.85 -14.2 4.2 -13.3 3.4 -12.4 2.6 -11.85 2.6 L-11.55 2.65" fill="#35495c" fill-rule="evenodd" stroke="none"/>
    <path d="M-4.05 6.45 Q-4.05 4.85 -3.0 4.1 L-2.6 3.85 -2.6 3.9 -2.55 4.4 -2.4 4.75 -2.7 5.0 -3.2 5.45 -3.85 6.25 -3.9 6.3 -4.05 6.45 M0.1 2.85 L0.25 2.8 1.0 2.9 0.35 3.15 0.3 3.15 0.25 3.05 0.1 2.85 M-12.8 7.3 L-12.8 7.25 -12.75 7.25 -12.35 6.85 Q-11.75 6.35 -11.3 6.35 L-10.95 6.45 -11.2 7.05 -11.3 7.05 -11.25 7.35 -11.2 7.45 -11.2 7.5 -11.3 7.5 -11.45 7.5 -12.45 7.55 -12.5 7.6 -12.1 7.95 -11.65 8.1 -11.35 8.25 -10.35 8.55 -10.3 8.55 -10.25 8.55 -9.25 8.35 -9.15 8.45 -9.7 8.65 -9.9 8.75 -10.6 8.85 -11.8 8.55 Q-12.6 8.2 -12.6 7.85 L-12.75 7.45 -12.7 7.45 -12.8 7.3" fill="#a2bbbf" fill-rule="evenodd" stroke="none"/>
    <path d="M-9.8 7.55 L-9.8 7.5 -9.7 7.55 -9.8 7.55 M-10.3 7.2 L-10.3 7.35 -10.25 7.5 -10.25 7.55 -10.75 7.55 -11.15 7.5 -11.2 7.5 -11.2 7.45 -11.25 7.35 -11.3 7.05 -11.2 7.05 -10.8 7.1 -10.3 7.2" fill="#4a6617" fill-rule="evenodd" stroke="none"/>
    <path d="M-2.6 3.85 L-2.4 3.75 -1.65 3.35 -1.65 3.7 -1.6 4.0 -1.45 4.3 -1.35 4.65 -1.6 4.65 -2.15 4.9 -2.2 4.95 -2.3 4.85 -2.25 4.85 -2.2 4.75 -2.1 4.55 -2.4 4.75 -2.55 4.4 -2.6 3.9 -2.6 3.85 M-0.75 3.05 L-0.65 3.05 0.1 2.85 0.25 3.05 0.3 3.15 0.35 3.15 0.4 3.25 0.5 3.65 0.5 3.9 0.5 4.05 -1.35 5.45 -1.4 5.45 -1.3 5.35 -1.3 5.3 Q-1.0 5.05 -1.1 4.85 L-0.9 5.0 Q-0.5 4.55 -0.75 3.65 L-0.75 3.05 M-9.7 7.55 L-9.7 7.6 -9.55 7.7 -9.5 7.75 -9.35 7.9 -9.3 8.05 -9.2 8.3 -9.25 8.35 -10.25 8.55 -10.3 8.55 -10.5 8.45 -10.8 8.15 -10.65 8.1 -10.75 7.75 -11.15 7.55 -11.2 7.55 -11.2 7.5 -11.15 7.5 -10.75 7.55 -10.25 7.55 -10.0 8.1 -9.8 7.55 -9.7 7.55 -9.65 7.5 -9.6 7.6 -9.7 7.55 M-10.15 6.95 L-10.2 7.25 -10.3 7.2 -10.8 7.1 -11.2 7.05 -10.95 6.45 -10.15 6.95" fill="#7fab27" fill-rule="evenodd" stroke="none"/>
    <path d="M1.0 2.9 L1.2 2.8 1.3 2.9 Q1.25 3.65 0.5 4.05 L0.5 3.9 0.5 3.65 0.4 3.25 0.35 3.15 1.0 2.9 M-1.35 5.45 L-1.45 5.5 -1.4 5.45 -1.35 5.45 M-1.85 5.75 L-3.65 6.5 Q-4.05 6.7 -3.9 6.3 L-3.85 6.25 -3.2 5.45 -2.7 5.0 -2.55 5.0 -2.3 4.85 -2.2 4.95 -2.35 5.1 -2.45 5.45 -2.45 5.65 -2.4 5.8 -2.0 5.75 -1.85 5.75 M-11.3 7.5 L-11.2 7.5 -11.2 7.55 -11.3 7.5 M-10.8 8.15 L-10.5 8.45 -10.3 8.55 -10.35 8.55 -11.35 8.25 -11.65 8.1 -12.1 7.95 -12.5 7.6 -12.45 7.55 -11.45 7.5 -11.55 7.5 Q-11.9 7.6 -11.85 7.9 L-11.5 8.1 -10.8 8.15" fill="#d6f8fc" fill-rule="evenodd" stroke="none"/>
    <path d="M-1.45 5.5 L-1.8 5.7 -1.85 5.75 -2.0 5.75 -2.4 5.8 -2.45 5.65 -2.45 5.45 -2.35 5.1 -2.2 4.95 -2.15 4.9 -1.6 4.65 -1.35 4.65 -1.25 4.65 -1.1 4.85 Q-1.0 5.05 -1.3 5.3 L-1.3 5.35 -1.4 5.45 -1.45 5.5 M-2.4 4.75 L-2.1 4.55 -2.2 4.75 -2.25 4.85 -2.3 4.85 -2.55 5.0 -2.7 5.0 -2.4 4.75 M-11.3 7.5 L-11.2 7.55 -11.15 7.55 -10.75 7.75 -10.65 8.1 -10.8 8.15 -11.5 8.1 -11.85 7.9 Q-11.9 7.6 -11.55 7.5 L-11.45 7.5 -11.3 7.5" fill="#ffffff" fill-rule="evenodd" stroke="none"/>
    <path d="M-4.3 6.85 L-4.5 6.05 -4.5 5.75 -4.45 5.05 -3.7 3.35 Q-2.9 2.35 -1.5 2.0 L-0.45 1.85 -0.25 1.8 1.05 1.7 1.85 1.3 1.95 1.3 2.4 1.15 2.45 1.35 1.85 2.15 1.85 2.2 2.15 2.15 1.2 2.8 1.0 2.9 0.25 2.8 0.1 2.85 -0.65 3.05 -0.75 3.05 -1.55 3.3 -1.65 3.35 -2.4 3.75 -2.6 3.85 -3.0 4.1 Q-4.05 4.85 -4.05 6.45 L-4.3 6.85 M-9.35 7.9 L-9.4 7.75 -9.4 7.65 -9.5 7.6 -9.6 7.6 -9.65 7.5 -10.1 7.0 -10.15 6.95 -10.95 6.45 -11.3 6.35 Q-11.75 6.35 -12.35 6.85 L-12.75 7.25 -12.8 7.25 -12.8 7.3 -12.85 7.35 -12.95 7.35 -13.0 7.5 -13.1 7.55 -13.15 7.45 -13.55 7.85 -13.75 7.95 -13.85 7.95 -14.3 7.9 -14.25 7.7 -13.7 7.3 -13.65 7.4 -13.65 7.35 -13.4 7.0 -13.15 6.6 -12.25 5.75 -12.15 5.7 -11.35 5.6 -11.1 5.7 -11.0 5.75 -10.95 5.8 -10.65 6.0 -10.5 5.95 -10.35 6.0 -10.05 6.25 -9.35 7.15 Q-9.05 7.65 -8.9 8.25 L-8.9 8.3 -8.85 8.6 -8.85 8.65 -9.1 8.5 -9.15 8.45 -9.2 8.3 -9.3 8.05 -9.35 7.9" fill="#2c3c4d" fill-rule="evenodd" stroke="none"/>
    <path d="M-1.65 3.35 L-1.55 3.3 -0.75 3.05 -0.75 3.65 Q-0.5 4.55 -0.9 5.0 L-1.1 4.85 -1.25 4.65 -1.35 4.65 -1.45 4.3 -1.6 4.0 -1.65 3.7 -1.65 3.35 M-9.7 7.55 L-9.8 7.5 -9.8 7.55 -10.0 8.1 -10.25 7.55 -10.25 7.5 -10.3 7.35 -10.3 7.2 -10.2 7.25 -10.15 6.95 -10.1 7.0 -9.65 7.5 -9.7 7.55" fill="#000000" fill-rule="evenodd" stroke="none"/>
  </g>
</svg>
