<?xml version="1.0" encoding="UTF-8" standalone="no"?>
<svg xmlns:xlink="http://www.w3.org/1999/xlink" height="50.0px" width="25.0px" xmlns="http://www.w3.org/2000/svg">
  <g transform="matrix(1.0, 0.0, 0.0, 1.0, 0.0, 31.0)">
    <path d="M0.0 -10.6 L7.1 -4.9 13.0 -31.0 25.0 -9.55 16.0 -19.0 9.0 19.0 0.0 7.6 0.0 -10.6" fill="#ffffff" fill-rule="evenodd" stroke="none"/>
  </g>
</svg>
