<?xml version="1.0" encoding="UTF-8" standalone="no"?>
<svg xmlns:xlink="http://www.w3.org/1999/xlink" height="7.8px" width="7.7px" xmlns="http://www.w3.org/2000/svg">
  <g transform="matrix(1.0, 0.0, 0.0, 1.0, 33.65, 21.45)">
    <path d="M-30.65 -16.3 L-32.65 -18.55 -29.0 -19.15" fill="none" stroke="#361a0e" stroke-linecap="round" stroke-linejoin="round" stroke-width="2.0">
      <animate attributeName="stroke" dur="2s" repeatCount="indefinite" values="#361a0e;#361a0f"/>
      <animate attributeName="stroke-width" dur="2s" repeatCount="indefinite" values="2.0;2.0"/>
      <animate attributeName="fill-opacity" dur="2s" repeatCount="indefinite" values="1.0;1.0"/>
      <animate attributeName="d" dur="2s" repeatCount="indefinite" values="M-30.65 -16.3 L-32.65 -18.55 -29.0 -19.15;M-32.0 -14.65 L-32.65 -18.55 -26.95 -20.45"/>
    </path>
  </g>
</svg>
