<?xml version="1.0" encoding="UTF-8" standalone="no"?>
<svg xmlns:xlink="http://www.w3.org/1999/xlink" height="120.2px" width="165.15px" xmlns="http://www.w3.org/2000/svg">
  <g transform="matrix(1.0, 0.0, 0.0, 1.0, 87.35, 68.15)">
    <path d="M77.8 -68.15 L77.8 52.05 -87.35 52.05 -87.35 -68.15 77.8 -68.15 M24.1 -21.45 L24.2 -21.85 23.8 -21.55 24.1 -21.45" fill="#000000" fill-rule="evenodd" stroke="none"/>
  </g>
</svg>
