<?xml version="1.0" encoding="UTF-8" standalone="no"?>
<svg xmlns:xlink="http://www.w3.org/1999/xlink" height="7.55px" width="6.35px" xmlns="http://www.w3.org/2000/svg">
  <g transform="matrix(1.0, 0.0, 0.0, 1.0, 17.15, 9.4)">
    <path d="M-14.9 -8.35 Q-15.4 -8.35 -15.4 -8.7 -15.4 -9.3 -14.85 -9.4 -14.35 -9.45 -14.35 -8.9 -14.35 -8.35 -14.9 -8.35 M-13.55 -7.55 Q-13.55 -8.6 -12.75 -8.6 -12.0 -8.65 -12.0 -7.85 L-12.2 -7.2 Q-12.4 -6.75 -12.75 -6.75 -13.65 -6.75 -13.55 -7.55 M-11.3 -6.35 Q-10.8 -5.55 -10.8 -4.95 -10.8 -3.95 -11.15 -3.95 -11.75 -3.95 -11.5 -4.9 -11.5 -5.45 -11.85 -6.25 -11.85 -7.1 -11.3 -6.35 M-15.25 -7.25 L-16.35 -6.0 Q-16.75 -6.0 -16.75 -6.45 -16.75 -7.0 -16.0 -7.5 -15.25 -7.95 -15.25 -7.25 M-16.2 -3.65 L-15.5 -3.35 -15.25 -2.9 Q-15.25 -1.85 -16.1 -1.85 -17.2 -1.85 -17.15 -3.1 -17.15 -3.65 -16.2 -3.65" fill="#ffff00" fill-rule="evenodd" stroke="none"/>
  </g>
</svg>
