<?xml version="1.0" encoding="UTF-8" standalone="no"?>
<svg xmlns:xlink="http://www.w3.org/1999/xlink" height="156.9px" width="214.55px" xmlns="http://www.w3.org/2000/svg">
  <g transform="matrix(1.0, 0.0, 0.0, 1.0, 107.1, 82.8)">
    <path d="M-107.1 27.75 L44.4 27.75 44.4 -41.8 -31.1 -41.8 -31.1 6.2 -107.1 6.2 -107.1 -82.8 107.45 -82.8 107.45 74.1 -107.1 74.1 -107.1 27.75" fill="#ff0000" fill-rule="evenodd" stroke="none"/>
  </g>
</svg>
