<?xml version="1.0" encoding="UTF-8" standalone="no"?>
<svg xmlns:xlink="http://www.w3.org/1999/xlink" height="332.65px" width="212.3px" xmlns="http://www.w3.org/2000/svg">
  <g transform="matrix(1.0, 0.0, 0.0, 1.0, 64.35, 478.0)">
    <path d="M39.8 -274.4 Q42.85 -276.0 45.85 -277.9 54.25 -283.05 59.15 -289.05 L60.85 -291.3 Q63.15 -294.6 64.05 -297.8 L64.3 -299.15 64.5 -301.3 64.8 -301.3 Q65.3 -299.6 66.05 -297.85 L66.05 -297.8 65.95 -297.3 66.85 -296.4 68.3 -294.8 67.85 -288.45 Q67.05 -288.9 66.4 -290.05 L65.0 -292.45 64.65 -292.45 Q62.85 -284.3 62.0 -279.4 L61.35 -274.45 Q60.85 -270.45 60.8 -266.45 L60.8 -261.9 60.8 -260.75 61.0 -258.05 61.05 -258.0 61.0 -258.0 Q58.25 -256.35 55.0 -254.8 43.75 -249.3 33.9 -248.65 L33.75 -249.9 33.3 -252.6 Q32.6 -255.35 31.2 -258.0 L29.55 -260.75 28.2 -262.55 27.05 -263.9 Q30.1 -265.0 33.2 -266.45 37.95 -268.65 42.9 -271.55 49.75 -275.55 54.55 -279.3 L40.7 -274.75 39.8 -274.4 M63.5 -250.55 L64.6 -239.6 62.25 -240.85 60.9 -241.65 Q59.25 -242.65 58.5 -243.55 L60.8 -237.75 61.55 -235.7 60.6 -234.3 Q58.4 -230.9 57.75 -229.6 L60.3 -229.65 Q59.45 -219.35 59.65 -210.9 60.0 -200.85 62.75 -190.35 65.75 -178.7 70.3 -173.05 69.15 -173.4 65.9 -177.1 L62.9 -180.8 65.75 -174.15 Q69.45 -165.7 73.7 -158.8 78.2 -151.4 83.55 -145.35 L6.85 -145.35 3.15 -162.7 Q1.4 -171.05 1.3 -175.45 1.25 -177.6 1.65 -180.3 2.05 -182.55 1.9 -183.65 L1.9 -184.05 4.25 -184.2 7.4 -182.75 Q6.65 -177.2 6.6 -175.6 8.25 -177.75 10.3 -181.4 L10.4 -181.35 20.0 -176.65 15.05 -184.95 14.0 -186.8 14.3 -186.95 Q20.1 -189.85 23.9 -194.85 26.45 -198.25 27.55 -202.9 28.45 -206.85 27.85 -208.35 33.8 -211.15 36.85 -216.8 39.6 -222.05 39.45 -228.8 39.35 -232.05 36.65 -237.4 L34.15 -241.9 34.2 -244.55 Q43.45 -245.05 54.35 -247.7 L60.85 -249.55 63.5 -250.55 M48.8 -202.1 L44.5 -207.35 Q44.85 -205.85 44.5 -199.8 39.35 -197.05 38.7 -196.55 L39.05 -196.2 44.15 -195.1 43.65 -188.05 47.9 -194.45 55.0 -193.15 54.95 -193.8 51.2 -199.05 56.3 -206.0 Q55.05 -205.5 48.8 -202.1 M48.7 -162.6 Q44.4 -168.3 43.15 -169.2 L40.25 -161.15 28.95 -159.4 29.65 -159.05 Q31.65 -158.6 38.4 -156.05 L35.7 -148.7 Q39.65 -150.6 44.4 -153.7 L44.8 -153.55 59.9 -147.3 60.0 -147.55 52.15 -158.0 51.6 -158.85 58.0 -163.95 57.8 -164.15 48.7 -162.6" fill="#258cb8" fill-rule="evenodd" stroke="none"/>
    <path d="M67.85 -288.45 L67.4 -284.35 66.2 -273.15 Q65.55 -267.0 65.7 -261.15 L65.65 -261.05 65.2 -260.75 64.3 -260.1 62.7 -259.05 61.05 -258.0 61.0 -258.05 60.8 -260.75 60.8 -261.9 60.8 -266.45 Q60.85 -270.45 61.35 -274.45 L62.0 -279.4 Q62.85 -284.3 64.65 -292.45 L65.0 -292.45 66.4 -290.05 Q67.05 -288.9 67.85 -288.45 M21.8 -267.95 Q30.85 -269.9 39.8 -274.4 L40.7 -274.75 54.55 -279.3 Q49.75 -275.55 42.9 -271.55 37.95 -268.65 33.2 -266.45 30.1 -265.0 27.05 -263.9 L24.4 -266.45 21.8 -267.95" fill="#2895cc" fill-rule="evenodd" stroke="none"/>
    <path d="M62.7 -259.05 L62.85 -258.0 63.5 -250.55 60.85 -249.55 54.35 -247.7 Q43.45 -245.05 34.2 -244.55 L33.9 -248.65 Q43.75 -249.3 55.0 -254.8 58.25 -256.35 61.0 -258.0 L61.05 -258.0 62.7 -259.05 M-10.0 -186.15 L-10.15 -195.85 -10.1 -197.85 Q-6.95 -196.95 -4.05 -196.95 6.7 -196.95 12.75 -208.0 15.15 -212.4 15.75 -216.9 16.3 -221.45 14.75 -223.85 18.95 -225.0 22.15 -226.35 L22.85 -223.8 23.9 -218.45 Q25.2 -220.05 26.0 -224.0 L26.65 -228.5 28.35 -229.6 30.8 -229.0 Q33.95 -228.3 35.8 -227.25 L36.5 -227.25 Q36.9 -229.0 32.55 -234.25 L32.6 -234.3 Q33.95 -237.25 34.15 -241.9 L36.65 -237.4 Q39.35 -232.05 39.45 -228.8 39.6 -222.05 36.85 -216.8 33.8 -211.15 27.85 -208.35 28.45 -206.85 27.55 -202.9 26.45 -198.25 23.9 -194.85 20.1 -189.85 14.3 -186.95 L14.0 -186.8 13.05 -186.4 13.65 -187.4 17.7 -194.5 Q16.1 -193.4 11.6 -191.3 10.0 -194.5 9.3 -196.55 L8.4 -189.9 1.8 -187.1 -0.55 -186.1 -0.25 -185.9 -0.15 -185.75 1.85 -185.1 4.25 -184.2 1.9 -184.05 1.4 -184.05 Q-5.35 -184.05 -10.0 -186.15" fill="#1e7099" fill-rule="evenodd" stroke="none"/>
    <path d="M60.6 -234.3 L60.3 -229.65 57.75 -229.6 Q58.4 -230.9 60.6 -234.3 M60.9 -241.65 L60.8 -237.75 58.5 -243.55 Q59.25 -242.65 60.9 -241.65 M48.8 -202.1 Q55.05 -205.5 56.3 -206.0 L51.2 -199.05 54.95 -193.8 55.0 -193.15 47.9 -194.45 43.65 -188.05 44.15 -195.1 39.05 -196.2 38.7 -196.55 Q39.35 -197.05 44.5 -199.8 44.85 -205.85 44.5 -207.35 L48.8 -202.1 M48.7 -162.6 L57.8 -164.15 58.0 -163.95 51.6 -158.85 52.15 -158.0 60.0 -147.55 59.9 -147.3 44.8 -153.55 44.4 -153.7 Q39.65 -150.6 35.7 -148.7 L38.4 -156.05 Q31.65 -158.6 29.65 -159.05 L28.95 -159.4 40.25 -161.15 43.15 -169.2 Q44.4 -168.3 48.7 -162.6 M13.05 -186.4 L14.0 -186.8 15.05 -184.95 20.0 -176.65 10.4 -181.35 10.3 -181.4 Q8.25 -177.75 6.6 -175.6 6.65 -177.2 7.4 -182.75 L4.25 -184.2 7.7 -184.65 Q10.45 -185.3 13.05 -186.4 M0.5 -163.8 L0.7 -163.7 0.65 -163.65 0.5 -163.8" fill="#b524b8" fill-rule="evenodd" stroke="none"/>
    <path d="M64.6 -239.6 L65.5 -230.8 64.95 -227.45 Q64.2 -229.05 63.8 -230.25 L63.25 -230.15 60.3 -229.65 60.6 -234.3 61.55 -235.7 60.8 -237.75 60.9 -241.65 62.25 -240.85 64.6 -239.6 M79.0 -168.75 L79.1 -168.6 80.5 -165.7 Q76.4 -166.75 75.6 -167.5 L79.0 -168.75 M0.5 -163.8 L0.65 -163.65 -2.8 -160.75 -2.9 -162.6 0.5 -163.8" fill="#d52bd9" fill-rule="evenodd" stroke="none"/>
    <path d="M-62.5 -227.25 Q-63.45 -231.05 -63.9 -235.3 -64.45 -239.7 -64.3 -243.65 L-63.9 -243.15 Q-63.1 -242.2 -61.5 -241.9 L-60.0 -241.8 Q-53.4 -241.8 -46.45 -245.75 -43.65 -247.35 -40.8 -249.55 -35.6 -253.65 -32.95 -258.0 L-31.55 -260.75 Q-30.35 -263.5 -30.2 -266.45 L-30.2 -268.0 Q-30.25 -270.55 -31.25 -272.6 -28.45 -272.2 -26.3 -271.2 -23.1 -269.65 -22.45 -269.55 L-22.4 -269.55 -22.4 -269.75 -22.3 -269.65 -16.8 -266.45 -14.25 -265.1 -15.15 -266.45 -18.8 -270.75 Q-21.15 -273.8 -21.55 -276.8 L-21.05 -277.15 Q-18.1 -278.6 -13.45 -278.6 L-8.35 -277.95 -5.45 -277.1 -5.15 -277.5 -4.25 -276.9 -3.7 -276.55 -3.45 -276.4 -2.25 -274.75 Q-0.95 -272.5 -0.9 -271.05 -0.8 -267.75 -3.7 -266.45 -5.85 -265.5 -11.2 -265.1 -8.7 -263.75 -4.25 -262.75 L-3.9 -262.65 0.15 -261.9 Q3.75 -264.5 8.4 -266.45 L8.5 -266.55 9.85 -267.05 Q14.6 -268.8 17.95 -268.8 19.85 -268.8 21.8 -267.95 L24.4 -266.45 27.05 -263.9 28.2 -262.55 29.55 -260.75 31.2 -258.0 Q32.6 -255.35 33.3 -252.6 L29.75 -248.6 25.45 -244.15 Q21.25 -240.45 14.15 -240.45 9.45 -240.45 7.3 -241.45 4.85 -242.5 2.8 -245.4 L2.9 -244.7 Q3.0 -241.8 1.3 -237.25 -0.45 -232.35 -3.4 -227.95 -10.85 -216.85 -20.1 -216.85 -27.05 -216.85 -31.15 -220.95 -33.6 -223.4 -34.2 -226.0 -36.4 -224.35 -40.85 -222.65 -43.65 -221.6 -45.7 -221.05 L-49.15 -220.55 Q-55.8 -220.55 -61.0 -225.65 L-62.5 -227.25 M13.15 -262.25 Q13.15 -263.5 12.1 -263.75 L10.25 -263.75 7.7 -263.3 5.05 -262.35 4.65 -262.25 2.75 -260.75 Q1.8 -259.7 1.85 -258.7 1.85 -258.3 2.1 -258.0 2.25 -257.8 2.5 -257.65 3.05 -257.35 3.4 -257.35 5.45 -257.35 7.35 -258.0 8.85 -258.5 10.25 -259.35 L12.2 -260.75 Q13.2 -261.6 13.15 -262.25 M-23.2 -251.9 L-26.0 -245.3 Q-24.25 -247.6 -20.8 -249.9 -14.75 -254.0 -9.5 -253.65 L-14.45 -258.0 -14.6 -258.1 Q-16.1 -259.5 -17.0 -260.75 -18.4 -262.6 -18.6 -264.1 L-18.95 -264.1 Q-19.25 -262.55 -19.85 -260.75 L-20.7 -258.0 -23.2 -251.9 M-19.85 -248.55 Q-27.85 -244.3 -27.7 -238.95 -27.65 -237.25 -25.9 -235.75 -23.9 -234.05 -21.1 -234.05 -14.05 -234.05 -8.1 -239.1 -2.85 -243.5 -1.5 -248.0 -0.25 -252.5 -3.65 -252.6 L-9.85 -252.25 -9.8 -251.95 -11.8 -251.75 -12.15 -251.65 Q-15.3 -251.0 -19.85 -248.55" fill="#eafbfa" fill-rule="evenodd" stroke="none"/>
    <path d="M-64.3 -243.65 Q-63.95 -249.85 -61.85 -254.9 -60.5 -258.05 -58.6 -260.75 L-55.65 -264.1 -51.2 -267.75 Q-43.8 -272.75 -34.25 -272.75 L-31.25 -272.6 Q-30.25 -270.55 -30.2 -268.0 L-30.2 -266.45 Q-30.35 -263.5 -31.55 -260.75 L-32.95 -258.0 Q-35.6 -253.65 -40.8 -249.55 -43.65 -247.35 -46.45 -245.75 -53.4 -241.8 -60.0 -241.8 L-61.5 -241.9 Q-63.1 -242.2 -63.9 -243.15 L-64.3 -243.65 M-21.65 -278.65 Q-20.25 -281.5 -16.75 -281.5 -12.0 -281.5 -5.85 -277.9 L-5.15 -277.5 -5.45 -277.1 -8.35 -277.95 -13.45 -278.6 Q-18.1 -278.6 -21.05 -277.15 L-21.55 -276.8 -21.7 -277.9 -21.65 -278.65 M13.15 -262.25 Q13.2 -261.6 12.2 -260.75 L10.25 -259.35 Q8.85 -258.5 7.35 -258.0 5.45 -257.35 3.4 -257.35 3.05 -257.35 2.5 -257.65 2.25 -257.8 2.1 -258.0 1.85 -258.3 1.85 -258.7 1.8 -259.7 2.75 -260.75 L4.65 -262.25 5.05 -262.35 7.7 -263.3 10.25 -263.75 12.1 -263.75 Q13.15 -263.5 13.15 -262.25 M-19.85 -248.55 Q-15.3 -251.0 -12.15 -251.65 L-11.8 -251.75 -9.8 -251.95 -9.85 -252.25 -3.65 -252.6 Q-0.25 -252.5 -1.5 -248.0 -2.85 -243.5 -8.1 -239.1 -14.05 -234.05 -21.1 -234.05 -23.9 -234.05 -25.9 -235.75 -27.65 -237.25 -27.7 -238.95 -27.85 -244.3 -19.85 -248.55" fill="#ffffff" fill-rule="evenodd" stroke="none"/>
    <path d="M-17.1 -200.6 L-20.1 -202.45 -20.45 -202.65 Q-22.25 -205.1 -26.1 -209.15 L-32.05 -215.15 -32.0 -213.6 Q-31.9 -210.45 -32.55 -209.05 -33.9 -206.35 -38.25 -206.35 -41.15 -206.35 -43.45 -207.1 L-45.35 -207.75 -49.1 -209.05 Q-51.75 -209.85 -54.65 -212.25 L-57.85 -215.35 -58.8 -217.0 -60.9 -221.85 -62.5 -227.25 -61.0 -225.65 Q-55.8 -220.55 -49.15 -220.55 L-45.7 -221.05 Q-43.65 -221.6 -40.85 -222.65 -36.4 -224.35 -34.2 -226.0 -33.6 -223.4 -31.15 -220.95 -27.05 -216.85 -20.1 -216.85 -10.85 -216.85 -3.4 -227.95 -0.45 -232.35 1.3 -237.25 3.0 -241.8 2.9 -244.7 L2.8 -245.4 Q4.85 -242.5 7.3 -241.45 9.45 -240.45 14.15 -240.45 21.25 -240.45 25.45 -244.15 L29.75 -248.6 33.3 -252.6 33.75 -249.9 33.9 -248.65 34.2 -244.55 34.15 -241.9 Q33.95 -237.25 32.6 -234.3 L32.55 -234.3 Q27.75 -230.2 21.4 -229.05 L16.15 -228.65 11.9 -229.0 8.7 -229.65 8.75 -229.0 9.9 -226.15 Q10.55 -224.05 10.6 -222.55 10.8 -215.0 3.55 -208.4 -4.4 -201.1 -17.1 -200.6 M-22.4 -269.75 Q-22.95 -273.7 -22.45 -276.3 L-21.65 -278.65 -21.7 -277.9 -21.55 -276.8 Q-21.15 -273.8 -18.8 -270.75 L-15.15 -266.45 -14.25 -265.1 -16.8 -266.45 -22.3 -269.65 -22.4 -269.75 M-3.45 -276.4 Q0.6 -273.7 2.15 -271.85 L2.65 -271.1 3.55 -269.6 3.8 -269.2 0.65 -266.45 -0.5 -265.5 -4.25 -262.75 Q-8.7 -263.75 -11.2 -265.1 -5.85 -265.5 -3.7 -266.45 -0.8 -267.75 -0.9 -271.05 -0.95 -272.5 -2.25 -274.75 L-3.45 -276.4 M-23.2 -251.9 L-20.7 -258.0 -19.85 -260.75 Q-19.25 -262.55 -18.95 -264.1 L-18.6 -264.1 Q-18.4 -262.6 -17.0 -260.75 -16.1 -259.5 -14.6 -258.1 L-14.45 -258.0 -9.5 -253.65 Q-14.75 -254.0 -20.8 -249.9 -24.25 -247.6 -26.0 -245.3 L-23.2 -251.9" fill="#cededd" fill-rule="evenodd" stroke="none"/>
    <path d="M32.55 -234.25 Q36.9 -229.0 36.5 -227.25 L35.8 -227.25 Q33.95 -228.3 30.8 -229.0 L28.35 -229.6 Q30.55 -231.15 31.75 -232.85 L32.55 -234.25 M26.65 -228.5 L26.0 -224.0 Q25.2 -220.05 23.9 -218.45 L22.85 -223.8 22.15 -226.35 26.65 -228.5 M4.25 -184.2 L1.85 -185.1 -0.15 -185.75 -0.25 -185.9 -0.55 -186.1 1.8 -187.1 8.4 -189.9 9.3 -196.55 Q10.0 -194.5 11.6 -191.3 16.1 -193.4 17.7 -194.5 L13.65 -187.4 13.05 -186.4 Q10.45 -185.3 7.7 -184.65 L4.25 -184.2" fill="#871b8a" fill-rule="evenodd" stroke="none"/>
    <path d="M-10.1 -197.85 Q-13.0 -198.65 -16.15 -200.2 L-17.1 -200.6 Q-4.4 -201.1 3.55 -208.4 10.8 -215.0 10.6 -222.55 10.55 -224.05 9.9 -226.15 L8.75 -229.0 8.7 -229.65 11.9 -229.0 16.15 -228.65 21.4 -229.05 Q27.75 -230.2 32.55 -234.3 L32.6 -234.3 32.55 -234.25 31.75 -232.85 Q30.55 -231.15 28.35 -229.6 L26.65 -228.5 22.15 -226.35 Q18.95 -225.0 14.75 -223.85 16.3 -221.45 15.75 -216.9 15.15 -212.4 12.75 -208.0 6.7 -196.95 -4.05 -196.95 -6.95 -196.95 -10.1 -197.85 M-20.45 -202.65 Q-23.2 -204.6 -24.15 -206.5 -26.1 -202.8 -27.4 -201.8 -29.6 -200.15 -34.55 -200.15 -39.85 -200.15 -45.25 -202.95 -46.85 -203.8 -48.4 -204.9 -54.15 -208.85 -57.85 -215.35 L-54.65 -212.25 Q-51.75 -209.85 -49.1 -209.05 L-45.35 -207.75 -43.45 -207.1 Q-41.15 -206.35 -38.25 -206.35 -33.9 -206.35 -32.55 -209.05 -31.9 -210.45 -32.0 -213.6 L-32.05 -215.15 -26.1 -209.15 Q-22.25 -205.1 -20.45 -202.65 M3.8 -269.2 L5.7 -266.55 8.35 -266.55 8.4 -266.45 Q3.75 -264.5 0.15 -261.9 L-3.9 -262.65 -4.25 -262.75 -0.5 -265.5 0.65 -266.45 3.8 -269.2" fill="#b8c7c6" fill-rule="evenodd" stroke="none"/>
    <path d="M65.5 -230.8 L65.5 -230.75 66.2 -224.45 65.45 -226.15 64.95 -227.45 65.5 -230.8 M84.8 -170.8 Q86.6 -167.3 88.65 -163.85 L85.75 -164.5 80.5 -165.7 79.1 -168.6 79.0 -168.75 84.8 -170.8 M-7.75 -156.6 L-8.15 -160.55 -7.9 -160.65 Q-4.85 -161.85 -2.9 -162.6 L-2.8 -160.75 -7.75 -156.6" fill="#f131f5" fill-rule="evenodd" stroke="none"/>
    <path d="M93.5 -145.35 L83.55 -145.35 Q78.2 -151.4 73.7 -158.8 69.45 -165.7 65.75 -174.15 L62.9 -180.8 65.9 -177.1 Q69.15 -173.4 70.3 -173.05 65.75 -178.7 62.75 -190.35 60.0 -200.85 59.65 -210.9 59.45 -219.35 60.3 -229.65 L63.25 -230.15 63.8 -230.25 Q64.2 -229.05 64.95 -227.45 L64.8 -226.3 Q64.6 -224.45 64.8 -217.65 65.0 -210.65 66.6 -203.25 L70.25 -188.95 Q71.3 -184.9 73.4 -180.3 L79.0 -168.75 75.6 -167.5 Q76.4 -166.75 80.5 -165.7 85.25 -156.2 89.3 -150.6 L93.5 -145.35 M6.85 -145.35 L-1.7 -145.35 -2.7 -158.25 -2.8 -160.75 0.65 -163.65 0.7 -163.7 0.5 -163.8 -2.9 -162.6 -3.55 -178.05 -3.25 -179.15 -4.45 -179.15 -9.65 -179.45 -10.0 -186.15 Q-5.35 -184.05 1.4 -184.05 L1.9 -184.05 1.9 -183.65 Q2.05 -182.55 1.65 -180.3 1.25 -177.6 1.3 -175.45 1.4 -171.05 3.15 -162.7 L6.85 -145.35" fill="#2ca2de" fill-rule="evenodd" stroke="none"/>
    <path d="M66.2 -224.45 L66.25 -223.85 Q68.15 -207.45 74.55 -192.25 79.15 -181.25 84.8 -170.8 L79.0 -168.75 73.4 -180.3 Q71.3 -184.9 70.25 -188.95 L66.6 -203.25 Q65.0 -210.65 64.8 -217.65 64.6 -224.45 64.8 -226.3 L64.95 -227.45 65.45 -226.15 66.2 -224.45 M88.65 -163.85 L90.55 -160.65 Q95.3 -152.7 100.75 -145.35 L93.5 -145.35 89.3 -150.6 Q85.25 -156.2 80.5 -165.7 L85.75 -164.5 88.65 -163.85 M-1.7 -145.35 L-6.45 -145.35 -7.75 -156.6 -2.8 -160.75 -2.7 -158.25 -1.7 -145.35 M-8.15 -160.55 Q-9.2 -170.85 -9.65 -179.45 L-4.45 -179.15 -3.25 -179.15 -3.55 -178.05 -2.9 -162.6 Q-4.85 -161.85 -7.9 -160.65 L-8.15 -160.55" fill="#33b2ff" fill-rule="evenodd" stroke="none"/>
    <path d="M49.15 -409.55 L49.85 -410.9 50.55 -411.65 53.9 -413.3 56.9 -414.35 Q61.1 -415.7 65.7 -415.9 73.25 -416.25 81.45 -414.15 88.65 -412.3 89.85 -410.55 L88.05 -410.5 82.1 -409.55 82.2 -409.95 81.05 -410.55 Q77.5 -412.05 74.05 -412.75 L73.95 -412.8 64.35 -413.25 63.4 -413.2 60.4 -412.95 59.25 -412.85 53.2 -411.15 49.15 -409.55 M136.65 -380.15 L139.45 -374.95 141.4 -371.4 Q144.2 -362.0 146.25 -350.45 L146.3 -350.1 146.6 -348.1 147.15 -344.6 147.6 -341.9 Q143.05 -336.65 132.45 -331.2 120.0 -325.4 117.95 -324.2 L117.65 -324.2 Q118.2 -324.45 121.85 -327.55 L126.45 -331.4 122.75 -329.05 Q120.3 -327.45 119.15 -326.9 L118.85 -326.85 120.2 -328.05 Q120.8 -328.65 121.0 -329.3 119.5 -328.95 115.45 -326.15 L111.3 -323.05 110.8 -322.4 110.8 -322.7 111.3 -323.05 113.45 -326.0 Q116.25 -330.0 118.0 -333.85 120.3 -338.6 122.2 -343.4 L122.65 -344.55 123.6 -346.95 124.4 -349.25 123.1 -346.95 120.35 -343.3 114.6 -336.8 Q114.45 -339.2 113.35 -342.95 L112.2 -346.45 111.45 -348.65 Q108.75 -355.8 107.5 -357.85 107.2 -357.25 107.4 -355.45 L108.6 -346.25 108.75 -345.4 108.25 -346.25 107.0 -348.2 Q105.7 -350.05 104.0 -351.6 103.65 -351.85 103.4 -352.15 L102.4 -352.95 99.75 -354.6 Q94.75 -357.35 88.6 -357.05 84.05 -356.8 79.9 -353.0 L78.95 -352.05 78.7 -351.8 77.85 -350.85 Q73.3 -348.85 69.45 -345.55 L68.45 -344.7 68.0 -344.25 65.75 -342.05 66.25 -343.0 66.75 -344.25 66.9 -344.6 67.6 -346.3 67.7 -346.65 72.6 -354.1 72.75 -354.35 72.9 -354.55 73.2 -354.85 77.4 -358.25 78.15 -358.8 78.2 -358.85 80.55 -360.4 Q85.8 -363.8 92.5 -366.95 L88.6 -366.75 82.7 -365.5 80.05 -364.75 79.65 -364.65 77.75 -364.05 76.35 -363.65 76.1 -363.8 76.1 -363.9 Q78.95 -366.25 84.25 -367.85 L94.7 -370.7 Q100.1 -372.35 103.55 -374.5 106.35 -376.1 108.5 -378.35 103.8 -375.5 96.4 -373.4 L87.3 -371.1 91.15 -372.2 88.15 -372.95 88.45 -373.25 92.35 -374.65 92.95 -374.9 93.0 -374.95 94.15 -375.4 92.95 -375.05 92.85 -375.05 92.25 -374.95 82.8 -373.6 81.1 -373.7 92.55 -377.1 Q100.35 -379.65 103.25 -381.75 L103.35 -381.7 101.1 -379.8 Q98.3 -377.25 96.75 -376.4 101.25 -377.2 109.35 -381.15 117.25 -384.95 119.65 -387.45 L115.95 -380.5 Q112.5 -374.3 110.8 -372.25 L110.8 -371.7 117.5 -376.8 Q121.7 -380.2 123.25 -383.0 126.0 -380.2 128.65 -375.55 131.15 -371.1 132.5 -366.95 L133.05 -366.95 133.1 -369.5 133.2 -371.75 Q133.0 -374.6 131.65 -378.0 L128.35 -385.4 128.3 -385.9 Q131.85 -384.45 136.65 -380.15 M100.2 -310.85 Q107.1 -309.45 109.95 -310.4 108.6 -309.1 106.45 -307.9 L99.5 -307.8 Q94.2 -307.95 91.6 -309.35 L91.7 -309.5 99.15 -310.8 100.2 -310.95 100.2 -310.85 M92.7 -303.85 Q95.35 -301.3 100.2 -299.0 102.45 -297.9 104.65 -297.25 L108.2 -296.55 106.75 -295.6 Q98.5 -295.8 94.7 -297.05 92.8 -297.7 88.75 -299.8 84.3 -302.05 80.2 -303.6 L80.25 -303.7 Q80.95 -304.15 82.9 -304.5 L85.4 -304.85 90.5 -304.25 92.7 -303.85 M78.35 -298.05 Q78.25 -297.2 78.3 -296.1 L78.3 -296.05 Q78.2 -292.75 78.65 -289.9 79.6 -284.35 81.95 -279.8 78.45 -282.05 75.55 -285.3 75.05 -291.5 75.8 -295.85 76.3 -299.15 77.3 -300.45 77.3 -300.25 77.45 -300.2 L77.6 -300.15 78.35 -298.05 M78.2 -398.45 L75.1 -399.0 70.25 -400.05 70.15 -400.05 70.1 -400.1 75.0 -399.75 80.55 -399.3 96.45 -398.85 100.75 -399.35 100.5 -399.0 98.25 -397.45 94.8 -395.75 90.4 -396.4 90.35 -396.4 88.1 -396.75 86.2 -397.05 81.9 -397.75 81.85 -397.75 80.3 -398.05 78.2 -398.45 M67.6 -404.75 L63.5 -404.85 68.7 -406.4 74.45 -407.05 75.2 -407.1 Q79.1 -407.25 84.4 -406.1 89.35 -405.05 92.35 -403.5 L90.2 -403.4 85.1 -402.95 77.6 -404.2 74.65 -404.45 68.15 -404.75 67.6 -404.75 M74.95 -372.75 L76.9 -375.6 Q79.35 -378.7 83.15 -382.1 87.35 -385.75 92.1 -388.75 L90.0 -386.65 87.9 -384.7 Q88.75 -385.05 92.2 -386.75 L96.05 -388.85 92.05 -385.6 Q88.5 -382.75 85.8 -380.0 L82.1 -377.4 80.05 -375.85 77.05 -373.6 76.3 -373.0 74.75 -371.6 74.8 -372.0 74.95 -372.75 M108.5 -405.9 L111.35 -405.25 110.1 -409.25 112.3 -406.4 114.1 -404.1 114.3 -404.1 115.1 -404.2 Q117.2 -404.3 118.05 -403.65 120.3 -402.1 123.15 -400.8 L122.75 -400.8 118.2 -401.1 119.15 -399.95 119.4 -399.55 120.3 -397.95 117.75 -399.85 116.65 -400.85 Q115.75 -401.5 112.7 -401.4 L110.1 -401.15 Q110.85 -401.85 113.25 -402.7 L102.75 -406.0 104.35 -406.2 108.5 -405.9 M109.25 -374.7 L104.75 -371.85 Q100.2 -369.1 98.45 -368.5 95.5 -367.6 90.85 -364.25 L86.05 -360.5 86.1 -360.4 93.9 -364.25 Q98.95 -366.65 100.35 -367.8 100.6 -368.05 102.8 -369.1 L105.95 -371.2 108.2 -373.55 109.25 -374.7 M87.9 -384.7 L87.7 -384.6 87.8 -384.6 87.9 -384.7 M96.75 -376.4 L96.05 -376.35 96.55 -376.35 96.75 -376.4 M64.1 -339.85 L64.35 -340.1 64.55 -339.85 64.2 -339.7 64.1 -339.85" fill="#d4ad32" fill-rule="evenodd" stroke="none"/>
    <path d="M0.1 -302.5 L0.15 -303.85 Q0.05 -304.3 0.1 -304.7 2.05 -304.05 5.45 -303.7 L6.35 -303.65 14.5 -303.3 14.5 -303.65 14.65 -303.7 14.6 -303.3 18.5 -303.4 18.65 -303.4 Q21.1 -303.55 25.25 -304.45 L27.05 -304.1 39.2 -305.05 Q39.4 -304.45 39.75 -303.8 L40.15 -302.9 39.25 -302.15 36.25 -299.45 36.3 -299.25 Q38.95 -299.9 41.1 -300.8 42.15 -298.05 42.35 -295.65 L42.45 -294.25 Q42.5 -290.8 41.7 -287.5 40.85 -284.0 39.0 -280.7 L38.0 -279.0 32.95 -275.25 30.1 -273.5 Q23.65 -269.95 15.7 -269.55 10.75 -269.3 6.95 -270.95 7.2 -279.9 8.05 -284.3 L8.35 -285.85 8.85 -288.55 Q9.1 -290.05 9.0 -292.7 L8.85 -294.85 Q8.7 -296.8 6.0 -298.75 L5.6 -299.0 0.1 -302.5 M-15.05 -347.3 L-13.7 -346.9 Q-10.85 -346.0 -5.9 -343.35 L-4.15 -342.4 -2.1 -341.3 Q5.05 -337.35 5.25 -337.35 6.2 -337.4 6.75 -337.8 7.35 -338.25 7.3 -338.9 7.2 -340.0 6.2 -341.7 L5.1 -343.4 3.55 -345.7 3.2 -346.4 Q2.1 -347.3 -0.05 -347.7 -2.3 -348.15 -2.4 -349.9 L-2.2 -351.1 Q-1.3 -353.85 3.9 -358.45 L9.2 -364.75 10.0 -365.7 Q16.0 -372.6 21.15 -377.75 L29.25 -385.9 35.25 -392.35 Q38.85 -394.55 43.05 -395.95 L46.0 -396.9 47.0 -399.55 Q48.5 -403.15 50.4 -405.55 L50.15 -403.45 Q49.75 -400.2 50.15 -398.05 51.15 -392.0 56.3 -387.0 L58.8 -384.9 61.3 -382.8 Q65.7 -387.5 73.7 -391.2 L73.7 -391.25 75.6 -392.0 77.75 -392.85 75.5 -393.3 73.0 -393.85 68.35 -394.7 68.35 -395.1 72.0 -396.3 74.8 -397.25 75.2 -397.4 76.55 -397.85 78.2 -398.45 80.3 -398.05 81.85 -397.75 81.9 -397.75 81.9 -397.7 81.85 -397.7 Q82.5 -396.7 86.2 -396.45 88.2 -396.3 90.35 -396.4 L90.4 -396.4 90.35 -396.2 Q89.6 -396.15 87.35 -394.85 85.05 -393.4 84.25 -392.2 L82.0 -389.45 80.85 -388.45 Q80.55 -388.05 80.2 -385.85 L79.75 -383.4 Q77.85 -380.85 76.7 -378.1 75.8 -376.1 75.25 -374.0 L73.7 -372.7 Q70.85 -370.35 69.9 -370.3 L67.85 -371.85 67.25 -372.3 67.3 -371.5 Q67.4 -369.9 67.1 -368.8 L66.35 -370.2 64.6 -372.45 63.25 -373.65 61.95 -374.55 57.75 -377.9 57.6 -378.0 57.0 -378.1 Q55.45 -378.5 53.9 -379.4 L51.8 -380.85 51.1 -381.45 50.05 -382.5 Q48.1 -384.45 46.9 -386.3 L45.95 -388.1 Q45.5 -388.95 45.35 -389.7 L45.2 -390.4 45.05 -391.3 45.05 -392.0 45.1 -393.0 45.55 -395.45 Q43.9 -394.65 42.3 -393.65 38.8 -391.65 38.9 -391.15 L39.55 -388.6 Q40.3 -386.05 40.85 -385.75 L42.95 -385.5 43.65 -385.4 Q45.1 -383.5 47.6 -381.65 48.75 -380.75 53.75 -377.65 L57.25 -375.2 Q60.4 -372.65 61.45 -370.0 L59.05 -369.6 58.9 -369.6 58.65 -369.5 58.75 -369.6 58.6 -369.7 58.6 -369.6 57.65 -369.65 47.5 -370.1 41.1 -369.5 41.8 -370.2 43.8 -371.9 47.9 -374.4 46.65 -375.15 42.0 -376.9 38.4 -377.65 38.1 -377.45 37.45 -376.8 Q38.05 -377.7 38.85 -380.6 L38.85 -381.0 Q37.1 -378.35 31.05 -372.3 25.95 -367.25 26.0 -366.45 28.9 -360.95 30.05 -358.1 L28.95 -357.5 28.15 -357.0 28.6 -357.0 28.95 -357.05 29.6 -357.05 32.6 -356.75 35.4 -356.6 36.85 -356.55 37.45 -356.6 43.15 -357.3 45.8 -358.2 51.7 -359.4 52.45 -359.55 52.65 -359.6 53.15 -359.7 53.25 -359.75 53.2 -359.6 53.25 -359.65 55.55 -359.65 57.0 -359.75 54.75 -357.4 54.45 -357.05 52.4 -355.15 53.7 -355.2 55.45 -355.65 Q57.1 -356.1 58.65 -356.7 L60.2 -357.35 60.55 -357.35 Q63.3 -357.5 66.35 -355.9 69.5 -354.2 69.65 -352.3 69.8 -350.15 64.05 -344.7 L59.85 -341.0 56.55 -338.15 55.7 -337.5 46.8 -330.1 Q44.15 -327.55 42.95 -324.9 40.0 -321.8 38.6 -318.65 36.1 -319.25 33.2 -320.6 27.3 -323.4 25.15 -327.55 26.0 -330.2 22.95 -333.65 L22.0 -334.6 20.4 -335.8 20.35 -335.85 19.4 -336.35 18.35 -338.05 15.8 -342.15 14.35 -344.6 14.3 -344.7 14.4 -344.6 15.35 -343.8 17.1 -342.25 17.5 -341.85 19.6 -339.95 22.6 -337.15 23.85 -335.95 24.35 -335.5 25.6 -335.3 31.0 -335.25 Q35.35 -335.5 40.95 -336.8 44.85 -337.8 49.4 -339.25 53.85 -340.7 56.95 -342.3 L59.65 -343.85 60.25 -344.3 Q64.25 -347.3 64.0 -350.75 L63.5 -352.75 Q62.85 -354.45 61.65 -354.35 61.0 -354.35 58.9 -353.45 L54.6 -351.6 Q48.65 -349.0 45.6 -348.8 42.45 -348.7 38.65 -350.0 36.45 -350.75 35.05 -351.8 L34.05 -353.3 33.75 -353.2 30.25 -351.45 25.05 -348.85 24.95 -349.2 28.5 -354.4 28.85 -354.85 25.55 -357.15 24.15 -358.2 22.35 -359.35 20.0 -357.45 17.45 -355.15 18.55 -357.6 19.25 -359.05 17.75 -357.8 16.35 -356.4 14.5 -354.65 12.8 -352.95 9.05 -349.1 6.8 -346.55 9.45 -343.45 9.75 -343.1 10.75 -341.95 11.05 -341.55 11.25 -341.3 11.6 -340.85 13.1 -339.25 13.8 -338.2 15.2 -335.55 15.7 -334.1 Q15.75 -332.7 14.65 -331.85 13.5 -331.0 11.35 -330.9 8.85 -330.8 5.45 -333.25 L3.3 -335.0 -1.0 -338.65 -4.2 -341.2 -5.75 -342.25 -6.5 -342.7 Q-8.5 -343.95 -10.45 -344.7 L-10.5 -344.8 Q-13.2 -345.85 -15.7 -346.1 L-15.05 -347.3 M78.3 -401.25 L74.85 -401.5 74.5 -401.5 69.25 -401.85 61.9 -402.3 64.35 -403.15 67.7 -404.5 68.15 -404.75 74.65 -404.45 77.6 -404.2 85.1 -402.95 87.0 -402.4 78.45 -401.3 78.3 -401.25 M71.65 -408.3 L65.45 -409.15 61.5 -409.6 Q56.6 -409.95 52.95 -409.8 L49.4 -409.25 49.25 -409.15 49.15 -409.55 53.2 -411.15 59.25 -412.85 60.4 -412.95 63.4 -413.2 Q67.6 -412.6 72.7 -410.95 L74.15 -410.5 74.95 -410.25 77.9 -409.15 74.3 -408.65 72.1 -408.25 71.65 -408.3 M81.65 -362.8 L81.85 -362.8 81.85 -362.7 81.65 -362.8 M80.7 -322.4 L79.5 -321.6 Q77.9 -320.75 76.0 -320.65 73.0 -320.5 69.2 -321.5 66.95 -322.1 65.9 -322.8 65.15 -323.35 65.1 -323.9 65.05 -324.5 65.7 -325.6 L65.75 -325.65 Q66.65 -327.3 67.9 -327.85 L68.7 -328.1 70.5 -328.35 71.7 -328.3 72.25 -328.15 72.95 -327.95 Q76.2 -326.95 80.05 -323.0 L80.7 -322.4 M66.05 -326.8 L65.8 -326.6 65.7 -326.65 66.05 -326.8 M65.6 -340.05 L64.3 -339.5 64.25 -339.5 64.1 -339.4 64.0 -339.35 63.25 -339.0 62.8 -338.75 62.75 -338.75 62.7 -338.85 62.75 -338.9 63.2 -339.15 63.25 -339.2 64.2 -339.7 64.55 -339.85 65.95 -340.65 66.1 -340.75 66.05 -340.65 65.6 -340.05 M75.05 -346.5 L75.25 -346.3 74.85 -346.05 74.7 -345.65 74.45 -345.75 74.85 -346.05 75.05 -346.5 M9.9 -315.05 L15.25 -317.0 20.25 -318.75 Q21.1 -318.8 24.0 -316.25 L25.1 -315.35 27.05 -313.7 29.05 -311.4 22.8 -308.3 17.15 -305.65 16.3 -305.6 15.95 -305.55 15.55 -305.55 14.7 -305.55 14.6 -305.55 13.95 -305.5 13.4 -307.1 13.25 -307.55 Q11.55 -312.4 9.9 -315.05 M38.25 -307.55 L38.2 -307.55 38.15 -307.5 38.05 -307.5 38.05 -307.6 38.1 -307.6 38.25 -307.55 M14.7 -300.6 L14.7 -300.65 14.55 -300.65 14.7 -300.6 M14.35 -300.35 L14.4 -300.25 14.5 -300.25 14.35 -300.35 M28.3 -309.4 Q28.15 -309.25 27.8 -309.25 L27.8 -309.4 28.3 -309.4 M73.2 -335.95 L73.2 -335.9 73.1 -335.85 73.2 -335.95 M31.15 -277.25 L31.35 -277.1 31.55 -277.3 31.15 -277.25" fill="#eccfa4" fill-rule="evenodd" stroke="none"/>
    <path d="M50.55 -411.65 L52.0 -412.7 54.45 -414.25 59.25 -417.7 Q64.2 -420.45 72.5 -420.85 82.65 -421.35 93.9 -418.05 101.95 -415.65 105.95 -412.9 L110.3 -411.95 110.85 -411.75 Q117.15 -409.65 122.65 -404.55 L126.85 -400.3 Q134.2 -391.6 139.3 -377.6 L138.7 -378.2 136.65 -380.15 Q131.85 -384.45 128.3 -385.9 L128.35 -385.4 131.65 -378.0 Q133.0 -374.6 133.2 -371.75 L133.1 -369.5 133.05 -366.95 132.5 -366.95 Q131.15 -371.1 128.65 -375.55 126.0 -380.2 123.25 -383.0 121.7 -380.2 117.5 -376.8 L110.8 -371.7 110.8 -372.25 Q112.5 -374.3 115.95 -380.5 L119.65 -387.45 Q117.25 -384.95 109.35 -381.15 101.25 -377.2 96.75 -376.4 98.3 -377.25 101.1 -379.8 L103.35 -381.7 103.25 -381.75 Q100.35 -379.65 92.55 -377.1 L81.1 -373.7 79.75 -373.8 83.4 -377.35 89.1 -382.35 85.8 -380.0 Q88.5 -382.75 92.05 -385.6 L96.05 -388.85 92.2 -386.75 Q88.75 -385.05 87.9 -384.7 L90.0 -386.65 92.1 -388.75 Q87.35 -385.75 83.15 -382.1 79.35 -378.7 76.9 -375.6 L74.95 -372.75 75.25 -374.0 Q75.8 -376.1 76.7 -378.1 77.85 -380.85 79.75 -383.4 82.4 -387.05 86.45 -390.25 90.05 -393.15 93.8 -394.9 L95.6 -395.65 94.8 -395.75 98.25 -397.45 100.5 -399.0 100.75 -399.35 96.45 -398.85 80.55 -399.3 75.0 -399.75 70.1 -400.1 70.15 -400.05 70.1 -400.05 69.85 -400.15 70.1 -400.15 70.2 -400.15 70.25 -400.2 74.9 -400.8 78.3 -401.25 78.45 -401.3 87.0 -402.4 85.1 -402.95 90.2 -403.4 92.35 -403.5 Q89.35 -405.05 84.4 -406.1 79.1 -407.25 75.2 -407.1 L74.45 -407.05 68.7 -406.4 63.5 -404.85 62.7 -404.85 Q64.05 -405.95 66.55 -406.8 L71.6 -408.2 71.65 -408.2 72.1 -408.25 74.3 -408.65 77.9 -409.15 81.35 -409.4 82.1 -409.45 82.1 -409.55 88.05 -410.5 89.85 -410.55 Q88.65 -412.3 81.45 -414.15 73.25 -416.25 65.7 -415.9 61.1 -415.7 56.9 -414.35 L53.9 -413.3 50.55 -411.65 M108.5 -405.9 L104.35 -406.2 102.75 -406.0 113.25 -402.7 Q110.85 -401.85 110.1 -401.15 L112.7 -401.4 Q115.75 -401.5 116.65 -400.85 L117.75 -399.85 120.3 -397.95 119.4 -399.55 119.15 -399.95 118.2 -401.1 122.75 -400.8 123.15 -400.8 Q120.3 -402.1 118.05 -403.65 117.2 -404.3 115.1 -404.2 L114.3 -404.1 114.1 -404.1 112.3 -406.4 110.1 -409.25 111.35 -405.25 108.5 -405.9 M87.3 -371.1 L96.4 -373.4 Q103.8 -375.5 108.5 -378.35 106.35 -376.1 103.55 -374.5 100.1 -372.35 94.7 -370.7 L84.25 -367.85 Q78.95 -366.25 76.1 -363.9 76.5 -364.7 77.6 -365.75 79.0 -366.95 81.5 -368.4 L82.85 -369.15 85.7 -370.45 87.3 -371.1 M109.25 -374.7 L108.2 -373.55 105.95 -371.2 102.8 -369.1 Q100.6 -368.05 100.35 -367.8 98.95 -366.65 93.9 -364.25 L86.1 -360.4 86.05 -360.5 90.85 -364.25 Q95.5 -367.6 98.45 -368.5 100.2 -369.1 104.75 -371.85 L109.25 -374.7 M87.9 -384.7 L87.8 -384.6 87.7 -384.6 87.9 -384.7 M96.75 -376.4 L96.55 -376.35 96.05 -376.35 96.75 -376.4" fill="#edc638" fill-rule="evenodd" stroke="none"/>
    <path d="M19.1 -266.45 L19.05 -266.45 19.0 -266.6 11.95 -266.0 7.85 -266.55 6.6 -266.9 5.6 -268.35 5.45 -268.75 5.1 -269.05 3.55 -271.8 2.55 -273.95 5.2 -271.85 6.95 -270.95 Q10.75 -269.3 15.7 -269.55 23.65 -269.95 30.1 -273.5 L32.95 -275.25 38.0 -279.0 39.0 -280.7 Q40.85 -284.0 41.7 -287.5 42.5 -290.8 42.45 -294.25 L42.35 -295.65 Q42.15 -298.05 41.1 -300.8 38.95 -299.9 36.3 -299.25 L36.25 -299.45 39.25 -302.15 40.15 -302.9 39.75 -303.8 Q39.4 -304.45 39.2 -305.05 L27.05 -304.1 25.25 -304.45 31.1 -306.1 Q36.75 -307.75 38.05 -307.6 L38.05 -307.5 38.15 -307.5 38.2 -307.55 38.25 -307.55 38.3 -307.55 42.15 -308.1 46.15 -307.85 Q45.0 -309.25 41.85 -309.75 L37.4 -309.95 37.3 -309.95 33.1 -309.8 29.75 -309.55 31.75 -309.3 33.5 -309.0 Q28.85 -307.2 24.2 -306.45 L17.15 -305.65 22.8 -308.3 29.05 -311.4 27.05 -313.7 25.1 -315.35 24.0 -316.25 Q21.1 -318.8 20.25 -318.75 L15.25 -317.0 9.9 -315.05 9.1 -316.4 Q4.3 -322.75 -4.7 -322.3 L-4.75 -322.3 -4.85 -324.5 0.15 -325.3 2.5 -325.2 3.1 -324.35 4.65 -323.75 Q8.3 -322.0 9.8 -317.85 15.4 -320.3 19.0 -322.25 23.05 -324.55 24.5 -326.2 L25.15 -327.55 Q27.3 -323.4 33.2 -320.6 36.1 -319.25 38.6 -318.65 40.0 -321.8 42.95 -324.9 44.15 -327.55 46.8 -330.1 L55.7 -337.5 56.55 -338.15 59.85 -341.0 64.05 -344.7 Q69.8 -350.15 69.65 -352.3 69.5 -354.2 66.35 -355.9 63.3 -357.5 60.55 -357.35 L60.2 -357.35 58.65 -356.7 Q57.1 -356.1 55.45 -355.65 L53.7 -355.2 52.4 -355.15 54.45 -357.05 54.75 -357.4 57.0 -359.75 55.55 -359.65 53.25 -359.65 53.2 -359.6 53.25 -359.75 53.15 -359.7 52.65 -359.6 52.45 -359.55 51.7 -359.4 45.8 -358.2 43.15 -357.3 37.45 -356.6 36.85 -356.55 35.4 -356.6 32.6 -356.75 29.6 -357.05 28.95 -357.05 28.6 -357.0 28.15 -357.0 28.95 -357.5 30.05 -358.1 Q28.9 -360.95 26.0 -366.45 25.95 -367.25 31.05 -372.3 37.1 -378.35 38.85 -381.0 L38.85 -380.6 Q38.05 -377.7 37.45 -376.8 L37.0 -376.35 35.4 -374.55 33.6 -372.15 32.75 -370.7 Q31.65 -368.65 31.4 -367.1 33.9 -368.15 38.0 -369.0 L41.1 -369.5 47.5 -370.1 57.65 -369.65 58.6 -369.6 58.6 -369.7 58.75 -369.6 58.65 -369.5 58.9 -369.6 59.05 -369.6 61.45 -370.0 Q60.4 -372.65 57.25 -375.2 L53.75 -377.65 Q48.75 -380.75 47.6 -381.65 45.1 -383.5 43.65 -385.4 L42.95 -385.5 40.85 -385.75 Q40.3 -386.05 39.55 -388.6 L38.9 -391.15 Q38.8 -391.65 42.3 -393.65 43.9 -394.65 45.55 -395.45 L45.1 -393.0 45.05 -392.0 45.05 -391.3 45.2 -390.4 45.35 -389.7 Q45.5 -388.95 45.95 -388.1 L46.9 -386.3 Q48.1 -384.45 50.05 -382.5 L51.1 -381.45 51.8 -380.85 53.9 -379.4 Q55.45 -378.5 57.0 -378.1 L57.6 -378.0 57.75 -377.9 61.95 -374.55 63.25 -373.65 64.6 -372.45 66.35 -370.2 67.1 -368.8 Q67.4 -369.9 67.3 -371.5 L67.25 -372.3 67.85 -371.85 69.9 -370.3 Q70.85 -370.35 73.7 -372.7 L75.25 -374.0 74.95 -372.75 74.8 -372.0 74.75 -371.6 76.3 -373.0 77.05 -373.6 80.05 -375.85 79.1 -374.45 75.6 -368.85 75.65 -368.7 80.15 -370.75 85.0 -372.65 83.9 -371.35 Q83.2 -370.6 82.05 -370.25 L84.2 -370.65 Q85.95 -371.1 86.3 -371.3 L85.7 -370.45 82.85 -369.15 81.5 -368.4 Q79.0 -366.95 77.6 -365.75 76.5 -364.7 76.1 -363.9 L76.1 -363.8 76.05 -363.65 76.35 -363.65 77.75 -364.05 79.65 -364.65 80.05 -364.75 82.7 -365.5 82.0 -364.25 79.35 -360.65 77.4 -358.25 73.2 -354.85 72.9 -354.55 72.75 -354.35 72.7 -354.3 72.6 -354.1 67.7 -346.65 67.6 -346.3 66.9 -344.6 66.75 -344.25 66.25 -343.0 65.75 -342.05 64.75 -340.6 64.35 -340.1 64.1 -339.85 63.25 -339.2 63.15 -339.15 62.75 -338.9 62.7 -338.85 62.75 -338.75 62.8 -338.75 63.25 -339.0 64.0 -339.35 64.1 -339.4 64.25 -339.5 64.3 -339.5 65.6 -340.05 63.75 -337.9 63.45 -337.6 Q60.1 -333.85 59.45 -332.75 L59.25 -332.5 Q60.1 -332.5 61.15 -332.9 L62.4 -333.5 64.95 -335.0 65.8 -335.5 65.45 -333.15 65.25 -332.3 65.15 -332.1 64.2 -329.0 62.55 -325.05 65.65 -326.6 65.7 -326.65 65.8 -326.6 66.05 -326.8 66.45 -327.05 Q67.1 -327.55 67.9 -327.85 66.65 -327.3 65.75 -325.65 L65.7 -325.6 Q65.05 -324.5 65.1 -323.9 65.15 -323.35 65.9 -322.8 66.95 -322.1 69.2 -321.5 73.0 -320.5 76.0 -320.65 77.9 -320.75 79.5 -321.6 L80.7 -322.4 Q85.8 -317.55 88.95 -317.7 93.75 -317.9 97.3 -323.7 L99.05 -327.0 Q100.75 -331.5 100.1 -336.6 L100.95 -334.85 Q102.45 -331.4 102.7 -327.7 102.85 -325.9 102.0 -321.0 L102.1 -320.9 Q104.35 -323.95 105.25 -327.15 L105.45 -327.95 Q105.8 -329.55 105.8 -331.55 L105.5 -334.45 105.2 -335.85 Q104.25 -339.85 102.0 -342.35 L99.75 -344.4 103.65 -344.55 Q104.75 -344.75 105.15 -346.1 L105.15 -347.75 105.15 -348.1 Q104.9 -350.35 103.85 -351.5 L104.0 -351.6 Q105.7 -350.05 107.0 -348.2 L108.25 -346.25 108.75 -345.4 109.9 -342.75 Q110.7 -340.65 111.1 -338.25 111.5 -335.7 111.3 -333.35 110.45 -326.05 103.25 -319.95 L101.45 -318.5 98.95 -316.85 95.65 -315.05 95.35 -314.95 Q95.0 -314.75 94.65 -314.65 L91.5 -313.45 88.95 -313.05 Q84.0 -312.75 78.6 -313.85 L77.8 -314.05 77.7 -314.05 76.3 -314.4 74.75 -314.8 Q72.15 -315.5 70.3 -316.4 67.65 -317.55 66.2 -319.0 L66.0 -319.25 65.35 -319.9 65.2 -319.15 62.75 -321.5 60.05 -308.7 60.1 -308.65 60.05 -308.6 59.65 -308.0 59.0 -307.1 57.65 -305.2 Q55.5 -302.3 53.65 -300.75 L57.6 -302.5 Q55.9 -299.15 53.6 -296.65 54.45 -296.8 57.55 -299.25 L61.2 -301.8 Q59.95 -298.35 57.35 -292.7 L55.25 -288.15 52.75 -283.25 48.75 -280.1 Q45.4 -277.7 37.3 -273.25 30.75 -269.55 25.05 -267.95 L19.0 -266.6 19.1 -266.45 M-25.15 -341.6 L-24.9 -343.45 -24.55 -344.25 -23.7 -344.35 Q-21.85 -344.6 -20.9 -345.2 -19.55 -346.1 -17.85 -346.15 L-15.7 -346.1 Q-13.2 -345.85 -10.5 -344.8 L-10.45 -344.7 Q-8.5 -343.95 -6.5 -342.7 L-5.75 -342.25 -4.2 -341.2 -1.0 -338.65 3.3 -335.0 5.45 -333.25 Q8.85 -330.8 11.35 -330.9 13.5 -331.0 14.65 -331.85 15.75 -332.7 15.7 -334.1 L15.2 -335.55 13.8 -338.2 13.1 -339.25 11.6 -340.85 11.25 -341.3 11.05 -341.55 10.75 -341.95 9.75 -343.1 9.45 -343.45 6.8 -346.55 9.05 -349.1 12.8 -352.95 14.5 -354.65 16.35 -356.4 17.75 -357.8 19.25 -359.05 18.55 -357.6 17.45 -355.15 16.25 -352.9 15.95 -352.2 13.15 -346.7 12.8 -346.1 14.3 -344.7 14.35 -344.6 15.8 -342.15 18.35 -338.05 19.4 -336.35 17.5 -337.2 14.9 -338.1 16.85 -336.65 18.1 -335.7 18.25 -335.55 Q20.75 -333.5 21.1 -330.95 21.35 -329.85 20.5 -328.5 17.7 -327.3 16.05 -327.2 12.15 -327.05 7.8 -329.65 5.75 -330.9 0.9 -334.85 L0.1 -335.5 Q-4.95 -339.7 -8.15 -341.45 -9.8 -342.35 -11.4 -342.85 -14.1 -343.85 -16.85 -343.85 L-17.8 -343.85 Q-20.7 -343.65 -23.3 -342.6 -24.3 -342.2 -25.15 -341.6 M63.4 -413.2 L64.35 -413.25 73.95 -412.8 74.05 -412.75 Q77.5 -412.05 81.05 -410.55 L82.2 -409.95 82.1 -409.55 82.1 -409.45 81.35 -409.4 77.9 -409.15 74.95 -410.25 74.15 -410.5 72.7 -410.95 Q67.6 -412.6 63.4 -413.2 M94.8 -395.75 L95.6 -395.65 93.8 -394.9 Q90.05 -393.15 86.45 -390.25 82.4 -387.05 79.75 -383.4 L80.2 -385.85 Q80.55 -388.05 80.85 -388.45 L82.0 -389.45 84.25 -392.2 Q85.05 -393.4 87.35 -394.85 89.6 -396.15 90.35 -396.2 L90.4 -396.4 94.8 -395.75 M90.35 -396.4 Q88.2 -396.3 86.2 -396.45 82.5 -396.7 81.85 -397.7 L81.9 -397.7 81.9 -397.75 86.2 -397.05 88.1 -396.75 90.35 -396.4 M92.95 -374.9 L92.85 -375.05 92.95 -375.05 94.15 -375.4 93.0 -374.95 92.95 -374.9 M62.7 -338.85 L62.65 -338.85 62.7 -338.85 M45.75 -365.7 L45.7 -365.7 45.7 -365.65 45.75 -365.7 M47.1 -368.5 L46.95 -368.5 47.0 -368.45 47.1 -368.45 47.1 -368.5 M76.65 -349.15 L76.7 -348.2 76.9 -346.75 Q77.15 -345.75 77.75 -345.25 L77.85 -345.15 78.5 -344.8 79.05 -344.65 79.45 -344.6 80.3 -344.6 80.5 -344.4 78.6 -343.15 78.05 -342.7 77.75 -342.45 76.65 -341.45 76.55 -341.3 Q74.75 -341.55 74.35 -343.0 L74.15 -343.85 74.05 -344.6 74.05 -344.9 74.1 -345.0 74.45 -345.75 74.7 -345.65 74.85 -346.05 75.25 -346.3 75.05 -346.5 75.15 -346.65 Q75.7 -347.95 76.65 -349.15 M74.15 -343.85 L74.45 -343.85 74.3 -344.45 74.15 -343.85 M34.15 -374.5 L33.9 -374.7 33.85 -374.65 34.1 -374.45 34.15 -374.5 M31.15 -365.85 L31.1 -365.85 31.05 -365.45 31.15 -365.85 M14.35 -300.35 L14.5 -300.25 14.4 -300.25 14.35 -300.35 M28.3 -309.4 L27.8 -309.4 27.8 -309.25 Q28.15 -309.25 28.3 -309.4" fill="#e6bf88" fill-rule="evenodd" stroke="none"/>
    <path d="M32.35 -394.15 L36.05 -396.8 36.85 -397.3 38.0 -398.45 39.3 -400.35 42.05 -404.65 Q44.05 -407.0 47.85 -408.95 L47.9 -408.95 49.15 -409.55 49.25 -409.15 49.4 -409.25 52.95 -409.8 Q56.6 -409.95 61.5 -409.6 L65.45 -409.15 71.65 -408.3 71.6 -408.2 66.55 -406.8 Q64.05 -405.95 62.7 -404.85 L63.5 -404.85 67.6 -404.75 67.7 -404.5 64.35 -403.15 61.9 -402.3 69.25 -401.85 74.5 -401.5 74.85 -401.5 78.3 -401.25 74.9 -400.8 70.25 -400.2 70.2 -400.15 70.1 -400.15 69.85 -400.15 70.1 -400.05 70.15 -400.05 70.25 -400.05 75.1 -399.0 78.2 -398.45 76.55 -397.85 75.2 -397.4 74.8 -397.25 72.0 -396.3 68.35 -395.1 68.35 -394.7 73.0 -393.85 75.5 -393.3 77.75 -392.85 75.6 -392.0 73.7 -391.25 73.7 -391.2 Q65.7 -387.5 61.3 -382.8 L58.8 -384.9 56.3 -387.0 Q51.15 -392.0 50.15 -398.05 49.75 -400.2 50.15 -403.45 L50.4 -405.55 Q48.5 -403.15 47.0 -399.55 L46.0 -396.9 43.05 -395.95 Q38.85 -394.55 35.25 -392.35 L29.25 -385.9 21.15 -377.75 Q16.0 -372.6 10.0 -365.7 L9.2 -364.75 3.9 -358.45 Q-1.3 -353.85 -2.2 -351.1 L-2.4 -349.9 Q-2.3 -348.15 -0.05 -347.7 2.1 -347.3 3.2 -346.4 L3.55 -345.7 5.1 -343.4 6.2 -341.7 Q7.2 -340.0 7.3 -338.9 7.35 -338.25 6.75 -337.8 6.2 -337.4 5.25 -337.35 5.05 -337.35 -2.1 -341.3 L-4.15 -342.4 -5.9 -343.35 Q-10.85 -346.0 -13.7 -346.9 L-15.05 -347.3 -14.9 -347.75 -12.85 -351.55 -11.05 -352.75 -8.15 -354.85 -6.8 -355.9 Q-2.9 -358.9 -1.75 -360.45 -1.8 -361.25 -3.0 -361.15 -5.25 -361.05 -7.1 -360.15 L-4.65 -363.15 Q-1.65 -366.5 5.75 -372.45 L6.05 -372.7 7.15 -373.55 9.7 -375.6 10.55 -376.25 16.7 -380.7 24.55 -386.3 Q25.55 -387.05 26.95 -388.35 L32.35 -394.15 M2.55 -273.95 Q0.9 -277.5 0.4 -280.5 L-0.1 -285.5 -0.15 -286.1 Q1.4 -288.25 1.3 -290.05 1.05 -292.8 0.35 -294.1 L-0.05 -294.65 0.0 -296.8 0.15 -296.8 Q2.15 -295.95 3.15 -296.0 4.55 -296.1 5.0 -297.1 L5.6 -298.85 6.0 -298.75 Q8.7 -296.8 8.85 -294.85 L9.0 -292.7 Q9.1 -290.05 8.85 -288.55 L8.35 -285.85 8.05 -284.3 Q7.2 -279.9 6.95 -270.95 L5.2 -271.85 2.55 -273.95 M-4.75 -320.95 L-4.75 -322.3 -4.7 -322.3 Q4.3 -322.75 9.1 -316.4 L9.9 -315.05 Q11.55 -312.4 13.25 -307.55 L13.4 -307.1 13.95 -305.5 13.55 -305.5 13.4 -305.45 4.8 -306.0 -0.4 -306.6 -0.45 -306.6 -0.6 -306.6 -0.6 -308.2 -0.55 -308.7 Q-0.55 -314.1 -0.15 -318.7 -0.2 -319.25 -2.85 -320.3 L-4.75 -320.95 M77.85 -350.85 L78.7 -351.8 78.95 -352.05 79.9 -353.0 Q84.05 -356.8 88.6 -357.05 94.75 -357.35 99.75 -354.6 L102.4 -352.95 103.4 -352.15 Q103.65 -351.85 104.0 -351.6 L103.85 -351.5 Q104.9 -350.35 105.15 -348.1 L105.15 -347.75 105.15 -346.1 Q104.75 -344.75 103.65 -344.55 L99.75 -344.4 97.35 -345.75 95.95 -346.2 Q92.7 -347.25 88.55 -347.0 84.85 -346.85 81.35 -344.95 L80.85 -344.6 80.5 -344.4 80.3 -344.6 79.45 -344.6 79.05 -344.65 78.5 -344.8 77.85 -345.15 77.75 -345.25 Q77.15 -345.75 76.9 -346.75 L76.7 -348.2 76.65 -349.15 77.85 -350.85 M91.0 -350.45 Q92.6 -351.5 92.6 -352.15 92.5 -353.45 84.5 -354.3 L84.3 -354.3 Q82.35 -353.75 80.85 -352.0 79.25 -350.3 79.4 -348.5 L86.45 -348.85 Q89.0 -349.2 91.0 -350.45 M41.1 -369.5 L38.0 -369.0 Q33.9 -368.15 31.4 -367.1 31.65 -368.65 32.75 -370.7 L33.6 -372.15 35.4 -374.55 37.0 -376.35 37.45 -376.8 38.1 -377.45 38.4 -377.65 42.0 -376.9 46.65 -375.15 47.9 -374.4 43.8 -371.9 41.8 -370.2 41.1 -369.5 M17.45 -355.15 L20.0 -357.45 22.35 -359.35 24.15 -358.2 25.55 -357.15 28.85 -354.85 28.5 -354.4 24.95 -349.2 25.05 -348.85 30.25 -351.45 33.75 -353.2 34.05 -353.3 35.05 -351.8 Q36.45 -350.75 38.65 -350.0 42.45 -348.7 45.6 -348.8 48.65 -349.0 54.6 -351.6 L58.9 -353.45 Q61.0 -354.35 61.65 -354.35 62.85 -354.45 63.5 -352.75 L64.0 -350.75 Q64.25 -347.3 60.25 -344.3 L59.65 -343.85 56.95 -342.3 Q53.85 -340.7 49.4 -339.25 44.85 -337.8 40.95 -336.8 35.35 -335.5 31.0 -335.25 L25.6 -335.3 24.35 -335.5 23.85 -335.95 22.6 -337.15 19.6 -339.95 17.5 -341.85 17.1 -342.25 15.35 -343.8 14.4 -344.6 14.3 -344.7 12.8 -346.1 13.15 -346.7 15.95 -352.2 16.25 -352.9 17.45 -355.15" fill="#f0dab9" fill-rule="evenodd" stroke="none"/>
    <path d="M0.0 -296.85 L0.1 -302.5 5.6 -299.0 5.6 -298.85 5.0 -297.1 Q4.55 -296.1 3.15 -296.0 2.15 -295.95 0.15 -296.8 L0.0 -296.85 M-0.6 -306.45 L-1.0 -306.65 Q-4.35 -307.85 -5.85 -307.5 L-5.4 -308.05 -4.9 -308.65 -4.9 -308.7 Q-4.55 -309.45 -4.8 -310.75 -5.1 -312.45 -4.8 -317.95 L-4.75 -320.95 -2.85 -320.3 Q-0.2 -319.25 -0.15 -318.7 -0.55 -314.1 -0.55 -308.7 L-0.6 -308.2 -0.6 -306.6 -0.6 -306.45 M-24.55 -344.25 Q-23.35 -347.4 -19.0 -352.2 L-11.6 -359.6 -7.4 -363.3 5.0 -373.5 5.25 -373.7 5.35 -373.75 7.0 -375.1 9.95 -377.4 Q17.7 -383.5 25.9 -389.45 L32.35 -394.15 26.95 -388.35 Q25.55 -387.05 24.55 -386.3 L16.7 -380.7 10.55 -376.25 9.7 -375.6 7.15 -373.55 6.05 -372.7 5.75 -372.45 Q-1.65 -366.5 -4.65 -363.15 L-7.1 -360.15 Q-5.25 -361.05 -3.0 -361.15 -1.8 -361.25 -1.75 -360.45 -2.9 -358.9 -6.8 -355.9 L-8.15 -354.85 -11.05 -352.75 -12.85 -351.55 -14.9 -347.75 -15.05 -347.3 -15.7 -346.1 -17.85 -346.15 Q-19.55 -346.1 -20.9 -345.2 -21.85 -344.6 -23.7 -344.35 L-24.55 -344.25" fill="#ffecd1" fill-rule="evenodd" stroke="none"/>
    <path d="M34.15 -374.5 L34.1 -374.45 33.85 -374.65 33.9 -374.7 34.15 -374.5" fill="#ab8c28" fill-rule="evenodd" stroke="none"/>
    <path d="M0.0 -296.8 L0.0 -296.85 0.15 -296.8 0.0 -296.8 M-4.95 -325.2 L-5.2 -325.4 -4.95 -325.4 -4.95 -325.2 M67.7 -404.5 L67.6 -404.75 68.15 -404.75 67.7 -404.5 M71.6 -408.2 L71.65 -408.3 72.1 -408.25 71.65 -408.2 71.6 -408.2 M91.0 -350.45 Q89.0 -349.2 86.45 -348.85 L79.4 -348.5 Q79.25 -350.3 80.85 -352.0 82.35 -353.75 84.3 -354.3 L84.5 -354.3 Q92.5 -353.45 92.6 -352.15 92.6 -351.5 91.0 -350.45 M31.15 -365.85 L31.05 -365.45 31.1 -365.85 31.15 -365.85 M6.0 -298.75 L5.6 -298.85 5.6 -299.0 6.0 -298.75 M14.7 -300.6 L14.55 -300.65 14.7 -300.65 14.7 -300.6 M31.15 -277.25 L31.55 -277.3 31.35 -277.1 31.15 -277.25" fill="#f3e1c7" fill-rule="evenodd" stroke="none"/>
    <path d="M47.1 -368.5 L47.1 -368.45 47.0 -368.45 46.95 -368.5 47.1 -368.5" fill="#151540" fill-rule="evenodd" stroke="none"/>
    <path d="M66.15 -301.55 L65.85 -301.45 Q65.95 -298.5 64.75 -295.35 63.55 -292.3 61.1 -289.0 L60.7 -288.45 Q56.65 -283.15 50.05 -278.3 L48.45 -277.15 Q46.3 -275.7 44.15 -274.4 L40.7 -272.45 Q38.8 -271.4 36.9 -270.45 31.35 -267.85 25.65 -266.3 L24.9 -266.1 Q22.95 -266.85 21.1 -266.75 L20.55 -266.65 19.1 -266.45 19.0 -266.6 25.05 -267.95 Q30.75 -269.55 37.3 -273.25 45.4 -277.7 48.75 -280.1 L52.75 -283.25 55.25 -288.15 57.35 -292.7 Q59.95 -298.35 61.2 -301.8 L57.55 -299.25 Q54.45 -296.8 53.6 -296.65 55.9 -299.15 57.6 -302.5 L57.75 -302.55 57.8 -302.6 Q61.9 -304.8 64.65 -307.85 L64.8 -306.6 Q65.25 -304.2 66.15 -301.55 M0.1 -304.7 L0.05 -306.25 -0.6 -306.45 -0.6 -306.6 -0.45 -306.6 -0.4 -306.6 4.8 -306.0 13.4 -305.45 13.55 -305.5 13.95 -305.5 14.6 -305.55 14.7 -305.55 15.55 -305.55 15.95 -305.55 16.3 -305.6 17.15 -305.65 24.2 -306.45 Q28.85 -307.2 33.5 -309.0 L31.75 -309.3 29.75 -309.55 33.1 -309.8 37.3 -309.95 37.4 -309.95 41.85 -309.75 Q45.0 -309.25 46.15 -307.85 L42.15 -308.1 38.3 -307.55 38.25 -307.55 38.1 -307.6 38.05 -307.6 Q36.75 -307.75 31.1 -306.1 L25.25 -304.45 Q21.1 -303.55 18.65 -303.4 L18.5 -303.4 14.6 -303.3 14.65 -303.7 14.5 -303.65 14.5 -303.3 6.35 -303.65 5.45 -303.7 Q2.05 -304.05 0.1 -304.7 M-4.85 -324.5 L-4.95 -325.2 -4.95 -325.4 -5.2 -325.4 -11.8 -330.15 -17.0 -334.0 Q-24.85 -339.95 -25.05 -341.4 L-25.15 -341.6 Q-24.3 -342.2 -23.3 -342.6 -20.7 -343.65 -17.8 -343.85 L-16.85 -343.85 Q-14.1 -343.85 -11.4 -342.85 -9.8 -342.35 -8.15 -341.45 -4.95 -339.7 0.1 -335.5 L0.9 -334.85 Q5.75 -330.9 7.8 -329.65 12.15 -327.05 16.05 -327.2 17.7 -327.3 20.5 -328.5 18.45 -325.5 11.0 -321.0 9.25 -323.5 5.4 -327.25 L-1.45 -333.0 -1.15 -331.0 Q-1.0 -330.1 0.65 -327.9 L2.5 -325.2 0.15 -325.3 -4.85 -324.5 M85.8 -380.0 L89.1 -382.35 83.4 -377.35 79.75 -373.8 81.1 -373.7 82.8 -373.6 92.25 -374.95 92.85 -375.05 92.95 -374.9 92.35 -374.65 88.45 -373.25 88.15 -372.95 91.15 -372.2 87.3 -371.1 85.7 -370.45 86.3 -371.3 Q85.95 -371.1 84.2 -370.65 L82.05 -370.25 Q83.2 -370.6 83.9 -371.35 L85.0 -372.65 80.15 -370.75 75.65 -368.7 75.6 -368.85 79.1 -374.45 80.05 -375.85 82.1 -377.4 85.8 -380.0 M65.2 -319.15 Q63.45 -313.95 60.1 -308.65 L60.05 -308.7 62.75 -321.5 65.2 -319.15 M82.7 -365.5 L88.6 -366.75 92.5 -366.95 Q85.8 -363.8 80.55 -360.4 L78.2 -358.85 78.15 -358.8 77.4 -358.25 79.35 -360.65 82.0 -364.25 82.7 -365.5 M81.65 -362.8 L81.85 -362.7 81.85 -362.8 81.65 -362.8" fill="#d1ac7a" fill-rule="evenodd" stroke="none"/>
    <path d="M147.6 -341.9 L147.95 -339.45 Q136.45 -325.1 116.5 -316.4 110.5 -313.8 104.35 -312.0 L101.8 -311.3 101.5 -311.2 100.2 -310.85 100.2 -310.95 99.15 -310.8 91.7 -309.5 91.6 -309.35 Q94.2 -307.95 99.5 -307.8 L106.45 -307.9 104.9 -307.2 Q99.9 -305.05 92.55 -304.05 L92.7 -303.85 90.5 -304.25 85.4 -304.85 82.9 -304.5 Q80.95 -304.15 80.25 -303.7 L80.2 -303.6 Q84.3 -302.05 88.75 -299.8 92.8 -297.7 94.7 -297.05 98.5 -295.8 106.75 -295.6 104.85 -294.3 103.8 -293.9 101.75 -293.05 97.7 -292.9 90.85 -292.55 84.55 -295.0 83.15 -295.6 82.05 -296.2 79.85 -297.3 78.5 -298.7 L78.35 -298.05 77.6 -300.15 77.45 -300.2 Q77.3 -300.25 77.3 -300.45 76.3 -299.15 75.8 -295.85 75.05 -291.5 75.55 -285.3 73.0 -288.1 70.9 -291.65 L68.75 -295.55 67.9 -297.4 67.55 -298.15 66.15 -301.5 66.15 -301.55 Q65.25 -304.2 64.8 -306.6 L64.65 -307.85 Q61.9 -304.8 57.8 -302.6 L57.75 -302.55 57.6 -302.5 53.65 -300.75 Q55.5 -302.3 57.65 -305.2 L59.0 -307.1 59.65 -308.0 60.05 -308.6 60.1 -308.65 Q63.45 -313.95 65.2 -319.15 L65.35 -319.9 66.0 -319.25 66.2 -319.0 Q67.65 -317.55 70.3 -316.4 72.15 -315.5 74.75 -314.8 L76.3 -314.4 77.7 -314.05 77.8 -314.05 78.6 -313.85 Q77.9 -313.15 72.7 -311.7 68.35 -310.55 66.85 -310.4 L66.55 -310.4 66.9 -310.15 Q68.7 -309.0 74.7 -309.35 L81.1 -310.2 82.05 -310.25 71.75 -304.8 Q74.7 -304.05 83.4 -308.0 89.65 -310.85 94.65 -314.65 95.0 -314.75 95.35 -314.95 L95.65 -315.05 98.95 -316.85 101.45 -318.5 103.25 -319.95 Q110.45 -326.05 111.3 -333.35 111.5 -335.7 111.1 -338.25 110.7 -340.65 109.9 -342.75 L108.75 -345.4 108.6 -346.25 107.4 -355.45 Q107.2 -357.25 107.5 -357.85 108.75 -355.8 111.45 -348.65 L112.2 -346.45 113.35 -342.95 Q114.45 -339.2 114.6 -336.8 L120.35 -343.3 123.1 -346.95 124.4 -349.25 123.6 -346.95 122.65 -344.55 122.2 -343.4 Q120.3 -338.6 118.0 -333.85 116.25 -330.0 113.45 -326.0 L111.3 -323.05 110.8 -322.7 110.8 -322.4 111.3 -323.05 115.45 -326.15 Q119.5 -328.95 121.0 -329.3 120.8 -328.65 120.2 -328.05 L118.85 -326.85 119.15 -326.9 Q120.3 -327.45 122.75 -329.05 L126.45 -331.4 121.85 -327.55 Q118.2 -324.45 117.65 -324.2 L117.95 -324.2 Q120.0 -325.4 132.45 -331.2 143.05 -336.65 147.6 -341.9 M65.75 -342.05 L68.0 -344.25 68.45 -344.7 69.45 -345.55 Q73.3 -348.85 77.85 -350.85 L76.65 -349.15 Q75.7 -347.95 75.15 -346.65 L75.05 -346.5 74.85 -346.05 74.45 -345.75 74.2 -345.6 74.05 -345.5 73.2 -344.95 72.55 -344.5 69.25 -342.55 66.1 -340.75 65.95 -340.65 64.55 -339.85 64.35 -340.1 64.75 -340.6 65.75 -342.05" fill="#b8962c" fill-rule="evenodd" stroke="none"/>
    <path d="M99.75 -344.4 L102.0 -342.35 Q104.25 -339.85 105.2 -335.85 103.95 -338.95 101.35 -340.55 99.65 -341.6 97.15 -342.05 L98.9 -339.75 Q100.2 -337.5 100.95 -334.85 L100.1 -336.6 Q100.75 -331.5 99.05 -327.0 L98.9 -329.85 Q98.45 -335.5 96.2 -339.0 L94.0 -342.0 93.7 -342.4 90.95 -342.4 87.7 -342.15 88.3 -341.7 Q90.45 -340.0 90.7 -337.8 91.0 -333.6 87.15 -330.75 83.95 -328.3 79.75 -328.15 L77.7 -328.3 76.7 -328.5 76.7 -328.85 Q81.25 -330.35 82.35 -330.95 86.05 -333.2 85.75 -337.1 85.55 -339.8 83.3 -341.3 L82.9 -341.2 Q77.45 -339.7 75.7 -336.8 76.35 -339.1 77.1 -340.8 L77.2 -341.2 77.75 -342.45 78.05 -342.7 78.6 -343.15 80.5 -344.4 80.85 -344.6 81.35 -344.95 Q84.85 -346.85 88.55 -347.0 92.7 -347.25 95.95 -346.2 L97.35 -345.75 99.75 -344.4" fill="#b39465" fill-rule="evenodd" stroke="none"/>
    <path d="M99.05 -327.0 L97.3 -323.7 Q93.75 -317.9 88.95 -317.7 85.8 -317.55 80.7 -322.4 L80.05 -323.0 Q76.2 -326.95 72.95 -327.95 L72.25 -328.15 73.7 -333.6 Q74.3 -335.65 75.65 -338.4 L77.1 -340.8 Q76.35 -339.1 75.7 -336.8 77.45 -339.7 82.9 -341.2 L83.3 -341.3 Q85.55 -339.8 85.75 -337.1 86.05 -333.2 82.35 -330.95 81.25 -330.35 76.7 -328.85 L76.7 -328.5 77.7 -328.3 79.75 -328.15 Q83.95 -328.3 87.15 -330.75 91.0 -333.6 90.7 -337.8 90.45 -340.0 88.3 -341.7 L87.7 -342.15 90.95 -342.4 93.7 -342.4 94.0 -342.0 96.2 -339.0 Q98.45 -335.5 98.9 -329.85 L99.05 -327.0 M83.4 -338.8 L82.0 -338.7 Q80.3 -338.35 78.25 -336.7 77.1 -335.85 76.65 -335.1 L76.5 -334.1 76.2 -333.25 76.65 -332.65 Q77.8 -331.1 79.1 -331.15 80.45 -331.25 81.95 -332.9 83.9 -335.05 83.6 -338.35 L83.5 -338.65 83.4 -338.8 M91.65 -339.0 L92.25 -337.15 92.65 -335.25 Q92.85 -333.3 88.55 -329.5 L85.8 -327.1 85.0 -326.5 83.4 -326.0 82.7 -325.5 Q82.35 -325.25 82.35 -324.9 82.4 -324.5 83.0 -323.65 L83.6 -322.35 84.7 -321.85 86.55 -321.45 Q90.9 -321.65 93.9 -324.25 97.5 -327.5 97.1 -333.25 L96.45 -335.45 95.5 -337.4 Q95.2 -338.0 93.5 -338.45 L91.65 -339.0" fill="#cca874" fill-rule="evenodd" stroke="none"/>
    <path d="M105.2 -335.85 L105.5 -334.45 105.8 -331.55 Q105.8 -329.55 105.45 -327.95 L105.25 -327.15 Q104.35 -323.95 102.1 -320.9 L102.0 -321.0 Q102.85 -325.9 102.7 -327.7 102.45 -331.4 100.95 -334.85 100.2 -337.5 98.9 -339.75 L97.15 -342.05 Q99.65 -341.6 101.35 -340.55 103.95 -338.95 105.2 -335.85 M67.9 -327.85 Q67.1 -327.55 66.45 -327.05 L66.05 -326.8 65.7 -326.65 65.65 -326.6 62.55 -325.05 64.2 -329.0 65.15 -332.1 65.25 -332.3 65.45 -333.15 65.8 -335.5 64.95 -335.0 62.4 -333.5 61.15 -332.9 Q60.1 -332.5 59.25 -332.5 L59.45 -332.75 Q60.1 -333.85 63.45 -337.6 L63.75 -337.9 65.6 -340.05 66.05 -340.65 66.1 -340.75 69.25 -342.55 72.55 -344.5 73.2 -344.95 74.05 -345.5 74.2 -345.6 74.45 -345.75 74.1 -345.0 74.05 -344.9 74.05 -344.6 74.15 -343.85 74.35 -343.0 Q74.75 -341.55 76.55 -341.3 L76.65 -341.45 77.75 -342.45 77.2 -341.2 77.1 -340.8 75.65 -338.4 Q74.3 -335.65 73.7 -333.6 L72.25 -328.15 71.7 -328.3 70.5 -328.35 68.7 -328.1 67.9 -327.85 M91.65 -339.0 L93.5 -338.45 Q95.2 -338.0 95.5 -337.4 L96.45 -335.45 97.1 -333.25 Q97.5 -327.5 93.9 -324.25 90.9 -321.65 86.55 -321.45 L84.7 -321.85 83.6 -322.35 83.0 -323.65 Q82.4 -324.5 82.35 -324.9 82.35 -325.25 82.7 -325.5 L83.4 -326.0 85.0 -326.5 85.8 -327.1 88.55 -329.5 Q92.85 -333.3 92.65 -335.25 L92.25 -337.15 91.65 -339.0 M83.4 -338.8 L83.5 -338.65 83.6 -338.35 Q83.9 -335.05 81.95 -332.9 80.45 -331.25 79.1 -331.15 77.8 -331.1 76.65 -332.65 L76.2 -333.25 76.5 -334.1 76.65 -335.1 Q77.1 -335.85 78.25 -336.7 80.3 -338.35 82.0 -338.7 L83.4 -338.8 M73.2 -335.95 L73.1 -335.85 73.2 -335.9 73.2 -335.95" fill="#d4af78" fill-rule="evenodd" stroke="none"/>
    <path d="M94.65 -314.65 Q89.65 -310.85 83.4 -308.0 74.7 -304.05 71.75 -304.8 L82.05 -310.25 81.1 -310.2 74.7 -309.35 Q68.7 -309.0 66.9 -310.15 L66.55 -310.4 66.85 -310.4 Q68.35 -310.55 72.7 -311.7 77.9 -313.15 78.6 -313.85 84.0 -312.75 88.95 -313.05 L91.5 -313.45 94.65 -314.65" fill="#a18126" fill-rule="evenodd" stroke="none"/>
    <path d="M45.75 -365.7 L45.7 -365.65 45.7 -365.7 45.75 -365.7" fill="#447ad1" fill-rule="evenodd" stroke="none"/>
    <path d="M25.15 -327.55 L24.5 -326.2 Q23.05 -324.55 19.0 -322.25 15.4 -320.3 9.8 -317.85 8.3 -322.0 4.65 -323.75 L3.1 -324.35 2.5 -325.2 0.65 -327.9 Q-1.0 -330.1 -1.15 -331.0 L-1.45 -333.0 5.4 -327.25 Q9.25 -323.5 11.0 -321.0 18.45 -325.5 20.5 -328.5 21.35 -329.85 21.1 -330.95 20.75 -333.5 18.25 -335.55 L18.1 -335.7 16.85 -336.65 14.9 -338.1 17.5 -337.2 19.4 -336.35 20.35 -335.85 20.4 -335.8 22.0 -334.6 22.95 -333.65 Q26.0 -330.2 25.15 -327.55" fill="#c29f72" fill-rule="evenodd" stroke="none"/>
    <path d="M47.45 -402.45 Q47.65 -399.15 48.35 -397.05 50.35 -391.2 56.3 -387.15 L59.0 -385.45 61.85 -383.85 64.75 -381.95 Q67.35 -379.85 68.5 -377.0 L68.75 -376.45 69.4 -374.4 69.6 -373.6 Q70.0 -372.05 69.85 -370.95 L68.9 -372.15 66.8 -374.1 65.3 -375.05 63.9 -375.75 Q61.2 -377.1 59.2 -378.35 L59.0 -378.45 58.45 -378.45 Q56.8 -378.55 55.2 -379.2 L52.85 -380.25 52.05 -380.8 50.85 -381.65 Q48.6 -383.25 47.15 -384.85 L45.85 -386.5 45.0 -388.0 44.75 -388.65 44.45 -389.55 44.35 -390.2 44.25 -391.2 44.3 -393.7 Q44.3 -394.45 44.45 -395.2 L45.0 -398.0 Q45.9 -401.85 47.4 -404.55 L47.45 -402.45" fill="#cca730" fill-rule="evenodd" stroke="none"/>
    <path d="M29.3 -366.35 L29.0 -367.55 Q29.0 -367.9 32.35 -372.15 L31.7 -370.7 Q30.8 -368.65 30.65 -367.1 L30.6 -366.75 30.45 -366.7 30.0 -366.6 29.3 -366.35 M34.4 -357.75 L34.4 -357.55 Q31.7 -357.3 29.95 -357.95 L30.75 -359.05 31.2 -360.15 30.1 -364.05 29.45 -365.85 30.4 -365.85 30.35 -365.45 30.45 -365.85 31.6 -365.95 31.6 -365.7 32.45 -363.35 32.65 -362.8 34.25 -358.4 32.7 -358.2 34.15 -357.8 34.4 -357.75" fill="#d1ac7a" fill-rule="evenodd" stroke="none"/>
    <path d="M29.3 -366.35 L30.0 -366.6 30.45 -366.7 30.6 -366.75 32.75 -367.3 37.3 -368.1 37.6 -368.15 39.55 -368.4 42.95 -368.45 43.05 -368.45 43.05 -368.5 49.2 -368.0 50.55 -367.85 51.55 -367.7 Q57.0 -366.9 59.35 -365.45 57.7 -363.3 52.05 -361.1 L49.85 -360.35 49.35 -360.2 47.95 -359.75 47.85 -359.7 47.5 -359.6 47.3 -359.55 46.8 -359.4 Q44.3 -358.65 42.05 -358.2 L36.95 -357.5 35.9 -357.5 35.0 -357.6 34.4 -357.75 34.15 -357.8 32.7 -358.2 34.25 -358.4 32.65 -362.8 32.45 -363.35 31.6 -365.7 31.6 -365.95 30.45 -365.85 30.4 -365.85 29.45 -365.85 27.9 -365.85 28.8 -366.2 29.3 -366.35 M40.05 -359.65 L45.15 -361.15 Q47.3 -361.95 50.1 -363.5 L50.45 -363.65 51.8 -364.4 53.75 -365.55 51.7 -365.6 47.7 -365.8 41.2 -365.95 39.1 -366.05 39.05 -366.05 37.0 -366.15 35.9 -366.2 35.45 -366.2 32.9 -366.0 33.05 -364.5 33.2 -364.1 33.75 -362.85 34.3 -361.7 Q35.0 -360.15 36.8 -358.85 L39.1 -359.4 40.05 -359.65" fill="#b5936a" fill-rule="evenodd" stroke="none"/>
    <path d="M41.2 -365.95 L47.7 -365.8 51.7 -365.6 53.75 -365.55 51.8 -364.4 50.45 -363.65 50.1 -363.5 Q47.3 -361.95 45.15 -361.15 L40.05 -359.65 40.8 -360.05 Q43.35 -361.65 44.6 -363.3 L40.05 -362.8 40.35 -363.45 41.2 -365.95 M33.75 -362.85 L33.2 -364.1 33.05 -364.5 32.9 -366.0 35.45 -366.2 35.45 -365.8 Q35.55 -363.9 36.05 -362.75 L34.4 -362.9 33.75 -362.85 M42.0 -365.7 L42.0 -365.65 42.0 -365.7" fill="#d4c693" fill-rule="evenodd" stroke="none"/>
    <path d="M35.45 -366.2 L35.9 -366.2 37.0 -366.15 39.05 -366.05 39.1 -366.05 41.2 -365.95 40.35 -363.45 40.05 -362.8 39.9 -362.8 Q38.5 -362.6 36.05 -362.75 35.55 -363.9 35.45 -365.8 L35.45 -366.2" fill="#876e36" fill-rule="evenodd" stroke="none"/>
    <path d="M40.05 -359.65 L39.1 -359.4 36.8 -358.85 Q35.0 -360.15 34.3 -361.7 L33.75 -362.85 34.4 -362.9 36.05 -362.75 Q36.65 -361.1 38.0 -361.2 39.05 -361.25 39.95 -362.65 L39.9 -362.8 40.05 -362.8 44.6 -363.3 Q43.35 -361.65 40.8 -360.05 L40.05 -359.65 M35.4 -361.65 L35.35 -361.65 35.4 -361.65" fill="#eddea5" fill-rule="evenodd" stroke="none"/>
    <path d="M39.9 -362.8 L39.95 -362.65 Q39.05 -361.25 38.0 -361.2 36.65 -361.1 36.05 -362.75 38.5 -362.6 39.9 -362.8" fill="#a68742" fill-rule="evenodd" stroke="none"/>
    <path d="M121.55 -378.5 L120.8 -382.15 120.5 -383.25 120.3 -384.0 119.0 -388.1 Q117.15 -392.15 114.8 -395.5 L114.7 -395.65 111.65 -399.6 108.75 -402.55 109.8 -402.95 113.4 -399.35 116.25 -395.75 116.45 -395.4 Q118.85 -391.95 120.8 -387.85 L122.1 -383.75 122.3 -383.0 122.55 -381.9 123.2 -378.7 123.5 -377.25 123.65 -376.2 124.25 -372.85 122.5 -372.75 121.9 -376.45 121.75 -377.25 121.55 -378.5 M115.25 -405.0 L115.4 -404.9 114.45 -404.65 113.75 -404.45 115.25 -405.0 M127.85 -368.0 L130.55 -370.2 129.05 -367.45 127.5 -364.85 Q127.1 -365.4 125.2 -366.25 L125.2 -366.35 Q126.25 -366.7 127.85 -368.0" fill="#695d37" fill-rule="evenodd" stroke="none"/>
    <path d="M59.1 -435.75 L58.95 -434.5 59.15 -434.45 61.95 -434.1 61.1 -428.1 64.8 -427.4 62.0 -419.9 66.75 -418.65 73.45 -416.8 72.25 -415.5 52.0 -420.6 50.85 -417.85 70.65 -412.55 69.65 -410.05 69.4 -409.2 51.9 -414.35 48.15 -415.5 49.5 -418.2 50.9 -420.85 54.3 -427.1 55.9 -429.9 57.4 -432.7 59.1 -435.75 M77.6 -450.2 L77.4 -451.05 77.0 -450.9 76.95 -450.95 74.75 -453.25 73.7 -450.45 73.55 -450.05 65.95 -448.1 65.95 -448.15 67.05 -450.05 67.35 -450.6 76.15 -467.4 79.9 -457.35 82.65 -449.9 80.65 -448.65 80.15 -448.35 79.85 -448.4 Q79.1 -448.7 77.6 -450.2 M63.3 -443.25 L62.45 -437.6 60.25 -437.75 63.3 -443.25 M72.05 -446.15 L70.85 -443.05 68.0 -442.8 67.5 -434.45 66.4 -431.6 66.05 -430.5 65.2 -430.65 66.55 -444.6 72.05 -446.15" fill="#ffdd87" fill-rule="evenodd" stroke="none"/>
    <path d="M59.1 -435.75 L57.4 -432.7 55.9 -429.9 54.3 -427.1 50.9 -420.85 49.5 -418.2 48.15 -415.5 46.0 -416.15 72.25 -478.0 76.15 -467.4 67.35 -450.6 67.05 -450.05 65.95 -448.15 65.95 -448.1 63.95 -447.6 63.3 -443.25 60.25 -437.75 59.35 -437.85 59.15 -436.2 59.1 -435.75" fill="#ffebb0" fill-rule="evenodd" stroke="none"/>
    <path d="M69.4 -409.2 L69.65 -410.05 70.65 -412.55 90.9 -407.15 88.8 -411.3 72.25 -415.5 73.45 -416.8 66.75 -418.65 62.0 -419.9 64.8 -427.4 64.9 -427.35 83.5 -423.75 81.55 -432.55 83.65 -433.1 84.3 -433.25 84.4 -433.3 82.95 -438.8 80.2 -438.5 77.6 -450.2 Q79.1 -448.7 79.85 -448.4 L80.15 -448.35 80.65 -448.65 82.65 -449.9 85.4 -442.35 95.4 -415.4 101.15 -399.75 69.4 -409.2 M77.0 -450.9 L73.55 -450.05 73.7 -450.45 74.75 -453.25 76.95 -450.95 77.0 -450.9 M72.05 -446.15 L74.45 -446.85 78.1 -428.75 66.05 -430.5 66.4 -431.6 67.5 -434.45 67.45 -433.65 67.4 -432.45 73.9 -431.95 74.85 -431.85 Q74.15 -437.45 72.9 -443.2 L72.05 -443.15 70.85 -443.05 72.05 -446.15" fill="#edd27d" fill-rule="evenodd" stroke="none"/>
    <path d="M64.8 -427.4 L61.1 -428.1 61.95 -434.1 59.15 -434.45 58.95 -434.5 59.1 -435.75 59.15 -436.2 59.35 -437.85 60.25 -437.75 62.45 -437.6 63.3 -443.25 63.95 -447.6 65.95 -448.1 73.55 -450.05 77.0 -450.9 77.4 -451.05 77.6 -450.2 80.2 -438.5 82.95 -438.8 84.4 -433.3 84.3 -433.25 83.65 -433.1 81.55 -432.55 83.5 -423.75 64.9 -427.35 64.8 -427.4 M70.65 -412.55 L50.85 -417.85 52.0 -420.6 72.25 -415.5 88.8 -411.3 90.9 -407.15 70.65 -412.55 M66.05 -430.5 L78.1 -428.75 74.45 -446.85 72.05 -446.15 66.55 -444.6 65.2 -430.65 66.05 -430.5 M70.85 -443.05 L72.05 -443.15 72.9 -443.2 Q74.15 -437.45 74.85 -431.85 L73.9 -431.95 67.4 -432.45 67.45 -433.65 67.5 -434.45 68.0 -442.8 70.85 -443.05" fill="#827044" fill-rule="evenodd" stroke="none"/>
    <path d="M108.55 -450.3 L106.3 -450.25 Q101.9 -450.2 100.8 -450.85 L99.3 -452.55 97.95 -454.35 Q97.65 -454.85 96.8 -455.25 95.65 -455.8 93.95 -455.8 L90.3 -455.55 Q89.6 -455.65 89.05 -458.05 L84.1 -458.05 79.9 -457.35 76.15 -467.4 72.25 -478.0 99.6 -473.3 108.55 -450.3" fill="#bfaa65" fill-rule="evenodd" stroke="none"/>
    <path d="M79.9 -457.35 L84.1 -458.05 89.05 -458.05 Q89.6 -455.65 90.3 -455.55 L93.95 -455.8 Q95.65 -455.8 96.8 -455.25 97.65 -454.85 97.95 -454.35 L99.3 -452.55 100.8 -450.85 Q101.9 -450.2 106.3 -450.25 L108.55 -450.3 122.8 -413.85 121.5 -413.75 114.8 -413.55 115.0 -413.4 114.85 -413.3 111.4 -423.5 Q110.8 -425.2 110.4 -427.4 109.75 -428.85 106.75 -429.25 101.1 -429.7 100.4 -430.1 99.75 -430.45 98.0 -433.95 96.15 -436.9 94.85 -440.9 94.1 -443.2 92.85 -443.2 L87.9 -442.7 85.4 -442.35 82.65 -449.9 79.9 -457.35 M115.4 -404.9 L116.4 -405.15 116.65 -405.2 117.55 -404.2 123.05 -398.1 123.75 -397.3 124.35 -396.6 124.6 -396.25 123.2 -396.1 120.45 -395.9 116.45 -395.4 116.25 -395.75 113.4 -399.35 109.8 -402.95 109.45 -403.25 111.75 -403.9 113.75 -404.45 114.45 -404.65 115.4 -404.9" fill="#ad9a5b" fill-rule="evenodd" stroke="none"/>
    <path d="M85.4 -442.35 L87.9 -442.7 92.85 -443.2 Q94.1 -443.2 94.85 -440.9 96.15 -436.9 98.0 -433.95 99.75 -430.45 100.4 -430.1 101.1 -429.7 106.75 -429.25 109.75 -428.85 110.4 -427.4 110.8 -425.2 111.4 -423.5 L114.85 -413.3 115.0 -413.4 114.8 -413.55 121.5 -413.75 122.8 -413.85 124.65 -409.1 120.9 -408.55 108.75 -406.3 103.6 -404.85 Q102.7 -405.95 101.75 -408.05 L100.15 -411.75 Q98.65 -415.8 97.75 -415.8 L95.4 -415.4 85.4 -442.35" fill="#9c8a52" fill-rule="evenodd" stroke="none"/>
    <path d="M108.75 -402.55 L101.15 -399.75 95.4 -415.4 97.75 -415.8 Q98.65 -415.8 100.15 -411.75 L101.75 -408.05 Q102.7 -405.95 103.6 -404.85 L108.75 -406.3 120.9 -408.55 124.65 -409.1 124.85 -408.6 115.25 -405.0 113.75 -404.45 111.75 -403.9 109.45 -403.25 109.8 -402.95 108.75 -402.55" fill="#8a7a49" fill-rule="evenodd" stroke="none"/>
    <path d="M124.6 -396.25 L126.55 -393.9 126.85 -393.5 127.95 -391.5 129.45 -387.6 Q130.15 -385.65 130.45 -383.1 L128.7 -383.2 127.65 -383.25 122.3 -383.0 122.1 -383.75 120.8 -387.85 Q118.85 -391.95 116.45 -395.4 L120.45 -395.9 123.2 -396.1 124.6 -396.25" fill="#91814c" fill-rule="evenodd" stroke="none"/>
    <path d="M130.45 -383.1 L130.7 -381.5 131.0 -376.65 Q130.9 -374.45 130.6 -373.15 L124.3 -372.5 124.25 -372.85 123.65 -376.2 123.5 -377.25 123.2 -378.7 122.55 -381.9 122.3 -383.0 127.65 -383.25 128.7 -383.2 130.45 -383.1" fill="#7d6f42" fill-rule="evenodd" stroke="none"/>
    <path d="M51.9 -414.35 L69.4 -409.2 101.15 -399.75 108.75 -402.55 111.65 -399.6 114.7 -395.65 114.75 -395.5 114.8 -395.5 Q117.15 -392.15 119.0 -388.1 L120.3 -384.0 120.5 -383.25 120.8 -382.15 121.55 -378.5 Q118.5 -378.05 118.15 -377.6 L118.05 -378.3 118.15 -381.95 Q117.8 -384.95 115.3 -390.0 113.55 -393.4 111.95 -395.1 L108.95 -394.7 105.75 -394.25 79.6 -401.15 77.2 -401.8 Q57.7 -407.15 50.8 -409.55 50.95 -411.15 51.9 -414.35" fill="#695c37" fill-opacity="0.39215687" fill-rule="evenodd" stroke="none"/>
  </g>
</svg>
