<?xml version="1.0" encoding="UTF-8" standalone="no"?>
<svg xmlns:xlink="http://www.w3.org/1999/xlink" height="127.9px" width="215.2px" xmlns="http://www.w3.org/2000/svg">
  <g transform="matrix(1.0, 0.0, 0.0, 1.0, 104.1, 56.65)">
    <path d="M63.6 -34.85 Q39.25 -54.95 3.15 -54.95 -39.6 -54.95 -67.75 -36.9 -96.75 -18.2 -104.1 16.55 L-104.1 -56.65 111.1 -56.65 111.1 71.25 61.2 71.25 Q72.15 63.8 79.45 51.2 88.65 35.5 88.65 17.6 88.65 -14.2 63.6 -34.85" fill="#000000" fill-rule="evenodd" stroke="none"/>
  </g>
</svg>
