<?xml version="1.0" encoding="UTF-8" standalone="no"?>
<svg xmlns:xlink="http://www.w3.org/1999/xlink" height="72.55px" width="36.0px" xmlns="http://www.w3.org/2000/svg">
  <g transform="matrix(1.0, 0.0, 0.0, 1.0, 43.25, 49.65)">
    <path d="M-12.4 -38.3 L-11.9 -38.5 -11.4 -38.7 -10.55 -38.4 -9.55 -37.95 Q-9.2 -37.7 -9.2 -37.2 -9.2 -36.0 -11.5 -36.0 -16.95 -36.0 -20.9 -41.35 -24.1 -45.7 -24.1 -49.15 L-24.05 -49.6 Q-23.1 -49.8 -22.55 -48.8 L-21.9 -47.2 -21.4 -45.6 -20.65 -44.05 Q-20.2 -42.95 -18.15 -41.05 -15.2 -38.3 -12.4 -38.3 M-9.6 4.85 L-13.75 6.1 -13.6 6.15 -11.65 7.8 Q-9.75 9.45 -9.75 10.0 -9.75 10.85 -13.35 16.6 L-15.95 20.15 Q-17.95 22.9 -18.3 22.9 -18.95 22.9 -23.45 16.05 -27.1 10.65 -27.1 9.3 L-26.95 8.7 -30.6 8.75 -38.75 8.6 Q-39.65 8.5 -40.95 7.85 L-42.6 7.45 Q-43.25 7.35 -43.25 6.75 -43.25 5.85 -41.8 5.85 -41.25 5.85 -40.1 6.35 L-36.05 6.85 -24.85 6.5 Q-20.9 6.05 -14.1 4.1 L-10.0 2.8 Q-8.75 2.1 -7.95 2.15 -7.25 2.25 -7.25 3.0 -7.25 4.05 -9.6 4.85 M-18.85 8.6 L-23.75 9.7 -22.55 11.9 -22.25 11.55 Q-21.95 11.25 -21.6 11.25 -20.85 11.25 -19.8 12.7 -18.9 13.9 -18.7 14.65 L-18.35 13.95 Q-18.15 13.65 -17.4 13.65 -16.45 13.65 -16.45 14.8 L-15.45 13.4 Q-14.75 12.5 -14.05 12.3 L-13.15 12.15 -12.6 11.65 -12.05 10.9 -11.8 10.3 Q-11.8 9.6 -13.25 8.5 -14.75 7.4 -15.8 7.55 L-18.85 8.6" fill="#000000" fill-opacity="0.17254902" fill-rule="evenodd" stroke="none"/>
  </g>
</svg>
