<?xml version="1.0" encoding="UTF-8" standalone="no"?>
<svg xmlns:xlink="http://www.w3.org/1999/xlink" height="16.45px" width="11.0px" xmlns="http://www.w3.org/2000/svg">
  <g transform="matrix(1.0, 0.0, 0.0, 1.0, 2.65, 2.55)">
    <path d="M6.95 0.9 L7.0 1.1 7.6 3.1 8.05 5.05 8.25 5.85 8.3 6.6 8.35 7.5 8.35 8.45 8.1 9.25 Q7.8 9.6 7.15 9.6 L6.7 9.5 6.65 9.45 Q5.85 9.05 5.1 7.55 L4.65 6.6 4.6 6.55 Q2.95 2.8 1.25 1.6 L0.55 1.6 0.25 2.05 0.05 1.9 0.05 1.75 0.1 1.7 Q0.7 1.2 1.15 1.05 1.25 0.95 1.45 0.95 L1.85 1.1 2.25 1.05 2.25 0.95 2.3 0.95 3.45 1.3 4.8 1.6 Q5.75 1.6 6.4 0.35 L6.65 0.0 6.95 0.9" fill="#647862" fill-rule="evenodd" stroke="none"/>
    <path d="M4.15 10.6 L4.15 10.45 4.85 8.35 4.85 8.3 4.25 7.2 4.1 6.6 3.75 6.05 2.3 4.0 Q1.45 3.2 0.25 3.1 L0.0 3.05 0.05 2.95 -0.3 2.95 -1.8 2.0 Q-2.65 1.2 -2.65 0.45 -2.65 -0.8 -0.5 -1.75 1.35 -2.55 3.1 -2.55 4.65 -2.55 5.9 -1.3 6.95 -0.2 6.95 0.7 L6.95 0.9 6.65 0.0 6.4 0.35 Q5.75 1.6 4.8 1.6 L3.45 1.3 2.3 0.95 2.25 0.95 2.25 1.05 1.85 1.1 1.45 0.95 Q1.25 0.95 1.15 1.05 0.7 1.2 0.1 1.7 L0.05 1.75 0.05 1.9 0.25 2.05 0.55 1.6 1.25 1.6 Q2.95 2.8 4.6 6.55 L4.65 6.6 5.1 7.55 Q5.85 9.05 6.65 9.45 L6.7 9.5 7.15 9.6 Q7.8 9.6 8.1 9.25 7.0 13.9 4.25 13.9 L3.3 13.65 3.45 13.15 Q3.55 12.2 4.0 10.85 L4.15 10.6" fill="#4c5c4b" fill-rule="evenodd" stroke="none"/>
    <path d="M3.45 13.15 L2.0 9.85 Q2.0 9.4 2.6 9.4 L3.55 10.0 4.15 10.6 4.0 10.85 Q3.55 12.2 3.45 13.15" fill="#2e382d" fill-rule="evenodd" stroke="none"/>
  </g>
</svg>
