<?xml version="1.0" encoding="UTF-8" standalone="no"?>
<svg xmlns:xlink="http://www.w3.org/1999/xlink" height="7.5px" width="6.95px" xmlns="http://www.w3.org/2000/svg">
  <g transform="matrix(1.0, 0.0, 0.0, 1.0, 3.45, 3.75)">
    <path d="M3.5 -3.4 L0.9 -2.95 0.85 -3.75 3.5 -3.5 3.5 -3.4 M-1.55 -2.35 L-3.4 -1.8 -3.45 -3.35 -1.55 -3.75 -1.55 -2.35" fill="#f7a809" fill-rule="evenodd" stroke="none"/>
    <path d="M3.5 -3.4 L3.4 -1.9 0.95 -0.9 0.9 -2.95 3.5 -3.4 M-3.4 -1.8 L-1.55 -2.35 -1.55 0.1 -3.3 0.8 -3.4 -1.8" fill="#f78c09" fill-rule="evenodd" stroke="none"/>
    <path d="M0.95 -0.9 L3.4 -1.9 3.25 0.35 1.0 1.1 0.95 -0.9 M-3.3 0.8 L-1.55 0.1 -1.55 1.95 -3.25 2.55 -3.3 0.8" fill="#f77b09" fill-rule="evenodd" stroke="none"/>
    <path d="M3.25 0.35 L3.0 3.35 1.05 3.6 1.0 1.1 3.25 0.35 M-3.25 2.55 L-1.55 1.95 -1.55 3.75 -3.2 3.75 -3.25 2.55" fill="#f76f09" fill-rule="evenodd" stroke="none"/>
  </g>
</svg>
