<?xml version="1.0" encoding="UTF-8" standalone="no"?>
<svg xmlns:xlink="http://www.w3.org/1999/xlink" height="65.1px" width="148.65px" xmlns="http://www.w3.org/2000/svg">
  <g transform="matrix(1.0, 0.0, 0.0, 1.0, 74.3, 32.55)">
    <path d="M24.05 -31.05 L25.05 -30.65 Q26.0 -30.2 27.15 -29.85 L27.35 -29.65 27.35 -29.55 27.85 -29.45 27.9 -29.45 28.35 -29.1 28.45 -29.1 28.65 -28.9 28.65 -28.85 29.5 -28.4 29.55 -28.4 Q30.05 -29.0 30.2 -29.85 L30.25 -29.9 30.95 -30.7 31.0 -30.8 Q31.3 -30.85 31.45 -31.05 L31.45 -31.1 Q32.8 -31.85 34.45 -31.6 35.0 -31.45 35.2 -30.95 35.95 -30.45 36.65 -30.95 L36.7 -30.95 36.5 -32.25 36.5 -32.35 37.4 -32.45 37.5 -32.45 Q37.65 -32.1 37.95 -31.9 L38.0 -31.9 Q39.05 -30.65 38.95 -28.55 L38.95 -28.5 37.9 -26.4 37.9 -26.35 37.55 -26.15 37.55 -26.05 36.9 -25.85 36.85 -25.8 Q35.95 -25.25 34.5 -25.2 34.0 -25.2 33.8 -24.85 L34.35 -24.3 34.4 -24.25 35.2 -23.65 35.2 -23.6 Q35.45 -23.45 35.75 -23.45 35.75 -23.4 35.85 -23.4 L36.5 -22.7 36.5 -22.65 37.5 -22.05 37.55 -22.05 38.05 -21.4 39.2 -20.55 39.25 -20.5 40.15 -20.0 40.75 -20.55 40.8 -20.55 41.55 -21.35 41.6 -21.4 41.8 -21.75 41.8 -21.85 44.55 -24.6 44.55 -24.65 44.85 -24.75 44.9 -24.75 45.3 -25.2 45.4 -25.2 45.75 -25.5 45.8 -25.55 46.25 -26.15 Q46.5 -26.2 46.55 -26.3 L46.6 -26.3 46.85 -26.55 46.85 -26.6 Q47.35 -26.8 47.8 -27.15 L47.9 -27.15 49.2 -28.1 49.25 -28.1 49.9 -28.5 49.95 -28.5 50.1 -28.7 50.1 -28.75 52.0 -29.55 52.05 -29.55 52.3 -29.8 52.35 -29.85 56.3 -31.3 56.95 -31.45 56.95 -31.5 60.95 -31.9 61.5 -32.0 64.9 -31.75 68.2 -31.1 69.3 -30.8 69.9 -30.3 69.95 -30.25 70.15 -30.05 70.2 -30.05 70.95 -29.65 71.0 -29.55 71.85 -28.85 71.9 -28.75 73.6 -26.9 73.65 -26.8 73.95 -26.45 74.0 -26.4 74.15 -25.5 74.1 -25.45 Q74.45 -24.75 74.35 -23.6 L74.2 -21.75 74.0 -21.5 73.8 -20.9 73.8 -20.85 73.3 -20.3 73.3 -20.2 72.4 -19.85 72.4 -19.8 70.65 -20.05 70.65 -20.1 70.3 -20.35 70.25 -20.4 Q69.75 -21.1 69.9 -22.1 L69.95 -22.1 70.3 -22.45 70.3 -22.5 Q71.45 -22.7 72.0 -21.95 L72.0 -21.9 72.65 -22.05 72.7 -22.1 Q73.45 -23.5 73.0 -25.25 L73.0 -25.35 72.8 -25.55 72.7 -25.55 72.6 -26.05 72.6 -26.15 72.25 -26.55 72.25 -26.6 Q70.45 -27.85 67.5 -27.55 L67.45 -27.5 67.2 -27.35 67.2 -27.3 Q65.15 -26.65 63.35 -25.8 L63.3 -25.75 Q63.25 -25.5 62.95 -25.45 L62.85 -25.45 61.95 -24.8 61.95 -24.75 61.25 -24.35 61.25 -24.3 60.85 -24.1 60.8 -24.05 60.25 -23.65 60.2 -23.65 59.95 -23.45 59.85 -23.4 59.35 -22.75 58.9 -22.5 58.85 -22.5 58.05 -21.75 58.0 -21.75 57.4 -21.2 57.35 -21.2 56.55 -20.35 55.1 -19.3 54.4 -18.6 Q53.5 -18.35 52.95 -17.75 L52.85 -17.7 52.4 -17.6 52.35 -17.6 52.05 -17.35 52.05 -17.3 50.75 -17.05 50.7 -17.05 Q49.9 -16.6 48.6 -16.55 L46.25 -16.45 45.25 -14.9 45.2 -14.9 45.05 -14.4 45.05 -14.35 44.3 -13.5 44.25 -13.5 43.55 -12.6 43.5 -12.6 42.0 -10.6 42.0 -10.5 41.45 -10.1 41.4 -10.1 40.35 -9.1 40.35 -9.05 39.9 -8.8 39.8 -8.8 39.6 -8.55 39.6 -8.5 39.15 -8.15 39.1 -8.1 38.8 -7.9 38.75 -7.85 Q35.9 -6.3 31.7 -5.95 L31.4 -6.05 31.35 -6.05 Q30.7 -6.1 30.2 -5.65 L30.15 -5.65 Q30.05 -5.25 30.1 -4.6 L30.1 -4.55 28.95 -1.55 28.95 -1.5 Q28.5 -1.15 28.35 -0.5 L28.35 -0.4 28.15 -0.2 28.1 -0.2 27.7 0.55 27.7 0.6 27.4 0.9 27.35 0.9 26.95 1.4 26.9 1.4 26.05 2.25 26.0 2.25 25.25 3.0 25.2 3.0 24.85 3.4 24.8 3.4 24.2 4.0 24.1 4.0 23.9 4.2 23.9 4.3 23.6 4.4 23.55 4.4 23.05 4.95 23.05 5.05 Q22.45 5.2 22.05 5.5 L22.0 5.5 20.8 6.3 20.75 6.35 20.55 6.6 20.5 6.6 Q20.1 6.7 19.9 7.05 L19.8 7.1 16.1 8.95 16.05 8.95 Q14.15 10.15 12.0 11.0 L11.9 11.0 11.65 11.2 11.65 11.3 11.35 11.35 11.2 11.35 11.05 11.55 11.05 11.65 Q9.6 12.2 8.4 13.0 L8.35 13.0 8.15 13.25 8.1 13.3 7.65 13.45 7.6 13.45 7.25 13.8 7.2 13.8 6.8 14.2 6.75 14.25 6.55 14.85 6.55 14.95 Q6.0 15.05 5.9 15.75 L5.75 16.95 5.7 17.0 Q5.75 17.9 5.95 18.55 L5.95 18.65 Q6.35 18.8 6.35 19.25 L6.35 19.3 7.15 20.3 7.2 20.3 8.05 20.75 8.1 20.8 8.35 21.0 8.35 21.05 9.6 21.5 9.65 21.55 11.4 21.5 11.45 21.5 12.8 20.75 12.9 20.7 13.2 20.35 13.2 20.3 13.85 19.85 13.9 19.85 14.35 18.85 14.4 18.8 14.95 18.4 14.95 18.45 Q15.7 19.3 15.25 20.75 L14.65 22.25 14.2 22.65 13.85 23.15 13.8 23.15 13.55 23.95 13.55 24.0 12.8 24.7 12.8 24.75 12.35 25.15 12.35 25.25 Q11.95 25.4 11.75 25.65 L11.65 25.7 11.0 25.8 10.85 25.8 Q10.0 26.35 8.4 26.2 L8.35 26.2 Q7.7 25.8 7.25 25.9 L7.2 25.9 Q6.8 26.85 6.8 27.9 L6.75 28.4 Q6.45 29.8 5.8 30.9 L4.95 31.8 4.9 31.9 3.85 32.4 0.4 32.55 0.35 32.55 0.2 32.5 Q-0.15 32.25 -0.6 32.15 L-0.65 32.1 -1.25 31.6 -1.3 31.6 -2.05 30.95 -2.05 30.9 -2.8 29.85 -3.2 28.5 -3.25 28.5 Q-3.2 26.7 -3.8 25.7 L-3.8 25.55 Q-4.45 25.65 -4.65 26.1 L-4.7 26.1 -7.45 26.75 -7.5 26.75 -10.75 25.9 Q-11.3 25.8 -11.75 25.5 L-12.3 24.9 -12.35 24.8 -12.65 24.35 -12.7 24.35 -13.1 23.6 -13.45 21.5 -13.45 21.4 -12.85 19.95 -12.75 19.9 -12.3 19.6 -12.25 19.6 Q-11.85 19.65 -11.7 19.9 L-11.65 19.9 -11.1 20.5 -11.05 20.6 -10.65 20.7 -10.6 20.7 -10.3 21.0 -10.3 21.05 Q-8.75 21.7 -6.7 21.65 L-6.6 21.65 -5.9 21.45 -5.85 21.4 -5.5 21.1 -5.45 21.05 -4.55 20.3 -4.5 20.3 Q-3.65 19.25 -3.75 17.5 L-3.75 17.4 -4.15 16.5 Q-4.2 16.25 -4.45 16.35 -4.5 15.85 -4.85 15.75 L-4.95 15.75 -5.15 15.45 -5.2 15.45 -5.35 15.2 -5.35 15.15 -5.85 14.7 -5.85 14.65 -6.25 14.4 -6.25 14.3 Q-6.9 13.9 -7.6 13.65 L-7.7 13.65 -8.15 13.3 -8.2 13.3 -9.75 12.3 -9.8 12.25 Q-10.95 11.7 -12.2 11.2 L-12.25 11.2 Q-15.65 9.6 -19.25 8.35 L-19.3 8.3 -19.55 8.05 -21.0 7.25 -21.0 7.2 -21.6 6.85 -21.6 6.8 -22.15 6.65 -22.2 6.6 Q-22.2 6.4 -22.35 6.35 L-23.05 5.95 -23.1 5.9 -23.55 5.5 -23.6 5.5 -24.2 5.05 -24.25 5.05 -25.55 3.55 -25.65 3.5 -25.75 3.25 -25.75 3.15 -26.15 2.75 -26.15 2.7 Q-27.3 1.2 -28.05 -0.7 L-28.65 -2.7 Q-28.95 -3.85 -28.6 -4.95 -28.65 -5.85 -29.2 -6.35 L-29.25 -6.35 -30.4 -6.0 -31.55 -5.85 -31.55 -5.95 -31.6 -5.95 -33.45 -6.05 -34.25 -6.1 -37.8 -7.4 -37.85 -7.4 -38.1 -7.65 -38.1 -7.7 -39.05 -8.25 -39.1 -8.3 -39.65 -8.8 -40.35 -9.35 -40.45 -9.35 -41.0 -9.85 -41.1 -9.85 -42.7 -11.55 -42.9 -11.85 -42.9 -11.9 -43.55 -12.6 -43.6 -12.6 -44.0 -13.2 -44.05 -13.2 -44.25 -13.7 -44.25 -13.8 Q-44.5 -13.75 -44.5 -13.95 L-44.55 -13.95 Q-44.7 -14.65 -45.0 -15.1 L-45.0 -15.15 -48.1 -15.25 -48.2 -15.25 -52.6 -16.95 -52.65 -16.95 -52.9 -17.2 -52.9 -17.25 Q-53.3 -17.25 -53.4 -17.5 L-53.4 -17.6 -53.9 -17.75 -53.95 -17.75 Q-54.5 -18.25 -55.2 -18.55 L-55.25 -18.6 Q-55.25 -18.9 -55.6 -18.9 L-55.65 -18.95 -56.0 -19.25 -56.05 -19.3 -56.85 -20.05 -56.85 -20.1 -57.15 -20.2 -57.2 -20.2 Q-57.3 -20.55 -57.65 -20.6 L-57.7 -20.7 Q-57.7 -20.9 -58.0 -20.9 L-58.05 -20.9 -58.25 -21.25 -58.35 -21.25 -59.0 -21.7 -59.1 -21.75 -59.7 -22.3 -59.75 -22.3 Q-59.8 -22.65 -60.15 -22.7 L-60.25 -22.75 -60.65 -23.2 -60.65 -23.25 Q-60.85 -23.25 -60.95 -23.4 L-61.2 -23.7 -61.5 -23.9 -61.55 -23.9 -61.7 -24.1 -61.75 -24.2 -62.2 -24.3 -62.25 -24.3 -62.8 -25.05 -62.85 -25.05 -64.25 -25.85 -64.3 -25.9 -64.45 -26.05 -64.55 -26.15 Q-66.25 -27.0 -68.7 -27.05 L-68.75 -27.05 Q-69.25 -26.7 -69.9 -26.6 L-70.05 -26.6 -70.2 -26.3 -70.25 -26.3 Q-70.6 -26.4 -70.85 -26.05 L-70.85 -26.0 Q-71.3 -25.95 -71.45 -25.6 L-71.45 -25.55 Q-72.05 -25.2 -72.3 -24.35 -72.45 -23.2 -72.1 -22.3 L-72.1 -22.25 Q-71.75 -22.05 -71.55 -21.85 L-71.55 -21.75 -70.9 -21.5 -70.85 -21.5 -70.15 -21.65 -70.15 -21.6 -69.6 -22.05 -69.5 -22.1 Q-69.0 -22.3 -68.75 -22.85 L-68.75 -22.9 -67.85 -22.95 -67.8 -22.95 Q-67.5 -22.4 -67.8 -21.9 L-67.8 -21.85 -68.75 -20.85 -68.85 -20.85 -69.45 -20.3 -69.45 -20.2 -70.2 -20.05 -72.0 -20.2 -72.1 -20.2 -73.25 -20.9 -73.3 -20.9 -73.6 -21.3 -73.6 -21.35 Q-73.75 -21.35 -73.9 -21.5 L-73.95 -21.5 Q-74.4 -22.9 -74.25 -24.9 L-74.25 -25.0 Q-73.9 -25.45 -73.8 -26.15 L-73.8 -26.25 -72.75 -28.0 -72.7 -28.0 -71.95 -28.9 -71.85 -28.9 Q-71.6 -29.3 -71.05 -29.35 L-71.05 -29.4 Q-70.85 -29.8 -70.25 -29.85 L-70.25 -29.8 Q-70.1 -30.1 -69.45 -30.25 L-69.4 -30.25 -68.85 -30.8 -68.85 -30.85 Q-67.8 -30.9 -67.1 -31.25 L-66.4 -31.25 Q-65.6 -31.75 -64.35 -31.85 L-63.5 -31.85 -62.4 -31.85 -62.25 -31.9 -62.1 -31.9 -58.2 -31.6 -54.35 -31.2 -52.55 -30.65 Q-51.05 -30.4 -49.85 -29.8 L-47.5 -28.65 -47.3 -28.35 -46.95 -28.15 -46.95 -28.1 -46.05 -27.55 -46.05 -27.5 -45.5 -27.3 -45.4 -27.3 -44.5 -26.35 -44.45 -26.3 -43.05 -25.15 -43.0 -25.1 -41.75 -23.55 -41.7 -23.5 -41.4 -23.4 -41.35 -23.3 -40.05 -21.85 -39.95 -21.85 -39.7 -21.4 -39.65 -21.4 -39.5 -21.15 -39.5 -21.1 -39.2 -20.85 -39.15 -20.85 -38.75 -20.2 -38.75 -20.15 -38.15 -19.65 -38.1 -19.65 -37.6 -20.1 -37.55 -20.1 -35.9 -21.85 -35.85 -21.85 -35.2 -22.55 -35.15 -22.55 -35.05 -22.85 -35.05 -22.9 Q-34.85 -22.9 -34.75 -23.05 L-34.7 -23.05 -32.7 -25.35 -32.7 -25.4 Q-33.75 -24.9 -35.05 -24.9 L-35.1 -24.9 -36.15 -25.1 -36.2 -25.1 Q-36.7 -25.45 -37.35 -25.6 L-37.4 -25.6 -37.75 -25.95 -37.8 -25.95 -37.9 -26.25 -37.9 -26.3 -38.7 -27.2 -38.75 -27.3 -39.0 -27.7 -39.05 -27.7 Q-39.45 -29.55 -38.7 -31.2 L-38.7 -31.25 -38.35 -31.5 -38.2 -31.85 -38.2 -31.9 -37.8 -32.4 -37.8 -32.45 -37.0 -32.45 -36.45 -31.3 -36.3 -30.85 -36.0 -30.5 Q-35.45 -30.2 -34.8 -30.5 L-34.75 -30.5 -34.35 -30.85 -34.35 -30.9 -34.05 -31.5 -34.05 -31.6 -33.7 -31.9 -33.7 -32.0 -33.3 -32.25 -33.3 -32.35 Q-31.75 -32.85 -30.6 -32.05 L-29.85 -31.5 Q-28.95 -29.95 -29.6 -28.1 L-29.55 -28.1 Q-28.65 -28.0 -28.0 -28.55 -27.35 -29.0 -26.5 -29.25 -25.65 -29.9 -24.5 -30.3 L-22.4 -30.85 -22.0 -30.9 -19.55 -31.45 -19.2 -31.5 -11.65 -31.2 -10.55 -30.9 -10.5 -30.9 -8.2 -29.8 -8.2 -29.75 -6.85 -29.25 -6.8 -29.15 -6.15 -28.7 -6.1 -28.7 -5.95 -28.5 -5.9 -28.4 -5.55 -28.3 -5.5 -28.3 -5.1 -27.95 -5.05 -27.95 -4.55 -27.55 -4.5 -27.5 -3.7 -26.6 -2.85 -25.25 -2.8 -25.2 -2.2 -24.65 -2.2 -24.6 Q-2.1 -24.0 -1.7 -23.7 L-1.7 -23.65 -1.35 -23.15 -1.3 -23.15 0.2 -19.6 0.55 -18.8 1.0 -20.35 1.0 -20.4 Q1.7 -21.5 2.1 -22.9 L2.15 -22.9 2.8 -23.85 2.8 -23.9 3.2 -24.45 3.2 -24.5 3.5 -24.75 3.6 -24.75 4.6 -26.3 4.55 -26.35 Q4.85 -26.75 5.45 -26.8 L5.55 -26.8 Q5.95 -27.1 5.9 -27.5 L5.9 -27.6 Q6.4 -27.4 6.6 -27.8 L6.6 -27.85 Q6.95 -28.0 7.15 -28.3 L7.2 -28.35 7.5 -28.6 7.55 -28.65 9.4 -29.55 9.45 -29.55 9.6 -29.8 9.65 -29.85 11.0 -30.45 11.05 -30.45 Q12.65 -31.4 14.9 -31.8 L15.7 -32.0 18.65 -32.15 19.0 -32.2 19.25 -32.35 20.95 -31.8 20.95 -31.85 Q22.65 -31.75 24.05 -31.05 M-19.85 -29.9 L-19.9 -29.9 Q-22.75 -29.15 -25.3 -28.0 L-25.2 -27.95 Q-25.05 -27.4 -24.5 -27.15 L-24.4 -27.15 Q-23.05 -27.05 -22.0 -27.5 L-22.0 -27.55 Q-21.85 -27.8 -21.55 -27.85 L-21.55 -27.9 -21.4 -28.2 -21.3 -28.25 -20.3 -28.9 -20.3 -29.0 -19.85 -29.9 M-57.65 -28.5 Q-57.95 -28.9 -58.55 -28.9 L-59.5 -29.1 -59.55 -29.1 -60.1 -29.1 -60.1 -29.15 -60.4 -29.35 -60.45 -29.35 Q-61.5 -29.55 -62.45 -29.35 L-62.6 -29.35 -62.7 -29.4 -64.35 -29.35 -66.4 -29.1 Q-67.55 -29.0 -68.2 -28.4 L-65.85 -28.25 -63.65 -27.8 -63.65 -27.75 Q-63.5 -27.5 -63.15 -27.45 L-63.1 -27.4 -61.95 -26.6 -61.95 -26.55 -61.45 -26.15 -61.35 -26.15 -60.9 -25.6 -60.85 -25.6 -60.25 -25.1 -60.15 -25.1 -59.7 -24.65 -59.65 -24.65 Q-59.55 -24.5 -59.35 -24.5 L-59.3 -24.45 -58.1 -23.15 -58.05 -23.1 -57.4 -22.8 -57.4 -22.75 -57.0 -22.25 -56.95 -22.25 Q-56.2 -21.9 -55.7 -21.35 L-55.65 -21.3 Q-55.05 -21.1 -54.7 -20.55 L-54.65 -20.55 -54.05 -20.1 -53.95 -20.1 Q-53.4 -19.85 -53.05 -19.4 L-53.0 -19.4 -52.55 -19.2 -52.3 -18.95 -52.25 -18.9 -51.7 -18.75 -51.7 -18.65 -51.5 -18.45 -51.45 -18.45 Q-50.95 -18.15 -50.4 -18.0 L-50.35 -17.9 -50.2 -17.7 -50.15 -17.7 -49.45 -17.6 -49.4 -17.5 Q-47.95 -16.65 -46.1 -16.7 L-46.1 -16.8 Q-46.2 -18.1 -47.05 -19.15 L-47.1 -19.15 -47.55 -20.0 -47.6 -20.0 -47.9 -20.4 -47.95 -20.4 -48.25 -20.8 -48.3 -20.8 -48.9 -21.5 -49.0 -21.55 -49.2 -22.1 -49.9 -22.9 -49.95 -22.9 -50.3 -23.25 -50.35 -23.3 -50.8 -24.2 -50.85 -24.2 -52.3 -25.45 -52.3 -25.5 -52.95 -26.15 -53.0 -26.2 -53.5 -26.65 -53.55 -26.65 -54.1 -27.05 -54.2 -27.05 -54.95 -27.3 -54.95 -27.35 Q-55.9 -28.25 -57.65 -28.5 M64.7 -28.0 L65.55 -28.25 68.25 -28.85 68.25 -28.9 Q67.4 -29.95 65.8 -29.55 L65.7 -29.65 64.7 -29.85 61.95 -29.4 59.25 -28.85 54.9 -27.05 54.9 -27.0 Q54.65 -27.05 54.7 -26.75 L54.6 -26.75 Q54.2 -26.75 54.05 -26.4 L54.0 -26.4 53.45 -26.3 53.45 -26.25 52.8 -25.6 52.75 -25.6 52.2 -25.35 52.2 -25.25 Q52.1 -25.0 51.8 -25.0 L51.8 -24.9 51.3 -24.3 51.25 -24.3 50.9 -23.95 50.85 -23.95 50.55 -23.85 50.5 -23.8 50.0 -23.25 50.0 -23.2 49.9 -22.85 49.85 -22.85 49.1 -21.85 48.75 -21.5 48.75 -21.4 48.6 -21.1 48.55 -21.0 48.05 -20.7 48.05 -20.55 Q48.05 -20.1 47.65 -20.0 L47.65 -19.95 47.55 -19.4 47.5 -19.4 47.25 -19.2 47.25 -19.15 46.95 -18.5 46.95 -18.4 48.15 -18.15 48.2 -18.15 51.4 -18.95 Q51.6 -19.2 52.0 -19.3 L52.35 -19.65 52.4 -19.65 52.75 -19.7 52.75 -19.75 53.65 -20.2 53.65 -20.3 54.05 -20.55 54.05 -20.6 54.25 -20.9 54.3 -20.95 54.6 -21.1 54.65 -21.15 Q54.9 -21.55 55.3 -21.75 L55.35 -21.75 Q55.45 -22.1 55.85 -22.25 L55.85 -22.3 56.65 -22.9 56.7 -22.95 57.5 -23.55 57.5 -23.6 59.4 -24.9 59.45 -25.0 59.85 -25.2 59.85 -25.25 Q59.95 -25.5 60.2 -25.45 L60.2 -25.5 60.4 -25.75 60.45 -25.75 Q61.25 -26.15 61.95 -26.65 L62.0 -26.65 Q62.75 -26.9 63.2 -27.4 L64.7 -28.0 M0.9 -9.45 L0.9 -9.35 Q0.65 -9.05 0.7 -8.45 L0.65 -8.45 0.2 -6.95 -0.5 -4.25 -0.5 -4.2 Q-0.55 -2.3 -0.25 -0.85 L-0.2 -0.85 0.2 -0.45 0.3 -0.4 0.35 -0.4 Q1.05 -0.55 1.55 -0.85 L1.65 -0.85 2.1 -1.4 2.1 -1.45 2.2 -1.8 2.25 -1.8 2.5 -2.1 2.5 -2.15 2.4 -4.85 2.3 -4.85 2.15 -5.05 2.15 -5.2 Q1.75 -7.55 0.9 -9.45 M9.85 -28.1 L9.85 -28.0 8.65 -27.4 8.55 -27.35 7.95 -26.65 7.9 -26.65 7.7 -26.15 7.65 -26.15 7.1 -25.55 7.0 -25.5 6.7 -25.25 6.7 -25.2 5.55 -24.2 5.55 -24.1 Q5.05 -23.8 4.9 -23.15 L4.85 -23.1 4.15 -22.5 4.15 -22.45 Q3.8 -22.0 3.6 -21.35 L3.6 -21.3 4.5 -21.5 4.5 -21.55 5.55 -22.05 5.6 -22.05 10.7 -21.75 10.7 -21.7 12.25 -20.8 12.3 -20.75 13.55 -19.4 13.55 -19.35 13.8 -18.95 13.85 -18.9 14.1 -18.75 14.1 -18.65 14.3 -18.0 14.3 -17.9 14.4 -15.85 14.35 -15.8 13.55 -13.6 13.3 -13.45 13.3 -13.35 13.1 -12.75 13.05 -12.7 12.45 -12.15 12.45 -12.05 Q12.2 -10.8 12.4 -9.35 L12.45 -9.35 12.8 -8.7 12.9 -8.7 13.3 -8.15 13.35 -8.15 17.5 -7.85 17.5 -7.9 18.1 -8.3 18.15 -8.35 18.45 -8.65 18.5 -8.65 Q18.8 -9.7 18.45 -10.85 L18.4 -10.85 17.85 -11.15 17.8 -11.2 17.35 -11.75 17.3 -11.75 16.9 -11.9 16.85 -11.9 Q16.3 -12.65 16.6 -13.5 18.25 -13.9 19.05 -13.1 L19.15 -13.05 19.75 -12.65 19.75 -12.6 20.5 -11.75 20.55 -11.65 Q21.0 -10.25 20.95 -8.45 L20.9 -8.4 Q20.55 -8.0 20.5 -7.25 L20.5 -7.2 Q19.95 -6.3 19.05 -5.65 L19.0 -5.65 18.65 -5.3 16.85 -4.25 Q15.95 -3.8 14.6 -3.7 11.95 -3.45 10.0 -4.4 L10.0 -4.45 9.8 -4.65 9.7 -4.65 9.25 -4.9 9.2 -4.9 7.9 -5.75 7.85 -5.8 7.7 -6.1 7.65 -6.15 6.75 -6.95 Q6.6 -6.7 6.75 -6.2 L6.8 -6.15 7.35 -5.6 7.35 -5.55 7.7 -5.05 7.7 -5.0 7.95 -4.4 Q8.5 -3.7 8.85 -2.7 L9.2 -0.6 Q9.2 1.8 7.75 2.95 L7.7 2.95 7.35 3.3 7.3 3.3 6.4 3.75 6.35 3.75 5.55 3.8 5.55 3.95 4.95 6.2 4.65 6.4 4.65 6.45 4.5 7.15 4.45 7.15 3.8 7.7 3.8 7.8 3.6 8.25 3.5 8.25 Q3.3 8.4 3.25 8.75 L3.2 8.75 2.9 9.1 Q2.3 9.75 2.05 10.65 1.8 11.65 1.1 12.2 L1.05 12.15 Q0.7 11.95 0.75 11.35 L0.7 11.35 0.3 10.15 0.25 10.1 0.2 10.05 -0.4 9.2 -0.5 9.2 -0.9 8.75 -0.95 8.7 -1.25 8.4 -1.25 8.35 -1.6 8.25 -1.6 8.2 -2.8 7.05 -2.85 6.9 -3.15 6.6 Q-3.6 5.9 -3.65 4.85 L-3.75 3.1 -3.8 3.1 Q-4.2 3.0 -4.65 3.35 L-4.7 3.35 -5.2 3.35 -5.25 3.3 -6.05 2.95 -6.05 2.9 -6.9 2.05 -7.0 2.0 -7.4 1.4 -7.4 1.35 Q-7.85 -2.55 -5.75 -4.9 L-5.75 -4.95 -5.35 -5.35 -5.35 -5.4 -5.1 -5.7 -5.1 -5.75 -4.5 -6.4 -4.5 -6.45 -3.8 -7.35 -3.8 -7.4 -3.35 -8.7 -3.4 -8.7 Q-3.7 -8.35 -4.1 -8.1 L-4.1 -8.05 -4.5 -7.65 -4.55 -7.6 -5.5 -6.45 -5.55 -6.45 -5.85 -6.35 -5.85 -6.3 -6.35 -5.75 -6.4 -5.75 -6.85 -5.6 -6.85 -5.55 -7.1 -5.3 -7.15 -5.3 -8.55 -4.85 Q-9.25 -4.35 -10.3 -4.05 L-12.3 -3.85 -12.55 -3.9 Q-15.0 -3.6 -16.8 -4.4 L-16.8 -4.45 -17.0 -4.65 -17.1 -4.65 -17.7 -4.95 -17.7 -5.0 -18.05 -5.35 -18.05 -5.4 -18.2 -5.95 -18.3 -5.95 Q-19.25 -7.1 -19.25 -9.2 L-19.25 -9.25 -18.85 -10.45 -18.8 -10.45 Q-18.55 -10.6 -18.55 -10.85 L-18.5 -10.9 -18.2 -11.15 -18.2 -11.2 Q-17.8 -12.0 -16.85 -12.3 L-16.85 -12.25 Q-16.4 -11.55 -16.8 -10.6 L-16.8 -10.5 -16.4 -9.05 -16.35 -9.05 Q-16.0 -8.95 -16.0 -8.7 L-15.95 -8.7 Q-14.6 -7.9 -12.65 -7.75 L-12.65 -7.85 Q-12.35 -7.75 -12.35 -8.0 L-12.3 -8.0 -11.7 -8.0 -11.7 -8.05 -11.3 -8.3 -11.2 -8.3 -10.7 -8.85 -10.7 -8.9 Q-10.35 -9.6 -10.35 -10.7 L-10.4 -10.7 -11.0 -11.55 -11.0 -11.6 -11.15 -11.95 -11.15 -12.0 -11.5 -12.3 -11.5 -12.4 -11.55 -12.75 -11.85 -13.0 -12.15 -14.1 -12.2 -14.5 Q-12.7 -17.2 -11.85 -19.15 L-11.8 -19.15 Q-11.55 -19.25 -11.55 -19.55 L-11.5 -19.6 -10.3 -20.9 -10.25 -20.95 Q-9.8 -21.3 -9.2 -21.5 L-9.2 -21.55 -9.0 -21.75 -7.3 -22.3 -6.15 -22.35 -3.25 -22.1 -3.2 -22.1 Q-3.3 -22.9 -3.7 -23.5 L-3.75 -23.5 -4.1 -23.9 -4.1 -23.95 -4.4 -24.3 -4.4 -24.35 Q-4.55 -24.8 -4.85 -25.1 L-4.9 -25.2 -5.65 -25.9 -5.65 -25.95 -6.1 -26.3 -6.1 -26.35 -6.7 -27.0 -6.75 -27.0 -7.25 -27.3 -7.3 -27.35 Q-7.55 -27.8 -8.2 -27.95 L-8.4 -28.2 -8.45 -28.25 -10.25 -28.85 -10.25 -28.75 Q-9.9 -26.3 -11.05 -25.0 L-11.05 -24.9 -11.3 -24.35 -11.85 -24.05 -12.05 -23.85 -12.1 -23.85 Q-13.9 -23.15 -16.0 -23.4 L-16.45 -22.85 -16.45 -22.8 Q-16.65 -22.0 -16.35 -21.4 L-16.25 -21.35 -15.7 -21.0 -15.7 -20.95 Q-15.4 -20.75 -15.45 -20.45 L-15.55 -20.45 Q-15.8 -19.95 -16.45 -19.8 L-16.5 -19.8 -17.35 -19.75 -17.35 -19.8 -18.15 -20.0 -18.95 -20.2 -19.05 -20.3 -19.65 -20.55 -19.7 -20.6 -20.5 -21.35 -21.05 -22.15 -21.1 -22.15 -21.55 -22.5 -21.95 -21.25 -22.0 -21.25 -22.3 -20.85 -22.35 -20.85 -22.75 -20.4 -22.8 -20.35 Q-23.65 -19.8 -24.65 -19.35 L-24.7 -19.35 Q-25.5 -19.25 -26.1 -18.85 L-26.1 -18.8 -26.45 -18.4 -26.45 -18.35 -26.45 -17.3 -26.45 -17.25 -25.75 -16.7 -25.75 -16.65 Q-25.55 -16.5 -25.65 -16.2 L-25.7 -15.95 Q-26.6 -15.4 -27.8 -15.15 L-27.85 -15.15 Q-29.3 -15.15 -30.5 -15.7 L-30.5 -15.75 -30.95 -16.05 -30.95 -16.1 -31.3 -16.35 -31.3 -16.45 -31.7 -16.9 -31.75 -16.9 Q-31.8 -17.4 -32.2 -17.7 L-32.3 -18.05 -32.5 -18.8 Q-32.55 -19.55 -32.9 -20.0 L-32.9 -20.05 -32.75 -20.7 -32.8 -20.7 -32.7 -23.05 -32.75 -23.05 Q-33.45 -22.65 -33.75 -21.95 L-33.85 -21.9 -36.2 -19.4 -36.25 -19.4 Q-36.35 -19.3 -36.55 -19.3 L-36.6 -19.25 Q-36.75 -18.95 -37.05 -18.8 L-37.05 -18.75 -36.55 -17.35 -36.45 -17.35 Q-36.05 -16.95 -35.8 -16.35 L-35.7 -16.35 -34.9 -15.55 -34.8 -15.55 -34.6 -15.4 -34.5 -15.35 -33.9 -14.7 -33.85 -14.7 -33.55 -14.6 -33.5 -14.55 -33.1 -14.25 -33.1 -14.2 -32.9 -13.95 -32.85 -13.95 -32.35 -13.8 -32.35 -13.75 -32.15 -13.5 -30.5 -12.7 Q-29.75 -12.3 -28.6 -12.2 L-28.55 -12.15 -24.95 -11.85 Q-22.95 -12.05 -21.45 -12.8 L-19.3 -13.45 -19.35 -13.35 Q-19.5 -12.55 -20.1 -12.15 L-20.1 -12.05 -20.3 -11.55 -20.35 -11.55 -20.65 -11.25 -20.65 -11.2 -21.4 -9.15 -21.45 -9.1 Q-21.8 -6.85 -21.4 -4.4 -20.6 -1.95 -19.45 0.0 L-19.35 0.05 -18.75 0.65 -18.75 0.7 Q-18.7 1.3 -18.2 1.35 L-18.2 1.4 -16.45 3.0 -16.45 3.1 -14.85 4.65 -14.8 4.65 -13.75 5.2 -13.75 5.25 Q-13.65 5.5 -13.4 5.5 L-13.35 5.5 -12.9 5.9 -12.85 5.95 Q-12.55 6.35 -12.05 6.45 L-12.05 6.5 -11.85 6.75 -11.8 6.75 -10.9 7.2 -10.9 7.25 -10.65 7.5 -10.6 7.5 -9.95 7.7 -9.95 7.8 -9.5 8.05 -9.5 8.15 -8.75 8.55 -8.7 8.6 -8.2 8.95 -8.2 9.0 -7.95 9.2 -7.9 9.2 -7.5 9.35 -7.5 9.4 Q-7.2 9.6 -7.05 9.9 L-6.9 9.9 Q-6.25 10.15 -5.85 10.7 L-5.75 10.75 -5.5 10.9 -5.5 10.95 -5.05 11.3 -5.05 11.35 Q-4.55 11.55 -4.4 11.95 L-4.35 11.95 Q-4.15 11.95 -4.05 12.1 L-4.05 12.15 -3.15 13.25 Q-2.75 13.25 -2.75 13.65 L-2.65 13.65 -2.1 13.9 -2.1 14.0 Q-1.95 14.15 -1.95 14.45 L-1.85 14.45 -1.3 15.05 -1.3 15.15 -0.7 16.0 -0.7 16.05 0.2 17.55 0.5 18.15 0.5 18.2 0.35 20.8 0.2 21.2 0.1 21.8 0.0 23.5 Q-0.05 24.4 0.2 25.05 L0.7 25.9 0.7 25.95 2.45 25.75 2.45 25.7 2.85 25.15 2.85 25.1 3.05 24.5 2.5 21.5 2.25 19.6 Q2.1 16.8 3.25 14.85 L3.25 14.8 3.85 13.4 3.9 13.4 4.25 12.9 4.35 12.85 4.65 12.2 4.8 12.15 5.0 11.75 5.15 11.75 5.35 11.65 5.4 11.55 7.4 9.6 7.5 9.55 8.25 8.8 Q8.35 8.65 8.55 8.65 L8.55 8.6 8.9 8.15 8.95 8.15 9.8 7.55 9.85 7.55 10.65 6.75 10.7 6.75 11.1 6.5 11.1 6.45 11.75 6.0 11.8 5.95 12.25 5.75 12.3 5.7 12.75 5.2 12.8 5.2 13.15 5.1 13.15 5.05 13.4 4.8 13.45 4.8 13.9 4.5 13.9 4.45 14.3 4.3 14.35 4.2 14.55 4.0 14.6 4.0 Q14.9 3.8 15.25 3.7 L15.25 3.65 Q15.35 3.35 15.7 3.35 L15.75 3.3 Q15.9 2.95 16.4 2.9 L16.45 2.85 Q16.5 2.5 16.9 2.45 L16.9 2.4 Q17.0 2.15 17.35 2.05 L17.35 2.0 17.7 1.75 17.7 1.7 17.85 1.4 Q18.1 1.15 18.45 1.0 L18.5 0.95 18.6 0.65 18.65 0.65 19.4 -0.2 19.45 -0.25 19.95 -0.85 20.15 -1.05 20.2 -1.1 20.35 -1.45 20.4 -1.45 20.6 -1.65 20.6 -1.75 21.5 -2.95 21.5 -3.0 21.75 -3.3 21.75 -3.35 Q21.75 -3.9 22.15 -4.15 L22.15 -4.2 22.45 -4.9 22.5 -4.9 22.75 -5.05 22.75 -5.2 23.05 -5.85 Q23.15 -7.2 23.4 -8.35 23.65 -9.6 23.25 -10.7 23.5 -10.75 23.45 -11.1 L23.45 -12.15 23.45 -12.2 Q23.1 -12.55 23.4 -12.95 L23.9 -13.05 25.2 -12.95 29.05 -12.7 31.05 -13.05 34.15 -14.0 34.15 -14.1 34.85 -14.65 34.9 -14.65 35.45 -14.9 35.45 -14.95 35.6 -15.15 35.65 -15.15 36.0 -15.3 36.05 -15.35 37.65 -17.1 37.7 -17.2 Q38.2 -17.4 38.35 -17.9 L38.4 -17.9 Q38.95 -18.25 39.1 -18.85 L39.1 -18.9 Q38.6 -19.15 38.3 -19.55 L38.25 -19.6 37.3 -20.15 37.3 -20.2 36.7 -20.85 36.65 -20.85 35.5 -21.85 35.5 -21.9 Q35.0 -22.25 34.6 -22.55 L34.55 -22.55 Q34.05 -22.85 33.8 -23.4 L33.75 -23.45 Q33.4 -23.8 33.05 -23.7 L33.05 -21.55 Q32.95 -19.8 32.15 -18.6 L32.1 -18.55 31.0 -17.25 30.95 -17.2 30.3 -16.9 30.3 -16.85 30.1 -16.55 30.05 -16.5 29.65 -16.1 29.1 -15.95 27.95 -15.9 27.95 -15.95 27.95 -17.05 Q27.75 -17.45 27.2 -17.5 25.35 -17.65 23.9 -18.1 L23.9 -18.15 23.55 -18.4 23.55 -18.45 23.45 -18.8 23.4 -18.8 22.8 -19.35 22.8 -19.4 22.45 -20.0 22.45 -20.05 22.35 -21.2 22.3 -21.2 21.85 -20.55 21.75 -20.55 Q21.1 -19.65 19.75 -19.35 L19.7 -19.35 19.05 -19.7 19.05 -19.75 18.75 -20.2 18.75 -20.3 18.45 -22.1 Q17.45 -22.35 16.85 -22.85 L16.7 -22.85 15.1 -22.9 15.0 -22.9 14.2 -23.3 14.15 -23.3 12.9 -23.55 12.9 -23.6 12.4 -23.9 12.4 -23.95 Q11.8 -24.4 11.45 -25.2 L11.2 -25.4 10.85 -27.35 10.9 -27.4 11.1 -28.75 11.05 -28.75 Q10.3 -28.6 9.85 -28.1 M23.7 -28.2 L23.8 -28.2 24.05 -27.7 Q24.3 -27.2 24.65 -27.0 L24.7 -26.95 24.85 -26.3 24.95 -26.3 25.2 -25.8 25.25 -25.8 Q25.9 -25.6 26.25 -25.2 L26.3 -25.2 27.4 -25.45 27.45 -25.5 Q28.25 -26.25 27.95 -27.4 L27.95 -27.45 26.9 -28.35 26.8 -28.35 Q26.05 -28.6 25.5 -29.05 L25.45 -29.05 Q24.05 -29.7 22.7 -29.9 L22.7 -29.85 23.5 -28.75 23.5 -28.7 23.7 -28.2 M-10.7 -13.95 L-10.7 -13.85 Q-10.1 -13.75 -10.7 -13.95" fill="#000000" fill-rule="evenodd" stroke="none"/>
    <path d="M-10.7 -13.95 Q-10.1 -13.75 -10.7 -13.85 L-10.7 -13.95" fill="#ffffff" fill-rule="evenodd" stroke="none"/>
  </g>
</svg>
