<?xml version="1.0" encoding="UTF-8" standalone="no"?>
<svg xmlns:xlink="http://www.w3.org/1999/xlink" height="13.0px" width="12.0px" xmlns="http://www.w3.org/2000/svg">
  <g transform="matrix(1.0, 0.0, 0.0, 1.0, 6.0, 7.0)">
    <pattern height="13" id="PatternID_42_1" overflow="visible" patternTransform="matrix(1.0, 0.0, 0.0, 1.0, -6.0, -7.0)" patternUnits="userSpaceOnUse" viewBox="0 0 12 13" width="12">
      <image height="13" width="12" xlink:href="data:image/PNG;base64,iVBORw0KGgoAAAANSUhEUgAAAAwAAAANCAYAAACdKY9CAAAAi0lEQVR4XmNgoAb493zLfxBGF8cKQArPW0iBMUFNIAUn5Jj/f8+VAGMQG6cmmDPO6gv9/zUrCIxBbKzOQ3bG/3KJ///f7YVgIBvDeTDFICeATP33dBPcVBAbJAaSg2sCERcsQRokIRqeIWl4BtMgCVaDYQtRToIBkjwNAyAJooMVBpCdR1AxDOBzBgDBrPcFHokosgAAAABJRU5ErkJggg=="/>
    </pattern>
    <path d="M-6.0 -7.0 L6.0 -7.0 6.0 6.0 -6.0 6.0 -6.0 -7.0" style="fill:url(#PatternID_42_1)"/>
  </g>
</svg>
