<?xml version="1.0" encoding="UTF-8" standalone="no"?>
<svg xmlns:xlink="http://www.w3.org/1999/xlink" height="4.35px" width="6.9px" xmlns="http://www.w3.org/2000/svg">
  <g transform="matrix(1.0, 0.0, 0.0, 1.0, 3.1, 0.95)">
    <path d="M-3.05 0.0 L-3.1 -0.5 -2.7 -0.6 Q2.3 -2.1 3.8 3.2 L3.65 3.25 Q2.7 2.35 0.15 1.2 -1.45 0.45 -2.7 0.1 L-3.05 0.0" fill="#bfa68d" fill-rule="evenodd" stroke="none"/>
    <path d="M-3.05 0.0 L-2.7 0.1 Q-1.45 0.45 0.15 1.2 2.7 2.35 3.65 3.25 L3.35 3.25 Q-1.5 3.95 -2.7 1.5 L-3.05 0.0" fill="#efd0b0" fill-rule="evenodd" stroke="none"/>
  </g>
</svg>
