<?xml version="1.0" encoding="UTF-8" standalone="no"?>
<svg xmlns:xlink="http://www.w3.org/1999/xlink" height="32.15px" width="31.85px" xmlns="http://www.w3.org/2000/svg">
  <g transform="matrix(1.0, 0.0, 0.0, 1.0, -0.1, 0.7)">
    <path d="M13.0 -0.7 L15.25 -0.3 Q18.0 0.95 19.25 3.85 L21.6 2.8 Q23.8 1.65 26.25 1.65 27.25 1.65 27.95 2.15 29.45 3.2 29.25 5.15 31.3 6.5 31.85 8.95 32.15 10.35 31.45 11.35 29.95 13.5 27.55 14.8 27.9 17.25 27.1 19.6 L27.6 20.15 Q29.35 22.15 29.45 24.7 29.5 25.8 29.05 26.65 27.95 28.8 25.8 29.8 L23.85 30.5 Q21.0 31.45 18.05 31.4 L15.45 31.25 Q13.85 30.85 12.5 30.05 L10.45 28.5 Q8.85 30.85 6.25 31.25 L4.8 30.7 Q1.65 29.2 3.1 26.25 L2.75 25.7 Q1.35 23.35 1.9 20.5 L1.35 20.3 0.3 19.6 Q-0.6 16.35 2.15 14.85 L1.35 13.25 Q0.45 11.55 1.4 10.1 3.15 7.6 6.2 7.5 L6.05 7.05 Q5.65 5.9 5.65 4.75 5.6 3.0 6.85 1.65 8.65 -0.25 11.1 -0.6 L13.0 -0.7 M27.2 2.9 L27.0 2.7 Q26.45 2.2 25.35 2.2 22.55 2.2 19.8 4.5 L20.1 4.6 Q20.6 4.85 20.6 5.3 L20.15 5.75 19.45 6.0 19.15 6.75 19.0 7.45 19.0 7.65 18.7 8.05 18.5 8.65 18.65 9.85 18.5 11.4 18.45 11.2 Q17.2 11.4 16.5 12.35 16.0 13.05 15.9 14.0 15.65 14.15 15.65 14.65 L15.75 15.25 15.2 15.9 Q14.6 16.65 14.6 17.2 L14.6 17.45 Q13.95 17.0 13.05 17.0 12.65 17.0 11.35 17.95 L11.15 18.1 11.3 17.8 Q11.9 16.8 11.9 16.05 L11.55 15.35 11.25 15.0 11.2 14.05 10.95 13.45 10.85 13.1 10.95 13.0 11.4 13.25 11.9 13.45 12.15 13.45 12.15 13.55 12.0 14.05 Q11.65 14.1 11.65 14.6 L11.9 15.0 12.15 15.85 Q12.1 16.45 12.2 16.65 L12.65 16.9 Q13.25 16.9 13.4 16.3 L13.65 16.3 Q14.3 16.3 14.65 15.55 L14.9 14.45 Q14.9 13.7 14.4 13.0 L13.65 12.3 13.75 11.8 13.75 11.7 13.9 11.95 14.6 12.1 Q15.9 12.1 16.95 9.95 L17.15 9.15 17.4 8.3 18.1 7.35 18.3 6.55 Q18.3 4.8 17.8 3.75 L17.55 2.9 Q17.1 1.8 15.85 1.1 14.15 0.15 11.8 0.4 L11.55 0.4 11.45 0.4 Q10.55 0.5 9.0 1.45 7.25 2.5 7.1 3.55 L7.1 3.7 6.8 3.95 Q6.5 4.3 6.5 4.65 L6.75 5.55 Q6.45 5.7 6.45 6.25 L6.7 7.55 7.15 8.7 6.9 8.35 6.7 8.05 6.7 8.0 Q5.35 8.05 4.15 8.9 2.9 9.8 2.8 10.95 L2.7 10.9 2.45 11.3 Q2.35 11.65 2.4 12.05 L2.35 11.95 2.15 12.3 Q2.15 13.05 3.0 14.1 3.35 14.5 3.5 15.25 L3.3 15.25 2.35 15.3 2.2 15.35 Q1.85 15.55 1.75 16.05 L1.65 16.5 Q1.15 16.75 1.0 17.0 0.75 17.35 0.75 18.05 0.75 19.0 1.4 19.7 2.0 20.35 2.85 20.35 L3.65 20.1 3.8 19.95 Q4.4 19.9 4.6 19.15 L4.65 18.95 5.6 20.8 Q6.45 22.5 8.05 23.1 L8.05 23.25 Q8.05 23.7 9.15 24.15 9.55 24.25 9.65 24.75 L9.75 25.55 Q9.9 26.05 10.45 26.55 L10.75 26.2 11.45 26.75 12.7 27.15 12.75 27.15 Q13.7 27.15 14.45 26.1 L14.65 25.85 15.95 27.0 Q16.3 27.7 16.9 28.05 L17.35 28.45 17.5 28.65 17.3 28.5 16.65 28.3 15.9 28.35 Q15.85 27.8 15.4 27.45 14.95 27.15 14.4 27.15 L13.65 27.4 Q13.05 27.75 13.05 28.25 13.05 28.7 13.45 29.05 13.85 29.4 14.25 29.4 L14.3 29.4 14.95 29.95 16.05 30.3 Q16.55 30.3 17.15 29.9 L17.65 29.4 Q17.65 30.75 19.9 30.75 20.8 30.75 21.65 30.2 L22.3 29.6 23.0 29.8 Q25.0 29.8 26.5 28.25 27.95 26.7 27.95 24.65 L27.75 23.5 27.45 22.45 26.8 21.55 26.5 21.2 26.4 20.9 26.3 20.8 25.9 20.7 25.65 20.75 Q24.8 20.95 22.8 22.45 21.15 23.65 19.4 24.0 L19.35 23.9 Q20.15 23.9 21.2 23.25 22.35 22.5 22.35 21.75 L21.55 19.95 21.7 19.6 Q22.1 19.9 22.45 19.9 23.35 19.9 24.45 19.0 25.7 17.95 25.7 16.45 25.7 15.65 25.3 14.95 L24.85 14.25 25.0 13.75 Q25.0 13.0 24.4 12.45 23.95 12.05 23.3 11.9 L23.15 11.75 25.95 12.2 Q27.15 12.2 28.65 10.9 30.15 9.55 30.15 8.25 30.15 6.55 28.4 5.65 L28.3 5.85 28.35 5.35 27.9 3.8 27.2 2.9 M24.65 9.4 L24.0 10.0 23.85 10.1 23.8 9.9 24.5 9.4 24.65 9.4 M7.8 9.4 L7.8 9.35 7.8 9.4 M11.7 10.55 L11.7 10.6 11.7 10.55 M7.95 18.2 L8.5 17.5 Q8.9 16.8 8.9 16.1 L8.8 15.45 8.7 15.1 8.95 14.5 9.2 13.8 9.0 12.9 8.65 12.4 8.85 12.35 Q9.2 12.35 9.45 13.0 9.6 13.5 10.0 13.6 L9.95 13.75 10.3 14.8 Q9.55 14.95 9.55 15.6 L9.75 16.55 9.3 17.5 Q8.8 18.0 8.8 18.7 L8.8 18.85 Q8.4 18.7 7.95 18.2 M4.95 22.05 L4.5 22.1 3.9 21.7 3.4 21.25 3.3 21.25 2.65 21.55 2.55 21.7 2.55 21.75 2.5 22.0 2.55 22.15 2.3 23.1 Q2.3 23.55 2.65 24.15 L3.1 24.95 Q3.65 25.9 4.35 25.9 L5.2 25.6 5.55 25.7 Q6.0 25.7 6.35 25.1 L6.65 24.3 Q6.65 23.7 6.2 23.05 L5.7 22.55 5.45 22.15 5.1 21.95 4.95 22.05 M13.85 20.75 L15.3 21.25 15.4 21.3 15.35 21.55 Q15.35 21.9 15.95 22.15 16.5 22.35 16.5 22.8 L16.2 23.25 Q15.9 23.65 15.9 24.0 L15.95 24.1 15.5 24.05 15.1 24.1 15.1 23.9 Q15.1 22.7 14.65 21.9 L13.85 20.75 M5.4 29.5 L6.0 29.7 Q7.25 29.7 8.5 28.75 L9.8 27.45 9.5 26.95 Q8.95 26.05 8.3 26.05 L6.2 26.75 5.3 26.85 3.65 26.5 Q3.2 26.75 3.2 27.85 3.2 28.7 3.7 29.2 4.15 29.65 4.85 29.65 L5.4 29.5" fill="#453729" fill-rule="evenodd" stroke="none"/>
    <path d="M21.7 19.6 L21.55 19.95 21.45 19.4 21.7 19.6 M18.5 21.5 L18.05 21.55 18.15 21.45 18.5 21.5 M7.65 10.05 Q7.55 9.6 7.75 9.4 L7.65 9.9 7.65 10.05 M8.5 12.4 L8.5 12.3 8.65 12.4 8.5 12.4 M6.9 16.65 L7.0 16.8 6.9 16.7 6.9 16.65 M2.55 21.7 L2.55 22.15 2.5 22.0 2.55 21.75 2.55 21.7 M5.7 22.55 L4.95 22.05 5.1 21.95 5.45 22.15 5.7 22.55 M9.65 18.8 L9.2 19.2 Q8.85 19.2 8.8 18.85 L9.0 18.85 9.65 18.8 M15.35 18.1 Q14.7 18.1 14.65 17.8 L14.6 17.45 15.05 17.8 15.35 18.1 M12.8 13.2 L12.85 12.7 13.25 12.9 13.15 12.95 12.8 13.2" fill="#634f3b" fill-rule="evenodd" stroke="none"/>
    <path d="M27.2 2.9 L27.9 3.8 28.35 5.35 28.3 5.85 28.15 6.0 27.8 6.25 26.7 6.35 26.7 6.45 26.4 6.2 26.0 6.2 25.3 6.3 24.9 6.1 24.8 5.95 Q25.75 5.8 26.5 5.35 27.45 4.8 27.45 3.95 L27.2 2.9 M23.3 11.9 Q23.95 12.05 24.4 12.45 25.0 13.0 25.0 13.75 L24.85 14.25 25.3 14.95 Q25.7 15.65 25.7 16.45 25.7 17.95 24.45 19.0 23.35 19.9 22.45 19.9 22.1 19.9 21.7 19.6 L21.75 19.15 Q21.75 18.4 20.95 17.95 20.35 17.6 19.8 17.6 L19.05 17.75 18.8 17.25 Q18.5 16.95 18.1 17.0 17.35 17.0 16.85 16.3 17.7 16.8 18.85 16.8 20.7 16.8 22.0 15.8 23.45 14.65 23.45 12.65 L23.3 11.9 M21.55 19.95 L22.35 21.75 Q22.35 22.5 21.2 23.25 20.15 23.9 19.35 23.9 18.3 23.9 18.3 23.35 18.3 23.15 18.45 22.9 L18.6 22.55 18.2 22.15 17.75 21.85 18.05 21.55 18.5 21.5 20.2 21.0 21.55 19.95 M26.5 21.2 L26.8 21.55 27.45 22.45 27.75 23.5 27.95 24.65 Q27.95 26.7 26.5 28.25 25.0 29.8 23.0 29.8 L22.3 29.6 Q21.95 29.25 21.95 28.5 L22.0 28.1 Q23.5 27.7 24.65 26.75 26.6 25.1 26.6 22.4 L26.5 21.2 M17.65 29.4 L17.15 29.9 Q16.55 30.3 16.05 30.3 L14.95 29.95 14.3 29.4 14.15 29.05 14.45 28.75 14.75 28.4 15.9 28.35 16.65 28.3 17.3 28.5 17.5 28.65 17.7 29.2 17.65 29.4 M14.65 25.85 L14.45 26.1 Q13.7 27.15 12.75 27.15 L12.7 27.15 11.45 26.75 10.75 26.2 Q10.4 25.8 10.4 25.25 L10.55 24.4 Q10.55 24.0 10.2 23.75 L9.8 23.35 9.95 23.35 Q10.95 23.35 12.1 22.5 L13.75 20.7 13.85 20.75 14.65 21.9 Q15.1 22.7 15.1 23.9 L15.1 24.1 14.65 24.2 Q14.35 24.4 14.35 25.0 14.35 25.4 14.65 25.85 M4.65 18.95 L4.6 19.15 Q4.4 19.9 3.8 19.95 L3.65 19.95 Q3.15 19.95 3.15 19.55 L3.25 19.05 2.9 18.75 Q2.65 18.55 2.7 18.3 L3.25 18.35 4.3 18.25 4.65 18.95 M17.8 3.75 Q18.3 4.8 18.3 6.55 L18.1 7.35 17.4 8.3 17.15 9.15 16.95 9.95 Q15.9 12.1 14.6 12.1 L13.9 11.95 13.75 11.7 13.6 11.2 13.2 10.85 Q12.7 10.5 12.25 10.5 L11.7 10.6 11.7 10.55 11.7 10.05 Q11.7 9.4 11.35 8.85 L10.8 7.75 11.7 8.05 12.6 7.7 Q13.3 7.3 13.45 7.3 L13.9 7.45 14.45 7.55 Q16.1 7.55 17.0 6.7 17.85 5.85 17.85 4.4 L17.8 3.75 M13.65 12.3 L14.4 13.0 Q14.9 13.7 14.9 14.45 L14.65 15.55 Q14.3 16.3 13.65 16.3 L13.4 16.3 Q12.85 16.2 12.85 15.7 12.85 15.35 13.2 14.9 L13.65 14.55 Q13.45 13.95 13.05 13.75 L12.75 13.4 12.8 13.2 13.15 12.95 13.25 12.9 13.65 12.3 M10.85 13.1 L10.95 13.45 11.2 14.05 11.25 15.0 11.55 15.35 11.9 16.05 Q11.9 16.8 11.3 17.8 L11.15 18.1 9.65 18.8 9.0 18.85 8.8 18.85 8.8 18.7 Q8.8 18.0 9.3 17.5 L9.75 16.55 9.55 15.6 Q9.55 14.95 10.3 14.8 L9.95 13.75 10.0 13.6 10.1 13.6 10.85 13.1 M21.05 9.4 L21.1 9.4 Q22.35 9.4 23.55 8.15 L24.4 7.15 Q25.0 7.95 25.0 8.3 25.0 8.85 24.5 9.4 L23.8 9.9 23.5 9.95 Q22.65 9.95 22.6 9.4 L21.7 9.9 Q21.4 9.9 21.25 9.7 L21.05 9.4 M9.9 6.55 L9.85 7.25 9.85 7.3 Q9.7 8.45 9.3 8.75 L8.95 8.85 Q8.55 8.85 8.45 8.35 L8.3 7.35 7.3 5.45 Q7.3 5.0 7.6 4.8 8.05 5.2 8.6 5.2 L9.6 5.0 9.6 5.35 Q9.6 5.85 9.9 6.55 M8.65 12.4 L9.0 12.9 9.2 13.8 8.95 14.5 8.7 15.1 8.8 15.45 8.9 16.1 Q8.9 16.8 8.5 17.5 L7.95 18.2 7.9 18.15 7.15 17.05 7.0 16.8 6.9 16.65 6.9 16.45 Q6.95 15.85 6.6 15.05 L6.0 13.45 7.4 12.9 Q8.0 12.5 8.5 12.4 L8.65 12.4 M4.2 23.9 L5.15 23.5 Q5.7 23.05 5.7 22.6 L5.7 22.55 6.2 23.05 Q6.65 23.7 6.65 24.3 L6.35 25.1 Q6.0 25.7 5.55 25.7 L5.2 25.6 5.15 25.55 4.9 25.35 4.65 25.45 4.35 25.55 3.95 25.25 Q3.95 24.85 4.3 24.7 L4.65 24.4 4.45 24.15 4.2 23.9 M6.2 26.75 L8.3 26.05 Q8.95 26.05 9.5 26.95 L9.8 27.45 8.5 28.75 Q7.25 29.7 6.0 29.7 L5.4 29.5 5.3 29.4 5.0 28.65 5.6 27.45 6.2 26.75" fill="#2e241b" fill-rule="evenodd" stroke="none"/>
    <path d="M19.0 7.65 L19.0 7.45 19.15 6.75 19.45 6.0 20.15 5.75 20.6 5.3 Q20.6 4.85 20.1 4.6 L19.8 4.5 Q22.55 2.2 25.35 2.2 26.45 2.2 27.0 2.7 L27.2 2.9 27.45 3.95 Q27.45 4.8 26.5 5.35 25.75 5.8 24.8 5.95 L24.7 5.95 Q24.75 6.5 24.4 7.15 L23.55 8.15 Q22.35 9.4 21.1 9.4 L21.05 9.4 Q19.1 9.3 19.0 7.65 M28.3 5.85 L28.4 5.65 Q30.15 6.55 30.15 8.25 30.15 9.55 28.65 10.9 27.15 12.2 25.95 12.2 L23.15 11.75 23.3 11.9 23.45 12.65 Q23.45 14.65 22.0 15.8 20.7 16.8 18.85 16.8 17.7 16.8 16.85 16.3 15.85 15.7 15.85 14.65 L15.9 14.0 Q16.0 13.05 16.5 12.35 17.2 11.4 18.45 11.2 L18.5 11.4 18.6 11.7 19.0 12.05 Q19.55 12.4 20.15 12.4 L21.2 11.95 21.9 11.05 Q21.95 10.75 22.75 10.55 L23.85 10.1 24.0 10.0 24.65 9.4 Q26.35 7.6 26.7 6.45 L26.7 6.35 27.8 6.25 28.15 6.0 28.3 5.85 M19.4 24.0 Q21.15 23.65 22.8 22.45 24.8 20.95 25.65 20.75 L25.9 20.7 26.3 20.8 26.4 20.9 26.5 21.2 26.6 22.4 Q26.6 25.1 24.65 26.75 23.5 27.7 22.0 28.1 L19.7 28.35 Q18.4 28.35 16.5 27.3 L15.95 27.0 14.65 25.85 Q14.35 25.4 14.35 25.0 14.35 24.4 14.65 24.2 L15.1 24.1 15.5 24.05 15.95 24.1 17.85 24.15 19.4 24.0 M8.05 23.1 Q6.45 22.5 5.6 20.8 L4.65 18.95 4.3 18.25 3.25 18.35 2.7 18.3 Q1.65 18.0 1.65 16.7 L1.65 16.5 1.75 16.05 Q1.85 15.55 2.2 15.35 L2.35 15.3 3.3 15.25 3.5 15.25 Q5.8 15.3 6.9 16.65 L6.9 16.7 7.0 16.8 7.15 17.05 7.9 18.15 7.95 18.2 Q8.4 18.7 8.8 18.85 8.85 19.2 9.2 19.2 L9.65 18.8 11.15 18.1 11.35 17.95 Q12.65 17.0 13.05 17.0 13.95 17.0 14.6 17.45 L14.65 17.8 Q14.7 18.1 15.35 18.1 15.9 18.6 16.4 18.6 L18.05 18.1 18.95 17.75 19.05 17.75 19.8 17.6 Q20.35 17.6 20.95 17.95 21.75 18.4 21.75 19.15 L21.7 19.6 21.45 19.4 21.55 19.95 20.2 21.0 18.5 21.5 18.15 21.45 18.05 21.55 17.6 21.55 15.8 21.35 15.4 21.3 15.3 21.25 13.85 20.75 13.75 20.7 12.1 22.5 Q10.95 23.35 9.95 23.35 L9.8 23.35 9.55 23.35 8.05 23.1 M2.8 10.95 Q2.9 9.8 4.15 8.9 5.35 8.05 6.7 8.0 L6.7 8.05 6.9 8.35 7.15 8.7 7.3 8.9 7.65 9.25 7.8 9.35 7.8 9.4 7.75 9.4 Q7.55 9.6 7.65 10.05 L8.3 10.9 Q8.95 11.4 9.5 11.4 L10.75 10.95 11.3 10.75 11.7 10.6 12.25 10.5 Q12.7 10.5 13.2 10.85 L13.6 11.2 13.75 11.7 13.75 11.8 13.65 12.3 13.25 12.9 12.85 12.7 12.8 13.2 12.15 13.45 11.9 13.45 11.4 13.25 10.95 13.0 10.85 13.1 10.1 13.6 10.0 13.6 Q9.6 13.5 9.45 13.0 9.2 12.35 8.85 12.35 L8.65 12.4 8.5 12.3 8.5 12.4 Q8.0 12.5 7.4 12.9 L6.0 13.45 5.85 13.45 Q4.9 13.45 3.9 12.8 2.8 12.05 2.8 11.15 L2.8 10.95 M7.1 3.7 L7.1 3.55 Q7.25 2.5 9.0 1.45 10.55 0.5 11.45 0.4 L11.55 0.4 11.8 0.4 Q14.15 0.15 15.85 1.1 17.1 1.8 17.55 2.9 L17.8 3.75 17.85 4.4 Q17.85 5.85 17.0 6.7 16.1 7.55 14.45 7.55 L13.9 7.45 13.45 7.3 Q13.3 7.3 12.6 7.7 L11.7 8.05 10.8 7.75 10.0 6.75 9.9 6.55 Q9.6 5.85 9.6 5.35 L9.6 5.0 8.6 5.2 Q8.05 5.2 7.6 4.8 7.1 4.35 7.1 3.7 M2.55 21.7 L2.65 21.55 3.3 21.25 3.4 21.25 3.9 21.7 4.5 22.1 4.95 22.05 5.7 22.55 5.7 22.6 Q5.7 23.05 5.15 23.5 L4.2 23.9 4.05 23.9 3.1 23.35 Q2.7 22.85 2.65 22.45 L2.55 22.15 2.55 21.7" fill="#856a4f" fill-rule="evenodd" stroke="none"/>
    <path d="M19.35 23.9 L19.4 24.0 17.85 24.15 15.95 24.1 15.9 24.0 Q15.9 23.65 16.2 23.25 L16.5 22.8 Q16.5 22.35 15.95 22.15 15.35 21.9 15.35 21.55 L15.4 21.3 15.8 21.35 17.6 21.55 18.05 21.55 17.75 21.85 18.2 22.15 18.6 22.55 18.45 22.9 Q18.3 23.15 18.3 23.35 18.3 23.9 19.35 23.9 M22.3 29.6 L21.65 30.2 Q20.8 30.75 19.9 30.75 17.65 30.75 17.65 29.4 L17.7 29.2 17.5 28.65 17.35 28.45 16.9 28.05 Q16.3 27.7 15.95 27.0 L16.5 27.3 Q18.4 28.35 19.7 28.35 L22.0 28.1 21.95 28.5 Q21.95 29.25 22.3 29.6 M14.3 29.4 L14.25 29.4 Q13.85 29.4 13.45 29.05 13.05 28.7 13.05 28.25 13.05 27.75 13.65 27.4 L14.4 27.15 Q14.95 27.15 15.4 27.45 15.85 27.8 15.9 28.35 L14.75 28.4 14.45 28.75 14.15 29.05 14.3 29.4 M10.75 26.2 L10.45 26.55 Q9.9 26.05 9.75 25.55 L9.65 24.75 Q9.55 24.25 9.15 24.15 8.05 23.7 8.05 23.25 L8.05 23.1 9.55 23.35 9.8 23.35 10.2 23.75 Q10.55 24.0 10.55 24.4 L10.4 25.25 Q10.4 25.8 10.75 26.2 M3.8 19.95 L3.65 20.1 2.85 20.35 Q2.0 20.35 1.4 19.7 0.75 19.0 0.75 18.05 0.75 17.35 1.0 17.0 1.15 16.75 1.65 16.5 L1.65 16.7 Q1.65 18.0 2.7 18.3 2.65 18.55 2.9 18.75 L3.25 19.05 3.15 19.55 Q3.15 19.95 3.65 19.95 L3.8 19.95 M3.5 15.25 Q3.35 14.5 3.0 14.1 2.15 13.05 2.15 12.3 L2.35 11.95 2.4 12.05 Q2.35 11.65 2.45 11.3 L2.7 10.9 2.8 10.95 2.8 11.15 Q2.8 12.05 3.9 12.8 4.9 13.45 5.85 13.45 L6.0 13.45 6.6 15.05 Q6.95 15.85 6.9 16.45 L6.9 16.65 Q5.8 15.3 3.5 15.25 M7.15 8.7 L6.7 7.55 6.45 6.25 Q6.45 5.7 6.75 5.55 L6.5 4.65 Q6.5 4.3 6.8 3.95 L7.1 3.7 Q7.1 4.35 7.6 4.8 7.3 5.0 7.3 5.45 L8.3 7.35 8.45 8.35 Q8.55 8.85 8.95 8.85 L9.3 8.75 Q9.7 8.45 9.85 7.3 L9.85 7.25 9.9 6.55 10.0 6.75 10.8 7.75 11.35 8.85 Q11.7 9.4 11.7 10.05 L11.7 10.55 11.7 10.6 11.3 10.75 10.75 10.95 9.5 11.4 Q8.95 11.4 8.3 10.9 L7.65 10.05 7.65 9.9 7.75 9.4 7.8 9.4 7.8 9.35 7.65 9.25 7.3 8.9 7.15 8.7 M13.4 16.3 Q13.25 16.9 12.65 16.9 L12.2 16.65 Q12.1 16.45 12.15 15.85 L11.9 15.0 11.65 14.6 Q11.65 14.1 12.0 14.05 L12.15 13.55 12.15 13.45 12.8 13.2 12.75 13.4 13.05 13.75 Q13.45 13.95 13.65 14.55 L13.2 14.9 Q12.85 15.35 12.85 15.7 12.85 16.2 13.4 16.3 M14.6 17.45 L14.6 17.2 Q14.6 16.65 15.2 15.9 L15.75 15.25 15.65 14.65 Q15.65 14.15 15.9 14.0 L15.85 14.65 Q15.85 15.7 16.85 16.3 17.35 17.0 18.1 17.0 18.5 16.95 18.8 17.25 L19.05 17.75 18.95 17.75 18.05 18.1 16.4 18.6 Q15.9 18.6 15.35 18.1 L15.05 17.8 14.6 17.45 M18.5 11.4 L18.65 9.85 18.5 8.65 18.7 8.05 19.0 7.65 Q19.1 9.3 21.05 9.4 L21.25 9.7 Q21.4 9.9 21.7 9.9 L22.6 9.4 Q22.65 9.95 23.5 9.95 L23.8 9.9 23.85 10.1 22.75 10.55 Q21.95 10.75 21.9 11.05 L21.2 11.95 20.15 12.4 Q19.55 12.4 19.0 12.05 L18.6 11.7 18.5 11.4 M24.4 7.15 Q24.75 6.5 24.7 5.95 L24.8 5.95 24.9 6.1 25.3 6.3 26.0 6.2 26.4 6.2 26.7 6.45 Q26.35 7.6 24.65 9.4 L24.5 9.4 Q25.0 8.85 25.0 8.3 25.0 7.95 24.4 7.15 M2.55 22.15 L2.65 22.45 Q2.7 22.85 3.1 23.35 L4.05 23.9 4.2 23.9 4.45 24.15 4.65 24.4 4.3 24.7 Q3.95 24.85 3.95 25.25 L4.35 25.55 4.65 25.45 4.9 25.35 5.15 25.55 5.2 25.6 4.35 25.9 Q3.65 25.9 3.1 24.95 L2.65 24.15 Q2.3 23.55 2.3 23.1 L2.55 22.15 M5.4 29.5 L4.85 29.65 Q4.15 29.65 3.7 29.2 3.2 28.7 3.2 27.85 3.2 26.75 3.65 26.5 L5.3 26.85 6.2 26.75 5.6 27.45 5.0 28.65 5.3 29.4 5.4 29.5" fill="#705943" fill-rule="evenodd" stroke="none"/>
    <path d="M30.95 9.0 L30.95 8.5 31.25 9.3 Q31.25 10.9 30.15 12.05 29.1 13.15 27.5 13.35 L27.0 14.3 Q26.6 14.75 26.05 14.75 L25.9 14.75 Q26.75 14.3 26.6 13.0 27.45 13.0 29.45 11.65 L30.55 10.55 30.95 9.0 M26.5 16.35 L26.7 16.6 26.9 17.3 Q26.9 18.7 25.85 19.65 24.8 20.6 23.7 20.25 24.7 19.9 25.55 18.65 L26.5 16.35 M27.45 5.5 L28.25 3.3 28.5 3.8 28.65 4.4 Q28.65 6.3 26.35 6.9 L27.45 5.5 M25.0 15.4 L25.25 15.85 Q25.0 16.05 25.25 15.95 L25.3 16.05 25.2 16.45 24.95 17.0 24.3 17.65 24.5 16.95 24.65 15.9 24.45 14.7 25.0 15.4 M22.55 20.6 L22.55 20.9 22.1 22.0 21.65 22.45 21.15 22.8 20.8 22.9 20.5 22.75 21.85 21.7 22.55 20.6 M27.35 24.5 L28.15 23.55 28.3 23.3 28.4 24.45 Q28.4 26.0 27.0 27.55 25.85 28.8 24.8 29.1 L24.7 29.1 26.35 27.45 Q27.55 25.9 27.55 25.15 L27.55 25.1 27.05 25.75 26.35 26.35 Q27.15 24.85 27.55 23.15 27.55 24.2 27.35 24.45 L27.35 24.5 M23.45 29.25 Q22.45 30.0 21.1 30.0 L19.05 29.7 Q23.0 29.25 24.5 27.9 L23.45 29.25 M9.35 25.65 L9.35 26.65 Q9.25 27.45 8.65 28.15 L7.75 29.15 7.65 29.2 7.65 29.25 7.75 29.15 9.9 28.05 9.9 28.15 Q9.2 29.25 8.1 29.85 L6.75 30.45 7.65 29.6 7.6 29.6 7.2 29.8 Q6.45 29.8 6.1 29.3 L6.15 29.25 Q7.1 28.95 7.95 27.85 L9.35 25.65 M12.35 23.1 L12.25 23.0 13.7 21.7 13.55 22.35 13.6 22.4 13.95 22.45 13.5 23.5 13.55 23.5 Q13.9 23.15 14.3 23.15 L14.3 23.2 Q13.35 24.5 11.95 24.85 L11.9 24.8 13.3 23.15 12.8 23.35 12.8 23.3 13.3 22.7 12.35 23.1" fill="#9ae2e3" fill-rule="evenodd" stroke="none"/>
    <path d="M25.95 3.25 L25.75 2.95 Q25.75 2.55 26.2 2.95 L26.65 3.6 Q26.65 4.2 25.0 5.0 L23.4 5.7 23.45 6.55 23.45 7.15 22.75 7.7 21.35 7.85 20.5 8.3 Q19.9 8.3 19.75 7.8 L19.7 7.3 Q19.7 6.4 20.5 6.4 21.0 6.4 21.25 6.8 L21.7 7.2 Q22.7 7.2 22.95 6.4 23.2 5.45 23.45 5.35 L25.05 4.55 Q26.1 3.95 26.1 3.55 L25.95 3.25 M25.0 10.4 Q25.0 10.3 25.2 10.3 L25.45 10.5 25.55 10.8 25.85 10.7 26.1 10.5 27.05 10.55 Q28.7 10.55 29.3 8.4 L28.8 7.25 28.95 7.15 29.35 7.8 29.6 8.45 28.7 10.3 Q28.2 10.9 27.4 10.95 L26.15 11.0 25.75 11.3 Q25.4 11.3 25.15 10.95 L25.0 10.6 25.0 10.4 M22.45 12.95 L22.55 13.4 Q21.75 15.85 19.7 15.85 L18.65 15.8 17.8 15.5 17.3 14.9 17.7 14.3 Q18.1 13.85 18.35 13.85 19.5 13.85 19.3 15.3 L19.7 15.45 Q21.0 15.45 21.75 14.35 L22.45 12.95 M22.25 24.1 Q22.25 23.65 23.1 23.75 23.9 23.85 23.9 24.35 23.9 25.0 23.2 25.0 22.8 25.0 22.5 24.55 L22.25 24.1 M23.95 22.8 L24.05 22.65 24.25 22.25 Q24.6 21.75 25.15 21.75 L25.6 21.95 25.65 22.0 Q26.15 22.2 26.15 23.1 26.15 24.5 24.95 25.25 22.45 26.5 20.75 26.5 L20.15 26.4 19.85 26.25 Q19.25 26.25 18.8 26.5 L17.7 26.75 Q16.6 26.75 16.05 26.15 15.7 25.75 15.7 25.3 L15.75 24.75 15.95 24.7 16.2 25.5 Q16.45 25.95 17.45 26.25 L17.95 26.25 Q18.65 25.9 19.35 25.85 L20.3 26.0 21.0 26.1 Q22.75 26.1 24.2 25.25 25.4 24.55 25.65 23.6 L24.9 23.9 24.55 23.85 Q23.95 23.85 23.95 23.1 L23.95 22.8 M16.45 5.8 L15.75 6.4 14.6 6.9 14.15 6.9 13.25 6.55 12.75 6.65 12.45 6.75 11.8 6.55 11.4 6.1 10.35 5.45 9.9 4.0 9.2 4.15 8.8 4.25 Q8.1 4.25 7.8 3.9 L7.65 3.55 8.05 2.55 Q8.5 1.9 8.95 2.05 L8.45 2.65 Q7.95 3.3 7.95 3.5 L8.25 3.9 9.95 3.45 10.4 4.05 10.65 5.0 11.1 5.3 Q11.5 5.4 11.7 5.7 L11.95 6.0 12.4 6.3 12.7 6.2 13.15 6.1 13.8 6.3 14.4 6.45 Q14.95 6.45 15.55 6.05 L16.25 5.6 16.4 5.65 16.45 5.8 M10.3 2.9 L9.8 3.2 9.3 2.95 9.25 2.65 Q9.25 1.95 9.85 1.85 10.45 1.75 10.45 2.5 L10.3 2.9 M3.85 9.9 Q4.15 9.35 4.7 9.35 L4.75 9.4 4.05 10.7 Q4.05 11.6 4.8 11.6 L5.3 11.5 6.25 11.85 7.25 11.4 7.45 11.45 7.5 11.6 7.0 12.05 6.2 12.35 5.65 12.2 5.35 12.05 4.9 12.15 Q3.6 12.15 3.55 10.75 3.55 10.35 3.85 9.9 M3.6 15.9 Q4.45 15.9 5.75 18.4 5.75 19.15 6.45 19.4 L7.55 19.9 8.15 20.7 Q8.6 21.2 9.25 21.2 9.55 21.2 10.6 20.25 11.6 19.25 11.95 19.25 L12.8 19.35 13.4 19.45 13.75 19.4 14.5 19.3 15.7 19.6 16.8 19.85 19.5 19.4 Q20.5 18.85 20.6 18.85 20.75 19.2 19.9 19.7 18.8 20.3 16.8 20.3 L15.45 20.05 Q15.1 19.75 14.25 19.75 L13.5 19.9 12.05 19.7 Q11.65 19.7 10.85 20.65 10.05 21.6 9.25 21.6 8.45 21.6 7.85 21.05 L7.4 20.5 6.45 20.0 5.5 19.55 Q5.3 19.35 5.25 18.95 L5.05 18.3 4.1 17.1 3.4 17.45 Q2.7 17.45 2.7 16.5 2.7 15.9 3.6 15.9 M3.3 23.65 Q2.55 23.65 2.65 22.95 2.65 22.15 3.2 22.25 3.75 22.3 3.75 22.9 3.6 23.65 3.3 23.65 M19.7 14.55 Q19.7 13.9 20.15 13.95 20.6 14.0 20.6 14.45 20.6 15.0 20.1 15.0 19.75 15.0 19.7 14.8 L19.7 14.55" fill="#d6c7ba" fill-rule="evenodd" stroke="none"/>
  </g>
</svg>
