<?xml version="1.0" encoding="UTF-8" standalone="no"?>
<svg xmlns:xlink="http://www.w3.org/1999/xlink" height="79.05px" width="79.2px" xmlns="http://www.w3.org/2000/svg">
  <g transform="matrix(1.0, 0.0, 0.0, 1.0, 39.6, 39.5)">
    <path d="M0.35 -25.55 L5.75 -27.65 2.1 -30.95 -0.1 -31.05 -1.2 -31.05 -4.55 -27.65 0.35 -25.55 M23.5 -27.05 L25.35 -25.35 25.35 -25.3 26.95 -23.55 32.15 -23.55 Q37.85 -16.2 39.4 -7.0 L35.85 -3.4 36.0 0.1 35.95 2.55 39.6 6.25 Q38.3 15.05 33.2 22.3 L28.25 22.3 25.35 25.4 23.5 27.15 23.5 32.35 Q16.45 37.7 7.9 39.3 L4.4 35.85 -0.1 36.05 -3.7 35.9 -7.3 39.55 Q-15.95 38.05 -22.75 33.1 L-22.75 28.05 -25.45 25.45 -25.55 25.4 -28.35 22.3 -33.4 22.3 Q-38.2 15.5 -39.6 7.35 L-36.0 3.8 -36.2 0.1 -35.9 -4.5 -39.4 -7.95 Q-37.75 -16.55 -32.35 -23.55 L-27.15 -23.55 -25.55 -25.3 -22.75 -27.85 -22.75 -32.9 Q-15.65 -38.15 -6.45 -39.5 L-2.85 -35.85 -0.1 -35.95 3.5 -35.8 7.1 -39.35 Q16.15 -37.8 23.5 -32.15 L23.5 -27.05 M-0.1 -18.85 Q-6.4 -18.85 -11.05 -15.35 L-13.4 -13.3 Q-18.95 -7.8 -18.95 0.0 -18.95 7.8 -13.4 13.25 L-11.05 15.4 Q-6.4 18.8 -0.1 18.8 7.75 18.8 13.2 13.25 18.75 7.8 18.75 0.0 18.75 -7.8 13.2 -13.3 7.75 -18.85 -0.1 -18.85 M10.35 -10.4 Q14.7 -6.1 14.7 0.0 14.7 6.1 10.35 10.4 6.05 14.75 -0.1 14.75 -5.05 14.75 -8.6 12.1 L-8.7 12.1 -10.55 10.45 -10.55 10.4 Q-14.9 6.1 -14.9 0.0 -14.9 -6.1 -10.55 -10.4 L-8.6 -12.1 Q-5.05 -14.75 -0.1 -14.75 6.05 -14.75 10.35 -10.4 M17.75 -18.15 L23.5 -16.1 23.5 -20.1 21.85 -21.8 21.8 -21.8 19.95 -23.55 15.65 -23.55 17.75 -18.15 M-26.45 -5.75 L-31.0 -1.15 -31.1 0.1 -31.1 0.3 -26.45 5.0 -24.35 -0.8 -26.45 -5.75 M-0.1 30.95 L1.3 30.95 5.75 26.9 0.35 24.8 -4.55 26.9 -0.45 30.95 -0.1 30.95 M23.5 20.2 L23.5 14.9 17.75 17.35 15.65 22.3 21.5 22.3 21.85 21.9 23.5 20.2 M30.8 -2.55 L27.65 -5.75 25.15 -0.4 27.65 5.0 30.9 1.75 30.9 0.1 30.8 -2.55 M-22.75 -16.1 L-16.95 -18.15 -14.9 -23.55 -20.15 -23.55 -22.0 -21.8 -22.05 -21.7 -22.75 -21.05 -22.75 -16.1 M-14.9 22.3 L-16.95 17.35 -22.75 14.9 -22.75 21.2 -22.05 21.85 -22.0 21.9 -21.65 22.3 -14.9 22.3" fill="#000000" fill-rule="evenodd" stroke="none"/>
  </g>
</svg>
