<?xml version="1.0" encoding="UTF-8" standalone="no"?>
<svg xmlns:xlink="http://www.w3.org/1999/xlink" height="98.4px" width="65.45px" xmlns="http://www.w3.org/2000/svg">
  <g transform="matrix(1.0, 0.0, 0.0, 1.0, 32.75, 49.15)">
    <path d="M1.3 -45.2 L1.4 -45.35 1.7 -45.25 2.1 -44.95 1.85 -44.75 1.3 -45.2" fill="#3a6073" fill-rule="evenodd" stroke="none"/>
    <path d="M16.0 -11.2 L16.0 -11.15 13.4 -6.7 10.5 -6.25 Q0.75 -4.8 -6.6 -4.8 L-7.15 -4.8 -14.7 -6.95 -19.9 -8.7 -20.1 -10.6 -18.65 -13.95 -17.3 -16.8 Q-16.55 -17.65 -15.9 -18.8 L-14.95 -20.65 Q-13.5 -24.05 -13.5 -27.7 L-13.7 -29.65 -13.7 -30.45 Q-13.7 -40.1 -23.05 -40.6 L-24.2 -40.65 -28.95 -40.0 Q-30.7 -39.45 -31.65 -38.5 L-31.7 -39.65 -31.7 -39.75 -31.75 -40.1 Q-28.75 -42.35 -24.2 -42.35 L-23.0 -42.3 -22.65 -42.3 -21.4 -42.15 Q-12.85 -39.4 -12.1 -24.5 L-12.75 -18.15 -14.0 -9.45 Q-10.3 -8.55 -0.9 -8.55 6.2 -8.55 12.5 -10.2 14.25 -10.65 16.0 -11.2 M14.25 4.4 L16.8 4.4 16.85 4.6 Q16.95 4.8 17.2 4.8 L16.9 4.95 16.9 5.0 16.8 5.25 15.8 5.65 Q10.35 7.85 3.5 9.25 L5.25 9.9 7.45 10.75 7.95 10.95 10.75 10.9 12.4 10.9 9.65 11.6 9.3 11.5 8.7 11.65 8.4 11.75 3.0 13.35 9.05 12.85 9.25 12.8 10.2 12.55 10.55 12.45 11.15 12.25 11.1 12.25 14.4 11.0 15.0 10.75 14.15 11.25 11.15 14.45 7.3 35.9 5.0 47.65 4.2 47.75 2.5 47.9 0.65 37.6 -1.1 26.05 -1.15 25.85 -2.05 19.65 Q-1.85 18.3 -0.45 17.3 0.7 16.5 4.65 14.75 L-1.3 14.95 -2.05 13.45 -2.55 11.75 Q-2.55 11.15 -0.95 9.85 L1.05 8.5 1.65 8.45 6.25 7.95 6.3 7.95 Q10.8 7.25 15.3 5.6 L16.9 4.95 15.2 4.6 14.25 4.45 14.25 4.4 M15.35 10.5 L15.4 10.55 15.35 10.5 M-31.65 43.8 L-30.55 41.25 Q-28.75 35.45 -25.25 29.15 -21.95 23.5 -21.35 22.0 L-17.75 13.85 -15.75 9.5 -12.6 10.05 -7.5 9.65 -5.35 9.4 -5.45 15.35 Q-6.05 15.0 -6.4 14.95 -13.95 21.3 -19.15 32.35 -21.7 37.9 -24.85 47.9 L-26.6 47.7 -32.6 47.05 -31.65 43.8 M-4.25 29.55 L-4.05 30.4 -4.0 31.7 -4.25 29.55" fill="#c29c9c" fill-rule="evenodd" stroke="none"/>
    <path d="M14.05 -20.85 Q14.95 -16.05 16.0 -11.2 14.25 -10.65 12.5 -10.2 6.2 -8.55 -0.9 -8.55 -10.3 -8.55 -14.0 -9.45 L-12.75 -18.15 -12.1 -24.5 Q-12.85 -39.4 -21.4 -42.15 L-22.65 -42.3 -23.0 -42.3 -24.2 -42.35 Q-28.75 -42.35 -31.75 -40.1 L-31.75 -40.15 -28.2 -43.05 -27.85 -43.3 Q-22.95 -47.1 -18.65 -49.15 -18.25 -47.85 -17.3 -46.5 -14.5 -42.4 -8.7 -42.4 L-8.2 -42.4 -7.6 -42.3 -8.05 -42.1 -14.6 -39.25 -14.1 -38.45 -13.55 -37.4 -12.55 -34.4 -12.2 -32.5 -11.8 -32.3 -8.7 -30.8 -3.9 -28.65 14.05 -20.85 M12.4 10.9 L10.75 10.9 7.95 10.95 7.45 10.75 5.25 9.9 3.5 9.25 Q10.35 7.85 15.8 5.65 L16.8 5.25 16.9 5.0 16.9 4.95 17.2 4.8 Q16.95 4.8 16.85 4.6 L16.8 4.4 14.25 4.4 14.25 3.45 17.15 3.4 17.1 3.45 17.3 3.6 17.8 3.95 18.3 4.75 Q18.3 5.25 16.5 6.05 L9.3 8.45 9.35 8.6 Q11.35 8.0 15.4 7.45 L16.35 7.25 Q18.25 6.65 19.75 5.55 L19.95 6.75 20.5 9.25 Q22.8 18.25 32.45 42.55 L29.1 43.45 28.8 42.85 25.6 36.4 19.2 23.2 Q19.2 23.6 18.8 23.6 16.05 32.1 14.7 37.75 13.55 42.55 12.95 46.7 L5.1 47.65 5.0 47.65 7.3 35.9 11.15 14.45 14.15 11.25 15.0 10.75 15.4 10.55 15.35 10.5 15.15 10.55 14.7 10.65 12.4 10.9 M-5.35 9.4 L-4.7 9.35 -4.4 21.7 -5.6 25.15 -5.7 31.95 -6.4 31.45 Q-8.85 29.7 -9.3 29.7 -11.25 29.7 -14.7 38.3 -17.05 44.1 -18.05 48.3 L-23.75 47.95 -24.85 47.9 Q-21.7 37.9 -19.15 32.35 -13.95 21.3 -6.4 14.95 -6.05 15.0 -5.45 15.35 L-5.35 9.4" fill="#d2b6b6" fill-rule="evenodd" stroke="none"/>
    <path d="M11.15 -38.9 L11.8 -34.3 Q12.75 -27.55 14.05 -20.85 L-3.9 -28.65 -8.7 -30.8 -11.8 -32.3 -12.2 -32.5 -12.55 -34.4 -13.55 -37.4 -14.1 -38.45 -14.6 -39.25 -8.05 -42.1 -7.6 -42.3 -6.2 -42.2 Q-3.95 -42.2 -1.55 -43.2 0.4 -44.0 1.3 -45.2 L1.85 -44.75 2.1 -44.95 Q2.75 -44.45 3.45 -44.0 L-2.4 -41.4 Q-8.0 -38.95 -10.0 -37.6 -9.7 -37.3 -9.3 -37.25 L-8.2 -37.2 0.25 -37.9 11.15 -38.9 M12.95 46.7 Q13.55 42.55 14.7 37.75 16.05 32.1 18.8 23.6 19.2 23.6 19.2 23.2 L25.6 36.4 28.8 42.85 29.1 43.45 Q21.1 45.45 12.95 46.7 M19.75 5.55 Q18.25 6.65 16.35 7.25 L15.4 7.45 Q11.35 8.0 9.35 8.6 L9.3 8.45 16.5 6.05 Q18.3 5.25 18.3 4.75 L17.8 3.95 17.3 3.6 17.1 3.45 17.15 3.4 Q18.75 3.6 19.8 4.45 19.7 4.85 19.75 5.55 M-4.4 21.7 L-4.25 29.4 -4.3 29.4 -4.25 29.55 -4.0 31.7 -3.7 49.25 -5.3 49.1 -5.0 45.4 -4.75 42.75 -6.9 41.1 -9.45 45.55 -10.95 48.45 -11.1 48.4 -11.4 48.4 -15.7 48.35 -18.05 48.3 Q-17.05 44.1 -14.7 38.3 -11.25 29.7 -9.3 29.7 -8.85 29.7 -6.4 31.45 L-5.7 31.95 -5.6 25.15 -4.4 21.7 M25.6 43.2 L22.2 38.3 21.0 40.35 Q20.55 41.2 20.25 42.2 L19.7 44.15 25.6 43.2" fill="#e0cdcd" fill-rule="evenodd" stroke="none"/>
    <path d="M13.4 -6.7 L13.1 -6.2 11.0 -5.5 Q9.75 -4.65 7.85 -4.15 L3.65 -3.0 3.2 -2.85 2.65 -2.7 1.6 -2.4 -5.25 -1.15 -12.25 -0.4 -15.0 -0.65 Q-16.55 -1.0 -18.05 -1.7 -20.8 -3.0 -21.6 -4.85 L-23.9 -5.65 Q-25.95 -10.2 -27.45 -15.1 L-28.0 -16.95 Q-26.4 -15.05 -23.5 -15.05 -19.55 -15.05 -16.8 -19.85 -14.4 -24.05 -14.4 -28.65 -14.4 -30.05 -14.7 -31.25 L-15.05 -32.65 -15.4 -34.5 Q-15.9 -36.2 -16.8 -37.05 -18.05 -38.3 -19.7 -39.1 -21.55 -40.05 -23.1 -40.1 L-23.3 -40.1 Q-25.45 -40.1 -28.0 -39.35 -30.15 -38.7 -31.6 -37.85 L-31.65 -38.5 Q-30.7 -39.45 -28.95 -40.0 L-24.2 -40.65 -23.05 -40.6 Q-13.7 -40.1 -13.7 -30.45 L-13.7 -29.65 -13.5 -27.7 Q-13.5 -24.05 -14.95 -20.65 L-15.9 -18.8 Q-16.55 -17.65 -17.3 -16.8 L-18.65 -13.95 -20.1 -10.6 -19.9 -8.7 -14.7 -6.95 -7.15 -4.8 -6.6 -4.8 Q0.75 -4.8 10.5 -6.25 L13.4 -6.7 M12.4 10.9 L14.7 10.65 15.15 10.55 15.35 10.5 15.4 10.55 15.0 10.75 14.4 11.0 11.1 12.25 11.15 12.25 10.55 12.45 10.2 12.55 9.25 12.8 9.05 12.85 3.0 13.35 8.4 11.75 8.7 11.65 9.3 11.5 9.65 11.6 12.4 10.9 M14.25 4.45 L15.2 4.6 16.9 4.95 15.3 5.6 Q10.8 7.25 6.3 7.95 L6.25 7.95 1.65 8.45 1.05 8.5 -0.95 9.85 Q-2.55 11.15 -2.55 11.75 L-2.05 13.45 -1.3 14.95 4.65 14.75 Q0.7 16.5 -0.45 17.3 -1.85 18.3 -2.05 19.65 L-1.15 25.85 -1.1 26.05 0.65 37.6 2.5 47.9 0.2 48.1 -0.3 48.1 Q-1.6 41.05 -3.2 33.95 L-4.05 30.4 -4.25 29.55 -4.3 29.4 -4.25 29.4 -4.4 21.7 -4.7 9.35 -5.35 9.4 -7.5 9.65 -12.6 10.05 -15.75 9.5 -17.75 13.85 -21.35 22.0 Q-21.95 23.5 -25.25 29.15 -28.75 35.45 -30.55 41.25 L-31.65 43.8 -21.3 7.2 -20.1 6.75 -19.45 6.75 Q-19.0 7.75 -16.75 7.95 L-16.25 8.0 -14.0 8.1 -13.9 8.1 -9.55 8.4 -8.8 8.4 -8.65 8.4 -8.45 8.4 -6.0 8.3 -5.35 8.25 -4.7 8.2 -3.95 8.15 -3.85 8.15 9.65 6.5 9.75 6.5 13.7 5.6 14.25 5.45 14.25 4.45 M-21.6 -4.85 L-19.8 -4.25 -19.2 -4.25 -19.8 -4.25 -21.6 -4.85" fill="#b38484" fill-rule="evenodd" stroke="none"/>
    <path d="M-28.0 -16.95 L-28.65 -19.2 -29.15 -21.35 -29.25 -21.65 Q-31.05 -29.4 -31.6 -37.85 -30.15 -38.7 -28.0 -39.35 -25.45 -40.1 -23.3 -40.1 L-23.1 -40.1 Q-21.55 -40.05 -19.7 -39.1 -18.05 -38.3 -16.8 -37.05 -15.9 -36.2 -15.4 -34.5 L-15.05 -32.65 -14.7 -31.25 Q-14.4 -30.05 -14.4 -28.65 -14.4 -24.05 -16.8 -19.85 -19.55 -15.05 -23.5 -15.05 -26.4 -15.05 -28.0 -16.95" fill="#a36a6a" fill-rule="evenodd" stroke="none"/>
    <path d="M3.45 -44.0 Q6.9 -41.65 11.0 -39.45 L11.05 -39.45 11.15 -38.9 0.25 -37.9 -8.2 -37.2 -9.3 -37.25 Q-9.7 -37.3 -10.0 -37.6 -8.0 -38.95 -2.4 -41.4 L3.45 -44.0 M25.6 43.2 L19.7 44.15 20.25 42.2 Q20.55 41.2 21.0 40.35 L22.2 38.3 25.6 43.2 M-5.3 49.1 L-10.95 48.45 -9.45 45.55 -6.9 41.1 -4.75 42.75 -5.0 45.4 -5.3 49.1" fill="#f2eaea" fill-rule="evenodd" stroke="none"/>
    <path d="M3.45 -44.0 Q6.9 -41.65 11.0 -39.45 L11.05 -39.45 11.15 -38.9 11.8 -34.3 Q12.75 -27.55 14.05 -20.85 14.95 -16.05 16.0 -11.2 L16.0 -11.15 13.4 -6.7 13.1 -6.2 M-21.6 -4.85 L-23.9 -5.65 Q-25.95 -10.2 -27.45 -15.1 L-28.0 -16.95 -28.65 -19.2 -29.15 -21.35 M-29.25 -21.65 Q-31.05 -29.4 -31.6 -37.85 L-31.65 -38.5 -31.7 -39.65 -31.7 -39.75 -31.75 -40.1 -31.75 -40.15 -28.2 -43.05 -27.85 -43.3 Q-22.95 -47.1 -18.65 -49.15 M1.4 -45.35 L1.7 -45.25 2.1 -44.95 Q2.75 -44.45 3.45 -44.0 M5.0 47.65 L5.1 47.65 12.95 46.7 Q21.1 45.45 29.1 43.45 L32.45 42.55 Q22.8 18.25 20.5 9.25 L19.95 6.75 19.75 5.55 Q19.7 4.85 19.8 4.45 18.75 3.6 17.15 3.4 L14.25 3.45 M2.5 47.9 L4.2 47.75 5.0 47.65 M-20.1 6.75 L-21.3 7.2 -31.65 43.8 -32.6 47.05 -26.6 47.7 -24.85 47.9 -23.75 47.95 -18.05 48.3 M-4.3 29.4 L-4.25 29.55 -4.05 30.4 -3.2 33.95 Q-1.6 41.05 -0.3 48.1 L0.2 48.1 2.5 47.9 M32.45 42.55 L32.7 43.2 M-19.2 -4.25 L-19.8 -4.25 -21.6 -4.85 M-32.6 47.05 L-32.75 47.6 M-4.05 30.4 L-4.0 31.7 -3.7 49.25 -5.3 49.1 -10.95 48.45 -11.1 48.4 -11.4 48.4 -15.7 48.35 -18.05 48.3" fill="none" stroke="#a36a6a" stroke-linecap="round" stroke-linejoin="round" stroke-opacity="0.4" stroke-width="0.05"/>
  </g>
</svg>
