<?xml version="1.0" encoding="UTF-8" standalone="no"?>
<svg xmlns:xlink="http://www.w3.org/1999/xlink" height="2.0px" width="8.0px" xmlns="http://www.w3.org/2000/svg">
  <g transform="matrix(1.0, 0.0, 0.0, 1.0, 0.1, 0.2)">
    <path d="M-0.1 0.55 Q0.4 -0.2 2.25 -0.2 3.6 -0.2 5.35 0.75 6.95 1.55 7.9 1.3 L6.4 1.8 4.3 1.1 Q2.65 0.45 0.9 0.45 L-0.1 0.55" fill="#e0cbcb" fill-rule="evenodd" stroke="none"/>
    <path d="M7.9 1.3 L6.4 1.8 4.3 1.1 Q2.65 0.45 0.9 0.45 L-0.1 0.55" fill="none" stroke="#a36a6a" stroke-linecap="round" stroke-linejoin="round" stroke-width="0.05"/>
  </g>
</svg>
