<?xml version="1.0" encoding="UTF-8" standalone="no"?>
<svg xmlns:xlink="http://www.w3.org/1999/xlink" height="10.4px" width="12.2px" xmlns="http://www.w3.org/2000/svg">
  <g transform="matrix(1.0, 0.0, 0.0, 1.0, 6.05, 4.8)">
    <path d="M4.6 -3.35 Q6.15 -1.75 6.15 0.4 6.15 2.6 4.6 4.05 3.15 5.6 0.95 5.6 -1.1 5.6 -2.65 4.15 -4.1 4.15 -5.1 3.2 -6.05 2.25 -6.05 0.8 -6.05 -0.65 -5.1 -1.65 -4.35 -2.35 -3.4 -2.5 L-2.8 -3.35 Q-1.2 -4.8 0.95 -4.8 3.15 -4.8 4.6 -3.35" fill="#cccccc" fill-rule="evenodd" stroke="none"/>
  </g>
</svg>
