<?xml version="1.0" encoding="UTF-8" standalone="no"?>
<svg xmlns:xlink="http://www.w3.org/1999/xlink" height="33.3px" width="52.7px" xmlns="http://www.w3.org/2000/svg">
  <g transform="matrix(1.0, 0.0, 0.0, 1.0, 26.35, 16.65)">
    <path d="M25.1 -0.6 L26.35 0.55 Q20.55 6.5 9.5 11.65 -1.6 16.8 -5.45 16.65 -9.35 16.45 -10.45 15.3 -11.6 14.15 -11.6 12.3 -11.6 9.65 -4.15 2.35 3.25 -5.0 3.25 -7.25 3.25 -8.3 2.3 -8.85 L0.5 -9.3 Q-2.55 -9.3 -11.65 -3.6 -18.45 0.7 -23.15 4.4 L-26.35 0.7 Q-15.5 -8.7 -11.6 -11.4 -5.35 -15.75 -1.0 -16.45 3.3 -17.2 6.65 -14.95 9.95 -12.7 9.0 -9.6 L6.0 -1.45 Q3.9 3.65 3.9 4.95 3.9 5.45 4.5 5.9 5.1 6.35 5.7 6.35 9.5 6.35 16.45 2.45 L20.2 -0.25 23.05 -2.65 25.1 -0.6" fill="#ffffff" fill-rule="evenodd" stroke="none"/>
  </g>
</svg>
