<?xml version="1.0" encoding="UTF-8" standalone="no"?>
<svg xmlns:xlink="http://www.w3.org/1999/xlink" height="195.2px" width="263.85px" xmlns="http://www.w3.org/2000/svg">
  <g transform="matrix(1.0, 0.0, 0.0, 1.0, -111.8, -25.0)">
    <path d="M325.1 71.5 L324.85 72.65 Q323.2 79.8 320.1 85.7 L319.8 86.2 318.5 88.45 317.95 89.3 317.4 90.15 Q314.05 94.95 309.75 98.15 L308.4 101.15 Q305.5 108.35 305.5 114.55 305.5 129.15 315.0 139.75 321.3 146.8 328.85 149.05 332.35 150.05 336.15 150.05 341.6 150.05 348.45 147.1 355.65 144.0 361.65 138.8 374.9 127.25 375.65 112.65 L375.65 113.4 Q375.65 128.5 367.9 140.45 359.65 153.15 344.8 155.7 L346.35 158.85 Q340.55 157.3 339.8 157.3 335.05 157.3 331.4 158.55 327.75 159.75 325.2 162.25 L325.2 161.3 325.2 160.25 324.85 156.95 Q324.35 153.75 323.05 150.75 319.65 142.65 312.05 142.65 309.2 142.65 306.2 143.8 304.3 144.5 302.3 145.7 301.7 146.0 301.1 146.4 297.0 149.05 295.2 152.55 294.4 154.05 294.1 155.7 L291.55 150.75 Q289.8 147.85 287.85 145.5 L285.75 143.25 Q277.75 135.3 266.0 134.75 L264.15 134.7 259.25 135.1 253.1 136.0 253.55 133.2 Q253.55 131.25 253.2 129.5 L252.1 126.25 Q249.4 120.35 241.85 116.45 L240.05 115.55 Q235.7 113.55 231.4 112.7 L224.7 112.0 220.5 112.2 Q213.25 112.95 207.6 116.25 205.25 117.55 203.2 119.4 201.65 120.7 200.25 122.25 L199.25 123.45 Q192.15 132.1 192.15 143.8 192.15 151.6 196.3 157.75 L197.5 157.2 Q196.95 157.5 196.4 157.95 194.15 159.75 191.6 163.9 187.1 171.2 187.1 177.05 187.1 186.55 195.1 193.9 203.15 201.25 213.75 201.25 219.4 201.25 224.4 198.95 228.65 196.9 232.4 193.2 240.45 185.2 240.45 175.2 240.45 171.8 238.5 165.9 L238.4 165.7 238.45 165.65 Q241.8 163.95 244.4 161.5 244.65 162.8 245.2 164.1 246.25 166.85 246.25 169.4 L246.1 176.3 Q245.65 179.65 243.5 184.5 240.25 190.35 237.0 194.8 241.55 199.85 245.45 201.6 249.4 203.4 256.1 203.4 275.85 203.4 287.0 188.15 290.75 183.0 292.9 177.3 295.85 169.2 295.45 160.05 L295.4 159.05 295.6 159.55 296.75 163.35 Q298.2 168.7 298.2 172.3 298.2 176.3 297.65 180.0 L297.6 180.1 298.3 180.25 Q303.25 182.25 306.55 182.25 L307.05 182.25 Q305.95 183.3 304.75 185.0 301.85 189.0 301.85 192.05 301.85 198.2 306.95 203.4 312.0 208.55 317.9 208.55 L327.0 207.8 Q335.0 207.8 344.55 200.75 L341.35 205.6 Q333.0 216.55 319.2 219.3 313.65 218.7 305.55 215.85 293.05 211.4 293.05 205.95 293.05 205.25 294.9 198.85 296.8 192.3 297.45 190.95 L297.45 184.4 296.7 184.4 Q293.75 195.45 285.0 203.45 L284.3 203.45 284.3 204.1 Q271.0 215.8 249.55 215.8 L244.7 215.45 242.5 213.9 Q234.4 207.55 233.85 198.7 L231.3 201.4 226.65 205.3 Q219.0 210.75 210.05 210.75 200.2 210.75 190.8 201.95 188.15 199.5 186.2 196.95 181.5 190.75 181.25 184.15 179.6 188.45 175.15 192.7 168.2 199.35 154.85 205.25 L151.1 204.4 Q141.5 202.0 133.65 197.55 118.1 188.6 113.6 174.05 116.85 179.4 122.7 183.0 133.45 189.55 151.95 189.55 166.0 189.55 176.05 180.0 186.35 170.15 186.35 155.5 186.35 142.3 174.15 132.8 171.7 130.9 169.05 129.35 L171.75 129.55 Q190.1 129.55 203.2 109.8 208.3 102.05 211.35 93.0 214.1 84.7 214.1 78.65 214.1 70.15 211.15 61.4 209.25 55.75 206.75 52.35 L208.1 53.75 Q216.2 62.5 221.4 75.45 L222.2 75.45 222.15 76.85 Q222.15 77.95 222.55 79.15 L222.9 80.5 222.4 80.75 Q223.7 83.35 226.6 85.65 231.2 89.3 235.3 89.3 245.1 89.3 249.15 82.75 252.1 78.0 252.15 69.5 254.45 80.25 263.8 86.45 L264.65 87.0 264.85 87.15 Q268.8 89.5 273.45 90.95 280.25 93.0 288.65 93.0 305.6 93.0 317.25 80.55 L319.3 78.25 319.6 77.85 Q320.75 75.0 322.9 73.1 324.6 70.2 325.85 67.15 L325.1 71.5 M251.4 56.25 L252.55 57.45 Q251.45 60.55 251.4 61.9 L251.4 56.25 M251.4 62.35 L251.75 64.35 251.95 66.0 252.15 69.25 252.15 69.5 251.6 66.0 251.4 66.0 251.4 62.35 251.3 61.95 251.4 61.95 251.4 62.35 M255.65 94.75 Q254.15 95.55 252.8 96.65 248.5 100.2 248.5 104.25 248.5 112.25 254.3 116.45 259.35 120.05 267.45 120.05 273.35 120.05 279.9 115.7 283.2 113.5 284.9 111.4 284.35 108.9 283.4 106.6 281.15 101.45 276.55 97.05 L273.4 96.15 262.65 93.0 260.9 93.1 Q259.45 93.25 258.05 93.75 256.8 94.1 255.65 94.75 M140.3 120.05 L140.55 120.25 140.65 120.35 140.5 120.25 140.3 120.05 M215.6 93.75 Q212.6 96.65 212.6 99.8 212.6 104.25 215.6 106.1 218.05 107.6 222.9 107.6 227.65 107.6 231.65 104.7 235.3 102.05 235.3 99.55 235.3 97.5 229.9 93.85 227.85 92.45 226.15 91.6 224.25 90.8 222.05 90.8 218.65 90.8 215.6 93.75 M197.5 157.2 L198.6 156.75 199.3 156.6 199.5 156.55 Q199.5 157.25 198.65 156.8 L197.5 157.2 M289.7 115.25 L284.8 119.25 Q277.5 124.45 271.85 125.9 271.85 126.45 271.5 126.6 276.0 126.0 285.1 133.25 293.3 139.75 297.45 145.65 297.4 142.75 301.15 135.65 L304.9 129.05 300.0 129.55 Q294.0 129.55 291.55 127.3 289.4 125.3 289.4 120.75 289.4 116.75 289.7 115.25 M150.55 123.0 L150.45 123.55 150.4 123.55 150.55 123.0" fill="#983010" fill-rule="evenodd" stroke="none"/>
    <path d="M154.85 205.25 Q168.2 199.35 175.15 192.7 179.6 188.45 181.25 184.15 181.5 190.75 186.2 196.95 182.8 199.0 176.1 202.0 166.5 206.3 164.05 206.3 L154.85 205.25 M226.65 205.3 L231.3 201.4 233.85 198.7 Q234.4 207.55 242.5 213.9 L244.7 215.45 Q238.0 214.5 232.4 210.8 228.65 208.3 226.65 205.3 M285.0 203.45 Q293.75 195.45 296.7 184.4 L297.45 184.4 297.45 190.95 Q296.8 192.3 294.9 198.85 293.05 205.25 293.05 205.95 293.05 211.4 305.55 215.85 313.65 218.7 319.2 219.3 L309.45 220.2 302.8 219.65 293.8 215.8 Q289.65 214.0 287.2 211.85 284.15 209.15 284.3 206.3 L284.3 204.1 285.0 203.45 M289.7 115.25 Q289.4 116.75 289.4 120.75 289.4 125.3 291.55 127.3 294.0 129.55 300.0 129.55 L304.9 129.05 301.15 135.65 Q297.4 142.75 297.45 145.65 293.3 139.75 285.1 133.25 276.0 126.0 271.5 126.6 271.85 126.45 271.85 125.9 277.5 124.45 284.8 119.25 L289.7 115.25" fill="#680000" fill-rule="evenodd" stroke="none"/>
    <path d="M325.85 67.15 Q324.6 70.2 322.9 73.1 320.75 75.0 319.6 77.85 L319.3 78.25 317.25 80.55 Q305.6 93.0 288.65 93.0 280.25 93.0 273.45 90.95 268.8 89.5 264.85 87.15 L264.65 87.0 263.8 86.45 Q254.45 80.25 252.15 69.5 252.1 78.0 249.15 82.75 245.1 89.3 235.3 89.3 231.2 89.3 226.6 85.65 223.7 83.35 222.4 80.75 L222.9 80.5 222.55 79.15 Q222.15 77.95 222.15 76.85 L222.2 75.45 Q222.3 71.8 222.95 68.75 223.4 76.85 230.15 76.85 235.8 76.85 240.45 71.85 245.5 66.35 245.5 58.55 245.5 55.55 244.55 53.55 L248.9 53.9 251.4 56.25 251.4 53.5 Q254.85 42.25 261.6 35.4 257.25 43.0 257.25 50.15 257.25 61.4 260.9 66.65 265.4 73.2 276.65 73.2 290.7 73.2 302.55 63.75 315.0 53.8 315.0 40.65 L314.95 38.05 314.7 35.15 315.0 35.45 317.25 38.15 Q325.95 49.4 325.95 64.85 L325.85 67.15 M206.75 52.35 Q209.25 55.75 211.15 61.4 214.1 70.15 214.1 78.65 214.1 84.7 211.35 93.0 208.3 102.05 203.2 109.8 190.1 129.55 171.75 129.55 L169.05 129.35 Q171.7 130.9 174.15 132.8 186.35 142.3 186.35 155.5 186.35 170.15 176.05 180.0 166.0 189.55 151.95 189.55 133.45 189.55 122.7 183.0 116.85 179.4 113.6 174.05 112.3 169.7 111.95 164.95 113.95 168.15 117.65 170.55 124.4 174.9 133.4 174.9 147.35 174.9 159.3 166.9 172.5 158.05 172.5 145.3 172.5 139.25 169.4 133.25 168.1 130.7 166.55 128.95 L162.65 128.05 158.3 126.9 154.95 125.95 Q146.15 123.35 142.45 121.5 L140.65 120.35 140.55 120.25 140.3 120.05 140.5 119.65 135.6 116.7 Q129.8 112.6 126.3 106.9 120.55 97.5 120.55 81.65 120.55 80.1 123.55 73.7 121.3 79.75 121.3 84.9 121.3 94.5 134.45 103.2 146.65 111.25 157.75 111.25 177.75 111.25 191.4 99.55 205.3 87.6 205.3 69.55 205.3 66.55 203.5 61.4 201.6 56.0 198.75 51.25 197.1 46.7 195.3 44.05 198.95 45.85 202.4 48.5 L206.75 52.35 M344.55 200.75 Q335.0 207.8 327.0 207.8 L317.9 208.55 Q312.0 208.55 306.95 203.4 301.85 198.2 301.85 192.05 301.85 189.0 304.75 185.0 305.95 183.3 307.05 182.25 L306.55 182.25 Q303.25 182.25 298.3 180.25 L297.65 180.0 Q298.2 176.3 298.2 172.3 298.2 168.7 296.75 163.35 L295.6 159.55 295.4 159.05 295.45 160.05 Q295.85 169.2 292.9 177.3 290.75 183.0 287.0 188.15 275.85 203.4 256.1 203.4 249.4 203.4 245.45 201.6 241.55 199.85 237.0 194.8 240.25 190.35 243.5 184.5 245.65 179.65 246.1 176.3 L246.25 169.4 Q246.25 166.85 245.2 164.1 244.65 162.8 244.4 161.5 241.8 163.95 238.45 165.65 L238.4 165.7 238.5 165.9 Q240.45 171.8 240.45 175.2 240.45 185.2 232.4 193.2 228.65 196.9 224.4 198.95 219.4 201.25 213.75 201.25 203.15 201.25 195.1 193.9 187.1 186.55 187.1 177.05 187.1 171.2 191.6 163.9 194.15 159.75 196.4 157.95 196.95 157.5 197.5 157.2 L196.3 157.75 Q192.15 151.6 192.15 143.8 192.15 132.1 199.25 123.45 196.55 128.55 196.55 134.6 196.55 145.45 201.7 150.75 207.4 156.55 219.9 156.55 232.85 156.55 243.35 146.4 248.55 141.4 251.1 135.95 252.6 132.8 253.2 129.5 253.55 131.25 253.55 133.2 L253.1 136.0 259.25 135.1 264.15 134.7 266.0 134.75 Q262.5 137.15 258.35 145.1 L257.3 147.05 256.05 149.7 Q253.55 155.15 252.4 159.8 251.4 163.8 251.4 167.15 251.4 176.3 257.2 180.75 262.05 184.4 270.0 184.4 279.45 184.4 287.25 176.3 294.0 169.3 294.45 162.6 L294.45 161.7 294.3 159.75 Q293.8 159.5 293.8 158.4 L293.8 157.95 294.1 155.7 Q294.4 154.05 295.2 152.55 297.0 149.05 301.1 146.4 301.7 146.0 302.3 145.7 L301.25 146.7 Q296.7 151.35 296.7 156.9 296.7 162.3 300.4 165.35 303.9 168.25 309.8 168.25 316.15 168.25 321.6 163.95 323.8 162.2 325.2 160.25 L325.2 161.3 325.2 162.25 Q325.05 166.35 323.7 169.75 322.35 173.25 319.75 176.05 L318.65 177.1 316.55 178.85 Q315.0 181.6 315.0 184.0 315.0 189.6 321.6 192.45 326.45 194.6 332.5 194.6 341.05 194.6 348.6 187.3 L349.75 186.15 Q348.2 194.2 344.55 200.75 M375.65 112.65 Q374.9 127.25 361.65 138.8 355.65 144.0 348.45 147.1 341.6 150.05 336.15 150.05 332.35 150.05 328.85 149.05 321.3 146.8 315.0 139.75 305.5 129.15 305.5 114.55 305.5 108.35 308.4 101.15 L309.75 98.15 Q314.05 94.95 317.4 90.15 L315.95 93.5 Q314.25 98.0 314.25 101.3 314.25 108.45 321.6 114.95 329.05 121.5 337.65 121.5 350.4 121.5 361.8 112.05 370.45 104.85 372.7 96.7 374.9 102.7 375.5 109.15 L375.65 112.65 M251.4 56.25 L251.4 61.9 Q251.45 60.55 252.55 57.45 L251.4 56.25 M251.4 61.95 L251.3 61.95 251.4 62.35 251.4 61.95 M251.4 62.35 L251.4 66.0 251.6 66.0 252.15 69.5 252.15 69.25 251.95 66.0 251.75 64.35 251.4 62.35 M283.4 106.6 Q284.35 108.9 284.9 111.4 283.2 113.5 279.9 115.7 273.35 120.05 267.45 120.05 259.35 120.05 254.3 116.45 248.5 112.25 248.5 104.25 248.5 100.2 252.8 96.65 254.15 95.55 255.65 94.75 L254.2 96.2 Q251.4 99.35 251.4 101.7 251.4 106.3 255.1 108.4 258.75 110.5 266.7 110.5 276.7 110.5 282.85 106.9 L283.4 106.6 M215.6 93.75 Q218.65 90.8 222.05 90.8 224.25 90.8 226.15 91.6 227.85 92.45 229.9 93.85 235.3 97.5 235.3 99.55 235.3 102.05 231.65 104.7 227.65 107.6 222.9 107.6 218.05 107.6 215.6 106.1 212.6 104.25 212.6 99.8 212.6 96.65 215.6 93.75 M197.5 157.2 L198.65 156.8 Q199.5 157.25 199.5 156.55 L199.3 156.6 198.6 156.75 197.5 157.2 M206.85 167.25 Q203.75 165.65 200.9 163.05 199.05 164.15 197.45 165.95 194.4 169.5 194.4 173.8 194.4 180.9 199.55 184.4 203.85 187.3 211.1 187.3 220.25 187.3 225.85 182.25 231.0 177.65 231.0 171.15 L230.75 168.4 221.1 169.65 217.4 169.75 Q211.75 169.75 206.85 167.25 M150.55 123.0 L150.4 123.55 150.45 123.55 150.55 123.0" fill="#c86020" fill-rule="evenodd" stroke="none"/>
    <path d="M199.25 123.45 L200.25 122.25 Q201.65 120.7 203.2 119.4 201.75 123.1 201.75 127.65 201.75 136.6 209.0 139.75 214.1 142.0 226.1 142.0 239.45 142.0 246.25 136.85 251.55 132.8 252.1 126.25 L253.2 129.5 Q252.6 132.8 251.1 135.95 248.55 141.4 243.35 146.4 232.85 156.55 219.9 156.55 207.4 156.55 201.7 150.75 196.55 145.45 196.55 134.6 196.55 128.55 199.25 123.45 M302.3 145.7 Q304.3 144.5 306.2 143.8 L305.3 144.85 Q302.5 148.4 302.5 152.25 302.5 157.55 306.15 159.6 308.65 160.95 313.5 160.95 320.5 160.95 324.85 156.95 L325.2 160.25 Q323.8 162.2 321.6 163.95 316.15 168.25 309.8 168.25 303.9 168.25 300.4 165.35 296.7 162.3 296.7 156.9 296.7 151.35 301.25 146.7 L302.3 145.7 M317.4 90.15 L317.95 89.3 Q318.35 93.6 322.3 95.9 327.25 98.8 338.3 98.8 349.6 98.8 356.6 91.6 361.85 86.2 362.45 79.95 L365.4 83.5 Q370.15 89.8 372.7 96.7 370.45 104.85 361.8 112.05 350.4 121.5 337.65 121.5 329.05 121.5 321.6 114.95 314.25 108.45 314.25 101.3 314.25 98.0 315.95 93.5 L317.4 90.15 M350.8 174.6 Q350.75 180.7 349.75 186.15 L348.6 187.3 Q341.05 194.6 332.5 194.6 326.45 194.6 321.6 192.45 315.0 189.6 315.0 184.0 315.0 181.6 316.55 178.85 L318.65 177.1 319.75 176.05 Q320.6 178.35 323.7 180.0 328.0 182.25 335.05 182.25 343.75 182.25 349.3 176.35 L350.8 174.6 M314.95 38.05 L315.0 40.65 Q315.0 53.8 302.55 63.75 290.7 73.2 276.65 73.2 265.4 73.2 260.9 66.65 257.25 61.4 257.25 50.15 257.25 43.0 261.6 35.4 L263.1 33.95 264.25 32.95 267.8 30.45 Q262.3 37.4 262.3 46.5 262.3 52.55 267.45 56.4 272.35 60.05 279.55 60.05 293.0 60.05 304.05 52.75 314.15 46.0 314.95 38.05 M244.55 53.55 Q245.5 55.55 245.5 58.55 245.5 66.35 240.45 71.85 235.8 76.85 230.15 76.85 223.4 76.85 222.95 68.75 223.85 64.5 225.8 61.45 225.9 63.8 226.55 64.5 227.2 65.25 229.5 65.25 233.3 65.25 236.05 61.6 238.2 58.8 238.2 57.15 238.2 55.95 236.4 54.3 L236.25 54.15 242.25 53.5 244.55 53.55 M283.4 106.6 L282.85 106.9 Q276.7 110.5 266.7 110.5 258.75 110.5 255.1 108.4 251.4 106.3 251.4 101.7 251.4 99.35 254.2 96.2 L255.65 94.75 Q256.8 94.1 258.05 93.75 L257.85 94.05 Q256.5 96.35 256.5 96.9 256.5 99.2 258.75 100.35 260.2 101.05 261.55 101.05 268.55 101.05 271.85 98.05 L273.4 96.15 276.55 97.05 Q281.15 101.45 283.4 106.6 M181.9 40.45 Q189.0 41.0 195.3 44.05 197.1 46.7 198.75 51.25 201.6 56.0 203.5 61.4 205.3 66.55 205.3 69.55 205.3 87.6 191.4 99.55 177.75 111.25 157.75 111.25 146.65 111.25 134.45 103.2 121.3 94.5 121.3 84.9 121.3 79.75 123.55 73.7 L124.05 72.6 Q127.1 66.1 129.35 62.3 L130.75 60.25 132.9 57.8 130.75 61.45 Q126.35 69.35 126.35 73.95 126.35 82.0 134.45 87.15 142.4 92.25 154.5 92.25 167.45 92.25 179.05 83.55 191.4 74.2 191.4 61.95 191.4 58.75 190.0 54.3 188.2 48.5 184.85 43.95 L181.9 40.45 M162.65 128.05 L166.55 128.95 Q168.1 130.7 169.4 133.25 172.5 139.25 172.5 145.3 172.5 158.05 159.3 166.9 147.35 174.9 133.4 174.9 124.4 174.9 117.65 170.55 113.95 168.15 111.95 164.95 L111.8 161.3 Q111.8 155.95 112.35 151.3 113.6 154.0 116.15 155.9 120.95 159.55 129.25 159.55 142.95 159.55 153.45 151.5 163.65 143.65 163.65 133.95 163.65 130.65 162.65 128.05 M221.1 169.65 L230.75 168.4 231.0 171.15 Q231.0 177.65 225.85 182.25 220.25 187.3 211.1 187.3 203.85 187.3 199.55 184.4 194.4 180.9 194.4 173.8 194.4 169.5 197.45 165.95 199.05 164.15 200.9 163.05 203.75 165.65 206.85 167.25 205.3 168.2 205.3 170.15 205.3 172.35 207.55 173.4 209.1 174.15 211.2 174.15 219.6 174.15 221.1 169.65 M252.4 159.8 Q253.4 165.0 258.75 168.3 264.6 171.9 273.25 171.9 284.75 171.9 290.85 166.9 293.15 165.0 294.45 162.6 294.0 169.3 287.25 176.3 279.45 184.4 270.0 184.4 262.05 184.4 257.2 180.75 251.4 176.3 251.4 167.15 251.4 163.8 252.4 159.8" fill="#e08830" fill-rule="evenodd" stroke="none"/>
    <path d="M320.1 85.7 Q320.65 86.2 322.7 86.7 L326.25 87.15 Q337.25 87.15 343.5 82.75 348.55 79.25 348.55 75.05 348.55 72.65 346.45 69.85 355.3 72.2 362.45 79.95 361.85 86.2 356.6 91.6 349.6 98.8 338.3 98.8 327.25 98.8 322.3 95.9 318.35 93.6 317.95 89.3 L318.5 88.45 319.8 86.2 320.1 85.7 M203.2 119.4 Q205.25 117.55 207.6 116.25 206.8 117.95 206.8 120.05 206.8 125.1 211.95 127.3 215.55 128.8 221.05 128.8 232.15 128.8 237.45 125.15 241.1 122.7 241.1 119.7 241.1 117.4 240.05 115.55 L241.85 116.45 Q249.4 120.35 252.1 126.25 251.55 132.8 246.25 136.85 239.45 142.0 226.1 142.0 214.1 142.0 209.0 139.75 201.75 136.6 201.75 127.65 201.75 123.1 203.2 119.4 M287.85 145.5 Q289.8 147.85 291.55 150.75 L294.1 155.7 293.8 157.95 293.8 158.4 Q293.8 159.5 294.3 159.75 L294.45 161.7 294.45 162.6 Q293.15 165.0 290.85 166.9 284.75 171.9 273.25 171.9 264.6 171.9 258.75 168.3 253.4 165.0 252.4 159.8 253.55 155.15 256.05 149.7 256.65 152.15 258.7 153.0 L267.45 153.75 Q277.4 153.75 282.8 150.75 286.4 148.75 287.85 145.5 M306.2 143.8 Q309.2 142.65 312.05 142.65 319.65 142.65 323.05 150.75 324.35 153.75 324.85 156.95 320.5 160.95 313.5 160.95 308.65 160.95 306.15 159.6 302.5 157.55 302.5 152.25 302.5 148.4 305.3 144.85 L306.2 143.8 M325.2 162.25 Q327.75 159.75 331.4 158.55 329.6 161.25 329.6 163.85 329.6 167.0 333.3 168.3 335.35 169.0 337.95 169.0 344.7 169.0 349.45 166.0 350.8 170.3 350.8 174.15 L350.8 174.6 349.3 176.35 Q343.75 182.25 335.05 182.25 328.0 182.25 323.7 180.0 320.6 178.35 319.75 176.05 322.35 173.25 323.7 169.75 325.05 166.35 325.2 162.25 M314.95 38.05 Q314.15 46.0 304.05 52.75 293.0 60.05 279.55 60.05 272.35 60.05 267.45 56.4 262.3 52.55 262.3 46.5 262.3 37.4 267.8 30.45 271.1 28.45 274.95 27.15 271.85 31.1 271.85 34.85 271.85 37.45 274.0 38.9 276.1 40.3 279.8 40.3 286.75 40.3 293.75 36.0 300.9 31.6 301.1 26.7 308.9 29.15 314.7 35.15 L314.95 38.05 M258.05 93.75 Q259.45 93.25 260.9 93.1 L262.65 93.0 273.4 96.15 271.85 98.05 Q268.55 101.05 261.55 101.05 260.2 101.05 258.75 100.35 256.5 99.2 256.5 96.9 256.5 96.35 257.85 94.05 L258.05 93.75 M170.25 41.05 L178.65 40.3 181.9 40.45 184.85 43.95 Q188.2 48.5 190.0 54.3 191.4 58.75 191.4 61.95 191.4 74.2 179.05 83.55 167.45 92.25 154.5 92.25 142.4 92.25 134.45 87.15 126.35 82.0 126.35 73.95 126.35 69.35 130.75 61.45 130.95 67.15 134.45 71.8 138.8 77.6 146.15 77.6 158.6 77.6 166.65 69.6 173.9 62.3 173.9 52.75 173.9 45.65 170.25 41.1 L170.25 41.05 M236.25 54.15 L236.4 54.3 Q238.2 55.95 238.2 57.15 238.2 58.8 236.05 61.6 233.3 65.25 229.5 65.25 227.2 65.25 226.55 64.5 225.9 63.8 225.8 61.45 226.8 59.9 228.0 58.65 231.3 55.35 236.25 54.15 M158.3 126.9 L162.65 128.05 Q163.65 130.65 163.65 133.95 163.65 143.65 153.45 151.5 142.95 159.55 129.25 159.55 120.95 159.55 116.15 155.9 113.6 154.0 112.35 151.3 L112.95 147.25 113.1 146.4 Q114.7 137.75 118.5 131.8 L119.1 130.95 Q119.3 135.95 122.7 138.35 125.85 140.5 131.9 140.5 144.8 140.5 152.7 133.95 156.75 130.6 158.3 126.9 M221.1 169.65 Q219.6 174.15 211.2 174.15 209.1 174.15 207.55 173.4 205.3 172.35 205.3 170.15 205.3 168.2 206.85 167.25 211.75 169.75 217.4 169.75 L221.1 169.65" fill="#f0b040" fill-rule="evenodd" stroke="none"/>
    <path d="M326.7 70.7 Q326.7 72.6 328.85 74.7 331.05 76.85 333.25 76.85 334.6 76.85 336.15 74.7 337.65 72.65 337.65 71.05 L336.3 68.85 338.3 68.8 Q342.55 68.8 346.45 69.85 348.55 72.65 348.55 75.05 348.55 79.25 343.5 82.75 337.25 87.15 326.25 87.15 L322.7 86.7 Q320.65 86.2 320.1 85.7 323.2 79.8 324.85 72.65 L325.1 71.5 Q325.85 71.05 326.7 70.7 M207.6 116.25 Q213.25 112.95 220.5 112.2 L219.3 113.05 Q217.0 115.0 217.0 117.45 217.0 119.75 218.5 120.1 L221.8 120.05 Q226.05 120.05 228.75 118.55 231.65 116.95 231.65 114.15 L231.4 112.7 Q235.7 113.55 240.05 115.55 241.1 117.4 241.1 119.7 241.1 122.7 237.45 125.15 232.15 128.8 221.05 128.8 215.55 128.8 211.95 127.3 206.8 125.1 206.8 120.05 206.8 117.95 207.6 116.25 M266.0 134.75 Q277.75 135.3 285.75 143.25 L287.85 145.5 Q286.4 148.75 282.8 150.75 277.4 153.75 267.45 153.75 L258.7 153.0 Q256.65 152.15 256.05 149.7 L257.3 147.05 258.35 145.1 Q262.5 137.15 266.0 134.75 M331.4 158.55 Q335.05 157.3 339.8 157.3 340.55 157.3 346.35 158.85 L347.95 162.0 349.45 166.0 Q344.7 169.0 337.95 169.0 335.35 169.0 333.3 168.3 329.6 167.0 329.6 163.85 329.6 161.25 331.4 158.55 M301.1 26.7 Q300.9 31.6 293.75 36.0 286.75 40.3 279.8 40.3 276.1 40.3 274.0 38.9 271.85 37.45 271.85 34.85 271.85 31.1 274.95 27.15 281.4 25.0 289.4 25.0 295.75 25.0 301.1 26.7 M170.25 41.05 L170.25 41.1 Q173.9 45.65 173.9 52.75 173.9 62.3 166.65 69.6 158.6 77.6 146.15 77.6 138.8 77.6 134.45 71.8 130.95 67.15 130.75 61.45 L132.9 57.8 133.1 57.65 135.6 55.3 136.15 54.85 Q138.05 53.3 144.0 49.1 148.45 46.0 160.3 43.1 165.75 41.75 170.25 41.05 M142.45 121.5 Q146.15 123.35 154.95 125.95 L158.3 126.9 Q156.75 130.6 152.7 133.95 144.8 140.5 131.9 140.5 125.85 140.5 122.7 138.35 119.3 135.95 119.1 130.95 121.45 127.45 125.15 124.15 L124.95 125.5 Q124.95 127.4 126.4 128.8 127.9 130.3 130.0 130.3 136.9 130.3 140.35 125.9 142.2 123.55 142.45 121.5 M156.2 50.25 Q155.55 49.85 154.5 49.85 147.85 49.85 141.75 55.7 136.65 60.55 136.65 63.0 136.65 65.65 138.1 66.65 139.2 67.4 141.75 67.4 147.45 67.4 155.6 62.35 163.65 57.35 163.65 54.15 163.65 51.55 159.15 50.4 L157.2 50.0 Q156.85 50.6 156.2 50.25" fill="#f8d060" fill-rule="evenodd" stroke="none"/>
    <path d="M336.3 68.85 L337.65 71.05 Q337.65 72.65 336.15 74.7 334.6 76.85 333.25 76.85 331.05 76.85 328.85 74.7 326.7 72.6 326.7 70.7 L326.8 70.65 Q330.55 69.05 336.3 68.85 M220.5 112.2 L224.7 112.0 231.4 112.7 231.65 114.15 Q231.65 116.95 228.75 118.55 226.05 120.05 221.8 120.05 L218.5 120.1 Q217.0 119.75 217.0 117.45 217.0 115.0 219.3 113.05 L220.5 112.2 M135.6 116.7 L140.5 119.65 140.3 120.05 140.5 120.25 140.65 120.35 142.45 121.5 Q142.2 123.55 140.35 125.9 136.9 130.3 130.0 130.3 127.9 130.3 126.4 128.8 124.95 127.4 124.95 125.5 L125.15 124.15 Q129.45 120.25 135.6 116.7 M156.2 50.25 Q156.85 50.6 157.2 50.0 L159.15 50.4 Q163.65 51.55 163.65 54.15 163.65 57.35 155.6 62.35 147.45 67.4 141.75 67.4 139.2 67.4 138.1 66.65 136.65 65.65 136.65 63.0 136.65 60.55 141.75 55.7 147.85 49.85 154.5 49.85 155.55 49.85 156.2 50.25" fill="#f8f090" fill-rule="evenodd" stroke="none"/>
  </g>
</svg>
