<?xml version="1.0" encoding="UTF-8" standalone="no"?>
<svg xmlns:xlink="http://www.w3.org/1999/xlink" height="57.1px" width="184.8px" xmlns="http://www.w3.org/2000/svg">
  <g transform="matrix(1.0, 0.0, 0.0, 1.0, -101.0, 28.1)">
    <path d="M137.6 -22.5 L141.4 -21.9 Q143.8 -21.2 143.8 -20.25 143.8 -19.8 143.0 -19.2 142.35 -18.7 142.25 -18.4 L147.9 -19.45 156.4 -20.1 Q161.2 -20.1 164.6 -18.85 169.0 -17.3 169.0 -14.2 169.0 -13.05 167.3 -11.65 166.1 -10.6 164.8 -10.0 L164.4 -9.85 164.85 -9.9 164.9 -9.95 166.2 -10.1 Q168.5 -10.25 171.4 -9.3 174.6 -8.2 174.6 -6.6 174.6 -4.35 171.85 -3.25 L169.75 -2.65 147.0 -4.05 133.6 -4.75 131.75 -4.8 131.75 -4.85 131.9 -4.85 132.1 -4.85 133.25 -4.85 133.6 -4.85 Q144.6 -4.65 148.6 -4.95 151.4 -5.15 161.15 -4.8 168.45 -4.65 171.4 -5.55 169.4 -7.25 161.05 -8.35 L154.85 -9.0 154.65 -9.0 154.55 -9.05 154.6 -9.25 154.7 -9.3 154.8 -9.3 154.85 -9.3 Q161.0 -9.85 161.0 -11.75 161.0 -14.3 154.2 -15.55 L143.4 -16.45 139.8 -16.25 135.4 -15.85 137.35 -16.45 Q139.0 -17.0 139.0 -17.8 139.0 -18.6 137.8 -19.2 136.55 -19.8 134.8 -19.8 132.0 -19.8 126.7 -18.3 L121.3 -17.0 128.0 -20.55 Q132.75 -22.5 137.6 -22.5 M142.25 -18.4 L141.8 -18.25 142.2 -18.25 142.25 -18.4 M163.8 -9.8 L164.2 -9.8 164.4 -9.85 163.8 -9.8 M210.6 -21.45 Q210.6 -22.4 209.4 -23.4 L208.45 -24.1 205.6 -23.6 203.4 -22.6 202.8 -22.75 Q202.6 -22.9 202.6 -23.4 202.6 -24.0 204.3 -24.65 206.0 -25.4 208.05 -25.7 L212.6 -25.4 215.0 -24.65 Q217.0 -23.7 217.0 -22.35 217.0 -21.2 215.85 -20.35 L213.15 -18.65 212.6 -18.55 213.0 -18.55 213.15 -18.65 Q216.05 -19.1 218.0 -16.8 219.8 -14.65 219.8 -12.05 219.8 -9.25 216.6 -8.25 L210.4 -7.65 207.0 -7.75 205.0 -8.25 Q210.6 -8.35 210.6 -11.9 210.6 -13.8 209.65 -15.0 208.35 -16.65 205.8 -16.45 206.6 -16.7 208.35 -18.1 210.6 -19.95 210.6 -21.45 M220.0 -27.95 Q220.8 -28.25 223.0 -27.95 L223.1 -27.8 223.2 -27.3 Q223.2 -25.85 221.0 -26.0 220.2 -26.15 220.0 -26.6 L219.9 -27.15 220.0 -27.95 M284.0 14.0 Q282.85 14.0 282.5 13.4 L282.4 12.8 Q282.4 11.45 284.1 11.55 285.8 11.65 285.8 12.95 285.8 13.45 285.1 13.75 L284.0 14.0 M224.5 17.5 L224.0 18.15 Q223.5 18.6 223.0 18.6 221.5 18.6 221.5 17.55 221.5 17.05 221.85 16.85 L224.3 16.8 224.4 16.95 224.5 17.5 M130.6 9.0 Q132.85 9.0 135.4 10.5 138.2 12.2 138.2 14.0 138.2 16.4 134.9 19.05 131.7 21.55 128.6 22.0 127.8 22.15 126.9 23.25 L125.05 25.65 Q122.1 29.0 117.2 29.0 111.35 29.0 107.0 26.25 102.6 23.55 102.6 19.75 102.6 18.05 104.6 16.85 L101.9 16.35 Q101.0 15.95 101.0 14.6 101.0 12.05 106.2 11.25 L109.8 10.5 Q111.4 9.95 111.4 8.7 111.4 8.1 109.85 6.9 111.55 7.0 112.6 7.8 113.8 8.75 113.8 10.35 113.8 11.8 110.4 12.35 107.0 12.85 107.0 14.3 107.0 16.65 111.4 18.1 115.1 19.3 119.2 19.3 123.85 19.3 127.0 17.2 130.2 15.05 130.2 11.85 130.2 11.0 129.3 10.35 128.55 9.85 127.25 9.55 L130.6 9.0" fill="#5a1403" fill-rule="evenodd" stroke="none"/>
  </g>
</svg>
