<?xml version="1.0" encoding="UTF-8" standalone="no"?>
<svg xmlns:xlink="http://www.w3.org/1999/xlink" height="29.0px" width="36.35px" xmlns="http://www.w3.org/2000/svg">
  <g transform="matrix(1.0, 0.0, 0.0, 1.0, 18.75, 16.5)">
    <path d="M6.55 -14.85 Q9.2 -13.25 9.2 -11.05 9.2 -9.3 7.6 -7.8 11.25 -7.65 14.05 -6.65 17.6 -5.15 17.6 -3.1 17.6 -1.05 14.05 0.3 L11.7 1.15 Q12.3 2.5 12.3 4.25 12.3 7.65 9.8 10.0 7.45 12.5 4.05 12.5 0.65 12.5 -1.85 10.0 -3.45 8.4 -3.9 6.15 L-7.15 6.45 Q-12.0 6.45 -15.4 3.8 -18.75 1.15 -18.75 -2.5 -18.75 -6.2 -15.4 -8.85 -12.3 -11.2 -8.15 -11.5 -7.85 -13.4 -5.65 -14.85 -3.0 -16.5 0.5 -16.5 4.05 -16.5 6.55 -14.85" fill="#999999" fill-rule="evenodd" stroke="none"/>
  </g>
</svg>
