<?xml version="1.0" encoding="UTF-8" standalone="no"?>
<svg xmlns:xlink="http://www.w3.org/1999/xlink" height="28.75px" width="27.45px" xmlns="http://www.w3.org/2000/svg">
  <g transform="matrix(1.0, 0.0, 0.0, 1.0, 0.4, 1.4)">
    <path d="M25.1 -1.0 L25.35 -1.4 25.35 0.0 25.35 0.15 25.25 0.35 25.05 0.65 24.9 0.65 24.95 -0.85 25.1 -1.0 M24.3 -0.4 L24.3 1.15 23.95 1.3 24.0 -0.3 24.3 -0.4 M25.8 0.65 L25.35 1.15 25.35 1.55 25.35 1.7 25.35 1.8 25.1 2.3 24.6 2.7 24.7 1.75 24.75 1.55 24.95 1.25 25.15 0.95 25.35 0.75 25.65 0.5 25.8 0.2 25.8 0.4 25.8 0.65 M27.05 5.7 L27.05 5.85 27.05 23.25 27.05 23.4 26.9 23.85 26.8 24.0 26.75 24.1 25.25 25.75 25.3 25.8 25.3 25.95 25.3 26.05 24.6 26.9 24.4 26.3 Q24.4 26.05 25.0 25.35 L25.5 24.85 25.55 24.85 25.6 24.8 25.6 24.75 25.65 24.75 25.85 24.6 25.85 22.7 Q25.85 22.1 26.0 21.6 L26.1 20.95 25.9 20.1 25.95 7.7 25.9 7.65 26.05 6.6 25.35 4.45 25.0 3.7 24.9 3.4 25.5 2.95 26.9 5.2 27.05 5.7 M24.05 2.95 L24.05 3.1 24.0 3.0 24.05 2.95 24.1 1.85 24.0 1.5 24.25 1.4 24.35 1.75 24.4 1.85 24.3 2.85 24.15 2.9 24.05 2.95 M24.4 3.7 L24.5 4.0 25.3 7.25 Q25.8 10.05 25.5 12.15 L25.5 24.15 25.3 24.35 24.8 24.9 24.8 7.8 24.75 7.4 24.55 5.25 24.35 4.05 24.25 3.75 24.4 3.7 M24.3 25.3 L24.55 25.2 24.0 26.05 23.8 26.45 23.9 26.85 23.95 26.9 24.1 27.15 23.65 27.35 23.7 27.1 23.3 26.45 23.6 25.85 23.85 25.5 23.9 25.4 24.3 25.3" fill="#3395ff" fill-opacity="0.48235294" fill-rule="evenodd" stroke="none"/>
    <path d="M5.95 2.25 L4.15 1.9 4.05 1.9 3.75 1.4 4.65 1.4 4.45 1.0 4.5 0.9 4.55 0.75 4.7 0.45 6.05 0.7 6.05 0.9 6.05 1.25 6.0 2.05 5.95 2.25 M5.6 2.6 L5.6 2.65 5.65 2.75 5.2 2.65 3.8 2.35 3.7 2.35 3.6 2.2 3.6 1.95 4.1 2.1 4.15 2.05 5.8 2.35 5.6 2.6 M5.6 3.4 L5.4 3.9 4.15 3.6 4.1 3.6 3.15 3.4 3.2 3.35 3.45 3.15 3.35 2.75 3.15 2.45 3.25 2.45 4.65 3.05 4.7 3.05 5.65 3.35 5.6 3.4 M1.25 5.5 Q1.25 4.45 2.35 3.85 L2.8 3.6 3.85 4.05 4.95 4.4 4.7 5.05 Q4.2 6.95 4.2 7.9 L4.25 8.05 4.25 23.85 4.25 23.9 Q3.8 24.3 3.8 24.6 L4.25 25.4 4.15 25.45 3.25 25.4 2.55 25.25 Q1.85 24.9 1.85 24.1 L1.85 8.0 1.8 8.0 1.8 7.9 1.9 7.3 1.6 6.6 1.3 5.8 1.25 5.5 M0.4 4.2 Q0.35 4.35 0.65 4.5 L0.9 4.75 0.7 5.45 0.7 5.5 0.5 6.5 0.55 7.2 -0.4 6.75 -0.1 5.35 0.15 4.65 0.4 4.2 M3.8 26.5 L3.4 26.75 3.2 26.75 2.8 26.45 2.5 25.95 3.45 26.35 3.8 26.5" fill="#eef7ff" fill-opacity="0.48235294" fill-rule="evenodd" stroke="none"/>
  </g>
</svg>
