<?xml version="1.0" encoding="UTF-8" standalone="no"?>
<svg xmlns:xlink="http://www.w3.org/1999/xlink" height="7.95px" width="8.15px" xmlns="http://www.w3.org/2000/svg">
  <g transform="matrix(1.0, 0.0, 0.0, 1.0, 126.2, -9.1)">
    <path d="M-118.65 15.55 Q-119.6 17.05 -121.75 17.05 -124.65 17.05 -125.7 15.25 -126.25 14.35 -126.2 13.4 -126.2 8.85 -122.1 9.2 -118.05 9.5 -118.05 13.4 -118.05 14.6 -118.65 15.55" fill="#000000" fill-rule="evenodd" stroke="none"/>
  </g>
</svg>
