<?xml version="1.0" encoding="UTF-8" standalone="no"?>
<svg xmlns:xlink="http://www.w3.org/1999/xlink" height="12.0px" width="12.0px" xmlns="http://www.w3.org/2000/svg">
  <g transform="matrix(1.0, 0.0, 0.0, 1.0, 4.8, 4.8)">
    <path d="M3.35 -0.85 Q2.4 -1.75 1.2 -1.75 0.0 -1.75 -0.85 -0.85 -1.75 0.0 -1.75 1.2 -1.75 2.4 -0.85 3.35 0.0 4.15 1.2 4.15 2.4 4.15 3.35 3.35 4.15 2.4 4.15 1.2 4.15 0.0 3.35 -0.85 M1.2 -4.8 Q3.65 -4.8 5.45 -3.0 7.2 -1.25 7.2 1.2 7.2 3.65 5.45 5.45 3.65 7.2 1.2 7.2 -1.25 7.2 -3.0 5.45 -4.8 3.65 -4.8 1.2 -4.8 -1.25 -3.0 -3.0 -1.25 -4.8 1.2 -4.8" fill="#ff9800" fill-opacity="0.2" fill-rule="evenodd" stroke="none"/>
    <path d="M4.35 -1.95 Q5.75 -0.7 5.75 1.2 5.75 3.1 4.35 4.35 3.1 5.75 1.2 5.75 -0.7 5.75 -1.95 4.35 -3.25 3.1 -3.25 1.2 -3.25 -0.7 -1.95 -1.95 -0.7 -3.25 1.2 -3.25 3.1 -3.25 4.35 -1.95" fill="url(#gradient0)" fill-rule="evenodd" stroke="none"/>
  </g>
  <defs>
    <radialGradient cx="0" cy="0" gradientTransform="matrix(0.0061, 0.0, 0.0, 0.0061, 1.2, 1.2)" gradientUnits="userSpaceOnUse" id="gradient0" r="819.2" spreadMethod="pad">
      <stop offset="0.0" stop-color="#f76311"/>
      <stop offset="0.3607843137254902" stop-color="#fff300"/>
      <stop offset="0.4" stop-color="#f73811"/>
      <stop offset="0.5529411764705883" stop-color="#912b2b"/>
      <stop offset="1.0" stop-color="#421414" stop-opacity="0.0"/>
    </radialGradient>
  </defs>
</svg>
