<?xml version="1.0" encoding="UTF-8" standalone="no"?>
<svg xmlns:xlink="http://www.w3.org/1999/xlink" height="43.85px" width="30.0px" xmlns="http://www.w3.org/2000/svg">
  <g transform="matrix(1.0, 0.0, 0.0, 1.0, 15.0, 28.8)">
    <path d="M1.8 -14.85 L2.5 -14.75 4.5 -14.3 5.4 -14.0 Q7.3 -13.25 9.0 -11.95 L10.55 -10.55 11.0 -10.15 Q12.65 -8.4 13.6 -6.35 L13.7 -6.15 Q15.0 -3.3 15.0 0.05 15.0 4.35 12.85 7.85 L12.0 9.05 11.9 9.15 10.55 10.6 9.1 12.0 9.0 12.05 Q7.3 13.3 5.4 14.1 L4.5 14.4 1.8 15.0 0.0 15.05 -3.0 14.8 -4.5 14.4 -5.4 14.1 Q-7.4 13.3 -9.05 12.0 L-10.4 10.8 -10.55 10.65 -10.6 10.6 -11.9 9.15 -12.0 9.05 -12.85 7.85 Q-15.0 4.35 -15.0 0.05 -15.0 -5.85 -11.0 -10.15 L-10.6 -10.55 Q-8.3 -12.9 -5.4 -14.0 L-4.5 -14.3 -3.0 -14.65 -2.5 -14.75 -0.35 -14.95 0.4 -14.95 1.8 -14.85 M1.55 -13.05 L0.35 -13.15 -0.35 -13.15 -2.65 -12.85 -2.7 -12.85 -4.0 -12.6 -4.8 -12.3 -4.85 -12.25 Q-7.35 -11.35 -9.35 -9.3 L-9.7 -8.95 Q-13.15 -5.2 -13.2 0.1 -13.2 3.85 -11.35 6.85 -10.55 8.2 -9.35 9.35 L-9.35 9.4 -9.2 9.55 -8.9 9.75 Q-7.05 11.5 -4.8 12.4 L-4.0 12.65 -2.65 13.0 0.0 13.25 1.55 13.2 3.9 12.65 4.7 12.4 Q6.4 11.7 7.9 10.65 L8.85 9.75 9.25 9.35 11.3 6.85 Q13.2 3.85 13.2 0.1 13.1 -5.2 9.65 -8.95 L9.25 -9.3 7.9 -10.55 Q6.4 -11.7 4.75 -12.25 L4.7 -12.3 3.9 -12.6 2.65 -12.85 1.55 -13.05" fill="url(#gradient0)" fill-rule="evenodd" stroke="none"/>
    <path d="M1.55 -13.05 L2.65 -12.85 3.9 -12.6 4.7 -12.3 4.75 -12.25 Q6.4 -11.7 7.9 -10.55 L9.25 -9.3 9.65 -8.95 Q13.1 -5.2 13.2 0.1 13.2 3.85 11.3 6.85 L9.25 9.35 8.85 9.75 7.9 10.65 Q6.4 11.7 4.7 12.4 L3.9 12.65 1.55 13.2 0.0 13.25 -2.65 13.0 -4.0 12.65 -4.8 12.4 Q-7.05 11.5 -8.9 9.75 L-9.2 9.55 -9.35 9.4 -9.35 9.35 Q-10.55 8.2 -11.35 6.85 -13.2 3.85 -13.2 0.1 -13.15 -5.2 -9.7 -8.95 L-9.35 -9.3 Q-7.35 -11.35 -4.85 -12.25 L-4.8 -12.3 -4.0 -12.6 -2.7 -12.85 -2.65 -12.85 -0.35 -13.15 0.35 -13.15 1.55 -13.05" fill="url(#gradient1)" fill-rule="evenodd" stroke="none"/>
    <path d="M1.55 -13.05 L2.65 -12.85 3.9 -12.6 4.7 -12.3 4.75 -12.25 Q6.4 -11.7 7.9 -10.55 L9.25 -9.3 9.65 -8.95 Q13.1 -5.2 13.2 0.1 13.2 3.85 11.3 6.85 L9.25 9.35 8.85 9.75 7.9 10.65 Q6.4 11.7 4.7 12.4 L3.9 12.65 1.55 13.2 0.0 13.25 -2.65 13.0 -4.0 12.65 -4.8 12.4 Q-7.05 11.5 -8.9 9.75 L-9.2 9.55 -9.35 9.4 -9.35 9.35 Q-10.55 8.2 -11.35 6.85 -13.2 3.85 -13.2 0.1 -13.15 -5.2 -9.7 -8.95 L-9.35 -9.3 Q-7.35 -11.35 -4.85 -12.25 L-4.8 -12.3 -4.0 -12.6 -2.7 -12.85 -2.65 -12.85 -0.35 -13.15 0.35 -13.15 1.55 -13.05 Z" fill="none" stroke="#ffffff" stroke-linecap="butt" stroke-linejoin="miter" stroke-miterlimit="3.0" stroke-opacity="0.7254902" stroke-width="1.0"/>
    <path d="M3.25 -18.55 L4.35 -18.8 4.65 -18.9 4.65 -12.0 4.85 -11.8 5.95 -10.0 5.3 -10.3 4.85 -10.45 4.75 -10.45 4.65 -10.55 4.0 -10.75 3.25 -10.9 3.25 -11.2 3.25 -18.55" fill="url(#gradient2)" fill-rule="evenodd" stroke="none"/>
    <path d="M3.25 -11.2 Q3.1 -11.2 3.05 -11.3 L3.0 -11.3 2.85 -11.3 2.4 -11.4 2.3 -11.4 2.15 -11.45 1.5 -11.5 0.5 -11.55 -0.55 -11.55 -1.8 -11.45 -1.95 -11.4 -2.1 -11.4 -2.5 -11.3 -2.8 -11.15 -3.0 -11.15 -3.25 -11.05 -3.25 -18.55 -0.05 -18.3 3.25 -18.55 3.25 -11.2" fill="url(#gradient3)" fill-rule="evenodd" stroke="none"/>
    <path d="M-3.25 -11.05 L-3.35 -10.95 -4.6 -10.6 -4.75 -10.55 -4.8 -10.55 -5.55 -10.25 -4.6 -11.9 -4.6 -18.8 -4.35 -18.8 -4.15 -18.7 -3.3 -18.55 -3.25 -18.55 -3.25 -11.05" fill="url(#gradient4)" fill-rule="evenodd" stroke="none"/>
    <path d="M3.25 -18.55 L3.25 -11.2 M-3.25 -18.55 L-3.25 -11.05" fill="none" stroke="#ffffff" stroke-linecap="butt" stroke-linejoin="miter" stroke-miterlimit="3.0" stroke-opacity="0.7254902" stroke-width="1.0"/>
    <path d="M3.7 -10.95 L3.2 -10.4 2.6 -10.25 2.5 -10.2 2.2 -10.15 1.3 -10.0 1.1 -10.0 0.45 -9.95 0.0 -9.95 -0.75 -9.95 -1.15 -10.0 -1.35 -10.0 -2.5 -10.2 -2.6 -10.2 -2.65 -10.25 -3.2 -10.4 -3.75 -10.95 -3.25 -11.4 -3.25 -18.55 -0.05 -18.3 3.25 -18.55 3.25 -11.4 3.7 -10.95" fill="url(#gradient5)" fill-rule="evenodd" stroke="none"/>
    <path d="M7.3 -19.9 Q7.3 -19.1 6.25 -18.45 5.75 -18.1 5.1 -17.9 L4.9 -17.8 4.35 -17.6 2.6 -17.2 2.2 -17.15 0.9 -17.05 0.0 -17.0 -1.4 -17.1 -2.2 -17.15 -2.65 -17.2 -4.9 -17.8 -5.05 -17.85 -5.15 -17.9 Q-5.85 -18.1 -6.25 -18.45 -7.25 -19.1 -7.25 -19.9 -7.2 -21.1 -5.3 -21.9 L-5.15 -22.0 -2.7 -22.65 -2.65 -22.65 -2.2 -22.75 -1.45 -22.8 -1.4 -22.8 -0.15 -22.85 0.2 -22.85 0.9 -22.85 1.45 -22.8 2.2 -22.75 2.6 -22.65 2.65 -22.65 4.35 -22.3 5.1 -22.0 5.35 -21.9 Q7.25 -21.1 7.3 -19.9" fill="url(#gradient6)" fill-rule="evenodd" stroke="none"/>
    <path d="M5.65 -19.9 L4.65 -19.6 4.4 -19.55 3.9 -19.4 2.35 -19.15 2.0 -19.15 0.8 -19.05 0.0 -19.05 -1.3 -19.1 -1.95 -19.15 -2.3 -19.15 -4.4 -19.55 -4.5 -19.55 -4.6 -19.6 -5.6 -19.9 Q-6.55 -20.35 -6.55 -20.9 -6.45 -21.65 -4.75 -22.15 L-4.6 -22.2 -2.35 -22.6 -2.3 -22.6 -1.95 -22.65 -1.35 -22.65 -1.3 -22.65 -0.15 -22.75 0.2 -22.75 0.8 -22.75 1.3 -22.65 2.0 -22.65 2.35 -22.6 2.4 -22.6 3.9 -22.35 4.65 -22.2 4.8 -22.15 Q6.5 -21.65 6.55 -20.9 6.55 -20.35 5.65 -19.9" fill="url(#gradient7)" fill-rule="evenodd" stroke="none"/>
    <path d="M0.6 -28.8 L2.9 -28.55 Q5.05 -28.1 6.35 -26.4 L4.3 -20.85 Q3.05 -20.05 1.65 -19.95 0.0 -19.75 -1.55 -19.95 L-1.65 -19.95 -3.1 -20.25 Q-3.85 -20.4 -4.35 -20.85 L-4.5 -21.3 -6.3 -26.4 -5.0 -27.8 -3.8 -28.3 0.6 -28.8" fill="#524131" fill-rule="evenodd" stroke="none"/>
    <path d="M-0.95 -28.2 L-0.75 -28.2 -0.6 -28.2 -0.5 -28.25 -0.35 -28.25 0.1 -28.25 0.2 -28.25 0.35 -28.25 0.55 -28.25 0.75 -28.2 1.0 -28.2 1.05 -28.2 1.35 -28.2 1.5 -28.2 1.75 -28.2 3.35 -27.9 3.5 -27.85 Q4.2 -27.7 4.55 -27.35 L4.7 -27.05 Q4.7 -26.7 4.1 -26.35 L3.85 -26.25 3.8 -26.25 3.35 -26.15 3.35 -26.1 3.2 -26.1 2.8 -26.0 2.2 -25.85 1.75 -25.8 1.6 -25.8 1.5 -25.8 1.0 -25.75 0.8 -25.7 0.75 -25.7 0.7 -25.75 1.8 -25.95 1.8 -26.1 0.4 -25.9 0.25 -25.95 -0.4 -26.2 -1.15 -26.4 -1.2 -26.45 -1.65 -26.6 -1.85 -26.7 -2.3 -27.05 -2.2 -27.35 -2.15 -27.4 -0.95 -28.2 M-5.5 -25.65 L-5.5 -25.95 -4.75 -27.05 -4.7 -27.05 -4.05 -26.35 -3.6 -26.2 -4.05 -25.55 -4.15 -25.35 -3.7 -24.95 -3.05 -24.75 -2.35 -24.5 -2.5 -24.45 -3.05 -24.45 -4.15 -24.75 -4.25 -24.85 -4.3 -24.9 -4.7 -25.1 Q-5.0 -25.2 -5.2 -25.4 L-5.5 -25.65 M-0.5 -27.6 L-1.0 -27.35 -1.25 -27.1 -1.3 -27.05 -1.35 -27.0 Q-1.3 -26.9 -1.15 -26.9 L-1.05 -26.9 -0.4 -26.65 -0.25 -26.65 -0.15 -26.6 -0.05 -26.6 0.0 -26.55 -0.1 -26.75 -0.25 -27.0 -0.3 -27.05 -0.45 -27.4 -0.5 -27.6 M-4.55 -24.6 L-3.9 -23.0 -3.55 -21.75 Q-3.55 -21.5 -3.75 -21.5 -4.1 -21.5 -4.35 -22.6 L-4.65 -24.2 -4.65 -24.6 -4.55 -24.6" fill="#b08759" fill-rule="evenodd" stroke="none"/>
    <path d="M-4.7 -27.05 L-4.5 -27.35 Q-4.2 -27.7 -3.45 -27.85 L-3.35 -27.9 -1.75 -28.2 -1.45 -28.2 -1.35 -28.2 -1.0 -28.2 -0.95 -28.2 -2.15 -27.4 -2.2 -27.35 -2.3 -27.05 -1.85 -26.7 -1.65 -26.6 -1.2 -26.45 -1.15 -26.4 -0.4 -26.2 0.25 -25.95 0.4 -25.9 1.8 -26.1 1.8 -25.95 0.7 -25.75 0.75 -25.7 0.3 -25.7 0.1 -25.7 -0.05 -25.7 -0.3 -25.7 -0.5 -25.7 -0.75 -25.7 -0.95 -25.75 -1.25 -25.8 -1.35 -25.8 -1.45 -25.8 -1.6 -25.8 -1.75 -25.8 -1.85 -25.85 -2.2 -25.9 -2.4 -25.9 -2.75 -26.0 -2.8 -26.0 -3.2 -26.1 -3.35 -26.1 -3.35 -26.15 -3.6 -26.2 -4.05 -26.35 -4.7 -27.05 M-0.5 -27.6 L-0.45 -27.4 -0.3 -27.05 -0.25 -27.0 -0.1 -26.75 0.0 -26.55 -0.05 -26.6 -0.15 -26.6 -0.25 -26.65 -0.4 -26.65 -1.05 -26.9 -1.15 -26.9 Q-1.3 -26.9 -1.35 -27.0 L-1.3 -27.05 -1.25 -27.1 -1.0 -27.35 -0.5 -27.6" fill="#dba262" fill-rule="evenodd" stroke="none"/>
    <path d="M4.7 -27.05 L4.75 -27.05 5.55 -25.95 Q5.55 -25.7 5.2 -25.4 L5.1 -25.25 4.7 -25.1 4.4 -24.9 4.35 -24.9 4.35 -24.95 4.25 -25.25 4.0 -25.85 3.85 -26.25 4.1 -26.35 Q4.7 -26.7 4.7 -27.05 M-1.35 -20.1 L-1.45 -20.1 -1.65 -20.15 -1.75 -20.55 -1.75 -20.7 -1.85 -21.2 -1.9 -21.85 -1.95 -21.95 -2.25 -23.85 -2.25 -24.1 -2.3 -24.4 -2.5 -24.45 -2.35 -24.5 -3.05 -24.75 -3.05 -24.8 -3.1 -24.95 -3.05 -25.05 -2.95 -25.25 -2.7 -25.55 -2.4 -25.9 -2.2 -25.9 -1.85 -25.85 -1.75 -25.8 -1.8 -25.8 -1.85 -25.75 -2.3 -25.05 -2.35 -24.85 -2.35 -24.55 -2.3 -24.5 -2.3 -24.4 -2.0 -24.4 -1.9 -24.4 -1.8 -24.4 -1.8 -24.5 -1.85 -24.55 -1.85 -24.65 -1.8 -24.85 -1.75 -24.9 -1.7 -25.1 -1.35 -25.6 -1.3 -25.65 Q-1.2 -25.7 -1.25 -25.8 L-0.95 -25.75 -0.75 -25.7 -0.5 -25.7 -0.3 -25.7 -0.05 -25.7 0.1 -25.7 0.3 -25.7 0.75 -25.7 0.8 -25.7 1.0 -25.75 1.5 -25.8 1.6 -25.8 1.75 -25.8 2.2 -25.85 2.35 -25.55 2.5 -25.1 2.7 -24.45 2.6 -24.45 2.05 -24.4 1.9 -24.4 1.75 -24.4 1.15 -24.3 0.8 -24.25 0.6 -24.25 0.35 -24.25 0.1 -24.25 -0.1 -24.25 -0.3 -24.25 -0.6 -24.25 -0.75 -24.25 -1.15 -24.3 -1.75 -24.4 -1.8 -24.4 -1.8 -24.1 -1.75 -23.8 -1.65 -22.8 -1.6 -22.65 -1.5 -22.15 -1.5 -22.0 -1.45 -21.4 -1.45 -21.25 -1.4 -20.9 -1.4 -20.8 -1.35 -20.1 M-2.25 -20.25 L-2.7 -20.35 -2.75 -20.35 -2.8 -20.4 -3.15 -20.5 -3.2 -20.65 -3.25 -20.85 -3.3 -20.95 -3.5 -21.9 -3.55 -22.0 -3.55 -22.1 -3.6 -22.3 -3.65 -22.4 -3.7 -22.65 -3.75 -22.7 -3.75 -22.85 -3.85 -23.35 -3.9 -23.55 -3.95 -23.65 -4.05 -24.15 -4.2 -24.6 -4.25 -24.8 -4.3 -24.85 -4.25 -24.85 -4.15 -24.75 -3.05 -24.45 -3.0 -24.35 -3.0 -24.2 -2.65 -22.35 -2.6 -22.25 -2.55 -21.65 -2.4 -21.15 -2.4 -21.05 -2.25 -20.25" fill="#78593a" fill-rule="evenodd" stroke="none"/>
    <path d="M5.55 -25.95 L5.6 -25.95 3.9 -21.3 3.9 -21.25 Q3.9 -20.9 3.4 -20.6 L2.9 -20.4 3.25 -21.3 3.45 -21.9 3.8 -22.75 4.25 -24.6 4.35 -24.9 3.9 -24.75 3.85 -24.7 3.7 -24.7 2.7 -24.45 2.5 -25.1 2.35 -25.55 2.2 -25.85 2.8 -26.0 3.2 -26.1 3.35 -26.1 3.35 -26.15 3.8 -26.25 3.85 -26.25 4.0 -25.85 4.25 -25.25 4.35 -24.95 4.35 -24.9 4.4 -24.9 4.7 -25.1 5.1 -25.25 5.2 -25.4 Q5.55 -25.7 5.55 -25.95 M1.45 -20.1 L1.4 -20.1 1.15 -20.1 0.45 -20.0 -0.05 -20.0 -0.8 -20.05 -1.2 -20.1 -1.35 -20.1 -1.4 -20.8 -1.4 -20.9 -1.45 -21.25 -1.45 -21.4 -1.5 -22.0 -1.5 -22.15 -1.6 -22.65 -1.65 -22.8 -1.75 -23.8 -1.8 -24.1 -1.8 -24.4 -1.75 -24.4 -1.15 -24.3 -0.75 -24.25 -0.6 -24.25 -0.3 -24.25 -0.1 -24.25 0.1 -24.25 0.35 -24.25 0.6 -24.25 0.8 -24.25 1.15 -24.3 1.75 -24.4 1.9 -24.4 2.05 -24.4 2.6 -24.45 2.7 -24.45 2.5 -24.1 2.2 -22.75 2.1 -22.4 1.55 -20.55 1.45 -20.3 1.45 -20.1 M-1.65 -20.15 L-2.25 -20.25 -2.4 -21.05 -2.4 -21.15 -2.55 -21.65 -2.6 -22.25 -2.65 -22.35 -3.0 -24.2 -3.0 -24.35 -3.05 -24.45 -2.5 -24.45 -2.3 -24.4 -2.25 -24.1 -2.25 -23.85 -1.95 -21.95 -1.9 -21.85 -1.85 -21.2 -1.75 -20.7 -1.75 -20.55 -1.65 -20.15 M-3.15 -20.5 L-3.4 -20.6 Q-3.95 -20.9 -3.95 -21.25 L-3.95 -21.3 -5.5 -25.65 -5.2 -25.4 Q-5.0 -25.2 -4.7 -25.1 L-4.3 -24.9 -4.25 -24.85 -4.3 -24.85 -4.25 -24.8 -4.2 -24.6 -4.05 -24.15 -3.95 -23.65 -3.9 -23.55 -3.85 -23.35 -3.75 -22.85 -3.75 -22.7 -3.7 -22.65 -3.65 -22.4 -3.6 -22.3 -3.55 -22.1 -3.55 -22.0 -3.5 -21.9 -3.3 -20.95 -3.25 -20.85 -3.2 -20.65 -3.15 -20.5 M-4.55 -24.6 L-4.65 -24.6 -4.65 -24.2 -4.35 -22.6 Q-4.1 -21.5 -3.75 -21.5 -3.55 -21.5 -3.55 -21.75 L-3.9 -23.0 -4.55 -24.6" fill="#66523d" fill-rule="evenodd" stroke="none"/>
    <path d="M2.9 -20.4 L2.8 -20.4 2.6 -20.35 2.35 -20.25 1.45 -20.1 1.45 -20.3 1.55 -20.55 2.1 -22.4 2.2 -22.75 2.5 -24.1 2.7 -24.45 3.7 -24.7 3.85 -24.7 3.9 -24.75 4.35 -24.9 4.25 -24.6 3.8 -22.75 3.45 -21.9 3.25 -21.3 2.9 -20.4" fill="#524131" fill-rule="evenodd" stroke="none"/>
    <path d="M-3.05 -24.75 L-3.7 -24.95 -4.15 -25.35 -4.05 -25.55 -3.6 -26.2 -3.35 -26.15 -3.35 -26.1 -3.2 -26.1 -2.8 -26.0 -2.75 -26.0 -2.4 -25.9 -2.7 -25.55 -2.95 -25.25 -3.05 -25.05 -3.1 -24.95 -3.05 -24.8 -3.05 -24.75 M-1.25 -25.8 Q-1.2 -25.7 -1.3 -25.65 L-1.35 -25.6 -1.7 -25.1 -1.75 -24.9 -1.8 -24.85 -1.85 -24.65 -1.85 -24.55 -1.8 -24.5 -1.8 -24.4 -1.9 -24.4 -2.0 -24.4 -2.3 -24.4 -2.3 -24.5 -2.35 -24.55 -2.35 -24.85 -2.3 -25.05 -1.85 -25.75 -1.8 -25.8 -1.75 -25.8 -1.6 -25.8 -1.45 -25.8 -1.35 -25.8 -1.25 -25.8" fill="#8c6844" fill-rule="evenodd" stroke="none"/>
  </g>
  <defs>
    <linearGradient gradientTransform="matrix(0.0, -0.0237, 0.0183, 0.0, 0.0, -6.9)" gradientUnits="userSpaceOnUse" id="gradient0" spreadMethod="pad" x1="-819.2" x2="819.2">
      <stop offset="0.0" stop-color="#014b70"/>
      <stop offset="1.0" stop-color="#0295d2"/>
    </linearGradient>
    <radialGradient cx="0" cy="0" gradientTransform="matrix(0.0237, 0.0, 0.0, 0.0218, 0.25, 5.65)" gradientUnits="userSpaceOnUse" id="gradient1" r="819.2" spreadMethod="pad">
      <stop offset="0.0" stop-color="#1c63ff"/>
      <stop offset="0.24313725490196078" stop-color="#3399ff"/>
      <stop offset="0.6666666666666666" stop-color="#33c5ff"/>
      <stop offset="1.0" stop-color="#d6f2fe"/>
    </radialGradient>
    <linearGradient gradientTransform="matrix(0.0, 0.004, -8.0E-4, 0.0, -3.9, -15.55)" gradientUnits="userSpaceOnUse" id="gradient2" spreadMethod="pad" x1="-819.2" x2="819.2">
      <stop offset="0.0" stop-color="#014b70"/>
      <stop offset="1.0" stop-color="#0295d2"/>
    </linearGradient>
    <radialGradient cx="0" cy="0" gradientTransform="matrix(0.0233, 0.0, 0.0, 0.035, 0.25, 13.8)" gradientUnits="userSpaceOnUse" id="gradient3" r="819.2" spreadMethod="pad">
      <stop offset="0.0" stop-color="#1c63ff"/>
      <stop offset="0.24313725490196078" stop-color="#3399ff"/>
      <stop offset="0.6666666666666666" stop-color="#33c5ff"/>
      <stop offset="1.0" stop-color="#d6f2fe"/>
    </radialGradient>
    <linearGradient gradientTransform="matrix(0.0, 0.004, -8.0E-4, 0.0, -3.9, -15.85)" gradientUnits="userSpaceOnUse" id="gradient4" spreadMethod="pad" x1="-819.2" x2="819.2">
      <stop offset="0.0" stop-color="#014b70"/>
      <stop offset="1.0" stop-color="#0295d2"/>
    </linearGradient>
    <linearGradient gradientTransform="matrix(-0.004, 0.0, 0.0, -0.0046, 0.0, -14.8)" gradientUnits="userSpaceOnUse" id="gradient5" spreadMethod="pad" x1="-819.2" x2="819.2">
      <stop offset="0.00392156862745098" stop-color="#33c0ff" stop-opacity="0.0"/>
      <stop offset="0.36470588235294116" stop-color="#3399ff"/>
      <stop offset="1.0" stop-color="#d6f2ff" stop-opacity="0.0"/>
    </linearGradient>
    <linearGradient gradientTransform="matrix(0.0074, 0.0, 0.0, 0.0036, -0.2, -19.9)" gradientUnits="userSpaceOnUse" id="gradient6" spreadMethod="pad" x1="-819.2" x2="819.2">
      <stop offset="0.0784313725490196" stop-color="#0191cd"/>
      <stop offset="0.2823529411764706" stop-color="#014b70"/>
      <stop offset="0.43137254901960786" stop-color="#016592"/>
      <stop offset="1.0" stop-color="#0295d2"/>
    </linearGradient>
    <radialGradient cx="0" cy="0" gradientTransform="matrix(0.0037, 0.0, 0.0, 0.0121, -0.15, -20.25)" gradientUnits="userSpaceOnUse" id="gradient7" r="819.2" spreadMethod="pad">
      <stop offset="0.0" stop-color="#d6f2fe"/>
      <stop offset="0.7764705882352941" stop-color="#33c5ff"/>
      <stop offset="0.8823529411764706" stop-color="#d6f2fe"/>
    </radialGradient>
  </defs>
</svg>
