<?xml version="1.0" encoding="UTF-8" standalone="no"?>
<svg xmlns:xlink="http://www.w3.org/1999/xlink" height="9.2px" width="9.6px" xmlns="http://www.w3.org/2000/svg">
  <g transform="matrix(1.0, 0.0, 0.0, 1.0, 4.8, 9.2)">
    <path d="M-4.15 -8.5 L-4.4 -9.2 4.4 -9.2 4.15 -8.5 1.5 -2.65 1.4 -2.5 0.35 -2.4 0.25 -2.4 -0.25 -2.4 -0.35 -2.4 -1.4 -2.5 -1.5 -2.65 -4.15 -8.5" fill="url(#gradient0)" fill-rule="evenodd" stroke="none"/>
    <path d="M4.15 -8.5 Q3.8 -7.4 3.8 -5.85 3.8 -4.65 4.3 -3.75 L4.8 -2.95 4.35 -2.65 4.25 -2.55 3.55 -2.15 3.55 -2.25 3.45 -2.7 3.3 -2.9 Q2.85 -2.9 2.55 -2.35 L2.2 -1.7 1.9 -1.65 0.7 -1.5 0.25 -1.5 -0.25 -1.5 -0.7 -1.5 -1.9 -1.65 -2.2 -1.7 -2.55 -2.35 Q-2.85 -2.9 -3.3 -2.9 L-3.45 -2.7 -3.55 -2.25 -3.55 -2.15 -4.35 -2.7 -4.8 -2.95 -4.5 -3.35 -4.3 -3.75 Q-3.8 -4.65 -3.8 -5.85 -3.8 -7.4 -4.15 -8.5 L-1.5 -2.65 -1.4 -2.5 -0.35 -2.4 -0.25 -2.4 0.25 -2.4 0.35 -2.4 1.4 -2.5 1.5 -2.65 4.15 -8.5" fill="url(#gradient1)" fill-rule="evenodd" stroke="none"/>
    <path d="M4.25 -2.55 L4.45 -1.8 Q2.75 -1.3 2.45 -0.95 1.4 0.0 -0.25 0.0 -1.7 0.0 -2.95 -1.15 L-4.8 -2.05 -4.35 -2.7 -3.55 -2.15 -3.55 -2.25 -3.45 -2.7 -3.3 -2.9 Q-2.85 -2.9 -2.55 -2.35 L-2.2 -1.7 -1.9 -1.65 -0.7 -1.5 -0.25 -1.5 0.25 -1.5 0.7 -1.5 1.9 -1.65 2.2 -1.7 2.55 -2.35 Q2.85 -2.9 3.3 -2.9 L3.45 -2.7 3.55 -2.25 3.55 -2.15 4.25 -2.55" fill="url(#gradient2)" fill-rule="evenodd" stroke="none"/>
  </g>
  <defs>
    <linearGradient gradientTransform="matrix(0.0, 0.0033, -0.0054, 0.0, 0.0, -5.5)" gradientUnits="userSpaceOnUse" id="gradient0" spreadMethod="pad" x1="-819.2" x2="819.2">
      <stop offset="0.0" stop-color="#f2eaea" stop-opacity="0.0"/>
      <stop offset="1.0" stop-color="#ffffff"/>
    </linearGradient>
    <linearGradient gradientTransform="matrix(0.0, 0.0055, -0.0059, 0.0, -0.15, -4.55)" gradientUnits="userSpaceOnUse" id="gradient1" spreadMethod="pad" x1="-819.2" x2="819.2">
      <stop offset="0.0" stop-color="#a36a6a" stop-opacity="0.0"/>
      <stop offset="1.0" stop-color="#a36a6a"/>
    </linearGradient>
    <linearGradient gradientTransform="matrix(0.0, -0.0027, 0.0056, 0.0, -0.15, -1.15)" gradientUnits="userSpaceOnUse" id="gradient2" spreadMethod="pad" x1="-819.2" x2="819.2">
      <stop offset="0.0" stop-color="#a36a6a" stop-opacity="0.0"/>
      <stop offset="1.0" stop-color="#a36a6a"/>
    </linearGradient>
  </defs>
</svg>
