<?xml version="1.0" encoding="UTF-8" standalone="no"?>
<svg xmlns:xlink="http://www.w3.org/1999/xlink" height="23.1px" width="25.05px" xmlns="http://www.w3.org/2000/svg">
  <g transform="matrix(1.0, 0.0, 0.0, 1.0, 12.0, 11.0)">
    <path d="M5.9 -6.45 L6.85 -6.95 8.1 -4.95 7.15 -4.25 6.05 -3.85 5.95 -4.0 4.85 -5.7 5.9 -6.45 M6.95 -6.3 L6.85 -6.45 Q6.5 -6.75 5.85 -5.8 L6.65 -4.9 7.1 -5.1 7.45 -5.45 7.25 -5.85 6.95 -6.3 M8.85 -3.35 Q8.85 -2.85 8.05 -2.85 7.7 -2.85 7.5 -3.2 L7.35 -3.55 Q7.35 -3.95 8.1 -4.0 8.85 -4.05 8.85 -3.35 M7.85 -3.55 L8.05 -3.3 8.3 -3.6 8.05 -3.85 7.85 -3.55 M-5.85 -6.95 L-5.35 -6.8 -5.05 -6.7 -3.6 -6.0 -2.5 -5.55 -2.3 -5.4 -2.05 -5.3 -3.8 -5.15 -6.65 -4.8 -6.85 -4.8 -6.45 -5.7 -5.85 -6.95 M-5.9 -5.8 Q-5.95 -5.6 -5.5 -5.6 L-5.25 -6.0 -5.55 -6.25 Q-5.9 -6.3 -5.9 -5.8" fill="#fff6d6" fill-opacity="0.42352942" fill-rule="evenodd" stroke="none"/>
    <path d="M6.95 -6.3 L7.25 -5.85 7.45 -5.45 7.1 -5.1 6.65 -4.9 5.85 -5.8 Q6.5 -6.75 6.85 -6.45 L6.95 -6.3 M7.85 -3.55 L8.05 -3.85 8.3 -3.6 8.05 -3.3 7.85 -3.55 M-5.9 -5.8 Q-5.9 -6.3 -5.55 -6.25 L-5.25 -6.0 -5.5 -5.6 Q-5.95 -5.6 -5.9 -5.8" fill="#fff6d6" fill-rule="evenodd" stroke="none"/>
    <path d="M7.3 -7.1 L9.7 -3.45 9.75 -3.3 10.45 -2.1 10.5 -2.0 10.55 -1.95 -9.5 -1.95 -9.5 -2.0 -9.45 -2.05 -9.3 -2.3 -8.8 -3.15 -8.75 -3.2 -8.75 -3.25 -8.7 -3.3 -8.65 -3.45 -6.25 -7.1 -5.8 -7.65 0.1 -4.95 0.1 -4.9 0.3 -4.85 0.7 -4.85 0.95 -4.9 0.95 -4.95 6.85 -7.65 7.3 -7.1" fill="#fdf1c6" fill-opacity="0.39215687" fill-rule="evenodd" stroke="none"/>
    <path d="M-10.05 -5.3 L-7.15 -11.0 0.55 -7.3 8.15 -10.4 10.05 -6.7 10.45 -6.0 11.05 -4.9 10.0 -4.85 7.85 -9.35 0.95 -6.35 0.1 -6.35 -2.55 -7.9 -6.5 -9.9 -9.0 -5.45 -10.05 -5.3 M8.3 5.7 L7.8 6.35 7.25 6.35 7.15 6.35 7.1 6.35 Q4.8 6.55 2.95 8.3 L1.55 10.1 0.8 11.65 0.6 12.1 0.55 12.05 0.5 11.9 -0.4 10.1 Q-1.25 8.7 -2.35 7.7 -4.0 6.35 -6.25 6.5 L-6.8 6.55 -7.25 5.9 -6.95 5.8 -6.25 5.55 -6.15 5.5 -6.1 5.5 -5.95 5.5 -5.85 5.5 -5.75 5.5 -5.65 5.55 -5.55 5.55 Q-3.15 5.75 -1.4 7.6 -0.35 8.7 0.45 10.1 L0.6 10.35 0.7 10.2 0.8 10.1 0.8 10.0 0.85 9.9 0.95 9.8 Q2.05 7.45 4.3 6.3 5.7 5.55 7.2 5.5 L7.25 5.45 8.3 5.7 M-2.05 -5.45 L-2.05 -5.4 -2.1 -5.4 -2.05 -5.45" fill="#d14103" fill-rule="evenodd" stroke="none"/>
    <path d="M-10.05 -5.3 L-9.0 -5.45 -10.5 -2.8 -11.4 -2.7 -10.05 -5.3 M10.0 -4.85 L11.05 -4.9 12.4 -2.2 12.5 -1.95 11.4 -1.95 10.0 -4.85 M12.95 -1.1 L13.05 -0.9 10.95 2.0 10.1 1.8 12.05 -0.65 11.85 -1.0 12.95 -1.1 M-9.95 1.7 L-11.9 -1.35 -11.15 -1.45 -9.05 1.45 -9.5 1.55 -9.95 1.7" fill="#ff4900" fill-rule="evenodd" stroke="none"/>
    <path d="M12.5 -1.95 L12.95 -1.1 11.85 -1.0 11.4 -1.95 12.5 -1.95 M-11.9 -1.35 L-12.0 -1.55 -11.4 -2.7 -10.5 -2.8 -11.25 -1.55 -11.15 -1.45 -11.9 -1.35" fill="#ff7a00" fill-rule="evenodd" stroke="none"/>
    <path d="M10.95 2.0 L8.3 5.7 7.25 5.45 7.35 5.35 10.1 1.8 10.95 2.0 M-7.25 5.9 L-9.95 1.7 -9.5 1.55 -9.05 1.45 -6.15 5.5 -6.25 5.55 -6.95 5.8 -7.25 5.9" fill="#b03503" fill-rule="evenodd" stroke="none"/>
    <path d="M7.0 -8.25 L6.9 -8.25 0.6 -5.35 0.4 -5.35 -1.55 -6.25 -5.85 -8.2 -5.95 -8.25 -7.05 -6.8 -7.95 -5.4 -9.05 -3.65 -9.1 -3.55 -9.2 -3.45 -9.85 -2.35 -9.85 -2.3 -10.25 -1.6 -10.25 -1.5 -10.35 -1.4 -9.85 -0.45 -9.7 -0.25 -9.7 -0.2 -8.7 1.35 -5.95 4.7 -4.35 4.9 -3.3 5.25 Q-2.2 5.75 -1.2 6.65 L-0.75 7.05 -0.75 7.1 -0.55 7.35 -0.5 7.4 -0.4 7.55 0.05 8.1 0.5 8.85 0.7 8.6 1.0 8.1 1.55 7.4 1.6 7.35 2.25 6.65 Q3.25 5.65 4.6 5.15 L5.15 4.95 6.95 4.7 7.0 4.7 7.05 4.65 9.65 1.45 10.7 -0.2 10.75 -0.25 11.4 -1.4 10.85 -2.3 10.85 -2.35 9.4 -4.8 7.6 -7.45 7.0 -8.25 M-9.0 -5.45 L-6.5 -9.9 -2.55 -7.9 0.1 -6.35 0.95 -6.35 7.85 -9.35 10.0 -4.85 11.4 -1.95 11.85 -1.0 12.05 -0.65 10.1 1.8 7.35 5.35 7.25 5.45 7.2 5.5 Q5.7 5.55 4.3 6.3 2.05 7.45 0.95 9.8 L0.85 9.9 0.8 10.0 0.8 10.1 0.7 10.2 0.6 10.35 0.45 10.1 Q-0.35 8.7 -1.4 7.6 -3.15 5.75 -5.55 5.55 L-5.65 5.55 -5.75 5.5 -5.85 5.5 -5.95 5.5 -6.1 5.5 -6.15 5.5 -9.05 1.45 -11.15 -1.45 -11.25 -1.55 -10.5 -2.8 -9.0 -5.45" fill="#641f02" fill-rule="evenodd" stroke="none"/>
  </g>
</svg>
