<?xml version="1.0" encoding="UTF-8" standalone="no"?>
<svg xmlns:xlink="http://www.w3.org/1999/xlink" height="19.9px" width="8.05px" xmlns="http://www.w3.org/2000/svg">
  <g transform="matrix(1.0, 0.0, 0.0, 1.0, 0.55, 4.25)">
    <path d="M0.05 0.0 Q-0.55 -1.1 -0.55 -1.6 -0.55 -2.4 0.75 -3.35 2.0 -4.25 3.15 -4.25 L5.3 -3.8 6.35 -3.0 7.1 -1.75 7.5 -0.7 7.3 0.4 7.25 0.4 7.25 0.5 7.25 0.95 7.25 1.0 Q7.05 1.2 7.0 1.55 L7.0 1.6 6.85 2.2 6.8 2.25 6.8 2.3 6.7 2.45 5.85 3.35 5.55 3.6 5.45 3.65 5.25 3.8 5.85 2.4 5.35 2.85 4.85 3.05 Q5.0 2.65 6.1 1.55 L7.15 0.4 7.2 0.35 7.25 0.4 7.25 0.25 7.15 0.3 7.05 0.35 7.0 0.4 6.8 0.55 Q5.4 1.65 4.15 1.65 1.95 1.65 0.85 0.6 L0.8 0.55 0.65 0.4 0.1 0.0 0.05 0.0 M4.9 4.85 L4.9 4.8 4.95 4.85 4.9 4.85" fill="#5d705b" fill-rule="evenodd" stroke="none"/>
    <path d="M0.8 1.95 L0.35 0.65 0.25 0.4 0.15 0.2 0.0 0.0 0.05 0.0 0.1 0.0 0.65 0.4 0.8 0.55 0.85 0.6 Q1.95 1.65 4.15 1.65 5.4 1.65 6.8 0.55 L7.0 0.4 7.05 0.35 7.15 0.3 7.25 0.25 7.25 0.4 7.2 0.35 7.15 0.4 6.1 1.55 Q5.0 2.65 4.85 3.05 L5.35 2.85 5.85 2.4 5.25 3.8 4.9 4.0 3.6 4.35 3.45 4.35 Q2.65 4.35 2.0 3.85 L1.45 3.35 1.05 2.85 1.0 2.45 0.95 2.4 0.85 2.2 0.8 1.95 M1.75 6.2 L2.05 6.55 2.7 6.95 3.5 7.1 4.05 7.05 4.8 6.85 5.25 6.65 6.05 5.85 Q5.2 9.55 3.35 9.55 2.0 9.55 1.75 7.85 L1.75 6.2" fill="#647862" fill-rule="evenodd" stroke="none"/>
    <path d="M6.05 5.85 L5.85 9.9 5.85 10.15 5.75 11.15 Q5.45 13.4 4.85 14.55 4.25 15.65 3.35 15.65 2.45 15.65 1.85 12.55 L1.6 11.15 Q1.3 9.6 1.3 8.25 L1.65 6.05 1.7 5.6 1.75 6.2 1.75 7.85 Q2.0 9.55 3.35 9.55 5.2 9.55 6.05 5.85" fill="#4c5c4b" fill-rule="evenodd" stroke="none"/>
    <path d="M5.85 9.9 Q6.15 9.55 6.55 9.55 7.4 9.55 7.4 11.1 L7.4 11.15 Q7.4 12.5 6.15 13.65 L4.85 14.55 Q5.45 13.4 5.75 11.15 L5.85 10.15 5.85 9.9" fill="#2e382d" fill-rule="evenodd" stroke="none"/>
    <path d="M6.8 2.3 L6.7 2.45 6.7 2.5 6.65 2.65 6.75 2.5 6.85 2.65 6.8 3.15 5.85 3.85 5.75 3.9 4.9 4.4 3.7 4.8 3.3 4.8 Q2.6 4.8 2.0 4.35 1.2 3.8 0.65 2.55 L0.6 2.3 0.8 1.95 0.85 2.2 0.95 2.4 1.0 2.45 1.05 2.85 1.45 3.35 2.0 3.85 Q2.65 4.35 3.45 4.35 L3.6 4.35 4.9 4.0 5.25 3.8 5.45 3.65 5.55 3.6 5.85 3.35 6.7 2.45 6.8 2.3" fill="#ff9900" fill-rule="evenodd" stroke="none"/>
    <path d="M2.7 6.95 L2.45 6.05 2.0 4.35 Q2.6 4.8 3.3 4.8 L3.7 4.8 4.05 7.05 3.5 7.1 2.7 6.95" fill="#6b460f" fill-rule="evenodd" stroke="none"/>
    <path d="M1.65 6.05 L1.4 5.35 0.95 3.8 0.65 2.55 Q1.2 3.8 2.0 4.35 L2.45 6.05 2.7 6.95 2.05 6.55 1.75 6.2 1.7 5.6 1.65 6.05 M4.9 4.4 L5.75 3.9 5.85 3.85 5.25 6.65 4.8 6.85 4.9 4.4 M4.9 4.85 L4.95 4.85 4.9 4.8 4.9 4.85" fill="#ba863b" fill-rule="evenodd" stroke="none"/>
    <path d="M4.05 7.05 L3.7 4.8 4.9 4.4 4.8 6.85 4.05 7.05" fill="#a17433" fill-rule="evenodd" stroke="none"/>
    <path d="M6.8 3.15 L6.45 4.2 6.4 5.05 6.25 5.1 6.05 5.8 6.05 5.85 5.25 6.65 5.85 3.85 6.8 3.15" fill="#c9ab40" fill-rule="evenodd" stroke="none"/>
  </g>
</svg>
