<?xml version="1.0" encoding="UTF-8" standalone="no"?>
<svg xmlns:xlink="http://www.w3.org/1999/xlink" height="72.45px" width="103.1px" xmlns="http://www.w3.org/2000/svg">
  <g transform="matrix(1.0, 0.0, 0.0, 1.0, 72.0, 35.1)">
    <path d="M2.7 -15.0 Q3.6 -14.25 4.5 -12.0 5.9 -14.45 7.6 -15.6 10.2 -17.4 14.55 -17.4 20.2 -17.4 22.55 -13.95 24.2 -11.5 24.2 -7.0 24.2 -4.2 23.65 -2.8 23.05 -1.3 21.15 0.5 L21.15 0.8 Q22.35 0.0 23.95 0.0 26.35 0.0 28.8 2.55 31.1 4.9 31.1 6.65 31.1 8.75 29.3 10.3 L26.25 12.5 28.5 15.1 Q30.0 16.8 30.0 18.8 30.0 21.15 25.6 24.95 L24.35 26.05 24.55 27.9 Q24.55 30.1 23.5 32.9 22.6 35.45 21.25 37.35 L15.1 37.35 Q11.25 31.1 7.1 28.5 -0.55 23.75 -17.4 23.75 -30.35 23.75 -40.35 30.2 -45.85 33.7 -48.2 37.35 L-57.3 37.35 -59.0 35.2 -59.15 34.8 -61.15 33.05 Q-63.45 30.65 -63.45 28.95 -63.45 27.9 -62.8 27.2 -62.4 26.8 -61.4 26.25 -65.15 26.4 -67.9 24.5 -72.0 21.7 -72.0 15.1 -72.0 7.6 -66.15 6.35 -66.8 5.25 -66.8 3.9 -66.8 1.35 -64.8 -0.85 -62.75 -3.15 -60.0 -3.15 -58.6 -3.15 -56.75 -2.0 L-54.5 -0.6 Q-55.8 -1.65 -57.45 -4.85 -59.4 -8.65 -59.4 -11.4 -59.4 -15.15 -56.5 -17.4 -53.65 -19.7 -48.85 -19.7 -43.45 -19.7 -39.65 -14.6 L-37.5 -10.7 Q-37.2 -12.2 -36.05 -13.3 -34.4 -14.85 -31.95 -14.85 -33.15 -15.65 -33.35 -16.6 L-33.45 -19.7 Q-33.45 -24.35 -29.4 -29.1 -24.4 -35.1 -16.4 -35.1 -8.3 -35.1 -4.55 -28.85 -1.65 -24.0 -1.65 -16.15 L-1.65 -15.45 0.0 -15.75 Q1.8 -15.75 2.7 -15.0" fill="#000000" fill-rule="evenodd" stroke="none"/>
  </g>
</svg>
