<?xml version="1.0" encoding="UTF-8" standalone="no"?>
<svg xmlns:xlink="http://www.w3.org/1999/xlink" height="17.0px" width="26.8px" xmlns="http://www.w3.org/2000/svg">
  <g transform="matrix(1.0, 0.0, 0.0, 1.0, 13.4, 8.25)">
    <path d="M11.9 -6.75 Q11.6 -4.3 10.4 -2.25 9.6 -0.9 8.4 0.25 4.9 3.8 -0.05 3.8 -4.95 3.8 -8.5 0.25 -10.0 -1.25 -10.8 -2.95 -11.7 -4.75 -11.9 -6.75" fill="none" stroke="#361a0e" stroke-linecap="butt" stroke-linejoin="miter" stroke-miterlimit="3.0" stroke-width="3.0"/>
    <path d="M9.05 0.95 L10.5 2.4 M0.1 4.7 L0.1 6.75 M-9.1 0.95 L-10.55 2.4" fill="none" stroke="#361a0e" stroke-linecap="round" stroke-linejoin="round" stroke-width="4.0"/>
  </g>
</svg>
