<?xml version="1.0" encoding="UTF-8" standalone="no"?>
<svg xmlns:xlink="http://www.w3.org/1999/xlink" height="53.05px" width="60.65px" xmlns="http://www.w3.org/2000/svg">
  <g transform="matrix(1.0, 0.0, 0.0, 1.0, 40.1, 53.2)">
    <path d="M20.55 -13.8 L15.85 -0.15 -22.2 -1.85 -40.1 -14.85 20.55 -13.8" fill="url(#gradient0)" fill-rule="evenodd" stroke="none"/>
    <path d="M5.0 -53.2 L20.55 -13.8 -40.1 -14.85 5.0 -53.2" fill="url(#gradient1)" fill-rule="evenodd" stroke="none"/>
  </g>
  <defs>
    <linearGradient gradientTransform="matrix(-0.0054, 0.0216, -0.0099, -0.0023, -6.9, 1.3)" gradientUnits="userSpaceOnUse" id="gradient0" spreadMethod="pad" x1="-819.2" x2="819.2">
      <stop offset="0.0" stop-color="#ab5428"/>
      <stop offset="0.5411764705882353" stop-color="#7d492b"/>
      <stop offset="1.0" stop-color="#7d685d"/>
    </linearGradient>
    <linearGradient gradientTransform="matrix(-0.0038, -0.0738, 0.1054, -0.0108, 43.05, -35.6)" gradientUnits="userSpaceOnUse" id="gradient1" spreadMethod="pad" x1="-819.2" x2="819.2">
      <stop offset="0.0" stop-color="#e35202"/>
      <stop offset="0.36470588235294116" stop-color="#ed8e02"/>
      <stop offset="0.6980392156862745" stop-color="#ede102"/>
      <stop offset="1.0" stop-color="#fefda3"/>
    </linearGradient>
  </defs>
</svg>
