<?xml version="1.0" encoding="UTF-8" standalone="no"?>
<svg xmlns:xlink="http://www.w3.org/1999/xlink" height="208.6px" width="293.65px" xmlns="http://www.w3.org/2000/svg">
  <g transform="matrix(1.0, 0.0, 0.0, 1.0, 285.65, 204.85)">
    <path d="M-78.4 -203.3 Q-71.95 -205.2 -66.35 -204.8 -52.3 -204.15 -44.6 -189.45 -42.05 -184.5 -45.6 -180.5 -56.7 -167.95 -73.75 -163.65 -99.4 -157.25 -125.65 -153.2 -151.7 -149.35 -178.2 -148.4 -207.05 -147.45 -235.3 -152.6 -248.95 -155.2 -256.6 -161.05 L-257.4 -161.75 Q-258.65 -163.45 -261.05 -165.45 L-261.15 -165.7 Q-267.1 -174.15 -253.8 -185.0 -239.65 -196.7 -209.05 -191.65 -181.8 -185.35 -152.35 -184.5 -127.35 -184.3 -101.45 -194.9 -90.2 -199.8 -78.4 -203.3" fill="#0d0908" fill-rule="evenodd" stroke="none"/>
    <path d="M-190.2 -129.35 L-190.9 -128.25 -192.75 -124.55 Q-193.65 -122.05 -193.65 -119.1 L-193.4 -115.05 Q-193.15 -111.2 -193.35 -109.25 -193.4 -108.45 -193.05 -106.95 L-192.4 -104.85 -191.75 -102.75 Q-191.3 -101.05 -191.3 -100.05 -191.3 -99.15 -189.95 -94.3 L-188.05 -87.6 -189.05 -86.3 -190.4 -84.1 -197.0 -80.7 -198.45 -80.7 -198.45 -82.4 Q-197.95 -83.6 -198.35 -92.75 -198.6 -98.05 -198.95 -101.3 L-198.75 -102.75 -198.3 -106.95 -198.05 -109.75 -197.95 -110.9 -197.85 -112.15 -197.4 -116.6 -197.15 -119.3 -197.0 -121.4 -196.75 -121.7 -194.35 -124.85 -191.1 -128.25 -190.75 -128.75 -190.2 -129.35 M-108.2 -132.5 L-105.65 -130.1 -103.8 -128.25 -98.55 -122.45 -97.6 -121.25 -95.3 -117.85 -95.1 -114.2 -95.1 -114.05 -94.6 -106.95 -94.6 -106.8 -94.25 -102.75 -94.1 -100.0 -92.65 -91.05 -92.5 -90.3 -91.45 -84.25 Q-92.55 -83.5 -93.3 -83.5 L-95.45 -83.75 -96.4 -88.7 -97.1 -93.2 -97.7 -97.35 -98.45 -102.75 -99.05 -106.95 -99.85 -111.85 Q-100.0 -110.05 -100.9 -106.95 L-102.3 -102.75 -102.4 -102.5 -102.5 -102.75 -103.0 -104.5 -103.0 -100.9 -103.8 -97.95 Q-104.3 -95.8 -104.25 -93.85 L-105.3 -93.95 -106.0 -93.95 -104.9 -98.75 -103.9 -102.75 -103.5 -104.35 -102.8 -106.95 -101.15 -113.25 Q-101.15 -113.75 -101.65 -114.6 L-102.1 -115.95 Q-102.1 -116.55 -105.8 -126.25 L-106.55 -128.25 -108.2 -132.5" fill="#876c65" fill-rule="evenodd" stroke="none"/>
    <path d="M-188.05 -87.6 L-189.95 -94.3 Q-191.3 -99.15 -191.3 -100.05 -191.3 -101.05 -191.75 -102.75 L-192.4 -104.85 -193.05 -106.95 Q-193.4 -108.45 -193.35 -109.25 -193.15 -111.2 -193.4 -115.05 L-193.65 -119.1 Q-193.65 -122.05 -192.75 -124.55 L-190.9 -128.25 -190.2 -129.35 -189.35 -130.35 -189.2 -128.7 -189.15 -128.25 -189.05 -127.2 -188.7 -122.7 -188.65 -121.7 -188.55 -119.85 -188.45 -118.45 -187.8 -112.15 -187.0 -106.95 -186.2 -102.75 -185.3 -98.6 -183.6 -91.9 -182.55 -88.2 Q-183.6 -89.2 -185.1 -89.2 -186.6 -89.2 -188.05 -87.6 M-109.85 -93.35 L-107.65 -101.15 -107.55 -101.45 -107.2 -102.75 -106.6 -105.05 -106.3 -106.3 -106.25 -106.35 -106.15 -106.95 Q-104.55 -113.2 -104.55 -117.0 -104.55 -119.55 -106.3 -123.8 L-108.05 -128.25 -108.1 -128.45 -110.75 -134.95 -108.2 -132.5 -106.55 -128.25 -105.8 -126.25 Q-102.1 -116.55 -102.1 -115.95 L-101.65 -114.6 Q-101.15 -113.75 -101.15 -113.25 L-102.8 -106.95 -103.5 -104.35 -103.9 -102.75 -104.9 -98.75 -106.0 -93.95 -108.8 -93.75 -109.85 -93.35 M-91.45 -84.25 L-92.5 -90.3 -92.65 -91.05 -94.1 -100.0 -94.25 -102.75 -94.6 -106.8 -94.6 -106.95 -95.1 -114.05 -95.1 -114.2 -95.3 -117.85 -94.2 -115.95 -94.4 -113.3 -94.3 -112.7 -93.7 -106.25 -92.4 -102.75 -89.8 -94.75 -88.9 -91.85 -88.05 -88.95 -87.65 -87.5 -87.75 -87.3 -88.05 -87.4 -90.2 -85.2 Q-90.85 -84.65 -91.45 -84.25 M-97.8 -85.15 L-98.0 -85.35 -97.8 -85.55 -97.8 -85.15" fill="#7a625b" fill-rule="evenodd" stroke="none"/>
    <path d="M-197.15 -119.3 L-197.4 -116.6 -197.85 -112.15 -197.95 -110.9 -198.05 -109.75 -198.35 -109.8 -199.35 -106.95 -200.9 -102.75 -202.9 -98.1 Q-207.25 -88.05 -212.6 -82.5 L-207.25 -86.6 -210.35 -80.75 -213.7 -78.15 -214.5 -77.55 -213.55 -78.0 -211.3 -79.0 -212.4 -77.0 -215.35 -71.7 Q-223.6 -66.65 -248.5 -54.5 L-243.0 -59.8 Q-238.1 -64.15 -237.75 -64.8 L-241.85 -63.45 -245.85 -62.0 -245.85 -62.35 -241.25 -65.85 -241.6 -65.85 -250.45 -63.05 -258.15 -60.2 -256.4 -62.5 -256.2 -62.75 Q-251.45 -68.7 -251.4 -68.95 L-251.9 -68.95 -256.95 -69.25 -259.45 -69.3 -262.05 -69.4 -262.5 -69.4 -261.3 -70.15 -252.5 -75.55 Q-243.05 -81.3 -241.6 -82.85 L-243.9 -82.45 Q-237.2 -86.7 -224.75 -96.3 L-216.5 -102.75 -211.3 -106.95 -207.45 -110.2 -205.15 -111.9 -204.85 -112.15 -203.8 -113.0 -203.6 -113.15 -202.55 -114.1 -203.3 -112.85 -203.4 -112.75 -203.45 -112.6 -203.5 -112.55 -203.45 -112.55 -203.45 -112.6 -203.35 -112.7 -202.1 -114.1 -201.9 -114.3 -197.95 -118.5 -197.15 -119.3 M-245.35 -81.9 L-243.9 -82.45 -244.85 -81.9 -245.35 -81.9 M-248.5 -54.5 L-248.75 -54.2 -249.1 -54.2 -248.5 -54.5 M-97.6 -121.25 L-95.45 -119.7 -93.85 -118.6 -92.9 -118.0 -92.3 -117.55 -90.2 -116.25 Q-88.3 -115.1 -81.6 -112.35 L-80.05 -111.75 -80.05 -112.0 -80.0 -112.0 -78.4 -111.6 -76.1 -110.7 -67.1 -106.95 Q-59.25 -103.6 -59.25 -102.8 L-41.35 -96.9 Q-21.95 -90.5 -16.1 -87.95 L-16.15 -87.05 -24.1 -85.65 Q-22.7 -85.55 -21.7 -84.7 -20.8 -84.0 -20.8 -83.3 -20.8 -82.6 -20.35 -82.55 L-19.85 -82.4 -37.5 -82.4 Q-28.3 -79.9 -26.25 -78.85 L-18.95 -74.4 -18.95 -74.3 -23.7 -74.3 -17.15 -69.2 -15.45 -67.85 Q-25.7 -71.2 -39.95 -73.8 L-55.85 -76.3 Q-73.75 -79.25 -83.0 -81.5 -82.5 -81.5 -82.5 -81.9 L-69.75 -82.1 -57.05 -82.4 -71.0 -87.0 -82.4 -90.65 -74.35 -91.15 -66.2 -91.6 -80.6 -93.3 -84.05 -93.85 -86.3 -94.2 -89.85 -101.8 -90.3 -102.75 -92.25 -106.95 -93.5 -110.2 Q-93.5 -111.15 -94.3 -112.7 L-94.4 -113.3 -94.2 -115.95 -95.3 -117.85 -97.6 -121.25 M-29.9 -33.15 L-27.95 -32.6 -21.95 -30.9 -24.9 -29.85 -30.5 -31.05 -31.3 -31.3 -31.7 -31.35 Q-42.0 -34.05 -43.3 -36.95 L-34.05 -36.95 -34.05 -37.45 -37.1 -38.05 Q-39.35 -38.5 -40.05 -39.2 -38.3 -39.15 -34.5 -40.15 L-30.35 -41.05 -30.35 -41.5 Q-30.75 -41.5 -31.2 -41.8 -31.75 -42.1 -31.75 -42.45 -30.3 -42.45 -30.3 -42.95 -34.05 -45.3 -45.65 -51.65 L-50.2 -54.15 -47.0 -54.15 -41.9 -53.1 -37.05 -52.25 -34.6 -53.2 Q-32.0 -54.15 -30.8 -54.15 -30.8 -56.1 -29.3 -55.95 L-27.5 -55.5 Q-37.0 -60.9 -38.1 -61.95 -37.65 -61.95 -37.65 -62.4 L-29.4 -62.65 -29.4 -60.75 Q-28.6 -59.15 -26.65 -56.8 L-23.7 -53.75 Q-25.15 -53.75 -26.0 -52.9 -26.8 -51.95 -27.7 -51.95 L-29.1 -52.25 -30.75 -52.9 -30.75 -49.8 -30.15 -49.75 Q-29.9 -49.6 -29.9 -48.95 L-30.75 -47.0 Q-30.75 -44.55 -29.0 -42.6 -26.85 -40.25 -26.4 -38.45 -28.0 -38.8 -36.3 -35.45 -34.7 -34.6 -29.9 -33.15" fill="#69544e" fill-rule="evenodd" stroke="none"/>
    <path d="M-207.45 -110.2 L-211.3 -106.95 -216.5 -102.75 -224.75 -96.3 Q-237.2 -86.7 -243.9 -82.45 L-241.6 -82.85 Q-243.05 -81.3 -252.5 -75.55 L-261.3 -70.15 -262.5 -69.4 -262.05 -69.4 -259.45 -69.3 -256.95 -69.25 -251.9 -68.95 -251.4 -68.95 Q-251.45 -68.7 -256.2 -62.75 L-256.4 -62.5 -258.15 -60.2 -260.7 -59.0 -261.6 -59.0 -260.85 -59.75 Q-259.25 -61.25 -257.85 -63.45 L-257.65 -63.75 -258.3 -63.85 -258.55 -64.25 -256.15 -65.7 Q-254.95 -66.3 -255.05 -67.3 L-260.85 -67.95 -263.15 -68.3 -265.1 -68.65 -266.75 -69.05 -269.45 -70.15 -271.0 -70.9 -269.45 -71.6 Q-260.85 -75.8 -236.8 -90.85 -225.8 -97.75 -218.2 -102.75 L-211.95 -106.95 -207.45 -110.2 M-245.35 -81.9 L-244.85 -81.9 -243.9 -82.45 -245.35 -81.9 M-78.4 -111.6 Q-72.25 -110.1 -63.35 -106.95 L-54.0 -103.6 -51.8 -102.75 -32.95 -95.75 Q-21.9 -91.6 -14.0 -89.25 -12.1 -88.5 -11.3 -87.75 L-11.0 -87.4 -4.05 -86.1 Q-5.15 -85.0 -12.2 -82.75 L-12.6 -82.6 -12.75 -82.55 -19.85 -80.4 Q-19.85 -80.1 -19.35 -79.8 -19.05 -79.65 -18.75 -78.7 L-23.35 -78.65 Q-23.35 -78.25 -23.7 -78.25 -23.15 -77.15 -18.95 -75.2 L-18.95 -74.4 -26.25 -78.85 Q-28.3 -79.9 -37.5 -82.4 L-19.85 -82.4 -20.35 -82.55 Q-20.8 -82.6 -20.8 -83.3 -20.8 -84.0 -21.7 -84.7 -22.7 -85.55 -24.1 -85.65 L-16.15 -87.05 -16.1 -87.95 Q-21.95 -90.5 -41.35 -96.9 L-59.25 -102.8 Q-59.25 -103.6 -67.1 -106.95 L-76.1 -110.7 -78.4 -111.6" fill="#755d56" fill-rule="evenodd" stroke="none"/>
    <path d="M-198.05 -109.75 L-198.3 -106.95 -198.75 -102.75 -198.95 -101.3 -200.25 -88.4 -201.25 -79.35 Q-201.25 -78.3 -200.75 -78.6 L-201.25 -76.9 -202.05 -73.8 -203.05 -69.95 -204.2 -65.7 -203.85 -64.25 -203.25 -64.7 Q-201.95 -65.75 -200.6 -67.3 L-202.15 -60.2 -202.15 -58.1 -197.8 -61.35 -192.95 -64.8 -189.9 -56.5 Q-188.45 -52.95 -188.45 -51.25 -188.45 -48.8 -189.9 -35.8 L-191.4 -21.4 -191.4 -20.7 -186.65 -16.65 Q-181.45 -12.15 -181.25 -11.15 -180.95 -9.4 -180.6 -0.5 L-180.45 3.75 -194.85 3.75 -187.65 -3.4 -188.0 -3.4 Q-189.8 -3.1 -194.85 -0.95 L-199.65 1.15 -199.65 0.85 Q-187.8 -9.35 -187.25 -10.45 -193.35 -9.0 -213.0 0.15 L-220.55 3.75 -232.5 3.75 Q-227.25 -0.45 -225.8 -2.7 -223.5 -6.15 -219.3 -10.0 L-215.45 -13.6 Q-216.8 -13.2 -223.35 -9.4 L-229.95 -5.5 -229.95 -5.85 -227.15 -11.2 Q-224.6 -15.95 -224.6 -16.45 L-232.85 -6.65 -241.15 3.0 -241.15 -3.75 -240.25 -4.7 Q-239.85 -5.2 -239.85 -5.65 L-243.0 -5.65 -245.8 -4.95 -246.55 -4.75 Q-248.25 -4.2 -248.7 -3.75 L-252.4 -3.75 Q-251.85 -4.9 -247.75 -10.2 L-247.45 -10.65 -242.9 -16.4 -250.45 -16.8 -253.55 -17.05 -257.5 -17.5 -258.05 -17.6 -258.05 -18.25 -251.55 -21.8 -251.35 -21.85 Q-247.75 -24.0 -247.2 -24.5 -249.15 -24.5 -249.15 -25.15 L-245.7 -27.8 -242.25 -30.25 Q-242.65 -30.25 -242.85 -30.55 L-242.9 -30.9 -251.05 -34.55 -254.8 -36.3 -257.3 -37.5 Q-265.15 -41.1 -266.8 -41.5 L-256.15 -42.1 -255.65 -42.2 Q-247.85 -43.35 -247.15 -44.05 -247.55 -44.05 -247.75 -44.35 L-247.8 -44.7 Q-248.3 -44.7 -249.15 -45.4 L-250.35 -46.6 Q-247.75 -47.9 -245.85 -47.9 L-245.85 -48.45 -249.9 -47.9 -252.8 -47.4 Q-253.2 -52.55 -251.2 -55.85 -248.9 -58.5 -248.4 -59.45 L-254.65 -59.2 -255.0 -59.2 -259.0 -59.05 -260.7 -59.0 -258.15 -60.2 -250.45 -63.05 -241.6 -65.85 -241.25 -65.85 -245.85 -62.35 -245.85 -62.0 -241.85 -63.45 -237.75 -64.8 Q-238.1 -64.15 -243.0 -59.8 L-248.5 -54.5 Q-223.6 -66.65 -215.35 -71.7 L-212.4 -77.0 -211.3 -79.0 -213.55 -78.0 -214.5 -77.55 -213.7 -78.15 -210.35 -80.75 -207.25 -86.6 -212.6 -82.5 Q-207.25 -88.05 -202.9 -98.1 L-200.9 -102.75 -199.35 -106.95 -198.35 -109.8 -198.05 -109.75 M-248.5 -54.5 L-249.1 -54.2 -248.75 -54.2 -248.5 -54.5 M-34.15 3.75 L-35.15 3.75 Q-39.35 1.8 -43.45 -0.6 -49.95 -4.4 -55.6 -6.75 L-50.05 -0.25 -50.05 0.65 -57.6 -0.8 -75.95 -4.5 -76.15 -4.35 -69.9 -0.5 -69.2 -0.15 Q-68.7 0.15 -68.15 0.5 L-63.0 3.75 -98.0 3.75 -89.75 -1.1 -79.5 -7.1 -78.9 -7.5 -70.85 -12.3 -74.5 -12.3 -79.1 -11.7 -85.25 -10.5 -96.85 -10.5 Q-96.1 -10.8 -90.65 -15.65 -84.85 -20.8 -84.25 -22.1 -87.55 -20.75 -96.3 -16.15 L-100.2 -14.05 -100.7 -26.15 Q-100.7 -32.4 -104.9 -42.2 L-109.1 -50.9 Q-109.1 -51.5 -110.1 -53.95 -111.15 -56.45 -111.15 -58.25 -111.15 -61.4 -110.55 -64.7 -109.85 -68.9 -108.55 -71.15 -106.6 -74.5 -104.95 -76.1 L-102.8 -77.5 -100.0 -77.9 Q-97.9 -78.15 -95.85 -78.9 L-96.55 -80.4 -97.25 -81.4 -97.45 -83.85 -97.55 -84.5 -97.6 -84.95 -96.75 -84.3 -95.45 -83.75 -93.3 -83.5 Q-92.55 -83.5 -91.45 -84.25 -90.85 -84.65 -90.2 -85.2 L-88.05 -87.4 -87.75 -87.3 -87.55 -87.2 -87.65 -87.5 -88.05 -88.95 -88.9 -91.85 -89.8 -94.75 -92.4 -102.75 -93.7 -106.25 -94.3 -112.7 Q-93.5 -111.15 -93.5 -110.2 L-92.25 -106.95 -90.3 -102.75 -89.85 -101.8 -86.3 -94.2 -84.05 -93.85 -80.6 -93.3 -66.2 -91.6 -74.35 -91.15 -82.4 -90.65 -71.0 -87.0 -57.05 -82.4 -69.75 -82.1 -82.5 -81.9 Q-82.5 -81.5 -83.0 -81.5 -73.75 -79.25 -55.85 -76.3 L-39.95 -73.8 Q-25.7 -71.2 -15.45 -67.85 L-9.3 -63.4 -12.55 -64.0 -17.15 -64.7 -20.4 -64.5 -24.5 -63.95 -29.4 -63.4 -29.4 -62.65 -37.65 -62.4 Q-37.65 -61.95 -38.1 -61.95 -37.0 -60.9 -27.5 -55.5 L-29.3 -55.95 Q-30.8 -56.1 -30.8 -54.15 -32.0 -54.15 -34.6 -53.2 L-37.05 -52.25 -41.9 -53.1 -47.0 -54.15 -50.2 -54.15 -45.65 -51.65 Q-34.05 -45.3 -30.3 -42.95 -30.3 -42.45 -31.75 -42.45 -31.75 -42.1 -31.2 -41.8 -30.75 -41.5 -30.35 -41.5 L-30.35 -41.05 -34.5 -40.15 Q-38.3 -39.15 -40.05 -39.2 -39.35 -38.5 -37.1 -38.05 L-34.05 -37.45 -34.05 -36.95 -43.3 -36.95 Q-42.0 -34.05 -31.7 -31.35 L-31.3 -31.3 -30.5 -31.05 -24.9 -29.85 -28.85 -28.65 -29.25 -28.55 -36.35 -26.55 -35.5 -24.85 -34.5 -23.6 -34.6 -22.65 -37.7 -22.65 -34.6 -20.8 -34.6 -20.15 -37.65 -20.15 Q-37.1 -20.15 -33.4 -18.3 L-25.85 -14.55 -25.85 -13.9 -30.2 -12.9 -35.15 -11.5 Q-43.55 -9.05 -45.35 -8.2 L-41.4 -7.4 -35.9 -6.95 -30.6 -6.95 -30.3 -6.95 -30.35 -6.7 Q-30.7 -6.05 -32.75 -5.05 L-36.55 -3.2 -36.55 -2.55 -29.0 -2.55 Q-29.35 -1.8 -33.7 3.25 L-34.15 3.75" fill="#5e4b45" fill-rule="evenodd" stroke="none"/>
    <path d="M-182.55 -88.2 L-183.6 -91.9 -185.3 -98.6 -185.5 -102.75 -185.75 -106.95 -185.95 -112.15 -186.05 -114.9 -186.2 -120.35 -186.2 -121.45 Q-185.9 -123.2 -185.0 -125.3 L-184.7 -125.95 -184.7 -126.0 -184.5 -128.25 -184.45 -128.7 Q-184.5 -128.3 -184.15 -128.3 L-184.1 -127.2 -183.8 -127.95 -183.95 -128.25 -187.2 -133.1 Q-185.5 -135.45 -185.5 -136.15 -185.5 -137.05 -185.65 -137.75 -179.75 -141.6 -173.85 -144.0 L-171.7 -144.85 Q-167.5 -146.35 -162.7 -147.4 L-156.05 -148.55 -136.5 -150.3 -115.7 -152.45 Q-115.35 -151.0 -114.75 -147.4 L-114.45 -144.85 -114.0 -141.55 -113.5 -138.15 -113.45 -137.7 -113.1 -134.7 -112.4 -129.0 -112.3 -128.25 -112.0 -125.9 -112.0 -119.6 Q-112.0 -113.6 -113.2 -109.75 L-113.2 -107.2 Q-110.65 -109.9 -110.3 -111.2 L-109.9 -111.2 Q-109.95 -110.25 -109.45 -108.5 L-109.05 -106.95 -108.85 -105.4 -108.15 -102.75 -107.8 -101.95 -107.65 -101.65 -107.55 -101.45 -107.65 -101.15 -109.85 -93.35 -110.65 -90.4 -110.75 -90.05 -111.65 -86.95 -113.0 -81.75 -113.95 -78.15 -114.3 -77.95 -129.95 -70.35 -135.4 -67.65 -136.05 -67.3 -137.95 -66.75 -143.15 -64.85 -144.7 -64.25 Q-146.5 -63.6 -147.85 -63.25 L-150.8 -62.75 Q-152.25 -62.75 -153.35 -63.9 L-155.7 -66.05 Q-156.75 -66.65 -158.35 -66.95 L-158.45 -66.95 -159.05 -67.0 Q-160.2 -67.3 -161.4 -67.75 L-161.6 -67.85 Q-165.0 -69.15 -169.45 -71.55 L-174.35 -74.45 -174.8 -74.8 Q-177.85 -76.8 -179.75 -78.55 L-182.55 -88.2 M-181.35 -110.55 L-179.8 -106.95 -177.9 -102.75 -177.45 -101.8 Q-171.75 -89.7 -171.45 -87.65 L-174.45 -93.25 Q-177.25 -98.55 -178.95 -102.75 L-180.45 -106.95 -181.35 -110.55 M-175.05 -116.9 Q-177.05 -121.75 -177.4 -121.75 L-179.6 -121.45 -180.3 -121.35 -183.05 -121.05 -184.85 -121.05 -184.9 -117.1 Q-184.9 -114.95 -184.35 -112.15 L-183.1 -106.95 -181.75 -102.75 -181.35 -101.65 Q-177.8 -91.65 -177.8 -90.85 -177.8 -89.4 -172.0 -82.35 L-166.2 -75.5 -165.1 -74.9 -162.95 -74.45 -162.75 -75.65 -162.55 -77.0 Q-162.55 -83.0 -165.25 -92.3 L-168.3 -102.75 -169.45 -106.95 -169.65 -107.6 Q-170.1 -109.7 -171.5 -112.15 -172.85 -114.4 -175.05 -116.9 M-159.8 -101.55 L-161.2 -102.75 -161.3 -102.85 -161.15 -103.0 -161.3 -103.05 -161.7 -103.15 -162.7 -102.75 Q-163.35 -102.2 -163.65 -100.9 L-163.9 -97.0 Q-163.9 -95.7 -160.3 -90.5 -156.7 -85.35 -156.7 -83.15 -156.7 -82.35 -155.9 -81.0 L-154.55 -78.8 Q-153.5 -79.45 -152.45 -83.35 -151.55 -86.7 -151.55 -88.1 -151.55 -89.25 -152.3 -91.9 L-152.45 -92.3 -154.25 -94.0 -154.25 -93.85 -154.45 -94.2 -156.65 -96.15 -156.65 -97.4 -156.85 -97.8 Q-157.8 -99.55 -158.75 -100.6 L-159.8 -101.55 M-117.95 3.75 L-124.0 3.75 -123.8 0.9 -123.6 -2.1 -123.95 -2.1 Q-126.7 -2.1 -127.9 -3.5 -128.8 -4.5 -128.9 -6.4 L-129.0 -6.4 -133.1 -6.05 -134.15 -5.9 -134.4 -5.75 Q-135.15 -5.15 -135.7 -5.1 L-137.25 -4.8 -138.2 -4.6 Q-138.8 -4.6 -139.15 -5.3 L-140.1 -4.6 -142.6 -4.2 Q-143.95 -4.2 -146.2 -5.0 -148.95 -5.9 -148.95 -6.95 -148.95 -7.75 -147.0 -9.0 L-146.55 -9.25 Q-144.25 -10.6 -143.1 -10.6 L-141.55 -10.15 -141.35 -10.1 -141.15 -10.2 -139.8 -10.45 Q-139.3 -10.6 -138.7 -11.0 L-137.65 -11.35 Q-137.15 -11.35 -136.35 -10.75 L-136.2 -10.65 -130.55 -11.75 -129.65 -11.95 Q-126.55 -12.85 -122.6 -14.55 L-122.45 -17.2 Q-121.8 -25.4 -120.65 -32.25 -119.75 -37.85 -119.75 -39.25 L-121.25 -45.1 -119.55 -51.8 -117.95 -57.6 -116.2 -51.4 Q-114.25 -44.7 -114.25 -43.05 L-114.35 -35.5 -115.8 -17.95 -115.85 -17.2 -116.05 -14.8 Q-116.4 -14.25 -116.7 -10.85 L-116.75 -10.45 -117.4 -2.8 -117.6 -1.15 -117.95 3.75 M-161.5 3.75 L-170.1 3.75 Q-171.1 -1.75 -171.1 -4.35 L-171.1 -6.2 Q-171.15 -10.25 -171.7 -13.3 -172.5 -18.35 -174.55 -21.0 L-178.6 -24.95 -183.25 -29.45 -183.25 -29.9 Q-183.25 -34.6 -182.2 -40.8 -180.9 -46.95 -180.7 -48.5 -180.6 -49.6 -177.75 -55.0 L-177.25 -55.95 -175.8 -52.05 -173.65 -46.75 -174.95 -42.7 Q-176.3 -38.3 -176.3 -36.4 L-172.4 -29.2 Q-168.2 -20.9 -166.95 -15.05 L-164.9 -7.1 -162.4 1.1 -161.55 3.7 -161.5 3.75 M-123.8 -124.75 L-126.45 -121.65 Q-129.9 -117.3 -132.1 -113.4 -132.85 -112.15 -134.5 -107.3 L-134.65 -106.95 -136.0 -102.75 -136.2 -101.75 -136.1 -100.25 -136.05 -100.2 -136.05 -100.15 -141.95 -88.55 Q-145.0 -82.35 -147.75 -77.6 L-149.5 -74.8 -147.8 -74.45 -146.75 -74.45 Q-142.6 -74.45 -135.05 -80.45 -127.75 -86.35 -125.7 -90.85 -122.65 -97.5 -121.3 -101.55 L-120.85 -102.75 -119.65 -106.95 Q-118.65 -111.05 -118.65 -114.15 -118.65 -116.3 -119.7 -120.75 -120.85 -125.55 -121.85 -126.5 L-123.55 -125.0 -123.6 -124.55 -123.8 -124.75 M-123.55 -125.0 L-123.45 -125.4 -123.45 -125.9 -123.55 -125.0 M-135.7 -95.45 Q-133.1 -100.95 -132.9 -102.75 L-132.9 -103.0 Q-132.9 -103.45 -133.25 -104.2 L-133.65 -105.4 -132.9 -106.95 -129.05 -112.3 -125.55 -116.6 Q-127.1 -112.15 -129.5 -106.95 L-131.65 -102.75 -132.1 -102.0 -135.7 -95.45" fill="#705736" fill-rule="evenodd" stroke="none"/>
    <path d="M-185.3 -98.6 L-186.2 -102.75 -187.0 -106.95 -187.8 -112.15 -188.45 -118.45 -188.55 -119.85 -188.65 -121.7 -188.7 -122.7 -189.05 -127.2 -189.15 -128.25 -189.2 -128.7 -189.35 -130.35 -188.8 -131.0 -187.2 -133.1 -183.95 -128.25 -183.8 -127.95 -184.1 -127.2 -184.15 -128.3 Q-184.5 -128.3 -184.45 -128.7 L-184.5 -128.25 -184.7 -126.0 -184.7 -125.95 -185.0 -125.3 Q-185.9 -123.2 -186.2 -121.45 L-186.2 -120.35 -186.05 -114.9 -185.95 -112.15 -185.75 -106.95 -185.5 -102.75 -185.3 -98.6 M-107.55 -101.45 L-107.65 -101.65 -107.8 -101.95 -108.15 -102.75 -108.85 -105.4 -109.05 -106.95 -109.45 -108.5 Q-109.95 -110.25 -109.9 -111.2 L-110.3 -111.2 Q-110.65 -109.9 -113.2 -107.2 L-113.2 -109.75 Q-112.0 -113.6 -112.0 -119.6 L-112.0 -125.9 -112.3 -128.25 -112.4 -129.0 -113.1 -134.7 -110.8 -128.25 -107.3 -119.15 Q-105.5 -114.45 -105.5 -112.1 -105.5 -109.95 -106.15 -106.95 L-106.25 -106.35 -106.3 -106.3 -106.6 -105.05 -107.2 -102.75 -107.55 -101.45" fill="#634b2f" fill-rule="evenodd" stroke="none"/>
    <path d="M-263.15 -68.3 L-260.85 -67.95 -263.45 -64.9 -263.5 -64.8 -268.6 -57.25 Q-271.05 -53.55 -272.3 -48.15 -273.3 -43.55 -273.3 -38.55 -273.3 -29.2 -270.15 -21.45 L-268.0 -16.3 Q-267.0 -13.6 -267.0 -11.4 L-266.55 -10.1 Q-266.1 -9.4 -266.1 -8.85 L-269.0 -0.95 -270.6 3.75 -280.95 3.75 -278.15 -8.4 Q-278.15 -9.7 -281.2 -15.8 L-281.95 -17.4 -283.45 -21.7 Q-285.6 -27.3 -285.6 -30.25 L-285.6 -30.45 Q-283.05 -44.7 -276.4 -54.0 -273.5 -58.1 -268.6 -63.0 L-263.15 -68.3 M-181.35 -110.55 L-181.6 -112.15 -181.65 -113.4 Q-181.65 -114.85 -182.55 -118.55 L-183.05 -121.05 -180.3 -121.35 -179.6 -121.45 -177.4 -121.75 Q-177.05 -121.75 -175.05 -116.9 L-174.35 -115.2 -173.1 -112.15 Q-171.8 -108.75 -171.55 -106.95 L-171.45 -106.1 Q-171.45 -105.3 -170.45 -102.75 L-170.05 -101.85 -168.6 -98.45 Q-168.6 -95.6 -166.6 -88.85 -164.5 -81.65 -164.35 -80.25 L-164.35 -77.35 Q-167.15 -80.1 -171.45 -87.65 -171.75 -89.7 -177.45 -101.8 L-177.9 -102.75 -179.8 -106.95 -181.35 -110.55 M-154.25 -93.85 L-153.0 -91.75 Q-153.0 -87.8 -153.4 -85.35 -154.6 -86.1 -158.05 -90.7 -161.7 -95.5 -161.7 -96.8 -161.7 -98.35 -160.5 -100.45 L-159.8 -101.55 -158.75 -100.6 Q-157.8 -99.55 -156.85 -97.8 L-156.65 -97.4 -156.65 -96.15 -154.45 -94.2 -154.25 -93.85 M-174.35 -74.45 L-169.45 -71.55 Q-165.0 -69.15 -161.6 -67.85 L-161.4 -67.75 -161.55 -67.5 -161.55 -67.15 -159.05 -67.0 -158.45 -66.95 -158.35 -66.95 -158.45 -66.9 -157.7 -65.45 Q-156.25 -62.05 -155.55 -61.25 -154.6 -60.1 -152.95 -55.55 -151.55 -51.75 -150.85 -51.75 -150.15 -51.75 -146.6 -55.9 L-146.55 -55.95 -141.8 -61.6 Q-140.25 -63.2 -133.4 -67.0 -127.15 -70.45 -124.45 -71.35 L-124.5 -71.45 -124.15 -71.55 -123.25 -71.9 -120.35 -71.9 -122.5 -65.8 Q-124.05 -61.25 -124.05 -60.6 L-122.95 -59.45 -121.9 -58.45 -127.5 -37.85 Q-127.5 -36.95 -125.85 -34.05 -124.25 -31.2 -124.25 -28.7 -124.25 -27.0 -126.65 -20.2 L-127.75 -17.2 -129.65 -11.95 -130.55 -11.75 -136.2 -10.65 -136.35 -10.75 Q-137.15 -11.35 -137.65 -11.35 L-138.7 -11.0 Q-139.3 -10.6 -139.8 -10.45 L-141.15 -10.2 -141.35 -10.1 -141.55 -10.15 -143.1 -10.6 Q-144.25 -10.6 -146.55 -9.25 L-147.0 -9.0 -150.7 -8.65 -152.45 -8.5 -158.15 -7.9 -162.05 -7.45 -164.2 -13.25 Q-166.8 -19.8 -166.9 -22.0 -167.05 -24.85 -169.45 -31.3 L-171.9 -37.25 Q-171.9 -39.15 -171.3 -42.05 -170.75 -44.95 -170.75 -46.2 -170.75 -46.65 -174.0 -53.3 L-171.95 -57.7 Q-169.9 -62.15 -169.9 -63.15 -169.9 -63.9 -171.05 -66.75 L-172.1 -69.3 -174.35 -74.45 M7.05 -48.4 Q8.75 -40.85 7.45 -34.55 L7.45 -34.5 Q1.55 -23.6 0.85 -20.6 -3.15 -13.25 -3.15 -11.2 -3.15 -9.4 -0.95 -0.15 L0.0 3.75 -12.55 3.75 -12.5 0.15 Q-12.5 -6.4 -14.5 -12.45 -16.55 -17.35 -16.55 -18.4 L-12.9 -25.3 Q-9.0 -32.15 -8.6 -34.15 L-6.2 -43.45 Q-4.7 -49.35 -4.7 -52.9 -4.7 -54.25 -6.3 -59.45 L-7.95 -64.8 Q-7.95 -66.3 -11.55 -70.45 L-15.25 -74.45 -12.05 -76.7 -5.4 -68.65 Q2.7 -58.65 2.7 -57.25 L6.25 -50.1 7.05 -48.4 M-135.05 3.75 L-159.65 3.75 -160.2 0.5 -154.6 -0.85 -153.95 -1.0 -150.7 -1.7 Q-142.75 -3.4 -139.15 -3.4 L-133.05 -2.6 -135.05 3.75 M-135.7 -95.45 L-132.1 -102.0 -131.65 -102.75 -129.5 -106.95 Q-127.1 -112.15 -125.55 -116.6 L-124.1 -118.5 -123.7 -118.1 -123.7 -114.85 Q-124.05 -110.75 -124.85 -106.95 -125.3 -104.8 -125.9 -102.75 -130.6 -86.4 -144.3 -78.45 -144.5 -79.85 -143.1 -82.4 L-142.15 -83.85 -141.35 -85.35 -135.7 -95.45" fill="#856941" fill-rule="evenodd" stroke="none"/>
    <path d="M-183.05 -121.05 L-182.55 -118.55 Q-181.65 -114.85 -181.65 -113.4 L-181.6 -112.15 -181.35 -110.55 -180.45 -106.95 -178.95 -102.75 Q-177.25 -98.55 -174.45 -93.25 L-171.45 -87.65 Q-167.15 -80.1 -164.35 -77.35 L-164.35 -80.25 Q-164.5 -81.65 -166.6 -88.85 -168.6 -95.6 -168.6 -98.45 L-170.05 -101.85 -170.45 -102.75 Q-171.45 -105.3 -171.45 -106.1 L-171.55 -106.95 Q-171.8 -108.75 -173.1 -112.15 L-174.35 -115.2 -175.05 -116.9 Q-172.85 -114.4 -171.5 -112.15 -170.1 -109.7 -169.65 -107.6 L-169.45 -106.95 -168.3 -102.75 -165.25 -92.3 Q-162.55 -83.0 -162.55 -77.0 L-162.75 -75.65 -162.95 -74.45 -165.1 -74.9 -166.2 -75.5 -172.0 -82.35 Q-177.8 -89.4 -177.8 -90.85 -177.8 -91.65 -181.35 -101.65 L-181.75 -102.75 -183.1 -106.95 -184.35 -112.15 Q-184.9 -114.95 -184.9 -117.1 L-184.85 -121.05 -183.05 -121.05 M-154.25 -93.85 L-154.25 -94.0 -152.45 -92.3 -152.3 -91.9 Q-151.55 -89.25 -151.55 -88.1 -151.55 -86.7 -152.45 -83.35 -153.5 -79.45 -154.55 -78.8 L-155.9 -81.0 Q-156.7 -82.35 -156.7 -83.15 -156.7 -85.35 -160.3 -90.5 -163.9 -95.7 -163.9 -97.0 L-163.65 -100.9 Q-163.35 -102.2 -162.7 -102.75 L-161.7 -103.15 -161.3 -103.05 -161.15 -103.0 -161.3 -102.85 -161.2 -102.75 -159.8 -101.55 -160.5 -100.45 Q-161.7 -98.35 -161.7 -96.8 -161.7 -95.5 -158.05 -90.7 -154.6 -86.1 -153.4 -85.35 -153.0 -87.8 -153.0 -91.75 L-154.25 -93.85 M-179.75 -78.55 Q-177.85 -76.8 -174.8 -74.8 L-174.35 -74.45 -172.1 -69.3 -171.05 -66.75 Q-169.9 -63.9 -169.9 -63.15 -169.9 -62.15 -171.95 -57.7 L-174.0 -53.3 Q-170.75 -46.65 -170.75 -46.2 -170.75 -44.95 -171.3 -42.05 -171.9 -39.15 -171.9 -37.25 L-169.45 -31.3 Q-167.05 -24.85 -166.9 -22.0 -166.8 -19.8 -164.2 -13.25 L-162.05 -7.45 -158.15 -7.9 -152.45 -8.5 -150.7 -8.65 -147.0 -9.0 Q-148.95 -7.75 -148.95 -6.95 -148.95 -5.9 -146.2 -5.0 -143.95 -4.2 -142.6 -4.2 L-140.1 -4.6 -139.15 -5.3 Q-138.8 -4.6 -138.2 -4.6 L-137.25 -4.8 -135.7 -5.1 Q-135.15 -5.15 -134.4 -5.75 L-134.15 -5.9 -133.1 -6.05 -129.0 -6.4 -128.9 -6.4 Q-128.8 -4.5 -127.9 -3.5 -126.7 -2.1 -123.95 -2.1 L-123.6 -2.1 -123.8 0.9 -124.0 3.75 -135.05 3.75 -133.05 -2.6 -139.15 -3.4 Q-142.75 -3.4 -150.7 -1.7 L-153.95 -1.0 -154.6 -0.85 -160.2 0.5 -159.65 3.75 -161.5 3.75 -161.55 3.7 -162.4 1.1 -164.9 -7.1 -166.95 -15.05 Q-168.2 -20.9 -172.4 -29.2 L-176.3 -36.4 Q-176.3 -38.3 -174.95 -42.7 L-173.65 -46.75 -175.8 -52.05 -177.25 -55.95 -175.75 -59.3 -175.65 -59.75 Q-175.0 -61.55 -175.0 -62.75 L-175.2 -65.0 -175.35 -66.0 -175.5 -66.45 -175.95 -67.55 -179.75 -78.55 M-161.4 -67.75 Q-160.2 -67.3 -159.05 -67.0 L-161.55 -67.15 -161.55 -67.5 -161.4 -67.75 M-158.35 -66.95 Q-156.75 -66.65 -155.7 -66.05 L-153.35 -63.9 Q-152.25 -62.75 -150.8 -62.75 L-147.85 -63.25 Q-146.5 -63.6 -144.7 -64.25 L-143.15 -64.85 -137.95 -66.75 -136.05 -67.3 -135.4 -67.65 -129.95 -70.35 -114.3 -77.95 -113.95 -78.15 -114.0 -77.9 -115.7 -71.45 Q-117.9 -63.35 -118.15 -59.75 L-118.2 -58.8 -117.95 -57.6 -119.55 -51.8 -121.25 -45.1 -119.75 -39.25 Q-119.75 -37.85 -120.65 -32.25 -121.8 -25.4 -122.45 -17.2 L-122.6 -14.55 Q-126.55 -12.85 -129.65 -11.95 L-127.75 -17.2 -126.65 -20.2 Q-124.25 -27.0 -124.25 -28.7 -124.25 -31.2 -125.85 -34.05 -127.5 -36.95 -127.5 -37.85 L-121.9 -58.45 -122.95 -59.45 -124.05 -60.6 Q-124.05 -61.25 -122.5 -65.8 L-120.35 -71.9 -123.25 -71.9 -124.15 -71.55 -124.5 -71.45 -124.45 -71.35 Q-127.15 -70.45 -133.4 -67.0 -140.25 -63.2 -141.8 -61.6 L-146.55 -55.95 -146.6 -55.9 Q-150.15 -51.75 -150.85 -51.75 -151.55 -51.75 -152.95 -55.55 -154.6 -60.1 -155.55 -61.25 -156.25 -62.05 -157.7 -65.45 L-158.45 -66.9 -158.35 -66.95 M-123.8 -124.75 L-123.6 -124.55 -123.55 -125.0 -121.85 -126.5 Q-120.85 -125.55 -119.7 -120.75 -118.65 -116.3 -118.65 -114.15 -118.65 -111.05 -119.65 -106.95 L-120.85 -102.75 -121.3 -101.55 Q-122.65 -97.5 -125.7 -90.85 -127.75 -86.35 -135.05 -80.45 -142.6 -74.45 -146.75 -74.45 L-147.8 -74.45 -149.5 -74.8 -147.75 -77.6 Q-145.0 -82.35 -141.95 -88.55 L-136.05 -100.15 -136.05 -100.2 -136.1 -100.25 -136.2 -101.75 -136.0 -102.75 -134.65 -106.95 -134.5 -107.3 Q-132.85 -112.15 -132.1 -113.4 -129.9 -117.3 -126.45 -121.65 L-123.8 -124.75 M-125.55 -116.6 L-129.05 -112.3 -132.9 -106.95 -133.65 -105.4 -133.25 -104.2 Q-132.9 -103.45 -132.9 -103.0 L-132.9 -102.75 Q-133.1 -100.95 -135.7 -95.45 L-141.35 -85.35 -142.15 -83.85 -143.1 -82.4 Q-144.5 -79.85 -144.3 -78.45 -130.6 -86.4 -125.9 -102.75 -125.3 -104.8 -124.85 -106.95 -124.05 -110.75 -123.7 -114.85 L-123.7 -118.1 -124.1 -118.5 -125.55 -116.6" fill="#7d5f3b" fill-rule="evenodd" stroke="none"/>
    <path d="M-258.3 -63.85 L-257.65 -63.75 -257.85 -63.45 Q-259.25 -61.25 -260.85 -59.75 L-261.6 -59.0 -260.7 -59.0 -259.0 -59.05 -255.0 -59.2 -254.65 -59.2 -255.65 -58.15 -258.45 -54.55 -256.6 -54.3 -254.3 -54.15 -254.3 -53.2 Q-254.3 -50.95 -255.5 -45.1 L-256.15 -42.1 -266.8 -41.5 Q-265.15 -41.1 -257.3 -37.5 L-254.8 -36.3 -251.05 -34.55 -255.05 -33.55 -261.75 -33.2 Q-260.1 -31.6 -255.85 -29.0 -252.0 -26.7 -249.8 -25.75 L-251.35 -21.85 -251.55 -21.8 -258.05 -18.25 -258.05 -17.6 -257.5 -17.5 -253.55 -17.05 -255.45 -12.3 Q-251.35 -10.7 -247.75 -10.2 -251.85 -4.9 -252.4 -3.75 L-248.7 -3.75 Q-248.25 -4.2 -246.55 -4.75 L-246.6 -4.65 -249.05 0.65 -247.15 0.65 -247.45 3.75 -270.6 3.75 -269.0 -0.95 -266.1 -8.85 Q-266.1 -9.4 -266.55 -10.1 L-267.0 -11.4 Q-267.0 -13.6 -268.0 -16.3 L-270.15 -21.45 Q-273.3 -29.2 -273.3 -38.55 -273.3 -43.55 -272.3 -48.15 -271.05 -53.55 -268.6 -57.25 L-263.5 -64.8 -263.45 -64.9 -263.45 -64.8 -261.15 -64.8 Q-260.2 -64.05 -258.4 -63.6 L-258.3 -63.85 M-12.75 -82.55 L-12.7 -82.5 -12.55 -82.4 -8.9 -78.7 -10.25 -77.8 -12.05 -76.7 -15.25 -74.45 -11.55 -70.45 Q-7.95 -66.3 -7.95 -64.8 L-6.3 -59.45 Q-4.7 -54.25 -4.7 -52.9 -4.7 -49.35 -6.2 -43.45 L-8.6 -34.15 Q-9.0 -32.15 -12.9 -25.3 L-16.55 -18.4 Q-16.55 -17.35 -14.5 -12.45 -12.5 -6.4 -12.5 0.15 L-12.55 3.75 -29.05 3.75 Q-26.35 -1.0 -26.35 -1.45 -26.35 -3.1 -28.65 -5.3 L-30.35 -6.7 -30.3 -6.95 -30.6 -6.95 -31.45 -7.65 Q-29.8 -7.75 -26.3 -10.0 -28.0 -10.85 -30.2 -12.9 L-25.85 -13.9 -25.85 -14.55 -33.4 -18.3 Q-32.05 -19.5 -29.85 -22.1 -26.65 -25.75 -23.45 -27.15 -25.3 -27.35 -28.45 -28.3 L-29.25 -28.55 -28.85 -28.65 -24.9 -29.85 -21.95 -30.9 -27.95 -32.6 -29.9 -33.15 -28.0 -34.95 Q-24.6 -38.4 -22.5 -41.05 -26.35 -44.9 -26.1 -47.15 -25.05 -47.15 -23.0 -48.25 -20.8 -49.3 -20.05 -50.35 L-22.8 -54.05 -26.0 -58.7 -19.3 -59.4 -12.55 -60.1 -12.55 -60.55 -17.75 -63.1 -20.4 -64.5 -17.15 -64.7 -12.55 -64.0 -9.3 -63.4 -15.45 -67.85 -17.15 -69.2 -23.7 -74.3 -18.95 -74.3 -18.95 -74.4 -18.95 -75.2 Q-23.15 -77.15 -23.7 -78.25 -23.35 -78.25 -23.35 -78.65 L-18.75 -78.7 Q-19.05 -79.65 -19.35 -79.8 -19.85 -80.1 -19.85 -80.4 L-12.75 -82.55" fill="#785e3a" fill-rule="evenodd" stroke="none"/>
    <path d="M-260.85 -67.95 L-255.05 -67.3 Q-254.95 -66.3 -256.15 -65.7 L-258.55 -64.25 -258.3 -63.85 -258.4 -63.6 Q-260.2 -64.05 -261.15 -64.8 L-263.45 -64.8 -263.45 -64.9 -260.85 -67.95 M-247.45 3.75 L-247.15 0.65 -249.05 0.65 -246.6 -4.65 -246.55 -4.75 -245.8 -4.95 -243.0 -5.65 -239.85 -5.65 Q-239.85 -5.2 -240.25 -4.7 L-241.15 -3.75 -241.15 3.0 -241.15 3.75 -247.45 3.75 M-247.75 -10.2 Q-251.35 -10.7 -255.45 -12.3 L-253.55 -17.05 -250.45 -16.8 -242.9 -16.4 -247.45 -10.65 -247.75 -10.2 M-251.35 -21.85 L-249.8 -25.75 Q-252.0 -26.7 -255.85 -29.0 -260.1 -31.6 -261.75 -33.2 L-255.05 -33.55 -251.05 -34.55 -242.9 -30.9 -242.85 -30.55 Q-242.65 -30.25 -242.25 -30.25 L-245.7 -27.8 -249.15 -25.15 Q-249.15 -24.5 -247.2 -24.5 -247.75 -24.0 -251.35 -21.85 M-256.15 -42.1 L-255.5 -45.1 Q-254.3 -50.95 -254.3 -53.2 L-254.3 -54.15 -256.6 -54.3 -258.45 -54.55 -255.65 -58.15 -254.65 -59.2 -248.4 -59.45 Q-248.9 -58.5 -251.2 -55.85 -253.2 -52.55 -252.8 -47.4 L-249.9 -47.9 -245.85 -48.45 -245.85 -47.9 Q-247.75 -47.9 -250.35 -46.6 L-249.15 -45.4 Q-248.3 -44.7 -247.8 -44.7 L-247.75 -44.35 Q-247.55 -44.05 -247.15 -44.05 -247.85 -43.35 -255.65 -42.2 L-256.15 -42.1 M-29.05 3.75 L-34.15 3.75 -33.7 3.25 Q-29.35 -1.8 -29.0 -2.55 L-36.55 -2.55 -36.55 -3.2 -32.75 -5.05 Q-30.7 -6.05 -30.35 -6.7 L-28.65 -5.3 Q-26.35 -3.1 -26.35 -1.45 -26.35 -1.0 -29.05 3.75 M-20.4 -64.5 L-17.75 -63.1 -12.55 -60.55 -12.55 -60.1 -19.3 -59.4 -26.0 -58.7 -22.8 -54.05 -20.05 -50.35 Q-20.8 -49.3 -23.0 -48.25 -25.05 -47.15 -26.1 -47.15 -26.35 -44.9 -22.5 -41.05 -24.6 -38.4 -28.0 -34.95 L-29.9 -33.15 Q-34.7 -34.6 -36.3 -35.45 -28.0 -38.8 -26.4 -38.45 -26.85 -40.25 -29.0 -42.6 -30.75 -44.55 -30.75 -47.0 L-29.9 -48.95 Q-29.9 -49.6 -30.15 -49.75 L-30.75 -49.8 -30.75 -52.9 -29.1 -52.25 -27.7 -51.95 Q-26.8 -51.95 -26.0 -52.9 -25.15 -53.75 -23.7 -53.75 L-26.65 -56.8 Q-28.6 -59.15 -29.4 -60.75 L-29.4 -62.65 -29.4 -63.4 -24.5 -63.95 -20.4 -64.5 M-29.25 -28.55 L-28.45 -28.3 Q-25.3 -27.35 -23.45 -27.15 -26.65 -25.75 -29.85 -22.1 -32.05 -19.5 -33.4 -18.3 -37.1 -20.15 -37.65 -20.15 L-34.6 -20.15 -34.6 -20.8 -37.7 -22.65 -34.6 -22.65 -34.5 -23.6 -34.5 -23.85 -35.5 -24.85 -36.35 -26.55 -29.25 -28.55 M-30.2 -12.9 Q-28.0 -10.85 -26.3 -10.0 -29.8 -7.75 -31.45 -7.65 L-30.6 -6.95 -35.9 -6.95 -41.4 -7.4 -45.35 -8.2 Q-43.55 -9.05 -35.15 -11.5 L-30.2 -12.9" fill="#6b5334" fill-rule="evenodd" stroke="none"/>
    <path d="M-266.75 -69.05 L-265.1 -68.65 -263.15 -68.3 -268.6 -63.0 Q-273.5 -58.1 -276.4 -54.0 -283.05 -44.7 -285.6 -30.45 L-285.65 -31.15 -285.65 -33.05 -285.65 -33.2 Q-285.65 -48.2 -276.6 -59.75 L-276.25 -60.1 Q-272.7 -64.65 -269.45 -67.15 -268.1 -68.3 -266.75 -69.05 M-281.95 -17.4 L-281.2 -15.8 Q-278.15 -9.7 -278.15 -8.4 L-280.95 3.75 -285.6 3.75 Q-285.0 1.05 -283.8 -2.5 -281.25 -10.1 -281.25 -13.25 L-281.25 -13.8 Q-281.4 -15.3 -281.95 -17.4 M-8.9 -78.7 Q-1.95 -71.05 2.85 -60.5 5.8 -54.15 7.05 -48.4 L6.25 -50.1 2.7 -57.25 Q2.7 -58.65 -5.4 -68.65 L-12.05 -76.7 -10.25 -77.8 -8.9 -78.7 M0.85 -20.6 L0.7 -19.9 Q0.7 -16.7 2.2 -11.0 3.7 -5.3 3.7 -2.9 L3.55 1.15 2.55 3.75 0.0 3.75 -0.95 -0.15 Q-3.15 -9.4 -3.15 -11.2 -3.15 -13.25 0.85 -20.6" fill="#947448" fill-rule="evenodd" stroke="none"/>
    <path d="M-188.05 -87.6 Q-186.6 -89.2 -185.1 -89.2 -183.6 -89.2 -182.55 -88.2 L-179.75 -78.55 -175.95 -67.55 -175.5 -66.45 -175.35 -66.0 -175.2 -65.0 -175.0 -62.75 Q-175.0 -61.55 -175.65 -59.75 L-175.75 -59.3 -177.25 -55.95 -177.75 -55.0 Q-180.6 -49.6 -180.7 -48.5 -180.9 -46.95 -182.2 -40.8 -183.25 -34.6 -183.25 -29.9 L-183.25 -29.45 -178.6 -24.95 -174.55 -21.0 Q-172.5 -18.35 -171.7 -13.3 L-174.2 -16.05 -178.35 -20.0 -183.0 -23.1 Q-187.15 -25.95 -187.15 -26.7 -187.15 -33.9 -183.3 -44.25 -179.15 -54.4 -176.85 -60.7 L-177.35 -61.35 Q-179.9 -64.55 -179.9 -65.15 -179.9 -65.6 -180.25 -66.25 -181.2 -67.9 -184.45 -70.8 -188.75 -74.65 -189.5 -74.65 L-198.3 -68.15 -198.6 -67.95 Q-199.3 -67.45 -199.6 -67.3 L-199.4 -68.3 -199.3 -68.8 -199.0 -69.2 Q-196.0 -73.2 -192.75 -79.5 L-190.4 -84.1 -189.05 -86.3 -188.05 -87.6 M-113.95 -78.15 L-113.0 -81.75 -111.65 -86.95 -110.75 -90.05 -110.65 -90.4 -109.85 -93.35 -108.8 -93.75 -106.0 -93.95 -105.3 -93.95 -104.25 -93.85 -102.45 -93.45 -101.5 -92.85 -100.95 -92.35 Q-100.35 -91.6 -99.8 -90.05 -100.45 -88.05 -101.2 -86.65 L-102.5 -84.9 Q-103.8 -83.55 -106.85 -82.7 -109.7 -82.0 -111.0 -80.35 -111.85 -79.35 -112.5 -77.7 L-112.8 -76.85 -113.6 -73.95 -113.85 -72.35 -114.05 -71.1 Q-114.65 -66.65 -114.65 -63.4 -114.65 -57.8 -111.15 -48.25 -107.75 -38.7 -107.75 -35.85 L-107.2 -33.55 -106.7 -31.5 -109.5 -7.95 -110.65 3.75 -117.95 3.75 -117.6 -1.15 -117.4 -2.8 -116.75 -10.45 -116.7 -10.85 Q-116.4 -14.25 -116.05 -14.8 L-115.85 -17.2 -115.8 -17.95 -114.35 -35.5 -114.25 -43.05 Q-114.25 -44.7 -116.2 -51.4 L-117.95 -57.6 -118.2 -58.8 -118.15 -59.75 Q-117.9 -63.35 -115.7 -71.45 L-114.0 -77.9 -113.95 -78.15" fill="#473834" fill-rule="evenodd" stroke="none"/>
    <path d="M-198.95 -101.3 Q-198.6 -98.05 -198.35 -92.75 -197.95 -83.6 -198.45 -82.4 L-198.45 -80.7 -197.0 -80.7 -190.4 -84.1 -192.75 -79.5 Q-196.0 -73.2 -199.0 -69.2 L-200.85 -71.9 -202.05 -73.8 -201.25 -76.9 -200.75 -78.6 Q-201.25 -78.3 -201.25 -79.35 L-200.25 -88.4 -198.95 -101.3 M-104.25 -93.85 Q-104.3 -95.8 -103.8 -97.95 L-103.0 -100.9 -103.0 -104.5 -102.5 -102.75 -102.4 -102.5 -102.3 -102.75 -100.9 -106.95 Q-100.0 -110.05 -99.85 -111.85 L-99.05 -106.95 -98.45 -102.75 -97.7 -97.35 -97.1 -93.2 -96.4 -88.7 -95.45 -83.75 -96.75 -84.3 -97.7 -88.15 -98.5 -91.6 -100.95 -102.05 Q-100.95 -100.25 -101.5 -92.85 L-102.45 -93.45 -104.25 -93.85" fill="#94766e" fill-rule="evenodd" stroke="none"/>
    <path d="M-241.15 3.0 L-232.85 -6.65 -224.6 -16.45 Q-224.6 -15.95 -227.15 -11.2 L-229.95 -5.85 -229.95 -5.5 -223.35 -9.4 Q-216.8 -13.2 -215.45 -13.6 L-219.3 -10.0 Q-223.5 -6.15 -225.8 -2.7 -227.25 -0.45 -232.5 3.75 L-241.15 3.75 -241.15 3.0 M-220.55 3.75 L-213.0 0.15 Q-193.35 -9.0 -187.25 -10.45 -187.8 -9.35 -199.65 0.85 L-199.65 1.15 -194.85 -0.95 Q-189.8 -3.1 -188.0 -3.4 L-187.65 -3.4 -194.85 3.75 -220.55 3.75 M-180.45 3.75 L-180.6 -0.5 Q-180.95 -9.4 -181.25 -11.15 -181.45 -12.15 -186.65 -16.65 L-191.4 -20.7 -191.4 -21.4 -189.9 -35.8 Q-188.45 -48.8 -188.45 -51.25 -188.45 -52.95 -189.9 -56.5 L-192.95 -64.8 -197.8 -61.35 -202.15 -58.1 -202.15 -60.2 -200.6 -67.3 -199.65 -68.35 -199.3 -68.8 -199.4 -68.3 -199.6 -67.3 Q-199.3 -67.45 -198.6 -67.95 L-198.3 -68.15 -189.5 -74.65 Q-188.75 -74.65 -184.45 -70.8 -181.2 -67.9 -180.25 -66.25 -179.9 -65.6 -179.9 -65.15 -179.9 -64.55 -177.35 -61.35 L-176.85 -60.7 Q-179.15 -54.4 -183.3 -44.25 -187.15 -33.9 -187.15 -26.7 -187.15 -25.95 -183.0 -23.1 L-178.35 -20.0 -174.2 -16.05 -171.7 -13.3 Q-171.15 -10.25 -171.1 -6.2 L-171.1 -4.35 Q-171.1 -1.75 -170.1 3.75 L-180.45 3.75 M-35.15 3.75 L-63.0 3.75 -68.15 0.5 Q-68.7 0.15 -69.2 -0.15 L-69.9 -0.5 -76.15 -4.35 -75.95 -4.5 -57.6 -0.8 -50.05 0.65 -50.05 -0.25 -55.6 -6.75 Q-49.95 -4.4 -43.45 -0.6 -39.35 1.8 -35.15 3.75 M-98.0 3.75 L-110.65 3.75 -109.5 -7.95 -106.7 -31.5 -107.2 -33.55 -107.75 -35.85 Q-107.75 -38.7 -111.15 -48.25 -114.65 -57.8 -114.65 -63.4 -114.65 -66.65 -114.05 -71.1 L-113.85 -72.35 -113.6 -73.95 -112.8 -76.85 -112.5 -77.7 Q-111.85 -79.35 -111.0 -80.35 -109.7 -82.0 -106.85 -82.7 -103.8 -83.55 -102.5 -84.9 L-101.2 -86.65 Q-100.45 -88.05 -99.8 -90.05 L-99.35 -88.7 -99.05 -87.6 -98.0 -85.35 -97.8 -85.15 -97.75 -85.1 -97.6 -84.95 -97.55 -84.5 -97.45 -83.85 -97.25 -81.4 -96.55 -80.4 -95.85 -78.9 Q-97.9 -78.15 -100.0 -77.9 L-102.8 -77.5 -104.95 -76.1 Q-106.6 -74.5 -108.55 -71.15 -109.85 -68.9 -110.55 -64.7 -111.15 -61.4 -111.15 -58.25 -111.15 -56.45 -110.1 -53.95 -109.1 -51.5 -109.1 -50.9 L-104.9 -42.2 Q-100.7 -32.4 -100.7 -26.15 L-100.2 -14.05 -96.3 -16.15 Q-87.55 -20.75 -84.25 -22.1 -84.85 -20.8 -90.65 -15.65 -96.1 -10.8 -96.85 -10.5 L-85.25 -10.5 -79.1 -11.7 -74.5 -12.3 -70.85 -12.3 -78.9 -7.5 -79.5 -7.1 -89.75 -1.1 -98.0 3.75" fill="#574540" fill-rule="evenodd" stroke="none"/>
    <path d="M-200.6 -67.3 Q-201.95 -65.75 -203.25 -64.7 L-203.85 -64.25 -204.2 -65.7 -203.05 -69.95 -202.05 -73.8 -200.85 -71.9 -199.0 -69.2 -199.3 -68.8 -199.65 -68.35 -200.6 -67.3 M-101.5 -92.85 Q-100.95 -100.25 -100.95 -102.05 L-98.5 -91.6 -97.7 -88.15 -96.75 -84.3 -97.6 -84.95 -97.75 -85.1 -97.8 -85.15 -97.8 -85.55 -98.0 -85.35 -99.05 -87.6 -99.35 -88.7 -99.8 -90.05 Q-100.35 -91.6 -100.95 -92.35 L-101.5 -92.85" fill="#a18178" fill-rule="evenodd" stroke="none"/>
    <path d="M-113.1 -134.7 L-113.45 -137.7 -110.75 -134.95 -108.1 -128.45 -108.05 -128.25 -106.3 -123.8 Q-104.55 -119.55 -104.55 -117.0 -104.55 -113.2 -106.15 -106.95 -105.5 -109.95 -105.5 -112.1 -105.5 -114.45 -107.3 -119.15 L-110.8 -128.25 -113.1 -134.7" fill="#755e57" fill-rule="evenodd" stroke="none"/>
  </g>
</svg>
