<?xml version="1.0" encoding="UTF-8" standalone="no"?>
<svg xmlns:xlink="http://www.w3.org/1999/xlink" height="34.65px" width="30.0px" xmlns="http://www.w3.org/2000/svg">
  <g transform="matrix(1.0, 0.0, 0.0, 1.0, 15.0, 19.8)">
    <path d="M12.75 -8.75 L12.35 -9.7 Q11.45 -11.9 9.85 -13.75 5.75 -18.6 0.0 -18.6 -5.75 -18.6 -9.85 -13.75 -11.75 -11.45 -12.75 -8.75 L-13.85 -8.7 Q-12.8 -11.9 -10.6 -14.55 -6.2 -19.8 0.0 -19.8 4.95 -19.8 8.75 -16.5 L8.8 -16.45 10.6 -14.55 12.35 -12.0 Q13.3 -10.45 13.9 -8.7 L12.75 -8.75" fill="#6d2424" fill-rule="evenodd" stroke="none"/>
    <path d="M-12.75 -8.75 Q-11.75 -11.45 -9.85 -13.75 -5.75 -18.6 0.0 -18.6 5.75 -18.6 9.85 -13.75 11.45 -11.9 12.35 -9.7 L12.75 -8.75 12.35 -8.8 11.7 -8.85 0.0 -9.15 -11.65 -8.85 -12.75 -8.75" fill="url(#gradient0)" fill-rule="evenodd" stroke="none"/>
    <path d="M-9.35 5.85 L-9.55 5.7 -10.6 4.75 -11.5 3.75 -12.1 3.05 -13.35 1.1 -13.85 0.0 -14.05 -0.5 Q-15.0 -3.0 -15.0 -5.85 -15.0 -7.75 -14.55 -9.45 L-14.5 -9.65 -14.25 -10.55 -13.15 -10.75 -12.3 -10.85 -11.35 -10.9 -10.35 -11.0 0.0 -11.25 10.4 -11.0 11.0 -10.95 11.35 -10.9 12.35 -10.85 13.15 -10.75 14.3 -10.55 14.55 -9.65 14.6 -9.45 Q15.0 -7.7 15.0 -5.8 15.0 -2.95 14.1 -0.5 L13.85 0.05 13.35 1.1 11.85 3.3 11.0 4.35 10.6 4.75 10.1 5.25 9.2 5.95 7.45 7.2 Q5.3 8.45 2.85 8.9 L1.9 9.05 1.7 8.05 1.8 8.05 2.85 7.85 Q5.1 7.45 7.05 6.3 L9.9 4.05 11.0 2.85 12.2 1.1 12.4 0.8 Q14.0 -2.15 14.0 -5.8 14.0 -7.8 13.55 -9.55 L13.5 -9.75 12.65 -9.8 12.6 -9.8 11.45 -9.9 11.0 -9.9 0.0 -10.15 -11.4 -9.9 -12.5 -9.8 -12.6 -9.8 -13.45 -9.75 -13.5 -9.55 Q-14.0 -7.8 -14.0 -5.85 -14.0 -2.2 -12.35 0.8 L-12.15 1.1 -10.75 3.1 -9.9 4.05 -8.85 5.0 -6.6 6.55 Q-4.55 7.65 -2.2 8.0 L-2.05 8.05 -2.15 9.05 -2.3 9.0 -2.35 9.0 Q-4.9 8.6 -7.15 7.4 L-8.25 6.7 -8.25 6.5 -8.55 6.5 -9.35 5.85 M0.8 9.35 L1.0 11.0 1.0 11.5 0.95 11.5 0.9 12.25 0.9 12.35 0.95 12.5 0.95 12.7 Q0.85 13.45 0.25 13.75 L0.1 13.8 0.1 13.85 -0.35 13.9 -0.6 13.85 -0.8 13.7 -1.1 13.0 -1.4 11.3 -1.25 9.1 -1.2 8.85 -1.05 8.1 -1.0 7.9 -1.05 8.75 -0.9 9.9 Q-0.7 10.7 -0.35 10.7 0.35 10.7 0.8 9.35" fill="url(#gradient1)" fill-rule="evenodd" stroke="none"/>
    <path d="M-12.35 0.8 Q-14.0 -2.2 -14.0 -5.85 -14.0 -7.8 -13.5 -9.55 L-13.45 -9.75 -12.6 -9.8 -12.5 -9.8 -11.4 -9.9 0.0 -10.15 11.0 -9.9 11.45 -9.9 12.6 -9.8 12.65 -9.8 13.5 -9.75 13.55 -9.55 Q14.0 -7.8 14.0 -5.8 14.0 -2.15 12.4 0.8 L11.0 1.2 9.95 1.4 0.0 2.2 -10.0 1.4 -12.35 0.8" fill="url(#gradient2)" fill-rule="evenodd" stroke="none"/>
    <path d="M-2.2 8.0 Q-4.55 7.65 -6.6 6.55 L-8.85 5.0 -9.9 4.05 -10.75 3.1 -12.15 1.1 -12.35 0.8 -10.0 1.4 0.0 2.2 9.95 1.4 11.0 1.2 12.4 0.8 12.2 1.1 11.0 2.85 9.9 4.05 7.05 6.3 Q5.1 7.45 2.85 7.85 L1.8 8.05 1.7 8.05 1.55 8.05 1.45 7.55 Q1.1 5.85 -0.05 5.85 -1.6 5.85 -2.1 7.75 L-2.2 8.0" fill="url(#gradient3)" fill-rule="evenodd" stroke="none"/>
    <path d="M-9.35 5.85 L-8.55 6.5 -8.25 6.5 -8.25 6.7 -7.15 7.4 -8.05 8.85 Q-9.6 11.15 -10.6 11.15 -11.75 11.15 -11.75 10.45 -11.75 9.85 -10.1 7.0 L-9.35 5.85 M-2.3 9.0 L-2.15 9.05 -2.05 8.05 -2.2 8.0 -2.1 7.75 Q-1.6 5.85 -0.05 5.85 1.1 5.85 1.45 7.55 L1.55 8.05 1.7 8.05 1.9 9.05 1.85 9.05 2.0 11.45 Q2.0 12.95 1.5 13.85 0.9 14.85 -0.15 14.85 -1.9 14.85 -2.25 12.35 L-2.3 10.0 -2.3 9.95 -2.3 9.0 M7.45 7.2 L9.2 5.95 10.1 5.25 11.0 6.65 11.15 6.85 Q11.85 8.1 11.85 9.3 11.85 10.75 11.0 11.0 L10.6 11.05 Q9.5 11.05 8.35 9.1 L7.45 7.2 M0.8 9.35 L0.75 9.1 0.7 8.75 0.55 8.15 Q0.2 7.0 -0.3 7.0 L-0.5 7.1 Q-0.8 7.25 -1.0 7.9 L-1.05 8.1 -1.2 8.85 -1.25 9.1 -1.4 11.3 -1.1 13.0 -0.8 13.7 -0.6 13.85 -0.35 13.9 0.1 13.85 0.1 13.8 0.25 13.75 Q0.85 13.45 0.95 12.7 L0.95 12.5 0.9 12.35 0.9 12.25 0.95 11.5 1.0 11.5 1.0 11.0 0.8 9.35" fill="#442c09" fill-rule="evenodd" stroke="none"/>
    <path d="M-1.0 7.9 Q-0.8 7.25 -0.5 7.1 L-0.3 7.0 Q0.2 7.0 0.55 8.15 L0.7 8.75 0.75 9.1 0.8 9.35 Q0.35 10.7 -0.35 10.7 -0.7 10.7 -0.9 9.9 L-1.05 8.75 -1.0 7.9" fill="#9c6711" fill-rule="evenodd" stroke="none"/>
    <path d="M3.1 -9.7 L3.85 -9.85 4.0 -8.95 4.0 -8.4 3.0 -7.5 2.75 -7.95 1.7 -7.85 1.7 -6.15 -0.1 -4.65 Q-0.25 -4.85 -0.6 -4.85 L-1.05 -4.75 2.25 -8.8 2.75 -9.35 3.1 -9.7 M-4.5 -8.2 L-4.5 -9.0 0.25 -9.45 -0.45 -8.55 -1.6 -7.2 -1.7 -7.5 Q-2.05 -7.9 -2.4 -7.9 L-3.1 -7.35 -3.3 -6.85 Q-3.3 -6.1 -2.5 -6.0 L-2.7 -5.8 -4.85 -2.95 -4.5 -8.2 M2.25 -4.05 L2.6 -4.05 2.65 -4.4 4.15 -5.75 4.4 -0.75 -2.15 -0.15 0.5 -2.55 2.25 -4.05 M-1.3 -4.45 L-1.3 -4.35 -0.95 -3.85 Q-2.15 -2.95 -2.55 -2.95 L-1.3 -4.45" fill="#a3b4bb" fill-rule="evenodd" stroke="none"/>
    <path d="M3.1 -9.7 L2.75 -9.35 2.25 -8.8 -1.05 -4.75 -1.25 -4.5 -1.3 -4.45 -2.55 -2.95 Q-2.15 -2.95 -0.95 -3.85 L-0.9 -3.85 -1.05 -3.7 -0.55 -3.65 Q0.0 -3.6 0.0 -4.05 L-0.1 -4.65 1.7 -6.15 1.6 -5.4 1.6 -4.65 Q1.7 -4.3 1.95 -4.15 L2.25 -4.05 0.5 -2.55 -2.15 -0.15 -5.0 -0.05 -4.85 -2.95 -2.7 -5.8 -2.5 -6.0 Q-2.15 -5.95 -1.85 -6.3 -1.5 -6.65 -1.5 -6.95 L-1.6 -7.2 -0.45 -8.55 0.25 -9.45 3.1 -9.7 M3.0 -7.5 L4.0 -8.4 4.15 -5.75 2.65 -4.4 3.0 -7.5 M0.0 -2.2 L0.25 -2.6 Q0.25 -3.05 -0.45 -3.05 L-1.25 -2.6 Q-1.25 -2.0 -0.45 -1.9 L0.0 -2.2 M-2.3 -3.8 Q-2.05 -3.95 -2.05 -4.2 -2.05 -4.75 -3.05 -4.75 L-3.45 -4.2 Q-3.45 -3.6 -2.85 -3.5 -2.55 -3.5 -2.3 -3.8 M-3.3 -2.45 L-3.25 -2.25 Q-3.2 -1.9 -2.7 -1.9 -2.05 -1.85 -2.05 -2.35 -2.05 -2.8 -2.7 -2.95 -3.3 -3.05 -3.3 -2.45" fill="#b1c6cd" fill-rule="evenodd" stroke="none"/>
    <path d="M1.7 -6.15 L1.7 -7.85 2.75 -7.95 3.0 -7.5 2.65 -4.4 2.6 -4.05 2.25 -4.05 1.95 -4.15 Q1.7 -4.3 1.6 -4.65 L1.6 -5.4 1.7 -6.15" fill="#442c09" fill-rule="evenodd" stroke="none"/>
    <path d="M4.0 -8.4 L4.0 -8.95 4.9 -9.0 5.25 -0.4 4.05 1.85 -3.25 1.85 -5.6 0.6 -5.25 -8.1 -4.5 -8.2 -4.85 -2.95 -5.0 -0.05 -3.05 1.0 3.7 0.8 4.4 -0.75 4.15 -5.75 4.0 -8.4" fill="#b5853f" fill-rule="evenodd" stroke="none"/>
    <path d="M-1.05 -4.75 L-0.6 -4.85 Q-0.25 -4.85 -0.1 -4.65 L0.0 -4.05 Q0.0 -3.6 -0.55 -3.65 L-1.05 -3.7 -0.9 -3.85 -0.95 -3.85 -1.3 -4.35 -1.3 -4.45 -1.25 -4.5 -1.05 -4.75 M-2.15 -0.15 L4.4 -0.75 3.7 0.8 -3.05 1.0 -5.0 -0.05 -2.15 -0.15 M0.0 -2.2 L-0.45 -1.9 Q-1.25 -2.0 -1.25 -2.6 L-0.45 -3.05 Q0.25 -3.05 0.25 -2.6 L0.0 -2.2 M-2.3 -3.8 Q-2.55 -3.5 -2.85 -3.5 -3.45 -3.6 -3.45 -4.2 L-3.05 -4.75 Q-2.05 -4.75 -2.05 -4.2 -2.05 -3.95 -2.3 -3.8 M-3.3 -2.45 Q-3.3 -3.05 -2.7 -2.95 -2.05 -2.8 -2.05 -2.35 -2.05 -1.85 -2.7 -1.9 -3.2 -1.9 -3.25 -2.25 L-3.3 -2.45" fill="#6c787b" fill-rule="evenodd" stroke="none"/>
    <path d="M-2.5 -6.0 Q-3.3 -6.1 -3.3 -6.85 L-3.1 -7.35 -2.4 -7.9 Q-2.05 -7.9 -1.7 -7.5 L-1.6 -7.2 -1.5 -6.95 Q-1.5 -6.65 -1.85 -6.3 -2.15 -5.95 -2.5 -6.0" fill="#8a3131" fill-rule="evenodd" stroke="none"/>
  </g>
  <defs>
    <radialGradient cx="0" cy="0" fx="-915.2" fy="0" gradientTransform="matrix(0.0076, 0.0159, -0.0148, 0.0101, -1.0, -3.6)" gradientUnits="userSpaceOnUse" id="gradient0" r="819.2" spreadMethod="pad">
      <stop offset="0.06666666666666667" stop-color="#f9b0b0"/>
      <stop offset="0.3333333333333333" stop-color="#ed251a"/>
      <stop offset="0.6313725490196078" stop-color="#ed1a1a"/>
      <stop offset="0.8705882352941177" stop-color="#b53f3f"/>
      <stop offset="1.0" stop-color="#ed6a6a"/>
    </radialGradient>
    <linearGradient gradientTransform="matrix(-0.0084, -0.0175, 0.0165, -0.0079, -0.45, -6.7)" gradientUnits="userSpaceOnUse" id="gradient1" spreadMethod="pad" x1="-819.2" x2="819.2">
      <stop offset="0.0" stop-color="#7a4f0e"/>
      <stop offset="1.0" stop-color="#442c09"/>
    </linearGradient>
    <radialGradient cx="0" cy="0" fx="-1100.8" fy="0" gradientTransform="matrix(0.0093, 0.0162, -0.0162, 0.0093, -1.15, -6.75)" gradientUnits="userSpaceOnUse" id="gradient2" r="819.2" spreadMethod="pad">
      <stop offset="0.14901960784313725" stop-color="#f9eab0"/>
      <stop offset="0.2196078431372549" stop-color="#f2e05c"/>
      <stop offset="0.3333333333333333" stop-color="#edc51a"/>
      <stop offset="0.6313725490196078" stop-color="#ed9d1a"/>
      <stop offset="0.8705882352941177" stop-color="#b5853f"/>
      <stop offset="1.0" stop-color="#edbb6a"/>
    </radialGradient>
    <radialGradient cx="0" cy="0" fx="-1100.8" fy="0" gradientTransform="matrix(0.0093, 0.0162, -0.0162, 0.0093, -1.15, -6.75)" gradientUnits="userSpaceOnUse" id="gradient3" r="819.2" spreadMethod="pad">
      <stop offset="0.14901960784313725" stop-color="#f9eab0"/>
      <stop offset="0.2196078431372549" stop-color="#f2e05c"/>
      <stop offset="0.3333333333333333" stop-color="#edc51a"/>
      <stop offset="0.6313725490196078" stop-color="#ed9d1a"/>
      <stop offset="0.8705882352941177" stop-color="#442c09"/>
      <stop offset="1.0" stop-color="#6c460c"/>
    </radialGradient>
  </defs>
</svg>
