<?xml version="1.0" encoding="UTF-8" standalone="no"?>
<svg xmlns:xlink="http://www.w3.org/1999/xlink" height="93.05px" width="119.3px" xmlns="http://www.w3.org/2000/svg">
  <g transform="matrix(1.0, 0.0, 0.0, 1.0, 43.15, 71.65)">
    <path d="M58.6 -63.2 L58.95 -62.7 59.0 -62.3 59.1 -61.85 59.1 -61.8 59.5 -59.7 59.5 -59.65 Q59.55 -59.1 59.75 -58.5 L60.3 -55.9 60.2 -56.85 Q60.2 -58.0 60.6 -58.25 L62.05 -59.9 62.85 -60.75 62.9 -60.8 66.55 -64.8 70.65 -70.6 71.1 -71.25 71.7 -71.6 72.4 -71.5 72.85 -70.9 72.75 -70.2 72.55 -69.7 72.55 -69.65 72.1 -68.5 72.1 -68.45 71.65 -67.1 Q70.9 -64.65 70.5 -61.8 L70.5 -61.75 70.2 -59.1 69.65 -53.2 69.5 -52.8 69.3 -52.5 69.05 -52.3 Q68.1 -51.6 67.05 -51.4 L65.3 -48.0 65.3 -48.05 65.0 -47.45 68.4 -35.9 68.5 -35.65 76.1 -9.65 76.05 -8.9 75.45 -8.45 74.1 -8.05 73.7 -7.95 73.65 -7.8 Q73.4 -7.55 73.05 -7.45 L70.85 -6.9 67.15 -5.6 62.85 -4.05 58.0 -2.35 57.95 -2.35 56.05 -1.7 53.65 -0.75 53.6 -0.7 48.75 0.9 Q45.8 1.8 44.1 2.65 L41.55 3.75 41.5 3.8 41.0 4.1 40.0 4.65 39.5 4.75 39.25 4.75 38.95 4.95 38.7 5.05 38.3 5.2 37.7 5.75 37.6 6.15 37.6 6.2 37.1 6.65 Q35.35 7.3 34.35 7.85 L34.3 7.85 33.6 8.25 33.0 8.65 Q31.75 9.4 30.6 10.1 L30.05 10.4 28.6 11.2 28.4 11.3 27.9 11.5 27.85 11.55 27.5 11.7 27.35 11.8 24.65 12.95 24.3 13.0 24.0 13.05 18.4 13.5 18.3 13.5 18.0 13.5 16.75 13.65 16.7 13.65 15.6 13.75 15.55 13.75 13.1 13.9 10.35 14.05 6.4 14.2 6.3 14.2 5.3 14.2 4.0 14.2 3.95 14.2 3.15 14.15 3.1 14.35 2.7 14.85 2.15 15.15 1.85 15.3 1.25 15.5 0.5 15.55 -0.15 15.5 -0.35 15.4 -0.55 15.3 -1.35 14.7 -2.75 20.65 -3.15 21.25 -3.85 21.4 -14.25 20.05 -14.85 19.85 -15.2 19.35 -15.15 18.7 -13.45 14.3 -14.95 13.8 -15.0 13.8 -15.25 13.6 -16.0 13.0 -16.3 12.4 -16.35 11.65 -37.05 5.6 -37.45 5.45 -37.7 5.1 -38.0 4.5 -38.3 3.9 -38.3 3.85 -39.05 2.25 -39.5 1.3 -39.5 1.25 -39.75 0.7 -39.85 0.5 -40.7 -1.55 Q-41.25 -3.1 -40.9 -3.45 L-41.9 -6.4 -42.15 -6.55 -42.3 -6.7 -42.35 -6.7 -42.6 -7.0 -42.85 -7.25 Q-43.2 -7.65 -43.15 -8.0 L-43.1 -8.35 -43.05 -8.5 -42.2 -11.0 -42.2 -10.95 -42.1 -11.25 -42.1 -11.3 -42.0 -11.65 -41.6 -13.05 -41.6 -13.1 -41.35 -13.7 -40.8 -14.05 -40.15 -14.0 -39.7 -13.55 -39.55 -13.3 -39.5 -13.25 -39.35 -13.0 -38.75 -11.9 -38.7 -11.85 -38.3 -11.1 -38.25 -11.05 -37.8 -12.4 -37.8 -12.45 -37.8 -12.4 -37.45 -13.45 -37.4 -13.5 -36.5 -16.3 -36.5 -16.25 -35.65 -18.6 -35.9 -18.8 -36.2 -19.35 -37.45 -27.8 -37.5 -27.85 -38.0 -28.35 -38.0 -28.4 -38.1 -28.5 -38.3 -28.85 -38.35 -28.85 -38.45 -29.0 -38.7 -29.55 -38.7 -29.6 -38.9 -29.95 -38.85 -30.75 -38.75 -30.95 -37.15 -36.35 -37.0 -37.1 -36.85 -37.45 -36.75 -37.85 -35.85 -41.6 -35.5 -42.2 -34.85 -42.45 -34.2 -42.2 -33.85 -41.65 -33.75 -41.2 -33.7 -41.1 -33.7 -40.95 -33.65 -40.85 -33.6 -40.75 -33.55 -40.65 -32.7 -37.9 -32.65 -37.85 -32.15 -36.3 -32.15 -36.25 -30.9 -32.6 -30.65 -33.4 -30.65 -33.35 -30.15 -34.85 -29.8 -35.75 -29.85 -35.7 -29.15 -37.6 -29.15 -37.7 -29.2 -37.75 -29.2 -37.85 -29.3 -37.95 -29.5 -38.2 -29.6 -38.35 -29.65 -38.5 -29.8 -38.85 -30.05 -39.25 -30.1 -39.35 -30.2 -40.0 -30.15 -40.3 -30.05 -40.6 -30.05 -40.55 -29.0 -45.35 -28.85 -46.0 -28.8 -46.2 -28.8 -46.4 -28.75 -46.6 Q-28.2 -49.0 -28.15 -49.85 L-27.85 -50.5 -27.25 -50.8 -26.55 -50.6 -26.15 -50.05 -26.05 -49.7 -26.0 -49.5 -25.95 -49.2 -25.9 -49.1 -25.35 -46.6 -25.4 -46.65 -25.0 -45.3 -22.75 -45.45 -21.45 -45.5 -21.0 -46.25 -20.75 -46.65 -20.35 -46.8 -20.25 -46.85 -19.9 -46.95 -19.55 -46.9 Q-18.9 -46.8 -18.75 -46.25 L-18.7 -46.1 -17.4 -47.3 Q-17.1 -47.85 -16.45 -47.8 L-15.85 -47.65 -15.65 -47.5 -13.6 -45.85 -12.4 -45.95 -12.35 -45.95 -12.15 -45.95 -11.85 -45.95 -11.4 -45.95 -9.75 -46.05 -9.7 -46.05 -9.45 -46.05 -8.3 -46.85 -6.05 -48.35 -6.0 -48.4 -5.65 -48.7 -5.45 -48.8 -5.35 -48.9 -5.45 -48.8 -3.5 -50.1 -3.4 -50.2 -3.25 -50.25 -3.2 -50.3 -2.75 -50.55 -2.7 -50.55 -1.7 -51.25 -0.8 -51.8 -0.75 -51.85 -0.35 -52.1 -0.6 -52.85 -1.55 -53.6 -1.75 -54.25 -1.75 -54.7 -1.95 -57.3 -1.9 -57.2 -2.1 -58.9 -2.2 -59.35 -2.7 -62.55 -2.7 -62.6 -2.75 -62.9 -2.65 -63.6 -2.15 -64.1 -1.4 -64.05 -0.9 -63.6 -0.75 -63.4 -0.65 -63.3 1.9 -59.95 1.95 -59.9 2.1 -59.75 2.75 -58.9 2.8 -58.85 3.15 -58.4 3.2 -58.35 4.45 -56.9 4.5 -56.85 4.7 -56.65 5.0 -55.95 4.75 -54.55 4.7 -54.5 4.3 -53.9 4.05 -53.65 3.95 -53.5 4.3 -53.55 4.4 -53.55 7.2 -53.95 9.95 -54.3 11.25 -54.5 11.3 -54.5 12.15 -54.55 13.75 -54.8 15.9 -55.05 15.85 -55.0 18.35 -55.35 18.25 -55.35 21.0 -55.7 23.25 -55.95 25.5 -56.25 25.6 -56.25 25.65 -56.25 27.85 -56.5 29.45 -56.7 30.45 -56.8 30.5 -56.8 31.0 -56.85 31.2 -57.6 31.0 -57.95 30.95 -58.0 30.65 -58.75 Q30.5 -58.95 30.5 -59.25 L30.4 -60.05 30.6 -60.6 30.9 -60.95 30.9 -61.0 32.05 -62.8 32.75 -63.95 32.75 -64.0 35.3 -68.75 35.75 -69.2 36.45 -69.25 37.0 -68.85 37.15 -68.2 Q37.0 -66.1 37.25 -63.2 L37.65 -59.5 37.7 -59.2 37.75 -58.85 37.7 -58.35 37.45 -57.95 37.35 -57.8 37.15 -57.55 36.4 -57.0 36.35 -56.95 35.9 -56.65 35.6 -55.9 47.0 -50.55 53.8 -50.55 53.8 -51.95 53.6 -52.2 53.15 -52.7 53.05 -52.9 52.85 -53.5 52.8 -53.65 52.8 -54.3 53.1 -54.85 55.15 -58.9 55.15 -58.85 55.4 -59.4 55.6 -59.7 55.7 -59.85 55.7 -59.95 56.9 -62.5 57.05 -62.9 57.5 -63.3 58.05 -63.45 58.6 -63.2 M60.65 -53.85 L60.85 -54.35 60.8 -54.4 60.85 -54.35 60.35 -55.65 60.65 -54.1 60.65 -53.85 M59.3 -51.7 L59.4 -51.8 59.3 -51.7 M-29.75 -38.7 L-29.75 -38.75 -29.8 -38.8 -29.75 -38.7 M-37.45 -27.8 L-37.3 -27.65 -37.4 -27.8 -37.45 -27.8 M-30.45 -28.95 L-30.65 -28.7 -30.55 -28.65 -30.4 -29.0 -30.35 -29.2 -30.4 -29.2 -30.4 -29.0 -30.45 -28.95 M-30.85 -28.15 L-31.0 -28.25 -31.05 -27.9 -31.3 -27.65 -31.3 -27.55 -31.05 -27.9 -30.85 -28.15 M-31.4 -26.45 L-31.4 -26.3 -31.35 -26.55 -31.4 -26.55 -31.4 -26.45" fill="#ffffff" fill-rule="evenodd" stroke="none"/>
  </g>
</svg>
