<?xml version="1.0" encoding="UTF-8" standalone="no"?>
<svg xmlns:xlink="http://www.w3.org/1999/xlink" height="6.15px" width="32.9px" xmlns="http://www.w3.org/2000/svg">
  <g transform="matrix(1.0, 0.0, 0.0, 1.0, 18.6, 23.9)">
    <path d="M-7.3 -22.9 L-9.8 -20.85 Q-0.05 -17.95 13.3 -19.9" fill="none" stroke="#361a0e" stroke-linecap="round" stroke-linejoin="round" stroke-width="2.0">
      <animate attributeName="stroke" dur="2s" repeatCount="indefinite" values="#361a0e;#361a0f"/>
      <animate attributeName="stroke-width" dur="2s" repeatCount="indefinite" values="2.0;2.0"/>
      <animate attributeName="fill-opacity" dur="2s" repeatCount="indefinite" values="1.0;1.0"/>
      <animate attributeName="d" dur="2s" repeatCount="indefinite" values="M-7.3 -22.9 L-9.8 -20.85 Q-0.05 -17.95 13.3 -19.9;M-14.95 -22.9 L-17.6 -20.75 Q-13.95 -19.75 -10.3 -18.75"/>
    </path>
  </g>
</svg>
