<?xml version="1.0" encoding="UTF-8" standalone="no"?>
<svg xmlns:xlink="http://www.w3.org/1999/xlink" height="325.25px" width="170.25px" xmlns="http://www.w3.org/2000/svg">
  <g transform="matrix(1.0, 0.0, 0.0, 1.0, 17.75, 31.2)">
    <path d="M15.05 203.65 L18.75 204.25 20.3 204.5 21.0 205.8 Q21.25 207.3 19.8 215.45 L17.85 224.6 16.55 230.0 Q15.95 232.15 14.4 233.6 13.45 234.4 12.15 234.95 L13.3 221.05 13.55 217.25 Q14.1 210.35 15.05 203.65 M-12.15 228.05 L-13.85 225.2 -13.2 218.25 Q-12.75 212.25 -12.0 208.8 -10.85 203.05 -9.5 202.25 L-8.5 202.1 -8.7 203.55 -5.3 203.35 -7.05 217.1 -7.55 221.6 -8.45 231.8 -8.65 231.6 Q-10.8 229.9 -12.15 228.05" fill="#dce5e6" fill-rule="evenodd" stroke="none"/>
    <path d="M15.05 203.65 Q14.1 210.35 13.55 217.25 L13.3 221.05 12.15 234.95 9.2 235.8 9.1 235.85 8.15 235.95 8.95 224.65 9.05 223.85 Q9.95 215.6 12.05 203.4 L15.05 203.65 M-5.3 203.35 L3.85 203.1 1.85 222.9 1.7 224.4 0.9 235.75 -1.4 235.35 Q-4.9 234.6 -8.45 231.8 L-7.55 221.6 -7.05 217.1 -5.3 203.35" fill="#d2dadb" fill-rule="evenodd" stroke="none"/>
    <path d="M3.85 203.1 L6.15 203.1 12.05 203.4 Q9.95 215.6 9.05 223.85 L8.95 224.65 8.15 235.95 0.9 235.75 1.7 224.4 1.85 222.9 3.85 203.1" fill="#c8d0d1" fill-rule="evenodd" stroke="none"/>
    <path d="M12.15 234.95 Q13.45 234.4 14.4 233.6 L13.85 238.35 8.65 239.4 3.0 240.0 Q-2.95 238.8 -7.4 236.3 L-9.1 235.3 Q-11.25 233.9 -12.7 232.2 L-12.15 228.05 Q-10.8 229.9 -8.65 231.6 L-8.45 231.8 Q-4.9 234.6 -1.4 235.35 L0.9 235.75 8.15 235.95 9.1 235.85 9.2 235.8 12.15 234.95" fill="#8ca4a8" fill-rule="evenodd" stroke="none"/>
    <path d="M5.35 283.05 L-4.7 285.0 -12.6 286.6 Q-12.9 272.75 -10.85 258.4 -8.9 246.5 -8.5 242.35 -8.15 237.8 -9.1 235.3 L-7.4 236.3 Q-2.95 238.8 3.0 240.0 L8.65 239.4 Q5.5 266.1 5.35 283.05" fill="#96aeb3" fill-rule="evenodd" stroke="none"/>
    <path d="M13.85 238.35 Q12.1 255.9 11.7 281.9 L5.35 283.05 Q5.5 266.1 8.65 239.4 L13.85 238.35 M-12.6 286.6 L-17.3 287.55 Q-17.55 273.5 -15.25 252.15 L-12.7 232.2 Q-11.25 233.9 -9.1 235.3 -8.15 237.8 -8.5 242.35 -8.9 246.5 -10.85 258.4 -12.9 272.75 -12.6 286.6" fill="#a0bbbf" fill-rule="evenodd" stroke="none"/>
    <path d="M1.0 161.25 Q1.4 161.05 1.9 160.95 L6.1 161.05 Q7.5 161.75 9.1 164.15 L9.2 164.35 9.8 165.25 Q11.05 167.35 11.2 168.8 L11.2 169.8 9.35 169.65 Q8.15 169.05 6.5 165.85 4.95 162.7 3.05 161.75 2.3 161.4 1.7 161.35 L1.0 161.25 M10.2 164.4 L10.85 164.5 12.8 164.85 Q14.8 165.8 15.95 168.8 16.75 171.05 16.45 172.9 L16.15 174.05 Q15.65 174.75 14.75 174.85 13.85 174.95 12.8 174.45 11.75 173.9 11.85 172.15 L12.2 169.7 Q12.35 168.0 11.5 166.45 L10.2 164.4 M8.65 180.85 L8.4 182.05 Q7.85 183.1 6.4 183.15 L3.2 183.05 Q-1.35 182.95 -3.35 187.0 -5.0 190.2 -2.15 193.4 -0.8 195.1 3.3 197.9 L4.85 199.0 Q10.1 202.65 11.85 204.7 14.3 207.6 13.3 210.65 11.25 212.25 7.45 212.45 2.8 212.6 -1.2 210.6 L-2.6 209.65 Q-4.0 208.45 -5.5 206.2 -7.65 203.05 -9.4 202.05 L-9.45 201.95 -9.5 201.85 -13.55 196.9 Q-14.5 193.5 -14.75 191.4 L-15.85 187.35 Q-16.5 185.35 -15.9 183.5 L-13.4 175.45 -10.8 168.1 Q-8.7 166.2 -6.85 165.6 -3.3 164.4 3.15 167.65 L5.85 169.25 5.6 169.9 5.4 170.0 5.5 170.05 Q4.95 170.9 3.85 170.6 L3.65 170.55 3.2 170.4 2.25 170.0 1.3 169.6 1.2 169.55 1.05 169.5 -0.1 169.4 -0.4 169.35 -0.95 169.45 -0.95 169.35 -3.95 169.9 Q-6.8 170.65 -7.45 171.85 -8.4 173.75 -9.0 178.45 L-9.3 181.5 -9.05 181.4 -9.35 182.25 -9.8 184.75 -9.85 185.3 -9.9 185.85 -9.95 186.3 -9.35 184.55 -9.15 184.1 -8.95 184.15 -6.4 181.0 Q-4.7 179.5 -2.4 178.65 L-2.45 178.7 Q-2.0 179.85 -0.9 180.4 0.6 181.15 3.9 181.6 7.9 182.2 8.65 180.85 M8.35 188.5 Q8.65 187.2 9.3 185.85 10.75 183.0 13.35 181.5 16.4 179.75 19.4 181.25 22.2 182.65 23.05 186.35 23.9 190.35 21.8 194.6 L21.35 195.5 Q20.65 196.85 19.95 197.6 22.4 193.6 21.75 189.2 21.4 186.2 19.65 184.4 19.75 185.65 19.45 186.55 L18.95 187.55 18.85 187.6 Q18.1 186.5 17.25 186.1 L16.55 186.75 16.55 186.8 16.55 187.7 16.6 187.9 16.55 188.55 15.7 190.85 15.15 191.8 Q14.55 192.95 13.95 193.5 L13.0 194.15 Q11.65 194.7 10.0 193.9 L9.65 193.7 Q8.6 193.0 8.3 191.8 8.1 191.05 8.15 190.15 L8.35 188.5 M15.8 181.6 L15.4 182.05 14.4 183.3 17.85 185.5 18.75 185.45 Q19.0 184.95 18.9 183.8 L18.9 183.4 Q18.75 181.8 18.15 181.5 L16.85 181.45 16.15 181.55 15.8 181.6 M15.65 187.55 L15.9 185.9 15.5 185.65 Q14.25 185.05 13.0 185.1 11.25 185.15 10.5 186.6 9.85 187.95 9.8 189.5 9.85 191.45 11.25 192.15 12.25 192.65 13.3 191.8 L15.0 189.45 15.65 187.55 M17.8 196.35 L18.45 196.85 19.4 197.95 19.65 198.4 19.85 198.75 19.1 201.4 Q18.2 203.25 16.75 203.85 15.15 204.55 13.1 203.5 11.7 202.8 10.5 201.1 9.2 199.2 9.85 197.9 10.5 196.6 13.45 196.1 15.5 195.75 16.85 196.05 L17.8 196.35" fill="#c9a182" fill-rule="evenodd" stroke="none"/>
    <path d="M9.2 164.35 L10.2 164.4 11.5 166.45 Q12.35 168.0 12.2 169.7 L11.85 172.15 Q11.75 173.9 12.8 174.45 13.85 174.95 14.75 174.85 15.65 174.75 16.15 174.05 L16.0 174.45 Q15.65 175.15 13.5 175.55 L10.55 175.45 Q9.7 175.0 9.25 173.1 L8.9 171.25 Q10.5 171.35 11.1 170.1 L11.2 169.8 11.2 168.8 Q11.05 167.35 9.8 165.25 L9.2 164.35 M2.25 170.0 L3.2 170.4 2.65 170.8 Q2.0 171.5 1.6 172.3 1.05 173.4 0.85 174.8 L0.8 175.25 -0.1 175.3 Q0.25 173.05 0.8 171.95 L1.95 170.35 2.25 170.0 M-0.95 169.45 L-0.4 169.35 -0.1 169.4 1.05 169.5 -1.1 171.15 -2.45 173.4 Q-3.3 175.15 -3.45 176.5 L-4.3 177.15 -4.0 175.3 Q-3.8 174.3 -3.05 172.85 L-1.65 170.4 -0.95 169.45" fill="#a8876d" fill-rule="evenodd" stroke="none"/>
    <path d="M2.85 175.6 Q3.85 175.85 4.9 176.4 6.6 177.2 7.75 178.75 L8.45 180.1 8.65 180.85 Q7.9 182.2 3.9 181.6 0.6 181.15 -0.9 180.4 -2.0 179.85 -2.45 178.7 L-2.4 178.65 Q-4.7 179.5 -6.4 181.0 L-8.95 184.15 -9.15 184.1 Q-8.4 182.25 -7.45 180.8 -6.3 178.85 -4.75 177.5 L-4.3 177.15 -3.45 176.5 Q-2.4 175.85 -1.35 175.55 L-0.1 175.3 0.8 175.25 2.85 175.6 M-13.55 196.9 L-15.55 194.1 Q-18.1 190.1 -17.7 187.15 L-17.55 186.4 -17.45 185.1 -17.05 179.7 Q-16.6 176.9 -14.95 173.5 L-13.3 170.6 Q-11.75 167.95 -10.0 166.1 L-8.75 164.85 Q-4.85 161.3 -0.75 162.1 0.3 162.4 1.4 162.95 L4.75 165.05 Q6.7 166.95 5.85 169.25 L3.15 167.65 Q-3.3 164.4 -6.85 165.6 -8.7 166.2 -10.8 168.1 L-13.4 175.45 -15.9 183.5 Q-16.5 185.35 -15.85 187.35 L-14.75 191.4 Q-14.5 193.5 -13.55 196.9 M15.8 181.6 L16.15 181.55 16.85 181.45 18.15 181.5 Q18.75 181.8 18.9 183.4 L18.9 183.8 Q19.0 184.95 18.75 185.45 L17.85 185.5 14.4 183.3 15.4 182.05 15.8 181.6 M15.65 187.55 L15.0 189.45 13.3 191.8 Q12.25 192.65 11.25 192.15 9.85 191.45 9.8 189.5 9.85 187.95 10.5 186.6 11.25 185.15 13.0 185.1 14.25 185.05 15.5 185.65 L15.9 185.9 15.65 187.55" fill="#dbb08e" fill-rule="evenodd" stroke="none"/>
    <path d="M8.9 171.25 L7.0 170.8 Q4.7 171.7 3.65 173.85 L2.85 175.6 0.8 175.25 0.85 174.8 Q1.05 173.4 1.6 172.3 2.0 171.5 2.65 170.8 L3.2 170.4 3.65 170.55 3.85 170.6 Q4.95 170.9 5.5 170.05 L5.6 169.9 5.85 169.25 Q6.7 166.95 4.75 165.05 L1.4 162.95 Q0.3 162.4 -0.75 162.1 0.0 161.6 1.0 161.25 L1.7 161.35 Q2.3 161.4 3.05 161.75 4.95 162.7 6.5 165.85 8.15 169.05 9.35 169.65 L11.2 169.8 11.1 170.1 Q10.5 171.35 8.9 171.25 M3.2 183.05 Q4.2 185.7 5.95 187.0 L8.35 188.5 8.15 190.15 Q8.1 191.05 8.3 191.8 8.6 193.0 9.65 193.7 L10.0 193.9 Q10.5 195.1 11.1 195.4 L13.15 195.3 14.35 194.8 14.9 194.35 Q16.1 192.95 18.75 194.4 L18.0 193.1 Q16.85 190.75 16.6 188.5 L16.55 188.55 16.6 187.9 16.55 187.7 16.55 186.8 16.55 186.75 17.25 186.1 Q18.1 186.5 18.85 187.6 L18.95 187.55 19.45 186.55 Q19.75 185.65 19.65 184.4 21.4 186.2 21.75 189.2 22.4 193.6 19.95 197.6 20.65 196.85 21.35 195.5 L21.1 198.15 20.75 201.3 Q20.3 205.15 19.3 207.15 17.7 210.35 13.45 213.45 12.8 213.9 12.3 214.3 L10.5 214.6 9.1 214.75 Q2.85 215.45 -1.25 213.4 -2.35 212.85 -3.55 211.55 -6.1 208.85 -8.95 202.8 L-9.4 202.05 Q-7.65 203.05 -5.5 206.2 -4.0 208.45 -2.6 209.65 L-1.2 210.6 Q2.8 212.6 7.45 212.45 11.25 212.25 13.3 210.65 14.3 207.6 11.85 204.7 10.1 202.65 4.85 199.0 L3.3 197.9 Q-0.8 195.1 -2.15 193.4 -5.0 190.2 -3.35 187.0 -1.35 182.95 3.2 183.05 M1.05 169.5 L1.2 169.55 1.3 169.6 2.25 170.0 1.95 170.35 0.8 171.95 Q0.25 173.05 -0.1 175.3 L-1.35 175.55 Q-2.4 175.85 -3.45 176.5 -3.3 175.15 -2.45 173.4 L-1.1 171.15 1.05 169.5 M-9.15 184.1 L-9.35 184.55 -9.95 186.3 -9.9 185.85 -9.85 185.3 -9.8 184.75 -9.35 182.25 -9.05 181.4 -9.3 181.5 -9.0 178.45 Q-8.4 173.75 -7.45 171.85 -6.8 170.65 -3.95 169.9 L-0.95 169.35 -0.95 169.45 -1.65 170.4 -3.05 172.85 Q-3.8 174.3 -4.0 175.3 L-4.3 177.15 -4.75 177.5 Q-6.3 178.85 -7.45 180.8 -8.4 182.25 -9.15 184.1 M17.8 196.35 L16.85 196.05 Q15.5 195.75 13.45 196.1 10.5 196.6 9.85 197.9 9.2 199.2 10.5 201.1 11.7 202.8 13.1 203.5 15.15 204.55 16.75 203.85 18.2 203.25 19.1 201.4 L19.85 198.75 19.65 198.4 19.4 197.95 18.45 196.85 17.8 196.35" fill="#b59175" fill-rule="evenodd" stroke="none"/>
    <path d="M10.0 193.9 Q11.65 194.7 13.0 194.15 L13.95 193.5 Q14.55 192.95 15.15 191.8 L15.7 190.85 16.55 188.55 16.6 188.5 Q16.85 190.75 18.0 193.1 L18.75 194.4 Q16.1 192.95 14.9 194.35 L14.35 194.8 13.15 195.3 11.1 195.4 Q10.5 195.1 10.0 193.9" fill="#ab896f" fill-rule="evenodd" stroke="none"/>
    <path d="M-9.4 202.05 L-9.5 201.85" fill="none" stroke="#00ff00" stroke-linecap="butt" stroke-linejoin="miter" stroke-miterlimit="3.0" stroke-width="0.05"/>
    <path d="M40.6 151.6 Q39.9 150.45 39.9 149.15 39.85 147.3 43.7 145.45 L43.85 145.4 45.2 144.8 Q47.6 143.85 48.95 144.15 L49.6 144.0 57.8 142.95 58.8 142.95 65.3 142.4 66.9 142.25 73.0 142.1 Q73.2 141.7 76.05 141.55 L79.5 141.75 82.65 142.25 84.2 142.65 88.2 143.65 Q90.4 144.3 91.5 145.4 L90.3 146.45 89.3 147.2 81.3 146.5 Q68.55 146.5 53.95 148.75 44.3 150.25 40.6 151.6 M73.0 142.1 L73.05 142.15 73.95 142.15 73.0 142.1" fill="#7a7f80" fill-rule="evenodd" stroke="none"/>
    <path d="M58.8 142.95 L57.8 142.95 49.6 144.0 48.95 144.15 Q47.6 143.85 45.2 144.8 L43.85 145.4 43.7 145.45 Q39.85 147.3 39.9 149.15 39.9 150.45 40.6 151.6 41.2 152.55 42.35 153.4 L44.35 154.6 44.4 154.65 44.05 154.9 41.75 156.95 40.9 156.2 39.7 155.1 37.35 152.7 Q35.5 150.55 34.15 147.75 L34.05 146.85 34.05 146.7 34.1 146.7 Q35.35 145.65 38.65 144.6 41.75 143.5 46.8 142.25 L48.4 141.85 Q57.05 139.85 64.0 139.1 L59.65 142.25 58.8 142.95" fill="#b2b9ba" fill-rule="evenodd" stroke="none"/>
    <path d="M58.8 142.95 L59.65 142.25 64.0 139.1 71.8 138.6 Q78.25 138.6 83.85 139.65 L81.15 140.9 Q80.25 141.35 79.5 141.75 L76.05 141.55 Q73.2 141.7 73.0 142.1 L66.9 142.25 65.3 142.4 58.8 142.95 M41.75 156.95 L44.05 154.9 44.4 154.65 44.55 154.7 Q46.8 155.8 49.6 156.7 L55.9 158.5 Q54.55 159.3 54.6 159.8 L57.6 160.1 56.15 184.7 Q55.4 198.05 55.15 208.05 L52.75 208.15 52.9 206.5 53.45 197.75 Q54.2 186.35 54.15 184.4 53.95 179.55 54.35 171.25 L54.55 161.0 51.5 160.3 49.05 159.65 45.4 158.55 42.95 157.85 42.6 157.65 41.75 156.95" fill="#abb2b3" fill-rule="evenodd" stroke="none"/>
    <path d="M73.0 142.1 L73.95 142.15 73.05 142.15 73.0 142.1 M96.55 145.2 L96.7 145.3 96.7 145.35 96.55 145.2" fill="#c4cbcc" fill-rule="evenodd" stroke="none"/>
    <path d="M39.7 155.1 L40.9 156.2 41.75 156.95 42.6 157.65 39.85 182.85 Q38.85 190.3 39.0 195.95 L39.25 198.4 39.55 202.45 39.85 205.2 Q39.15 205.0 38.45 204.6 L38.4 204.65 38.2 204.5 38.1 204.4 37.65 204.05 35.1 201.85 35.05 201.8 Q32.75 199.65 31.75 197.45 L36.0 170.95 36.1 168.55 36.45 167.3 38.5 160.0 39.25 156.95 39.7 155.1 M96.7 145.3 L96.85 145.5 96.75 146.45 96.0 150.95 95.45 153.15 93.45 161.6 Q92.95 164.1 91.3 168.45 91.3 162.15 91.6 156.55 L92.15 150.4 92.3 148.7 92.3 148.65 96.7 145.35 96.7 145.3 M76.9 156.75 L77.0 156.7 77.0 156.9 76.9 156.75 M66.7 161.0 L67.05 160.8 66.85 161.0 66.7 161.0" fill="#f2fbfc" fill-rule="evenodd" stroke="none"/>
    <path d="M34.15 147.75 Q35.5 150.55 37.35 152.7 L39.7 155.1 39.25 156.95 38.5 160.0 36.45 167.3 36.1 168.55 35.75 162.5 34.15 147.75" fill="#ffffff" fill-rule="evenodd" stroke="none"/>
    <path d="M85.25 149.75 Q83.15 150.95 80.5 152.15 L76.75 153.85 75.4 154.4 Q70.8 156.25 66.15 157.6 L66.1 157.65 65.1 157.65 64.4 157.65 57.85 157.4 Q56.85 157.9 56.15 158.35 L55.9 158.5 49.6 156.7 Q46.8 155.8 44.55 154.7 46.9 153.8 49.35 153.05 61.0 149.5 76.25 149.5 L85.25 149.75" fill="#5f6263" fill-rule="evenodd" stroke="none"/>
    <path d="M89.3 147.2 L90.3 146.45 91.5 145.4 Q90.4 144.3 88.2 143.65 L84.2 142.65 82.65 142.25 79.5 141.75 Q80.25 141.35 81.15 140.9 L83.85 139.65 87.1 140.35 Q90.35 141.2 92.7 142.25 L92.9 142.35 Q95.2 143.5 96.4 144.9 L96.55 145.2 96.7 145.35 92.3 148.65 92.25 148.65 91.05 149.55 Q90.9 149.5 90.1 149.95 L89.8 150.1 Q88.55 150.75 86.25 152.05 L83.0 153.85 78.1 156.25 77.0 156.7 76.9 156.75 76.8 156.8 73.05 158.35 73.8 157.05 75.4 154.4 76.75 153.85 80.5 152.15 Q83.15 150.95 85.25 149.75 L89.3 147.2" fill="#a1a7a8" fill-rule="evenodd" stroke="none"/>
    <path d="M73.05 158.35 L76.8 156.8 76.9 156.75 77.0 156.9 76.8 157.55 Q73.45 167.1 72.5 173.6 72.1 176.2 72.2 179.65 72.25 182.45 74.4 200.35 L74.65 202.2 Q74.65 203.8 74.1 206.15 L67.35 206.9 67.45 206.2 67.8 201.15 Q68.1 195.55 67.8 190.45 67.55 184.25 68.65 175.15 L70.5 162.45 70.95 159.2 73.05 158.35" fill="#b0b7b8" fill-rule="evenodd" stroke="none"/>
    <path d="M75.4 154.4 L73.8 157.05 73.05 158.35 70.95 159.2 67.05 160.8 66.7 161.0 65.2 160.85 64.1 160.7 65.15 159.05 65.9 158.0 66.15 157.6 Q70.8 156.25 75.4 154.4" fill="#9aa0a1" fill-rule="evenodd" stroke="none"/>
    <path d="M77.0 156.7 L78.1 156.25 83.0 153.85 78.05 172.95 77.25 176.05 Q76.15 180.1 76.15 180.5 L77.55 185.1 Q78.9 189.45 78.95 191.15 79.0 192.9 78.25 199.95 L77.8 203.65 77.95 205.6 75.65 205.95 74.1 206.15 Q74.65 203.8 74.65 202.2 L74.4 200.35 Q72.25 182.45 72.2 179.65 72.1 176.2 72.5 173.6 73.45 167.1 76.8 157.55 L77.0 156.9 77.0 156.7 M70.95 159.2 L70.5 162.45 68.65 175.15 Q67.55 184.25 67.8 190.45 68.1 195.55 67.8 201.15 L67.45 206.2 67.35 206.9 64.65 207.2 60.85 207.6 60.9 207.05 61.05 202.2 61.05 201.8 60.1 197.65 59.15 193.4 62.5 181.0 Q63.1 178.55 64.2 170.2 L65.15 161.55 66.7 161.0 66.85 161.0 67.05 160.8 70.95 159.2" fill="#bfc6c7" fill-rule="evenodd" stroke="none"/>
    <path d="M48.55 206.3 L49.25 202.25 50.35 196.05 50.3 194.15 48.1 194.15 Q48.2 193.65 47.3 186.55 L46.3 178.0 Q46.25 176.05 48.35 169.75 L51.5 160.3 54.55 161.0 54.35 171.25 Q53.95 179.55 54.15 184.4 54.2 186.35 53.45 197.75 L52.9 206.5 48.55 206.3 M83.0 153.85 L86.25 152.05 Q88.55 150.75 89.8 150.1 L90.1 149.95 90.05 150.1 Q86.85 162.2 84.4 167.8 83.1 170.75 81.7 176.3 80.95 179.3 80.15 183.05 L82.4 181.4 82.9 192.8 82.0 204.15 Q80.05 205.1 77.95 205.6 L77.8 203.65 78.25 199.95 Q79.0 192.9 78.95 191.15 78.9 189.45 77.55 185.1 L76.15 180.5 Q76.15 180.1 77.25 176.05 L78.05 172.95 83.0 153.85 M64.1 160.7 L65.2 160.85 66.7 161.0 65.15 161.55 64.2 170.2 Q63.1 178.55 62.5 181.0 L59.15 193.4 60.1 197.65 61.05 201.8 61.05 202.2 60.9 207.05 60.85 207.6 55.15 208.05 Q55.4 198.05 56.15 184.7 L57.6 160.1 64.1 160.7" fill="#cbd3d4" fill-rule="evenodd" stroke="none"/>
    <path d="M66.15 157.6 L65.9 158.0 65.15 159.05 64.1 160.7 57.6 160.1 54.6 159.8 Q54.55 159.3 55.9 158.5 L56.15 158.35 Q56.85 157.9 57.85 157.4 L64.4 157.65 65.1 157.65 66.1 157.65 66.15 157.6" fill="#909596" fill-rule="evenodd" stroke="none"/>
    <path d="M91.3 168.45 L91.2 168.85 Q89.75 172.5 89.6 175.3 L89.55 176.3 Q89.45 179.9 89.9 187.0 90.35 194.3 90.25 197.4 L88.95 198.65 84.7 202.45 84.65 202.45 82.0 204.15 82.9 192.8 82.4 181.4 80.15 183.05 Q80.95 179.3 81.7 176.3 83.1 170.75 84.4 167.8 86.85 162.2 90.05 150.1 L90.1 149.95 Q90.9 149.5 91.05 149.55 L92.25 148.65 92.3 148.65 92.3 148.7 92.15 150.4 91.6 156.55 Q91.3 162.15 91.3 168.45 M39.85 205.2 L39.55 202.45 39.25 198.4 39.0 195.95 Q38.85 190.3 39.85 182.85 L42.6 157.65 42.95 157.85 45.4 158.55 49.05 159.65 51.5 160.3 48.35 169.75 Q46.25 176.05 46.3 178.0 L47.3 186.55 Q48.2 193.65 48.1 194.15 L50.3 194.15 50.35 196.05 49.25 202.25 48.55 206.3 45.1 205.85 40.3 205.3 39.85 205.2" fill="#dce5e6" fill-rule="evenodd" stroke="none"/>
    <path d="M44.4 154.65 L44.35 154.6 42.35 153.4 Q41.2 152.55 40.6 151.6 44.3 150.25 53.95 148.75 68.55 146.5 81.3 146.5 L89.3 147.2 85.25 149.75 76.25 149.5 Q61.0 149.5 49.35 153.05 46.9 153.8 44.55 154.7 L44.4 154.65" fill="#6e7273" fill-rule="evenodd" stroke="none"/>
    <path d="M89.1 204.45 Q89.4 214.85 90.8 226.15 L91.55 232.2 Q93.0 242.35 95.1 253.15 99.0 272.65 104.05 286.15 L93.2 286.15 91.2 276.15 Q88.5 262.05 87.75 254.0 86.95 244.7 86.25 233.45 L86.15 232.2 85.8 226.15 85.6 219.95 Q85.5 214.15 84.95 210.25 L84.45 206.7 89.1 204.45 M26.2 286.15 L6.8 286.15 17.05 257.15 18.5 256.3 25.8 252.5 Q27.65 251.5 28.55 249.5 L36.3 232.2 38.65 226.15 39.35 223.6 41.75 213.25 42.05 211.65 44.25 212.0 40.95 226.15 39.4 232.2 28.65 275.45 26.2 286.15" fill="#adcbcf" fill-rule="evenodd" stroke="none"/>
    <path d="M93.2 286.15 L79.0 286.15 78.55 273.3 Q78.2 257.35 78.9 245.0 L79.4 232.2 79.5 226.15 79.45 223.75 Q79.25 216.15 78.7 212.0 L78.2 209.15 78.25 209.15 Q81.35 208.1 84.45 206.7 L84.95 210.25 Q85.5 214.15 85.6 219.95 L85.8 226.15 86.15 232.2 86.25 233.45 Q86.95 244.7 87.75 254.0 88.5 262.05 91.2 276.15 L93.2 286.15 M51.85 286.15 L26.2 286.15 28.65 275.45 39.4 232.2 40.95 226.15 44.25 212.0 45.7 212.15 53.05 212.8 53.1 212.8 55.15 212.85 57.65 212.8 57.65 213.45 Q57.9 217.9 57.25 226.15 L56.6 231.9 56.55 232.2 Q53.9 257.85 52.9 270.35 L51.85 286.15" fill="#a0bbbf" fill-rule="evenodd" stroke="none"/>
    <path d="M88.95 198.65 L88.95 201.45 89.1 204.45 84.45 206.7 Q81.35 208.1 78.25 209.15 L78.2 209.0 78.2 209.15 77.8 209.3 71.4 211.1 71.35 211.9 71.4 219.55 71.35 226.15 70.9 232.2 69.9 242.15 Q68.2 255.95 68.35 262.1 68.4 265.4 70.2 276.9 L71.65 286.15 65.9 286.15 65.6 277.9 Q65.35 266.1 66.05 247.85 L66.7 232.2 67.0 226.15 67.4 211.85 57.65 212.8 55.15 212.85 53.1 212.8 53.05 212.8 45.7 212.15 44.25 212.0 42.05 211.65 38.9 211.0 37.05 210.25 33.3 207.85 35.05 201.85 35.1 201.85 37.65 204.05 38.1 204.4 38.2 204.5 38.4 204.65 38.45 204.6 Q39.15 205.0 39.85 205.2 L40.3 205.3 45.1 205.85 48.55 206.3 52.9 206.5 52.75 208.15 55.15 208.05 60.85 207.6 64.65 207.2 67.35 206.9 74.1 206.15 75.65 205.95 77.95 205.6 Q80.05 205.1 82.0 204.15 L84.65 202.45 84.7 202.45 88.95 198.65" fill="#8ca4a8" fill-rule="evenodd" stroke="none"/>
    <path d="M79.0 286.15 L71.65 286.15 70.2 276.9 Q68.4 265.4 68.35 262.1 68.2 255.95 69.9 242.15 L70.9 232.2 71.35 226.15 71.4 219.55 71.35 211.9 71.4 211.1 77.8 209.3 78.2 209.15 78.2 209.0 78.25 209.15 78.2 209.15 78.7 212.0 Q79.25 216.15 79.45 223.75 L79.5 226.15 79.4 232.2 78.9 245.0 Q78.2 257.35 78.55 273.3 L79.0 286.15 M65.9 286.15 L51.85 286.15 52.9 270.35 Q53.9 257.85 56.55 232.2 L56.6 231.9 57.25 226.15 Q57.9 217.9 57.65 213.45 L57.65 212.8 67.4 211.85 67.0 226.15 66.7 232.2 66.05 247.85 Q65.35 266.1 65.6 277.9 L65.9 286.15 M35.05 201.85 L35.05 201.8 35.1 201.85 35.05 201.85" fill="#97b1b5" fill-rule="evenodd" stroke="none"/>
    <path d="M17.05 257.15 Q19.55 249.7 21.75 243.7 28.85 237.65 29.15 236.75 L31.35 232.2 32.35 230.2 34.25 226.15 36.2 221.05 Q37.6 216.85 38.6 212.15 L38.9 211.0 42.05 211.65 41.75 213.25 39.35 223.6 38.65 226.15 36.3 232.2 28.55 249.5 Q27.65 251.5 25.8 252.5 L18.5 256.3 17.05 257.15" fill="#bbdbe0" fill-rule="evenodd" stroke="none"/>
    <path d="M21.75 243.7 L22.55 241.2 25.6 232.2 27.65 226.15 33.3 207.85 37.05 210.25 38.9 211.0 38.6 212.15 Q37.6 216.85 36.2 221.05 L34.25 226.15 32.35 230.2 31.35 232.2 29.15 236.75 Q28.85 237.65 21.75 243.7" fill="#c2e3e8" fill-rule="evenodd" stroke="none"/>
    <path d="M92.8 104.9 Q91.65 103.3 91.65 102.95 91.6 102.15 92.85 100.15 94.85 96.95 99.9 90.75 108.25 80.65 108.2 79.2 L106.6 74.9 105.0 70.85 Q105.0 69.75 108.6 64.75 112.6 59.25 115.3 58.2 115.3 56.75 114.5 55.9 L114.85 55.55 Q115.55 55.55 117.15 54.75 118.55 53.9 119.4 54.0 118.2 52.45 114.25 44.35 L114.25 43.75 117.55 43.25 119.95 43.0 120.1 43.0 119.95 42.95 Q121.8 39.85 125.6 36.85 134.15 49.05 134.55 65.05 134.75 74.9 131.8 82.1 129.1 88.8 122.85 95.05 118.05 99.9 108.0 107.4 L107.9 107.45 106.25 108.65 105.55 109.15 102.9 111.1 102.45 111.75 Q99.4 114.45 96.8 117.25 93.4 121.05 90.9 124.95 L88.1 129.95 84.95 133.3 84.3 134.1 Q81.0 137.85 74.8 142.2 71.8 144.25 69.25 145.45 66.4 146.85 64.05 147.15 L55.1 147.7 Q52.05 147.7 49.45 146.2 L48.2 145.45 46.5 144.05 Q44.6 140.95 41.5 138.7 L43.7 138.95 46.15 139.25 53.4 139.7 Q68.25 139.7 78.15 133.3 L81.15 131.1 Q87.25 126.15 92.15 117.25 L96.0 109.4 94.75 107.7 92.8 104.9 M81.4 146.6 L81.35 146.85 81.2 146.9 81.15 146.85 81.4 146.6" fill="#b59175" fill-rule="evenodd" stroke="none"/>
    <path d="M77.45 27.7 Q72.35 28.8 66.35 30.7 53.15 34.95 47.55 34.95 39.6 34.95 31.25 28.95 L31.05 28.75 28.45 26.75 29.25 22.55 29.45 22.45 Q31.1 21.7 32.9 21.0 33.5 20.7 34.15 20.45 38.4 18.9 43.4 17.35 59.3 12.65 75.2 12.65 94.25 12.65 108.35 21.0 111.35 22.8 114.15 25.0 L114.4 25.1 117.75 28.0 Q122.25 32.15 125.6 36.85 121.8 39.85 119.95 42.95 L120.1 43.0 119.95 43.0 117.55 43.25 114.25 43.75 114.25 44.35 Q118.2 52.45 119.4 54.0 118.55 53.9 117.15 54.75 115.55 55.55 114.85 55.55 L114.5 55.9 Q115.3 56.75 115.3 58.2 112.6 59.25 108.6 64.75 105.0 69.75 105.0 70.85 L106.6 74.9 108.2 79.2 Q108.25 80.65 99.9 90.75 94.85 96.95 92.85 100.15 L92.4 97.85 Q91.85 96.2 90.8 95.1 L90.55 94.8 Q89.65 94.0 88.35 93.5 L87.45 93.15 87.1 93.4 85.05 94.8 83.4 95.9 83.15 95.85 Q81.1 96.95 78.85 97.45 78.85 97.25 79.0 97.2 L79.15 97.15 Q81.3 95.45 83.6 92.2 L85.95 88.6 87.35 86.1 86.85 86.1 79.7 88.9 78.5 89.35 79.8 87.6 79.65 87.45 77.8 87.3 68.3 88.05 Q64.3 88.75 60.15 90.6 L60.15 90.65 60.85 90.9 60.3 90.85 59.25 90.8 56.2 90.55 57.25 92.2 Q61.1 98.1 63.95 100.3 L63.7 100.25 Q62.0 99.65 60.25 98.6 L56.4 95.75 Q52.3 92.1 49.15 86.6 L51.2 85.75 Q52.75 85.2 53.35 84.4 52.35 84.0 52.1 82.75 51.95 82.3 51.95 80.7 51.9 78.8 53.15 76.35 L55.1 72.65 51.85 72.0 Q49.85 71.3 50.8 69.65 L51.6 69.5 60.3 67.75 62.5 67.25 Q70.0 65.6 74.45 65.6 78.9 65.6 86.3 68.5 93.8 71.35 97.35 71.35 L100.8 70.9 103.8 70.3 103.75 69.0 100.65 65.1 Q102.25 64.65 103.9 63.75 106.1 62.6 107.7 61.1 L108.3 59.8 Q112.5 51.45 112.4 46.95 112.35 43.8 108.7 37.65 105.75 32.6 103.6 30.8 L104.35 30.2 101.0 28.7 Q94.95 26.45 87.9 26.45 83.4 26.45 77.45 27.7 M-6.7 114.75 L-5.0 117.25 Q-2.25 120.65 2.3 123.1 6.9 125.5 14.5 127.2 L27.8 129.85 28.35 129.9 41.9 130.75 Q55.9 130.75 65.6 129.0 L68.85 128.35 Q77.85 126.0 84.7 120.2 L86.5 118.5 87.45 117.25 Q89.55 114.35 90.9 111.05 92.3 107.85 92.8 104.9 L94.75 107.7 96.0 109.4 92.15 117.25 Q87.25 126.15 81.15 131.1 L78.15 133.3 Q68.25 139.7 53.4 139.7 L46.15 139.25 43.7 138.95 41.5 138.7 38.9 137.05 38.5 136.85 38.35 136.75 38.45 136.6 37.5 136.25 37.3 136.15 36.55 135.9 31.15 134.15 31.1 134.1 29.7 133.75 28.95 133.6 25.85 132.95 25.45 132.85 22.65 132.2 9.85 128.35 Q3.6 126.25 -0.6 123.5 L-1.7 122.75 Q-4.5 120.4 -5.85 117.25 L-6.7 114.75 M40.4 70.0 Q39.0 70.9 34.85 72.8 36.9 74.9 37.0 80.1 37.15 85.9 34.15 89.95 31.05 94.1 25.0 95.75 27.0 94.45 30.85 90.45 L30.85 90.15 29.65 90.45 Q27.3 90.45 23.6 88.8 21.6 87.85 20.75 87.1 L20.2 86.6 20.1 86.0 19.8 86.0 19.9 89.35 19.8 89.25 17.9 83.65 Q16.55 79.05 16.45 75.15 16.45 74.1 17.1 72.55 L17.6 71.35 Q17.9 71.05 18.35 70.75 19.8 69.7 22.65 68.45 28.1 66.05 31.8 66.05 34.35 66.05 37.0 67.3 39.6 68.5 40.4 70.0 M76.85 99.55 L75.45 100.25 75.4 100.05 76.85 99.55" fill="#c9a182" fill-rule="evenodd" stroke="none"/>
    <path d="M77.45 27.7 Q84.15 27.9 91.75 30.1 97.45 31.7 100.1 33.8 102.25 35.5 102.3 37.6 102.45 44.4 97.7 49.5 93.9 53.5 87.3 56.15 84.8 57.2 73.55 60.2 L70.35 61.05 Q63.95 61.2 59.25 63.3 56.3 63.05 51.6 61.2 46.5 59.2 45.1 59.2 43.85 59.2 40.5 61.1 37.1 62.95 35.65 62.95 31.7 62.95 25.0 60.4 20.05 58.5 16.15 58.05 L15.6 58.5 15.65 58.0 16.15 54.65 Q19.05 54.75 23.2 56.4 27.85 58.2 31.55 58.2 35.05 58.2 37.35 56.5 38.8 55.45 40.9 52.4 46.2 44.6 52.5 41.25 L49.9 47.15 Q47.75 51.85 47.75 53.3 47.9 60.35 59.85 60.35 62.2 60.35 64.7 58.65 L69.45 54.8 Q70.85 53.7 75.15 47.7 79.7 41.3 79.65 39.7 79.6 38.3 76.2 36.2 73.1 34.3 71.65 34.3 L57.8 36.5 45.3 38.6 43.8 38.7 Q43.0 38.7 40.05 37.05 L38.7 36.25 Q36.05 34.75 35.65 34.55 31.0 32.45 28.2 29.55 L28.45 26.75 31.05 28.75 31.25 28.95 Q39.6 34.95 47.55 34.95 53.15 34.95 66.35 30.7 72.35 28.8 77.45 27.7 M21.45 95.9 L23.0 97.05 25.3 97.9 27.35 98.15 27.5 98.15 27.45 98.1 27.4 98.1 27.45 97.95 32.45 99.35 31.65 100.8 Q30.1 103.25 28.3 104.55 29.15 105.85 30.9 107.2 32.5 108.4 33.1 109.9 34.0 109.1 36.65 107.45 39.85 105.5 40.8 105.5 41.3 105.5 43.0 106.5 44.7 107.5 45.05 107.5 47.05 107.5 51.95 104.3 L52.55 103.85 52.7 104.0 Q53.7 103.65 54.35 103.65 55.65 103.65 60.95 106.45 L66.35 109.45 66.45 109.3 61.15 104.2 61.9 103.0 62.75 101.7 Q65.0 102.55 67.2 102.55 70.0 102.55 79.4 99.15 L88.55 95.7 89.25 95.9 Q89.95 96.4 90.75 98.15 91.55 100.25 91.6 101.6 91.65 104.2 89.65 108.6 L87.2 113.65 85.25 115.15 83.2 117.25 Q81.35 118.9 79.1 120.15 L78.1 120.65 Q73.5 122.9 68.8 124.55 57.35 128.4 44.9 128.25 28.5 128.1 12.95 122.75 6.95 120.65 3.35 117.25 0.1 114.2 -1.15 110.1 -2.7 109.9 -4.1 108.95 -6.05 107.65 -6.1 105.6 L-6.05 104.9 -5.65 103.9 -3.9 100.7 -3.3 99.85 -3.35 100.9 Q-3.3 102.95 -2.8 104.25 -2.2 105.6 -1.2 105.6 3.9 105.6 11.85 101.25 L21.45 95.9 M79.7 88.9 L76.75 91.7 Q73.7 93.85 69.4 93.85 67.4 93.85 63.85 92.4 L62.45 91.8 60.95 91.1 61.1 90.9 60.85 90.9 60.15 90.65 60.15 90.6 Q64.3 88.75 68.3 88.05 L77.8 87.3 79.65 87.45 79.8 87.6 78.5 89.35 79.7 88.9 M48.0 48.95 L51.8 42.45 Q50.35 43.15 47.2 47.0 43.9 50.85 43.95 52.15 43.95 53.0 46.05 54.55 45.85 52.45 48.0 48.95 M26.65 91.2 L26.45 91.35 26.35 91.45 Q24.3 92.05 23.65 92.35 L22.55 92.35 21.3 88.8 23.75 89.4 Q26.2 90.1 26.65 91.2 M37.45 86.8 L37.4 86.9 37.2 86.95 37.35 86.75 37.45 86.8 M49.65 101.25 L49.7 101.25 49.8 101.4 49.65 101.25" fill="#edbe9a" fill-rule="evenodd" stroke="none"/>
    <path d="M45.3 38.6 L57.8 36.5 71.65 34.3 Q73.1 34.3 76.2 36.2 79.6 38.3 79.65 39.7 79.7 41.3 75.15 47.7 70.85 53.7 69.45 54.8 L64.7 58.65 Q62.2 60.35 59.85 60.35 47.9 60.35 47.75 53.3 47.75 51.85 49.9 47.15 L52.5 41.25 Q46.2 44.6 40.9 52.4 38.8 55.45 37.35 56.5 35.05 58.2 31.55 58.2 27.85 58.2 23.2 56.4 19.05 54.75 16.15 54.65 17.0 50.0 19.1 45.85 L19.65 46.15 Q22.75 47.35 32.6 49.0 35.15 48.7 38.15 46.3 40.75 44.05 45.3 38.6 M19.7 93.9 Q20.5 95.1 21.45 95.9 L11.85 101.25 Q3.9 105.6 -1.2 105.6 -2.2 105.6 -2.8 104.25 -3.3 102.95 -3.35 100.9 L-3.3 99.85 Q-2.3 98.4 -0.95 97.1 L0.4 95.95 2.7 94.75 1.25 97.0 1.3 98.4 4.45 98.7 8.05 98.95 Q10.15 98.95 19.7 93.9 M61.15 104.2 L56.5 99.85 56.85 99.85 58.55 99.4 Q60.7 100.9 62.75 101.7 L61.9 103.0 61.15 104.2" fill="#f7c8a5" fill-rule="evenodd" stroke="none"/>
    <path d="M15.6 58.5 L16.15 58.05 Q20.05 58.5 25.0 60.4 31.7 62.95 35.65 62.95 37.1 62.95 40.5 61.1 43.85 59.2 45.1 59.2 46.5 59.2 51.6 61.2 56.3 63.05 59.25 63.3 63.95 61.2 70.35 61.05 L73.55 60.2 Q84.8 57.2 87.3 56.15 93.9 53.5 97.7 49.5 102.45 44.4 102.3 37.6 102.25 35.5 100.1 33.8 97.45 31.7 91.75 30.1 84.15 27.9 77.45 27.7 83.4 26.45 87.9 26.45 94.95 26.45 101.0 28.7 L104.35 30.2 103.6 30.8 Q105.75 32.6 108.7 37.65 112.35 43.8 112.4 46.95 112.5 51.45 108.3 59.8 L107.7 61.1 Q106.1 62.6 103.9 63.75 102.25 64.65 100.65 65.1 L103.75 69.0 103.8 70.3 100.8 70.9 97.35 71.35 Q93.8 71.35 86.3 68.5 78.9 65.6 74.45 65.6 70.0 65.6 62.5 67.25 L60.3 67.75 51.6 69.5 50.8 69.65 Q49.85 71.3 51.85 72.0 L55.1 72.65 53.15 76.35 Q51.9 78.8 51.95 80.7 51.95 82.3 52.1 82.75 52.35 84.0 53.35 84.4 52.75 85.2 51.2 85.75 L49.15 86.6 Q52.3 92.1 56.4 95.75 L60.25 98.6 Q62.0 99.65 63.7 100.25 L63.95 100.3 Q61.1 98.1 57.25 92.2 L56.2 90.55 59.25 90.8 60.3 90.85 60.85 90.9 61.1 90.9 60.95 91.1 62.45 91.8 63.85 92.4 Q67.4 93.85 69.4 93.85 73.7 93.85 76.75 91.7 L79.7 88.9 86.85 86.1 87.35 86.1 85.95 88.6 83.6 92.2 Q81.3 95.45 79.15 97.15 L79.0 97.2 Q78.85 97.25 78.85 97.45 81.1 96.95 83.15 95.85 L83.4 95.9 85.05 94.8 87.1 93.4 87.45 93.15 88.35 93.5 Q89.65 94.0 90.55 94.8 L90.8 95.1 Q91.85 96.2 92.4 97.85 L92.85 100.15 Q91.6 102.15 91.65 102.95 91.65 103.3 92.8 104.9 92.3 107.85 90.9 111.05 89.55 114.35 87.45 117.25 L86.5 118.5 84.7 120.2 Q77.85 126.0 68.85 128.35 L65.6 129.0 Q55.9 130.75 41.9 130.75 L28.35 129.9 27.8 129.85 14.5 127.2 Q6.9 125.5 2.3 123.1 -2.25 120.65 -5.0 117.25 L-6.7 114.75 -6.95 113.45 -7.05 110.75 -6.95 109.3 Q-6.75 106.95 -6.05 104.9 L-6.1 105.6 Q-6.05 107.65 -4.1 108.95 -2.7 109.9 -1.15 110.1 0.1 114.2 3.35 117.25 6.95 120.65 12.95 122.75 28.5 128.1 44.9 128.25 57.35 128.4 68.8 124.55 73.5 122.9 78.1 120.65 L79.1 120.15 Q81.35 118.9 83.2 117.25 L85.25 115.15 87.2 113.65 89.65 108.6 Q91.65 104.2 91.6 101.6 91.55 100.25 90.75 98.15 89.95 96.4 89.25 95.9 L88.55 95.7 79.4 99.15 Q70.0 102.55 67.2 102.55 65.0 102.55 62.75 101.7 60.7 100.9 58.55 99.4 L57.85 98.85 Q53.05 95.1 52.7 95.1 L51.75 95.55 56.5 99.85 61.15 104.2 66.45 109.3 66.35 109.45 60.95 106.45 Q55.65 103.65 54.35 103.65 53.7 103.65 52.7 104.0 L52.55 103.85 51.95 104.3 Q47.05 107.5 45.05 107.5 44.7 107.5 43.0 106.5 41.3 105.5 40.8 105.5 39.85 105.5 36.65 107.45 34.0 109.1 33.1 109.9 32.5 108.4 30.9 107.2 29.15 105.85 28.3 104.55 30.1 103.25 31.65 100.8 L32.45 99.35 27.45 97.95 27.4 98.1 27.45 98.1 27.5 98.15 27.35 98.15 25.3 97.9 23.0 97.05 21.45 95.9 Q20.5 95.1 19.7 93.9 18.55 92.2 17.85 89.85 L17.55 89.1 17.05 86.45 15.85 85.15 16.05 83.25 16.15 82.9 16.15 82.8 16.1 82.45 15.95 76.65 15.85 74.55 15.5 62.3 15.6 58.5 M48.0 48.95 Q45.85 52.45 46.05 54.55 43.95 53.0 43.95 52.15 43.9 50.85 47.2 47.0 50.35 43.15 51.8 42.45 L48.0 48.95 M40.4 70.0 Q39.6 68.5 37.0 67.3 34.35 66.05 31.8 66.05 28.1 66.05 22.65 68.45 19.8 69.7 18.35 70.75 17.9 71.05 17.6 71.35 L17.1 72.55 Q16.45 74.1 16.45 75.15 16.55 79.05 17.9 83.65 L19.8 89.25 19.9 89.35 19.8 86.0 20.1 86.0 20.2 86.6 20.75 87.1 Q21.6 87.85 23.6 88.8 27.3 90.45 29.65 90.45 L30.85 90.15 30.85 90.45 Q27.0 94.45 25.0 95.75 31.05 94.1 34.15 89.95 37.15 85.9 37.0 80.1 36.9 74.9 34.85 72.8 39.0 70.9 40.4 70.0 M26.65 91.2 Q26.2 90.1 23.75 89.4 L21.3 88.8 22.55 92.35 23.65 92.35 Q24.3 92.05 26.35 91.45 L26.45 91.35 26.65 91.2 M37.45 86.8 L37.35 86.75 37.2 86.95 37.4 86.9 37.5 86.8 37.45 86.8 M76.85 99.55 L75.4 100.05 75.45 100.25 76.85 99.55 M49.65 101.25 L49.8 101.4 49.7 101.25 49.65 101.25 M46.05 101.5 L46.3 101.4 45.9 101.05 46.05 101.5 M32.15 105.4 L32.15 105.3 31.95 105.25 32.15 105.4 M36.2 105.4 L36.15 105.4 36.25 105.5 36.2 105.4" fill="#dbb08e" fill-rule="evenodd" stroke="none"/>
    <path d="M28.2 29.55 Q31.0 32.45 35.65 34.55 36.05 34.75 38.7 36.25 L36.1 39.7 Q35.05 40.95 32.55 40.95 29.05 40.95 23.15 39.3 L25.6 36.5 26.65 33.0 28.0 31.05 28.2 29.55 M15.85 85.15 L17.05 86.45 17.55 89.1 17.85 89.85 Q16.85 90.45 15.35 91.5 12.8 93.1 10.7 93.1 9.95 93.1 9.45 92.25 L8.95 91.15 Q12.75 88.5 15.85 85.15" fill="#ffd8ba" fill-rule="evenodd" stroke="none"/>
    <path d="M38.7 36.25 L40.05 37.05 Q43.0 38.7 43.8 38.7 L45.3 38.6 Q40.75 44.05 38.15 46.3 35.15 48.7 32.6 49.0 22.75 47.35 19.65 46.15 L19.1 45.85 Q20.7 42.4 23.15 39.3 29.05 40.95 32.55 40.95 35.05 40.95 36.1 39.7 L38.7 36.25 M17.85 89.85 Q18.55 92.2 19.7 93.9 10.15 98.95 8.05 98.95 L4.45 98.7 1.3 98.4 1.25 97.0 2.7 94.75 4.35 93.9 8.95 91.15 9.45 92.25 Q9.95 93.1 10.7 93.1 12.8 93.1 15.35 91.5 16.85 90.45 17.85 89.85 M56.5 99.85 L51.75 95.55 52.7 95.1 Q53.05 95.1 57.85 98.85 L58.55 99.4 56.85 99.85 56.5 99.85" fill="#ffd1ad" fill-rule="evenodd" stroke="none"/>
    <path d="M37.4 86.9 L37.45 86.8 37.5 86.8 37.4 86.9" fill="#ffe1c9" fill-rule="evenodd" stroke="none"/>
    <path d="M46.05 101.5 L45.9 101.05 46.3 101.4 46.05 101.5 M36.2 105.4 L36.25 105.5 36.15 105.4 36.2 105.4" fill="#b38f74" fill-rule="evenodd" stroke="none"/>
    <path d="M38.35 136.75 L37.45 136.3 37.5 136.25 38.45 136.6 38.35 136.75" fill="#ba8d71" fill-rule="evenodd" stroke="none"/>
    <path d="M88.1 129.95 L86.6 133.1 86.5 133.3 Q84.6 137.35 82.95 142.2 L81.4 146.6 81.15 146.85 Q78.0 149.5 75.15 150.95 72.4 152.3 69.6 153.3 L63.45 155.05 55.5 156.0 Q51.85 156.0 49.65 153.8 L49.2 153.3 Q49.15 151.45 48.75 149.75 48.15 146.6 46.5 144.05 L48.2 145.45 49.45 146.2 Q52.05 147.7 55.1 147.7 L64.05 147.15 Q66.4 146.85 69.25 145.45 71.8 144.25 74.8 142.2 81.0 137.85 84.3 134.1 L84.95 133.3 88.1 129.95" fill="#a8876d" fill-rule="evenodd" stroke="none"/>
    <path d="M81.2 146.9 L80.6 150.8 Q80.55 152.3 80.15 152.55 L76.8 153.8 75.45 154.3 Q73.7 154.95 73.3 155.15 L69.85 156.65 Q67.3 157.7 65.9 158.0 L64.95 158.1 Q59.55 158.1 57.85 157.25 56.35 158.8 55.65 158.8 L51.95 157.7 49.05 156.75 49.15 155.05 49.2 153.9 49.2 153.4 49.2 153.3 49.65 153.8 Q51.85 156.0 55.5 156.0 L63.45 155.05 69.6 153.3 Q72.4 152.3 75.15 150.95 78.0 149.5 81.15 146.85 L81.2 146.9" fill="#a18168" fill-rule="evenodd" stroke="none"/>
    <path d="M91.05 73.5 Q96.1 80.2 95.95 88.9 94.65 77.5 87.85 72.55 83.4 69.25 73.65 67.6 63.4 65.8 60.2 64.0 54.2 60.45 54.1 51.5 54.1 50.15 54.65 48.55 55.15 57.1 63.65 60.85 68.85 63.1 79.25 65.1 86.35 67.2 91.05 73.5" fill="#a17b2e" fill-rule="evenodd" stroke="none"/>
    <path d="M35.3 53.6 L35.6 55.95 Q35.65 60.75 32.6 63.75 30.5 65.7 25.7 67.65 19.9 70.05 18.35 71.0 15.35 72.9 14.25 75.6 L13.85 75.45 Q13.8 71.1 17.15 68.45 18.75 67.15 24.5 64.7 29.7 62.45 31.9 60.2 34.4 57.55 34.9 53.55 L35.3 53.6" fill="#a17b2e" fill-rule="evenodd" stroke="none"/>
    <path d="M57.55 83.55 L57.6 83.05 57.6 82.8 Q58.35 77.85 63.65 74.85 69.2 71.8 75.85 73.35 82.5 75.0 83.55 79.8 L83.65 80.45 83.65 80.55 81.0 80.45 67.95 81.35 67.7 81.35 64.35 81.85 Q59.4 82.55 57.55 83.55 M22.3 83.45 Q22.0 82.2 22.0 80.7 L22.25 79.15 Q23.15 75.0 25.75 73.35 27.95 72.0 29.85 73.3 L31.0 74.45 Q33.25 77.3 33.35 82.2 L33.35 82.75 31.75 81.9 Q30.3 81.15 28.7 80.7 28.45 80.5 28.2 80.45 L27.5 80.2 27.5 80.3 26.4 80.05 25.0 79.55 24.5 79.45 24.2 79.35 23.4 79.2 22.75 80.45 Q22.45 81.15 22.35 82.35 L22.4 83.35 22.3 83.45" fill="#b6c2c9" fill-rule="evenodd" stroke="none"/>
    <path d="M57.55 83.55 Q59.4 82.55 64.35 81.85 L67.7 81.35 67.95 81.35 81.0 80.45 83.65 80.55 Q83.45 83.35 81.15 85.05 L80.75 84.95 79.7 85.05 75.35 85.15 72.2 85.35 71.3 85.55 68.45 86.05 63.8 86.8 Q62.15 87.25 61.3 87.75 L60.2 87.25 Q58.9 86.65 58.3 85.95 L57.75 84.8 Q57.5 84.15 57.55 83.55 M22.3 83.45 L22.4 83.35 22.35 82.35 Q22.45 81.15 22.75 80.45 L23.4 79.2 24.2 79.35 24.5 79.45 25.0 79.55 26.4 80.05 27.5 80.3 27.5 80.2 28.2 80.45 Q28.45 80.5 28.7 80.7 30.3 81.15 31.75 81.9 L33.35 82.75 Q33.35 84.35 32.75 85.95 L32.35 86.7 Q31.8 86.4 30.95 86.2 L27.2 85.5 Q24.05 84.45 22.7 84.8 L22.3 83.45" fill="#cedbe3" fill-rule="evenodd" stroke="none"/>
    <path d="M81.8 108.75 Q82.75 109.0 83.8 109.55 85.5 110.4 86.2 111.35 L86.05 111.4 Q84.2 110.45 79.1 109.9 L71.15 109.4 65.05 109.5 53.95 111.5 46.75 113.25 Q34.05 115.85 22.4 117.2 L22.4 115.5 22.4 115.25 26.45 115.0 34.45 114.2 Q42.35 113.1 49.6 111.25 L54.2 109.9 54.15 109.85 54.2 109.85 64.7 107.4 61.5 106.9 58.0 106.2 64.55 105.6 65.9 105.8 68.7 106.5 69.35 106.7 71.05 107.3 71.35 107.4 71.45 107.45 Q73.6 108.3 77.1 108.9 L82.85 109.65 81.8 108.75 M13.95 122.4 Q8.8 121.95 6.35 120.05 L-1.25 112.0 Q1.0 111.05 9.7 107.9 L18.15 104.8 21.0 103.6 20.1 104.15 18.15 105.3 15.55 106.8 13.55 107.85 5.85 112.35 5.4 112.65 9.45 111.8 14.1 111.6 15.05 113.2 13.4 113.2 10.95 114.15 7.75 114.45 12.9 121.1 13.95 122.4 M5.25 112.75 L5.4 112.65 4.85 112.75 5.25 112.75" fill="#dbb08e" fill-rule="evenodd" stroke="none"/>
    <path d="M81.8 108.75 L82.85 109.65 77.1 108.9 Q73.6 108.3 71.45 107.45 L71.35 107.4 71.05 107.3 69.35 106.7 68.7 106.5 65.9 105.8 64.55 105.6 Q62.75 105.4 61.35 105.6 L65.5 105.3 69.05 105.2 69.8 105.2 Q76.7 105.35 80.95 108.15 L81.8 108.75 M18.85 122.65 Q20.4 124.0 21.85 126.05 L22.4 126.85 22.4 126.95 17.2 126.55 13.95 122.4 12.9 121.1 7.75 114.45 10.95 114.15 13.4 113.2 15.05 113.2 14.1 111.6 16.55 111.6 17.9 111.65 18.25 112.4 19.6 115.35 15.95 115.25 14.55 115.25 12.8 115.15 10.45 115.3 Q11.55 116.75 13.8 118.85 L15.05 119.95 15.65 120.45 18.5 122.55 18.85 122.65" fill="#c9a182" fill-rule="evenodd" stroke="none"/>
    <path d="M54.2 109.9 L49.6 111.25 Q42.35 113.1 34.45 114.2 L36.0 111.9 53.45 110.05 54.2 109.9" fill="#bab998" fill-rule="evenodd" stroke="none"/>
    <path d="M21.0 103.6 L21.3 103.55 21.3 103.65 Q21.45 107.55 21.75 109.8 L22.4 109.85 22.4 111.75 21.65 111.7 17.75 110.1 17.55 110.2 15.45 109.75 13.8 109.15 13.45 108.85 Q14.45 107.65 15.55 106.8 L18.15 105.3 20.1 104.15 21.0 103.6" fill="#ffd1ad" fill-rule="evenodd" stroke="none"/>
    <path d="M21.3 103.55 L21.4 103.4 22.4 102.9 22.4 103.0 Q23.5 102.4 25.2 101.7 29.75 105.15 33.85 112.0 L32.65 112.0 27.4 111.9 22.4 111.75 22.4 109.85 21.75 109.8 Q21.45 107.55 21.3 103.65 L21.3 103.55" fill="#f7c8a5" fill-rule="evenodd" stroke="none"/>
    <path d="M34.45 114.2 L26.45 115.0 26.8 113.8 27.4 111.9 32.65 112.0 33.85 112.0 33.95 112.0 36.0 111.9 34.45 114.2" fill="#c7c6a3" fill-rule="evenodd" stroke="none"/>
    <path d="M26.45 115.0 L22.4 115.25 22.4 115.5 19.95 115.4 19.6 115.35 18.25 112.4 17.9 111.65 21.65 111.7 22.4 111.75 27.4 111.9 26.8 113.8 26.45 115.0" fill="#d6d5af" fill-rule="evenodd" stroke="none"/>
    <path d="M22.4 115.5 L22.4 117.2 22.4 123.5 21.15 123.3 18.85 122.65 18.5 122.55 15.65 120.45 15.05 119.95 13.8 118.85 Q11.55 116.75 10.45 115.3 L12.8 115.15 14.55 115.25 15.95 115.25 19.6 115.35 19.95 115.4 22.4 115.5" fill="#edbe9a" fill-rule="evenodd" stroke="none"/>
    <path d="M15.55 106.8 Q14.45 107.65 13.45 108.85 L13.8 109.15 15.45 109.75 17.55 110.2 17.75 110.1 21.65 111.7 17.9 111.65 16.55 111.6 14.1 111.6 9.45 111.8 5.4 112.65 5.85 112.35 13.55 107.85 15.55 106.8" fill="#ffdfc7" fill-rule="evenodd" stroke="none"/>
    <path d="M32.8 79.75 L32.85 79.05 32.6 77.95 Q32.3 77.5 31.85 77.5 L31.3 77.95 Q30.95 78.4 30.95 79.05 L31.05 79.65 30.6 79.65 30.5 79.05 Q30.5 78.05 30.95 77.35 31.3 76.65 31.8 76.65 32.45 76.65 32.95 77.35 33.35 78.05 33.35 79.05 L33.3 79.75 32.8 79.75 M76.15 79.4 L76.2 78.75 Q76.2 78.05 75.75 77.55 75.35 77.05 74.9 77.05 74.35 77.05 74.05 77.55 73.65 78.05 73.65 78.75 L73.8 79.5 73.2 79.5 73.05 78.75 Q73.05 77.75 73.5 76.95 74.05 76.2 74.9 76.2 75.65 76.2 76.15 76.95 76.8 77.75 76.8 78.75 L76.8 79.35 76.15 79.4" fill="#45889e" fill-rule="evenodd" stroke="none"/>
    <path d="M31.05 79.65 L30.95 79.05 Q30.95 78.4 31.3 77.95 L31.85 77.5 Q32.3 77.5 32.6 77.95 L32.85 79.05 32.8 79.75 31.05 79.65 M73.8 79.5 L73.65 78.75 Q73.65 78.05 74.05 77.55 74.35 77.05 74.9 77.05 75.35 77.05 75.75 77.55 76.2 78.05 76.2 78.75 L76.15 79.4 73.8 79.5" fill="#0e3947" fill-rule="evenodd" stroke="none"/>
    <path d="M31.05 79.65 L32.8 79.75 32.65 80.15 31.9 80.65 31.35 80.15 31.05 79.65 M73.8 79.5 L76.15 79.4 75.8 79.95 Q75.45 80.45 75.0 80.45 74.45 80.45 74.1 79.95 L73.8 79.5" fill="#176071" fill-rule="evenodd" stroke="none"/>
    <path d="M32.8 79.75 L33.3 79.75 33.0 80.75 Q32.6 81.45 31.95 81.45 31.45 81.45 31.0 80.75 30.65 80.25 30.6 79.65 L31.05 79.65 31.35 80.15 31.9 80.65 32.65 80.15 32.8 79.75 M76.15 79.4 L76.8 79.35 76.25 80.55 Q75.75 81.3 75.0 81.3 74.15 81.3 73.6 80.55 73.25 80.1 73.2 79.5 L73.8 79.5 74.1 79.95 Q74.45 80.45 75.0 80.45 75.45 80.45 75.8 79.95 L76.15 79.4" fill="#269ab7" fill-rule="evenodd" stroke="none"/>
    <path d="M29.55 79.65 L30.4 79.65 30.6 79.65 Q30.65 80.25 31.0 80.75 31.45 81.45 31.95 81.45 32.6 81.45 33.0 80.75 L33.3 79.75 34.35 79.85 Q34.2 81.05 33.7 81.9 33.0 83.15 31.95 83.15 31.05 83.15 30.3 81.9 29.65 80.95 29.55 79.65 M76.8 79.35 L77.1 79.35 78.2 79.4 Q78.05 80.75 77.25 81.85 76.3 83.1 75.05 83.1 73.7 83.1 72.75 81.85 72.0 80.9 71.8 79.65 L73.2 79.5 Q73.25 80.1 73.6 80.55 74.15 81.3 75.0 81.3 75.75 81.3 76.25 80.55 L76.8 79.35" fill="#42bad7" fill-rule="evenodd" stroke="none"/>
    <path d="M33.3 79.75 L33.35 79.05 Q33.35 78.05 32.95 77.35 32.45 76.65 31.8 76.65 31.3 76.65 30.95 77.35 30.5 78.05 30.5 79.05 L30.6 79.65 30.4 79.65 29.55 79.65 29.5 79.05 Q29.5 77.35 30.15 76.15 30.85 75.0 31.75 75.0 32.8 75.0 33.55 76.15 34.35 77.35 34.35 79.05 L34.35 79.85 33.3 79.75 M76.8 79.35 L76.8 78.75 Q76.8 77.75 76.15 76.95 75.65 76.2 74.9 76.2 74.05 76.2 73.5 76.95 73.05 77.75 73.05 78.75 L73.2 79.5 71.8 79.65 71.7 78.75 Q71.65 76.95 72.6 75.65 73.5 74.45 74.85 74.45 76.1 74.45 77.1 75.65 78.1 76.95 78.15 78.75 L78.2 79.4 77.1 79.35 76.8 79.35" fill="#53a3bd" fill-rule="evenodd" stroke="none"/>
    <path d="M29.2 70.45 L32.95 70.95 34.0 71.45 34.05 71.4 36.75 72.75 33.5 73.0 32.1 73.05 34.1 76.65 34.7 79.3 34.75 81.45 34.45 83.4 34.2 84.7 33.85 86.5 33.3 87.2 34.3 88.2 34.9 88.75 34.1 89.2 Q33.1 88.4 31.6 87.75 29.25 86.65 25.55 85.85 L23.15 85.5 20.0 85.05 19.25 83.7 19.0 83.75 18.45 82.3 Q18.15 81.4 18.2 80.6 L18.45 79.3 Q18.95 77.75 20.25 75.8 L20.25 75.7 19.95 75.7 Q19.7 76.05 18.95 76.25 L17.9 76.4 17.8 76.2 Q19.2 73.85 21.55 72.4 23.25 71.4 25.85 70.7 L25.9 70.7 29.2 70.45 M25.75 73.4 Q23.1 75.0 22.2 79.15 L22.2 79.3 22.0 80.7 22.1 82.6 Q27.05 83.15 29.75 84.5 L32.5 86.45 32.75 85.95 Q33.35 84.35 33.35 82.75 L33.35 82.25 33.05 79.3 Q32.5 76.4 31.0 74.5 L29.85 73.35 Q27.95 72.05 25.75 73.4" fill="#8f725d" fill-rule="evenodd" stroke="none"/>
    <path d="M89.7 83.25 L87.55 85.0 85.0 86.45 82.05 86.05 80.0 85.85 78.45 85.7 Q72.95 85.7 67.15 86.8 L61.95 88.0 Q58.45 88.95 55.5 90.3 L54.2 90.15 54.1 89.8 53.9 89.15 53.6 88.5 53.5 88.25 54.95 88.0 56.4 87.45 55.6 85.4 55.0 83.95 54.6 82.2 Q54.55 79.5 56.5 77.35 57.85 75.75 61.85 73.25 L60.35 72.45 58.25 72.55 55.0 72.75 54.75 72.65 54.75 72.5 57.05 72.05 57.35 72.0 57.6 71.95 62.1 70.95 64.1 70.65 68.85 70.15 Q78.4 70.15 82.85 73.25 85.7 75.3 88.05 79.85 L89.7 83.25 M83.6 80.6 L83.6 80.45 83.55 79.8 Q82.45 75.0 75.85 73.4 69.2 71.8 63.65 74.9 58.4 77.85 57.6 82.85 L57.6 83.05 57.6 83.55 57.75 84.8 58.3 85.95 59.3 86.8 Q62.35 85.75 66.05 84.95 72.45 83.65 78.2 83.6 L78.45 83.6 82.55 83.7 Q83.5 82.35 83.6 80.6" fill="#8f725d" fill-rule="evenodd" stroke="none"/>
    <path d="M64.35 82.2 Q62.8 81.7 62.75 80.75 62.75 79.8 64.3 79.05 65.85 78.3 68.05 78.15 L71.85 78.6 Q73.45 79.15 73.45 80.1 73.5 81.05 71.9 81.75 70.4 82.5 68.2 82.6 L64.35 82.2" fill="#ffffff" fill-opacity="0.6627451" fill-rule="evenodd" stroke="none"/>
    <path d="M24.7 81.45 Q24.0 80.85 23.95 80.0 23.95 79.2 24.65 78.6 25.3 78.05 26.3 78.05 27.3 78.05 28.05 78.6 28.8 79.2 28.8 80.0 28.85 80.85 28.1 81.45 27.4 82.0 26.4 82.0 25.4 82.0 24.7 81.45" fill="#ffffff" fill-opacity="0.6627451" fill-rule="evenodd" stroke="none"/>
    <path d="M27.65 94.15 Q30.55 91.6 32.85 88.35 L33.4 87.7 35.3 84.4 Q36.1 83.25 37.95 81.25 L39.9 77.65 Q41.4 75.2 43.65 75.2 L45.45 75.6 44.65 80.6 44.55 81.05 44.2 82.65 43.2 86.65 Q42.35 89.65 40.95 91.35 L37.95 95.5 Q35.0 99.0 33.35 99.0 32.25 99.0 30.05 97.45 27.75 95.85 27.6 94.8 L27.65 94.15 M29.9 94.4 L30.3 95.15 Q30.95 95.55 31.85 95.55 32.8 95.55 33.75 94.8 34.6 93.95 34.55 93.3 34.3 91.4 31.95 92.1 29.65 92.8 29.9 94.4" fill="url(#gradient0)" fill-rule="evenodd" stroke="none"/>
    <path d="M52.75 97.65 L53.45 98.25 56.2 101.05 51.9 102.55 49.45 103.55 48.35 102.35 46.9 101.05 Q46.2 99.55 45.1 98.1 L41.7 99.4 42.4 100.75 42.85 101.1 Q41.1 101.7 39.0 102.65 L33.85 105.45 Q32.1 102.7 30.0 100.75 L29.3 101.7 28.7 102.35 Q25.6 100.05 23.85 97.85 L24.7 97.1 24.25 96.9 Q24.95 96.9 24.85 96.15 L25.65 95.65 25.95 95.9 28.3 97.8 Q32.2 100.85 33.65 100.85 34.65 100.85 38.2 98.0 41.6 95.15 42.95 95.15 44.45 95.15 46.6 97.4 48.8 99.6 49.75 99.6 50.15 99.6 51.95 98.25 L52.75 97.65" fill="#a6795e" fill-rule="evenodd" stroke="none"/>
    <path d="M45.45 75.6 L46.45 76.35 Q47.45 77.45 47.65 78.95 L47.65 80.45 46.7 84.45 45.0 92.05 Q45.25 93.95 47.95 95.35 L48.2 95.25 49.8 94.7 49.85 94.7 52.75 97.65 51.95 98.25 Q50.15 99.6 49.75 99.6 48.8 99.6 46.6 97.4 44.45 95.15 42.95 95.15 41.6 95.15 38.2 98.0 34.65 100.85 33.65 100.85 32.2 100.85 28.3 97.8 L25.95 95.9 25.65 95.65 27.65 94.15 27.6 94.8 Q27.75 95.85 30.05 97.45 32.25 99.0 33.35 99.0 35.0 99.0 37.95 95.5 L40.95 91.35 Q42.35 89.65 43.2 86.65 L44.2 82.65 44.55 81.05 44.65 80.6 45.45 75.6" fill="url(#gradient1)" fill-rule="evenodd" stroke="none"/>
    <path d="M29.9 94.4 Q29.65 92.8 31.95 92.1 34.3 91.4 34.55 93.3 34.6 93.95 33.75 94.8 32.8 95.55 31.85 95.55 30.95 95.55 30.3 95.15 L29.9 94.4" fill="#ffd1ad" fill-rule="evenodd" stroke="none"/>
    <path d="M46.9 101.05 L46.25 100.45 Q44.8 100.45 42.85 101.1 L42.4 100.75 41.7 99.4 45.1 98.1 Q46.2 99.55 46.9 101.05" fill="#7d5b47" fill-rule="evenodd" stroke="none"/>
    <path d="M25.6 6.25 Q26.45 3.25 27.8 -0.4 L29.9 -6.0 Q35.75 -20.75 40.05 -26.4 L47.0 -28.1 50.8 -28.95 Q58.1 -30.45 62.55 -30.95 L45.0 -25.35 Q40.6 -19.15 35.65 -11.15 30.25 -2.55 25.6 6.25 M76.6 7.25 Q86.8 7.95 96.1 11.7 L82.85 10.6 73.95 11.25 71.8 11.7 76.6 7.25 M43.0 -24.9 L43.0 -24.7 43.5 -24.85 43.0 -24.9" fill="#fef081" fill-rule="evenodd" stroke="none"/>
    <path d="M25.6 6.25 Q30.25 -2.55 35.65 -11.15 40.6 -19.15 45.0 -25.35 L62.55 -30.95 66.25 -31.2 Q73.65 -31.2 83.15 -28.4 L88.25 -26.65 83.6 -27.15 79.7 -27.5 72.9 -28.15 71.7 -28.2 Q65.55 -28.2 57.25 -26.35 50.3 -24.8 45.35 -22.75 39.1 -14.95 32.2 -1.5 25.35 11.75 24.5 18.15 23.75 16.95 23.7 16.1 23.65 12.75 25.6 6.25 M96.1 11.7 Q100.3 13.4 104.35 15.65 109.75 18.7 114.35 22.4 L114.25 22.45 Q106.7 18.0 104.7 17.25 100.9 15.65 96.9 14.45 L88.45 13.0 83.6 12.6 82.6 12.55 78.85 12.4 73.85 12.45 70.1 13.05 71.2 12.1 71.8 11.7 73.95 11.25 82.85 10.6 96.1 11.7 M19.7 34.45 Q18.6 33.25 18.6 32.05 18.55 29.95 23.6 24.95 L25.95 22.75 26.9 24.6 22.3 29.95 Q20.65 32.1 19.7 34.45 M43.0 -24.9 L43.5 -24.85 43.0 -24.7 43.0 -24.9" fill="#ffdc69" fill-rule="evenodd" stroke="none"/>
    <path d="M72.4 7.05 L75.05 7.2 69.9 11.45 65.9 14.7 Q59.9 14.15 54.35 10.35 L54.75 9.55 Q55.75 7.8 57.0 6.25 L57.6 5.35 57.45 5.35 65.5 -7.4 Q70.55 -14.8 75.55 -19.35 L75.7 -19.2 Q71.95 -15.75 65.95 -6.4 L62.2 -0.4 61.5 0.75 Q57.6 7.1 56.55 9.95 58.0 10.75 61.15 11.65 L65.85 12.65 66.25 12.35 72.4 7.05 M137.9 78.55 L136.05 79.9 135.6 79.5 135.2 79.2 135.2 79.15 Q132.75 77.3 129.7 77.3 125.55 77.3 123.1 79.05 L123.1 79.1 122.9 79.0 122.7 79.35 118.85 84.35 116.65 87.1 114.25 90.2 110.25 95.25 108.9 97.1 108.1 98.15 105.7 101.25 103.25 104.35 100.35 108.25 Q99.05 106.95 97.05 105.7 94.35 103.9 93.0 102.7 L94.6 100.85 94.95 100.4 96.6 102.05 98.55 103.5 Q100.4 103.5 105.3 97.25 L111.0 89.6 114.0 85.4 116.95 81.4 120.85 77.05 Q122.0 75.2 121.45 72.15 L122.55 73.7 123.8 75.25 127.15 74.15 131.0 73.2 Q132.25 73.2 137.9 78.55 M47.05 31.55 Q40.15 31.0 33.75 27.1 L33.1 26.7 31.4 25.55 31.05 25.25 30.6 24.8 30.45 24.65 29.1 23.4 27.25 21.6 Q25.35 19.6 24.5 18.15 25.35 11.75 32.2 -1.5 39.1 -14.95 45.35 -22.75 50.3 -24.8 57.25 -26.35 65.55 -28.2 71.7 -28.2 L71.75 -28.05 Q66.3 -27.4 56.65 -24.9 52.55 -23.85 48.65 -21.5 44.2 -18.85 41.6 -15.4 35.6 -7.3 33.15 -1.65 30.2 5.35 30.4 13.55 30.55 20.55 38.9 26.45 L47.05 31.55 M119.1 82.3 L118.85 81.9 118.85 82.0 119.1 82.3" fill="#c2a74f" fill-rule="evenodd" stroke="none"/>
    <path d="M88.25 -26.65 Q94.7 -24.0 94.8 -20.55 94.8 -18.85 92.7 -15.35 L93.1 -18.2 Q93.0 -21.5 90.45 -22.8 88.35 -23.85 83.9 -23.85 74.4 -23.85 69.65 -21.2 64.65 -18.5 58.55 -9.45 52.6 -0.8 49.85 4.35 45.55 12.25 45.0 17.45 44.9 18.35 44.95 19.2 L44.95 19.7 Q45.2 23.65 47.45 25.75 49.6 27.8 53.45 27.8 56.3 27.8 62.75 25.9 L71.35 23.15 80.5 20.9 Q84.8 19.95 88.8 19.85 L90.35 19.7 93.35 19.55 102.15 20.6 102.2 20.7 102.45 20.8 Q101.55 21.6 99.2 22.4 L95.8 23.4 95.55 23.7 109.8 27.15 Q118.35 29.95 124.75 35.3 121.95 37.0 119.6 36.6 121.4 37.6 126.75 41.95 129.85 44.25 132.25 44.95 137.45 56.35 138.45 70.65 L138.45 71.3 Q138.55 71.2 138.6 71.2 L138.8 71.85 138.95 72.95 142.6 71.1 Q144.65 70.1 146.75 70.1 147.4 70.1 148.65 70.7 L148.9 70.75 148.55 71.05 145.0 73.35 144.7 73.55 144.7 73.45 143.95 73.7 142.6 74.2 142.35 74.5 Q149.85 76.75 149.95 81.5 L149.6 83.1 147.95 83.35 Q145.75 83.35 142.5 81.05 140.25 79.45 138.75 77.85 L137.9 78.55 Q132.25 73.2 131.0 73.2 L127.15 74.15 123.8 75.25 122.55 73.7 121.45 72.15 Q122.0 75.2 120.85 77.05 L116.95 81.4 114.0 85.4 111.0 89.6 105.3 97.25 Q100.4 103.5 98.55 103.5 L96.6 102.05 94.95 100.4 96.15 98.9 96.45 98.8 96.2 98.8 Q99.1 94.55 105.65 85.85 L112.3 77.0 111.25 75.25 Q110.05 73.65 109.7 72.55 L108.45 70.25 Q107.45 68.35 107.45 67.55 107.4 66.45 111.8 62.1 113.8 60.1 116.35 57.85 L118.0 58.2 118.0 57.05 Q116.9 56.05 116.9 55.4 117.85 55.4 120.1 56.3 122.2 57.1 122.9 57.65 121.15 50.0 114.95 43.85 115.55 43.85 115.55 43.4 L118.25 43.4 121.55 43.85 Q118.7 41.45 116.5 38.4 L118.55 38.4 115.35 35.95 112.45 34.0 119.1 34.0 Q114.75 30.45 106.2 27.8 97.85 25.3 87.6 24.2 L87.6 24.15 Q89.6 23.35 92.8 22.4 96.35 21.35 96.85 21.4 L96.8 20.8 77.15 24.0 Q70.7 25.3 64.95 28.0 55.6 32.25 47.05 31.55 L38.9 26.45 Q30.55 20.55 30.4 13.55 30.2 5.35 33.15 -1.65 35.6 -7.3 41.6 -15.4 44.2 -18.85 48.65 -21.5 52.55 -23.85 56.65 -24.9 66.3 -27.4 71.75 -28.05 L71.8 -28.05 71.7 -28.2 72.9 -28.15 79.7 -27.5 83.6 -27.15 88.25 -26.65 M87.3 -7.95 Q84.5 -4.45 80.4 -0.4 L72.4 7.05 66.25 12.35 65.85 12.65 61.15 11.65 Q58.0 10.75 56.55 9.95 57.6 7.1 61.5 0.75 L62.2 -0.4 65.95 -6.4 Q71.95 -15.75 75.7 -19.2 L77.95 -20.95 Q78.75 -21.35 79.4 -21.35 81.0 -21.35 82.75 -19.7 84.45 -18.1 84.45 -16.7 84.55 -14.05 76.75 -5.65 L71.6 -0.4 66.95 4.35 Q67.9 2.1 70.0 -0.35 L74.05 -4.8 Q75.5 -6.5 77.6 -9.7 L80.8 -14.6 78.95 -15.5 Q77.55 -16.15 76.65 -16.15 74.8 -16.15 68.55 -6.6 L60.45 6.45 Q60.65 7.0 62.35 8.05 64.0 9.05 64.45 9.05 66.65 9.05 78.25 -0.3 L87.3 -7.95 M75.05 7.2 L76.6 7.25 71.8 11.7 71.2 12.1 70.1 13.05 73.85 12.45 78.85 12.4 82.6 12.55 82.6 12.7 77.85 12.95 Q76.45 12.95 72.7 13.9 L67.7 14.7 65.9 14.7 69.9 11.45 75.05 7.2 M114.35 22.4 L115.35 23.15 114.25 22.45 114.35 22.4 M118.55 38.4 L119.25 38.95 119.2 38.4 118.55 38.4 M122.7 79.35 L122.9 79.0 123.1 79.1 Q122.85 79.2 122.7 79.35" fill="#d4b957" fill-rule="evenodd" stroke="none"/>
    <path d="M33.1 26.7 L30.75 28.65 29.05 26.25 27.5 23.95 26.9 24.6 25.95 22.75 26.4 22.3 27.25 21.6 29.1 23.4 30.45 24.65 30.6 24.8 31.05 25.25 31.4 25.55 33.1 26.7 M71.75 -28.05 L71.7 -28.2 71.8 -28.05 71.75 -28.05" fill="#cca03c" fill-rule="evenodd" stroke="none"/>
    <path d="M92.7 -15.35 Q90.85 -12.35 87.3 -7.95 L78.25 -0.3 Q66.65 9.05 64.45 9.05 64.0 9.05 62.35 8.05 60.65 7.0 60.45 6.45 L68.55 -6.6 Q74.8 -16.15 76.65 -16.15 77.55 -16.15 78.95 -15.5 L80.8 -14.6 77.6 -9.7 Q75.5 -6.5 74.05 -4.8 L70.0 -0.35 Q67.9 2.1 66.95 4.35 L71.6 -0.4 76.75 -5.65 Q84.55 -14.05 84.45 -16.7 84.45 -18.1 82.75 -19.7 81.0 -21.35 79.4 -21.35 78.75 -21.35 77.95 -20.95 L75.7 -19.2 75.55 -19.35 Q70.55 -14.8 65.5 -7.4 L57.45 5.35 57.6 5.35 57.0 6.25 Q55.75 7.8 54.75 9.55 L54.35 10.35 Q59.9 14.15 65.9 14.7 L67.7 14.7 72.7 13.9 Q76.45 12.95 77.85 12.95 L82.6 12.7 82.6 12.55 83.6 12.6 88.45 13.0 96.9 14.45 Q100.9 15.65 104.7 17.25 106.7 18.0 114.25 22.45 L115.35 23.15 Q126.45 32.35 132.25 44.95 129.85 44.25 126.75 41.95 121.4 37.6 119.6 36.6 121.95 37.0 124.75 35.3 118.35 29.95 109.8 27.15 L95.55 23.7 95.8 23.4 99.2 22.4 Q101.55 21.6 102.45 20.8 L102.2 20.7 102.15 20.6 93.35 19.55 90.35 19.7 88.8 19.85 Q84.8 19.95 80.5 20.9 L71.35 23.15 62.75 25.9 Q56.3 27.8 53.45 27.8 49.6 27.8 47.45 25.75 45.2 23.65 44.95 19.7 L44.95 19.2 Q44.9 18.35 45.0 17.45 45.55 12.25 49.85 4.35 52.6 -0.8 58.55 -9.45 64.65 -18.5 69.65 -21.2 74.4 -23.85 83.9 -23.85 88.35 -23.85 90.45 -22.8 93.0 -21.5 93.1 -18.2 L92.7 -15.35 M138.6 71.2 Q139.9 70.8 142.85 68.85 146.55 66.4 147.9 66.4 150.0 66.4 150.65 68.55 150.7 69.45 148.9 70.75 L148.65 70.7 Q147.4 70.1 146.75 70.1 144.65 70.1 142.6 71.1 L138.95 72.95 138.8 71.85 138.6 71.2 M144.7 73.55 L146.1 73.65 Q147.45 73.9 149.15 75.0 152.45 77.05 152.5 79.8 152.55 81.2 150.95 82.3 L149.6 83.1 149.95 81.5 Q149.85 76.75 142.35 74.5 L142.6 74.2 143.95 73.7 144.7 73.45 144.7 73.55" fill="#e6c65e" fill-rule="evenodd" stroke="none"/>
    <path d="M132.6 87.55 Q134.35 90.25 134.45 93.9 134.55 99.7 130.5 104.5 126.55 109.4 121.5 109.4 116.95 109.4 111.15 106.0 107.0 103.55 105.7 101.25 L108.1 98.15 Q109.05 101.05 111.1 102.45 113.55 104.15 117.85 104.15 121.65 104.15 124.1 101.55 126.7 98.85 126.6 94.5 126.5 91.1 124.8 89.4 123.1 87.75 120.1 88.1 120.7 87.15 122.7 86.35 124.9 85.55 127.1 85.55 128.75 85.55 130.7 86.55 L132.6 87.55 M108.9 97.1 L110.25 95.25 114.25 90.2 115.5 90.05 Q117.35 90.05 120.15 91.5 123.2 93.1 123.25 94.5 123.3 96.75 121.15 99.35 118.65 102.25 115.7 102.25 113.2 102.25 111.05 100.45 109.3 98.95 108.9 97.1" fill="#ba8d71" fill-rule="evenodd" stroke="none"/>
    <path d="M118.85 84.35 L120.2 83.75 Q122.5 82.9 123.9 82.9 128.65 82.9 131.6 86.25 L132.6 87.55 130.7 86.55 Q128.75 85.55 127.1 85.55 124.9 85.55 122.7 86.35 120.7 87.15 120.1 88.1 123.1 87.75 124.8 89.4 126.5 91.1 126.6 94.5 126.7 98.85 124.1 101.55 121.65 104.15 117.85 104.15 113.55 104.15 111.1 102.45 109.05 101.05 108.1 98.15 L108.9 97.1 Q109.3 98.95 111.05 100.45 113.2 102.25 115.7 102.25 118.65 102.25 121.15 99.35 123.3 96.75 123.25 94.5 123.2 93.1 120.15 91.5 117.35 90.05 115.5 90.05 L114.25 90.2 116.65 87.1 118.85 84.35 M119.7 88.15 L120.05 88.15 120.1 88.1 119.7 88.15 M124.65 84.45 L124.75 84.85 124.9 84.5 124.85 84.5 124.65 84.45" fill="#ad8063" fill-rule="evenodd" stroke="none"/>
    <path d="M136.05 79.9 L137.2 81.2 Q140.05 85.0 140.15 90.5 140.35 99.1 134.45 106.45 128.4 114.1 120.35 114.1 116.9 114.1 113.15 112.2 L112.55 111.95 Q110.45 110.85 108.25 109.2 L107.0 108.2 107.05 108.05 106.9 108.15 Q104.6 106.25 103.25 104.35 L105.7 101.25 Q107.0 103.55 111.15 106.0 116.95 109.4 121.5 109.4 126.55 109.4 130.5 104.5 134.55 99.7 134.45 93.9 134.35 90.25 132.6 87.55 L131.6 86.25 Q128.65 82.9 123.9 82.9 122.5 82.9 120.2 83.75 L118.85 84.35 122.7 79.35 Q122.85 79.2 123.1 79.1 L123.1 79.05 Q125.55 77.3 129.7 77.3 132.75 77.3 135.2 79.15 L135.2 79.2 135.25 79.55 Q135.35 80.4 136.05 79.9" fill="#c9a182" fill-rule="evenodd" stroke="none"/>
    <path d="M119.7 88.15 L120.1 88.1 120.05 88.15 119.7 88.15" fill="#b78d73" fill-rule="evenodd" stroke="none"/>
    <path d="M113.15 112.2 L112.2 113.8 111.1 115.95 Q111.15 118.95 115.05 121.5 118.9 124.0 119.0 128.1 119.1 131.2 116.75 131.95 L116.75 131.9 117.05 130.5 Q117.0 127.5 112.5 124.15 108.05 120.8 108.05 120.2 108.0 118.75 110.2 115.25 L112.55 111.95 113.15 112.2 M108.6 128.0 Q108.7 133.6 104.65 133.9 L105.95 130.5 107.45 124.65 Q107.45 124.95 107.7 124.95 L108.45 127.45 108.6 128.0 M30.75 28.65 Q28.85 30.35 27.8 32.1 26.35 34.35 25.3 38.3 L22.4 36.6 Q20.6 35.5 19.7 34.45 20.65 32.1 22.3 29.95 L26.9 24.6 27.5 23.95 29.05 26.25 30.75 28.65" fill="#bf9b48" fill-rule="evenodd" stroke="none"/>
    <path d="M116.75 131.95 L115.0 132.25 Q110.9 132.25 108.6 127.3 L108.6 128.0 108.45 127.45 107.7 124.95 Q107.45 124.95 107.45 124.65 L105.95 130.5 104.65 133.9 104.1 133.9 Q100.35 133.9 96.5 130.55 92.65 127.25 92.35 124.85 91.9 122.4 97.85 115.5 103.75 108.6 107.0 108.2 L108.25 109.2 Q110.45 110.85 112.55 111.95 L110.2 115.25 Q108.0 118.75 108.05 120.2 108.05 120.8 112.5 124.15 117.0 127.5 117.05 130.5 L116.75 131.9 116.75 131.95" fill="#a48439" fill-rule="evenodd" stroke="none"/>
    <path d="M88.1 139.95 L88.75 140.05 Q90.4 140.35 91.75 141.8 L90.9 143.0 90.8 143.1 90.9 143.45 90.9 145.6 91.05 149.05 91.25 152.6 Q91.45 155.7 91.85 157.35 92.0 158.2 92.25 158.6 93.3 160.6 94.85 161.2 L96.55 161.45 95.8 163.6 95.55 164.55 Q95.15 166.65 95.95 168.1 96.7 169.4 98.2 169.45 L100.65 168.85 Q100.65 170.4 101.15 171.3 L102.3 172.8 102.6 173.05 107.2 172.95 108.85 171.9 108.8 171.5 Q108.65 170.7 108.95 171.8 L109.1 172.35 109.1 172.45 109.4 173.15 Q110.0 174.35 111.4 174.35 113.1 174.4 115.25 173.15 L115.6 172.95 115.75 172.95 115.85 172.8 Q118.65 171.15 120.4 169.0 L118.9 177.5 118.25 181.1 93.35 188.2 93.1 188.05 Q87.95 184.55 84.6 178.45 82.5 174.6 83.05 170.8 L83.75 168.4 Q84.4 166.65 85.6 164.4 87.65 160.15 88.1 158.2 88.85 154.5 86.95 151.05 L84.45 147.45 82.0 144.3 Q81.4 143.2 82.1 142.3 82.3 142.0 82.65 141.8 L84.2 140.85 Q86.2 139.7 88.1 139.95 M86.4 171.3 Q85.2 175.35 86.95 178.45 88.65 181.55 93.65 181.65 97.45 181.7 99.3 180.65 101.6 179.35 102.25 176.05 L102.5 174.95 101.85 174.5 100.05 172.85 99.8 172.0 99.6 171.1 Q99.0 171.85 97.35 171.75 95.65 171.75 95.0 170.5 94.4 169.55 94.1 167.4 L93.9 164.45 Q92.65 164.7 91.0 165.6 87.75 167.4 86.4 171.3" fill="#c9a182" fill-rule="evenodd" stroke="none"/>
    <path d="M86.4 171.3 Q87.75 167.4 91.0 165.6 92.65 164.7 93.9 164.45 L94.1 167.4 Q94.4 169.55 95.0 170.5 95.65 171.75 97.35 171.75 99.0 171.85 99.6 171.1 L99.8 172.0 100.05 172.85 101.85 174.5 102.5 174.95 102.25 176.05 Q101.6 179.35 99.3 180.65 97.45 181.7 93.65 181.65 88.65 181.55 86.95 178.45 85.2 175.35 86.4 171.3" fill="#dbb08e" fill-rule="evenodd" stroke="none"/>
    <path d="M71.65 137.05 L59.85 130.8 53.8 133.1 53.45 132.85 52.75 133.55 50.6 134.5 Q49.65 134.95 48.75 135.45 L51.55 132.1 50.3 131.2 45.9 136.8 43.95 137.65 47.95 131.2 55.3 128.65 55.55 128.55 59.85 130.8 60.9 130.4 72.5 136.45 71.65 137.05" fill="#6e8f94" fill-rule="evenodd" stroke="none"/>
    <path d="M58.95 145.2 L64.05 138.45 62.4 137.6 56.1 145.9 55.8 145.75 60.15 136.6 59.5 136.1 52.95 144.2 52.0 143.8 58.25 135.4 57.05 134.85 49.6 142.6 48.85 142.2 54.15 133.35 53.8 133.1 59.85 130.8 71.65 137.05 69.7 138.3 65.25 141.3 66.45 139.7 65.65 139.4 62.85 142.8 58.95 145.2 M52.75 133.55 L45.75 140.6 44.75 140.05 48.75 135.45 Q49.65 134.95 50.6 134.5 L52.75 133.55 M45.9 136.8 L43.75 139.55 42.95 139.2 43.95 137.65 45.9 136.8 M72.5 136.45 L89.3 145.25 88.45 145.95 79.55 141.2 71.65 137.05 72.5 136.45" fill="#67868a" fill-rule="evenodd" stroke="none"/>
    <path d="M47.95 131.2 L51.5 125.45 60.9 130.4 59.85 130.8 55.55 128.55 55.3 128.65 47.95 131.2" fill="#7a9ea3" fill-rule="evenodd" stroke="none"/>
    <path d="M58.95 145.2 L62.85 142.8 59.05 147.4 57.7 146.7 58.95 145.2 M65.25 141.3 L69.7 138.3 71.65 137.05 79.55 141.2 74.3 144.55 71.35 146.9 73.8 143.45 71.5 142.25 67.3 150.05 66.2 151.0 65.95 150.9 70.65 141.9 69.75 141.4 63.8 149.75 63.0 149.4 69.0 141.0 67.9 140.4 60.6 148.15 60.2 147.95 65.25 141.3" fill="#5f7c80" fill-rule="evenodd" stroke="none"/>
    <path d="M89.3 145.25 L103.55 152.7 103.05 153.6 88.45 145.95 84.75 149.1 84.3 148.9 83.65 150.05 80.75 152.5 83.1 148.25 82.2 147.7 75.7 155.85 74.75 155.4 80.55 146.85 79.15 146.15 72.75 154.35 71.8 153.9 77.0 145.05 75.3 144.2 68.6 152.2 67.75 151.75 71.35 146.9 74.3 144.55 79.55 141.2 88.45 145.95 89.3 145.25 M67.3 150.05 L66.65 151.25 66.2 151.0 67.3 150.05" fill="#577175" fill-rule="evenodd" stroke="none"/>
    <path d="M103.05 153.6 L102.4 154.6 99.95 158.8 94.25 165.25 92.45 164.35 99.55 156.7 97.5 155.6 91.4 163.75 90.05 163.05 95.9 154.8 94.55 154.1 88.9 162.5 87.2 161.6 93.1 153.35 90.95 152.25 85.3 160.7 83.55 159.8 89.0 151.3 88.15 150.85 80.95 158.45 80.05 158.1 86.15 149.8 84.75 149.1 88.45 145.95 103.05 153.6 M83.65 150.05 L79.3 157.65 78.15 157.1 80.75 152.5 83.65 150.05" fill="#50696b" fill-rule="evenodd" stroke="none"/>
    <path d="M91.0 147.7 L90.9 145.7 90.85 143.45 90.8 143.15 90.9 143.05 91.7 141.8 92.05 141.55 Q94.75 140.05 97.2 140.25 L98.5 140.5 Q99.25 143.05 99.35 146.9 L99.25 149.25 Q98.05 150.45 96.9 151.05 93.35 153.0 91.6 149.85 91.35 149.35 91.0 147.7 M103.1 146.3 L103.45 146.1 Q106.65 146.0 108.35 147.2 L108.95 149.65 108.9 150.5 108.45 151.15 107.2 152.45 Q106.1 153.0 105.05 152.9 104.35 152.8 102.7 152.15 L102.7 152.1 103.25 149.3 Q103.45 147.75 103.1 146.3 M111.75 154.35 L113.8 154.25 113.9 154.35 113.1 156.4 Q112.25 157.85 111.35 158.35 L110.05 158.75 111.75 154.35 M119.35 161.25 L120.4 161.55 120.2 162.4 Q119.75 164.25 118.9 164.7 L118.15 165.0 119.35 161.25" fill="#f7c8a5" fill-rule="evenodd" stroke="none"/>
    <path d="M91.0 147.7 Q91.35 149.35 91.6 149.85 93.35 153.0 96.9 151.05 98.05 150.45 99.25 149.25 L99.35 146.9 Q99.25 143.05 98.5 140.5 99.3 140.75 100.0 141.35 L100.25 141.55 100.15 141.6 101.5 144.9 Q102.45 148.15 101.7 151.65 101.25 153.75 100.3 155.45 98.95 157.65 96.65 158.95 L93.75 158.8 Q92.55 158.25 91.8 157.3 91.5 156.05 91.35 153.55 L91.25 152.6 91.05 149.1 91.0 147.7 M109.9 155.15 L110.35 155.05 111.1 154.65 111.75 154.35 110.05 158.75 111.35 158.35 Q112.25 157.85 113.1 156.4 L113.9 154.35 Q114.6 154.5 115.1 155.0 115.1 157.0 114.15 160.6 112.3 167.25 107.75 169.8 106.65 170.4 105.6 170.4 104.2 170.4 103.55 169.25 103.25 168.65 103.4 167.6 L103.65 166.75 103.8 166.6 Q106.2 164.1 108.25 159.65 L108.7 158.6 108.8 158.5 109.9 155.15 M117.65 161.05 L118.15 160.8 119.35 161.25 118.15 165.0 118.9 164.7 Q119.75 164.25 120.2 162.4 L120.4 161.55 120.5 161.65 Q121.05 161.85 121.55 162.8 L121.85 163.45 Q121.6 165.15 120.95 166.65 119.55 170.0 116.3 171.8 114.9 172.55 113.55 172.6 112.0 172.7 111.4 171.6 L111.3 171.45 111.4 171.4 Q113.2 169.65 114.4 167.95 L116.25 164.85 116.25 164.75 117.65 161.05 M96.55 161.55 L96.05 161.55 97.65 161.15 Q99.8 159.95 102.35 153.4 L102.7 152.15 Q104.35 152.8 105.05 152.9 106.1 153.0 107.2 152.45 L108.45 151.15 108.9 150.5 108.9 151.95 107.75 157.35 Q106.15 163.7 102.05 165.9 100.65 166.7 99.4 166.7 97.85 166.75 97.15 165.5 96.85 164.85 97.05 162.65 L97.2 161.4 96.55 161.55" fill="#edbe9a" fill-rule="evenodd" stroke="none"/>
    <path d="M100.25 141.55 Q100.9 142.15 101.4 143.1 L102.0 144.25 102.25 144.85 102.7 146.5 103.1 146.3 Q103.45 147.75 103.25 149.3 L102.7 152.1 102.7 152.15 102.35 153.4 Q99.8 159.95 97.65 161.15 L96.05 161.55 95.5 161.45 94.8 161.3 Q93.3 160.65 92.15 158.6 L91.8 157.3 Q92.55 158.25 93.75 158.8 L96.65 158.95 Q98.95 157.65 100.3 155.45 101.25 153.75 101.7 151.65 102.45 148.15 101.5 144.9 L100.15 141.6 100.25 141.55 M108.35 147.2 L109.4 148.35 Q110.9 151.05 109.9 155.15 L108.8 158.5 108.7 158.6 108.25 159.65 Q106.2 164.1 103.8 166.6 L103.65 166.75 103.4 167.6 Q103.25 168.65 103.55 169.25 104.2 170.4 105.6 170.4 106.65 170.4 107.75 169.8 112.3 167.25 114.15 160.6 115.1 157.0 115.1 155.0 L115.8 155.9 Q117.2 158.5 116.3 161.75 L117.65 161.05 116.25 164.75 116.25 164.85 114.4 167.95 Q113.2 169.65 111.4 171.4 L111.3 171.45 111.4 171.6 Q112.0 172.7 113.55 172.6 114.9 172.55 116.3 171.8 119.55 170.0 120.95 166.65 121.6 165.15 121.85 163.45 122.7 165.85 120.6 168.7 L120.4 169.0 Q118.6 171.2 115.9 172.85 L115.75 172.6 115.7 172.95 115.6 173.0 115.3 173.2 Q113.1 174.4 111.35 174.35 110.0 174.35 109.35 173.15 L109.1 172.45 109.1 172.35 108.95 171.85 Q108.65 170.7 108.8 171.6 L108.85 171.9 107.2 173.0 102.6 173.1 102.35 172.85 Q101.6 172.3 101.1 171.35 100.6 170.45 100.6 168.85 99.3 169.5 98.15 169.45 96.6 169.45 95.9 168.15 95.1 166.7 95.6 164.6 L95.8 163.6 96.55 161.55 97.2 161.4 97.05 162.65 Q96.85 164.85 97.15 165.5 97.85 166.75 99.4 166.7 100.65 166.7 102.05 165.9 106.15 163.7 107.75 157.35 L108.9 151.95 108.9 150.5 108.95 149.65 108.35 147.2" fill="#dbb08e" fill-rule="evenodd" stroke="none"/>
    <path d="M86.1 217.55 L84.2 210.55 Q81.95 202.7 81.0 198.25 78.6 187.25 78.9 185.25 79.15 184.25 79.7 183.4 L81.8 182.95 82.4 182.85 83.05 187.4 Q84.1 195.1 84.15 200.15 84.1 203.95 86.1 217.55 M118.8 180.6 L119.0 180.6 118.65 178.7 120.05 178.85 Q121.9 179.7 123.8 187.45 124.95 192.15 126.0 200.3 L127.25 209.75 125.55 212.75 Q123.5 207.35 122.45 203.05 121.7 200.0 120.2 189.85 L118.8 180.6" fill="#e8f1f2" fill-rule="evenodd" stroke="none"/>
    <path d="M82.4 182.85 L86.8 182.0 Q88.5 191.05 89.55 200.3 L90.1 205.5 92.35 224.3 Q90.65 223.6 89.35 222.55 87.05 220.7 86.15 217.8 L86.1 217.55 Q84.1 203.95 84.15 200.15 84.1 195.1 83.05 187.4 L82.4 182.85 M114.4 180.45 L118.8 180.6 120.2 189.85 Q121.7 200.0 122.45 203.05 123.5 207.35 125.55 212.75 L125.0 213.65 Q123.3 216.2 120.45 218.65 L120.15 218.9 118.4 205.1 117.55 199.0 114.4 180.45" fill="#dce5e6" fill-rule="evenodd" stroke="none"/>
    <path d="M86.8 182.0 L90.85 181.5 Q94.35 197.95 96.05 209.05 L96.2 210.2 97.85 225.45 96.65 225.3 96.5 225.3 Q94.2 225.0 92.35 224.3 L90.1 205.5 89.55 200.3 Q88.5 191.05 86.8 182.0 M101.95 180.7 Q108.1 180.3 114.4 180.45 L117.55 199.0 118.4 205.1 120.15 218.9 Q115.5 222.95 110.8 224.1 L107.75 224.8 106.0 209.45 105.75 207.4 101.95 180.7" fill="#d2dadb" fill-rule="evenodd" stroke="none"/>
    <path d="M90.85 181.5 L98.85 180.75 101.95 180.7 105.75 207.4 106.0 209.45 107.75 224.8 97.85 225.45 96.2 210.2 96.05 209.05 Q94.35 197.95 90.85 181.5" fill="#c8d0d1" fill-rule="evenodd" stroke="none"/>
    <path d="M125.0 213.65 L126.0 219.2 123.8 221.6 121.25 223.65 119.05 225.05 Q113.1 228.75 105.05 230.7 L97.4 230.15 95.6 229.9 93.9 229.65 90.25 229.0 89.35 222.55 Q90.65 223.6 92.35 224.3 94.2 225.0 96.5 225.3 L96.65 225.3 97.85 225.45 107.75 224.8 110.8 224.1 Q115.5 222.95 120.15 218.9 L120.45 218.65 Q123.3 216.2 125.0 213.65" fill="#8ca4a8" fill-rule="evenodd" stroke="none"/>
    <path d="M126.0 219.2 L128.2 232.2 130.5 246.15 Q132.45 259.45 133.65 270.65 L134.5 279.25 130.1 262.7 Q129.35 259.75 126.4 239.75 L125.5 233.6 123.8 221.6 126.0 219.2 M93.55 258.7 L92.1 243.95 Q94.2 241.35 94.4 238.65 L94.5 236.65 94.1 231.6 93.9 229.65 95.6 229.9 96.2 237.75 Q96.5 243.6 96.4 248.15 L96.05 252.7 95.5 256.5 Q95.0 257.8 93.55 258.7" fill="#a8c4c9" fill-rule="evenodd" stroke="none"/>
    <path d="M134.5 279.25 L135.25 294.05 128.75 293.0 Q128.6 282.65 127.45 272.2 126.45 263.55 124.85 254.9 122.1 241.7 121.2 235.6 L120.85 233.3 Q120.05 227.1 121.25 223.65 L123.8 221.6 125.5 233.6 126.4 239.75 Q129.35 259.75 130.1 262.7 L134.5 279.25 M104.25 289.15 L95.5 287.95 95.1 280.15 93.55 258.7 Q95.0 257.8 95.5 256.5 L96.05 252.7 96.4 248.15 Q96.5 243.6 96.2 237.75 L95.6 229.9 97.4 230.15 98.75 238.85 Q102.05 261.2 103.5 278.05 L104.25 289.15" fill="#a0bbbf" fill-rule="evenodd" stroke="none"/>
    <path d="M92.1 243.95 L91.0 234.25 91.0 234.1 90.25 229.0 93.9 229.65 94.1 231.6 94.5 236.65 94.4 238.65 Q94.2 241.35 92.1 243.95" fill="#b1cfd4" fill-rule="evenodd" stroke="none"/>
    <path d="M128.75 293.0 L117.95 291.3 104.25 289.15 103.5 278.05 Q102.05 261.2 98.75 238.85 L97.4 230.15 105.05 230.7 Q113.1 228.75 119.05 225.05 L121.25 223.65 Q120.05 227.1 120.85 233.3 L121.2 235.6 Q122.1 241.7 124.85 254.9 126.45 263.55 127.45 272.2 128.6 282.65 128.75 293.0" fill="#96aeb3" fill-rule="evenodd" stroke="none"/>
  </g>
  <defs>
    <linearGradient gradientTransform="matrix(2.0E-4, 0.0065, -0.0111, 0.0, 36.5, 82.75)" gradientUnits="userSpaceOnUse" id="gradient0" spreadMethod="pad" x1="-819.2" x2="819.2">
      <stop offset="0.0" stop-color="#cc9474" stop-opacity="0.15294118"/>
      <stop offset="1.0" stop-color="#cc9574"/>
    </linearGradient>
    <linearGradient gradientTransform="matrix(2.0E-4, 0.0096, -0.0165, 0.0, 38.95, 86.3)" gradientUnits="userSpaceOnUse" id="gradient1" spreadMethod="pad" x1="-819.2" x2="819.2">
      <stop offset="0.0" stop-color="#cc9474" stop-opacity="0.15294118"/>
      <stop offset="1.0" stop-color="#bd8c6c"/>
    </linearGradient>
  </defs>
</svg>
