<?xml version="1.0" encoding="UTF-8" standalone="no"?>
<svg xmlns:xlink="http://www.w3.org/1999/xlink" height="78.3px" width="93.3px" xmlns="http://www.w3.org/2000/svg">
  <g transform="matrix(1.0, 0.0, 0.0, 1.0, -97.35, -27.2)">
    <path d="M185.5 90.8 L179.2 76.4 172.75 62.2 170.95 58.5 170.65 57.85 169.35 55.1 168.25 52.7 167.1 50.45 165.65 47.7 164.35 45.1 160.0 37.2 156.3 35.4 154.85 34.75 147.25 31.2 146.9 31.05 146.75 31.35 Q141.25 36.7 132.7 45.9 L132.2 46.4 131.25 47.5 129.15 49.95 124.8 54.95 124.65 55.1 122.2 58.2 118.15 62.7 111.4 70.95 108.5 74.65 Q107.05 76.25 105.9 78.05 104.75 79.35 103.95 80.6 L103.3 81.45 106.05 82.55 107.85 83.2 110.25 84.15 111.25 84.5 122.2 88.7 129.15 91.3 132.2 92.25 132.7 92.4 145.45 96.6 147.9 97.4 162.1 101.45 163.4 100.8 Q164.5 100.15 165.65 99.7 167.25 98.85 169.2 97.9 L172.6 96.3 Q178.55 93.7 184.4 92.1 L161.45 105.5 97.35 80.45 145.15 27.2 161.1 34.1 190.65 88.55 185.65 91.3 185.5 90.8" fill="#aeddeb" fill-opacity="0.21176471" fill-rule="evenodd" stroke="none"/>
    <path d="M147.25 31.2 L154.85 34.75 156.3 35.4 160.0 37.2 164.35 45.1 165.65 47.7 167.1 50.45 168.25 52.7 169.35 55.1 170.65 57.85 170.95 58.5 172.75 62.2 179.2 76.4 185.5 90.8 185.35 90.95 156.45 45.6 147.25 31.2 M169.2 97.9 Q167.25 98.85 165.65 99.7 164.5 100.15 163.4 100.8 L159.65 86.6 164.35 92.25 169.2 97.9" fill="#61818e" fill-rule="evenodd" stroke="none"/>
    <path d="M184.4 92.1 Q178.55 93.7 172.6 96.3 L169.2 97.9 164.35 92.25 156.45 45.6 185.35 90.95 185.85 91.75 185.5 91.75 184.4 92.1" fill="#6f8e96" fill-rule="evenodd" stroke="none"/>
    <path d="M185.5 90.8 L185.65 91.3 185.85 91.75 185.35 90.95 185.5 90.8" fill="#81805c" fill-rule="evenodd" stroke="none"/>
    <path d="M163.4 100.8 L162.1 101.45 147.9 97.4 145.45 96.6 157.4 78.05 159.65 86.6 163.4 100.8 M132.2 92.25 L129.15 91.3 122.2 88.7 126.55 85.95 Q126.4 86.25 126.4 86.75 L126.55 87.75 Q127.05 88.35 128.85 88.35 L129.15 88.35 Q130.75 88.2 130.95 86.1 L132.7 86.45 135.6 86.6 136.1 86.6 Q136.1 87.4 136.6 88.2 L136.9 88.7 132.2 92.25 M105.9 78.05 Q107.05 76.25 108.5 74.65 L111.4 70.95 118.15 62.7 151.75 55.25 152.55 58.5 152.55 58.65 131.25 67.55 129.65 66.9 129.15 66.75 123.5 64.65 Q119.8 63.65 119.8 66.1 119.8 66.75 121.1 67.7 L120.6 68.85 120.6 72.05 105.9 78.05 M155.0 68.5 L156.45 74.15 140.8 85.95 140.45 85.15 Q142.55 84.0 144.35 81.45 L145.95 79.35 147.55 75.95 150.0 76.1 Q151.1 76.1 151.75 75.45 152.55 74.95 152.55 74.15 152.55 72.4 150.15 71.6 L155.0 68.5" fill="#94b7af" fill-rule="evenodd" stroke="none"/>
    <path d="M111.25 84.5 L110.25 84.15 107.85 83.2 120.75 76.1 121.4 77.55 Q118.15 77.9 118.15 80.0 L118.0 80.45 118.15 80.95 111.25 84.5 M103.95 80.6 Q104.75 79.35 105.9 78.05 L120.6 72.05 120.6 73.35 103.95 80.6 M118.15 62.7 L122.2 58.2 124.65 55.1 124.8 54.95 129.15 49.95 131.25 47.5 132.2 46.4 132.7 45.9 Q141.25 36.7 146.75 31.35 146.6 32.5 148.2 40.1 L128.65 56.1 150.3 49.45 151.6 55.1 151.75 55.25 118.15 62.7 M152.55 58.65 L152.75 59.45 153.2 61.4 139.35 69.0 138.7 69.5 134.3 68.5 144.0 63.35 132.7 68.05 131.25 67.55 152.55 58.65" fill="#c2e0ca" fill-rule="evenodd" stroke="none"/>
    <path d="M146.75 31.35 L146.9 31.05 147.25 31.2 146.75 31.35" fill="#5f5e43" fill-rule="evenodd" stroke="none"/>
    <path d="M147.25 31.2 L156.45 45.6 164.35 92.25 159.65 86.6 157.4 78.05 156.45 74.15 155.0 68.5 153.55 62.7 153.2 61.4 152.75 59.45 152.55 58.65 152.55 58.5 151.75 55.25 151.6 55.1 150.3 49.45 150.0 47.5 Q148.85 43.3 148.2 40.1 146.6 32.5 146.75 31.35 L147.25 31.2" fill="#537379" fill-rule="evenodd" stroke="none"/>
    <path d="M107.85 83.2 L106.05 82.55 103.3 81.45 103.95 80.6 120.6 73.35 120.45 74.35 Q120.45 75.15 120.75 76.1 L107.85 83.2 M148.2 40.1 Q148.85 43.3 150.0 47.5 L150.3 49.45 128.65 56.1 148.2 40.1 M134.3 68.5 L134.0 68.35 132.7 68.05 144.0 63.35 134.3 68.5" fill="#d7f0d5" fill-rule="evenodd" stroke="none"/>
    <path d="M120.6 72.05 L120.6 68.85 121.1 67.7 Q119.8 66.75 119.8 66.1 119.8 63.65 123.5 64.65 L129.15 66.75 129.65 66.9 131.25 67.55 132.7 68.05 134.0 68.35 134.3 68.5 138.7 69.5 139.65 69.65 140.45 69.8 146.45 70.6 Q148.7 70.95 150.15 71.6 152.55 72.4 152.55 74.15 152.55 74.95 151.75 75.45 151.1 76.1 150.0 76.1 L147.55 75.95 145.95 79.35 144.35 81.45 Q142.55 84.0 140.45 85.15 L140.8 85.95 140.8 87.25 Q140.8 88.2 140.45 88.85 139.95 89.65 138.85 89.65 137.7 89.65 136.9 88.7 L136.6 88.2 Q136.1 87.4 136.1 86.6 L135.6 86.6 132.7 86.45 130.95 86.1 Q130.75 88.2 129.15 88.35 L128.85 88.35 Q127.05 88.35 126.55 87.75 L126.4 86.75 Q126.4 86.25 126.55 85.95 L127.05 85.0 127.55 84.5 Q125.6 83.2 124.0 81.45 L123.5 80.8 Q121.9 81.9 120.45 81.9 118.65 81.9 118.15 80.95 L118.0 80.45 118.15 80.0 Q118.15 77.9 121.4 77.55 L120.75 76.1 Q120.45 75.15 120.45 74.35 L120.6 73.35 120.6 72.05 M129.65 75.3 L129.65 74.65 130.1 73.05 130.1 71.75 129.15 71.4 127.05 70.6 125.45 69.8 Q124.65 69.65 124.0 69.3 123.65 70.15 123.65 70.6 L123.5 70.95 Q123.5 71.6 123.65 72.05 123.65 73.05 124.0 74.0 L124.0 74.35 Q124.3 75.45 124.95 76.9 L125.45 77.55 Q126.9 80.3 129.15 81.6 L132.05 82.55 132.7 82.7 135.3 83.05 Q138.85 83.05 142.25 78.35 L142.4 78.05 144.0 75.45 143.5 75.45 Q140.15 74.8 135.95 73.35 L135.15 75.95 134.8 76.4 Q133.5 78.85 131.75 78.85 L131.1 78.85 130.75 78.7 Q130.1 78.35 129.8 77.7 L129.65 76.4 129.65 75.95 129.65 75.8 129.65 75.3 M133.05 72.55 L132.7 72.55 Q132.55 72.4 132.4 72.4 131.1 75.3 131.1 76.75 131.1 77.7 131.9 77.7 132.55 77.7 133.5 74.5 133.65 73.5 134.0 72.85 L133.65 72.85 133.5 72.7 133.05 72.55" fill="#000000" fill-rule="evenodd" stroke="none"/>
    <path d="M145.45 96.6 L132.7 92.4 132.2 92.25 136.9 88.7 Q137.7 89.65 138.85 89.65 139.95 89.65 140.45 88.85 140.8 88.2 140.8 87.25 L140.8 85.95 156.45 74.15 157.4 78.05 145.45 96.6 M122.2 88.7 L111.25 84.5 118.15 80.95 Q118.65 81.9 120.45 81.9 121.9 81.9 123.5 80.8 L124.0 81.45 Q125.6 83.2 127.55 84.5 L127.05 85.0 126.55 85.95 122.2 88.7 M153.2 61.4 L153.55 62.7 155.0 68.5 150.15 71.6 Q148.7 70.95 146.45 70.6 L140.45 69.8 139.65 69.65 139.35 69.0 153.2 61.4" fill="#7da2a1" fill-rule="evenodd" stroke="none"/>
    <path d="M124.0 74.0 Q123.65 73.05 123.65 72.05 123.5 71.6 123.5 70.95 L123.65 70.6 Q123.65 70.15 124.0 69.3 124.65 69.65 125.45 69.8 L127.05 70.6 129.15 71.4 130.1 71.75 130.1 73.05 129.65 74.65 129.65 75.3 124.0 74.0 M134.8 76.4 L135.15 75.95 135.95 73.35 Q140.15 74.8 143.5 75.45 L144.0 75.45 142.4 78.05 142.25 78.35 134.8 76.4" fill="#b1bfde" fill-rule="evenodd" stroke="none"/>
    <path d="M133.05 72.55 L133.5 72.7 133.65 72.85 134.0 72.85 Q133.65 73.5 133.5 74.5 132.55 77.7 131.9 77.7 131.1 77.7 131.1 76.75 131.1 75.3 132.4 72.4 132.55 72.4 132.7 72.55 L133.05 72.55" fill="#475c33" fill-rule="evenodd" stroke="none"/>
    <path d="M139.65 69.65 L138.7 69.5 139.35 69.0 139.65 69.65" fill="#bfbfa6" fill-rule="evenodd" stroke="none"/>
    <path d="M129.65 75.3 L129.65 75.8 129.65 75.95 129.65 76.4 129.8 77.7 Q130.1 78.35 130.75 78.7 L131.1 78.85 131.75 78.85 Q133.5 78.85 134.8 76.4 L142.25 78.35 Q138.85 83.05 135.3 83.05 L132.7 82.7 132.05 82.55 129.15 81.6 Q126.9 80.3 125.45 77.55 L124.95 76.9 Q124.3 75.45 124.0 74.35 L124.0 74.0 129.65 75.3" fill="#ffffff" fill-rule="evenodd" stroke="none"/>
  </g>
</svg>
