<?xml version="1.0" encoding="UTF-8" standalone="no"?>
<svg xmlns:xlink="http://www.w3.org/1999/xlink" height="55.15px" width="75.55px" xmlns="http://www.w3.org/2000/svg">
  <g transform="matrix(1.0, 0.0, 0.0, 1.0, 34.25, 53.9)">
    <path d="M-34.25 -10.65 L41.3 -6.55 28.9 1.25 -21.25 -1.2 -34.25 -10.65" fill="url(#gradient0)" fill-rule="evenodd" stroke="none"/>
    <path d="M-34.25 -10.65 L5.25 -53.9 41.3 -6.55 -34.25 -10.65" fill="url(#gradient1)" fill-rule="evenodd" stroke="none"/>
  </g>
  <defs>
    <linearGradient gradientTransform="matrix(9.0E-4, 0.0104, -0.0437, 0.0036, 4.6, -5.45)" gradientUnits="userSpaceOnUse" id="gradient0" spreadMethod="pad" x1="-819.2" x2="819.2">
      <stop offset="0.0" stop-color="#ab5428"/>
      <stop offset="0.5411764705882353" stop-color="#7d492b"/>
      <stop offset="1.0" stop-color="#7d685d"/>
    </linearGradient>
    <linearGradient gradientTransform="matrix(-0.0088, -0.0416, 0.04, -0.0085, -3.25, -23.45)" gradientUnits="userSpaceOnUse" id="gradient1" spreadMethod="pad" x1="-819.2" x2="819.2">
      <stop offset="0.0" stop-color="#e35202"/>
      <stop offset="0.36470588235294116" stop-color="#ed8e02"/>
      <stop offset="0.6980392156862745" stop-color="#ede102"/>
      <stop offset="1.0" stop-color="#fefda3"/>
    </linearGradient>
  </defs>
</svg>
