<?xml version="1.0" encoding="UTF-8" standalone="no"?>
<svg xmlns:xlink="http://www.w3.org/1999/xlink" height="49.25px" width="91.5px" xmlns="http://www.w3.org/2000/svg">
  <g transform="matrix(1.0, 0.0, 0.0, 1.0, 45.75, 24.6)">
    <path d="M15.5 -10.6 L15.3 -14.3 15.7 -19.2 15.5 -21.2 Q20.25 -21.65 25.0 -22.85 L25.15 -22.9 23.1 -17.1 23.0 -16.75 21.25 -11.25 Q18.45 -10.5 15.55 -10.6 L15.5 -10.6 M5.85 -21.0 L8.35 -13.25 9.0 -11.25 7.85 -11.55 7.55 -11.6 6.6 -11.9 3.2 -21.15 5.85 -21.0 M8.6 -8.7 L9.5 -8.5 Q9.5 -6.5 10.0 -3.4 L10.5 1.6 Q10.5 4.2 8.7 6.2 6.9 8.2 6.9 12.7 L6.9 13.0 6.95 13.7 5.6 13.75 5.55 13.4 5.55 13.35 5.15 10.65 5.1 9.25 Q5.1 5.6 7.15 2.15 9.25 -1.25 9.25 -1.7 L9.1 -4.2 8.6 -8.7 M15.85 -8.15 L18.9 -8.4 21.15 -8.75 22.85 -9.05 Q22.35 -7.8 22.2 -6.55 L20.9 -6.1 20.65 -6.05 Q19.0 -5.45 18.9 -4.45 L18.9 -4.3 19.5 -2.8 20.7 -3.65 21.5 -4.2 21.9 -4.45 Q23.1 -2.55 25.8 -0.2 L29.9 3.5 29.85 3.6 28.9 4.6 28.85 4.7 27.95 5.65 Q26.2 7.4 25.15 7.95 L24.85 7.7 16.9 0.75 16.05 0.0 16.35 -1.0 17.15 -1.4 16.1 -1.55 16.1 -1.6 17.7 -3.2 15.5 -2.6 15.55 -3.35 15.85 -8.15 M43.95 10.9 L43.95 11.05 42.8 11.0 36.8 11.6 31.1 12.2 30.0 11.9 28.9 11.4 27.3 10.3 27.6 9.5 27.9 8.7 27.9 8.2 27.1 8.55 26.3 8.8 Q26.6 7.65 28.05 5.75 L30.0 7.4 31.7 8.8 32.65 9.1 33.9 9.4 34.6 9.4 42.9 8.7 43.95 10.9 M-25.5 -19.55 Q-25.15 -16.3 -25.05 -12.75 L-24.9 -8.55 -26.9 -8.85 -27.6 -13.95 -28.5 -20.0 -25.5 -19.55 M-15.9 -8.9 L-14.1 -13.65 -11.85 -19.15 -10.0 -19.35 -9.3 -19.45 -13.2 -10.0 Q-13.9 -9.6 -14.75 -9.25 L-15.9 -8.9 M-29.1 -3.65 L-29.0 -4.2 -28.65 -6.6 -28.65 -7.0 -26.8 -6.5 -26.15 -6.3 -20.8 -5.6 -20.4 -5.6 -20.6 -4.45 -21.1 -0.75 -18.15 -1.05 -18.3 1.0 -18.3 1.1 -19.2 10.95 -21.5 11.95 -23.65 12.55 -23.75 12.55 -29.0 13.05 -30.8 13.0 -30.9 13.0 -32.1 12.9 -34.1 12.55 -36.1 11.9 -36.15 11.9 -36.3 11.8 -36.85 11.3 Q-34.45 8.85 -32.35 5.1 -30.4 1.65 -29.35 -1.75 L-28.2 -1.45 -25.35 -0.95 Q-25.15 -2.25 -25.75 -2.85 L-25.9 -3.0 -26.7 -3.35 -28.25 -3.45 -29.1 -3.65 M-16.2 -6.25 L-15.35 -6.55 -15.6 -4.2 -15.65 -2.15 Q-15.65 1.4 -12.8 3.85 -12.3 4.3 -11.5 5.6 -10.75 6.9 -10.6 8.85 L-10.4 11.7 -10.35 12.55 -10.4 13.0 -10.4 13.05 -12.4 13.05 -12.45 13.1 Q-12.95 8.7 -14.2 7.0 L-15.1 5.95 -15.85 4.85 Q-16.45 3.8 -16.6 1.8 L-16.65 0.05 -16.6 -3.3 -16.2 -6.25 M-45.65 19.15 L-45.65 19.05 -44.55 17.75 -44.45 17.65 Q-43.6 16.8 -42.2 15.65 L-41.65 15.2 Q-42.25 16.3 -42.25 16.75 -42.25 17.4 -40.65 18.3 L-40.2 18.5 -39.4 18.85 Q-36.8 19.95 -35.75 19.95 -34.0 19.95 -32.05 18.5 L-31.15 17.75 -30.65 17.25 -28.55 15.05 -27.55 15.1 -25.0 14.9 -23.65 14.75 -23.05 14.7 -23.65 16.0 -25.15 18.5 Q-28.0 22.35 -32.65 22.35 -35.35 22.35 -40.05 21.2 -44.15 20.2 -45.65 19.15" fill="#d2b6b6" fill-rule="evenodd" stroke="none"/>
    <path d="M15.5 -21.2 L15.7 -19.2 15.3 -14.3 15.5 -10.6 14.75 -10.65 9.0 -11.25 8.35 -13.25 5.85 -21.0 Q9.05 -20.85 12.35 -21.0 L15.5 -21.2 M9.5 -8.5 L14.55 -8.15 15.85 -8.15 15.55 -3.35 15.5 -2.6 17.7 -3.2 16.1 -1.6 16.1 -1.55 17.15 -1.4 16.35 -1.0 16.05 0.0 16.9 0.75 16.35 1.15 Q15.55 1.75 15.1 1.6 L19.15 5.85 19.6 6.3 21.45 8.0 22.9 9.0 24.45 7.95 24.85 7.7 25.15 7.95 Q26.2 7.4 27.95 5.65 L28.85 4.7 28.05 5.7 28.05 5.75 Q26.6 7.65 26.3 8.8 L27.1 8.55 27.9 8.2 27.9 8.7 27.6 9.5 27.3 10.3 28.9 11.4 30.0 11.9 31.1 12.2 36.8 11.6 42.8 11.0 43.95 11.05 43.95 10.9 44.0 11.05 45.35 14.4 33.2 16.4 Q32.35 16.4 28.8 15.2 L24.5 13.6 Q23.7 13.15 20.05 12.6 L14.8 12.0 Q10.65 12.0 6.9 13.0 L6.9 12.7 Q6.9 8.2 8.7 6.2 10.5 4.2 10.5 1.6 L10.0 -3.4 Q9.5 -6.5 9.5 -8.5 M-24.9 -8.55 L-25.05 -12.75 Q-25.15 -16.3 -25.5 -19.55 L-15.65 -19.05 -11.85 -19.15 -14.1 -13.65 -15.9 -8.9 -16.05 -8.85 -19.9 -8.35 -24.9 -8.55 M-36.3 11.8 L-36.15 11.9 -36.1 11.9 -34.1 12.55 -32.1 12.9 -30.9 13.0 -30.8 13.0 -29.65 13.45 -27.65 14.05 -27.1 14.1 -23.65 13.55 -19.15 12.45 -19.0 12.95 -18.8 14.15 -18.6 16.1 Q-18.6 19.8 -22.25 22.3 -24.0 23.5 -26.8 24.45 L-26.8 24.55 -27.1 24.55 Q-31.4 24.75 -35.5 24.5 L-35.7 24.5 Q-40.75 24.15 -45.35 22.25 L-45.4 21.85 -45.45 21.5 -45.75 19.4 -45.65 19.15 Q-44.15 20.2 -40.05 21.2 -35.35 22.35 -32.65 22.35 -28.0 22.35 -25.15 18.5 L-23.65 16.0 -23.05 14.7 -23.65 14.75 -25.0 14.9 -27.55 15.1 -28.55 15.05 -32.6 14.15 -34.05 13.6 -34.1 13.6 -36.2 12.2 -36.35 12.0 -36.6 11.6 -36.3 11.8 M-18.3 1.0 L-18.15 -1.05 -21.1 -0.75 -20.6 -4.45 -20.4 -5.6 -20.35 -5.6 -17.25 -5.95 -16.2 -6.25 -16.6 -3.3 -16.65 0.05 -16.6 1.8 Q-16.45 3.8 -15.85 4.85 L-15.1 5.95 -14.2 7.0 Q-12.95 8.7 -12.45 13.1 -13.9 13.6 -14.85 14.3 L-16.55 13.15 -17.8 11.7 Q-18.6 10.45 -18.6 9.15 L-18.4 7.0 -18.15 5.25 -18.15 0.9 -18.3 1.0" fill="#c29c9c" fill-rule="evenodd" stroke="none"/>
    <path d="M15.5 -10.6 L15.55 -10.6 Q18.45 -10.5 21.25 -11.25 L24.4 -12.3 24.3 -12.1 23.55 -10.75 22.85 -9.05 21.15 -8.75 18.9 -8.4 15.85 -8.15 14.55 -8.15 9.5 -8.5 8.6 -8.7 8.4 -9.95 7.85 -11.55 9.0 -11.25 14.75 -10.65 15.5 -10.6 M6.9 13.0 Q10.65 12.0 14.8 12.0 L20.05 12.6 Q23.7 13.15 24.5 13.6 L28.8 15.2 Q32.35 16.4 33.2 16.4 L45.35 14.4 45.6 15.2 45.75 15.65 42.9 15.95 39.4 16.3 29.9 16.85 27.0 16.4 Q24.7 14.6 23.3 13.8 L10.7 13.4 6.95 13.7 6.9 13.0 M24.85 7.7 L24.45 7.95 22.9 9.0 21.45 8.0 19.6 6.3 19.15 5.85 15.1 1.6 Q15.55 1.75 16.35 1.15 L16.9 0.75 24.85 7.7 M-24.9 -8.55 L-19.9 -8.35 -16.05 -8.85 -15.9 -8.9 -14.75 -9.25 -15.2 -7.4 -15.35 -6.6 -15.35 -6.55 -16.2 -6.25 -17.25 -5.95 -20.35 -5.6 -20.4 -5.6 -20.8 -5.6 -26.15 -6.3 -26.8 -6.5 -28.65 -7.0 -28.65 -7.55 -28.65 -9.35 -26.9 -8.85 -24.9 -8.55 M-30.8 13.0 L-29.0 13.05 -23.75 12.55 -23.65 12.55 -21.5 11.95 -19.2 10.95 -18.3 1.1 -18.3 1.0 -18.15 0.9 -18.15 5.25 -18.4 7.0 -18.6 9.15 Q-18.6 10.45 -17.8 11.7 L-16.55 13.15 -14.85 14.3 -16.0 15.3 Q-16.8 16.3 -16.9 18.0 L-16.95 18.25 Q-16.95 19.15 -17.35 20.05 L-18.05 21.1 -21.35 22.95 Q-24.05 24.2 -26.8 24.55 L-26.8 24.45 Q-24.0 23.5 -22.25 22.3 -18.6 19.8 -18.6 16.1 L-18.8 14.15 -19.0 12.95 -19.15 12.45 -23.65 13.55 -27.1 14.1 -27.65 14.05 -29.65 13.45 -30.8 13.0" fill="#b38484" fill-rule="evenodd" stroke="none"/>
    <path d="M21.25 -11.25 L23.0 -16.75 23.1 -17.1 25.15 -22.9 31.35 -24.6 27.7 -17.55 26.3 -13.55 26.05 -13.1 24.55 -12.35 24.4 -12.3 21.25 -11.25 M28.05 5.75 L28.05 5.7 28.85 4.7 28.9 4.6 29.85 3.6 29.9 3.5 29.95 3.45 30.6 2.75 Q32.2 4.05 33.4 5.75 L34.5 6.5 32.5 6.6 32.4 6.7 Q33.0 7.2 35.15 7.7 L36.65 8.05 38.3 8.2 41.8 7.7 42.3 7.6 42.9 8.65 42.9 8.7 34.6 9.4 33.9 9.4 32.65 9.1 31.7 8.8 30.0 7.4 28.05 5.75 M21.9 -4.45 L21.5 -4.2 20.7 -3.65 19.5 -2.8 18.9 -4.3 18.9 -4.45 Q19.0 -5.45 20.65 -6.05 L20.9 -6.1 22.2 -6.55 22.05 -4.95 22.05 -4.85 22.05 -4.6 21.9 -4.45 M-28.5 -20.0 L-27.6 -13.95 -26.9 -8.85 -28.65 -9.35 Q-29.7 -9.8 -30.1 -10.35 -30.2 -12.85 -31.45 -16.45 L-33.25 -21.35 Q-31.95 -20.75 -29.95 -20.3 L-28.5 -20.0 M-29.1 -3.65 L-28.25 -3.45 -26.7 -3.35 -25.9 -3.0 -25.75 -2.85 Q-25.15 -2.25 -25.35 -0.95 L-28.2 -1.45 -29.35 -1.75 -29.6 -1.85 -29.25 -3.0 -29.1 -3.65 M-36.85 11.3 L-36.3 11.8 -36.6 11.6 -36.35 12.0 -36.2 12.2 -37.3 11.35 -37.05 11.05 -36.85 11.3 M-41.65 15.2 L-40.65 14.35 -40.2 14.0 -40.2 14.05 Q-40.2 15.45 -37.55 16.15 -36.7 16.15 -35.9 15.6 -35.0 14.95 -34.1 13.6 L-34.05 13.6 -32.6 14.15 -28.55 15.05 -30.65 17.25 -31.15 17.75 -32.05 18.5 Q-34.0 19.95 -35.75 19.95 -36.8 19.95 -39.4 18.85 L-40.2 18.5 -40.65 18.3 Q-42.25 17.4 -42.25 16.75 -42.25 16.3 -41.65 15.2" fill="#e0cdcd" fill-rule="evenodd" stroke="none"/>
    <path d="M34.5 6.5 L38.35 7.15 41.5 6.85 Q41.8 6.85 42.3 7.6 L41.8 7.7 38.3 8.2 36.65 8.05 35.15 7.7 Q33.0 7.2 32.4 6.7 L32.5 6.6 34.5 6.5 M-40.2 14.0 L-37.35 11.35 -37.3 11.35 -36.2 12.2 -34.1 13.6 Q-35.0 14.95 -35.9 15.6 -36.7 16.15 -37.55 16.15 -40.2 15.45 -40.2 14.05 L-40.2 14.0" fill="#f2eaea" fill-rule="evenodd" stroke="none"/>
    <path d="M15.55 -10.6 Q18.45 -10.5 21.25 -11.25 M25.15 -22.9 L25.0 -22.85 Q20.25 -21.65 15.5 -21.2 L12.35 -21.0 Q9.05 -20.85 5.85 -21.0 M9.0 -11.25 L14.75 -10.65 15.5 -10.6 M7.85 -11.55 L7.55 -11.6 6.6 -11.9 3.2 -21.15 5.85 -21.0 M8.6 -8.7 L8.4 -9.95 7.85 -11.55 9.0 -11.25 M22.85 -9.05 L23.55 -10.75 24.3 -12.1 M24.4 -12.3 L21.25 -11.25 M5.55 13.35 L5.15 10.65 5.1 9.25 Q5.1 5.6 7.15 2.15 9.25 -1.25 9.25 -1.7 L9.1 -4.2 8.6 -8.7 M45.35 14.4 L44.0 11.05 43.95 10.9 M22.2 -6.55 Q22.35 -7.8 22.85 -9.05 M25.15 -22.9 L31.35 -24.6 27.7 -17.55 26.3 -13.55 26.05 -13.1 24.55 -12.35 24.4 -12.3 M22.2 -6.55 L22.05 -4.95 22.05 -4.85 22.05 -4.6 M30.6 2.75 Q32.2 4.05 33.4 5.75 L34.5 6.5 38.35 7.15 41.5 6.85 Q41.8 6.85 42.3 7.6 L42.9 8.65 42.9 8.7 43.95 10.9 M45.35 14.4 L45.6 15.2 M-24.9 -8.55 L-19.9 -8.35 -16.05 -8.85 -15.9 -8.9 M-11.85 -19.15 L-15.65 -19.05 -25.5 -19.55 -28.5 -20.0 -29.95 -20.3 Q-31.95 -20.75 -33.25 -21.35 L-31.45 -16.45 Q-30.2 -12.85 -30.1 -10.35 -29.7 -9.8 -28.65 -9.35 L-26.9 -8.85 -24.9 -8.55 M-28.65 -7.0 L-28.65 -6.6 -29.0 -4.2 -29.1 -3.65 -29.25 -3.0 -29.6 -1.85 M-28.65 -7.0 L-28.65 -7.55 -28.65 -9.35 M-15.35 -6.55 L-15.35 -6.6 -15.2 -7.4 -14.75 -9.25 -15.9 -8.9 M-14.75 -9.25 Q-13.9 -9.6 -13.2 -10.0 L-9.3 -19.45 -10.0 -19.35 -11.85 -19.15 M-10.35 12.55 L-10.4 11.7 -10.6 8.85 Q-10.75 6.9 -11.5 5.6 -12.3 4.3 -12.8 3.85 -15.65 1.4 -15.65 -2.15 L-15.6 -4.2 -15.35 -6.55 M-45.4 21.85 L-45.45 21.5 -45.75 19.4 -45.65 19.15 -45.65 19.05 -44.55 17.75 -44.45 17.65 Q-43.6 16.8 -42.2 15.65 L-41.65 15.2 -40.65 14.35 -40.2 14.0 -37.35 11.35 M-37.3 11.35 L-37.05 11.05 M-36.6 11.6 L-36.3 11.8" fill="none" stroke="#a36a6a" stroke-linecap="round" stroke-linejoin="round" stroke-opacity="0.4" stroke-width="0.05"/>
  </g>
</svg>
