<?xml version="1.0" encoding="UTF-8" standalone="no"?>
<svg xmlns:xlink="http://www.w3.org/1999/xlink" height="118.55px" width="81.2px" xmlns="http://www.w3.org/2000/svg">
  <g transform="matrix(1.0, 0.0, 0.0, 1.0, 40.6, 59.25)">
    <path d="M0.15 -52.05 L4.1 -52.3 6.6 -52.65 2.5 -48.1 -2.15 -42.95 Q1.45 -43.95 5.8 -47.3 9.95 -50.6 14.85 -56.1 L15.15 -56.25 15.75 -56.55 Q15.65 -51.5 13.9 -47.75 L12.95 -45.85 Q11.0 -42.75 7.5 -39.85 L13.75 -44.05 12.6 -42.2 11.9 -41.0 11.2 -39.65 10.2 -38.05 6.75 -32.45 6.25 -31.7 -1.05 -19.7 Q-5.4 -11.95 -8.45 -3.15 L-2.2 -12.3 -5.05 1.6 -7.05 11.8 Q-8.4 18.15 -9.6 21.55 L-10.0 22.6 -12.9 28.85 Q-15.3 33.95 -15.5 35.05 L-15.4 35.05 Q-11.65 33.45 -7.1 27.9 L-6.85 27.55 0.1 17.95 0.2 18.05 0.3 18.4 Q0.3 19.65 -2.95 26.9 L-4.4 30.1 -6.85 35.6 -7.6 37.25 Q-10.15 41.55 -14.0 44.0 -18.1 46.65 -22.55 46.65 -30.9 46.65 -36.05 41.9 -39.85 38.4 -40.45 34.0 L-40.55 33.0 Q-40.5 31.0 -40.05 28.75 L-40.0 28.5 -39.7 27.05 -39.35 25.6 -38.55 22.9 -38.55 24.4 Q-38.55 26.8 -38.05 28.45 -37.45 30.6 -32.2 31.5 -27.0 32.35 -24.65 26.2 -22.3 20.05 -19.5 14.55 -16.7 9.05 -13.05 0.95 L-13.25 0.85 -17.65 4.3 -23.15 8.05 -23.15 7.85 -17.55 -0.2 -16.3 -2.05 Q-11.6 -9.35 -9.65 -14.0 -8.55 -16.65 -5.25 -21.65 -2.2 -26.2 -1.85 -27.5 L0.2 -33.6 1.4 -36.45 Q2.5 -38.95 3.95 -41.5 L5.4 -43.85 -1.15 -39.6 -9.75 -33.55 -12.1 -31.9 -12.1 -32.05 -11.45 -33.4 Q-10.0 -36.1 -6.3 -40.4 -2.05 -45.25 0.25 -46.3 -2.35 -45.3 -3.65 -45.15 L-7.15 -45.2 -6.95 -45.55 -8.55 -45.3 -10.6 -44.8 -11.55 -44.8 -8.6 -47.4 -8.7 -47.5 -10.8 -46.75 -12.4 -46.7 Q-14.3 -46.7 -18.1 -47.6 L-19.2 -47.85 -21.95 -43.7 Q-25.5 -37.95 -27.1 -33.4 L-27.5 -32.15 Q-28.8 -28.65 -31.35 -23.05 L-31.6 -22.3 -30.55 -28.05 -29.55 -32.25 -28.5 -36.85 -28.5 -37.05 -28.25 -37.75 -26.65 -42.0 -23.4 -49.7 -22.9 -51.0 -22.5 -52.0 -22.0 -53.3 -21.05 -54.45 -19.3 -55.55 -19.25 -55.5 -18.55 -55.15 -18.35 -55.05 -21.95 -49.8 -17.05 -51.25 -14.0 -52.25 -13.8 -52.25 -18.35 -49.55 -18.35 -49.4 -18.1 -49.3 -17.55 -49.2 -8.5 -49.55 Q-7.9 -49.55 -6.0 -50.35 L-4.3 -51.0 -3.35 -51.3 -3.85 -50.75 -6.2 -47.85 -6.1 -47.65 -2.55 -50.0 -0.2 -51.8 0.15 -52.05 M27.35 -47.05 L28.25 -44.8 28.8 -38.55 28.8 -37.15 28.8 -36.65 28.85 -35.6 28.8 -35.15 28.85 -33.15 29.25 -27.65 29.8 -21.35 30.0 -19.1 30.35 -15.35 28.8 -18.4 Q28.15 -19.8 27.25 -22.45 L26.3 -25.25 Q25.1 -22.4 23.1 -16.2 L22.75 -15.05 Q20.8 -8.95 20.8 -7.25 20.8 -5.4 22.1 0.0 23.45 5.5 24.8 9.2 25.8 11.9 27.6 14.65 L29.45 17.2 30.85 18.5 35.9 13.6 36.75 12.75 Q38.4 15.6 40.5 18.2 L39.85 18.35 39.65 18.4 39.45 18.75 Q37.25 22.15 33.8 25.35 L32.8 26.25 Q29.0 29.45 26.3 29.55 L26.3 29.75 27.25 29.9 32.6 29.05 32.7 29.05 36.15 27.8 Q36.3 28.95 37.15 30.85 L36.2 31.6 32.75 34.1 Q29.45 34.1 26.0 32.25 23.7 31.05 21.35 29.05 L20.25 28.1 Q16.0 24.2 13.45 19.55 L13.45 19.45 13.55 19.45 Q15.95 19.45 20.25 21.35 L25.35 23.65 25.75 23.85 26.3 23.85 26.3 23.65 26.05 22.85 Q23.9 16.3 21.35 7.1 20.9 5.45 17.5 -1.8 14.7 -7.75 14.7 -10.6 14.7 -15.5 17.45 -22.55 L18.8 -25.75 Q22.9 -34.95 22.9 -40.55 L22.45 -46.45 Q21.95 -50.4 21.35 -52.55 L21.35 -52.6 21.55 -52.6 27.35 -47.05 M-34.15 9.0 L-34.15 8.9 -34.1 8.55 Q-34.9 7.6 -34.9 7.0 L-34.35 5.7 -31.35 8.6 -29.85 9.75 Q-28.15 10.9 -26.95 11.1 L-27.7 11.1 -27.9 11.1 -30.25 10.55 -34.15 9.0 M30.35 24.3 L28.8 24.5 25.65 24.8 24.3 24.75 Q22.6 24.55 20.85 23.9 18.6 23.1 17.35 21.95 L20.15 24.8 22.3 26.55 Q23.05 27.05 23.45 27.05 25.65 27.05 30.35 24.3 M-18.2 20.2 Q-21.8 26.6 -21.8 31.85 L-21.7 33.2 -21.45 34.65 Q-20.9 30.9 -17.95 25.2 L-14.0 17.55 -13.4 16.25 -9.85 7.0 Q-8.2 2.5 -7.6 -1.1 L-12.85 11.1 Q-13.75 13.15 -16.4 17.45 L-18.2 20.2" fill="#d2b6b6" fill-rule="evenodd" stroke="none"/>
    <path d="M6.6 -52.65 Q9.3 -53.2 11.15 -54.2 L14.85 -56.1 Q9.95 -50.6 5.8 -47.3 1.45 -43.95 -2.15 -42.95 L2.5 -48.1 6.6 -52.65 M15.75 -56.55 Q17.45 -57.35 18.6 -57.75 L18.65 -59.25 19.7 -59.25 20.05 -59.1 20.05 -59.25 21.0 -58.95 21.4 -58.75 21.7 -58.6 22.2 -58.25 24.1 -53.6 Q24.8 -51.95 26.55 -48.65 L27.35 -47.05 21.55 -52.6 21.35 -52.6 21.35 -52.55 Q21.95 -50.4 22.45 -46.45 L22.9 -40.55 Q22.9 -34.95 18.8 -25.75 L17.45 -22.55 Q14.7 -15.5 14.7 -10.6 14.7 -7.75 17.5 -1.8 20.9 5.45 21.35 7.1 23.9 16.3 26.05 22.85 L26.3 23.65 26.3 23.85 25.75 23.85 25.35 23.65 20.25 21.35 Q15.95 19.45 13.55 19.45 L13.45 19.45 13.45 19.55 Q16.0 24.2 20.25 28.1 L21.35 29.05 Q23.7 31.05 26.0 32.25 29.45 34.1 32.75 34.1 L36.2 31.6 37.15 30.85 38.0 32.65 40.25 37.3 40.2 37.55 40.05 38.15 38.9 38.7 Q34.4 40.75 30.0 40.75 24.9 40.75 22.05 39.0 20.9 38.3 19.7 37.0 18.4 35.55 17.0 33.35 L19.5 33.6 21.15 33.85 22.05 34.0 21.5 33.6 16.9 30.0 16.25 29.45 Q15.1 28.35 13.75 25.35 L11.35 20.1 Q9.75 16.15 9.75 14.05 9.75 13.2 9.95 13.0 10.65 12.75 12.8 13.95 L16.05 15.85 17.95 15.85 13.2 -1.0 Q9.95 -12.55 9.35 -16.35 L9.2 -17.7 Q9.2 -20.05 9.8 -24.05 10.4 -27.9 10.7 -28.25 L11.0 -28.55 Q11.4 -28.85 12.15 -29.15 L14.4 -29.95 Q17.8 -30.9 19.1 -31.7 L13.0 -31.7 Q17.2 -36.2 20.2 -40.9 L20.05 -41.0 19.1 -40.4 18.75 -40.2 16.95 -39.1 14.35 -37.4 14.35 -37.6 14.9 -39.8 15.3 -42.35 Q15.15 -41.5 14.25 -40.05 L14.15 -39.9 14.2 -40.45 Q14.4 -43.4 14.65 -43.8 L14.4 -43.85 12.6 -42.2 13.75 -44.05 7.5 -39.85 Q11.0 -42.75 12.95 -45.85 L13.9 -47.75 Q15.65 -51.5 15.75 -56.55 M40.5 18.2 L40.6 18.3 Q39.45 19.45 37.95 22.05 36.05 25.35 36.05 27.1 L36.15 27.8 32.7 29.05 32.6 29.05 27.25 29.9 26.3 29.75 26.3 29.55 Q29.0 29.45 32.8 26.25 L33.8 25.35 Q37.25 22.15 39.45 18.75 L39.65 18.4 39.85 18.35 40.5 18.2 M37.0 46.4 L35.55 48.2 28.6 55.2 Q24.15 58.9 19.6 58.9 L15.25 58.5 9.9 55.95 8.1 55.0 7.4 54.6 4.65 52.9 1.5 50.8 Q3.15 48.1 4.9 43.95 7.0 49.35 9.4 52.25 13.1 56.75 18.45 56.75 L20.15 56.65 Q25.1 55.95 31.25 51.3 L37.0 46.4 M-40.6 34.0 L-40.55 33.0 -40.45 34.0 -40.6 34.0 M-18.35 -55.05 Q-16.55 -54.25 -13.45 -53.5 L-12.3 -53.25 Q-6.35 -52.05 -0.8 -52.05 L0.15 -52.05 -0.2 -51.8 -2.55 -50.0 -6.1 -47.65 -6.2 -47.85 -3.85 -50.75 -3.35 -51.3 -4.3 -51.0 -6.0 -50.35 Q-7.9 -49.55 -8.5 -49.55 L-17.55 -49.2 -18.1 -49.3 -18.35 -49.4 -18.35 -49.55 -13.8 -52.25 -14.0 -52.25 -17.05 -51.25 -21.95 -49.8 -18.35 -55.05 M20.05 -59.1 L21.4 -58.75 20.05 -59.1 M-15.5 35.05 L-15.4 35.05 -15.5 35.05 M-18.2 20.2 L-16.4 17.45 Q-13.75 13.15 -12.85 11.1 L-7.6 -1.1 Q-8.2 2.5 -9.85 7.0 L-13.4 16.25 -14.0 17.55 -17.95 25.2 Q-20.9 30.9 -21.45 34.65 L-21.7 33.2 -21.8 31.85 Q-21.8 26.6 -18.2 20.2" fill="#c29c9c" fill-rule="evenodd" stroke="none"/>
    <path d="M1.5 50.8 L0.05 52.85 Q-1.95 55.5 -7.7 57.35 L-10.05 58.05 -10.4 58.15 -17.1 59.25 -17.6 59.25 -18.1 59.25 -19.65 59.3 Q-23.8 58.45 -27.2 56.45 L-27.95 55.95 Q-31.75 53.55 -34.75 49.6 -36.9 46.85 -38.25 44.0 -40.6 39.15 -40.6 34.0 L-40.45 34.0 Q-39.85 38.4 -36.05 41.9 -30.9 46.65 -22.55 46.65 -18.1 46.65 -14.0 44.0 -10.15 41.55 -7.6 37.25 L-6.85 35.6 -4.4 30.1 -2.95 26.9 Q0.3 19.65 0.3 18.4 L0.2 18.05 0.1 17.95 -6.85 27.55 -7.1 27.9 Q-11.65 33.45 -15.4 35.05 L-15.5 35.05 Q-15.3 33.95 -12.9 28.85 L-10.0 22.6 -9.6 21.55 Q-8.4 18.15 -7.05 11.8 L-5.05 1.6 -2.2 -12.3 -8.45 -3.15 Q-5.4 -11.95 -1.05 -19.7 L6.25 -31.7 6.75 -32.45 10.2 -38.05 11.2 -39.65 11.9 -41.0 12.6 -42.2 14.4 -43.85 14.65 -43.8 Q14.4 -43.4 14.2 -40.45 L14.15 -39.9 13.7 -39.2 13.3 -38.6 13.2 -38.1 10.75 -31.95 10.75 -31.9 10.25 -30.85 9.35 -28.85 7.5 -25.05 Q6.65 -23.25 6.05 -17.55 L6.0 -16.95 5.6 -10.8 Q5.6 -7.4 6.2 -1.65 L6.65 2.1 7.45 8.8 7.85 14.1 6.5 18.15 5.95 20.1 6.8 26.55 Q7.15 28.45 8.15 30.7 L8.85 32.25 9.35 33.3 Q8.35 34.9 5.6 42.25 L4.9 43.95 Q3.15 48.1 1.5 50.8 M-23.95 49.15 Q-22.9 50.35 -21.75 50.6 L-18.35 50.7 Q-10.85 50.7 -4.8 44.45 -0.15 39.65 1.0 34.45 -5.3 41.8 -9.4 44.6 -15.35 48.6 -23.95 49.15" fill="url(#gradient0)" fill-rule="evenodd" stroke="none"/>
    <path d="M14.15 -39.9 L14.25 -40.05 Q15.15 -41.5 15.3 -42.35 L14.9 -39.8 14.35 -37.6 14.35 -37.4 16.95 -39.1 18.75 -40.2 14.75 -36.0 10.8 -31.9 10.75 -31.95 13.2 -38.1 13.3 -38.6 13.7 -39.2 14.15 -39.9 M9.35 -28.85 L10.25 -30.85 10.75 -31.9 Q11.25 -31.35 12.4 -31.0 L13.75 -30.75 11.25 -29.65 9.35 -28.85 M6.2 -1.65 Q5.6 -7.4 5.6 -10.8 L6.0 -16.95 7.4 -9.05 8.1 -4.9 10.05 5.9 9.95 5.95 7.3 0.8 6.2 -1.65" fill="#aa7777" fill-rule="evenodd" stroke="none"/>
    <path d="M40.05 38.15 L39.35 41.25 Q38.4 44.25 37.0 46.4 L31.25 51.3 Q25.1 55.95 20.15 56.65 L18.45 56.75 Q13.1 56.75 9.4 52.25 7.0 49.35 4.9 43.95 L5.6 42.25 Q8.35 34.9 9.35 33.3 L8.85 32.25 8.15 30.7 Q7.15 28.45 6.8 26.55 L5.95 20.1 6.5 18.15 7.85 14.1 7.45 8.8 6.65 2.1 6.2 -1.65 7.3 0.8 9.95 5.95 10.05 5.9 8.1 -4.9 7.4 -9.05 6.0 -16.95 6.05 -17.55 Q6.65 -23.25 7.5 -25.05 L9.35 -28.85 11.25 -29.65 13.75 -30.75 12.4 -31.0 Q11.25 -31.35 10.75 -31.9 L10.75 -31.95 10.8 -31.9 14.75 -36.0 18.75 -40.2 19.1 -40.4 20.05 -41.0 20.2 -40.9 Q17.2 -36.2 13.0 -31.7 L19.1 -31.7 Q17.8 -30.9 14.4 -29.95 L12.15 -29.15 Q11.4 -28.85 11.0 -28.55 L10.7 -28.25 Q10.4 -27.9 9.8 -24.05 9.2 -20.05 9.2 -17.7 L9.35 -16.35 Q9.95 -12.55 13.2 -1.0 L17.95 15.85 16.05 15.85 12.8 13.95 Q10.65 12.75 9.95 13.0 9.75 13.2 9.75 14.05 9.75 16.15 11.35 20.1 L13.75 25.35 Q15.1 28.35 16.25 29.45 L16.9 30.0 21.5 33.6 22.05 34.0 21.15 33.85 19.5 33.6 17.0 33.35 Q18.4 35.55 19.7 37.0 20.9 38.3 22.05 39.0 24.9 40.75 30.0 40.75 34.4 40.75 38.9 38.7 L40.05 38.15" fill="url(#gradient1)" fill-rule="evenodd" stroke="none"/>
    <path d="M30.35 -15.35 L31.35 -3.95 Q31.65 1.7 34.3 7.95 35.4 10.45 36.75 12.75 L35.9 13.6 30.85 18.5 29.45 17.2 27.6 14.65 Q25.8 11.9 24.8 9.2 23.45 5.5 22.1 0.0 20.8 -5.4 20.8 -7.25 20.8 -8.95 22.75 -15.05 L23.1 -16.2 Q25.1 -22.4 26.3 -25.25 L27.25 -22.45 Q28.15 -19.8 28.8 -18.4 L30.35 -15.35 M-38.55 22.9 L-38.25 22.05 -38.1 21.5 -34.15 9.0 -30.25 10.55 -27.9 11.1 -27.7 11.1 -26.95 11.1 Q-28.15 10.9 -29.85 9.75 L-31.35 8.6 -34.35 5.7 -33.85 4.7 -32.45 1.6 Q-31.5 -1.35 -31.6 -6.9 L-31.6 -7.9 -31.6 -11.1 -31.65 -13.4 -31.65 -13.8 -31.75 -14.9 -31.95 -18.05 -31.6 -22.3 -31.35 -23.05 Q-28.8 -28.65 -27.5 -32.15 L-27.1 -33.4 Q-25.5 -37.95 -21.95 -43.7 L-19.2 -47.85 -18.1 -47.6 Q-14.3 -46.7 -12.4 -46.7 L-10.8 -46.75 -8.7 -47.5 -8.6 -47.4 -11.55 -44.8 -10.6 -44.8 -8.55 -45.3 -6.95 -45.55 -7.15 -45.2 -3.65 -45.15 Q-2.35 -45.3 0.25 -46.3 -2.05 -45.25 -6.3 -40.4 -10.0 -36.1 -11.45 -33.4 L-12.1 -32.05 -12.1 -31.9 -9.75 -33.55 -1.15 -39.6 5.4 -43.85 3.95 -41.5 Q2.5 -38.95 1.4 -36.45 L0.2 -33.6 -1.85 -27.5 Q-2.2 -26.2 -5.25 -21.65 -8.55 -16.65 -9.65 -14.0 -11.6 -9.35 -16.3 -2.05 L-17.55 -0.2 -23.15 7.85 -23.15 8.05 -17.65 4.3 -13.25 0.85 -13.05 0.95 Q-16.7 9.05 -19.5 14.55 -22.3 20.05 -24.65 26.2 -27.0 32.35 -32.2 31.5 -37.45 30.6 -38.05 28.45 -38.55 26.8 -38.55 24.4 L-38.55 22.9 M30.35 24.3 Q25.65 27.05 23.45 27.05 23.05 27.05 22.3 26.55 L20.15 24.8 17.35 21.95 Q18.6 23.1 20.85 23.9 22.6 24.55 24.3 24.75 L25.65 24.8 28.8 24.5 30.35 24.3" fill="#e0cdcd" fill-rule="evenodd" stroke="none"/>
    <path d="M-28.5 -36.85 L-28.55 -36.9 -28.5 -37.05 -28.5 -36.85" fill="#b38484" fill-rule="evenodd" stroke="none"/>
    <path d="M-23.95 49.15 Q-15.35 48.6 -9.4 44.6 -5.3 41.8 1.0 34.45 -0.15 39.65 -4.8 44.45 -10.85 50.7 -18.35 50.7 L-21.75 50.6 Q-22.9 50.35 -23.95 49.15" fill="#c29d9d" fill-rule="evenodd" stroke="none"/>
    <path d="M-10.05 58.05 L-10.3 58.15 -10.4 58.15 -10.05 58.05" fill="#181512" fill-rule="evenodd" stroke="none"/>
    <path d="M0.15 -52.05 L4.1 -52.3 6.6 -52.65 Q9.3 -53.2 11.15 -54.2 L14.85 -56.1 M15.15 -56.25 L15.75 -56.55 Q17.45 -57.35 18.6 -57.75 L18.65 -59.25 19.7 -59.25 20.05 -59.1 20.05 -59.25 21.0 -58.95 21.4 -58.75 21.7 -58.6 22.2 -58.25 24.1 -53.6 Q24.8 -51.95 26.55 -48.65 L27.35 -47.05 28.25 -44.8 28.8 -38.55 28.8 -37.15 28.8 -36.65 28.85 -35.6 28.8 -35.15 28.85 -33.15 29.25 -27.65 29.8 -21.35 30.0 -19.1 30.35 -15.35 31.35 -3.95 Q31.65 1.7 34.3 7.95 35.4 10.45 36.75 12.75 38.4 15.6 40.5 18.2 L40.6 18.3 Q39.45 19.45 37.95 22.05 36.05 25.35 36.05 27.1 L36.15 27.8 Q36.3 28.95 37.15 30.85 L38.0 32.65 40.25 37.3 40.2 37.55 40.05 38.15 39.35 41.25 Q38.4 44.25 37.0 46.4 L35.55 48.2 28.6 55.2 Q24.15 58.9 19.6 58.9 L15.25 58.5 9.9 55.95 8.1 55.0 7.4 54.6 4.65 52.9 1.5 50.8 0.05 52.85 Q-1.95 55.5 -7.7 57.35 L-10.05 58.05 -10.3 58.15 -10.4 58.15 -17.1 59.25 -17.6 59.25 -18.1 59.25 -19.65 59.3 Q-23.8 58.45 -27.2 56.45 L-27.95 55.95 Q-31.75 53.55 -34.75 49.6 -36.9 46.85 -38.25 44.0 -40.6 39.15 -40.6 34.0 L-40.55 33.0 Q-40.5 31.0 -40.05 28.75 L-40.0 28.5 -39.7 27.05 M-39.35 25.6 L-38.55 22.9 -38.25 22.05 -38.1 21.5 -34.15 9.0 -34.15 8.9 -34.1 8.55 Q-34.9 7.6 -34.9 7.0 L-34.35 5.7 -33.85 4.7 -32.45 1.6 Q-31.5 -1.35 -31.6 -6.9 L-31.6 -7.9 -31.6 -11.1 -31.65 -13.4 -31.65 -13.8 -31.75 -14.9 -31.95 -18.05 -31.6 -22.3 -30.55 -28.05 -29.55 -32.25 -28.5 -36.85 -28.55 -36.9 -28.5 -37.05 -28.25 -37.75 -26.65 -42.0 -23.4 -49.7 M-22.9 -51.0 L-22.5 -52.0 -22.0 -53.3 -21.05 -54.45 -19.3 -55.55 -19.5 -55.7 -19.0 -55.7 -19.3 -55.55 -19.25 -55.5 -18.55 -55.15 -18.35 -55.05 Q-16.55 -54.25 -13.45 -53.5 L-12.3 -53.25 Q-6.35 -52.05 -0.8 -52.05 L0.15 -52.05 M21.4 -58.75 L20.05 -59.1 M13.7 -39.2 L13.3 -38.6 13.2 -38.1 10.75 -31.95 M6.0 -16.95 L6.05 -17.55 Q6.65 -23.25 7.5 -25.05 L9.35 -28.85 10.25 -30.85 10.75 -31.9 10.75 -31.95 M6.0 -16.95 L5.6 -10.8 Q5.6 -7.4 6.2 -1.65 M4.9 43.95 L5.6 42.25 Q8.35 34.9 9.35 33.3 L8.85 32.25 8.15 30.7 Q7.15 28.45 6.8 26.55 L5.95 20.1 6.5 18.15 7.85 14.1 7.45 8.8 6.65 2.1 6.2 -1.65 M4.9 43.95 Q3.15 48.1 1.5 50.8 M-28.5 -36.85 L-28.5 -37.05" fill="none" stroke="#a36a6a" stroke-linecap="round" stroke-linejoin="round" stroke-opacity="0.4" stroke-width="0.05"/>
    <path d="M-19.3 -55.55 L-19.25 -55.5 -18.55 -55.15 -18.35 -55.05 Q-16.55 -54.25 -13.45 -53.5 L-12.3 -53.25 Q-6.35 -52.05 -0.8 -52.05 L0.15 -52.05 4.1 -52.3 6.6 -52.65 Q9.3 -53.2 11.15 -54.2 L13.2 -55.25 13.7 -46.4 Q13.7 -42.3 12.8 -39.35 11.95 -36.7 11.85 -34.5 L11.65 -33.95 10.75 -31.95 10.75 -31.9 10.25 -30.85 9.35 -28.85 7.5 -25.05 Q6.65 -23.25 6.05 -17.55 L6.0 -16.95 5.6 -10.8 Q5.6 -7.4 6.2 -1.65 L6.65 2.1 7.45 8.8 7.85 14.1 6.5 18.15 5.95 20.1 6.8 26.55 Q7.15 28.45 8.15 30.7 L8.85 32.25 9.35 33.3 Q8.35 34.9 5.6 42.25 L4.9 43.95 Q3.15 48.1 1.5 50.8 L0.05 52.85 Q-1.95 55.5 -7.7 57.35 L-10.05 58.05 -10.4 58.15 -17.1 59.25 -17.6 59.25 -18.1 59.25 -19.65 59.3 Q-23.8 58.45 -27.2 56.45 L-27.95 55.95 Q-31.75 53.55 -34.75 49.6 -36.9 46.85 -38.25 44.0 -40.6 39.15 -40.6 34.0 L-40.55 33.0 Q-40.5 31.0 -40.05 28.75 L-40.0 28.5 -39.7 27.05 -39.35 25.6 -38.55 22.9 -38.25 22.05 -38.1 21.5 -34.15 9.0 -34.15 8.9 -34.1 8.55 Q-34.9 7.6 -34.9 7.0 L-34.35 5.7 -33.85 4.7 -32.45 1.6 Q-31.5 -1.35 -31.6 -6.9 L-31.6 -7.9 -31.6 -11.1 -31.65 -13.4 -31.65 -13.8 -31.75 -14.9 -31.95 -18.05 -31.6 -22.3 -30.55 -28.05 -29.55 -32.25 -28.5 -36.85 -28.5 -37.05 -28.25 -37.75 -26.65 -42.0 -23.4 -49.7 -22.9 -51.0 -22.5 -52.0 -22.0 -53.3 -21.05 -54.45 -19.3 -55.55" fill="url(#gradient2)" fill-rule="evenodd" stroke="none"/>
    <path d="M13.2 -55.25 L14.85 -56.1 15.15 -56.25 15.75 -56.55 Q17.45 -57.35 18.6 -57.75 L18.2 -59.25 19.7 -59.25 20.05 -59.1 21.4 -58.75 21.7 -58.6 22.2 -58.25 24.1 -53.6 Q24.8 -51.95 26.55 -48.65 L27.35 -47.05 28.25 -44.8 28.8 -38.55 28.8 -37.15 28.8 -36.65 28.85 -35.6 28.8 -35.15 28.85 -33.15 29.25 -27.65 29.8 -21.35 30.0 -19.1 30.35 -15.35 31.35 -3.95 Q31.65 1.7 34.3 7.95 35.4 10.45 36.75 12.75 38.4 15.6 40.5 18.2 L40.6 18.3 Q39.45 19.45 37.95 22.05 36.05 25.35 36.05 27.1 L36.15 27.8 Q36.3 28.95 37.15 30.85 L38.0 32.65 40.25 37.3 40.2 37.55 40.05 38.15 39.35 41.25 Q38.4 44.25 37.0 46.4 L35.55 48.2 28.6 55.2 Q24.15 58.9 19.6 58.9 L15.25 58.5 9.9 55.95 8.1 55.0 7.4 54.6 4.65 52.9 1.5 50.8 Q3.15 48.1 4.9 43.95 L5.6 42.25 Q8.35 34.9 9.35 33.3 L8.85 32.25 8.15 30.7 Q7.15 28.45 6.8 26.55 L5.95 20.1 6.5 18.15 7.85 14.1 7.45 8.8 6.65 2.1 6.2 -1.65 Q5.6 -7.4 5.6 -10.8 L6.0 -16.95 6.05 -17.55 Q6.65 -23.25 7.5 -25.05 L9.35 -28.85 10.25 -30.85 10.75 -31.9 10.75 -31.95 11.65 -33.95 11.85 -33.95 11.85 -34.5 13.2 -38.1 13.3 -38.6 13.7 -39.2 13.3 -38.6 13.2 -38.1 11.85 -34.5 Q11.95 -36.7 12.8 -39.35 13.7 -42.3 13.7 -46.4 L13.2 -55.25" fill="url(#gradient3)" fill-rule="evenodd" stroke="none"/>
    <path d="M-10.05 58.05 L-10.3 58.15 -10.4 58.15 -10.05 58.05 M-28.5 -36.85 L-28.55 -36.9 -28.5 -37.05 -28.5 -36.85 M11.85 -34.5 L11.85 -33.95 11.65 -33.95 11.85 -34.5" fill="#4f3131" fill-rule="evenodd" stroke="none"/>
    <path d="M-19.3 -55.55 L-19.25 -55.5 -18.55 -55.15 -18.35 -55.05 Q-16.55 -54.25 -13.45 -53.5 L-12.3 -53.25 Q-6.35 -52.05 -0.8 -52.05 L0.15 -52.05 4.1 -52.3 6.6 -52.65 Q9.3 -53.2 11.15 -54.2 L13.2 -55.25 14.85 -56.1 M15.15 -56.25 L15.75 -56.55 Q17.45 -57.35 18.6 -57.75 L18.2 -59.25 19.7 -59.25 20.05 -59.1 21.4 -58.75 21.7 -58.6 22.2 -58.25 24.1 -53.6 Q24.8 -51.95 26.55 -48.65 L27.35 -47.05 28.25 -44.8 28.8 -38.55 28.8 -37.15 28.8 -36.65 28.85 -35.6 28.8 -35.15 28.85 -33.15 29.25 -27.65 29.8 -21.35 30.0 -19.1 30.35 -15.35 31.35 -3.95 Q31.65 1.7 34.3 7.95 35.4 10.45 36.75 12.75 38.4 15.6 40.5 18.2 L40.6 18.3 Q39.45 19.45 37.95 22.05 36.05 25.35 36.05 27.1 L36.15 27.8 Q36.3 28.95 37.15 30.85 L38.0 32.65 40.25 37.3 40.2 37.55 40.05 38.15 39.35 41.25 Q38.4 44.25 37.0 46.4 L35.55 48.2 28.6 55.2 Q24.15 58.9 19.6 58.9 L15.25 58.5 9.9 55.95 8.1 55.0 7.4 54.6 4.65 52.9 1.5 50.8 0.05 52.85 Q-1.95 55.5 -7.7 57.35 L-10.05 58.05 -10.3 58.15 -10.4 58.15 -17.1 59.25 -17.6 59.25 -18.1 59.25 -19.65 59.3 Q-23.8 58.45 -27.2 56.45 L-27.95 55.95 Q-31.75 53.55 -34.75 49.6 -36.9 46.85 -38.25 44.0 -40.6 39.15 -40.6 34.0 L-40.55 33.0 Q-40.5 31.0 -40.05 28.75 L-40.0 28.5 -39.7 27.05 M-39.35 25.6 L-38.55 22.9 -38.25 22.05 -38.1 21.5 -34.15 9.0 -34.15 8.9 -34.1 8.55 Q-34.9 7.6 -34.9 7.0 L-34.35 5.7 -33.85 4.7 -32.45 1.6 Q-31.5 -1.35 -31.6 -6.9 L-31.6 -7.9 -31.6 -11.1 -31.65 -13.4 -31.65 -13.8 -31.75 -14.9 -31.95 -18.05 -31.6 -22.3 -30.55 -28.05 -29.55 -32.25 -28.5 -36.85 -28.55 -36.9 -28.5 -37.05 -28.25 -37.75 -26.65 -42.0 -23.4 -49.7 M-22.9 -51.0 L-22.5 -52.0 -22.0 -53.3 -21.05 -54.45 -19.3 -55.55 -19.5 -55.7 -19.0 -55.7 -19.3 -55.55 M11.85 -34.5 L13.2 -38.1 13.3 -38.6 13.7 -39.2 M11.65 -33.95 L10.75 -31.95 10.75 -31.9 10.25 -30.85 9.35 -28.85 7.5 -25.05 Q6.65 -23.25 6.05 -17.55 L6.0 -16.95 5.6 -10.8 Q5.6 -7.4 6.2 -1.65 L6.65 2.1 7.45 8.8 7.85 14.1 6.5 18.15 5.95 20.1 6.8 26.55 Q7.15 28.45 8.15 30.7 L8.85 32.25 9.35 33.3 Q8.35 34.9 5.6 42.25 L4.9 43.95 Q3.15 48.1 1.5 50.8 M11.65 -33.95 L11.85 -34.5 M-28.5 -37.05 L-28.5 -36.85" fill="none" stroke="#a36a6a" stroke-linecap="round" stroke-linejoin="round" stroke-opacity="0.4" stroke-width="0.05"/>
  </g>
  <defs>
    <linearGradient gradientTransform="matrix(0.0226, -0.039, 0.0237, 0.0137, -33.05, 30.25)" gradientUnits="userSpaceOnUse" id="gradient0" spreadMethod="pad" x1="-819.2" x2="819.2">
      <stop offset="0.0" stop-color="#b38484"/>
      <stop offset="1.0" stop-color="#c29d9d"/>
    </linearGradient>
    <linearGradient gradientTransform="matrix(0.0, 0.0707, -0.0215, 0.0, 22.55, 24.4)" gradientUnits="userSpaceOnUse" id="gradient1" spreadMethod="pad" x1="-819.2" x2="819.2">
      <stop offset="0.0" stop-color="#b38484"/>
      <stop offset="1.0" stop-color="#c29d9d"/>
    </linearGradient>
    <linearGradient gradientTransform="matrix(-0.0365, -0.0808, 0.0304, -0.0137, 11.0, 34.75)" gradientUnits="userSpaceOnUse" id="gradient2" spreadMethod="pad" x1="-819.2" x2="819.2">
      <stop offset="0.0" stop-color="#a36a6a"/>
      <stop offset="1.0" stop-color="#a36a6a" stop-opacity="0.0"/>
    </linearGradient>
    <linearGradient gradientTransform="matrix(0.0217, -0.145, 0.0236, 0.0035, 23.4, 24.45)" gradientUnits="userSpaceOnUse" id="gradient3" spreadMethod="pad" x1="-819.2" x2="819.2">
      <stop offset="0.0" stop-color="#a36a6a"/>
      <stop offset="1.0" stop-color="#a36a6a" stop-opacity="0.0"/>
    </linearGradient>
  </defs>
</svg>
