<?xml version="1.0" encoding="UTF-8" standalone="no"?>
<svg xmlns:xlink="http://www.w3.org/1999/xlink" height="283.85px" width="203.55px" xmlns="http://www.w3.org/2000/svg">
  <g transform="matrix(1.0, 0.0, 0.0, 1.0, 192.85, 283.85)">
    <path d="M-144.85 -55.3 L-140.4 -58.85 -138.4 -60.45 -139.35 -37.15 -143.6 -31.6 Q-148.1 -25.65 -148.95 -23.3 -150.2 -20.15 -153.85 -5.95 L-154.1 -4.75 -175.4 -4.75 Q-172.4 -17.0 -169.35 -26.0 L-168.95 -26.3 Q-148.45 -39.4 -146.15 -43.75 -145.15 -45.65 -145.15 -49.45 L-144.85 -55.3 M-189.15 -4.75 Q-186.1 -10.7 -183.25 -13.95 -181.8 -16.65 -180.65 -17.95 -179.3 -19.5 -173.3 -23.45 L-173.75 -22.45 Q-177.4 -13.5 -179.7 -4.75 L-189.15 -4.75 M-2.35 -51.9 L-2.4 -49.95 Q-6.9 -46.15 -10.2 -41.1 -19.2 -27.5 -21.7 -4.75 L-24.25 -4.75 Q-23.9 -19.6 -18.15 -31.3 -12.85 -42.25 -2.35 -51.9" fill="#828cc2" fill-rule="evenodd" stroke="none"/>
    <path d="M-154.1 -4.75 L-153.85 -5.95 Q-150.2 -20.15 -148.95 -23.3 -148.1 -25.65 -143.6 -31.6 L-139.35 -37.15 -138.4 -60.45 -138.25 -60.6 Q-131.05 -66.45 -127.7 -69.75 L-125.05 -60.5 -124.3 -57.75 -122.75 -51.75 -128.4 -36.65 -122.85 -31.0 -122.55 -30.7 Q-124.95 -24.4 -133.95 -4.75 L-154.1 -4.75 M-17.15 -107.9 Q-11.4 -103.6 -1.45 -95.05 L-2.35 -51.9 Q-12.85 -42.25 -18.15 -31.3 -23.9 -19.6 -24.25 -4.75 L-47.3 -4.75 Q-43.55 -8.0 -42.4 -9.6 -41.9 -10.4 -40.9 -14.9 -39.95 -19.15 -39.95 -20.1 -39.8 -26.1 -44.85 -30.35 L-48.85 -32.85 Q-51.7 -34.3 -53.3 -34.3 -55.25 -34.35 -58.65 -32.6 -62.4 -30.7 -62.95 -30.6 -65.25 -30.1 -67.45 -27.05 L-70.9 -21.75 Q-72.9 -18.75 -73.75 -16.4 -74.6 -14.1 -74.65 -11.5 -74.7 -8.65 -73.1 -6.2 L-71.95 -4.75 -92.05 -4.75 -95.15 -16.55 Q-99.35 -32.85 -99.3 -34.0 -99.25 -35.65 -94.85 -41.15 L-89.2 -48.05 Q-88.3 -45.2 -87.25 -42.9 -85.75 -39.5 -84.75 -39.5 -83.5 -39.5 -49.65 -65.05 -41.95 -70.5 -33.65 -82.0 -28.5 -89.2 -23.7 -97.8 L-23.15 -98.65 Q-21.0 -101.7 -19.15 -104.65 L-17.75 -106.85 -17.15 -107.9 M-2.4 -49.95 L-3.3 -4.75 -21.7 -4.75 Q-19.2 -27.5 -10.2 -41.1 -6.9 -46.15 -2.4 -49.95 M-53.05 -30.15 Q-52.15 -28.6 -51.65 -28.0 L-48.65 -24.05 Q-47.2 -21.6 -47.25 -19.85 -47.2 -15.75 -49.2 -12.1 -53.15 -4.8 -63.6 -4.8 -65.8 -4.8 -68.35 -6.75 -71.3 -9.0 -71.25 -11.75 -71.25 -13.35 -70.15 -15.7 L-67.85 -19.7 Q-66.25 -18.45 -65.45 -19.9 L-64.65 -22.05 -63.95 -24.1 Q-63.35 -25.45 -62.2 -26.2 L-59.4 -28.1 -56.4 -29.95 Q-54.1 -31.1 -53.05 -30.15" fill="#7985b5" fill-rule="evenodd" stroke="none"/>
    <path d="M-166.1 -39.6 L-163.3 -41.4 Q-163.95 -39.2 -167.05 -32.6 L-169.35 -26.0 -173.3 -23.45 -167.3 -36.9 -166.1 -39.6" fill="#969be0" fill-rule="evenodd" stroke="none"/>
    <path d="M-163.3 -41.4 L-162.65 -41.85 Q-158.7 -44.55 -155.55 -46.95 L-154.7 -47.6 -153.65 -48.45 -153.15 -48.8 -149.55 -51.7 -149.45 -51.7 -149.45 -51.75 -145.6 -54.8 -144.85 -55.3 -145.15 -49.45 Q-145.15 -45.65 -146.15 -43.75 -148.45 -39.4 -168.95 -26.3 L-169.35 -26.0 -167.05 -32.6 Q-163.95 -39.2 -163.3 -41.4 M-166.1 -39.6 L-167.3 -36.9 -173.3 -23.45 Q-179.3 -19.5 -180.65 -17.95 -181.8 -16.65 -183.25 -13.95 -186.1 -10.7 -189.15 -4.75 L-192.85 -4.75 Q-191.2 -15.35 -186.25 -24.35 L-183.3 -29.05 -169.25 -37.6 -166.1 -39.6" fill="#8a92cf" fill-rule="evenodd" stroke="none"/>
    <path d="M-173.3 -23.45 L-169.35 -26.0 Q-172.4 -17.0 -175.4 -4.75 L-179.7 -4.75 Q-177.4 -13.5 -173.75 -22.45 L-173.3 -23.45" fill="#8f97d6" fill-rule="evenodd" stroke="none"/>
    <path d="M-124.8 -81.1 L-124.8 -88.15 -99.3 -107.5 -97.0 -109.15 Q-78.2 -122.95 -67.45 -129.3 -62.5 -132.2 -47.5 -143.6 L-43.3 -146.85 -40.2 -149.2 Q-32.55 -154.9 -26.25 -158.85 L-26.25 -149.2 -26.2 -143.6 -25.5 -124.55 -29.7 -118.25 Q-32.15 -114.85 -34.85 -111.8 L-37.3 -109.15 Q-41.4 -104.9 -46.4 -100.8 -63.0 -87.1 -89.45 -74.9 L-89.8 -75.55 Q-89.8 -74.9 -90.0 -74.7 L-90.35 -74.55 Q-90.1 -71.7 -94.9 -63.6 L-99.75 -55.95 -99.9 -55.7 -100.05 -55.7 -110.6 -55.35 -115.25 -55.3 -116.05 -55.3 Q-118.05 -56.85 -121.8 -62.7 L-124.55 -67.15 -124.7 -74.2 -124.8 -81.1" fill="#856a56" fill-rule="evenodd" stroke="none"/>
    <path d="M-25.5 -124.55 L-25.15 -125.25 -21.3 -131.4 -20.9 -131.15 Q-19.3 -126.9 -16.25 -109.3 L-16.35 -109.15 -17.15 -107.9 -17.75 -106.85 -20.1 -109.15 -29.7 -118.25 -25.5 -124.55" fill="#abb7ff" fill-rule="evenodd" stroke="none"/>
    <path d="M-23.7 -97.8 L-27.25 -100.4 Q-28.9 -101.5 -31.35 -104.85 L-34.35 -108.5 -46.4 -100.8 Q-41.4 -104.9 -37.3 -109.15 L-34.85 -111.8 Q-32.15 -114.85 -29.7 -118.25 L-20.1 -109.15 -17.75 -106.85 -19.15 -104.65 Q-21.0 -101.7 -23.15 -98.65 L-23.7 -97.8" fill="#a4aff5" fill-rule="evenodd" stroke="none"/>
    <path d="M-145.25 -58.3 L-146.45 -57.2 Q-144.15 -62.9 -133.95 -72.75 L-124.8 -81.1 -124.7 -74.2 -124.55 -67.15 -126.6 -70.95 -127.75 -73.5 -128.65 -72.8 -136.2 -66.35 -145.25 -58.3 M-46.4 -100.8 L-34.35 -108.5 -31.35 -104.85 Q-28.9 -101.5 -27.25 -100.4 L-23.7 -97.8 -24.4 -96.8 Q-27.6 -92.2 -32.25 -87.75 L-40.35 -80.2 Q-47.6 -73.3 -60.55 -64.0 L-79.95 -50.15 -81.3 -54.0 -85.1 -64.05 -87.8 -70.95 -89.45 -74.9 Q-63.0 -87.1 -46.4 -100.8" fill="#94a1de" fill-rule="evenodd" stroke="none"/>
    <path d="M-99.5 -4.75 L-101.8 -4.75 -109.55 -31.75 -106.35 -35.1 -104.35 -37.15 -103.8 -34.75 -102.8 -31.05 Q-102.85 -30.4 -103.9 -28.2 L-105.0 -25.7 Q-102.3 -14.2 -99.5 -4.75 M-89.45 -74.9 L-87.8 -70.95 -85.1 -64.05 -81.3 -54.0 -84.5 -51.45 -87.6 -54.5 Q-90.5 -57.45 -91.55 -59.1 -92.35 -57.55 -97.8 -51.75 L-100.5 -48.75 -100.05 -55.45 -99.9 -55.7 -99.75 -55.95 -94.9 -63.6 Q-90.1 -71.7 -90.35 -74.55 L-90.0 -74.7 -89.45 -74.9" fill="#5c648a" fill-rule="evenodd" stroke="none"/>
    <path d="M-100.05 -55.45 L-100.5 -48.75 -100.55 -47.8 -100.7 -46.25 -100.4 -41.1 -104.35 -37.15 -106.35 -35.1 -109.55 -31.75 Q-115.15 -26.05 -117.3 -24.7 L-122.55 -30.7 -122.45 -30.9 -122.85 -31.0 -128.4 -36.65 -122.75 -51.75 -121.3 -55.3 -121.25 -55.3 Q-121.3 -54.8 -120.75 -55.3 L-116.05 -55.3 -115.25 -55.3 -110.6 -55.35 -100.05 -55.7 -100.05 -55.45" fill="#e6e9f7" fill-rule="evenodd" stroke="none"/>
    <path d="M-140.4 -58.85 L-144.4 -58.4 -144.5 -58.4 -145.25 -58.3 -136.2 -66.35 -128.65 -72.8 -127.75 -73.5 -126.6 -70.95 -124.55 -67.15 -121.8 -62.7 Q-118.05 -56.85 -116.05 -55.3 L-120.75 -55.3 -121.25 -55.3 -121.3 -55.3 -122.75 -51.75 -124.3 -57.75 -125.05 -60.5 -127.7 -69.75 Q-131.05 -66.45 -138.25 -60.6 L-138.4 -60.45 -140.4 -58.85" fill="#535a7d" fill-rule="evenodd" stroke="none"/>
    <path d="M-47.3 -4.75 L-47.75 -4.35 Q-52.9 0.0 -55.3 0.0 -57.1 0.0 -57.35 -0.7 L-57.35 -1.7 -61.65 -1.3 Q-68.65 -1.3 -71.95 -4.75 L-73.1 -6.2 Q-74.7 -8.65 -74.65 -11.5 -74.6 -14.1 -73.75 -16.4 -72.9 -18.75 -70.9 -21.75 L-67.45 -27.05 Q-65.25 -30.1 -62.95 -30.6 -62.4 -30.7 -58.65 -32.6 -55.25 -34.35 -53.3 -34.3 -51.7 -34.3 -48.85 -32.85 L-44.85 -30.35 Q-39.8 -26.1 -39.95 -20.1 -39.95 -19.15 -40.9 -14.9 -41.9 -10.4 -42.4 -9.6 -43.55 -8.0 -47.3 -4.75 M-92.05 -4.75 L-99.5 -4.75 Q-102.3 -14.2 -105.0 -25.7 L-103.9 -28.2 Q-102.85 -30.4 -102.8 -31.05 L-103.8 -34.75 -104.35 -37.15 -100.4 -41.1 -100.7 -46.25 -100.55 -47.8 -100.5 -48.75 -97.8 -51.75 Q-92.35 -57.55 -91.55 -59.1 -90.5 -57.45 -87.6 -54.5 L-84.5 -51.45 -81.3 -54.0 -79.95 -50.15 -60.55 -64.0 Q-47.6 -73.3 -40.35 -80.2 L-32.25 -87.75 Q-27.6 -92.2 -24.4 -96.8 L-23.7 -97.8 Q-28.5 -89.2 -33.65 -82.0 -41.95 -70.5 -49.65 -65.05 -83.5 -39.5 -84.75 -39.5 -85.75 -39.5 -87.25 -42.9 -88.3 -45.2 -89.2 -48.05 L-94.85 -41.15 Q-99.25 -35.65 -99.3 -34.0 -99.35 -32.85 -95.15 -16.55 L-92.05 -4.75 M-53.05 -30.15 Q-54.1 -31.1 -56.4 -29.95 L-59.4 -28.1 -62.2 -26.2 Q-63.35 -25.45 -63.95 -24.1 L-64.65 -22.05 -65.45 -19.9 Q-66.25 -18.45 -67.85 -19.7 L-70.15 -15.7 Q-71.25 -13.35 -71.25 -11.75 -71.3 -9.0 -68.35 -6.75 -65.8 -4.8 -63.6 -4.8 -53.15 -4.8 -49.2 -12.1 -47.2 -15.75 -47.25 -19.85 -47.2 -21.6 -48.65 -24.05 L-51.65 -28.0 Q-52.15 -28.6 -53.05 -30.15" fill="#6b74a1" fill-rule="evenodd" stroke="none"/>
    <path d="M-101.8 -4.75 L-133.95 -4.75 Q-124.95 -24.4 -122.55 -30.7 L-117.3 -24.7 Q-115.15 -26.05 -109.55 -31.75 L-101.8 -4.75" fill="#c9ccd9" fill-rule="evenodd" stroke="none"/>
    <path d="M-40.2 -149.2 Q-32.55 -154.9 -26.25 -158.85 L-26.15 -166.4 M-26.25 -158.85 L-26.25 -149.2 M-26.25 -158.85 Q-20.95 -162.2 -16.55 -164.25" fill="none" stroke="#ffd500" stroke-linecap="round" stroke-linejoin="round" stroke-width="0.05"/>
    <path d="M-3.25 -262.2 Q3.8 -258.05 8.6 -253.65 L9.6 -248.15 Q11.0 -238.3 10.65 -226.05 L10.55 -224.2 Q6.1 -242.65 2.85 -251.95 -2.7 -254.6 -10.3 -256.9 -29.25 -262.65 -46.3 -261.95 L-48.15 -261.85 -55.1 -261.8 -48.05 -251.4 Q-41.35 -241.5 -39.6 -238.5 -41.1 -240.0 -62.7 -256.95 L-54.8 -237.6 -52.25 -231.25 Q-55.2 -233.7 -58.9 -236.35 -75.5 -248.0 -79.1 -251.25 L-79.3 -251.4 -79.4 -250.95 Q-78.5 -250.65 -73.85 -238.75 -69.4 -227.6 -69.0 -226.05 L-69.5 -226.15 -91.4 -249.35 -86.8 -234.3 Q-82.8 -220.65 -83.0 -218.95 -86.6 -224.2 -93.25 -232.6 -100.5 -241.9 -105.6 -246.75 L-100.6 -221.3 Q-102.1 -222.5 -106.75 -227.6 L-111.05 -232.45 -112.65 -234.25 -112.8 -234.45 -112.9 -234.0 Q-112.4 -231.05 -111.05 -226.75 -109.45 -221.6 -106.75 -214.55 L-105.3 -211.0 -104.25 -208.25 -104.2 -208.15 -103.3 -206.05 -99.15 -196.3 -98.5 -195.0 -101.2 -196.7 -101.8 -197.15 Q-106.1 -200.4 -110.6 -206.05 L-111.05 -206.55 -112.25 -208.15 -113.6 -210.0 -114.05 -210.7 -118.1 -216.75 -126.2 -230.1 -121.85 -217.45 -119.5 -211.15 -118.3 -208.15 -117.4 -206.05 -114.55 -199.55 -114.4 -199.25 -111.05 -192.95 -110.2 -191.55 -111.05 -192.25 Q-113.95 -194.85 -118.1 -199.95 L-118.35 -200.3 -122.8 -206.05 -124.4 -208.15 -127.75 -212.7 -129.75 -215.6 -132.45 -219.45 Q-144.85 -237.5 -148.9 -247.55 L-149.05 -246.95 Q-149.7 -245.7 -147.2 -239.15 -144.15 -230.9 -143.8 -223.9 L-143.6 -221.6 -143.2 -215.65 -142.6 -208.7 -142.5 -208.15 -142.2 -206.05 -142.1 -205.0 -142.5 -206.05 -143.35 -208.15 -146.4 -216.3 -148.65 -222.55 -150.3 -227.2 Q-155.85 -242.75 -158.2 -254.0 -157.65 -247.7 -154.35 -227.55 L-153.65 -223.5 -152.95 -219.1 -152.7 -217.45 -151.15 -208.15 -150.9 -206.5 -150.85 -206.2 -150.8 -206.05 -150.1 -201.65 -151.75 -203.7 -152.95 -206.05 -153.25 -206.65 -153.4 -207.0 -153.9 -208.15 -155.8 -212.85 -157.75 -218.45 -159.6 -224.65 Q-161.15 -230.15 -162.55 -236.45 L-162.55 -236.55 -162.65 -236.45 -163.3 -235.0 -164.4 -239.7 Q-166.05 -246.8 -165.65 -250.0 -167.1 -244.9 -169.2 -233.85 L-172.3 -217.65 -173.7 -210.55 -174.2 -208.15 -174.65 -206.05 -176.05 -199.95 -178.3 -190.45 -178.65 -189.6 -179.3 -187.95 -178.25 -206.05 -178.2 -207.25 -175.85 -219.5 -178.9 -211.55 -179.0 -211.3 -180.25 -208.15 -181.15 -206.05 -182.55 -203.1 -182.4 -204.85 -182.3 -206.05 -182.15 -208.15 -182.05 -209.0 -181.35 -212.0 -178.55 -222.4 -176.9 -227.95 -175.25 -234.0 -172.05 -244.6 -172.2 -244.65 -178.8 -228.3 -181.05 -222.9 -182.75 -218.95 -182.15 -223.1 -181.3 -228.8 -180.75 -232.75 Q-177.55 -242.35 -172.5 -252.7 L-169.25 -259.15 -166.2 -264.75 -165.5 -260.45 -164.7 -256.3 -163.9 -252.8 Q-162.0 -244.45 -160.65 -240.0 L-160.85 -242.75 -161.0 -247.45 -160.05 -255.1 -158.7 -262.2 -154.8 -249.05 -150.6 -235.8 -150.15 -235.7 Q-151.25 -238.6 -152.3 -249.3 -153.35 -259.5 -153.05 -261.15 L-153.0 -261.55 -133.3 -233.95 Q-136.45 -242.1 -138.8 -252.55 -140.7 -261.0 -141.3 -266.6 -140.05 -265.25 -131.05 -251.05 -123.55 -239.25 -117.15 -234.8 -123.9 -242.4 -128.95 -258.6 L-131.85 -269.1 -128.95 -269.65 Q-124.5 -262.9 -111.05 -247.2 L-108.05 -243.75 -107.65 -243.65 -107.8 -243.8 Q-109.35 -245.15 -111.05 -248.85 -112.95 -252.95 -115.0 -259.85 L-118.0 -271.3 -111.05 -272.1 Q-70.7 -276.15 -27.0 -267.8 -14.95 -265.5 -3.25 -262.2 M-1.75 -124.3 L-1.8 -124.2 -1.8 -124.3 -1.75 -124.3 M-172.4 -178.7 L-173.65 -184.2 Q-175.0 -191.9 -174.1 -197.75 L-174.15 -197.8 -174.2 -197.8 -172.95 -202.65 Q-172.55 -202.55 -172.5 -202.95 L-172.55 -183.05 -172.4 -178.7 M-15.5 -197.15 L-15.45 -197.15 -15.6 -196.8 -15.5 -197.15" fill="#868c86" fill-rule="evenodd" stroke="none"/>
    <path d="M10.55 -224.2 Q10.1 -217.95 8.0 -200.8 L7.05 -192.85 6.6 -188.95 Q6.25 -190.9 3.75 -198.55 1.1 -206.75 1.25 -209.25 L-3.9 -200.1 -9.05 -190.3 -9.05 -191.8 -7.1 -201.25 -7.6 -201.25 Q-8.05 -199.7 -10.85 -195.95 -13.1 -192.9 -14.3 -191.75 L-13.05 -198.85 -11.0 -208.5 -11.0 -211.3 Q-13.5 -206.15 -19.8 -188.9 L-19.9 -188.6 -24.75 -175.6 Q-23.85 -179.25 -23.3 -182.15 L-23.0 -183.6 -21.9 -192.95 -21.35 -198.25 -21.35 -198.3 -21.4 -198.45 -21.45 -198.35 -21.45 -198.3 -24.2 -190.95 -23.2 -197.85 Q-22.45 -202.8 -22.4 -206.05 L-22.4 -206.55 Q-22.4 -211.15 -24.3 -226.55 -23.75 -220.8 -26.45 -206.05 L-27.7 -199.7 Q-29.95 -188.6 -32.7 -177.65 L-32.85 -184.0 -33.0 -187.2 -33.3 -191.85 Q-33.7 -196.6 -34.35 -200.75 -34.75 -203.5 -35.3 -206.05 -37.2 -214.85 -40.5 -220.85 L-40.8 -221.3 -40.95 -220.6 Q-40.55 -216.8 -40.1 -208.15 L-40.05 -206.55 -40.0 -206.05 -39.85 -201.8 -39.75 -198.5 Q-39.7 -195.8 -39.8 -194.3 -41.4 -198.45 -43.3 -202.45 L-45.1 -206.05 -46.2 -208.15 -48.6 -212.4 -54.05 -220.95 Q-58.7 -227.65 -62.95 -232.5 L-63.1 -231.85 Q-62.35 -230.8 -56.9 -218.1 L-52.8 -208.15 -52.0 -206.05 -51.25 -204.0 -51.15 -203.55 -52.9 -204.0 -54.45 -204.4 -54.7 -204.65 -56.1 -206.05 -58.25 -208.15 -68.4 -218.35 -70.6 -220.55 -81.85 -232.55 -80.7 -229.55 Q-76.15 -217.45 -74.25 -209.55 L-73.95 -208.3 -73.9 -208.15 -73.45 -206.05 -73.1 -204.0 -74.5 -206.05 -75.95 -208.15 -76.45 -208.8 -80.7 -214.45 -86.7 -222.2 -101.05 -240.6 -101.2 -239.9 Q-100.9 -239.4 -92.75 -219.1 L-89.6 -211.3 -88.4 -208.15 -87.55 -206.05 -87.1 -204.95 -84.25 -197.9 -84.9 -198.0 -89.2 -202.2 -92.7 -206.05 -94.45 -208.15 -98.2 -212.95 -100.25 -215.75 -100.8 -216.55 -100.95 -216.7 -108.25 -226.9 Q-107.5 -223.65 -103.5 -213.95 L-102.0 -210.3 -101.05 -208.15 -100.85 -207.6 -100.15 -206.05 -98.95 -203.25 -96.15 -196.05 -96.05 -195.75 -95.2 -193.55 Q-96.85 -194.1 -98.5 -195.0 L-99.15 -196.3 -103.3 -206.05 -104.2 -208.15 -104.25 -208.25 -105.3 -211.0 -106.75 -214.55 Q-109.45 -221.6 -111.05 -226.75 -112.4 -231.05 -112.9 -234.0 L-112.65 -234.25 -111.05 -232.45 -106.75 -227.6 Q-102.1 -222.5 -100.6 -221.3 L-105.6 -246.75 Q-100.5 -241.9 -93.25 -232.6 -86.6 -224.2 -83.0 -218.95 -82.8 -220.65 -86.8 -234.3 L-91.4 -249.35 -69.5 -226.15 -69.0 -226.05 Q-69.4 -227.6 -73.85 -238.75 -78.5 -250.65 -79.4 -250.95 L-79.1 -251.25 Q-75.5 -248.0 -58.9 -236.35 -55.2 -233.7 -52.25 -231.25 L-54.8 -237.6 -62.7 -256.95 Q-41.1 -240.0 -39.6 -238.5 -41.35 -241.5 -48.05 -251.4 L-55.1 -261.8 -48.15 -261.85 -46.3 -261.95 Q-29.25 -262.65 -10.3 -256.9 -2.7 -254.6 2.85 -251.95 6.1 -242.65 10.55 -224.2 M-11.1 -124.6 L-16.95 -120.3 -19.75 -118.45 -20.0 -118.85 -19.9 -118.9 Q-18.35 -119.85 -16.4 -123.1 L-16.2 -123.45 -15.9 -124.1 -12.5 -130.15 -13.1 -130.3 -12.9 -130.65 -12.6 -130.85 -10.45 -132.0 Q-8.5 -132.95 -7.6 -134.0 -8.25 -131.2 -10.7 -125.55 L-11.1 -124.6 M-49.3 -240.35 L-49.25 -240.35 -49.3 -240.4 -49.4 -240.55 -49.3 -240.35 M-21.75 -132.85 L-19.9 -134.35 -16.4 -137.45 -16.35 -137.4 -13.75 -137.05 -10.25 -137.6 -10.6 -136.55 Q-13.25 -132.65 -15.75 -131.6 L-19.9 -129.9 -25.85 -127.45 Q-30.45 -125.55 -32.8 -123.85 L-33.4 -123.7 -33.45 -123.8 -28.9 -127.2 -24.65 -130.55 -21.75 -132.85" fill="#7f857f" fill-rule="evenodd" stroke="none"/>
    <path d="M6.6 -188.95 L6.5 -188.4 5.95 -184.25 Q3.45 -186.45 -0.2 -187.35 -2.9 -188.0 -8.1 -186.5 L-12.3 -184.9 -14.45 -180.45 -19.9 -169.85 -21.55 -166.65 -23.1 -163.55 -29.15 -151.75 -34.35 -141.95 -30.7 -153.9 Q-27.95 -163.35 -26.05 -170.55 L-24.75 -175.6 -19.9 -188.6 -19.8 -188.9 Q-13.5 -206.15 -11.0 -211.3 L-11.0 -208.5 -13.05 -198.85 -14.3 -191.75 Q-13.1 -192.9 -10.85 -195.95 -8.05 -199.7 -7.6 -201.25 L-7.1 -201.25 -9.05 -191.8 -9.05 -190.3 -3.9 -200.1 1.25 -209.25 Q1.1 -206.75 3.75 -198.55 6.25 -190.9 6.6 -188.95 M5.1 -151.9 Q5.0 -150.4 5.2 -149.15 5.5 -146.95 5.1 -144.85 4.7 -142.9 1.7 -134.6 -0.65 -128.35 -1.75 -124.3 L-1.8 -124.3 Q-1.15 -127.05 -0.8 -132.65 -0.55 -137.25 -0.6 -139.95 L-1.5 -137.75 -5.55 -128.85 -7.45 -127.4 -10.4 -125.15 -10.7 -125.55 Q-8.25 -131.2 -7.6 -134.0 -8.5 -132.95 -10.45 -132.0 L-12.6 -130.85 -12.9 -130.65 -12.3 -132.2 -10.6 -136.55 -10.55 -136.65 -9.8 -137.75 Q-5.0 -139.5 0.1 -145.3 L1.0 -146.35 1.5 -146.85 2.1 -147.65 4.35 -150.8 5.1 -151.9 M-32.7 -177.65 Q-29.95 -188.6 -27.7 -199.7 L-26.45 -206.05 Q-23.75 -220.8 -24.3 -226.55 -22.4 -211.15 -22.4 -206.55 L-22.4 -206.05 Q-22.45 -202.8 -23.2 -197.85 L-24.2 -190.95 -27.35 -182.95 -27.65 -182.2 -32.55 -169.8 -32.55 -169.75 -32.6 -169.8 -32.65 -173.9 -32.7 -177.65 M-15.5 -197.15 L-15.6 -196.8 -15.45 -197.15 -15.5 -197.15 M-33.5 -123.75 L-33.45 -123.8 -33.4 -123.7 -33.5 -123.75" fill="#757a75" fill-rule="evenodd" stroke="none"/>
    <path d="M5.95 -184.25 Q8.65 -181.8 9.85 -177.9 11.5 -172.2 9.95 -164.15 8.75 -157.9 5.1 -151.9 L4.35 -150.8 2.1 -147.65 1.5 -146.85 1.0 -146.35 0.1 -145.3 Q-5.0 -139.5 -9.8 -137.75 L-10.25 -137.6 -13.75 -137.05 -16.35 -137.4 -16.4 -137.45 -19.9 -134.35 -21.75 -132.85 Q-23.05 -144.6 -22.4 -153.35 L-21.55 -166.65 -19.9 -169.85 -14.45 -180.45 -12.3 -184.9 -8.1 -186.5 Q-2.9 -188.0 -0.2 -187.35 3.45 -186.45 5.95 -184.25 M-77.6 -86.0 L-85.15 -84.95 -100.3 -83.4 Q-106.25 -83.1 -111.05 -83.2 L-118.7 -83.85 Q-127.6 -85.25 -132.95 -86.5 L-137.9 -87.9 -144.4 -90.45 Q-145.55 -91.0 -146.65 -92.85 L-147.05 -93.75 -147.3 -93.3 -147.6 -94.0 -148.05 -95.15 -148.7 -97.05 -152.35 -106.25 -153.6 -109.2 Q-159.25 -122.55 -160.4 -126.15 L-160.7 -127.05 -161.3 -128.65 -160.75 -128.95 -160.8 -130.85 -160.8 -136.3 Q-160.75 -141.6 -160.35 -143.55 L-158.75 -148.05 Q-157.35 -151.7 -157.2 -152.6 -156.2 -152.2 -154.2 -151.55 L-151.25 -150.55 -156.15 -158.1 -158.5 -162.45 Q-156.5 -158.6 -154.1 -156.55 -150.8 -153.7 -144.15 -152.15 -139.2 -151.05 -134.9 -151.5 L-136.15 -150.85 Q-139.8 -149.0 -141.05 -148.6 L-140.2 -148.45 -136.2 -148.75 -132.55 -149.2 -131.45 -149.0 -137.55 -141.65 -137.25 -141.45 Q-135.7 -142.45 -127.2 -149.4 L-120.1 -155.3 -120.8 -150.95 -121.15 -145.65 -121.2 -145.6 -121.15 -145.35 Q-120.15 -141.05 -119.2 -138.35 L-118.55 -136.6 -118.6 -136.55 -118.8 -136.4 -118.5 -135.95 -118.05 -135.5 Q-117.2 -134.75 -116.0 -134.35 L-115.8 -134.3 -111.05 -133.9 -108.9 -134.05 -108.85 -134.65 -98.95 -135.55 -97.85 -135.65 -98.85 -134.65 -94.45 -135.0 -91.35 -135.35 -90.5 -135.5 -90.4 -135.5 -86.65 -136.45 -87.45 -136.7 -85.8 -136.6 -75.05 -135.9 -75.0 -135.95 -81.85 -142.5 -88.05 -147.6 -90.05 -149.15 Q-89.25 -147.6 -88.85 -145.25 L-88.7 -144.35 -88.1 -141.4 -88.15 -141.25 -89.25 -141.45 -91.65 -142.1 -93.1 -142.25 Q-97.95 -142.8 -103.85 -140.25 -107.95 -138.5 -111.05 -138.05 L-114.6 -138.15 Q-116.9 -138.55 -117.3 -139.2 L-118.15 -138.85 -117.15 -145.25 -113.3 -160.1 -113.2 -163.05 -113.15 -166.0 Q-111.85 -173.0 -112.7 -176.45 -113.5 -179.75 -118.55 -189.5 L-119.0 -190.5 -119.25 -190.7 -127.75 -201.8 -128.05 -202.15 -130.95 -206.05 -132.45 -208.15 -136.9 -214.45 -140.95 -221.1 -141.3 -221.8 -141.3 -221.15 -141.2 -215.3 -141.05 -208.15 -141.0 -206.05 -141.0 -204.6 -140.95 -204.3 -140.8 -197.35 -141.25 -197.15 -141.35 -196.9 Q-143.1 -198.5 -146.65 -205.4 L-146.8 -205.75 -146.95 -206.05 -147.8 -207.8 -147.95 -208.15 -152.25 -217.4 -152.95 -219.1 -153.65 -223.5 -154.35 -227.55 Q-157.65 -247.7 -158.2 -254.0 -155.85 -242.75 -150.3 -227.2 L-148.65 -222.55 -146.4 -216.3 -143.35 -208.15 -142.5 -206.05 -142.1 -205.0 -142.2 -206.05 -142.5 -208.15 -142.6 -208.7 -143.2 -215.65 -143.6 -221.6 -143.8 -223.9 Q-144.15 -230.9 -147.2 -239.15 -149.7 -245.7 -149.05 -246.95 L-148.9 -247.55 Q-144.85 -237.5 -132.45 -219.45 L-129.75 -215.6 -127.75 -212.7 -124.4 -208.15 -122.8 -206.05 -118.35 -200.3 -118.1 -199.95 Q-113.95 -194.85 -111.05 -192.25 L-110.2 -191.55 -111.05 -192.95 -114.4 -199.25 -114.55 -199.55 -117.4 -206.05 -118.3 -208.15 -119.5 -211.15 -121.85 -217.45 -126.2 -230.1 -118.1 -216.75 -114.05 -210.7 -113.6 -210.0 -112.25 -208.15 -111.05 -206.55 -110.6 -206.05 Q-106.1 -200.4 -101.8 -197.15 L-101.2 -196.7 -98.5 -195.0 Q-96.85 -194.1 -95.2 -193.55 L-96.05 -195.75 -96.15 -196.05 -98.95 -203.25 Q-93.35 -197.8 -92.55 -197.45 L-96.35 -206.05 -96.7 -206.8 -97.3 -208.15 -99.55 -213.2 -101.15 -216.6 -100.95 -216.7 -100.8 -216.55 -100.25 -215.75 -98.2 -212.95 -94.45 -208.15 -92.7 -206.05 -89.2 -202.2 -84.9 -198.0 -84.25 -197.9 -87.1 -204.95 -87.55 -206.05 -88.4 -208.15 -87.05 -207.35 -85.0 -206.05 -81.75 -203.95 -77.8 -201.45 -73.75 -199.2 -78.7 -206.05 -80.2 -208.15 -81.3 -209.7 -89.1 -220.75 -89.9 -221.3 -89.4 -221.2 -89.1 -220.75 -80.7 -214.45 -76.45 -208.8 -75.95 -208.15 -74.5 -206.05 -73.1 -204.0 -73.45 -206.05 -73.9 -208.15 -73.95 -208.3 -74.25 -209.55 -72.4 -208.15 -72.15 -207.95 -69.6 -206.05 -65.15 -202.9 -67.0 -206.05 -67.6 -207.1 -68.2 -208.15 -71.9 -214.6 Q-78.3 -225.6 -78.65 -226.9 -76.7 -225.65 -70.8 -220.45 L-70.6 -220.55 -68.4 -218.35 -58.25 -208.15 -56.1 -206.05 -54.7 -204.65 -54.45 -204.4 -52.9 -204.0 -46.1 -197.6 -47.15 -203.2 -47.3 -203.9 -47.65 -206.05 -48.0 -208.15 -48.6 -212.4 -46.2 -208.15 -45.1 -206.05 -43.3 -202.45 Q-41.4 -198.45 -39.8 -194.3 -39.7 -195.8 -39.75 -198.5 L-35.95 -191.4 -33.45 -186.55 -33.3 -191.85 -33.0 -187.2 -32.85 -184.0 -32.7 -177.65 -32.65 -173.9 -33.95 -168.0 -35.65 -160.7 -35.95 -159.5 -36.3 -158.55 -36.9 -156.55 Q-37.3 -154.65 -36.9 -154.1 L-36.7 -153.95 -35.95 -155.1 -26.05 -170.55 Q-27.95 -163.35 -30.7 -153.9 L-34.35 -141.95 -29.15 -151.75 -31.3 -142.8 -32.35 -137.4 -33.45 -131.5 -27.8 -143.25 -28.0 -139.55 -28.25 -135.4 -28.3 -134.25 -28.9 -127.2 -33.45 -123.8 -33.5 -123.75 -33.8 -123.6 -33.9 -123.65 -35.95 -120.3 -40.5 -113.35 -43.5 -109.2 -46.8 -104.8 Q-51.25 -100.95 -62.2 -94.45 -68.9 -90.45 -76.6 -86.5 L-77.6 -86.0 M-40.95 -220.6 L-40.8 -221.3 -40.5 -220.85 -40.95 -220.6 M-21.45 -198.35 L-21.4 -198.45 -21.35 -198.3 -21.45 -198.35 M-12.85 -146.2 L-12.0 -146.15 -10.2 -146.0 Q-0.4 -146.5 2.65 -162.5 3.4 -166.5 3.0 -172.05 L2.45 -173.85 Q1.15 -177.25 -1.0 -177.75 -3.5 -178.4 -6.05 -177.4 -8.1 -176.65 -10.2 -174.95 L-11.8 -173.5 Q-14.5 -170.8 -16.15 -168.1 L-16.85 -158.35 Q-17.35 -151.4 -17.1 -146.2 L-17.1 -146.15 -16.9 -146.2 -12.85 -146.2 M-162.55 -236.45 Q-161.15 -230.15 -159.6 -224.65 L-157.75 -218.45 -155.8 -212.85 -153.9 -208.15 -153.4 -207.0 -153.25 -206.65 -152.95 -206.05 -151.75 -203.7 -151.1 -196.05 -150.6 -194.8 -151.1 -194.9 -151.1 -196.05 -155.8 -206.05 -156.4 -207.25 -156.6 -207.6 -156.85 -208.15 -157.1 -208.7 -162.15 -219.3 -164.1 -223.75 Q-164.2 -222.75 -165.1 -219.85 L-166.85 -214.5 -167.5 -212.25 -167.2 -220.25 -166.9 -226.05 -166.85 -226.8 -166.0 -228.95 -163.3 -235.0 -162.65 -236.45 -162.55 -236.45 M-39.8 -194.3 L-39.9 -193.1 -39.2 -192.9 -39.8 -194.3 M-55.4 -188.25 L-55.2 -188.25 Q-51.4 -188.05 -47.7 -187.05 -51.75 -190.45 -55.65 -191.4 -63.2 -193.35 -71.0 -191.5 L-71.6 -191.4 -80.05 -189.65 -84.2 -188.9 -90.7 -188.05 -90.0 -187.55 -88.9 -186.75 -95.6 -186.25 -99.15 -182.1 Q-102.0 -178.75 -102.15 -178.0 -102.45 -176.45 -99.8 -172.3 L-95.2 -165.7 -94.7 -165.7 Q-94.75 -172.45 -89.75 -174.75 L-86.7 -175.8 -82.45 -176.95 -79.15 -177.8 -79.05 -178.3 -83.35 -179.1 -86.1 -178.85 -88.3 -179.0 -88.75 -179.1 -85.95 -179.75 -81.75 -180.65 -70.3 -182.35 -57.3 -182.85 -53.05 -182.05 Q-53.9 -181.5 -56.35 -180.75 -58.8 -180.0 -59.85 -179.95 L-59.9 -179.45 -43.9 -176.4 -51.8 -185.55 Q-53.5 -187.25 -55.4 -188.25 M-51.05 -175.0 Q-54.6 -176.3 -57.8 -177.0 -65.4 -178.6 -74.15 -176.75 L-83.0 -174.25 -87.2 -173.0 -89.25 -172.35 -83.0 -170.9 -83.7 -170.5 -85.8 -169.9 -87.9 -169.4 -88.5 -169.2 -87.95 -169.15 -84.55 -168.8 -84.05 -168.75 -81.8 -168.7 -81.65 -163.4 -81.15 -157.5 -83.15 -157.05 -85.05 -156.5 Q-82.35 -154.4 -80.4 -153.75 L-75.05 -152.45 Q-64.25 -150.05 -53.9 -156.35 -44.95 -161.75 -41.45 -170.15 -43.85 -172.2 -49.1 -174.25 L-51.05 -175.0 M-77.5 -148.7 L-81.0 -149.45 Q-74.25 -144.6 -69.65 -143.75 -64.85 -142.8 -61.2 -144.75 L-46.8 -153.55 Q-62.75 -148.75 -64.3 -148.45 -70.05 -147.3 -77.5 -148.7 M-63.5 -135.2 L-64.85 -135.2 -64.9 -134.8 Q-63.2 -134.3 -58.6 -131.85 L-52.85 -128.8 Q-71.15 -124.2 -88.1 -122.45 L-92.95 -122.0 -94.1 -121.95 -97.0 -121.7 Q-104.25 -121.35 -111.05 -121.55 -120.85 -121.9 -129.7 -123.35 L-125.9 -128.2 -124.7 -129.45 Q-122.45 -131.65 -120.05 -132.45 L-121.05 -132.6 Q-122.6 -132.9 -126.7 -131.75 L-127.45 -131.45 -127.5 -131.45 -129.0 -131.5 -142.65 -132.85 -143.75 -132.85 Q-151.55 -132.75 -157.95 -128.35 -156.8 -125.45 -154.0 -122.1 L-149.75 -117.1 -148.85 -116.95 Q-148.7 -120.95 -147.1 -122.3 -146.55 -122.85 -144.05 -123.85 -136.2 -120.35 -133.1 -119.65 -123.45 -117.3 -114.35 -117.2 L-111.05 -117.2 -97.8 -117.55 -93.8 -117.65 -90.95 -117.85 -73.6 -119.7 -65.65 -121.1 -63.5 -121.6 -62.7 -121.8 -62.6 -121.3 -55.8 -121.55 Q-54.8 -121.35 -54.35 -120.1 L-53.6 -117.8 -53.35 -118.15 -53.05 -118.15 -44.45 -124.55 Q-37.8 -129.25 -36.7 -132.6 -39.4 -133.6 -46.25 -134.9 L-66.45 -137.3 -66.55 -136.85 Q-65.5 -136.0 -63.5 -135.2 M-18.4 -137.95 L-18.15 -137.9 -18.55 -138.1 -18.4 -137.95 M-110.2 -191.55 L-109.25 -190.05 -109.1 -190.75 -110.2 -191.55 M-125.7 -179.05 L-119.95 -176.3 -119.7 -176.45 Q-117.9 -173.05 -118.45 -166.4 -119.9 -168.85 -123.0 -171.2 -127.55 -174.65 -134.95 -177.65 L-135.1 -177.35 Q-134.6 -177.0 -132.55 -172.7 L-131.75 -170.95 -132.2 -171.2 Q-136.35 -173.2 -138.3 -173.65 -145.05 -175.2 -150.85 -172.45 -154.9 -170.6 -159.5 -165.95 -158.5 -170.45 -152.35 -174.3 L-143.35 -179.25 -150.3 -179.7 -157.4 -179.2 Q-152.7 -183.75 -150.5 -184.7 L-147.45 -185.55 -144.0 -184.75 -136.2 -182.05 -128.4 -179.4 -125.7 -179.05 M-141.9 -109.2 Q-141.5 -101.6 -138.85 -95.2 L-138.1 -93.25 -136.4 -90.15 -134.8 -92.65 -133.75 -94.2 Q-128.35 -102.4 -122.95 -109.2 L-121.0 -111.6 -137.55 -114.8 -141.45 -115.05 -142.0 -112.2 -141.9 -109.2 M-89.3 -137.3 L-88.9 -137.4 -88.95 -137.05 -89.3 -137.2 -89.3 -137.3" fill="#b28f74" fill-rule="evenodd" stroke="none"/>
    <path d="M-21.8 -126.75 L-27.75 -110.95 -28.35 -109.6 -28.65 -109.2 Q-31.9 -105.25 -35.95 -101.9 -50.05 -90.35 -73.75 -86.55 L-74.05 -86.5 -77.6 -86.0 -76.6 -86.5 Q-68.9 -90.45 -62.2 -94.45 -51.25 -100.95 -46.8 -104.8 L-43.5 -109.2 -40.5 -113.35 -35.95 -120.3 -33.9 -123.65 -33.8 -123.6 -33.4 -123.7 -32.8 -123.85 -24.0 -126.2 -21.8 -126.75 M-98.95 -203.25 L-100.15 -206.05 -100.85 -207.6 -101.05 -208.15 -102.0 -210.3 -103.5 -213.95 Q-107.5 -223.65 -108.25 -226.9 L-100.95 -216.7 -101.15 -216.6 -99.55 -213.2 -97.3 -208.15 -96.7 -206.8 -96.35 -206.05 -92.55 -197.45 Q-93.35 -197.8 -98.95 -203.25 M-88.4 -208.15 L-89.6 -211.3 -92.75 -219.1 Q-100.9 -239.4 -101.2 -239.9 L-101.05 -240.6 -86.7 -222.2 -80.7 -214.45 -89.1 -220.75 -89.4 -221.2 -89.9 -221.3 -89.1 -220.75 -81.3 -209.7 -80.2 -208.15 -78.7 -206.05 -73.75 -199.2 -77.8 -201.45 -81.75 -203.95 -85.0 -206.05 -87.05 -207.35 -88.4 -208.15 M-74.25 -209.55 Q-76.15 -217.45 -80.7 -229.55 L-81.85 -232.55 -70.6 -220.55 -70.8 -220.45 Q-76.7 -225.65 -78.65 -226.9 -78.3 -225.6 -71.9 -214.6 L-68.2 -208.15 -67.6 -207.1 -67.0 -206.05 -65.15 -202.9 -69.6 -206.05 -72.15 -207.95 -72.4 -208.15 -74.25 -209.55 M-52.9 -204.0 L-51.15 -203.55 -51.25 -204.0 -52.0 -206.05 -52.8 -208.15 -56.9 -218.1 Q-62.35 -230.8 -63.1 -231.85 L-62.95 -232.5 Q-58.7 -227.65 -54.05 -220.95 L-48.6 -212.4 -48.0 -208.15 -47.65 -206.05 -47.3 -203.9 -47.15 -203.2 -46.1 -197.6 -52.9 -204.0 M-39.75 -198.5 L-39.85 -201.8 -40.0 -206.05 -40.05 -206.55 -40.1 -208.15 Q-40.55 -216.8 -40.95 -220.6 L-40.5 -220.85 Q-37.2 -214.85 -35.3 -206.05 -34.75 -203.5 -34.35 -200.75 -33.7 -196.6 -33.3 -191.85 L-33.45 -186.55 -35.95 -191.4 -39.75 -198.5 M-24.2 -190.95 L-21.45 -198.3 -21.45 -198.35 -21.35 -198.3 -21.35 -198.25 -21.9 -192.95 -23.0 -183.6 -23.3 -182.15 Q-23.85 -179.25 -24.75 -175.6 L-26.05 -170.55 -35.95 -155.1 -36.7 -153.95 -36.9 -154.1 Q-37.3 -154.65 -36.9 -156.55 L-36.3 -158.55 -35.95 -159.5 -35.65 -160.7 -33.95 -168.0 -32.65 -173.9 -32.6 -169.8 -32.6 -169.65 -32.55 -169.75 -32.55 -169.8 -27.65 -182.2 -27.35 -182.95 -24.2 -190.95 M-29.15 -151.75 L-23.1 -163.55 -21.55 -166.65 -22.4 -153.35 Q-23.05 -144.6 -21.75 -132.85 L-24.65 -130.55 -28.9 -127.2 -28.3 -134.25 -28.25 -135.4 -28.0 -139.55 -27.8 -143.25 -33.45 -131.5 -32.35 -137.4 -31.3 -142.8 -29.15 -151.75 M-10.2 -174.95 Q-8.1 -176.65 -6.05 -177.4 -3.5 -178.4 -1.0 -177.75 1.15 -177.25 2.45 -173.85 L3.0 -172.05 Q3.4 -166.5 2.65 -162.5 -0.4 -146.5 -10.2 -146.0 L-12.0 -146.15 -12.85 -146.2 Q-12.3 -146.5 -11.9 -146.75 -8.9 -148.95 -8.3 -151.95 L-9.4 -155.5 -9.9 -157.25 -10.4 -159.2 Q-10.2 -160.2 -9.15 -161.15 L-6.55 -163.0 Q-3.05 -164.9 -2.6 -167.35 -2.2 -169.45 -3.3 -171.25 -4.4 -173.1 -6.7 -174.05 L-8.2 -174.55 -10.2 -174.95 M-118.15 -138.85 L-117.3 -139.2 Q-116.9 -138.55 -114.6 -138.15 L-111.05 -138.05 Q-107.95 -138.5 -103.85 -140.25 -97.95 -142.8 -93.1 -142.25 L-91.65 -142.1 -89.25 -141.45 -88.15 -141.25 -88.1 -141.4 -88.7 -144.35 -88.85 -145.25 Q-89.25 -147.6 -90.05 -149.15 L-88.05 -147.6 -81.85 -142.5 -75.0 -135.95 -75.05 -135.9 -85.8 -136.6 -87.45 -136.7 -88.95 -137.05 -88.9 -137.4 -89.3 -137.3 -89.95 -137.9 -90.35 -138.1 -93.0 -138.15 -93.9 -137.95 Q-96.1 -137.45 -97.85 -135.65 L-98.95 -135.55 -108.85 -134.65 -108.85 -134.9 -108.85 -135.05 -109.05 -135.15 -109.3 -135.4 -116.0 -137.1 Q-116.4 -136.75 -117.3 -136.85 L-118.05 -136.9 -118.35 -136.65 -118.15 -138.85 M-120.1 -155.3 L-127.2 -149.4 Q-135.7 -142.45 -137.25 -141.45 L-137.55 -141.65 -131.45 -149.0 -132.55 -149.2 -136.2 -148.75 -140.2 -148.45 -141.05 -148.6 Q-139.8 -149.0 -136.15 -150.85 L-134.9 -151.5 -133.05 -151.75 Q-127.45 -152.8 -124.55 -156.55 L-126.95 -156.75 -129.1 -156.65 -129.6 -156.75 -129.55 -157.1 Q-129.25 -158.6 -130.4 -163.2 L-130.5 -163.65 -126.05 -165.35 Q-124.1 -166.3 -122.9 -168.55 L-123.1 -168.75 -124.6 -168.55 -126.2 -168.7 Q-128.0 -169.1 -131.75 -170.95 L-132.55 -172.7 Q-134.6 -177.0 -135.1 -177.35 L-134.95 -177.65 Q-127.55 -174.65 -123.0 -171.2 -119.9 -168.85 -118.45 -166.4 -118.6 -164.05 -119.1 -161.2 L-120.1 -155.3 M-88.9 -186.75 L-87.55 -185.95 -84.85 -185.4 -80.9 -185.1 -76.6 -185.45 -66.7 -187.4 Q-61.0 -188.6 -55.4 -188.25 -53.5 -187.25 -51.8 -185.55 L-43.9 -176.4 -59.9 -179.45 -59.85 -179.95 Q-58.8 -180.0 -56.35 -180.75 -53.9 -181.5 -53.05 -182.05 L-57.3 -182.85 -70.3 -182.35 -81.75 -180.65 -85.95 -179.75 -88.75 -179.1 -88.3 -179.0 -86.1 -178.85 -83.35 -179.1 -79.05 -178.3 -79.15 -177.8 -82.45 -176.95 -86.7 -175.8 -89.75 -174.75 Q-94.75 -172.45 -94.7 -165.7 L-95.2 -165.7 -99.8 -172.3 Q-102.45 -176.45 -102.15 -178.0 -102.0 -178.75 -99.15 -182.1 L-95.6 -186.25 -88.9 -186.75 M-129.0 -131.5 L-133.9 -131.2 -141.15 -130.1 -153.0 -127.45 Q-151.75 -127.2 -144.05 -123.85 -146.55 -122.85 -147.1 -122.3 -148.7 -120.95 -148.85 -116.95 L-149.75 -117.1 -154.0 -122.1 Q-156.8 -125.45 -157.95 -128.35 -151.55 -132.75 -143.75 -132.85 L-142.65 -132.85 -129.0 -131.5 M-62.7 -121.8 Q-48.6 -124.95 -40.25 -132.1 L-49.15 -133.75 Q-59.3 -135.55 -62.65 -135.2 L-63.5 -135.2 Q-65.5 -136.0 -66.55 -136.85 L-66.45 -137.3 -46.25 -134.9 Q-39.4 -133.6 -36.7 -132.6 -37.8 -129.25 -44.45 -124.55 L-53.05 -118.15 -53.35 -118.15 -53.6 -117.8 -54.35 -120.1 Q-54.8 -121.35 -55.8 -121.55 L-62.6 -121.3 -62.7 -121.8" fill="#9e7f66" fill-rule="evenodd" stroke="none"/>
    <path d="M-180.75 -232.75 L-180.45 -234.8 Q-178.75 -243.75 -175.8 -251.4 L-170.55 -259.55 Q-167.1 -264.45 -164.25 -267.35 L-164.0 -264.35 Q-163.3 -259.55 -162.25 -257.4 -161.8 -259.9 -160.75 -263.0 -159.65 -266.25 -158.55 -268.35 -157.9 -267.6 -157.0 -263.45 L-155.8 -257.75 -153.8 -268.45 Q-153.05 -267.05 -149.9 -263.4 L-145.85 -258.65 -146.7 -263.9 -147.8 -269.35 Q-140.9 -272.2 -122.15 -281.15 L-111.05 -282.2 -104.45 -282.75 Q-71.0 -285.15 -58.1 -282.4 L-57.6 -282.3 -56.9 -282.1 Q-33.15 -276.2 -16.1 -268.65 -8.95 -265.5 -3.25 -262.2 -14.95 -265.5 -27.0 -267.8 -70.7 -276.15 -111.05 -272.1 L-118.0 -271.3 -115.0 -259.85 Q-112.95 -252.95 -111.05 -248.85 -109.35 -245.15 -107.8 -243.8 L-108.05 -243.75 -111.05 -247.2 Q-124.5 -262.9 -128.95 -269.65 L-131.85 -269.1 -128.95 -258.6 Q-123.9 -242.4 -117.15 -234.8 -123.55 -239.25 -131.05 -251.05 -140.05 -265.25 -141.3 -266.6 -140.7 -261.0 -138.8 -252.55 -136.45 -242.1 -133.3 -233.95 L-153.0 -261.55 -153.05 -261.15 Q-153.35 -259.5 -152.3 -249.3 -151.25 -238.6 -150.15 -235.7 L-150.6 -235.8 -154.8 -249.05 -158.7 -262.2 -160.05 -255.1 -161.0 -247.45 -160.85 -242.75 -160.65 -240.0 Q-162.0 -244.45 -163.9 -252.8 L-164.7 -256.3 -165.5 -260.45 -166.2 -264.75 -169.25 -259.15 -172.5 -252.7 Q-177.55 -242.35 -180.75 -232.75 M-159.05 -271.5 L-159.4 -271.1 -160.0 -271.05 -159.05 -271.5" fill="#939993" fill-rule="evenodd" stroke="none"/>
    <path d="M-175.8 -251.4 L-173.55 -256.7 -173.05 -257.7 -166.85 -269.75 -162.25 -271.65 -161.75 -271.8 -150.3 -276.0 Q-141.55 -279.05 -122.15 -281.15 -140.9 -272.2 -147.8 -269.35 L-146.7 -263.9 -145.85 -258.65 -149.9 -263.4 Q-153.05 -267.05 -153.8 -268.45 L-155.8 -257.75 -157.0 -263.45 Q-157.9 -267.6 -158.55 -268.35 -159.65 -266.25 -160.75 -263.0 -161.8 -259.9 -162.25 -257.4 -163.3 -259.55 -164.0 -264.35 L-164.25 -267.35 Q-167.1 -264.45 -170.55 -259.55 L-175.8 -251.4 M-159.05 -271.5 L-160.0 -271.05 -159.4 -271.1 -159.05 -271.5" fill="#abb3ab" fill-rule="evenodd" stroke="none"/>
    <path d="M-161.3 -128.65 Q-162.6 -132.75 -163.45 -136.8 L-164.25 -141.45 -162.65 -148.4 -160.25 -157.2 -158.65 -155.9 -157.7 -155.1 Q-159.0 -159.2 -161.4 -163.45 L-164.35 -168.1 -163.45 -174.4 Q-166.95 -179.4 -167.8 -182.45 L-168.1 -183.75 -168.15 -184.55 -168.1 -185.9 Q-168.25 -191.6 -167.75 -206.05 L-167.7 -208.15 -167.65 -209.4 -167.65 -209.45 -167.65 -209.7 -167.5 -212.25 -166.85 -214.5 -165.1 -219.85 Q-164.2 -222.75 -164.1 -223.75 L-162.15 -219.3 -157.1 -208.7 -156.85 -208.15 -156.6 -207.6 -156.4 -207.25 -155.8 -206.05 -151.1 -196.05 -151.1 -194.9 -150.6 -194.8 -151.1 -196.05 -151.75 -203.7 -150.1 -201.65 -150.8 -206.05 -150.85 -206.2 -150.9 -206.5 -151.15 -208.15 -152.7 -217.45 -152.95 -219.1 -152.25 -217.4 -147.95 -208.15 -147.8 -207.8 -146.95 -206.05 -146.8 -205.75 -146.65 -205.4 Q-143.1 -198.5 -141.35 -196.9 L-141.25 -197.15 -140.8 -197.35 -140.95 -204.3 -141.0 -204.6 -141.0 -206.05 -141.05 -208.15 -141.2 -215.3 -141.3 -221.15 -141.3 -221.8 -140.95 -221.1 -136.9 -214.45 -132.45 -208.15 -130.95 -206.05 -128.05 -202.15 -127.75 -201.8 -119.25 -190.7 -119.0 -190.5 -118.55 -189.5 Q-113.5 -179.75 -112.7 -176.45 -111.85 -173.0 -113.15 -166.0 L-113.2 -163.05 -113.3 -160.1 -117.15 -145.25 -118.15 -138.85 -118.35 -136.65 -118.55 -136.6 -119.2 -138.35 Q-120.15 -141.05 -121.15 -145.35 L-121.2 -145.6 -121.15 -145.6 -121.05 -145.65 -121.15 -145.65 -120.8 -150.95 -120.1 -155.3 -119.1 -161.2 Q-118.6 -164.05 -118.45 -166.4 -117.9 -173.05 -119.7 -176.45 L-119.95 -176.3 -125.7 -179.05 -123.7 -179.15 -130.25 -183.5 Q-136.75 -187.8 -140.45 -188.7 -143.8 -189.55 -149.65 -188.2 -155.5 -186.75 -157.5 -184.65 L-156.8 -184.45 -156.4 -184.6 Q-152.05 -186.05 -149.95 -186.0 L-147.45 -185.55 -150.5 -184.7 Q-152.7 -183.75 -157.4 -179.2 L-150.3 -179.7 -143.35 -179.25 -152.35 -174.3 Q-158.5 -170.45 -159.5 -165.95 L-159.95 -165.6 -158.7 -162.9 -158.5 -162.45 -156.15 -158.1 -151.25 -150.55 -154.2 -151.55 Q-156.2 -152.2 -157.2 -152.6 -157.35 -151.7 -158.75 -148.05 L-160.35 -143.55 Q-160.75 -141.6 -160.8 -136.3 L-160.8 -130.85 -160.75 -128.95 -161.3 -128.65 M-159.6 -201.95 L-161.8 -206.05 -163.0 -208.15 -163.5 -209.0 Q-165.05 -211.75 -165.15 -214.6 L-165.2 -208.15 -165.2 -206.05 -165.3 -188.8 -165.4 -188.3 Q-160.1 -189.85 -156.2 -190.1 L-154.9 -190.1 -145.2 -191.65 -146.4 -194.45 -148.55 -199.3 -149.5 -194.15 -153.2 -195.45 -156.95 -196.7 Q-157.15 -197.55 -158.1 -199.2 L-159.6 -201.95 M-77.5 -148.7 Q-70.05 -147.3 -64.3 -148.45 -62.75 -148.75 -46.8 -153.55 L-61.2 -144.75 Q-64.85 -142.8 -69.65 -143.75 -74.25 -144.6 -81.0 -149.45 L-77.5 -148.7 M-129.7 -123.35 Q-135.85 -124.4 -141.6 -126.0 -139.45 -127.4 -135.5 -128.8 L-133.7 -129.4 -130.25 -130.5 -127.25 -131.45 -127.45 -131.45 -126.7 -131.75 Q-122.6 -132.9 -121.05 -132.6 L-120.05 -132.45 Q-122.45 -131.65 -124.7 -129.45 L-125.9 -128.2 -129.7 -123.35 M-116.45 -162.5 L-118.5 -156.85 -118.75 -150.75 -118.75 -145.45 -118.65 -145.55 Q-117.45 -156.2 -114.45 -167.4 L-116.45 -162.5 M-141.9 -109.2 L-142.0 -112.2 -141.45 -115.05 -137.55 -114.8 -121.0 -111.6 -122.95 -109.2 Q-128.35 -102.4 -133.75 -94.2 L-134.8 -92.65 -136.4 -90.15 -138.1 -93.25 -138.85 -95.2 Q-141.5 -101.6 -141.9 -109.2 M-140.5 -111.15 Q-139.95 -110.55 -139.5 -109.2 L-138.65 -105.75 Q-137.9 -101.95 -136.1 -100.75 -135.75 -101.15 -133.75 -105.45 -132.55 -107.95 -131.0 -109.2 L-130.2 -109.75 -140.5 -111.15" fill="#c49d7f" fill-rule="evenodd" stroke="none"/>
    <path d="M-164.25 -141.45 L-165.05 -148.65 Q-165.6 -157.6 -164.35 -168.1 L-161.4 -163.45 Q-159.0 -159.2 -157.7 -155.1 L-158.65 -155.9 -160.25 -157.2 -162.65 -148.4 -164.25 -141.45 M-159.6 -201.95 L-158.1 -199.2 Q-157.15 -197.55 -156.95 -196.7 L-153.2 -195.45 -149.5 -194.15 -148.55 -199.3 -146.4 -194.45 -145.2 -191.65 -154.9 -190.1 -156.2 -190.1 Q-160.1 -189.85 -165.4 -188.3 L-165.3 -188.8 -165.2 -206.05 -165.2 -208.15 -165.15 -214.6 Q-165.05 -211.75 -163.5 -209.0 L-163.0 -208.15 -161.8 -206.05 -159.6 -201.95 M-116.45 -162.5 L-114.45 -167.4 Q-117.45 -156.2 -118.65 -145.55 L-118.75 -145.45 -118.75 -150.75 -118.5 -156.85 -116.45 -162.5 M-140.5 -111.15 L-130.2 -109.75 -131.0 -109.2 Q-132.55 -107.95 -133.75 -105.45 -135.75 -101.15 -136.1 -100.75 -137.9 -101.95 -138.65 -105.75 L-139.5 -109.2 Q-139.95 -110.55 -140.5 -111.15" fill="#d4aa8a" fill-rule="evenodd" stroke="none"/>
    <path d="M-107.8 -243.8 L-107.65 -243.65 -108.05 -243.75 -107.8 -243.8" fill="#a1a8a1" fill-rule="evenodd" stroke="none"/>
    <path d="M-10.4 -125.15 L-11.1 -124.6 -10.7 -125.55 -10.4 -125.15 M-19.75 -118.45 L-19.9 -118.4 -20.4 -118.1 -20.25 -118.75 -20.0 -118.85 -19.75 -118.45 M-13.1 -130.3 Q-13.55 -129.75 -15.3 -128.95 -17.05 -128.25 -19.9 -127.3 L-21.0 -126.95 -21.8 -126.75 -24.0 -126.2 -32.8 -123.85 Q-30.45 -125.55 -25.85 -127.45 L-19.9 -129.9 -15.75 -131.6 Q-13.25 -132.65 -10.6 -136.55 L-10.25 -137.6 -9.8 -137.75 -10.55 -136.65 -10.6 -136.55 -12.3 -132.2 -12.9 -130.65 -13.1 -130.3 M-167.8 -182.45 Q-170.6 -174.7 -171.15 -171.65 L-171.5 -171.75 Q-171.4 -173.5 -172.4 -178.7 L-172.55 -183.05 -172.5 -202.95 Q-172.55 -202.55 -172.95 -202.65 L-174.2 -197.8 -174.25 -197.8 -174.4 -197.15 -175.95 -194.75 -176.7 -193.5 -178.3 -190.45 -176.05 -199.95 -174.65 -206.05 -174.2 -208.15 -173.7 -210.55 -172.3 -217.65 -169.2 -233.85 Q-167.1 -244.9 -165.65 -250.0 -166.05 -246.8 -164.4 -239.7 L-163.3 -235.0 -166.0 -228.95 -166.85 -226.8 -166.9 -226.05 -167.2 -220.25 -167.5 -212.25 -167.65 -209.7 -167.65 -209.45 -167.65 -209.4 -167.7 -208.15 -167.75 -206.05 Q-168.25 -191.6 -168.1 -185.9 L-168.15 -184.55 -168.1 -183.75 -167.8 -182.45 M-79.1 -251.25 L-79.4 -250.95 -79.3 -251.4 -79.1 -251.25 M-112.65 -234.25 L-112.9 -234.0 -112.8 -234.45 -112.65 -234.25 M-49.3 -240.35 L-49.4 -240.55 -49.3 -240.4 -49.25 -240.35 -49.3 -240.35 M-88.9 -186.75 L-90.0 -187.55 -90.7 -188.05 -84.2 -188.9 -80.05 -189.65 -71.6 -191.4 -71.0 -191.5 Q-63.2 -193.35 -55.65 -191.4 -51.75 -190.45 -47.7 -187.05 -51.4 -188.05 -55.2 -188.25 L-55.4 -188.25 Q-61.0 -188.6 -66.7 -187.4 L-76.6 -185.45 -80.9 -185.1 -84.85 -185.4 -87.55 -185.95 -88.9 -186.75 M-33.8 -123.6 L-33.5 -123.75 -33.4 -123.7 -33.8 -123.6 M-125.7 -179.05 L-128.4 -179.4 -136.2 -182.05 -144.0 -184.75 -147.45 -185.55 -149.95 -186.0 Q-152.05 -186.05 -156.4 -184.6 L-156.8 -184.45 -157.5 -184.65 Q-155.5 -186.75 -149.65 -188.2 -143.8 -189.55 -140.45 -188.7 -136.75 -187.8 -130.25 -183.5 L-123.7 -179.15 -125.7 -179.05" fill="#787d78" fill-rule="evenodd" stroke="none"/>
    <path d="M-12.85 -146.2 L-16.9 -146.2 -17.1 -146.2 Q-17.35 -151.4 -16.85 -158.35 L-16.15 -168.1 Q-14.5 -170.8 -11.8 -173.5 L-10.2 -174.95 -8.2 -174.55 -6.7 -174.05 Q-4.4 -173.1 -3.3 -171.25 -2.2 -169.45 -2.6 -167.35 -3.05 -164.9 -6.55 -163.0 L-9.15 -161.15 Q-10.2 -160.2 -10.4 -159.2 L-9.9 -157.25 -9.4 -155.5 -8.3 -151.95 Q-8.9 -148.95 -11.9 -146.75 -12.3 -146.5 -12.85 -146.2 M-87.45 -136.7 L-86.65 -136.45 -90.4 -135.5 -90.5 -135.5 -91.35 -135.35 -94.45 -135.0 -98.85 -134.65 -97.85 -135.65 Q-96.1 -137.45 -93.9 -137.95 L-93.0 -138.15 -90.35 -138.1 -89.95 -137.9 -89.3 -137.3 -89.3 -137.2 -88.95 -137.05 -87.45 -136.7 M-108.85 -134.65 L-108.9 -134.05 -111.05 -133.9 -115.8 -134.3 -116.0 -134.35 Q-117.2 -134.75 -118.05 -135.5 L-118.5 -135.95 -118.8 -136.4 -118.6 -136.55 -118.35 -136.65 -118.05 -136.9 -117.3 -136.85 Q-116.4 -136.75 -116.0 -137.1 L-109.3 -135.4 -109.05 -135.15 -108.85 -135.05 -108.85 -134.9 -108.85 -134.65 M-134.9 -151.5 Q-139.2 -151.05 -144.15 -152.15 -150.8 -153.7 -154.1 -156.55 -156.5 -158.6 -158.5 -162.45 L-158.7 -162.9 -159.95 -165.6 -159.5 -165.95 Q-154.9 -170.6 -150.85 -172.45 -145.05 -175.2 -138.3 -173.65 -136.35 -173.2 -132.2 -171.2 L-131.75 -170.95 Q-128.0 -169.1 -126.2 -168.7 L-124.6 -168.55 -123.1 -168.75 -122.9 -168.55 Q-124.1 -166.3 -126.05 -165.35 L-130.5 -163.65 -130.4 -163.2 Q-129.25 -158.6 -129.55 -157.1 L-129.6 -156.75 -129.1 -156.65 -126.95 -156.75 -124.55 -156.55 Q-127.45 -152.8 -133.05 -151.75 L-134.9 -151.5 M-51.05 -175.0 L-49.1 -174.25 Q-43.85 -172.2 -41.45 -170.15 -44.95 -161.75 -53.9 -156.35 -64.25 -150.05 -75.05 -152.45 L-80.4 -153.75 Q-82.35 -154.4 -85.05 -156.5 L-83.15 -157.05 -81.15 -157.5 -81.65 -163.4 -81.8 -168.7 -84.05 -168.75 -84.55 -168.8 -87.95 -169.15 -88.5 -169.2 -87.9 -169.4 -85.8 -169.9 -83.7 -170.5 -83.0 -170.9 -89.25 -172.35 -87.2 -173.0 -83.0 -174.25 -74.15 -176.75 Q-65.4 -178.6 -57.8 -177.0 -54.6 -176.3 -51.05 -175.0 M-51.05 -172.65 L-55.5 -173.85 -61.25 -175.0 -68.45 -175.45 -68.5 -175.45 Q-73.05 -175.05 -77.2 -173.15 L-77.85 -171.35 -78.65 -168.85 Q-78.9 -167.5 -78.5 -162.8 -78.2 -158.7 -78.85 -157.2 L-74.8 -156.25 Q-67.8 -154.25 -57.6 -159.3 -53.45 -161.35 -50.55 -163.55 -47.15 -166.25 -45.6 -169.2 -47.4 -171.2 -49.7 -172.2 L-51.05 -172.65 M-129.7 -123.35 Q-120.85 -121.9 -111.05 -121.55 -104.25 -121.35 -97.0 -121.7 L-94.1 -121.95 -92.95 -122.0 -88.1 -122.45 Q-71.15 -124.2 -52.85 -128.8 L-58.6 -131.85 Q-63.2 -134.3 -64.9 -134.8 L-64.85 -135.2 -63.5 -135.2 -62.65 -135.2 Q-59.3 -135.55 -49.15 -133.75 L-40.25 -132.1 Q-48.6 -124.95 -62.7 -121.8 L-63.5 -121.6 -65.65 -121.1 -73.6 -119.7 -90.95 -117.85 -93.8 -117.65 -97.8 -117.55 -111.05 -117.2 -114.35 -117.2 Q-123.45 -117.3 -133.1 -119.65 -136.2 -120.35 -144.05 -123.85 -151.75 -127.2 -153.0 -127.45 L-141.15 -130.1 -133.9 -131.2 -129.0 -131.5 -127.5 -131.45 -127.45 -131.45 -127.25 -131.45 -130.25 -130.5 -133.7 -129.4 -135.5 -128.8 Q-139.45 -127.4 -141.6 -126.0 -135.85 -124.4 -129.7 -123.35 M-141.6 -126.0 L-141.65 -126.05 -141.65 -126.0 -141.6 -126.0 M-135.5 -169.55 L-137.85 -170.5 Q-139.95 -171.1 -144.95 -170.4 L-146.8 -170.15 -148.55 -169.75 Q-152.0 -168.8 -156.25 -166.25 L-156.85 -165.9 -155.9 -164.1 Q-148.85 -151.45 -135.1 -153.9 L-134.95 -153.95 Q-133.1 -154.15 -131.35 -155.05 L-132.1 -159.6 -132.6 -161.95 -132.7 -162.55 -132.95 -163.8 -133.9 -168.75 -135.5 -169.55" fill="#856a56" fill-rule="evenodd" stroke="none"/>
    <path d="M-68.45 -175.45 L-68.85 -173.55 Q-68.85 -171.1 -68.0 -169.05 -75.1 -167.95 -76.65 -162.3 L-75.5 -162.0 Q-69.75 -160.95 -62.5 -163.4 L-60.2 -162.95 Q-58.15 -162.95 -56.35 -164.2 -55.0 -165.25 -53.7 -167.0 L-53.65 -167.1 -53.1 -167.85 Q-51.95 -169.55 -51.5 -170.8 L-51.05 -172.65 -49.7 -172.2 Q-47.4 -171.2 -45.6 -169.2 -47.15 -166.25 -50.55 -163.55 -53.45 -161.35 -57.6 -159.3 -67.8 -154.25 -74.8 -156.25 L-78.85 -157.2 Q-78.2 -158.7 -78.5 -162.8 -78.9 -167.5 -78.65 -168.85 L-77.85 -171.35 -77.2 -173.15 Q-73.05 -175.05 -68.5 -175.45 L-68.45 -175.45 M-135.5 -169.55 L-133.9 -168.75 -132.95 -163.8 -132.7 -162.55 -132.6 -161.95 -132.1 -159.6 -131.35 -155.05 Q-133.1 -154.15 -134.95 -153.95 L-135.1 -153.9 Q-148.85 -151.45 -155.9 -164.1 L-156.85 -165.9 -156.25 -166.25 Q-152.0 -168.8 -148.55 -169.75 L-148.85 -167.65 -148.65 -165.55 -154.45 -164.55 -154.55 -164.65 -154.7 -164.5 -154.45 -164.55 -150.4 -161.3 Q-146.4 -158.3 -144.65 -157.95 L-137.55 -158.35 -135.75 -158.7 -136.1 -160.65 -136.1 -160.75 -136.3 -162.1 Q-134.65 -164.15 -134.65 -166.25 -134.65 -168.2 -135.5 -169.55" fill="#cfbb8e" fill-rule="evenodd" stroke="none"/>
    <path d="M-68.0 -169.05 Q-68.85 -171.1 -68.85 -173.55 L-68.45 -175.45 -61.25 -175.0 -55.5 -173.85 -51.05 -172.65 -51.5 -170.8 Q-51.95 -169.55 -53.1 -167.85 -57.7 -168.95 -61.6 -169.25 L-66.35 -169.25 -68.0 -169.05 M-62.5 -163.4 L-61.4 -163.8 -58.25 -165.05 -53.7 -167.0 Q-55.0 -165.25 -56.35 -164.2 -58.15 -162.95 -60.2 -162.95 L-62.5 -163.4 M-148.55 -169.75 L-146.8 -170.15 -144.95 -170.4 Q-139.95 -171.1 -137.85 -170.5 L-135.5 -169.55 Q-134.65 -168.2 -134.65 -166.25 -134.65 -164.15 -136.3 -162.1 L-136.7 -164.65 -137.55 -164.8 -144.75 -165.6 -148.65 -165.55 -148.85 -167.65 -148.55 -169.75" fill="#587485" fill-rule="evenodd" stroke="none"/>
    <path d="M-68.0 -169.05 Q-67.25 -167.25 -65.8 -165.75 -64.2 -164.1 -62.5 -163.4 -69.75 -160.95 -75.5 -162.0 L-76.65 -162.3 Q-75.1 -167.95 -68.0 -169.05 M-148.65 -165.55 Q-148.2 -163.3 -146.8 -161.6 -144.75 -159.15 -141.75 -159.15 -140.15 -159.15 -138.7 -160.0 -137.7 -160.6 -136.75 -161.6 L-136.3 -162.1 -136.1 -160.75 -136.1 -160.65 -135.75 -158.7 -137.55 -158.35 -144.65 -157.95 Q-146.4 -158.3 -150.4 -161.3 L-154.45 -164.55 -154.7 -164.5 -154.55 -164.65 -154.45 -164.55 -148.65 -165.55" fill="#dec999" fill-rule="evenodd" stroke="none"/>
    <path d="M-68.0 -169.05 L-66.35 -169.25 -61.6 -169.25 Q-57.7 -168.95 -53.1 -167.85 L-53.65 -167.1 -53.7 -167.0 -58.25 -165.05 -61.4 -163.8 -62.5 -163.4 Q-64.2 -164.1 -65.8 -165.75 -67.25 -167.25 -68.0 -169.05 M-148.65 -165.55 L-144.75 -165.6 -137.55 -164.8 -136.7 -164.65 -136.3 -162.1 -136.75 -161.6 Q-137.7 -160.6 -138.7 -160.0 -140.15 -159.15 -141.75 -159.15 -144.75 -159.15 -146.8 -161.6 -148.2 -163.3 -148.65 -165.55" fill="#68889e" fill-rule="evenodd" stroke="none"/>
    <path d="M-118.6 -136.55 L-118.55 -136.6 -118.35 -136.65 -118.6 -136.55 M-121.2 -145.6 L-121.15 -145.65 -121.05 -145.65 -121.15 -145.6 -121.2 -145.6" fill="#bfa08c" fill-rule="evenodd" stroke="none"/>
  </g>
</svg>
