<?xml version="1.0" encoding="UTF-8" standalone="no"?>
<svg xmlns:xlink="http://www.w3.org/1999/xlink" height="57.8px" width="75.05px" xmlns="http://www.w3.org/2000/svg">
  <g transform="matrix(1.0, 0.0, 0.0, 1.0, 57.3, 14.4)">
    <path d="M-54.75 16.9 L-45.0 13.25 -36.1 10.25 -17.15 4.9 -17.25 5.3 -17.9 5.7 Q-19.0 6.3 -20.95 7.0 -19.0 6.3 -17.9 5.7 L-17.25 5.3 -17.3 5.9 Q-24.55 10.55 -28.8 14.9 -24.55 10.55 -17.3 5.9 L-16.8 5.55 -16.5 6.5 -15.9 8.45 Q-17.6 9.7 -18.65 11.3 -20.05 13.45 -21.4 16.95 L-21.4 16.55 Q-21.4 14.75 -20.85 12.45 L-20.0 9.65 -19.65 9.3 -19.55 9.25 -16.5 6.5 -19.55 9.25 -19.65 9.3 -20.0 9.65 Q-22.95 12.3 -25.15 17.5 -26.6 20.85 -27.3 24.45 -28.05 28.0 -28.05 31.85 L-28.05 32.3 -28.1 32.05 Q-28.4 30.7 -28.85 30.15 -29.2 29.7 -29.75 29.6 L-29.4 26.85 -29.05 24.95 -28.75 23.25 -28.05 18.95 Q-29.65 20.7 -31.8 25.4 L-32.05 26.05 -34.0 30.9 -34.25 31.1 -34.3 31.1 Q-35.55 32.2 -36.0 33.4 L-36.05 32.8 Q-36.05 24.6 -32.2 18.95 L-29.75 15.9 -28.8 14.9 -28.75 14.8 Q-28.45 14.1 -28.5 13.35 L-29.75 13.35 Q-45.3 21.65 -50.5 29.4 -49.2 26.55 -46.8 23.45 -41.1 15.95 -33.05 12.35 L-25.5 9.15 -20.95 7.0 -26.25 8.55 Q-32.8 10.4 -37.95 12.85 L-40.25 14.0 -42.9 15.5 -45.1 16.95 -45.35 15.9 Q-45.65 15.3 -46.1 15.05 -46.4 14.9 -46.8 14.9 L-50.75 15.9 Q-53.85 16.9 -54.5 16.9 L-54.75 16.9" fill="#b38484" fill-rule="evenodd" stroke="none"/>
    <path d="M-26.8 5.6 Q-19.2 5.05 -16.9 3.7 L-17.15 4.9 -36.1 10.25 -45.0 13.25 -54.75 16.9 -55.5 16.4 -55.95 15.6 Q-50.15 12.7 -45.15 10.8 L-39.85 8.9 -26.8 5.6 M-21.4 16.95 L-22.2 19.25 -22.6 20.6 -23.15 17.4 -23.5 17.65 -25.5 24.0 -26.2 26.0 -28.05 31.85 Q-28.05 28.0 -27.3 24.45 -26.6 20.85 -25.15 17.5 -22.95 12.3 -20.0 9.65 L-20.85 12.45 Q-21.4 14.75 -21.4 16.55 L-21.4 16.95 M-32.2 29.85 Q-33.15 30.2 -34.0 30.9 L-32.05 26.05 -31.8 25.4 Q-29.65 20.7 -28.05 18.95 L-28.75 23.25 -29.95 25.25 -31.05 27.35 -32.2 29.85 M-36.0 33.4 L-35.95 35.15 -35.85 37.55 Q-36.35 38.85 -37.75 40.0 L-37.85 37.0 -37.85 35.85 Q-37.8 30.75 -37.35 26.05 -36.9 21.5 -36.3 19.55 L-36.55 19.5 Q-46.2 27.85 -48.6 31.9 -49.7 33.7 -50.2 36.45 -50.75 39.15 -50.75 42.8 L-50.75 43.2 -51.55 42.95 -53.65 42.2 -53.8 42.15 -53.65 42.15 -54.0 39.25 -53.85 36.9 Q-53.2 30.4 -48.75 23.45 -44.8 17.3 -40.25 14.0 L-37.95 12.85 Q-32.8 10.4 -26.25 8.55 L-20.95 7.0 -25.5 9.15 -33.05 12.35 Q-41.1 15.95 -46.8 23.45 -49.2 26.55 -50.5 29.4 -45.3 21.65 -29.75 13.35 L-28.5 13.35 Q-28.45 14.1 -28.75 14.8 L-28.8 14.9 -29.75 15.9 -32.2 18.95 Q-36.05 24.6 -36.05 32.8 L-36.0 33.4 M-52.1 34.65 Q-51.85 32.7 -51.05 30.65 -51.85 32.7 -52.1 34.65" fill="#c29c9c" fill-rule="evenodd" stroke="none"/>
    <path d="M-26.8 5.6 L-39.85 8.9 -45.15 10.8 Q-50.15 12.7 -55.95 15.6 L-56.0 15.15 -55.75 13.65 -51.1 11.4 -45.5 9.1 Q-40.6 7.25 -35.55 6.05 L-31.0 5.8 -26.8 5.6 M-24.0 26.3 L-24.45 29.5 -24.5 29.95 -25.75 31.4 Q-27.0 32.8 -27.4 32.8 L-27.85 32.7 -27.95 32.55 -26.35 29.6 -24.0 26.3 M-39.85 41.25 L-40.25 41.45 -40.1 40.4 Q-40.1 39.75 -40.25 39.5 L-40.85 38.85 -41.85 38.85 -41.1 37.35 -40.9 36.3 -40.85 34.8 Q-40.85 32.4 -41.4 31.55 -41.85 30.9 -42.85 30.7 L-38.85 25.0 -39.6 36.2 -39.85 41.25 M-51.65 22.8 Q-54.45 27.55 -55.05 37.05 L-55.25 41.55 -56.8 40.9 -56.9 40.55 Q-57.3 39.05 -57.3 37.75 L-57.3 37.25 Q-57.15 29.15 -51.65 22.8" fill="#e0cdcd" fill-rule="evenodd" stroke="none"/>
    <path d="M-22.6 20.6 L-23.45 23.6 -24.0 26.3 -26.35 29.6 -27.95 32.55 -28.0 32.55 -28.05 32.3 -28.05 31.85 -26.2 26.0 -25.5 24.0 -23.5 17.65 -23.15 17.4 -22.6 20.6 M-29.75 29.6 L-30.4 29.5 Q-31.35 29.5 -32.2 29.85 L-31.05 27.35 -29.95 25.25 -28.75 23.25 -29.05 24.95 -29.4 26.85 -29.75 29.6 M-37.75 40.0 L-39.85 41.25 -39.6 36.2 -38.85 25.0 -42.85 30.7 -44.15 30.55 Q-45.9 30.55 -47.25 31.55 -48.75 32.7 -48.75 34.55 L-48.55 36.35 -47.75 38.3 -46.8 39.9 -47.35 39.85 Q-48.25 39.85 -49.0 40.7 -49.75 41.5 -49.75 42.55 L-49.65 43.4 -50.75 43.2 -50.75 42.8 Q-50.75 39.15 -50.2 36.45 -49.7 33.7 -48.6 31.9 -46.2 27.85 -36.55 19.5 L-36.3 19.55 Q-36.9 21.5 -37.35 26.05 -37.8 30.75 -37.85 35.85 L-37.85 37.0 -37.75 40.0 M-40.25 14.0 Q-44.8 17.3 -48.75 23.45 -53.2 30.4 -53.85 36.9 L-54.0 39.25 -53.65 42.15 -53.8 42.15 -55.25 41.55 -55.05 37.05 Q-54.45 27.55 -51.65 22.8 L-49.75 20.75 Q-47.8 18.85 -45.35 17.1 L-45.1 16.95 -42.9 15.5 -40.25 14.0" fill="#d2b6b6" fill-rule="evenodd" stroke="none"/>
    <path d="M-35.55 6.05 Q-40.6 7.25 -45.5 9.1 L-51.1 11.4 -55.75 13.65 Q-55.4 12.55 -54.45 11.7 L-52.95 10.55 Q-50.2 8.85 -46.9 7.8 L-45.9 7.5 Q-42.2 6.5 -35.55 6.05" fill="#f2eaea" fill-rule="evenodd" stroke="none"/>
    <path d="M-17.15 4.9 L-16.9 3.7 Q-19.2 5.05 -26.8 5.6 L-31.0 5.8 -35.55 6.05 Q-42.2 6.5 -45.9 7.5 L-46.9 7.8 Q-50.2 8.85 -52.95 10.55 L-54.45 11.7 Q-55.4 12.55 -55.75 13.65 L-56.0 15.15 -55.95 15.6 -55.5 16.4 -54.75 16.9 -54.5 16.9 Q-53.85 16.9 -50.75 15.9 L-46.8 14.9 Q-46.4 14.9 -46.1 15.05 -45.65 15.3 -45.35 15.9 L-45.1 16.95 -42.9 15.5 -40.25 14.0 M-17.15 4.9 L-17.25 5.3 -16.95 5.1 -16.8 5.55 -16.5 6.5 -15.9 8.45 Q-17.6 9.7 -18.65 11.3 -20.05 13.45 -21.4 16.95 L-22.2 19.25 -22.6 20.6 -23.45 23.6 -24.0 26.3 -24.45 29.5 -24.5 29.95 -25.75 31.4 Q-27.0 32.8 -27.4 32.8 L-27.85 32.7 -27.95 32.55 -28.0 32.55 -28.05 32.3 -28.1 32.05 Q-28.4 30.7 -28.85 30.15 -29.2 29.7 -29.75 29.6 L-30.4 29.5 Q-31.35 29.5 -32.2 29.85 -33.15 30.2 -34.0 30.9 L-34.25 31.1 -34.3 31.1 Q-35.55 32.2 -36.0 33.4 L-35.95 35.15 -35.85 37.55 Q-36.35 38.85 -37.75 40.0 L-39.85 41.25 -40.25 41.45 -40.1 40.4 Q-40.1 39.75 -40.25 39.5 L-40.85 38.85 -41.85 38.85 -42.15 39.35 -42.15 38.85 -41.85 38.85 -41.1 37.35 -40.9 36.3 -40.85 34.8 Q-40.85 32.4 -41.4 31.55 -41.85 30.9 -42.85 30.7 L-44.15 30.55 Q-45.9 30.55 -47.25 31.55 -48.75 32.7 -48.75 34.55 L-48.55 36.35 -47.75 38.3 -46.8 39.9 -46.75 39.95 -46.6 40.2 -46.5 40.4 -46.6 40.2 -46.75 40.15 -46.75 39.95 M-17.25 5.3 L-17.9 5.7 Q-19.0 6.3 -20.95 7.0 L-25.5 9.15 -33.05 12.35 Q-41.1 15.95 -46.8 23.45 -49.2 26.55 -50.5 29.4 M-28.8 14.9 Q-24.55 10.55 -17.3 5.9 L-17.25 5.3 M-16.8 5.55 L-17.3 5.9 M-16.5 6.5 L-19.55 9.25 -19.65 9.3 -20.0 9.65 Q-22.95 12.3 -25.15 17.5 -26.6 20.85 -27.3 24.45 -28.05 28.0 -28.05 31.85 L-28.05 32.3 M-20.95 7.0 L-26.25 8.55 Q-32.8 10.4 -37.95 12.85 L-40.25 14.0 M-53.8 42.15 L-53.65 42.2 -51.55 42.95 -50.75 43.2 -49.65 43.4 -49.75 42.55 Q-49.75 41.5 -49.0 40.7 -48.25 39.85 -47.35 39.85 L-46.8 39.9 M-29.75 15.9 L-32.2 18.95 Q-36.05 24.6 -36.05 32.8 L-36.0 33.4 M-45.1 16.95 L-45.35 17.1 Q-47.8 18.85 -49.75 20.75 M-55.25 41.55 L-53.8 42.15 M-51.05 30.65 Q-51.85 32.7 -52.1 34.65 M-51.65 22.8 Q-57.15 29.15 -57.3 37.25 L-57.3 37.75 Q-57.3 39.05 -56.9 40.55 L-56.8 40.9 -55.25 41.55" fill="none" stroke="#a36a6a" stroke-linecap="round" stroke-linejoin="round" stroke-width="0.05"/>
    <path d="M-16.9 3.7 L-17.15 4.9 -17.25 5.3 -17.3 5.9 -16.8 5.55 -16.5 6.5 -15.9 8.45 Q-17.6 9.7 -18.65 11.3 -20.05 13.45 -21.4 16.95 L-22.2 19.25 -22.6 20.6 -23.45 23.6 -24.0 26.3 -24.45 29.5 -24.5 29.95 -25.75 31.4 Q-27.0 32.8 -27.4 32.8 L-27.85 32.7 -27.95 32.55 -28.0 32.55 -28.05 32.3 -28.1 32.05 Q-28.4 30.7 -28.85 30.15 -29.2 29.7 -29.75 29.6 L-30.4 29.5 Q-31.35 29.5 -32.2 29.85 -33.15 30.2 -34.0 30.9 L-34.25 31.1 -34.3 31.1 Q-35.55 32.2 -36.0 33.4 L-35.95 35.15 -35.85 37.55 Q-36.35 38.85 -37.75 40.0 L-39.85 41.25 -40.25 41.45 -40.1 40.4 Q-40.1 39.75 -40.25 39.5 L-40.85 38.85 -41.85 38.85 -41.1 37.35 -40.9 36.3 -40.85 34.8 Q-40.85 32.4 -41.4 31.55 -41.85 30.9 -42.85 30.7 L-44.15 30.55 Q-45.9 30.55 -47.25 31.55 -48.75 32.7 -48.75 34.55 L-48.55 36.35 -47.75 38.3 -46.8 39.9 -47.35 39.85 Q-48.25 39.85 -49.0 40.7 -49.75 41.5 -49.75 42.55 L-49.65 43.4 -50.75 43.2 -51.55 42.95 -53.65 42.2 -53.8 42.15 -55.25 41.55 -56.8 40.9 -56.9 40.55 Q-57.3 39.05 -57.3 37.75 L-57.3 37.25 Q-57.15 29.15 -51.65 22.8 L-49.75 20.75 Q-47.8 18.85 -45.35 17.1 L-45.1 16.95 -45.35 15.9 Q-45.65 15.3 -46.1 15.05 -46.4 14.9 -46.8 14.9 L-50.75 15.9 Q-53.85 16.9 -54.5 16.9 L-54.75 16.9 -55.5 16.4 -55.95 15.6 -56.0 15.15 -55.75 13.65 Q-55.4 12.55 -54.45 11.7 L-52.95 10.55 Q-50.2 8.85 -46.9 7.8 L-45.9 7.5 Q-42.2 6.5 -35.55 6.05 L-31.0 5.8 -26.8 5.6 Q-19.2 5.05 -16.9 3.7" fill="url(#gradient0)" fill-rule="evenodd" stroke="none"/>
    <path d="M-3.4 -4.7 Q-2.1 -6.35 -0.5 -6.3 L-0.35 -6.3 Q0.5 -6.2 1.9 -4.95 L3.25 -3.6 3.95 -2.9 Q-1.5 -2.45 -5.9 0.1 -1.5 -2.45 3.95 -2.9 L5.3 -1.2 4.65 -1.3 -0.8 -0.9 -1.05 -0.85 -3.3 -0.15 -6.3 1.35 -5.9 0.1 -5.15 -1.8 -4.9 -2.15 -4.6 -2.75 Q-1.55 -4.25 1.9 -4.95 -1.55 -4.25 -4.6 -2.75 L-4.1 -3.7 -3.4 -4.7 -0.35 -6.3 -3.4 -4.7" fill="#e0cdcd" fill-rule="evenodd" stroke="none"/>
    <path d="M5.95 -8.35 L6.65 -7.4 7.9 -5.5 9.25 -2.75 6.4 -3.0 3.95 -2.9 6.4 -3.0 9.25 -2.75 10.35 0.25 Q7.9 -0.85 5.3 -1.2 L3.95 -2.9 3.25 -3.6 1.9 -4.95 7.7 -5.5 7.9 -5.5 7.7 -5.5 1.9 -4.95 Q0.5 -6.2 -0.35 -6.3 L-0.5 -6.3 Q-2.1 -6.35 -3.4 -4.7 L-3.7 -4.55 -5.55 -3.4 Q-8.7 -2.6 -11.5 -0.5 -8.7 -2.6 -5.55 -3.4 L-3.7 -4.55 -3.4 -4.7 -4.1 -3.7 -4.6 -2.75 -4.9 -2.15 -5.15 -1.8 -5.9 0.1 Q-9.3 2.05 -12.05 5.25 -9.3 2.05 -5.9 0.1 L-6.3 1.35 Q-8.1 2.2 -9.8 3.4 L-12.05 5.3 -12.05 5.25 -11.95 2.55 -9.0 -0.05 -4.6 -2.75 -9.0 -0.05 -11.95 2.55 -11.9 2.15 -11.5 -0.5 -11.2 -2.05 -10.6 -4.0 -9.9 -5.85 -8.65 -8.15 Q-4.5 -10.55 0.1 -10.55 2.35 -10.55 4.6 -9.85 2.35 -10.55 0.1 -10.55 -4.5 -10.55 -8.65 -8.15 -5.75 -12.65 -0.85 -12.55 2.0 -12.5 4.6 -9.85 L5.95 -8.35 2.2 -7.3 0.5 -7.5 Q-5.1 -7.5 -10.6 -4.0 -5.1 -7.5 0.5 -7.5 L2.2 -7.3 5.95 -8.35 M2.2 -7.3 L-0.35 -6.3 2.2 -7.3 M-5.55 -3.4 Q-9.5 -0.8 -11.9 2.15 -9.5 -0.8 -5.55 -3.4" fill="#d2b6b6" fill-rule="evenodd" stroke="none"/>
    <path d="M9.65 -10.95 L9.7 -10.85 9.85 -10.55 10.85 -8.65 12.5 -4.95 12.75 -4.35 12.4 -4.5 Q9.85 -5.45 7.9 -5.5 9.85 -5.45 12.4 -4.5 L12.75 -4.35 13.95 -0.95 15.05 3.75 14.6 3.25 Q13.55 2.2 12.3 1.4 L10.35 0.25 9.25 -2.75 7.9 -5.5 6.65 -7.4 5.95 -8.35 7.7 -8.6 9.95 -8.75 10.85 -8.65 9.95 -8.75 7.7 -8.6 5.95 -8.35 4.6 -9.85 5.35 -9.65 Q6.75 -9.2 7.7 -8.6 6.75 -9.2 5.35 -9.65 L4.6 -9.85 Q2.0 -12.5 -0.85 -12.55 -5.75 -12.65 -8.65 -8.15 L-9.9 -5.85 -10.6 -4.0 -11.15 -3.65 -14.4 -1.0 -11.15 -3.65 -10.6 -4.0 -11.2 -2.05 -11.5 -0.5 -12.9 0.55 -14.95 2.55 -12.9 0.55 -11.5 -0.5 -11.9 2.15 -11.95 2.55 -13.3 4.15 -11.9 2.15 -13.3 4.15 -11.95 2.55 -12.05 5.25 -12.05 5.3 -12.3 5.55 -12.05 5.25 -12.3 5.55 -13.75 7.1 Q-14.95 8.45 -15.55 10.15 L-15.7 10.45 -15.7 9.45 -15.5 7.5 -14.95 2.55 -14.4 -1.0 -14.35 -1.5 -14.0 -3.4 -13.8 -4.1 Q-11.95 -5.95 -10.15 -7.2 L-8.65 -8.15 -10.15 -7.2 Q-11.95 -5.95 -13.8 -4.1 L-12.6 -7.85 -11.3 -10.25 -8.15 -12.2 Q-4.45 -14.05 -0.25 -14.4 L1.8 -14.4 Q6.05 -13.85 9.3 -11.2 9.4 -11.1 9.65 -10.95 M9.7 -10.85 Q8.75 -11.5 4.95 -12.3 L-0.6 -13.05 Q-5.3 -13.05 -10.0 -9.85 L-12.6 -7.85 -10.0 -9.85 Q-5.3 -13.05 -0.6 -13.05 L4.95 -12.3 Q8.75 -11.5 9.7 -10.85 M13.95 -0.95 L13.3 -1.3 Q11.4 -2.35 9.25 -2.75 11.4 -2.35 13.3 -1.3 L13.95 -0.95 M-13.3 4.15 Q-14.6 5.7 -15.5 7.5 -14.6 5.7 -13.3 4.15" fill="#c29c9c" fill-rule="evenodd" stroke="none"/>
    <path d="M9.85 -10.55 L9.7 -10.85 9.65 -10.95 10.0 -10.65 9.85 -10.55" fill="#fee7b4" fill-rule="evenodd" stroke="none"/>
    <path d="M9.85 -10.55 L10.0 -10.65 Q11.35 -9.55 12.35 -8.25 13.4 -6.85 13.95 -5.2 L14.1 -3.8 12.75 -4.35 14.1 -3.8 14.2 -2.2 14.85 -0.3 16.15 2.95 17.55 6.3 Q17.85 6.95 17.75 7.8 L17.0 7.25 16.35 5.8 15.05 3.75 13.95 -0.95 12.75 -4.35 12.5 -4.95 10.85 -8.65 12.35 -8.25 10.85 -8.65 9.85 -10.55 M-11.3 -10.25 L-12.6 -7.85 -15.8 -4.4 -12.6 -7.85 -13.8 -4.1 -14.0 -3.4 -14.35 -1.5 -14.4 -1.0 Q-16.45 0.95 -17.6 3.25 -16.45 0.95 -14.4 -1.0 L-14.95 2.55 Q-16.7 4.5 -17.65 6.8 -16.7 4.5 -14.95 2.55 L-15.5 7.5 -15.7 9.45 -15.7 10.45 -16.05 11.95 -16.3 13.6 -17.05 12.35 -17.2 12.15 Q-16.65 9.65 -15.5 7.5 -16.65 9.65 -17.2 12.15 -17.6 11.6 -17.6 10.9 L-17.65 6.8 -17.6 5.1 -17.6 3.25 -17.7 2.35 -17.7 1.2 -17.5 -0.05 -17.0 -1.75 -15.8 -4.4 -13.6 -7.85 -11.3 -10.25 M14.85 -0.3 L13.95 -0.95 14.85 -0.3 M-17.5 -0.05 L-15.7 -2.15 -15.25 -2.65 -13.8 -4.1 -15.25 -2.65 -15.7 -2.15 -17.5 -0.05" fill="#b38484" fill-rule="evenodd" stroke="none"/>
    <path d="M10.0 -10.65 L9.65 -10.95 Q9.4 -11.1 9.3 -11.2 6.05 -13.85 1.8 -14.4 L-0.25 -14.4 Q-4.45 -14.05 -8.15 -12.2 L-11.3 -10.25 -13.6 -7.85 -15.8 -4.4 -12.6 -7.85 -10.0 -9.85 Q-5.3 -13.05 -0.6 -13.05 L4.95 -12.3 Q8.75 -11.5 9.7 -10.85 M7.9 -5.5 Q9.85 -5.45 12.4 -4.5 L12.75 -4.35 14.1 -3.8 14.2 -2.2 14.85 -0.3 16.15 2.95 17.55 6.3 Q17.85 6.95 17.75 7.8 L17.0 7.25 16.35 5.8 15.05 3.75 14.6 3.25 Q13.55 2.2 12.3 1.4 L10.35 0.25 Q7.9 -0.85 5.3 -1.2 M10.85 -8.65 L9.95 -8.75 7.7 -8.6 5.95 -8.35 M4.6 -9.85 Q2.35 -10.55 0.1 -10.55 -4.5 -10.55 -8.65 -8.15 L-10.15 -7.2 Q-11.95 -5.95 -13.8 -4.1 L-15.25 -2.65 -15.7 -2.15 -17.5 -0.05 -17.7 1.2 -17.7 2.35 -17.6 3.25 Q-16.45 0.95 -14.4 -1.0 L-11.15 -3.65 -10.6 -4.0 Q-5.1 -7.5 0.5 -7.5 L2.2 -7.3 5.95 -8.35 M7.7 -8.6 Q6.75 -9.2 5.35 -9.65 L4.6 -9.85 M-11.5 -0.5 Q-8.7 -2.6 -5.55 -3.4 L-3.7 -4.55 -3.4 -4.7 M-0.35 -6.3 L2.2 -7.3 M1.9 -4.95 Q-1.55 -4.25 -4.6 -2.75 L-9.0 -0.05 -11.95 2.55 M-5.9 0.1 Q-1.5 -2.45 3.95 -2.9 L6.4 -3.0 9.25 -2.75 Q11.4 -2.35 13.3 -1.3 L13.95 -0.95 14.85 -0.3 M7.9 -5.5 L7.7 -5.5 1.9 -4.95 M-0.35 -6.3 L-3.4 -4.7 M-12.05 5.25 Q-9.3 2.05 -5.9 0.1 M-6.3 1.35 L-3.3 -0.15 -1.05 -0.85 M-0.8 -0.9 L4.65 -1.3 5.3 -1.2 M12.35 -8.25 L10.85 -8.65 M14.1 -3.8 L13.95 -5.2 Q13.4 -6.85 12.35 -8.25 11.35 -9.55 10.0 -10.65 M-14.95 2.55 L-12.9 0.55 -11.5 -0.5 M-11.9 2.15 Q-9.5 -0.8 -5.55 -3.4 M-15.8 -4.4 L-17.0 -1.75 -17.5 -0.05 M-12.05 5.3 L-9.8 3.4 Q-8.1 2.2 -6.3 1.35 M-12.05 5.25 L-12.3 5.55 -12.05 5.3 M-11.9 2.15 L-13.3 4.15 -11.95 2.55 M-17.6 3.25 L-17.6 5.1 -17.65 6.8 Q-16.7 4.5 -14.95 2.55 M-15.5 7.5 Q-14.6 5.7 -13.3 4.15 M-17.2 12.15 L-17.05 12.35 -16.3 13.6 -16.05 11.95 M-15.5 7.5 Q-16.65 9.65 -17.2 12.15 -17.6 11.6 -17.6 10.9 L-17.65 6.8 M-15.7 10.45 L-15.55 10.15 Q-14.95 8.45 -13.75 7.1 L-12.3 5.55 M-16.3 13.6 L-16.1 14.4" fill="none" stroke="#a36a6a" stroke-linecap="round" stroke-linejoin="round" stroke-opacity="0.4" stroke-width="0.05"/>
  </g>
  <defs>
    <radialGradient cx="0" cy="0" fx="467.20000000000005" fy="0" gradientTransform="matrix(0.0385, -0.0222, 0.0081, 0.0141, -34.3, 20.0)" gradientUnits="userSpaceOnUse" id="gradient0" r="819.2" spreadMethod="pad">
      <stop offset="0.0" stop-color="#a36a6a"/>
      <stop offset="1.0" stop-color="#a36a6a" stop-opacity="0.0"/>
    </radialGradient>
  </defs>
</svg>
