<?xml version="1.0" encoding="UTF-8" standalone="no"?>
<svg xmlns:xlink="http://www.w3.org/1999/xlink" height="60.35px" width="60.35px" xmlns="http://www.w3.org/2000/svg">
  <g transform="matrix(1.0, 0.0, 0.0, 1.0, 30.2, 59.7)">
    <path d="M22.4 -7.05 L22.45 -7.25 22.4 -7.15 22.4 -7.05 21.65 -3.55 21.05 -1.15 Q20.7 -0.75 18.1 -0.5 L17.3 -0.5 17.3 -0.95 18.05 -4.25 18.6 -8.2 17.25 -5.6 16.4 -3.85 16.35 -3.7 16.2 -3.7 12.9 -3.3 7.7 -2.25 7.2 -2.25 Q7.25 -4.5 6.35 -5.15 L3.6 -5.6 -6.2 -5.25 -6.2 -3.35 -9.05 -3.0 -11.75 -2.5 -12.0 -4.3 -12.1 -4.3 -12.6 -3.0 -13.0 -2.1 -13.15 -1.8 -13.2 -1.75 -13.2 -1.65 -13.4 -1.25 Q-14.0 0.0 -14.35 0.0 L-18.25 -0.25 -19.35 -7.25 -19.2 -1.3 -21.6 -0.75 -24.3 -0.15 Q-26.75 -4.45 -28.55 -13.7 L-28.55 -13.85 -29.0 -23.6 -29.1 -25.2 Q-29.6 -30.0 -29.55 -34.7 -29.45 -39.4 -27.0 -43.35 -24.8 -46.9 -21.6 -49.5 -17.9 -52.65 -13.15 -54.55 -8.55 -56.4 -3.75 -57.65 L5.15 -59.05 Q7.1 -59.0 8.8 -58.3 L13.15 -56.75 18.1 -55.1 Q22.8 -53.55 25.7 -49.7 28.35 -46.05 29.05 -41.65 29.75 -37.2 29.4 -32.8 29.0 -28.15 28.25 -23.6 27.7 -19.5 27.55 -15.45 27.3 -9.65 26.25 -3.95 L25.6 -3.65 23.8 -3.55 22.4 -3.55 22.4 -7.05 M22.75 -8.3 L22.45 -7.25 22.75 -8.3" fill="url(#gradient0)" fill-rule="evenodd" stroke="none"/>
    <path d="M-28.55 -13.85 L-28.6 -14.0 -28.6 -13.9 -28.55 -13.85" fill="none" stroke="#fb8c1e" stroke-linecap="round" stroke-linejoin="round" stroke-width="0.05"/>
    <path d="M22.45 -7.25 L22.4 -7.05 22.4 -3.55 23.8 -3.55 25.6 -3.65 26.25 -3.95 Q27.3 -9.65 27.55 -15.45 27.7 -19.5 28.25 -23.6 29.0 -28.15 29.4 -32.8 29.75 -37.2 29.05 -41.65 28.35 -46.05 25.7 -49.7 22.8 -53.55 18.1 -55.1 L13.15 -56.75 8.8 -58.3 Q7.1 -59.0 5.15 -59.05 L-3.75 -57.65 Q-8.55 -56.4 -13.15 -54.55 -17.9 -52.65 -21.6 -49.5 -24.8 -46.9 -27.0 -43.35 -29.45 -39.4 -29.55 -34.7 -29.6 -30.0 -29.1 -25.2 L-29.0 -23.6 -28.55 -13.85 -28.55 -13.7 Q-26.75 -4.45 -24.3 -0.15 L-21.6 -0.75 -19.2 -1.3 -19.35 -7.25 -18.25 -0.25 -14.35 0.0 Q-14.0 0.0 -13.4 -1.25 L-13.2 -1.65 -13.2 -1.75 -13.15 -1.8 -13.0 -2.1 -12.6 -3.0 -12.1 -4.3 -12.0 -4.3 -11.75 -2.5 -9.05 -3.0 -6.2 -3.35 -6.2 -5.25 3.6 -5.6 6.35 -5.15 Q7.25 -4.5 7.2 -2.25 L7.7 -2.25 12.9 -3.3 16.2 -3.7 16.35 -3.7 16.4 -3.85 17.25 -5.6 18.6 -8.2 18.05 -4.25 17.3 -0.95 17.3 -0.5 18.1 -0.5 Q20.7 -0.75 21.05 -1.15 L21.65 -3.55 22.4 -7.05 22.4 -7.15 22.45 -7.25" fill="none" stroke="#a36a6a" stroke-linecap="round" stroke-linejoin="miter" stroke-miterlimit="3.0" stroke-opacity="0.69411767" stroke-width="1.0"/>
    <path d="M22.45 -7.25 L22.75 -8.3" fill="none" stroke="#a36a6a" stroke-linecap="round" stroke-linejoin="miter" stroke-miterlimit="3.0" stroke-opacity="0.69411767" stroke-width="1.0"/>
  </g>
  <defs>
    <linearGradient gradientTransform="matrix(0.0, 0.0137, -0.036, 0.0, 0.0, -9.65)" gradientUnits="userSpaceOnUse" id="gradient0" spreadMethod="pad" x1="-819.2" x2="819.2">
      <stop offset="0.0" stop-color="#e0cbcb"/>
      <stop offset="1.0" stop-color="#a36a6a"/>
    </linearGradient>
  </defs>
</svg>
