<?xml version="1.0" encoding="UTF-8" standalone="no"?>
<svg xmlns:xlink="http://www.w3.org/1999/xlink" height="82.05px" width="82.05px" xmlns="http://www.w3.org/2000/svg">
  <g transform="matrix(1.0, 0.0, 0.0, 1.0, 41.05, 41.0)">
    <path d="M27.15 -30.75 L29.0 -29.0 30.75 -27.15 28.15 -24.5 Q31.45 -20.85 33.55 -16.65 L36.95 -18.05 38.9 -13.35 35.5 -11.9 Q36.95 -7.45 37.25 -2.5 L40.95 -2.5 41.0 0.05 40.95 2.55 37.25 2.55 Q36.95 7.5 35.5 12.0 L38.9 13.4 36.95 18.1 33.55 16.7 Q31.45 20.9 28.15 24.55 L30.75 27.2 29.0 29.0 27.15 30.8 24.55 28.15 Q20.8 31.45 16.6 33.55 L18.05 37.0 13.35 38.95 11.95 35.5 Q7.5 37.0 2.55 37.3 L2.55 41.0 0.0 41.05 -2.55 41.0 -2.55 37.3 Q-7.5 37.0 -11.95 35.5 L-13.35 38.95 -18.05 37.0 -16.65 33.55 Q-20.85 31.45 -24.55 28.15 L-27.15 30.8 -29.0 29.0 -30.75 27.15 -28.15 24.55 Q-31.45 20.85 -33.55 16.65 L-36.95 18.05 Q-38.1 15.8 -38.9 13.35 L-35.5 11.95 Q-36.95 7.5 -37.25 2.55 L-40.95 2.55 -41.05 0.05 -40.95 -2.5 -37.25 -2.5 Q-36.95 -7.45 -35.5 -11.9 L-38.9 -13.35 -36.95 -18.05 -33.55 -16.6 Q-31.45 -20.85 -28.15 -24.5 L-30.75 -27.15 -29.0 -29.0 -27.15 -30.75 -24.55 -28.1 Q-20.85 -31.4 -16.65 -33.5 L-18.05 -36.95 Q-15.8 -38.05 -13.35 -38.85 L-11.95 -35.45 -11.15 -35.7 Q-7.05 -36.95 -2.55 -37.2 L-2.55 -40.9 0.0 -41.0 2.55 -40.95 2.55 -37.2 Q6.85 -37.0 10.75 -35.8 L11.95 -35.45 13.35 -38.9 18.05 -36.95 16.65 -33.5 Q20.8 -31.4 24.5 -28.15 L27.15 -30.75 M8.6 -7.35 L8.0 -8.0 7.4 -8.55 6.5 -9.25 5.15 -10.1 3.5 -10.75 2.55 -11.0 2.55 11.1 3.5 10.8 5.15 10.15 6.75 9.15 7.4 8.6 8.0 8.0 8.6 7.4 9.3 6.5 10.15 5.15 10.8 3.55 11.25 1.65 11.3 0.9 11.3 0.05 11.3 -0.85 11.15 -2.05 10.8 -3.5 10.15 -5.1 9.15 -6.7 8.6 -7.35 M2.35 -30.6 L1.85 -30.6 1.85 -19.25 2.55 -19.2 6.05 -18.45 8.8 -17.3 Q10.6 -16.35 12.25 -15.0 L20.25 -23.05 19.95 -23.3 18.35 -24.6 Q16.15 -26.2 13.9 -27.4 L10.75 -28.8 9.55 -29.2 4.0 -30.4 2.35 -30.6 M19.25 -2.05 L30.6 -2.05 30.55 -2.35 Q30.3 -6.15 29.25 -9.55 L27.45 -13.9 Q25.95 -16.7 23.9 -19.2 L23.3 -19.95 22.85 -20.45 14.85 -12.4 17.35 -8.75 18.5 -6.0 19.25 -2.05 M30.55 2.35 L30.6 1.65 19.3 1.65 Q19.15 3.95 18.5 6.05 L17.35 8.8 15.05 12.25 23.05 20.25 23.3 19.95 23.9 19.25 Q25.95 16.7 27.45 13.9 L29.25 9.55 Q30.3 6.15 30.55 2.35 M6.05 18.45 L2.55 19.25 1.85 19.35 1.85 30.6 2.35 30.55 4.0 30.45 Q6.9 30.1 9.55 29.15 11.85 28.5 13.9 27.4 17.05 25.8 19.95 23.3 L20.45 22.85 12.45 14.85 Q10.7 16.35 8.8 17.3 L6.05 18.45 M-10.8 -3.5 L-11.1 -2.05 -11.25 -0.85 -11.3 0.05 -11.25 0.9 -11.2 1.65 -10.8 3.55 -10.1 5.15 -9.3 6.5 -8.55 7.4 -8.0 8.0 -7.35 8.6 -6.7 9.15 -5.15 10.15 -3.5 10.8 -2.55 11.05 -2.55 -11.0 -3.5 -10.75 -5.15 -10.1 -6.45 -9.25 -7.35 -8.55 -8.0 -8.0 -8.55 -7.35 -9.1 -6.7 -10.1 -5.1 -10.8 -3.5 M-22.8 -20.4 L-23.25 -19.95 Q-25.8 -17.1 -27.4 -13.9 L-29.2 -9.55 Q-30.25 -6.15 -30.5 -2.35 L-30.5 -2.05 -19.25 -2.05 Q-19.05 -4.1 -18.45 -6.0 L-17.3 -8.75 -14.85 -12.45 -22.8 -20.4 M-11.15 -28.6 L-13.9 -27.4 Q-17.1 -25.75 -19.95 -23.3 L-20.25 -23.05 -12.2 -15.0 Q-10.6 -16.35 -8.8 -17.3 L-6.05 -18.45 -2.55 -19.2 -1.85 -19.25 -1.85 -30.6 -2.35 -30.6 -4.05 -30.4 -9.55 -29.2 -11.15 -28.6 M-19.3 1.65 L-30.55 1.65 -30.5 2.35 Q-30.3 6.15 -29.2 9.55 L-27.4 13.9 Q-25.8 17.1 -23.25 19.95 L-23.0 20.25 -15.05 12.25 -17.3 8.8 -18.45 6.05 Q-19.15 3.95 -19.3 1.65 M-8.8 17.3 L-12.4 14.85 -20.4 22.85 -19.95 23.3 Q-17.1 25.75 -13.9 27.4 L-9.55 29.15 -4.05 30.45 -2.35 30.55 -1.85 30.6 -1.85 19.35 -2.55 19.25 -6.05 18.45 -8.8 17.3" fill="#000000" fill-rule="evenodd" stroke="none"/>
  </g>
</svg>
