<?xml version="1.0" encoding="UTF-8" standalone="no"?>
<svg xmlns:xlink="http://www.w3.org/1999/xlink" height="76.9px" width="221.2px" xmlns="http://www.w3.org/2000/svg">
  <g transform="matrix(1.0, 0.0, 0.0, 1.0, 75.9, 147.35)">
    <path d="M85.1 -98.25 L87.7 -97.4 Q90.95 -96.05 92.25 -95.8 L92.2 -95.4 Q86.35 -92.8 82.9 -91.45 76.65 -88.85 72.4 -88.4 L67.75 -87.9 63.7 -87.6 56.6 -87.2 44.65 -87.25 18.75 -85.55 2.05 -84.5 Q-6.65 -84.15 -8.8 -84.55 L-9.35 -84.65 -15.95 -87.1 Q-22.45 -89.75 -24.55 -90.85 L-18.45 -94.9 -15.7 -96.5 -14.25 -96.6 7.55 -97.45 9.75 -97.4 Q20.4 -97.25 28.25 -95.85 L39.3 -92.95 52.85 -93.55 63.55 -94.55 64.9 -94.7 Q73.1 -95.65 79.8 -97.1 L85.1 -98.25" fill="#1e1f1e" fill-rule="evenodd" stroke="none"/>
    <path d="M116.85 -92.25 Q97.0 -84.1 70.5 -79.05 L62.35 -77.55 Q52.25 -75.9 42.55 -75.05 L31.75 -74.25 Q13.85 -73.25 2.55 -75.2 L-1.45 -74.45 -3.15 -74.5 -7.2 -74.55 -12.5 -74.4 Q-20.85 -73.9 -32.65 -75.5 L-44.3 -77.45 -42.65 -78.45 -57.85 -79.4 Q-52.85 -82.55 -42.95 -89.7 L-42.35 -90.1 -37.35 -93.75 -27.2 -95.3 -21.65 -95.85 -15.95 -96.4 -15.7 -96.5 -18.45 -94.9 -24.55 -90.85 Q-22.45 -89.75 -15.95 -87.1 L-9.35 -84.65 -8.8 -84.55 Q-6.65 -84.15 2.05 -84.5 L18.75 -85.55 44.65 -87.25 56.6 -87.2 63.7 -87.6 67.75 -87.9 72.4 -88.4 Q76.65 -88.85 82.9 -91.45 86.35 -92.8 92.2 -95.4 L92.25 -95.8 Q90.95 -96.05 87.7 -97.4 L85.1 -98.25 93.5 -100.3 94.6 -100.6 95.05 -100.7 96.8 -101.15 100.6 -101.95 107.35 -103.15 Q121.3 -105.55 124.8 -105.25 121.25 -98.85 116.85 -92.25" fill="#2a2b2a" fill-rule="evenodd" stroke="none"/>
    <path d="M84.4 -107.55 L85.45 -107.9 92.05 -109.0 Q96.55 -105.25 100.35 -102.05 L96.8 -101.15 95.05 -100.7 94.6 -100.6 93.5 -100.3 85.1 -98.25 79.8 -97.1 Q73.1 -95.65 64.9 -94.7 L63.2 -99.1 61.4 -103.35 68.95 -104.35 Q77.05 -105.7 84.4 -107.55" fill="#727370" fill-rule="evenodd" stroke="none"/>
    <path d="M139.1 -111.4 Q140.2 -111.15 142.3 -110.0 144.2 -108.85 145.3 -107.7 133.3 -98.95 116.85 -92.25 121.25 -98.85 124.8 -105.25 121.3 -105.55 107.35 -103.15 L100.6 -101.95 96.8 -101.15 100.35 -102.05 Q109.15 -104.45 119.4 -107.6 134.8 -112.15 139.05 -111.4 L139.1 -111.4 M-1.45 -74.45 L-3.3 -74.15 -7.05 -73.45 -21.6 -71.3 Q-36.75 -69.75 -51.4 -71.0 L-56.0 -72.8 Q-62.05 -75.35 -66.5 -78.05 -70.3 -80.35 -70.2 -80.85 -69.85 -82.65 -65.4 -85.55 L-65.6 -85.95 -63.2 -86.85 -60.65 -87.7 -60.25 -87.9 -59.95 -88.0 -48.8 -91.3 -37.35 -93.75 -42.35 -90.1 -42.95 -89.7 Q-52.85 -82.55 -57.85 -79.4 L-42.65 -78.45 -44.3 -77.45 -32.65 -75.5 Q-20.85 -73.9 -12.5 -74.4 L-7.2 -74.55 -3.15 -74.5 -1.45 -74.45" fill="#3c3d3b" fill-rule="evenodd" stroke="none"/>
    <path d="M92.05 -109.0 L109.65 -111.25 Q132.0 -113.95 133.8 -113.65 L137.5 -112.2 139.15 -111.55 139.05 -111.4 Q134.8 -112.15 119.4 -107.6 109.15 -104.45 100.35 -102.05 96.55 -105.25 92.05 -109.0" fill="#5d5e5b" fill-rule="evenodd" stroke="none"/>
    <path d="M139.15 -111.55 L139.1 -111.4 139.05 -111.4 139.15 -111.55" fill="#959595" fill-rule="evenodd" stroke="none"/>
    <path d="M10.35 -145.95 L18.0 -147.1 Q22.55 -147.45 27.25 -147.3 36.65 -146.8 54.7 -142.4 L55.1 -142.3 55.95 -142.1 58.5 -141.5 Q67.3 -139.8 76.85 -139.95 85.5 -140.05 94.9 -141.75 L94.15 -138.45 Q92.3 -130.8 86.4 -113.6 L84.4 -107.55 Q77.05 -105.7 68.95 -104.35 L70.05 -108.8 71.45 -111.4 Q74.95 -117.4 81.75 -135.55 L81.9 -136.15 77.25 -135.6 Q61.75 -133.8 58.55 -134.4 L52.6 -136.45 46.75 -138.25 35.75 -141.65 28.7 -143.35 28.0 -143.5 21.2 -144.7 13.5 -143.4 10.25 -142.65 10.1 -142.55 Q0.85 -137.3 0.55 -135.6 -0.15 -132.35 1.45 -128.45 2.6 -125.65 5.7 -120.75 9.15 -115.35 11.25 -111.05 L16.6 -111.25 Q21.45 -110.95 31.65 -109.1 L37.25 -108.0 44.65 -106.15 51.45 -104.05 54.85 -102.85 44.5 -102.55 Q36.0 -102.75 28.55 -104.0 L14.65 -105.4 13.7 -105.45 11.25 -111.05 9.55 -110.75 -1.7 -109.4 Q-4.65 -114.4 -9.9 -120.9 -16.4 -129.05 -16.05 -131.25 -15.3 -134.95 -1.35 -141.25 L9.5 -145.6 10.35 -145.95" fill="#5b5c5a" fill-rule="evenodd" stroke="none"/>
    <path d="M35.75 -141.65 L46.75 -138.25 52.6 -136.45 49.5 -125.1 Q45.4 -109.85 44.75 -106.6 L44.65 -106.15 37.25 -108.0 37.4 -108.25 38.55 -110.35 Q38.75 -111.05 38.05 -116.95 37.25 -124.35 37.1 -127.4 36.7 -137.0 35.75 -141.65" fill="#6f706d" fill-rule="evenodd" stroke="none"/>
    <path d="M11.25 -111.05 Q9.15 -115.35 5.7 -120.75 2.6 -125.65 1.45 -128.45 -0.15 -132.35 0.55 -135.6 0.85 -137.3 10.1 -142.55 L10.25 -142.65 13.5 -143.4 21.2 -144.7 28.0 -143.5 28.7 -143.35 35.75 -141.65 Q36.7 -137.0 37.1 -127.4 37.25 -124.35 38.05 -116.95 38.75 -111.05 38.55 -110.35 L37.4 -108.25 37.25 -108.0 31.65 -109.1 Q21.45 -110.95 16.6 -111.25 L11.25 -111.05 M52.6 -136.45 L58.55 -134.4 Q61.75 -133.8 77.25 -135.6 L81.9 -136.15 81.75 -135.55 Q74.95 -117.4 71.45 -111.4 L70.05 -108.8 68.95 -104.35 61.4 -103.35 59.75 -103.2 54.85 -102.85 51.45 -104.05 44.65 -106.15 44.75 -106.6 Q45.4 -109.85 49.5 -125.1 L52.6 -136.45" fill="#626361" fill-rule="evenodd" stroke="none"/>
    <path d="M14.65 -105.4 L28.55 -104.0 Q36.0 -102.75 44.5 -102.55 L54.85 -102.85 59.75 -103.2 61.4 -103.35 63.2 -99.1 64.9 -94.7 63.55 -94.55 52.85 -93.55 39.3 -92.95 28.25 -95.85 Q20.4 -97.25 9.75 -97.4 L10.1 -98.0 14.65 -105.4" fill="#81827f" fill-rule="evenodd" stroke="none"/>
    <path d="M-15.7 -96.5 L-15.95 -96.4 -21.65 -95.85 -15.85 -100.55 -11.15 -104.25 -10.7 -104.6 -7.05 -104.95 -1.75 -105.25 0.4 -105.35 0.5 -105.4 Q7.65 -105.7 13.7 -105.45 L14.65 -105.4 10.1 -98.0 9.75 -97.4 7.55 -97.45 -14.25 -96.6 -15.7 -96.5" fill="#5d5e5c" fill-rule="evenodd" stroke="none"/>
    <path d="M-73.3 -82.1 Q-69.6 -86.55 -65.75 -89.4 -63.3 -91.1 -60.4 -92.35 L-66.35 -85.6 Q-71.0 -83.75 -73.3 -82.1 M-20.3 -111.3 L-23.85 -116.0 -29.55 -122.45 Q-33.2 -126.75 -33.65 -128.2 L-33.45 -128.3 Q-29.9 -130.65 -23.45 -133.85 -26.8 -130.8 -27.0 -129.6 -27.35 -128.1 -22.25 -115.95 L-20.3 -111.3" fill="#5aa5e3" fill-rule="evenodd" stroke="none"/>
    <path d="M-47.1 -95.85 L-42.9 -96.75 Q-34.75 -98.4 -28.25 -101.0 -24.05 -102.7 -17.2 -103.75 L-15.4 -104.05 -11.2 -104.55 -11.15 -104.25 -15.85 -100.55 -21.65 -95.85 -27.2 -95.3 -37.35 -93.75 -48.8 -91.3 -59.95 -88.0 Q-54.8 -91.9 -47.1 -95.85 M-14.8 -137.8 Q-2.4 -143.05 9.5 -145.75 L9.5 -145.6 -1.35 -141.25 Q-15.3 -134.95 -16.05 -131.25 -16.4 -129.05 -9.9 -120.9 -4.65 -114.4 -1.7 -109.4 L-10.0 -109.15 -14.95 -116.5 Q-22.45 -128.05 -21.9 -130.85 -21.6 -132.15 -16.25 -136.5 L-14.8 -137.8" fill="#494a48" fill-rule="evenodd" stroke="none"/>
    <path d="M9.5 -145.75 L10.35 -145.95 9.5 -145.6 9.5 -145.75" fill="#3a3b39" fill-rule="evenodd" stroke="none"/>
    <path d="M-60.4 -92.35 L-58.85 -93.1 -55.0 -94.25 -47.1 -95.85 Q-54.8 -91.9 -59.95 -88.0 L-60.25 -87.9 -60.65 -87.7 -63.2 -86.85 -65.6 -85.95 -66.35 -85.6 -60.4 -92.35 M-15.4 -104.05 L-18.4 -108.6 -20.3 -111.3 -22.25 -115.95 Q-27.35 -128.1 -27.0 -129.6 -26.8 -130.8 -23.45 -133.85 L-20.5 -135.2 -14.8 -137.8 -16.25 -136.5 Q-21.6 -132.15 -21.9 -130.85 -22.45 -128.05 -14.95 -116.5 L-10.0 -109.15 -1.7 -109.4 Q-0.4 -107.25 0.4 -105.35 L-1.75 -105.25 -7.05 -104.95 -10.7 -104.6 -11.2 -104.55 -15.4 -104.05" fill="#447fab" fill-rule="evenodd" stroke="none"/>
    <path d="M-1.7 -109.4 L9.55 -110.75 11.25 -111.05 13.7 -105.45 Q7.65 -105.7 0.5 -105.4 L0.4 -105.35 Q-0.4 -107.25 -1.7 -109.4" fill="#346482" fill-rule="evenodd" stroke="none"/>
    <path d="M-10.7 -104.6 L-11.15 -104.25 -11.2 -104.55 -10.7 -104.6" fill="#6a6b68" fill-rule="evenodd" stroke="none"/>
    <path d="M-51.4 -71.0 L-58.2 -71.75 -65.1 -72.8 Q-72.6 -74.2 -74.75 -75.85 L-75.2 -76.25 Q-76.05 -77.2 -75.85 -78.75 L-73.3 -82.1 Q-71.0 -83.75 -66.35 -85.6 L-65.6 -85.95 -65.4 -85.55 Q-69.85 -82.65 -70.2 -80.85 -70.3 -80.35 -66.5 -78.05 -62.05 -75.35 -56.0 -72.8 L-51.4 -71.0" fill="#254a5e" fill-rule="evenodd" stroke="none"/>
  </g>
</svg>
