<?xml version="1.0" encoding="UTF-8" standalone="no"?>
<svg xmlns:xlink="http://www.w3.org/1999/xlink" height="43.35px" width="45.6px" xmlns="http://www.w3.org/2000/svg">
  <g transform="matrix(1.0, 0.0, 0.0, 1.0, 15.35, 10.9)">
    <path d="M8.05 -2.35 L7.9 -3.6 Q8.1 -4.4 9.2 -4.95 L9.5 -5.1 Q11.15 -5.9 13.45 -5.9 15.7 -5.9 17.45 -5.1 L17.7 -4.95 Q18.8 -4.4 19.0 -3.6 L18.95 -2.5 Q18.6 -1.8 17.45 -1.2 L17.25 -1.05 16.6 -0.85 15.45 -0.55 13.85 -0.45 13.45 -0.45 12.5 -0.45 10.1 -0.9 9.5 -1.2 9.3 -1.25 Q8.4 -1.8 8.05 -2.35 M9.0 -3.45 L9.15 -2.5 10.3 -1.55 Q11.25 -1.1 12.45 -1.0 L13.45 -1.0 13.75 -1.0 15.45 -1.2 16.55 -1.45 16.7 -1.55 17.85 -2.65 17.9 -3.45 Q17.7 -4.2 16.7 -4.7 L16.0 -4.95 13.45 -5.35 10.95 -4.95 10.3 -4.7 Q9.3 -4.2 9.0 -3.45" fill="#6b0d03" fill-rule="evenodd" stroke="none"/>
    <path d="M9.0 -3.45 Q9.3 -4.2 10.3 -4.7 L10.95 -4.95 13.45 -5.35 16.0 -4.95 16.7 -4.7 Q17.7 -4.2 17.9 -3.45 L17.85 -2.65 16.7 -1.55 16.55 -1.45 15.45 -1.2 13.75 -1.0 13.45 -1.0 12.45 -1.0 Q11.25 -1.1 10.3 -1.55 L9.15 -2.5 9.0 -3.45" fill="#4a0902" fill-rule="evenodd" stroke="none"/>
    <path d="M8.05 -2.35 Q8.4 -1.8 9.3 -1.25 L9.5 -1.2 10.1 -0.9 12.5 -0.45 13.45 -0.45 13.85 -0.45 14.1 1.2 14.15 3.6 14.1 5.05 14.0 5.2 Q13.95 7.4 14.2 9.45 L13.75 16.35 Q13.75 16.85 14.4 17.95 L14.2 18.5 14.0 19.35 13.75 28.25 13.95 30.05 14.2 31.85 14.2 32.45 13.45 32.45 12.8 32.45 10.5 32.1 10.3 32.05 9.5 31.7 Q8.4 31.15 8.05 30.55 L8.05 -2.35 M10.3 31.35 L11.55 31.5 12.55 31.95 12.65 31.95 12.35 29.5 12.15 25.2 12.0 23.2 12.45 20.8 12.85 18.6 Q12.15 16.85 12.15 15.55 L12.85 7.05 Q12.55 6.0 12.55 5.2 L12.7 2.85 12.55 0.3 12.55 0.25 10.5 -0.15 10.15 -0.15 9.15 -0.35 9.15 0.8 9.3 4.3 Q9.0 5.2 9.0 5.6 9.0 7.05 9.15 8.35 L9.4 11.2 9.2 15.6 9.0 18.4 9.15 18.9 9.0 20.35 9.2 26.0 9.3 29.1 9.4 31.0 10.15 31.35 10.3 31.35" fill="#ad1303" fill-rule="evenodd" stroke="none"/>
    <path d="M17.25 -1.05 L17.45 -1.2 Q18.6 -1.8 18.95 -2.5 L18.95 29.1 19.1 29.7 Q19.1 30.9 17.45 31.7 L16.8 31.95 16.8 31.65 16.7 30.05 17.25 13.7 16.9 10.3 Q16.55 8.15 16.55 7.1 L16.8 3.7 17.25 -0.3 17.25 -1.05 M10.15 -0.15 L10.5 -0.15 12.55 0.25 12.55 0.3 12.7 2.85 12.55 5.2 Q12.55 6.0 12.85 7.05 L12.15 15.55 Q12.15 16.85 12.85 18.6 L12.45 20.8 12.0 23.2 12.15 25.2 12.35 29.5 12.65 31.95 12.55 31.95 11.55 31.5 10.3 31.35 9.9 25.35 9.6 19.3 9.55 15.8 10.4 7.7 10.1 0.2 10.15 -0.15" fill="#cc1704" fill-rule="evenodd" stroke="none"/>
    <path d="M13.85 -0.45 L15.45 -0.55 15.45 4.5 14.95 10.25 Q14.95 12.15 15.4 16.0 L15.85 21.7 15.3 26.5 14.85 31.1 14.85 32.4 14.2 32.45 14.2 31.85 13.95 30.05 13.75 28.25 14.0 19.35 14.2 18.5 14.4 17.95 Q13.75 16.85 13.75 16.35 L14.2 9.45 Q13.95 7.4 14.0 5.2 L14.1 5.05 14.15 3.6 14.1 1.2 13.85 -0.45 M16.6 -0.85 L17.25 -1.05 17.25 -0.3 16.8 3.7 16.55 7.1 Q16.55 8.15 16.9 10.3 L17.25 13.7 16.7 30.05 16.8 31.65 16.8 31.95 16.15 32.2 16.25 30.75 16.4 28.05 16.25 25.55 16.55 24.1 16.4 23.55 16.8 18.2 Q16.8 16.5 16.2 13.7 15.65 10.85 15.65 9.8 L15.85 7.3 16.15 4.9 16.7 0.0 16.6 -0.85" fill="#e31904" fill-rule="evenodd" stroke="none"/>
    <path d="M15.45 -0.55 L16.6 -0.85 16.7 0.0 16.15 4.9 15.85 7.3 15.65 9.8 Q15.65 10.85 16.2 13.7 16.8 16.5 16.8 18.2 L16.4 23.55 16.55 24.1 16.25 25.55 16.4 28.05 16.25 30.75 16.15 32.2 14.85 32.4 14.85 31.1 15.3 26.5 15.85 21.7 15.4 16.0 Q14.95 12.15 14.95 10.25 L15.45 4.5 15.45 -0.55 M10.15 -0.15 L10.1 0.2 10.4 7.7 9.55 15.8 9.6 19.3 9.9 25.35 10.3 31.35 10.15 31.35 9.4 31.0 9.3 29.1 9.2 26.0 9.0 20.35 9.15 18.9 9.0 18.4 9.2 15.6 9.4 11.2 9.15 8.35 Q9.0 7.05 9.0 5.6 9.0 5.2 9.3 4.3 L9.15 0.8 9.15 -0.35 10.15 -0.15" fill="#ff1d05" fill-rule="evenodd" stroke="none"/>
    <path d="M-2.2 -0.15 L-0.25 0.45 -0.05 4.95 -0.45 4.85 -2.2 4.4 -2.2 4.3 -2.15 4.1 -2.2 3.6 -2.2 2.65 -2.2 1.0 -2.2 0.1 -2.3 -0.15 -2.2 -0.15 M0.95 0.7 L1.4 0.75 3.8 1.15 3.8 1.4 Q3.8 2.35 4.25 3.8 L3.95 5.15 3.8 5.6 2.45 5.4 1.0 5.15 1.15 2.75 0.95 0.7 M12.25 1.2 L13.2 1.05 13.6 5.45 13.55 5.55 12.05 5.8 12.05 5.6 12.15 4.75 12.3 3.45 12.25 1.9 12.25 1.2 M17.65 0.15 L18.9 -0.5 18.9 -0.35 18.9 0.1 18.9 1.05 18.95 2.8 Q19.3 3.7 17.85 4.4 L17.65 4.5 17.75 4.0 17.85 3.05 17.55 1.45 17.65 0.15" fill="#fa8900" fill-rule="evenodd" stroke="none"/>
    <path d="M-2.2 -0.15 L-1.7 -0.3 -1.25 -0.15 -0.25 0.1 0.3 0.2 0.85 0.4 2.75 0.7 3.8 0.9 4.3 0.95 6.45 1.1 7.1 1.15 8.75 1.15 9.05 1.15 11.15 1.0 11.3 1.0 11.9 0.85 12.3 0.8 13.2 0.65 13.25 0.65 15.15 0.35 16.05 0.15 17.55 -0.25 18.3 -0.55 18.35 -0.7 18.9 -0.5 17.65 0.15 17.15 0.25 16.05 0.5 14.15 0.85 13.2 1.05 12.25 1.2 11.2 1.35 11.1 1.35 9.1 1.45 7.4 1.45 7.15 1.45 3.8 1.15 1.4 0.75 0.95 0.7 -0.25 0.45 -2.2 -0.15" fill="#333333" fill-opacity="0.3647059" fill-rule="evenodd" stroke="none"/>
    <path d="M7.15 1.45 L7.4 1.45 9.1 1.45 9.75 4.5 10.0 6.0 9.45 6.0 7.75 6.0 7.6 5.75 Q7.15 4.95 7.15 4.45 L7.3 2.6 7.15 1.45 M11.2 1.35 L12.25 1.2 12.25 1.9 12.3 3.45 12.15 4.75 12.05 5.6 12.05 5.8 11.8 3.85 11.2 1.35 M16.05 0.5 L17.15 0.25 17.65 0.15 17.55 1.45 17.85 3.05 17.75 4.0 17.65 4.5 16.15 5.1 16.35 2.9 16.05 0.5" fill="#fcb035" fill-rule="evenodd" stroke="none"/>
    <path d="M-0.25 0.45 L0.95 0.7 1.15 2.75 1.0 5.15 -0.05 4.95 -0.25 0.45 M3.8 1.15 L7.15 1.45 7.3 2.6 7.15 4.45 Q7.15 4.95 7.6 5.75 L7.75 6.0 6.95 6.0 4.65 5.75 3.8 5.6 3.95 5.15 4.25 3.8 Q3.8 2.35 3.8 1.4 L3.8 1.15 M13.2 1.05 L14.15 0.85 16.05 0.5 16.35 2.9 16.15 5.1 15.5 5.2 13.6 5.55 13.55 5.55 13.6 5.45 13.2 1.05" fill="#b15901" fill-rule="evenodd" stroke="none"/>
    <path d="M9.1 1.45 L11.1 1.35 11.2 1.35 11.8 3.85 12.05 5.8 11.4 5.85 10.85 5.9 10.0 6.0 9.75 4.5 9.1 1.45" fill="#fccd35" fill-rule="evenodd" stroke="none"/>
    <path d="M18.9 25.5 L19.05 25.5 18.9 25.6 18.9 25.5" fill="#333333" fill-opacity="0.3647059" fill-rule="evenodd" stroke="none"/>
    <path d="M19.05 25.5 L19.05 25.7 19.05 26.05 19.05 26.9 19.1 28.1 19.1 28.4 Q19.45 29.1 18.0 29.75 L17.8 29.85 17.9 29.4 18.0 28.6 17.7 27.2 17.8 26.05 18.9 25.6 19.05 25.5 M13.7 30.75 L12.2 30.95 12.2 30.8 12.3 30.05 12.45 28.9 12.4 27.6 12.4 27.0 13.35 26.85 13.75 30.65 13.7 30.75 M3.95 30.8 L2.6 30.65 1.15 30.35 1.3 28.35 1.1 26.55 1.55 26.65 3.95 26.95 3.95 27.2 Q3.95 27.95 4.4 29.25 L4.1 30.35 3.95 30.8 M0.1 30.25 L-0.3 30.2 -2.05 29.75 -2.05 29.7 -2.0 29.5 -2.05 29.05 -2.05 28.2 -2.05 26.9 -2.05 26.05 -2.05 25.9 -2.15 25.8 -2.05 25.8 -0.1 26.3 0.1 30.25" fill="#fa8900" fill-rule="evenodd" stroke="none"/>
    <path d="M-2.05 25.8 L-2.15 19.5 18.9 19.5 18.9 25.5 18.9 25.6 17.8 26.05 17.3 26.2 16.2 26.4 14.3 26.7 13.35 26.85 12.4 27.0 11.35 27.15 11.25 27.15 9.25 27.2 7.55 27.2 7.3 27.2 3.95 26.95 1.55 26.65 1.1 26.55 -0.1 26.3 -2.05 25.8" fill="#2b1300" fill-opacity="0.69411767" fill-rule="evenodd" stroke="none"/>
    <path d="M17.8 29.85 L16.3 30.3 16.5 28.45 16.2 26.4 17.3 26.2 17.8 26.05 17.7 27.2 18.0 28.6 17.9 29.4 17.8 29.85 M10.15 31.15 L9.6 31.15 7.9 31.15 7.75 30.9 Q7.3 30.2 7.3 29.8 L7.45 28.2 7.3 27.2 7.55 27.2 9.25 27.2 9.9 29.8 10.15 31.15 M11.35 27.15 L12.4 27.0 12.4 27.6 12.45 28.9 12.3 30.05 12.2 30.8 12.2 30.95 11.95 29.3 11.35 27.15" fill="#fcb035" fill-rule="evenodd" stroke="none"/>
    <path d="M16.3 30.3 L15.65 30.45 13.75 30.75 13.7 30.75 13.75 30.65 13.35 26.85 14.3 26.7 16.2 26.4 16.5 28.45 16.3 30.3 M7.9 31.15 L7.1 31.15 4.8 30.9 3.95 30.8 4.1 30.35 4.4 29.25 Q3.95 27.95 3.95 27.2 L3.95 26.95 7.3 27.2 7.45 28.2 7.3 29.8 Q7.3 30.2 7.75 30.9 L7.9 31.15 M1.15 30.35 L0.1 30.25 -0.1 26.3 1.1 26.55 1.3 28.35 1.15 30.35" fill="#b15901" fill-rule="evenodd" stroke="none"/>
    <path d="M12.2 30.95 L11.55 31.0 11.0 31.0 10.15 31.15 9.9 29.8 9.25 27.2 11.25 27.15 11.35 27.15 11.95 29.3 12.2 30.95" fill="#fccd35" fill-rule="evenodd" stroke="none"/>
    <path d="M-4.7 11.95 L26.9 11.95 27.5 11.8 Q28.7 11.8 29.5 13.45 L29.75 14.1 29.45 14.1 27.85 14.2 11.5 13.65 8.1 14.0 4.9 14.35 1.5 14.1 -2.5 13.65 -3.25 13.65 -3.4 13.45 Q-4.0 12.3 -4.7 11.95 M-2.35 20.75 L-2.35 20.4 -1.95 18.35 -1.9 18.35 0.65 18.2 3.0 18.35 4.85 18.05 13.35 18.75 Q14.65 18.75 16.4 18.05 L18.6 18.45 21.0 18.9 23.0 18.75 27.3 18.55 29.75 18.25 29.75 18.35 29.3 19.35 Q29.0 19.7 29.15 20.6 L23.15 21.0 17.1 21.3 13.6 21.35 5.5 20.5 -2.0 20.8 -2.35 20.75" fill="#cc1704" fill-rule="evenodd" stroke="none"/>
    <path d="M29.75 14.1 L30.0 14.75 28.55 14.65 25.85 14.5 23.35 14.65 21.9 14.35 21.35 14.5 16.0 14.1 11.5 14.7 7.6 15.25 5.1 15.05 2.7 14.75 -2.2 14.2 -3.05 14.3 -3.25 13.65 -2.5 13.65 1.5 14.1 4.9 14.35 8.1 14.0 11.5 13.65 27.85 14.2 29.45 14.1 29.75 14.1 M30.2 16.05 L30.25 16.7 29.65 16.7 27.85 16.95 26.05 17.15 17.15 16.9 16.3 16.7 15.75 16.5 14.15 17.15 7.25 16.7 3.0 16.9 2.85 16.8 1.4 16.75 -1.0 16.8 -2.65 17.05 -2.75 15.45 2.3 15.45 8.05 15.95 13.8 15.5 19.5 15.05 24.3 15.6 28.9 16.05 30.2 16.05" fill="#e31904" fill-rule="evenodd" stroke="none"/>
    <path d="M30.0 14.75 L30.2 16.05 28.9 16.05 24.3 15.6 19.5 15.05 13.8 15.5 8.05 15.95 2.3 15.45 -2.75 15.45 -3.05 14.3 -2.2 14.2 2.7 14.75 5.1 15.05 7.6 15.25 11.5 14.7 16.0 14.1 21.35 14.5 21.9 14.35 23.35 14.65 25.85 14.5 28.55 14.65 30.0 14.75 M-2.35 20.75 L-2.0 20.8 5.5 20.5 13.6 21.35 17.1 21.3 23.15 21.0 29.15 20.6 29.15 20.75 28.8 21.5 26.9 21.6 23.8 21.7 18.15 21.9 16.7 21.75 16.2 21.9 13.4 21.7 9.0 21.5 6.15 21.75 3.4 21.9 2.1 21.6 -1.4 21.75 -2.55 21.75 -2.35 20.75" fill="#ff1d05" fill-rule="evenodd" stroke="none"/>
    <path d="M30.25 16.7 L30.25 17.45 30.25 18.1 29.9 20.4 29.85 20.6 29.5 21.4 Q28.95 22.5 28.35 22.85 L-4.55 22.85 -3.45 21.6 -3.4 21.4 -3.1 20.8 Q-2.75 19.7 -2.65 18.4 L-2.65 17.45 -2.65 17.05 -1.0 16.8 1.4 16.75 2.85 16.8 3.0 16.9 7.25 16.7 14.15 17.15 15.75 16.5 16.3 16.7 17.15 16.9 26.05 17.15 27.85 16.95 29.65 16.7 30.25 16.7 M29.15 20.6 Q29.0 19.7 29.3 19.35 L29.75 18.35 29.75 18.25 27.3 18.55 23.0 18.75 21.0 18.9 18.6 18.45 16.4 18.05 Q14.65 18.75 13.35 18.75 L4.85 18.05 3.0 18.35 0.65 18.2 -1.9 18.35 -1.95 18.35 -2.35 20.4 -2.35 20.75 -2.55 21.75 -1.4 21.75 2.1 21.6 3.4 21.9 6.15 21.75 9.0 21.5 13.4 21.7 16.2 21.9 16.7 21.75 18.15 21.9 23.8 21.7 26.9 21.6 28.8 21.5 29.15 20.75 29.15 20.6" fill="#ad1303" fill-rule="evenodd" stroke="none"/>
    <path d="M-4.55 22.85 L-5.8 23.0 Q-6.6 22.8 -7.15 21.7 L-7.3 21.4 Q-8.1 19.75 -8.1 17.45 -8.1 15.2 -7.3 13.45 L-7.15 13.2 Q-6.6 12.1 -5.8 11.9 L-4.7 11.95 Q-4.0 12.3 -3.4 13.45 L-3.25 13.65 -3.05 14.3 -2.75 15.45 -2.65 17.05 -2.65 17.45 -2.65 18.4 Q-2.75 19.7 -3.1 20.8 L-3.4 21.4 -3.45 21.6 -4.55 22.85 M-3.4 15.45 L-3.65 14.35 -3.75 14.2 -4.85 13.05 -5.65 13.0 Q-6.4 13.2 -6.9 14.2 L-7.15 14.9 Q-7.55 16.0 -7.55 17.45 -7.55 18.9 -7.15 19.95 L-6.9 20.6 Q-6.4 21.6 -5.65 21.9 L-4.7 21.75 -3.75 20.6 Q-3.3 19.65 -3.2 18.45 L-3.2 17.45 -3.2 17.15 -3.4 15.45" fill="#6b0d03" fill-rule="evenodd" stroke="none"/>
    <path d="M-3.4 15.45 L-3.2 17.15 -3.2 17.45 -3.2 18.45 Q-3.3 19.65 -3.75 20.6 L-4.7 21.75 -5.65 21.9 Q-6.4 21.6 -6.9 20.6 L-7.15 19.95 Q-7.55 18.9 -7.55 17.45 -7.55 16.0 -7.15 14.9 L-6.9 14.2 Q-6.4 13.2 -5.65 13.0 L-4.85 13.05 -3.75 14.2 -3.65 14.35 -3.4 15.45" fill="#4a0902" fill-rule="evenodd" stroke="none"/>
    <path d="M2.0 12.4 L1.4 12.35 0.35 12.3 -1.45 12.45 -2.9 12.4 Q-3.2 11.9 -3.6 11.75 L-3.4 11.75 -2.9 11.75 -1.85 11.75 0.1 11.7 Q1.05 11.5 1.85 12.3 L2.0 12.4 M-1.9 14.8 L3.0 14.55 3.15 14.6 3.4 15.4 3.2 15.4 2.25 15.35 0.8 15.25 -0.95 15.3 -1.7 15.3 -1.9 14.8 M3.2 19.8 L2.95 20.5 2.65 21.3 0.05 21.25 -2.3 21.35 -2.2 21.1 -1.75 19.8 -1.45 19.8 1.15 19.55 2.65 19.75 3.2 19.8 M2.45 21.9 L2.4 22.1 1.85 23.05 1.75 23.05 1.5 23.0 0.95 23.05 -0.1 23.05 -1.9 23.05 -2.9 23.05 -3.2 23.05 -2.55 22.0 2.45 21.9" fill="#fa8900" fill-rule="evenodd" stroke="none"/>
    <path d="M-2.9 12.4 L-1.45 12.45 0.35 12.3 1.4 12.35 2.0 12.4 2.6 13.2 0.2 13.1 -2.5 13.3 -2.75 12.65 -2.9 12.4 M3.65 16.5 L3.65 16.8 3.65 17.7 3.35 17.8 1.9 18.0 -0.15 17.95 -1.45 18.0 -1.45 17.9 -1.45 16.95 1.95 16.65 3.65 16.5 M-1.7 15.3 L-0.95 15.3 0.8 15.25 2.25 15.35 3.2 15.4 3.4 15.4 1.25 15.55 -1.55 15.85 -1.7 15.3" fill="#fcb035" fill-rule="evenodd" stroke="none"/>
    <path d="M-2.5 13.3 L0.2 13.1 2.6 13.2 2.75 13.55 3.15 14.55 3.15 14.6 3.0 14.55 -1.9 14.8 -2.1 14.3 -2.5 13.3 M3.65 17.7 L3.65 18.1 3.35 19.35 3.2 19.8 2.65 19.75 1.15 19.55 -1.45 19.8 -1.75 19.8 Q-1.45 18.85 -1.45 18.0 L-0.15 17.95 1.9 18.0 3.35 17.8 3.65 17.7 M2.65 21.3 L2.45 21.9 -2.55 22.0 -2.3 21.35 0.05 21.25 2.65 21.3" fill="#b15901" fill-rule="evenodd" stroke="none"/>
    <path d="M3.4 15.4 L3.45 15.75 3.5 16.05 3.65 16.5 1.95 16.65 -1.45 16.95 -1.55 15.9 -1.55 15.85 1.25 15.55 3.4 15.4" fill="#fccd35" fill-rule="evenodd" stroke="none"/>
    <path d="M-3.6 11.75 Q-3.2 11.9 -2.9 12.4 L-2.75 12.65 -2.5 13.3 -2.1 14.3 -1.9 14.8 -1.7 15.3 -1.55 15.85 -1.55 15.9 -1.45 16.95 -1.45 17.9 -1.45 18.0 Q-1.45 18.85 -1.75 19.8 L-2.2 21.1 -2.3 21.35 -2.55 22.0 -3.2 23.05 -3.35 22.75 -3.2 22.5 -2.9 22.0 -2.8 21.65 -2.65 21.4 -2.25 20.4 -2.05 19.8 -2.0 19.55 -1.8 18.4 -1.75 18.05 -1.75 17.15 -1.75 17.0 -1.9 15.9 -1.95 15.8 -2.1 15.5 -2.15 15.25 -2.3 14.8 -2.3 14.75 -2.7 13.75 -2.9 13.3 -3.35 12.45 -3.7 12.05 -3.85 12.0 -3.6 11.75" fill="#333333" fill-opacity="0.3647059" fill-rule="evenodd" stroke="none"/>
    <path d="M22.05 11.75 L22.75 12.4 22.9 12.65 23.15 13.3 23.55 14.3 23.75 14.8 23.95 15.3 24.1 15.85 24.1 15.9 24.2 16.95 24.2 17.9 24.2 18.0 23.9 19.8 23.45 21.1 23.35 21.35 23.1 22.0 22.45 23.05 22.3 22.75 22.45 22.5 22.75 22.0 22.85 21.65 23.0 21.4 23.4 20.4 23.6 19.8 23.65 19.55 23.85 18.4 23.9 18.05 23.9 17.15 23.9 17.0 23.75 15.9 23.7 15.8 23.55 15.5 23.5 15.25 23.35 14.8 23.35 14.75 22.95 13.75 22.75 13.3 22.3 12.45 21.95 12.05 21.8 12.0 22.05 11.75" fill="#333333" fill-opacity="0.3647059" fill-rule="evenodd" stroke="none"/>
    <path d="M22.05 11.75 L22.25 11.75 22.75 11.75 23.8 11.75 25.75 11.7 Q26.7 11.5 27.5 12.3 L27.65 12.4 27.05 12.35 26.0 12.3 24.2 12.45 22.75 12.4 22.05 11.75 M28.8 14.6 L29.05 15.4 28.85 15.4 27.9 15.35 26.45 15.25 24.7 15.3 23.95 15.3 23.75 14.8 28.65 14.55 28.8 14.6 M28.85 19.8 L28.6 20.5 28.3 21.3 25.7 21.25 23.35 21.35 23.45 21.1 23.9 19.8 24.2 19.8 26.8 19.55 28.3 19.75 28.85 19.8 M28.1 21.9 L28.05 22.1 27.5 23.05 27.4 23.05 27.15 23.0 26.6 23.05 25.55 23.05 23.75 23.05 22.75 23.05 22.45 23.05 23.1 22.0 28.1 21.9" fill="#fa8900" fill-rule="evenodd" stroke="none"/>
    <path d="M22.75 12.4 L24.2 12.45 26.0 12.3 27.05 12.35 27.65 12.4 28.25 13.2 25.85 13.1 23.15 13.3 22.9 12.65 22.75 12.4 M29.3 16.5 L29.3 16.8 29.3 17.7 29.0 17.8 27.55 18.0 25.5 17.95 24.2 18.0 24.2 17.9 24.2 16.95 27.6 16.65 29.3 16.5 M23.95 15.3 L24.7 15.3 26.45 15.25 27.9 15.35 28.85 15.4 29.05 15.4 26.9 15.55 24.1 15.85 23.95 15.3" fill="#fcb035" fill-rule="evenodd" stroke="none"/>
    <path d="M28.25 13.2 L28.4 13.55 28.8 14.55 28.8 14.6 28.65 14.55 23.75 14.8 23.55 14.3 23.15 13.3 25.85 13.1 28.25 13.2 M29.3 17.7 L29.3 18.1 29.0 19.35 28.85 19.8 28.3 19.75 26.8 19.55 24.2 19.8 23.9 19.8 24.2 18.0 25.5 17.95 27.55 18.0 29.0 17.8 29.3 17.7 M28.3 21.3 L28.1 21.9 23.1 22.0 23.35 21.35 25.7 21.25 28.3 21.3" fill="#b15901" fill-rule="evenodd" stroke="none"/>
    <path d="M29.05 15.4 L29.1 15.75 29.15 16.05 29.3 16.5 27.6 16.65 24.2 16.95 24.1 15.9 24.1 15.85 26.9 15.55 29.05 15.4" fill="#fccd35" fill-rule="evenodd" stroke="none"/>
    <path d="M11.85 7.25 L13.2 7.5 13.15 7.15 13.4 6.35 Q13.7 5.7 14.45 5.7 15.5 5.7 15.5 7.55 L15.5 8.55 17.0 9.85 Q19.35 12.1 19.7 15.15 L20.35 15.1 20.35 14.65 20.5 14.0 21.8 14.05 21.8 18.0 20.5 18.15 20.35 17.35 20.35 16.65 19.8 16.65 Q19.65 20.3 17.0 22.9 14.3 25.6 10.5 25.6 6.7 25.6 3.95 22.9 1.25 20.15 1.25 16.35 1.25 12.55 3.95 9.85 5.15 8.65 6.5 8.0 6.3 7.6 6.35 6.75 6.35 4.95 7.45 4.95 8.4 4.95 8.65 6.05 L8.7 7.3 Q6.55 7.75 4.85 9.45 2.5 11.8 2.5 15.1 2.5 18.4 4.85 20.7 7.2 23.05 10.5 23.05 13.75 23.05 16.1 20.7 18.5 18.4 18.5 15.1 18.5 11.8 16.1 9.45 14.3 7.6 11.85 7.25" fill="#3d3129" fill-rule="evenodd" stroke="none"/>
    <path d="M8.7 7.3 L10.5 7.1 11.85 7.25 Q14.3 7.6 16.1 9.45 18.5 11.8 18.5 15.1 18.5 18.4 16.1 20.7 13.75 23.05 10.5 23.05 7.2 23.05 4.85 20.7 2.5 18.4 2.5 15.1 2.5 11.8 4.85 9.45 6.55 7.75 8.7 7.3 M9.95 10.6 Q10.1 9.6 10.35 9.3 L10.6 10.55 10.85 13.3 10.85 13.55 10.55 13.5 9.95 13.65 9.9 12.3 9.95 10.6 M16.5 14.95 L17.05 14.75 17.25 14.75 Q17.15 12.55 15.75 10.85 L15.55 10.95 14.95 11.2 Q14.65 11.2 14.65 10.8 14.65 10.35 15.1 10.2 13.35 8.55 11.0 8.45 11.0 9.25 10.35 9.3 L10.2 9.3 9.8 9.05 9.8 8.7 9.8 8.5 Q7.55 8.7 5.9 10.25 6.25 10.4 6.25 10.9 6.25 11.3 5.8 11.3 5.45 11.3 5.35 10.9 3.85 12.75 3.85 15.1 L4.4 15.0 Q5.15 15.1 5.15 15.6 5.15 16.15 4.35 16.15 L3.9 16.1 Q4.2 18.25 5.8 19.85 L5.9 19.95 6.0 19.85 6.15 19.7 6.55 19.5 Q6.8 19.5 6.8 19.85 L6.5 20.3 6.35 20.35 Q7.95 21.65 10.05 21.8 L10.05 21.6 9.9 21.25 10.1 20.8 Q10.15 20.3 10.4 20.35 10.75 20.35 10.8 21.1 L10.85 21.65 10.85 21.8 Q13.15 21.65 14.85 20.3 L14.65 19.85 Q14.65 19.35 15.05 19.45 L15.35 19.85 Q16.45 18.7 16.95 17.35 L17.05 16.9 17.25 15.8 16.8 15.85 16.75 15.85 Q16.2 15.85 16.2 15.35 16.2 15.1 16.5 14.95 M11.95 15.95 L12.9 17.05 13.85 17.85 Q14.6 18.65 14.6 18.95 L14.35 19.4 Q14.0 19.4 12.4 17.45 L11.45 16.4 11.7 16.25 11.95 15.95" fill="#604e42" fill-rule="evenodd" stroke="none"/>
    <path d="M10.6 10.55 L10.35 9.3 Q10.1 9.6 9.95 10.6 7.75 10.7 6.7 12.15 5.45 13.75 5.45 17.0 5.45 18.25 6.15 19.7 L6.0 19.85 5.9 19.95 5.8 19.85 Q4.2 18.25 3.9 16.1 L4.35 16.15 Q5.15 16.15 5.15 15.6 5.15 15.1 4.4 15.0 L3.85 15.1 Q3.85 12.75 5.35 10.9 5.45 11.3 5.8 11.3 6.25 11.3 6.25 10.9 6.25 10.4 5.9 10.25 7.55 8.7 9.8 8.5 L9.8 8.7 9.8 9.05 10.2 9.3 10.35 9.3 Q11.0 9.25 11.0 8.45 13.35 8.55 15.1 10.2 14.65 10.35 14.65 10.8 14.65 11.2 14.95 11.2 L15.55 10.95 15.75 10.85 Q17.15 12.55 17.25 14.75 L17.05 14.75 16.5 14.95 16.25 14.5 15.15 12.5 Q14.7 11.65 13.35 11.1 11.95 10.55 10.65 10.55 L10.6 10.55" fill="#b0a69c" fill-rule="evenodd" stroke="none"/>
    <path d="M9.95 10.6 L9.9 12.3 9.95 13.65 Q9.65 13.7 9.4 13.95 8.95 14.45 8.95 15.1 8.95 15.7 9.4 16.25 9.85 16.65 10.55 16.65 L11.45 16.4 12.4 17.45 Q14.0 19.4 14.35 19.4 L14.6 18.95 Q14.6 18.65 13.85 17.85 L12.9 17.05 11.95 15.95 12.1 15.2 12.1 15.1 Q12.1 14.45 11.7 13.95 L10.85 13.55 10.85 13.3 10.6 10.55 10.65 10.55 Q11.95 10.55 13.35 11.1 14.7 11.65 15.15 12.5 L16.25 14.5 16.5 14.95 Q16.2 15.1 16.2 15.35 16.2 15.85 16.75 15.85 L16.8 15.85 17.25 15.8 17.05 16.9 16.95 17.35 Q16.45 18.7 15.35 19.85 L15.05 19.45 Q14.65 19.35 14.65 19.85 L14.85 20.3 Q13.15 21.65 10.85 21.8 L10.85 21.65 10.8 21.1 Q10.75 20.35 10.4 20.35 10.15 20.3 10.1 20.8 L9.9 21.25 10.05 21.6 10.05 21.8 Q7.95 21.65 6.35 20.35 L6.5 20.3 6.8 19.85 Q6.8 19.5 6.55 19.5 L6.15 19.7 Q5.45 18.25 5.45 17.0 5.45 13.75 6.7 12.15 7.75 10.7 9.95 10.6" fill="#cbbfb4" fill-rule="evenodd" stroke="none"/>
    <path d="M9.95 13.65 L10.55 13.5 10.85 13.55 11.7 13.95 Q12.1 14.45 12.1 15.1 L12.1 15.2 11.95 15.95 11.7 16.25 11.45 16.4 10.55 16.65 Q9.85 16.65 9.4 16.25 8.95 15.7 8.95 15.1 8.95 14.45 9.4 13.95 9.65 13.7 9.95 13.65 M9.85 14.4 Q9.55 14.7 9.55 15.1 9.55 15.55 9.85 15.85 L10.55 16.1 11.1 15.95 11.3 15.85 11.45 15.65 11.55 15.15 11.55 15.1 11.3 14.4 Q11.05 14.15 10.8 14.15 L10.55 14.05 10.2 14.15 Q9.95 14.2 9.85 14.4" fill="#977e68" fill-rule="evenodd" stroke="none"/>
    <path d="M9.85 14.4 Q9.95 14.2 10.2 14.15 L10.55 14.05 10.8 14.15 Q11.05 14.15 11.3 14.4 L11.55 15.1 11.55 15.15 11.45 15.65 11.3 15.85 11.1 15.95 10.55 16.1 9.85 15.85 Q9.55 15.55 9.55 15.1 9.55 14.7 9.85 14.4" fill="#372d26" fill-rule="evenodd" stroke="none"/>
    <path d="M10.1 -10.65 Q12.05 -10.65 12.65 -8.2 L12.75 -5.45 Q12.75 -2.4 12.05 -2.4 11.7 -2.4 11.55 -2.85 L11.5 -3.3 11.6 -5.45 11.45 -8.2 Q11.0 -9.55 9.45 -9.55 8.25 -9.55 8.25 -9.1 L8.4 -8.3 Q8.4 -7.4 7.7 -7.4 6.85 -7.4 6.85 -8.45 L7.0 -9.15 6.75 -9.6 Q6.4 -9.95 5.9 -9.95 4.65 -9.95 3.7 -8.6 2.95 -7.5 2.95 -6.75 2.95 -6.05 3.5 -5.9 4.1 -5.7 4.1 -5.05 4.1 -4.55 3.5 -4.55 L3.0 -4.65 2.75 -5.0 Q2.0 -4.05 2.0 -3.55 L2.45 -2.45 Q2.45 -2.1 1.85 -2.1 1.05 -2.1 1.05 -3.55 L1.25 -4.65 2.25 -5.8 Q2.05 -6.05 2.05 -6.75 2.05 -8.45 3.5 -9.95 5.35 -11.75 7.7 -10.1 L8.45 -10.45 10.1 -10.65 M14.65 -2.5 Q14.35 -2.5 14.3 -2.9 L14.3 -3.3 Q14.3 -5.3 16.45 -5.3 18.0 -5.3 18.75 -3.4 L19.2 -1.15 Q19.2 1.45 16.6 3.2 15.6 3.9 15.15 5.7 L14.7 7.4 Q14.2 7.4 14.15 7.0 L14.15 6.45 Q14.15 3.5 16.2 2.1 18.2 0.7 18.2 -1.2 L17.9 -2.85 Q17.3 -4.3 16.1 -4.3 15.5 -4.3 15.1 -3.4 L14.65 -2.5 M8.05 5.8 Q8.15 7.8 7.3 7.8 7.0 7.8 6.85 7.4 L6.8 7.0 6.95 5.8 Q6.95 2.25 6.3 2.25 4.9 2.25 4.0 3.55 3.55 4.25 3.25 5.15 L2.2 6.65 0.85 8.2 -2.05 11.15 -3.65 12.55 Q-4.7 13.55 -4.7 14.15 -4.7 14.65 -4.35 15.0 L-3.95 15.6 Q-3.95 16.05 -4.3 16.05 -5.6 16.05 -5.65 14.0 -5.65 13.25 -4.65 12.25 L-2.95 10.6 0.1 7.4 3.0 3.2 Q4.45 1.05 6.4 1.05 7.65 1.05 8.0 3.35 L8.05 5.8 M-11.05 12.3 L-11.65 12.85 -11.7 12.95 -11.65 12.95 -11.05 12.8 Q-9.85 12.8 -9.85 13.55 -9.85 13.9 -10.15 14.25 L-11.0 14.7 Q-11.5 14.7 -12.25 14.15 -13.35 14.15 -14.05 15.35 -14.5 16.15 -14.5 16.9 L-14.3 18.0 -13.65 19.25 Q-12.95 18.4 -12.15 18.4 -11.0 18.4 -11.0 19.35 -11.0 19.85 -11.45 20.35 -12.0 21.05 -13.0 20.85 L-13.0 21.25 -12.6 22.5 Q-12.0 23.75 -11.1 23.75 -10.15 23.75 -8.8 22.25 L-7.5 20.6 -6.8 18.8 Q-6.5 17.35 -5.55 17.35 -4.55 17.35 -4.55 18.15 -4.55 18.65 -5.0 18.65 L-5.5 18.5 -6.9 21.65 Q-8.8 24.8 -11.2 24.8 -13.6 24.8 -13.95 21.05 -13.95 20.55 -14.3 19.95 L-14.85 18.95 -15.35 16.9 -15.05 15.3 -13.9 13.7 -12.65 13.25 -12.4 12.85 -12.25 12.5 -11.35 11.65 Q-10.7 11.2 -10.7 11.9 -10.7 12.1 -11.05 12.3 M-10.8 13.8 L-10.8 13.7 -11.45 13.75 -11.05 13.9 -10.8 13.8 M-12.05 19.35 L-12.75 19.85 -12.75 19.9 -12.5 19.95 -12.05 19.35" fill="url(#gradient0)" fill-rule="evenodd" stroke="none"/>
  </g>
  <defs>
    <radialGradient cx="0" cy="0" fx="-1635.2" fy="0" gradientTransform="matrix(0.0309, 0.0, 0.0, 0.0309, 7.35, 9.9)" gradientUnits="userSpaceOnUse" id="gradient0" r="819.2" spreadMethod="pad">
      <stop offset="0.0" stop-color="#186889"/>
      <stop offset="1.0" stop-color="#0a2632"/>
    </radialGradient>
  </defs>
</svg>
