<?xml version="1.0" encoding="UTF-8" standalone="no"?>
<svg xmlns:xlink="http://www.w3.org/1999/xlink" height="205.75px" width="199.35px" xmlns="http://www.w3.org/2000/svg">
  <g transform="matrix(1.0, 0.0, 0.0, 1.0, 200.3, 282.2)">
    <path d="M-150.5 -270.4 L-139.7 -273.2 -133.3 -274.85 Q-100.75 -282.75 -87.55 -282.15 L-87.05 -282.15 -86.35 -282.05 Q-61.95 -280.15 -43.85 -275.55 -36.3 -273.6 -30.15 -271.3 L-54.5 -272.95 Q-98.95 -273.9 -138.05 -263.25 L-144.75 -261.35 Q-143.0 -256.95 -139.9 -250.55 -136.8 -244.1 -134.2 -240.35 -131.95 -237.0 -130.15 -235.9 L-130.4 -235.8 -133.95 -238.7 Q-149.75 -252.0 -155.3 -257.9 L-158.05 -256.85 -153.45 -247.0 Q-145.85 -231.9 -137.95 -225.5 -144.95 -228.85 -154.3 -239.2 -165.5 -251.7 -167.0 -252.85 -165.45 -247.4 -162.15 -239.45 -158.15 -229.5 -153.7 -222.0 L-177.65 -245.95 -177.65 -245.5 Q-177.65 -243.85 -174.9 -234.0 -172.15 -223.6 -170.6 -220.95 L-171.05 -221.0 -177.4 -233.35 -183.4 -245.65 -183.55 -238.4 -183.2 -230.7 -182.3 -226.15 -181.65 -223.4 Q-183.7 -227.6 -186.95 -235.55 L-188.35 -238.85 -189.8 -242.8 -191.25 -246.9 -193.3 -240.9 -195.45 -234.0 Q-198.7 -223.0 -200.25 -213.0 L-200.3 -215.05 Q-200.1 -224.15 -198.45 -232.15 L-194.6 -241.1 Q-192.05 -246.45 -189.7 -249.8 L-188.95 -246.85 Q-187.45 -242.3 -186.1 -240.3 -186.1 -242.9 -185.55 -246.1 L-184.25 -251.7 Q-183.5 -251.1 -181.9 -247.15 L-179.75 -241.7 -179.6 -252.6 Q-178.6 -251.35 -174.9 -248.3 L-170.1 -244.25 -171.85 -249.3 -173.85 -254.5 Q-167.5 -258.45 -150.5 -270.4 M-185.3 -254.75 L-185.55 -254.3 Q-185.8 -254.05 -186.1 -254.15 L-185.3 -254.75" fill="#939993" fill-rule="evenodd" stroke="none"/>
    <path d="M-103.35 -247.65 Q-102.45 -247.5 -95.9 -236.55 L-89.0 -224.8 -89.5 -224.8 -114.95 -244.1 -107.9 -230.0 Q-101.7 -217.2 -101.6 -215.5 -106.05 -220.1 -113.95 -227.3 -122.65 -235.25 -128.5 -239.2 L-119.35 -214.95 Q-121.05 -215.85 -126.5 -220.1 L-131.5 -224.2 -133.4 -225.7 -133.55 -225.85 -133.6 -225.4 Q-132.6 -222.6 -130.55 -218.55 -128.15 -213.75 -124.35 -207.25 L-122.3 -204.0 -120.8 -201.5 -120.75 -201.4 -113.8 -190.5 -112.95 -189.35 -115.9 -190.6 -116.55 -190.95 Q-121.55 -193.55 -127.2 -198.65 L-128.7 -200.05 -130.35 -201.65 -130.85 -202.25 -135.85 -207.55 -146.05 -219.35 -139.65 -207.65 -136.3 -201.8 -134.65 -199.05 -129.5 -191.2 -129.3 -190.9 -124.95 -185.25 -123.95 -184.0 -124.85 -184.55 Q-128.15 -186.65 -133.05 -191.0 L-133.4 -191.3 -140.65 -198.05 -144.75 -201.95 -147.15 -204.45 -150.45 -207.8 Q-165.7 -223.6 -171.3 -232.8 L-171.35 -232.2 Q-171.8 -230.9 -168.25 -224.85 -163.9 -217.2 -162.4 -210.35 L-161.8 -208.15 -160.4 -202.3 -158.65 -195.55 -158.5 -195.05 -157.55 -192.0 -159.35 -194.9 -163.65 -202.4 -166.95 -208.2 -169.3 -212.55 Q-177.35 -226.95 -181.55 -237.6 -179.95 -231.5 -173.4 -212.2 L-172.0 -208.3 -170.6 -204.1 -170.05 -202.55 -167.05 -193.65 -166.5 -192.05 -166.4 -191.75 -164.9 -187.35 -166.9 -189.15 -168.85 -191.8 -169.05 -192.1 -169.75 -193.2 -172.35 -197.45 -175.25 -202.7 -178.05 -208.5 -182.95 -219.6 -182.95 -219.7 -183.05 -219.6 -183.4 -218.1 -185.3 -222.55 Q-188.1 -229.25 -188.25 -232.5 -188.8 -227.2 -189.05 -215.95 L-189.45 -199.5 -189.6 -192.25 -189.75 -189.85 -190.2 -181.4 -190.85 -171.7 -191.05 -170.8 -191.45 -169.05 -193.55 -188.25 -193.25 -200.7 -194.95 -192.4 Q-194.9 -192.25 -195.0 -192.15 L-195.75 -188.85 Q-196.45 -185.5 -197.15 -183.45 L-197.3 -185.15 -197.6 -188.5 -197.6 -189.35 -197.4 -192.4 -196.4 -203.1 -195.65 -208.9 -195.05 -215.1 -193.65 -226.1 -193.8 -226.1 -197.6 -208.9 -198.9 -203.2 -199.95 -199.0 -200.05 -203.2 -200.15 -209.0 -200.25 -213.0 Q-198.7 -223.0 -195.45 -234.0 L-193.3 -240.9 -191.25 -246.9 -189.8 -242.8 -188.35 -238.85 -186.95 -235.55 Q-183.7 -227.6 -181.65 -223.4 L-182.3 -226.15 -183.2 -230.7 -183.55 -238.4 -183.4 -245.65 -177.4 -233.35 -171.05 -221.0 -170.6 -220.95 Q-172.15 -223.6 -174.9 -234.0 -177.65 -243.85 -177.65 -245.5 L-177.65 -245.95 -153.7 -222.0 Q-158.15 -229.5 -162.15 -239.45 -165.45 -247.4 -167.0 -252.85 -165.5 -251.7 -154.3 -239.2 -144.95 -228.85 -137.95 -225.5 -145.85 -231.9 -153.45 -247.0 L-158.05 -256.85 -155.3 -257.9 Q-149.75 -252.0 -133.95 -238.7 L-130.4 -235.8 -130.0 -235.75 -130.15 -235.9 Q-131.95 -237.0 -134.2 -240.35 -136.8 -244.1 -139.9 -250.55 -143.0 -256.95 -144.75 -261.35 L-138.05 -263.25 Q-98.95 -273.9 -54.5 -272.95 L-30.15 -271.3 Q-22.5 -268.4 -17.05 -264.85 L-15.2 -259.6 Q-12.15 -250.1 -10.5 -237.95 L-10.3 -236.15 Q-17.75 -253.6 -22.45 -262.2 -28.35 -263.9 -36.25 -264.95 -55.9 -267.45 -72.55 -263.95 L-74.35 -263.55 -81.2 -262.35 -72.5 -253.25 -62.1 -241.95 Q-63.8 -243.15 -87.9 -256.35 L-76.9 -238.55 -73.35 -232.7 Q-76.65 -234.65 -80.75 -236.6 -99.0 -245.4 -103.1 -248.0 L-103.3 -248.1 -103.35 -247.65 M-31.5 -205.2 L-31.45 -205.2 -31.5 -205.05 -31.5 -205.2 M-188.0 -179.6 L-187.6 -184.6 Q-187.2 -184.55 -187.2 -184.95 L-184.0 -165.35 -183.1 -161.1 -185.2 -166.25 Q-187.85 -173.65 -187.9 -179.6 L-188.0 -179.6" fill="#868c86" fill-rule="evenodd" stroke="none"/>
    <path d="M-103.1 -248.0 L-103.35 -247.65 -103.3 -248.1 -103.1 -248.0 M-133.4 -225.7 L-133.6 -225.4 -133.55 -225.85 -133.4 -225.7 M-190.85 -171.7 L-190.2 -181.4 -189.75 -189.85 -189.6 -192.25 -189.45 -199.5 -189.05 -215.95 Q-188.8 -227.2 -188.25 -232.5 -188.1 -229.25 -185.3 -222.55 L-183.4 -218.1 -185.1 -211.7 -185.55 -209.4 -185.5 -208.65 -184.85 -202.9 -183.8 -194.95 -183.55 -192.4 -183.5 -192.15 -183.5 -192.1 -183.35 -190.9 Q-181.2 -174.85 -180.05 -168.9 L-179.9 -167.55 -179.7 -166.8 -179.2 -165.55 Q-180.65 -157.4 -180.7 -154.35 L-181.05 -154.35 Q-181.25 -156.1 -183.1 -161.1 L-184.0 -165.35 -187.2 -184.95 Q-187.2 -184.55 -187.6 -184.6 L-188.0 -179.6 -188.05 -179.55 -188.1 -178.95 -189.25 -176.3 -189.8 -174.95 -190.85 -171.7 M-37.35 -129.65 L-37.1 -129.85 -37.0 -129.85 -37.35 -129.65 M-71.95 -242.15 L-72.1 -242.35 -71.95 -242.2 -71.9 -242.15 -71.95 -242.15 M-14.55 -135.05 L-15.2 -134.35 -14.95 -135.4 -14.55 -135.05 M-22.65 -126.9 L-22.8 -126.8 -23.25 -126.45 -23.2 -127.1 -23.0 -127.25 -22.65 -126.9 M-18.05 -139.7 Q-18.45 -139.05 -20.05 -137.95 -21.9 -136.8 -25.3 -135.1 L-26.1 -134.75 -28.15 -133.85 -36.45 -130.1 Q-34.4 -132.1 -30.2 -134.8 L-20.95 -140.5 Q-18.6 -141.95 -16.65 -146.25 L-16.5 -147.35 -16.05 -147.6 -16.6 -146.35 -16.65 -146.25 -17.6 -141.65 -17.95 -140.05 -18.05 -139.7 M-159.65 -171.95 L-162.15 -172.0 Q-164.3 -171.7 -168.3 -169.5 L-168.65 -169.3 -169.4 -169.4 Q-167.8 -171.8 -162.25 -174.2 -156.7 -176.5 -153.25 -176.2 -149.45 -175.9 -142.35 -172.8 -137.85 -170.65 -135.2 -169.55 L-137.1 -169.15 -139.85 -169.05 -147.95 -170.35 -156.1 -171.7 -159.65 -171.95 M-102.15 -182.8 L-103.35 -183.4 -104.1 -183.75 Q-101.2 -184.55 -97.85 -185.7 L-93.85 -187.15 -85.85 -190.2 -85.3 -190.4 Q-77.9 -193.55 -70.1 -192.85 -66.1 -192.6 -61.55 -189.9 -65.35 -190.25 -69.15 -189.85 L-69.35 -189.8 Q-74.95 -189.25 -80.35 -187.1 L-89.8 -183.55 -93.95 -182.5 -97.9 -182.15 -100.65 -182.25 -102.15 -182.8" fill="#787d78" fill-rule="evenodd" stroke="none"/>
    <path d="M-103.35 -247.65 L-103.1 -248.0 Q-99.0 -245.4 -80.75 -236.6 -76.65 -234.65 -73.35 -232.7 L-76.9 -238.55 -87.9 -256.35 Q-63.8 -243.15 -62.1 -241.95 L-72.5 -253.25 -81.2 -262.35 -74.35 -263.55 -72.55 -263.95 Q-55.9 -267.45 -36.25 -264.95 -28.35 -263.9 -22.45 -262.2 -17.75 -253.6 -10.3 -236.15 -9.7 -229.9 -8.9 -212.65 L-8.55 -204.65 -8.35 -200.75 Q-9.05 -202.6 -12.75 -209.7 -16.7 -217.4 -16.95 -219.85 L-20.55 -210.0 Q-23.8 -200.85 -24.0 -199.5 L-24.25 -200.95 -23.9 -210.65 -24.4 -210.55 Q-24.6 -208.9 -26.7 -204.75 -28.4 -201.4 -29.4 -200.05 L-29.35 -207.25 Q-29.25 -214.35 -28.95 -217.1 L-29.4 -219.9 Q-31.0 -214.35 -34.35 -196.35 L-37.05 -182.4 -36.7 -189.1 -36.6 -190.6 -37.1 -200.0 -37.45 -205.25 -37.45 -205.3 -37.55 -205.45 -37.55 -205.35 -37.55 -205.3 -39.05 -197.6 -39.2 -204.55 Q-39.3 -210.0 -39.85 -213.3 -40.6 -217.85 -45.0 -232.7 -43.25 -226.0 -43.95 -205.7 -44.3 -194.35 -45.25 -183.1 L-46.45 -189.3 -47.1 -192.5 -48.15 -197.0 Q-49.3 -201.65 -50.65 -205.65 -54.6 -217.5 -60.05 -224.4 L-60.4 -224.8 -60.45 -224.1 Q-59.4 -220.4 -57.6 -212.0 L-57.25 -210.4 -56.3 -205.7 -55.65 -202.5 -55.0 -198.35 -59.8 -205.8 -63.6 -210.95 -66.65 -214.7 -73.45 -222.25 Q-79.1 -228.1 -84.1 -232.2 L-84.15 -231.55 Q-83.2 -230.6 -75.75 -219.0 L-70.1 -209.9 -67.85 -206.05 -67.65 -205.6 -69.5 -205.75 -71.05 -205.9 -71.35 -206.1 -75.45 -209.0 -87.1 -217.35 -89.7 -219.15 Q-97.55 -225.0 -102.75 -229.15 L-101.1 -226.3 Q-94.6 -215.15 -91.45 -207.7 L-90.95 -206.55 -90.9 -206.4 -89.4 -202.45 -92.9 -206.05 -93.5 -206.55 -98.6 -211.45 -105.8 -218.15 -123.0 -233.85 -123.0 -233.15 -111.3 -214.05 -106.85 -206.9 -105.2 -204.0 -103.35 -201.0 -99.4 -194.55 -100.05 -194.55 -105.0 -197.95 -109.1 -201.2 -111.15 -203.0 -115.6 -207.1 -118.1 -209.5 -118.75 -210.2 -118.95 -210.35 -127.85 -219.15 Q-126.55 -216.1 -121.0 -207.2 L-118.95 -203.85 -117.65 -201.9 -117.35 -201.4 -114.75 -197.4 -110.85 -190.75 -110.7 -190.5 -109.45 -188.5 -112.95 -189.35 -113.8 -190.5 -120.75 -201.4 -120.8 -201.5 -122.3 -204.0 -124.35 -207.25 Q-128.15 -213.75 -130.55 -218.55 -132.6 -222.6 -133.6 -225.4 L-133.4 -225.7 -131.5 -224.2 -126.5 -220.1 Q-121.05 -215.85 -119.35 -214.95 L-128.5 -239.2 Q-122.65 -235.25 -113.95 -227.3 -106.05 -220.1 -101.6 -215.5 -101.7 -217.2 -107.9 -230.0 L-114.95 -244.1 -89.5 -224.8 -89.0 -224.8 -95.9 -236.55 Q-102.45 -247.5 -103.35 -247.65 M-37.05 -129.95 L-33.15 -134.05 -29.5 -138.05 -27.05 -140.75 Q-23.45 -144.75 -22.5 -146.2 L-22.45 -146.15 -19.85 -146.25 Q-18.15 -146.5 -16.5 -147.35 L-16.65 -146.25 Q-18.6 -141.95 -20.95 -140.5 L-30.2 -134.8 Q-34.4 -132.1 -36.45 -130.1 L-37.0 -129.85 -37.05 -129.95 M-71.95 -242.15 L-71.9 -242.15 -71.95 -242.2 -72.1 -242.35 -71.95 -242.15 M-15.2 -134.35 L-20.2 -129.2 -22.65 -126.9 -23.0 -127.25 Q-21.6 -128.4 -20.15 -132.05 L-20.0 -132.4 -19.8 -133.1 -17.45 -139.65 -18.05 -139.7 -17.95 -140.05 -17.65 -140.3 -15.75 -141.75 Q-14.0 -143.05 -13.3 -144.25 -13.45 -141.4 -14.95 -135.4 L-15.2 -134.35" fill="#7f857f" fill-rule="evenodd" stroke="none"/>
    <path d="M-130.15 -235.9 L-130.0 -235.75 -130.4 -235.8 -130.15 -235.9" fill="#a1a8a1" fill-rule="evenodd" stroke="none"/>
    <path d="M-114.75 -197.4 L-117.35 -201.4 -117.65 -201.9 -118.95 -203.85 -121.0 -207.2 Q-126.55 -216.1 -127.85 -219.15 L-118.95 -210.35 -119.1 -210.2 -117.0 -207.1 -113.95 -202.55 -113.1 -201.3 -107.5 -192.75 Q-108.3 -192.95 -114.75 -197.4 M-105.2 -204.0 L-106.85 -206.9 -111.3 -214.05 -123.0 -233.15 -123.0 -233.85 -105.8 -218.15 -98.6 -211.45 -107.95 -216.3 -108.3 -216.7 -108.8 -216.7 -107.95 -216.3 -98.45 -206.65 -97.1 -205.35 -89.25 -197.55 -93.6 -199.1 -97.95 -200.95 -103.7 -203.4 -105.2 -204.0 M-91.45 -207.7 Q-94.6 -215.15 -101.1 -226.3 L-102.75 -229.15 Q-97.55 -225.0 -89.7 -219.15 L-89.85 -219.0 Q-96.5 -223.2 -98.7 -224.05 -98.1 -222.85 -89.95 -213.05 L-85.3 -207.35 -84.5 -206.4 -81.35 -202.65 Q-82.95 -203.25 -89.1 -206.5 L-89.4 -206.65 -91.45 -207.7 M-69.5 -205.75 L-67.65 -205.6 -67.85 -206.05 -70.1 -209.9 -75.75 -219.0 Q-83.2 -230.6 -84.15 -231.55 L-84.1 -232.2 Q-79.1 -228.1 -73.45 -222.25 L-66.65 -214.7 -65.35 -210.65 -63.95 -206.6 -63.7 -205.9 -61.75 -200.6 -69.5 -205.75 M-55.65 -202.5 L-56.3 -205.7 -57.25 -210.4 -57.6 -212.0 Q-59.4 -220.4 -60.45 -224.1 L-60.05 -224.4 Q-54.6 -217.5 -50.65 -205.65 -49.3 -201.65 -48.15 -197.0 L-47.4 -191.8 -50.7 -196.1 -55.65 -202.5 M-39.05 -197.6 L-37.55 -205.3 -37.55 -205.35 -37.45 -205.3 -37.45 -205.25 -37.1 -200.0 -36.6 -190.6 -36.7 -189.1 -37.05 -182.4 -37.5 -177.2 -44.7 -160.35 -45.3 -159.1 -45.45 -159.2 Q-45.95 -159.7 -45.85 -161.6 L-45.65 -163.7 -45.45 -164.65 -45.35 -165.9 -44.85 -173.4 -44.55 -179.4 -43.85 -175.35 -43.8 -175.3 -43.8 -175.35 -41.0 -188.45 -40.8 -189.25 -39.05 -197.6 M-123.05 -130.75 L-122.25 -131.25 Q-121.8 -130.65 -119.4 -130.65 L-115.9 -131.15 Q-112.9 -132.05 -109.15 -134.5 -103.8 -137.95 -98.9 -138.2 L-97.45 -138.3 -95.0 -138.1 -93.9 -138.1 -93.85 -138.25 -94.95 -141.05 -95.25 -141.95 Q-96.05 -144.15 -97.05 -145.55 L-94.85 -144.35 Q-91.5 -142.55 -87.9 -140.35 -82.7 -137.1 -80.05 -135.0 L-80.1 -134.95 -90.75 -133.9 -92.45 -133.7 -94.0 -133.8 -94.0 -134.15 -94.35 -134.0 Q-94.6 -134.4 -95.1 -134.5 L-95.5 -134.65 -98.1 -134.25 -99.0 -133.9 Q-101.1 -133.05 -102.5 -130.95 L-103.6 -130.65 Q-107.6 -129.45 -113.2 -128.15 L-113.25 -128.35 -113.25 -128.5 -113.45 -128.6 -113.75 -128.8 -120.65 -129.4 Q-121.0 -129.0 -121.85 -128.95 L-122.6 -128.85 -122.85 -128.55 -123.05 -130.75 M-127.7 -146.65 L-133.75 -139.65 Q-140.95 -131.4 -142.3 -130.2 L-142.65 -130.35 -137.8 -138.55 -138.95 -138.55 -142.45 -137.55 Q-145.6 -136.55 -146.35 -136.6 L-147.25 -136.6 -142.75 -139.6 -141.6 -140.45 Q-140.75 -140.7 -139.85 -141.05 -134.55 -142.95 -132.25 -147.15 L-134.7 -146.95 -136.75 -146.5 -137.3 -146.5 -137.3 -146.85 Q-137.25 -148.4 -139.15 -152.7 L-139.35 -153.15 -135.2 -155.6 Q-133.45 -156.8 -132.65 -159.25 L-132.85 -159.4 -134.3 -158.95 -135.9 -158.85 Q-137.75 -158.95 -141.75 -160.15 L-142.8 -161.75 Q-145.6 -165.6 -146.1 -165.9 L-146.0 -166.2 Q-138.25 -164.5 -133.2 -161.85 -129.75 -160.05 -127.9 -157.85 -127.65 -155.5 -127.65 -152.65 L-127.7 -146.65 M-74.35 -85.35 L-73.45 -86.0 Q-66.5 -91.15 -60.55 -96.25 -50.8 -104.45 -47.1 -108.95 L-42.25 -118.45 -38.95 -126.05 -37.45 -129.7 -37.35 -129.65 -37.0 -129.85 -36.45 -130.1 -28.15 -133.85 -26.1 -134.75 -29.3 -118.15 -29.7 -116.75 Q-32.3 -112.05 -35.95 -107.9 -47.9 -94.2 -70.65 -86.5 L-70.95 -86.4 -74.35 -85.35 M-33.15 -134.05 L-33.7 -141.1 -33.85 -142.2 -34.3 -146.35 -34.7 -150.0 -38.3 -137.5 -38.25 -143.5 -38.1 -149.0 Q-37.7 -153.15 -37.45 -158.2 L-33.4 -170.8 -32.4 -174.1 -31.1 -160.85 Q-30.25 -152.15 -27.05 -140.75 L-29.5 -138.05 -33.15 -134.05 M-22.6 -184.15 Q-20.85 -186.2 -18.9 -187.25 -16.55 -188.65 -14.0 -188.45 -11.75 -188.3 -9.95 -185.15 L-9.1 -183.5 Q-7.8 -178.05 -7.9 -174.05 -8.25 -157.75 -17.8 -155.6 L-19.65 -155.45 -20.45 -155.4 -19.65 -156.1 Q-17.0 -158.75 -16.95 -161.85 L-18.6 -165.15 -19.35 -166.75 -20.2 -168.65 Q-20.15 -169.6 -19.25 -170.75 -18.55 -171.85 -17.0 -172.95 -13.9 -175.45 -13.85 -177.9 -13.8 -180.1 -15.2 -181.65 -16.6 -183.3 -19.0 -183.85 L-20.6 -184.1 -22.6 -184.15 M-102.15 -182.8 L-100.65 -182.25 -97.9 -182.15 -93.95 -182.5 -89.8 -183.55 -80.35 -187.1 Q-74.95 -189.25 -69.35 -189.8 -67.35 -189.15 -65.35 -187.75 L-56.05 -180.05 -72.35 -180.4 -72.35 -180.9 Q-71.35 -181.15 -69.05 -182.25 -66.8 -183.4 -66.0 -184.1 L-70.35 -184.2 -83.05 -181.55 Q-87.8 -180.45 -94.1 -177.95 L-98.05 -176.4 -100.75 -175.3 -100.25 -175.25 -98.05 -175.5 -95.4 -176.2 -91.0 -176.1 -91.0 -175.6 -94.15 -174.2 Q-96.45 -173.3 -98.15 -172.4 L-100.95 -170.85 Q-105.55 -167.75 -104.35 -161.1 L-104.85 -161.05 -110.45 -166.75 Q-113.8 -170.45 -113.75 -172.0 -113.7 -172.75 -111.5 -176.5 L-108.65 -181.2 Q-107.5 -181.8 -102.15 -182.8 M-68.6 -136.15 Q-70.65 -136.65 -71.85 -137.3 L-71.85 -137.8 -51.55 -138.7 -41.75 -138.05 Q-42.25 -134.55 -48.0 -128.8 L-55.45 -121.1 -55.75 -121.05 -55.95 -120.65 -57.05 -122.8 Q-57.7 -123.95 -58.75 -124.0 L-65.4 -122.6 -65.55 -123.1 Q-52.2 -128.5 -45.15 -136.95 L-54.2 -137.15 -67.75 -136.3 -68.6 -136.15 M-146.1 -111.7 L-148.85 -109.65 Q-150.25 -108.05 -149.65 -104.1 L-150.6 -104.1 -155.6 -108.3 Q-158.9 -111.15 -160.55 -113.8 -155.0 -119.2 -147.3 -120.6 L-146.2 -120.8 -132.5 -121.7 -137.3 -120.65 Q-140.5 -119.8 -144.3 -118.35 L-155.5 -113.8 -146.1 -111.7" fill="#9e7f66" fill-rule="evenodd" stroke="none"/>
    <path d="M-112.95 -189.35 L-109.45 -188.5 -110.7 -190.5 -110.85 -190.75 -114.75 -197.4 Q-108.3 -192.95 -107.5 -192.75 L-113.1 -201.3 -113.95 -202.55 -117.0 -207.1 -119.1 -210.2 -118.95 -210.35 -118.75 -210.2 -118.1 -209.5 -115.6 -207.1 -111.15 -203.0 -109.1 -201.2 -105.0 -197.95 -100.05 -194.55 -99.4 -194.55 -103.35 -201.0 -105.2 -204.0 -103.7 -203.4 -97.95 -200.95 -93.6 -199.1 -89.25 -197.55 -97.1 -205.35 -98.45 -206.65 -107.95 -216.3 -108.8 -216.7 -108.3 -216.7 -107.95 -216.3 -98.6 -211.45 -93.5 -206.55 -92.9 -206.05 -89.4 -202.45 -90.9 -206.4 -90.95 -206.55 -91.45 -207.7 -89.4 -206.65 -89.1 -206.5 Q-82.95 -203.25 -81.35 -202.65 L-84.5 -206.4 -85.3 -207.35 -89.95 -213.05 Q-98.1 -222.85 -98.7 -224.05 -96.5 -223.2 -89.85 -219.0 L-89.7 -219.15 -87.1 -217.35 -75.45 -209.0 -71.35 -206.1 -71.05 -205.9 -69.5 -205.75 -61.75 -200.6 -63.7 -205.9 -63.95 -206.6 -65.35 -210.65 -66.65 -214.7 -63.6 -210.95 -59.8 -205.8 -55.0 -198.35 -55.65 -202.5 -50.7 -196.1 -47.4 -191.8 -48.15 -197.0 -47.1 -192.5 -46.45 -189.3 -45.25 -183.1 -44.55 -179.4 -44.85 -173.4 -45.35 -165.9 -45.45 -164.65 -45.65 -163.7 -45.85 -161.6 Q-45.95 -159.7 -45.45 -159.2 L-45.3 -159.1 -44.7 -160.35 -37.5 -177.2 -39.3 -160.05 -40.95 -147.65 -37.45 -158.2 Q-37.7 -153.15 -38.1 -149.0 L-38.25 -143.5 -38.3 -137.5 -34.7 -150.0 -34.3 -146.35 -33.85 -142.2 -33.7 -141.1 -33.15 -134.05 -37.05 -129.95 -37.1 -129.85 -37.35 -129.65 -37.45 -129.7 -38.95 -126.05 -42.25 -118.45 -47.1 -108.95 Q-50.8 -104.45 -60.55 -96.25 -66.5 -91.15 -73.45 -86.0 L-74.35 -85.35 -81.65 -83.1 Q-89.65 -80.65 -96.25 -79.05 L-106.85 -77.05 -114.5 -76.45 Q-123.55 -76.4 -129.0 -76.7 L-134.1 -77.25 -140.95 -78.7 Q-142.15 -79.05 -143.55 -80.7 L-144.1 -81.5 -144.25 -81.0 -144.7 -81.65 -145.3 -82.75 -146.3 -84.5 Q-148.55 -88.55 -151.35 -93.0 -160.65 -107.5 -162.6 -111.25 L-163.05 -112.1 -163.9 -113.55 -163.4 -113.95 -163.75 -115.85 -164.65 -121.2 Q-165.5 -126.45 -165.4 -128.4 L-164.6 -133.15 Q-163.8 -136.95 -163.8 -137.85 L-160.7 -137.35 -157.6 -136.8 -163.65 -143.45 -166.75 -147.35 Q-164.1 -143.9 -161.4 -142.25 -157.7 -140.0 -150.9 -139.6 -145.8 -139.3 -141.6 -140.45 L-142.75 -139.6 -147.25 -136.6 -146.35 -136.6 Q-145.6 -136.55 -142.45 -137.55 L-138.95 -138.55 -137.8 -138.55 -142.65 -130.35 -142.3 -130.2 Q-140.95 -131.4 -133.75 -139.65 L-127.7 -146.65 -127.65 -142.25 -127.1 -136.95 -127.15 -136.9 -127.05 -136.65 Q-125.4 -132.6 -124.0 -130.05 L-123.05 -128.45 -123.1 -128.4 -123.3 -128.25 -122.9 -127.85 -122.4 -127.45 Q-121.45 -126.9 -120.2 -126.7 L-120.0 -126.65 -115.2 -127.05 -113.15 -127.55 -113.2 -128.15 Q-107.6 -129.45 -103.6 -130.65 L-102.5 -130.95 -103.35 -129.8 -99.05 -130.85 -96.05 -131.7 -95.25 -132.0 -95.15 -132.0 -91.6 -133.6 -92.45 -133.7 -90.75 -133.9 -80.1 -134.95 -80.05 -135.0 Q-82.7 -137.1 -87.9 -140.35 -91.5 -142.55 -94.85 -144.35 L-97.05 -145.55 Q-96.05 -144.15 -95.25 -141.95 L-94.95 -141.05 -93.85 -138.25 -93.9 -138.1 -95.0 -138.1 -97.45 -138.3 -98.9 -138.2 Q-103.8 -137.95 -109.15 -134.5 -112.9 -132.05 -115.9 -131.15 L-119.4 -130.65 Q-121.8 -130.65 -122.25 -131.25 L-123.05 -130.75 -123.15 -137.25 -121.8 -152.5 -122.2 -155.4 -122.6 -158.35 Q-122.45 -165.5 -123.9 -168.75 -125.25 -171.85 -131.8 -180.6 L-132.4 -181.55 -132.7 -181.7 -142.95 -191.2 -143.25 -191.5 -148.6 -196.7 -154.0 -202.2 -159.1 -208.05 -159.6 -208.7 -159.5 -208.05 -158.4 -202.35 -157.1 -195.3 -156.45 -191.8 -156.35 -191.5 -155.05 -184.7 -155.45 -184.4 -155.5 -184.15 Q-157.5 -185.4 -162.1 -191.65 L-162.35 -191.95 -163.65 -193.85 -163.9 -194.15 -169.65 -202.55 -170.6 -204.1 -172.0 -208.3 -173.4 -212.2 Q-179.95 -231.5 -181.55 -237.6 -177.35 -226.95 -169.3 -212.55 L-166.95 -208.2 -163.65 -202.4 -159.35 -194.9 -157.55 -192.0 -158.5 -195.05 -158.65 -195.55 -160.4 -202.3 -161.8 -208.15 -162.4 -210.35 Q-163.9 -217.2 -168.25 -224.85 -171.8 -230.9 -171.35 -232.2 L-171.3 -232.8 Q-165.7 -223.6 -150.45 -207.8 L-147.15 -204.45 -144.75 -201.95 -140.65 -198.05 -133.4 -191.3 -133.05 -191.0 Q-128.15 -186.65 -124.85 -184.55 L-123.95 -184.0 -124.95 -185.25 -129.3 -190.9 -129.5 -191.2 -134.65 -199.05 -136.3 -201.8 -139.65 -207.65 -146.05 -219.35 -135.85 -207.55 -130.85 -202.25 -130.35 -201.65 -128.7 -200.05 -127.2 -198.65 Q-121.55 -193.55 -116.55 -190.95 L-115.9 -190.6 -112.95 -189.35 M-60.45 -224.1 L-60.4 -224.8 -60.05 -224.4 -60.45 -224.1 M-37.55 -205.35 L-37.55 -205.45 -37.45 -205.3 -37.55 -205.35 M-183.4 -218.1 L-183.05 -219.6 -182.95 -219.6 -178.05 -208.5 -175.25 -202.7 -172.35 -197.45 -169.75 -193.2 -169.05 -192.1 -168.85 -191.8 -166.9 -189.15 -165.0 -181.7 -172.05 -191.85 -172.3 -192.2 -172.65 -192.7 -172.95 -193.15 -179.7 -202.75 -182.35 -206.85 Q-182.3 -205.85 -182.7 -202.85 L-183.55 -197.3 -183.8 -194.95 -184.85 -202.9 -185.5 -208.65 -185.55 -209.4 -185.1 -211.7 -183.4 -218.1 M-8.25 -196.0 Q-5.15 -194.05 -3.35 -190.4 -0.75 -185.05 -0.95 -176.85 -1.1 -170.5 -3.7 -164.0 L-4.25 -162.75 -6.0 -159.3 -6.4 -158.4 -6.8 -157.8 -7.55 -156.6 Q-11.65 -150.05 -16.05 -147.6 L-16.5 -147.35 Q-18.15 -146.5 -19.85 -146.25 L-22.45 -146.15 -22.5 -146.2 Q-23.45 -144.75 -27.05 -140.75 -30.25 -152.15 -31.1 -160.85 L-32.4 -174.1 -27.7 -188.85 -26.3 -193.6 Q-24.8 -194.75 -22.45 -195.9 -17.55 -198.2 -14.8 -198.0 -11.05 -197.75 -8.25 -196.0 M-164.25 -180.55 L-164.8 -180.55 -165.0 -181.7 -164.25 -180.55 M-168.25 -150.65 Q-168.05 -155.2 -162.6 -160.05 -159.6 -162.7 -154.55 -166.4 L-161.5 -165.75 -168.4 -164.05 Q-164.5 -169.35 -162.5 -170.6 -161.25 -171.45 -159.65 -171.95 L-156.1 -171.7 -147.95 -170.35 -139.85 -169.05 -137.1 -169.15 -131.0 -167.4 -130.8 -167.6 Q-128.45 -164.55 -127.9 -157.85 -129.75 -160.05 -133.2 -161.85 -138.25 -164.5 -146.0 -166.2 L-146.1 -165.9 Q-145.6 -165.6 -142.8 -161.75 L-141.75 -160.15 -142.25 -160.3 Q-146.65 -161.65 -148.65 -161.7 -155.6 -162.15 -160.85 -158.5 -164.55 -155.95 -168.25 -150.65 M-20.45 -155.4 L-19.65 -155.45 -17.8 -155.6 Q-8.25 -157.75 -7.9 -174.05 -7.8 -178.05 -9.1 -183.5 L-9.95 -185.15 Q-11.75 -188.3 -14.0 -188.45 -16.55 -188.65 -18.9 -187.25 -20.85 -186.2 -22.6 -184.15 L-23.95 -182.45 Q-26.15 -179.35 -27.3 -176.45 L-26.4 -166.7 Q-25.75 -159.8 -24.65 -154.7 L-24.65 -154.65 -24.45 -154.7 -20.45 -155.4 M-54.15 -197.1 L-55.0 -198.35 -54.9 -197.15 -54.15 -197.1 M-69.35 -189.8 L-69.15 -189.85 Q-65.35 -190.25 -61.55 -189.9 -66.1 -192.6 -70.1 -192.85 -77.9 -193.55 -85.3 -190.4 L-85.85 -190.2 -93.85 -187.15 -97.85 -185.7 Q-101.2 -184.55 -104.1 -183.75 L-103.35 -183.4 -102.15 -182.8 Q-107.5 -181.8 -108.65 -181.2 L-111.5 -176.5 Q-113.7 -172.75 -113.75 -172.0 -113.8 -170.45 -110.45 -166.75 L-104.85 -161.05 -104.35 -161.1 Q-105.55 -167.75 -100.95 -170.85 L-98.15 -172.4 Q-96.45 -173.3 -94.15 -174.2 L-91.0 -175.6 -91.0 -176.1 -95.4 -176.2 -98.05 -175.5 -100.25 -175.25 -100.75 -175.3 -98.05 -176.4 -94.1 -177.95 Q-87.8 -180.45 -83.05 -181.55 L-70.35 -184.2 -66.0 -184.1 Q-66.8 -183.4 -69.05 -182.25 -71.35 -181.15 -72.35 -180.9 L-72.35 -180.4 -56.05 -180.05 -65.35 -187.75 Q-67.35 -189.15 -69.35 -189.8 M-60.85 -177.05 L-69.85 -178.3 Q-77.6 -178.65 -85.95 -175.4 L-94.25 -171.45 -98.15 -169.55 -100.1 -168.55 -93.7 -168.15 -94.3 -167.65 Q-95.0 -167.2 -96.25 -166.7 L-98.3 -165.9 -98.85 -165.6 -98.3 -165.6 -94.9 -165.85 -94.35 -165.85 -92.15 -166.2 -91.15 -160.95 -89.65 -155.25 Q-90.25 -155.25 -91.55 -154.45 L-93.35 -153.6 Q-90.3 -152.0 -88.3 -151.65 L-82.85 -151.25 Q-71.8 -150.7 -62.6 -158.6 -54.65 -165.45 -52.6 -174.25 -55.3 -175.9 -60.85 -177.05 M-55.15 -157.0 Q-70.05 -149.7 -71.55 -149.15 -77.05 -147.05 -84.6 -147.2 L-88.2 -147.3 Q-80.75 -143.7 -76.05 -143.6 -71.15 -143.45 -67.9 -146.0 -65.3 -147.9 -55.15 -157.0 M-65.55 -123.1 L-65.4 -122.6 -58.75 -124.0 Q-57.7 -123.95 -57.05 -122.8 L-55.95 -120.65 -55.75 -121.05 -55.45 -121.1 -48.0 -128.8 Q-42.25 -134.55 -41.75 -138.05 L-51.55 -138.7 -71.85 -137.8 -71.85 -137.3 Q-70.65 -136.65 -68.6 -136.15 L-69.9 -135.95 -69.85 -135.55 Q-68.15 -135.35 -63.2 -133.65 L-57.0 -131.6 Q-74.3 -124.1 -90.7 -119.55 L-95.4 -118.3 -96.55 -118.05 -99.35 -117.35 Q-106.45 -115.8 -113.2 -114.85 L-131.85 -113.6 -128.9 -118.95 -127.95 -120.4 Q-126.1 -122.95 -123.9 -124.1 L-124.85 -124.1 Q-126.45 -124.15 -130.3 -122.3 L-131.0 -121.9 -131.05 -121.9 -132.5 -121.7 -146.2 -120.8 -147.3 -120.6 Q-155.0 -119.2 -160.55 -113.8 -158.9 -111.15 -155.6 -108.3 L-150.6 -104.1 -149.65 -104.1 Q-150.25 -108.05 -148.85 -109.65 L-146.1 -111.7 Q-137.8 -109.55 -134.6 -109.35 L-115.7 -110.05 -112.45 -110.6 -99.45 -113.1 -95.55 -113.85 -92.75 -114.55 Q-84.3 -116.45 -75.95 -119.25 L-68.35 -121.9 -66.35 -122.75 Q-65.9 -122.95 -65.55 -123.1 M-24.6 -146.35 L-24.4 -146.35 -24.75 -146.5 -24.6 -146.35 M-123.95 -184.0 L-122.75 -182.7 -122.7 -183.45 -123.95 -184.0 M-142.15 -100.55 Q-140.6 -91.35 -136.2 -84.3 L-135.2 -82.5 -133.0 -79.7 -131.8 -82.5 -131.05 -84.15 Q-126.4 -94.7 -121.35 -103.4 L-138.2 -103.85 -142.1 -103.45 -142.15 -100.55 M-94.35 -134.0 L-94.0 -134.15 -94.0 -133.8 -94.3 -133.9 -94.35 -134.0" fill="#b28f74" fill-rule="evenodd" stroke="none"/>
    <path d="M-166.9 -189.15 L-164.9 -187.35 -166.4 -191.75 -166.5 -192.05 -167.05 -193.65 -170.05 -202.55 -170.6 -204.1 -169.65 -202.55 -163.9 -194.15 -163.65 -193.85 -162.35 -191.95 -162.1 -191.65 Q-157.5 -185.4 -155.5 -184.15 L-155.45 -184.4 -155.05 -184.7 -156.35 -191.5 -156.45 -191.8 -157.1 -195.3 -158.4 -202.35 -159.5 -208.05 -159.6 -208.7 -159.1 -208.05 -154.0 -202.2 -148.6 -196.7 -143.25 -191.5 -142.95 -191.2 -132.7 -181.7 -132.4 -181.55 -131.8 -180.6 Q-125.25 -171.85 -123.9 -168.75 -122.45 -165.5 -122.6 -158.35 L-122.2 -155.4 -121.8 -152.5 -123.15 -137.25 -123.05 -130.75 -122.85 -128.55 -123.05 -128.45 -124.0 -130.05 Q-125.4 -132.6 -127.05 -136.65 L-127.15 -136.9 -127.1 -136.9 -127.0 -136.95 -127.1 -136.95 -127.65 -142.25 -127.7 -146.65 -127.65 -152.65 Q-127.65 -155.5 -127.9 -157.85 -128.45 -164.55 -130.8 -167.6 L-131.0 -167.4 -137.1 -169.15 -135.2 -169.55 Q-137.85 -170.65 -142.35 -172.8 -149.45 -175.9 -153.25 -176.2 -156.7 -176.5 -162.25 -174.2 -167.8 -171.8 -169.4 -169.4 L-168.65 -169.3 -168.3 -169.5 Q-164.3 -171.7 -162.15 -172.0 L-159.65 -171.95 Q-161.25 -171.45 -162.5 -170.6 -164.5 -169.35 -168.4 -164.05 L-161.5 -165.75 -154.55 -166.4 Q-159.6 -162.7 -162.6 -160.05 -168.05 -155.2 -168.25 -150.65 L-168.65 -150.25 -167.0 -147.75 -166.75 -147.35 -163.65 -143.45 -157.6 -136.8 -160.7 -137.35 -163.8 -137.85 Q-163.8 -136.95 -164.6 -133.15 L-165.4 -128.4 Q-165.5 -126.45 -164.65 -121.2 L-163.75 -115.85 -163.4 -113.95 -163.9 -113.55 Q-165.9 -117.4 -167.35 -121.25 L-168.9 -125.7 -168.5 -132.85 -167.55 -141.9 -165.8 -140.85 -164.7 -140.25 Q-166.7 -144.1 -169.75 -147.85 L-173.4 -151.95 -173.55 -158.3 Q-177.85 -162.7 -179.2 -165.55 L-179.7 -166.8 -179.9 -167.55 -180.05 -168.9 Q-181.2 -174.85 -183.35 -190.9 L-183.5 -192.1 -183.5 -192.15 -183.55 -192.4 -183.8 -194.95 -183.55 -197.3 -182.7 -202.85 Q-182.3 -205.85 -182.35 -206.85 L-179.7 -202.75 -172.95 -193.15 -172.65 -192.7 -172.3 -192.2 -172.05 -191.85 -165.0 -181.7 -166.9 -189.15 M-179.3 -192.4 Q-181.3 -194.9 -181.9 -197.65 L-180.9 -191.3 -177.8 -172.2 -177.8 -171.7 Q-172.8 -174.1 -169.0 -175.0 L-167.75 -175.2 Q-163.15 -177.05 -158.45 -178.3 L-160.05 -180.85 -163.0 -185.3 -163.05 -180.1 -166.95 -180.75 -170.85 -181.4 Q-171.2 -182.2 -172.4 -183.65 L-174.3 -186.1 -178.7 -191.7 -179.3 -192.4 M-164.25 -180.55 L-165.0 -181.7 -164.8 -180.55 -164.25 -180.55 M-55.15 -157.0 Q-65.3 -147.9 -67.9 -146.0 -71.15 -143.45 -76.05 -143.6 -80.75 -143.7 -88.2 -147.3 L-84.6 -147.2 Q-77.05 -147.05 -71.55 -149.15 -70.05 -149.7 -55.15 -157.0 M-131.0 -121.9 L-130.3 -122.3 Q-126.45 -124.15 -124.85 -124.1 L-123.9 -124.1 Q-126.1 -122.95 -127.95 -120.4 L-128.9 -118.95 -131.85 -113.6 -144.05 -114.2 Q-142.15 -115.95 -138.45 -117.95 L-136.8 -118.85 -133.6 -120.55 -130.8 -121.95 -131.0 -121.9 M-124.1 -159.5 L-125.3 -154.35 -126.35 -148.45 -125.6 -142.4 -124.7 -137.15 -124.65 -137.25 Q-125.2 -147.95 -124.1 -159.5 M-142.15 -100.55 L-142.1 -103.45 -138.2 -103.85 -121.35 -103.4 Q-126.4 -94.7 -131.05 -84.15 L-131.8 -82.5 -133.0 -79.7 -135.2 -82.5 -136.2 -84.3 Q-140.6 -91.35 -142.15 -100.55 M-130.15 -100.1 L-140.5 -99.75 Q-139.25 -98.8 -137.75 -94.75 -136.45 -91.1 -134.45 -90.2 -134.15 -90.7 -132.9 -95.25 -131.95 -98.6 -130.15 -100.1" fill="#c49d7f" fill-rule="evenodd" stroke="none"/>
    <path d="M-45.25 -183.1 Q-44.3 -194.35 -43.95 -205.7 -43.25 -226.0 -45.0 -232.7 -40.6 -217.85 -39.85 -213.3 -39.3 -210.0 -39.2 -204.55 L-39.05 -197.6 -40.8 -189.25 -41.0 -188.45 -43.8 -175.35 -43.85 -175.35 -44.55 -179.4 -45.25 -183.1 M-37.05 -182.4 L-34.35 -196.35 Q-31.0 -214.35 -29.4 -219.9 L-28.95 -217.1 Q-29.25 -214.35 -29.35 -207.25 L-29.4 -200.05 Q-28.4 -201.4 -26.7 -204.75 -24.6 -208.9 -24.4 -210.55 L-23.9 -210.65 -24.25 -200.95 -24.0 -199.5 Q-23.8 -200.85 -20.55 -210.0 L-16.95 -219.85 Q-16.7 -217.4 -12.75 -209.7 -9.05 -202.6 -8.35 -200.75 L-8.35 -200.15 -8.25 -196.0 Q-11.05 -197.75 -14.8 -198.0 -17.55 -198.2 -22.45 -195.9 -24.8 -194.75 -26.3 -193.6 L-27.7 -188.85 -32.4 -174.1 -33.4 -170.8 -37.45 -158.2 -40.95 -147.65 -39.3 -160.05 -37.5 -177.2 -37.05 -182.4 M-37.1 -129.85 L-37.05 -129.95 -37.0 -129.85 -37.1 -129.85 M-31.5 -205.2 L-31.5 -205.05 -31.45 -205.2 -31.5 -205.2 M-3.7 -164.0 L-3.15 -161.25 Q-2.5 -159.15 -2.5 -157.05 -2.6 -155.05 -4.2 -146.4 -5.5 -139.8 -5.95 -135.6 -5.8 -138.45 -6.35 -144.0 L-7.35 -151.25 -7.9 -148.95 Q-8.5 -146.25 -10.4 -139.5 L-12.05 -137.75 -14.55 -135.05 -14.95 -135.4 Q-13.45 -141.4 -13.3 -144.25 -14.0 -143.05 -15.75 -141.75 L-17.65 -140.3 -17.95 -140.05 -17.6 -141.65 -16.65 -146.25 -16.6 -146.35 -16.05 -147.6 Q-11.65 -150.05 -7.55 -156.6 L-6.8 -157.8 -6.4 -158.4 -6.0 -159.3 -4.25 -162.75 -3.7 -164.0" fill="#757a75" fill-rule="evenodd" stroke="none"/>
    <path d="M-198.45 -232.15 L-197.1 -237.8 -196.8 -238.8 -192.65 -251.75 -188.45 -254.35 -188.0 -254.6 -177.4 -260.65 Q-169.3 -265.05 -150.5 -270.4 -167.5 -258.45 -173.85 -254.5 L-171.85 -249.3 -170.1 -244.25 -174.9 -248.3 Q-178.6 -251.35 -179.6 -252.6 L-179.75 -241.7 -181.9 -247.15 Q-183.5 -251.1 -184.25 -251.7 L-185.55 -246.1 Q-186.1 -242.9 -186.1 -240.3 -187.45 -242.3 -188.95 -246.85 L-189.7 -249.8 Q-192.05 -246.45 -194.6 -241.1 L-198.45 -232.15 M-185.3 -254.75 L-186.1 -254.15 Q-185.8 -254.05 -185.55 -254.3 L-185.3 -254.75" fill="#abb3ab" fill-rule="evenodd" stroke="none"/>
    <path d="M-179.3 -192.4 L-178.7 -191.7 -174.3 -186.1 -172.4 -183.65 Q-171.2 -182.2 -170.85 -181.4 L-166.95 -180.75 -163.05 -180.1 -163.0 -185.3 -160.05 -180.85 -158.45 -178.3 Q-163.15 -177.05 -167.75 -175.2 L-169.0 -175.0 Q-172.8 -174.1 -177.8 -171.7 L-177.8 -172.2 -180.9 -191.3 -181.9 -197.65 Q-181.3 -194.9 -179.3 -192.4 M-173.4 -151.95 L-169.75 -147.85 Q-166.7 -144.1 -164.7 -140.25 L-165.8 -140.85 -167.55 -141.9 -168.5 -132.85 -168.9 -125.7 -170.9 -132.7 Q-172.95 -141.4 -173.4 -151.95 M-124.1 -159.5 Q-125.2 -147.95 -124.65 -137.25 L-124.7 -137.15 -125.6 -142.4 -126.35 -148.45 -125.3 -154.35 -124.1 -159.5 M-130.15 -100.1 Q-131.95 -98.6 -132.9 -95.25 -134.15 -90.7 -134.45 -90.2 -136.45 -91.1 -137.75 -94.75 -139.25 -98.8 -140.5 -99.75 L-130.15 -100.1" fill="#d4aa8a" fill-rule="evenodd" stroke="none"/>
    <path d="M-141.3 -151.75 L-141.1 -151.15 -140.2 -148.9 -138.7 -144.55 Q-140.3 -143.35 -142.1 -142.85 L-142.2 -142.8 Q-155.35 -138.1 -164.4 -149.4 L-165.65 -151.05 -165.1 -151.5 Q-160.4 -155.6 -156.45 -156.85 L-154.7 -157.4 -154.55 -155.3 Q-154.3 -153.9 -153.7 -152.75 -158.85 -152.1 -163.1 -150.1 L-163.2 -150.15 -163.3 -150.0 Q-163.15 -150.0 -163.1 -150.1 -160.95 -148.75 -158.55 -147.55 -154.1 -145.25 -152.35 -145.2 -149.8 -145.15 -145.4 -146.8 L-143.65 -147.45 -144.35 -149.25 -144.35 -149.35 -144.3 -149.35 -143.3 -150.1 -141.3 -151.75 M-60.5 -166.25 Q-63.0 -163.6 -66.75 -160.9 -76.0 -154.25 -83.2 -155.05 L-87.3 -155.35 Q-86.95 -156.95 -87.95 -160.9 L-89.1 -166.85 -88.7 -169.45 -88.35 -171.35 Q-84.55 -173.9 -80.15 -175.05 L-72.95 -175.8 -73.05 -174.95 -73.1 -172.55 Q-72.85 -171.1 -72.3 -170.1 L-77.0 -169.3 Q-85.4 -167.15 -86.0 -160.75 L-84.8 -160.65 Q-78.5 -160.5 -71.2 -164.7 L-68.3 -166.5 Q-68.1 -166.35 -67.8 -166.3 L-61.35 -166.1 -60.5 -166.25" fill="#cfbb8e" fill-rule="evenodd" stroke="none"/>
    <path d="M-144.35 -149.25 L-143.65 -147.45 -145.4 -146.8 Q-149.8 -145.15 -152.35 -145.2 -154.1 -145.25 -158.55 -147.55 -160.95 -148.75 -163.1 -150.1 -163.15 -150.0 -163.3 -150.0 L-163.2 -150.15 -163.1 -150.1 Q-158.85 -152.1 -153.7 -152.75 -152.8 -151.05 -151.0 -149.8 -148.3 -147.85 -145.8 -148.25 L-144.35 -149.25 M-68.3 -166.5 L-71.2 -164.7 Q-78.5 -160.5 -84.8 -160.65 L-86.0 -160.75 Q-85.4 -167.15 -77.0 -169.3 L-72.3 -170.1 Q-71.15 -167.45 -68.3 -166.5" fill="#dec999" fill-rule="evenodd" stroke="none"/>
    <path d="M-92.45 -133.7 L-91.6 -133.6 -95.15 -132.0 -95.25 -132.0 -96.05 -131.7 -99.05 -130.85 -103.35 -129.8 -102.5 -130.95 Q-101.1 -133.05 -99.0 -133.9 L-98.1 -134.25 -95.5 -134.65 -95.1 -134.5 Q-94.6 -134.4 -94.35 -134.0 L-94.3 -133.9 -94.0 -133.8 -92.45 -133.7 M-113.2 -128.15 L-113.15 -127.55 -115.2 -127.05 -120.0 -126.65 -120.2 -126.7 Q-121.45 -126.9 -122.4 -127.45 L-122.9 -127.85 -123.3 -128.25 -123.1 -128.4 -122.85 -128.55 -122.6 -128.85 -121.85 -128.95 Q-121.0 -129.0 -120.65 -129.4 L-113.75 -128.8 -113.45 -128.6 -113.25 -128.5 -113.25 -128.35 -113.2 -128.15 M-141.6 -140.45 Q-145.8 -139.3 -150.9 -139.6 -157.7 -140.0 -161.4 -142.25 -164.1 -143.9 -166.75 -147.35 L-167.0 -147.75 -168.65 -150.25 -168.25 -150.65 Q-164.55 -155.95 -160.85 -158.5 -155.6 -162.15 -148.65 -161.7 -146.65 -161.65 -142.25 -160.3 L-141.75 -160.15 Q-137.75 -158.95 -135.9 -158.85 L-134.3 -158.95 -132.85 -159.4 -132.65 -159.25 Q-133.45 -156.8 -135.2 -155.6 L-139.35 -153.15 -139.15 -152.7 Q-137.25 -148.4 -137.3 -146.85 L-137.3 -146.5 -136.75 -146.5 -134.7 -146.95 -132.25 -147.15 Q-134.55 -142.95 -139.85 -141.05 -140.75 -140.7 -141.6 -140.45 M-154.7 -157.4 L-156.45 -156.85 Q-160.4 -155.6 -165.1 -151.5 L-165.65 -151.05 -164.4 -149.4 Q-155.35 -138.1 -142.2 -142.8 L-142.1 -142.85 Q-140.3 -143.35 -138.7 -144.55 L-140.2 -148.9 -141.1 -151.15 -141.3 -151.75 -141.75 -152.9 -143.5 -157.65 -147.7 -158.7 Q-149.85 -158.95 -154.7 -157.4 M-20.45 -155.4 L-24.45 -154.7 -24.65 -154.7 Q-25.75 -159.8 -26.4 -166.7 L-27.3 -176.45 Q-26.15 -179.35 -23.95 -182.45 L-22.6 -184.15 -20.6 -184.1 -19.0 -183.85 Q-16.6 -183.3 -15.2 -181.65 -13.8 -180.1 -13.85 -177.9 -13.9 -175.45 -17.0 -172.95 -18.55 -171.85 -19.25 -170.75 -20.15 -169.6 -20.2 -168.65 L-19.35 -166.75 -18.6 -165.15 -16.95 -161.85 Q-17.0 -158.75 -19.65 -156.1 L-20.45 -155.4 M-72.95 -175.8 L-80.15 -175.05 Q-84.55 -173.9 -88.35 -171.35 L-88.7 -169.45 -89.1 -166.85 -87.95 -160.9 Q-86.95 -156.95 -87.3 -155.35 L-83.2 -155.05 Q-76.0 -154.25 -66.75 -160.9 -63.0 -163.6 -60.5 -166.25 -57.6 -169.5 -56.55 -172.65 -58.65 -174.3 -61.1 -174.95 L-67.05 -175.6 -72.95 -175.8 M-60.85 -177.05 Q-55.3 -175.9 -52.6 -174.25 -54.65 -165.45 -62.6 -158.6 -71.8 -150.7 -82.85 -151.25 L-88.3 -151.65 Q-90.3 -152.0 -93.35 -153.6 L-91.55 -154.45 Q-90.25 -155.25 -89.65 -155.25 L-91.15 -160.95 -92.15 -166.2 -94.35 -165.85 -94.9 -165.85 -98.3 -165.6 -98.85 -165.6 -98.3 -165.9 -96.25 -166.7 Q-95.0 -167.2 -94.3 -167.65 L-93.7 -168.15 -100.1 -168.55 -98.15 -169.55 -94.25 -171.45 -85.95 -175.4 Q-77.6 -178.65 -69.85 -178.3 L-60.85 -177.05 M-68.6 -136.15 L-67.75 -136.3 -54.2 -137.15 -45.15 -136.95 Q-52.2 -128.5 -65.55 -123.1 -65.9 -122.95 -66.35 -122.75 L-68.35 -121.9 -75.95 -119.25 Q-84.3 -116.45 -92.75 -114.55 L-95.55 -113.85 -99.45 -113.1 -112.45 -110.6 -115.7 -110.05 -134.6 -109.35 Q-137.8 -109.55 -146.1 -111.7 L-155.5 -113.8 -144.3 -118.35 Q-140.5 -119.8 -137.3 -120.65 L-132.5 -121.7 -131.05 -121.9 -131.0 -121.9 -130.8 -121.95 -133.6 -120.55 -136.8 -118.85 -138.45 -117.95 Q-142.15 -115.95 -144.05 -114.2 L-131.85 -113.6 -113.2 -114.85 Q-106.45 -115.8 -99.35 -117.35 L-96.55 -118.05 -95.4 -118.3 -90.7 -119.55 Q-74.3 -124.1 -57.0 -131.6 L-63.2 -133.65 Q-68.15 -135.35 -69.85 -135.55 L-69.9 -135.95 -68.6 -136.15 M-144.05 -114.2 L-144.1 -114.25 -144.1 -114.2 -144.05 -114.2" fill="#856a56" fill-rule="evenodd" stroke="none"/>
    <path d="M-154.7 -157.4 Q-149.85 -158.95 -147.7 -158.7 L-143.5 -157.65 -141.75 -152.9 -141.3 -151.75 -143.3 -150.1 -144.3 -149.35 -144.35 -149.35 -145.6 -153.1 -146.45 -153.15 -153.7 -152.75 Q-154.3 -153.9 -154.55 -155.3 L-154.7 -157.4 M-72.95 -175.8 L-67.05 -175.6 -61.1 -174.95 Q-58.65 -174.3 -56.55 -172.65 -57.6 -169.5 -60.5 -166.25 L-61.35 -166.1 -67.8 -166.3 Q-68.1 -166.35 -68.3 -166.5 L-62.85 -170.0 Q-68.1 -170.5 -72.3 -170.1 -72.85 -171.1 -73.1 -172.55 L-73.05 -174.95 -72.95 -175.8" fill="#587485" fill-rule="evenodd" stroke="none"/>
    <path d="M-144.35 -149.35 L-144.35 -149.25 -145.8 -148.25 Q-148.3 -147.85 -151.0 -149.8 -152.8 -151.05 -153.7 -152.75 L-146.45 -153.15 -145.6 -153.1 -144.35 -149.35 M-72.3 -170.1 Q-68.1 -170.5 -62.85 -170.0 L-68.3 -166.5 Q-71.15 -167.45 -72.3 -170.1" fill="#68889e" fill-rule="evenodd" stroke="none"/>
    <path d="M-123.1 -128.4 L-123.05 -128.45 -122.85 -128.55 -123.1 -128.4 M-127.15 -136.9 L-127.1 -136.95 -127.0 -136.95 -127.1 -136.9 -127.15 -136.9" fill="#bfa08c" fill-rule="evenodd" stroke="none"/>
  </g>
</svg>
