<?xml version="1.0" encoding="UTF-8" standalone="no"?>
<svg xmlns:xlink="http://www.w3.org/1999/xlink" height="55.2px" width="55.2px" xmlns="http://www.w3.org/2000/svg">
  <g transform="matrix(1.0, 0.0, 0.0, 1.0, 27.5, 27.65)">
    <path d="M21.9 -17.0 Q28.95 -7.95 27.45 3.4 26.1 14.7 17.05 21.75 8.0 28.8 -3.35 27.3 -14.65 25.95 -21.7 16.9 -28.75 7.85 -27.25 -3.5 -25.9 -14.8 -16.85 -21.85 -7.8 -28.9 3.55 -27.4 14.85 -26.05 21.9 -17.0 M-6.65 23.0 L-2.9 23.75 Q6.95 24.95 14.8 18.85 22.65 12.75 23.85 3.0 25.1 -6.9 19.0 -14.75 12.9 -22.6 3.1 -23.75 -6.75 -25.05 -14.6 -18.95 -22.05 -13.2 -23.5 -4.05 -24.75 -1.4 -25.2 1.7 -26.0 9.55 -21.3 15.65 -16.55 21.75 -8.8 22.85 L-6.65 23.0" fill="#000000" fill-rule="evenodd" stroke="none"/>
    <path d="M-23.5 -4.05 Q-22.05 -13.2 -14.6 -18.95 -6.75 -25.05 3.1 -23.75 12.9 -22.6 19.0 -14.75 25.1 -6.9 23.85 3.0 22.65 12.75 14.8 18.85 6.95 24.95 -2.9 23.75 L-6.65 23.0 Q-0.25 23.1 4.9 19.1 L5.65 18.5 Q8.95 17.5 11.95 15.2 18.3 10.3 19.25 2.4 L19.2 2.35 Q20.25 -5.55 15.35 -11.9 10.45 -18.25 2.5 -19.15 -5.4 -20.2 -11.75 -15.3 L-14.45 -12.8 Q-16.35 -11.95 -18.15 -10.55 -21.7 -7.8 -23.5 -4.05" fill="#000000" fill-opacity="0.8" fill-rule="evenodd" stroke="none"/>
    <path d="M-14.45 -12.8 L-11.75 -15.3 Q-5.4 -20.2 2.5 -19.15 10.45 -18.25 15.35 -11.9 20.25 -5.55 19.2 2.35 L19.25 2.4 Q18.3 10.3 11.95 15.2 8.95 17.5 5.65 18.5 10.95 14.0 11.65 7.0 12.1 3.15 11.2 -0.25 11.15 -3.85 8.85 -6.85 7.15 -9.1 4.75 -10.15 0.8 -13.4 -4.75 -14.15 -9.95 -14.9 -14.45 -12.8" fill="#000000" fill-opacity="0.6" fill-rule="evenodd" stroke="none"/>
    <path d="M11.2 -0.25 Q10.25 -3.85 7.8 -7.0 L4.75 -10.15 Q7.15 -9.1 8.85 -6.85 11.15 -3.85 11.2 -0.25" fill="#000000" fill-opacity="0.29803923" fill-rule="evenodd" stroke="none"/>
  </g>
</svg>
