<?xml version="1.0" encoding="UTF-8" standalone="no"?>
<svg xmlns:xlink="http://www.w3.org/1999/xlink" height="16.85px" width="37.3px" xmlns="http://www.w3.org/2000/svg">
  <g transform="matrix(1.0, 0.0, 0.0, 1.0, 18.65, 8.45)">
    <path d="M-16.2 -7.65 L-15.0 -7.9 -14.6 -7.95 -8.6 -8.15 -6.6 -7.9 Q0.75 -6.8 7.05 -3.05 L11.35 0.05 Q13.85 2.15 15.8 4.75 13.75 3.3 11.45 2.25 10.4 1.8 9.3 1.5 L8.7 1.0 1.55 -3.65 -0.75 -4.8 Q-3.2 -5.95 -5.8 -6.65 -9.2 -7.6 -12.05 -7.6 L-16.05 -7.4 -16.2 -7.65" fill="#f2eaea" fill-rule="evenodd" stroke="none"/>
    <path d="M14.6 6.3 L12.2 5.55 11.45 5.35 1.5 3.55 Q-5.35 2.35 -9.3 0.55 -14.9 -2.05 -18.65 -7.85 L-18.5 -7.9 -16.65 -8.45 -16.35 -7.9 -16.2 -7.65 -16.05 -7.4 Q-14.95 -5.7 -12.9 -4.45 L-12.65 -4.3 Q-11.55 -3.65 -10.15 -3.1 -8.75 -2.55 -5.8 -1.85 L-6.55 -1.35 4.25 1.1 11.05 2.85 Q13.25 3.9 14.6 6.3" fill="#b38484" fill-rule="evenodd" stroke="none"/>
    <path d="M-5.8 -1.85 Q-8.75 -2.55 -10.15 -3.1 -11.55 -3.65 -12.65 -4.3 L-10.35 -4.55 Q-6.9 -4.55 -2.3 -3.0 L-0.6 -2.4 Q3.5 -0.85 5.5 0.55 L-0.2 -0.65 -5.8 -1.85" fill="#d2b6b6" fill-rule="evenodd" stroke="none"/>
    <path d="M-16.05 -7.4 L-12.05 -7.6 Q-9.2 -7.6 -5.8 -6.65 -3.2 -5.95 -0.75 -4.8 L1.55 -3.65 8.7 1.0 9.3 1.5 8.4 1.2 6.4 0.75 5.5 0.55 Q3.5 -0.85 -0.6 -2.4 L-2.3 -3.0 Q-6.9 -4.55 -10.35 -4.55 L-12.65 -4.3 -12.9 -4.45 Q-14.95 -5.7 -16.05 -7.4" fill="#e0cdcd" fill-rule="evenodd" stroke="none"/>
    <path d="M15.8 4.75 Q16.55 5.25 17.3 5.9 L18.65 8.4 Q16.9 7.2 14.6 6.3 13.25 3.9 11.05 2.85 L4.25 1.1 -6.55 -1.35 -5.8 -1.85 -0.2 -0.65 5.5 0.55 6.4 0.75 8.4 1.2 9.3 1.5 Q10.4 1.8 11.45 2.25 13.75 3.3 15.8 4.75" fill="#c29c9c" fill-rule="evenodd" stroke="none"/>
    <path d="M-16.2 -7.65 L-15.0 -7.9 -14.6 -7.95 -8.6 -8.15 -6.6 -7.9 Q0.75 -6.8 7.05 -3.05 L11.35 0.05 Q13.85 2.15 15.8 4.75 16.55 5.25 17.3 5.9 L18.65 8.4 Q16.9 7.2 14.6 6.3 L12.2 5.55 11.45 5.35 1.5 3.55 Q-5.35 2.35 -9.3 0.55 -14.9 -2.05 -18.65 -7.85 L-18.5 -7.9 -16.65 -8.45 -16.35 -7.9 -16.2 -7.65 -16.05 -7.4 M9.3 1.5 Q10.4 1.8 11.45 2.25 13.75 3.3 15.8 4.75 M-12.65 -4.3 Q-11.55 -3.65 -10.15 -3.1 -8.75 -2.55 -5.8 -1.85 L-0.2 -0.65 5.5 0.55 6.4 0.75 8.4 1.2 9.3 1.5 M-12.9 -4.45 Q-14.95 -5.7 -16.05 -7.4" fill="none" stroke="#a36a6a" stroke-linecap="round" stroke-linejoin="round" stroke-opacity="0.4" stroke-width="0.05"/>
  </g>
</svg>
