<?xml version="1.0" encoding="UTF-8" standalone="no"?>
<svg xmlns:xlink="http://www.w3.org/1999/xlink" height="213.3px" width="240.8px" xmlns="http://www.w3.org/2000/svg">
  <g transform="matrix(1.0, 0.0, 0.0, 1.0, 111.95, 147.6)">
    <path d="M127.65 20.45 L128.6 21.3 128.6 21.75 128.65 22.2 128.55 23.0 Q128.55 23.75 128.85 24.3 L128.85 25.5 128.85 28.0 128.6 29.05 Q128.3 32.15 126.55 35.1 124.55 38.45 120.75 41.55 L119.0 42.75 118.95 42.8 Q117.6 43.25 116.1 44.0 L110.4 46.9 109.45 47.1 Q106.15 48.25 103.1 50.1 L100.35 51.0 99.05 51.2 98.65 51.5 96.6 52.0 90.3 53.7 87.5 54.95 Q85.95 55.55 83.15 55.95 L81.05 56.55 77.5 55.55 Q72.85 56.2 67.7 59.0 64.6 60.65 61.4 61.15 L59.3 60.85 57.2 61.2 56.3 61.1 53.75 60.75 Q51.45 60.75 47.8 62.65 L46.35 62.2 44.35 62.7 41.9 63.45 40.75 64.05 38.15 63.85 Q33.85 63.85 30.95 65.1 20.05 65.7 8.35 65.7 -2.65 65.7 -13.0 65.2 L-15.7 64.0 Q-17.25 63.2 -17.9 63.05 L-24.8 63.25 -27.25 63.2 Q-30.25 63.15 -30.85 63.75 L-44.05 62.0 -44.55 61.75 Q-47.1 60.35 -47.85 60.1 L-54.3 58.65 -59.55 58.55 -60.35 58.6 -62.3 57.25 Q-64.45 56.15 -65.3 55.95 L-66.75 55.75 -67.95 55.85 -68.7 55.75 -69.0 55.85 -70.45 55.05 -71.65 54.8 -72.8 54.8 Q-73.6 54.7 -73.8 54.35 L-74.6 53.6 -77.85 53.25 -78.45 53.3 Q-80.0 51.95 -82.9 51.0 L-87.45 49.55 -92.4 47.5 -96.85 45.85 -97.6 45.5 Q-97.95 43.65 -100.75 42.5 L-101.45 42.25 Q-102.1 40.3 -106.3 39.45 L-106.35 39.45 -108.25 37.3 -108.25 37.15 -108.85 35.25 -109.25 34.2 -109.15 33.3 Q-109.15 32.3 -109.7 31.5 L-110.4 30.15 -110.7 29.1 Q-110.4 28.5 -110.4 27.55 L-110.7 26.35 -110.95 25.25 -110.05 24.25 Q-109.2 23.45 -109.15 22.6 L-108.65 22.05 Q-108.25 21.4 -108.25 20.6 L-108.25 20.45 -111.95 20.45 -111.95 -147.6 128.6 -147.6 128.6 20.45 127.65 20.45" fill="#66ff00" fill-rule="evenodd" stroke="none"/>
  </g>
</svg>
