<?xml version="1.0" encoding="UTF-8" standalone="no"?>
<svg xmlns:xlink="http://www.w3.org/1999/xlink" height="17.15px" width="69.5px" xmlns="http://www.w3.org/2000/svg">
  <g transform="matrix(1.0, 0.0, 0.0, 1.0, 35.8, 6.35)">
    <path d="M-35.7 -5.6 L-35.5 -5.95 -35.25 -6.25 -35.0 -6.35 -34.85 -6.3 -33.95 -6.15 -17.8 -3.1 3.2 0.95 15.9 3.35 15.75 3.55 15.4 4.5 14.3 4.15 11.7 3.45 8.85 3.05 6.35 2.7 3.25 1.85 -0.6 0.85 -4.15 0.45 -7.15 0.15 -11.05 -0.85 -16.1 -2.0 -22.7 -3.25 -26.05 -3.65 -29.5 -4.0 -34.9 -5.55 -35.7 -5.6" fill="#808080" fill-rule="evenodd" stroke="none"/>
    <path d="M-35.7 -5.6 L-34.9 -5.55 -29.5 -4.0 -26.05 -3.65 -22.7 -3.25 -16.1 -2.0 -11.05 -0.85 -7.15 0.15 -4.15 0.45 -0.6 0.85 3.25 1.85 6.35 2.7 8.85 3.05 11.7 3.45 14.3 4.15 15.4 4.5 15.75 3.55 15.9 3.35 16.3 3.4 17.15 3.55 Q16.95 3.8 16.9 4.1 L16.9 4.15 16.8 4.8 16.85 5.55 15.9 5.35 15.6 5.3 15.15 5.2 9.25 4.25 0.1 2.7 -0.1 2.65 -11.55 0.1 -25.3 -2.95 -34.25 -4.6 -35.65 -4.85 -35.8 -5.5 -35.7 -5.6" fill="#666666" fill-rule="evenodd" stroke="none"/>
    <path d="M15.9 3.35 L3.2 0.95 -17.8 -3.1 -33.95 -6.15 -34.85 -6.3 -35.0 -6.35 -35.25 -6.25 -35.5 -5.95 -35.7 -5.6 M15.9 3.35 L16.3 3.4 17.15 3.55 M16.85 5.55 L15.9 5.35 15.6 5.3 15.15 5.2 9.25 4.25 0.1 2.7 -0.1 2.65 -11.55 0.1 -25.3 -2.95 -34.25 -4.6 -35.65 -4.85 -35.8 -5.5 -35.7 -5.6" fill="none" stroke="#333333" stroke-linecap="round" stroke-linejoin="round" stroke-width="0.05"/>
    <path d="M17.25 2.85 L30.6 4.8 31.35 4.95 31.05 5.45 30.65 6.35 30.65 6.4 30.45 6.85 28.8 6.25 27.85 5.8 25.25 5.65 Q24.65 5.55 23.3 4.85 L21.75 4.1 19.5 4.4 17.8 4.7 17.2 4.35 16.65 3.9 15.9 3.95 16.1 3.3 Q16.3 2.85 16.7 2.75 L16.85 2.75 17.25 2.85" fill="#cfcfcf" fill-rule="evenodd" stroke="none"/>
    <path d="M17.25 2.85 L16.85 2.75 16.7 2.75 Q16.3 2.85 16.1 3.3 L15.9 3.95 15.85 4.05 15.15 3.8 14.95 3.75 14.95 3.7 15.2 3.15 Q15.3 2.85 15.55 2.6 16.15 1.85 16.65 2.0 17.25 2.1 17.25 2.85 M30.65 6.35 L31.05 5.45 31.35 4.95 31.85 4.45 32.05 4.35 32.15 4.3 32.5 4.35 33.15 4.75 33.6 5.65 Q33.8 6.7 33.5 8.25 33.2 9.6 32.55 10.25 32.45 10.3 32.3 10.4 L32.15 10.55 31.85 10.55 Q31.35 10.45 31.25 9.55 L31.25 8.7 31.4 7.75 31.5 7.3 31.65 6.55 30.65 6.35 M31.4 9.85 L31.55 9.9 31.75 9.95 31.4 9.85" fill="#e6e6e6" fill-rule="evenodd" stroke="none"/>
    <path d="M30.45 6.85 L30.65 6.4 30.65 6.35 31.65 6.55 31.5 7.3 31.4 7.75 31.25 8.7 31.25 9.55 Q31.35 10.45 31.85 10.55 L32.15 10.55 30.95 10.75 Q30.35 10.6 30.2 9.55 L30.2 9.5 30.15 8.35 30.25 7.5 30.45 6.85 M16.95 6.35 L15.8 6.7 Q15.1 6.55 14.95 5.55 L14.9 5.15 14.85 4.45 14.95 3.75 15.15 3.8 15.85 4.05 15.8 4.55 15.8 4.6 15.9 5.4 16.4 6.25 16.95 6.35" fill="#d1d1d1" fill-rule="evenodd" stroke="none"/>
    <path d="M15.9 3.95 L16.65 3.9 17.2 4.35 17.8 4.7 19.5 4.4 21.75 4.1 23.3 4.85 Q24.65 5.55 25.25 5.65 L27.85 5.8 28.8 6.25 30.45 6.85 30.25 7.5 30.15 8.35 29.8 8.2 Q27.85 7.8 26.0 6.85 24.1 5.9 22.9 5.65 L20.3 5.6 18.05 5.6 Q17.6 5.5 17.05 5.1 L16.55 4.75 16.1 4.6 15.8 4.55 15.85 4.05 15.9 3.95" fill="#8f8f8f" fill-rule="evenodd" stroke="none"/>
    <path d="M30.2 9.55 L21.1 7.35 17.2 6.4 16.95 6.35 16.4 6.25 15.9 5.4 15.8 4.6 15.8 4.55 16.1 4.6 16.55 4.75 17.05 5.1 Q17.6 5.5 18.05 5.6 L20.3 5.6 22.9 5.65 Q24.1 5.9 26.0 6.85 27.85 7.8 29.8 8.2 L30.15 8.35 30.2 9.5 30.2 9.55" fill="#adadad" fill-rule="evenodd" stroke="none"/>
    <path d="M31.35 4.95 L30.6 4.8 17.25 2.85 16.85 2.75 16.7 2.75 Q16.3 2.85 16.1 3.3 L15.9 3.95 M30.45 6.85 L30.65 6.4 M30.65 6.35 L31.05 5.45 31.35 4.95 31.85 4.45 32.05 4.35 32.15 4.3 32.5 4.35 33.15 4.75 33.6 5.65 Q33.8 6.7 33.5 8.25 33.2 9.6 32.55 10.25 32.45 10.3 32.3 10.4 L32.15 10.55 30.95 10.75 Q30.35 10.6 30.2 9.55 L21.1 7.35 17.2 6.4 16.95 6.35 15.8 6.7 Q15.1 6.55 14.95 5.55 L14.9 5.15 14.85 4.45 14.95 3.75 14.95 3.7 15.2 3.15 Q15.3 2.85 15.55 2.6 16.15 1.85 16.65 2.0 17.25 2.1 17.25 2.85 M15.8 4.55 L15.8 4.6 15.9 5.4 16.4 6.25 16.95 6.35 M30.45 6.85 L30.25 7.5 30.15 8.35 30.2 9.5 30.2 9.55 M15.8 4.55 L15.85 4.05 15.9 3.95" fill="none" stroke="#333333" stroke-linecap="round" stroke-linejoin="round" stroke-width="0.05"/>
    <path d="M30.65 6.4 L30.65 6.35" fill="none" stroke="#00ff00" stroke-linecap="round" stroke-linejoin="round" stroke-width="0.05"/>
  </g>
</svg>
