<?xml version="1.0" encoding="UTF-8" standalone="no"?>
<svg xmlns:xlink="http://www.w3.org/1999/xlink" height="55.3px" width="63.55px" xmlns="http://www.w3.org/2000/svg">
  <g transform="matrix(1.0, 0.0, 0.0, 1.0, 31.75, 27.65)">
    <path d="M-18.4 4.1 L-16.6 5.8 -12.0 9.3 Q-9.7 10.6 -7.35 11.1 L-4.15 11.45 0.6 10.75 Q3.3 10.05 5.95 8.8 L8.85 7.25 9.75 6.8 11.65 5.6 11.9 5.4 15.15 3.3 16.5 2.4 18.6 0.85 22.75 -2.45 26.55 -5.55 26.45 -4.75 24.1 -2.05 21.75 0.45 19.45 2.8 15.55 6.35 Q13.4 8.15 11.05 9.6 L9.0 10.45 6.4 11.2 Q1.2 12.55 -4.25 13.2 L-5.8 13.25 -7.75 12.75 -10.45 11.85 -12.7 10.85 -14.3 10.05 -14.9 9.75 -14.9 9.85 -14.15 11.25 -11.85 15.35 -11.9 15.5 -13.35 14.15 -15.15 11.9 -14.65 14.6 -14.65 17.9 -14.85 17.9 -16.05 12.9 -17.55 16.75 Q-16.75 18.5 -15.5 19.7 L-13.7 21.5 -11.85 23.15 -9.85 24.35 -8.4 25.3 -6.6 26.3 -7.05 25.4 -7.5 24.6 -7.85 24.05 -8.25 23.5 -9.1 22.65 -9.1 22.6 -4.4 24.35 Q-1.85 25.25 1.1 25.5 L6.5 25.9 9.7 25.5 13.45 25.05 18.2 23.65 Q20.45 23.05 22.6 22.05 L26.65 20.1 27.0 21.35 Q24.3 22.1 21.8 23.6 L20.95 23.9 17.95 24.9 14.9 25.75 9.5 26.6 3.95 27.5 -1.75 27.65 -7.55 27.25 -13.45 26.45 Q-15.25 26.35 -16.75 25.35 -18.2 24.4 -20.0 24.45 L-20.5 23.6 -20.85 22.0 -20.7 19.3 -20.3 17.7 -20.0 16.95 -19.5 15.55 -18.95 14.1 Q-18.45 12.9 -18.3 11.6 L-18.0 8.15 Q-17.9 6.2 -18.4 4.1 M3.35 18.3 Q6.5 17.45 11.25 15.55 L5.7 19.05 Q0.2 22.25 -1.75 22.25 -2.75 22.25 -5.7 20.2 L-8.5 18.1 Q-6.55 19.1 -2.35 19.1 0.45 19.1 3.35 18.3" fill="#d2b6b6" fill-rule="evenodd" stroke="none"/>
    <path d="M15.7 -19.4 L15.8 -20.05 15.6 -22.0 Q16.45 -21.3 17.75 -20.45 L21.05 -18.2 27.05 -13.35 Q23.8 -11.75 21.0 -9.45 L19.05 -11.25 15.9 -13.75 Q16.8 -14.45 17.1 -16.15 L17.3 -16.3 17.1 -16.3 17.1 -16.15 16.35 -15.5 15.75 -14.95 15.75 -15.7 16.0 -17.8 15.7 -19.4 M-19.9 -10.1 L-20.0 -10.2 -20.65 -10.8 Q-23.25 -12.95 -25.95 -12.95 L-26.05 -13.1 -11.25 -21.35 -11.4 -20.4 -11.75 -19.85 -13.75 -18.35 Q-16.75 -16.05 -16.75 -15.45 L-15.3 -11.65 Q-15.7 -11.65 -16.3 -12.1 L-17.05 -12.55 -19.0 -10.95 -19.9 -10.1" fill="#faf2f2" fill-rule="evenodd" stroke="none"/>
    <path d="M15.7 -19.4 L16.0 -17.8 15.75 -15.7 15.75 -14.95 16.35 -15.5 17.1 -16.15 17.1 -16.3 17.3 -16.3 17.1 -16.15 Q16.8 -14.45 15.9 -13.75 L19.05 -11.25 21.0 -9.45 20.35 -8.95 12.1 -1.95 8.35 0.7 7.15 1.35 7.9 -1.4 9.1 -5.55 8.9 -5.55 7.85 -5.2 6.7 -4.95 Q10.35 -7.85 12.8 -10.5 L12.6 -10.5 9.8 -9.05 Q8.55 -8.4 7.85 -8.1 L11.15 -11.3 11.8 -11.95 13.1 -13.5 13.7 -14.2 14.2 -14.9 15.2 -17.2 15.65 -19.2 15.7 -19.4 M11.05 9.6 Q13.4 8.15 15.55 6.35 L19.45 2.8 21.75 0.45 24.1 -2.05 26.45 -4.75 25.7 0.1 Q24.9 6.4 24.7 11.9 L24.9 12.85 25.5 15.35 26.4 19.15 Q23.7 20.35 20.4 21.15 L17.35 21.7 15.95 22.0 14.4 22.25 14.45 22.35 14.0 22.45 Q12.35 22.8 11.6 23.45 L11.5 23.4 14.15 20.4 13.65 18.4 13.2 18.6 9.25 20.4 12.9 16.15 13.0 16.2 12.95 16.1 19.45 8.7 19.35 8.6 15.25 11.35 12.1 13.2 11.05 9.6 M23.55 7.5 L24.7 11.9 23.55 7.5 M-13.65 -3.6 L-14.05 -4.0 Q-18.1 -8.45 -19.9 -10.1 L-19.0 -10.95 -17.05 -12.55 -16.3 -12.1 Q-15.7 -11.65 -15.3 -11.65 L-16.75 -15.45 Q-16.75 -16.05 -13.75 -18.35 L-11.75 -19.85 -12.1 -18.9 Q-12.1 -17.1 -11.0 -15.4 L-8.65 -12.55 -8.7 -12.4 Q-9.2 -12.6 -10.3 -13.25 L-12.0 -14.25 -12.1 -14.45 -12.1 -14.3 -12.0 -14.25 -9.9 -11.25 -7.85 -8.6 -7.75 -8.5 -9.4 -5.55 Q-10.95 -2.95 -11.15 -2.95 L-13.4 -3.55 -13.65 -3.6" fill="#f2eaea" fill-rule="evenodd" stroke="none"/>
    <path d="M-11.4 -20.4 L-11.45 -20.05 -11.75 -18.7 Q-10.7 -15.85 -8.0 -13.8 L-5.5 -12.25 -4.9 -11.95 Q-0.85 -10.0 4.1 -10.0 6.85 -10.0 9.2 -10.95 10.6 -11.55 11.9 -12.45 L13.1 -13.5 11.8 -11.95 11.15 -11.3 7.85 -8.1 Q8.55 -8.4 9.8 -9.05 L12.6 -10.5 12.8 -10.5 Q10.35 -7.85 6.7 -4.95 L7.85 -5.2 8.9 -5.55 9.1 -5.55 7.9 -1.4 7.15 1.35 Q4.5 2.7 1.6 3.45 L1.1 3.45 0.4 3.45 0.1 3.45 -3.65 3.15 Q-5.5 2.8 -7.55 1.7 L-10.15 -0.15 -10.95 -0.9 -13.65 -3.6 -13.4 -3.55 -11.15 -2.95 Q-10.95 -2.95 -9.4 -5.55 L-7.75 -8.5 -7.85 -8.6 -9.9 -11.25 -12.0 -14.25 -12.1 -14.3 -12.1 -14.45 -12.0 -14.25 -10.3 -13.25 Q-9.2 -12.6 -8.7 -12.4 L-8.65 -12.55 -11.0 -15.4 Q-12.1 -17.1 -12.1 -18.9 L-11.75 -19.85 -11.4 -20.4 M26.65 20.1 L22.6 22.05 Q20.45 23.05 18.2 23.65 L13.45 25.05 9.7 25.5 6.5 25.9 1.1 25.5 Q-1.85 25.25 -4.4 24.35 L-9.1 22.6 -9.1 22.65 -8.25 23.5 -7.85 24.05 -7.5 24.6 -7.05 25.4 -6.6 26.3 -8.4 25.3 -9.85 24.35 -11.85 23.15 -13.7 21.5 -15.5 19.7 Q-16.75 18.5 -17.55 16.75 L-16.05 12.9 -14.85 17.9 -14.65 17.9 -14.65 14.6 -15.15 11.9 -13.35 14.15 -11.9 15.5 -11.85 15.35 -14.15 11.25 -14.9 9.85 -14.9 9.75 -14.3 10.05 -12.7 10.85 -10.45 11.85 -7.75 12.75 -5.8 13.25 -4.25 13.2 Q1.2 12.55 6.4 11.2 L9.0 10.45 11.05 9.6 12.1 13.2 15.25 11.35 19.35 8.6 19.45 8.7 12.95 16.1 13.0 16.2 12.9 16.15 9.25 20.4 13.2 18.6 13.65 18.4 14.15 20.4 11.5 23.4 11.6 23.45 Q12.35 22.8 14.0 22.45 L14.45 22.35 14.4 22.25 15.95 22.0 17.35 21.7 20.4 21.15 Q23.7 20.35 26.4 19.15 L26.65 20.1 M3.35 18.3 Q0.45 19.1 -2.35 19.1 -6.55 19.1 -8.5 18.1 L-5.7 20.2 Q-2.75 22.25 -1.75 22.25 0.2 22.25 5.7 19.05 L11.25 15.55 Q6.5 17.45 3.35 18.3" fill="#e0cdcd" fill-rule="evenodd" stroke="none"/>
    <path d="M27.05 -13.35 L21.05 -18.2 17.75 -20.45 Q16.45 -21.3 15.6 -22.0 M-18.4 4.1 Q-17.9 6.2 -18.0 8.15 L-18.3 11.6 Q-18.45 12.9 -18.95 14.1 L-19.5 15.55 -20.0 16.95 -20.3 17.7 -20.7 19.3 -20.85 22.0 -20.5 23.6 -20.0 24.45 Q-18.2 24.4 -16.75 25.35 -15.25 26.35 -13.45 26.45 L-7.55 27.25 -1.75 27.65 3.95 27.5 9.5 26.6 14.9 25.75 17.95 24.9 20.95 23.9 21.8 23.6 Q24.3 22.1 27.0 21.35 L26.65 20.1 M26.45 -4.75 L26.55 -5.55 M24.7 11.9 L23.55 7.5 M26.45 -4.75 L25.7 0.1 Q24.9 6.4 24.7 11.9 L24.9 12.85 25.5 15.35 26.4 19.15 26.65 20.1 M27.0 21.35 L27.1 21.85 M-26.05 -13.1 L-26.3 -12.9 M-11.25 -21.35 L-26.05 -13.1" fill="none" stroke="#a36a6a" stroke-linecap="round" stroke-linejoin="round" stroke-opacity="0.4" stroke-width="0.05"/>
    <path d="M5.1 -24.9 L5.3 -24.9 7.1 -25.15 7.1 -24.6 10.0 -24.6 11.65 -24.9 13.25 -25.2 13.9 -25.2 Q14.6 -20.4 14.6 -17.05 14.6 -16.25 14.2 -15.1 L14.4 -14.95 13.9 -14.25 13.3 -13.55 12.05 -12.5 9.3 -11.0 5.85 -10.5 Q1.9 -10.5 1.9 -12.15 L2.2 -13.5 2.45 -14.8 Q2.45 -15.5 1.85 -16.85 L1.35 -18.3 1.25 -19.05 Q1.25 -20.5 2.65 -22.0 L5.1 -24.9 M-5.2 -12.0 L-5.8 -12.3 -8.35 -13.85 -8.4 -14.35 -8.45 -17.45 -8.35 -19.65 Q-8.25 -22.0 -7.8 -24.1 L-4.0 -23.7 -2.65 -24.0 Q-2.05 -24.25 -1.85 -24.6 L-1.8 -24.6 -0.45 -24.6 0.55 -24.6 -3.95 -23.25 Q-7.05 -22.4 -7.05 -21.15 -7.05 -20.45 -6.05 -19.1 L-5.95 -18.95 Q-5.05 -17.7 -5.05 -17.05 L-5.45 -15.75 -5.85 -14.35 Q-5.85 -13.15 -5.5 -12.55 L-5.2 -12.0" fill="#c29c9c" fill-rule="evenodd" stroke="none"/>
    <path d="M7.1 -25.15 L10.75 -25.9 Q13.05 -26.45 15.2 -27.25 L15.3 -27.25 15.6 -24.25 15.75 -22.95 15.85 -22.05 16.05 -20.1 15.95 -19.45 15.9 -19.25 15.45 -17.25 14.4 -14.95 14.2 -15.1 Q14.6 -16.25 14.6 -17.05 14.6 -20.4 13.9 -25.2 L13.25 -25.2 11.65 -24.9 10.0 -24.6 7.1 -24.6 7.1 -25.15 M-8.35 -13.85 Q-11.1 -15.9 -12.2 -18.75 L-11.9 -20.1 -11.85 -20.45 -11.7 -21.4 -11.5 -23.35 Q-11.45 -24.65 -11.0 -25.9 L-10.9 -26.15 -10.55 -26.45 Q-9.3 -25.6 -5.95 -25.05 L-5.9 -25.05 -1.85 -24.6 Q-2.05 -24.25 -2.65 -24.0 L-4.0 -23.7 -7.8 -24.1 Q-8.25 -22.0 -8.35 -19.65 L-8.45 -17.45 -8.4 -14.35 -8.35 -13.85" fill="#d2b6b6" fill-rule="evenodd" stroke="none"/>
    <path d="M10.75 -25.9 L10.35 -26.6 10.05 -27.45 12.0 -27.65 13.85 -27.6 14.7 -27.45 15.2 -27.25 Q13.05 -26.45 10.75 -25.9 M9.3 -11.0 Q6.9 -10.05 4.05 -10.05 -1.0 -10.05 -5.2 -12.0 L-5.5 -12.55 Q-5.85 -13.15 -5.85 -14.35 L-5.45 -15.75 -5.05 -17.05 Q-5.05 -17.7 -5.95 -18.95 L-6.05 -19.1 Q-7.05 -20.45 -7.05 -21.15 -7.05 -22.4 -3.95 -23.25 L0.55 -24.6 0.8 -24.6 5.1 -24.9 2.65 -22.0 Q1.25 -20.5 1.25 -19.05 L1.35 -18.3 1.85 -16.85 Q2.45 -15.5 2.45 -14.8 L2.2 -13.5 1.9 -12.15 Q1.9 -10.5 5.85 -10.5 L9.3 -11.0 M-10.55 -26.45 Q-9.05 -27.5 -5.45 -27.4 L-5.4 -26.95 Q-5.4 -26.1 -5.9 -25.05 L-5.95 -25.05 Q-9.3 -25.6 -10.55 -26.45" fill="#b38484" fill-rule="evenodd" stroke="none"/>
    <path d="M5.3 -24.9 L7.1 -25.15 10.75 -25.9 10.35 -26.6 10.05 -27.45 12.0 -27.65 13.85 -27.6 14.7 -27.45 15.2 -27.25 15.3 -27.25 15.6 -24.25 15.75 -22.95 15.85 -22.05 16.05 -20.1 15.95 -19.45 15.9 -19.25 15.45 -17.25 M13.3 -13.55 L12.05 -12.5 9.3 -11.0 Q6.9 -10.05 4.05 -10.05 -1.0 -10.05 -5.2 -12.0 L-5.8 -12.3 -8.35 -13.85 Q-11.1 -15.9 -12.2 -18.75 L-11.9 -20.1 -11.85 -20.45 -11.7 -21.4 -11.5 -23.35 Q-11.45 -24.65 -11.0 -25.9 L-10.9 -26.15 -10.55 -26.45 Q-9.05 -27.5 -5.45 -27.4 L-5.4 -26.95 Q-5.4 -26.1 -5.9 -25.05 L-1.85 -24.6 M-1.8 -24.6 L-0.45 -24.6 0.55 -24.6 M0.8 -24.6 L5.1 -24.9 M10.75 -25.9 Q13.05 -26.45 15.2 -27.25 M-10.55 -26.45 Q-9.3 -25.6 -5.95 -25.05 L-5.9 -25.05" fill="none" stroke="#a36a6a" stroke-linecap="round" stroke-linejoin="round" stroke-opacity="0.4" stroke-width="0.05"/>
    <path d="M8.35 0.7 L12.1 -1.95 20.35 -8.95 21.0 -9.45 Q23.8 -11.75 27.05 -13.35 L27.85 -13.75 29.1 -12.85 31.8 -10.55 30.4 -9.1 28.25 -7.8 25.95 -5.65 21.05 -2.05 16.35 1.8 16.05 2.0 Q13.4 3.9 11.1 4.8 L10.4 3.8 8.35 0.7 M-31.35 -9.45 L-28.75 -11.95 -28.05 -12.6 -27.7 -12.7 -26.3 -12.9 -25.95 -12.95 Q-23.25 -12.95 -20.65 -10.8 L-24.8 -6.45 -24.9 -6.5 Q-25.75 -7.7 -27.05 -8.55 -28.65 -9.55 -30.35 -9.55 L-31.35 -9.45" fill="#d2b6b6" fill-rule="evenodd" stroke="none"/>
    <path d="M30.4 -9.1 L26.95 -5.9 26.55 -5.55 22.75 -2.45 18.6 0.85 16.5 2.4 15.15 3.3 11.9 5.4 11.65 5.6 9.75 6.8 8.85 7.25 8.75 7.2 Q2.7 9.5 1.25 9.5 L0.8 9.35 0.45 6.95 0.1 3.45 0.4 3.45 1.1 3.45 1.6 3.45 Q4.5 2.7 7.15 1.35 L8.35 0.7 10.4 3.8 11.1 4.8 Q13.4 3.9 16.05 2.0 L16.35 1.8 21.05 -2.05 25.95 -5.65 28.25 -7.8 30.4 -9.1 M-20.95 1.1 L-21.3 0.6 -22.1 -0.55 -26.05 -6.0 Q-28.5 -9.25 -30.0 -9.25 L-31.75 -9.05 -31.35 -9.45 -30.35 -9.55 Q-28.65 -9.55 -27.05 -8.55 -25.75 -7.7 -24.9 -6.5 L-24.8 -6.45 -20.65 -10.8 -20.0 -10.2 -19.9 -10.1 Q-18.1 -8.45 -14.05 -4.0 L-13.65 -3.6 -10.95 -0.9 -10.15 -0.15 -11.0 0.65 Q-11.95 1.6 -12.75 1.4 -12.5 2.0 -12.75 2.75 L-13.65 2.75 Q-14.25 2.45 -14.65 2.45 L-13.85 3.05 Q-13.4 3.55 -13.45 3.8 -13.7 3.85 -14.55 4.7 -15.4 5.5 -15.65 5.5 L-17.4 4.2 -18.9 2.6 -20.55 1.3 -20.85 1.0 -20.95 1.1" fill="#c29c9c" fill-rule="evenodd" stroke="none"/>
    <path d="M8.85 7.25 L5.95 8.8 Q3.3 10.05 0.6 10.75 L-4.15 11.45 -7.35 11.1 Q-9.7 10.6 -12.0 9.3 L-16.6 5.8 -18.4 4.1 -20.95 1.1 -20.85 1.0 -20.55 1.3 -18.9 2.6 -17.4 4.2 -15.65 5.5 Q-15.4 5.5 -14.55 4.7 -13.7 3.85 -13.45 3.8 -13.4 3.55 -13.85 3.05 L-14.65 2.45 Q-14.25 2.45 -13.65 2.75 L-12.75 2.75 Q-12.5 2.0 -12.75 1.4 -11.95 1.6 -11.0 0.65 L-10.15 -0.15 -7.55 1.7 Q-5.5 2.8 -3.65 3.15 L0.1 3.45 0.45 6.95 0.8 9.35 1.25 9.5 Q2.7 9.5 8.75 7.2 L8.85 7.25" fill="#b38484" fill-rule="evenodd" stroke="none"/>
    <path d="M8.35 0.7 L12.1 -1.95 20.35 -8.95 21.0 -9.45 Q23.8 -11.75 27.05 -13.35 L27.85 -13.75 29.1 -12.85 31.8 -10.55 30.4 -9.1 26.95 -5.9 26.55 -5.55 22.75 -2.45 18.6 0.85 16.5 2.4 15.15 3.3 11.9 5.4 11.65 5.6 9.75 6.8 8.85 7.25 5.95 8.8 Q3.3 10.05 0.6 10.75 L-4.15 11.45 -7.35 11.1 Q-9.7 10.6 -12.0 9.3 L-16.6 5.8 -18.4 4.1 -20.95 1.1 -21.3 0.6 M-22.1 -0.55 L-26.05 -6.0 Q-28.5 -9.25 -30.0 -9.25 L-31.75 -9.05 M-31.35 -9.45 L-28.75 -11.95 -28.05 -12.6 -27.7 -12.7 -26.3 -12.9 -25.95 -12.95 Q-23.25 -12.95 -20.65 -10.8 L-20.0 -10.2 -19.9 -10.1 Q-18.1 -8.45 -14.05 -4.0 L-13.65 -3.6 -10.95 -0.9 -10.15 -0.15 -7.55 1.7 Q-5.5 2.8 -3.65 3.15 L0.1 3.45 0.4 3.45 1.1 3.45 1.6 3.45 Q4.5 2.7 7.15 1.35 L8.35 0.7 Z" fill="none" stroke="#a36a6a" stroke-linecap="round" stroke-linejoin="round" stroke-opacity="0.4" stroke-width="0.05"/>
  </g>
</svg>
