<?xml version="1.0" encoding="UTF-8" standalone="no"?>
<svg xmlns:xlink="http://www.w3.org/1999/xlink" height="93.45px" width="298.4px" xmlns="http://www.w3.org/2000/svg">
  <g transform="matrix(1.0, 0.0, 0.0, 1.0, 149.0, 51.45)">
    <path d="M-7.1 -51.15 Q67.2 -53.75 113.85 -33.1 160.5 -12.5 145.9 6.35 1.9 77.65 -146.0 6.35 -158.3 -13.6 -119.85 -31.05 -81.45 -48.55 -7.1 -51.15" fill="#333333" fill-rule="evenodd" stroke="none"/>
  </g>
</svg>
