<?xml version="1.0" encoding="UTF-8" standalone="no"?>
<svg xmlns:xlink="http://www.w3.org/1999/xlink" height="99.1px" width="121.7px" xmlns="http://www.w3.org/2000/svg">
  <g transform="matrix(1.0, 0.0, 0.0, 1.0, 124.0, -6.9)">
    <path d="M-2.8 32.4 L-5.0 103.0 -122.0 106.0 -124.0 34.0 -23.0 32.0 -24.8 13.4 -2.3 6.9 -17.8 15.4 -11.0 32.0 -2.8 32.4" fill="#ededed" fill-opacity="0.9529412" fill-rule="evenodd" stroke="none"/>
  </g>
</svg>
