<?xml version="1.0" encoding="UTF-8" standalone="no"?>
<svg xmlns:xlink="http://www.w3.org/1999/xlink" height="20.0px" width="30.0px" xmlns="http://www.w3.org/2000/svg">
  <g transform="matrix(1.0, 0.0, 0.0, 1.0, 15.0, 2.9)">
    <path d="M0.85 -2.85 L3.9 -2.45 Q6.85 -1.75 9.2 0.05 11.1 1.55 12.05 3.25 L12.6 4.45 13.05 7.0 13.05 7.1 13.0 8.05 13.0 8.25 12.9 8.85 13.35 8.65 15.0 7.65 14.95 8.05 14.95 8.25 14.8 9.05 Q13.95 11.85 10.95 14.0 L10.6 14.25 9.85 14.75 9.7 14.8 Q6.05 16.85 1.3 17.1 L-1.35 17.1 Q-6.1 16.85 -9.65 14.85 L-9.8 14.8 -10.7 14.25 -11.0 14.05 Q-14.1 11.85 -14.8 9.05 L-14.95 8.3 -15.0 7.7 -13.45 8.65 -12.95 8.9 -13.05 8.3 -13.1 7.1 -12.8 4.65 -11.95 2.85 -11.9 2.85 -11.9 2.8 Q-11.0 1.3 -9.35 0.05 -6.75 -1.95 -3.5 -2.55 L-1.15 -2.85 -1.0 -2.85 -0.45 -2.9 -0.3 -2.9 -0.05 -2.9 0.4 -2.9 0.85 -2.85" fill="url(#gradient0)" fill-rule="evenodd" stroke="none"/>
    <path d="M11.2 11.75 L10.05 11.35 9.85 11.3 9.65 11.2 9.7 11.3 9.75 11.5 9.8 12.05 9.5 13.2 8.9 14.05 8.85 14.05 6.95 15.35 Q5.05 16.3 2.6 16.6 L0.8 16.7 0.7 16.7 0.3 16.7 0.2 16.7 0.0 16.7 -0.35 16.7 -0.7 16.7 -2.95 16.55 Q-5.15 16.2 -6.9 15.35 -8.35 14.65 -9.05 13.85 L-9.5 13.3 -9.75 12.1 -9.75 11.65 -9.75 11.55 -9.65 11.3 -9.65 11.25 -9.8 11.3 -10.0 11.35 -11.25 11.8 -11.25 11.65 -11.25 11.55 -11.1 11.15 -11.0 10.95 Q-10.25 9.65 -7.95 8.75 -5.0 7.5 -1.0 7.35 L1.0 7.35 Q5.05 7.5 7.95 8.75 10.3 9.65 10.95 10.9 L11.05 11.15 11.15 11.5 11.2 11.75" fill="url(#gradient1)" fill-rule="evenodd" stroke="none"/>
    <path d="M1.95 6.75 L0.95 7.05 Q-0.25 7.35 -1.0 7.85 L-1.15 7.95 -0.75 8.8 -0.85 8.8 -1.25 7.85 -1.9 6.35 -1.75 6.1 -0.1 6.1 2.15 5.95 2.2 6.1 1.95 6.75" fill="#9c7474" fill-rule="evenodd" stroke="none"/>
    <path d="M-0.75 8.8 L-1.15 7.95 -1.0 7.85 Q-0.25 7.35 0.95 7.05 L1.95 6.75 1.55 7.65 1.55 7.7 1.15 8.8 0.45 8.85 0.1 8.85 -0.75 8.8" fill="#ab8080" fill-rule="evenodd" stroke="none"/>
    <path d="M2.35 9.8 L2.3 9.8 2.3 9.75 2.35 9.8" fill="#777777" fill-rule="evenodd" stroke="none"/>
    <path d="M-1.85 10.15 L-1.25 11.15 Q-0.65 11.7 0.1 11.75 L0.5 11.75 Q1.35 11.7 1.9 11.15 L2.5 10.1" fill="none" stroke="#000000" stroke-linecap="round" stroke-linejoin="round" stroke-width="1.0"/>
  </g>
  <defs>
    <radialGradient cx="0" cy="0" gradientTransform="matrix(0.0358, 0.0, 0.0, 0.0199, 0.0, 0.0)" gradientUnits="userSpaceOnUse" id="gradient0" r="819.2" spreadMethod="pad">
      <stop offset="0.050980392156862744" stop-color="#616161"/>
      <stop offset="0.06666666666666667" stop-color="#4d4d4d"/>
      <stop offset="1.0" stop-color="#000000"/>
    </radialGradient>
    <linearGradient gradientTransform="matrix(0.0, 0.0057, -0.0137, 0.0, 0.0, 12.25)" gradientUnits="userSpaceOnUse" id="gradient1" spreadMethod="pad" x1="-819.2" x2="819.2">
      <stop offset="0.0" stop-color="#e6e6e6"/>
      <stop offset="1.0" stop-color="#b3aba4"/>
    </linearGradient>
  </defs>
</svg>
