<?xml version="1.0" encoding="UTF-8" standalone="no"?>
<svg xmlns:xlink="http://www.w3.org/1999/xlink" height="313.45px" width="170.55px" xmlns="http://www.w3.org/2000/svg">
  <g transform="matrix(1.0, 0.0, 0.0, 1.0, 119.15, 8.3)">
    <path d="M27.3 106.95 Q28.4 109.15 29.4 112.35 L30.3 112.1 31.65 111.9 Q34.2 111.9 35.6 119.05 36.3 122.65 36.5 126.4 L35.7 133.5 Q34.85 139.35 34.5 140.1 34.15 140.9 31.65 143.4 29.35 145.7 29.1 146.7 28.7 148.85 28.2 149.8 26.8 152.5 23.85 152.5 20.45 152.5 19.5 148.75 19.2 147.6 19.2 144.35 L18.9 143.8 17.75 147.6 Q17.1 149.75 16.35 150.9 14.25 154.15 8.1 154.15 L6.15 155.9 Q4.05 157.65 2.6 157.65 -2.8 157.65 -5.35 141.15 -6.2 135.95 -6.6 129.75 L-6.9 124.3 Q-7.05 118.9 -6.6 113.95 -5.8 104.15 -3.05 104.15 -1.7 104.15 -0.9 105.05 -0.3 105.75 -0.3 106.4 L-0.75 108.55 -1.25 111.05 Q-1.25 122.6 -0.6 128.6 0.3 136.5 3.3 147.8 L3.3 148.0 Q5.4 143.05 5.4 141.75 L2.6 121.5 Q2.6 120.85 3.5 120.1 4.65 119.05 5.25 117.3 5.5 116.6 5.2 115.4 L4.85 113.55 Q4.85 111.55 6.7 108.05 8.55 104.55 10.95 102.15 13.55 99.35 15.4 99.5 17.6 99.65 18.1 103.9 L18.55 104.35 20.1 103.3 Q21.1 102.7 22.1 102.7 25.2 102.7 27.3 106.95 M23.0 115.9 Q22.5 120.45 22.5 122.65 22.5 123.3 23.65 125.95 L23.65 126.1 24.2 123.9 24.65 121.8 23.95 118.75 Q23.2 116.35 23.2 115.8 L23.0 115.9 M-86.85 120.1 L-86.65 120.9 -84.15 120.7 Q-77.8 120.7 -75.7 130.45 -74.8 134.6 -74.8 141.5 L-75.0 153.75 Q-76.2 164.9 -81.2 164.9 -83.1 164.9 -86.95 161.95 -91.1 158.75 -91.5 156.05 L-91.85 150.05 -91.8 145.8 -92.75 149.4 Q-94.6 154.05 -97.55 154.05 -101.3 154.05 -102.35 147.6 L-102.7 140.75 -101.05 125.6 Q-99.55 114.0 -100.15 113.6 -100.6 113.3 -98.7 113.3 L-94.45 113.8 Q-87.9 115.3 -86.85 120.1 M-97.35 141.8 L-97.25 141.8 -97.25 135.65 -97.35 135.9 -97.35 141.8" fill="#3a3b33" fill-rule="evenodd" stroke="none"/>
    <path d="M-16.0 122.2 L-10.35 118.3 -10.5 114.7 Q-10.5 113.55 -10.1 112.2 -9.7 110.75 -8.9 109.2 L-8.85 109.05 Q-7.3 106.05 -5.15 103.95 L-3.35 102.55 Q-2.3 101.9 -1.5 102.05 -1.0 102.2 -0.65 102.55 0.2 103.45 0.2 106.05 L-0.5 109.2 -1.4 112.2 -1.45 112.4 0.0 112.55 Q3.65 113.55 5.15 119.85 L5.3 120.6 5.8 124.1 5.85 124.25 6.2 131.25 6.2 132.5 6.15 135.45 Q6.0 139.3 5.5 141.85 L4.9 144.15 4.65 144.85 Q3.9 146.5 2.5 147.7 L1.6 148.4 1.45 148.5 Q-1.0 150.2 -3.7 151.6 -3.05 148.55 -3.05 145.7 -3.05 141.3 -4.1 139.7 L-4.4 139.35 -8.3 142.05 -8.75 141.3 Q-11.35 137.1 -11.35 141.85 L-11.3 142.6 Q-14.3 142.85 -15.1 143.65 -15.55 144.0 -15.55 145.25 L-14.95 146.4 Q-32.4 157.1 -45.2 158.2 L-44.9 157.45 Q-44.9 156.55 -47.7 155.15 L-47.7 154.85 Q-47.7 150.6 -49.55 152.8 L-50.4 153.9 Q-53.75 152.75 -53.75 154.8 L-51.45 157.0 -51.45 157.1 -51.4 158.25 Q-56.4 157.95 -60.65 157.05 -60.8 155.3 -61.5 154.25 L-59.4 152.15 Q-58.85 151.5 -58.85 150.4 -58.85 149.65 -59.2 149.1 -59.85 147.9 -61.55 147.9 -62.3 147.9 -63.4 148.55 L-65.05 149.45 Q-66.05 146.8 -68.85 144.2 -72.15 141.15 -72.15 146.05 -72.15 147.65 -71.45 149.25 -70.8 150.8 -70.8 151.6 L-71.55 152.75 -75.15 150.2 -78.15 147.45 -78.35 146.45 Q-78.85 144.85 -80.65 142.6 -83.1 139.45 -83.1 138.35 L-82.55 136.7 -81.9 135.3 -81.7 134.85 -80.7 132.85 Q-79.75 131.2 -78.8 130.45 -77.35 129.35 -74.65 129.35 L-57.45 130.95 -41.15 132.5 Q-33.3 132.5 -19.35 124.25 L-17.75 123.35 -17.8 123.7 -17.35 124.25 -15.25 127.35 Q-16.0 128.35 -16.0 128.9 -16.0 130.75 -14.15 130.75 -13.8 130.75 -12.95 129.9 -11.6 131.05 -10.6 131.05 -9.4 131.05 -8.8 130.15 -8.35 129.55 -8.35 128.75 -8.35 127.4 -9.65 126.0 L-8.45 124.25 Q-7.95 123.5 -7.95 123.2 -7.95 122.6 -8.1 122.2 L-8.25 121.45 Q-9.6 121.75 -12.1 124.05 L-13.05 123.45 Q-14.9 122.35 -16.0 122.2 M22.35 218.1 L18.95 220.95 Q18.25 222.15 16.9 222.55 L14.35 223.3 10.5 223.65 9.65 223.5 9.35 223.55 Q6.6 223.1 4.55 221.4 0.7 218.25 -0.85 210.65 L-0.85 210.55 Q-1.5 207.45 0.35 205.1 L0.75 205.0 1.4 209.1 Q1.95 213.05 2.8 214.7 4.85 218.75 14.55 218.75 L22.35 218.1 M-26.1 139.0 Q-26.1 132.75 -30.4 139.5 L-31.5 141.3 Q-36.6 140.1 -36.6 143.3 L-33.5 145.15 Q-34.7 147.8 -34.7 149.65 L-34.65 151.15 Q-34.2 152.45 -32.3 152.45 -31.05 152.45 -29.05 147.8 -26.75 149.0 -25.4 149.0 -24.1 149.0 -23.35 148.1 -22.75 147.45 -22.75 146.7 -22.75 144.6 -27.1 142.75 -26.1 139.85 -26.1 139.0 M-11.55 132.45 L-12.0 132.45 -11.85 132.65 -11.55 132.45 M-50.8 140.15 Q-52.0 139.4 -52.65 139.3 L-53.0 139.6 -53.1 140.4 Q-53.1 141.0 -52.4 142.4 -53.1 143.65 -53.1 144.75 -53.1 145.85 -52.9 146.05 L-52.25 146.45 -51.35 146.6 Q-50.75 146.6 -50.1 145.8 -49.2 146.6 -48.25 146.6 -46.15 146.6 -46.15 144.8 -46.15 143.9 -48.1 142.2 -47.35 140.5 -47.35 139.8 -47.35 136.45 -50.2 139.5 L-50.8 140.15 M-74.45 131.75 Q-76.0 133.1 -76.45 135.4 L-77.7 135.9 Q-77.45 136.8 -76.7 137.65 -76.7 138.5 -75.25 139.85 L-74.25 139.0 -73.5 139.05 Q-72.6 139.05 -72.0 138.65 -71.25 138.1 -71.25 137.2 -71.25 136.45 -72.75 135.9 -72.25 134.35 -72.25 133.25 -72.25 131.65 -72.95 131.25 -73.6 130.9 -74.45 131.75 M-78.05 208.85 L-79.05 214.45 -79.6 217.3 -79.95 220.4 -87.55 216.45 Q-84.3 215.3 -81.45 212.75 -79.35 210.85 -78.05 208.85" fill="#857363" fill-rule="evenodd" stroke="none"/>
    <path d="M-3.7 151.6 Q-1.0 150.2 1.45 148.5 L1.6 148.4 2.5 147.7 2.9 149.4 2.9 149.65 Q2.25 149.8 1.65 150.1 L0.6 150.65 Q-3.5 152.85 -5.15 156.35 L-5.7 157.65 -5.75 157.8 Q-6.5 160.4 -6.2 163.55 L-4.85 166.0 -4.65 166.3 -8.55 168.75 -9.45 169.3 -9.45 155.0 -4.3 151.85 -3.7 151.6 M19.5 223.8 Q20.75 231.15 20.75 236.75 20.75 239.2 17.8 246.55 L13.3 257.0 13.65 248.9 13.75 245.65 14.1 235.85 13.65 234.4 12.65 231.4 Q10.8 235.95 8.2 240.85 1.65 253.25 -3.55 258.45 L-6.2 260.9 Q-7.75 262.15 -9.45 263.25 L-9.45 244.35 -6.2 242.05 19.5 223.8 M-15.55 266.55 L-20.05 268.3 Q-27.0 270.6 -35.8 271.5 L-35.8 263.2 -15.55 248.75 -15.55 266.55 M-41.5 271.95 L-48.05 272.1 -48.1 272.0 -45.75 270.3 -41.5 267.25 -41.5 271.95 M-78.9 242.05 L-79.0 241.7 Q-79.85 237.25 -80.05 232.35 L-80.15 228.1 -80.1 224.65 -76.5 222.0 -69.2 216.5 -66.4 214.4 -66.4 237.9 -77.9 246.6 -78.9 242.05 M-2.7 169.5 L0.3 174.25 1.45 175.95 1.55 176.05 1.7 176.3 Q1.9 177.1 2.25 177.15 L2.35 177.15 4.45 180.05 4.95 180.8 5.2 181.1 5.3 181.4 6.1 184.1 5.45 181.4 7.35 183.95 8.35 185.3 8.1 185.5 7.5 185.9 1.55 189.9 -9.45 197.35 -9.45 173.9 -2.7 169.5 M7.55 190.15 L6.1 195.15 4.6 198.55 3.05 201.3 0.7 204.65 0.35 205.1 Q-1.5 207.45 -0.85 210.55 L-0.9 210.55 -2.6 211.3 Q-3.65 211.2 -5.6 212.5 -8.5 214.4 -9.45 216.45 L-9.45 203.0 7.55 190.15 M-3.9 228.0 L-9.45 232.25 -9.45 219.95 Q-8.75 220.6 -7.05 220.6 L-6.25 220.55 Q-7.7 223.9 -7.7 224.8 L-7.7 226.5 Q-7.2 228.15 -4.85 228.15 L-3.9 228.0 M-77.95 208.25 L-76.8 201.6 -76.6 200.45 -76.5 200.05 -76.3 197.65 -76.25 196.5 -76.25 195.9 -76.25 192.4 -76.25 192.0 -76.3 190.9 -76.35 189.9 -76.35 189.3 -76.45 187.55 -76.55 186.2 -76.8 183.7 -76.8 183.65 -77.0 182.05 -77.55 176.5 -78.0 168.75 -78.05 166.05 -76.95 168.75 -75.65 171.2 Q-74.45 173.25 -72.7 174.95 L-71.3 176.1 -66.4 179.35 -66.4 206.15 -74.55 211.5 -79.05 214.45 -78.05 208.85 -78.0 208.45 -77.95 208.25 M-60.3 182.4 L-56.75 183.75 Q-49.8 186.1 -42.45 185.5 L-41.5 185.4 -41.5 189.75 -41.75 189.9 -57.65 200.35 -59.55 201.6 -60.3 202.1 -60.3 182.4 M-35.8 183.8 Q-31.25 181.8 -27.8 177.8 -25.1 174.7 -23.0 171.2 L-21.45 168.75 -20.05 166.7 Q-17.95 163.65 -15.55 160.95 L-15.55 173.15 -35.8 186.05 -35.8 183.8 M-60.3 209.85 L-55.05 205.85 -49.35 201.6 -41.5 195.85 -41.5 219.75 -44.75 222.1 -60.3 233.45 -60.3 209.85 M-35.8 191.8 L-33.1 189.9 -15.55 177.9 -15.55 201.55 -15.55 201.6 -15.65 201.6 -35.8 215.7 -35.8 191.8 M-35.8 223.5 L-15.55 207.7 -15.55 237.1 Q-25.8 245.2 -35.8 253.4 L-35.8 223.5 M-41.5 228.0 L-41.5 258.0 -44.75 260.7 -51.85 266.4 -57.8 271.15 -60.3 270.6 -60.3 242.95 -44.75 230.55 -41.5 228.0 M-75.4 255.05 L-71.35 251.75 -66.4 247.8 -66.4 267.65 -68.0 266.4 -69.45 265.05 -71.35 262.75 -73.95 258.35 -75.4 255.05" fill="#805939" fill-rule="evenodd" stroke="none"/>
    <path d="M2.9 149.65 L3.1 149.55 Q3.7 149.8 4.3 150.1 2.55 151.25 1.5 154.35 0.45 157.45 0.45 160.65 0.45 163.35 2.75 168.75 L4.45 172.55 Q8.55 181.15 10.8 181.15 11.6 181.15 13.3 180.45 15.4 179.45 15.45 179.45 15.15 180.75 14.15 182.0 L12.4 183.75 13.25 183.6 14.75 183.35 16.8 183.35 Q16.6 183.45 12.35 187.2 13.4 188.85 16.2 189.9 L16.9 190.15 Q19.9 191.1 23.45 191.1 28.15 191.1 31.8 189.9 34.3 189.05 36.25 187.65 38.75 185.9 40.3 183.3 40.2 186.65 39.4 189.9 L39.15 190.8 37.2 196.8 34.25 203.15 32.25 206.5 30.75 208.65 Q28.7 211.15 25.15 213.2 20.25 216.15 16.05 216.15 10.9 216.15 7.0 213.1 2.6 209.8 2.6 204.5 L2.85 202.6 3.05 201.3 4.6 198.55 6.1 195.15 7.55 190.15 7.6 189.9 8.1 185.5 8.35 185.3 7.35 183.95 5.45 181.4 5.3 181.4 5.2 181.1 4.95 180.8 4.45 180.05 2.35 177.15 2.25 177.15 Q1.9 177.1 1.7 176.3 L1.55 176.05 1.65 175.95 1.45 175.95 0.3 174.25 -2.7 169.5 -3.2 168.75 -4.65 166.3 -4.85 166.0 -6.2 163.55 Q-6.5 160.4 -5.75 157.8 L-5.7 157.65 -5.15 156.35 Q-3.5 152.85 0.6 150.65 L1.65 150.1 Q2.25 149.8 2.9 149.65 M-92.65 217.45 Q-94.85 215.55 -96.85 213.05 L-97.85 211.85 Q-101.75 206.75 -103.65 201.6 -104.7 198.8 -105.15 196.05 L-105.5 192.25 -104.0 190.25 -103.7 189.9 -97.4 182.95 Q-92.15 178.05 -90.85 175.85 L-88.95 171.9 Q-88.3 170.2 -89.1 168.75 L-89.15 168.65 Q-90.1 167.1 -90.9 166.7 L-86.2 161.95 -85.1 160.9 -79.0 155.3 -79.3 158.55 Q-79.3 161.75 -78.4 164.85 L-78.4 164.9 -77.9 164.75 -78.05 166.05 -78.0 168.75 -77.55 176.5 -77.0 182.05 -76.8 183.65 -76.8 183.7 -76.55 186.2 -77.15 186.6 -79.1 187.95 -79.25 187.65 Q-87.6 187.35 -91.2 189.4 L-91.25 189.45 -88.25 189.9 -82.4 191.05 -81.85 191.15 -82.1 191.4 -86.75 196.1 Q-86.75 199.6 -78.1 208.1 L-77.95 208.25 -78.0 208.45 -78.05 208.85 Q-79.35 210.85 -81.45 212.75 -84.3 215.3 -87.55 216.45 -90.0 217.35 -92.65 217.45 M12.4 183.75 L12.0 183.8 12.35 183.8 12.4 183.75" fill="#422f1d" fill-rule="evenodd" stroke="none"/>
    <path d="M4.3 150.1 L4.45 150.2 10.65 153.5 13.55 155.2 16.85 157.25 21.4 160.25 Q26.6 163.9 31.45 168.1 L32.2 168.75 32.8 169.25 34.2 170.55 35.35 171.6 39.75 175.95 Q40.45 179.65 40.3 183.3 38.75 185.9 36.25 187.65 34.3 189.05 31.8 189.9 28.15 191.1 23.45 191.1 19.9 191.1 16.9 190.15 L16.2 189.9 Q13.4 188.85 12.35 187.2 16.6 183.45 16.8 183.35 L14.75 183.35 13.25 183.6 12.4 183.75 14.15 182.0 Q15.15 180.75 15.45 179.45 15.4 179.45 13.3 180.45 11.6 181.15 10.8 181.15 8.55 181.15 4.45 172.55 L2.75 168.75 Q0.45 163.35 0.45 160.65 0.45 157.45 1.5 154.35 2.55 151.25 4.3 150.1 M-105.5 192.25 L-105.55 191.35 -105.5 189.9 -105.15 187.35 Q-104.5 183.25 -102.4 178.6 L-92.9 168.75 -90.95 166.75 -90.9 166.7 Q-90.1 167.1 -89.15 168.65 L-89.1 168.75 Q-88.3 170.2 -88.95 171.9 L-90.85 175.85 Q-92.15 178.05 -97.4 182.95 L-103.7 189.9 -104.0 190.25 -105.5 192.25 M12.4 183.75 L12.35 183.8 12.0 183.8 12.4 183.75 M-77.95 208.25 L-78.1 208.1 Q-86.75 199.6 -86.75 196.1 L-82.1 191.4 -81.85 191.15 -82.4 191.05 -88.25 189.9 -91.25 189.45 -91.2 189.4 Q-87.6 187.35 -79.25 187.65 L-79.1 187.95 -79.9 188.55 -81.85 189.9 -81.45 190.75 -81.4 190.8 -81.15 191.3 -79.45 194.05 -77.95 195.9 -76.55 197.4 -76.6 197.55 -76.3 197.65 -76.5 200.05 -76.6 200.45 -76.8 201.6 -77.95 208.25" fill="#543d26" fill-rule="evenodd" stroke="none"/>
    <path d="M1.45 175.95 L1.65 175.95 1.55 176.05 1.45 175.95 M5.3 181.4 L5.45 181.4 6.1 184.1 5.3 181.4" fill="#c1c2cc" fill-rule="evenodd" stroke="none"/>
    <path d="M18.95 220.95 L19.5 223.8 -6.2 242.05 -9.45 244.35 -9.45 232.25 -3.9 228.0 -3.3 227.7 -1.5 226.85 -1.8 229.05 Q-1.5 230.75 1.5 230.75 2.7 230.75 3.55 230.2 L4.35 229.65 Q4.55 229.65 5.2 230.2 6.05 230.75 7.45 230.75 9.1 230.75 10.55 228.8 11.8 227.15 11.8 226.05 L12.9 225.2 14.35 223.3 16.9 222.55 Q18.25 222.15 18.95 220.95 M-11.55 264.55 L-13.55 265.6 -13.95 265.8 -15.55 266.55 -15.55 248.75 -35.8 263.2 -35.8 271.5 -41.5 271.95 -41.5 267.25 -45.75 270.3 -48.1 272.0 -48.25 272.1 -55.95 271.45 -57.8 271.15 -51.85 266.4 -44.75 260.7 -41.5 258.0 -41.5 267.25 -35.8 263.2 -35.8 253.4 Q-25.8 245.2 -15.55 237.1 L-15.55 248.75 -9.45 244.35 -9.45 263.25 -11.55 264.55 M-4.65 166.3 L-3.2 168.75 -2.7 169.5 -9.45 173.9 -9.45 169.3 -15.55 173.15 -15.55 160.95 -13.95 159.2 -12.7 157.85 -11.4 156.65 -10.55 155.85 -9.45 155.0 -9.45 169.3 -8.55 168.75 -4.65 166.3 M8.1 185.5 L7.6 189.9 7.55 190.15 -9.45 203.0 -9.45 197.35 1.55 189.9 7.5 185.9 8.1 185.5 M14.65 225.9 L14.7 225.9 14.6 225.4 14.65 225.9 M-66.4 179.35 Q-63.45 181.05 -60.3 182.4 L-60.3 202.1 -59.55 201.6 -57.65 200.35 -41.75 189.9 -41.5 189.75 -41.5 195.85 -49.35 201.6 -55.05 205.85 -60.3 209.85 -60.3 202.1 -66.4 206.15 -66.4 214.4 -69.2 216.5 -76.5 222.0 -80.1 224.65 -80.05 222.5 -79.95 220.4 -79.6 217.3 -79.05 214.45 -74.55 211.5 -66.4 206.15 -66.4 179.35 M-41.5 185.4 Q-38.45 184.9 -35.8 183.8 L-35.8 186.05 -15.55 173.15 -15.55 177.9 -33.1 189.9 -35.8 191.8 -35.8 186.05 -41.5 189.75 -41.5 185.4 M-41.5 195.85 L-35.8 191.8 -35.8 215.7 -15.65 201.6 -15.55 201.6 -15.55 207.7 -9.45 203.0 -9.45 216.45 Q-9.9 217.45 -9.9 218.4 L-9.7 219.6 -9.45 219.95 -9.45 232.25 -15.55 237.1 -15.55 207.7 -35.8 223.5 -35.8 215.7 -41.5 219.75 -41.5 228.0 -38.75 225.8 -35.8 223.5 -35.8 253.4 -39.3 256.2 -41.5 258.0 -41.5 228.0 -44.75 230.55 -60.3 242.95 -60.3 233.45 -44.75 222.1 -41.5 219.75 -41.5 195.85 M-9.45 173.9 L-9.45 197.35 -15.55 201.55 -15.55 177.9 -9.45 173.9 M-60.3 209.85 L-60.3 233.45 -66.4 237.9 -66.4 247.8 -71.35 251.75 -75.4 255.05 Q-76.8 251.4 -77.9 246.6 L-66.4 237.9 -66.4 214.4 -60.3 209.85 M-60.3 242.95 L-60.3 270.6 Q-62.65 269.9 -64.25 269.05 L-66.4 267.65 -66.4 247.8 -60.3 242.95" fill="#7a4918" fill-rule="evenodd" stroke="none"/>
    <path d="M-78.15 147.45 L-75.15 150.2 -71.55 152.75 -70.8 151.6 Q-70.8 150.8 -71.45 149.25 -72.15 147.65 -72.15 146.05 -72.15 141.15 -68.85 144.2 -66.05 146.8 -65.05 149.45 L-63.4 148.55 Q-62.3 147.9 -61.55 147.9 -59.85 147.9 -59.2 149.1 -58.85 149.65 -58.85 150.4 -58.85 151.5 -59.4 152.15 L-61.5 154.25 Q-60.8 155.3 -60.65 157.05 -56.4 157.95 -51.4 158.25 L-51.45 157.1 -51.45 157.0 -53.75 154.8 Q-53.75 152.75 -50.4 153.9 L-49.55 152.8 Q-47.7 150.6 -47.7 154.85 L-47.7 155.15 Q-44.9 156.55 -44.9 157.45 L-45.2 158.2 Q-32.4 157.1 -14.95 146.4 L-15.55 145.25 Q-15.55 144.0 -15.1 143.65 -14.3 142.85 -11.3 142.6 L-11.35 141.85 Q-11.35 137.1 -8.75 141.3 L-8.3 142.05 -4.4 139.35 -4.1 139.7 Q-3.05 141.3 -3.05 145.7 -3.05 148.55 -3.7 151.6 L-4.3 151.85 -9.45 155.0 -10.55 155.85 -11.4 156.65 -12.7 157.85 -13.95 159.2 -15.55 160.95 Q-17.95 163.65 -20.05 166.7 L-21.45 168.75 -23.0 171.2 Q-25.1 174.7 -27.8 177.8 -31.25 181.8 -35.8 183.8 -38.45 184.9 -41.5 185.4 L-42.45 185.5 Q-49.8 186.1 -56.75 183.75 L-60.3 182.4 Q-63.45 181.05 -66.4 179.35 L-71.3 176.1 -72.7 174.95 Q-74.45 173.25 -75.65 171.2 L-76.95 168.75 -78.05 166.05 -77.9 164.75 -78.4 164.85 Q-79.3 161.75 -79.3 158.55 L-79.0 155.3 -78.75 153.1 -78.2 148.65 -78.15 147.65 -78.15 147.45 M30.75 208.65 L30.0 209.75 Q26.65 214.2 22.35 218.1 L14.55 218.75 Q4.85 218.75 2.8 214.7 1.95 213.05 1.4 209.1 L0.75 205.0 0.35 205.1 0.7 204.65 3.05 201.3 2.85 202.6 2.6 204.5 Q2.6 209.8 7.0 213.1 10.9 216.15 16.05 216.15 20.25 216.15 25.15 213.2 28.7 211.15 30.75 208.65 M-83.45 222.4 Q-85.8 221.95 -88.3 220.55 L-88.65 220.35 -92.4 217.65 -92.65 217.45 Q-90.0 217.35 -87.55 216.45 L-79.95 220.4 -80.05 222.5 -83.45 222.4 M-26.1 139.0 Q-26.1 139.85 -27.1 142.75 -22.75 144.6 -22.75 146.7 -22.75 147.45 -23.35 148.1 -24.1 149.0 -25.4 149.0 -26.75 149.0 -29.05 147.8 -31.05 152.45 -32.3 152.45 -34.2 152.45 -34.65 151.15 L-34.7 149.65 Q-34.7 147.8 -33.5 145.15 L-36.6 143.3 Q-36.6 140.1 -31.5 141.3 L-30.4 139.5 Q-26.1 132.75 -26.1 139.0 M-8.3 142.05 Q-11.7 144.4 -14.95 146.4 L-14.75 146.7 Q-14.0 148.05 -14.0 148.5 L-14.3 150.65 Q-14.1 152.75 -11.75 152.75 -10.95 152.75 -8.5 149.95 -6.15 147.3 -6.15 146.55 -7.2 143.95 -8.3 142.05 M-74.45 131.75 Q-73.6 130.9 -72.95 131.25 -72.25 131.65 -72.25 133.25 -72.25 134.35 -72.75 135.9 -71.25 136.45 -71.25 137.2 -71.25 138.1 -72.0 138.65 -72.6 139.05 -73.5 139.05 L-74.25 139.0 -75.25 139.85 Q-76.7 138.5 -76.7 137.65 -77.45 136.8 -77.7 135.9 L-76.45 135.4 Q-76.0 133.1 -74.45 131.75 M-50.8 140.15 L-50.2 139.5 Q-47.35 136.45 -47.35 139.8 -47.35 140.5 -48.1 142.2 -46.15 143.9 -46.15 144.8 -46.15 146.6 -48.25 146.6 -49.2 146.6 -50.1 145.8 -50.75 146.6 -51.35 146.6 L-52.25 146.45 -52.9 146.05 Q-53.1 145.85 -53.1 144.75 -53.1 143.65 -52.4 142.4 -53.1 141.0 -53.1 140.4 L-53.0 139.6 -52.65 139.3 Q-52.0 139.4 -50.8 140.15 M-49.2 158.8 L-47.35 159.45 Q-46.55 159.45 -45.7 158.75 L-45.2 158.2 -48.0 158.3 -51.4 158.25 Q-51.2 159.55 -50.0 159.55 L-49.2 158.8 M-60.65 157.05 Q-66.8 155.6 -71.55 152.75 L-72.4 153.65 Q-74.05 155.35 -74.05 156.45 L-73.7 157.9 Q-72.85 159.25 -70.2 159.25 -67.65 159.25 -66.2 160.5 -64.75 161.7 -63.3 161.7 -61.15 161.7 -60.7 160.1 L-60.65 157.8 -60.65 157.05 M-43.3 163.15 Q-45.35 162.9 -45.35 165.8 L-44.9 168.75 -44.7 169.7 Q-45.5 171.55 -46.7 172.65 -47.55 173.35 -47.55 173.9 L-47.45 175.6 Q-46.95 177.05 -44.7 177.05 L-43.0 176.7 -41.7 176.1 -41.15 177.8 Q-40.4 179.15 -38.5 179.15 -37.0 179.15 -36.5 178.2 -36.15 177.5 -36.15 176.0 -36.15 174.6 -37.05 172.65 -33.5 171.2 -33.1 168.75 L-33.05 168.05 Q-33.05 166.0 -35.85 166.0 -36.9 166.0 -38.2 166.65 L-39.95 167.45 Q-41.2 163.4 -43.3 163.15 M-55.65 170.2 L-58.95 169.6 Q-58.95 171.15 -57.3 173.15 -58.85 175.95 -58.85 177.15 L-58.85 178.15 Q-58.65 179.0 -57.35 179.0 -56.15 179.0 -54.4 175.45 L-53.3 175.65 Q-51.2 175.65 -51.2 173.8 -51.2 172.65 -52.8 171.55 -52.45 170.4 -52.45 169.65 L-52.5 168.75 Q-52.75 166.2 -54.65 168.75 L-55.65 170.2 M-64.1 164.4 L-64.35 164.5 -64.25 164.6 -64.1 164.4 M-66.85 166.15 Q-67.05 164.85 -67.6 163.8 -68.25 164.0 -69.0 165.6 -71.6 165.25 -71.6 166.95 L-70.05 168.5 -70.05 168.65 -70.05 168.75 Q-70.0 171.4 -68.6 171.4 L-67.7 171.2 -67.5 170.9 -67.35 170.15 -65.5 170.5 Q-63.9 170.5 -63.9 168.75 -63.9 167.15 -66.85 166.15 M-26.0 159.1 Q-27.55 159.0 -27.55 160.4 L-26.85 161.1 -27.3 163.65 -27.25 164.65 Q-27.0 165.35 -26.1 165.55 -25.2 165.05 -24.35 163.2 -22.95 164.0 -21.65 164.0 L-20.75 163.85 -20.45 163.65 Q-20.25 163.6 -20.25 162.55 -20.25 161.15 -23.25 159.85 L-23.1 158.85 Q-23.1 158.15 -23.25 157.8 L-23.65 157.1 Q-25.1 157.45 -26.0 159.1" fill="#a38e7a" fill-rule="evenodd" stroke="none"/>
    <path d="M-80.15 228.1 L-81.2 226.85 Q-82.95 224.5 -83.45 222.4 L-80.05 222.5 -80.1 224.65 -80.15 228.1 M-0.85 210.65 Q0.7 218.25 4.55 221.4 6.6 223.1 9.35 223.55 L9.65 223.5 10.5 223.65 14.35 223.3 12.9 225.2 11.8 226.05 Q11.8 227.15 10.55 228.8 9.1 230.75 7.45 230.75 6.05 230.75 5.2 230.2 4.55 229.65 4.35 229.65 L3.55 230.2 Q2.7 230.75 1.5 230.75 -1.5 230.75 -1.8 229.05 L-1.5 226.85 -3.3 227.7 -3.9 228.0 -4.85 228.15 Q-7.2 228.15 -7.7 226.5 L-7.7 224.8 Q-7.7 223.9 -6.25 220.55 L-7.05 220.6 Q-8.75 220.6 -9.45 219.95 L-9.7 219.6 -9.9 218.4 Q-9.9 217.45 -9.45 216.45 -8.5 214.4 -5.6 212.5 -3.65 211.2 -2.6 211.3 L-0.9 210.55 -0.9 210.6 -0.85 210.65" fill="#616457" fill-rule="evenodd" stroke="none"/>
    <path d="M-10.55 272.8 Q-10.75 269.1 -11.35 265.6 L-11.55 264.55 -9.45 263.25 Q-7.75 262.15 -6.2 260.9 L-3.55 258.45 Q1.65 253.25 8.2 240.85 10.8 235.95 12.65 231.4 L13.65 234.4 14.1 235.85 13.75 245.65 13.65 248.9 Q7.6 252.75 1.2 259.8 L-6.2 268.15 -8.2 270.45 -10.55 272.8 M-55.95 271.45 Q-56.1 274.2 -56.6 278.05 L-56.65 278.5 -56.75 279.0 -56.85 279.8 Q-62.8 276.6 -69.25 271.3 L-71.35 269.55 -77.8 263.5 -78.05 257.15 -78.55 247.1 -78.9 242.05 -77.9 246.6 Q-76.8 251.4 -75.4 255.05 L-73.95 258.35 -71.35 262.75 -69.45 265.05 -68.0 266.4 -66.4 267.65 -64.25 269.05 Q-62.65 269.9 -60.3 270.6 L-57.8 271.15 -55.95 271.45" fill="#323236" fill-rule="evenodd" stroke="none"/>
    <path d="M13.3 257.0 L13.0 263.0 12.95 265.6 12.8 270.95 12.25 278.5 12.15 279.1 Q11.85 281.35 12.05 287.25 12.0 289.85 11.5 291.55 L9.9 292.5 8.7 293.0 Q5.4 294.4 1.6 294.4 -3.35 294.4 -6.2 293.5 L-6.2 268.15 1.2 259.8 Q7.6 252.75 13.65 248.9 L13.3 257.0 M-56.85 279.8 L-58.6 288.8 Q-59.35 289.9 -60.3 290.6 L-60.8 290.85 Q-62.15 291.55 -64.55 291.8 L-66.4 291.85 -66.45 291.85 -71.35 291.25 -71.35 269.55 -69.25 271.3 Q-62.8 276.6 -56.85 279.8" fill="#48484d" fill-rule="evenodd" stroke="none"/>
    <path d="M8.7 293.0 Q3.5 299.0 -6.2 304.75 L-6.9 305.15 -9.05 305.15 -9.45 304.45 Q-10.1 303.1 -10.25 301.25 L-10.3 296.25 -9.95 290.8 -9.45 291.55 -8.4 292.5 -6.2 293.5 Q-3.35 294.4 1.6 294.4 5.4 294.4 8.7 293.0 M-64.55 291.8 L-66.4 293.3 -68.95 295.3 -71.35 297.05 Q-77.6 301.35 -81.25 301.35 L-82.2 301.2 -82.75 301.0 Q-82.3 298.9 -80.1 294.7 L-78.7 292.1 -76.3 287.35 Q-75.35 289.15 -73.7 290.2 L-72.4 290.85 -71.35 291.25 -66.45 291.85 -66.4 291.85 -64.55 291.8" fill="#323234" fill-rule="evenodd" stroke="none"/>
    <path d="M-16.0 122.2 Q-14.9 122.35 -13.05 123.45 L-12.1 124.05 Q-9.6 121.75 -8.25 121.45 L-8.1 122.2 Q-7.95 122.6 -7.95 123.2 -7.95 123.5 -8.45 124.25 L-9.65 126.0 Q-8.35 127.4 -8.35 128.75 -8.35 129.55 -8.8 130.15 -9.4 131.05 -10.6 131.05 -11.6 131.05 -12.95 129.9 -13.8 130.75 -14.15 130.75 -16.0 130.75 -16.0 128.9 -16.0 128.35 -15.25 127.35 L-17.35 124.25 -17.8 123.7 -17.75 123.35 Q-17.6 121.9 -16.0 122.2 M-8.3 142.05 Q-7.2 143.95 -6.15 146.55 -6.15 147.3 -8.5 149.95 -10.95 152.75 -11.75 152.75 -14.1 152.75 -14.3 150.65 L-14.0 148.5 Q-14.0 148.05 -14.75 146.7 L-14.95 146.4 Q-11.7 144.4 -8.3 142.05 M-60.65 157.05 L-60.65 157.8 -60.7 160.1 Q-61.15 161.7 -63.3 161.7 -64.75 161.7 -66.2 160.5 -67.65 159.25 -70.2 159.25 -72.85 159.25 -73.7 157.9 L-74.05 156.45 Q-74.05 155.35 -72.4 153.65 L-71.55 152.75 Q-66.8 155.6 -60.65 157.05 M-49.2 158.8 L-50.0 159.55 Q-51.2 159.55 -51.4 158.25 L-48.0 158.3 -45.2 158.2 -45.7 158.75 Q-46.55 159.45 -47.35 159.45 L-49.2 158.8 M-55.65 170.2 L-54.65 168.75 Q-52.75 166.2 -52.5 168.75 L-52.45 169.65 Q-52.45 170.4 -52.8 171.55 -51.2 172.65 -51.2 173.8 -51.2 175.65 -53.3 175.65 L-54.4 175.45 Q-56.15 179.0 -57.35 179.0 -58.65 179.0 -58.85 178.15 L-58.85 177.15 Q-58.85 175.95 -57.3 173.15 -58.95 171.15 -58.95 169.6 L-55.65 170.2 M-43.3 163.15 Q-41.2 163.4 -39.95 167.45 L-38.2 166.65 Q-36.9 166.0 -35.85 166.0 -33.05 166.0 -33.05 168.05 L-33.1 168.75 Q-33.5 171.2 -37.05 172.65 -36.15 174.6 -36.15 176.0 -36.15 177.5 -36.5 178.2 -37.0 179.15 -38.5 179.15 -40.4 179.15 -41.15 177.8 L-41.7 176.1 -43.0 176.7 -44.7 177.05 Q-46.95 177.05 -47.45 175.6 L-47.55 173.9 Q-47.55 173.35 -46.7 172.65 -45.5 171.55 -44.7 169.7 L-44.9 168.75 -45.35 165.8 Q-45.35 162.9 -43.3 163.15 M-66.85 166.15 Q-63.9 167.15 -63.9 168.75 -63.9 170.5 -65.5 170.5 L-67.35 170.15 -67.5 170.9 -67.7 171.2 -68.6 171.4 Q-70.0 171.4 -70.05 168.75 L-70.05 168.65 -70.05 168.5 -71.6 166.95 Q-71.6 165.25 -69.0 165.6 -68.25 164.0 -67.6 163.8 -67.05 164.85 -66.85 166.15 M-26.0 159.1 Q-25.1 157.45 -23.65 157.1 L-23.25 157.8 Q-23.1 158.15 -23.1 158.85 L-23.25 159.85 Q-20.25 161.15 -20.25 162.55 -20.25 163.6 -20.45 163.65 L-20.75 163.85 -21.65 164.0 Q-22.95 164.0 -24.35 163.2 -25.2 165.05 -26.1 165.55 -27.0 165.35 -27.25 164.65 L-27.3 163.65 -26.85 161.1 -27.55 160.4 Q-27.55 159.0 -26.0 159.1" fill="#dbbea4" fill-rule="evenodd" stroke="none"/>
    <path d="M-11.55 132.45 L-11.85 132.65 -12.0 132.45 -11.55 132.45" fill="#898991" fill-rule="evenodd" stroke="none"/>
    <path d="M-77.9 164.75 L-78.4 164.9 -78.4 164.85 -77.9 164.75" fill="#87888f" fill-rule="evenodd" stroke="none"/>
    <path d="M-64.1 164.4 L-64.25 164.6 -64.35 164.5 -64.1 164.4" fill="#636369" fill-rule="evenodd" stroke="none"/>
    <path d="M-76.3 197.65 L-76.6 197.55 -76.55 197.4 -76.5 197.45 -76.3 197.65" fill="#6b6d7a" fill-rule="evenodd" stroke="none"/>
    <path d="M-9.45 197.35 L-9.45 203.0 -15.55 207.7 -15.55 201.6 -15.55 201.55 -9.45 197.35 M-9.45 232.25 L-9.45 244.35 -15.55 248.75 -15.55 237.1 -9.45 232.25 M-41.5 195.85 L-41.5 189.75 -35.8 186.05 -35.8 191.8 -41.5 195.85 M-60.3 202.1 L-60.3 209.85 -66.4 214.4 -66.4 206.15 -60.3 202.1 M-9.45 169.3 L-9.45 173.9 -15.55 177.9 -15.55 173.15 -9.45 169.3 M-35.8 215.7 L-35.8 223.5 -38.75 225.8 -41.5 228.0 -41.5 219.75 -35.8 215.7 M-41.5 258.0 L-39.3 256.2 -35.8 253.4 -35.8 263.2 -41.5 267.25 -41.5 258.0 M-66.4 247.8 L-66.4 237.9 -60.3 233.45 -60.3 242.95 -66.4 247.8" fill="#aa6622" fill-rule="evenodd" stroke="none"/>
    <path d="M-48.05 272.1 L-48.25 272.1 -48.1 272.0 -48.05 272.1 M-0.9 210.55 L-0.85 210.55 -0.85 210.65 -0.9 210.6 -0.9 210.55" fill="#b0b1ba" fill-rule="evenodd" stroke="none"/>
    <path d="M-9.95 290.8 Q-10.85 289.25 -10.9 286.75 L-10.55 278.5 -10.55 276.9 -10.55 272.8 -8.2 270.45 -6.2 268.15 -6.2 293.5 -8.4 292.5 -9.45 291.55 -9.95 290.8 M-76.3 287.35 L-76.8 286.15 -76.85 285.9 -76.85 285.8 -77.25 278.5 -77.7 267.15 -77.7 266.4 -77.75 265.6 -77.8 263.5 -71.35 269.55 -71.35 291.25 -72.4 290.85 -73.7 290.2 Q-75.35 289.15 -76.3 287.35" fill="#545459" fill-rule="evenodd" stroke="none"/>
    <path d="M2.1 270.45 Q3.35 270.7 3.35 271.9 L3.3 272.65 3.05 272.9 2.3 273.1 Q1.05 273.1 0.8 271.65 0.8 270.2 2.1 270.45 M5.45 269.45 L7.55 273.85 7.55 275.3 7.0 275.85 5.1 273.5 Q4.55 272.5 4.55 271.05 4.55 270.0 5.45 269.45 M4.2 275.65 Q-2.1 280.55 -2.95 280.55 -4.1 280.55 -4.2 278.9 -4.2 277.65 -0.75 276.0 2.7 274.35 4.05 275.0 L4.15 275.05 4.2 275.65 M5.3 279.2 Q5.3 280.45 -1.25 283.2 L-2.35 283.0 -2.45 282.95 -2.6 282.4 Q-2.6 280.95 1.35 278.85 5.3 276.7 5.3 279.2 M-12.9 183.8 L-9.6 188.1 -6.5 192.9 -6.75 193.15 Q-7.1 193.45 -7.75 193.55 -9.9 191.5 -11.4 188.9 -13.05 186.2 -13.3 183.95 L-12.9 183.8 M-6.65 187.7 L-5.4 189.65 Q-4.55 191.3 -4.8 192.3 L-5.05 192.65 -6.75 190.95 Q-7.7 189.8 -7.7 189.25 -7.7 188.35 -7.4 188.05 -7.2 187.85 -6.65 187.7 M-53.75 216.8 L-53.7 216.65 -53.7 217.15 Q-53.7 217.8 -55.65 221.65 -57.8 225.9 -59.15 226.8 L-59.6 226.85 -59.75 226.3 Q-59.75 225.05 -57.85 221.6 -55.65 217.65 -53.75 216.8 M-59.85 221.95 L-60.65 220.85 Q-60.65 220.4 -56.85 215.95 L-51.45 209.3 Q-52.15 211.8 -55.0 215.8 L-59.85 221.95 M-52.6 222.35 L-52.5 223.0 -52.7 223.65 -53.55 224.0 -54.5 223.1 Q-54.5 221.7 -52.75 222.15 L-52.6 222.35 M-64.1 283.6 L-64.0 283.75 -63.9 284.4 -64.65 285.15 Q-65.45 285.9 -66.0 286.1 L-66.15 285.3 Q-66.15 284.8 -65.5 284.2 -64.8 283.55 -64.1 283.6 M-68.6 284.05 Q-68.6 284.85 -68.75 284.75 L-68.85 284.9 -69.5 285.05 Q-70.6 285.05 -70.8 284.3 L-70.75 283.4 Q-70.5 282.25 -70.55 281.3 L-70.4 281.05 Q-69.9 281.35 -69.25 282.45 -68.6 283.5 -68.6 284.05 M-71.65 276.9 Q-71.65 277.6 -72.6 279.3 L-73.85 281.15 Q-74.9 280.35 -74.9 279.55 -74.9 278.5 -74.1 277.3 -73.15 275.95 -72.1 276.2 L-71.8 276.3 Q-71.65 276.4 -71.65 276.9 M-75.5 276.55 Q-73.9 273.2 -72.1 273.2 -71.8 274.05 -72.75 275.55 -73.75 277.2 -75.05 277.2 L-75.35 277.1 -75.5 276.55" fill="#3d3009" fill-opacity="0.5647059" fill-rule="evenodd" stroke="none"/>
    <path d="M-23.65 7.0 L-21.05 6.75 Q-23.6 4.75 -25.3 1.9 -26.65 -0.45 -25.15 -2.45 L-22.8 -2.15 Q-21.8 -1.7 -21.25 -0.9 -19.65 1.2 -18.9 3.75 -19.6 0.45 -19.6 -2.8 -19.6 -5.35 -18.15 -7.35 -17.15 -8.85 -15.7 -7.95 L-15.3 -7.45 Q-14.6 -6.6 -14.6 -5.35 L-14.45 6.1 -14.45 6.4 -14.3 6.15 -8.9 -2.05 Q-7.25 -4.6 -4.9 -6.2 L-4.5 -6.4 -3.75 -6.1 Q-3.1 -3.75 -4.15 -0.95 -5.6 2.4 -7.3 5.35 L-8.55 7.6 -7.35 7.75 -21.25 7.2 Q-22.55 7.2 -23.3 7.95 -23.3 7.6 -23.65 7.0 M50.5 56.65 L51.2 71.2 51.4 86.75 50.9 102.15 50.6 107.35 Q49.9 116.35 47.85 125.35 L47.65 125.85 46.75 129.4 45.0 136.15 Q44.15 140.85 40.9 144.65 40.05 145.75 38.6 145.55 L38.3 145.35 37.6 142.85 36.25 146.9 35.35 145.6 34.95 144.65 Q34.35 142.4 34.5 140.05 L35.25 120.55 35.2 120.7 33.95 123.7 32.15 120.8 31.7 122.2 31.4 123.2 Q29.85 129.2 27.35 134.85 L25.5 137.45 25.15 137.75 23.6 138.95 23.6 138.7 23.25 134.8 20.1 140.0 Q18.65 139.2 18.7 137.55 L17.85 146.85 16.75 156.55 16.05 160.05 Q15.3 162.6 13.85 164.8 L13.0 165.55 Q11.95 166.05 11.3 165.2 L11.05 164.65 15.65 110.35 15.75 110.2 17.4 90.0 18.75 88.45 19.5 88.4 20.1 88.0 Q20.3 87.75 20.15 87.5 20.0 87.2 19.55 87.0 L22.1 82.3 Q22.8 80.9 22.85 79.4 L22.65 78.15 Q21.6 76.1 19.75 74.7 18.5 73.6 18.35 72.5 L19.4 71.2 24.15 65.6 Q25.7 64.0 25.9 61.85 26.55 57.2 26.05 52.45 L25.55 50.0 24.5 47.3 Q22.1 41.9 18.4 37.25 L7.05 24.05 2.5 24.95 -3.95 26.3 Q-6.1 26.8 -7.85 25.85 L-8.55 23.85 -10.3 24.35 Q-12.6 24.8 -14.7 24.4 -18.75 24.25 -17.9 20.55 -23.05 24.25 -28.9 25.85 L-30.65 25.75 Q-31.85 25.0 -32.4 25.3 -33.35 26.55 -34.85 27.65 -36.35 28.8 -38.15 28.55 -39.6 28.35 -40.15 26.95 -40.35 26.3 -40.15 25.8 -39.75 23.9 -39.5 21.9 L-39.6 21.6 -39.7 21.6 Q-43.55 26.05 -48.65 29.35 -51.25 31.1 -54.05 30.1 -54.55 29.6 -54.5 28.35 -54.4 25.95 -52.8 23.85 L-54.6 22.3 -54.9 21.6 Q-54.9 20.8 -55.05 20.6 -59.35 24.25 -64.25 27.3 -65.6 28.15 -66.95 27.6 -68.1 26.55 -67.2 24.95 L-64.75 21.05 -64.8 20.8 -68.0 22.15 Q-75.5 25.55 -82.5 30.0 L-85.6 32.0 Q-87.7 33.25 -89.25 35.1 -92.3 39.05 -96.1 42.6 L-96.65 42.65 -101.65 52.35 -101.85 52.35 Q-101.65 48.55 -100.45 45.0 -98.55 39.0 -94.15 34.05 -88.75 28.15 -82.55 22.9 L-70.15 18.45 Q-57.45 14.0 -56.75 13.9 L-60.2 16.6 Q-61.8 18.1 -62.8 20.1 L-55.05 17.45 -46.5 14.25 -46.1 14.25 Q-47.55 14.7 -48.8 20.55 L-48.6 20.75 -47.9 20.9 Q-46.65 20.9 -42.5 18.15 L-38.65 15.35 -39.05 16.65 -40.35 18.35 Q-40.4 19.05 -39.25 19.05 -38.7 19.05 -34.3 16.95 L-29.45 14.6 -29.1 14.6 -32.95 21.65 -26.15 18.0 Q-20.25 14.6 -18.1 14.6 -17.7 14.6 -17.0 15.75 -16.35 16.85 -15.6 16.85 -13.55 16.85 -10.75 13.5 -10.0 16.25 -9.1 17.6 -7.55 19.8 -5.3 19.8 L-0.5 18.4 5.0 16.7 Q5.25 19.6 9.3 21.6 12.55 23.15 14.6 23.15 L15.8 23.15 16.35 22.35 16.8 22.05 Q27.35 45.0 29.75 45.0 30.3 45.0 31.3 43.15 L31.7 42.35 Q31.45 47.3 31.65 51.0 31.9 55.05 31.3 64.35 L30.0 78.75 Q29.5 87.55 31.6 87.55 32.95 87.55 33.55 83.65 L33.9 79.1 Q34.35 72.65 34.4 59.8 L34.4 56.3 35.85 68.3 36.1 68.3 Q36.1 76.2 36.85 76.2 38.05 76.2 38.65 70.25 L39.05 63.7 39.35 58.85 39.5 59.2 39.2 63.05 Q39.05 65.15 39.15 67.8 39.25 71.55 39.85 72.2 40.4 71.55 40.95 67.75 L41.3 64.95 42.1 66.1 Q43.75 65.95 43.95 61.7 L43.85 55.7 44.2 61.6 Q44.6 65.35 46.3 65.35 48.85 65.35 50.2 58.3 L50.5 56.65 M-96.5 122.35 L-98.8 158.7 Q-99.85 163.15 -101.05 164.7 -102.0 167.0 -103.55 167.0 -104.9 167.0 -105.45 165.2 L-105.7 163.45 -105.8 162.1 -105.35 157.2 Q-105.9 151.25 -105.6 145.6 L-105.25 141.9 -105.15 141.4 -105.35 141.95 -105.75 141.95 Q-105.6 140.1 -106.1 138.75 L-107.15 138.75 Q-108.25 143.15 -108.95 152.5 L-109.6 159.05 Q-112.0 157.0 -113.1 154.4 L-110.4 122.45 Q-107.5 123.75 -104.15 123.75 L-98.6 123.5 -96.5 122.35 M-108.15 95.2 L-107.4 86.2 Q-106.9 91.65 -105.7 96.75 L-106.7 95.65 Q-107.25 95.2 -108.15 95.2 M20.85 112.5 L20.7 113.95 Q23.8 115.6 27.45 115.6 L27.75 115.6 Q34.6 115.5 39.95 110.95 41.85 109.3 43.1 107.35 44.55 104.8 44.9 101.7 45.1 99.1 43.45 96.95 41.35 94.5 38.45 92.75 34.45 90.5 29.8 91.25 26.15 91.75 23.5 93.95 L23.4 94.75 Q23.05 95.7 22.3 96.2 L22.2 96.5 21.8 101.35 20.85 112.5" fill="#515247" fill-rule="evenodd" stroke="none"/>
    <path d="M-23.65 7.0 Q-23.3 7.6 -23.3 7.95 -22.55 7.2 -21.25 7.2 L-7.35 7.75 Q2.8 9.1 11.85 13.35 24.15 19.05 34.75 27.2 42.15 32.9 46.85 40.6 48.3 43.1 48.95 45.7 49.8 49.25 50.2 53.0 L50.5 56.65 50.2 58.3 Q48.85 65.35 46.3 65.35 44.6 65.35 44.2 61.6 L43.85 55.7 43.95 61.7 Q43.75 65.95 42.1 66.1 L41.3 64.95 40.95 67.75 Q40.4 71.55 39.85 72.2 39.25 71.55 39.15 67.8 39.05 65.15 39.2 63.05 L39.5 59.2 39.35 58.85 39.05 63.7 38.65 70.25 Q38.05 76.2 36.85 76.2 36.1 76.2 36.1 68.3 L35.85 68.3 34.4 56.3 34.4 59.8 Q34.35 72.65 33.9 79.1 L33.55 83.65 Q32.95 87.55 31.6 87.55 29.5 87.55 30.0 78.75 L31.3 64.35 Q31.9 55.05 31.65 51.0 31.45 47.3 31.7 42.35 L31.3 43.15 Q30.3 45.0 29.75 45.0 27.35 45.0 16.8 22.05 L16.35 22.35 15.8 23.15 14.6 23.15 Q12.55 23.15 9.3 21.6 5.25 19.6 5.0 16.7 L-0.5 18.4 -5.3 19.8 Q-7.55 19.8 -9.1 17.6 -10.0 16.25 -10.75 13.5 -13.55 16.85 -15.6 16.85 -16.35 16.85 -17.0 15.75 -17.7 14.6 -18.1 14.6 -20.25 14.6 -26.15 18.0 L-32.95 21.65 -29.1 14.6 -29.45 14.6 -34.3 16.95 Q-38.7 19.05 -39.25 19.05 -40.4 19.05 -40.35 18.35 L-39.05 16.65 -38.65 15.35 -42.5 18.15 Q-46.65 20.9 -47.9 20.9 L-48.6 20.75 -48.8 20.55 Q-47.55 14.7 -46.1 14.25 L-46.5 14.25 -55.05 17.45 -62.8 20.1 Q-61.8 18.1 -60.2 16.6 L-56.75 13.9 Q-57.45 14.0 -70.15 18.45 L-82.55 22.9 -78.2 19.3 Q-73.8 15.85 -68.8 13.35 -60.25 8.95 -50.85 8.35 L-23.65 7.0" fill="#5c5e51" fill-rule="evenodd" stroke="none"/>
    <path d="M18.4 37.25 L18.1 37.35 Q16.85 35.55 10.05 32.25 3.05 28.85 0.05 28.85 L-2.9 29.6 -6.8 30.15 -15.05 29.05 -20.65 27.85 -18.45 26.55 -18.85 26.55 Q-20.9 28.35 -27.5 30.95 -34.75 33.8 -39.1 33.8 -41.0 33.8 -42.15 33.0 -43.5 32.1 -43.0 30.45 L-46.4 32.8 Q-49.65 34.75 -51.25 34.75 -53.7 34.75 -54.8 32.05 -56.05 29.45 -55.1 26.95 -57.9 28.25 -60.85 29.4 -64.5 30.85 -65.5 30.85 L-66.2 30.7 -66.3 29.85 Q-67.0 29.85 -68.45 30.5 -69.85 31.15 -70.6 31.15 L-72.15 30.85 Q-72.5 30.45 -72.4 29.35 -72.25 27.65 -70.6 25.4 L-68.0 22.15 -64.8 20.8 -64.75 21.05 -67.2 24.95 Q-68.1 26.55 -66.95 27.6 -65.6 28.15 -64.25 27.3 -59.35 24.25 -55.05 20.6 -54.9 20.8 -54.9 21.6 L-54.6 22.3 -52.8 23.85 Q-54.4 25.95 -54.5 28.35 -54.55 29.6 -54.05 30.1 -51.25 31.1 -48.65 29.35 -43.55 26.05 -39.7 21.6 L-39.5 21.9 Q-39.75 23.9 -40.15 25.8 -40.35 26.3 -40.15 26.95 -39.6 28.35 -38.15 28.55 -36.35 28.8 -34.85 27.65 -33.35 26.55 -32.4 25.3 -31.85 25.0 -30.65 25.75 L-28.9 25.85 Q-23.05 24.25 -17.9 20.55 -18.75 24.25 -14.7 24.4 -12.6 24.8 -10.3 24.35 L-8.55 23.85 -7.85 25.85 Q-6.1 26.8 -3.95 26.3 L2.5 24.95 7.05 24.05 18.4 37.25 M-46.0 109.9 Q-44.2 113.0 -43.8 115.8 -53.9 115.65 -58.9 116.75 L-59.05 115.6 -59.35 112.55 Q-59.15 109.9 -56.95 107.65 L-56.6 107.35 Q-54.5 105.35 -51.9 105.35 -49.7 105.35 -47.75 107.35 -46.85 108.4 -46.0 109.9" fill="#7d8473" fill-rule="evenodd" stroke="none"/>
    <path d="M-93.75 120.15 L-96.5 122.35 -98.6 123.5 -104.15 123.75 Q-107.5 123.75 -110.4 122.45 -112.6 121.6 -114.5 119.95 -119.7 115.6 -119.1 108.65 L-118.85 107.35 Q-118.15 104.1 -115.05 100.15 -111.15 95.2 -108.4 95.2 L-108.15 95.2 Q-107.25 95.2 -106.7 95.65 L-105.7 96.75 -105.5 97.6 -105.0 99.25 Q-109.7 100.5 -110.85 101.25 -112.85 102.7 -114.15 106.65 L-112.4 106.65 Q-109.65 105.4 -108.8 105.1 -106.85 104.4 -105.1 104.4 L-103.15 104.7 -102.65 105.8 -105.15 107.35 -106.35 108.3 Q-108.05 109.8 -108.25 112.1 -108.45 114.35 -106.25 115.5 -104.5 116.45 -102.1 116.45 -99.2 116.45 -97.7 115.75 L-97.25 115.5 -96.15 116.95 -93.75 120.15 M19.55 87.0 Q20.0 87.2 20.15 87.5 20.3 87.75 20.1 88.0 L19.5 88.4 18.75 88.45 19.55 87.0 M21.8 101.35 L22.2 96.5 22.3 96.2 Q23.05 95.7 23.4 94.75 L23.5 93.95 Q26.15 91.75 29.8 91.25 34.45 90.5 38.45 92.75 41.35 94.5 43.45 96.95 45.1 99.1 44.9 101.7 44.55 104.8 43.1 107.35 41.85 109.3 39.95 110.95 34.6 115.5 27.75 115.6 L27.45 115.6 Q23.8 115.6 20.7 113.95 L20.85 112.5 21.9 112.55 Q24.2 112.55 26.5 111.65 L27.55 111.25 Q30.05 109.95 30.25 107.85 L30.3 107.35 Q30.2 105.9 28.95 104.75 27.5 103.35 25.25 103.75 L25.3 103.45 31.7 102.2 Q36.5 101.25 36.55 100.65 36.7 99.45 35.1 98.55 33.35 97.55 31.2 97.55 27.45 97.55 24.6 99.05 22.8 99.95 21.8 101.35" fill="#6d7364" fill-rule="evenodd" stroke="none"/>
    <path d="M20.85 112.5 L21.8 101.35 Q22.8 99.95 24.6 99.05 27.45 97.55 31.2 97.55 33.35 97.55 35.1 98.55 36.7 99.45 36.55 100.65 36.5 101.25 31.7 102.2 L25.3 103.45 25.25 103.75 Q27.5 103.35 28.95 104.75 30.2 105.9 30.3 107.35 L30.25 107.85 Q30.05 109.95 27.55 111.25 L26.5 111.65 Q24.2 112.55 21.9 112.55 L20.85 112.5 M-97.25 115.5 L-97.7 115.75 Q-99.2 116.45 -102.1 116.45 -104.5 116.45 -106.25 115.5 -108.45 114.35 -108.25 112.1 -108.05 109.8 -106.35 108.3 L-105.15 107.35 -102.65 105.8 -101.95 107.35 Q-100.0 111.55 -97.25 115.5 M-103.15 104.7 L-105.1 104.4 Q-106.85 104.4 -108.8 105.1 -109.65 105.4 -112.4 106.65 L-114.15 106.65 Q-112.85 102.7 -110.85 101.25 -109.7 100.5 -105.0 99.25 L-103.15 104.7" fill="#616457" fill-rule="evenodd" stroke="none"/>
    <path d="M15.65 110.35 Q11.45 117.2 5.95 122.85 -13.7 142.9 -48.15 142.9 -67.0 142.9 -82.35 131.15 L-85.7 128.4 -89.9 124.45 -93.75 120.15 -96.15 116.95 -97.25 115.5 Q-100.0 111.55 -101.95 107.35 L-102.65 105.8 -103.15 104.7 -105.0 99.25 -105.5 97.6 -105.7 96.75 Q-106.9 91.65 -107.4 86.2 -107.7 81.05 -107.3 75.6 L-107.25 74.95 -106.8 71.2 Q-105.55 61.5 -101.95 53.05 L-101.65 52.45 -101.65 52.35 -96.65 42.65 -96.1 42.6 Q-92.3 39.05 -89.25 35.1 -87.7 33.25 -85.6 32.0 L-82.5 30.0 Q-75.5 25.55 -68.0 22.15 L-70.6 25.4 Q-72.25 27.65 -72.4 29.35 -72.5 30.45 -72.15 30.85 L-70.6 31.15 Q-69.85 31.15 -68.45 30.5 -67.0 29.85 -66.3 29.85 L-66.2 30.7 -65.5 30.85 Q-64.5 30.85 -60.85 29.4 -57.9 28.25 -55.1 26.95 -56.05 29.45 -54.8 32.05 -53.7 34.75 -51.25 34.75 -49.65 34.75 -46.4 32.8 L-43.0 30.45 Q-43.5 32.1 -42.15 33.0 -41.0 33.8 -39.1 33.8 -34.75 33.8 -27.5 30.95 -20.9 28.35 -18.85 26.55 L-18.45 26.55 -20.65 27.85 -15.05 29.05 -6.8 30.15 -2.9 29.6 0.05 28.85 Q3.05 28.85 10.05 32.25 16.85 35.55 18.1 37.35 L18.4 37.25 Q22.1 41.9 24.5 47.3 L25.55 50.0 26.05 52.45 Q26.55 57.2 25.9 61.85 25.7 64.0 24.15 65.6 L19.4 71.2 18.35 72.5 Q18.5 73.6 19.75 74.7 21.6 76.1 22.65 78.15 L22.85 79.4 Q22.8 80.9 22.1 82.3 L19.55 87.0 18.75 88.45 17.4 90.0 15.75 110.2 15.65 110.35 M-39.5 21.9 L-39.7 21.6 -39.6 21.6 -39.5 21.9 M-46.0 109.9 Q-46.85 108.4 -47.75 107.35 -49.7 105.35 -51.9 105.35 -54.5 105.35 -56.6 107.35 L-56.95 107.65 Q-59.15 109.9 -59.35 112.55 L-59.05 115.6 -58.9 116.75 Q-53.9 115.65 -43.8 115.8 -44.2 113.0 -46.0 109.9 M-64.4 116.0 L-63.6 115.65 -63.7 115.65 -64.4 116.0 -65.1 116.2 -64.75 116.2 -64.4 116.0" fill="url(#gradient0)" fill-rule="evenodd" stroke="none"/>
    <path d="M-12.45 64.45 Q-14.85 67.25 -16.7 70.3 -19.0 74.15 -20.2 77.8 L-14.35 75.7 Q-8.85 73.6 -6.9 73.4 -4.6 73.2 2.1 74.7 8.8 76.15 10.3 77.2 10.35 74.65 8.95 71.7 7.35 68.85 6.7 67.25 9.85 68.75 13.35 73.25 L18.15 79.85 16.1 81.1 15.45 79.65 14.6 77.9 Q14.7 78.75 13.75 79.85 L11.45 81.95 9.85 81.05 8.9 80.35 Q8.65 80.0 8.75 79.6 5.9 77.15 1.0 76.2 L-7.45 75.95 Q-10.9 76.3 -16.7 79.1 L-26.15 83.75 -26.05 82.65 Q-25.6 77.1 -19.45 70.55 -16.0 66.75 -12.45 64.45 M5.1 91.15 L5.4 91.4 0.8 95.65 Q-2.9 98.95 -3.85 99.25 L-2.95 99.15 -0.7 98.7 1.9 98.25 1.9 98.7 Q-0.75 101.7 -8.35 106.5 -9.15 106.9 -9.95 107.5 -16.5 109.3 -23.1 109.1 L-25.6 104.35 -30.5 94.8 -30.3 94.75 -28.5 97.2 -26.4 100.0 Q-23.05 103.75 -20.65 103.5 L-17.55 103.05 -17.1 103.0 -16.25 102.75 Q-11.8 101.65 -7.8 99.3 L-7.55 99.3 Q-5.95 99.15 -0.6 95.5 L5.1 91.15 M8.7 90.45 Q8.8 89.2 9.95 90.0 10.75 90.6 11.65 91.65 L11.4 91.95 10.75 92.05 Q9.8 92.15 9.15 91.35 8.7 90.8 8.7 90.45 M12.3 88.55 L9.65 88.65 Q7.2 88.3 7.05 86.5 L10.85 86.1 Q13.45 86.2 13.4 87.4 L12.9 88.25 12.3 88.55 M29.3 94.7 Q29.35 93.8 30.0 93.2 30.65 92.6 31.55 92.6 L32.25 92.65 32.45 92.85 31.2 94.15 29.4 95.1 Q29.25 95.4 29.3 94.7 M33.6 96.25 L33.0 96.1 32.8 95.95 Q32.7 95.85 32.75 95.4 32.75 94.9 33.9 94.5 35.15 93.95 36.35 94.1 L36.55 94.0 36.65 94.5 Q36.6 95.25 35.4 95.8 L33.6 96.25 M4.2 109.15 Q2.5 112.65 2.3 113.7 L1.35 114.1 Q1.25 113.7 1.3 112.95 1.4 111.25 2.75 108.75 4.1 106.2 5.7 105.1 L5.8 105.0 5.85 105.5 4.2 109.15 M6.55 99.6 Q6.5 100.4 3.75 105.05 0.85 109.9 -0.95 112.15 L-1.55 111.35 -1.8 110.75 Q-1.7 109.15 1.35 104.45 4.65 99.35 6.35 99.15 L6.45 99.1 6.55 99.6 M-27.05 41.8 Q-30.15 42.55 -46.75 42.35 L-51.75 42.8 -55.2 43.2 Q-57.5 43.2 -58.9 42.35 -60.3 41.5 -60.4 41.5 L-60.6 41.15 -59.0 41.45 -57.1 41.7 -43.05 40.8 Q-28.8 40.05 -25.7 40.7 -26.3 40.75 -26.25 41.1 -26.25 41.55 -27.05 41.8 M-36.35 49.05 L-47.7 50.2 -56.25 51.5 -67.35 52.7 -68.85 52.65 -70.05 51.5 -70.1 51.1 Q-64.15 51.1 -51.7 49.05 L-30.05 45.3 Q-4.5 41.2 -4.85 47.25 -4.9 48.15 -5.6 48.7 -6.2 49.15 -6.9 49.15 L-11.7 48.6 -16.55 48.05 -36.35 49.05 M-48.05 56.15 L-22.35 55.35 Q-13.2 55.0 -13.35 57.25 -13.45 59.15 -15.75 59.45 L-27.75 59.6 -52.45 58.8 -68.75 57.35 Q-64.95 55.3 -59.45 55.55 L-48.05 56.15 M-65.65 86.85 L-66.0 85.05 -67.2 85.05 Q-69.25 86.0 -71.0 86.0 -71.6 86.05 -75.8 83.15 -80.5 80.3 -84.3 80.35 -86.55 80.4 -91.65 82.8 L-98.6 86.2 Q-98.55 85.55 -98.95 83.4 L-99.0 83.2 -99.35 80.0 Q-98.95 75.25 -94.1 70.0 -89.05 64.25 -83.75 63.7 L-83.65 63.35 -83.65 63.3 -83.6 63.2 -81.25 62.75 -89.5 71.3 -96.45 78.5 Q-94.85 78.6 -92.6 77.95 -90.25 77.2 -89.5 77.2 L-87.6 77.2 Q-83.4 77.35 -79.45 78.3 L-69.15 81.3 -69.05 79.3 Q-68.95 78.1 -69.65 75.35 L-70.45 72.8 -66.55 78.2 Q-63.35 83.1 -62.85 84.65 -61.6 84.0 -59.35 83.35 -56.3 82.5 -54.55 82.6 L-54.15 83.1 Q-55.1 83.75 -58.2 84.8 L-61.6 85.7 -58.55 86.75 -58.4 86.7 Q-58.3 86.75 -58.35 87.1 -58.35 87.55 -59.25 87.8 L-60.9 88.15 Q-62.3 88.15 -63.75 87.0 L-64.45 86.5 -65.65 86.85 M-99.9 95.8 L-98.65 97.45 Q-94.85 102.2 -89.15 102.4 -86.9 103.3 -84.15 103.25 -82.3 103.2 -78.35 100.65 -74.65 98.35 -74.55 97.6 L-74.3 97.05 -74.15 96.75 -78.7 99.05 -80.55 100.05 -74.2 95.5 -66.7 91.3 -75.6 102.3 Q-81.55 109.15 -84.75 109.2 -91.3 109.3 -95.9 103.55 -98.85 100.0 -99.9 95.8 M-51.8 97.55 L-51.75 98.0 -57.95 103.25 -58.4 103.25 -58.55 102.75 Q-58.5 102.25 -55.95 100.0 -53.2 97.55 -51.9 97.45 L-51.8 97.55 M-48.95 98.8 L-48.85 99.3 -50.15 100.95 Q-51.6 102.55 -52.35 102.55 L-53.3 102.3 Q-53.45 102.4 -53.4 101.65 -53.35 100.65 -51.95 99.8 -50.65 98.95 -49.0 98.7 L-48.95 98.8 M-34.55 92.7 L-35.7 93.1 -36.95 93.05 -37.7 92.7 Q-37.2 92.35 -35.7 92.05 L-33.75 91.85 -33.7 92.15 Q-33.8 92.4 -34.55 92.7 M-31.3 87.65 Q-31.35 88.35 -32.0 88.7 L-33.95 89.1 Q-39.25 89.65 -39.15 88.05 -39.1 87.15 -35.15 86.95 -31.25 86.6 -31.3 87.65 M-86.35 111.0 Q-84.9 111.65 -83.7 111.6 -80.8 111.6 -77.75 108.3 -75.05 104.6 -74.25 104.2 -74.55 106.1 -76.65 108.95 -79.55 112.7 -83.2 112.75 -83.95 112.8 -84.95 112.3 L-86.5 111.25 -86.35 111.0 M-20.05 115.4 L-20.4 115.55 -20.5 115.35 -20.05 115.4 M-22.15 112.75 L-23.2 110.9 Q-16.65 111.8 -10.2 110.65 L-13.75 112.4 -14.75 112.4 -22.15 112.75 M-76.1 114.55 L-76.35 114.55 -74.65 111.7 -72.5 109.3 Q-72.35 111.55 -76.1 114.55" fill="#6c7364" fill-opacity="0.4509804" fill-rule="evenodd" stroke="none"/>
    <path d="M16.1 81.1 L16.15 81.3 15.4 82.75 Q10.6 84.3 5.0 85.0 L5.95 85.35 5.8 85.55 Q3.25 84.65 1.6 84.65 -0.25 86.4 -5.85 89.75 -13.6 94.45 -16.35 94.7 -18.05 94.85 -22.75 93.0 L-24.55 92.35 -26.05 94.65 -26.75 95.9 -25.25 97.75 -24.3 98.65 Q-23.65 98.85 -22.85 99.3 -18.9 101.05 -16.2 100.85 -12.1 100.25 -7.95 97.7 L-6.85 96.8 -6.65 96.85 -5.8 96.35 Q-0.95 92.75 1.25 88.95 L0.6 90.45 0.0 91.8 Q-0.1 92.95 -1.65 94.65 L4.4 90.6 5.6 89.7 6.15 90.15 5.1 91.15 -0.6 95.5 Q-5.95 99.15 -7.55 99.3 L-7.8 99.3 Q-11.8 101.65 -16.25 102.75 L-17.1 103.0 -17.55 103.05 -20.65 103.5 Q-23.05 103.75 -26.4 100.0 L-28.5 97.2 -30.3 94.75 -30.5 94.5 -29.65 92.6 Q-28.9 90.8 -28.8 90.0 -28.8 89.55 -29.3 89.4 L-29.85 89.2 -30.6 89.45 -30.7 84.7 Q-28.15 73.25 -22.1 67.95 -16.1 62.65 -7.95 62.05 L-7.95 62.1 Q-10.2 63.0 -12.45 64.45 -16.0 66.75 -19.45 70.55 -25.6 77.1 -26.05 82.65 L-26.15 83.75 -16.7 79.1 Q-10.9 76.3 -7.45 75.95 L1.0 76.2 Q5.9 77.15 8.75 79.6 8.65 80.0 8.9 80.35 L9.85 81.05 11.45 81.95 13.75 79.85 Q14.7 78.75 14.6 77.9 L15.45 79.65 16.1 81.1 M-83.65 63.3 L-83.65 63.35 -83.75 63.7 Q-89.05 64.25 -94.1 70.0 -98.95 75.25 -99.35 80.0 L-99.0 83.2 -98.95 83.4 Q-98.55 85.55 -98.6 86.2 L-91.65 82.8 Q-86.55 80.4 -84.3 80.35 -80.5 80.3 -75.8 83.15 -71.6 86.05 -71.0 86.0 -69.25 86.0 -67.2 85.05 L-66.0 85.05 -65.65 86.85 -65.7 87.3 Q-65.75 88.5 -67.3 88.95 L-70.6 89.35 -73.5 89.6 Q-74.2 89.8 -76.15 91.0 -81.35 94.3 -88.3 94.4 -91.5 94.45 -95.1 93.1 L-96.8 92.55 Q-96.8 92.95 -97.7 93.95 L-98.2 94.4 -96.9 96.0 Q-95.7 97.2 -91.0 99.15 -88.25 100.25 -87.35 100.9 L-84.1 101.15 Q-83.3 101.15 -81.65 100.45 L-80.55 100.05 -78.7 99.05 -74.15 96.75 -74.3 97.05 -74.55 97.6 Q-74.65 98.35 -78.35 100.65 -82.3 103.2 -84.15 103.25 -86.9 103.3 -89.15 102.4 -94.85 102.2 -98.65 97.45 L-99.9 95.8 Q-101.5 93.55 -101.6 92.15 L-103.55 91.85 -102.6 91.4 -101.55 91.15 -103.6 90.75 -105.4 90.1 -105.4 89.85 -102.7 89.65 -102.45 89.6 -101.25 89.3 -103.05 85.6 Q-103.65 83.9 -103.5 82.8 -103.3 80.25 -102.1 77.25 -101.1 74.8 -99.3 71.95 -95.55 65.95 -84.5 63.5 L-83.65 63.3 M-88.25 85.3 L-88.35 85.35 -91.95 86.45 -100.5 89.4 -94.3 90.05 -89.6 90.3 Q-86.35 90.3 -79.15 88.9 L-72.9 87.4 Q-74.5 85.8 -75.85 85.2 -76.55 84.9 -77.6 84.65 L-82.75 84.25 Q-84.65 84.25 -88.25 85.3 M-18.85 85.4 Q-23.8 86.8 -28.85 88.85 -27.25 89.75 -22.4 90.05 -17.9 90.35 -15.25 90.1 -10.8 89.6 -4.85 86.8 -0.35 84.65 1.6 82.7 L-1.15 82.55 Q-3.65 82.5 -4.65 82.6 L-4.95 82.65 Q-11.65 83.3 -18.85 85.4" fill="#6d7364" fill-rule="evenodd" stroke="none"/>
    <path d="M40.7 104.55 L40.7 105.0 Q40.55 106.75 37.65 109.4 34.55 112.25 31.95 112.25 L31.4 112.05 36.0 107.8 Q38.75 105.0 40.65 104.55 L40.7 104.55 M35.45 105.8 L35.6 106.4 34.4 107.85 32.95 109.0 32.55 109.0 32.45 108.5 Q32.5 108.25 33.3 107.2 34.15 106.1 34.9 105.6 L35.45 105.8" fill="#5f6356" fill-opacity="0.47058824" fill-rule="evenodd" stroke="none"/>
    <path d="M-77.6 84.65 Q-76.55 84.9 -75.85 85.2 -74.5 85.8 -72.9 87.4 L-79.15 88.9 Q-86.35 90.3 -89.6 90.3 L-94.3 90.05 -100.5 89.4 -91.95 86.45 -88.35 85.35 -88.25 85.3 Q-87.4 86.8 -86.25 87.15 L-83.5 87.25 Q-80.3 87.2 -78.9 86.05 L-77.6 84.65 M-4.95 82.65 L-4.65 82.6 Q-3.65 82.5 -1.15 82.55 L1.6 82.7 Q-0.35 84.65 -4.85 86.8 -10.8 89.6 -15.25 90.1 -17.9 90.35 -22.4 90.05 -27.25 89.75 -28.85 88.85 -23.8 86.8 -18.85 85.4 -18.35 86.5 -16.8 87.3 -14.7 88.4 -13.05 88.2 -10.6 87.95 -7.6 85.45 -5.95 84.05 -4.95 82.65" fill="#c2c2c2" fill-rule="evenodd" stroke="none"/>
    <path d="M-88.25 85.3 Q-84.65 84.25 -82.75 84.25 L-77.6 84.65 -78.9 86.05 Q-80.3 87.2 -83.5 87.25 L-86.25 87.15 Q-87.4 86.8 -88.25 85.3 M-4.95 82.65 Q-5.95 84.05 -7.6 85.45 -10.6 87.95 -13.05 88.2 -14.7 88.4 -16.8 87.3 -18.35 86.5 -18.85 85.4 -11.65 83.3 -4.95 82.65" fill="#535948" fill-rule="evenodd" stroke="none"/>
    <path d="M-71.8 126.15 L-63.4 118.3 -63.0 118.3 Q-63.75 120.45 -65.95 123.95 L-67.7 126.65 -71.8 126.15 M-59.85 126.1 L-59.05 123.15 Q-58.5 120.55 -57.95 119.5 -55.75 122.7 -55.2 125.6 L-57.6 125.85 -59.85 126.1 M-46.9 124.4 Q-47.6 121.75 -49.8 119.25 L-49.6 119.1 -45.4 122.2 -43.45 123.55 -46.9 124.4 M-36.15 121.45 L-37.45 120.35 -39.5 118.95 Q-37.65 118.6 -36.0 117.7 -36.9 116.35 -40.25 112.8 -39.6 113.45 -36.15 115.25 -32.95 116.9 -32.85 117.6 -32.85 118.0 -33.45 118.5 L-34.45 119.0 -32.8 120.4 -34.65 121.0 -36.15 121.45 M-18.15 115.3 L-20.05 115.4 -20.5 115.35 -23.05 114.9 -27.55 113.6 -27.55 113.3 -22.15 112.75 -14.75 112.4 -13.75 112.4 -2.9 112.55 Q-3.5 113.55 -6.95 115.4 L-12.05 118.1 Q-12.75 117.45 -13.65 117.15 L-13.7 117.1 Q-12.0 116.15 -11.5 115.5 -6.6 113.9 -6.65 113.45 -6.85 111.7 -15.05 114.3 L-17.85 115.25 -18.15 115.3" fill="#5c6356" fill-opacity="0.44313726" fill-rule="evenodd" stroke="none"/>
    <path d="M-13.7 117.1 L-13.8 117.1 Q-17.6 119.2 -26.9 122.55 -37.95 126.5 -46.95 128.85 L-54.45 130.45 -58.7 131.2 -60.15 130.75 -57.15 129.7 -57.1 129.7 Q-60.35 128.15 -62.3 127.5 L-63.4 127.5 -68.15 127.55 -72.6 127.0 Q-73.85 126.65 -74.2 126.15 L-74.05 126.0 -73.7 125.8 -71.8 126.15 -67.7 126.65 -66.65 126.65 -59.85 126.1 -57.6 125.85 -55.2 125.6 -49.65 124.9 -47.45 124.5 -46.9 124.4 -43.45 123.55 -36.15 121.45 -34.65 121.0 -32.8 120.4 -25.3 117.95 -18.15 115.3 -17.85 115.25 -15.05 114.3 Q-6.85 111.7 -6.65 113.45 -6.6 113.9 -11.5 115.5 -12.0 116.15 -13.7 117.1 M-35.3 122.8 L-47.3 125.85 -49.5 126.3 -57.75 127.3 Q-55.5 128.2 -54.95 129.25 L-53.4 128.9 -47.1 127.6 Q-37.15 125.15 -25.4 120.45 -23.2 119.45 -21.35 118.5 L-24.5 119.4 -31.35 121.6 -35.3 122.8 M-45.5 106.8 L-45.2 107.0 Q-41.35 109.6 -45.7 113.05 L-45.9 113.2 -46.35 113.5 Q-51.9 112.15 -48.7 108.05 -47.9 106.85 -45.5 106.8 M-57.5 107.4 Q-55.2 109.75 -55.7 112.4 L-55.35 112.65 Q-55.25 113.55 -56.65 114.15 L-57.6 114.25 Q-58.7 114.25 -59.25 113.85 L-59.8 113.75 Q-63.55 110.15 -58.3 107.3 L-57.5 107.4" fill="#5d6356" fill-rule="evenodd" stroke="none"/>
    <path d="M-35.3 122.8 L-31.35 121.6 -24.5 119.4 -21.35 118.5 Q-23.2 119.45 -25.4 120.45 -37.15 125.15 -47.1 127.6 L-53.4 128.9 -54.95 129.25 Q-55.5 128.2 -57.75 127.3 L-49.5 126.3 -47.3 125.85 -35.3 122.8" fill="#c2bca6" fill-rule="evenodd" stroke="none"/>
    <path d="M17.65 57.65 Q16.95 59.7 15.35 62.5 10.25 70.4 7.25 70.95 L3.35 71.45 -1.2 67.2 -4.95 63.5 Q-12.9 56.45 -19.55 52.6 -21.8 51.3 -27.4 49.05 L-32.2 47.3 Q-31.5 45.05 -28.2 40.2 L-25.85 37.0 Q-24.3 34.7 -19.9 31.2 -15.15 27.35 -13.9 28.1 -13.3 28.4 -13.3 30.8 -13.35 33.1 -13.0 33.3 L-6.25 34.75 Q0.15 36.0 1.35 36.65 2.15 37.15 2.35 38.45 L2.6 41.0 Q2.55 42.65 2.65 43.25 2.65 44.15 4.55 45.2 10.05 48.25 11.85 49.8 L15.5 52.9 17.65 57.65 M-106.6 55.35 L-103.8 52.95 -100.95 50.6 -98.15 48.65 -95.55 47.2 -93.0 45.8 Q-92.5 45.6 -92.4 45.05 L-91.85 44.2 -89.85 41.15 -88.0 38.45 -86.75 36.3 -85.45 36.1 -83.75 36.1 -77.25 36.75 -73.95 36.95 -72.1 37.05 Q-71.65 37.05 -71.25 36.45 L-69.3 32.35 -68.75 31.45 -68.55 31.25 -68.15 31.15 -66.1 31.55 -65.05 31.85 -64.75 32.4 -64.2 34.2 Q-64.05 35.65 -63.5 37.45 L-61.95 42.8 -60.6 47.75 -60.2 50.15 -60.05 53.45 Q-59.95 54.45 -60.0 55.65 L-59.9 56.8 -66.1 57.35 -74.75 58.55 Q-82.5 60.55 -93.1 65.45 L-99.55 68.65 -103.0 62.1 -106.6 55.35" fill="#42443c" fill-rule="evenodd" stroke="none"/>
    <path d="M-32.2 47.3 L-32.8 47.05 -33.8 46.6 Q-33.4 43.8 -30.75 39.05 -27.75 33.45 -24.55 29.65 -21.95 26.4 -17.2 24.9 -13.1 23.55 -11.75 24.35 -10.3 25.25 -10.35 26.5 L-11.35 30.25 -4.35 31.05 Q0.85 31.75 3.05 33.0 4.75 34.05 5.3 38.35 5.8 43.0 8.25 44.3 L14.1 47.8 Q17.55 50.45 18.3 52.75 18.75 54.55 17.65 57.65 L15.5 52.9 11.85 49.8 Q10.05 48.25 4.55 45.2 2.65 44.15 2.65 43.25 2.55 42.65 2.6 41.0 L2.35 38.45 Q2.15 37.15 1.35 36.65 0.15 36.0 -6.25 34.75 L-13.0 33.3 Q-13.35 33.1 -13.3 30.8 -13.3 28.4 -13.9 28.1 -15.15 27.35 -19.9 31.2 -24.3 34.7 -25.85 37.0 L-28.2 40.2 Q-31.5 45.05 -32.2 47.3 M-106.6 55.35 L-109.25 50.2 -108.15 48.75 -106.4 47.25 Q-104.35 45.7 -102.1 44.95 L-97.6 43.65 -94.6 42.55 Q-93.4 42.1 -92.6 41.3 -91.0 39.8 -89.7 38.05 L-88.3 36.2 -87.65 35.5 -86.4 34.25 Q-85.1 33.1 -83.45 33.1 L-76.0 33.7 -72.65 34.3 -70.75 34.6 -70.45 33.0 -70.2 31.9 -69.9 30.85 Q-69.65 30.0 -68.95 29.55 -68.3 29.2 -67.55 29.2 L-65.6 29.4 Q-64.2 30.05 -63.1 31.05 L-60.4 34.1 -59.5 35.7 Q-59.05 37.15 -58.75 38.75 -58.5 39.95 -58.4 41.2 -58.0 44.8 -58.2 48.4 L-58.2 50.95 -58.3 52.1 -58.6 54.15 -59.0 55.95 -59.15 56.7 -59.9 56.8 -60.0 55.65 Q-59.95 54.45 -60.05 53.45 L-60.2 50.15 -60.6 47.75 -61.95 42.8 -63.5 37.45 Q-64.05 35.65 -64.2 34.2 L-64.75 32.4 -65.05 31.85 -66.1 31.55 -68.15 31.15 -68.55 31.25 -68.75 31.45 -69.3 32.35 -71.25 36.45 Q-71.65 37.05 -72.1 37.05 L-73.95 36.95 -77.25 36.75 -83.75 36.1 -85.45 36.1 -86.75 36.3 -88.0 38.45 -89.85 41.15 -91.85 44.2 -92.4 45.05 Q-92.5 45.6 -93.0 45.8 L-95.55 47.2 -98.15 48.65 -100.95 50.6 -103.8 52.95 -106.6 55.35" fill="#515247" fill-rule="evenodd" stroke="none"/>
  </g>
  <defs>
    <radialGradient cx="0" cy="0" gradientTransform="matrix(0.1896, 0.0, -0.0157, 0.1848, -42.15, 34.55)" gradientUnits="userSpaceOnUse" id="gradient0" r="819.2" spreadMethod="pad">
      <stop offset="0.0" stop-color="#bdc1b5"/>
      <stop offset="0.28627450980392155" stop-color="#959e89"/>
      <stop offset="1.0" stop-color="#6d7364"/>
    </radialGradient>
  </defs>
</svg>
