<?xml version="1.0" encoding="UTF-8" standalone="no"?>
<svg xmlns:xlink="http://www.w3.org/1999/xlink" height="20.5px" width="19.95px" xmlns="http://www.w3.org/2000/svg">
  <g transform="matrix(1.0, 0.0, 0.0, 1.0, 9.95, 10.25)">
    <path d="M-3.5 -1.5 L-2.4 -0.85 Q-0.9 0.2 0.35 2.0 L0.3 2.05 -0.95 2.95 Q-1.4 3.2 -1.7 3.4 L-2.6 2.45 Q-4.6 0.65 -6.65 0.35 L-5.8 -0.65 -5.65 -0.75 Q-4.8 -1.35 -3.5 -1.5 M1.9 6.25 L1.8 7.25 1.7 7.5 1.65 7.6 1.3 8.55 0.1 10.2 -0.55 10.25 0.3 9.0 0.4 8.35 1.05 7.6 1.45 7.0 1.9 6.25" fill="#b38484" fill-rule="evenodd" stroke="none"/>
    <path d="M0.35 2.0 L0.4 2.1 0.5 2.25 1.2 3.45 1.55 4.2 Q1.25 4.4 0.9 4.75 L0.8 4.85 0.1 5.65 0.25 6.35 0.15 6.75 0.1 6.6 Q-0.25 5.15 -1.7 3.4 -1.4 3.2 -0.95 2.95 L0.3 2.05 0.35 2.0" fill="#c29c9c" fill-rule="evenodd" stroke="none"/>
    <path d="M1.55 4.2 L1.85 5.45 1.9 6.25 1.45 7.0 1.05 7.6 0.4 8.35 0.35 7.6 0.15 6.75 0.25 6.35 0.1 5.65 0.8 4.85 0.9 4.75 Q1.25 4.4 1.55 4.2" fill="#d2b6b6" fill-rule="evenodd" stroke="none"/>
    <path d="M-8.15 0.3 Q-8.75 0.4 -9.1 0.75 L-9.9 1.8 -9.95 1.05 Q-9.45 -0.85 -8.3 -1.45 L-8.2 -1.5 Q-7.6 -1.85 -6.8 -2.05 L-7.0 -1.8 -7.45 -1.2 -8.15 0.3" fill="#f2eaea" fill-rule="evenodd" stroke="none"/>
    <path d="M-6.8 -2.05 L-6.1 -2.2 Q-4.7 -2.05 -3.5 -1.5 -4.8 -1.35 -5.65 -0.75 L-5.8 -0.65 -6.65 0.35 -7.75 0.25 -8.15 0.3 -7.45 -1.2 -7.0 -1.8 -6.8 -2.05" fill="#a36a6a" fill-rule="evenodd" stroke="none"/>
    <path d="M-8.15 0.3 Q-8.75 0.4 -9.1 0.75 L-9.9 1.8 -9.95 1.05 Q-9.45 -0.85 -8.3 -1.45 L-8.2 -1.5 Q-7.6 -1.85 -6.8 -2.05 L-6.1 -2.2 Q-4.7 -2.05 -3.5 -1.5 L-2.4 -0.85 Q-0.9 0.2 0.35 2.0 L0.4 2.1 0.5 2.25 1.2 3.45 1.55 4.2 1.85 5.45 1.9 6.25 1.8 7.25 1.7 7.5 1.65 7.6 1.3 8.55 0.1 10.2 -0.55 10.25 0.3 9.0 0.4 8.35 0.35 7.6 0.15 6.75 0.1 6.6 Q-0.25 5.15 -1.7 3.4 L-2.6 2.45 Q-4.6 0.65 -6.65 0.35 L-7.75 0.25 -8.15 0.3 Z" fill="none" stroke="#a36a6a" stroke-linecap="round" stroke-linejoin="round" stroke-opacity="0.4" stroke-width="0.05"/>
    <path d="M3.65 -9.65 L5.2 -8.8 5.55 -8.55 7.2 -7.15 7.7 -6.6 7.75 -6.15 Q7.75 -5.45 7.05 -4.95 L6.0 -4.5 5.0 -5.5 Q2.35 -7.8 -0.45 -7.8 L-0.45 -7.85 0.1 -8.55 Q1.2 -9.65 3.25 -9.65 L3.65 -9.65 M10.0 -1.7 L9.9 -0.6 9.3 0.65 8.85 1.4 8.0 2.3 7.3 2.3 8.2 1.1 8.25 0.95 8.3 0.25 8.95 -0.45 10.0 -1.7" fill="#b38484" fill-rule="evenodd" stroke="none"/>
    <path d="M-0.45 -7.8 L-0.65 -7.8 -1.75 -7.55 -1.35 -8.55 -0.4 -9.85 1.15 -10.25 3.65 -9.65 3.25 -9.65 Q1.2 -9.65 0.1 -8.55 L-0.45 -7.85 -0.45 -7.8" fill="#a36a6a" fill-rule="evenodd" stroke="none"/>
    <path d="M7.7 -6.6 L8.3 -5.8 8.85 -5.05 9.3 -4.2 8.1 -2.6 8.3 -1.8 8.15 -0.8 8.0 -1.3 Q7.6 -2.8 6.0 -4.5 L7.05 -4.95 Q7.75 -5.45 7.75 -6.15 L7.7 -6.6" fill="#c29c9c" fill-rule="evenodd" stroke="none"/>
    <path d="M9.3 -4.2 L9.95 -2.4 10.0 -1.7 8.95 -0.45 8.3 0.25 8.2 -0.55 8.15 -0.8 8.3 -1.8 8.1 -2.6 9.3 -4.2" fill="#d2b6b6" fill-rule="evenodd" stroke="none"/>
    <path d="M-1.75 -7.55 L-2.15 -7.35 -3.0 -6.3 -3.05 -7.05 -2.45 -8.45 -1.3 -9.5 -0.4 -9.85 -1.35 -8.55 -1.75 -7.55" fill="#f2eaea" fill-rule="evenodd" stroke="none"/>
    <path d="M3.65 -9.65 L5.2 -8.8 5.55 -8.55 7.2 -7.15 M7.7 -6.6 L8.3 -5.8 8.85 -5.05 9.3 -4.2 9.95 -2.4 10.0 -1.7 9.9 -0.6 9.3 0.65 8.85 1.4 8.0 2.3 7.3 2.3 8.2 1.1 8.25 0.95 8.3 0.25 8.2 -0.55 M8.15 -0.8 L8.0 -1.3 Q7.6 -2.8 6.0 -4.5 L5.0 -5.5 Q2.35 -7.8 -0.45 -7.8 L-0.65 -7.8 -1.75 -7.55 -2.15 -7.35 -3.0 -6.3 -3.05 -7.05 -2.45 -8.45 -1.3 -9.5 -0.4 -9.85 1.15 -10.25 3.65 -9.65 Z" fill="none" stroke="#a36a6a" stroke-linecap="round" stroke-linejoin="round" stroke-opacity="0.4" stroke-width="0.05"/>
  </g>
</svg>
