<?xml version="1.0" encoding="UTF-8" standalone="no"?>
<svg xmlns:xlink="http://www.w3.org/1999/xlink" height="20.85px" width="14.8px" xmlns="http://www.w3.org/2000/svg">
  <g transform="matrix(1.0, 0.0, 0.0, 1.0, 0.0, 0.0)">
    <path d="M11.9 4.85 Q9.95 2.5 7.2 2.45 4.6 2.5 2.75 5.0 0.85 7.55 0.9 11.2 1.0 14.75 2.85 17.2 4.8 19.65 7.5 19.7 10.25 19.6 12.1 17.05 14.0 14.55 13.9 10.95 13.9 7.35 11.9 4.85 M12.6 3.05 Q14.8 6.0 14.8 10.4 14.85 14.65 12.65 17.8 10.45 20.8 7.4 20.85 4.35 20.85 2.2 17.85 0.0 14.75 0.0 10.5 0.0 6.1 2.15 3.05 4.2 0.05 7.35 0.0 10.35 0.05 12.6 3.05" fill="url(#gradient0)" fill-rule="evenodd" stroke="none"/>
    <path d="M11.9 4.85 Q13.9 7.35 13.9 10.95 14.0 14.55 12.1 17.05 10.25 19.6 7.5 19.7 4.8 19.65 2.85 17.2 1.0 14.75 0.9 11.2 0.85 7.55 2.75 5.0 4.6 2.5 7.2 2.45 9.95 2.5 11.9 4.85 M4.4 11.1 Q4.45 13.7 5.35 15.5 6.15 17.3 7.35 17.3 8.5 17.3 9.3 15.4 10.1 13.6 10.1 11.0 10.05 8.45 9.15 6.65 8.3 4.9 7.15 4.85 5.95 4.8 5.2 6.7 4.35 8.5 4.4 11.1" fill="url(#gradient1)" fill-rule="evenodd" stroke="none"/>
    <path d="M4.4 11.1 Q4.35 8.5 5.2 6.7 5.95 4.8 7.15 4.85 8.3 4.9 9.15 6.65 10.05 8.45 10.1 11.0 10.1 13.6 9.3 15.4 8.5 17.3 7.35 17.3 6.15 17.3 5.35 15.5 4.45 13.7 4.4 11.1" fill="#3c0c00" fill-rule="evenodd" stroke="none"/>
    <path d="M4.85 10.3 Q3.75 10.7 2.9 10.0 1.55 9.1 1.45 7.25 1.45 5.4 3.4 5.35 7.25 5.9 6.95 9.65 L4.85 10.3 M3.4 8.25 L3.7 9.05 Q4.1 9.65 4.75 9.65 6.05 9.65 6.05 8.45 6.05 7.15 4.75 7.05 3.4 6.9 3.4 8.25" fill="#ffffff" fill-opacity="0.4117647" fill-rule="evenodd" stroke="none"/>
    <path d="M3.4 8.25 Q3.4 6.9 4.75 7.05 6.05 7.15 6.05 8.45 6.05 9.65 4.75 9.65 4.1 9.65 3.7 9.05 L3.4 8.25 M10.6 13.1 Q12.3 13.9 12.4 14.35 L12.45 14.65 11.8 15.1 Q10.45 15.4 9.25 13.75 8.9 12.4 10.6 13.1 M9.85 17.2 Q9.35 17.35 8.9 16.9 L8.4 16.1 Q8.1 14.8 9.0 15.2 9.9 15.5 10.15 16.7 L10.2 17.1 9.85 17.2" fill="#ffffff" fill-opacity="0.7647059" fill-rule="evenodd" stroke="none"/>
  </g>
  <defs>
    <linearGradient gradientTransform="matrix(-0.001, 0.0115, -0.0091, -8.0E-4, 7.4, 10.75)" gradientUnits="userSpaceOnUse" id="gradient0" spreadMethod="pad" x1="-819.2" x2="819.2">
      <stop offset="0.0" stop-color="#cf9982"/>
      <stop offset="0.5058823529411764" stop-color="#f2e1cd"/>
      <stop offset="1.0" stop-color="#ffffff"/>
    </linearGradient>
    <radialGradient cx="0" cy="0" gradientTransform="matrix(-0.0138, -5.0E-4, -6.0E-4, 0.0151, 9.55, 11.6)" gradientUnits="userSpaceOnUse" id="gradient1" r="819.2" spreadMethod="pad">
      <stop offset="0.0" stop-color="#870101"/>
      <stop offset="0.6313725490196078" stop-color="#ff6200"/>
      <stop offset="1.0" stop-color="#ffaa00"/>
    </radialGradient>
  </defs>
</svg>
