<?xml version="1.0" encoding="UTF-8" standalone="no"?>
<svg xmlns:xlink="http://www.w3.org/1999/xlink" height="28.4px" width="33.1px" xmlns="http://www.w3.org/2000/svg">
  <g transform="matrix(1.0, 0.0, 0.0, 1.0, 0.0, 0.0)">
    <path d="M28.25 4.1 Q33.1 8.3 33.1 14.2 33.1 20.1 28.25 24.25 23.4 28.4 16.55 28.4 9.7 28.4 4.85 24.25 0.0 20.1 0.0 14.2 0.0 8.3 4.85 4.1 9.7 0.0 16.55 0.0 23.4 0.0 28.25 4.1" fill="url(#gradient0)" fill-rule="evenodd" stroke="none"/>
  </g>
  <defs>
    <radialGradient cx="0" cy="0" fx="41.6" fy="0" gradientTransform="matrix(0.0, -0.0165, 0.0192, 0.0, 16.4, 14.15)" gradientUnits="userSpaceOnUse" id="gradient0" r="819.2" spreadMethod="pad">
      <stop offset="0.0" stop-color="#fa3000"/>
      <stop offset="0.4745098039215686" stop-color="#fa3000" stop-opacity="0.6431373"/>
      <stop offset="1.0" stop-color="#e00505" stop-opacity="0.0"/>
    </radialGradient>
  </defs>
</svg>
