<?xml version="1.0" encoding="UTF-8" standalone="no"?>
<svg xmlns:xlink="http://www.w3.org/1999/xlink" height="56.35px" width="55.35px" xmlns="http://www.w3.org/2000/svg">
  <g transform="matrix(1.0, 0.0, 0.0, 1.0, -151.0, -42.4)">
    <path d="M198.15 55.55 L200.9 56.7 194.0 62.15 191.05 63.25 Q188.4 64.3 177.9 66.0 L158.15 58.6 162.35 55.65 Q165.4 54.3 167.8 53.75 172.45 51.8 181.3 51.8 184.8 51.8 186.7 53.15 L191.8 54.55 198.15 55.55" fill="#f7d701" fill-rule="evenodd" stroke="none"/>
    <path d="M204.4 56.1 L199.65 59.85 194.0 62.15 200.9 56.7 198.15 55.55 204.4 56.1 M177.9 66.0 L176.5 66.2 Q173.9 66.2 170.5 64.85 167.2 63.5 162.0 63.5 L161.9 63.6 154.05 60.45 Q158.6 57.35 162.35 55.65 L158.15 58.6 177.9 66.0" fill="#ffb700" fill-rule="evenodd" stroke="none"/>
    <path d="M198.5 60.75 L199.65 59.85 204.4 56.1 204.75 55.8 203.25 64.5 201.8 63.4 202.05 61.8 200.9 62.7 198.5 60.75 M183.9 95.1 L183.9 78.8 184.0 79.0 Q184.8 82.1 185.6 86.5 185.95 87.85 187.5 91.05 L187.85 91.85 183.9 95.1" fill="#964d23" fill-rule="evenodd" stroke="none"/>
    <path d="M199.65 59.85 L198.5 60.75 189.1 68.25 187.65 69.4 186.7 69.85 185.0 70.4 165.3 64.85 161.9 63.6 162.0 63.5 Q167.2 63.5 170.5 64.85 173.9 66.2 176.5 66.2 L177.9 66.0 185.35 68.8 194.0 62.15 199.65 59.85" fill="#ffc900" fill-rule="evenodd" stroke="none"/>
    <path d="M198.15 55.55 L191.8 54.55 186.7 53.15 Q184.8 51.8 181.3 51.8 172.45 51.8 167.8 53.75 165.4 54.3 162.35 55.65 L176.4 45.9 198.15 55.55" fill="#f0ce02" fill-rule="evenodd" stroke="none"/>
    <path d="M198.5 60.75 L200.9 62.7 196.15 66.3 195.55 66.0 193.4 66.65 192.05 67.1 191.25 67.35 189.1 68.25 198.5 60.75 M201.8 63.4 L203.25 64.5 200.55 80.85 198.4 82.75 Q198.5 81.4 198.75 80.15 L199.2 79.7 201.8 63.4 M183.9 76.2 L184.1 76.65 187.3 83.45 187.05 89.45 190.7 86.6 192.6 87.65 187.85 91.85 187.5 91.05 Q185.95 87.85 185.6 86.5 184.8 82.1 184.0 79.0 L183.9 78.8 183.9 77.45 183.9 76.2" fill="#a65527" fill-rule="evenodd" stroke="none"/>
    <path d="M187.65 69.4 L189.1 68.25 191.25 67.35 192.05 67.1 193.4 66.65 195.55 66.0 196.15 66.3 187.5 72.8 187.3 83.45 184.1 76.65 Q184.35 72.9 186.05 70.75 L186.05 70.65 187.65 69.4 M198.75 80.15 Q198.5 81.4 198.4 82.75 L192.6 87.65 190.7 86.6 198.75 80.15" fill="#b8500c" fill-rule="evenodd" stroke="none"/>
    <path d="M165.3 64.85 L185.0 70.4 186.7 69.85 187.65 69.4 186.05 70.65 186.05 70.75 183.9 72.35 176.95 69.5 165.3 64.85" fill="#fff4cc" fill-rule="evenodd" stroke="none"/>
    <path d="M161.9 63.6 L165.3 64.85 176.95 69.5 Q178.1 71.1 181.75 73.15 182.65 73.9 183.3 75.75 L183.9 77.45 183.9 78.8 183.9 95.1 178.9 92.95 176.5 90.25 174.95 88.2 181.95 90.95 181.95 75.15 156.8 65.75 154.3 61.9 153.6 60.65 153.15 60.1 154.05 60.45 161.9 63.6 M183.9 72.35 L186.05 70.75 Q184.35 72.9 184.1 76.65 L183.9 76.2 183.9 72.35" fill="#f06d17" fill-rule="evenodd" stroke="none"/>
    <path d="M200.9 62.7 L202.05 61.8 201.8 63.4 199.2 79.7 198.75 80.15 Q199.1 77.2 199.75 74.15 197.25 67.55 196.15 66.3 L200.9 62.7 M187.3 83.45 L187.75 84.25 Q188.4 85.15 189.65 85.95 L190.7 86.6 187.05 89.45 187.3 83.45" fill="#ba7c1f" fill-rule="evenodd" stroke="none"/>
    <path d="M196.15 66.3 Q197.25 67.55 199.75 74.15 199.1 77.2 198.75 80.15 L190.7 86.6 189.65 85.95 Q188.4 85.15 187.75 84.25 L187.3 83.45 187.5 72.8 196.15 66.3" fill="#c87e08" fill-rule="evenodd" stroke="none"/>
    <path d="M194.0 62.15 L185.35 68.8 177.9 66.0 Q188.4 64.3 191.05 63.25 L194.0 62.15" fill="#ffe757" fill-rule="evenodd" stroke="none"/>
    <path d="M176.95 69.5 L183.9 72.35 183.9 76.2 183.9 77.45 183.3 75.75 Q182.65 73.9 181.75 73.15 178.1 71.1 176.95 69.5" fill="#ff862b" fill-rule="evenodd" stroke="none"/>
    <path d="M156.8 65.75 L181.95 75.15 181.95 90.95 174.95 88.2 173.45 85.5 Q172.65 83.8 171.65 83.1 164.3 78.0 161.9 74.25 L156.8 65.75" fill="#f09a0f" fill-rule="evenodd" stroke="none"/>
    <path d="M156.8 65.75 L161.9 74.25 Q164.3 78.0 171.65 83.1 172.65 83.8 173.45 85.5 L174.95 88.2 158.4 81.85 155.75 65.4 156.8 65.75" fill="#e68e0d" fill-rule="evenodd" stroke="none"/>
    <path d="M174.95 88.2 L176.5 90.25 178.9 92.95 157.15 83.8 152.95 60.1 153.15 60.1 153.6 60.65 154.3 61.9 156.8 65.75 155.75 65.4 158.4 81.85 174.95 88.2" fill="#e36416" fill-rule="evenodd" stroke="none"/>
    <path d="M203.25 64.5 L204.75 55.8 177.1 43.65 152.95 60.0 152.95 60.1 157.15 83.8 178.9 92.95 183.9 95.1 187.85 91.85 192.6 87.65 198.4 82.75 200.55 80.85 203.25 64.5 M206.35 54.75 L202.5 81.2 183.0 98.75 155.75 86.05 Q153.85 75.95 151.0 58.75 154.4 57.15 163.05 51.45 L177.2 42.4 206.35 54.75" fill="#fff300" fill-opacity="0.16078432" fill-rule="evenodd" stroke="none"/>
    <path d="M204.75 55.8 L204.4 56.1 198.15 55.55 176.4 45.9 162.35 55.65 Q158.6 57.35 154.05 60.45 L153.15 60.1 152.95 60.0 177.1 43.65 204.75 55.8" fill="#edaa00" fill-rule="evenodd" stroke="none"/>
    <path d="M153.15 60.1 L152.95 60.1 152.95 60.0 153.15 60.1" fill="#c9672a" fill-rule="evenodd" stroke="none"/>
  </g>
</svg>
