<?xml version="1.0" encoding="UTF-8" standalone="no"?>
<svg xmlns:xlink="http://www.w3.org/1999/xlink" height="76.05px" width="52.65px" xmlns="http://www.w3.org/2000/svg">
  <g transform="matrix(1.0, 0.0, 0.0, 1.0, -47.0, -8.65)">
    <path d="M95.55 43.6 L95.4 43.5 95.4 43.25 95.55 43.6" fill="#c19b9b" fill-rule="evenodd" stroke="none"/>
    <path d="M97.65 12.65 L97.0 12.15 98.3 12.2 94.55 23.95 94.35 24.65 Q92.65 30.0 92.65 34.75 L92.9 37.45 93.4 39.5 Q93.8 38.9 94.05 36.55 L94.4 33.0 Q94.85 35.6 96.0 39.75 L97.9 46.75 95.55 43.6 96.35 46.6 96.4 50.05 Q96.4 55.0 95.65 60.2 94.85 65.15 93.4 70.4 L92.95 72.0 90.85 79.8 88.65 79.3 85.65 78.8 87.4 70.8 88.85 63.7 89.4 61.0 90.5 55.15 89.0 61.05 87.5 66.8 87.5 65.45 87.75 61.1 88.0 58.15 89.0 46.75 Q89.3 42.6 89.2 35.8 89.15 28.4 89.25 26.3 86.65 36.4 85.5 37.5 L85.5 36.0 86.05 28.05 88.5 25.35 Q92.8 20.3 97.65 12.65 M77.15 77.55 L81.25 60.1 81.5 60.1 81.5 60.9 81.4 62.25 81.5 64.6 Q82.15 63.65 82.7 61.0 83.45 57.45 84.1 51.0 85.15 40.35 84.75 38.75 L85.0 38.75 85.4 41.3 Q85.75 43.75 85.75 47.45 85.75 52.55 85.15 61.1 L84.35 70.35 83.55 78.45 78.8 77.75 77.15 77.55 M95.55 43.6 L95.4 43.25 95.4 43.5 95.55 43.6 M53.35 14.65 L56.65 18.25 56.8 20.15 57.15 25.2 Q57.15 29.4 56.3 35.5 L55.9 38.0 Q54.65 45.7 54.65 48.7 54.65 49.8 55.5 53.9 L55.4 51.55 Q55.4 48.9 56.95 39.7 L57.75 35.0 58.85 28.3 58.85 32.8 58.9 33.7 58.95 34.55 58.85 35.5 58.35 40.25 57.85 44.8 57.6 48.95 Q57.6 52.9 58.15 57.2 L58.55 60.2 59.1 64.35 58.9 60.15 58.85 59.4 Q58.85 53.1 60.1 47.9 L61.85 39.75 62.6 33.1 62.7 31.6 Q62.85 29.4 63.8 26.65 L66.75 30.2 66.5 31.55 Q66.05 34.35 66.05 36.5 L66.55 44.0 66.8 48.0 66.8 50.7 66.7 53.7 66.8 57.15 Q66.1 55.45 65.25 51.3 64.65 48.2 64.55 46.65 L64.35 49.3 65.0 59.35 65.15 61.35 65.9 71.45 66.3 78.35 62.55 79.45 61.9 72.2 61.35 65.85 61.1 65.85 60.75 71.95 60.75 72.45 60.35 78.75 60.45 80.3 59.1 80.95 Q58.1 76.6 58.1 73.05 L58.1 72.9 Q58.1 70.1 58.6 65.4 L58.6 65.35 58.6 65.1 58.6 65.4 Q57.6 67.25 57.0 70.05 56.6 71.75 56.5 73.4 L56.4 75.3 Q56.4 77.25 56.9 81.6 L57.0 82.15 55.75 83.05 53.1 74.2 51.1 66.4 50.4 63.0 49.4 57.35 Q50.3 60.85 50.95 62.75 51.55 64.6 51.9 64.85 L51.45 62.55 51.4 62.35 Q50.9 60.1 50.9 58.15 50.9 55.95 51.65 51.4 L52.4 45.5 49.15 53.9 49.15 53.65 53.2 38.7 53.75 36.4 Q54.9 31.0 54.9 25.05 54.9 19.15 53.35 14.65 M79.95 32.95 L82.45 31.25 Q81.65 36.1 79.25 42.5 L79.65 38.8 80.0 34.25 79.95 32.95" fill="#b89393" fill-rule="evenodd" stroke="none"/>
    <path d="M82.45 31.25 L86.05 28.05 85.5 36.0 85.5 37.5 Q86.65 36.4 89.25 26.3 89.15 28.4 89.2 35.8 89.3 42.6 89.0 46.75 L88.0 58.15 87.75 61.1 87.5 65.45 87.5 66.8 89.0 61.05 90.5 55.15 89.4 61.0 88.85 63.7 87.4 70.8 85.65 78.8 83.55 78.45 84.35 70.35 85.15 61.1 Q85.75 52.55 85.75 47.45 85.75 43.75 85.4 41.3 L85.0 38.75 84.75 38.75 Q85.15 40.35 84.1 51.0 83.45 57.45 82.7 61.0 82.15 63.65 81.5 64.6 L81.4 62.25 81.5 60.9 81.5 60.1 81.25 60.1 77.15 77.55 67.6 78.0 66.3 78.35 65.9 71.45 65.15 61.35 65.0 59.35 64.35 49.3 64.55 46.65 Q64.65 48.2 65.25 51.3 66.1 55.45 66.8 57.15 L66.7 53.7 66.8 50.7 66.8 48.0 66.55 44.0 66.05 36.5 Q66.05 34.35 66.5 31.55 L66.75 30.2 67.35 30.95 67.5 31.15 Q72.65 37.2 79.95 32.95 L80.0 34.25 79.65 38.8 79.25 42.5 Q81.65 36.1 82.45 31.25 M56.65 18.25 L63.8 26.65 Q62.85 29.4 62.7 31.6 L62.6 33.1 61.85 39.75 60.1 47.9 Q58.85 53.1 58.85 59.4 L58.9 60.15 59.1 64.35 58.55 60.2 58.15 57.2 Q57.6 52.9 57.6 48.95 L57.85 44.8 58.35 40.25 58.85 35.5 58.95 34.55 58.9 33.7 58.85 32.8 58.85 28.3 57.75 35.0 56.95 39.7 Q55.4 48.9 55.4 51.55 L55.5 53.9 Q54.65 49.8 54.65 48.7 54.65 45.7 55.9 38.0 L56.3 35.5 Q57.15 29.4 57.15 25.2 L56.8 20.15 56.65 18.25" fill="#aa8080" fill-rule="evenodd" stroke="none"/>
    <path d="M98.3 12.2 L99.4 12.2 Q99.25 15.05 97.8 20.9 L96.95 24.55 Q96.15 28.1 96.15 29.55 96.15 32.6 97.9 38.75 99.65 44.9 99.65 49.95 L99.4 55.9 98.5 59.5 95.55 67.55 95.45 67.85 95.1 68.55 93.95 71.55 93.75 72.2 Q92.65 75.55 92.65 77.5 L93.05 80.95 Q92.3 80.25 90.85 79.8 L92.95 72.0 93.4 70.4 Q94.85 65.15 95.65 60.2 96.4 55.0 96.4 50.05 L96.35 46.6 95.55 43.6 97.9 46.75 96.0 39.75 Q94.85 35.6 94.4 33.0 L94.05 36.55 Q93.8 38.9 93.4 39.5 L92.9 37.45 92.65 34.75 Q92.65 30.0 94.35 24.65 L94.55 23.95 98.3 12.2 M53.1 14.4 L53.35 14.65 Q54.9 19.15 54.9 25.05 54.9 31.0 53.75 36.4 L53.2 38.7 49.15 53.65 49.15 53.9 52.4 45.5 51.65 51.4 Q50.9 55.95 50.9 58.15 50.9 60.1 51.4 62.35 L51.45 62.55 51.9 64.85 Q51.55 64.6 50.95 62.75 50.3 60.85 49.4 57.35 L50.4 63.0 51.1 66.4 53.1 74.2 55.75 83.05 54.15 84.7 53.95 84.0 53.8 83.65 53.7 83.25 51.25 74.65 48.6 63.9 Q47.0 56.6 47.0 52.8 47.0 45.25 50.2 38.2 L50.6 37.3 Q53.4 30.85 53.4 26.8 L53.1 14.4" fill="#cca3a3" fill-rule="evenodd" stroke="none"/>
    <path d="M97.65 12.65 L97.0 12.15 98.3 12.2 99.4 12.2 99.4 11.55 Q99.4 10.15 98.9 8.65 M90.85 79.8 Q92.3 80.25 93.05 80.95 L92.65 77.5 Q92.65 75.55 93.75 72.2 L93.95 71.55 95.1 68.55 95.45 67.85 95.55 67.55 98.5 59.5 99.4 55.9 99.65 49.95 Q99.65 44.9 97.9 38.75 96.15 32.6 96.15 29.55 96.15 28.1 96.95 24.55 L97.8 20.9 Q99.25 15.05 99.4 12.2 M85.65 78.8 L88.65 79.3 90.85 79.8 M77.15 77.55 L78.8 77.75 83.55 78.45 85.65 78.8 M50.9 15.1 L50.65 14.6 M53.1 14.4 L53.1 14.1 52.65 9.9 M55.75 83.05 L57.0 82.15 56.9 81.6 Q56.4 77.25 56.4 75.3 L56.5 73.4 Q56.6 71.75 57.0 70.05 57.6 67.25 58.6 65.4 L58.6 65.1 58.6 65.35 58.6 65.4 Q58.1 70.1 58.1 72.9 L58.1 73.05 Q58.1 76.6 59.1 80.95 L60.45 80.3 60.35 78.75 60.75 72.45 60.75 71.95 61.1 65.85 61.35 65.85 61.9 72.2 62.55 79.45 66.3 78.35 M55.75 83.05 L54.15 84.7 53.95 84.0 53.8 83.65 53.7 83.25 51.25 74.65 48.6 63.9 Q47.0 56.6 47.0 52.8 47.0 45.25 50.2 38.2 L50.6 37.3 Q53.4 30.85 53.4 26.8 L53.1 14.4 M77.15 77.55 L67.6 78.0 66.3 78.35" fill="none" stroke="#a36a6a" stroke-linecap="round" stroke-linejoin="round" stroke-opacity="0.6" stroke-width="0.05"/>
  </g>
</svg>
