<?xml version="1.0" encoding="UTF-8" standalone="no"?>
<svg xmlns:xlink="http://www.w3.org/1999/xlink" height="16.1px" width="81.4px" xmlns="http://www.w3.org/2000/svg">
  <g transform="matrix(1.0, 0.0, 0.0, 1.0, 40.1, 14.85)">
    <path d="M-40.1 -14.85 L-22.2 -1.85 15.85 -0.15 20.55 -13.8 -40.1 -14.85" fill="url(#gradient0)" fill-rule="evenodd" stroke="none">
      <animate attributeName="d" dur="2s" repeatCount="indefinite" values="M-40.1 -14.85 L-22.2 -1.85 15.85 -0.15 20.55 -13.8 -40.1 -14.85;M-34.25 -10.65 L-21.25 -1.2 28.9 1.25 41.3 -6.55 -34.25 -10.65"/>
    </path>
    <path d="M-40.1 -14.85 L20.55 -13.8 15.85 -0.15 -22.2 -1.85 -40.1 -14.85" fill="none" stroke="#000000" stroke-linecap="round" stroke-linejoin="round" stroke-opacity="0.0" stroke-width="1.0">
      <animate attributeName="stroke" dur="2s" repeatCount="indefinite" values="#000000;#000001"/>
      <animate attributeName="stroke-width" dur="2s" repeatCount="indefinite" values="0.0;0.0"/>
      <animate attributeName="fill-opacity" dur="2s" repeatCount="indefinite" values="0.0;0.0"/>
      <animate attributeName="d" dur="2s" repeatCount="indefinite" values="M-40.1 -14.85 L20.55 -13.8 15.85 -0.15 -22.2 -1.85 -40.1 -14.85;M-34.25 -10.65 L41.3 -6.55 28.9 1.25 -21.25 -1.2 -34.25 -10.65"/>
    </path>
  </g>
  <defs>
    <linearGradient gradientTransform="matrix(-0.0054, 0.0216, -0.0099, -0.0023, -6.9, 1.3)" gradientUnits="userSpaceOnUse" id="gradient0" spreadMethod="pad" x1="-819.2" x2="819.2">
      <animateTransform additive="replace" attributeName="gradientTransform" dur="2s" from="1" repeatCount="indefinite" to="1" type="scale"/>
      <animateTransform additive="sum" attributeName="gradientTransform" dur="2s" from="-6.9 1.3" repeatCount="indefinite" to="-6.9 1.3" type="translate"/>
      <animateTransform additive="sum" attributeName="gradientTransform" dur="2s" from="104.0553" repeatCount="indefinite" to="104.0553" type="rotate"/>
      <animateTransform additive="sum" attributeName="gradientTransform" dur="2s" from="0.0223 0.0102" repeatCount="indefinite" to="0.0223 0.0102" type="scale"/>
      <animateTransform additive="sum" attributeName="gradientTransform" dur="2s" from="0.465" repeatCount="indefinite" to="0.465" type="skewX"/>
      <stop offset="0.0" stop-color="#ab5428">
        <animate attributeName="offset" dur="2s" repeatCount="indefinite" values="0.0;0.0"/>
        <animate attributeName="stop-color" dur="2s" repeatCount="indefinite" values="#ab5428;#ab5429"/>
        <animate attributeName="stop-opacity" dur="2s" repeatCount="indefinite" values="1.0;1.0"/>
      </stop>
      <stop offset="0.5411764705882353" stop-color="#7d492b">
        <animate attributeName="offset" dur="2s" repeatCount="indefinite" values="0.5411764705882353;0.5411764705882353"/>
        <animate attributeName="stop-color" dur="2s" repeatCount="indefinite" values="#7d492b;#7d492c"/>
        <animate attributeName="stop-opacity" dur="2s" repeatCount="indefinite" values="1.0;1.0"/>
      </stop>
      <stop offset="1.0" stop-color="#7d685d">
        <animate attributeName="offset" dur="2s" repeatCount="indefinite" values="1.0;1.0"/>
        <animate attributeName="stop-color" dur="2s" repeatCount="indefinite" values="#7d685d;#7d685e"/>
        <animate attributeName="stop-opacity" dur="2s" repeatCount="indefinite" values="1.0;1.0"/>
      </stop>
    </linearGradient>
  </defs>
</svg>
