<?xml version="1.0" encoding="UTF-8" standalone="no"?>
<svg xmlns:xlink="http://www.w3.org/1999/xlink" height="283.5px" width="295.2px" xmlns="http://www.w3.org/2000/svg">
  <g transform="matrix(1.0, 0.0, 0.0, 1.0, 147.6, 141.75)">
    <path d="M23.7 -125.25 L45.15 -122.75 69.8 -119.4 69.25 -118.0 Q67.95 -115.7 63.6 -113.2 58.0 -109.95 53.25 -109.6 L58.05 -106.35 62.9 -103.65 Q62.9 -103.35 63.15 -103.15 L63.35 -102.7 58.1 -102.05 54.15 -101.75 52.85 -101.75 54.7 -99.1 56.1 -96.7 Q57.1 -94.8 59.35 -88.65 63.45 -83.1 68.8 -79.75 L63.65 -80.05 63.35 -80.05 65.8 -77.55 67.05 -76.25 Q69.5 -73.65 70.9 -72.75 70.2 -72.3 68.35 -71.7 66.7 -71.0 66.3 -70.2 L66.1 -70.2 69.75 -69.95 Q67.4 -68.5 66.0 -66.0 L65.85 -65.95 65.85 -65.7 65.9 -64.35 65.9 -60.45 68.95 -60.85 Q70.3 -56.35 70.1 -54.25 69.8 -52.15 68.65 -49.8 L67.5 -48.25 67.45 -47.8 65.85 -46.3 Q65.15 -45.7 65.15 -44.5 65.15 -43.75 65.45 -42.75 L65.75 -41.35 65.35 -40.5 Q64.95 -39.7 64.95 -38.95 64.95 -38.25 65.45 -37.5 L65.95 -36.4 65.05 -32.8 Q64.15 -28.9 64.15 -26.2 64.1 -25.5 64.55 -25.25 L64.5 -25.15 64.75 -25.15 65.15 -25.1 68.3 -24.3 69.1 -24.0 Q73.85 -21.95 77.1 -16.4 79.8 -11.85 80.8 -6.8 81.35 -3.95 81.35 -0.95 81.35 2.55 80.8 5.55 L80.3 7.75 Q79.35 11.0 77.6 13.4 73.95 18.25 65.35 21.15 63.85 21.7 62.8 22.6 L61.9 23.45 61.5 23.95 61.15 24.5 61.35 25.2 Q60.85 26.9 60.85 27.85 L61.1 31.1 61.9 30.6 62.8 29.7 Q69.2 23.55 80.8 17.7 L82.1 17.0 82.4 16.85 Q92.2 12.05 103.55 8.65 L106.6 7.75 Q118.1 4.55 131.15 2.7 L132.55 2.55 132.55 2.6 131.6 3.6 128.55 7.75 127.15 9.85 121.75 18.3 121.75 18.7 121.85 18.6 Q123.25 16.8 132.45 14.1 L139.3 12.3 141.9 11.65 142.0 11.75 Q140.6 12.5 139.3 13.55 129.05 22.05 123.4 52.85 122.0 60.2 122.3 68.25 L122.35 69.4 Q123.5 93.65 139.3 124.3 143.05 131.5 147.6 139.1 L-31.25 139.1 -31.75 139.45 -34.95 141.55 -35.25 141.75 -35.0 141.55 -31.8 139.35 -31.6 139.15 -31.5 139.1 -31.75 139.1 -31.6 139.0 -31.4 138.85 -28.1 133.7 Q-25.15 129.3 -21.95 125.6 L-21.2 124.75 Q-16.15 119.1 -7.9 112.6 L-1.05 107.4 2.2 105.05 -5.85 107.4 -17.75 110.75 -21.6 111.75 -18.0 110.15 -12.6 107.4 -5.4 102.8 -3.85 101.7 Q7.35 93.6 12.55 84.55 L11.6 84.95 Q-2.1 92.55 -14.15 96.0 -22.0 98.15 -29.2 98.5 L-29.65 98.55 -30.9 98.55 Q-33.65 97.2 -37.2 94.0 L-39.4 91.9 Q-39.0 91.5 -38.3 88.35 -37.7 85.35 -37.7 84.35 -37.7 83.55 -45.05 75.2 L-50.9 68.7 Q-53.75 73.75 -56.45 73.75 -59.8 73.75 -61.2 51.4 L-61.25 50.85 -61.25 50.8 -61.4 50.9 Q-65.15 42.25 -67.1 32.25 -68.95 23.1 -69.35 12.8 L-69.45 8.55 -69.7 7.75 -70.7 4.6 -70.3 2.85 -70.55 2.45 -71.4 2.25 -73.2 1.65 -73.95 1.35 -74.2 1.25 -74.2 1.2 -74.35 1.1 Q-74.85 0.65 -74.85 -0.5 L-74.3 -4.75 Q-73.7 -8.7 -73.3 -9.75 L-73.25 -9.8 -82.5 -17.45 -83.5 -18.35 -83.75 -18.55 -84.4 -18.35 -86.8 -17.6 -95.35 -15.05 -101.3 -13.2 -111.35 -9.85 -125.75 -4.0 Q-131.5 -1.9 -136.25 -1.05 L-141.15 -0.55 -142.1 -0.55 -143.05 -0.6 -143.2 -0.65 Q-146.05 -2.7 -146.35 -3.45 L-147.5 -6.6 -147.6 -7.95 Q-147.8 -13.4 -146.15 -18.1 L-146.05 -18.35 -145.5 -19.7 -144.75 -21.45 Q-143.25 -24.65 -141.15 -27.45 -139.0 -30.35 -136.25 -32.75 L-135.15 -33.7 Q-128.9 -38.9 -120.95 -39.7 L-119.65 -39.8 -118.8 -39.85 -111.1 -38.7 -101.3 -36.75 -99.1 -36.2 -94.9 -35.15 -85.45 -33.1 -81.25 -32.35 -73.3 -31.8 -72.9 -31.85 -73.35 -32.65 Q-74.4 -35.1 -74.35 -35.85 -73.5 -36.4 -72.05 -36.75 L-70.75 -37.0 -70.95 -37.45 -74.35 -43.9 -74.35 -44.35 -74.15 -44.2 -73.3 -44.05 Q-72.45 -44.1 -71.9 -44.7 L-73.15 -46.4 Q-74.05 -47.5 -74.85 -47.5 L-75.6 -47.35 -76.25 -47.2 Q-75.65 -48.25 -74.15 -49.45 L-72.7 -50.5 -73.95 -51.45 Q-75.55 -52.6 -76.4 -52.6 L-78.8 -52.2 -80.5 -51.75 -80.8 -51.65 -80.8 -51.9 -80.7 -52.25 Q-80.35 -53.45 -79.0 -55.1 -77.3 -57.1 -76.0 -57.4 L-77.1 -57.4 -80.55 -56.85 -80.6 -56.85 -80.6 -57.05 -75.55 -60.4 -75.9 -61.6 -77.35 -60.8 Q-81.2 -58.8 -82.55 -58.6 L-82.55 -58.65 -80.1 -61.7 -78.1 -63.95 -79.5 -63.85 Q-83.6 -63.85 -87.95 -66.3 L-84.45 -66.5 -80.95 -67.0 Q-81.15 -67.0 -81.15 -67.15 L-81.9 -67.5 -84.7 -68.95 Q-86.9 -70.2 -88.2 -70.3 L-80.95 -71.85 -74.4 -72.35 Q-76.2 -75.0 -77.6 -79.2 L-78.6 -83.15 -79.3 -87.35 -79.35 -88.2 -79.0 -87.4 -76.75 -83.15 -75.05 -80.2 -74.05 -79.1 Q-71.05 -75.9 -67.6 -75.9 L-67.2 -75.9 -67.1 -76.05 -67.05 -76.1 -64.8 -80.35 -63.0 -83.15 Q-59.75 -88.15 -56.0 -92.5 -52.1 -97.15 -47.65 -101.05 L-46.45 -102.05 Q-38.15 -108.9 -25.05 -113.45 L-24.3 -114.55 Q-23.15 -116.3 -22.15 -118.0 -17.35 -125.6 -14.55 -131.55 -16.1 -121.65 -16.55 -120.35 L-16.55 -119.85 Q-6.75 -127.05 5.7 -132.6 26.05 -141.75 44.95 -141.75 L55.4 -140.8 59.15 -139.9 Q58.3 -138.45 49.55 -134.95 L41.6 -131.95 Q25.75 -126.15 20.65 -125.45 L23.7 -125.25 M44.6 -10.85 L44.75 -10.55 44.75 -10.9 44.6 -10.85 M-52.15 -61.9 L-52.25 -61.9 -52.3 -61.8 -52.2 -61.85 -52.15 -61.9 M-76.4 -64.05 L-76.35 -64.05 -76.35 -64.25 -76.4 -64.05 M-66.6 -75.7 L-66.55 -75.5 -66.6 -75.8 -66.6 -75.7 M35.65 28.7 L35.75 28.6 35.65 28.6 35.65 28.7" fill="url(#gradient0)" fill-rule="evenodd" stroke="none"/>
  </g>
  <defs>
    <linearGradient gradientTransform="matrix(-0.1055, -0.1492, 0.1355, -0.1058, -15.8, -5.2)" gradientUnits="userSpaceOnUse" id="gradient0" spreadMethod="pad" x1="-819.2" x2="819.2">
      <stop offset="0.0" stop-color="#28479e" stop-opacity="0.5647059"/>
      <stop offset="1.0" stop-color="#2878d9" stop-opacity="0.0"/>
    </linearGradient>
  </defs>
</svg>
