<?xml version="1.0" encoding="UTF-8" standalone="no"?>
<svg xmlns:xlink="http://www.w3.org/1999/xlink" height="82.9px" width="82.65px" xmlns="http://www.w3.org/2000/svg">
  <g transform="matrix(1.0, 0.0, 0.0, 1.0, 41.3, 41.45)">
    <path d="M22.85 -32.25 L24.85 -32.2 26.65 -31.9 28.35 -28.25 Q30.2 -27.6 31.85 -26.75 L32.25 -23.2 32.55 -21.85 33.45 -21.25 Q34.3 -20.7 35.3 -20.4 L36.75 -19.4 Q37.1 -17.45 37.0 -15.35 L39.6 -12.5 38.75 -9.05 38.45 -7.6 38.45 -7.55 39.0 -6.75 Q39.55 -5.95 40.4 -5.25 L41.35 -3.8 Q40.9 -1.9 40.0 0.05 40.85 1.85 41.35 3.7 L39.25 6.55 38.55 7.65 38.85 8.95 Q38.8 10.3 39.35 11.35 L39.6 12.4 36.95 15.1 36.75 19.05 33.75 20.9 32.95 21.5 32.75 21.65 32.45 23.2 Q31.9 24.4 32.0 25.6 L31.8 26.7 Q30.2 27.55 28.3 28.15 L26.65 31.75 23.15 32.3 21.8 32.6 21.05 33.7 Q20.1 34.65 19.75 35.8 L19.15 36.7 15.45 36.7 12.45 39.55 12.15 39.75 10.6 39.5 8.7 39.1 8.55 39.05 8.3 39.0 7.35 38.7 6.55 39.25 Q5.3 39.75 4.55 40.7 L3.65 41.3 Q1.95 40.8 0.2 39.9 L-3.65 41.4 -4.0 41.45 -5.3 40.65 -6.95 39.5 -7.8 38.85 -9.0 39.1 -11.8 39.7 -12.15 39.45 -15.35 36.8 -19.2 36.7 -19.55 36.65 -20.5 35.35 -21.55 33.7 -21.7 33.45 -22.0 32.95 -23.3 32.75 -26.1 32.2 -26.35 31.9 -28.3 28.2 -31.8 26.65 -32.15 26.45 -32.5 24.9 -32.8 22.95 -32.95 21.9 -34.05 21.2 -36.5 19.65 -36.55 19.2 Q-36.9 17.3 -36.9 15.25 -38.45 13.7 -39.6 12.0 L-39.5 11.4 -39.2 8.9 -38.8 7.7 -39.55 6.6 -41.3 4.25 -41.15 3.85 Q-40.75 1.9 -39.95 0.05 L-41.2 -4.0 -40.85 -4.55 -39.65 -6.7 -38.8 -7.7 -39.05 -8.6 -39.15 -8.9 -39.2 -9.1 -39.6 -12.5 -36.9 -15.35 Q-36.9 -17.55 -36.55 -19.6 L-36.05 -19.95 Q-35.1 -20.55 -34.05 -21.5 L-32.85 -22.1 -32.75 -23.3 -31.8 -26.65 -28.25 -28.25 -26.3 -32.0 -25.65 -32.15 -23.25 -32.8 -22.05 -32.9 -21.35 -34.2 -19.25 -36.95 -15.2 -37.05 -12.45 -39.65 -9.05 -38.65 -8.1 -38.5 -6.65 -39.7 -3.65 -41.45 0.1 -40.0 3.65 -41.35 6.4 -39.1 7.55 -38.4 8.75 -38.65 10.65 -39.35 12.4 -39.7 Q14.0 -38.6 15.4 -37.0 L19.15 -36.95 20.9 -33.8 21.85 -32.45 22.85 -32.25 M8.5 -35.2 L7.85 -35.6 3.85 -36.15 Q3.4 -36.2 3.1 -35.9 L2.75 -35.2 Q2.7 -34.8 3.0 -34.5 3.25 -34.2 3.7 -34.15 L7.5 -33.65 8.25 -33.8 8.65 -34.45 8.5 -35.2 M0.45 -32.15 L-4.95 -31.75 Q-12.45 -30.6 -18.25 -26.2 L-18.25 -26.15 -18.85 -25.65 -22.3 -22.55 -22.3 -22.5 -25.35 -19.05 Q-30.2 -12.95 -31.3 -5.1 -31.7 -2.65 -31.7 0.05 L-31.45 4.0 Q-30.6 12.1 -25.75 18.5 L-22.3 22.55 -19.5 25.25 -18.3 26.35 -18.25 26.35 Q-12.45 30.55 -4.85 31.65 L0.45 32.0 4.45 31.85 Q12.9 30.85 19.5 25.8 L23.05 22.6 23.1 22.55 26.15 19.15 Q31.35 12.5 32.35 3.95 L32.5 0.05 Q32.5 -2.65 32.15 -5.1 30.85 -13.45 25.6 -19.85 L23.05 -22.55 23.1 -22.55 18.95 -26.2 Q12.6 -30.95 4.5 -31.9 L0.45 -32.15 M4.25 -30.4 L4.35 -30.4 Q12.05 -29.55 18.05 -25.0 L21.95 -21.5 22.1 -21.4 22.15 -21.4 24.45 -18.9 Q29.45 -12.8 30.65 -4.9 L31.0 0.05 30.85 3.8 Q29.9 11.9 24.95 18.25 L22.0 21.45 22.0 21.5 21.95 21.5 18.6 24.6 Q12.3 29.4 4.3 30.35 L0.45 30.5 -4.65 30.15 Q-11.8 29.1 -17.25 25.25 L-17.25 25.2 -18.55 24.1 -21.25 21.5 Q-23.1 19.65 -24.55 17.6 -29.15 11.55 -29.95 3.9 L-29.95 3.8 -30.2 0.05 Q-30.2 -2.5 -29.8 -4.9 -28.75 -12.35 -24.15 -18.15 L-21.25 -21.5 -21.2 -21.55 -17.95 -24.5 -17.95 -24.45 -17.85 -24.55 -17.8 -24.6 -17.3 -25.0 -17.25 -25.05 Q-11.8 -29.15 -4.75 -30.25 L0.45 -30.65 4.25 -30.4 M15.05 -30.95 L18.5 -29.05 19.25 -28.9 Q19.65 -29.0 19.85 -29.35 L20.0 -30.1 19.55 -30.75 Q17.8 -31.85 15.95 -32.75 L15.2 -32.8 Q14.8 -32.65 14.6 -32.3 14.4 -31.9 14.55 -31.5 L15.05 -30.95 M10.25 -23.9 L10.05 -24.05 9.85 -24.1 7.6 -23.9 5.35 -23.5 5.35 -23.55 4.45 -23.25 2.75 -22.7 2.5 -22.55 2.4 -22.25 2.4 -16.1 2.5 -15.8 2.75 -15.6 2.9 -15.55 2.95 -15.55 3.25 -15.45 4.35 -14.75 4.45 -14.65 4.5 -14.6 5.65 -13.5 5.8 -13.4 6.0 -13.35 7.45 -13.2 7.55 -13.2 8.45 -13.05 8.5 -13.05 8.9 -12.9 9.15 -12.9 9.4 -13.05 14.0 -17.7 14.15 -17.95 14.1 -18.25 13.5 -19.45 13.5 -19.5 13.1 -20.2 13.05 -20.25 12.35 -21.3 12.3 -21.4 10.25 -23.9 M19.6 -13.3 L17.8 -14.35 17.5 -14.4 17.2 -14.25 12.95 -10.0 12.8 -9.75 12.85 -9.45 13.15 -8.7 13.45 -7.35 13.45 -7.25 13.5 -5.85 13.55 -5.65 13.7 -5.45 14.65 -4.45 14.9 -4.1 15.55 -3.05 15.55 -3.0 15.65 -2.85 16.0 -2.7 22.5 -2.7 22.8 -2.8 23.0 -3.05 23.3 -4.35 23.3 -4.45 23.4 -5.25 24.0 -7.8 24.25 -9.6 24.25 -9.8 24.1 -10.0 22.2 -11.6 22.15 -11.65 20.35 -12.9 19.6 -13.35 19.6 -13.3 M5.05 -6.6 Q3.45 -7.85 1.4 -8.05 L0.4 -8.1 -0.9 -8.0 Q-2.75 -7.75 -4.15 -6.65 L-4.2 -6.6 -4.25 -6.6 -4.4 -6.5 -5.25 -5.7 -5.25 -5.65 -6.0 -4.85 -6.05 -4.85 Q-7.2 -3.3 -7.55 -1.35 L-7.65 -0.05 -7.6 0.95 -7.6 1.0 Q-7.35 2.95 -6.15 4.6 L-5.25 5.6 -5.2 5.65 -4.55 6.25 -4.3 6.5 -4.25 6.55 Q-2.8 7.6 -0.9 7.85 L0.4 7.95 1.4 7.9 Q3.55 7.7 5.2 6.4 L6.1 5.6 6.85 4.75 Q8.15 3.05 8.4 0.9 L8.45 -0.05 8.35 -1.3 Q8.05 -3.4 6.7 -5.05 L6.1 -5.7 5.05 -6.6 M33.5 -12.55 L32.95 -12.05 Q32.8 -11.7 32.95 -11.3 L34.05 -7.7 Q34.1 -7.3 34.5 -7.1 L35.25 -6.95 35.85 -7.4 36.0 -8.15 34.8 -12.0 34.25 -12.55 33.5 -12.55 M25.85 -24.25 Q25.5 -23.95 25.5 -23.55 L25.75 -22.8 28.2 -19.8 28.85 -19.4 29.6 -19.6 Q29.9 -19.85 30.0 -20.25 L29.8 -21.0 27.25 -24.15 26.55 -24.5 25.85 -24.25 M36.9 2.1 L36.65 1.4 Q36.35 1.05 35.95 1.05 35.55 1.05 35.25 1.3 34.9 1.6 34.9 2.0 L34.5 5.85 Q34.4 6.25 34.65 6.6 34.85 6.9 35.3 7.0 L36.05 6.85 36.45 6.2 36.9 2.1 M22.6 2.0 L22.3 1.9 16.1 1.9 15.85 2.0 15.65 2.2 15.5 2.6 15.05 3.4 14.55 4.05 14.55 4.1 13.65 5.15 13.55 5.35 13.5 5.55 13.45 7.05 13.45 7.1 13.4 7.45 13.35 7.55 13.1 8.6 13.0 9.0 13.15 9.35 17.7 13.9 18.0 14.05 18.3 14.0 19.7 13.1 19.65 13.15 20.2 12.75 22.45 11.4 22.45 11.35 24.1 10.1 24.2 9.9 24.25 9.7 23.8 6.0 23.7 5.8 Q23.4 5.45 23.4 5.0 L23.4 4.9 23.35 4.5 23.35 4.4 22.85 2.55 22.75 2.2 22.6 2.0 M29.55 19.35 Q29.6 19.75 30.0 19.95 L30.75 20.1 31.35 19.65 33.35 16.0 33.4 15.25 32.9 14.65 32.15 14.6 31.55 15.15 29.65 18.6 Q29.45 18.95 29.55 19.35 M9.3 12.65 L8.15 12.95 7.4 13.05 7.35 13.05 5.75 13.2 Q5.55 13.2 5.45 13.35 L4.5 14.1 4.45 14.15 4.35 14.25 2.75 15.2 2.5 15.4 2.4 15.65 2.4 22.05 2.55 22.4 2.85 22.55 2.9 22.6 4.05 22.95 4.1 22.95 5.45 23.25 5.5 23.25 7.5 23.6 7.55 23.6 10.0 23.9 10.25 23.9 10.45 23.75 12.55 21.0 12.6 20.8 Q12.65 20.3 13.0 20.0 L13.0 19.95 13.6 19.15 13.65 19.1 14.25 18.1 14.3 18.0 14.35 17.85 14.4 17.55 14.25 17.25 9.75 12.75 9.55 12.65 9.3 12.65 M11.8 32.8 L8.1 33.95 Q7.65 34.0 7.45 34.4 7.25 34.7 7.35 35.15 7.4 35.55 7.8 35.75 L8.55 35.9 12.5 34.7 13.05 34.2 Q13.25 33.8 13.1 33.4 L12.6 32.85 11.8 32.8 M20.1 29.75 Q20.3 30.05 20.75 30.15 L21.5 30.0 24.7 27.45 25.05 26.8 Q25.1 26.35 24.8 26.05 24.55 25.75 24.15 25.7 23.7 25.65 23.4 25.95 L20.35 28.35 Q20.0 28.55 19.95 29.0 19.85 29.4 20.1 29.75 M-11.0 -33.2 L-10.5 -32.65 -9.7 -32.6 -6.0 -33.6 -5.35 -34.05 Q-5.15 -34.4 -5.2 -34.8 L-5.65 -35.4 -6.4 -35.55 -10.35 -34.5 -10.95 -34.0 -11.0 -33.2 M-18.05 -28.9 L-18.2 -29.65 -18.85 -30.05 -19.6 -29.9 Q-21.35 -28.75 -22.9 -27.45 L-23.25 -26.8 -23.0 -26.05 Q-22.75 -25.75 -22.35 -25.7 L-21.6 -25.9 -18.5 -28.25 Q-18.15 -28.5 -18.05 -28.9 M-28.35 -20.1 L-29.1 -20.2 Q-29.55 -20.15 -29.75 -19.75 L-31.75 -16.3 -31.8 -15.55 -31.3 -14.95 -30.55 -14.9 -29.95 -15.4 -28.05 -18.7 Q-27.85 -19.05 -27.9 -19.45 L-28.35 -20.1 M-20.9 -12.45 Q-22.5 -11.4 -23.7 -10.15 L-23.85 -9.8 -23.75 -7.8 -23.25 -5.15 -23.1 -4.5 -23.0 -4.15 -22.6 -3.05 -22.45 -2.8 -22.15 -2.7 -15.5 -2.7 Q-15.3 -2.7 -15.15 -2.85 L-15.0 -3.15 -14.4 -4.05 -14.3 -4.25 -14.4 -4.25 -14.1 -4.45 -13.2 -5.5 -13.05 -5.7 -13.05 -5.9 -13.05 -7.2 -12.85 -8.0 -12.65 -8.65 -12.65 -8.6 -12.5 -9.0 -12.45 -9.3 -12.6 -9.6 -17.15 -14.15 -17.4 -14.3 -17.7 -14.25 -19.4 -13.35 -19.35 -13.4 -19.95 -13.1 -20.05 -13.0 -20.85 -12.5 -20.9 -12.45 M-34.0 -7.3 L-34.75 -7.15 -35.15 -6.55 -35.75 -2.4 Q-35.8 -2.0 -35.5 -1.7 -35.25 -1.4 -34.8 -1.35 -34.4 -1.3 -34.1 -1.6 -33.8 -1.85 -33.75 -2.25 L-33.2 -6.15 -33.35 -6.9 Q-33.6 -7.25 -34.0 -7.3 M-5.0 -23.55 L-6.25 -23.75 -6.3 -23.8 -9.5 -24.1 -9.9 -23.95 -11.35 -22.4 -12.8 -20.2 -13.2 -19.5 -13.95 -18.15 -14.0 -17.85 -13.85 -17.6 -9.2 -12.95 -8.85 -12.8 -8.8 -12.8 -8.5 -12.85 -8.3 -12.95 -7.35 -13.15 -7.15 -13.2 -7.1 -13.2 -6.85 -13.2 -5.65 -13.35 -5.45 -13.4 -5.25 -13.5 -3.95 -14.6 -3.9 -14.7 -3.2 -15.2 -3.15 -15.2 -3.0 -15.3 -2.9 -15.35 -2.75 -15.4 -2.5 -15.6 -2.4 -15.9 -2.4 -22.4 -2.5 -22.7 -2.75 -22.85 -4.05 -23.25 -4.9 -23.5 -5.0 -23.55 M-15.0 2.8 L-15.2 2.25 -15.4 2.0 -15.7 1.9 -21.95 1.95 -22.2 2.05 -22.4 2.25 -23.1 4.25 -23.3 4.95 -23.45 5.95 -23.5 6.0 Q-23.9 7.95 -23.85 9.85 L-23.8 10.05 -23.65 10.2 Q-22.55 11.15 -21.1 12.1 L-21.05 12.1 Q-20.6 12.35 -20.05 12.75 L-20.0 12.8 -19.35 13.2 -19.3 13.25 -18.05 13.95 -17.75 14.0 -17.5 13.85 -12.75 9.05 -12.6 8.8 -12.65 8.5 -12.75 8.2 -12.75 8.25 -13.05 6.95 -13.0 5.7 -13.0 5.5 -13.15 5.3 -14.2 4.2 -14.65 3.5 -14.65 3.45 -15.0 2.8 M-14.2 17.3 L-14.15 17.6 -13.0 19.55 -13.0 19.5 -12.6 20.2 -11.45 21.9 -11.45 21.95 -9.9 23.8 -9.7 23.95 -9.5 23.95 -6.3 23.5 -6.2 23.5 -5.05 23.2 -5.0 23.2 -3.75 22.95 -2.7 22.65 -2.45 22.45 -2.35 22.15 -2.4 15.5 -2.45 15.25 -2.65 15.1 Q-2.9 14.9 -3.2 14.85 -3.7 14.4 -4.25 14.15 L-5.0 13.35 -5.2 13.2 -5.4 13.15 -6.9 13.05 -7.05 13.05 -8.45 12.75 -9.15 12.5 -9.4 12.5 -9.65 12.6 -14.05 17.0 -14.2 17.3 M-33.5 6.75 L-34.25 6.65 Q-34.7 6.7 -34.9 7.1 L-35.0 7.85 -33.85 11.95 -33.3 12.5 -32.55 12.55 Q-32.2 12.4 -32.0 12.05 -31.8 11.65 -31.95 11.3 L-33.05 7.4 Q-33.15 6.95 -33.5 6.75 M-26.8 24.1 L-26.1 24.45 -25.4 24.2 -25.05 23.55 Q-25.0 23.1 -25.3 22.8 L-27.65 19.7 -28.3 19.3 -29.05 19.45 -29.45 20.05 -29.3 20.8 -26.8 24.1 M-6.45 35.55 L-5.85 36.0 -1.75 36.55 Q-1.35 36.6 -1.05 36.3 -0.75 36.05 -0.7 35.65 -0.65 35.2 -0.95 34.9 L-1.6 34.55 -5.45 34.05 -6.2 34.2 -6.6 34.8 -6.45 35.55 M-18.95 30.85 L-15.4 32.85 -14.6 32.9 -14.05 32.4 Q-13.85 32.0 -14.0 31.65 L-14.5 31.05 -17.9 29.15 -18.65 29.05 Q-19.1 29.1 -19.3 29.5 L-19.4 30.25 -18.95 30.85" fill="#000000" fill-rule="evenodd" stroke="none"/>
  </g>
</svg>
