<?xml version="1.0" encoding="UTF-8" standalone="no"?>
<svg xmlns:xlink="http://www.w3.org/1999/xlink" height="14.5px" width="44.65px" xmlns="http://www.w3.org/2000/svg">
  <g transform="matrix(1.0, 0.0, 0.0, 1.0, 0.0, 0.0)">
    <path d="M38.9 0.05 L39.2 0.0 39.15 1.6 Q39.05 7.3 43.95 9.35 L44.65 9.65 41.85 10.15 Q38.7 8.1 38.55 4.5 L38.5 4.0 Q38.5 1.25 38.9 0.05 M8.55 12.8 L4.95 12.35 Q7.4 11.85 8.45 9.5 L8.4 9.55 8.7 9.3 Q9.6 8.6 9.65 8.05 L9.85 9.05 9.7 10.35 9.05 12.0 8.55 12.8 M1.65 10.5 Q0.8 10.25 0.0 9.8 7.35 8.75 4.85 1.0 L5.1 1.0 Q5.55 1.4 6.0 2.7 6.55 4.2 6.55 4.95 6.55 6.7 5.9 7.95 L4.4 9.45 1.65 10.5" fill="#c29d9d" fill-rule="evenodd" stroke="none"/>
    <path d="M41.85 10.15 Q39.7 10.15 37.7 9.0 L36.55 12.05 35.7 11.05 35.0 11.0 33.9 7.2 33.6 4.9 33.6 4.3 33.7 2.65 33.8 2.65 Q33.55 3.35 34.05 4.85 L34.7 6.6 Q36.0 9.5 37.0 9.25 L35.8 5.55 35.55 4.6 Q34.9 1.85 34.9 0.4 L38.9 0.05 Q38.5 1.25 38.5 4.0 L38.55 4.5 Q38.7 8.1 41.85 10.15 M9.65 12.7 L9.0 12.75 8.55 12.8 9.05 12.0 9.7 10.35 9.85 9.05 9.65 8.05 Q9.6 8.6 8.7 9.3 L8.4 9.55 7.55 9.95 Q4.5 11.3 1.65 10.5 L4.4 9.45 5.9 7.95 Q6.55 6.7 6.55 4.95 6.55 4.2 6.0 2.7 5.55 1.4 5.1 1.0 L7.9 1.1 8.25 2.25 8.55 4.2 Q8.55 5.55 7.9 7.15 7.25 8.7 6.55 9.15 7.85 9.2 9.45 7.1 L9.75 6.65 Q11.35 4.25 11.35 1.15 L15.85 1.15 Q15.65 5.0 13.75 7.85 L13.5 8.25 13.35 8.45 11.9 10.05 13.25 9.25 13.25 9.35 Q12.75 9.65 12.15 10.35 L11.15 11.45 9.65 12.7" fill="#b38484" fill-rule="evenodd" stroke="none"/>
    <path d="M35.0 11.0 Q31.5 10.9 29.6 13.95 29.0 7.5 21.35 9.7 16.9 11.0 13.65 14.5 13.8 11.6 15.6 9.4 12.9 12.15 9.65 12.7 L11.15 11.45 12.15 10.35 Q12.75 9.65 13.25 9.35 L13.25 9.25 11.9 10.05 13.35 8.45 13.5 8.25 13.75 7.85 Q15.65 5.0 15.85 1.15 L34.9 0.4 Q34.9 1.85 35.55 4.6 L35.8 5.55 37.0 9.25 Q36.0 9.5 34.7 6.6 L34.05 4.85 Q33.55 3.35 33.8 2.65 L33.7 2.65 33.6 4.3 33.6 4.9 33.9 7.2 35.0 11.0 M7.9 1.1 L11.35 1.15 Q11.35 4.25 9.75 6.65 L9.45 7.1 Q7.85 9.2 6.55 9.15 7.25 8.7 7.9 7.15 8.55 5.55 8.55 4.2 L8.25 2.25 7.9 1.1" fill="#a36a6a" fill-rule="evenodd" stroke="none"/>
    <path d="M38.9 0.05 L39.2 0.0 39.15 1.6 Q39.05 7.3 43.95 9.35 L44.65 9.65 41.85 10.15 Q39.7 10.15 37.7 9.0 L36.55 12.05 35.7 11.05 35.0 11.0 Q31.5 10.9 29.6 13.95 29.0 7.5 21.35 9.7 16.9 11.0 13.65 14.5 13.8 11.6 15.6 9.4 12.9 12.15 9.65 12.7 M9.0 12.75 L8.55 12.8 4.95 12.35 Q7.4 11.85 8.45 9.5 L8.4 9.55 M7.55 9.95 Q4.5 11.3 1.65 10.5 0.8 10.25 0.0 9.8 7.35 8.75 4.85 1.0 M5.1 1.0 L7.9 1.1 11.35 1.15 15.85 1.15 34.9 0.4 38.9 0.05 Z" fill="none" stroke="#a36a6a" stroke-linecap="round" stroke-linejoin="round" stroke-opacity="0.6" stroke-width="0.05"/>
  </g>
</svg>
