<?xml version="1.0" encoding="UTF-8" standalone="no"?>
<svg xmlns:xlink="http://www.w3.org/1999/xlink" height="286.75px" width="175.95px" xmlns="http://www.w3.org/2000/svg">
  <g transform="matrix(1.0, 0.0, 0.0, 1.0, 85.8, 143.4)">
    <path d="M23.05 -136.65 L31.15 -135.95 31.2 -134.8 Q31.4 -133.55 32.5 -133.55 L33.4 -133.7 33.65 -133.9 33.8 -134.25 33.9 -134.9 33.7 -135.5 37.45 -134.65 39.1 -134.05 38.55 -133.25 Q37.85 -131.95 37.85 -130.95 37.8 -130.25 38.05 -130.05 L38.7 -129.85 Q39.7 -130.5 40.85 -132.25 L41.5 -133.2 45.35 -131.9 Q45.05 -131.2 45.0 -130.35 L46.35 -129.05 Q47.25 -129.45 48.0 -130.75 L48.15 -130.95 57.0 -128.1 Q60.5 -126.95 64.1 -124.15 L66.75 -121.85 66.4 -121.6 Q66.1 -121.2 66.05 -120.05 L66.25 -119.05 66.85 -118.8 68.7 -119.8 Q73.05 -115.05 75.55 -109.65 L77.15 -105.95 78.2 -102.9 78.9 -100.35 Q77.3 -102.05 75.55 -102.9 73.65 -103.8 71.6 -103.8 70.0 -103.8 68.7 -102.9 64.6 -100.25 62.4 -89.75 61.1 -83.7 60.7 -76.2 L60.5 -71.8 60.8 -52.4 Q60.6 -45.15 58.75 -38.25 L58.1 -36.05 56.9 -32.6 Q53.2 -23.1 52.9 -11.55 52.75 -6.05 49.55 -1.15 L42.65 7.6 Q32.55 20.25 32.0 38.95 31.85 45.05 35.15 57.8 L36.75 63.95 Q41.65 81.45 41.6 82.3 41.6 83.75 40.65 84.3 L38.35 84.75 36.7 84.55 32.65 81.75 Q27.3 78.25 25.05 77.4 L23.9 77.1 Q22.65 77.1 19.05 79.4 L14.05 82.5 Q9.4 84.7 1.3 86.55 L0.65 86.7 Q-4.1 87.7 -11.1 87.9 L-24.0 87.9 -27.75 87.9 -29.4 87.9 -33.2 86.7 -39.7 84.25 Q-47.8 81.0 -47.75 79.6 -47.75 78.9 -45.35 75.4 L-42.5 71.25 -42.5 70.6 -58.25 82.5 -58.85 82.15 -58.95 82.3 Q-59.9 81.15 -59.9 80.7 L-57.7 77.8 Q-59.8 78.5 -64.1 80.45 L-68.55 82.3 -69.5 79.5 -69.15 77.0 Q-68.65 72.45 -68.7 62.35 L-68.75 58.25 -68.7 57.8 -68.75 54.0 -66.95 44.25 Q-64.4 32.2 -64.25 28.15 L-64.55 22.3 Q-64.8 16.4 -64.55 13.45 -64.3 10.9 -65.05 7.0 L-65.15 6.5 Q-66.05 1.95 -66.0 -0.25 -65.9 -4.05 -61.8 -8.45 -57.8 -12.85 -57.75 -14.3 -57.65 -16.5 -63.4 -25.1 L-66.6 -30.85 -67.7 -33.05 -67.35 -33.45 Q-65.95 -34.95 -63.9 -36.05 L-63.35 -36.35 Q-65.5 -38.3 -66.55 -39.8 -67.45 -41.05 -68.15 -42.45 -64.3 -48.5 -60.45 -57.55 -58.05 -63.1 -55.75 -69.8 L-52.55 -76.2 -49.7 -81.65 -43.25 -94.55 Q-40.65 -99.25 -37.75 -102.9 L-35.15 -105.95 -34.5 -106.6 Q-29.3 -111.85 -22.95 -116.45 L-9.6 -125.2 -3.4 -128.55 Q-2.9 -128.05 -1.95 -128.05 -1.35 -128.05 -0.95 -128.5 -0.45 -129.0 -0.45 -129.9 L-0.45 -130.0 5.1 -132.45 5.8 -132.75 Q6.4 -129.5 7.75 -129.5 10.0 -129.5 11.4 -132.35 12.1 -133.9 12.3 -135.3 L12.4 -136.25 12.4 -136.35 16.5 -136.6 19.95 -136.7 Q19.4 -135.7 19.35 -134.8 L19.4 -133.55 19.85 -133.15 20.75 -133.0 Q22.1 -133.0 22.75 -135.2 L23.05 -136.65 M29.65 -131.55 Q27.85 -130.1 27.85 -129.0 L29.15 -127.7 Q31.3 -128.3 31.35 -130.35 31.45 -133.05 29.65 -131.55 M16.4 -116.4 Q17.7 -116.4 18.75 -117.1 19.75 -117.8 19.8 -118.6 19.85 -121.1 16.1 -121.9 12.25 -122.65 12.2 -120.3 12.15 -119.25 12.6 -118.3 13.6 -116.4 16.4 -116.4 M8.65 -103.3 L4.3 -103.35 3.4 -103.35 3.0 -103.35 -4.8 -102.9 Q-8.65 -102.45 -11.35 -101.45 -18.55 -98.95 -29.15 -97.6 -24.1 -96.15 -21.45 -96.15 -15.45 -96.15 -5.45 -99.75 -0.75 -101.45 2.95 -102.35 L4.25 -102.65 5.55 -102.9 8.65 -103.3 M30.4 -117.0 Q28.5 -116.8 29.0 -115.95 L24.95 -114.8 Q25.85 -113.7 26.95 -113.7 L26.95 -113.5 Q26.1 -113.55 24.7 -112.5 23.35 -111.5 23.3 -110.9 23.25 -109.55 28.3 -107.7 32.4 -106.2 35.25 -105.95 L36.3 -105.9 37.4 -105.95 Q40.1 -106.2 43.25 -107.7 46.6 -109.3 46.65 -110.15 46.65 -111.15 44.55 -111.95 L41.95 -112.75 43.15 -112.95 Q43.65 -113.3 43.65 -113.9 43.7 -115.8 38.85 -116.6 L33.55 -117.05 30.4 -117.0 M33.6 -120.6 L33.85 -121.45 Q33.9 -123.2 32.15 -123.6 L31.7 -123.65 29.7 -124.15 26.35 -123.5 Q27.7 -120.4 32.4 -120.4 L33.6 -120.6 M65.65 -116.0 Q65.15 -115.75 65.15 -114.95 65.1 -114.15 65.4 -113.85 L66.2 -113.5 67.35 -114.05 Q67.35 -114.75 67.5 -115.05 L67.4 -115.85 67.3 -116.1 65.65 -116.0 M54.6 -117.0 L53.8 -116.9 Q53.35 -116.75 53.3 -116.05 L53.35 -115.35 53.35 -115.5 54.55 -114.95 Q55.3 -115.25 55.55 -116.1 L54.6 -117.0 M59.15 -120.05 Q57.4 -120.1 57.35 -118.35 57.3 -117.75 57.5 -117.35 57.85 -116.45 59.05 -116.45 59.85 -116.45 60.45 -117.15 60.9 -117.7 60.9 -118.3 60.95 -120.0 59.15 -120.05 M56.15 -125.1 L56.1 -125.35 Q53.8 -125.85 53.6 -124.15 L53.55 -123.8 Q53.55 -123.55 54.75 -122.4 56.05 -123.4 56.25 -124.15 L56.25 -124.3 56.15 -125.1 M47.65 -124.15 L47.55 -124.2 47.5 -124.15 Q45.85 -123.1 45.85 -122.0 L47.0 -120.6 Q47.95 -120.65 48.4 -121.25 L48.75 -122.3 Q48.75 -123.5 47.65 -124.15 M42.8 -126.6 L42.9 -127.35 Q42.9 -128.05 42.55 -128.2 L41.8 -128.45 Q41.05 -128.4 40.6 -127.85 40.1 -127.4 40.05 -126.8 L41.3 -125.55 42.55 -126.2 42.8 -126.6 M62.6 -124.2 Q61.8 -124.5 61.1 -124.2 L61.0 -124.15 Q60.45 -123.85 60.4 -123.3 60.4 -122.6 60.7 -122.35 L61.5 -122.05 62.4 -122.45 Q62.8 -122.75 62.85 -123.2 L62.65 -124.15 62.6 -124.2 M49.65 -81.45 L49.95 -81.7 49.9 -81.75 Q45.45 -89.8 32.75 -89.8 25.25 -89.8 17.25 -86.65 12.55 -84.75 3.6 -79.75 L3.4 -79.65 2.3 -79.0 -3.0 -76.2 Q-7.55 -73.85 -10.6 -72.65 -18.7 -69.5 -26.5 -69.5 -30.4 -69.5 -38.65 -72.35 L-46.5 -75.35 Q-43.25 -70.25 -35.25 -66.65 -27.6 -63.2 -20.8 -63.2 -12.9 -63.2 -5.6 -66.65 -2.75 -68.0 2.05 -71.2 L3.4 -72.05 6.55 -74.25 9.4 -76.2 Q15.15 -80.1 19.15 -81.85 26.95 -85.3 35.8 -85.3 L42.75 -85.05 Q44.75 -84.55 49.65 -81.45 M17.8 -97.55 L17.7 -97.95 Q12.2 -97.95 4.65 -95.2 L4.05 -94.95 2.75 -94.45 -8.8 -89.4 Q-17.1 -85.7 -21.95 -84.4 -24.7 -83.65 -27.15 -83.45 L-27.15 -83.1 -20.2 -82.15 Q-15.9 -82.15 -8.9 -85.95 0.65 -91.1 2.65 -91.95 L2.85 -92.05 4.0 -92.45 14.5 -96.45 17.8 -97.55 M7.1 -12.2 Q5.75 -12.2 3.0 -9.7 L1.9 -8.6 4.3 6.9 4.35 7.0 Q6.25 15.6 10.15 20.8 L8.65 14.4 Q7.3 8.9 7.3 8.5 L7.35 7.75 14.65 12.05 Q19.4 14.5 22.4 14.5 L26.9 13.9 Q31.85 12.6 37.0 8.45 44.6 2.35 45.9 -4.45 L45.85 -4.75 39.7 -3.2 Q35.6 -2.2 32.3 -2.2 22.75 -2.2 15.3 -7.2 L10.65 -10.65 Q8.45 -12.2 7.1 -12.2 M60.25 55.6 L60.55 55.6 60.55 55.65 60.25 55.6 M25.75 20.4 Q23.6 18.6 21.8 18.6 L19.7 19.0 19.1 19.5 18.2 20.0 18.15 22.15 Q18.2 24.7 19.85 27.2 21.8 29.95 24.2 29.95 25.55 29.95 26.45 29.3 L27.35 28.4 Q28.2 27.15 28.25 25.4 28.35 23.1 26.7 21.3 L25.75 20.4 M17.05 28.75 L16.85 28.75 16.8 28.9 16.6 30.05 Q16.55 30.6 17.2 31.25 L18.55 31.95 Q19.45 31.95 19.45 31.05 19.45 30.4 18.65 29.55 17.85 28.75 17.05 28.75 M11.1 53.65 Q10.75 50.8 9.95 49.15 7.6 44.05 0.15 44.05 -1.25 44.05 -3.4 44.7 -5.6 42.25 -6.25 38.35 L-6.45 36.4 -5.95 34.0 -4.8 15.95 -4.25 7.0 -3.6 -6.45 Q-3.45 -12.7 -4.2 -18.8 L-4.4 -20.15 Q-5.95 -30.65 -9.85 -30.65 -11.5 -30.65 -12.95 -29.25 L-13.5 -28.7 Q-15.0 -19.75 -20.4 7.0 L-20.7 8.35 Q-22.25 16.1 -23.3 23.45 L-23.35 23.85 Q-24.35 31.5 -24.75 38.75 -26.65 43.5 -28.6 46.7 L-29.45 46.65 Q-34.2 46.65 -35.15 50.95 L-35.35 56.5 -35.35 57.8 -35.4 59.05 -35.45 60.15 -35.45 62.95 Q-37.35 65.1 -38.9 68.35 L-37.35 68.35 Q-36.25 67.85 -35.25 67.5 -34.55 71.35 -32.15 70.45 L-32.1 70.15 Q-30.6 71.2 -29.45 71.6 -27.7 72.25 -26.1 74.35 -24.15 77.3 -23.1 78.1 -21.4 79.45 -18.4 79.45 -15.0 79.45 -11.55 76.45 -8.15 73.45 -3.5 73.45 L2.3 74.05 Q6.65 74.05 10.0 71.2 12.5 69.05 13.35 66.25 L14.2 66.6 16.25 67.15 18.05 66.85 Q18.7 66.4 18.7 65.2 18.8 61.9 15.45 57.8 L15.05 57.35 Q13.35 55.4 11.75 54.15 L11.1 53.65 M17.95 43.05 Q20.05 45.95 22.0 46.9 L21.8 46.05 21.8 45.95 Q14.4 33.8 8.65 22.05 8.95 28.55 13.5 35.95 17.15 42.0 17.95 43.05 M25.0 35.25 L25.75 35.7 26.25 35.65 26.65 35.5 26.7 34.4 26.3 34.2 25.6 33.95 Q25.2 33.95 24.9 34.2 L25.0 35.25 M20.05 90.0 L20.15 89.9 20.15 89.85 20.2 89.75 Q22.2 88.25 25.5 86.85 28.8 85.5 30.45 85.5 31.55 85.5 35.0 86.45 L33.15 88.95 Q30.75 91.5 28.05 91.5 L23.9 91.05 Q21.25 90.6 20.05 90.0 M-25.2 -90.0 Q-22.85 -90.95 -22.4 -91.45 L-25.5 -91.45 Q-28.5 -90.55 -29.6 -90.4 L-31.55 -90.35 -34.3 -90.85 -37.9 -91.95 -38.6 -91.85 Q-40.2 -91.6 -40.2 -91.15 -40.25 -90.1 -38.3 -88.6 -36.2 -87.0 -34.1 -87.0 -33.1 -87.0 -31.65 -88.0 -30.15 -89.0 -28.7 -89.05 -27.6 -89.05 -25.2 -90.0 M-38.8 -0.9 Q-43.3 0.7 -46.0 0.7 L-58.1 -0.95 Q-60.35 -0.95 -62.55 0.85 -63.95 2.0 -64.6 3.2 L-64.7 3.45 -62.75 7.0 -59.6 12.4 Q-54.3 21.2 -50.9 21.2 -47.8 21.2 -41.9 17.9 -36.2 14.65 -34.1 11.9 L-33.8 11.9 -38.7 19.75 -43.0 27.1 Q-32.6 18.45 -26.8 8.55 L-25.9 7.0 Q-22.4 0.55 -18.7 -10.55 L-18.65 -11.8 Q-21.85 -8.3 -24.7 -6.3 -28.1 -3.95 -31.8 -3.2 L-38.8 -0.9 M-29.15 31.5 Q-29.8 30.8 -30.4 30.8 L-31.3 31.1 Q-32.1 32.25 -34.2 34.25 L-36.65 36.45 Q-40.25 39.5 -40.25 40.25 L-40.25 41.2 Q-40.15 41.35 -39.25 41.7 -41.1 43.05 -47.2 46.05 -52.8 49.15 -54.65 52.2 -54.3 52.55 -53.1 52.55 -50.0 52.55 -46.05 49.95 L-40.6 46.0 -40.4 45.55 -40.45 45.9 -40.6 46.0 -40.8 46.95 Q-40.7 46.95 -40.55 47.15 L-39.95 47.3 Q-36.55 47.3 -32.25 40.65 -28.55 34.95 -28.5 33.25 -28.5 32.25 -29.15 31.5 M-36.4 26.35 L-43.2 33.7 Q-49.55 40.4 -53.85 44.15 -44.6 39.4 -40.5 34.8 -37.15 31.0 -36.4 26.35 M-47.05 55.7 Q-47.4 55.5 -48.1 55.45 L-48.55 55.4 -49.7 55.75 -51.2 56.4 Q-53.4 57.5 -53.45 58.35 -53.45 59.4 -52.8 59.6 L-51.75 59.6 Q-49.85 59.6 -48.8 58.75 -47.85 57.95 -47.05 55.7 M-60.3 53.9 Q-60.75 54.35 -61.45 54.55 -62.15 55.55 -62.2 56.6 -62.2 57.8 -61.55 58.55 -60.9 59.25 -59.95 59.25 -58.6 59.25 -57.7 58.2 -56.9 57.3 -56.9 56.4 -56.8 53.25 -58.95 53.25 L-59.95 53.65 -60.3 53.9 M-27.5 107.55 L-25.45 107.35 Q-21.85 107.95 -21.9 109.15 -21.95 111.05 -24.25 111.4 L-29.0 111.4 -40.5 110.5 -43.4 110.0 -44.1 109.85 Q-49.45 108.55 -49.4 106.4 -49.35 105.1 -47.05 104.15 -44.9 103.25 -42.1 103.25 -38.3 103.25 -33.55 105.1 L-27.5 107.55" fill="#8d9a9c" fill-rule="evenodd" stroke="none"/>
    <path d="M19.95 -136.7 L20.55 -137.6 21.3 -138.55 Q23.05 -140.45 23.15 -138.0 L23.15 -137.55 23.05 -136.65 22.75 -135.2 Q22.1 -133.0 20.75 -133.0 L19.85 -133.15 19.4 -133.55 19.35 -134.8 Q19.4 -135.7 19.95 -136.7 M31.15 -135.95 L31.1 -136.55 33.15 -136.1 33.7 -135.5 33.9 -134.9 33.8 -134.25 33.65 -133.9 33.4 -133.7 32.5 -133.55 Q31.4 -133.55 31.2 -134.8 L31.15 -135.95 M39.1 -134.05 Q40.05 -135.45 41.7 -135.65 L41.85 -135.3 42.0 -134.45 41.5 -133.2 40.85 -132.25 Q39.7 -130.5 38.7 -129.85 L38.05 -130.05 Q37.8 -130.25 37.85 -130.95 37.85 -131.95 38.55 -133.25 L39.1 -134.05 M45.35 -131.9 Q45.8 -133.05 46.95 -133.9 48.75 -135.25 48.7 -132.75 L48.15 -130.95 48.0 -130.75 Q47.25 -129.45 46.35 -129.05 L45.0 -130.35 Q45.05 -131.2 45.35 -131.9 M66.75 -121.85 Q67.6 -122.55 69.75 -122.4 L69.85 -122.2 69.9 -121.4 Q69.9 -120.7 68.7 -119.85 L68.7 -119.8 66.85 -118.8 66.25 -119.05 66.05 -120.05 Q66.1 -121.2 66.4 -121.6 L66.75 -121.85 M-18.2 -126.4 Q-18.0 -127.85 -16.4 -127.75 L-16.05 -127.7 Q-14.6 -127.55 -14.65 -126.0 -14.65 -125.4 -15.15 -124.8 -15.55 -124.3 -16.1 -124.15 L-16.5 -124.1 -17.15 -124.15 -17.45 -124.25 -18.1 -124.65 -18.2 -125.05 -18.25 -126.0 -18.2 -126.4 M-11.2 -130.3 L-11.45 -130.8 Q-11.4 -133.1 -9.55 -132.1 L-8.55 -131.45 Q-7.6 -130.65 -7.35 -129.6 L-7.45 -128.7 -7.9 -128.4 -9.0 -128.15 Q-9.9 -128.15 -11.2 -130.3 M5.35 -135.45 Q5.2 -137.1 5.2 -138.7 5.3 -141.6 6.5 -142.75 7.5 -143.8 9.0 -143.15 12.5 -141.6 12.4 -136.35 L12.4 -136.25 12.3 -135.3 Q12.1 -133.9 11.4 -132.35 10.0 -129.5 7.75 -129.5 6.4 -129.5 5.8 -132.75 5.6 -133.4 5.55 -134.15 L5.35 -135.45 M29.65 -131.55 Q31.45 -133.05 31.35 -130.35 31.3 -128.3 29.15 -127.7 L27.85 -129.0 Q27.85 -130.1 29.65 -131.55 M-0.45 -130.0 L-0.45 -129.9 Q-0.45 -129.0 -0.95 -128.5 -1.35 -128.05 -1.95 -128.05 -2.9 -128.05 -3.4 -128.55 L-3.8 -129.35 -3.85 -130.15 Q-3.8 -131.8 -2.1 -131.8 -0.45 -131.8 -0.45 -130.0 M62.6 -124.2 L62.65 -124.15 62.85 -123.2 Q62.8 -122.75 62.4 -122.45 L61.5 -122.05 60.7 -122.35 Q60.4 -122.6 60.4 -123.3 60.45 -123.85 61.0 -124.15 L61.1 -124.2 Q61.8 -124.5 62.6 -124.2 M42.8 -126.6 L42.55 -126.2 41.3 -125.55 40.05 -126.8 Q40.1 -127.4 40.6 -127.85 41.05 -128.4 41.8 -128.45 L42.55 -128.2 Q42.9 -128.05 42.9 -127.35 L42.8 -126.6 M47.65 -124.15 Q48.75 -123.5 48.75 -122.3 L48.4 -121.25 Q47.95 -120.65 47.0 -120.6 L45.85 -122.0 Q45.85 -123.1 47.5 -124.15 L47.55 -124.2 47.65 -124.15 M56.15 -125.1 L56.25 -124.3 56.25 -124.15 Q56.05 -123.4 54.75 -122.4 53.55 -123.55 53.55 -123.8 L53.6 -124.15 Q53.8 -125.85 56.1 -125.35 L56.15 -125.1 M59.15 -120.05 Q60.95 -120.0 60.9 -118.3 60.9 -117.7 60.45 -117.15 59.85 -116.45 59.05 -116.45 57.85 -116.45 57.5 -117.35 57.3 -117.75 57.35 -118.35 57.4 -120.1 59.15 -120.05 M54.6 -117.0 L55.55 -116.1 Q55.3 -115.25 54.55 -114.95 L53.35 -115.5 53.35 -115.35 53.3 -116.05 Q53.35 -116.75 53.8 -116.9 L54.6 -117.0 M65.65 -116.0 L67.3 -116.1 67.4 -115.85 67.5 -115.05 Q67.35 -114.75 67.35 -114.05 L66.2 -113.5 65.4 -113.85 Q65.1 -114.15 65.15 -114.95 65.15 -115.75 65.65 -116.0 M15.45 110.1 L20.6 109.2 Q28.8 107.55 34.6 105.05 L40.95 103.35 Q45.35 102.25 46.95 100.55 L49.9 97.7 52.65 98.8 57.5 100.35 Q49.75 104.3 43.1 106.9 L39.05 108.35 Q32.65 110.55 22.4 112.45 L16.55 113.45 15.65 113.6 15.0 113.7 -5.45 116.2 -18.95 117.45 -30.55 118.0 -42.9 117.55 -52.4 116.75 -61.95 115.3 -54.8 112.55 -54.5 112.45 Q-51.5 111.35 -48.9 110.75 L-40.45 112.45 Q-31.35 114.1 -25.2 114.1 L-8.6 112.85 -4.3 112.45 6.05 111.4 6.1 111.4 15.45 110.1" fill="#4c5354" fill-rule="evenodd" stroke="none"/>
    <path d="M16.4 -116.4 Q13.6 -116.4 12.6 -118.3 12.15 -119.25 12.2 -120.3 12.25 -122.65 16.1 -121.9 19.85 -121.1 19.8 -118.6 19.75 -117.8 18.75 -117.1 17.7 -116.4 16.4 -116.4 M33.6 -120.6 L32.4 -120.4 Q27.7 -120.4 26.35 -123.5 L29.7 -124.15 31.7 -123.65 32.15 -123.6 Q33.9 -123.2 33.85 -121.45 L33.6 -120.6 M30.4 -117.0 L33.55 -117.05 38.85 -116.6 Q43.7 -115.8 43.65 -113.9 43.65 -113.3 43.15 -112.95 L41.95 -112.75 44.55 -111.95 Q46.65 -111.15 46.65 -110.15 46.6 -109.3 43.25 -107.7 40.1 -106.2 37.4 -105.95 L36.3 -105.9 35.25 -105.95 Q32.4 -106.2 28.3 -107.7 23.25 -109.55 23.3 -110.9 23.35 -111.5 24.7 -112.5 26.1 -113.55 26.95 -113.5 L26.95 -113.7 Q25.85 -113.7 24.95 -114.8 L29.0 -115.95 Q28.5 -116.8 30.4 -117.0 M25.75 20.4 L26.7 21.3 Q28.35 23.1 28.25 25.4 28.2 27.15 27.35 28.4 L26.45 29.3 Q25.55 29.95 24.2 29.95 21.8 29.95 19.85 27.2 18.2 24.7 18.15 22.15 L18.2 20.0 19.1 19.5 19.7 19.0 21.8 18.6 Q23.6 18.6 25.75 20.4 M16.8 28.9 L17.05 28.75 Q17.85 28.75 18.65 29.55 19.45 30.4 19.45 31.05 19.45 31.95 18.55 31.95 L17.2 31.25 Q16.55 30.6 16.6 30.05 L16.8 28.9 M25.0 35.25 L24.9 34.2 Q25.2 33.95 25.6 33.95 L26.3 34.2 26.7 34.4 26.65 35.5 26.25 35.65 25.75 35.7 25.0 35.25 M-25.2 -90.0 Q-27.6 -89.05 -28.7 -89.05 -30.15 -89.0 -31.65 -88.0 -33.1 -87.0 -34.1 -87.0 -36.2 -87.0 -38.3 -88.6 -40.25 -90.1 -40.2 -91.15 -40.2 -91.6 -38.6 -91.85 L-37.9 -91.95 -34.3 -90.85 -31.55 -90.35 -29.6 -90.4 Q-28.5 -90.55 -25.5 -91.45 L-22.4 -91.45 Q-22.85 -90.95 -25.2 -90.0 M-29.15 31.5 Q-28.5 32.25 -28.5 33.25 -28.55 34.95 -32.25 40.65 -36.55 47.3 -39.95 47.3 L-40.55 47.15 Q-40.7 46.95 -40.8 46.95 L-40.6 46.0 -40.45 45.9 -40.4 45.55 -40.6 46.0 -46.05 49.95 Q-50.0 52.55 -53.1 52.55 -54.3 52.55 -54.65 52.2 -52.8 49.15 -47.2 46.05 -41.1 43.05 -39.25 41.7 -40.15 41.35 -40.25 41.2 L-40.25 40.25 Q-40.25 39.5 -36.65 36.45 L-34.2 34.25 Q-32.1 32.25 -31.3 31.1 L-30.4 30.8 Q-29.8 30.8 -29.15 31.5 M-60.3 53.9 L-59.95 53.65 -58.95 53.25 Q-56.8 53.25 -56.9 56.4 -56.9 57.3 -57.7 58.2 -58.6 59.25 -59.95 59.25 -60.9 59.25 -61.55 58.55 -62.2 57.8 -62.2 56.6 -62.15 55.55 -61.45 54.55 -60.75 54.35 -60.3 53.9 M-47.05 55.7 Q-47.85 57.95 -48.8 58.75 -49.85 59.6 -51.75 59.6 L-52.8 59.6 Q-53.45 59.4 -53.45 58.35 -53.4 57.5 -51.2 56.4 L-49.7 55.75 -48.55 55.4 -48.1 55.45 Q-47.4 55.5 -47.05 55.7" fill="#97a4a6" fill-rule="evenodd" stroke="none"/>
    <path d="M78.9 -100.35 Q80.4 -94.7 81.4 -87.5 82.15 -81.75 82.5 -76.2 82.85 -70.3 82.65 -64.55 82.35 -52.8 77.95 -38.25 L77.75 -37.5 77.3 -36.05 Q73.75 -24.3 71.65 -15.65 63.25 0.05 60.2 6.2 55.15 16.55 54.85 27.2 54.75 30.9 55.45 38.85 56.05 46.75 55.95 49.95 55.5 66.25 53.15 75.85 50.6 86.5 44.8 93.35 38.95 100.2 28.15 105.2 22.9 107.65 15.45 110.1 L6.1 111.4 6.05 111.4 -4.3 112.45 -8.6 112.85 -25.2 114.1 Q-31.35 114.1 -40.45 112.45 L-48.9 110.75 -49.9 110.5 -52.3 109.95 -53.55 109.6 Q-69.65 105.35 -69.5 100.1 -69.45 98.05 -68.2 94.95 -66.95 91.85 -66.9 89.55 -66.85 88.3 -67.2 86.7 L-67.65 85.0 -68.55 82.3 -64.1 80.45 Q-59.8 78.5 -57.7 77.8 L-59.9 80.7 Q-59.9 81.15 -58.95 82.3 L-59.05 82.5 -58.7 82.85 -56.85 85.55 -56.1 86.7 -55.85 87.05 -55.25 87.3 -42.35 91.75 Q-43.2 96.1 -39.45 99.0 -36.65 101.25 -31.6 102.35 L-23.35 104.65 Q-18.25 105.95 -13.7 105.95 -2.95 105.95 6.75 101.9 10.45 100.4 12.8 95.75 L15.95 88.5 16.35 88.3 Q18.25 87.35 19.8 86.7 L22.05 85.7 24.85 84.75 Q27.9 83.85 30.9 83.85 32.4 83.85 36.05 84.75 L37.55 85.1 36.7 84.55 38.35 84.75 40.65 84.3 Q41.6 83.75 41.6 82.3 41.65 81.45 36.75 63.95 L35.15 57.8 Q31.85 45.05 32.0 38.95 32.55 20.25 42.65 7.6 L49.55 -1.15 Q52.75 -6.05 52.9 -11.55 53.2 -23.1 56.9 -32.6 L58.1 -36.05 58.75 -38.25 Q60.6 -45.15 60.8 -52.4 L60.5 -71.8 60.7 -76.2 Q61.1 -83.7 62.4 -89.75 64.6 -100.25 68.7 -102.9 70.0 -103.8 71.6 -103.8 73.65 -103.8 75.55 -102.9 77.3 -102.05 78.9 -100.35 M8.65 -103.3 L5.55 -102.9 4.25 -102.65 2.95 -102.35 Q-0.75 -101.45 -5.45 -99.75 -15.45 -96.15 -21.45 -96.15 -24.1 -96.15 -29.15 -97.6 -18.55 -98.95 -11.35 -101.45 -8.65 -102.45 -4.8 -102.9 L3.0 -103.35 3.4 -103.35 4.3 -103.35 8.65 -103.3 M17.8 -97.55 L14.5 -96.45 4.0 -92.45 2.85 -92.05 2.65 -91.95 Q0.65 -91.1 -8.9 -85.95 -15.9 -82.15 -20.2 -82.15 L-27.15 -83.1 -27.15 -83.45 Q-24.7 -83.65 -21.95 -84.4 -17.1 -85.7 -8.8 -89.4 L2.75 -94.45 4.05 -94.95 4.65 -95.2 Q12.2 -97.95 17.7 -97.95 L17.8 -97.55 M49.65 -81.45 Q44.75 -84.55 42.75 -85.05 L35.8 -85.3 Q26.95 -85.3 19.15 -81.85 15.15 -80.1 9.4 -76.2 L6.55 -74.25 3.4 -72.05 2.05 -71.2 Q-2.75 -68.0 -5.6 -66.65 -12.9 -63.2 -20.8 -63.2 -27.6 -63.2 -35.25 -66.65 -43.25 -70.25 -46.5 -75.35 L-38.65 -72.35 Q-30.4 -69.5 -26.5 -69.5 -18.7 -69.5 -10.6 -72.65 -7.55 -73.85 -3.0 -76.2 L2.3 -79.0 3.4 -79.65 3.6 -79.75 Q12.55 -84.75 17.25 -86.65 25.25 -89.8 32.75 -89.8 45.45 -89.8 49.9 -81.75 L49.95 -81.7 49.65 -81.45 M7.1 -12.2 Q8.45 -12.2 10.65 -10.65 L15.3 -7.2 Q22.75 -2.2 32.3 -2.2 35.6 -2.2 39.7 -3.2 L45.85 -4.75 45.9 -4.45 Q44.6 2.35 37.0 8.45 31.85 12.6 26.9 13.9 L22.4 14.5 Q19.4 14.5 14.65 12.05 L7.35 7.75 7.3 8.5 Q7.3 8.9 8.65 14.4 L10.15 20.8 Q6.25 15.6 4.35 7.0 L4.3 6.9 1.9 -8.6 3.0 -9.7 Q5.75 -12.2 7.1 -12.2 M43.6 -0.85 L43.75 -1.05 43.35 -1.05 Q39.2 3.25 30.4 3.25 22.2 3.25 16.55 0.05 11.8 -2.7 7.35 -8.65 7.8 -0.5 10.4 4.1 11.3 5.75 12.5 7.0 16.2 10.9 22.85 10.9 L27.0 10.7 Q31.65 10.15 34.9 8.3 39.3 5.75 43.6 -0.85 M11.1 53.65 L11.75 54.15 Q13.35 55.4 15.05 57.35 L15.45 57.8 Q18.8 61.9 18.7 65.2 18.7 66.4 18.05 66.85 L16.25 67.15 14.2 66.6 13.35 66.25 Q12.5 69.05 10.0 71.2 6.65 74.05 2.3 74.05 L-3.5 73.45 Q-8.15 73.45 -11.55 76.45 -15.0 79.45 -18.4 79.45 -21.4 79.45 -23.1 78.1 -24.15 77.3 -26.1 74.35 -27.7 72.25 -29.45 71.6 -30.6 71.2 -32.1 70.15 L-32.15 66.55 Q-32.15 65.05 -30.2 65.05 -29.4 65.05 -24.75 70.05 -20.0 75.1 -16.65 75.1 -14.0 75.1 -11.3 71.7 -8.5 68.25 -5.6 68.25 -3.1 68.25 -0.35 70.45 2.35 72.6 3.7 72.6 7.25 72.6 9.35 68.25 11.15 64.85 11.3 60.65 L11.35 57.8 11.3 56.7 11.15 54.6 11.1 53.65 M-35.25 67.5 Q-36.25 67.85 -37.35 68.35 L-38.9 68.35 Q-37.35 65.1 -35.45 62.95 L-35.4 66.7 -35.25 67.5 M-28.6 46.7 Q-26.65 43.5 -24.75 38.75 L-25.0 43.55 -24.85 49.0 -24.9 49.0 Q-26.4 47.05 -28.6 46.7 M-23.35 23.85 L-23.3 23.45 Q-22.25 16.1 -20.7 8.35 L-20.4 7.0 Q-15.0 -19.75 -13.5 -28.7 L-12.95 -29.25 Q-11.5 -30.65 -9.85 -30.65 -5.95 -30.65 -4.4 -20.15 L-4.2 -18.8 -4.25 -2.05 Q-4.35 2.25 -4.75 7.0 -5.5 16.3 -7.35 27.25 -11.55 52.9 -18.2 52.9 -21.9 52.9 -23.25 44.3 -23.8 40.55 -23.85 36.25 L-23.85 32.7 -23.35 23.85 M-6.45 36.4 L-6.25 38.35 Q-5.6 42.25 -3.4 44.7 L-5.1 45.25 -7.65 46.1 Q-7.3 43.95 -7.1 41.4 L-6.45 36.4 M17.95 43.05 Q17.15 42.0 13.5 35.95 8.95 28.55 8.65 22.05 14.4 33.8 21.8 45.95 L21.8 46.05 22.0 46.9 Q20.05 45.95 17.95 43.05 M20.05 90.0 Q21.25 90.6 23.9 91.05 L28.05 91.5 Q30.75 91.5 33.15 88.95 L35.0 86.45 Q31.55 85.5 30.45 85.5 28.8 85.5 25.5 86.85 22.2 88.25 20.2 89.75 L20.15 89.85 20.15 89.9 20.05 90.0 M-38.8 -0.9 L-31.8 -3.2 Q-28.1 -3.95 -24.7 -6.3 -21.85 -8.3 -18.65 -11.8 L-18.7 -10.55 Q-22.4 0.55 -25.9 7.0 L-26.8 8.55 Q-32.6 18.45 -43.0 27.1 L-38.7 19.75 -33.8 11.9 -34.1 11.9 Q-36.2 14.65 -41.9 17.9 -47.8 21.2 -50.9 21.2 -54.3 21.2 -59.6 12.4 L-62.75 7.0 -64.7 3.45 -64.6 3.2 Q-63.95 2.0 -62.55 0.85 -60.35 -0.95 -58.1 -0.95 L-46.0 0.7 Q-43.3 0.7 -38.8 -0.9 M-29.0 4.7 L-27.35 3.05 -27.3 2.6 Q-29.6 4.2 -32.85 5.25 -38.1 6.9 -44.65 6.9 -48.9 6.9 -55.05 5.4 -59.25 4.35 -61.7 3.25 -61.1 4.75 -59.25 7.0 L-57.35 9.2 Q-52.3 14.85 -48.5 14.85 -41.0 14.85 -34.4 9.65 L-31.35 7.0 -29.0 4.7 M-36.4 26.35 Q-37.15 31.0 -40.5 34.8 -44.6 39.4 -53.85 44.15 -49.55 40.4 -43.2 33.7 L-36.4 26.35 M-27.5 107.55 L-33.55 105.1 Q-38.3 103.25 -42.1 103.25 -44.9 103.25 -47.05 104.15 -49.35 105.1 -49.4 106.4 -49.45 108.55 -44.1 109.85 L-43.4 110.0 -40.5 110.5 -29.0 111.4 -24.25 111.4 Q-21.95 111.05 -21.9 109.15 -21.85 107.95 -25.45 107.35 L-27.5 107.55" fill="#7d888a" fill-rule="evenodd" stroke="none"/>
    <path d="M71.5 -15.1 L72.4 -17.0 74.45 -20.7 Q79.7 -29.2 85.2 -29.2 87.75 -29.2 89.15 -25.95 90.2 -23.3 90.15 -20.5 90.0 -15.7 87.7 -9.95 L82.6 0.75 Q75.15 15.7 74.75 29.25 74.6 34.05 76.5 38.8 77.5 41.4 80.65 46.85 83.65 52.1 84.8 55.4 L85.55 57.8 Q86.6 61.9 86.5 66.3 86.3 72.35 82.2 76.2 78.45 79.85 73.5 79.85 65.5 79.85 61.9 73.35 60.45 70.8 59.85 67.65 L60.7 62.7 60.25 62.65 Q59.85 61.3 59.9 58.55 L60.0 57.8 60.0 57.3 Q60.2 56.4 60.55 55.65 L60.55 55.6 60.25 55.6 Q60.55 53.4 61.3 50.65 62.55 45.75 62.6 42.95 L62.3 30.4 Q61.85 21.8 62.0 17.95 62.15 11.7 65.15 4.15 L69.1 -5.8 69.75 -7.4 69.85 -7.7 70.4 -9.1 70.1 -9.2 70.15 -9.5 70.3 -10.05 71.5 -15.1 M-68.75 58.25 L-69.3 58.05 -69.75 57.8 Q-71.15 57.1 -72.25 55.85 -74.45 53.3 -74.35 50.0 -74.2 45.0 -71.45 36.95 -68.75 28.85 -68.6 23.6 -68.45 19.2 -73.05 7.05 L-73.05 7.0 Q-77.7 -5.05 -77.5 -12.7 -77.4 -15.55 -76.4 -19.5 -74.85 -25.4 -72.35 -25.4 -71.6 -25.4 -70.8 -24.85 L-71.0 -21.85 Q-71.1 -19.65 -69.05 -4.35 -68.3 1.7 -67.85 7.0 -67.25 15.0 -67.4 21.15 L-68.85 42.5 -68.75 54.0 -68.7 57.8 -68.75 58.25 M43.35 -1.05 L43.6 -0.85 Q39.3 5.75 34.9 8.3 31.65 10.15 27.0 10.7 L22.85 10.9 Q16.2 10.9 12.5 7.0 11.3 5.75 10.4 4.1 7.8 -0.5 7.35 -8.65 11.8 -2.7 16.55 0.05 22.2 3.25 30.4 3.25 39.2 3.25 43.35 -1.05 M80.85 -6.4 L81.3 -4.85 83.4 -8.85 Q85.15 -12.8 85.25 -16.0 85.3 -17.4 84.95 -18.7 84.45 -20.5 83.35 -20.5 77.55 -20.5 71.35 -2.85 69.1 3.5 67.4 10.35 65.95 16.35 65.85 18.5 65.85 19.65 68.6 22.8 71.3 26.05 71.2 29.3 71.15 31.6 68.5 32.95 65.8 34.3 65.75 36.35 65.65 38.9 67.4 43.6 69.05 48.3 69.0 50.45 L67.65 56.1 67.2 57.8 Q66.3 61.25 66.25 62.9 66.15 66.4 67.3 67.9 68.75 69.7 72.65 69.7 75.1 69.7 77.75 68.1 80.55 66.4 81.3 63.95 L81.4 59.65 79.4 59.65 77.45 60.65 Q75.9 61.45 75.0 61.45 72.75 61.45 71.95 57.8 L71.6 56.3 Q71.3 53.65 71.4 50.6 L69.8 44.55 Q68.9 40.5 68.95 38.5 69.0 36.7 71.1 33.5 73.15 30.35 73.25 27.3 73.4 23.3 71.7 19.0 70.05 14.65 70.05 13.95 70.15 9.9 72.8 1.85 76.0 -7.9 79.3 -7.9 80.3 -7.9 80.85 -6.4 M-24.75 38.75 Q-24.35 31.5 -23.35 23.85 L-23.85 32.7 -23.85 36.25 Q-23.8 40.55 -23.25 44.3 -21.9 52.9 -18.2 52.9 -11.55 52.9 -7.35 27.25 -5.5 16.3 -4.75 7.0 -4.35 2.25 -4.25 -2.05 L-4.2 -18.8 Q-3.45 -12.7 -3.6 -6.45 L-4.25 7.0 -4.8 15.95 -5.95 34.0 -6.45 36.4 -7.1 41.4 Q-7.3 43.95 -7.65 46.1 -8.1 50.4 -8.7 53.05 -9.15 55.65 -9.75 57.8 -11.75 64.55 -15.0 67.1 -16.95 68.6 -19.4 68.6 -23.05 68.6 -23.9 64.3 L-23.95 63.8 Q-24.3 61.55 -24.2 57.8 L-24.2 57.45 -24.85 49.05 -24.85 49.0 -25.0 43.55 -24.75 38.75 M-29.0 4.7 L-31.35 7.0 -34.4 9.65 Q-41.0 14.85 -48.5 14.85 -52.3 14.85 -57.35 9.2 L-59.25 7.0 Q-61.1 4.75 -61.7 3.25 -59.25 4.35 -55.05 5.4 -48.9 6.9 -44.65 6.9 -38.1 6.9 -32.85 5.25 -29.6 4.2 -27.3 2.6 L-27.35 3.05 -29.0 4.7" fill="#717c7d" fill-rule="evenodd" stroke="none"/>
    <path d="M80.85 -6.4 Q80.3 -7.9 79.3 -7.9 76.0 -7.9 72.8 1.85 70.15 9.9 70.05 13.95 70.05 14.65 71.7 19.0 73.4 23.3 73.25 27.3 73.15 30.35 71.1 33.5 69.0 36.7 68.95 38.5 68.9 40.5 69.8 44.55 L71.4 50.6 Q71.3 53.65 71.6 56.3 L71.95 57.8 Q72.75 61.45 75.0 61.45 75.9 61.45 77.45 60.65 L79.4 59.65 81.4 59.65 81.3 63.95 Q80.55 66.4 77.75 68.1 75.1 69.7 72.65 69.7 68.75 69.7 67.3 67.9 66.15 66.4 66.25 62.9 66.3 61.25 67.2 57.8 L67.65 56.1 69.0 50.45 Q69.05 48.3 67.4 43.6 65.65 38.9 65.75 36.35 65.8 34.3 68.5 32.95 71.15 31.6 71.2 29.3 71.3 26.05 68.6 22.8 65.85 19.65 65.85 18.5 65.95 16.35 67.4 10.35 69.1 3.5 71.35 -2.85 77.55 -20.5 83.35 -20.5 84.45 -20.5 84.95 -18.7 85.3 -17.4 85.25 -16.0 85.15 -12.8 83.4 -8.85 L81.3 -4.85 80.85 -6.4" fill="#5f6869" fill-rule="evenodd" stroke="none"/>
    <path d="M71.65 -15.65 L71.5 -15.1 Q70.15 -12.0 70.3 -10.05 L70.15 -9.5 70.1 -9.2 70.4 -9.1 69.85 -7.7 69.75 -7.4 69.1 -5.8 65.15 4.15 Q62.15 11.7 62.0 17.95 61.85 21.8 62.3 30.4 L62.6 42.95 Q62.55 45.75 61.3 50.65 60.55 53.4 60.25 55.6 L60.55 55.65 Q60.2 56.4 60.0 57.3 L60.0 57.8 59.9 58.55 Q59.85 61.3 60.25 62.65 L60.7 62.7 59.85 67.65 Q57.9 78.55 54.5 90.65 L53.15 93.75 51.15 96.4 49.9 97.7 46.95 100.55 Q45.35 102.25 40.95 103.35 L34.6 105.05 Q28.8 107.55 20.6 109.2 L15.45 110.1 Q22.9 107.65 28.15 105.2 38.95 100.2 44.8 93.35 50.6 86.5 53.15 75.85 55.5 66.25 55.95 49.95 56.05 46.75 55.45 38.85 54.75 30.9 54.85 27.2 55.15 16.55 60.2 6.2 63.25 0.05 71.65 -15.65 M69.5 -7.9 L69.8 -7.75 69.85 -7.8 69.5 -7.9 69.5 -8.6 Q69.1 -8.6 69.05 -7.5 L69.5 -7.9" fill="#747d80" fill-rule="evenodd" stroke="none"/>
    <path d="M69.5 -7.9 L69.85 -7.8 69.8 -7.75 69.5 -7.9" fill="#7f8f91" fill-rule="evenodd" stroke="none"/>
    <path d="M17.05 28.75 L16.8 28.9 16.85 28.75 17.05 28.75" fill="#979c8d" fill-rule="evenodd" stroke="none"/>
    <path d="M-32.1 70.15 L-32.15 70.45 Q-34.55 71.35 -35.25 67.5 L-35.4 66.7 -35.45 62.95 -35.45 60.15 -35.0 61.05 Q-34.15 62.4 -32.3 62.4 L-30.1 62.05 -28.1 61.65 Q-26.7 61.65 -24.25 63.6 L-23.95 63.8 -23.9 64.3 Q-23.05 68.6 -19.4 68.6 -16.95 68.6 -15.0 67.1 -13.7 66.55 -12.15 65.65 -8.95 63.7 -6.25 63.7 -4.8 63.7 -2.35 65.1 0.2 66.5 2.45 66.5 8.2 66.5 10.0 62.45 10.55 61.3 11.3 56.7 L11.35 57.8 11.3 60.65 Q11.15 64.85 9.35 68.25 7.25 72.6 3.7 72.6 2.35 72.6 -0.35 70.45 -3.1 68.25 -5.6 68.25 -8.5 68.25 -11.3 71.7 -14.0 75.1 -16.65 75.1 -20.0 75.1 -24.75 70.05 -29.4 65.05 -30.2 65.05 -32.15 65.05 -32.15 66.55 L-32.1 70.15" fill="#4f5759" fill-rule="evenodd" stroke="none"/>
    <path d="M-3.4 44.7 Q-1.25 44.05 0.15 44.05 7.6 44.05 9.95 49.15 10.75 50.8 11.1 53.65 L11.15 54.6 11.3 56.7 Q10.55 61.3 10.0 62.45 8.2 66.5 2.45 66.5 0.2 66.5 -2.35 65.1 -4.8 63.7 -6.25 63.7 -8.95 63.7 -12.15 65.65 -13.7 66.55 -15.0 67.1 -11.75 64.55 -9.75 57.8 -9.15 55.65 -8.7 53.05 -8.1 50.4 -7.65 46.1 L-5.1 45.25 -3.4 44.7 M-35.45 60.15 L-35.4 59.05 -35.35 57.8 -35.35 56.5 -35.15 50.95 Q-34.2 46.65 -29.45 46.65 L-28.6 46.7 Q-26.4 47.05 -24.9 49.0 L-24.85 49.05 -24.2 57.45 -24.2 57.8 Q-24.3 61.55 -23.95 63.8 L-24.25 63.6 Q-26.7 61.65 -28.1 61.65 L-30.1 62.05 -32.3 62.4 Q-34.15 62.4 -35.0 61.05 L-35.45 60.15" fill="#5c6566" fill-rule="evenodd" stroke="none"/>
    <path d="M15.95 88.5 L12.8 95.75 Q10.45 100.4 6.75 101.9 -2.95 105.95 -13.7 105.95 -18.25 105.95 -23.35 104.65 L-31.6 102.35 Q-36.65 101.25 -39.45 99.0 -43.2 96.1 -42.35 91.75 L-39.1 92.75 Q-28.95 95.6 -19.25 95.6 0.1 95.6 13.35 89.75 L15.95 88.5" fill="#535b5c" fill-rule="evenodd" stroke="none"/>
    <path d="M-29.4 87.9 L-27.75 87.9 -24.0 87.9 -11.1 87.9 Q-4.1 87.7 0.65 86.7 L1.3 86.55 Q9.4 84.7 14.05 82.5 L19.05 79.4 Q22.65 77.1 23.9 77.1 L25.05 77.4 Q27.3 78.25 32.65 81.75 L36.7 84.55 37.55 85.1 36.05 84.75 Q32.4 83.85 30.9 83.85 27.9 83.85 24.85 84.75 L22.05 85.7 19.8 86.7 Q18.25 87.35 16.35 88.3 L15.95 88.5 13.35 89.75 Q0.1 95.6 -19.25 95.6 -28.95 95.6 -39.1 92.75 L-42.35 91.75 -55.25 87.3 -55.85 87.05 -56.1 86.7 -56.85 85.55 -58.7 82.85 -59.05 82.5 -58.95 82.3 -58.85 82.15 -58.25 82.5 Q-52.85 85.35 -46.95 86.7 L-41.9 87.55 -29.4 87.9" fill="#4b5354" fill-rule="evenodd" stroke="none"/>
    <path d="M53.15 93.75 Q54.5 94.6 58.8 96.6 L61.5 98.25 Q63.2 99.65 63.15 101.2 63.05 105.25 62.25 112.45 L62.0 114.55 Q61.0 122.15 60.75 126.0 L60.6 127.6 60.4 140.65 60.3 143.35 44.3 143.35 Q45.0 138.35 46.45 133.0 47.4 129.45 47.95 126.0 48.7 121.55 48.8 117.2 48.9 114.35 47.75 112.45 L47.55 112.2 43.1 106.9 Q49.75 104.3 57.5 100.35 L52.65 98.8 49.9 97.7 51.15 96.4 53.15 93.75" fill="#bccccf" fill-rule="evenodd" stroke="none"/>
    <path d="M44.3 143.35 L16.9 143.35 Q17.7 135.45 19.0 126.0 L19.75 120.8 19.95 114.5 Q18.7 113.85 16.55 113.45 L22.4 112.45 Q32.65 110.55 39.05 108.35 L43.1 106.9 47.55 112.2 47.75 112.45 Q48.9 114.35 48.8 117.2 48.7 121.55 47.95 126.0 47.4 129.45 46.45 133.0 45.0 138.35 44.3 143.35 M28.55 117.7 L28.4 117.85 Q27.45 119.35 27.4 121.05 27.35 122.95 29.1 124.45 30.6 125.8 31.95 125.8 34.4 125.8 36.35 123.55 38.25 121.4 38.3 119.0 38.4 116.2 36.15 114.95 34.6 114.05 32.1 114.05 30.6 114.05 29.45 115.05 28.25 116.1 28.55 117.7" fill="#adcbcf" fill-rule="evenodd" stroke="none"/>
    <path d="M28.55 117.7 Q28.25 116.1 29.45 115.05 30.6 114.05 32.1 114.05 34.6 114.05 36.15 114.95 38.4 116.2 38.3 119.0 38.25 121.4 36.35 123.55 34.4 125.8 31.95 125.8 30.6 125.8 29.1 124.45 27.35 122.95 27.4 121.05 27.45 119.35 28.4 117.85 L28.55 117.7" fill="#1a383c" fill-rule="evenodd" stroke="none"/>
    <path d="M16.9 143.35 L14.7 143.35 15.8 134.3 16.8 126.0 17.5 117.55 Q17.55 115.9 16.8 115.1 L15.0 113.7 15.65 113.6 16.55 113.45 Q18.7 113.85 19.95 114.5 L19.75 120.8 19.0 126.0 Q17.7 135.45 16.9 143.35 M-51.05 143.35 L-65.95 143.35 -66.0 141.8 -66.25 129.85 -65.95 126.0 -65.6 123.0 Q-65.0 117.55 -64.95 116.15 -64.85 113.8 -62.85 112.45 L-61.85 111.85 Q-58.9 110.85 -57.35 109.95 L-53.55 109.6 -52.3 109.95 -49.9 110.5 -48.9 110.75 Q-51.5 111.35 -54.5 112.45 L-54.8 112.55 -61.95 115.3 -52.4 116.75 -42.9 117.55 -46.35 118.55 Q-48.85 119.25 -49.65 120.15 -50.55 121.25 -50.85 124.2 L-50.95 126.0 -51.2 133.6 Q-51.35 138.85 -51.05 143.35" fill="#bedfe3" fill-rule="evenodd" stroke="none"/>
    <path d="M14.7 143.35 L-21.65 143.35 -19.85 126.0 -18.95 117.45 -5.45 116.2 15.0 113.7 16.8 115.1 Q17.55 115.9 17.5 117.55 L16.8 126.0 15.8 134.3 14.7 143.35" fill="#9cb6ba" fill-rule="evenodd" stroke="none"/>
    <path d="M-70.8 -24.85 Q-70.45 -27.9 -69.55 -30.05 -68.85 -31.7 -67.7 -33.05 L-66.6 -30.85 -63.4 -25.1 Q-57.65 -16.5 -57.75 -14.3 -57.8 -12.85 -61.8 -8.45 -65.9 -4.05 -66.0 -0.25 -66.05 1.95 -65.15 6.5 L-65.05 7.0 Q-64.3 10.9 -64.55 13.45 -64.8 16.4 -64.55 22.3 L-64.25 28.15 Q-64.4 32.2 -66.95 44.25 L-68.75 54.0 -68.85 42.5 -67.4 21.15 Q-67.25 15.0 -67.85 7.0 -68.3 1.7 -69.05 -4.35 -71.1 -19.65 -71.0 -21.85 L-70.8 -24.85 M-55.75 -69.8 L-54.65 -72.95 -53.5 -76.2 Q-47.25 -94.05 -41.5 -102.45 L-41.15 -102.9 -39.0 -105.95 Q-30.4 -117.5 -21.5 -124.15 L-19.6 -125.5 -18.2 -126.4 -18.25 -126.0 -18.2 -125.05 -18.1 -124.65 -17.45 -124.25 -17.15 -124.15 -16.5 -124.1 -16.1 -124.15 Q-15.55 -124.3 -15.15 -124.8 -14.65 -125.4 -14.65 -126.0 -14.6 -127.55 -16.05 -127.7 -13.7 -129.1 -11.2 -130.3 -9.9 -128.15 -9.0 -128.15 L-7.9 -128.4 -7.45 -128.7 -7.35 -129.6 Q-7.6 -130.65 -8.55 -131.45 -2.0 -134.15 5.35 -135.45 L5.55 -134.15 Q5.6 -133.4 5.8 -132.75 L5.1 -132.45 -0.45 -130.0 Q-0.45 -131.8 -2.1 -131.8 -3.8 -131.8 -3.85 -130.15 L-3.8 -129.35 -3.4 -128.55 -9.6 -125.2 -22.95 -116.45 Q-29.3 -111.85 -34.5 -106.6 L-35.15 -105.95 -37.75 -102.9 Q-40.65 -99.25 -43.25 -94.55 L-49.7 -81.65 -52.55 -76.2 -55.75 -69.8 M-58.25 82.5 L-42.5 70.6 -42.5 71.25 -45.35 75.4 Q-47.75 78.9 -47.75 79.6 -47.8 81.0 -39.7 84.25 L-33.2 86.7 -29.4 87.9 -41.9 87.55 -46.95 86.7 Q-52.85 85.35 -58.25 82.5" fill="#98a6a8" fill-rule="evenodd" stroke="none"/>
    <path d="M-21.65 143.35 L-51.05 143.35 Q-51.35 138.85 -51.2 133.6 L-50.95 126.0 -50.85 124.2 Q-50.55 121.25 -49.65 120.15 -48.85 119.25 -46.35 118.55 L-42.9 117.55 -30.55 118.0 -18.95 117.45 -19.85 126.0 -21.65 143.35" fill="#a2bec2" fill-rule="evenodd" stroke="none"/>
    <path d="M-65.95 143.35 L-71.65 143.35 -71.15 126.25 -71.1 126.0 Q-70.65 123.75 -70.4 117.75 -70.15 115.25 -69.5 113.8 L-68.65 112.45 Q-68.2 111.95 -67.55 111.8 -61.5 110.5 -57.35 109.95 -58.9 110.85 -61.85 111.85 L-62.85 112.45 Q-64.85 113.8 -64.95 116.15 -65.0 117.55 -65.6 123.0 L-65.95 126.0 -66.25 129.85 -66.0 141.8 -65.95 143.35" fill="#d3f7fc" fill-rule="evenodd" stroke="none"/>
    <path d="M-47.5 -100.45 L-47.25 -100.8 -44.45 -101.3 -41.1 -95.7 -38.75 -91.95 Q-37.65 -89.9 -38.2 -88.0 -38.8 -85.75 -41.8 -84.05 -45.1 -82.2 -52.35 -79.05 -59.65 -75.85 -63.2 -73.8 L-75.25 -66.45 Q-77.7 -65.05 -79.15 -64.85 L-79.7 -64.9 -73.0 -69.35 -65.0 -74.35 Q-62.0 -76.05 -56.25 -78.4 -50.4 -80.8 -45.95 -83.35 -43.0 -85.0 -42.1 -85.8 -41.25 -86.55 -41.45 -87.2 L-42.5 -88.85 Q-43.5 -90.25 -43.85 -91.9 -44.55 -94.85 -47.5 -100.45" fill="#383e40" fill-rule="evenodd" stroke="none"/>
    <path d="M-47.5 -100.45 Q-44.55 -94.85 -43.85 -91.9 -43.5 -90.25 -42.5 -88.85 L-41.45 -87.2 Q-41.25 -86.55 -42.1 -85.8 -43.0 -85.0 -45.95 -83.35 -50.4 -80.8 -56.25 -78.4 -62.0 -76.05 -65.0 -74.35 L-73.0 -69.35 -79.7 -64.9 -80.25 -64.45 -80.9 -65.25 -81.25 -65.65 -82.55 -67.4 -84.05 -69.65 Q-85.6 -72.5 -85.8 -73.55 -85.95 -74.95 -84.5 -76.25 -83.25 -77.35 -79.2 -79.6 L-68.6 -85.55 -61.85 -89.75 Q-57.65 -92.3 -54.9 -93.55 -51.85 -94.9 -49.95 -97.4 L-47.5 -100.45" fill="#4b5354" fill-rule="evenodd" stroke="none"/>
    <path d="M19.9 -86.65 L19.85 -86.75 Q19.75 -88.55 20.85 -90.85 L23.2 -95.1 24.95 -98.05 Q26.2 -99.2 28.25 -98.0 28.95 -97.6 29.65 -96.15 30.3 -94.65 31.2 -94.1 L33.7 -91.95 35.05 -90.5 37.95 -89.35 40.75 -88.2 49.25 -82.5 57.85 -76.5 Q62.6 -73.25 64.35 -71.2 L65.35 -69.75 65.35 -69.7 Q65.7 -68.6 63.7 -65.3 62.25 -62.95 61.8 -62.65 60.4 -61.65 57.35 -63.2 L52.65 -65.3 Q48.8 -67.1 47.2 -68.05 41.15 -71.6 29.0 -80.15 L19.9 -86.65" fill="#4b5354" fill-rule="evenodd" stroke="none"/>
    <path d="M65.35 -69.7 L67.05 -67.1 Q67.5 -65.8 66.45 -64.0 64.25 -60.35 59.95 -60.85 55.95 -61.25 49.05 -65.35 45.95 -67.15 40.0 -71.05 L31.3 -76.85 Q22.9 -82.35 20.05 -86.35 L19.85 -86.65 19.9 -86.65 29.0 -80.15 Q41.15 -71.6 47.2 -68.05 48.8 -67.1 52.65 -65.3 L57.35 -63.2 Q60.4 -61.65 61.8 -62.65 62.25 -62.95 63.7 -65.3 65.7 -68.6 65.35 -69.7" fill="#383e40" fill-rule="evenodd" stroke="none"/>
    <path d="M26.35 -53.65 Q38.65 -53.45 44.45 -49.9 L35.05 -42.65 30.85 -42.65 Q21.45 -42.65 14.35 -38.9 L26.35 -53.65 M-4.55 -11.85 L-5.5 -14.45 3.6 -25.65 Q3.3 -24.1 3.25 -22.4 3.2 -20.9 3.85 -18.4 L-4.55 -11.85 M-6.3 -25.15 Q-5.55 -32.35 -1.4 -39.05 1.55 -43.85 5.5 -46.65 L7.7 -48.05 8.75 -48.65 10.2 -49.3 Q12.85 -51.0 15.95 -52.05 L18.1 -52.7 -6.3 -25.15 M-27.3 -44.75 Q-25.5 -42.85 -24.25 -40.1 L-23.35 -37.7 -24.6 -36.8 -27.35 -38.0 Q-30.1 -38.85 -34.65 -39.05 L-27.3 -44.75 M-72.6 -0.95 L-77.15 -6.05 -68.2 -13.0 Q-67.95 -9.65 -66.35 -5.6 L-72.6 -0.95 M-80.7 -18.15 L-80.7 -19.7 Q-80.45 -28.2 -75.6 -36.0 -71.6 -42.65 -65.5 -45.55 L-64.05 -46.25 Q-61.4 -47.9 -58.3 -49.0 L-55.25 -49.9 -80.7 -18.15" fill="#bfc2c7" fill-rule="evenodd" stroke="none"/>
    <path d="M5.5 -46.65 Q4.6 -51.65 1.3 -55.55 L1.15 -55.65 Q-2.25 -59.6 -6.8 -60.7 L-10.8 -61.2 Q-16.7 -61.2 -24.45 -54.25 -28.15 -51.05 -31.0 -47.45 -32.05 -48.05 -33.35 -48.45 -30.45 -55.0 -24.2 -59.55 -17.65 -64.25 -11.15 -64.25 -2.7 -64.25 2.35 -59.3 6.65 -55.05 7.7 -48.05 L5.5 -46.65" fill="#3c4044" fill-rule="evenodd" stroke="none"/>
    <path d="M18.1 -52.7 Q21.55 -53.65 24.95 -53.65 L26.35 -53.65 14.35 -38.9 12.5 -37.85 Q5.05 -33.2 3.6 -25.65 L-5.5 -14.45 Q-6.6 -18.25 -6.45 -22.8 L-6.3 -25.15 18.1 -52.7 M44.45 -49.9 L45.95 -48.8 Q48.5 -46.65 50.0 -43.2 51.65 -39.3 52.1 -33.7 50.35 -34.7 48.6 -36.75 45.65 -40.2 44.25 -40.9 41.55 -42.35 37.8 -42.65 L35.05 -42.65 44.45 -49.9 M2.7 -3.2 L1.95 -3.75 -3.75 -10.15 -4.55 -11.85 3.85 -18.4 Q4.75 -15.05 6.95 -9.85 10.95 -0.45 17.75 1.95 9.3 0.85 3.75 -2.5 L2.7 -3.2 M-27.95 -45.45 L-28.1 -45.2 -27.9 -45.35 -27.3 -44.75 -34.65 -39.05 -37.8 -39.15 Q-50.1 -39.15 -58.35 -33.45 -67.9 -26.85 -68.25 -14.9 L-68.2 -13.0 -77.15 -6.05 -78.0 -7.05 Q-80.55 -11.8 -80.7 -18.15 L-55.25 -49.9 -49.3 -50.6 Q-39.3 -50.6 -33.35 -48.45 -32.05 -48.05 -31.0 -47.45 L-28.3 -45.7 -27.95 -45.45 M-71.55 -0.1 L-72.35 -0.65 -72.6 -0.95 -66.35 -5.6 -65.15 -2.85 -61.35 4.15 Q-66.6 2.95 -70.55 0.55 L-71.55 -0.1 M-22.85 -35.6 L-24.6 -36.8 -23.35 -37.7 -22.85 -35.6" fill="#bfc2c7" fill-opacity="0.7254902" fill-rule="evenodd" stroke="none"/>
    <path d="M35.05 -42.65 L37.8 -42.65 Q41.55 -42.35 44.25 -40.9 45.65 -40.2 48.6 -36.75 50.35 -34.7 52.1 -33.7 L52.2 -27.7 Q51.85 -16.9 45.8 -8.05 38.45 2.55 26.7 2.55 L17.75 1.95 Q10.95 -0.45 6.95 -9.85 4.75 -15.05 3.85 -18.4 L35.05 -42.65 M14.35 -38.9 L3.6 -25.65 Q5.05 -33.2 12.5 -37.85 L14.35 -38.9 M-68.2 -13.0 L-68.25 -14.9 Q-67.9 -26.85 -58.35 -33.45 -50.1 -39.15 -37.8 -39.15 L-34.65 -39.05 -68.2 -13.0 M-61.35 4.15 L-65.15 -2.85 -66.35 -5.6 -24.6 -36.8 -22.85 -35.6 Q-21.85 -30.9 -22.05 -24.65 -22.35 -13.85 -28.45 -5.0 -35.8 5.6 -47.55 5.6 -55.35 5.6 -61.35 4.15" fill="#d2d5db" fill-rule="evenodd" stroke="none"/>
    <path d="M14.35 -38.9 Q21.45 -42.65 30.85 -42.65 L35.05 -42.65 3.85 -18.4 Q3.2 -20.9 3.25 -22.4 3.3 -24.1 3.6 -25.65 L14.35 -38.9 M-68.2 -13.0 L-34.65 -39.05 Q-30.1 -38.85 -27.35 -38.0 L-24.6 -36.8 -66.35 -5.6 Q-67.95 -9.65 -68.2 -13.0" fill="#f2f6fc" fill-rule="evenodd" stroke="none"/>
    <path d="M50.0 -43.2 L58.6 -33.1 58.8 -32.35 Q60.5 -27.0 60.3 -19.05 59.95 -8.2 53.85 0.6 46.5 11.2 34.75 11.2 19.2 11.2 10.8 5.5 L8.55 3.75 2.5 -3.05 2.7 -3.2 3.75 -2.5 Q9.3 0.85 17.75 1.95 L26.7 2.55 Q38.45 2.55 45.8 -8.05 51.85 -16.9 52.2 -27.7 L52.1 -33.7 Q51.65 -39.3 50.0 -43.2 M-24.25 -40.1 L-15.65 -30.05 -15.4 -29.25 Q-13.75 -23.9 -14.0 -15.95 -14.3 -5.1 -20.35 3.7 -27.75 14.3 -39.5 14.3 -55.05 14.3 -63.5 8.55 L-65.75 6.85 -71.7 0.0 -71.55 -0.1 -70.55 0.55 Q-66.6 2.95 -61.35 4.15 -55.35 5.6 -47.55 5.6 -35.8 5.6 -28.45 -5.0 -22.35 -13.85 -22.05 -24.65 -21.85 -30.9 -22.85 -35.6 L-23.35 -37.7 -24.25 -40.1" fill="#818387" fill-rule="evenodd" stroke="none"/>
    <path d="M1.15 -55.65 L-3.65 -58.5 Q-5.4 -59.45 -6.2 -59.45 L-8.85 -59.15 Q-13.45 -58.2 -19.2 -54.05 -25.2 -49.7 -27.95 -45.45 L-28.3 -45.7 -31.0 -47.45 Q-28.15 -51.05 -24.45 -54.25 -16.7 -61.2 -10.8 -61.2 L-6.8 -60.7 Q-2.25 -59.6 1.15 -55.65" fill="#212326" fill-rule="evenodd" stroke="none"/>
  </g>
</svg>
