<?xml version="1.0" encoding="UTF-8" standalone="no"?>
<svg xmlns:xlink="http://www.w3.org/1999/xlink" height="20.0px" width="20.0px" xmlns="http://www.w3.org/2000/svg">
  <g transform="matrix(1.0, 0.0, 0.0, 1.0, 70.0, 58.0)">
    <path d="M-60.0 -58.0 Q-55.85 -58.0 -52.95 -55.1 -50.0 -52.15 -50.0 -48.0 -50.0 -43.9 -52.95 -40.95 L-54.35 -39.75 Q-56.85 -38.0 -60.0 -38.0 -63.15 -38.0 -65.65 -39.75 L-67.1 -40.95 Q-70.0 -43.9 -70.0 -48.0 -70.0 -52.15 -67.1 -55.1 -64.1 -58.0 -60.0 -58.0" fill="#ee3333" fill-rule="evenodd" stroke="none"/>
  </g>
</svg>
