<?xml version="1.0" encoding="UTF-8" standalone="no"?>
<svg xmlns:xlink="http://www.w3.org/1999/xlink" height="13.2px" width="64.8px" xmlns="http://www.w3.org/2000/svg">
  <g transform="matrix(1.0, 0.0, 0.0, 1.0, 29.85, 24.25)">
    <path d="M-15.9 -19.4 L-19.9 -16.9 Q-8.95 -13.45 2.45 -13.2 13.8 -12.95 25.0 -15.1 L22.35 -17.75" fill="none" stroke="#361a0e" stroke-linecap="round" stroke-linejoin="round" stroke-width="2.0">
      <animate attributeName="stroke" dur="2s" repeatCount="indefinite" values="#361a0e;#361a0f"/>
      <animate attributeName="stroke-width" dur="2s" repeatCount="indefinite" values="2.0;2.0"/>
      <animate attributeName="fill-opacity" dur="2s" repeatCount="indefinite" values="1.0;1.0"/>
      <animate attributeName="d" dur="2s" repeatCount="indefinite" values="M-15.9 -19.4 L-19.9 -16.9 Q-8.95 -13.45 2.45 -13.2 13.8 -12.95 25.0 -15.1 L22.35 -17.75;M-19.85 -23.25 L-28.85 -16.95 Q-12.8 -12.3 3.35 -12.05 19.5 -11.8 33.95 -17.3 L29.15 -19.05"/>
    </path>
  </g>
</svg>
