<?xml version="1.0" encoding="UTF-8" standalone="no"?>
<svg xmlns:xlink="http://www.w3.org/1999/xlink" height="194.95px" width="172.9px" xmlns="http://www.w3.org/2000/svg">
  <g transform="matrix(1.0, 0.0, 0.0, 1.0, 5.45, 57.3)">
    <path d="M70.9 -52.85 L165.95 -49.05 162.35 23.6 156.8 135.7 -2.6 136.15 -3.8 -32.8 -3.95 -55.8 15.6 -55.0 70.9 -52.85" fill="#2f393b" fill-opacity="0.9019608" fill-rule="evenodd" stroke="none"/>
    <path d="M70.9 -52.85 L165.95 -49.05 162.35 23.6 156.8 135.7 -2.6 136.15 -3.8 -32.8 -3.95 -55.8 15.6 -55.0 70.9 -52.85 Z" fill="none" stroke="#5b6a8a" stroke-linecap="round" stroke-linejoin="round" stroke-width="3.0"/>
  </g>
</svg>
