<?xml version="1.0" encoding="UTF-8" standalone="no"?>
<svg xmlns:xlink="http://www.w3.org/1999/xlink" height="7.1px" width="15.3px" xmlns="http://www.w3.org/2000/svg">
  <g transform="matrix(1.0, 0.0, 0.0, 1.0, 7.4, -9.95)">
    <path d="M0.65 12.2 L0.25 12.2 -0.35 12.2 -1.25 12.25 -4.45 12.85 -5.4 13.15 -5.7 13.35 Q-6.4 13.7 -6.45 14.25 L-6.45 14.1 -6.45 13.9 -6.45 13.75 -6.45 13.65 -6.45 13.55 -6.45 13.3 -6.45 13.15 -6.45 13.1 -6.45 12.95 -6.45 12.75 -6.45 12.6 -6.45 12.5 -6.45 12.4 -6.45 12.2 -6.45 12.05 Q-6.45 11.5 -5.7 11.1 L-5.4 10.95 -4.45 10.6 -2.7 10.2 -0.35 9.95 0.25 9.95 3.45 10.25 3.95 10.3 4.45 10.4 4.5 10.45 5.0 10.6 5.95 10.95 6.35 11.15 6.8 11.5 6.85 11.6 6.85 13.9 6.35 13.4 5.95 13.15 5.0 12.85 4.75 12.75 3.55 12.5 2.7 12.35 0.65 12.2" fill="url(#gradient0)" fill-rule="evenodd" stroke="none"/>
    <path d="M-6.45 14.25 Q-6.4 13.7 -5.7 13.35 L-5.4 13.15 -4.45 12.85 -1.25 12.25 -0.35 12.2 0.25 12.2 0.65 12.2 -0.35 12.75 -0.45 12.8 -0.6 12.8 -1.75 12.9 -2.5 13.05 -3.25 13.2 -3.9 13.45 Q-4.7 13.8 -4.7 14.3 L-4.45 14.8 -5.65 15.35 Q-6.45 14.85 -6.45 14.3 L-6.45 14.25" fill="#cc9e59" fill-rule="evenodd" stroke="none"/>
    <path d="M4.5 10.45 L4.45 10.4 3.95 10.3 4.5 10.4 4.5 10.45" fill="#7a4f0e" fill-rule="evenodd" stroke="none"/>
    <path d="M6.85 13.9 L6.85 11.6 6.8 11.5 6.35 11.15 5.95 10.95 5.0 10.6 4.5 10.45 4.5 10.4 5.55 10.65 6.55 11.0 7.05 11.3 7.25 11.4 7.55 11.65 7.6 11.75 7.75 11.95 7.75 14.15 7.9 14.65 Q7.95 15.65 5.55 16.4 L3.5 16.85 3.05 16.9 0.25 17.05 -0.35 17.05 -0.9 17.05 -2.25 16.95 -5.0 16.4 -5.05 16.4 -6.55 15.8 Q-7.45 15.25 -7.4 14.65 L-7.4 14.55 -7.4 14.4 -7.4 14.25 -7.4 14.1 -7.4 13.95 -7.4 13.85 -7.4 13.7 -7.4 13.55 -7.4 13.4 -7.4 13.3 -7.4 13.1 -7.4 12.95 -7.4 12.85 -7.4 12.7 -7.4 12.6 -7.4 12.4 Q-7.4 11.75 -6.45 11.2 L-6.05 11.0 -5.0 10.65 -2.7 10.2 -4.45 10.6 -5.4 10.95 -5.7 11.1 Q-6.45 11.5 -6.45 12.05 L-6.45 12.2 -6.45 12.4 -6.45 12.5 -6.45 12.6 -6.45 12.75 -6.45 12.95 -6.45 13.1 -6.45 13.15 -6.45 13.3 -6.45 13.55 -6.45 13.65 -6.45 13.75 -6.45 13.9 -6.45 14.1 -6.45 14.25 -6.45 14.3 Q-6.45 14.85 -5.65 15.35 L-4.45 15.85 -3.0 16.2 -1.3 16.4 -1.0 16.4 -0.35 16.4 0.25 16.4 3.1 16.25 5.0 15.85 Q7.0 15.2 7.0 14.3 L6.85 13.9" fill="#472e09" fill-rule="evenodd" stroke="none"/>
    <path d="M0.65 12.2 L2.7 12.35 3.55 12.5 4.75 12.75 3.95 13.25 3.75 13.2 2.9 13.0 2.2 12.9 0.25 12.75 -0.3 12.8 -0.45 12.8 -0.35 12.75 0.65 12.2 M-5.65 15.35 L-4.45 14.8 Q-4.15 15.1 -3.25 15.4 L-3.1 15.45 -1.05 15.85 -0.4 15.85 -1.05 16.25 -1.3 16.4 -3.0 16.2 -4.45 15.85 -5.65 15.35" fill="#e4b263" fill-rule="evenodd" stroke="none"/>
    <path d="M4.75 12.75 L5.0 12.85 5.95 13.15 6.35 13.4 6.85 13.9 7.0 14.3 Q7.0 15.2 5.0 15.85 L3.1 16.25 0.25 16.4 -0.35 16.4 -1.0 16.4 -1.3 16.4 -1.05 16.25 -0.4 15.85 0.25 15.85 3.1 15.6 3.75 15.4 Q5.25 14.9 5.25 14.3 5.25 13.8 4.45 13.45 L3.95 13.25 4.75 12.75" fill="#ffc670" fill-rule="evenodd" stroke="none"/>
    <path d="M-3.9 13.45 L-3.25 13.2 -2.5 13.05 -2.15 13.4 -1.45 13.6 -0.9 13.4 -0.4 13.3 0.4 13.55 2.1 13.3 2.9 13.0 3.75 13.2 3.95 13.25 4.45 13.45 3.75 13.7 3.15 13.9 2.75 14.0 0.25 14.2 -0.95 14.15 -2.65 13.9 -3.15 13.75 -3.25 13.7 -3.9 13.45" fill="#571717" fill-rule="evenodd" stroke="none"/>
    <path d="M-4.45 14.8 L-4.7 14.3 Q-4.7 13.8 -3.9 13.45 L-3.25 13.7 -3.15 13.75 -3.2 14.3 -3.1 15.45 -3.25 15.4 Q-4.15 15.1 -4.45 14.8 M4.45 13.45 Q5.25 13.8 5.25 14.3 5.25 14.9 3.75 15.4 L3.1 15.6 3.15 13.9 3.75 13.7 4.45 13.45" fill="#442c09" fill-rule="evenodd" stroke="none"/>
    <path d="M3.1 15.6 L0.25 15.85 -0.4 15.85 -1.05 15.85 -1.05 15.8 -0.95 14.15 0.25 14.2 2.75 14.0 3.15 13.9 3.1 15.6" fill="#784b0f" fill-rule="evenodd" stroke="none"/>
    <path d="M2.2 12.9 L1.85 13.1 1.0 13.25 -0.3 12.8 0.25 12.75 2.2 12.9" fill="#d25502" fill-rule="evenodd" stroke="none"/>
    <path d="M-2.5 13.05 L-1.75 12.9 -0.6 12.8 -0.45 12.8 -0.3 12.8 1.0 13.25 1.85 13.1 2.2 12.9 2.9 13.0 2.1 13.3 0.4 13.55 -0.4 13.3 -0.9 13.4 -1.45 13.6 -2.15 13.4 -2.5 13.05" fill="#b53300" fill-rule="evenodd" stroke="none"/>
    <path d="M-3.15 13.75 L-2.65 13.9 -0.95 14.15 -1.05 15.8 -1.05 15.85 -3.1 15.45 -3.2 14.3 -3.15 13.75" fill="#5c390b" fill-rule="evenodd" stroke="none"/>
  </g>
  <defs>
    <radialGradient cx="0" cy="0" gradientTransform="matrix(-0.0126, 0.0, 0.0, -0.0291, 3.5, 13.4)" gradientUnits="userSpaceOnUse" id="gradient0" r="819.2" spreadMethod="pad">
      <stop offset="0.047058823529411764" stop-color="#f9eab0"/>
      <stop offset="0.09803921568627451" stop-color="#f2e05c"/>
      <stop offset="0.3333333333333333" stop-color="#edc51a"/>
      <stop offset="0.6313725490196078" stop-color="#ed9d1a"/>
      <stop offset="0.8705882352941177" stop-color="#b5720f"/>
      <stop offset="1.0" stop-color="#ed9d1a"/>
    </radialGradient>
  </defs>
</svg>
