<?xml version="1.0" encoding="UTF-8" standalone="no"?>
<svg xmlns:xlink="http://www.w3.org/1999/xlink" height="25.65px" width="60.35px" xmlns="http://www.w3.org/2000/svg">
  <g transform="matrix(1.0, 0.0, 0.0, 1.0, 31.85, 30.15)">
    <path d="M28.5 -13.75 Q23.9 -11.65 15.15 -7.2 7.1 -3.85 -1.3 -4.65 -7.7 -5.35 -15.2 -13.3 -22.65 -21.1 -29.05 -22.8 L-29.95 -23.0 -31.2 -23.1 Q-31.85 -24.6 -31.85 -26.3 -31.85 -28.15 -28.4 -29.25 -25.7 -30.15 -23.05 -30.15 -18.5 -30.15 -15.45 -27.55 L-14.2 -26.3 -10.95 -26.05 Q-7.25 -25.7 2.3 -23.15 16.0 -19.25 28.5 -13.75" fill="#000000" fill-opacity="0.2" fill-rule="evenodd" stroke="none"/>
  </g>
</svg>
