<?xml version="1.0" encoding="UTF-8" standalone="no"?>
<svg xmlns:xlink="http://www.w3.org/1999/xlink" height="42.4px" width="54.95px" xmlns="http://www.w3.org/2000/svg">
  <g transform="matrix(1.0, 0.0, 0.0, 1.0, 27.5, 21.2)">
    <path d="M26.6 10.0 L25.15 12.05 22.7 14.1 Q21.65 14.6 20.6 14.7 L20.55 14.7 Q20.35 14.7 20.45 14.85 L18.8 15.0 17.8 15.05 Q15.35 15.05 12.65 13.75 L11.85 13.35 10.4 12.4 8.2 13.2 3.9 14.85 3.9 15.05 4.9 15.05 8.4 14.55 11.55 14.15 4.35 15.95 0.1 16.7 Q-2.15 18.3 -5.2 18.45 L-5.7 18.45 -6.0 18.45 -6.1 18.45 -6.1 18.65 -2.9 18.65 -0.85 18.35 -0.8 18.55 -2.85 19.2 -6.8 19.65 Q-11.65 19.65 -13.45 17.5 L-10.0 18.3 -6.9 18.4 Q-9.05 18.1 -11.1 16.85 L-11.25 16.75 -11.65 16.5 Q-13.25 15.35 -13.7 14.0 L-13.8 13.7 -13.85 13.9 -16.5 11.85 -16.9 13.85 -17.3 11.35 -17.5 9.7 -16.2 9.6 -15.8 9.25 -15.6 8.55 -14.95 9.9 -13.0 11.75 -12.75 11.65 -10.2 11.25 Q-9.25 11.25 -6.25 12.55 L-4.9 13.1 Q-2.8 13.85 -1.3 13.85 0.55 13.85 2.25 12.95 3.6 12.3 4.25 11.3 3.5 13.0 2.55 14.3 3.65 13.75 5.1 13.25 6.45 12.8 9.2 12.3 L10.05 12.15 Q8.85 11.15 8.7 10.1 L8.7 9.9 8.7 9.6 8.85 9.55 Q10.05 9.05 11.5 9.05 13.9 9.05 16.8 10.55 17.85 11.1 18.85 11.45 20.6 12.05 22.1 12.05 23.8 12.05 25.55 10.8 L26.6 10.0 M-15.3 1.15 L-15.65 -2.15 -14.9 -2.7 -12.7 -4.15 -12.6 -4.2 -13.7 -2.8 -14.45 -1.6 -9.3 -3.55 -15.3 1.15 M2.7 -6.55 L2.7 -6.75 Q0.7 -7.4 -1.0 -9.2 L-4.15 -13.7 1.6 -9.5 5.3 -6.95 8.3 -5.05 5.85 -5.05 2.55 -5.5 Q-0.5 -6.25 -3.15 -8.25 L-3.1 -8.35 Q-1.95 -7.8 -0.05 -7.3 L2.7 -6.55 M4.8 -3.95 L6.1 -3.9 8.55 -3.8 11.9 -3.35 11.95 -3.25 11.95 -3.1 8.9 -2.75 6.3 -3.1 6.1 -3.15 2.7 -3.55 Q3.35 -3.95 4.8 -3.95 M13.2 13.7 L14.75 14.1 17.1 14.4 20.5 14.0 15.95 13.65 Q13.2 13.15 11.9 12.3 12.2 13.1 13.2 13.7 M-14.7 -1.55 L-14.5 -1.55 -14.45 -1.6 -14.7 -1.55 M-10.9 13.9 L-10.9 14.5 -10.25 15.0 -10.0 15.1 -9.6 15.25 -8.75 15.35 -7.6 15.6 -9.5 15.7 Q-7.15 16.8 -5.1 16.8 L-2.2 16.4 -5.8 16.1 -5.8 16.0 -2.0 15.4 -3.15 15.4 Q-6.55 15.4 -10.9 13.9" fill="#b38484" fill-rule="evenodd" stroke="none"/>
    <path d="M2.7 -11.65 L4.3 -10.45 8.35 -7.35 Q9.45 -6.55 12.8 -5.45 L13.05 -5.35 Q16.85 -4.2 19.7 -4.2 L21.45 -4.35 22.6 -4.5 22.3 -5.15 23.05 -5.15 23.55 -5.05 24.1 -4.95 24.05 -4.75 24.05 -4.35 24.05 -4.3 24.0 -3.85 24.0 -3.7 24.0 -3.6 24.05 -3.2 24.35 -1.9 24.45 -1.7 24.6 -1.2 24.8 -0.75 24.7 -0.75 24.55 -0.7 24.1 -1.6 23.9 -1.9 23.0 -2.9 22.1 -2.45 21.65 -2.3 17.95 -2.9 15.8 -3.2 14.2 -2.75 13.1 -2.35 Q10.8 -1.4 9.75 -0.2 9.05 0.55 8.95 1.45 L6.6 1.5 2.7 1.25 1.7 -0.35 Q-0.05 -2.45 -2.8 -2.55 L-3.0 -2.55 -2.9 -2.6 -5.0 -3.6 Q-4.85 -3.6 -4.8 -3.7 L-4.8 -3.8 0.6 -4.8 0.4 -5.2 -2.2 -5.95 -4.4 -6.0 Q-6.45 -6.0 -8.95 -5.15 -10.95 -4.45 -12.25 -3.55 L-7.2 -4.6 -6.0 -4.4 -8.75 -2.95 -11.2 -1.8 -9.8 -2.05 Q-8.9 -2.3 -8.6 -2.6 L-7.0 -2.6 -7.0 -2.2 -7.9 -1.8 -9.05 -1.4 -9.7 -1.15 Q-12.55 0.2 -13.75 2.55 L-14.1 3.25 -14.0 3.75 Q-13.45 5.45 -9.7 6.85 -6.6 8.0 -4.2 8.2 L-3.3 8.25 Q-1.6 8.25 0.7 7.05 3.3 5.7 3.3 4.15 L3.25 3.3 8.95 2.1 Q9.0 2.65 9.4 3.2 9.65 4.3 10.25 5.1 L7.3 6.6 Q5.1 7.5 3.9 7.45 5.4 8.25 5.7 8.25 6.9 8.25 8.35 7.05 L10.3 5.1 Q11.65 6.8 14.9 6.8 17.3 6.8 23.5 5.0 L24.15 5.05 Q25.45 5.3 26.2 6.6 26.85 7.65 27.0 9.15 L26.6 10.0 25.55 10.8 Q23.8 12.05 22.1 12.05 20.6 12.05 18.85 11.45 17.85 11.1 16.8 10.55 13.9 9.05 11.5 9.05 10.05 9.05 8.85 9.55 L8.7 9.6 8.7 9.9 8.7 10.1 Q8.85 11.15 10.05 12.15 L9.2 12.3 Q6.45 12.8 5.1 13.25 3.65 13.75 2.55 14.3 3.5 13.0 4.25 11.3 3.6 12.3 2.25 12.95 0.55 13.85 -1.3 13.85 -2.8 13.85 -4.9 13.1 L-6.25 12.55 Q-9.25 11.25 -10.2 11.25 L-12.75 11.65 -13.0 11.75 -14.95 9.9 -15.6 8.55 -15.2 5.65 Q-15.1 3.8 -15.3 1.15 L-9.3 -3.55 -14.45 -1.6 -13.7 -2.8 -12.6 -4.2 -12.7 -4.15 -14.9 -2.7 -15.65 -2.15 -16.15 -5.5 -16.2 -5.7 -14.2 -6.2 -14.2 -6.5 -14.25 -7.15 -14.8 -7.8 Q-13.1 -8.6 -10.25 -10.3 L-6.0 -12.8 -5.1 -11.55 -3.8 -10.2 -3.6 -10.25 -5.6 -14.0 -5.45 -14.1 -5.1 -14.2 Q-4.35 -14.2 -0.1 -12.7 L2.7 -11.65 M20.45 14.9 L20.25 15.2 19.9 16.25 19.7 17.05 19.6 17.35 Q19.25 17.05 18.55 16.95 L18.15 16.9 13.35 16.55 Q9.5 16.25 2.95 18.75 -3.65 21.2 -5.8 21.2 L-6.7 21.2 Q-11.1 21.05 -13.95 19.8 -15.85 19.0 -17.55 17.55 L-20.15 9.4 -18.85 9.65 -17.5 9.7 -17.3 11.35 -16.9 13.85 -16.5 11.85 -13.85 13.9 -13.8 13.7 -13.7 14.0 Q-13.25 15.35 -11.65 16.5 L-11.25 16.75 -11.1 16.85 Q-9.05 18.1 -6.9 18.4 L-10.0 18.3 -13.45 17.5 Q-11.65 19.65 -6.8 19.65 L-2.85 19.2 -0.8 18.55 -0.85 18.35 -2.9 18.65 -6.1 18.65 -6.1 18.45 -6.0 18.45 -5.7 18.45 -5.2 18.45 Q-2.15 18.3 0.1 16.7 L4.35 15.95 11.55 14.15 8.4 14.55 4.9 15.05 3.9 15.05 3.9 14.85 8.2 13.2 10.4 12.4 11.85 13.35 12.65 13.75 Q15.35 15.05 17.8 15.05 L18.8 15.0 20.45 14.85 20.45 14.9 M2.7 -6.55 L-0.05 -7.3 Q-1.95 -7.8 -3.1 -8.35 L-3.15 -8.25 Q-0.5 -6.25 2.55 -5.5 L5.85 -5.05 8.3 -5.05 5.3 -6.95 1.6 -9.5 -4.15 -13.7 -1.0 -9.2 Q0.7 -7.4 2.7 -6.75 L2.7 -6.55 M4.8 -3.95 Q3.35 -3.95 2.7 -3.55 L6.1 -3.15 6.3 -3.1 8.9 -2.75 11.95 -3.1 11.95 -3.25 11.9 -3.35 8.55 -3.8 6.1 -3.9 4.8 -3.95 M23.55 -5.05 L22.6 -4.5 23.55 -5.05 M-14.7 -1.55 L-14.45 -1.6 -14.5 -1.55 -14.7 -1.55" fill="#c29d9d" fill-rule="evenodd" stroke="none"/>
    <path d="M-19.0 -12.7 L-19.8 -13.3 -20.45 -13.5 -20.45 -13.55 -20.55 -13.5 -21.6 -13.65 -21.5 -14.2 -19.55 -15.05 -19.4 -15.1 -19.3 -15.15 -17.05 -15.75 -16.7 -15.8 -16.65 -15.85 -15.3 -16.0 -14.6 -15.9 -14.5 -15.8 Q-14.85 -15.3 -17.65 -13.55 L-17.75 -13.45 -19.0 -12.7 M13.45 -0.65 L13.3 -0.75 Q13.4 -1.45 14.2 -1.8 L14.6 -1.95 15.3 -1.9 16.1 -1.75 16.1 -1.35 Q15.3 -0.55 13.8 -0.55 13.5 -0.55 13.45 -0.65 M-7.1 -0.3 L-6.15 -0.65 -5.55 -0.9 -4.65 -0.5 -3.7 0.65 Q-4.25 1.1 -5.3 1.2 L-7.2 1.25 -8.7 1.05 Q-8.2 0.25 -7.1 -0.3" fill="#f2eaea" fill-rule="evenodd" stroke="none"/>
    <path d="M-17.75 -11.0 L-18.55 -12.25 -19.0 -12.7 -17.75 -13.45 -17.65 -13.55 Q-14.85 -15.3 -14.5 -15.8 L-14.6 -15.9 -15.3 -16.0 -16.65 -15.85 -16.7 -15.8 -17.05 -15.75 -19.3 -15.15 -19.4 -15.1 -19.55 -15.05 -21.5 -14.2 -21.6 -13.65 -24.0 -13.7 -24.1 -14.2 -18.1 -16.4 -15.7 -17.3 -15.55 -17.35 Q-15.2 -17.5 -14.95 -17.6 L-12.9 -18.15 -12.65 -18.15 -12.35 -18.2 -12.3 -18.2 -10.3 -18.0 Q-9.3 -17.65 -9.3 -16.7 -9.3 -15.55 -16.6 -11.6 L-17.75 -11.0 M-20.45 -13.5 L-20.55 -13.5 -20.45 -13.55 -20.45 -13.5 M14.35 -2.5 L14.4 -2.5 15.3 -2.65 16.7 -2.75 20.1 -2.35 Q22.7 -1.8 22.7 -0.95 22.7 -0.1 19.5 0.85 L16.3 1.6 15.4 1.65 13.1 1.45 12.5 1.3 12.4 1.3 Q11.3 0.95 11.3 0.35 11.3 -0.9 13.95 -2.3 L14.35 -2.5 M13.45 -0.65 Q13.5 -0.55 13.8 -0.55 15.3 -0.55 16.1 -1.35 L16.1 -1.75 15.3 -1.9 14.6 -1.95 14.2 -1.8 Q13.4 -1.45 13.3 -0.75 L13.45 -0.65 M-5.9 -1.55 L-5.7 -1.55 -4.1 -1.4 -2.1 -0.95 -0.85 -0.35 Q0.3 0.35 0.3 1.35 0.3 3.0 -0.4 3.95 L-0.7 4.25 Q-1.7 5.25 -3.5 5.25 L-3.95 5.25 -7.5 4.45 Q-10.7 3.45 -10.7 2.25 -10.7 1.45 -8.65 0.1 L-7.65 -0.55 -5.9 -1.55 M-7.1 -0.3 Q-8.2 0.25 -8.7 1.05 L-7.2 1.25 -5.3 1.2 Q-4.25 1.1 -3.7 0.65 L-4.65 -0.5 -5.55 -0.9 -6.15 -0.65 -7.1 -0.3" fill="#e0cdcd" fill-rule="evenodd" stroke="none"/>
    <path d="M24.8 -0.75 L24.85 -0.7 25.75 0.9 Q27.55 3.85 27.45 6.7 L27.3 8.1 27.0 9.15 Q26.85 7.65 26.2 6.6 25.45 5.3 24.15 5.05 L23.5 5.0 Q17.3 6.8 14.9 6.8 11.65 6.8 10.3 5.1 L8.35 7.05 Q6.9 8.25 5.7 8.25 5.4 8.25 3.9 7.45 5.1 7.5 7.3 6.6 L10.25 5.1 Q9.65 4.3 9.4 3.2 9.0 2.65 8.95 2.1 L3.25 3.3 3.3 4.15 Q3.3 5.7 0.7 7.05 -1.6 8.25 -3.3 8.25 L-4.2 8.2 Q-6.6 8.0 -9.7 6.85 -13.45 5.45 -14.0 3.75 L-14.1 3.25 -13.75 2.55 Q-12.55 0.2 -9.7 -1.15 L-9.05 -1.4 -7.9 -1.8 -7.0 -2.2 -7.0 -2.6 -8.6 -2.6 Q-8.9 -2.3 -9.8 -2.05 L-11.2 -1.8 -8.75 -2.95 -6.0 -4.4 -7.2 -4.6 -12.25 -3.55 Q-10.95 -4.45 -8.95 -5.15 -6.45 -6.0 -4.4 -6.0 L-2.2 -5.95 0.4 -5.2 0.6 -4.8 -4.8 -3.8 -4.8 -3.7 Q-4.85 -3.6 -5.0 -3.6 L-2.9 -2.6 -3.0 -2.55 -2.8 -2.55 Q-0.05 -2.45 1.7 -0.35 L2.7 1.25 6.6 1.5 8.95 1.45 Q9.05 0.55 9.75 -0.2 10.8 -1.4 13.1 -2.35 L14.2 -2.75 15.8 -3.2 17.95 -2.9 21.65 -2.3 22.1 -2.45 23.0 -2.9 23.9 -1.9 24.1 -1.6 24.55 -0.7 24.7 -0.75 24.8 -0.75 M-17.55 17.55 L-19.45 15.55 -19.5 15.45 -20.5 13.35 -21.95 10.6 -23.25 7.95 -22.55 7.15 -22.45 7.4 -22.45 7.5 -22.25 7.85 -21.75 8.45 Q-21.15 9.1 -20.15 9.4 L-17.55 17.55 M-16.2 -5.7 Q-16.65 -8.15 -17.2 -9.75 L-17.75 -11.0 -16.6 -11.6 Q-9.3 -15.55 -9.3 -16.7 -9.3 -17.65 -10.3 -18.0 L-12.3 -18.2 -12.35 -18.2 -12.65 -18.15 -12.9 -18.15 -14.95 -17.6 Q-15.2 -17.5 -15.55 -17.35 L-15.7 -17.3 -18.1 -16.4 -24.1 -14.2 -24.0 -13.7 -25.35 -13.4 -27.5 -12.35 -26.65 -13.55 -23.5 -15.2 -21.0 -16.15 -19.9 -16.6 Q-18.55 -17.15 -16.85 -18.05 L-15.7 -18.65 -10.7 -21.2 -7.65 -19.45 -4.05 -16.75 2.7 -11.65 -0.1 -12.7 Q-4.35 -14.2 -5.1 -14.2 L-5.45 -14.1 -5.6 -14.0 -3.6 -10.25 -3.8 -10.2 -5.1 -11.55 -6.0 -12.8 -10.25 -10.3 Q-13.1 -8.6 -14.8 -7.8 L-14.25 -7.15 -14.2 -6.5 -14.2 -6.2 -16.2 -5.7 M14.35 -2.5 L13.95 -2.3 Q11.3 -0.9 11.3 0.35 11.3 0.95 12.4 1.3 L12.5 1.3 13.1 1.45 15.4 1.65 16.3 1.6 19.5 0.85 Q22.7 -0.1 22.7 -0.95 22.7 -1.8 20.1 -2.35 L16.7 -2.75 15.3 -2.65 14.4 -2.5 14.35 -2.5 M-5.9 -1.55 L-7.65 -0.55 -8.65 0.1 Q-10.7 1.45 -10.7 2.25 -10.7 3.45 -7.5 4.45 L-3.95 5.25 -3.5 5.25 Q-1.7 5.25 -0.7 4.25 L-0.4 3.95 Q0.3 3.0 0.3 1.35 0.3 0.35 -0.85 -0.35 L-2.1 -0.95 -4.1 -1.4 -5.7 -1.55 -5.9 -1.55" fill="#d2b6b6" fill-rule="evenodd" stroke="none"/>
    <path d="M13.2 13.7 Q12.2 13.1 11.9 12.3 13.2 13.15 15.95 13.65 L20.5 14.0 17.1 14.4 14.75 14.1 13.2 13.7 M-10.9 13.9 Q-6.55 15.4 -3.15 15.4 L-2.0 15.4 -5.8 16.0 -5.8 16.1 -2.2 16.4 -5.1 16.8 Q-7.15 16.8 -9.5 15.7 L-7.6 15.6 -8.75 15.35 -9.6 15.25 -10.0 15.1 -10.25 15.0 -10.9 14.5 -10.9 13.9" fill="#a87c7c" fill-rule="evenodd" stroke="none"/>
    <path d="M2.7 -11.65 L4.3 -10.45 8.35 -7.35 Q9.45 -6.55 12.8 -5.45 L13.05 -5.35 Q16.85 -4.2 19.7 -4.2 L21.45 -4.35 22.6 -4.5 22.3 -5.15 23.05 -5.15 23.55 -5.05 24.1 -4.95 24.05 -4.75 24.05 -4.35 24.05 -4.3 24.0 -3.85 24.0 -3.7 24.0 -3.6 24.05 -3.2 24.35 -1.9 24.45 -1.7 24.6 -1.2 24.8 -0.75 M24.85 -0.7 L25.75 0.9 Q27.55 3.85 27.45 6.7 L27.3 8.1 27.0 9.15 26.6 10.0 25.15 12.05 22.7 14.1 Q21.65 14.6 20.6 14.7 L20.55 14.7 20.55 14.75 20.5 14.85 20.45 14.9 20.25 15.2 19.9 16.25 19.7 17.05 19.6 17.35 Q19.25 17.05 18.55 16.95 L18.15 16.9 13.35 16.55 Q9.5 16.25 2.95 18.75 -3.65 21.2 -5.8 21.2 L-6.7 21.2 Q-11.1 21.05 -13.95 19.8 -15.85 19.0 -17.55 17.55 L-19.45 15.55 -19.5 15.45 -20.5 13.35 -21.95 10.6 -23.25 7.95 -22.55 7.15 -22.45 7.4 -22.45 7.5 -22.25 7.85 -21.75 8.45 Q-21.15 9.1 -20.15 9.4 L-18.85 9.65 -17.5 9.7 -16.2 9.6 -15.8 9.25 -15.6 8.55 -15.2 5.65 Q-15.1 3.8 -15.3 1.15 L-15.65 -2.15 -16.15 -5.5 -16.2 -5.7 Q-16.65 -8.15 -17.2 -9.75 L-17.75 -11.0 -18.55 -12.25 -19.0 -12.7 -19.8 -13.3 -20.45 -13.5 -20.55 -13.5 -21.6 -13.65 -24.0 -13.7 -25.35 -13.4 -27.5 -12.35 -26.65 -13.55 -23.5 -15.2 Q-22.05 -16.0 -19.9 -16.6 -18.55 -17.15 -16.85 -18.05 L-15.7 -18.65 -10.7 -21.2 -7.65 -19.45 -4.05 -16.75 2.7 -11.65 M22.6 -4.5 L23.55 -5.05 M20.55 14.7 Q20.35 14.7 20.45 14.85 L20.45 14.9 M-23.5 -15.2 L-21.0 -16.15 -19.9 -16.6" fill="none" stroke="#a36a6a" stroke-linecap="round" stroke-linejoin="round" stroke-opacity="0.6" stroke-width="0.05"/>
  </g>
</svg>
