<?xml version="1.0" encoding="UTF-8" standalone="no"?>
<svg xmlns:xlink="http://www.w3.org/1999/xlink" height="186.55px" width="35.2px" xmlns="http://www.w3.org/2000/svg">
  <g transform="matrix(1.0, 0.0, 0.0, 1.0, 22.55, -12.9)">
    <path d="M9.25 15.55 L7.9 15.15 Q5.25 14.95 2.85 16.55 L6.55 16.3 5.95 16.45 Q4.6 16.8 3.45 17.75 5.3 16.75 7.1 17.95 L8.05 18.8 Q9.5 20.55 8.5 22.75 L9.35 21.7 Q11.1 19.3 10.35 16.25 L9.25 15.55 M2.6 14.85 L0.05 15.75 -3.0 17.35 -6.15 18.8 -8.6 19.4 -11.05 19.6 -13.65 18.85 -15.2 17.8 Q-14.85 19.0 -13.95 19.55 L-11.2 20.4 Q-9.35 20.8 -7.35 20.0 -5.4 19.3 -2.9 18.05 -0.55 16.8 1.65 15.4 L2.6 14.85 M-11.8 30.85 L-12.0 30.85 Q-11.9 28.65 -12.45 26.45 L-12.85 24.55 Q-15.0 23.25 -15.75 21.6 -16.25 20.55 -16.3 18.9 L-16.3 17.65 Q-16.25 16.95 -15.8 16.0 -14.95 17.35 -13.15 18.15 L-9.35 18.6 Q-6.5 18.4 -1.4 15.8 3.75 13.1 6.65 12.9 9.05 12.7 10.9 14.7 12.8 16.6 12.65 18.9 12.5 21.35 10.45 23.05 L9.7 23.5 7.9 24.4 6.3 24.8 5.9 24.9 6.25 24.55 7.05 23.55 7.45 22.3 7.2 21.0 6.95 20.9 Q-0.7 17.75 -4.65 25.6 L-5.0 26.35 -5.5 27.9 -5.8 31.25 -5.95 31.25 -7.15 31.2 -7.0 29.4 -6.55 28.65 -6.15 27.9 -6.3 27.15 -6.45 26.55 -4.8 23.9 -7.1 25.25 -7.35 25.5 -7.7 26.0 -7.35 26.75 Q-7.0 27.45 -7.05 27.7 L-7.3 28.55 -7.55 29.2 -7.55 30.35 -7.65 31.15 -9.45 31.0 -9.5 30.35 Q-9.35 28.15 -8.5 25.35 -8.2 24.25 -7.55 23.5 L-6.65 22.35 -4.55 20.8 -1.95 19.35 1.65 16.8 Q-2.95 19.8 -4.8 20.65 -7.75 21.9 -11.05 21.65 -13.9 21.45 -15.5 19.9 -15.4 20.85 -14.65 21.8 L-13.0 23.75 Q-11.95 25.0 -11.55 26.15 -11.1 27.65 -11.25 29.95 L-11.35 30.9 -11.8 30.85 M-21.1 198.95 L-22.55 198.85 -21.3 189.45 -20.65 189.5 -20.85 189.8 -21.2 190.55 -20.05 194.4 -20.65 195.75 Q-20.95 196.6 -21.1 198.95 M11.65 19.65 L11.0 21.1 Q10.2 22.4 8.0 23.85 L10.15 22.7 Q11.65 21.5 11.7 20.15 L11.65 19.65" fill="#333333" fill-rule="evenodd" stroke="none"/>
    <path d="M9.25 15.55 L10.35 16.25 Q11.1 19.3 9.35 21.7 L8.5 22.75 Q9.5 20.55 8.05 18.8 L7.1 17.95 Q5.3 16.75 3.45 17.75 4.6 16.8 5.95 16.45 L6.55 16.3 2.85 16.55 Q5.25 14.95 7.9 15.15 L9.25 15.55 M-11.35 30.9 L-11.25 29.95 Q-11.1 27.65 -11.55 26.15 -11.95 25.0 -13.0 23.75 L-14.65 21.8 Q-15.4 20.85 -15.5 19.9 -13.9 21.45 -11.05 21.65 -7.75 21.9 -4.8 20.65 -2.95 19.8 1.65 16.8 L-1.95 19.35 -4.55 20.8 -6.65 22.35 -7.55 23.5 Q-8.2 24.25 -8.5 25.35 -9.35 28.15 -9.5 30.35 L-9.45 31.0 -11.35 30.9" fill="#212121" fill-rule="evenodd" stroke="none"/>
    <path d="M2.6 14.85 L1.65 15.4 Q-0.55 16.8 -2.9 18.05 -5.4 19.3 -7.35 20.0 -9.35 20.8 -11.2 20.4 L-13.95 19.55 Q-14.85 19.0 -15.2 17.8 L-13.65 18.85 -11.05 19.6 -8.6 19.4 -6.15 18.8 -3.0 17.35 0.05 15.75 2.6 14.85 M-7.65 31.15 L-7.55 30.35 -7.55 29.2 -7.3 28.55 -7.05 27.7 Q-7.0 27.45 -7.35 26.75 L-7.7 26.0 -7.35 25.5 -7.1 25.25 -4.8 23.9 -6.45 26.55 -6.3 27.15 -6.15 27.9 -6.55 28.65 -7.0 29.4 -7.15 31.2 -7.65 31.15 M11.65 19.65 L11.7 20.15 Q11.65 21.5 10.15 22.7 L8.0 23.85 Q10.2 22.4 11.0 21.1 L11.65 19.65" fill="#828282" fill-rule="evenodd" stroke="none"/>
    <path d="M-5.95 31.25 L-6.15 35.4 -6.45 35.4 -7.45 35.3 -7.4 35.05 -7.4 34.55 -7.0 33.85 -7.1 33.25 -7.2 32.65 -7.05 31.8 -8.15 31.7 -8.25 32.25 -8.05 32.95 -7.9 33.5 -8.35 34.25 -8.35 34.35 -8.4 34.45 -8.25 35.25 -8.5 35.25 -11.1 35.05 -11.7 35.0 -12.0 35.0 -11.8 30.85 -11.35 30.9 -9.45 31.0 -7.65 31.15 -7.15 31.2 -5.95 31.25" fill="#8a5321" fill-rule="evenodd" stroke="none"/>
    <path d="M-8.25 35.25 L-8.4 34.45 -8.35 34.35 -8.35 34.25 -7.9 33.5 -8.05 32.95 -8.25 32.25 -8.15 31.7 -7.05 31.8 -7.2 32.65 -7.1 33.25 -7.0 33.85 -7.4 34.55 -7.4 35.05 -7.45 35.3 -8.2 35.25 -8.25 35.25" fill="#cc7b30" fill-rule="evenodd" stroke="none"/>
    <path d="M-6.45 35.4 L-15.35 189.9 -15.6 189.85 -16.25 189.85 -16.2 182.45 -16.0 178.5 -15.3 169.35 -14.8 163.75 -13.65 151.0 Q-13.5 148.35 -13.45 140.3 L-13.25 130.6 -12.5 123.05 -11.9 116.55 -10.9 102.55 Q-10.6 97.6 -10.6 90.95 L-10.35 80.0 -9.15 54.5 Q-8.4 41.65 -7.7 36.2 L-8.65 36.15 -8.75 36.65 -8.5 35.25 -8.25 35.25 -8.2 35.25 -7.45 35.3 -6.45 35.4 M-20.6 189.5 L-11.7 35.0 -11.1 35.05 -11.15 35.1 -11.25 36.65 -11.3 46.35 Q-11.4 55.55 -11.6 58.75 L-13.2 78.4 -14.0 100.55 Q-14.45 117.0 -14.95 125.85 L-17.75 170.0 Q-17.85 172.55 -18.65 179.55 L-19.55 189.6 -20.0 189.55 -20.6 189.5 M-9.25 38.8 L-9.4 40.1 -9.45 46.7 -9.65 57.7 -10.35 67.35 -10.2 59.9 -10.1 51.55 -9.95 43.3 -9.25 38.8 M-11.15 77.7 L-11.3 78.85 -11.2 77.8 -11.15 77.7 M-11.65 87.5 L-11.8 93.35 Q-12.05 103.05 -12.25 106.5 L-12.7 112.35 -12.55 107.85 -11.65 87.5" fill="#636363" fill-rule="evenodd" stroke="none"/>
    <path d="M-8.75 36.65 L-8.65 36.15 -7.7 36.2 Q-8.4 41.65 -9.15 54.5 L-10.35 80.0 -10.6 90.95 Q-10.6 97.6 -10.9 102.55 L-11.9 116.55 -12.5 123.05 -13.25 130.6 -13.45 140.3 Q-13.5 148.35 -13.65 151.0 L-14.8 163.75 -15.3 169.35 -16.0 178.5 -16.2 182.45 -16.25 189.85 -17.25 189.75 -17.25 182.95 -17.1 174.35 -15.95 161.55 Q-14.9 152.3 -14.7 148.8 -14.55 145.95 -14.55 139.4 L-14.35 129.7 -12.7 112.35 -12.25 106.5 Q-12.05 103.05 -11.8 93.35 L-11.65 87.5 -11.35 80.05 -11.3 78.85 -11.15 77.7 -10.35 67.35 -9.65 57.7 -9.45 46.7 -9.4 40.1 -9.25 38.8 -9.15 38.65 -9.0 37.65 -8.9 37.05 -8.75 36.65" fill="url(#gradient0)" fill-rule="evenodd" stroke="none"/>
    <path d="M-8.5 35.25 L-8.75 36.65 -8.9 37.05 -9.0 37.65 -9.15 38.65 -9.25 38.8 -9.95 43.3 -10.1 51.55 -10.2 59.9 -10.35 67.35 -11.15 77.7 -11.2 77.8 -11.3 78.85 -11.35 80.05 -11.65 87.5 -12.55 107.85 -12.7 112.35 -14.35 129.7 -14.55 139.4 Q-14.55 145.95 -14.7 148.8 -14.9 152.3 -15.95 161.55 L-17.1 174.35 -17.25 182.95 -17.25 189.75 -18.7 189.65 -19.55 189.6 -18.65 179.55 Q-17.85 172.55 -17.75 170.0 L-14.95 125.85 Q-14.45 117.0 -14.0 100.55 L-13.2 78.4 -11.6 58.75 Q-11.4 55.55 -11.3 46.35 L-11.25 36.65 -11.15 35.1 -11.1 35.05 -8.5 35.25" fill="#474747" fill-rule="evenodd" stroke="none"/>
    <path d="M-15.35 189.9 L-14.7 189.95 -14.5 199.45 -17.6 199.2 -17.5 198.3 -17.1 195.2 Q-17.0 193.0 -17.4 190.5 L-20.35 190.0 -20.3 189.85 -20.0 189.55 -19.55 189.6 -18.7 189.65 -18.85 189.7 -18.85 189.75 Q-17.3 189.85 -17.05 190.25 -16.8 190.5 -16.6 191.3 L-16.5 192.7 -16.65 197.85 Q-15.75 193.4 -15.65 191.25 L-15.6 189.85 -15.35 189.9" fill="#4a4a4a" fill-rule="evenodd" stroke="none"/>
    <path d="M-17.6 199.2 L-21.1 198.95 Q-20.95 196.6 -20.65 195.75 L-20.05 194.4 -21.2 190.55 -20.85 189.8 -20.65 189.5 -20.6 189.5 -20.0 189.55 -20.3 189.85 -20.35 190.0 -17.4 190.5 Q-17.0 193.0 -17.1 195.2 L-17.5 198.3 -17.6 199.2" fill="#141414" fill-rule="evenodd" stroke="none"/>
    <path d="M-16.25 189.85 L-15.6 189.85 -15.65 191.25 Q-15.75 193.4 -16.65 197.85 L-16.5 192.7 -16.6 191.3 Q-16.8 190.5 -17.05 190.25 -17.3 189.85 -18.85 189.75 L-18.85 189.7 -18.7 189.65 -17.25 189.75 -16.25 189.85" fill="#6b6b6b" fill-rule="evenodd" stroke="none"/>
    <path d="M-11.8 30.85 L-12.0 30.85 Q-11.9 28.65 -12.45 26.45 L-12.85 24.55 Q-15.0 23.25 -15.75 21.6 -16.25 20.55 -16.3 18.9 L-16.3 17.65 Q-16.25 16.95 -15.8 16.0 -14.95 17.35 -13.15 18.15 L-9.35 18.6 Q-6.5 18.4 -1.4 15.8 3.75 13.1 6.65 12.9 9.05 12.7 10.9 14.7 12.8 16.6 12.65 18.9 12.5 21.35 10.45 23.05 L9.7 23.5 7.9 24.4 6.3 24.8 5.9 24.9 6.25 24.55 7.05 23.55 7.45 22.3 7.2 21.0 6.95 20.9 Q-0.7 17.75 -4.65 25.6 L-5.0 26.35 -5.5 27.9 -5.8 31.25 -5.95 31.25 -6.15 35.4 -6.45 35.4 -15.35 189.9 -14.7 189.95 -14.5 199.45 -17.6 199.2 -21.1 198.95 -22.55 198.85 -21.3 189.45 -20.65 189.5 -20.6 189.5 -11.7 35.0 -12.0 35.0 -11.8 30.85 -11.35 30.9 -9.45 31.0 -7.65 31.15 -7.15 31.2 -5.95 31.25 M-7.45 35.3 L-6.45 35.4 M-8.25 35.25 L-8.5 35.25 M-16.25 189.85 L-15.6 189.85 -15.35 189.9 M-17.25 189.75 L-16.25 189.85 M-7.45 35.3 L-8.2 35.25 M-11.7 35.0 L-11.1 35.05 -8.5 35.25 M-19.55 189.6 L-18.7 189.65 -17.25 189.75 M-19.55 189.6 L-20.0 189.55 -20.6 189.5" fill="none" stroke="#333333" stroke-linecap="round" stroke-linejoin="round" stroke-opacity="0.49803922" stroke-width="0.05"/>
  </g>
  <defs>
    <linearGradient gradientTransform="matrix(-0.0024, 0.0421, -0.0013, -1.0E-4, -12.7, 120.15)" gradientUnits="userSpaceOnUse" id="gradient0" spreadMethod="pad" x1="-819.2" x2="819.2">
      <stop offset="0.0" stop-color="#919191"/>
      <stop offset="1.0" stop-color="#636363"/>
    </linearGradient>
  </defs>
</svg>
