<?xml version="1.0" encoding="UTF-8" standalone="no"?>
<svg xmlns:xlink="http://www.w3.org/1999/xlink" height="40.85px" width="40.5px" xmlns="http://www.w3.org/2000/svg">
  <g transform="matrix(1.0, 0.0, 0.0, 1.0, 19.55, 29.8)">
    <path d="M19.25 -6.35 Q18.35 -0.55 13.9 3.85 8.4 9.4 0.6 9.4 -7.2 9.4 -12.75 3.85 -18.25 -1.65 -18.25 -9.4 -18.25 -17.2 -12.75 -22.75 -7.2 -28.25 0.6 -28.25 8.4 -28.25 13.9 -22.75 18.35 -18.3 19.25 -12.4 L19.45 -12.4 19.65 -10.95 16.2 -10.95 10.0 -11.0 9.7 -9.4 9.1 -6.35 15.6 -6.35 19.25 -6.35 M-13.5 -6.35 L-11.9 -6.35 -7.05 -6.35 Q-7.85 -8.4 -7.85 -10.6 L-7.85 -11.1 -13.6 -11.1 -18.05 -11.15 -18.15 -9.25 -17.95 -6.35 -13.5 -6.35 M-4.1 -11.05 L-4.05 -11.1 -4.1 -11.05" fill="#121212" fill-rule="evenodd" stroke="none"/>
    <path d="M15.6 -6.35 L9.1 -6.35 9.7 -9.4 10.0 -11.0 16.2 -10.95 15.6 -6.35 M-13.6 -11.1 L-7.85 -11.1 -7.85 -10.6 Q-7.85 -8.4 -7.05 -6.35 L-11.9 -6.35 -13.5 -6.35 -13.8 -9.25 -13.6 -11.1" fill="#2c2b2b" fill-rule="evenodd" stroke="none"/>
    <path d="M19.65 -10.95 L19.7 -9.25 19.5 -6.35 19.25 -6.35 15.6 -6.35 16.2 -10.95 19.65 -10.95 M-13.5 -6.35 L-17.95 -6.35 -18.15 -9.25 -18.05 -11.15 -13.6 -11.1 -13.8 -9.25 -13.5 -6.35" fill="#3f3f3f" fill-rule="evenodd" stroke="none"/>
    <path d="M-4.1 -11.05 L-4.05 -11.1 -4.1 -11.05" fill="#747474" fill-rule="evenodd" stroke="none"/>
    <path d="M-19.4 -13.15 Q-18.8 -16.75 -16.9 -19.85 L-14.15 -23.4 -13.75 -23.8 Q-7.75 -29.8 0.7 -29.8 9.15 -29.8 15.15 -23.8 L15.55 -23.4 Q17.15 -21.7 18.3 -19.85 20.15 -16.8 20.85 -13.25 L14.95 -13.2 10.25 -13.1 7.25 -13.05 Q5.95 -15.0 4.65 -15.9 2.85 -17.2 0.25 -17.2 -2.0 -17.2 -3.75 -16.15 -5.55 -15.05 -6.3 -13.15 -8.65 -12.95 -13.05 -13.1 L-19.4 -13.15" fill="url(#gradient0)" fill-rule="evenodd" stroke="none"/>
    <path d="M20.85 -13.25 L20.95 -12.4 19.45 -12.4 10.2 -12.45 7.05 -12.45 6.8 -12.85 6.75 -12.95 5.65 -14.3 Q3.6 -16.4 0.7 -16.4 -2.2 -16.4 -4.25 -14.3 L-5.35 -12.85 -5.55 -12.45 -17.9 -12.4 -19.55 -12.4 -19.4 -13.15 -13.05 -13.1 Q-8.65 -12.95 -6.3 -13.15 -5.55 -15.05 -3.75 -16.15 -2.0 -17.2 0.25 -17.2 2.85 -17.2 4.65 -15.9 5.95 -15.0 7.25 -13.05 L10.25 -13.1 14.95 -13.2 20.85 -13.25" fill="#722121" fill-rule="evenodd" stroke="none"/>
    <path d="M6.05 -4.8 L6.85 -5.9 7.1 -6.35 9.1 -6.35 15.6 -6.35 19.5 -6.35 20.95 -6.35 Q20.55 -3.25 19.2 -0.5 20.2 -2.85 20.55 -5.45 L19.1 -5.45 15.4 -5.45 8.85 -5.45 6.7 -5.45 6.45 -5.0 6.35 -4.75 6.05 -4.8 M-19.4 -5.45 L-19.55 -6.35 -17.95 -6.35 -13.5 -6.35 -11.9 -6.35 -13.4 -5.9 -14.85 -5.45 -18.35 -5.45 -19.4 -5.45 M-6.8 -6.35 L-5.65 -6.35 -5.4 -5.9 -4.25 -4.45 Q-2.2 -2.35 0.7 -2.35 L2.65 -2.6 1.8 -1.6 0.3 -1.45 Q-2.6 -1.45 -4.65 -3.55 L-5.8 -5.0 -6.0 -5.35 -5.7 -5.35 Q-5.8 -5.75 -6.8 -6.35" fill="#747272" fill-rule="evenodd" stroke="none"/>
    <path d="M6.05 -4.8 L6.35 -4.75 5.25 -3.55 5.15 -3.45 4.7 -3.6 4.3 -3.3 3.35 -2.55 3.45 -2.5 3.55 -2.5 4.2 -2.75 4.6 -2.95 Q3.35 -1.95 1.8 -1.6 L2.65 -2.6 Q4.3 -3.1 5.65 -4.45 L6.05 -4.8 M-11.9 -6.35 L-7.05 -6.35 -6.8 -6.35 Q-5.8 -5.75 -5.7 -5.35 L-6.0 -5.35 -6.05 -5.45 -6.55 -5.45 -10.5 -5.45 -13.35 -5.45 -14.85 -5.45 -13.4 -5.9 -11.9 -6.35 M-10.5 -6.15 L-10.4 -5.95 -10.05 -5.8 -8.3 -5.65 -8.15 -5.55 Q-7.85 -5.55 -7.85 -5.7 L-7.95 -5.85 -7.25 -5.85 -7.1 -6.0 -7.15 -6.15 -8.3 -6.15 -8.65 -6.2 -9.05 -6.15 -10.5 -6.15" fill="#aaaaaa" fill-rule="evenodd" stroke="none"/>
    <path d="M4.6 -2.95 L4.2 -2.75 3.55 -2.5 3.45 -2.5 3.35 -2.55 4.3 -3.3 4.7 -3.6 5.15 -3.45 5.2 -3.4 5.0 -3.15 4.6 -2.95 M-10.5 -6.15 L-9.05 -6.15 -8.65 -6.2 -8.3 -6.15 -7.15 -6.15 -7.1 -6.0 -7.25 -5.85 -7.95 -5.85 -7.85 -5.7 Q-7.85 -5.55 -8.15 -5.55 L-8.3 -5.65 -10.05 -5.8 -10.4 -5.95 -10.5 -6.15" fill="#f3f3f3" fill-rule="evenodd" stroke="none"/>
    <path d="M6.35 -4.75 L6.45 -5.0 6.7 -5.45 8.85 -5.45 15.4 -5.45 19.1 -5.45 20.55 -5.45 Q20.2 -2.85 19.2 -0.5 17.75 2.5 15.15 5.05 9.15 11.05 0.7 11.05 -7.75 11.05 -13.75 5.05 -18.3 0.5 -19.4 -5.45 L-18.35 -5.45 -14.85 -5.45 -13.35 -5.45 -10.5 -5.45 -6.55 -5.45 -6.05 -5.45 -6.0 -5.35 -5.8 -5.0 -4.65 -3.55 Q-2.6 -1.45 0.3 -1.45 L1.8 -1.6 Q3.35 -1.95 4.6 -2.95 L5.0 -3.15 5.2 -3.4 5.15 -3.45 5.25 -3.55 6.35 -4.75" fill="url(#gradient1)" fill-rule="evenodd" stroke="none"/>
    <path d="M1.35 -14.15 L1.95 -14.1 2.1 -14.25 1.6 -14.5 1.2 -14.5 0.95 -14.65 0.5 -14.7 -0.4 -14.65 -0.6 -14.55 -1.35 -14.25 -1.45 -14.15 -2.45 -13.6 Q-3.2 -13.25 -3.35 -12.8 L-4.05 -11.9 -4.25 -11.4 -4.45 -11.05 -4.4 -10.95 -4.45 -10.6 -4.4 -10.15 -4.2 -10.15 -3.15 -11.8 -2.95 -12.05 -2.5 -12.5 -1.7 -13.15 Q-0.75 -13.7 1.0 -14.1 L1.35 -14.15 M4.7 -13.4 L5.65 -12.25 6.15 -11.0 6.35 -9.4 Q6.35 -7.95 5.65 -6.65 L4.7 -5.45 Q3.0 -3.75 0.7 -3.75 -1.65 -3.75 -3.3 -5.45 L-4.2 -6.65 Q-4.95 -7.95 -4.95 -9.4 L-4.7 -11.05 -4.15 -12.25 -3.3 -13.4 Q-1.65 -15.05 0.7 -15.05 3.0 -15.05 4.7 -13.4 M4.05 -11.35 L3.45 -12.1 Q2.3 -13.2 0.7 -13.2 -0.85 -13.2 -1.95 -12.1 L-2.5 -11.35 -2.65 -11.05 Q-3.05 -10.3 -3.05 -9.4 -3.05 -8.35 -2.55 -7.55 L-1.95 -6.7 Q-0.85 -5.55 0.7 -5.55 2.3 -5.55 3.45 -6.7 L4.05 -7.55 Q4.55 -8.35 4.55 -9.4 4.55 -10.25 4.2 -11.0 L4.05 -11.35" fill="#747474" fill-rule="evenodd" stroke="none"/>
    <path d="M1.35 -14.15 L1.0 -14.1 Q-0.75 -13.7 -1.7 -13.15 L-2.5 -12.5 -2.95 -12.05 -3.15 -11.8 -4.2 -10.15 -4.4 -10.15 -4.45 -10.6 -4.4 -10.95 -4.45 -11.05 -4.25 -11.4 -4.05 -11.9 -3.35 -12.8 Q-3.2 -13.25 -2.45 -13.6 L-1.45 -14.15 -1.35 -14.25 -0.6 -14.55 -0.4 -14.65 0.5 -14.7 0.95 -14.65 1.2 -14.5 1.6 -14.5 2.1 -14.25 1.95 -14.1 1.35 -14.15 M-4.1 -11.05 L-4.05 -11.1 -4.1 -11.05" fill="#c2c2c2" fill-rule="evenodd" stroke="none"/>
    <path d="M3.45 -9.4 Q3.45 -10.15 3.1 -10.75 L2.9 -11.0 2.65 -11.3 Q1.85 -12.1 0.7 -12.1 -0.45 -12.1 -1.2 -11.3 L-1.35 -11.05 -1.6 -10.75 Q-1.95 -10.15 -1.95 -9.4 L-1.65 -8.05 -1.2 -7.5 Q-0.45 -6.65 0.7 -6.65 1.85 -6.65 2.65 -7.5 L3.1 -8.05 Q3.45 -8.65 3.45 -9.4 M4.05 -11.35 L4.2 -11.0 Q4.55 -10.25 4.55 -9.4 4.55 -8.35 4.05 -7.55 L3.45 -6.7 Q2.3 -5.55 0.7 -5.55 -0.85 -5.55 -1.95 -6.7 L-2.55 -7.55 Q-3.05 -8.35 -3.05 -9.4 -3.05 -10.3 -2.65 -11.05 L-2.5 -11.35 -1.95 -12.1 Q-0.85 -13.2 0.7 -13.2 2.3 -13.2 3.45 -12.1 L4.05 -11.35" fill="#121212" fill-rule="evenodd" stroke="none"/>
    <path d="M3.45 -9.4 Q3.45 -8.65 3.1 -8.05 L2.65 -7.5 Q1.85 -6.65 0.7 -6.65 -0.45 -6.65 -1.2 -7.5 L-1.65 -8.05 -1.95 -9.4 Q-1.95 -10.15 -1.6 -10.75 L-1.35 -11.05 -1.2 -11.3 Q-0.45 -12.1 0.7 -12.1 1.85 -12.1 2.65 -11.3 L2.9 -11.0 3.1 -10.75 Q3.45 -10.15 3.45 -9.4 M0.85 -11.45 L0.55 -11.65 -0.6 -11.35 -1.15 -10.7 Q-1.3 -9.85 -1.6 -9.65 L-1.15 -9.45 -1.0 -9.5 -1.0 -9.55 -0.6 -10.4 Q-0.2 -10.9 0.65 -11.15 L0.85 -11.45" fill="#b1b1b1" fill-rule="evenodd" stroke="none"/>
    <path d="M0.85 -11.45 L0.65 -11.15 Q-0.2 -10.9 -0.6 -10.4 L-1.0 -9.55 -1.0 -9.5 -1.15 -9.45 -1.6 -9.65 Q-1.3 -9.85 -1.15 -10.7 L-0.6 -11.35 0.55 -11.65 0.85 -11.45" fill="#f3f3f3" fill-rule="evenodd" stroke="none"/>
  </g>
  <defs>
    <radialGradient cx="0" cy="0" fx="-972.8000000000001" fy="0" gradientTransform="matrix(0.0164, 0.0206, -0.0206, 0.0164, 0.5, -9.5)" gradientUnits="userSpaceOnUse" id="gradient0" r="819.2" spreadMethod="pad">
      <stop offset="0.054901960784313725" stop-color="#ffffff"/>
      <stop offset="0.08235294117647059" stop-color="#ff1212"/>
      <stop offset="0.8627450980392157" stop-color="#6b2222"/>
      <stop offset="0.8784313725490196" stop-color="#e76161"/>
      <stop offset="1.0" stop-color="#ffb6b6"/>
    </radialGradient>
    <radialGradient cx="0" cy="0" fx="-972.8000000000001" fy="0" gradientTransform="matrix(0.0164, 0.0206, -0.0206, 0.0164, 0.5, -9.5)" gradientUnits="userSpaceOnUse" id="gradient1" r="819.2" spreadMethod="pad">
      <stop offset="0.054901960784313725" stop-color="#ffffff"/>
      <stop offset="0.08235294117647059" stop-color="#c9c3c3"/>
      <stop offset="0.8941176470588236" stop-color="#626262"/>
      <stop offset="0.8980392156862745" stop-color="#8c8c8c"/>
      <stop offset="1.0" stop-color="#c4c4c4"/>
    </radialGradient>
  </defs>
</svg>
