<?xml version="1.0" encoding="UTF-8" standalone="no"?>
<svg xmlns:xlink="http://www.w3.org/1999/xlink" height="24.8px" width="21.5px" xmlns="http://www.w3.org/2000/svg">
  <g transform="matrix(1.0, 0.0, 0.0, 1.0, 0.2, 17.3)">
    <path d="M-0.2 7.5 L-0.2 -4.55 21.3 -17.3 -0.2 7.5" fill="#ffffff" fill-rule="evenodd" stroke="none"/>
  </g>
</svg>
