<?xml version="1.0" encoding="UTF-8" standalone="no"?>
<svg xmlns:xlink="http://www.w3.org/1999/xlink" height="46.1px" width="172.55px" xmlns="http://www.w3.org/2000/svg">
  <g transform="matrix(1.0, 0.0, 0.0, 1.0, 86.25, 23.05)">
    <path d="M17.0 -21.95 Q17.8 -21.0 17.5 -19.35 L17.35 -19.3 Q17.0 -19.15 16.85 -19.65 L16.85 -19.7 Q16.95 -20.4 16.65 -20.85 L16.65 -20.95 16.25 -21.35 16.25 -21.4 15.3 -22.05 14.2 -22.05 14.15 -22.05 12.95 -21.5 12.9 -21.5 Q12.0 -20.45 11.6 -18.9 11.8 -17.2 12.45 -15.95 L12.45 -15.9 13.25 -15.15 13.3 -15.05 Q13.3 -14.85 13.45 -14.7 L13.45 -14.65 15.5 -12.65 15.5 -12.6 Q17.35 -11.35 18.7 -9.6 L18.7 -9.55 19.0 -9.25 19.05 -9.25 19.65 -8.35 19.75 -8.35 Q20.7 -6.4 19.85 -4.05 L19.4 -2.7 17.9 -1.25 Q16.6 -0.45 14.95 0.1 L14.95 0.15 Q15.3 0.5 16.25 0.65 16.8 0.8 17.2 1.1 L17.55 1.2 18.85 2.65 18.9 2.65 Q19.85 4.25 20.15 6.65 L20.15 6.7 Q19.8 8.3 19.0 9.3 L19.0 9.4 Q17.05 11.5 14.55 13.0 L14.45 13.0 14.15 13.35 14.05 13.35 13.6 13.95 13.6 14.05 12.95 14.3 12.9 14.3 12.65 14.7 12.55 14.7 Q11.8 16.5 11.4 18.7 L11.4 18.75 11.9 20.5 11.95 20.6 Q12.65 21.55 13.8 22.15 L13.8 22.25 14.75 22.35 14.8 22.35 16.1 21.8 16.2 21.8 Q16.65 21.15 16.5 20.3 16.1 20.95 15.3 21.05 L15.25 21.05 14.45 20.8 14.4 20.8 14.0 20.45 14.0 20.4 13.7 19.45 13.7 19.35 14.35 18.4 14.4 18.35 15.35 17.9 15.45 17.9 17.05 18.8 17.15 18.8 Q17.9 20.45 17.0 21.8 L16.45 22.65 14.7 23.0 14.6 23.05 12.85 22.55 12.75 22.5 12.35 22.1 12.35 22.0 11.65 21.7 11.6 21.6 Q10.4 19.9 11.0 17.3 11.2 16.2 11.75 15.25 12.65 13.7 14.0 12.65 L14.4 12.25 13.45 12.2 13.4 12.2 Q11.9 11.85 10.8 11.1 L10.7 11.05 9.9 10.2 9.9 10.15 9.3 8.9 9.3 8.85 Q9.2 5.65 11.4 4.2 L14.6 4.0 14.7 4.0 15.55 4.8 15.65 4.8 15.9 5.65 15.9 5.7 15.7 6.85 15.7 6.95 Q14.95 7.6 13.85 7.25 L13.8 7.25 Q13.1 6.65 13.5 5.7 L13.6 5.65 14.6 4.95 14.6 4.9 Q13.95 4.25 12.95 4.2 L12.95 4.25 Q12.0 4.55 11.25 5.1 L11.2 5.1 Q9.9 6.45 10.25 8.85 10.3 9.4 10.65 9.85 L11.35 10.75 Q12.35 11.5 14.05 11.5 L15.75 11.25 16.75 10.75 18.25 9.2 18.3 9.2 Q18.35 8.85 18.65 8.7 L18.7 8.7 Q19.3 7.35 19.4 5.45 L19.4 5.3 18.15 2.75 18.15 2.7 17.75 2.35 17.7 2.35 Q16.25 0.85 13.8 0.85 L11.35 1.2 9.3 1.9 8.05 2.85 8.0 2.85 7.05 4.0 7.05 4.05 Q6.6 4.35 6.4 4.75 L6.35 4.75 Q5.45 7.15 5.95 10.2 L6.05 10.75 6.85 12.4 Q7.65 13.35 8.8 13.95 L8.85 14.05 10.7 15.4 10.8 15.55 Q9.9 15.75 9.1 15.1 L7.6 14.15 6.6 13.15 6.6 13.1 Q5.6 11.35 5.0 9.3 L5.0 9.25 Q5.0 7.2 5.3 5.3 L5.4 5.2 Q5.3 2.7 4.1 1.2 L4.05 1.1 Q3.15 0.5 2.0 0.7 L1.9 0.7 Q1.1 1.35 0.7 2.35 L0.7 2.4 1.15 3.85 1.0 3.85 Q0.8 4.55 1.25 5.45 1.55 6.25 2.0 6.85 2.8 7.7 4.05 8.1 4.35 9.8 3.35 11.05 L2.6 10.9 2.5 10.9 Q1.65 9.65 1.15 8.0 L1.1 8.0 Q0.8 8.65 0.9 9.75 1.0 12.65 1.55 15.05 L1.45 17.6 1.45 17.7 0.9 18.45 0.9 18.55 -0.5 18.45 -0.55 18.4 -0.9 18.05 -0.95 18.0 Q-1.1 15.8 -0.7 13.55 -0.2 11.25 -0.15 8.9 -0.7 9.3 -0.8 10.15 L-0.9 10.2 -1.5 10.9 -1.5 10.95 -2.95 10.9 -3.0 10.9 -3.55 9.95 -3.4 7.9 -1.65 7.4 -0.9 7.05 -0.35 6.5 Q0.2 5.5 0.2 4.25 L0.2 4.2 -1.1 4.4 -1.15 4.4 -1.9 4.15 -2.0 4.05 Q-2.55 3.6 -2.75 2.75 L-2.75 2.7 Q-2.55 1.95 -1.9 1.55 L-1.85 1.55 Q-1.3 1.45 -1.15 1.8 L-1.1 1.8 Q-0.75 2.65 -1.25 3.4 L-1.3 3.45 Q-0.8 3.8 -0.4 3.45 L-0.35 3.45 Q0.0 3.05 -0.15 2.2 L-0.15 2.15 -0.55 1.35 -0.55 1.2 -1.5 0.7 -1.55 0.7 -2.75 0.65 -2.75 0.6 Q-3.55 1.0 -4.1 1.8 L-4.15 1.8 Q-4.9 4.05 -4.6 7.15 -4.35 9.05 -4.9 10.5 L-6.1 13.1 -7.6 14.35 -7.65 14.45 -8.15 14.9 -8.15 15.0 Q-8.95 15.65 -9.95 15.65 -10.25 15.35 -9.85 15.1 L-9.75 15.05 Q-8.7 14.6 -7.7 13.95 L-7.65 13.9 -7.5 13.55 -7.5 13.5 -7.15 13.2 -7.1 13.2 Q-5.4 11.15 -5.25 7.7 -5.2 6.5 -5.4 5.45 L-6.15 4.0 -6.2 3.9 -7.65 2.1 -7.65 2.0 -8.6 1.55 -8.7 1.55 -8.9 1.25 -8.9 1.2 Q-10.3 0.6 -12.0 0.15 L-15.1 0.5 -15.25 0.5 -17.15 1.55 -17.3 1.55 Q-18.9 3.1 -18.7 6.4 -18.7 7.2 -18.3 7.8 L-17.55 9.1 -16.65 9.85 -16.65 9.95 -14.95 10.55 -14.9 10.55 -13.95 10.35 -13.85 10.35 Q-12.0 10.35 -10.85 9.3 L-10.8 9.3 Q-10.5 9.45 -10.6 9.95 -12.35 11.25 -15.1 11.15 L-15.1 11.25 -13.4 13.1 -11.6 14.7 Q-10.05 16.55 -10.45 19.55 -10.6 20.45 -11.0 21.15 L-11.75 21.8 -11.75 21.9 Q-12.9 22.55 -14.8 22.5 L-14.9 22.5 -16.25 21.6 -16.35 21.6 Q-17.1 20.65 -17.0 18.95 L-17.0 18.8 -16.6 18.2 -16.6 18.15 -16.25 17.85 -16.25 17.8 Q-15.5 17.5 -15.3 17.1 L-15.3 17.05 Q-15.85 16.35 -17.0 16.15 L-18.5 15.65 -19.75 14.85 Q-20.85 14.3 -21.6 13.5 L-21.6 13.4 -21.95 13.3 -22.0 13.3 -24.3 10.8 -24.4 10.8 -25.75 8.75 -25.75 8.7 -27.4 6.4 -27.4 6.3 -28.15 5.5 -28.15 5.45 Q-28.4 5.15 -28.5 5.5 L-28.55 5.5 -29.15 6.7 -29.25 6.8 -30.2 7.55 -30.2 7.6 -31.3 7.75 -31.3 7.7 Q-31.3 6.5 -30.75 5.5 L-30.65 5.5 Q-30.8 3.85 -31.4 2.75 L-31.4 2.7 -31.95 2.1 -32.05 2.0 -32.35 1.9 -32.45 1.9 -33.45 0.9 Q-35.3 -0.1 -37.65 0.5 -39.7 1.05 -40.85 2.4 -41.95 4.0 -41.4 6.25 L-41.2 7.25 Q-40.15 8.85 -37.45 8.75 L-37.35 8.75 -36.45 8.35 -36.4 8.35 Q-35.65 7.55 -35.5 5.95 L-35.5 5.9 -36.0 5.2 -36.0 5.15 Q-36.4 4.8 -37.1 4.7 -37.75 4.6 -38.1 5.1 L-38.2 5.1 -36.95 5.7 -36.6 5.95 Q-36.35 6.85 -36.9 7.4 L-36.95 7.5 -37.75 7.7 -37.85 7.7 -38.65 7.4 -38.75 7.35 Q-39.95 5.7 -38.75 4.15 -37.75 2.75 -35.7 2.85 -34.9 3.1 -34.3 3.5 L-34.2 3.5 -33.65 4.05 -32.85 5.55 Q-32.5 9.05 -34.7 10.8 L-34.7 10.9 Q-36.2 11.8 -38.3 12.05 L-38.3 12.1 -39.0 12.1 -39.05 12.1 Q-43.15 11.35 -46.6 9.5 L-46.65 9.5 Q-48.35 8.5 -50.8 8.35 L-50.95 8.35 -54.0 9.2 Q-54.45 8.65 -53.95 8.15 L-53.95 8.1 -53.4 7.7 -53.25 7.7 -53.05 7.4 -53.05 7.35 -51.15 6.8 -51.1 6.8 -49.6 6.95 -49.5 6.95 Q-49.6 6.45 -49.85 6.1 L-49.85 6.05 -51.7 4.55 -51.75 4.45 -52.65 3.7 -52.65 3.65 Q-53.5 3.25 -54.1 2.65 L-54.1 2.55 Q-56.6 1.35 -60.05 1.1 -66.05 0.8 -67.6 4.8 -67.9 5.45 -67.6 6.1 L-66.75 7.9 Q-65.7 8.85 -63.7 8.55 L-63.65 8.55 Q-62.55 8.1 -62.1 7.0 L-62.1 6.95 -62.85 7.0 -62.9 7.05 -64.0 6.8 -64.05 6.8 -64.6 5.85 -64.6 5.7 -64.35 4.45 -64.25 4.4 Q-63.1 3.45 -61.8 4.25 L-61.45 4.6 -61.05 5.5 -61.0 5.5 Q-60.9 6.95 -61.45 7.7 L-61.45 7.75 Q-62.15 8.7 -63.2 9.25 L-63.25 9.3 Q-65.35 9.8 -66.95 8.9 L-67.0 8.9 -67.9 7.95 -67.95 7.95 Q-68.55 7.05 -68.7 5.7 L-68.7 5.65 Q-68.5 4.2 -67.8 3.25 L-67.8 3.15 -67.55 2.95 -67.5 2.95 -66.95 1.95 -66.95 1.9 -68.35 2.15 -68.45 2.15 -72.6 3.45 -72.65 3.5 Q-75.25 4.15 -77.7 3.6 L-77.7 3.5 -78.05 3.1 -78.05 3.05 -78.4 2.75 -78.45 2.75 -78.75 2.0 -78.8 1.95 -78.35 0.6 -78.25 0.5 -81.35 0.65 -81.4 0.65 -83.4 1.2 -83.45 1.2 -85.05 0.5 -86.05 -0.05 Q-86.25 -0.15 -86.25 -0.6 -85.5 -1.05 -84.4 -1.35 L-84.35 -1.35 -84.15 -1.6 -84.15 -1.7 Q-82.1 -2.1 -80.4 -1.25 L-79.0 -1.05 -78.05 -0.85 -78.0 -0.85 -78.55 -1.6 -78.55 -1.7 -78.55 -2.75 -78.55 -2.9 -77.5 -4.0 -77.45 -4.0 -76.1 -4.4 Q-73.1 -4.25 -70.9 -3.3 -69.3 -2.7 -67.9 -2.5 L-68.55 -4.4 -68.65 -4.4 Q-68.85 -7.8 -66.8 -9.3 L-66.75 -9.3 Q-66.1 -9.8 -65.15 -9.85 L-63.1 -9.95 Q-60.85 -9.2 -60.85 -6.65 -60.9 -5.75 -61.2 -5.0 L-61.65 -4.55 Q-62.15 -4.25 -62.65 -4.05 L-62.65 -4.0 -64.45 -4.35 -64.55 -4.35 -65.15 -5.1 -65.0 -6.3 -65.0 -6.4 -64.55 -6.95 -64.55 -7.0 -63.5 -7.15 -63.45 -7.15 -62.55 -6.25 -62.55 -6.2 -63.05 -5.1 -62.95 -5.1 Q-62.35 -5.15 -62.0 -5.45 L-62.0 -5.5 -61.65 -6.65 -61.65 -6.75 -62.35 -8.45 -62.4 -8.5 -63.1 -9.0 -63.1 -9.05 -63.5 -9.05 -64.25 -9.3 -64.35 -9.3 -65.9 -8.9 -66.0 -8.9 -66.95 -8.05 -67.0 -8.05 Q-68.3 -6.25 -67.25 -3.85 L-67.0 -3.2 -66.65 -2.55 Q-65.0 -1.35 -62.3 -1.2 L-57.1 -1.55 -55.85 -2.15 -55.85 -2.2 -54.85 -2.35 -54.8 -2.35 Q-54.65 -2.85 -53.95 -2.75 L-50.6 -4.95 -50.25 -5.1 -50.55 -5.35 -50.55 -5.45 Q-52.1 -6.0 -53.35 -6.95 L-53.4 -7.0 Q-53.9 -7.3 -54.1 -7.9 L-54.1 -7.95 -52.2 -7.8 Q-47.6 -7.8 -44.85 -9.65 L-43.25 -10.7 Q-42.0 -11.35 -40.3 -11.6 L-36.75 -11.6 -34.75 -10.6 -34.7 -10.55 -34.4 -10.15 -34.35 -10.1 -34.0 -9.95 -33.95 -9.95 Q-33.25 -8.9 -32.8 -7.6 L-32.7 -7.6 -32.9 -6.3 -33.0 -6.3 -32.9 -5.9 -32.9 -5.85 Q-33.15 -4.95 -33.55 -4.25 L-33.55 -4.2 Q-34.4 -3.1 -36.2 -2.75 L-36.2 -2.7 -37.9 -3.1 -37.95 -3.1 -39.2 -4.2 -39.2 -4.25 -39.4 -4.8 -39.5 -4.8 Q-39.35 -5.1 -39.35 -5.5 L-39.4 -5.55 -39.05 -6.1 -39.05 -6.2 -38.4 -6.65 -38.4 -6.75 -37.15 -6.5 -37.1 -6.45 Q-36.75 -5.55 -37.5 -5.15 L-37.5 -5.1 Q-38.3 -5.25 -38.2 -4.75 L-38.2 -4.7 -37.15 -4.55 -37.1 -4.55 Q-36.35 -4.9 -35.95 -5.55 L-35.85 -5.55 Q-35.6 -6.6 -35.85 -7.4 L-35.85 -7.5 -36.45 -8.25 -36.55 -8.3 -38.4 -8.65 -38.45 -8.65 Q-40.1 -8.3 -41.0 -7.2 L-41.05 -7.2 Q-42.0 -5.85 -41.45 -3.7 L-41.1 -2.55 Q-39.05 -0.3 -35.5 -0.9 L-35.45 -0.9 -32.65 -2.0 -32.6 -2.1 -31.9 -2.95 -31.85 -2.95 Q-30.85 -4.4 -30.8 -6.65 L-30.8 -6.75 Q-31.55 -7.7 -31.6 -8.85 -30.95 -9.2 -30.4 -8.65 L-30.05 -8.25 -30.0 -8.25 -28.75 -6.2 -21.4 -13.5 -19.95 -15.0 Q-17.95 -16.2 -15.45 -16.75 L-11.8 -16.95 Q-11.7 -16.95 -11.75 -16.7 -12.55 -16.1 -13.8 -16.15 -15.3 -16.3 -16.85 -15.6 L-19.45 -14.25 Q-19.6 -13.95 -19.95 -13.9 L-20.0 -13.85 -20.5 -13.3 -20.55 -13.2 -20.9 -13.1 -20.95 -13.0 -26.0 -7.7 -26.0 -7.6 Q-27.95 -6.25 -29.5 -4.5 L-29.55 -4.4 -25.4 -6.0 -25.35 -6.0 -23.45 -5.9 -23.3 -5.9 Q-21.95 -5.45 -21.3 -4.35 L-21.25 -4.25 Q-21.25 -4.0 -21.6 -4.05 L-21.6 -4.15 Q-23.55 -5.1 -26.15 -4.55 -28.15 -4.2 -29.5 -3.2 -31.9 -1.55 -34.9 -0.45 L-34.0 0.15 Q-32.85 0.5 -31.9 1.1 L-30.2 2.4 Q-28.7 3.4 -26.55 3.85 -24.3 4.4 -22.4 3.5 L-21.25 3.45 -21.15 3.45 Q-21.4 4.25 -22.05 4.6 L-22.05 4.7 Q-24.95 5.55 -27.8 4.25 L-27.95 4.25 -26.9 6.05 -26.9 6.1 -23.85 10.3 -23.85 10.35 -20.5 13.5 -20.4 13.5 -19.45 14.25 -19.45 14.3 Q-17.0 15.65 -13.6 16.1 L-13.6 16.15 -12.45 16.2 -12.45 16.3 Q-12.55 16.95 -13.6 16.9 -14.05 16.85 -14.2 17.1 L-13.65 17.7 -13.65 17.8 -13.4 18.25 -13.3 18.25 -13.4 19.45 -13.4 19.5 Q-13.85 20.05 -14.8 20.2 L-14.9 20.2 Q-15.55 19.85 -15.7 18.95 L-15.8 18.95 Q-16.25 18.75 -16.25 19.5 L-16.0 20.5 -15.9 20.6 -15.25 21.2 -15.25 21.25 -14.0 21.75 -13.85 21.8 -12.7 21.4 -12.65 21.4 -11.7 20.5 -11.6 20.45 Q-11.15 19.65 -11.0 18.4 L-10.95 18.4 Q-11.5 15.45 -13.4 13.95 L-15.1 12.4 -15.45 12.2 -15.5 12.2 Q-15.65 11.85 -16.05 11.7 L-16.1 11.7 -18.25 9.6 -18.3 9.6 Q-20.0 7.5 -19.4 3.9 -19.35 3.25 -18.9 2.75 L-18.7 2.3 -17.4 1.05 -17.4 1.0 Q-16.4 0.25 -15.05 -0.1 L-15.05 -0.15 Q-14.5 -0.15 -14.15 -0.4 L-14.15 -0.45 -14.95 -0.6 -15.05 -0.6 Q-15.1 -0.8 -15.35 -0.8 L-15.35 -0.85 -15.8 -0.8 -15.85 -0.85 Q-19.4 -2.15 -19.6 -6.65 L-19.55 -8.1 -19.15 -9.3 -17.75 -10.85 -17.75 -10.9 -16.55 -11.8 Q-15.15 -12.4 -14.05 -13.3 L-14.0 -13.3 -12.65 -14.25 -12.55 -14.25 -11.95 -15.4 -11.95 -15.45 Q-11.75 -15.55 -11.7 -15.75 L-11.6 -15.75 Q-10.65 -17.45 -11.05 -19.65 L-11.55 -20.95 -12.3 -21.7 -12.35 -21.75 -13.0 -22.15 -13.0 -22.25 -14.7 -22.3 -14.8 -22.3 -15.5 -21.9 -15.65 -21.9 -16.0 -21.5 -16.05 -21.5 -16.35 -20.25 -16.25 -20.25 Q-15.65 -21.3 -14.3 -21.15 L-14.2 -21.15 -13.55 -20.3 -13.45 -20.3 -13.45 -19.45 -13.45 -19.35 -14.3 -18.5 -15.5 -18.2 -15.65 -18.2 -16.2 -18.4 -16.25 -18.5 Q-17.15 -19.1 -17.3 -20.6 L-17.35 -20.6 -16.85 -21.8 -16.85 -21.9 -16.25 -22.5 -16.25 -22.55 -12.5 -22.8 -12.35 -22.8 -11.55 -22.25 Q-10.1 -20.8 -10.25 -18.05 -10.4 -15.9 -11.5 -14.6 L-11.8 -14.15 -12.75 -13.4 -12.85 -13.35 -13.2 -13.2 -13.25 -13.2 -14.2 -12.25 -14.2 -12.2 Q-12.45 -12.4 -11.0 -11.45 L-10.05 -10.85 Q-8.6 -8.9 -9.5 -6.2 L-10.05 -5.25 -10.1 -4.8 -10.65 -4.4 -10.75 -4.35 Q-12.35 -3.7 -14.2 -4.35 L-14.3 -4.35 -15.1 -5.25 -15.35 -5.85 -15.45 -5.85 -15.3 -7.0 -15.3 -7.05 -14.6 -7.7 -14.55 -7.7 Q-13.3 -7.95 -12.65 -7.15 L-12.55 -7.15 Q-12.3 -6.75 -12.55 -6.3 L-12.55 -6.25 -13.25 -5.75 -13.3 -5.75 Q-14.2 -5.7 -14.15 -6.3 L-14.15 -6.4 Q-14.35 -7.0 -14.75 -6.5 L-14.8 -6.45 -14.5 -5.45 Q-13.1 -4.4 -11.4 -5.0 L-10.85 -5.15 -10.5 -5.55 -10.45 -5.55 Q-9.45 -7.3 -10.05 -9.55 L-10.05 -9.6 -10.3 -9.8 -10.4 -9.85 -10.6 -10.3 -10.6 -10.35 Q-12.5 -11.9 -15.35 -11.35 L-15.7 -11.25 Q-16.45 -10.75 -17.35 -10.4 L-17.6 -10.1 -17.7 -10.1 Q-17.7 -9.85 -17.85 -9.75 L-17.85 -9.65 -18.15 -9.4 -18.25 -9.3 Q-19.4 -7.75 -18.85 -5.35 L-18.65 -4.8 -17.9 -3.2 -16.85 -2.15 -16.85 -2.1 Q-14.95 -1.05 -12.55 -1.05 -10.85 -1.05 -9.55 -1.6 -6.9 -2.7 -5.8 -5.3 -4.7 -7.7 -5.6 -10.4 L-6.2 -11.9 -7.7 -13.55 -7.7 -13.65 Q-8.2 -13.75 -8.4 -14.1 L-8.4 -14.15 -8.75 -14.3 -8.8 -14.4 Q-9.65 -15.0 -9.85 -15.75 L-9.9 -15.8 Q-9.55 -16.15 -9.2 -15.8 L-9.15 -15.8 Q-8.75 -15.35 -8.2 -15.0 L-8.15 -15.0 -6.35 -13.15 -6.3 -13.15 -5.95 -12.2 -5.95 -12.1 Q-4.25 -10.4 -4.5 -7.35 L-4.6 -5.55 -4.8 -3.85 Q-4.45 -3.2 -4.7 -2.65 L-4.8 -2.65 Q-5.2 -2.55 -5.4 -3.2 L-5.45 -3.2 -5.55 -4.0 -5.55 -4.15 Q-7.3 -1.75 -10.45 -0.7 L-10.45 -0.65 -11.35 -0.45 Q-11.35 -0.15 -10.6 -0.15 L-10.5 -0.15 -8.8 0.45 -8.75 0.5 -8.45 0.8 -6.55 2.35 -6.5 2.35 -5.6 3.8 -5.6 3.85 Q-5.15 2.3 -4.25 1.2 L-3.7 0.5 -3.6 0.35 -2.2 0.1 -2.1 0.1 Q-0.55 0.3 0.2 1.4 L0.25 1.4 Q0.7 1.55 0.75 1.1 L0.75 1.05 Q1.45 0.5 2.3 0.15 L3.8 0.45 3.9 0.5 4.85 1.45 Q5.6 2.65 5.8 4.35 L5.85 4.35 6.5 3.5 6.5 3.45 7.8 2.3 7.85 2.2 8.2 2.1 8.25 2.0 8.45 1.75 12.1 0.3 12.15 0.3 10.05 -0.45 Q9.0 -0.85 8.1 -1.4 L5.85 -3.95 Q5.8 -2.85 5.4 -1.95 L5.4 -1.9 4.15 -0.65 4.15 -0.6 Q3.75 -0.3 3.15 -0.25 L3.15 -0.15 1.85 -0.3 1.75 -0.3 1.1 -1.0 1.1 -1.05 Q0.7 -1.25 0.45 -1.7 L0.45 -1.75 -0.55 -1.35 -0.6 -1.35 -0.3 -2.2 -0.3 -2.3 -0.5 -3.25 -0.55 -3.3 -1.45 -3.5 -1.45 -3.45 Q-0.7 -2.85 -1.45 -2.1 -1.55 -1.9 -2.0 -1.9 L-2.1 -1.9 Q-2.75 -2.2 -3.1 -2.85 L-3.1 -2.9 Q-3.1 -3.65 -2.6 -4.0 L-1.5 -4.35 -1.45 -4.35 Q-0.8 -4.2 -0.5 -3.85 L-0.5 -3.8 Q-0.05 -4.6 -0.5 -5.5 L-1.05 -7.05 Q-1.9 -8.3 -3.55 -8.8 L-3.6 -8.8 -3.85 -9.3 -3.9 -9.3 Q-3.95 -10.7 -3.5 -11.65 L-3.5 -11.7 Q-2.95 -12.05 -2.4 -12.0 L-2.35 -12.0 -1.65 -11.3 -1.55 -11.3 -0.8 -9.6 -0.75 -9.6 Q-0.5 -10.55 -0.75 -11.7 -1.55 -14.9 -1.1 -18.35 L-0.05 -19.0 0.05 -19.0 Q0.75 -18.95 1.0 -18.5 L1.1 -18.5 Q1.45 -17.2 1.35 -15.6 L0.95 -12.6 1.0 -12.2 1.0 -12.1 0.6 -9.65 0.6 -9.6 Q1.25 -10.15 1.45 -11.1 L1.45 -11.15 2.2 -11.85 2.2 -11.9 3.0 -12.2 3.05 -12.2 3.8 -11.85 3.8 -11.8 Q4.15 -10.7 3.95 -9.3 L3.95 -9.25 3.2 -8.7 3.15 -8.7 2.75 -8.35 2.75 -8.3 1.75 -7.7 1.75 -7.6 1.45 -7.05 1.35 -7.05 Q0.6 -5.75 0.7 -4.15 L0.7 -4.0 Q1.3 -4.15 1.7 -4.4 L1.75 -4.4 Q2.95 -4.4 3.4 -3.65 L3.5 -3.6 3.55 -2.9 3.55 -2.75 Q3.35 -2.15 2.75 -1.9 L2.65 -1.9 Q2.05 -1.9 1.75 -2.2 L1.75 -2.3 1.75 -3.6 1.7 -3.6 Q1.35 -3.65 1.1 -3.25 L1.0 -3.2 0.95 -2.55 0.95 -2.5 1.65 -0.85 1.7 -0.7 3.0 -0.8 3.05 -0.7 4.05 -1.35 4.05 -1.4 Q5.65 -3.2 5.1 -6.45 4.9 -7.4 5.05 -8.55 5.25 -10.9 6.4 -12.35 L7.1 -13.35 8.55 -14.7 8.55 -14.8 Q9.5 -15.35 10.65 -15.7 L10.8 -15.6 Q10.45 -14.8 9.5 -14.6 L9.35 -14.6 Q9.2 -14.3 8.85 -14.15 L8.8 -14.15 8.45 -13.7 8.45 -13.65 7.6 -12.8 7.5 -12.8 7.35 -12.45 7.3 -12.4 6.95 -12.05 6.9 -12.05 Q5.3 -10.0 5.8 -6.8 L6.3 -4.9 Q6.5 -4.2 6.85 -3.8 L7.1 -3.5 7.15 -3.5 Q7.8 -2.5 8.8 -1.8 L8.8 -1.75 Q10.05 -1.05 11.4 -0.5 L14.15 -0.4 14.15 -0.3 Q16.5 -0.9 18.15 -2.3 L18.25 -2.3 Q19.6 -3.85 19.45 -6.2 19.3 -8.05 18.35 -9.05 L17.75 -9.85 16.1 -10.75 16.1 -10.85 Q13.6 -11.25 11.8 -10.35 L11.75 -10.35 11.25 -9.85 11.2 -9.85 Q10.05 -8.5 10.6 -6.45 10.7 -5.85 11.15 -5.45 L11.6 -4.95 12.2 -4.55 Q13.1 -4.4 13.5 -4.8 L13.6 -4.8 13.1 -5.25 13.05 -5.25 12.85 -5.9 12.85 -6.0 Q12.9 -6.65 13.3 -7.05 L13.3 -7.15 14.6 -7.35 14.7 -7.3 15.5 -6.3 15.5 -6.25 Q15.45 -5.1 14.8 -4.5 L14.8 -4.4 13.2 -3.85 13.05 -3.85 11.6 -4.2 11.55 -4.2 11.15 -4.6 11.15 -4.7 10.8 -4.8 10.7 -4.8 Q9.55 -6.0 9.75 -7.95 9.9 -9.3 10.65 -10.2 L11.2 -10.85 Q12.35 -11.45 13.95 -11.7 L14.0 -11.7 15.7 -11.7 14.55 -12.8 14.55 -12.9 13.45 -13.65 13.4 -13.65 12.65 -14.6 12.55 -14.6 12.3 -15.2 12.2 -15.25 11.8 -15.7 11.75 -15.7 Q11.05 -16.75 11.0 -18.5 10.9 -20.05 11.65 -21.2 L12.65 -22.25 12.65 -22.3 14.6 -22.7 14.7 -22.7 17.0 -22.05 17.0 -21.95 M16.1 -19.9 Q16.1 -19.0 15.5 -18.8 L15.45 -18.75 Q15.3 -18.55 15.65 -18.5 L15.7 -18.5 16.85 -18.4 16.95 -18.35 Q16.95 -17.85 16.45 -17.85 L16.45 -17.8 Q15.1 -17.6 14.2 -18.15 L14.2 -18.2 Q13.85 -18.8 13.7 -19.7 L13.7 -19.75 14.15 -20.2 14.15 -20.25 14.9 -20.6 14.95 -20.6 Q15.75 -20.6 16.05 -19.9 L16.1 -19.9 M13.6 -16.95 Q17.25 -16.85 19.8 -15.2 L21.6 -14.1 24.65 -10.9 24.7 -10.9 Q24.7 -10.7 24.85 -10.55 L24.85 -10.5 26.35 -8.7 26.45 -8.7 26.55 -8.35 26.55 -8.3 28.45 -6.2 28.55 -6.2 Q29.0 -6.25 29.45 -6.95 L29.5 -7.0 29.75 -7.3 31.6 -8.05 31.6 -7.95 Q31.55 -6.85 31.0 -5.85 L31.0 -5.75 31.05 -4.8 31.0 -4.8 Q31.4 -3.3 32.3 -2.2 L32.3 -2.15 33.4 -1.35 33.4 -1.25 Q34.95 -0.5 36.95 -0.25 L37.0 -0.25 Q38.9 -0.45 40.3 -1.2 L40.35 -1.25 41.05 -1.95 41.1 -1.95 41.3 -2.35 41.45 -2.35 Q43.3 -5.15 41.5 -7.9 L41.5 -7.95 40.65 -8.7 40.65 -8.8 Q39.35 -9.6 37.7 -9.1 L36.75 -8.8 36.35 -8.3 36.25 -8.3 36.0 -7.5 35.9 -7.5 Q36.1 -7.05 35.9 -6.75 L35.9 -6.65 36.75 -5.35 36.8 -5.35 38.7 -5.45 38.7 -5.5 Q38.9 -5.9 38.1 -5.65 L38.05 -5.55 Q37.3 -5.5 36.95 -6.0 36.75 -6.95 37.35 -7.4 L37.4 -7.5 38.65 -7.6 38.7 -7.6 39.2 -7.15 39.25 -7.15 39.75 -6.3 39.8 -6.3 Q39.8 -4.95 39.2 -4.2 L39.2 -4.15 38.8 -3.8 38.8 -3.7 37.95 -3.25 37.95 -3.2 Q35.85 -2.9 34.6 -3.8 L34.55 -3.8 33.95 -4.5 33.85 -4.55 Q32.65 -6.45 33.65 -8.8 L34.3 -10.0 34.9 -10.55 34.95 -10.55 Q36.05 -11.6 37.85 -11.8 L41.5 -11.9 Q43.85 -10.95 45.95 -9.85 L46.3 -9.75 Q48.4 -8.8 50.95 -8.25 52.25 -8.25 53.15 -8.8 L53.2 -8.8 Q53.6 -9.3 54.1 -9.25 L54.2 -9.25 Q54.5 -9.3 54.45 -8.9 L54.45 -8.85 54.2 -8.35 54.2 -8.3 52.85 -7.15 52.8 -7.05 50.05 -6.05 50.0 -6.0 51.9 -4.4 51.9 -4.35 52.65 -3.95 52.65 -3.85 53.35 -3.45 53.4 -3.4 Q55.8 -1.9 58.75 -1.05 L60.8 -0.65 Q63.9 -0.3 66.1 -1.7 L67.55 -3.2 67.6 -3.2 Q68.65 -5.0 67.8 -6.85 L67.05 -7.8 66.85 -8.25 66.8 -8.3 64.6 -8.8 64.55 -8.8 63.65 -8.65 63.5 -8.65 Q63.35 -8.35 62.95 -8.3 L62.9 -8.3 62.5 -7.75 62.4 -7.7 Q61.95 -6.95 61.8 -5.9 L61.8 -5.85 62.15 -5.1 62.2 -5.1 62.55 -5.85 62.55 -5.9 Q62.95 -6.5 63.8 -6.65 L63.85 -6.65 64.2 -6.65 64.25 -6.65 64.65 -6.2 64.75 -6.2 65.1 -5.35 Q65.1 -4.55 64.75 -4.05 L64.65 -4.0 62.15 -4.05 61.4 -4.55 Q60.7 -6.4 61.65 -7.95 L61.65 -8.05 62.5 -8.85 62.5 -8.9 Q63.3 -9.1 63.85 -9.45 L63.85 -9.55 66.25 -9.45 66.3 -9.45 66.65 -9.2 66.65 -9.1 Q67.8 -8.65 68.55 -7.75 68.55 -7.7 68.65 -7.7 69.3 -6.25 69.1 -4.2 L69.1 -4.15 68.65 -3.3 68.65 -3.2 67.45 -1.9 67.45 -1.8 Q68.9 -1.9 70.15 -2.5 L74.15 -3.95 Q76.4 -4.55 78.25 -3.45 79.15 -2.75 79.2 -1.4 L79.2 -1.35 79.0 -0.7 79.0 -0.65 Q78.65 -0.4 78.45 0.1 L78.45 0.15 79.35 0.25 79.4 0.25 80.05 0.05 80.1 -0.05 81.75 -0.3 82.15 -0.25 82.2 -0.25 82.9 -0.5 82.9 -0.6 86.2 0.45 86.3 0.65 Q86.4 1.1 86.1 1.2 L86.05 1.2 Q84.8 1.4 83.8 1.9 L83.7 1.9 78.2 1.1 Q78.75 1.55 78.95 2.3 L78.95 2.35 78.45 3.85 78.45 3.9 77.25 4.7 77.15 4.7 Q76.2 4.55 75.3 4.7 L75.25 4.7 71.3 3.4 68.55 2.15 67.55 2.0 68.75 4.6 68.75 4.7 68.7 5.3 68.7 5.45 Q69.05 7.15 68.1 8.35 L68.0 8.45 66.9 9.4 Q65.65 10.15 64.05 9.8 62.55 9.45 61.65 8.5 L61.1 7.05 61.05 6.95 Q61.2 5.3 62.1 4.4 L62.1 4.35 63.85 3.85 63.9 3.85 64.8 4.15 64.9 4.2 65.3 4.7 65.35 4.7 65.5 5.45 65.5 5.5 Q65.35 6.4 64.6 6.7 L64.6 6.8 63.65 6.85 63.5 6.85 Q62.95 6.6 62.75 6.05 L62.7 5.95 62.85 5.2 62.7 5.2 62.15 5.75 62.15 5.85 62.0 6.65 62.0 6.7 62.5 7.95 62.5 8.0 Q63.45 8.9 65.0 9.2 L65.1 9.2 66.45 8.7 66.5 8.7 Q67.95 7.55 67.95 5.15 L67.8 4.6 67.05 2.95 66.45 2.35 66.4 2.3 Q63.85 1.0 60.15 1.45 L57.15 1.9 Q54.65 2.85 52.5 4.15 L52.45 4.2 Q51.4 4.45 50.65 5.1 L50.65 5.15 Q51.85 5.5 52.65 6.1 L52.7 6.1 54.2 7.95 54.3 8.15 53.8 8.45 53.7 8.45 Q51.9 7.2 49.35 7.9 48.2 8.25 47.2 8.85 44.2 10.55 40.35 11.5 L37.55 11.65 37.3 11.45 37.2 11.35 Q35.25 11.05 34.2 9.75 L34.15 9.75 Q32.9 8.15 33.3 5.85 L33.55 4.8 33.95 4.35 33.95 4.25 Q35.1 2.55 37.75 2.95 L38.25 3.1 38.4 3.1 39.2 3.9 39.25 3.9 39.7 5.0 39.7 5.1 Q39.6 5.9 39.15 6.3 L39.15 6.4 37.7 6.45 37.65 6.45 Q37.35 6.3 37.35 5.9 L37.35 5.85 Q37.4 5.35 37.7 5.15 L37.75 5.1 38.65 4.7 Q38.25 4.2 37.55 4.4 L37.5 4.4 36.35 5.3 36.25 5.3 36.05 5.95 36.0 5.95 36.05 6.95 36.1 7.05 Q36.45 7.8 37.2 8.25 L37.2 8.3 38.7 8.5 38.8 8.5 Q40.5 8.1 41.45 7.0 L41.5 6.95 Q42.5 5.3 41.65 3.25 L41.2 2.15 40.85 1.9 40.75 1.9 40.2 1.25 40.2 1.2 Q38.1 0.15 35.45 0.8 L34.75 1.0 Q33.65 1.45 32.85 2.15 L32.05 3.05 Q31.2 4.25 31.2 6.4 L31.2 6.45 31.95 8.1 32.05 8.15 31.8 8.85 31.8 8.9 Q31.2 8.85 30.85 8.5 L30.8 8.5 29.85 7.55 29.75 7.55 Q29.45 6.65 28.95 5.9 L28.9 5.9 Q27.8 6.65 27.05 7.8 L26.95 7.9 Q23.75 11.7 19.75 14.8 17.75 16.3 14.55 16.55 13.25 16.65 12.65 16.1 L14.05 15.9 17.5 15.45 Q18.8 14.85 19.8 13.9 L22.0 12.1 22.0 12.05 22.6 11.7 22.65 11.7 Q25.2 9.25 27.4 6.4 L27.4 6.3 27.95 5.85 28.0 5.85 28.35 5.1 28.4 5.0 Q26.35 5.95 23.65 5.65 L23.55 5.65 22.65 5.15 22.6 5.15 Q22.1 4.8 21.9 4.25 L21.9 4.2 23.75 4.4 27.65 4.15 Q28.05 3.9 28.55 3.8 L28.9 3.8 Q29.5 3.25 30.2 2.9 L30.25 2.85 30.5 2.55 30.95 2.35 31.0 2.35 31.2 2.1 31.25 2.0 34.6 0.1 Q34.15 -0.3 33.45 -0.5 L33.4 -0.5 33.2 -0.8 33.1 -0.85 32.35 -1.35 32.3 -1.4 31.7 -1.75 31.6 -1.75 Q30.4 -2.75 28.8 -3.45 L28.8 -3.5 Q28.15 -3.7 27.5 -4.0 L26.55 -4.2 26.5 -4.2 25.75 -4.15 25.65 -4.15 24.7 -4.35 Q23.15 -3.85 21.8 -3.65 L21.65 -3.6 Q22.35 -4.7 23.7 -5.0 L23.7 -5.1 25.25 -5.3 25.35 -5.35 28.55 -4.55 28.55 -4.6 28.15 -5.25 28.05 -5.25 27.2 -6.8 27.2 -6.85 26.9 -7.15 26.85 -7.15 26.5 -7.75 26.5 -7.8 Q25.2 -9.1 24.05 -10.55 L23.95 -10.55 Q22.95 -12.05 21.6 -13.15 L21.6 -13.2 Q21.35 -13.2 21.25 -13.35 L21.15 -13.35 20.95 -13.65 20.95 -13.7 Q20.15 -13.95 19.65 -14.45 L19.6 -14.5 Q17.25 -15.95 13.85 -16.15 13.45 -16.2 13.25 -16.45 L13.05 -16.55 Q13.05 -16.95 13.45 -16.95 L13.6 -16.95 M8.85 -13.1 L8.95 -13.15 12.0 -12.75 12.85 -12.35 Q12.15 -12.0 11.15 -11.9 L9.7 -11.6 Q8.85 -11.25 8.25 -11.6 7.9 -11.8 8.0 -12.4 L8.0 -12.45 8.85 -13.1 M19.45 -1.25 Q20.15 -1.25 20.4 -0.85 L20.7 -0.25 20.7 -0.15 Q20.55 0.7 19.85 1.05 L19.8 1.05 18.85 0.85 18.8 0.8 18.45 0.25 18.35 0.25 18.35 -0.3 18.35 -0.45 19.4 -1.2 19.45 -1.25 M29.25 -13.55 L29.25 -13.4 Q28.45 -10.75 28.55 -7.6 L28.45 -7.6 Q28.05 -8.15 27.95 -8.8 L27.95 -8.85 27.3 -13.55 27.3 -13.65 Q27.85 -14.15 28.55 -14.1 L28.6 -14.1 29.25 -13.55 M25.65 -6.45 Q23.3 -7.3 21.45 -8.65 L21.45 -8.9 22.1 -9.75 22.2 -9.75 Q24.25 -8.5 25.65 -6.5 L25.65 -6.45 M22.4 -1.15 Q23.1 -1.2 23.4 -0.85 L23.5 -0.85 Q23.85 -0.3 23.65 0.5 L23.65 0.6 Q23.3 1.05 22.4 1.05 L22.35 1.05 Q21.65 0.8 21.6 -0.05 L21.6 -0.1 Q21.7 -0.85 22.4 -1.15 M24.8 -0.15 L25.4 -1.0 25.45 -1.0 26.3 -1.05 26.35 -1.05 Q26.95 -0.7 27.05 0.15 L27.1 0.25 Q26.9 0.9 26.2 1.1 L26.15 1.1 25.2 0.85 25.15 0.8 Q24.85 0.45 24.8 -0.1 L24.8 -0.15 M29.15 -0.7 Q30.2 -1.15 30.8 -0.4 L30.85 -0.3 Q31.05 0.35 30.75 0.85 L30.65 0.9 29.7 1.2 29.65 1.2 29.0 1.0 28.95 1.0 28.6 0.15 28.6 0.1 29.1 -0.7 29.15 -0.7 M37.4 -11.3 L37.35 -11.25 35.45 -10.3 35.45 -10.2 34.9 -9.65 34.85 -9.6 Q34.0 -8.65 33.8 -7.15 L33.8 -7.05 Q33.95 -5.3 34.75 -4.25 L35.65 -4.0 Q37.0 -3.4 38.3 -4.0 L38.3 -4.05 Q38.6 -4.4 38.3 -4.55 L38.25 -4.55 Q36.95 -4.5 36.0 -5.1 L36.0 -5.15 35.3 -6.05 35.3 -6.2 Q35.25 -7.05 35.35 -7.9 L35.6 -8.35 35.65 -8.35 36.25 -9.1 36.35 -9.1 37.35 -9.75 37.4 -9.8 40.65 -9.6 40.65 -9.55 42.25 -7.9 42.9 -5.9 Q43.15 -4.6 42.75 -3.6 41.95 -1.7 40.35 -0.5 L40.35 -0.45 42.5 -1.05 42.5 -1.15 43.65 -2.1 43.9 -2.75 44.05 -3.5 Q44.1 -4.7 44.8 -5.0 L44.85 -4.95 Q45.5 -4.2 45.7 -2.95 L45.7 -2.9 44.6 -0.65 Q48.0 -1.45 51.2 -0.5 L51.35 -0.5 Q53.25 -0.6 54.3 0.15 L48.85 0.85 48.0 0.85 44.5 0.3 44.5 0.35 45.35 1.2 45.35 1.35 45.75 2.65 45.75 2.7 Q45.8 4.4 44.85 5.15 L44.75 4.95 Q44.3 2.95 43.35 1.6 L43.3 1.6 42.9 1.1 42.8 1.1 Q41.85 0.35 40.7 0.65 L40.7 0.9 Q42.15 1.8 42.6 3.5 43.25 5.7 42.15 7.35 L42.15 7.4 41.85 7.6 41.8 7.7 41.5 8.15 40.2 8.7 Q37.85 9.6 36.0 8.35 L36.0 8.3 35.6 7.9 35.6 7.75 Q35.3 7.0 35.35 5.9 L35.35 5.85 35.7 5.5 35.7 5.45 36.1 4.6 36.1 4.55 36.75 4.35 36.75 4.25 37.0 4.0 37.1 4.0 Q37.65 3.9 37.65 3.65 L36.4 3.4 Q35.3 3.65 34.7 4.35 L34.2 5.35 Q33.45 7.2 34.35 8.75 L34.4 8.75 35.6 10.05 35.65 10.05 37.55 10.8 37.65 10.8 Q41.65 10.9 44.1 9.1 L44.1 9.05 44.75 8.35 44.8 8.35 45.3 8.0 46.45 5.75 46.55 4.9 Q46.55 3.5 46.9 2.65 L46.9 2.55 48.2 3.65 48.2 3.8 48.6 5.45 48.7 5.35 52.4 3.15 52.45 3.15 Q53.05 3.25 53.2 2.85 56.35 1.0 61.0 0.65 64.4 0.35 67.0 1.45 68.85 1.6 70.2 2.3 L73.35 3.45 77.45 3.6 77.5 3.5 78.05 2.4 78.0 2.4 Q77.7 1.65 77.45 1.95 L77.5 1.95 Q77.5 2.85 76.55 3.15 L76.5 3.15 Q75.55 3.1 75.2 2.4 L75.2 2.35 Q75.05 1.75 75.4 1.1 L75.45 1.1 Q76.1 0.7 76.0 0.35 74.85 -0.25 75.3 -1.7 L75.4 -1.7 Q76.15 -2.35 77.15 -2.1 L77.15 -2.0 77.45 -1.45 77.45 -1.4 77.3 -0.85 77.3 -0.8 Q76.35 -0.3 77.6 -0.3 L77.65 -0.4 Q78.45 -0.9 78.2 -2.2 L78.1 -2.2 77.35 -3.05 77.3 -3.05 76.4 -3.3 73.4 -2.85 68.95 -1.7 66.6 -0.8 Q64.65 -0.05 61.85 -0.05 L58.4 -0.4 Q55.45 -1.05 53.4 -2.7 L53.25 -2.7 Q53.0 -2.75 52.85 -3.05 L52.8 -3.05 Q51.3 -3.95 50.1 -5.15 L50.05 -5.15 49.1 -5.75 49.1 -5.7 48.35 -4.4 48.0 -4.0 Q47.4 -3.2 46.5 -3.1 L46.45 -3.1 46.7 -5.35 46.7 -5.45 Q46.25 -8.15 44.4 -9.6 L44.3 -9.6 41.7 -11.1 41.65 -11.1 37.4 -11.3 M72.0 -0.9 L72.0 -1.0 Q72.8 -1.35 73.55 -1.0 L73.6 -1.0 Q74.3 -0.3 74.05 0.9 L74.05 1.0 73.15 1.6 73.05 1.6 Q72.05 1.65 71.65 1.05 L71.55 1.05 Q71.25 0.65 71.3 -0.15 L71.3 -0.25 72.0 -0.9 M24.3 8.3 L22.1 9.65 22.05 9.65 21.35 8.9 21.35 8.85 22.0 8.0 22.0 7.95 25.25 7.0 25.35 6.95 24.3 8.25 24.3 8.3 M28.8 11.85 L28.9 13.3 28.45 14.15 27.95 14.25 27.8 14.25 27.3 13.95 27.25 13.9 Q27.05 13.55 27.1 13.0 L27.1 12.95 Q27.25 9.8 28.45 7.5 L28.55 7.5 Q28.45 9.5 28.8 11.85 M3.5 2.2 L3.15 3.45 3.15 3.5 2.75 3.85 2.75 3.9 1.65 3.85 1.55 3.8 Q2.3 3.8 2.1 3.45 L1.85 3.1 Q1.65 2.95 1.7 2.7 1.65 1.75 2.4 1.55 L2.5 1.55 Q3.25 1.6 3.5 2.15 L3.5 2.2 M7.1 10.55 Q7.5 10.0 8.1 10.35 L8.1 10.4 8.8 11.05 12.0 12.8 12.0 12.85 Q10.45 12.85 9.1 12.25 L7.15 10.95 Q7.05 10.9 7.1 10.55 M-76.35 -0.25 L-76.3 -0.15 -75.35 0.3 -75.35 0.35 Q-75.0 0.8 -75.15 1.75 L-75.75 2.35 -75.8 2.35 Q-76.55 2.3 -76.95 1.9 L-76.95 1.8 -76.9 0.8 -76.95 0.8 Q-77.7 0.7 -78.05 1.45 L-78.05 1.55 -77.8 2.75 Q-76.95 3.5 -75.45 3.25 L-72.95 2.75 -68.35 1.6 -62.15 0.35 -57.8 0.6 Q-55.4 0.85 -53.95 2.0 L-53.9 2.1 -53.4 2.2 -53.35 2.3 -51.9 3.15 -51.9 3.25 -51.65 3.5 -51.2 3.65 -51.2 3.7 -48.5 6.3 -48.4 6.3 Q-48.5 5.65 -48.2 4.75 L-48.15 4.75 -47.9 4.45 -47.9 4.4 -47.45 3.85 -47.4 3.85 -46.85 3.5 -46.8 3.45 Q-46.6 3.1 -46.15 3.15 L-46.15 3.25 -46.15 6.1 -46.1 6.2 -45.1 8.5 Q-43.65 10.3 -41.05 10.95 -38.1 11.7 -35.7 10.55 -33.2 9.25 -33.55 5.5 L-33.6 5.5 -34.15 4.4 -34.2 4.4 Q-34.75 3.8 -35.5 3.45 L-35.6 3.45 -37.15 3.5 -37.15 3.6 Q-37.75 3.7 -37.65 4.05 L-37.65 4.15 -36.2 4.25 -36.15 4.35 -35.45 4.8 -35.45 4.9 Q-35.05 5.65 -34.9 6.5 L-34.9 6.65 -35.3 7.95 -36.4 9.1 -36.45 9.1 -38.75 9.6 -38.8 9.6 Q-40.9 9.05 -42.0 7.5 L-42.0 7.35 Q-43.05 4.25 -41.25 2.0 L-41.2 2.0 Q-41.0 1.8 -40.7 1.75 L-40.65 1.65 -39.9 0.7 -39.8 0.7 -38.85 0.1 -38.85 0.05 -40.45 0.25 -40.45 0.3 -41.75 0.9 -41.8 0.9 -43.3 2.3 -43.3 2.35 -44.0 3.8 -44.0 3.85 Q-43.85 4.8 -44.45 5.15 L-44.55 5.15 Q-45.6 3.5 -44.65 1.55 L-44.6 1.55 Q-44.25 1.25 -44.2 0.65 L-45.7 0.7 Q-48.0 1.25 -50.25 0.65 L-51.35 0.5 Q-52.85 0.45 -53.7 -0.15 L-49.3 -1.0 -46.65 -0.85 -44.45 -0.6 Q-45.2 -1.75 -45.0 -3.5 -44.95 -4.55 -44.4 -5.0 L-44.35 -5.0 -43.35 -2.2 -43.3 -2.2 -42.15 -1.05 -40.85 -0.65 -39.6 -0.6 -39.6 -0.65 Q-40.7 -1.15 -41.45 -1.95 L-41.45 -2.0 Q-42.7 -3.6 -42.4 -6.3 L-42.35 -6.3 -41.85 -7.4 -41.8 -7.4 -40.7 -8.65 -40.1 -8.9 -39.55 -9.05 Q-36.9 -9.55 -35.5 -8.1 L-35.5 -8.05 Q-35.05 -7.2 -35.05 -6.0 L-35.05 -5.9 Q-35.3 -5.15 -35.8 -4.55 L-36.25 -4.35 Q-37.15 -4.15 -37.35 -3.7 L-37.3 -3.65 Q-36.9 -3.25 -36.15 -3.3 L-36.05 -3.3 Q-35.15 -3.65 -34.5 -4.15 L-33.95 -5.15 Q-32.9 -7.05 -34.1 -8.8 L-35.1 -9.95 Q-35.85 -10.4 -36.9 -10.7 L-39.05 -10.75 Q-41.8 -10.55 -43.65 -9.2 L-43.65 -9.1 -45.5 -7.4 -45.55 -7.35 Q-46.3 -6.0 -46.5 -4.25 L-46.5 -4.2 Q-45.95 -3.4 -46.3 -2.55 L-46.3 -2.5 Q-47.15 -2.75 -47.65 -3.4 L-48.0 -4.35 -48.35 -5.35 -48.4 -5.3 -50.7 -4.0 -50.95 -3.7 -51.0 -3.65 Q-52.05 -3.1 -53.2 -2.65 L-53.25 -2.55 -53.5 -2.3 -53.55 -2.3 -55.45 -1.4 -55.55 -1.4 -56.0 -1.4 -56.0 -1.35 -56.9 -0.9 -57.15 -0.85 -60.4 -0.45 Q-63.65 -0.15 -66.1 -1.05 -70.2 -2.5 -74.45 -3.6 -76.0 -4.0 -76.75 -3.4 -76.35 -2.9 -75.6 -2.7 L-75.55 -2.7 Q-75.25 -2.35 -75.2 -1.8 -75.4 -1.2 -75.8 -1.0 L-75.9 -0.9 -76.35 -0.25 M-73.7 -0.5 L-73.35 -1.25 -73.3 -1.35 -72.55 -1.6 -72.45 -1.7 -71.45 -1.4 -71.3 -1.4 Q-70.9 -0.9 -70.8 -0.05 L-70.8 0.1 -71.25 0.85 -71.25 0.9 -72.65 1.1 -72.75 1.1 -73.35 0.8 -73.35 0.7 -73.7 0.15 -73.7 -0.45 -73.7 -0.5 M-26.7 -13.95 Q-26.85 -10.9 -27.95 -8.45 L-28.55 -7.4 -28.6 -7.8 -28.6 -8.05 Q-27.8 -10.1 -28.35 -12.65 -28.55 -13.65 -28.15 -14.25 -27.25 -14.6 -26.7 -13.95 M-22.9 -9.05 Q-22.2 -9.6 -21.25 -9.45 L-21.15 -9.45 Q-20.9 -9.25 -20.95 -8.7 L-20.95 -8.65 Q-22.8 -7.2 -25.5 -6.95 L-25.5 -7.0 -22.95 -9.0 -22.9 -9.05 M-28.2 -0.1 L-28.2 -0.05 -28.6 0.5 -28.6 0.6 -29.85 0.5 -30.0 0.5 -30.35 -0.3 -30.4 -0.45 Q-30.05 -1.4 -28.95 -1.35 L-28.9 -1.35 Q-28.05 -0.9 -28.2 -0.1 M-26.5 -0.65 Q-25.9 -1.9 -24.75 -1.05 L-24.65 -1.05 Q-24.4 -0.7 -24.45 -0.05 L-24.45 0.1 -25.2 0.65 -25.25 0.65 Q-26.0 0.7 -26.3 0.25 L-26.35 0.25 -26.5 -0.6 -26.5 -0.65 M-23.15 -0.7 L-22.55 -1.4 -22.45 -1.4 Q-21.85 -1.55 -21.5 -1.05 L-21.45 -1.05 Q-21.05 -0.25 -21.5 0.3 L-21.5 0.35 -22.8 0.45 -22.9 0.35 -23.15 -0.65 -23.15 -0.7 M-8.55 -12.55 L-8.05 -12.25 -8.05 -12.2 -7.1 -12.1 -7.05 -12.1 Q-6.5 -11.65 -6.9 -11.05 L-6.9 -10.95 Q-7.8 -10.9 -8.55 -11.35 -9.1 -11.8 -9.75 -12.0 L-11.8 -12.8 -11.8 -12.95 -11.25 -13.15 -11.25 -13.2 -8.7 -12.55 -8.55 -12.55 M-17.9 -0.45 L-17.9 -0.3 -18.05 0.25 -18.1 0.3 -18.7 0.85 -18.7 0.9 Q-19.55 1.0 -19.9 0.6 L-19.95 0.6 Q-20.3 0.25 -20.2 -0.5 L-20.2 -0.6 -19.8 -1.2 -19.8 -1.25 Q-19.15 -1.55 -18.6 -1.25 L-18.5 -1.25 -17.9 -0.45 M-5.05 -2.15 Q-4.1 -2.45 -3.75 -1.25 L-2.65 -0.85 -2.6 -0.85 -0.75 -1.05 -0.75 -1.0 Q-0.8 -0.6 -1.5 -0.4 L-1.55 -0.3 -2.35 -0.4 -2.35 -0.3 -2.75 -0.45 -2.75 -0.5 -3.35 -0.45 -3.4 -0.45 Q-4.65 -0.85 -5.05 -2.1 L-5.05 -2.15 M-10.05 4.75 Q-8.8 6.2 -9.35 8.35 -9.55 9.05 -10.1 9.3 -10.65 8.65 -10.1 7.9 L-9.95 7.15 Q-10.1 6.05 -10.5 5.2 L-11.15 4.75 -11.2 4.7 -13.25 4.55 -13.25 4.6 Q-13.2 5.15 -12.55 5.55 L-12.5 5.55 Q-12.3 6.25 -12.55 6.7 L-12.55 6.8 -13.25 7.2 -13.25 7.25 -14.5 7.2 -14.55 7.2 -15.3 5.85 -15.3 5.7 Q-14.55 3.15 -11.35 3.85 L-11.25 3.85 -10.5 4.35 -10.45 4.35 -10.1 4.75 -10.05 4.75 M-7.8 12.3 L-7.85 12.4 -12.0 12.55 -13.0 12.0 -10.2 11.35 -9.1 11.05 Q-8.05 10.8 -7.6 11.35 -7.5 12.0 -7.8 12.3 M-26.55 5.55 Q-24.45 6.25 -22.4 7.4 L-22.35 7.5 -22.15 7.75 -22.05 7.75 Q-21.4 8.0 -20.9 8.5 L-20.85 8.55 Q-20.85 9.4 -21.45 9.6 L-21.5 9.6 Q-22.25 9.4 -22.6 8.85 L-22.7 8.75 -23.0 8.65 -23.1 8.55 -24.25 7.5 -24.3 7.5 -25.5 6.45 -25.55 6.4 Q-25.95 6.25 -26.15 5.95 L-26.15 5.9 -26.55 5.65 -26.55 5.55 M-27.95 7.8 L-27.1 10.7 Q-26.7 12.2 -26.7 13.7 L-27.55 14.15 -27.6 14.15 Q-28.15 14.1 -28.4 13.75 L-28.5 13.75 -28.55 10.7 Q-28.35 9.0 -28.75 7.35 -28.2 6.95 -27.95 7.8" fill="#000000" fill-rule="evenodd" stroke="none"/>
  </g>
</svg>
