<?xml version="1.0" encoding="UTF-8" standalone="no"?>
<svg xmlns:xlink="http://www.w3.org/1999/xlink" height="18.6px" width="76.55px" xmlns="http://www.w3.org/2000/svg">
  <g transform="matrix(1.0, 0.0, 0.0, 1.0, 35.25, 17.35)">
    <path d="M-34.25 -10.65 L-21.25 -1.2 28.9 1.25 41.3 -6.55 -34.25 -10.65" fill="url(#gradient0)" fill-rule="evenodd" stroke="none">
      <animate attributeName="d" dur="2s" repeatCount="indefinite" values="M-34.25 -10.65 L-21.25 -1.2 28.9 1.25 41.3 -6.55 -34.25 -10.65;M-35.25 -17.35 L-20.05 -3.65 24.55 -1.8 36.05 -12.75 -35.25 -17.35"/>
    </path>
    <path d="M-34.25 -10.65 L41.3 -6.55 28.9 1.25 -21.25 -1.2 -34.25 -10.65" fill="none" stroke="#000000" stroke-linecap="round" stroke-linejoin="round" stroke-opacity="0.0" stroke-width="1.0">
      <animate attributeName="stroke" dur="2s" repeatCount="indefinite" values="#000000;#000001"/>
      <animate attributeName="stroke-width" dur="2s" repeatCount="indefinite" values="0.0;0.0"/>
      <animate attributeName="fill-opacity" dur="2s" repeatCount="indefinite" values="0.0;0.0"/>
      <animate attributeName="d" dur="2s" repeatCount="indefinite" values="M-34.25 -10.65 L41.3 -6.55 28.9 1.25 -21.25 -1.2 -34.25 -10.65;M-35.25 -17.35 L36.05 -12.75 24.55 -1.8 -20.05 -3.65 -35.25 -17.35"/>
    </path>
  </g>
  <defs>
    <linearGradient gradientTransform="matrix(-0.0054, 0.0216, -0.0099, -0.0023, -6.9, 1.3)" gradientUnits="userSpaceOnUse" id="gradient0" spreadMethod="pad" x1="-819.2" x2="819.2">
      <animateTransform additive="replace" attributeName="gradientTransform" dur="2s" from="1" repeatCount="indefinite" to="1" type="scale"/>
      <animateTransform additive="sum" attributeName="gradientTransform" dur="2s" from="-6.9 1.3" repeatCount="indefinite" to="-1.6 -8.4" type="translate"/>
      <animateTransform additive="sum" attributeName="gradientTransform" dur="2s" from="104.0553" repeatCount="indefinite" to="103.1794" type="rotate"/>
      <animateTransform additive="sum" attributeName="gradientTransform" dur="2s" from="0.0223 0.0102" repeatCount="indefinite" to="0.0238 0.0102" type="scale"/>
      <animateTransform additive="sum" attributeName="gradientTransform" dur="2s" from="0.465" repeatCount="indefinite" to="-0.2982" type="skewX"/>
      <stop offset="0.0" stop-color="#ab5428">
        <animate attributeName="offset" dur="2s" repeatCount="indefinite" values="0.0;0.0"/>
        <animate attributeName="stop-color" dur="2s" repeatCount="indefinite" values="#ab5428;#ab5429"/>
        <animate attributeName="stop-opacity" dur="2s" repeatCount="indefinite" values="1.0;1.0"/>
      </stop>
      <stop offset="0.5411764705882353" stop-color="#7d492b">
        <animate attributeName="offset" dur="2s" repeatCount="indefinite" values="0.5411764705882353;0.5411764705882353"/>
        <animate attributeName="stop-color" dur="2s" repeatCount="indefinite" values="#7d492b;#7d492c"/>
        <animate attributeName="stop-opacity" dur="2s" repeatCount="indefinite" values="1.0;1.0"/>
      </stop>
      <stop offset="1.0" stop-color="#7d685d">
        <animate attributeName="offset" dur="2s" repeatCount="indefinite" values="1.0;1.0"/>
        <animate attributeName="stop-color" dur="2s" repeatCount="indefinite" values="#7d685d;#7d685e"/>
        <animate attributeName="stop-opacity" dur="2s" repeatCount="indefinite" values="1.0;1.0"/>
      </stop>
    </linearGradient>
  </defs>
</svg>
