<?xml version="1.0" encoding="UTF-8" standalone="no"?>
<svg xmlns:xlink="http://www.w3.org/1999/xlink" height="91.9px" width="40.4px" xmlns="http://www.w3.org/2000/svg">
  <g transform="matrix(1.0, 0.0, 0.0, 1.0, 13.3, 46.2)">
    <path d="M24.85 -41.5 L26.4 -42.15 Q27.1 -42.15 27.1 -41.2 27.1 -40.25 25.9 -39.65 24.45 -38.9 21.5 -38.9 15.95 -38.9 11.4 -41.8 7.3 -44.4 7.9 -46.2 8.9 -46.35 9.9 -45.2 11.1 -43.85 12.4 -43.6 L16.0 -41.65 Q18.0 -40.9 21.5 -40.9 23.35 -40.9 24.85 -41.5 M4.3 -35.8 Q6.8 -35.85 6.8 -28.05 6.8 -26.4 5.5 -23.7 3.95 -20.5 2.2 -20.55 L1.85 -20.65 Q1.7 -20.75 1.7 -21.1 1.7 -21.5 2.65 -22.75 3.85 -24.25 4.3 -25.45 5.25 -27.75 5.25 -29.65 L4.9 -32.65 4.25 -35.25 4.3 -35.8 M0.6 44.6 L0.8 45.25 Q0.8 45.7 -0.1 45.7 -0.45 45.7 -1.05 45.2 L-2.0 44.7 -3.1 44.3 Q-4.0 44.3 -5.45 44.9 -6.95 45.5 -8.1 45.5 -11.45 45.5 -13.3 43.55 L-12.65 42.7 -12.05 41.85 -11.8 41.45 -11.5 41.1 -10.7 41.2 -8.65 41.35 -5.05 41.25 -1.25 41.4 Q-0.8 41.35 -0.7 41.7 L-0.45 42.4 0.35 43.95 0.6 44.6" fill="#000000" fill-opacity="0.17254902" fill-rule="evenodd" stroke="none"/>
  </g>
</svg>
