<?xml version="1.0" encoding="UTF-8" standalone="no"?>
<svg xmlns:xlink="http://www.w3.org/1999/xlink" height="331.65px" width="189.1px" xmlns="http://www.w3.org/2000/svg">
  <g transform="matrix(1.0, 0.0, 0.0, 1.0, 81.1, 150.5)">
    <path d="M13.15 181.15 L-34.25 181.15 -34.25 132.3 Q-37.2 131.25 -37.85 122.5 L-37.85 112.8 Q-37.85 102.75 -36.45 96.95 -35.55 92.9 -34.25 92.0 L-34.25 76.9 -35.1 77.1 Q-38.3 77.1 -38.95 65.9 L-38.95 54.55 Q-40.5 43.15 -40.8 32.5 -41.4 11.5 -35.1 8.55 L-34.25 8.5 -34.25 -47.15 Q-36.85 -47.95 -37.45 -54.1 -37.75 -57.65 -37.45 -61.3 -37.45 -81.95 -37.15 -91.0 L-36.95 -96.5 Q-38.25 -98.0 -38.65 -102.05 -39.0 -105.3 -38.8 -108.65 -38.8 -110.15 -40.5 -128.95 L-40.5 -135.75 -41.35 -139.05 Q-41.85 -141.9 -41.85 -144.85 L-41.7 -150.5 -36.2 -150.5 -36.05 -147.35 -35.65 -147.4 -34.25 -147.15 -34.25 -150.5 -25.8 -150.5 -25.6 -129.8 -25.65 -120.1 Q-25.25 -110.55 -23.0 -110.55 L-22.9 -110.55 Q-22.35 -108.3 -21.3 -105.9 -18.45 -99.3 -17.65 -95.55 -17.5 -94.85 -16.9 -85.7 -16.5 -79.75 -13.75 -75.9 -12.15 -76.85 -11.3 -81.4 -10.75 -84.5 -10.75 -86.95 -10.75 -96.0 -14.6 -105.15 -18.35 -114.15 -20.35 -120.75 -20.2 -125.05 -20.4 -129.55 L-20.45 -150.5 4.5 -150.5 Q3.8 -146.7 2.95 -138.05 1.9 -126.55 1.9 -121.85 1.9 -116.2 2.7 -105.9 L3.55 -104.15 Q8.5 -91.6 10.7 -88.0 18.5 -75.4 18.7 -63.3 19.0 -47.2 18.8 -14.3 L18.7 7.2 Q18.45 17.4 18.0 24.65 19.0 31.3 19.35 43.9 L19.45 69.55 19.6 84.9 Q19.3 99.35 17.05 104.0 14.85 99.55 14.45 84.9 L14.55 69.5 Q14.55 63.15 15.45 42.95 L15.7 37.35 15.5 37.4 Q13.7 28.25 13.05 16.55 12.2 22.65 11.7 35.5 L11.3 48.3 Q9.9 50.75 9.8 56.2 9.7 61.15 10.45 66.45 10.45 77.15 10.7 80.45 L11.0 83.3 Q8.5 85.35 8.45 93.65 8.35 99.55 9.2 106.35 L9.2 116.25 Q9.35 118.6 9.65 120.4 8.25 123.2 7.85 129.75 6.8 130.2 6.05 131.7 L5.85 132.1 Q4.65 133.15 4.65 135.15 L4.9 135.85 4.8 138.1 4.95 145.75 Q5.7 152.8 8.3 153.4 L8.4 158.2 Q9.2 165.25 12.65 165.25 L13.15 165.2 13.15 181.15 M5.6 -150.5 L8.35 -150.5 Q9.4 -142.05 9.2 -138.7 8.85 -132.8 8.9 -121.6 L9.05 -110.55 Q8.9 -107.7 8.9 -104.7 7.9 -104.45 7.25 -103.2 L7.5 -106.95 7.95 -121.8 Q7.95 -126.65 6.95 -138.0 L5.6 -150.5 M27.8 83.55 L28.05 83.6 27.75 84.25 27.8 83.55 M26.4 128.35 L26.35 128.35 26.35 115.25 26.4 116.25 26.4 123.15 26.4 128.35 M4.55 -74.9 Q4.2 -84.35 1.65 -87.1 -1.25 -84.05 -1.45 -74.35 L-1.1 -64.8 Q-1.2 -61.15 -0.9 -57.6 -0.3 -50.6 1.65 -50.6 3.0 -50.6 2.3 -50.8 4.4 -58.35 4.4 -64.9 L4.55 -74.9 M6.0 -85.55 L6.3 -78.75 Q6.3 -75.05 7.0 -68.65 7.85 -61.15 8.9 -59.15 9.55 -59.8 10.1 -61.1 L10.15 -57.5 Q9.95 -51.2 10.1 -44.6 L9.35 -45.85 Q6.8 -42.45 6.15 -32.25 5.9 -28.75 5.9 -16.55 5.7 -10.1 6.05 -3.6 6.75 9.4 9.35 9.4 12.0 9.4 12.65 -3.3 L12.75 -4.9 12.8 -15.15 12.8 -15.5 12.75 -16.5 12.75 -25.0 12.9 -24.8 12.95 -33.05 13.2 -50.65 Q13.35 -61.25 12.4 -68.1 11.25 -76.55 6.0 -85.55 M26.35 90.9 L26.45 90.7 26.35 91.55 26.35 90.9 M5.35 69.2 L5.35 60.25 Q5.35 41.65 2.25 41.45 -0.85 41.3 -0.85 60.4 L-0.85 68.85 Q-0.35 77.1 2.2 77.1 4.85 77.1 5.35 69.2 M4.95 22.75 Q4.95 17.2 3.9 13.8 3.0 10.75 1.65 10.65 -1.65 10.35 -1.65 22.65 L-1.3 26.65 Q-0.55 30.55 1.65 30.55 3.75 30.55 4.55 26.95 4.95 25.1 4.95 22.75 M-7.55 -45.15 L-7.6 -46.9 Q-8.25 -63.3 -10.9 -67.95 -14.2 -62.7 -14.6 -46.4 L-14.35 -29.0 Q-14.6 -25.45 -14.35 -22.0 -13.75 -15.15 -10.9 -15.15 -10.0 -15.15 -9.3 -15.8 L-8.85 -13.3 Q-8.2 -8.15 -12.7 2.2 -15.0 7.5 -16.85 16.0 -18.75 24.8 -18.75 30.85 -19.0 56.95 -18.7 69.75 -18.45 76.2 -18.95 89.55 -18.95 101.35 -16.25 108.45 -14.4 98.55 -14.15 84.25 L-11.75 94.3 -11.25 100.2 -10.75 106.05 -11.2 126.85 Q-11.2 147.5 -8.8 147.5 -7.25 147.5 -6.25 127.15 L-5.55 105.9 Q-5.55 97.3 -9.5 82.0 -11.15 75.65 -14.3 65.35 L-14.35 48.7 -14.15 33.65 Q-13.9 24.95 -12.95 18.7 -12.2 13.6 -9.0 3.15 L-8.35 0.95 -8.3 2.45 Q-7.75 17.7 -4.95 17.7 -2.0 17.7 -1.4 2.45 -1.1 -5.2 -1.4 -13.2 -1.4 -18.35 -0.1 -30.45 0.2 -40.75 -4.95 -44.6 -6.6 -45.85 -7.55 -45.15" fill="#000000" fill-rule="evenodd" stroke="none"/>
    <path d="M-53.55 181.15 L-64.95 181.15 -64.95 165.2 Q-62.55 164.45 -62.05 154.85 L-62.05 154.5 -61.6 152.3 Q-60.8 148.9 -60.8 144.85 -60.8 137.8 -61.35 134.3 L-61.35 131.65 Q-61.4 121.75 -64.95 123.15 L-64.95 1.9 Q-63.8 0.95 -63.4 -1.65 -63.05 -3.7 -63.25 -6.1 L-62.7 -14.5 Q-61.85 -13.2 -60.4 -13.2 -59.1 -13.2 -58.25 -14.2 L-58.2 -14.85 Q-58.95 -20.4 -58.9 -25.35 -58.8 -30.75 -57.4 -33.2 L-58.0 -36.85 Q-59.0 -41.2 -60.35 -41.1 -61.75 -41.0 -62.75 -36.6 -63.55 -32.85 -63.75 -27.15 -64.25 -28.5 -64.95 -29.15 L-64.95 -55.95 Q-63.25 -56.85 -62.8 -60.15 -62.5 -62.45 -62.8 -65.3 L-62.5 -77.15 Q-62.8 -86.05 -64.95 -90.25 L-64.95 -150.5 -53.55 -150.5 -53.55 -118.5 -53.25 -118.7 Q-49.55 -120.3 -49.55 -93.4 -49.55 -91.4 -49.8 -90.5 -50.6 -88.05 -53.25 -88.05 L-53.55 -88.05 -53.55 -79.85 Q-54.15 -81.05 -54.9 -81.85 -58.0 -85.15 -58.5 -73.75 L-58.4 -61.3 Q-58.7 -58.85 -58.45 -56.3 -57.85 -51.15 -54.9 -51.15 L-53.55 -51.4 -53.55 -35.25 Q-52.5 -35.05 -51.75 -34.15 -51.1 -42.05 -47.75 -42.4 -44.3 -42.75 -43.85 -31.05 L-44.1 -17.35 Q-43.8 -12.9 -44.1 -8.95 -44.75 -1.1 -47.75 -1.1 -49.6 -1.1 -50.5 -4.25 -51.05 4.0 -53.55 5.1 L-53.55 57.4 Q-52.75 53.65 -51.6 52.35 -48.3 55.9 -47.8 66.45 -47.55 71.8 -47.95 76.9 L-48.3 84.25 Q-49.15 91.15 -51.6 91.15 -52.75 91.15 -53.55 89.95 L-53.55 114.4 Q-52.9 112.1 -51.6 112.55 -49.0 113.45 -49.0 122.0 L-49.05 128.0 Q-49.5 133.2 -51.6 133.2 L-52.7 133.05 -53.4 132.55 -53.55 131.65 -53.55 181.15 M75.25 57.85 L74.8 57.9 74.8 57.85 75.25 57.85 M-50.15 -145.5 L-49.95 -143.75 Q-49.95 -141.25 -50.7 -139.0 L-51.25 -138.9 Q-52.15 -141.6 -52.15 -143.85 -52.15 -146.5 -51.05 -147.1 L-50.15 -145.5 M-47.4 19.9 Q-47.4 30.55 -50.5 30.55 -52.9 30.55 -53.4 25.35 L-53.45 20.0 Q-53.45 9.65 -50.4 10.2 -47.4 10.75 -47.4 19.9 M-57.7 24.2 Q-58.1 17.4 -60.4 15.45 -62.35 13.95 -62.85 21.45 L-63.0 30.9 -63.0 38.55 Q-62.55 46.65 -60.4 46.65 L-59.55 46.55 -59.7 46.4 Q-58.35 43.55 -57.95 38.9 -57.8 36.85 -57.8 31.05 -57.5 27.65 -57.7 24.2 M-61.7 76.45 L-62.6 76.45 Q-63.95 82.75 -64.25 89.55 L-64.35 102.05 -64.35 108.8 Q-63.95 115.35 -62.05 115.35 -60.05 115.35 -59.7 109.45 L-59.7 102.2 Q-59.7 92.7 -59.85 89.75 -60.2 83.0 -61.7 76.45 M-43.5 102.05 Q-43.5 103.2 -44.1 103.95 L-44.05 107.35 -44.1 111.95 Q-44.55 115.75 -46.65 115.75 -48.5 115.75 -49.05 111.7 L-49.25 107.45 -49.2 104.2 -49.6 103.6 -49.95 102.15 Q-49.95 100.4 -48.75 99.8 -48.15 96.05 -46.65 96.15 -45.15 96.25 -44.5 100.1 -43.5 100.75 -43.5 102.05 M-43.6 147.65 Q-44.0 150.25 -46.1 150.25 -48.15 150.25 -48.55 147.3 L-48.5 144.2 Q-48.5 135.35 -46.0 135.5 -43.55 135.65 -43.55 144.15 L-43.6 147.65" fill="#3e3328" fill-rule="evenodd" stroke="none"/>
    <path d="M-64.95 181.15 L-73.85 181.15 -73.85 159.95 Q-72.4 159.6 -71.95 158.0 -71.8 157.4 -71.8 155.5 -71.8 147.0 -73.85 145.5 L-73.85 125.4 -73.6 125.4 Q-71.45 125.4 -70.5 123.45 -69.95 122.25 -69.95 120.55 L-70.15 113.7 -69.75 113.7 Q-67.65 113.7 -67.65 110.6 -67.65 108.65 -68.0 107.35 -68.35 105.95 -69.4 103.8 L-71.15 106.6 Q-72.15 102.45 -73.5 102.4 L-73.85 102.45 -73.85 22.75 Q-71.4 21.7 -70.85 16.8 L-70.85 9.8 Q-70.5 -7.85 -70.9 -24.3 -71.2 -37.75 -72.0 -47.4 L-73.05 -47.3 Q-76.25 -47.3 -76.9 -50.6 -77.2 -52.25 -76.9 -53.65 -76.9 -63.95 -76.2 -73.1 -75.4 -84.1 -73.85 -86.15 L-73.85 -100.15 -73.6 -100.15 Q-71.35 -100.15 -70.95 -108.4 -70.7 -112.55 -70.95 -117.45 -70.95 -121.75 -71.75 -130.1 -72.7 -139.85 -73.85 -142.25 L-73.85 -150.4 -74.15 -150.4 -75.1 -150.5 -64.95 -150.5 -64.95 -90.25 Q-62.8 -86.05 -62.5 -77.15 L-62.8 -65.3 Q-62.5 -62.45 -62.8 -60.15 -63.25 -56.85 -64.95 -55.95 L-64.95 -29.15 Q-64.25 -28.5 -63.75 -27.15 -63.55 -32.85 -62.75 -36.6 -61.75 -41.0 -60.35 -41.1 -59.0 -41.2 -58.0 -36.85 L-57.4 -33.2 Q-58.8 -30.75 -58.9 -25.35 -58.95 -20.4 -58.2 -14.85 L-58.25 -14.2 Q-59.1 -13.2 -60.4 -13.2 -61.85 -13.2 -62.7 -14.5 L-63.25 -6.1 Q-63.05 -3.7 -63.4 -1.65 -63.8 0.95 -64.95 1.9 L-64.95 123.15 Q-61.4 121.75 -61.35 131.65 L-61.35 134.3 Q-60.8 137.8 -60.8 144.85 -60.8 148.9 -61.6 152.3 L-62.05 154.5 -62.05 154.85 Q-62.55 164.45 -64.95 165.2 L-64.95 181.15 M102.7 4.6 L102.7 4.75 102.25 4.6 102.7 4.6 M102.35 23.55 L102.7 23.55 102.35 23.55 M-57.7 24.2 Q-57.5 27.65 -57.8 31.05 -57.8 36.85 -57.95 38.9 -58.35 43.55 -59.7 46.4 L-59.55 46.55 -60.4 46.65 Q-62.55 46.65 -63.0 38.55 L-63.0 30.9 -62.85 21.45 Q-62.35 13.95 -60.4 15.45 -58.1 17.4 -57.7 24.2 M-72.9 59.95 L-72.9 65.0 Q-72.45 69.85 -70.3 69.85 -68.05 69.85 -67.65 65.4 L-67.65 59.7 Q-67.65 44.4 -70.25 44.1 -72.9 43.8 -72.9 59.95 M-61.7 76.45 Q-60.2 83.0 -59.85 89.75 -59.7 92.7 -59.7 102.2 L-59.7 109.45 Q-60.05 115.35 -62.05 115.35 -63.95 115.35 -64.35 108.8 L-64.35 102.05 -64.25 89.55 Q-63.95 82.75 -62.6 76.45 L-61.7 76.45" fill="#574738" fill-rule="evenodd" stroke="none"/>
    <path d="M-34.25 181.15 L-53.55 181.15 -53.55 131.65 -53.4 132.55 -52.7 133.05 -51.6 133.2 Q-49.5 133.2 -49.05 128.0 L-49.0 122.0 Q-49.0 113.45 -51.6 112.55 -52.9 112.1 -53.55 114.4 L-53.55 89.95 Q-52.75 91.15 -51.6 91.15 -49.15 91.15 -48.3 84.25 L-47.95 76.9 Q-47.55 71.8 -47.8 66.45 -48.3 55.9 -51.6 52.35 -52.75 53.65 -53.55 57.4 L-53.55 5.1 Q-51.05 4.0 -50.5 -4.25 -49.6 -1.1 -47.75 -1.1 -44.75 -1.1 -44.1 -8.95 -43.8 -12.9 -44.1 -17.35 L-43.85 -31.05 Q-44.3 -42.75 -47.75 -42.4 -51.1 -42.05 -51.75 -34.15 -52.5 -35.05 -53.55 -35.25 L-53.55 -51.4 -54.9 -51.15 Q-57.85 -51.15 -58.45 -56.3 -58.7 -58.85 -58.4 -61.3 L-58.5 -73.75 Q-58.0 -85.15 -54.9 -81.85 -54.15 -81.05 -53.55 -79.85 L-53.55 -88.05 -53.25 -88.05 Q-50.6 -88.05 -49.8 -90.5 -49.55 -91.4 -49.55 -93.4 -49.55 -120.3 -53.25 -118.7 L-53.55 -118.5 -53.55 -150.5 -41.7 -150.5 -41.85 -144.85 Q-41.85 -141.9 -41.35 -139.05 L-40.5 -135.75 -40.5 -128.95 Q-38.8 -110.15 -38.8 -108.65 -39.0 -105.3 -38.65 -102.05 -38.25 -98.0 -36.95 -96.5 L-37.15 -91.0 Q-37.45 -81.95 -37.45 -61.3 -37.75 -57.65 -37.45 -54.1 -36.85 -47.95 -34.25 -47.15 L-34.25 8.5 -35.1 8.55 Q-41.4 11.5 -40.8 32.5 -40.5 43.15 -38.95 54.55 L-38.95 65.9 Q-38.3 77.1 -35.1 77.1 L-34.25 76.9 -34.25 92.0 Q-35.55 92.9 -36.45 96.95 -37.85 102.75 -37.85 112.8 L-37.85 122.5 Q-37.2 131.25 -34.25 132.3 L-34.25 181.15 M-36.2 -150.5 L-34.25 -150.5 -34.25 -147.15 -35.65 -147.4 -36.05 -147.35 -36.2 -150.5 M46.6 42.2 L47.0 42.25 46.45 44.2 Q46.0 45.85 45.65 48.0 L45.65 45.5 46.15 44.15 46.6 42.2 M52.25 77.75 L51.8 77.55 52.25 76.5 52.25 77.75 M46.25 -75.55 L45.85 -75.6 46.2 -77.15 46.25 -75.55 M54.45 56.2 L54.05 57.75 54.1 56.8 54.45 56.2 M-50.15 -145.5 L-51.05 -147.1 Q-52.15 -146.5 -52.15 -143.85 -52.15 -141.6 -51.25 -138.9 L-50.7 -139.0 Q-49.95 -141.25 -49.95 -143.75 L-50.15 -145.5 M-47.4 19.9 Q-47.4 10.75 -50.4 10.2 -53.45 9.65 -53.45 20.0 L-53.4 25.35 Q-52.9 30.55 -50.5 30.55 -47.4 30.55 -47.4 19.9 M-43.6 147.65 L-43.55 144.15 Q-43.55 135.65 -46.0 135.5 -48.5 135.35 -48.5 144.2 L-48.55 147.3 Q-48.15 150.25 -46.1 150.25 -44.0 150.25 -43.6 147.65 M-43.5 102.05 Q-43.5 100.75 -44.5 100.1 -45.15 96.25 -46.65 96.15 -48.15 96.05 -48.75 99.8 -49.95 100.4 -49.95 102.15 L-49.6 103.6 -49.2 104.2 -49.25 107.45 -49.05 111.7 Q-48.5 115.75 -46.65 115.75 -44.55 115.75 -44.1 111.95 L-44.05 107.35 -44.1 103.95 Q-43.5 103.2 -43.5 102.05" fill="#29211a" fill-rule="evenodd" stroke="none"/>
    <path d="M-73.85 181.15 L-81.1 181.15 -81.1 -150.5 -75.1 -150.5 -74.15 -150.4 -73.85 -150.4 -73.85 -142.25 Q-72.7 -139.85 -71.75 -130.1 -70.95 -121.75 -70.95 -117.45 -70.7 -112.55 -70.95 -108.4 -71.35 -100.15 -73.6 -100.15 L-73.85 -100.15 -73.85 -86.15 Q-75.4 -84.1 -76.2 -73.1 -76.9 -63.95 -76.9 -53.65 -77.2 -52.25 -76.9 -50.6 -76.25 -47.3 -73.05 -47.3 L-72.0 -47.4 Q-71.2 -37.75 -70.9 -24.3 -70.5 -7.85 -70.85 9.8 L-70.85 16.8 Q-71.4 21.7 -73.85 22.75 L-73.85 102.45 -73.5 102.4 Q-72.15 102.45 -71.15 106.6 L-69.4 103.8 Q-68.35 105.95 -68.0 107.35 -67.65 108.65 -67.65 110.6 -67.65 113.7 -69.75 113.7 L-70.15 113.7 -69.95 120.55 Q-69.95 122.25 -70.5 123.45 -71.45 125.4 -73.6 125.4 L-73.85 125.4 -73.85 145.5 Q-71.8 147.0 -71.8 155.5 -71.8 157.4 -71.95 158.0 -72.4 159.6 -73.85 159.95 L-73.85 181.15 M-72.9 59.95 Q-72.9 43.8 -70.25 44.1 -67.65 44.4 -67.65 59.7 L-67.65 65.4 Q-68.05 69.85 -70.3 69.85 -72.45 69.85 -72.9 65.0 L-72.9 59.95" fill="#78624e" fill-rule="evenodd" stroke="none"/>
    <path d="M26.35 181.15 L13.15 181.15 13.15 165.2 12.65 165.25 Q9.2 165.25 8.4 158.2 L8.3 153.4 Q5.7 152.8 4.95 145.75 L4.8 138.1 4.9 135.85 4.65 135.15 Q4.65 133.15 5.85 132.1 L6.05 131.7 Q6.8 130.2 7.85 129.75 8.25 123.2 9.65 120.4 9.35 118.6 9.2 116.25 L9.2 106.35 Q8.35 99.55 8.45 93.65 8.5 85.35 11.0 83.3 L10.7 80.45 Q10.45 77.15 10.45 66.45 9.7 61.15 9.8 56.2 9.9 50.75 11.3 48.3 L11.7 35.5 Q12.2 22.65 13.05 16.55 13.7 28.25 15.5 37.4 L15.7 37.35 15.45 42.95 Q14.55 63.15 14.55 69.5 L14.45 84.9 Q14.85 99.55 17.05 104.0 19.3 99.35 19.6 84.9 L19.45 69.55 19.35 43.9 Q19.0 31.3 18.0 24.65 18.45 17.4 18.7 7.2 L18.8 -14.3 Q19.0 -47.2 18.7 -63.3 18.5 -75.4 10.7 -88.0 8.5 -91.6 3.55 -104.15 L2.7 -105.9 Q1.9 -116.2 1.9 -121.85 1.9 -126.55 2.95 -138.05 3.8 -146.7 4.5 -150.5 L5.6 -150.5 6.95 -138.0 Q7.95 -126.65 7.95 -121.8 L7.5 -106.95 7.25 -103.2 Q7.9 -104.45 8.9 -104.7 8.9 -107.7 9.05 -110.55 L8.9 -121.6 Q8.85 -132.8 9.2 -138.7 9.4 -142.05 8.35 -150.5 L26.35 -150.5 26.35 -95.35 Q27.0 -99.5 28.6 -99.6 31.4 -97.45 31.65 -90.55 L31.35 -83.6 31.15 -75.95 Q30.7 -70.6 29.3 -69.55 L29.25 -51.05 Q29.5 -41.4 29.15 -32.6 28.6 -18.25 26.35 -15.65 L26.35 34.3 27.3 48.25 Q28.05 63.1 28.05 73.55 L27.8 83.55 27.75 84.25 28.05 83.6 Q28.75 82.25 29.7 82.05 32.3 81.55 32.9 96.8 L33.0 116.05 32.9 127.35 Q32.6 134.05 31.35 139.55 31.3 139.55 30.9 139.9 30.5 140.25 29.7 140.25 26.95 140.25 26.4 128.35 L26.4 123.15 26.4 116.25 26.35 115.25 26.35 128.35 26.35 146.8 Q28.7 147.75 28.7 150.55 28.7 152.25 27.5 153.45 L26.35 154.25 26.35 181.15 M-25.8 -150.5 L-20.45 -150.5 -20.4 -129.55 Q-20.2 -125.05 -20.35 -120.75 -18.35 -114.15 -14.6 -105.15 -10.75 -96.0 -10.75 -86.95 -10.75 -84.5 -11.3 -81.4 -12.15 -76.85 -13.75 -75.9 -16.5 -79.75 -16.9 -85.7 -17.5 -94.85 -17.65 -95.55 -18.45 -99.3 -21.3 -105.9 -22.35 -108.3 -22.9 -110.55 L-23.0 -110.55 Q-25.25 -110.55 -25.65 -120.1 L-25.6 -129.8 -25.8 -150.5 M6.0 -85.55 Q11.25 -76.55 12.4 -68.1 13.35 -61.25 13.2 -50.65 L12.95 -33.05 12.9 -24.8 12.75 -25.0 12.75 -16.5 12.8 -15.5 12.8 -15.15 12.75 -4.9 12.65 -3.3 Q12.0 9.4 9.35 9.4 6.75 9.4 6.05 -3.6 5.7 -10.1 5.9 -16.55 5.9 -28.75 6.15 -32.25 6.8 -42.45 9.35 -45.85 L10.1 -44.6 Q9.95 -51.2 10.15 -57.5 L10.1 -61.1 Q9.55 -59.8 8.9 -59.15 7.85 -61.15 7.0 -68.65 6.3 -75.05 6.3 -78.75 L6.0 -85.55 M4.55 -74.9 L4.4 -64.9 Q4.4 -58.35 2.3 -50.8 3.0 -50.6 1.65 -50.6 -0.3 -50.6 -0.9 -57.6 -1.2 -61.15 -1.1 -64.8 L-1.45 -74.35 Q-1.25 -84.05 1.65 -87.1 4.2 -84.35 4.55 -74.9 M4.95 22.75 Q4.95 25.1 4.55 26.95 3.75 30.55 1.65 30.55 -0.55 30.55 -1.3 26.65 L-1.65 22.65 Q-1.65 10.35 1.65 10.65 3.0 10.75 3.9 13.8 4.95 17.2 4.95 22.75 M5.35 69.2 Q4.85 77.1 2.2 77.1 -0.35 77.1 -0.85 68.85 L-0.85 60.4 Q-0.85 41.3 2.25 41.45 5.35 41.65 5.35 60.25 L5.35 69.2 M26.35 90.9 L26.35 91.55 26.45 90.7 26.35 90.9 M-7.55 -45.15 Q-6.6 -45.85 -4.95 -44.6 0.2 -40.75 -0.1 -30.45 -1.4 -18.35 -1.4 -13.2 -1.1 -5.2 -1.4 2.45 -2.0 17.7 -4.95 17.7 -7.75 17.7 -8.3 2.45 L-8.35 0.95 -9.0 3.15 Q-12.2 13.6 -12.95 18.7 -13.9 24.95 -14.15 33.65 L-14.35 48.7 -14.3 65.35 Q-11.15 75.65 -9.5 82.0 -5.55 97.3 -5.55 105.9 L-6.25 127.15 Q-7.25 147.5 -8.8 147.5 -11.2 147.5 -11.2 126.85 L-10.75 106.05 -11.25 100.2 -11.75 94.3 -14.15 84.25 Q-14.4 98.55 -16.25 108.45 -18.95 101.35 -18.95 89.55 -18.45 76.2 -18.7 69.75 -19.0 56.95 -18.75 30.85 -18.75 24.8 -16.85 16.0 -15.0 7.5 -12.7 2.2 -8.2 -8.15 -8.85 -13.3 L-9.3 -15.8 Q-10.0 -15.15 -10.9 -15.15 -13.75 -15.15 -14.35 -22.0 -14.6 -25.45 -14.35 -29.0 L-14.6 -46.4 Q-14.2 -62.7 -10.9 -67.95 -8.25 -63.3 -7.6 -46.9 L-7.55 -45.15" fill="#1c1611" fill-rule="evenodd" stroke="none"/>
    <path d="M66.7 181.15 L45.65 181.15 45.65 141.1 Q46.65 138.5 47.4 133.5 48.15 128.0 48.15 124.3 L48.15 119.45 Q49.3 117.6 49.8 112.9 L50.05 104.6 Q50.8 97.95 50.7 92.3 50.65 88.2 50.0 85.6 L50.25 82.4 50.25 76.75 Q50.85 77.35 51.7 77.65 L51.8 77.55 52.25 77.75 Q52.25 83.25 52.6 86.3 53.35 92.5 55.55 93.9 56.25 92.5 57.45 78.25 58.6 64.7 58.6 60.35 58.6 52.15 57.6 50.4 56.85 49.0 55.8 51.7 55.05 39.3 55.0 33.3 54.9 24.6 52.6 31.4 50.35 38.15 50.35 41.55 L50.55 48.7 Q50.1 49.4 49.75 50.6 L49.25 45.35 Q48.35 38.5 47.0 42.25 L46.6 42.2 Q47.95 34.25 48.6 9.55 49.05 -8.75 49.0 -27.7 L49.2 -38.6 Q49.6 -38.15 50.05 -38.15 52.85 -38.15 53.55 -56.45 53.9 -65.65 53.65 -75.4 L54.3 -88.9 Q54.1 -100.75 50.05 -100.7 48.15 -100.7 47.05 -98.2 L47.05 -102.75 47.05 -103.25 47.0 -103.95 46.6 -118.25 Q46.25 -127.5 45.65 -133.35 L45.65 -150.5 66.7 -150.5 66.7 -136.65 Q66.0 -136.45 65.4 -135.3 64.75 -141.3 62.75 -144.75 61.25 -141.45 60.85 -133.95 60.7 -131.2 60.7 -122.4 60.7 -119.95 61.35 -113.9 62.1 -106.8 62.9 -105.1 64.25 -106.75 65.05 -113.6 65.75 -112.95 66.7 -112.85 L66.7 -108.9 67.6 -109.1 Q69.35 -108.95 70.6 -105.4 71.95 -101.45 71.95 -95.05 72.15 -83.3 71.7 -71.95 70.75 -49.25 67.55 -49.25 67.1 -49.25 66.7 -49.65 L66.7 -43.4 65.85 -43.45 Q61.8 -43.45 61.8 -40.2 61.8 -36.6 66.45 -36.6 L66.7 -36.6 66.7 -28.7 Q66.45 -31.65 66.0 -33.5 65.05 -37.15 63.75 -35.35 63.1 -34.45 62.6 -33.0 62.05 -33.75 61.2 -34.0 58.4 -34.85 57.95 -27.5 L57.05 -13.85 Q55.0 -18.95 53.9 -15.35 53.0 -12.5 53.0 -7.25 53.0 -4.8 54.45 2.1 56.0 9.65 57.2 11.05 58.45 10.1 59.1 7.9 L59.5 6.0 60.3 7.3 60.25 13.05 Q60.25 18.75 60.5 20.95 61.1 26.9 63.25 27.95 64.0 27.7 64.65 27.25 L65.3 23.3 Q66.1 22.95 66.7 21.3 L66.7 44.15 67.75 43.95 Q69.0 40.8 71.4 42.25 72.25 42.75 72.9 44.6 73.9 42.4 75.3 42.45 76.75 42.5 77.75 45.05 78.85 47.85 78.85 52.5 78.85 55.0 78.45 56.0 77.7 57.85 75.25 57.85 L74.8 57.85 74.8 57.9 75.0 66.05 75.0 72.9 Q74.3 78.1 70.85 78.1 L70.3 78.05 70.3 90.65 Q69.7 103.75 66.7 105.25 L66.7 111.75 Q69.6 113.55 69.85 123.9 70.05 130.25 69.35 137.9 L69.35 143.25 Q68.85 146.7 66.7 147.45 L66.7 181.15 M66.6 -102.35 L66.2 -102.35 Q66.2 -96.15 65.05 -91.9 63.85 -87.6 63.85 -83.85 63.85 -77.55 64.0 -75.6 64.4 -69.75 66.05 -67.95 68.35 -70.25 68.9 -75.5 L69.05 -83.8 Q69.05 -88.35 68.1 -91.8 67.0 -95.9 66.6 -102.35 M73.75 -40.1 Q75.25 -39.65 76.3 -36.5 77.45 -33.0 77.45 -27.75 L77.35 -19.35 Q76.65 -12.35 73.9 -12.35 71.4 -12.35 70.45 -21.25 70.0 -25.65 70.05 -29.75 70.05 -35.2 71.2 -38.0 72.25 -40.55 73.75 -40.1 M76.9 8.25 Q77.0 14.3 78.35 16.35 79.65 18.3 79.65 21.55 L79.7 27.15 Q79.2 31.8 76.35 31.8 73.6 31.8 73.6 26.8 L74.15 21.65 Q74.15 19.45 72.3 17.85 70.45 16.2 70.45 11.3 L70.3 1.65 Q70.3 -0.65 72.55 -0.95 74.9 -1.25 76.2 1.65 L76.6 4.9 76.9 8.25 M44.45 40.6 Q44.35 45.2 43.45 53.6 L42.8 62.1 Q41.9 69.8 40.7 72.15 39.1 69.5 38.35 61.4 L37.95 53.4 Q37.95 36.85 40.7 30.0 44.6 32.35 44.45 40.6" fill="#121a1c" fill-rule="evenodd" stroke="none"/>
    <path d="M45.65 181.15 L26.35 181.15 26.35 154.25 27.5 153.45 Q28.7 152.25 28.7 150.55 28.7 147.75 26.35 146.8 L26.35 128.35 26.4 128.35 Q26.95 140.25 29.7 140.25 30.5 140.25 30.9 139.9 31.3 139.55 31.35 139.55 32.6 134.05 32.9 127.35 L33.0 116.05 32.9 96.8 Q32.3 81.55 29.7 82.05 28.75 82.25 28.05 83.6 L27.8 83.55 28.05 73.55 Q28.05 63.1 27.3 48.25 L26.35 34.3 26.35 -15.65 Q28.6 -18.25 29.15 -32.6 29.5 -41.4 29.25 -51.05 L29.3 -69.55 Q30.7 -70.6 31.15 -75.95 L31.35 -83.6 31.65 -90.55 Q31.4 -97.45 28.6 -99.6 27.0 -99.5 26.35 -95.35 L26.35 -150.5 45.65 -150.5 45.65 -133.35 Q46.25 -127.5 46.6 -118.25 L47.0 -103.95 47.05 -103.25 47.05 -102.75 47.05 -98.2 Q48.15 -100.7 50.05 -100.7 54.1 -100.75 54.3 -88.9 L53.65 -75.4 Q53.9 -65.65 53.55 -56.45 52.85 -38.15 50.05 -38.15 49.6 -38.15 49.2 -38.6 L49.0 -27.7 Q49.05 -8.75 48.6 9.55 47.95 34.25 46.6 42.2 L46.15 44.15 45.65 45.5 45.65 48.0 Q46.0 45.85 46.45 44.2 L47.0 42.25 Q48.35 38.5 49.25 45.35 L49.75 50.6 Q50.1 49.4 50.55 48.7 L50.35 41.55 Q50.35 38.15 52.6 31.4 54.9 24.6 55.0 33.3 55.05 39.3 55.8 51.7 56.85 49.0 57.6 50.4 58.6 52.15 58.6 60.35 58.6 64.7 57.45 78.25 56.25 92.5 55.55 93.9 53.35 92.5 52.6 86.3 52.25 83.25 52.25 77.75 L52.25 76.5 51.8 77.55 51.7 77.65 Q50.85 77.35 50.25 76.75 L50.25 82.4 50.0 85.6 Q50.65 88.2 50.7 92.3 50.8 97.95 50.05 104.6 L49.8 112.9 Q49.3 117.6 48.15 119.45 L48.15 124.3 Q48.15 128.0 47.4 133.5 46.65 138.5 45.65 141.1 L45.65 181.15 M46.25 -75.55 L46.2 -77.15 45.85 -75.6 46.25 -75.55 M44.45 40.6 Q44.6 32.35 40.7 30.0 37.95 36.85 37.95 53.4 L38.35 61.4 Q39.1 69.5 40.7 72.15 41.9 69.8 42.8 62.1 L43.45 53.6 Q44.35 45.2 44.45 40.6 M54.45 56.2 L54.1 56.8 54.05 57.75 54.45 56.2" fill="#090e0f" fill-rule="evenodd" stroke="none"/>
    <path d="M90.4 181.15 L66.7 181.15 66.7 147.45 Q68.85 146.7 69.35 143.25 L69.35 137.9 Q70.05 130.25 69.85 123.9 69.6 113.55 66.7 111.75 L66.7 105.25 Q69.7 103.75 70.3 90.65 L70.3 78.05 70.85 78.1 Q74.3 78.1 75.0 72.9 L75.0 66.05 74.8 57.9 75.25 57.85 Q77.7 57.85 78.45 56.0 78.85 55.0 78.85 52.5 78.85 47.85 77.75 45.05 76.75 42.5 75.3 42.45 73.9 42.4 72.9 44.6 72.25 42.75 71.4 42.25 69.0 40.8 67.75 43.95 L66.7 44.15 66.7 21.3 Q66.1 22.95 65.3 23.3 L64.65 27.25 Q64.0 27.7 63.25 27.95 61.1 26.9 60.5 20.95 60.25 18.75 60.25 13.05 L60.3 7.3 59.5 6.0 59.1 7.9 Q58.45 10.1 57.2 11.05 56.0 9.65 54.45 2.1 53.0 -4.8 53.0 -7.25 53.0 -12.5 53.9 -15.35 55.0 -18.95 57.05 -13.85 L57.95 -27.5 Q58.4 -34.85 61.2 -34.0 62.05 -33.75 62.6 -33.0 63.1 -34.45 63.75 -35.35 65.05 -37.15 66.0 -33.5 66.45 -31.65 66.7 -28.7 L66.7 -36.6 66.45 -36.6 Q61.8 -36.6 61.8 -40.2 61.8 -43.45 65.85 -43.45 L66.7 -43.4 66.7 -49.65 Q67.1 -49.25 67.55 -49.25 70.75 -49.25 71.7 -71.95 72.15 -83.3 71.95 -95.05 71.95 -101.45 70.6 -105.4 69.35 -108.95 67.6 -109.1 L66.7 -108.9 66.7 -112.85 Q65.75 -112.95 65.05 -113.6 64.25 -106.75 62.9 -105.1 62.1 -106.8 61.35 -113.9 60.7 -119.95 60.7 -122.4 60.7 -131.2 60.85 -133.95 61.25 -141.45 62.75 -144.75 64.75 -141.3 65.4 -135.3 66.0 -136.45 66.7 -136.65 L66.7 -150.5 84.25 -150.5 84.2 -144.15 Q83.95 -140.75 84.25 -137.3 84.8 -130.45 87.35 -130.45 89.8 -130.45 90.4 -135.95 L90.4 -6.65 89.55 -6.85 Q85.7 -6.95 85.35 5.3 85.15 11.75 85.7 21.65 L85.7 27.0 Q86.35 32.35 89.55 32.35 L90.4 32.25 90.4 65.25 Q89.25 66.0 88.45 67.55 87.6 62.75 86.25 60.6 83.6 64.4 83.05 76.0 82.75 81.9 82.95 88.25 L83.0 94.05 Q83.55 99.65 86.25 99.65 L87.6 99.2 87.75 100.75 Q88.55 103.75 90.4 104.25 L90.4 122.8 Q89.5 121.55 87.35 121.55 L86.2 121.65 86.25 113.5 Q86.0 107.7 82.4 103.8 81.25 104.9 80.5 106.25 76.9 106.7 76.9 109.35 L77.3 111.0 Q77.75 111.7 78.7 112.05 L78.6 113.05 Q78.45 116.35 78.7 123.05 78.2 129.65 78.55 143.05 L78.55 147.8 Q79.2 152.75 82.4 152.75 85.7 152.75 86.3 148.2 L86.25 143.25 Q86.5 134.65 86.35 128.85 L87.35 128.95 Q89.35 128.95 90.4 127.35 L90.4 181.15 M88.05 -113.5 Q88.05 -118.55 84.6 -118.65 81.15 -118.8 81.15 -113.4 81.05 -110.9 81.45 -108.55 82.2 -103.85 84.6 -103.85 88.05 -103.85 88.05 -113.5 M66.6 -102.35 Q67.0 -95.9 68.1 -91.8 69.05 -88.35 69.05 -83.8 L68.9 -75.5 Q68.35 -70.25 66.05 -67.95 64.4 -69.75 64.0 -75.6 63.85 -77.55 63.85 -83.85 63.85 -87.6 65.05 -91.9 66.2 -96.15 66.2 -102.35 L66.6 -102.35 M78.55 -94.9 Q73.6 -94.9 73.75 -82.55 L74.85 -69.35 Q74.65 -67.45 75.0 -65.65 75.65 -62.05 78.55 -62.05 79.6 -62.05 80.4 -62.65 81.35 -52.3 83.5 -52.3 85.9 -52.3 86.8 -64.25 87.25 -70.35 87.2 -77.25 87.2 -84.55 83.5 -84.4 L83.25 -84.35 Q82.95 -94.9 78.55 -94.9 M73.75 -40.1 Q72.25 -40.55 71.2 -38.0 70.05 -35.2 70.05 -29.75 70.0 -25.65 70.45 -21.25 71.4 -12.35 73.9 -12.35 76.65 -12.35 77.35 -19.35 L77.45 -27.75 Q77.45 -33.0 76.3 -36.5 75.25 -39.65 73.75 -40.1 M76.9 8.25 L76.6 4.9 76.2 1.65 Q74.9 -1.25 72.55 -0.95 70.3 -0.65 70.3 1.65 L70.45 11.3 Q70.45 16.2 72.3 17.85 74.15 19.45 74.15 21.65 L73.6 26.8 Q73.6 31.8 76.35 31.8 79.2 31.8 79.7 27.15 L79.65 21.55 Q79.65 18.3 78.35 16.35 77.0 14.3 76.9 8.25" fill="#1d292e" fill-rule="evenodd" stroke="none"/>
    <path d="M102.7 181.15 L90.4 181.15 90.4 127.35 Q89.35 128.95 87.35 128.95 L86.35 128.85 Q86.5 134.65 86.25 143.25 L86.3 148.2 Q85.7 152.75 82.4 152.75 79.2 152.75 78.55 147.8 L78.55 143.05 Q78.2 129.65 78.7 123.05 78.45 116.35 78.6 113.05 L78.7 112.05 Q77.75 111.7 77.3 111.0 L76.9 109.35 Q76.9 106.7 80.5 106.25 81.25 104.9 82.4 103.8 86.0 107.7 86.25 113.5 L86.2 121.65 87.35 121.55 Q89.5 121.55 90.4 122.8 L90.4 104.25 Q88.55 103.75 87.75 100.75 L87.6 99.2 86.25 99.65 Q83.55 99.65 83.0 94.05 L82.95 88.25 Q82.75 81.9 83.05 76.0 83.6 64.4 86.25 60.6 87.6 62.75 88.45 67.55 89.25 66.0 90.4 65.25 L90.4 32.25 89.55 32.35 Q86.35 32.35 85.7 27.0 L85.7 21.65 Q85.15 11.75 85.35 5.3 85.7 -6.95 89.55 -6.85 L90.4 -6.65 90.4 -135.95 Q89.8 -130.45 87.35 -130.45 84.8 -130.45 84.25 -137.3 83.95 -140.75 84.2 -144.15 L84.25 -150.5 102.7 -150.5 102.7 -141.55 101.65 -143.55 Q99.95 -141.25 99.3 -130.4 98.9 -124.4 98.9 -117.9 98.65 -111.05 98.9 -104.3 99.35 -90.8 101.65 -90.8 102.25 -90.8 102.7 -91.65 L102.7 -44.7 101.8 -44.1 Q97.55 -40.6 97.55 -33.85 L97.4 -18.9 Q97.15 -16.05 97.45 -13.35 98.0 -8.0 100.55 -8.0 101.9 -8.0 102.7 -9.3 L102.7 4.6 102.25 4.6 102.2 4.6 Q99.45 4.6 99.45 17.5 L99.5 20.4 Q100.0 23.55 102.2 23.55 L102.35 23.55 102.7 23.55 102.7 57.4 Q98.75 63.15 98.4 77.5 98.2 85.5 98.9 93.8 L98.9 106.7 Q99.35 119.45 101.65 119.45 102.25 119.45 102.7 117.45 L102.7 137.95 103.3 137.2 Q105.1 139.3 106.1 149.4 106.75 156.2 106.75 161.2 106.75 162.8 106.2 163.9 105.35 165.55 103.3 165.55 L102.7 165.55 102.7 181.15 M88.05 -113.5 Q88.05 -103.85 84.6 -103.85 82.2 -103.85 81.45 -108.55 81.05 -110.9 81.15 -113.4 81.15 -118.8 84.6 -118.65 88.05 -118.55 88.05 -113.5 M78.55 -94.9 Q82.95 -94.9 83.25 -84.35 L83.5 -84.4 Q87.2 -84.55 87.2 -77.25 87.25 -70.35 86.8 -64.25 85.9 -52.3 83.5 -52.3 81.35 -52.3 80.4 -62.65 79.6 -62.05 78.55 -62.05 75.65 -62.05 75.0 -65.65 74.65 -67.45 74.85 -69.35 L73.75 -82.55 Q73.6 -94.9 78.55 -94.9" fill="#2c3e45" fill-rule="evenodd" stroke="none"/>
    <path d="M102.7 -150.5 L108.0 -150.5 108.0 181.15 102.7 181.15 102.7 165.55 103.3 165.55 Q105.35 165.55 106.2 163.9 106.75 162.8 106.75 161.2 106.75 156.2 106.1 149.4 105.1 139.3 103.3 137.2 L102.7 137.95 102.7 117.45 Q102.25 119.45 101.65 119.45 99.35 119.45 98.9 106.7 L98.9 93.8 Q98.2 85.5 98.4 77.5 98.75 63.15 102.7 57.4 L102.7 23.55 102.35 23.55 102.2 23.55 Q100.0 23.55 99.5 20.4 L99.45 17.5 Q99.45 4.6 102.2 4.6 L102.25 4.6 102.7 4.75 102.7 4.6 102.7 -9.3 Q101.9 -8.0 100.55 -8.0 98.0 -8.0 97.45 -13.35 97.15 -16.05 97.4 -18.9 L97.55 -33.85 Q97.55 -40.6 101.8 -44.1 L102.7 -44.7 102.7 -91.65 Q102.25 -90.8 101.65 -90.8 99.35 -90.8 98.9 -104.3 98.65 -111.05 98.9 -117.9 98.9 -124.4 99.3 -130.4 99.95 -141.25 101.65 -143.55 L102.7 -141.55 102.7 -150.5" fill="#3a535c" fill-rule="evenodd" stroke="none"/>
  </g>
</svg>
