<?xml version="1.0" encoding="UTF-8" standalone="no"?>
<svg xmlns:xlink="http://www.w3.org/1999/xlink" height="40.55px" width="40.55px" xmlns="http://www.w3.org/2000/svg">
  <g transform="matrix(1.0, 0.0, 0.0, 1.0, 40.55, 40.55)">
    <path d="M-2.75 -14.7 L-2.75 -14.45 -2.85 -14.55 -2.75 -14.7" fill="#959595" fill-rule="evenodd" stroke="none"/>
    <path d="M-12.8 -11.05 Q-12.95 -10.6 -13.25 -10.3 L-13.5 -10.2 -13.25 -9.85 Q-13.1 -9.4 -13.25 -9.0 L-13.65 -7.95 -14.55 -8.55 -14.6 -8.55 -15.15 -8.9 -15.85 -8.2 -15.75 -8.8 -15.35 -9.85 -14.75 -10.45 -14.15 -10.55 -13.05 -11.6 -12.95 -11.75 Q-12.75 -11.45 -12.8 -11.05" fill="#fff300" fill-rule="evenodd" stroke="none"/>
    <path d="M-37.0 -8.8 Q-39.75 -12.7 -40.35 -17.4 L-40.55 -20.3 Q-40.55 -28.7 -34.55 -34.6 -30.85 -38.35 -26.15 -39.7 L-24.95 -40.05 -20.25 -40.55 -15.5 -40.05 Q-12.55 -39.4 -9.85 -37.75 L-9.2 -37.3 -6.55 -35.25 -5.9 -34.6 Q-3.2 -31.9 -1.7 -28.7 0.0 -24.85 0.0 -20.3 0.0 -15.1 -2.25 -10.75 L-2.45 -15.85 Q-1.7 -18.4 -1.65 -21.2 L-1.65 -21.4 Q-1.65 -25.15 -2.95 -28.35 -4.3 -31.75 -7.15 -34.55 L-7.7 -35.1 Q-9.95 -37.2 -12.55 -38.35 L-15.0 -39.25 -20.05 -40.0 -20.25 -40.0 -20.5 -40.0 -25.5 -39.25 -25.55 -39.2 -25.9 -39.15 Q-30.05 -37.85 -33.4 -34.55 -38.85 -29.1 -38.85 -21.4 -38.85 -19.6 -38.5 -17.95 -38.15 -15.85 -37.3 -13.95 L-37.25 -13.25 -37.0 -8.8" fill="#8f611c" fill-rule="evenodd" stroke="none"/>
    <path d="M-36.6 -16.35 L-36.7 -18.4 -36.7 -19.05 Q-36.7 -26.9 -31.25 -33.0 -28.4 -36.15 -25.25 -37.65 -22.4 -39.05 -19.25 -39.05 L-14.55 -38.65 -12.8 -38.45 Q-10.45 -37.25 -8.35 -35.35 L-8.5 -35.2 -11.25 -35.4 Q-15.3 -35.4 -17.6 -34.55 -19.7 -33.75 -22.65 -31.55 L-24.55 -30.15 Q-28.1 -27.35 -29.15 -26.1 L-30.4 -23.9 Q-31.05 -22.25 -32.6 -19.5 L-32.85 -19.05 Q-33.65 -17.6 -33.65 -15.9 -33.65 -15.0 -32.35 -12.0 -30.9 -8.8 -29.9 -7.95 L-32.6 -10.2 Q-35.05 -12.7 -36.3 -15.6 L-36.6 -16.35" fill="#db942b" fill-rule="evenodd" stroke="none"/>
    <path d="M-25.55 -39.2 L-25.5 -39.25 -20.5 -40.0 -20.25 -40.0 -20.05 -40.0 -15.0 -39.25 -12.8 -38.45 -14.55 -38.65 -19.25 -39.05 Q-22.4 -39.05 -25.25 -37.65 -28.4 -36.15 -31.25 -33.0 -36.7 -26.9 -36.7 -19.05 L-36.7 -18.4 -36.6 -16.35 -37.2 -18.25 -37.7 -21.7 -37.7 -22.55 Q-37.7 -29.75 -32.6 -34.9 -29.6 -37.85 -25.9 -39.1 L-25.55 -39.2" fill="#ffad33" fill-rule="evenodd" stroke="none"/>
    <path d="M-38.5 -17.95 Q-38.85 -19.6 -38.85 -21.4 -38.85 -29.1 -33.4 -34.55 -30.05 -37.85 -25.9 -39.15 L-25.55 -39.2 -25.9 -39.1 Q-29.6 -37.85 -32.6 -34.9 -37.7 -29.75 -37.7 -22.55 L-37.7 -21.7 -37.2 -18.25 -38.5 -17.95 M-15.0 -39.25 L-12.55 -38.35 Q-9.95 -37.2 -7.7 -35.1 L-7.15 -34.55 Q-4.3 -31.75 -2.95 -28.35 L-3.65 -28.1 Q-4.9 -31.85 -7.9 -34.9 L-8.2 -35.15 -8.35 -35.35 Q-10.45 -37.25 -12.8 -38.45 L-15.0 -39.25" fill="#bd8025" fill-rule="evenodd" stroke="none"/>
    <path d="M-29.9 -7.95 Q-30.9 -8.8 -32.35 -12.0 -33.65 -15.0 -33.65 -15.9 -33.65 -17.6 -32.85 -19.05 L-32.6 -19.5 Q-31.05 -22.25 -30.4 -23.9 L-29.15 -26.1 Q-28.1 -27.35 -24.55 -30.15 L-22.65 -31.55 Q-19.7 -33.75 -17.6 -34.55 -15.3 -35.4 -11.25 -35.4 L-8.5 -35.2 -8.2 -35.15 -7.9 -34.9 Q-4.9 -31.85 -3.65 -28.1 -2.8 -25.55 -2.8 -22.55 L-2.85 -21.0 -2.85 -20.75 -3.7 -22.9 Q-5.05 -25.7 -6.95 -25.7 L-11.2 -25.2 -14.85 -24.25 -18.5 -21.75 Q-23.15 -18.55 -26.35 -15.6 -29.9 -12.35 -29.9 -11.4 L-29.65 -10.65 Q-29.2 -9.7 -27.5 -8.05 -25.6 -6.15 -24.7 -5.6 -27.45 -6.3 -29.85 -7.95 L-29.9 -7.95" fill="#c48427" fill-rule="evenodd" stroke="none"/>
    <path d="M-8.5 -35.2 L-8.35 -35.35 -8.2 -35.15 -8.5 -35.2 M-24.7 -5.6 Q-25.6 -6.15 -27.5 -8.05 -29.2 -9.7 -29.65 -10.65 L-29.9 -11.4 Q-29.9 -12.35 -26.35 -15.6 -23.15 -18.55 -18.5 -21.75 L-14.85 -24.25 -11.2 -25.2 -6.95 -25.7 Q-5.05 -25.7 -3.7 -22.9 L-2.85 -20.75 Q-3.05 -18.7 -3.7 -16.8 L-5.4 -14.2 Q-6.95 -12.3 -9.65 -10.2 -10.9 -9.3 -12.8 -8.35 L-15.3 -7.25 Q-17.3 -6.3 -18.9 -5.85 -20.8 -5.3 -22.1 -5.3 L-22.1 -5.15 -24.05 -5.5 -24.2 -5.5 -24.7 -5.6" fill="#b07723" fill-rule="evenodd" stroke="none"/>
    <path d="M-37.3 -13.95 Q-38.15 -15.85 -38.5 -17.95 L-37.2 -18.25 -36.6 -16.35 -36.3 -15.6 Q-35.05 -12.7 -32.6 -10.2 L-29.9 -7.95 -29.85 -7.95 Q-27.45 -6.3 -24.7 -5.6 L-24.2 -5.5 -24.05 -5.5 -22.1 -5.15 -20.25 -5.1 -18.8 -5.15 Q-15.25 -5.4 -12.2 -7.0 -9.9 -8.25 -7.9 -10.2 L-6.9 -11.3 Q-4.7 -13.8 -3.7 -16.8 -3.05 -18.7 -2.85 -20.75 L-2.85 -21.0 -2.8 -22.55 Q-2.8 -25.55 -3.65 -28.1 L-2.95 -28.35 Q-1.65 -25.15 -1.65 -21.4 L-1.65 -21.2 Q-1.7 -18.4 -2.45 -15.85 L-2.8 -14.9 -2.95 -14.45 Q-4.15 -11.55 -6.4 -9.05 L-7.15 -8.3 Q-9.1 -6.3 -11.35 -5.05 -14.55 -3.3 -18.35 -2.9 L-20.25 -2.85 Q-25.45 -2.85 -29.6 -5.3 -31.65 -6.55 -33.4 -8.3 -35.95 -10.9 -37.3 -13.95" fill="#a1722e" fill-rule="evenodd" stroke="none"/>
    <path d="M-37.0 -8.8 L-37.25 -13.25 -37.3 -13.95 Q-35.95 -10.9 -33.4 -8.3 -31.65 -6.55 -29.6 -5.3 L-29.3 -2.1 Q-32.15 -3.5 -34.55 -5.95 L-37.0 -8.8" fill="#422c0d" fill-rule="evenodd" stroke="none"/>
    <path d="M-17.7 -0.15 L-20.25 0.0 Q-25.25 0.0 -29.3 -2.1 L-29.6 -5.3 Q-25.45 -2.85 -20.25 -2.85 L-18.35 -2.9 -17.7 -0.15" fill="#573b11" fill-rule="evenodd" stroke="none"/>
    <path d="M-22.1 -5.15 L-22.1 -5.3 Q-20.8 -5.3 -18.9 -5.85 -17.3 -6.3 -15.3 -7.25 L-12.8 -8.35 Q-10.9 -9.3 -9.65 -10.2 -6.95 -12.3 -5.4 -14.2 L-3.7 -16.8 Q-4.7 -13.8 -6.9 -11.3 L-7.9 -10.2 Q-9.9 -8.25 -12.2 -7.0 -15.25 -5.4 -18.8 -5.15 L-20.25 -5.1 -22.1 -5.15" fill="#d6912a" fill-rule="evenodd" stroke="none"/>
    <path d="M-2.45 -15.85 L-2.25 -10.75 Q-3.65 -8.2 -5.9 -5.95 L-6.1 -5.7 -6.4 -9.05 Q-4.15 -11.55 -2.95 -14.45 L-2.8 -14.9 -2.45 -15.85" fill="#734e17" fill-rule="evenodd" stroke="none"/>
    <path d="M-6.1 -5.7 Q-8.1 -3.85 -10.25 -2.55 -13.65 -0.65 -17.7 -0.15 L-18.35 -2.9 Q-14.55 -3.3 -11.35 -5.05 -9.1 -6.3 -7.15 -8.3 L-6.4 -9.05 -6.1 -5.7" fill="#664514" fill-rule="evenodd" stroke="none"/>
    <path d="M-9.4 -31.4 L-8.05 -32.1 Q-11.3 -29.25 -15.55 -27.85 L-11.3 -28.0 -14.65 -26.8 Q-12.6 -24.85 -11.3 -22.35 -9.8 -22.65 -8.4 -23.75 L-11.05 -21.4 -10.8 -18.85 -9.75 -18.3 -8.6 -18.5 -10.0 -17.7 -8.45 -16.9 -10.7 -16.5 -9.4 -13.05 -11.1 -14.15 -11.25 -12.8 -11.55 -14.4 -14.7 -11.3 -13.5 -14.5 Q-16.3 -12.65 -18.35 -10.0 L-18.05 -11.75 Q-20.05 -9.4 -23.0 -8.35 L-22.2 -9.9 -24.35 -8.35 -26.45 -13.05 -27.7 -11.85 -30.2 -14.35 Q-30.25 -12.65 -31.3 -11.2 -31.25 -12.9 -32.05 -14.75 L-33.45 -13.9 -33.25 -14.3 Q-32.95 -15.15 -32.95 -16.1 L-33.7 -15.55 -32.9 -16.9 -33.95 -17.1 -32.8 -17.6 -33.6 -18.55 -32.55 -18.8 Q-31.85 -19.85 -32.1 -21.05 L-35.3 -23.7 -31.8 -22.3 Q-30.2 -25.15 -27.55 -27.2 L-29.1 -28.45 -26.75 -28.35 -21.3 -28.55 -15.5 -29.35 Q-12.25 -29.7 -9.4 -31.4" fill="#573b11" fill-rule="evenodd" stroke="none"/>
    <path d="M-9.4 -31.4 Q-12.25 -29.7 -15.5 -29.35 L-21.3 -28.55 -26.75 -28.35 -29.1 -28.45 -27.55 -27.2 Q-30.2 -25.15 -31.8 -22.3 L-35.3 -23.7 -32.1 -21.05 Q-31.85 -19.85 -32.55 -18.8 L-33.6 -18.55 -32.8 -17.6 -33.95 -17.1 -32.9 -16.9 -33.7 -15.55 -32.95 -16.1 Q-32.95 -15.15 -33.25 -14.3 L-33.45 -13.9 -32.05 -14.75 Q-31.25 -12.9 -31.3 -11.2 -30.25 -12.65 -30.2 -14.35 L-27.7 -11.85 -26.45 -13.05 -24.35 -8.35 -22.2 -9.9 -23.0 -8.35 Q-20.05 -9.4 -18.05 -11.75 L-18.35 -10.0 Q-16.3 -12.65 -13.5 -14.5 L-14.7 -11.3 -11.55 -14.4 -11.25 -12.8 -11.1 -14.15 -9.4 -13.05 -10.7 -16.5 -8.45 -16.9 -10.0 -17.7 -8.6 -18.5 -9.75 -18.3 -10.8 -18.85 -11.05 -21.4 -8.4 -23.75 Q-9.8 -22.65 -11.3 -22.35 -12.6 -24.85 -14.65 -26.8 L-11.3 -28.0 -15.55 -27.85 Q-11.3 -29.25 -8.05 -32.1 L-9.4 -31.4 Z" fill="none" stroke="#573b11" stroke-linecap="square" stroke-linejoin="miter" stroke-miterlimit="3.0" stroke-width="1.0"/>
    <path d="M-16.25 -27.45 Q-17.65 -28.0 -19.35 -28.0 L-22.15 -28.0 -23.9 -27.65 Q-25.65 -27.2 -25.95 -26.05 L-26.1 -27.2 -26.55 -26.15 -26.75 -25.15 -27.4 -26.95 -27.5 -27.15 -27.55 -27.2 -27.55 -27.15 -27.7 -27.2 -29.1 -28.45 -29.05 -28.5 -27.35 -28.35 -18.1 -29.15 Q-10.8 -30.2 -8.1 -32.1 -9.1 -31.15 -11.45 -29.75 -14.0 -28.4 -15.6 -27.85 L-15.35 -27.85 -14.45 -28.0 -12.75 -28.2 -11.9 -28.1 -10.95 -28.0 -13.0 -27.55 -14.85 -26.75 -16.2 -27.5 -16.25 -27.5 -16.25 -27.45 M-31.8 -22.3 L-30.05 -22.05 -29.05 -22.05 -29.95 -22.75 -30.65 -23.4 -27.9 -23.2 Q-26.05 -23.0 -25.4 -22.0 L-25.4 -22.05 -25.7 -22.95 -25.9 -23.55 -25.9 -23.8 Q-25.45 -22.65 -24.3 -21.3 L-22.9 -19.95 -22.45 -19.5 Q-22.8 -19.3 -23.3 -19.05 L-23.35 -19.0 -23.5 -18.9 -23.5 -18.95 -23.45 -19.05 -23.15 -19.4 -23.75 -20.1 -25.1 -20.95 -26.1 -21.3 -27.45 -21.4 -27.55 -21.4 -29.95 -20.95 -29.95 -20.35 -29.9 -20.0 -30.65 -20.1 -32.25 -20.2 -32.35 -20.2 -32.35 -20.25 -32.25 -20.3 -31.05 -20.7 -32.15 -21.1 -33.4 -22.0 -35.3 -23.65 -35.25 -23.75 Q-34.4 -22.9 -32.85 -22.55 L-31.8 -22.3 M-11.0 -21.35 L-12.6 -20.7 Q-11.8 -20.65 -11.3 -20.25 L-11.3 -20.2 -12.95 -20.1 -13.0 -20.1 -13.8 -20.0 -13.7 -20.35 -13.7 -20.95 -16.1 -21.4 -16.2 -21.4 -18.45 -21.0 -18.55 -20.95 -19.9 -20.1 -20.55 -19.4 -20.2 -19.05 -20.15 -18.95 -20.15 -18.9 -20.3 -19.0 -20.35 -19.05 -21.2 -19.5 -20.75 -19.95 -19.35 -21.3 Q-18.25 -22.65 -17.8 -23.8 L-17.8 -23.55 -17.95 -22.95 -18.3 -22.05 -18.3 -22.0 -18.25 -22.0 Q-17.6 -23.0 -15.75 -23.2 L-12.95 -23.4 -13.7 -22.75 -14.6 -22.05 -13.6 -22.05 -11.3 -22.4 -10.8 -22.55 Q-9.25 -22.9 -8.45 -23.75 L-8.35 -23.65 -10.3 -22.0 -11.0 -21.35" fill="#61594d" fill-rule="evenodd" stroke="none"/>
    <path d="M-27.5 -27.15 L-27.4 -26.95 -26.75 -25.15 -26.55 -26.15 -26.1 -27.2 -25.95 -26.05 Q-25.65 -27.2 -23.9 -27.65 L-22.15 -28.0 -19.35 -28.0 Q-17.65 -28.0 -16.25 -27.45 L-14.85 -26.75 -13.65 -25.8 -13.35 -25.45 Q-11.95 -24.1 -11.3 -22.4 L-13.6 -22.05 -14.6 -22.05 -13.7 -22.75 -12.95 -23.4 -15.75 -23.2 Q-17.6 -23.0 -18.25 -22.0 L-18.3 -22.05 -17.95 -22.95 -17.8 -23.55 -17.8 -23.8 Q-18.25 -22.65 -19.35 -21.3 L-20.75 -19.95 -21.2 -19.5 -20.35 -19.05 -20.3 -19.0 -20.75 -18.65 -20.75 -18.6 Q-19.05 -17.7 -18.85 -15.8 L-18.8 -15.3 -18.7 -16.15 -14.55 -16.0 -16.65 -16.35 Q-14.55 -17.55 -12.1 -17.95 L-13.7 -18.4 -12.1 -18.55 -14.1 -19.0 -14.1 -19.05 -13.95 -19.45 -13.85 -19.8 -13.8 -20.0 -13.0 -20.1 -12.95 -20.1 -11.3 -20.2 -11.3 -20.25 Q-11.8 -20.65 -12.6 -20.7 L-11.0 -21.35 Q-10.85 -20.65 -10.85 -19.8 L-10.85 -19.6 -10.85 -18.9 Q-10.6 -18.65 -10.35 -18.55 L-8.65 -18.5 -9.15 -18.1 -10.0 -17.7 -8.9 -17.3 -8.5 -16.9 Q-9.5 -17.1 -10.75 -16.5 L-9.65 -13.65 -9.4 -13.1 -10.1 -13.65 -10.3 -13.75 -10.95 -14.3 -10.9 -14.05 -11.05 -14.15 -11.25 -12.8 -11.6 -14.45 Q-11.85 -13.95 -13.35 -13.2 -14.55 -12.6 -14.75 -11.35 L-14.75 -11.7 -14.6 -12.2 -14.3 -13.05 -13.55 -14.4 -13.5 -14.5 -13.55 -14.45 -16.2 -12.8 Q-18.1 -11.5 -18.4 -10.0 L-18.4 -10.45 -18.05 -11.75 -18.9 -10.9 -20.15 -9.8 -22.85 -8.35 -23.0 -8.35 -22.95 -8.5 -22.2 -9.85 -22.2 -10.15 Q-22.45 -9.65 -23.35 -9.05 L-24.35 -8.35 -24.4 -9.15 Q-24.7 -10.0 -25.25 -10.5 -26.6 -11.55 -26.5 -13.1 L-26.55 -13.1 -27.65 -11.5 -27.75 -11.8 -27.7 -11.85 -27.65 -12.0 -27.75 -11.85 Q-28.1 -12.45 -28.95 -13.05 -30.05 -13.75 -30.3 -14.6 L-30.3 -14.55 Q-30.1 -14.1 -30.5 -13.25 L-30.55 -12.9 -31.2 -11.45 -31.2 -11.4 -31.25 -11.45 -31.2 -11.75 Q-31.1 -12.4 -31.5 -13.05 -32.0 -13.8 -32.1 -14.75 L-33.4 -13.8 -33.45 -13.85 -33.25 -14.2 Q-32.85 -15.0 -32.85 -15.8 L-33.15 -15.55 -32.95 -16.15 -33.7 -15.55 -32.85 -16.9 Q-33.5 -16.85 -34.0 -17.15 L-33.65 -17.2 Q-33.15 -17.3 -32.8 -17.6 L-33.05 -17.7 -33.7 -18.5 -33.6 -18.55 -33.45 -18.5 Q-32.35 -18.6 -32.25 -19.6 L-32.25 -19.8 -32.25 -20.2 -30.65 -20.1 -29.9 -20.0 -29.85 -19.8 -29.7 -19.45 -29.55 -19.05 -29.5 -19.0 -31.55 -18.55 -29.95 -18.4 -31.55 -17.95 Q-29.1 -17.55 -27.0 -16.35 L-29.1 -16.0 -25.0 -16.15 -24.8 -15.3 -24.75 -15.8 Q-24.6 -17.7 -22.9 -18.6 L-22.9 -18.65 -23.35 -19.0 -23.3 -19.05 Q-22.8 -19.3 -22.45 -19.5 L-22.9 -19.95 -24.3 -21.3 Q-25.45 -22.65 -25.9 -23.8 L-25.9 -23.55 -25.7 -22.95 -25.4 -22.05 -25.4 -22.0 Q-26.05 -23.0 -27.9 -23.2 L-30.65 -23.4 -29.95 -22.75 -29.05 -22.05 -30.05 -22.05 -31.8 -22.3 -30.9 -24.05 -29.75 -25.45 -29.45 -25.8 Q-28.6 -26.65 -27.5 -27.1 L-27.5 -27.15 M-21.45 -18.6 L-21.5 -18.6 Q-22.8 -18.6 -23.3 -17.55 -23.7 -16.8 -23.7 -15.5 L-23.6 -14.65 Q-23.0 -14.6 -22.45 -13.55 -21.95 -12.65 -21.9 -11.6 L-21.9 -11.35 -21.9 -11.3 -21.9 -11.15 -21.85 -11.15 -21.4 -12.95 -20.75 -13.95 -19.95 -14.55 -19.95 -15.55 -20.15 -17.35 -20.2 -17.55 Q-20.55 -18.55 -21.45 -18.6 M-32.15 -21.1 L-31.05 -20.7 -32.25 -20.3 -32.15 -21.1" fill="#c2b29b" fill-rule="evenodd" stroke="none"/>
    <path d="M-23.35 -19.0 L-22.9 -18.65 -22.9 -18.6 Q-24.6 -17.7 -24.75 -15.8 L-24.8 -15.3 -25.0 -16.15 -29.1 -16.0 -27.0 -16.35 Q-29.1 -17.55 -31.55 -17.95 L-29.95 -18.4 -31.55 -18.55 -29.5 -19.0 -29.55 -19.05 -29.7 -19.45 -29.85 -19.8 -29.9 -20.0 -29.95 -20.35 -29.95 -20.95 -27.55 -21.4 -27.45 -21.4 -26.1 -21.3 -25.1 -20.95 -23.75 -20.1 -23.15 -19.4 -23.45 -19.05 -23.5 -18.95 -23.6 -18.95 -23.6 -18.9 -23.5 -18.9 -23.35 -19.0 M-13.8 -20.0 L-13.85 -19.8 -13.95 -19.45 -14.1 -19.05 -14.1 -19.0 -12.1 -18.55 -13.7 -18.4 -12.1 -17.95 Q-14.55 -17.55 -16.65 -16.35 L-14.55 -16.0 -18.7 -16.15 -18.8 -15.3 -18.85 -15.8 Q-19.05 -17.7 -20.75 -18.6 L-20.75 -18.65 -20.3 -19.0 -20.15 -18.9 -20.1 -18.9 -20.1 -18.95 -20.15 -18.95 -20.2 -19.05 -20.55 -19.4 -19.9 -20.1 -18.55 -20.95 -18.45 -21.0 -16.2 -21.4 -16.1 -21.4 -13.7 -20.95 -13.7 -20.35 -13.8 -20.0 M-26.1 -21.1 L-27.55 -21.2 -29.5 -20.8 -29.45 -20.4 -29.3 -19.8 -29.3 -19.65 -29.25 -19.45 -29.0 -19.0 -28.6 -18.3 Q-28.2 -17.8 -27.55 -17.65 -25.2 -16.85 -23.9 -18.75 L-23.75 -19.05 -23.5 -19.35 -23.6 -19.5 -23.85 -20.0 -25.3 -20.85 -26.1 -21.1 M-18.4 -20.8 L-19.8 -20.0 -20.1 -19.5 -20.15 -19.35 -19.9 -19.05 -19.75 -18.75 Q-18.45 -16.85 -16.1 -17.65 L-15.05 -18.3 -14.6 -19.0 -14.4 -19.45 -14.35 -19.65 -14.35 -19.8 -14.25 -20.4 -14.15 -20.8 -16.1 -21.2 -17.6 -21.0 -18.4 -20.8" fill="#f0dcc0" fill-rule="evenodd" stroke="none"/>
    <path d="M-25.3 -20.85 L-23.85 -20.0 -23.6 -19.5 -23.5 -19.35 -23.75 -19.05 -23.9 -18.75 Q-25.2 -16.85 -27.55 -17.65 -28.2 -17.8 -28.6 -18.3 L-29.0 -19.0 -29.25 -19.45 -29.3 -19.65 -29.3 -19.8 -29.45 -20.4 -29.5 -20.8 -27.55 -21.2 -26.1 -21.1 Q-26.2 -19.6 -25.9 -18.85 -25.55 -18.95 -25.45 -19.65 L-25.3 -20.85 M-23.5 -18.9 L-23.6 -18.9 -23.6 -18.95 -23.5 -18.95 -23.5 -18.9 M-17.6 -21.0 L-16.1 -21.2 -14.15 -20.8 -14.25 -20.4 -14.35 -19.8 -14.35 -19.65 -14.4 -19.45 -14.6 -19.0 -15.05 -18.3 -16.1 -17.65 Q-18.45 -16.85 -19.75 -18.75 L-19.9 -19.05 -20.15 -19.35 -20.1 -19.5 -19.8 -20.0 -18.4 -20.8 -18.15 -18.6 Q-17.7 -18.7 -17.65 -19.6 L-17.6 -21.0 M-20.15 -18.9 L-20.15 -18.95 -20.1 -18.95 -20.1 -18.9 -20.15 -18.9" fill="#ffffff" fill-rule="evenodd" stroke="none"/>
    <path d="M-21.5 -18.6 L-21.45 -18.6 -21.45 -18.55 -21.5 -18.6 M-21.85 -11.15 L-21.9 -11.15 -21.9 -11.3 -21.85 -11.15" fill="#3b3b3b" fill-rule="evenodd" stroke="none"/>
    <path d="M-26.1 -21.1 L-25.3 -20.85 -25.45 -19.65 Q-25.55 -18.95 -25.9 -18.85 -26.2 -19.6 -26.1 -21.1 M-17.6 -21.0 L-17.65 -19.6 Q-17.7 -18.7 -18.15 -18.6 L-18.4 -20.8 -17.6 -21.0" fill="#2b2c33" fill-rule="evenodd" stroke="none"/>
    <path d="M-21.5 -18.6 L-21.45 -18.55 -21.9 -18.15 -22.3 -18.15 -22.45 -18.1 -22.85 -17.7 -22.95 -17.35 -22.95 -17.2 -22.5 -17.05 -22.1 -17.15 -22.0 -16.3 -21.85 -15.35 -21.95 -14.1 -21.9 -11.6 Q-21.95 -12.65 -22.45 -13.55 -23.0 -14.6 -23.6 -14.65 L-23.7 -15.5 Q-23.7 -16.8 -23.3 -17.55 -22.8 -18.6 -21.5 -18.6 M-20.2 -17.55 L-20.15 -17.35 -19.95 -15.55 -19.95 -14.55 -20.75 -13.95 -20.95 -15.8 -20.8 -17.15 -20.7 -17.75 -20.2 -17.55" fill="#423c34" fill-rule="evenodd" stroke="none"/>
    <path d="M-21.45 -18.55 L-21.45 -18.6 Q-20.55 -18.55 -20.2 -17.55 L-20.7 -17.75 -20.8 -17.15 -20.95 -15.8 -20.75 -13.95 -21.4 -12.95 -21.85 -11.15 -21.9 -11.3 -21.9 -11.35 -21.9 -11.6 -21.95 -14.1 -21.85 -15.35 -22.0 -16.3 -22.1 -17.15 -21.75 -17.35 -21.6 -17.8 Q-21.6 -18.15 -21.9 -18.15 L-21.45 -18.55" fill="#242424" fill-rule="evenodd" stroke="none"/>
    <path d="M-21.9 -18.15 Q-21.6 -18.15 -21.6 -17.8 L-21.75 -17.35 -22.1 -17.15 -22.5 -17.05 -22.95 -17.2 -22.95 -17.35 -22.85 -17.7 -22.75 -17.65 -22.5 -17.55 Q-22.15 -17.6 -22.1 -17.75 L-22.05 -17.85 Q-22.05 -18.1 -22.4 -18.05 L-22.45 -18.1 -22.3 -18.15 -21.9 -18.15" fill="#595046" fill-rule="evenodd" stroke="none"/>
    <path d="M-22.45 -18.1 L-22.4 -18.05 Q-22.75 -17.95 -22.75 -17.65 L-22.85 -17.7 -22.45 -18.1" fill="#626262" fill-rule="evenodd" stroke="none"/>
    <path d="M-22.4 -18.05 Q-22.05 -18.1 -22.05 -17.85 L-22.1 -17.75 Q-22.15 -17.6 -22.5 -17.55 L-22.75 -17.65 Q-22.75 -17.95 -22.4 -18.05" fill="#665c50" fill-rule="evenodd" stroke="none"/>
    <path d="M-33.45 -13.85 L-33.4 -13.8 -33.45 -13.8 -33.45 -13.85 M-31.25 -11.45 L-31.2 -11.4 -31.35 -11.25 -31.25 -11.45 M-18.3 -22.05 L-18.25 -22.0 -18.3 -22.0 -18.3 -22.05" fill="#c8c8c8" fill-rule="evenodd" stroke="none"/>
    <path d="M-16.5 -36.1 L-16.5 -35.5 -18.9 -33.6 -19.05 -34.15 -16.5 -36.1 M-18.1 -31.0 L-18.1 -30.35 -20.8 -32.25 -23.45 -30.45 -23.45 -31.05 -20.8 -32.85 -18.1 -31.0 M-22.65 -33.65 L-25.1 -35.5 -25.1 -36.1 -22.55 -34.15 -22.65 -33.65" fill="#6e4a16" fill-rule="evenodd" stroke="none"/>
    <path d="M-16.5 -36.1 L-19.05 -34.15 -18.9 -33.6 -18.1 -31.05 -18.1 -31.0 -20.8 -32.85 -23.45 -31.05 -22.65 -33.65 -22.55 -34.15 -25.1 -36.1 -21.9 -36.25 -20.8 -39.25 -19.7 -36.25 -16.5 -36.1 M-18.25 -35.55 L-20.2 -35.6 -20.8 -37.35 -21.45 -35.6 -23.35 -35.55 -21.85 -34.35 -22.4 -32.5 -20.8 -33.6 -19.25 -32.5 -19.8 -34.35 -18.25 -35.55" fill="#fff300" fill-rule="evenodd" stroke="none"/>
    <path d="M-18.25 -35.55 L-19.8 -34.35 -19.25 -32.5 -20.8 -33.6 -22.4 -32.5 -21.85 -34.35 -23.35 -35.55 -21.45 -35.6 -20.8 -37.35 -20.2 -35.6 -18.25 -35.55" fill="#ffc900" fill-rule="evenodd" stroke="none"/>
  </g>
</svg>
