<?xml version="1.0" encoding="UTF-8" standalone="no"?>
<svg xmlns:xlink="http://www.w3.org/1999/xlink" height="30.95px" width="30.7px" xmlns="http://www.w3.org/2000/svg">
  <g transform="matrix(1.0, 0.0, 0.0, 1.0, 15.2, 15.3)">
    <path d="M-14.15 -7.05 L-13.65 -7.65 Q-12.1 -9.2 -9.3 -9.2 L-5.65 -8.6 -5.3 -8.5 -3.15 -7.9 -3.05 -7.85 -3.0 -7.85 -2.9 -8.2 -2.85 -8.35 -1.95 -10.25 -1.05 -11.5 -0.35 -12.2 -0.3 -12.35 1.1 -13.5 1.25 -13.55 2.55 -14.3 4.2 -14.95 6.65 -15.3 6.85 -15.3 9.3 -14.55 10.4 -14.1 13.0 -12.7 13.1 -12.65 Q14.15 -12.0 14.85 -10.6 L14.9 -10.5 Q15.5 -9.2 15.5 -8.05 L15.2 -6.1 14.65 -5.95 14.95 -6.75 15.0 -6.9 15.05 -7.95 15.05 -8.05 Q15.05 -9.1 14.5 -10.25 13.85 -11.65 12.9 -12.25 L12.85 -12.25 10.25 -13.7 9.3 -14.1 6.85 -14.9 6.65 -14.9 4.2 -14.5 2.7 -13.9 1.45 -13.15 1.4 -13.15 0.0 -12.0 -0.7 -11.2 -1.4 -10.25 Q-2.35 -8.85 -2.7 -7.25 L-2.75 -7.15 -2.8 -6.8 -2.85 -6.8 -2.9 -6.4 -3.05 -4.8 Q-3.05 -3.15 -2.6 -1.5 L-1.8 0.65 -1.95 0.65 -2.3 0.65 -2.45 0.25 -3.05 -1.5 -3.45 -4.0 -3.5 -4.65 -3.5 -4.8 -3.4 -6.1 -3.45 -6.1 -3.5 -6.15 -5.65 -6.75 -5.75 -6.8 -9.3 -7.45 Q-11.3 -7.45 -12.45 -6.4 L-12.65 -6.15 -13.45 -5.6 -12.75 -6.75 Q-11.5 -7.9 -9.3 -7.9 L-6.0 -7.3 -5.65 -7.2 -3.4 -6.55 -3.35 -6.55 -3.2 -7.2 -3.15 -7.4 -3.25 -7.45 -5.65 -8.1 -5.75 -8.15 -9.3 -8.75 Q-11.95 -8.75 -13.35 -7.35 L-14.15 -6.2 -14.15 -7.05 M-1.6 -5.6 L-1.65 -5.6 -1.7 -4.8 -1.7 -4.45 -1.65 -4.15 -1.25 -1.5 -0.6 0.15 -0.95 0.4 -1.0 0.3 -1.65 -1.5 Q-2.15 -3.15 -2.15 -4.8 L-2.05 -6.15 -2.0 -6.65 -1.9 -6.9 -1.9 -6.95 -1.9 -7.05 Q-1.5 -8.75 -0.35 -10.25 L-0.05 -10.65 0.65 -11.4 0.65 -11.35 1.9 -12.45 2.7 -12.95 4.2 -13.6 6.65 -14.0 6.85 -14.0 Q7.45 -14.0 9.3 -13.1 L9.85 -12.9 12.4 -11.5 Q13.15 -11.05 13.7 -9.9 14.2 -8.95 14.2 -8.05 14.2 -7.0 13.8 -6.2 L13.7 -6.05 13.45 -6.45 13.5 -6.65 13.6 -6.9 13.75 -8.05 13.3 -9.7 13.3 -9.8 12.15 -11.15 12.05 -11.25 9.6 -12.5 9.3 -12.6 6.85 -13.55 6.65 -13.55 4.2 -13.1 2.95 -12.55 2.25 -12.2 2.2 -12.1 0.95 -11.05 0.85 -10.95 0.3 -10.35 0.25 -10.25 Q-0.75 -9.1 -1.2 -7.75 L-1.25 -7.6 -1.25 -7.55 -1.35 -7.35 -1.45 -6.85 -1.5 -6.9 -1.6 -6.0 -1.6 -5.6 M7.6 -4.3 L7.75 -4.45 8.05 -4.25 7.6 -4.3" fill="#8d7761" fill-rule="evenodd" stroke="none"/>
    <path d="M-14.15 -6.2 L-13.35 -7.35 Q-11.95 -8.75 -9.3 -8.75 L-5.75 -8.15 -5.85 -8.0 -6.05 -7.5 -6.0 -7.3 -9.3 -7.9 Q-11.5 -7.9 -12.75 -6.75 L-13.45 -5.6 -13.8 -5.6 Q-14.25 -5.6 -14.25 -5.95 L-14.15 -6.2 M-1.8 0.65 L-2.6 -1.5 Q-3.05 -3.15 -3.05 -4.8 L-2.9 -6.4 -2.85 -6.8 -2.8 -6.8 -2.75 -7.15 -2.7 -7.25 Q-2.35 -8.85 -1.4 -10.25 L-0.7 -11.2 0.0 -12.0 1.4 -13.15 1.45 -13.15 2.7 -13.9 4.2 -14.5 6.65 -14.9 6.85 -14.9 9.3 -14.1 10.25 -13.7 12.85 -12.25 12.9 -12.25 Q13.85 -11.65 14.5 -10.25 15.05 -9.1 15.05 -8.05 L15.05 -7.95 15.0 -6.9 14.95 -6.75 14.9 -6.8 Q14.55 -6.05 14.15 -6.05 13.85 -6.05 13.8 -6.2 14.2 -7.0 14.2 -8.05 14.2 -8.95 13.7 -9.9 13.15 -11.05 12.4 -11.5 L9.85 -12.9 9.3 -13.1 Q7.45 -14.0 6.85 -14.0 L6.65 -14.0 4.2 -13.6 2.7 -12.95 1.9 -12.45 0.65 -11.35 0.65 -11.4 -0.05 -10.65 -0.35 -10.25 Q-1.5 -8.75 -1.9 -7.05 L-1.9 -6.95 -1.9 -6.9 -2.0 -6.65 -2.05 -6.15 -2.15 -4.8 Q-2.15 -3.15 -1.65 -1.5 L-1.0 0.3 -0.95 0.4 -1.1 0.45 -1.8 0.65" fill="#b59c82" fill-rule="evenodd" stroke="none"/>
    <path d="M15.2 -6.1 Q14.75 -4.85 13.6 -4.05 12.1 -2.9 9.7 -2.9 L9.5 -2.9 9.05 -2.9 7.0 -3.05 6.9 -3.05 Q4.35 -3.45 1.3 -4.6 L1.2 -4.65 1.15 -4.65 1.1 -4.7 0.85 -4.75 -1.6 -5.6 -1.6 -6.0 -0.05 -5.55 1.15 -5.15 1.2 -5.1 1.5 -5.0 Q4.45 -3.9 7.0 -3.5 L7.7 -3.4 9.5 -3.3 Q11.9 -3.3 13.35 -4.4 14.25 -5.0 14.65 -5.95 L15.2 -6.1 M-0.6 0.15 L0.05 1.35 Q0.85 2.75 1.95 3.3 L2.1 3.4 1.65 3.6 Q0.45 2.9 -0.45 1.35 L-0.95 0.4 -0.6 0.15 M0.7 4.05 L0.25 4.3 Q-1.0 3.3 -1.95 1.35 L-2.2 0.85 -2.3 0.65 -1.95 0.65 -1.8 0.65 -1.45 1.35 Q-0.5 3.15 0.7 4.05 M-12.65 -6.15 Q-13.45 -5.1 -13.45 -3.3 -13.45 -1.5 -12.15 -0.55 -11.35 0.1 -8.9 0.95 L-8.5 1.05 -8.55 1.05 -8.15 1.2 Q-6.4 1.8 -5.3 2.5 L-4.35 3.2 -4.25 3.3 Q-3.25 4.2 -2.55 5.85 L-2.95 6.1 Q-3.65 4.45 -4.65 3.55 L-5.3 3.0 Q-6.2 2.4 -7.65 1.85 L-8.65 1.5 Q-11.55 0.5 -12.45 -0.2 -13.9 -1.25 -13.9 -3.3 -13.9 -4.7 -13.45 -5.6 L-12.65 -6.15 M-3.65 6.5 L-4.05 6.8 Q-4.6 5.55 -5.3 4.8 L-5.5 4.6 -5.55 4.5 Q-6.65 3.55 -9.05 2.75 L-10.05 2.4 -10.2 2.35 Q-12.45 1.5 -13.25 0.9 -15.2 -0.55 -15.2 -3.3 -15.2 -5.65 -14.15 -7.05 L-14.15 -6.2 Q-14.8 -5.05 -14.8 -3.3 -14.8 -0.8 -12.95 0.55 -12.0 1.3 -8.95 2.35 L-8.6 2.45 Q-6.3 3.25 -5.3 4.15 L-5.25 4.2 -5.2 4.2 Q-4.3 5.0 -3.65 6.5 M-1.35 -7.35 L0.0 -6.9 1.15 -6.5 1.6 -6.4 1.85 -6.3 1.9 -6.3 Q4.8 -5.25 7.2 -4.85 L9.5 -4.65 Q11.4 -4.65 12.6 -5.45 L12.55 -5.45 13.45 -6.45 13.7 -6.05 12.8 -5.1 Q11.55 -4.2 9.5 -4.2 L8.05 -4.25 7.75 -4.45 7.6 -4.3 7.15 -4.4 Q4.65 -4.8 1.8 -5.85 L1.75 -5.85 1.5 -5.95 1.15 -6.05 -0.15 -6.5 -1.45 -6.85 -1.35 -7.35" fill="#6e5d4b" fill-rule="evenodd" stroke="none"/>
    <path d="M-5.75 -8.15 L-5.65 -8.1 -3.25 -7.45 -3.15 -7.4 -3.2 -7.2 -3.35 -6.55 -3.4 -6.55 -5.65 -7.2 -6.0 -7.3 -6.05 -7.5 -5.85 -8.0 -5.75 -8.15 M14.95 -6.75 L14.65 -5.95 Q14.25 -5.0 13.35 -4.4 11.9 -3.3 9.5 -3.3 L7.7 -3.4 7.0 -3.5 Q4.45 -3.9 1.5 -5.0 L1.2 -5.1 1.15 -5.15 -0.05 -5.55 -0.35 -6.1 -0.15 -6.5 1.15 -6.05 1.5 -5.95 1.75 -5.85 1.8 -5.85 Q4.65 -4.8 7.15 -4.4 L7.6 -4.3 8.05 -4.25 9.5 -4.2 Q11.55 -4.2 12.8 -5.1 L13.7 -6.05 13.8 -6.2 Q13.85 -6.05 14.15 -6.05 14.55 -6.05 14.9 -6.8 L14.95 -6.75 M-14.15 -6.2 L-14.25 -5.95 Q-14.25 -5.6 -13.8 -5.6 L-13.45 -5.6 Q-13.9 -4.7 -13.9 -3.3 -13.9 -1.25 -12.45 -0.2 -11.55 0.5 -8.65 1.5 L-7.65 1.85 Q-7.65 2.25 -8.0 2.35 L-8.6 2.45 -8.95 2.35 Q-12.0 1.3 -12.95 0.55 -14.8 -0.8 -14.8 -3.3 -14.8 -5.05 -14.15 -6.2" fill="#a18e74" fill-rule="evenodd" stroke="none"/>
    <path d="M1.65 3.6 Q1.2 3.8 0.7 4.05 -0.5 3.15 -1.45 1.35 L-1.8 0.65 -1.1 0.45 -0.95 0.4 -0.45 1.35 Q0.45 2.9 1.65 3.6 M-2.95 6.1 L-3.65 6.5 Q-4.3 5.0 -5.2 4.2 L-5.25 4.2 -5.3 4.15 Q-6.3 3.25 -8.6 2.45 L-8.0 2.35 Q-7.65 2.25 -7.65 1.85 -6.2 2.4 -5.3 3.0 L-4.65 3.55 Q-3.65 4.45 -2.95 6.1 M-1.45 -6.85 L-0.15 -6.5 -0.35 -6.1 -0.05 -5.55 -1.6 -6.0 -1.5 -6.9 -1.45 -6.85" fill="#7a6754" fill-rule="evenodd" stroke="none"/>
    <path d="M5.95 4.35 Q6.8 5.3 7.3 6.45 L7.65 8.0 7.7 8.9 7.55 10.6 Q7.2 11.9 6.3 13.05 L5.75 13.65 5.75 13.7 4.05 14.95 Q2.65 15.65 1.0 15.65 L0.9 15.65 0.5 15.65 0.25 15.6 -0.8 15.4 -1.5 15.2 -1.45 15.2 Q-2.4 14.85 -3.15 14.2 L-3.15 14.25 -3.8 13.65 -4.15 13.3 -4.45 12.9 -4.9 12.25 -4.9 12.2 -5.1 11.85 -5.15 11.75 -5.15 11.7 -5.5 10.7 -5.75 8.9 Q-5.75 7.25 -5.1 5.95 L-5.1 6.0 -4.35 4.85 -3.8 4.15 Q-2.55 2.95 -0.95 2.55 L-1.0 2.55 -0.25 2.35 -0.15 2.3 0.3 2.25 0.85 2.2 0.9 2.2 1.0 2.2 1.55 2.25 2.65 2.45 Q3.7 2.65 4.6 3.3 L4.6 3.25 5.75 4.15 5.95 4.35 M4.2 4.1 L4.15 4.0 Q3.35 3.5 2.5 3.3 L1.5 3.15 1.0 3.1 0.9 3.1 0.35 3.15 0.2 3.15 -0.1 3.2 -0.75 3.35 Q-2.1 3.75 -3.15 4.8 L-3.7 5.4 -4.3 6.35 Q-4.85 7.5 -4.85 8.9 L-4.7 10.45 -4.35 11.35 -4.35 11.45 -4.15 11.8 -3.75 12.35 -3.5 12.7 -3.15 13.05 -2.6 13.55 -1.15 14.35 -0.55 14.6 0.3 14.7 0.55 14.75 0.75 14.75 1.0 14.75 2.45 14.6 Q3.95 14.2 5.1 13.05 L5.5 12.65 6.55 10.7 6.65 10.35 6.85 8.9 6.8 8.1 6.45 6.75 Q6.0 5.7 5.1 4.8 L4.6 4.35 4.2 4.1" fill="#6d3434" fill-rule="evenodd" stroke="none"/>
    <path d="M1.5 3.15 L2.5 3.3 Q3.35 3.5 4.15 4.0 L4.2 4.1 4.3 4.35 4.6 5.9 Q4.6 7.35 2.45 8.75 L1.3 9.35 Q-2.0 11.0 -2.0 11.85 -2.0 12.5 -1.6 13.3 L-1.15 13.9 -0.55 14.6 -1.15 14.35 -2.6 13.55 -2.9 12.4 Q-2.9 10.1 -0.15 9.15 L-0.7 9.15 Q-3.8 9.95 -3.8 11.95 L-3.75 12.35 -4.15 11.8 Q-4.05 8.9 -0.6 7.9 1.6 7.25 2.45 6.45 2.95 6.0 2.95 5.45 L2.75 4.35 2.35 3.75 2.05 3.45 1.5 3.15" fill="#8f1212" fill-rule="evenodd" stroke="none"/>
    <path d="M4.2 4.1 L4.6 4.35 5.1 4.8 Q6.0 5.7 6.45 6.75 L6.8 8.1 6.15 8.8 Q5.0 9.75 3.2 9.9 L2.45 9.95 Q0.7 10.15 -0.05 10.5 -1.6 11.2 -1.6 13.05 L-1.6 13.3 Q-2.0 12.5 -2.0 11.85 -2.0 11.0 1.3 9.35 L2.45 8.75 Q4.6 7.35 4.6 5.9 L4.3 4.35 4.2 4.1 M-2.6 13.55 L-3.15 13.05 -3.5 12.7 -3.75 12.35 -3.8 11.95 Q-3.8 9.95 -0.7 9.15 L-0.15 9.15 Q-2.9 10.1 -2.9 12.4 L-2.6 13.55 M-4.15 11.8 L-4.35 11.45 -4.35 11.35 -4.7 10.45 Q-4.55 9.35 -3.4 8.4 L-2.9 8.55 Q-2.05 8.55 -2.05 7.6 L-1.6 7.35 Q1.45 6.0 1.45 4.8 1.45 3.35 0.35 3.15 L0.9 3.1 1.0 3.1 1.5 3.15 2.05 3.45 2.35 3.75 2.75 4.35 2.95 5.45 Q2.95 6.0 2.45 6.45 1.6 7.25 -0.6 7.9 -4.05 8.9 -4.15 11.8" fill="#ab1616" fill-rule="evenodd" stroke="none"/>
    <path d="M5.5 12.65 L5.1 13.05 Q3.95 14.2 2.45 14.6 L1.0 14.75 0.75 14.75 0.75 14.45 Q0.75 12.15 3.7 12.15 L4.4 12.25 4.3 12.5 4.55 12.75 5.0 12.45 5.5 12.65 M-3.7 5.4 L-3.15 4.8 Q-2.1 3.75 -0.75 3.35 L-0.1 3.2 0.25 3.7 0.3 4.05 0.3 4.35 0.1 4.25 -0.45 4.2 Q-1.55 4.25 -1.55 5.25 L-1.3 5.7 -1.6 5.85 -1.65 5.7 Q-1.65 5.0 -2.1 5.05 -2.6 5.1 -2.6 5.5 L-2.55 5.9 -3.15 5.7 -3.7 5.4 M-2.05 6.4 L-2.1 6.4 -2.1 6.35 -2.05 6.35 -2.05 6.4 M3.35 13.85 Q4.0 13.45 4.0 13.05 L3.95 12.9 3.15 13.1 2.45 13.4 2.4 13.4 1.4 13.35 Q1.0 13.35 1.0 13.8 0.95 14.35 1.45 14.35 L2.45 14.25 3.35 13.85" fill="#ff8121" fill-rule="evenodd" stroke="none"/>
    <path d="M6.8 8.1 L6.85 8.9 6.65 10.35 6.5 10.7 5.8 11.35 5.6 11.1 4.9 11.65 4.65 11.65 3.55 11.3 2.45 10.95 2.3 10.95 Q1.4 10.95 0.7 11.4 -0.05 11.9 -0.05 12.85 -0.05 13.8 0.4 14.6 L0.55 14.75 0.3 14.7 -0.55 14.6 -1.15 13.9 -1.6 13.3 -1.6 13.05 Q-1.6 11.2 -0.05 10.5 0.7 10.15 2.45 9.95 L3.2 9.9 Q5.0 9.75 6.15 8.8 L6.8 8.1 M-4.7 10.45 L-4.85 8.9 Q-4.85 7.5 -4.3 6.35 L-4.1 6.45 -3.15 6.45 -2.1 6.4 -2.05 6.4 -0.85 6.05 -0.4 6.05 Q0.15 6.05 0.45 5.65 L0.7 5.0 Q0.7 4.5 0.3 4.35 L0.3 4.05 0.25 3.7 -0.1 3.2 0.2 3.15 0.35 3.15 Q1.45 3.35 1.45 4.8 1.45 6.0 -1.6 7.35 L-2.05 7.6 Q-2.1 6.75 -3.0 6.75 -3.95 6.8 -3.95 7.6 L-3.4 8.4 Q-4.55 9.35 -4.7 10.45" fill="#d41b1b" fill-rule="evenodd" stroke="none"/>
    <path d="M-1.3 5.7 L-1.55 5.25 Q-1.55 4.25 -0.45 4.2 L0.1 4.25 0.3 4.35 Q0.7 4.5 0.7 5.0 L0.45 5.65 Q0.15 6.05 -0.4 6.05 L-0.85 6.05 -1.3 5.7 M4.4 12.25 L4.75 11.8 4.9 11.65 5.6 11.1 5.8 11.35 5.8 11.4 5.3 12.15 5.0 12.45 4.55 12.75 4.3 12.5 4.4 12.25 M3.35 13.85 L2.45 14.25 1.45 14.35 Q0.95 14.35 1.0 13.8 1.0 13.35 1.4 13.35 L2.4 13.4 2.45 13.4 3.15 13.1 3.95 12.9 4.0 13.05 Q4.0 13.45 3.35 13.85 M-2.55 5.9 L-2.6 5.5 Q-2.6 5.1 -2.1 5.05 -1.65 5.0 -1.65 5.7 L-1.6 5.85 Q-1.6 6.35 -2.05 6.35 L-2.1 6.35 -2.55 5.9" fill="#ffb521" fill-rule="evenodd" stroke="none"/>
    <path d="M6.55 10.7 L5.5 12.65 5.0 12.45 5.3 12.15 5.8 11.4 5.8 11.35 6.5 10.7 6.55 10.7 M0.75 14.75 L0.55 14.75 0.4 14.6 Q-0.05 13.8 -0.05 12.85 -0.05 11.9 0.7 11.4 1.4 10.95 2.3 10.95 L2.45 10.95 3.55 11.3 4.65 11.65 4.9 11.65 4.75 11.8 4.4 12.25 3.7 12.15 Q0.75 12.15 0.75 14.45 L0.75 14.75 M-4.3 6.35 L-3.7 5.4 -3.15 5.7 -2.55 5.9 -2.1 6.35 -2.1 6.4 -3.15 6.45 -4.1 6.45 -4.3 6.35 M-0.85 6.05 L-2.05 6.4 -2.05 6.35 Q-1.6 6.35 -1.6 5.85 L-1.3 5.7 -0.85 6.05 M-2.05 7.6 Q-2.05 8.55 -2.9 8.55 L-3.4 8.4 -3.95 7.6 Q-3.95 6.8 -3.0 6.75 -2.1 6.75 -2.05 7.6" fill="#eb5e1e" fill-rule="evenodd" stroke="none"/>
    <path d="M6.65 10.35 L6.55 10.7 6.5 10.7 6.65 10.35" fill="#6ee624" fill-rule="evenodd" stroke="none"/>
  </g>
</svg>
