<?xml version="1.0" encoding="UTF-8" standalone="no"?>
<svg xmlns:xlink="http://www.w3.org/1999/xlink" height="33.25px" width="45.95px" xmlns="http://www.w3.org/2000/svg">
  <g transform="matrix(1.0, 0.0, 0.0, 1.0, 22.95, 16.6)">
    <path d="M2.35 -15.0 Q3.55 -13.9 3.55 -12.35 L3.5 -11.65 4.1 -11.6 Q6.35 -11.45 8.5 -10.6 L8.55 -10.6 9.85 -9.95 9.9 -9.95 9.95 -9.9 10.55 -9.6 10.65 -9.55 11.35 -9.25 Q14.0 -7.95 16.2 -5.4 L16.25 -5.35 16.3 -5.3 17.6 -3.7 17.65 -3.65 18.6 -2.0 17.5 -8.45 17.45 -8.6 17.45 -8.7 Q17.2 -9.4 16.35 -10.1 L16.2 -10.2 Q15.15 -11.05 14.8 -11.95 14.5 -12.6 14.5 -13.35 14.5 -15.4 16.1 -15.25 L16.75 -15.1 17.75 -14.55 Q18.2 -15.65 18.85 -16.1 19.5 -16.6 20.2 -16.6 21.4 -16.75 22.3 -15.05 L22.35 -15.0 Q23.05 -13.85 23.0 -12.95 L23.0 -12.7 23.0 -12.5 22.15 -10.35 22.1 -10.3 Q21.55 -9.35 21.6 -8.4 L22.15 -0.1 22.05 0.45 21.75 0.95 21.45 1.5 20.75 1.8 20.15 1.8 20.1 2.25 19.65 2.75 18.95 3.1 Q19.55 3.5 19.8 4.0 L19.95 4.55 19.75 5.1 19.3 5.45 Q14.0 7.35 10.15 8.95 L10.1 9.0 9.0 9.5 8.95 9.55 7.1 10.35 0.3 13.35 -3.95 15.15 -4.6 15.25 -5.15 14.9 -6.25 14.0 -6.25 14.05 -6.55 13.85 -7.55 14.15 -9.35 14.7 -9.7 14.7 -10.35 14.8 -11.0 14.65 -11.45 14.15 Q-12.55 11.1 -12.65 7.6 L-12.65 7.55 -12.65 5.8 -12.6 5.3 -12.35 3.35 -12.4 3.4 Q-11.9 0.25 -10.6 -2.45 L-10.55 -2.5 -10.3 -2.95 -10.0 -3.45 -8.3 -5.9 -8.2 -6.0 -8.1 -6.2 -6.7 -7.6 -6.75 -7.6 -6.15 -8.15 -6.45 -8.45 -6.5 -8.5 -6.75 -8.9 -6.9 -9.1 -6.95 -9.2 -7.35 -10.55 -7.4 -10.75 -7.4 -11.05 Q-7.4 -12.0 -6.85 -12.9 L-6.8 -12.95 Q-6.25 -13.85 -4.9 -14.7 -2.8 -16.05 -0.4 -16.05 L0.55 -15.9 1.25 -15.65 2.3 -15.0 2.35 -15.0 M-18.75 -2.9 Q-17.8 -4.15 -16.9 -4.05 -15.9 -4.1 -15.1 -3.2 L-14.95 -2.95 -14.85 -2.85 -14.7 -2.65 -14.65 -2.6 Q-14.25 -1.9 -14.2 -1.0 L-14.2 -0.95 -14.2 -0.7 -14.2 -0.55 Q-14.3 0.25 -15.1 2.65 L-12.5 14.8 -12.5 15.2 -12.65 15.6 -13.1 16.25 Q-13.3 16.5 -13.65 16.6 L-14.3 16.6 Q-14.95 16.3 -15.2 15.8 L-15.25 15.7 -19.1 4.5 -19.25 4.1 -19.65 2.85 -19.95 2.55 -20.0 2.55 -20.1 2.5 -20.7 2.15 -20.65 2.15 Q-22.9 1.1 -22.95 -0.7 L-22.95 -0.8 -22.75 -1.55 -22.35 -2.15 Q-21.55 -3.2 -20.75 -3.1 L-20.7 -3.1 -20.0 -3.0 -19.2 -2.65 -19.05 -2.55 -19.0 -2.6 -18.85 -2.8 -18.75 -2.9" fill="#ffffff" fill-rule="evenodd" stroke="none"/>
  </g>
</svg>
