<?xml version="1.0" encoding="UTF-8" standalone="no"?>
<svg xmlns:xlink="http://www.w3.org/1999/xlink" height="222.85px" width="515.65px" xmlns="http://www.w3.org/2000/svg">
  <g transform="matrix(1.0, 0.0, 0.0, 1.0, 261.8, 168.6)">
    <path d="M-71.2 31.9 L-261.8 -168.6 253.85 -168.6 90.6 37.1 45.8 54.25 -60.6 48.85 -71.2 31.9" fill="#66ff00" fill-rule="evenodd" stroke="none"/>
  </g>
</svg>
