<?xml version="1.0" encoding="UTF-8" standalone="no"?>
<svg xmlns:xlink="http://www.w3.org/1999/xlink" height="200.0px" width="245.85px" xmlns="http://www.w3.org/2000/svg">
  <g transform="matrix(1.0, 0.0, 0.0, 1.0, -69.75, -109.75)">
    <path d="M290.7 302.1 L155.2 302.1 151.85 300.7 Q167.5 275.1 176.55 254.95 185.85 234.35 190.85 213.25 195.25 194.75 196.5 190.15 200.45 175.8 205.0 166.15 217.35 139.65 237.9 139.65 257.9 139.65 267.1 162.45 273.5 178.3 273.5 199.8 273.5 206.75 271.55 212.95 269.6 219.1 269.6 220.9 269.6 222.3 272.45 227.85 L266.85 230.4 Q258.25 234.05 254.95 234.2 256.55 235.45 258.9 239.6 L262.3 245.75 Q263.4 247.6 268.45 251.35 L273.15 255.15 Q273.15 256.0 272.75 256.55 L271.35 257.9 Q275.45 257.9 277.45 261.0 L276.15 262.8 274.45 265.2 Q275.2 265.9 277.35 266.05 279.35 266.15 280.45 267.6 274.0 274.95 271.95 276.15 L271.95 276.75 276.25 276.75 276.25 279.15 278.65 279.15 Q278.65 279.8 277.95 280.9 277.2 282.15 276.25 282.8 282.1 284.45 289.1 298.7 L290.7 302.1" fill="#0f1012" fill-rule="evenodd" stroke="none"/>
    <path d="M272.45 227.85 L272.8 228.5 Q276.0 234.65 276.0 240.0 276.0 245.0 278.6 249.6 281.15 254.2 281.15 256.4 281.15 259.15 286.85 271.75 292.55 284.3 292.55 290.6 292.55 297.05 291.25 302.1 L290.7 302.1 289.1 298.7 Q282.1 284.45 276.25 282.8 277.2 282.15 277.95 280.9 278.65 279.8 278.65 279.15 L276.25 279.15 276.25 276.75 271.95 276.75 271.95 276.15 Q274.0 274.95 280.45 267.6 279.35 266.15 277.35 266.05 275.2 265.9 274.45 265.2 L276.15 262.8 277.45 261.0 Q275.45 257.9 271.35 257.9 L272.75 256.55 Q273.15 256.0 273.15 255.15 L268.45 251.35 Q263.4 247.6 262.3 245.75 L258.9 239.6 Q256.55 235.45 254.95 234.2 258.25 234.05 266.85 230.4 L272.45 227.85" fill="#1e2024" fill-rule="evenodd" stroke="none"/>
    <path d="M143.4 221.5 L146.7 221.25 170.15 219.2 175.45 218.75 182.95 218.05 186.85 217.65 205.5 215.05 Q213.8 214.3 220.0 212.75 L220.8 212.5 222.05 212.25 224.6 212.4 227.1 213.1 228.9 213.8 228.1 215.9 227.15 218.05 Q222.35 228.4 212.6 236.55 L208.15 239.95 205.3 241.9 Q188.9 252.4 170.0 252.4 L161.65 251.8 159.1 251.25 156.45 250.35 Q151.85 248.45 148.9 243.95 L147.7 241.9 Q145.9 238.6 143.55 232.7 L140.85 226.05 Q142.2 222.9 143.4 221.5" fill="#ab8831" fill-rule="evenodd" stroke="none"/>
    <path d="M143.4 221.5 Q142.2 222.9 140.85 226.05 L138.95 230.8 135.15 241.9 134.4 244.2 Q132.45 243.05 130.85 241.9 L127.45 239.3 128.15 237.7 130.5 239.9 Q130.5 239.3 130.9 239.3 131.75 234.7 133.5 230.8 134.95 227.4 138.8 220.85 L138.9 220.9 139.85 221.15 141.6 221.65 143.4 221.5" fill="#e8b943" fill-rule="evenodd" stroke="none"/>
    <path d="M128.15 237.7 L129.95 233.4 132.5 227.8 Q136.05 220.65 137.8 220.65 L137.95 220.7 138.65 220.85 138.8 220.85 Q134.95 227.4 133.5 230.8 131.75 234.7 130.9 239.3 130.5 239.3 130.5 239.9 L128.15 237.7" fill="#decb40" fill-rule="evenodd" stroke="none"/>
    <path d="M140.85 226.05 L143.55 232.7 Q145.9 238.6 147.7 241.9 L148.9 243.95 Q151.85 248.45 156.45 250.35 L159.1 251.25 159.25 252.35 158.6 252.45 Q150.45 252.45 139.35 246.85 L134.4 244.2 135.15 241.9 138.95 230.8 140.85 226.05" fill="#d4a93d" fill-rule="evenodd" stroke="none"/>
    <path d="M161.65 251.8 L170.0 252.4 Q188.9 252.4 205.3 241.9 L208.15 239.95 212.6 236.55 215.65 241.9 216.75 243.9 220.95 241.9 Q232.0 236.4 241.55 228.1 L241.7 228.3 236.4 233.65 232.95 236.5 Q229.2 239.4 224.85 241.9 221.45 243.85 217.65 245.6 L215.1 246.7 Q195.9 254.75 173.35 254.75 L158.8 253.8 Q150.7 252.7 143.45 250.25 139.0 248.75 133.75 246.25 L130.1 244.5 128.55 243.7 128.1 241.9 127.95 241.35 127.45 239.35 127.45 239.3 130.85 241.9 Q132.45 243.05 134.4 244.2 L139.35 246.85 Q150.45 252.45 158.6 252.45 L159.25 252.35 161.65 251.8" fill="#bd9736" fill-rule="evenodd" stroke="none"/>
    <path d="M123.35 247.8 L123.25 246.85 123.45 245.65 125.3 246.3 Q126.5 246.3 126.7 244.35 L126.9 242.85 128.55 243.7 130.1 244.5 130.5 250.4 128.85 250.0 125.9 248.95 Q124.3 248.35 123.35 247.8 M124.65 241.9 L124.75 241.65 124.8 241.7 124.65 241.9" fill="#5e9476" fill-rule="evenodd" stroke="none"/>
    <path d="M123.45 245.65 Q123.8 244.3 124.65 241.9 L124.8 241.7 125.25 241.9 126.2 242.45 126.9 242.85 126.7 244.35 Q126.5 246.3 125.3 246.3 L123.45 245.65" fill="#6ead89" fill-rule="evenodd" stroke="none"/>
    <path d="M241.7 228.3 L242.15 227.8 242.35 227.55 242.65 227.8 242.95 228.4 Q245.9 234.6 247.15 241.55 L247.0 241.9 246.9 242.0 242.95 244.75 Q239.6 246.8 235.8 248.35 231.85 249.95 221.0 252.8 L219.3 249.15 217.65 245.6 Q221.45 243.85 224.85 241.9 229.2 239.4 232.95 236.5 L236.4 233.65 241.7 228.3 M124.5 250.1 L124.35 250.05 124.0 249.4 Q123.5 248.65 123.35 247.8 124.3 248.35 125.9 248.95 L128.85 250.0 130.5 250.4 130.1 244.5 133.75 246.25 Q139.0 248.75 143.45 250.25 150.7 252.7 158.8 253.8 L157.85 254.8 157.45 255.2 156.8 255.15 148.2 255.15 143.25 255.4 135.3 253.55 130.7 252.25 129.45 251.85 126.55 250.85 124.5 250.1" fill="#55856a" fill-rule="evenodd" stroke="none"/>
    <path d="M248.1 250.95 L248.2 250.75 Q248.85 249.8 249.85 249.0 251.3 247.9 251.3 249.65 251.3 250.55 249.3 253.1 L249.3 253.15 252.75 252.75 Q254.0 252.75 254.35 253.1 L254.45 253.4 254.6 253.45 254.6 253.8 Q254.6 254.6 252.05 255.65 L251.15 256.3 250.95 256.6 Q250.8 257.05 250.15 257.05 249.0 257.05 248.25 256.55 L247.2 255.65 246.25 254.9 245.95 254.4 Q245.95 253.95 248.1 250.95 M251.8 257.25 L252.4 256.95 Q253.95 256.2 253.95 257.65 253.95 258.25 253.15 258.9 L252.95 259.05 Q252.35 259.55 251.95 259.55 251.3 259.55 251.05 259.15 L251.0 259.15 Q250.75 259.5 250.05 259.5 249.3 259.5 249.15 258.85 L249.15 258.3 Q249.15 257.05 250.25 257.35 250.85 257.5 251.05 257.9 251.3 257.55 251.8 257.25 M253.3 259.6 L253.85 260.35 253.85 260.45 253.9 260.4 Q254.25 259.7 255.55 259.15 257.35 258.35 257.35 260.0 257.35 260.5 256.5 261.3 255.6 262.15 255.05 262.15 253.8 262.15 253.7 261.15 L253.2 261.65 Q252.5 262.15 251.55 262.15 250.8 262.15 250.8 261.15 250.8 260.1 252.35 259.65 L253.3 259.6 M256.4 264.15 L256.6 264.4 Q257.15 264.0 258.25 263.75 260.5 263.2 260.5 265.05 L260.05 266.1 Q259.45 266.9 258.8 266.9 L258.25 266.9 Q257.45 266.75 256.75 266.4 L256.1 265.9 254.7 266.1 Q254.0 266.1 253.75 265.5 L253.7 265.05 Q253.7 263.85 255.25 263.85 256.0 263.85 256.4 264.15 M259.1 268.15 L259.2 268.15 Q260.35 268.05 260.35 269.25 L260.25 269.75 259.9 270.0 259.05 270.25 258.35 270.0 Q258.0 269.7 258.0 269.25 258.0 268.3 259.1 268.15 M110.75 272.35 L112.3 270.35 Q111.5 269.95 111.5 269.3 L111.6 268.7 111.95 268.4 113.3 268.35 Q113.3 268.0 113.45 267.75 113.8 267.3 114.7 267.25 L114.8 267.15 113.85 266.3 113.4 265.75 Q113.4 265.0 114.5 264.75 115.6 264.5 115.55 264.1 115.55 263.65 116.0 263.5 L115.35 262.7 114.9 262.05 Q114.9 261.65 115.2 261.35 115.5 261.1 115.95 261.1 116.5 261.1 118.1 262.0 L118.6 261.9 117.4 260.55 Q116.95 260.15 116.95 259.55 116.95 258.55 118.0 258.55 118.75 258.55 119.45 259.0 L120.75 259.4 121.0 259.05 120.35 257.4 119.65 255.5 Q119.65 253.05 121.8 255.35 L122.85 256.65 124.0 255.15 124.95 255.5 131.55 257.55 130.55 260.1 129.85 259.25 Q127.55 256.75 127.55 259.05 L128.2 260.9 128.8 262.75 128.75 263.1 128.15 263.25 125.1 262.9 Q124.15 262.85 124.15 263.9 L125.15 264.85 Q126.15 265.55 126.15 265.8 L126.1 266.15 125.35 265.75 124.6 265.5 Q123.75 265.5 123.55 266.25 L123.45 267.35 123.55 268.4 122.8 269.1 Q122.55 269.25 122.55 269.55 122.55 270.0 123.15 270.9 122.3 270.7 121.55 271.8 L120.95 272.95 121.8 274.75 120.3 277.0 118.0 276.15 113.7 274.35 110.45 272.8 110.75 272.35 M119.7 267.85 Q118.8 267.85 118.8 269.4 L118.9 270.2 Q119.0 271.0 119.65 271.0 120.3 271.0 120.5 270.5 L120.6 269.4 Q120.6 267.85 119.7 267.85 M117.85 273.35 Q119.15 273.35 119.15 272.4 119.15 271.65 117.95 271.5 116.75 271.3 116.75 272.4 116.75 273.35 117.85 273.35 M130.95 264.25 Q130.8 264.55 130.25 264.55 L129.7 264.45 129.35 264.25 129.25 263.5 Q129.25 262.25 130.2 262.5 131.05 262.75 131.05 263.65 L130.95 264.25 M123.65 264.85 L123.9 264.15 Q123.9 263.25 122.8 263.1 121.7 262.9 121.7 264.0 L122.05 264.65 123.05 265.3 123.65 264.85 M129.85 270.0 Q129.85 271.1 128.9 271.1 128.2 271.1 127.7 270.0 L127.3 269.0 Q127.3 266.85 128.55 267.5 129.85 268.1 129.85 270.0 M127.1 270.9 Q128.4 271.55 128.4 272.4 128.4 273.35 127.45 273.35 126.5 273.35 126.05 272.4 L125.75 271.6 Q125.75 270.25 127.1 270.9 M133.45 262.15 L133.25 261.65 Q133.25 260.65 134.3 260.75 135.35 260.9 135.35 261.8 135.35 262.75 134.5 262.75 133.85 262.75 133.45 262.15 M241.65 253.15 L241.5 252.7 Q241.5 251.65 242.6 251.8 L242.95 251.9 243.4 252.3 243.6 253.05 243.6 253.7 244.05 252.0 244.1 251.6 Q244.35 250.25 245.35 250.45 L246.1 250.85 Q246.4 251.1 246.4 251.65 L245.95 253.75 245.15 254.45 244.25 255.25 243.5 254.7 243.45 254.55 242.95 254.75 242.8 254.75 Q242.55 254.75 242.0 253.8 L241.65 253.15 M245.25 257.0 Q245.25 256.05 246.4 256.1 247.5 256.2 247.5 257.0 247.5 258.0 246.4 258.0 245.65 258.0 245.4 257.5 L245.25 257.0 M255.2 270.25 L254.45 270.1 Q254.25 270.0 254.25 269.4 254.25 268.25 255.6 267.55 256.95 266.85 256.95 268.35 L256.5 269.45 Q255.9 270.25 255.2 270.25" fill="#7288a7" fill-rule="evenodd" stroke="none"/>
    <path d="M247.9 250.15 L248.1 250.95 Q245.95 253.95 245.95 254.4 L246.25 254.9 247.2 255.65 248.25 256.55 Q249.0 257.05 250.15 257.05 250.8 257.05 250.95 256.6 L251.15 256.3 251.8 257.25 Q251.3 257.55 251.05 257.9 250.85 257.5 250.25 257.35 249.15 257.05 249.15 258.3 L249.15 258.85 Q249.3 259.5 250.05 259.5 250.75 259.5 251.0 259.15 L251.05 259.15 Q251.3 259.55 251.95 259.55 252.35 259.55 252.95 259.05 L253.3 259.6 252.35 259.65 Q250.8 260.1 250.8 261.15 250.8 262.15 251.55 262.15 252.5 262.15 253.2 261.65 L253.7 261.15 Q253.8 262.15 255.05 262.15 L256.4 264.15 Q256.0 263.85 255.25 263.85 253.7 263.85 253.7 265.05 L253.75 265.5 Q254.0 266.1 254.7 266.1 L256.1 265.9 256.75 266.4 Q257.45 266.75 258.25 266.9 L259.1 268.15 Q258.0 268.3 258.0 269.25 258.0 269.7 258.35 270.0 L259.05 270.25 259.9 270.0 260.25 269.75 260.75 270.5 261.4 271.35 Q255.5 276.35 246.6 279.45 L242.95 280.6 236.55 282.1 232.6 282.85 232.3 281.4 232.35 281.4 Q232.95 281.4 233.55 280.9 L234.1 280.05 Q234.1 278.5 232.7 278.8 232.15 278.9 231.85 279.15 L231.8 278.85 231.6 277.75 Q232.55 277.6 233.0 276.9 233.35 276.3 233.35 275.1 233.35 273.2 231.8 273.8 L231.8 273.65 Q231.8 272.0 230.3 272.3 L230.15 271.65 231.65 270.65 Q232.6 269.65 232.6 268.75 232.6 266.8 229.8 267.75 L229.1 268.0 229.1 267.95 228.8 268.1 228.5 268.25 228.35 268.25 Q227.8 268.25 227.4 267.6 L227.15 266.85 Q227.15 266.05 228.25 265.6 L227.2 263.3 227.65 262.65 Q228.05 261.9 228.05 261.05 228.05 259.25 226.15 260.25 L225.6 260.6 224.7 259.15 Q233.45 256.95 241.65 253.15 L242.0 253.8 Q242.55 254.75 242.8 254.75 L242.95 254.75 243.45 254.55 243.5 254.7 244.25 255.25 245.15 254.45 245.95 253.75 246.4 251.65 Q246.4 251.1 246.1 250.85 L247.9 250.15 M253.85 260.35 L253.9 260.4 253.85 260.45 253.85 260.35 M119.7 267.85 Q120.6 267.85 120.6 269.4 L120.5 270.5 Q120.3 271.0 119.65 271.0 119.0 271.0 118.9 270.2 L118.8 269.4 Q118.8 267.85 119.7 267.85 M120.3 277.0 L121.8 274.75 120.95 272.95 121.55 271.8 Q122.3 270.7 123.15 270.9 122.55 270.0 122.55 269.55 122.55 269.25 122.8 269.1 L123.55 268.4 123.45 267.35 123.55 266.25 Q123.75 265.5 124.6 265.5 L125.35 265.75 126.1 266.15 126.15 265.8 Q126.15 265.55 125.15 264.85 L124.15 263.9 Q124.15 262.85 125.1 262.9 L128.15 263.25 128.75 263.1 128.8 262.75 128.2 260.9 127.55 259.05 Q127.55 256.75 129.85 259.25 L130.55 260.1 131.55 257.55 133.75 258.15 Q143.6 260.75 153.9 261.6 L155.75 261.8 155.6 262.8 154.7 262.35 Q152.55 261.5 152.55 263.1 L152.95 263.9 153.35 264.65 153.15 265.9 152.5 267.25 150.65 268.1 Q149.55 268.55 149.55 269.25 149.55 270.1 149.85 270.35 150.65 271.0 153.0 271.2 L152.4 273.2 152.1 273.1 Q150.0 272.5 150.0 273.8 L150.7 275.8 151.2 276.85 150.95 277.8 150.35 277.55 Q148.5 276.9 148.5 278.25 L149.1 279.25 150.15 280.15 150.0 280.55 149.5 280.4 Q148.55 280.25 148.55 281.25 L148.75 281.75 149.3 282.2 148.65 283.65 Q136.25 281.95 126.15 278.9 L123.15 278.0 120.3 277.0 M117.85 273.35 Q116.75 273.35 116.75 272.4 116.75 271.3 117.95 271.5 119.15 271.65 119.15 272.4 119.15 273.35 117.85 273.35 M147.6 267.1 Q148.0 267.9 148.75 267.9 L149.45 267.6 149.75 266.8 Q149.75 265.8 148.6 265.6 147.35 265.4 147.35 266.4 L147.6 267.1 M144.75 271.45 Q143.05 270.3 143.05 272.1 L143.45 273.5 Q144.05 274.8 145.25 274.8 145.7 274.8 146.05 274.4 146.45 274.0 146.45 273.35 146.45 272.65 144.75 271.45 M156.3 268.75 Q156.3 267.05 157.7 267.85 159.05 268.65 159.05 269.75 L158.95 270.5 158.1 270.65 Q157.1 270.65 156.65 269.75 156.3 269.15 156.3 268.75 M160.0 267.6 Q159.1 267.6 159.1 266.8 159.1 265.75 160.15 265.85 161.15 265.95 161.15 266.7 161.15 267.6 160.0 267.6 M130.95 264.25 L131.05 263.65 Q131.05 262.75 130.2 262.5 129.25 262.25 129.25 263.5 L129.35 264.25 129.7 264.45 130.25 264.55 Q130.8 264.55 130.95 264.25 M123.65 264.85 L123.05 265.3 122.05 264.65 121.7 264.0 Q121.7 262.9 122.8 263.1 123.9 263.25 123.9 264.15 L123.65 264.85 M133.45 262.15 Q133.85 262.75 134.5 262.75 135.35 262.75 135.35 261.8 135.35 260.9 134.3 260.75 133.25 260.65 133.25 261.65 L133.45 262.15 M127.1 270.9 Q125.75 270.25 125.75 271.6 L126.05 272.4 Q126.5 273.35 127.45 273.35 128.4 273.35 128.4 272.4 128.4 271.55 127.1 270.9 M129.85 270.0 Q129.85 268.1 128.55 267.5 127.3 266.85 127.3 269.0 L127.7 270.0 Q128.2 271.1 128.9 271.1 129.85 271.1 129.85 270.0 M243.4 252.3 L244.05 252.0 243.6 253.7 243.6 253.05 243.4 252.3 M156.85 275.55 L156.8 275.55 Q156.75 275.85 156.15 275.85 L155.55 275.4 155.4 275.05 Q155.4 274.25 156.2 274.25 156.9 274.25 156.9 275.25 L156.85 275.55 M143.65 279.45 Q144.25 280.25 145.65 280.25 146.7 280.25 147.15 279.45 L147.4 278.3 Q147.4 275.75 145.4 276.25 143.4 276.8 143.4 278.55 L143.65 279.45 M147.95 274.35 Q149.0 274.35 149.0 273.35 149.0 272.0 147.9 272.15 146.85 272.3 146.85 273.4 L147.05 273.9 Q147.3 274.35 147.95 274.35 M245.25 257.0 L245.4 257.5 Q245.65 258.0 246.4 258.0 247.5 258.0 247.5 257.0 247.5 256.2 246.4 256.1 245.25 256.05 245.25 257.0 M245.75 271.05 Q245.75 269.85 244.2 270.1 243.35 270.25 242.95 270.55 242.6 270.85 242.6 271.25 L242.75 271.75 242.95 272.0 244.15 272.25 Q245.75 272.25 245.75 271.05 M255.2 270.25 Q255.9 270.25 256.5 269.45 L256.95 268.35 Q256.95 266.85 255.6 267.55 254.25 268.25 254.25 269.4 254.25 270.0 254.45 270.1 L255.2 270.25 M243.15 276.85 L243.95 276.6 Q244.3 276.35 244.3 275.9 244.3 274.75 243.2 274.75 L242.95 274.75 Q242.05 274.8 242.05 275.65 L242.15 276.25 Q242.4 276.75 242.95 276.85 L243.15 276.85 M232.65 263.6 Q230.8 264.15 230.8 265.15 L231.05 265.85 Q231.4 266.5 232.05 266.5 233.15 266.5 233.85 266.05 234.45 265.65 234.45 265.0 234.45 263.05 232.65 263.6 M228.85 262.0 L228.95 262.55 Q229.2 263.05 230.0 263.05 230.85 263.05 231.9 262.25 232.85 261.5 232.85 260.9 232.85 259.3 230.85 260.05 228.85 260.8 228.85 262.0 M224.15 265.75 Q224.15 266.45 223.0 266.75 222.05 266.75 221.85 266.1 L221.8 265.5 Q221.8 264.45 222.95 264.45 224.15 264.5 224.15 265.75 M224.4 269.8 Q224.4 268.55 225.7 267.85 226.95 267.15 226.95 268.55 226.95 269.25 226.4 270.0 L225.25 270.85 224.5 270.35 224.4 269.8 M236.25 271.5 Q236.25 270.2 235.15 269.95 233.95 269.7 233.95 271.5 L234.05 272.6 Q234.25 273.25 234.95 273.25 L235.8 272.6 236.25 271.5 M234.25 262.8 Q234.9 262.8 235.45 262.35 L235.95 261.4 Q235.95 260.25 234.65 260.55 233.35 260.9 233.35 261.8 233.35 262.8 234.25 262.8 M239.45 262.5 Q239.45 260.95 238.4 261.25 237.4 261.55 237.4 262.6 L237.45 263.15 Q237.7 263.65 238.35 263.65 238.7 263.65 239.1 263.25 L239.45 262.5 M242.95 265.0 Q242.6 264.9 241.95 265.25 240.55 266.1 240.55 268.05 L240.55 269.15 Q240.7 270.15 241.45 270.15 242.15 270.15 242.85 268.35 L242.95 268.1 243.35 266.05 Q243.35 265.15 242.95 265.0 M220.55 278.0 Q220.0 278.65 218.9 278.55 L218.4 277.9 Q218.4 277.0 219.7 276.3 220.95 275.6 220.95 276.9 220.95 277.55 220.55 278.0 M239.6 281.0 L240.45 280.5 240.65 279.8 Q240.65 278.8 239.6 278.85 238.5 278.9 238.5 279.8 L238.7 280.45 Q239.0 281.0 239.6 281.0 M239.2 273.3 L239.6 273.75 Q240.35 273.8 240.7 273.35 L240.9 272.75 Q240.9 272.0 239.95 272.0 239.0 272.05 239.0 272.9 L239.2 273.3 M237.95 277.25 L238.35 276.15 Q238.35 274.6 236.95 275.0 235.55 275.4 235.55 276.9 L235.6 277.5 Q235.8 278.05 236.5 278.05 237.4 278.05 237.95 277.25 M226.5 274.35 L226.2 273.65 Q226.2 272.65 227.3 272.75 228.35 272.85 228.35 273.9 228.35 275.05 227.7 275.05 227.0 275.05 226.5 274.35 M226.45 280.5 L225.95 280.65 Q225.15 280.65 224.75 280.0 L224.5 279.3 224.95 278.45 Q225.55 277.75 226.05 278.15 L226.55 280.05 226.45 280.5" fill="#667894" fill-rule="evenodd" stroke="none"/>
    <path d="M260.75 270.5 L263.15 270.95 261.9 272.05 Q257.4 275.85 251.1 278.6 247.35 280.2 242.95 281.45 L236.85 282.85 232.75 283.6 Q215.1 286.4 181.3 286.4 163.2 286.4 148.25 284.4 135.75 282.75 125.4 279.65 L120.1 277.95 119.75 277.8 117.7 277.05 113.25 275.25 109.75 273.65 108.65 273.1 108.15 272.8 110.75 272.35 110.45 272.8 113.7 274.35 118.0 276.15 120.3 277.0 123.15 278.0 126.15 278.9 Q136.25 281.95 148.65 283.65 163.5 285.65 181.5 285.65 194.45 285.65 205.05 285.25 L205.35 285.25 205.7 285.2 Q222.05 284.55 232.6 282.85 L236.55 282.1 242.95 280.6 246.6 279.45 Q255.5 276.35 261.4 271.35 L260.75 270.5" fill="#c45c5c" fill-rule="evenodd" stroke="none"/>
    <path d="M243.1 247.2 L244.8 246.25 Q245.45 245.85 246.95 245.35 L247.8 249.6 247.9 250.1 247.9 250.15 246.1 250.85 245.35 250.45 Q244.35 250.25 244.1 251.6 L244.05 252.0 243.4 252.3 242.95 251.9 242.6 251.8 Q241.5 251.65 241.5 252.7 L241.65 253.15 Q233.45 256.95 224.7 259.15 L222.55 255.45 222.25 254.95 Q231.25 252.8 239.7 248.9 L242.95 247.3 243.1 247.2 M263.15 270.95 Q264.1 271.1 265.5 276.85 L261.95 280.4 Q256.2 285.2 247.6 288.25 L245.7 288.25 242.95 289.05 234.4 291.0 232.75 283.6 236.85 282.85 242.95 281.45 Q247.35 280.2 251.1 278.6 257.4 275.85 261.9 272.05 L263.15 270.95 M117.7 277.05 L119.75 277.8 120.1 277.95 125.4 279.65 Q135.75 282.75 148.25 284.4 L144.35 292.3 144.2 292.6 142.0 292.3 135.25 291.15 Q129.4 290.0 124.5 288.25 L125.4 288.25 126.4 288.25 125.4 287.95 121.65 286.75 115.5 284.5 117.7 277.05 M143.25 255.4 L154.8 256.95 156.2 257.1 156.2 257.15 155.95 260.15 155.75 261.8 153.9 261.6 Q143.6 260.75 133.75 258.15 L134.25 255.95 Q134.7 254.5 135.3 253.55 L143.25 255.4" fill="#9c4949" fill-rule="evenodd" stroke="none"/>
    <path d="M109.95 282.05 L108.65 281.4 105.25 279.55 106.3 277.1 111.05 279.0 112.45 276.75 113.25 275.25 117.7 277.05 115.5 284.5 109.95 282.05 M124.0 255.15 L123.7 253.05 127.1 254.25 129.0 254.25 129.3 252.65 129.45 251.85 130.7 252.25 135.3 253.55 Q134.7 254.5 134.25 255.95 L133.75 258.15 131.55 257.55 124.95 255.5 124.0 255.15" fill="#b05252" fill-rule="evenodd" stroke="none"/>
    <path d="M106.3 277.1 L108.15 272.8 108.65 273.1 109.75 273.65 113.25 275.25 112.45 276.75 111.05 279.0 106.3 277.1 M123.7 253.05 L123.35 250.45 123.55 250.4 124.5 250.1 126.55 250.85 129.45 251.85 129.3 252.65 129.0 254.25 127.1 254.25 123.7 253.05" fill="#cf6161" fill-rule="evenodd" stroke="none"/>
    <path d="M100.4 294.0 L102.5 291.3 108.65 283.65 108.7 283.6 Q111.9 285.3 116.65 287.3 115.35 288.8 112.95 292.75 110.3 296.9 109.5 298.65 L102.95 295.35 100.4 294.0" fill="#5f8571" fill-rule="evenodd" stroke="none"/>
    <path d="M261.95 280.4 L264.75 286.0 Q254.9 289.45 242.95 292.05 L242.55 292.1 241.6 292.3 235.25 293.6 239.0 304.7 235.6 304.65 183.5 307.2 137.05 309.7 Q139.65 302.45 142.45 296.2 136.5 294.6 129.95 292.3 L126.95 291.25 120.6 288.85 116.65 287.3 Q111.9 285.3 108.7 283.6 L109.95 282.05 115.5 284.5 121.65 286.75 125.4 287.95 125.4 288.25 124.5 288.25 Q129.4 290.0 135.25 291.15 L142.0 292.3 144.2 292.6 Q161.4 294.7 190.75 294.7 210.75 294.7 226.85 292.3 L234.4 291.0 242.95 289.05 245.7 288.25 247.6 288.25 Q256.2 285.2 261.95 280.4" fill="#354a3e" fill-rule="evenodd" stroke="none"/>
    <path d="M110.45 309.55 L91.55 308.35 Q92.75 304.0 100.4 294.0 L102.95 295.35 109.5 298.65 Q110.3 296.9 112.95 292.75 115.35 288.8 116.65 287.3 L120.6 288.85 118.9 292.3 113.2 303.85 110.45 309.55" fill="#4b6959" fill-rule="evenodd" stroke="none"/>
    <path d="M264.75 286.0 L267.75 291.9 275.2 306.6 242.95 304.8 239.0 304.7 235.25 293.6 241.6 292.3 242.55 292.1 242.95 292.05 Q254.9 289.45 264.75 286.0 M137.05 309.7 L129.7 309.75 110.45 309.55 113.2 303.85 118.9 292.3 120.6 288.85 126.95 291.25 129.95 292.3 Q136.5 294.6 142.45 296.2 139.65 302.45 137.05 309.7" fill="#40594b" fill-rule="evenodd" stroke="none"/>
    <path d="M159.1 251.25 L161.65 251.8 159.25 252.35 159.1 251.25" fill="#c49c38" fill-rule="evenodd" stroke="none"/>
    <path d="M246.9 242.0 L243.1 247.2 242.95 247.3 239.7 248.9 Q231.25 252.8 222.25 254.95 L212.65 256.65 182.85 258.25 156.2 257.1 154.8 256.95 143.25 255.4 148.2 255.15 156.8 255.15 157.45 255.2 157.85 254.8 158.8 253.8 173.35 254.75 Q195.9 254.75 215.1 246.7 L217.65 245.6 219.3 249.15 221.0 252.8 Q231.85 249.95 235.8 248.35 239.6 246.8 242.95 244.75 L246.9 242.0" fill="#4d7a62" fill-rule="evenodd" stroke="none"/>
    <path d="M148.25 284.4 Q163.2 286.4 181.3 286.4 215.1 286.4 232.75 283.6 L234.4 291.0 226.85 292.3 Q210.75 294.7 190.75 294.7 161.4 294.7 144.2 292.6 L144.35 292.3 148.25 284.4 M156.2 257.1 L182.85 258.25 212.65 256.65 222.25 254.95 222.55 255.45 224.7 259.15 Q219.0 260.6 213.15 261.3 L196.3 262.6 196.3 262.4 Q196.3 261.0 195.05 261.35 193.9 261.7 193.35 262.7 L182.6 262.9 155.75 261.8 155.95 260.15 156.2 257.15 156.2 257.1" fill="#8c4141" fill-rule="evenodd" stroke="none"/>
    <path d="M155.75 261.8 L182.6 262.9 193.35 262.7 193.3 262.75 Q193.0 263.35 193.0 264.35 L193.05 265.65 Q193.05 266.65 194.1 266.65 195.5 266.65 196.3 262.6 L213.15 261.3 Q219.0 260.6 224.7 259.15 L225.6 260.6 226.15 260.25 Q228.05 259.25 228.05 261.05 228.05 261.9 227.65 262.65 L227.2 263.3 228.25 265.6 Q227.15 266.05 227.15 266.85 L227.4 267.6 Q227.8 268.25 228.35 268.25 L228.5 268.25 228.8 268.1 229.1 267.95 229.1 268.0 229.8 267.75 Q232.6 266.8 232.6 268.75 232.6 269.65 231.65 270.65 L230.15 271.65 230.3 272.3 Q231.8 272.0 231.8 273.65 L231.8 273.8 Q233.35 273.2 233.35 275.1 233.35 276.3 233.0 276.9 232.55 277.6 231.6 277.75 L231.8 278.85 231.85 279.15 Q232.15 278.9 232.7 278.8 234.1 278.5 234.1 280.05 L233.55 280.9 Q232.95 281.4 232.35 281.4 L232.3 281.4 232.6 282.85 Q222.05 284.55 205.7 285.2 L206.05 285.0 Q206.45 284.7 206.45 284.2 206.45 283.25 205.0 282.7 203.55 282.15 203.55 283.7 L203.75 284.4 Q204.15 285.15 205.05 285.25 194.45 285.65 181.5 285.65 163.5 285.65 148.65 283.65 L149.3 282.2 148.75 281.75 148.55 281.25 Q148.55 280.25 149.5 280.4 L150.0 280.55 150.15 280.15 149.1 279.25 148.5 278.25 Q148.5 276.9 150.35 277.55 L150.95 277.8 151.2 276.85 150.7 275.8 150.0 273.8 Q150.0 272.5 152.1 273.1 L152.4 273.2 153.0 271.2 Q150.65 271.0 149.85 270.35 149.55 270.1 149.55 269.25 149.55 268.55 150.65 268.1 L152.5 267.25 153.15 265.9 153.35 264.65 152.95 263.9 152.55 263.1 Q152.55 261.5 154.7 262.35 L155.6 262.8 155.75 261.8 M144.75 271.45 Q146.45 272.65 146.45 273.35 146.45 274.0 146.05 274.4 145.7 274.8 145.25 274.8 144.05 274.8 143.45 273.5 L143.05 272.1 Q143.05 270.3 144.75 271.45 M147.6 267.1 L147.35 266.4 Q147.35 265.4 148.6 265.6 149.75 265.8 149.75 266.8 L149.45 267.6 148.75 267.9 Q148.0 267.9 147.6 267.1 M160.0 267.6 Q161.15 267.6 161.15 266.7 161.15 265.95 160.15 265.85 159.1 265.75 159.1 266.8 159.1 267.6 160.0 267.6 M156.3 268.75 Q156.3 269.15 156.65 269.75 157.1 270.65 158.1 270.65 L158.95 270.5 159.05 269.75 Q159.05 268.65 157.7 267.85 156.3 267.05 156.3 268.75 M156.85 275.55 L156.9 275.25 Q156.9 274.25 156.2 274.25 155.4 274.25 155.4 275.05 L155.55 275.4 156.15 275.85 Q156.75 275.85 156.8 275.55 L156.85 275.55 M147.95 274.35 Q147.3 274.35 147.05 273.9 L146.85 273.4 Q146.85 272.3 147.9 272.15 149.0 272.0 149.0 273.35 149.0 274.35 147.95 274.35 M143.65 279.45 L143.4 278.55 Q143.4 276.8 145.4 276.25 147.4 275.75 147.4 278.3 L147.15 279.45 Q146.7 280.25 145.65 280.25 144.25 280.25 143.65 279.45 M245.75 271.05 Q245.75 272.25 244.15 272.25 L242.95 272.0 242.75 271.75 242.6 271.25 Q242.6 270.85 242.95 270.55 243.35 270.25 244.2 270.1 245.75 269.85 245.75 271.05 M243.15 276.85 L242.95 276.85 Q242.4 276.75 242.15 276.25 L242.05 275.65 Q242.05 274.8 242.95 274.75 L243.2 274.75 Q244.3 274.75 244.3 275.9 244.3 276.35 243.95 276.6 L243.15 276.85 M188.2 283.65 Q188.6 284.3 189.45 284.3 190.7 284.3 191.65 283.6 192.35 283.05 192.35 282.55 192.35 281.15 190.2 281.35 188.0 281.55 188.0 282.9 L188.2 283.65 M182.25 284.5 Q182.9 284.5 184.35 282.15 184.35 280.55 182.65 281.65 180.9 282.75 180.9 283.3 180.9 284.5 182.25 284.5 M185.0 277.65 Q185.0 276.25 183.5 275.85 182.0 275.45 182.0 276.55 L182.6 277.6 Q183.3 278.55 183.95 278.55 185.0 278.55 185.0 277.65 M201.85 280.35 L201.9 280.85 Q202.05 281.5 202.85 281.5 L204.3 281.35 Q204.75 281.1 204.75 280.4 204.75 279.2 203.3 279.25 201.85 279.25 201.85 280.35 M200.15 272.9 Q200.15 273.9 201.3 273.9 202.65 273.9 203.15 273.5 203.65 273.1 203.65 272.15 203.65 270.9 201.9 271.5 200.15 272.05 200.15 272.9 M174.15 283.15 Q174.55 282.9 174.55 282.3 174.55 281.25 173.3 281.4 172.0 281.55 172.0 282.65 172.0 283.4 172.9 283.4 L174.15 283.15 M175.85 277.4 L176.55 277.15 176.75 276.6 Q176.25 275.55 175.45 275.9 174.75 276.2 174.6 276.75 L175.1 277.15 175.85 277.4 M180.4 278.2 Q180.4 277.2 179.2 277.4 177.95 277.6 177.95 278.65 177.95 279.6 178.95 279.6 179.5 279.6 180.0 279.0 L180.4 278.2 M181.15 273.25 L181.35 274.0 Q181.7 274.8 182.5 274.8 183.4 274.8 183.4 273.8 183.4 272.85 182.3 272.4 181.15 271.9 181.15 273.25 M178.25 273.8 Q179.2 273.3 179.2 272.7 179.2 271.25 176.55 271.4 173.9 271.55 173.9 272.65 173.9 273.1 174.4 273.6 175.0 274.25 176.0 274.25 L178.25 273.8 M180.15 265.75 L180.6 266.6 Q181.15 267.6 181.85 267.6 182.7 267.6 182.7 266.65 182.7 265.3 181.4 264.95 180.15 264.6 180.15 265.75 M178.95 270.0 Q179.8 270.0 179.8 268.65 179.8 267.55 178.0 265.75 176.15 263.95 176.15 266.05 L176.85 268.0 Q177.7 270.0 178.95 270.0 M201.35 268.55 Q199.25 268.95 199.25 269.9 L199.45 270.6 Q199.95 271.25 201.65 271.25 202.5 271.25 203.05 270.5 203.45 269.95 203.45 269.4 203.45 268.15 201.35 268.55 M199.9 264.5 Q199.9 261.85 197.6 264.6 195.25 267.35 195.25 268.85 L195.3 269.45 Q195.45 270.0 196.25 270.0 198.45 270.0 199.9 264.5 M189.6 269.95 Q189.15 270.25 189.15 270.9 189.15 271.6 189.45 272.5 L190.0 274.0 Q189.45 274.65 188.0 275.05 186.85 275.35 186.85 276.1 186.85 277.1 188.55 277.5 L189.75 278.1 190.25 278.35 Q189.05 278.9 189.05 279.65 L189.25 280.15 Q189.5 280.6 190.15 280.6 191.9 279.6 191.95 278.95 L192.55 279.1 193.0 279.3 192.8 281.0 192.9 281.85 193.25 282.1 193.8 282.15 Q195.1 282.15 195.1 280.3 L195.1 280.2 195.5 280.5 196.2 281.5 Q196.8 282.3 197.55 282.3 198.65 282.3 198.65 280.95 L198.3 279.8 197.95 278.8 Q197.95 278.45 198.1 278.2 L198.15 277.8 Q200.3 278.1 201.15 277.3 L201.6 276.25 Q201.6 275.15 199.85 274.75 197.6 274.2 196.7 273.25 197.5 272.55 197.5 271.95 197.7 270.9 196.45 270.9 196.25 270.9 194.45 271.95 L194.35 272.05 194.35 272.0 194.6 271.3 Q194.6 269.1 193.5 268.8 192.35 268.45 192.35 270.2 L192.55 271.25 Q192.9 272.25 193.8 272.25 L194.05 272.25 192.7 273.0 Q192.25 273.0 191.75 271.9 L191.25 270.6 Q190.2 269.55 189.6 269.95 M191.4 267.8 L191.45 268.25 Q191.6 268.65 192.3 268.65 192.85 268.65 193.05 268.35 L193.1 267.75 193.05 267.15 192.0 267.2 Q191.4 267.35 191.4 267.8 M186.35 268.1 L186.75 269.15 Q187.35 270.3 188.35 270.3 189.4 270.3 189.4 269.15 189.4 268.0 187.9 267.2 186.35 266.4 186.35 268.1 M184.15 271.0 Q184.7 272.0 185.4 272.0 186.8 272.0 186.8 270.6 186.8 269.4 185.25 269.2 183.7 269.0 183.7 270.2 L184.15 271.0 M188.3 263.95 L188.85 265.05 Q189.65 266.4 190.6 266.4 191.1 266.4 191.45 266.0 L191.75 265.3 Q191.75 264.3 190.05 263.35 188.3 262.35 188.3 263.95 M228.85 262.0 Q228.85 260.8 230.85 260.05 232.85 259.3 232.85 260.9 232.85 261.5 231.9 262.25 230.85 263.05 230.0 263.05 229.2 263.05 228.95 262.55 L228.85 262.0 M232.65 263.6 Q234.45 263.05 234.45 265.0 234.45 265.65 233.85 266.05 233.15 266.5 232.05 266.5 231.4 266.5 231.05 265.85 L230.8 265.15 Q230.8 264.15 232.65 263.6 M224.4 269.8 L224.5 270.35 225.25 270.85 226.4 270.0 Q226.95 269.25 226.95 268.55 226.95 267.15 225.7 267.85 224.4 268.55 224.4 269.8 M224.15 265.75 Q224.15 264.5 222.95 264.45 221.8 264.45 221.8 265.5 L221.85 266.1 Q222.05 266.75 223.0 266.75 224.15 266.45 224.15 265.75 M242.95 265.0 Q243.35 265.15 243.35 266.05 L242.95 268.1 242.85 268.35 Q242.15 270.15 241.45 270.15 240.7 270.15 240.55 269.15 L240.55 268.05 Q240.55 266.1 241.95 265.25 242.6 264.9 242.95 265.0 M239.45 262.5 L239.1 263.25 Q238.7 263.65 238.35 263.65 237.7 263.65 237.45 263.15 L237.4 262.6 Q237.4 261.55 238.4 261.25 239.45 260.95 239.45 262.5 M234.25 262.8 Q233.35 262.8 233.35 261.8 233.35 260.9 234.65 260.55 235.95 260.25 235.95 261.4 L235.45 262.35 Q234.9 262.8 234.25 262.8 M236.25 271.5 L235.8 272.6 234.95 273.25 Q234.25 273.25 234.05 272.6 L233.95 271.5 Q233.95 269.7 235.15 269.95 236.25 270.2 236.25 271.5 M207.3 264.3 Q206.3 264.6 206.3 265.9 206.3 266.9 207.25 266.9 208.25 266.9 208.25 265.4 208.25 264.05 207.3 264.3 M220.55 278.0 Q220.95 277.55 220.95 276.9 220.95 275.6 219.7 276.3 218.4 277.0 218.4 277.9 L218.9 278.55 Q220.0 278.65 220.55 278.0 M209.45 276.55 Q209.45 275.55 208.25 275.9 207.05 276.2 207.05 276.8 207.05 277.75 208.25 277.75 209.45 277.75 209.45 276.55 M237.95 277.25 Q237.4 278.05 236.5 278.05 235.8 278.05 235.6 277.5 L235.55 276.9 Q235.55 275.4 236.95 275.0 238.35 274.6 238.35 276.15 L237.95 277.25 M239.2 273.3 L239.0 272.9 Q239.0 272.05 239.95 272.0 240.9 272.0 240.9 272.75 L240.7 273.35 Q240.35 273.8 239.6 273.75 L239.2 273.3 M239.6 281.0 Q239.0 281.0 238.7 280.45 L238.5 279.8 Q238.5 278.9 239.6 278.85 240.65 278.8 240.65 279.8 L240.45 280.5 239.6 281.0 M226.45 280.5 L226.55 280.05 226.05 278.15 Q225.55 277.75 224.95 278.45 L224.5 279.3 224.75 280.0 Q225.15 280.65 225.95 280.65 L226.45 280.5 M226.5 274.35 Q227.0 275.05 227.7 275.05 228.35 275.05 228.35 273.9 228.35 272.85 227.3 272.75 226.2 272.65 226.2 273.65 L226.5 274.35" fill="#5c677a" fill-rule="evenodd" stroke="none"/>
    <path d="M212.6 236.55 Q222.35 228.4 227.15 218.05 L228.1 215.9 228.9 213.8 Q230.7 214.65 232.3 215.9 L234.4 217.8 234.65 218.05 235.8 219.45 Q238.35 222.65 241.2 227.45 L241.45 227.8 241.55 228.1 Q232.0 236.4 220.95 241.9 L216.75 243.9 215.65 241.9 212.6 236.55" fill="#cca33b" fill-rule="evenodd" stroke="none"/>
    <path d="M242.35 227.55 L242.45 227.4 242.65 227.8 242.35 227.55" fill="#7bb861" fill-rule="evenodd" stroke="none"/>
    <path d="M193.35 262.7 Q193.9 261.7 195.05 261.35 196.3 261.0 196.3 262.4 L196.3 262.6 Q195.5 266.65 194.1 266.65 193.05 266.65 193.05 265.65 L193.0 264.35 Q193.0 263.35 193.3 262.75 L193.35 262.7 M205.05 285.25 Q204.15 285.15 203.75 284.4 L203.55 283.7 Q203.55 282.15 205.0 282.7 206.45 283.25 206.45 284.2 206.45 284.7 206.05 285.0 L205.7 285.2 205.35 285.25 205.05 285.25 M188.3 263.95 Q188.3 262.35 190.05 263.35 191.75 264.3 191.75 265.3 L191.45 266.0 Q191.1 266.4 190.6 266.4 189.65 266.4 188.85 265.05 L188.3 263.95 M184.15 271.0 L183.7 270.2 Q183.7 269.0 185.25 269.2 186.8 269.4 186.8 270.6 186.8 272.0 185.4 272.0 184.7 272.0 184.15 271.0 M186.35 268.1 Q186.35 266.4 187.9 267.2 189.4 268.0 189.4 269.15 189.4 270.3 188.35 270.3 187.35 270.3 186.75 269.15 L186.35 268.1 M191.4 267.8 Q191.4 267.35 192.0 267.2 L193.05 267.15 193.1 267.75 193.05 268.35 Q192.85 268.65 192.3 268.65 191.6 268.65 191.45 268.25 L191.4 267.8 M189.6 269.95 Q190.2 269.55 191.25 270.6 L191.75 271.9 Q192.25 273.0 192.7 273.0 L194.05 272.25 193.8 272.25 Q192.9 272.25 192.55 271.25 L192.35 270.2 Q192.35 268.45 193.5 268.8 194.6 269.1 194.6 271.3 L194.35 272.0 194.35 272.05 194.45 271.95 Q196.25 270.9 196.45 270.9 197.7 270.9 197.5 271.95 197.5 272.55 196.7 273.25 197.6 274.2 199.85 274.75 201.6 275.15 201.6 276.25 L201.15 277.3 Q200.3 278.1 198.15 277.8 L198.1 278.2 Q197.95 278.45 197.95 278.8 L198.3 279.8 198.65 280.95 Q198.65 282.3 197.55 282.3 196.8 282.3 196.2 281.5 L195.5 280.5 195.1 280.2 195.1 280.3 Q195.1 282.15 193.8 282.15 L193.25 282.1 192.9 281.85 192.8 281.0 193.0 279.3 192.55 279.1 191.95 278.95 Q191.9 279.6 190.15 280.6 189.5 280.6 189.25 280.15 L189.05 279.65 Q189.05 278.9 190.25 278.35 L189.75 278.1 188.55 277.5 Q186.85 277.1 186.85 276.1 186.85 275.35 188.0 275.05 189.45 274.65 190.0 274.0 L189.45 272.5 Q189.15 271.6 189.15 270.9 189.15 270.25 189.6 269.95 M199.9 264.5 Q198.45 270.0 196.25 270.0 195.45 270.0 195.3 269.45 L195.25 268.85 Q195.25 267.35 197.6 264.6 199.9 261.85 199.9 264.5 M201.35 268.55 Q203.45 268.15 203.45 269.4 203.45 269.95 203.05 270.5 202.5 271.25 201.65 271.25 199.95 271.25 199.45 270.6 L199.25 269.9 Q199.25 268.95 201.35 268.55 M178.95 270.0 Q177.7 270.0 176.85 268.0 L176.15 266.05 Q176.15 263.95 178.0 265.75 179.8 267.55 179.8 268.65 179.8 270.0 178.95 270.0 M180.15 265.75 Q180.15 264.6 181.4 264.95 182.7 265.3 182.7 266.65 182.7 267.6 181.85 267.6 181.15 267.6 180.6 266.6 L180.15 265.75 M178.25 273.8 L176.0 274.25 Q175.0 274.25 174.4 273.6 173.9 273.1 173.9 272.65 173.9 271.55 176.55 271.4 179.2 271.25 179.2 272.7 179.2 273.3 178.25 273.8 M181.15 273.25 Q181.15 271.9 182.3 272.4 183.4 272.85 183.4 273.8 183.4 274.8 182.5 274.8 181.7 274.8 181.35 274.0 L181.15 273.25 M180.4 278.2 L180.0 279.0 Q179.5 279.6 178.95 279.6 177.95 279.6 177.95 278.65 177.95 277.6 179.2 277.4 180.4 277.2 180.4 278.2 M175.85 277.4 L175.1 277.15 174.6 276.75 Q174.75 276.2 175.45 275.9 176.25 275.55 176.75 276.6 L176.55 277.15 175.85 277.4 M174.15 283.15 L172.9 283.4 Q172.0 283.4 172.0 282.65 172.0 281.55 173.3 281.4 174.55 281.25 174.55 282.3 174.55 282.9 174.15 283.15 M200.15 272.9 Q200.15 272.05 201.9 271.5 203.65 270.9 203.65 272.15 203.65 273.1 203.15 273.5 202.65 273.9 201.3 273.9 200.15 273.9 200.15 272.9 M201.85 280.35 Q201.85 279.25 203.3 279.25 204.75 279.2 204.75 280.4 204.75 281.1 204.3 281.35 L202.85 281.5 Q202.05 281.5 201.9 280.85 L201.85 280.35 M185.0 277.65 Q185.0 278.55 183.95 278.55 183.3 278.55 182.6 277.6 L182.0 276.55 Q182.0 275.45 183.5 275.85 185.0 276.25 185.0 277.65 M182.25 284.5 Q180.9 284.5 180.9 283.3 180.9 282.75 182.65 281.65 184.35 280.55 184.35 282.15 182.9 284.5 182.25 284.5 M188.2 283.65 L188.0 282.9 Q188.0 281.55 190.2 281.35 192.35 281.15 192.35 282.55 192.35 283.05 191.65 283.6 190.7 284.3 189.45 284.3 188.6 284.3 188.2 283.65 M207.3 264.3 Q208.25 264.05 208.25 265.4 208.25 266.9 207.25 266.9 206.3 266.9 206.3 265.9 206.3 264.6 207.3 264.3 M209.45 276.55 Q209.45 277.75 208.25 277.75 207.05 277.75 207.05 276.8 207.05 276.2 208.25 275.9 209.45 275.55 209.45 276.55" fill="#535c6e" fill-rule="evenodd" stroke="none"/>
    <path d="M231.65 193.8 Q229.05 189.4 228.0 182.35 227.2 176.75 227.45 169.2 L227.85 161.7 Q228.1 158.85 228.6 156.05 229.5 150.15 231.5 144.45 L232.4 141.95 Q234.3 137.15 236.05 133.25 L236.05 132.6 Q243.7 123.85 249.95 118.95 L249.65 129.1 Q244.55 131.95 242.8 134.7 L239.9 139.35 237.8 142.9 Q236.15 145.85 235.15 148.1 L233.55 152.15 Q232.8 154.15 232.35 156.3 231.55 159.5 231.25 162.9 231.05 166.15 231.15 169.2 L231.25 171.3 Q232.5 183.15 240.2 192.4 L238.3 200.75 235.85 198.7 Q233.35 196.85 231.65 193.8" fill="#632727" fill-rule="evenodd" stroke="none"/>
    <path d="M240.2 192.4 Q232.5 183.15 231.25 171.3 L231.15 169.2 Q231.05 166.15 231.25 162.9 231.55 159.5 232.35 156.3 232.8 154.15 233.55 152.15 L235.15 148.1 Q236.15 145.85 237.8 142.9 L239.9 139.35 242.8 134.7 Q244.55 131.95 249.65 129.1 L248.85 140.0 248.25 145.3 Q246.95 157.2 244.95 168.35 242.35 183.1 240.5 191.1 L240.2 192.4" fill="#2c2e33" fill-rule="evenodd" stroke="none"/>
    <path d="M244.9 197.25 L240.45 192.7 240.2 192.4 240.5 191.1 Q242.35 183.1 244.95 168.35 246.95 157.2 248.25 145.3 L248.85 140.0 Q270.9 133.8 283.7 126.9 L283.95 126.8 286.1 125.6 286.3 125.75 288.2 126.8 290.35 128.15 290.9 128.6 Q295.5 134.35 298.2 138.25 L277.25 161.6 277.05 161.8 270.4 169.2 244.9 197.25" fill="#3f4349" fill-rule="evenodd" stroke="none"/>
    <path d="M238.3 200.75 L240.2 192.4 240.45 192.7 244.9 197.25 240.1 202.4 238.3 200.75 M296.6 119.65 L299.55 121.95 299.9 122.65 302.3 126.8 304.7 131.05 298.2 138.25 Q295.5 134.35 290.9 128.6 L290.35 128.15 288.2 126.8 286.3 125.75 286.1 125.6 296.6 119.65" fill="#853535" fill-rule="evenodd" stroke="none"/>
    <path d="M249.65 129.1 L249.95 118.95 250.45 118.55 251.85 117.55 Q262.45 109.95 272.65 109.75 274.0 109.75 280.45 111.4 286.9 113.05 287.9 113.7 L294.75 118.3 296.6 119.65 286.1 125.6 Q278.5 121.6 271.75 121.7 L271.1 121.7 Q265.0 121.95 255.55 126.1 L254.1 126.8 Q251.7 127.9 249.75 129.0 L249.65 129.1" fill="#7a3030" fill-rule="evenodd" stroke="none"/>
    <path d="M231.65 193.8 Q233.35 196.85 235.85 198.7 L238.3 200.75 240.1 202.4 247.3 209.65 Q251.9 213.7 256.4 215.5 L258.5 216.2 259.2 216.35 263.0 216.85 264.3 220.65 264.4 221.1 Q260.4 220.8 256.3 218.65 254.45 217.7 252.5 216.35 L251.35 215.5 249.25 213.75 249.2 213.7 Q242.25 206.45 238.9 203.75 L237.8 202.9 Q233.8 199.9 231.65 193.8 M299.9 122.65 L302.55 124.75 302.7 124.95 303.85 126.8 305.65 130.0 Q310.5 138.35 312.4 143.75 313.8 147.75 314.65 152.1 L315.2 155.65 312.7 154.55 312.05 154.2 Q311.4 147.05 309.1 140.65 307.7 136.65 304.7 131.05 L302.3 126.8 299.9 122.65" fill="#662b2b" fill-rule="evenodd" stroke="none"/>
    <path d="M286.1 125.6 L283.95 126.8 283.7 126.9 Q270.9 133.8 248.85 140.0 L249.65 129.1 249.75 129.0 Q251.7 127.9 254.1 126.8 L255.55 126.1 Q265.0 121.95 271.1 121.7 L271.75 121.7 Q278.5 121.6 286.1 125.6" fill="#393c42" fill-rule="evenodd" stroke="none"/>
    <path d="M303.0 166.05 Q304.15 162.05 304.4 159.45 305.15 150.7 300.7 142.3 L298.2 138.25 304.7 131.05 Q307.7 136.65 309.1 140.65 311.4 147.05 312.05 154.2 L312.15 155.2 303.0 166.05 M267.8 205.5 L263.75 210.1 259.1 215.5 258.5 216.2 256.4 215.5 Q251.9 213.7 247.3 209.65 L240.1 202.4 244.9 197.25 Q248.7 200.5 253.15 202.5 259.75 205.45 267.8 205.5" fill="#913a3a" fill-rule="evenodd" stroke="none"/>
    <path d="M244.9 197.25 L270.4 169.2 277.05 161.8 277.25 161.6 298.2 138.25 300.7 142.3 Q305.15 150.7 304.4 159.45 304.15 162.05 303.0 166.05 L302.2 166.95 300.2 169.2 296.3 173.5 Q286.5 184.1 267.8 205.5 259.75 205.45 253.15 202.5 248.7 200.5 244.9 197.25" fill="#44484f" fill-rule="evenodd" stroke="none"/>
    <path d="M315.2 155.65 Q315.95 161.9 315.35 168.75 L315.3 169.2 315.2 170.45 Q314.0 180.4 309.05 189.9 L308.65 189.15 306.35 185.15 Q310.25 177.45 311.55 169.45 L311.6 169.2 312.05 165.35 Q312.5 160.15 312.15 155.2 L312.05 154.2 312.7 154.55 315.2 155.65 M294.1 209.35 Q290.55 212.6 286.6 215.5 L285.35 216.35 282.35 218.35 282.1 218.45 281.05 218.7 Q270.15 221.1 266.0 221.1 L264.4 221.1 264.3 220.65 263.0 216.85 263.5 216.85 268.55 216.35 273.35 215.5 278.45 214.45 279.5 214.2 Q285.75 210.25 291.0 205.35 L292.75 207.65 294.1 209.35" fill="#592525" fill-rule="evenodd" stroke="none"/>
    <path d="M303.0 166.05 L312.15 155.2 Q312.5 160.15 312.05 165.35 L311.6 169.2 311.55 169.45 Q310.25 177.45 306.35 185.15 304.1 189.65 300.9 194.05 296.55 200.2 291.0 205.35 285.75 210.25 279.5 214.2 L278.45 214.45 273.35 215.5 268.55 216.35 263.5 216.85 263.0 216.85 259.2 216.35 258.5 216.2 259.1 215.5 263.75 210.1 267.8 205.5 268.8 205.5 Q273.6 205.4 283.15 198.1 291.15 191.95 292.75 189.45 294.45 187.0 297.45 180.2 L299.1 176.5 299.55 175.45 301.95 169.2 302.65 167.05 303.0 166.05" fill="#9c3e3e" fill-rule="evenodd" stroke="none"/>
    <path d="M303.0 166.05 L302.65 167.05 301.95 169.2 299.55 175.45 299.1 176.5 297.45 180.2 Q294.45 187.0 292.75 189.45 291.15 191.95 283.15 198.1 273.6 205.4 268.8 205.5 L267.8 205.5 Q286.5 184.1 296.3 173.5 L300.2 169.2 302.2 166.95 303.0 166.05" fill="#4c5059" fill-rule="evenodd" stroke="none"/>
    <path d="M309.05 189.9 Q306.9 194.0 304.05 197.95 299.65 204.15 294.1 209.35 L292.75 207.65 291.0 205.35 Q296.55 200.2 300.9 194.05 304.1 189.65 306.35 185.15 L308.65 189.15 309.05 189.9" fill="#4a1f1f" fill-rule="evenodd" stroke="none"/>
    <path d="M94.2 210.75 L93.6 210.65 92.7 210.4 Q82.15 203.2 76.0 192.1 72.7 186.25 71.2 180.15 69.8 174.75 69.75 169.2 L69.85 165.75 Q70.7 153.35 76.0 142.75 L77.75 139.5 80.45 149.2 Q78.0 154.6 77.55 160.2 77.35 163.45 78.45 169.2 L79.7 174.85 79.95 175.8 80.1 176.5 80.8 179.3 Q82.45 185.55 83.65 187.75 84.6 190.05 90.65 195.6 L93.15 197.7 96.25 211.15 94.2 210.75" fill="#9c3e3e" fill-rule="evenodd" stroke="none"/>
    <path d="M93.15 197.7 L90.65 195.6 Q84.6 190.05 83.65 187.75 82.45 185.55 80.8 179.3 L80.1 176.5 79.95 175.8 79.7 174.85 78.45 169.2 Q77.35 163.45 77.55 160.2 78.0 154.6 80.45 149.2 L86.05 169.2 87.05 172.95 87.3 173.8 93.15 197.7" fill="#4c5059" fill-rule="evenodd" stroke="none"/>
    <path d="M77.75 139.5 Q81.0 133.75 87.3 125.25 L88.6 124.3 92.0 132.8 Q85.55 140.25 83.15 144.15 81.6 146.65 80.45 149.2 L77.75 139.5 M96.25 211.15 L93.15 197.7 Q98.6 202.1 102.0 202.1 108.35 202.05 113.95 199.85 L117.45 209.15 Q111.75 212.55 106.8 212.6 103.6 212.6 96.25 211.15" fill="#913a3a" fill-rule="evenodd" stroke="none"/>
    <path d="M121.4 114.7 Q129.85 115.65 137.75 122.45 L137.8 122.45 Q142.95 126.9 149.0 135.25 L149.15 135.6 149.15 135.95 149.1 136.25 151.2 144.15 151.65 146.3 151.7 146.55 146.25 146.8 145.95 144.8 145.45 142.45 143.35 134.45 143.4 133.85 Q137.45 125.6 132.3 121.15 126.95 116.6 121.4 114.7 M135.55 201.25 L128.0 208.1 128.0 208.15 125.3 210.15 121.5 206.4 122.55 205.55 131.3 197.7 133.3 199.3 135.55 201.25" fill="#592525" fill-rule="evenodd" stroke="none"/>
    <path d="M100.1 127.25 Q105.8 124.5 110.7 124.45 L111.3 124.5 Q116.55 124.6 124.05 128.25 126.65 129.55 128.6 130.8 132.65 133.4 133.8 135.95 L135.7 140.2 136.35 141.75 124.5 137.5 110.2 132.0 Q104.75 130.0 100.1 127.25" fill="#393c42" fill-rule="evenodd" stroke="none"/>
    <path d="M92.4 121.55 L98.9 117.3 Q99.95 116.7 106.05 115.05 112.15 113.4 113.35 113.4 117.45 113.4 121.4 114.7 126.95 116.6 132.3 121.15 137.45 125.6 143.4 133.85 L143.35 134.45 145.45 142.45 145.95 144.8 142.5 143.75 136.35 141.75 135.7 140.2 133.8 135.95 Q132.65 133.4 128.6 130.8 126.65 129.55 124.05 128.25 116.55 124.6 111.3 124.5 L110.7 124.45 Q105.8 124.5 100.1 127.25 95.9 124.7 92.4 121.55" fill="#7a3030" fill-rule="evenodd" stroke="none"/>
    <path d="M100.1 127.25 Q104.75 130.0 110.2 132.0 L124.5 137.5 136.35 141.75 Q137.7 145.2 138.45 147.75 L138.6 148.25 139.45 151.9 Q140.2 156.15 140.0 160.7 L139.9 161.9 Q139.65 165.65 138.85 169.2 L138.75 169.65 Q136.15 180.9 128.05 189.7 122.4 195.95 115.8 199.05 L113.95 199.85 Q108.4 184.7 105.05 174.5 L103.4 169.2 103.2 168.65 98.0 151.95 92.25 133.55 92.0 132.8 93.35 131.2 93.85 130.85 Q95.6 129.65 97.65 128.5 98.9 127.8 100.1 127.25" fill="#3f4349" fill-rule="evenodd" stroke="none"/>
    <path d="M88.6 124.3 L92.15 121.7 92.4 121.55 Q95.9 124.7 100.1 127.25 98.9 127.8 97.65 128.5 95.6 129.65 93.85 130.85 L93.35 131.2 92.0 132.8 88.6 124.3 M136.35 141.75 L142.5 143.75 145.95 144.8 146.25 146.8 Q147.25 153.15 146.95 159.65 L146.85 160.7 146.0 169.2 Q145.2 175.25 143.85 179.85 140.65 190.9 134.45 195.2 L131.3 197.7 122.55 205.55 121.5 206.4 117.45 209.15 113.95 199.85 115.8 199.05 Q122.4 195.95 128.05 189.7 136.15 180.9 138.75 169.65 L138.85 169.2 Q139.65 165.65 139.9 161.9 L140.0 160.7 Q140.2 156.15 139.45 151.9 L138.6 148.25 138.45 147.75 Q137.7 145.2 136.35 141.75" fill="#853535" fill-rule="evenodd" stroke="none"/>
    <path d="M151.7 146.55 Q152.85 152.6 152.75 158.9 L152.6 162.65 152.0 169.2 Q151.15 176.55 149.55 182.0 146.25 193.35 139.85 197.8 L135.55 201.25 133.3 199.3 131.3 197.7 134.45 195.2 Q140.65 190.9 143.85 179.85 145.2 175.25 146.0 169.2 L146.85 160.7 146.95 159.65 Q147.25 153.15 146.25 146.8 L151.7 146.55" fill="#4f2121" fill-rule="evenodd" stroke="none"/>
    <path d="M80.45 149.2 Q81.6 146.65 83.15 144.15 85.55 140.25 92.0 132.8 L92.25 133.55 98.0 151.95 103.2 168.65 103.4 169.2 105.05 174.5 Q108.4 184.7 113.95 199.85 108.35 202.05 102.0 202.1 98.6 202.1 93.15 197.7 L87.3 173.8 87.05 172.95 86.05 169.2 80.45 149.2" fill="#44484f" fill-rule="evenodd" stroke="none"/>
    <path d="M125.3 210.15 Q122.1 212.4 119.1 213.7 115.25 215.3 111.75 215.3 108.0 215.3 98.45 213.35 L98.4 213.35 97.5 213.1 97.3 213.05 96.55 212.5 94.2 210.75 96.25 211.15 Q103.6 212.6 106.8 212.6 111.75 212.55 117.45 209.15 L121.5 206.4 125.3 210.15" fill="#662b2b" fill-rule="evenodd" stroke="none"/>
  </g>
</svg>
