<?xml version="1.0" encoding="UTF-8" standalone="no"?>
<svg xmlns:xlink="http://www.w3.org/1999/xlink" height="44.2px" width="34.0px" xmlns="http://www.w3.org/2000/svg">
  <g transform="matrix(1.0, 0.0, 0.0, 1.0, 0.0, 15.25)">
    <path d="M12.6 -15.25 L21.6 17.05 34.0 4.6 21.85 28.95 9.6 1.0 0.0 6.6 0.0 -10.4 12.6 -15.25" fill="#ffffff" fill-rule="evenodd" stroke="none"/>
  </g>
</svg>
