<?xml version="1.0" encoding="UTF-8" standalone="no"?>
<svg xmlns:xlink="http://www.w3.org/1999/xlink" height="48.6px" width="54.15px" xmlns="http://www.w3.org/2000/svg">
  <g transform="matrix(1.0, 0.0, 0.0, 1.0, 26.75, 24.3)">
    <path d="M4.35 -7.35 L4.55 -7.35 6.65 -7.5 8.85 -7.85 12.35 -8.75 12.45 -8.8 12.95 -9.05 13.25 -9.05 14.45 -9.55 Q16.25 -10.35 18.05 -11.35 L18.0 -11.3 18.85 -11.8 19.3 -12.05 Q23.35 -14.65 25.9 -17.7 L26.4 -18.35 26.55 -17.9 Q27.4 -14.85 27.4 -11.5 27.4 -7.4 26.1 -0.55 L25.3 3.4 25.35 3.4 24.2 7.85 24.15 8.05 24.65 10.8 25.65 15.35 25.65 15.5 Q24.35 17.05 22.1 18.0 L18.15 19.25 18.15 19.2 17.1 19.45 16.65 19.55 Q16.45 19.55 16.35 19.7 L16.3 19.85 15.95 20.05 15.95 20.0 12.55 21.8 Q8.85 23.55 8.2 23.6 L7.2 22.9 7.0 22.8 6.75 22.8 -0.85 24.3 -3.15 22.35 -4.3 21.25 -4.5 21.1 -4.7 21.0 -7.3 20.75 -13.85 20.2 -15.05 19.65 -16.05 19.25 -18.0 18.45 -18.0 18.4 -18.25 18.1 Q-19.05 17.7 -19.25 16.5 L-19.25 16.45 -19.35 13.6 -19.1 10.9 -19.1 10.8 -19.05 10.35 -18.8 9.95 -18.8 10.0 -18.35 9.1 -18.35 9.0 -17.35 10.5 -17.15 10.7 -16.85 10.75 -16.55 10.6 -16.45 10.3 Q-15.95 5.55 -16.3 0.4 L-16.3 0.35 -16.5 -1.65 Q-16.9 -5.55 -17.75 -9.75 -18.45 -13.1 -19.6 -15.1 L-19.65 -15.2 Q-22.2 -19.5 -26.75 -18.1 L-26.25 -18.35 -23.05 -20.2 -22.8 -20.4 -22.75 -20.4 -22.65 -20.45 Q-22.55 -20.45 -22.45 -20.55 L-22.1 -20.75 -22.05 -20.75 -20.95 -21.4 -19.5 -22.2 -19.3 -22.15 -18.95 -22.25 -18.55 -22.5 Q-17.2 -23.4 -15.65 -24.0 L-15.6 -24.05 -15.25 -24.25 -15.2 -24.25 -14.45 -24.3 -13.3 -24.15 -12.95 -24.0 -12.85 -23.95 Q-11.8 -23.55 -11.2 -22.35 L-10.9 -21.75 -10.9 -21.8 -10.5 -20.8 -10.15 -19.4 -10.15 -19.35 -10.15 -19.25 -10.05 -18.85 -9.6 -16.55 Q-9.3 -14.3 -7.8 -12.3 L-7.35 -11.7 -7.3 -11.7 -5.95 -10.3 Q-5.1 -9.6 -4.0 -9.05 -1.9 -8.05 0.15 -7.7 L4.1 -7.35 4.35 -7.35" fill="#6cf06c" fill-rule="evenodd" stroke="none"/>
  </g>
</svg>
