<?xml version="1.0" encoding="UTF-8" standalone="no"?>
<svg xmlns:xlink="http://www.w3.org/1999/xlink" height="209.25px" width="293.65px" xmlns="http://www.w3.org/2000/svg">
  <g transform="matrix(1.0, 0.0, 0.0, 1.0, 276.2, 203.6)">
    <path d="M-67.3 -202.5 Q-60.7 -204.05 -55.15 -203.4 -41.15 -202.0 -34.25 -186.95 -31.95 -181.85 -35.7 -178.05 -47.45 -166.1 -64.75 -162.7 -90.65 -157.65 -117.1 -155.0 -143.3 -152.5 -169.85 -152.95 -198.7 -153.5 -226.65 -160.1 -240.15 -163.4 -247.45 -169.65 L-248.2 -170.4 Q-249.4 -172.15 -251.65 -174.3 L-251.75 -174.55 Q-257.3 -183.3 -243.4 -193.45 -228.7 -204.35 -198.4 -197.75 -171.5 -190.05 -142.1 -187.65 -117.15 -186.15 -90.7 -195.35 -79.25 -199.65 -67.3 -202.5" fill="#0d0908" fill-rule="evenodd" stroke="none"/>
    <path d="M-108.5 5.65 L-114.55 5.65 -114.35 2.8 -114.15 -0.2 -114.5 -0.2 Q-117.25 -0.2 -118.45 -1.6 -119.35 -2.6 -119.45 -4.5 L-119.55 -4.5 -123.65 -4.15 -124.7 -4.0 -124.95 -3.85 Q-125.7 -3.25 -126.25 -3.2 L-127.8 -2.9 -128.75 -2.7 Q-129.35 -2.7 -129.7 -3.4 -130.1 -2.95 -130.65 -2.7 L-133.15 -2.3 Q-134.5 -2.3 -136.75 -3.1 -139.5 -4.0 -139.5 -5.05 -139.5 -5.85 -137.55 -7.1 L-137.1 -7.35 Q-134.8 -8.7 -133.65 -8.7 L-132.1 -8.25 -131.9 -8.2 -131.7 -8.3 -130.35 -8.55 Q-129.85 -8.7 -129.25 -9.1 L-128.2 -9.45 Q-127.7 -9.45 -126.9 -8.85 L-126.75 -8.75 -121.1 -9.85 -120.2 -10.05 Q-117.1 -10.95 -113.15 -12.65 L-113.0 -15.3 Q-112.35 -23.5 -111.2 -30.35 -110.3 -35.95 -110.3 -37.35 L-111.8 -43.2 -110.1 -49.9 -108.5 -55.7 -106.75 -49.5 Q-104.8 -42.8 -104.8 -41.15 L-104.9 -33.6 -106.35 -16.05 -106.4 -15.3 -106.6 -12.9 Q-106.95 -12.35 -107.25 -8.95 L-107.3 -8.55 -107.95 -0.9 -108.15 0.75 -108.5 5.65 M-152.05 5.65 L-160.65 5.65 Q-161.65 0.15 -161.65 -2.45 L-161.65 -4.3 Q-161.7 -8.35 -162.25 -11.4 -163.05 -16.45 -165.1 -19.1 L-169.15 -23.05 -173.8 -27.55 -173.8 -28.0 Q-173.8 -32.7 -172.75 -38.9 -171.45 -45.05 -171.25 -46.6 -171.15 -47.7 -168.3 -53.1 L-167.8 -54.05 -166.35 -50.15 -164.2 -44.85 -165.5 -40.8 Q-166.85 -36.4 -166.85 -34.5 L-162.95 -27.3 Q-158.75 -19.0 -157.5 -13.15 L-155.45 -5.2 -152.95 3.0 -152.1 5.6 -152.05 5.65 M-177.75 -131.2 Q-176.05 -133.55 -176.05 -134.25 -176.05 -135.15 -176.2 -135.85 -170.3 -139.7 -164.4 -142.1 L-162.25 -142.95 Q-158.05 -144.45 -153.25 -145.5 L-146.6 -146.65 -127.05 -148.4 -106.25 -150.55 -105.3 -145.5 -105.0 -142.95 -104.55 -139.65 -104.05 -136.25 -104.0 -135.8 -103.65 -132.8 -102.95 -127.1 -102.85 -126.35 -102.55 -124.0 -102.55 -117.7 Q-102.55 -111.7 -103.75 -107.85 L-103.75 -105.3 Q-101.2 -108.0 -100.85 -109.3 L-100.45 -109.3 Q-100.5 -108.35 -100.0 -106.6 L-99.6 -105.05 -99.4 -103.5 -98.7 -100.85 -98.35 -100.05 -98.2 -99.75 -98.1 -99.55 -98.2 -99.25 -100.4 -91.45 -101.2 -88.5 -101.3 -88.15 -102.2 -85.05 -103.55 -79.85 -104.5 -76.25 -104.85 -76.05 Q-109.25 -74.05 -120.5 -68.45 L-125.95 -65.75 -126.6 -65.4 -128.5 -64.85 -133.7 -62.95 -135.25 -62.35 Q-137.05 -61.7 -138.4 -61.35 L-141.35 -60.85 Q-142.8 -60.85 -143.9 -62.0 L-146.25 -64.15 -148.9 -65.05 -149.0 -65.05 -149.6 -65.1 -151.95 -65.85 -152.15 -65.95 Q-155.55 -67.25 -160.0 -69.65 L-164.9 -72.55 -165.35 -72.9 Q-168.4 -74.9 -170.3 -76.65 L-173.1 -86.3 -174.15 -90.0 -175.85 -96.7 -176.05 -100.85 -176.3 -105.05 -176.5 -110.25 -176.6 -113.0 -176.75 -118.45 -176.75 -119.55 Q-176.45 -121.3 -175.55 -123.4 L-175.25 -124.05 -175.25 -124.1 -175.05 -126.35 -175.0 -126.8 Q-175.05 -126.4 -174.7 -126.4 L-174.65 -125.3 -174.35 -126.05 -174.5 -126.35 -177.75 -131.2 M-165.6 -115.0 Q-167.6 -119.85 -167.95 -119.85 L-170.15 -119.55 -170.85 -119.45 -173.6 -119.15 -175.4 -119.15 -175.45 -115.2 Q-175.45 -113.05 -174.9 -110.25 L-173.65 -105.05 -172.3 -100.85 -171.9 -99.75 Q-168.35 -89.75 -168.35 -88.95 -168.35 -87.5 -162.55 -80.45 L-156.75 -73.6 -155.65 -73.0 -153.5 -72.55 -153.3 -73.75 -153.1 -75.1 Q-153.1 -81.1 -155.8 -90.4 L-158.85 -100.85 -160.0 -105.05 -160.2 -105.7 Q-160.65 -107.8 -162.05 -110.25 -163.4 -112.5 -165.6 -115.0 M-171.9 -108.65 L-170.35 -105.05 -168.45 -100.85 -168.0 -99.9 Q-162.3 -87.8 -162.0 -85.75 L-165.0 -91.35 Q-167.8 -96.65 -169.5 -100.85 L-171.0 -105.05 -171.9 -108.65 M-150.35 -99.65 L-151.75 -100.85 -151.85 -100.95 -151.7 -101.1 -151.85 -101.15 -152.25 -101.25 -153.25 -100.85 Q-153.9 -100.3 -154.2 -99.0 L-154.45 -95.1 Q-154.45 -93.8 -150.85 -88.6 -147.25 -83.45 -147.25 -81.25 -147.25 -80.45 -146.45 -79.1 L-145.1 -76.9 Q-144.05 -77.55 -143.0 -81.45 -142.1 -84.8 -142.1 -86.2 -142.1 -87.35 -142.85 -90.0 L-143.0 -90.4 -144.8 -92.1 -144.8 -91.95 -145.0 -92.3 -147.2 -94.25 -147.2 -95.5 -147.4 -95.9 -149.3 -98.7 -150.35 -99.65 M-125.2 -105.05 L-126.55 -100.85 -126.75 -99.85 -126.65 -98.35 -126.6 -98.3 -126.6 -98.25 -132.5 -86.65 Q-135.55 -80.45 -138.3 -75.7 L-140.05 -72.9 -138.35 -72.55 -137.3 -72.55 Q-133.15 -72.55 -125.6 -78.55 -118.3 -84.45 -116.25 -88.95 -113.2 -95.6 -111.85 -99.65 L-111.4 -100.85 -110.2 -105.05 Q-109.2 -109.15 -109.2 -112.25 -109.2 -114.4 -110.25 -118.85 -111.4 -123.65 -112.4 -124.6 L-114.1 -123.1 -114.15 -122.65 -114.35 -122.85 -117.0 -119.75 Q-120.45 -115.4 -122.65 -111.5 -123.4 -110.25 -125.05 -105.4 L-125.2 -105.05 M-126.25 -93.55 Q-123.65 -99.05 -123.45 -100.85 L-123.45 -101.1 Q-123.45 -101.55 -123.8 -102.3 L-124.2 -103.5 -123.45 -105.05 -119.6 -110.4 -116.1 -114.7 Q-117.65 -110.25 -120.05 -105.05 L-122.2 -100.85 -122.65 -100.1 -126.25 -93.55 M-114.0 -123.5 L-114.0 -124.0 -114.1 -123.1 -114.0 -123.5" fill="#705736" fill-rule="evenodd" stroke="none"/>
    <path d="M-114.55 5.65 L-125.6 5.65 -123.6 -0.7 -129.7 -1.5 Q-133.3 -1.5 -141.25 0.2 L-144.5 0.9 -145.15 1.05 -150.75 2.4 -150.2 5.65 -152.05 5.65 -152.1 5.6 -152.95 3.0 -155.45 -5.2 -157.5 -13.15 Q-158.75 -19.0 -162.95 -27.3 L-166.85 -34.5 Q-166.85 -36.4 -165.5 -40.8 L-164.2 -44.85 -166.35 -50.15 -167.8 -54.05 -166.3 -57.4 -166.2 -57.85 Q-165.55 -59.65 -165.55 -60.85 L-165.75 -63.1 -165.9 -64.1 -166.05 -64.55 -166.5 -65.65 Q-168.4 -70.65 -170.3 -76.65 -168.4 -74.9 -165.35 -72.9 L-164.9 -72.55 -162.65 -67.4 -161.6 -64.85 Q-160.45 -62.0 -160.45 -61.25 -160.45 -60.25 -162.5 -55.8 L-164.55 -51.4 Q-161.3 -44.75 -161.3 -44.3 -161.3 -43.05 -161.85 -40.15 -162.45 -37.25 -162.45 -35.35 L-160.0 -29.4 Q-157.6 -22.95 -157.45 -20.1 -157.35 -17.9 -154.75 -11.35 L-152.6 -5.55 -148.7 -6.0 -143.0 -6.6 -141.25 -6.75 -137.55 -7.1 Q-139.5 -5.85 -139.5 -5.05 -139.5 -4.0 -136.75 -3.1 -134.5 -2.3 -133.15 -2.3 L-130.65 -2.7 Q-130.1 -2.95 -129.7 -3.4 -129.35 -2.7 -128.75 -2.7 L-127.8 -2.9 -126.25 -3.2 Q-125.7 -3.25 -124.95 -3.85 L-124.7 -4.0 -123.65 -4.15 -119.55 -4.5 -119.45 -4.5 Q-119.35 -2.6 -118.45 -1.6 -117.25 -0.2 -114.5 -0.2 L-114.15 -0.2 -114.35 2.8 -114.55 5.65 M-173.6 -119.15 L-173.1 -116.65 Q-172.2 -112.95 -172.2 -111.5 L-172.15 -110.25 -171.9 -108.65 -171.0 -105.05 -169.5 -100.85 Q-167.8 -96.65 -165.0 -91.35 L-162.0 -85.75 Q-157.7 -78.2 -154.9 -75.45 L-154.9 -78.35 Q-155.05 -79.75 -157.15 -86.95 -159.15 -93.7 -159.15 -96.55 L-160.6 -99.95 -161.0 -100.85 Q-162.0 -103.4 -162.0 -104.2 L-162.1 -105.05 Q-162.35 -106.85 -163.65 -110.25 L-164.9 -113.3 -165.6 -115.0 Q-163.4 -112.5 -162.05 -110.25 -160.65 -107.8 -160.2 -105.7 L-160.0 -105.05 -158.85 -100.85 -155.8 -90.4 Q-153.1 -81.1 -153.1 -75.1 L-153.3 -73.75 -153.5 -72.55 -155.65 -73.0 -156.75 -73.6 -162.55 -80.45 Q-168.35 -87.5 -168.35 -88.95 -168.35 -89.75 -171.9 -99.75 L-172.3 -100.85 -173.65 -105.05 -174.9 -110.25 Q-175.45 -113.05 -175.45 -115.2 L-175.4 -119.15 -173.6 -119.15 M-151.95 -65.85 L-149.6 -65.1 -152.1 -65.25 -152.1 -65.6 -151.95 -65.85 M-148.9 -65.05 L-146.25 -64.15 -143.9 -62.0 Q-142.8 -60.85 -141.35 -60.85 L-138.4 -61.35 Q-137.05 -61.7 -135.25 -62.35 L-133.7 -62.95 -128.5 -64.85 -126.6 -65.4 -125.95 -65.75 -120.5 -68.45 Q-109.25 -74.05 -104.85 -76.05 L-104.5 -76.25 -104.55 -76.0 -106.25 -69.55 Q-108.45 -61.45 -108.7 -57.85 L-108.75 -56.9 -108.5 -55.7 -110.1 -49.9 -111.8 -43.2 -110.3 -37.35 Q-110.3 -35.95 -111.2 -30.35 -112.35 -23.5 -113.0 -15.3 L-113.15 -12.65 Q-117.1 -10.95 -120.2 -10.05 L-118.3 -15.3 -117.2 -18.3 Q-114.8 -25.1 -114.8 -26.8 -114.8 -29.3 -116.4 -32.15 -118.05 -35.05 -118.05 -35.95 L-112.45 -56.55 -113.5 -57.55 -114.6 -58.7 -113.05 -63.9 -110.9 -70.0 -113.8 -70.0 -114.7 -69.65 -115.05 -69.55 -115.0 -69.45 Q-117.7 -68.55 -123.95 -65.1 -130.8 -61.3 -132.35 -59.7 L-137.1 -54.05 -137.15 -54.0 Q-140.7 -49.85 -141.4 -49.85 -142.1 -49.85 -143.5 -53.65 -145.15 -58.2 -146.1 -59.35 -146.8 -60.15 -148.25 -63.55 L-149.0 -65.0 -148.9 -65.05 M-144.8 -91.95 L-144.8 -92.1 -143.0 -90.4 -142.85 -90.0 Q-142.1 -87.35 -142.1 -86.2 -142.1 -84.8 -143.0 -81.45 -144.05 -77.55 -145.1 -76.9 L-146.45 -79.1 Q-147.25 -80.45 -147.25 -81.25 -147.25 -83.45 -150.85 -88.6 -154.45 -93.8 -154.45 -95.1 L-154.2 -99.0 Q-153.9 -100.3 -153.25 -100.85 L-152.25 -101.25 -151.85 -101.15 -151.7 -101.1 -151.85 -100.95 -151.75 -100.85 -150.35 -99.65 -151.05 -98.55 Q-152.25 -96.45 -152.25 -94.9 -152.25 -93.6 -148.6 -88.8 -145.15 -84.2 -143.95 -83.45 -143.55 -85.9 -143.55 -89.85 L-144.8 -91.95 M-125.2 -105.05 L-125.05 -105.4 Q-123.4 -110.25 -122.65 -111.5 -120.45 -115.4 -117.0 -119.75 L-114.35 -122.85 -114.15 -122.65 -114.1 -123.1 -112.4 -124.6 Q-111.4 -123.65 -110.25 -118.85 -109.2 -114.4 -109.2 -112.25 -109.2 -109.15 -110.2 -105.05 L-111.4 -100.85 -111.85 -99.65 Q-113.2 -95.6 -116.25 -88.95 -118.3 -84.45 -125.6 -78.55 -133.15 -72.55 -137.3 -72.55 L-138.35 -72.55 -140.05 -72.9 -138.3 -75.7 Q-135.55 -80.45 -132.5 -86.65 L-126.6 -98.25 -126.6 -98.3 -126.65 -98.35 -126.75 -99.85 -126.55 -100.85 -125.2 -105.05 M-116.1 -114.7 L-119.6 -110.4 -123.45 -105.05 -124.2 -103.5 -123.8 -102.3 Q-123.45 -101.55 -123.45 -101.1 L-123.45 -100.85 Q-123.65 -99.05 -126.25 -93.55 L-131.9 -83.45 -132.7 -81.95 -133.65 -80.5 Q-135.05 -77.95 -134.85 -76.55 -121.15 -84.5 -116.45 -100.85 -115.85 -102.9 -115.4 -105.05 -114.6 -108.85 -114.25 -112.95 L-114.25 -116.2 -114.65 -116.6 -116.1 -114.7" fill="#7d5f3b" fill-rule="evenodd" stroke="none"/>
    <path d="M16.5 -46.5 Q18.2 -38.95 16.9 -32.65 L16.9 -32.6 Q11.0 -21.7 10.3 -18.7 6.3 -11.35 6.3 -9.3 6.3 -7.5 8.5 1.75 L9.45 5.65 -3.1 5.65 -3.05 2.05 Q-3.05 -4.5 -5.05 -10.55 -7.1 -15.45 -7.1 -16.5 L-3.45 -23.4 Q0.45 -30.25 0.85 -32.25 L3.25 -41.55 Q4.75 -47.45 4.75 -51.0 4.75 -52.35 3.15 -57.55 L1.5 -62.9 Q1.5 -64.4 -2.1 -68.55 L-5.8 -72.55 -2.6 -74.8 4.05 -66.75 Q12.15 -56.75 12.15 -55.35 L15.7 -48.2 16.5 -46.5 M-125.6 5.65 L-150.2 5.65 -150.75 2.4 -145.15 1.05 -144.5 0.9 -141.25 0.2 Q-133.3 -1.5 -129.7 -1.5 L-123.6 -0.7 -125.6 5.65 M-261.15 5.65 L-271.5 5.65 -268.7 -6.5 Q-268.7 -7.8 -271.75 -13.9 L-272.5 -15.5 -274.0 -19.8 Q-276.15 -25.4 -276.15 -28.35 L-276.15 -28.55 Q-273.6 -42.8 -266.95 -52.1 -264.05 -56.2 -259.15 -61.1 L-253.7 -66.4 -251.4 -66.05 -254.0 -63.0 -254.05 -62.9 -259.15 -55.35 Q-261.6 -51.65 -262.85 -46.25 -263.85 -41.65 -263.85 -36.65 -263.85 -27.3 -260.7 -19.55 L-258.55 -14.4 Q-257.55 -11.7 -257.55 -9.5 L-257.1 -8.2 Q-256.65 -7.5 -256.65 -6.95 L-259.55 0.95 -261.15 5.65 M-173.6 -119.15 L-170.85 -119.45 -170.15 -119.55 -167.95 -119.85 Q-167.6 -119.85 -165.6 -115.0 L-164.9 -113.3 -163.65 -110.25 Q-162.35 -106.85 -162.1 -105.05 L-162.0 -104.2 Q-162.0 -103.4 -161.0 -100.85 L-160.6 -99.95 -159.15 -96.55 Q-159.15 -93.7 -157.15 -86.95 -155.05 -79.75 -154.9 -78.35 L-154.9 -75.45 Q-157.7 -78.2 -162.0 -85.75 -162.3 -87.8 -168.0 -99.9 L-168.45 -100.85 -170.35 -105.05 -171.9 -108.65 -172.15 -110.25 -172.2 -111.5 Q-172.2 -112.95 -173.1 -116.65 L-173.6 -119.15 M-164.9 -72.55 L-160.0 -69.65 Q-155.55 -67.25 -152.15 -65.95 L-151.95 -65.85 -152.1 -65.6 -152.1 -65.25 -149.6 -65.1 -149.0 -65.05 -148.9 -65.05 -149.0 -65.0 -148.25 -63.55 Q-146.8 -60.15 -146.1 -59.35 -145.15 -58.2 -143.5 -53.65 -142.1 -49.85 -141.4 -49.85 -140.7 -49.85 -137.15 -54.0 L-137.1 -54.05 -132.35 -59.7 Q-130.8 -61.3 -123.95 -65.1 -117.7 -68.55 -115.0 -69.45 L-115.05 -69.55 -114.7 -69.65 -113.8 -70.0 -110.9 -70.0 -113.05 -63.9 -114.6 -58.7 -113.5 -57.55 -112.45 -56.55 -118.05 -35.95 Q-118.05 -35.05 -116.4 -32.15 -114.8 -29.3 -114.8 -26.8 -114.8 -25.1 -117.2 -18.3 L-118.3 -15.3 -120.2 -10.05 -121.1 -9.85 -126.75 -8.75 -126.9 -8.85 Q-127.7 -9.45 -128.2 -9.45 L-129.25 -9.1 Q-129.85 -8.7 -130.35 -8.55 L-131.7 -8.3 -131.9 -8.2 -132.1 -8.25 -133.65 -8.7 Q-134.8 -8.7 -137.1 -7.35 L-137.55 -7.1 -141.25 -6.75 -143.0 -6.6 -148.7 -6.0 -152.6 -5.55 -154.75 -11.35 Q-157.35 -17.9 -157.45 -20.1 -157.6 -22.95 -160.0 -29.4 L-162.45 -35.35 Q-162.45 -37.25 -161.85 -40.15 -161.3 -43.05 -161.3 -44.3 -161.3 -44.75 -164.55 -51.4 L-162.5 -55.8 Q-160.45 -60.25 -160.45 -61.25 -160.45 -62.0 -161.6 -64.85 L-162.65 -67.4 -164.9 -72.55 M-144.8 -91.95 L-143.55 -89.85 Q-143.55 -85.9 -143.95 -83.45 -145.15 -84.2 -148.6 -88.8 -152.25 -93.6 -152.25 -94.9 -152.25 -96.45 -151.05 -98.55 L-150.35 -99.65 -149.3 -98.7 -147.4 -95.9 -147.2 -95.5 -147.2 -94.25 -145.0 -92.3 -144.8 -91.95 M-126.25 -93.55 L-122.65 -100.1 -122.2 -100.85 -120.05 -105.05 Q-117.65 -110.25 -116.1 -114.7 L-114.65 -116.6 -114.25 -116.2 -114.25 -112.95 Q-114.6 -108.85 -115.4 -105.05 -115.85 -102.9 -116.45 -100.85 -121.15 -84.5 -134.85 -76.55 -135.05 -77.95 -133.65 -80.5 L-132.7 -81.95 -131.9 -83.45 -126.25 -93.55" fill="#856941" fill-rule="evenodd" stroke="none"/>
    <path d="M-179.9 -128.45 L-179.35 -129.1 -177.75 -131.2 -174.5 -126.35 -174.35 -126.05 -174.65 -125.3 -174.7 -126.4 Q-175.05 -126.4 -175.0 -126.8 L-175.05 -126.35 -175.25 -124.1 -175.25 -124.05 -175.55 -123.4 Q-176.45 -121.3 -176.75 -119.55 L-176.75 -118.45 -176.6 -113.0 -176.5 -110.25 -176.3 -105.05 -176.05 -100.85 -175.85 -96.7 -176.75 -100.85 -177.55 -105.05 -178.35 -110.25 -179.0 -116.55 -179.1 -117.95 -179.2 -119.8 -179.25 -120.8 -179.6 -125.3 -179.7 -126.35 -179.75 -126.8 -179.9 -128.45 M-98.1 -99.55 L-98.2 -99.75 -98.35 -100.05 -98.7 -100.85 -99.4 -103.5 -99.6 -105.05 -100.0 -106.6 Q-100.5 -108.35 -100.45 -109.3 L-100.85 -109.3 Q-101.2 -108.0 -103.75 -105.3 L-103.75 -107.85 Q-102.55 -111.7 -102.55 -117.7 L-102.55 -124.0 -102.85 -126.35 -102.95 -127.1 -103.65 -132.8 -101.35 -126.35 -97.85 -117.25 Q-96.05 -112.55 -96.05 -110.2 -96.05 -108.05 -96.7 -105.05 L-96.8 -104.45 -96.85 -104.4 -97.15 -103.15 -97.75 -100.85 -98.1 -99.55" fill="#634b2f" fill-rule="evenodd" stroke="none"/>
    <path d="M-180.75 -127.45 L-179.9 -128.45 -179.75 -126.8 -179.7 -126.35 -179.6 -125.3 -179.25 -120.8 -179.2 -119.8 -179.1 -117.95 -179.0 -116.55 -178.35 -110.25 -177.55 -105.05 -176.75 -100.85 -175.85 -96.7 -174.15 -90.0 -173.1 -86.3 Q-174.15 -87.3 -175.65 -87.3 -177.15 -87.3 -178.6 -85.7 L-180.5 -92.4 Q-181.85 -97.25 -181.85 -98.15 -181.85 -99.15 -182.3 -100.85 L-182.95 -102.95 -183.6 -105.05 Q-183.95 -106.55 -183.9 -107.35 -183.7 -109.3 -183.95 -113.15 L-184.2 -117.2 Q-184.2 -120.15 -183.3 -122.65 -182.65 -124.4 -181.45 -126.35 L-180.75 -127.45 M-101.3 -133.05 L-98.75 -130.6 -97.1 -126.35 -96.35 -124.35 Q-92.65 -114.65 -92.65 -114.05 L-92.2 -112.7 Q-91.7 -111.85 -91.7 -111.35 L-93.35 -105.05 -94.05 -102.45 -94.45 -100.85 -95.45 -96.85 -96.55 -92.05 -99.35 -91.85 -100.4 -91.45 -98.2 -99.25 -98.1 -99.55 -97.75 -100.85 -97.15 -103.15 -96.85 -104.4 -96.8 -104.45 -96.7 -105.05 Q-95.1 -111.3 -95.1 -115.1 -95.1 -117.65 -96.85 -121.9 L-98.6 -126.35 -98.65 -126.55 -101.3 -133.05 M-82.0 -82.35 L-83.05 -88.4 -83.2 -89.15 -84.65 -98.1 -84.8 -100.85 -85.15 -104.9 -85.15 -105.05 -85.65 -112.15 -85.65 -112.3 -85.85 -115.95 -84.75 -114.05 -84.95 -111.4 -84.85 -110.8 -84.25 -104.35 -82.95 -100.85 -80.35 -92.85 -79.45 -89.95 -78.6 -87.05 -78.2 -85.6 -78.3 -85.4 -78.6 -85.5 -80.75 -83.3 -82.0 -82.35 M-88.55 -83.45 L-88.35 -83.65 -88.35 -83.25 -88.55 -83.45" fill="#7a625b" fill-rule="evenodd" stroke="none"/>
    <path d="M-198.0 -108.3 L-195.7 -110.0 -195.4 -110.25 -194.35 -111.1 -194.15 -111.25 -193.1 -112.2 -193.85 -110.95 -193.95 -110.85 -194.0 -110.7 -193.9 -110.8 -192.65 -112.2 -192.45 -112.4 -188.5 -116.6 -187.7 -117.4 -187.95 -114.7 -188.4 -110.25 -188.5 -109.0 -188.6 -107.85 -188.9 -107.9 -189.9 -105.05 -191.45 -100.85 -193.45 -96.2 Q-197.8 -86.15 -203.15 -80.6 L-197.8 -84.7 -200.9 -78.85 -204.25 -76.25 -205.05 -75.65 Q-204.55 -75.9 -204.1 -76.1 L-201.85 -77.1 -202.95 -75.1 -205.9 -69.8 Q-214.15 -64.75 -239.05 -52.6 L-233.55 -57.9 Q-228.65 -62.25 -228.3 -62.9 L-232.4 -61.55 -236.4 -60.1 -236.4 -60.45 -231.8 -63.95 -232.15 -63.95 -241.0 -61.15 -248.7 -58.3 -246.95 -60.6 -246.75 -60.85 -241.95 -67.05 -242.45 -67.05 -247.5 -67.35 -250.0 -67.4 -252.6 -67.5 -253.05 -67.5 -251.85 -68.25 -243.05 -73.65 Q-233.6 -79.4 -232.15 -80.95 L-234.45 -80.55 Q-227.75 -84.8 -215.3 -94.4 L-207.05 -100.85 -201.85 -105.05 -198.0 -108.3 M-88.15 -119.35 L-86.0 -117.8 -84.4 -116.7 -83.45 -116.1 -82.85 -115.65 -80.75 -114.35 Q-78.85 -113.2 -72.15 -110.45 L-70.6 -109.85 -70.6 -110.1 -70.55 -110.1 -68.95 -109.7 -66.65 -108.8 -57.65 -105.05 Q-49.8 -101.7 -49.8 -100.9 L-31.9 -95.0 Q-12.5 -88.6 -6.65 -86.05 L-6.7 -85.15 -14.65 -83.75 Q-13.25 -83.65 -12.25 -82.8 -11.35 -82.1 -11.35 -81.4 -11.35 -80.7 -10.9 -80.65 L-10.4 -80.5 -28.05 -80.5 Q-18.85 -78.0 -16.8 -76.95 L-9.5 -72.5 -9.5 -72.4 -14.25 -72.4 -7.7 -67.3 -6.0 -65.95 Q-16.25 -69.3 -30.5 -71.9 L-46.4 -74.4 Q-64.3 -77.35 -73.55 -79.6 -73.05 -79.6 -73.05 -80.0 L-60.3 -80.2 -47.6 -80.5 -61.55 -85.1 -72.95 -88.75 -64.9 -89.25 -56.75 -89.7 -71.15 -91.4 -74.6 -91.95 -76.85 -92.3 -80.4 -99.9 -80.85 -100.85 -82.8 -105.05 -84.05 -108.3 Q-84.05 -109.25 -84.85 -110.8 L-84.95 -111.4 -84.75 -114.05 -85.85 -115.95 -88.15 -119.35 M-194.0 -110.7 L-194.05 -110.65 -194.0 -110.65 -194.0 -110.7 M-234.45 -80.55 L-235.4 -80.0 -235.9 -80.0 -234.45 -80.55 M-239.05 -52.6 L-239.3 -52.3 -239.65 -52.3 -239.05 -52.6 M-15.45 -27.95 L-21.05 -29.15 -21.85 -29.4 -22.25 -29.45 Q-32.55 -32.15 -33.85 -35.05 L-24.6 -35.05 -24.6 -35.55 -27.65 -36.15 Q-29.9 -36.6 -30.6 -37.3 -28.85 -37.25 -25.05 -38.25 L-20.9 -39.15 -20.9 -39.6 -21.75 -39.9 Q-22.3 -40.2 -22.3 -40.55 -20.85 -40.55 -20.85 -41.05 -24.6 -43.4 -36.2 -49.75 L-40.75 -52.25 -37.55 -52.25 -32.45 -51.2 -27.6 -50.35 -25.15 -51.3 Q-22.55 -52.25 -21.35 -52.25 -21.35 -54.2 -19.85 -54.05 L-18.05 -53.6 Q-27.55 -59.0 -28.65 -60.05 -28.2 -60.05 -28.2 -60.5 L-19.95 -60.75 -19.95 -58.85 Q-19.15 -57.25 -17.2 -54.9 L-14.25 -51.85 Q-15.7 -51.85 -16.55 -51.0 -17.35 -50.05 -18.25 -50.05 L-19.65 -50.35 -21.3 -51.0 -21.3 -47.9 -20.7 -47.85 Q-20.45 -47.7 -20.45 -47.05 L-21.3 -45.1 Q-21.3 -42.65 -19.55 -40.7 -17.4 -38.35 -16.95 -36.55 -18.55 -36.9 -26.85 -33.55 -25.25 -32.7 -20.45 -31.25 L-18.5 -30.7 -12.5 -29.0 -15.45 -27.95" fill="#69544e" fill-rule="evenodd" stroke="none"/>
    <path d="M-25.7 5.65 L-53.55 5.65 -58.7 2.4 -59.75 1.75 -60.45 1.4 -66.7 -2.45 -66.5 -2.6 -48.15 1.1 -40.6 2.55 -40.6 1.65 -46.15 -4.85 Q-40.5 -2.5 -34.0 1.3 -29.9 3.7 -25.7 5.65 M-88.55 5.65 L-101.2 5.65 -100.05 -6.05 -97.25 -29.6 -97.75 -31.65 -98.3 -33.95 Q-98.3 -36.8 -101.7 -46.35 -105.2 -55.9 -105.2 -61.5 -105.2 -64.75 -104.6 -69.2 L-104.4 -70.45 -104.15 -72.05 -103.35 -74.95 -103.05 -75.8 Q-102.4 -77.45 -101.55 -78.45 -100.25 -80.1 -97.4 -80.8 -94.35 -81.65 -93.05 -83.0 L-91.75 -84.75 Q-91.0 -86.15 -90.35 -88.15 L-89.9 -86.8 -89.6 -85.7 -88.55 -83.45 -88.35 -83.25 -88.3 -83.2 -88.15 -83.05 -88.1 -82.6 -88.0 -81.95 -87.8 -79.5 -87.1 -78.5 -86.4 -77.0 Q-88.45 -76.25 -90.55 -76.0 L-93.35 -75.6 Q-94.35 -75.3 -95.5 -74.2 -97.15 -72.6 -99.1 -69.25 -100.4 -67.0 -101.1 -62.8 -101.7 -59.5 -101.7 -56.35 -101.7 -54.55 -100.65 -52.05 -99.65 -49.6 -99.65 -49.0 L-95.45 -40.3 Q-91.25 -30.5 -91.25 -24.25 L-90.75 -12.15 -86.85 -14.25 Q-78.1 -18.85 -74.8 -20.2 -75.4 -18.9 -81.2 -13.75 -86.65 -8.9 -87.4 -8.6 L-75.8 -8.6 -69.65 -9.8 -65.05 -10.4 -61.4 -10.4 -69.45 -5.6 -70.05 -5.2 -80.3 0.8 -88.55 5.65 M-160.65 5.65 L-171.0 5.65 -171.15 1.4 Q-171.5 -7.5 -171.8 -9.25 -172.0 -10.25 -177.2 -14.75 L-181.95 -18.8 -181.95 -19.5 -180.45 -33.9 Q-179.0 -46.9 -179.0 -49.35 -179.0 -51.05 -180.45 -54.6 -182.6 -59.8 -183.5 -62.9 L-188.35 -59.45 -192.7 -56.2 -192.7 -58.3 -191.15 -65.4 -190.2 -66.45 -189.85 -66.9 -189.95 -66.4 -190.15 -65.4 -189.15 -66.05 -188.85 -66.25 -180.05 -72.75 Q-179.3 -72.75 -175.0 -68.9 -171.75 -66.0 -170.8 -64.35 -170.45 -63.7 -170.45 -63.25 -170.45 -62.65 -167.9 -59.45 L-167.4 -58.8 Q-169.7 -52.5 -173.85 -42.35 -177.7 -32.0 -177.7 -24.8 -177.7 -24.05 -173.55 -21.2 L-168.9 -18.1 -164.75 -14.15 -162.25 -11.4 Q-161.7 -8.35 -161.65 -4.3 L-161.65 -2.45 Q-161.65 0.15 -160.65 5.65 M-185.4 5.65 L-211.1 5.65 -203.55 2.05 Q-183.9 -7.1 -177.8 -8.55 -178.35 -7.45 -190.2 2.75 L-190.2 3.05 -185.4 0.95 Q-180.35 -1.2 -178.55 -1.5 L-178.2 -1.5 -185.4 5.65 M-223.05 5.65 L-231.7 5.65 -231.7 4.9 -223.4 -4.75 -215.15 -14.55 Q-215.15 -14.05 -217.7 -9.3 L-220.5 -3.95 -220.5 -3.6 -213.9 -7.5 Q-207.35 -11.3 -206.0 -11.7 L-209.85 -8.1 Q-214.05 -4.25 -216.35 -0.8 -217.8 1.45 -223.05 5.65" fill="#574540" fill-rule="evenodd" stroke="none"/>
    <path d="M-24.7 5.65 L-25.7 5.65 Q-29.9 3.7 -34.0 1.3 -40.5 -2.5 -46.15 -4.85 L-40.6 1.65 -40.6 2.55 -48.15 1.1 -66.5 -2.6 -66.7 -2.45 -60.45 1.4 -59.75 1.75 -58.7 2.4 -53.55 5.65 -88.55 5.65 -80.3 0.8 -70.05 -5.2 -69.45 -5.6 -61.4 -10.4 -65.05 -10.4 -69.65 -9.8 -75.8 -8.6 -87.4 -8.6 Q-86.65 -8.9 -81.2 -13.75 -75.4 -18.9 -74.8 -20.2 -78.1 -18.85 -86.85 -14.25 L-90.75 -12.15 -91.25 -24.25 Q-91.25 -30.5 -95.45 -40.3 L-99.65 -49.0 Q-99.65 -49.6 -100.65 -52.05 -101.7 -54.55 -101.7 -56.35 -101.7 -59.5 -101.1 -62.8 -100.4 -67.0 -99.1 -69.25 -97.15 -72.6 -95.5 -74.2 -94.35 -75.3 -93.35 -75.6 L-90.55 -76.0 Q-88.45 -76.25 -86.4 -77.0 L-87.1 -78.5 -87.8 -79.5 -88.0 -81.95 -88.1 -82.6 -88.15 -83.05 -87.3 -82.4 -86.0 -81.85 -83.85 -81.6 Q-83.1 -81.6 -82.0 -82.35 L-80.75 -83.3 -78.6 -85.5 -78.3 -85.4 -78.1 -85.3 -78.2 -85.6 -78.6 -87.05 -79.45 -89.95 -80.35 -92.85 -82.95 -100.85 -84.25 -104.35 -84.85 -110.8 Q-84.05 -109.25 -84.05 -108.3 L-82.8 -105.05 -80.85 -100.85 -80.4 -99.9 -76.85 -92.3 -74.6 -91.95 -71.15 -91.4 -56.75 -89.7 -64.9 -89.25 -72.95 -88.75 -61.55 -85.1 -47.6 -80.5 -60.3 -80.2 -73.05 -80.0 Q-73.05 -79.6 -73.55 -79.6 -64.3 -77.35 -46.4 -74.4 L-30.5 -71.9 Q-16.25 -69.3 -6.0 -65.95 L0.15 -61.5 -3.1 -62.1 -7.7 -62.8 -10.95 -62.6 -15.05 -62.05 -19.95 -61.5 -19.95 -60.75 -28.2 -60.5 Q-28.2 -60.05 -28.65 -60.05 -27.55 -59.0 -18.05 -53.6 L-19.85 -54.05 Q-21.35 -54.2 -21.35 -52.25 -22.55 -52.25 -25.15 -51.3 L-27.6 -50.35 -32.45 -51.2 -37.55 -52.25 -40.75 -52.25 -36.2 -49.75 Q-24.6 -43.4 -20.85 -41.05 -20.85 -40.55 -22.3 -40.55 -22.3 -40.2 -21.75 -39.9 L-20.9 -39.6 -20.9 -39.15 -25.05 -38.25 Q-28.85 -37.25 -30.6 -37.3 -29.9 -36.6 -27.65 -36.15 L-24.6 -35.55 -24.6 -35.05 -33.85 -35.05 Q-32.55 -32.15 -22.25 -29.45 L-21.85 -29.4 -21.05 -29.15 -15.45 -27.95 -19.4 -26.75 -19.8 -26.65 -26.9 -24.65 -26.05 -22.95 -25.05 -21.7 -25.15 -20.75 -28.25 -20.75 -25.15 -18.9 -25.15 -18.25 -28.2 -18.25 Q-27.65 -18.25 -23.95 -16.4 L-16.4 -12.65 -16.4 -12.0 -20.75 -11.0 -25.7 -9.6 Q-34.1 -7.15 -35.9 -6.3 L-31.95 -5.5 -26.45 -5.05 -21.15 -5.05 -20.85 -5.05 -20.9 -4.8 Q-21.25 -4.15 -23.3 -3.15 L-27.1 -1.3 -27.1 -0.65 -19.55 -0.65 Q-19.9 0.1 -24.25 5.15 L-24.7 5.65 M-171.0 5.65 L-185.4 5.65 -178.2 -1.5 -178.55 -1.5 Q-180.35 -1.2 -185.4 0.95 L-190.2 3.05 -190.2 2.75 Q-178.35 -7.45 -177.8 -8.55 -183.9 -7.1 -203.55 2.05 L-211.1 5.65 -223.05 5.65 Q-217.8 1.45 -216.35 -0.8 -214.05 -4.25 -209.85 -8.1 L-206.0 -11.7 Q-207.35 -11.3 -213.9 -7.5 L-220.5 -3.6 -220.5 -3.95 -217.7 -9.3 Q-215.15 -14.05 -215.15 -14.55 L-223.4 -4.75 -231.7 4.9 -231.7 -1.85 -230.8 -2.8 Q-230.4 -3.3 -230.4 -3.75 L-233.55 -3.75 -236.35 -3.05 Q-236.75 -2.9 -237.1 -2.85 -238.8 -2.3 -239.25 -1.85 L-242.95 -1.85 -238.3 -8.3 -238.0 -8.75 -233.45 -14.5 -241.0 -14.9 -244.1 -15.15 -248.05 -15.6 -248.6 -15.7 -248.6 -16.35 -242.1 -19.9 -241.9 -19.95 Q-238.3 -22.1 -237.75 -22.6 -239.7 -22.6 -239.7 -23.25 L-236.25 -25.9 -232.8 -28.35 Q-233.2 -28.35 -233.4 -28.65 L-233.45 -29.0 Q-233.75 -29.05 -241.6 -32.65 L-245.35 -34.4 -247.85 -35.6 Q-255.7 -39.2 -257.35 -39.6 L-246.7 -40.2 -246.2 -40.3 Q-238.4 -41.45 -237.7 -42.15 -238.1 -42.15 -238.3 -42.45 L-238.35 -42.8 Q-238.85 -42.8 -239.7 -43.5 L-240.9 -44.7 Q-238.3 -46.0 -236.4 -46.0 L-236.4 -46.55 -240.45 -46.0 -243.35 -45.5 Q-243.75 -50.65 -241.75 -53.95 -239.45 -56.6 -238.95 -57.55 L-245.2 -57.3 -245.55 -57.3 -249.55 -57.15 -251.25 -57.1 -248.7 -58.3 -241.0 -61.15 -232.15 -63.95 -231.8 -63.95 -236.4 -60.45 -236.4 -60.1 -232.4 -61.55 -228.3 -62.9 Q-228.65 -62.25 -233.55 -57.9 L-239.05 -52.6 Q-214.15 -64.75 -205.9 -69.8 L-202.95 -75.1 -201.85 -77.1 -204.1 -76.1 Q-204.55 -75.9 -205.05 -75.65 L-204.25 -76.25 -200.9 -78.85 -197.8 -84.7 -203.15 -80.6 Q-197.8 -86.15 -193.45 -96.2 L-191.45 -100.85 -189.9 -105.05 -188.9 -107.9 -188.6 -107.85 -188.85 -105.05 -189.3 -100.85 -189.5 -99.4 -190.8 -86.5 -191.8 -77.45 Q-191.8 -76.4 -191.3 -76.7 L-191.8 -75.0 -192.6 -71.9 -193.6 -68.05 -194.75 -63.8 -194.4 -62.35 -193.8 -62.8 Q-192.5 -63.85 -191.15 -65.4 L-192.7 -58.3 -192.7 -56.2 -188.35 -59.45 -183.5 -62.9 Q-182.6 -59.8 -180.45 -54.6 -179.0 -51.05 -179.0 -49.35 -179.0 -46.9 -180.45 -33.9 L-181.95 -19.5 -181.95 -18.8 -177.2 -14.75 Q-172.0 -10.25 -171.8 -9.25 -171.5 -7.5 -171.15 1.4 L-171.0 5.65 M-239.05 -52.6 L-239.65 -52.3 -239.3 -52.3 -239.05 -52.6" fill="#5e4b45" fill-rule="evenodd" stroke="none"/>
    <path d="M-101.2 5.65 L-108.5 5.65 -108.15 0.75 -107.95 -0.9 -107.3 -8.55 -107.25 -8.95 Q-106.95 -12.35 -106.6 -12.9 L-106.4 -15.3 -106.35 -16.05 -104.9 -33.6 -104.8 -41.15 Q-104.8 -42.8 -106.75 -49.5 L-108.5 -55.7 -108.75 -56.9 -108.7 -57.85 Q-108.45 -61.45 -106.25 -69.55 L-104.55 -76.0 -104.5 -76.25 -103.55 -79.85 -102.2 -85.05 -101.3 -88.15 -101.2 -88.5 -100.4 -91.45 -99.35 -91.85 -96.55 -92.05 -95.85 -92.05 -94.8 -91.95 -93.0 -91.55 -92.05 -90.95 -91.5 -90.45 Q-90.9 -89.7 -90.35 -88.15 -91.0 -86.15 -91.75 -84.75 L-93.05 -83.0 Q-94.35 -81.65 -97.4 -80.8 -100.25 -80.1 -101.55 -78.45 -102.4 -77.45 -103.05 -75.8 L-103.35 -74.95 -104.15 -72.05 -104.4 -70.45 -104.6 -69.2 Q-105.2 -64.75 -105.2 -61.5 -105.2 -55.9 -101.7 -46.35 -98.3 -36.8 -98.3 -33.95 L-97.75 -31.65 -97.25 -29.6 -100.05 -6.05 -101.2 5.65 M-178.6 -85.7 Q-177.15 -87.3 -175.65 -87.3 -174.15 -87.3 -173.1 -86.3 L-170.3 -76.65 Q-168.4 -70.65 -166.5 -65.65 L-166.05 -64.55 -165.9 -64.1 -165.75 -63.1 -165.55 -60.85 Q-165.55 -59.65 -166.2 -57.85 L-166.3 -57.4 -167.8 -54.05 -168.3 -53.1 Q-171.15 -47.7 -171.25 -46.6 -171.45 -45.05 -172.75 -38.9 -173.8 -32.7 -173.8 -28.0 L-173.8 -27.55 -169.15 -23.05 -165.1 -19.1 Q-163.05 -16.45 -162.25 -11.4 L-164.75 -14.15 -168.9 -18.1 -173.55 -21.2 Q-177.7 -24.05 -177.7 -24.8 -177.7 -32.0 -173.85 -42.35 -169.7 -52.5 -167.4 -58.8 L-167.9 -59.45 Q-170.45 -62.65 -170.45 -63.25 -170.45 -63.7 -170.8 -64.35 -171.75 -66.0 -175.0 -68.9 -179.3 -72.75 -180.05 -72.75 L-188.85 -66.25 -189.15 -66.05 -190.15 -65.4 -189.95 -66.4 -189.85 -66.9 -189.55 -67.3 Q-186.55 -71.3 -183.3 -77.6 L-180.95 -82.2 -179.6 -84.4 -178.6 -85.7" fill="#473834" fill-rule="evenodd" stroke="none"/>
    <path d="M-187.7 -117.4 L-187.55 -119.5 -187.3 -119.8 -184.9 -122.95 -181.65 -126.35 -181.3 -126.85 -180.75 -127.45 -181.45 -126.35 Q-182.65 -124.4 -183.3 -122.65 -184.2 -120.15 -184.2 -117.2 L-183.95 -113.15 Q-183.7 -109.3 -183.9 -107.35 -183.95 -106.55 -183.6 -105.05 L-182.95 -102.95 -182.3 -100.85 Q-181.85 -99.15 -181.85 -98.15 -181.85 -97.25 -180.5 -92.4 L-178.6 -85.7 -179.6 -84.4 -180.95 -82.2 -187.55 -78.8 -189.0 -78.8 -189.0 -80.5 Q-188.5 -81.7 -188.9 -90.85 -189.15 -96.15 -189.5 -99.4 L-189.3 -100.85 -188.85 -105.05 -188.6 -107.85 -188.5 -109.0 -188.4 -110.25 -187.95 -114.7 -187.7 -117.4 M-98.75 -130.6 L-96.2 -128.2 -94.35 -126.35 -89.1 -120.55 -88.15 -119.35 -85.85 -115.95 -85.65 -112.3 -85.65 -112.15 -85.15 -105.05 -85.15 -104.9 -84.8 -100.85 -84.65 -98.1 -83.2 -89.15 -83.05 -88.4 -82.0 -82.35 Q-83.1 -81.6 -83.85 -81.6 L-86.0 -81.85 -86.95 -86.8 -87.65 -91.3 -88.25 -95.45 -89.0 -100.85 -89.6 -105.05 -90.4 -109.95 Q-90.55 -108.15 -91.45 -105.05 L-92.85 -100.85 -92.95 -100.6 -93.05 -100.85 -93.55 -102.6 -93.55 -99.0 -94.35 -96.05 Q-94.85 -93.9 -94.8 -91.95 L-95.85 -92.05 -96.55 -92.05 -95.45 -96.85 -94.45 -100.85 -94.05 -102.45 -93.35 -105.05 -91.7 -111.35 Q-91.7 -111.85 -92.2 -112.7 L-92.65 -114.05 Q-92.65 -114.65 -96.35 -124.35 L-97.1 -126.35 -98.75 -130.6" fill="#876c65" fill-rule="evenodd" stroke="none"/>
    <path d="M-189.5 -99.4 Q-189.15 -96.15 -188.9 -90.85 -188.5 -81.7 -189.0 -80.5 L-189.0 -78.8 -187.55 -78.8 -180.95 -82.2 -183.3 -77.6 Q-186.55 -71.3 -189.55 -67.3 L-191.4 -70.0 -192.6 -71.9 -191.8 -75.0 -191.3 -76.7 Q-191.8 -76.4 -191.8 -77.45 L-190.8 -86.5 -189.5 -99.4 M-94.8 -91.95 Q-94.85 -93.9 -94.35 -96.05 L-93.55 -99.0 -93.55 -102.6 -93.05 -100.85 -92.95 -100.6 -92.85 -100.85 -91.45 -105.05 Q-90.55 -108.15 -90.4 -109.95 L-89.6 -105.05 -89.0 -100.85 -88.25 -95.45 -87.65 -91.3 -86.95 -86.8 -86.0 -81.85 -87.3 -82.4 -88.25 -86.25 -89.05 -89.7 -91.5 -100.15 Q-91.5 -98.35 -92.05 -90.95 L-93.0 -91.55 -94.8 -91.95" fill="#94766e" fill-rule="evenodd" stroke="none"/>
    <path d="M-189.55 -67.3 L-189.85 -66.9 -190.2 -66.45 -191.15 -65.4 Q-192.5 -63.85 -193.8 -62.8 L-194.4 -62.35 -194.75 -63.8 -193.6 -68.05 -192.6 -71.9 -191.4 -70.0 -189.55 -67.3 M-88.55 -83.45 L-89.6 -85.7 -89.9 -86.8 -90.35 -88.15 Q-90.9 -89.7 -91.5 -90.45 L-92.05 -90.95 Q-91.5 -98.35 -91.5 -100.15 L-89.05 -89.7 -88.25 -86.25 -87.3 -82.4 -88.15 -83.05 -88.3 -83.2 -88.35 -83.25 -88.35 -83.65 -88.55 -83.45" fill="#a18178" fill-rule="evenodd" stroke="none"/>
    <path d="M-104.0 -135.8 L-101.3 -133.05 -98.65 -126.55 -98.6 -126.35 -96.85 -121.9 Q-95.1 -117.65 -95.1 -115.1 -95.1 -111.3 -96.7 -105.05 -96.05 -108.05 -96.05 -110.2 -96.05 -112.55 -97.85 -117.25 L-101.35 -126.35 -103.65 -132.8 -104.0 -135.8" fill="#755e57" fill-rule="evenodd" stroke="none"/>
    <path d="M-257.3 -67.15 L-260.0 -68.25 -261.55 -69.0 -260.0 -69.7 Q-251.4 -73.9 -227.35 -88.95 L-208.75 -100.85 Q-205.25 -103.15 -202.5 -105.05 L-198.0 -108.3 -201.85 -105.05 -207.05 -100.85 -215.3 -94.4 Q-227.75 -84.8 -234.45 -80.55 L-232.15 -80.95 Q-233.6 -79.4 -243.05 -73.65 L-251.85 -68.25 -253.05 -67.5 -252.6 -67.5 -250.0 -67.4 -247.5 -67.35 -242.45 -67.05 -241.95 -67.05 -246.75 -60.85 -246.95 -60.6 -248.7 -58.3 -251.25 -57.1 -252.15 -57.1 -251.4 -57.85 Q-249.8 -59.35 -248.4 -61.55 L-248.2 -61.85 -248.85 -61.95 -249.1 -62.35 -246.7 -63.8 Q-245.5 -64.4 -245.6 -65.4 L-251.4 -66.05 -253.7 -66.4 -255.65 -66.75 -257.3 -67.15 M-68.95 -109.7 Q-62.8 -108.2 -53.9 -105.05 L-44.55 -101.7 -42.35 -100.85 -23.5 -93.85 Q-12.45 -89.7 -4.55 -87.35 -2.65 -86.6 -1.85 -85.85 L-1.55 -85.5 5.4 -84.2 Q4.3 -83.1 -2.75 -80.85 L-3.15 -80.7 -3.3 -80.65 -10.4 -78.5 -9.9 -77.9 Q-9.6 -77.75 -9.3 -76.8 L-13.9 -76.75 Q-13.9 -76.35 -14.25 -76.35 -13.7 -75.25 -9.5 -73.3 L-9.5 -72.5 -16.8 -76.95 Q-18.85 -78.0 -28.05 -80.5 L-10.4 -80.5 -10.9 -80.65 Q-11.35 -80.7 -11.35 -81.4 -11.35 -82.1 -12.25 -82.8 -13.25 -83.65 -14.65 -83.75 L-6.7 -85.15 -6.65 -86.05 Q-12.5 -88.6 -31.9 -95.0 L-49.8 -100.9 Q-49.8 -101.7 -57.65 -105.05 L-66.65 -108.8 -68.95 -109.7 M-234.45 -80.55 L-235.9 -80.0 -235.4 -80.0 -234.45 -80.55" fill="#755d56" fill-rule="evenodd" stroke="none"/>
    <path d="M-3.1 5.65 L-19.6 5.65 Q-16.9 0.9 -16.9 0.45 -16.9 -1.2 -19.2 -3.4 L-20.9 -4.8 -20.85 -5.05 -21.15 -5.05 -22.0 -5.75 Q-20.35 -5.85 -16.85 -8.1 -18.55 -8.95 -20.75 -11.0 L-16.4 -12.0 -16.4 -12.65 -23.95 -16.4 Q-22.6 -17.6 -20.4 -20.2 -17.2 -23.85 -14.0 -25.25 -15.85 -25.45 -19.0 -26.4 L-19.8 -26.65 -19.4 -26.75 -15.45 -27.95 -12.5 -29.0 -18.5 -30.7 -20.45 -31.25 -18.55 -33.05 Q-15.15 -36.5 -13.05 -39.15 -16.9 -43.0 -16.65 -45.25 -15.6 -45.25 -13.55 -46.35 -11.35 -47.4 -10.6 -48.45 L-13.35 -52.15 -16.55 -56.8 -9.85 -57.5 -3.1 -58.2 -3.1 -58.65 -8.3 -61.2 -10.95 -62.6 -7.7 -62.8 -3.1 -62.1 0.15 -61.5 -6.0 -65.95 -7.7 -67.3 -14.25 -72.4 -9.5 -72.4 -9.5 -72.5 -9.5 -73.3 Q-13.7 -75.25 -14.25 -76.35 -13.9 -76.35 -13.9 -76.75 L-9.3 -76.8 Q-9.6 -77.75 -9.9 -77.9 L-10.4 -78.5 -3.3 -80.65 -3.25 -80.6 -3.1 -80.5 0.55 -76.8 -0.8 -75.9 -2.6 -74.8 -5.8 -72.55 -2.1 -68.55 Q1.5 -64.4 1.5 -62.9 L3.15 -57.55 Q4.75 -52.35 4.75 -51.0 4.75 -47.45 3.25 -41.55 L0.85 -32.25 Q0.45 -30.25 -3.45 -23.4 L-7.1 -16.5 Q-7.1 -15.45 -5.05 -10.55 -3.05 -4.5 -3.05 2.05 L-3.1 5.65 M-238.0 5.65 L-261.15 5.65 -259.55 0.95 -256.65 -6.95 Q-256.65 -7.5 -257.1 -8.2 L-257.55 -9.5 Q-257.55 -11.7 -258.55 -14.4 L-260.7 -19.55 Q-263.85 -27.3 -263.85 -36.65 -263.85 -41.65 -262.85 -46.25 -261.6 -51.65 -259.15 -55.35 L-254.05 -62.9 -254.0 -63.0 -254.0 -62.9 -251.7 -62.9 Q-250.75 -62.15 -248.95 -61.7 L-248.85 -61.95 -248.2 -61.85 -248.4 -61.55 Q-249.8 -59.35 -251.4 -57.85 L-252.15 -57.1 -251.25 -57.1 -249.55 -57.15 -245.55 -57.3 -245.2 -57.3 -246.2 -56.25 -249.0 -52.65 -247.15 -52.4 -244.85 -52.25 -244.85 -51.3 Q-244.85 -49.05 -246.05 -43.2 L-246.7 -40.2 -257.35 -39.6 Q-255.7 -39.2 -247.85 -35.6 L-245.35 -34.4 -241.6 -32.65 -245.6 -31.65 -252.3 -31.3 Q-250.65 -29.7 -246.4 -27.1 -242.55 -24.8 -240.35 -23.85 L-241.9 -19.95 -242.1 -19.9 -248.6 -16.35 -248.6 -15.7 -248.05 -15.6 -244.1 -15.15 -246.0 -10.4 Q-241.9 -8.8 -238.3 -8.3 L-242.95 -1.85 -239.25 -1.85 Q-238.8 -2.3 -237.1 -2.85 L-237.15 -2.75 -239.6 2.55 -237.7 2.55 -238.0 5.65" fill="#785e3a" fill-rule="evenodd" stroke="none"/>
    <path d="M-19.6 5.65 L-24.7 5.65 -24.25 5.15 Q-19.9 0.1 -19.55 -0.65 L-27.1 -0.65 -27.1 -1.3 -23.3 -3.15 Q-21.25 -4.15 -20.9 -4.8 L-19.2 -3.4 Q-16.9 -1.2 -16.9 0.45 -16.9 0.9 -19.6 5.65 M-231.7 5.65 L-238.0 5.65 -237.7 2.55 -239.6 2.55 -237.15 -2.75 -237.1 -2.85 Q-236.75 -2.9 -236.35 -3.05 L-233.55 -3.75 -230.4 -3.75 Q-230.4 -3.3 -230.8 -2.8 L-231.7 -1.85 -231.7 4.9 -231.7 5.65 M-251.4 -66.05 L-245.6 -65.4 Q-245.5 -64.4 -246.7 -63.8 L-249.1 -62.35 -248.85 -61.95 -248.95 -61.7 Q-250.75 -62.15 -251.7 -62.9 L-254.0 -62.9 -254.0 -63.0 -251.4 -66.05 M-246.7 -40.2 L-246.05 -43.2 Q-244.85 -49.05 -244.85 -51.3 L-244.85 -52.25 -247.15 -52.4 -249.0 -52.65 -246.2 -56.25 -245.2 -57.3 -238.95 -57.55 Q-239.45 -56.6 -241.75 -53.95 -243.75 -50.65 -243.35 -45.5 L-240.45 -46.0 -236.4 -46.55 -236.4 -46.0 Q-238.3 -46.0 -240.9 -44.7 L-239.7 -43.5 Q-238.85 -42.8 -238.35 -42.8 L-238.3 -42.45 Q-238.1 -42.15 -237.7 -42.15 -238.4 -41.45 -246.2 -40.3 L-246.7 -40.2 M-241.6 -32.65 Q-233.75 -29.05 -233.45 -29.0 L-233.4 -28.65 Q-233.2 -28.35 -232.8 -28.35 L-236.25 -25.9 -239.7 -23.25 Q-239.7 -22.6 -237.75 -22.6 -238.3 -22.1 -241.9 -19.95 L-240.35 -23.85 Q-242.55 -24.8 -246.4 -27.1 -250.65 -29.7 -252.3 -31.3 L-245.6 -31.65 -241.6 -32.65 M-244.1 -15.15 L-241.0 -14.9 -233.45 -14.5 -238.0 -8.75 -238.3 -8.3 Q-241.9 -8.8 -246.0 -10.4 L-244.1 -15.15 M-20.45 -31.25 Q-25.25 -32.7 -26.85 -33.55 -18.55 -36.9 -16.95 -36.55 -17.4 -38.35 -19.55 -40.7 -21.3 -42.65 -21.3 -45.1 L-20.45 -47.05 Q-20.45 -47.7 -20.7 -47.85 L-21.3 -47.9 -21.3 -51.0 -19.65 -50.35 -18.25 -50.05 Q-17.35 -50.05 -16.55 -51.0 -15.7 -51.85 -14.25 -51.85 L-17.2 -54.9 Q-19.15 -57.25 -19.95 -58.85 L-19.95 -60.75 -19.95 -61.5 -15.05 -62.05 -10.95 -62.6 -8.3 -61.2 -3.1 -58.65 -3.1 -58.2 -9.85 -57.5 -16.55 -56.8 -13.35 -52.15 -10.6 -48.45 Q-11.35 -47.4 -13.55 -46.35 -15.6 -45.25 -16.65 -45.25 -16.9 -43.0 -13.05 -39.15 -15.15 -36.5 -18.55 -33.05 L-20.45 -31.25 M-19.8 -26.65 L-19.0 -26.4 Q-15.85 -25.45 -14.0 -25.25 -17.2 -23.85 -20.4 -20.2 -22.6 -17.6 -23.95 -16.4 -27.65 -18.25 -28.2 -18.25 L-25.15 -18.25 -25.15 -18.9 -28.25 -20.75 -25.15 -20.75 -25.05 -21.7 -25.05 -21.95 -26.05 -22.95 -26.9 -24.65 -19.8 -26.65 M-20.75 -11.0 Q-18.55 -8.95 -16.85 -8.1 -20.35 -5.85 -22.0 -5.75 L-21.15 -5.05 -26.45 -5.05 -31.95 -5.5 -35.9 -6.3 Q-34.1 -7.15 -25.7 -9.6 L-20.75 -11.0" fill="#6b5334" fill-rule="evenodd" stroke="none"/>
    <path d="M0.55 -76.8 Q7.5 -69.15 12.3 -58.6 15.25 -52.25 16.5 -46.5 L15.7 -48.2 12.15 -55.35 Q12.15 -56.75 4.05 -66.75 L-2.6 -74.8 -0.8 -75.9 0.55 -76.8 M10.3 -18.7 L10.15 -18.0 Q10.15 -14.8 11.65 -9.1 13.15 -3.4 13.15 -1.0 L13.0 3.05 Q12.8 4.1 12.0 5.65 L9.45 5.65 8.5 1.75 Q6.3 -7.5 6.3 -9.3 6.3 -11.35 10.3 -18.7 M-271.5 5.65 L-276.15 5.65 Q-275.55 2.95 -274.35 -0.6 -271.8 -8.2 -271.8 -11.35 L-271.8 -11.9 -272.5 -15.5 -271.75 -13.9 Q-268.7 -7.8 -268.7 -6.5 L-271.5 5.65 M-276.15 -28.55 L-276.2 -29.25 -276.2 -31.15 -276.2 -31.3 Q-276.2 -46.3 -267.15 -57.85 L-266.8 -58.2 Q-263.25 -62.75 -260.0 -65.25 L-257.3 -67.15 -255.65 -66.75 -253.7 -66.4 -259.15 -61.1 Q-264.05 -56.2 -266.95 -52.1 -273.6 -42.8 -276.15 -28.55" fill="#947448" fill-rule="evenodd" stroke="none"/>
  </g>
</svg>
