<?xml version="1.0" encoding="UTF-8" standalone="no"?>
<svg xmlns:xlink="http://www.w3.org/1999/xlink" height="9.35px" width="35.55px" xmlns="http://www.w3.org/2000/svg">
  <g transform="matrix(1.0, 0.0, 0.0, 1.0, 13.65, -13.0)">
    <path d="M-7.25 17.5 L-12.65 19.2 Q11.45 25.3 20.9 14.0" fill="none" stroke="#361a0e" stroke-linecap="round" stroke-linejoin="round" stroke-width="2.0">
      <animate attributeName="stroke" dur="2s" repeatCount="indefinite" values="#361a0e;#361a0f"/>
      <animate attributeName="stroke-width" dur="2s" repeatCount="indefinite" values="2.0;2.0"/>
      <animate attributeName="fill-opacity" dur="2s" repeatCount="indefinite" values="1.0;1.0"/>
      <animate attributeName="d" dur="2s" repeatCount="indefinite" values="M-7.25 17.5 L-12.65 19.2 Q11.45 25.3 20.9 14.0;M-6.15 18.15 L-9.2 20.15 Q10.45 17.95 13.35 19.7"/>
    </path>
  </g>
</svg>
