<?xml version="1.0" encoding="UTF-8" standalone="no"?>
<svg xmlns:xlink="http://www.w3.org/1999/xlink" height="32.65px" width="33.3px" xmlns="http://www.w3.org/2000/svg">
  <g transform="matrix(1.0, 0.0, 0.0, 1.0, 1.5, 1.6)">
    <path d="M31.3 -1.1 L31.05 5.2 Q29.7 5.7 28.0 6.55 L24.85 7.9 24.75 5.6 25.5 4.85 31.3 -1.1 M30.8 10.2 L30.55 15.8 27.95 15.25 26.3 14.95 Q25.95 13.15 25.0 12.45 26.2 11.7 26.75 11.5 L27.55 11.2 30.8 10.2" fill="#5b6a8a" fill-rule="evenodd" stroke="none"/>
    <path d="M13.1 -0.45 L20.75 -0.75 18.1 2.5 16.85 4.25 16.05 5.5 15.6 5.5 12.0 5.5 13.1 -0.45 M4.2 -0.15 L8.1 -0.3 8.9 3.85 9.1 5.5 8.25 5.5 6.35 5.5 5.7 4.15 Q4.7 1.75 4.2 -0.15 M24.8 5.55 L25.45 4.8 25.5 4.85 24.75 5.6 24.75 5.55 24.8 5.55" fill="#8091aa" fill-rule="evenodd" stroke="none"/>
    <path d="M-0.85 26.95 L-0.75 23.35 Q2.0 21.45 4.5 19.25 L4.4 20.7 4.35 21.8 4.3 22.15 3.4 23.6 -0.85 26.95 M-0.45 15.15 L-0.25 8.95 0.3 9.0 2.65 9.4 3.85 13.55 4.1 14.35 2.3 14.65 -0.45 15.15" fill="#394857" fill-rule="evenodd" stroke="none"/>
    <path d="M25.05 30.1 L21.6 30.15 20.95 27.55 24.35 28.15 25.05 30.1 M15.5 30.25 L8.6 30.4 Q9.55 28.5 10.45 26.95 L10.65 26.6 16.0 26.95 15.5 30.25 M2.2 30.5 L-1.0 30.55 3.4 26.4 4.7 25.65 5.45 25.65 7.0 25.65 9.45 25.65 7.05 27.15 Q4.3 28.45 2.2 30.5 M26.25 26.35 L26.3 26.4 26.25 26.4 26.25 26.35" fill="#1f272e" fill-rule="evenodd" stroke="none"/>
    <path d="M7.0 25.65 L10.8 24.3 13.7 23.45 13.95 23.35 15.2 22.9 17.0 22.35 21.4 20.65 22.7 19.2 22.8 18.95 23.7 16.95 25.05 14.1 25.35 20.95 24.4 22.8 Q23.65 23.65 22.0 23.85 16.9 24.25 13.7 25.1 L11.9 25.65 9.45 25.65 7.0 25.65" fill="#65769c" fill-rule="evenodd" stroke="none"/>
    <path d="M31.05 5.2 L30.8 10.2 27.55 11.2 26.75 11.5 Q26.2 11.7 25.0 12.45 L24.85 7.9 28.0 6.55 Q29.7 5.7 31.05 5.2 M30.55 15.8 L30.35 20.9 Q29.35 20.2 28.5 19.95 L27.05 19.4 26.45 15.9 26.3 14.95 27.95 15.25 30.55 15.8" fill="#4b5773" fill-rule="evenodd" stroke="none"/>
    <path d="M16.05 5.5 L16.85 4.25 18.1 2.5 20.75 -0.75 24.5 -0.85 21.65 2.3 20.05 4.25 19.1 5.5 16.05 5.5 M28.45 -1.0 L31.3 -1.1 25.5 4.85 25.45 4.8 24.8 5.55 24.75 5.5 22.35 5.5 23.35 4.25 24.7 2.7 28.45 -1.0" fill="#74849c" fill-rule="evenodd" stroke="none"/>
    <path d="M29.95 30.0 L25.05 30.1 24.35 28.15 20.95 27.55 17.9 27.15 16.0 26.95 10.65 26.6 9.45 25.65 26.25 26.4 26.3 26.4 29.95 30.0" fill="#000000" fill-rule="evenodd" stroke="none"/>
    <path d="M21.6 30.15 L15.5 30.25 16.0 26.95 17.9 27.15 20.95 27.55 21.6 30.15 M8.6 30.4 L2.2 30.5 Q4.3 28.45 7.05 27.15 L9.45 25.65 10.65 26.6 10.45 26.95 Q9.55 28.5 8.6 30.4" fill="#27313b" fill-rule="evenodd" stroke="none"/>
    <path d="M13.1 -0.45 L12.0 5.5 9.55 5.5 9.45 5.6 9.45 5.5 9.1 5.5 8.9 3.85 8.1 -0.3 13.1 -0.45 M0.0 0.0 L4.2 -0.15 Q4.7 1.75 5.7 4.15 L6.35 5.5 5.9 5.5 5.3 5.15 4.7 4.8 0.0 0.0" fill="#8da0bd" fill-rule="evenodd" stroke="none"/>
    <path d="M5.9 5.5 L6.35 5.5 8.25 5.5 6.95 6.75 5.55 8.1 5.05 9.9 5.3 5.5 5.9 5.5" fill="#a0bdf7" fill-rule="evenodd" stroke="none"/>
    <path d="M5.45 25.65 L9.85 22.6 Q11.6 21.25 12.05 21.15 L13.7 20.75 13.9 20.65 Q16.8 19.55 17.25 19.05 L17.35 18.95 19.1 15.55 19.35 14.45 Q19.4 13.9 19.65 13.5 L20.0 12.45 20.55 11.4 Q20.95 10.85 24.85 7.9 L25.0 12.45 25.05 14.1 23.7 16.95 22.8 18.95 22.7 19.2 21.4 20.65 17.0 22.35 15.2 22.9 13.95 23.35 13.7 23.45 10.8 24.3 7.0 25.65 5.45 25.65" fill="#7287b0" fill-rule="evenodd" stroke="none"/>
    <path d="M-0.25 8.95 L0.0 0.0 4.7 4.8 5.3 5.15 5.9 5.5 5.3 5.5 5.05 9.9 5.0 10.25 Q4.9 10.6 4.95 11.05 L4.95 11.35 4.8 14.05 4.8 14.15 4.1 14.35 3.85 13.55 2.65 9.4 0.3 9.0 -0.25 8.95" fill="#46586b" fill-rule="evenodd" stroke="none"/>
    <path d="M24.5 -0.85 L28.45 -1.0 24.7 2.7 23.35 4.25 22.35 5.5 22.2 5.5 19.1 5.5 20.05 4.25 21.65 2.3 24.5 -0.85" fill="#6f7d96" fill-rule="evenodd" stroke="none"/>
    <path d="M30.35 20.9 L29.95 30.0 26.3 26.4 26.25 26.35 25.0 12.45 Q25.95 13.15 26.3 14.95 L26.45 15.9 27.05 19.4 28.5 19.95 Q29.35 20.2 30.35 20.9" fill="#3d465e" fill-rule="evenodd" stroke="none"/>
    <path d="M-1.0 30.55 L-0.85 26.95 3.4 23.6 4.3 22.15 3.4 26.4 -1.0 30.55 M-0.75 23.35 L-0.45 15.15 2.3 14.65 4.1 14.35 4.8 14.15 4.5 19.25 Q2.0 21.45 -0.75 23.35" fill="#34414f" fill-rule="evenodd" stroke="none"/>
    <path d="M24.8 5.55 L24.75 5.55 24.75 5.5 24.8 5.55 M25.05 14.1 L25.0 12.45 26.25 26.35 26.25 26.4 9.45 25.65 11.9 25.65 25.5 25.65 25.35 20.95 25.05 14.1 M4.35 21.8 L4.15 25.65 4.7 25.65 3.4 26.4 4.3 22.15 4.35 21.8" fill="#2b3542" fill-rule="evenodd" stroke="none"/>
    <path d="M12.0 5.5 L15.6 5.5 13.7 6.25 13.35 6.4 12.0 6.9 10.25 7.5 9.85 7.7 Q7.95 8.75 6.45 11.6 6.0 12.4 5.25 16.05 L5.0 17.2 4.7 18.95 4.7 19.1 4.4 20.7 4.5 19.25 4.8 14.15 4.8 14.05 4.95 11.35 4.95 11.05 Q4.9 10.6 5.0 10.25 L5.05 9.9 5.55 8.1 6.95 6.75 8.25 5.5 9.1 5.5 9.45 5.5 9.45 5.6 9.55 5.5 12.0 5.5" fill="#91aae0" fill-rule="evenodd" stroke="none"/>
    <path d="M15.6 5.5 L16.05 5.5 19.1 5.5 22.2 5.5 20.65 6.4 20.55 6.45 17.65 8.3 16.8 8.7 Q14.9 9.65 13.7 10.55 L12.3 11.85 Q10.95 13.45 10.95 15.7 L11.15 16.65 8.65 18.4 7.95 18.95 Q6.7 20.0 6.3 21.1 5.65 22.55 4.9 24.9 L4.75 25.5 4.7 25.65 4.15 25.65 4.35 21.8 4.4 20.7 4.7 19.1 4.7 18.95 5.0 17.2 5.25 16.05 Q6.0 12.4 6.45 11.6 7.95 8.75 9.85 7.7 L10.25 7.5 12.0 6.9 13.35 6.4 13.7 6.25 15.6 5.5" fill="#8197c7" fill-rule="evenodd" stroke="none"/>
    <path d="M24.75 5.55 L24.75 5.6 24.85 7.9 Q20.95 10.85 20.55 11.4 L20.0 12.45 19.65 13.5 Q19.4 13.9 19.35 14.45 L19.1 15.55 17.35 18.95 17.25 19.05 Q16.8 19.55 13.9 20.65 L13.7 20.75 12.05 21.15 Q11.6 21.25 9.85 22.6 L5.45 25.65 4.7 25.65 4.75 25.5 4.9 24.9 Q5.65 22.55 6.3 21.1 6.7 20.0 7.95 18.95 L8.65 18.4 11.15 16.65 10.95 15.7 Q10.95 13.45 12.3 11.85 L13.7 10.55 Q14.9 9.65 16.8 8.7 L17.65 8.3 20.55 6.45 20.65 6.4 22.2 5.5 22.35 5.5 24.75 5.5 24.75 5.55" fill="#6d7fa8" fill-rule="evenodd" stroke="none"/>
    <path d="M11.9 25.65 L13.7 25.1 Q16.9 24.25 22.0 23.85 23.65 23.65 24.4 22.8 L25.35 20.95 25.5 25.65 11.9 25.65" fill="#5b688c" fill-rule="evenodd" stroke="none"/>
    <path d="M29.95 30.0 L31.3 -1.1 0.0 0.0 -1.0 30.55 29.95 30.0 Z" fill="none" stroke="#10141a" stroke-linecap="butt" stroke-linejoin="miter" stroke-miterlimit="3.0" stroke-opacity="0.69411767" stroke-width="1.0"/>
  </g>
</svg>
