<?xml version="1.0" encoding="UTF-8" standalone="no"?>
<svg xmlns:xlink="http://www.w3.org/1999/xlink" height="102.8px" width="111.7px" xmlns="http://www.w3.org/2000/svg">
  <g transform="matrix(1.0, 0.0, 0.0, 1.0, 50.65, 49.45)">
    <path d="M26.7 -44.0 Q26.0 -48.45 30.65 -49.45 37.0 -46.4 31.4 -41.9 27.55 -38.8 26.7 -44.0 M10.4 -23.75 Q11.3 -29.1 16.9 -29.85 26.75 -29.3 25.35 -19.8 25.1 -18.1 23.65 -17.1 16.8 -12.3 11.65 -18.8 9.95 -20.95 10.4 -23.75 M35.2 -14.05 Q38.1 -18.0 42.95 -18.15 52.65 -15.3 48.25 -5.6 44.4 2.8 36.7 -3.0 30.45 -7.7 35.2 -14.05 M50.4 23.95 Q49.15 25.4 47.25 25.0 38.35 23.2 42.9 16.6 44.5 14.3 47.15 14.15 56.5 16.9 50.4 23.95 M58.7 8.3 Q56.45 10.3 54.4 8.05 49.75 2.85 57.05 1.6 64.1 3.5 58.7 8.3 M15.65 14.3 Q16.15 20.65 9.4 21.05 L5.15 20.7 Q2.5 27.2 -2.7 23.25 -6.6 20.25 -3.9 16.0 L-1.95 14.1 Q-1.6 5.6 7.0 5.75 15.1 6.55 15.65 14.3 M11.95 36.6 Q19.7 38.05 16.5 44.4 15.45 46.55 12.9 46.65 7.05 46.85 8.0 40.75 8.55 37.2 11.95 36.6 M22.55 29.05 Q15.4 30.25 16.65 23.15 17.25 19.55 20.75 18.85 29.15 20.3 24.6 27.7 23.95 28.8 22.55 29.05 M-13.7 -33.0 Q-22.65 -32.1 -22.55 -40.95 -22.5 -47.15 -16.55 -48.95 -10.0 -48.75 -8.05 -44.75 L-7.0 -45.7 Q-6.0 -46.4 -4.95 -46.45 2.05 -45.6 2.65 -39.65 3.15 -34.6 -1.85 -33.8 -6.05 -33.15 -8.45 -35.55 -10.05 -33.35 -13.7 -33.0 M-24.05 -26.75 Q-26.5 -22.95 -30.35 -25.85 -33.65 -28.35 -30.85 -31.85 -29.55 -33.45 -27.1 -33.45 -20.95 -31.55 -24.05 -26.75 M-25.0 -15.65 Q-26.05 -14.15 -28.0 -14.2 -32.35 -14.25 -31.45 -18.95 -30.95 -21.7 -28.2 -21.9 -21.05 -21.2 -25.0 -15.65 M-24.45 -5.5 Q-24.55 -3.4 -26.35 -2.35 -31.45 0.7 -34.8 -3.8 -39.25 -9.75 -32.4 -12.25 -24.2 -12.65 -24.45 -5.5 M-13.7 -0.9 Q-16.05 1.05 -17.25 -2.1 -19.35 -7.8 -13.75 -9.35 -7.95 -5.65 -13.7 -0.9 M-7.4 -9.85 Q-4.95 -12.75 -1.4 -13.5 7.15 -11.45 3.5 -3.2 1.8 0.55 -2.3 0.2 -9.4 -0.35 -8.75 -6.65 -8.6 -8.45 -7.4 -9.85 M-20.75 5.7 Q-14.3 7.6 -19.3 11.85 -20.6 12.95 -21.85 11.7 -26.0 7.65 -20.75 5.7 M-14.4 40.0 Q-19.85 40.9 -20.8 35.25 -21.65 30.4 -16.55 29.75 -8.85 31.45 -12.35 38.55 -12.95 39.75 -14.4 40.0 M-42.6 45.15 Q-36.7 48.15 -41.95 52.6 -43.7 54.15 -45.5 52.6 -48.95 49.7 -45.65 46.6 -44.3 45.3 -42.6 45.15 M-48.8 13.25 Q-46.9 11.0 -44.0 11.0 -36.3 13.1 -40.25 20.15 -42.1 23.45 -45.85 21.95 -53.6 19.0 -48.8 13.25" fill="#ffffff" fill-opacity="0.49803922" fill-rule="evenodd" stroke="none"/>
    <path d="M-42.65 48.5 Q-42.35 48.8 -42.35 49.25 -42.35 49.7 -42.65 50.0 -42.95 50.3 -43.35 50.3 L-44.05 50.0 -44.35 49.25 -44.05 48.5 Q-43.75 48.2 -43.35 48.2 -42.95 48.2 -42.65 48.5 M-46.7 18.7 Q-47.55 17.85 -47.55 16.7 -47.55 15.55 -46.7 14.75 -45.9 13.9 -44.7 13.9 -43.5 13.9 -42.65 14.75 -41.85 15.55 -41.85 16.7 -41.85 17.85 -42.65 18.7 -43.5 19.5 -44.7 19.5 -45.9 19.5 -46.7 18.7 M-18.1 34.95 Q-18.1 34.1 -17.5 33.5 -16.9 32.9 -16.05 32.9 -15.2 32.9 -14.55 33.5 -14.0 34.1 -14.0 34.95 -14.0 35.8 -14.55 36.45 -15.2 37.0 -16.05 37.0 -16.9 37.0 -17.5 36.45 -18.1 35.8 -18.1 34.95 M-20.15 8.85 L-20.05 9.05 -20.15 9.25 -20.35 9.35 -20.55 9.25 -20.65 9.05 -20.55 8.85 -20.35 8.75 -20.15 8.85 M-13.8 -5.85 L-13.6 -4.65 -13.8 -3.4 Q-14.05 -2.9 -14.35 -2.9 L-14.85 -3.4 -15.1 -4.65 -14.85 -5.85 -14.35 -6.4 Q-14.05 -6.4 -13.8 -5.85 M-32.45 -8.6 Q-31.65 -9.45 -30.45 -9.45 -29.25 -9.45 -28.4 -8.6 -27.6 -7.8 -27.6 -6.65 -27.6 -5.5 -28.4 -4.65 -29.25 -3.85 -30.45 -3.85 -31.65 -3.85 -32.45 -4.65 -33.3 -5.5 -33.3 -6.65 -33.3 -7.8 -32.45 -8.6 M-27.55 -17.15 L-28.2 -17.4 -28.5 -18.05 -28.2 -18.65 Q-27.95 -18.95 -27.55 -18.95 L-26.85 -18.65 -26.6 -18.05 -26.85 -17.4 Q-27.15 -17.15 -27.55 -17.15 M-26.2 -30.15 Q-25.7 -29.65 -25.7 -28.95 -25.7 -28.25 -26.2 -27.75 -26.7 -27.25 -27.4 -27.25 -28.1 -27.25 -28.6 -27.75 -29.1 -28.25 -29.1 -28.95 -29.1 -29.65 -28.6 -30.15 -28.1 -30.65 -27.4 -30.65 -26.7 -30.65 -26.2 -30.15 M-4.2 -42.55 Q-0.5 -41.9 -0.85 -38.5 -1.05 -36.7 -2.65 -37.15 -8.25 -38.9 -13.7 -36.3 -15.7 -35.3 -17.15 -36.9 -21.8 -42.0 -16.05 -45.95 L-14.55 -45.65 Q-13.2 -45.2 -12.4 -44.2 -9.9 -41.1 -6.4 -42.2 -5.35 -42.85 -4.2 -42.55 M10.8 41.6 Q10.8 40.8 11.35 40.25 11.9 39.65 12.7 39.65 13.5 39.65 14.05 40.25 14.6 40.8 14.6 41.6 14.6 42.4 14.05 43.0 13.5 43.55 12.7 43.55 11.9 43.55 11.35 43.0 10.8 42.4 10.8 41.6 M2.9 10.4 Q4.4 8.75 6.65 9.15 13.65 9.8 12.7 16.45 L5.0 17.75 Q3.25 17.8 2.45 19.45 L0.75 21.75 Q-3.2 20.6 -0.9 17.7 0.0 16.65 0.3 15.5 1.0 12.55 2.9 10.4 M21.4 22.0 Q22.25 22.0 22.9 22.6 23.45 23.2 23.45 24.05 23.45 24.9 22.9 25.55 22.25 26.1 21.4 26.1 20.55 26.1 19.95 25.55 19.35 24.9 19.35 24.05 19.35 23.2 19.95 22.6 20.55 22.0 21.4 22.0 M49.0 17.75 Q49.75 18.5 49.75 19.6 49.75 20.7 49.0 21.45 48.25 22.2 47.15 22.2 46.05 22.2 45.3 21.45 44.55 20.7 44.55 19.6 44.55 18.5 45.3 17.75 46.05 17.0 47.15 17.0 48.25 17.0 49.0 17.75 M55.85 5.4 Q55.85 5.0 56.15 4.7 56.45 4.4 56.85 4.4 57.25 4.4 57.55 4.7 L57.85 5.4 57.55 6.1 Q57.25 6.4 56.85 6.4 L56.15 6.1 Q55.85 5.8 55.85 5.4 M36.2 -9.4 Q36.2 -11.8 37.75 -13.5 39.3 -15.2 41.45 -15.2 43.6 -15.2 45.15 -13.5 46.7 -11.8 46.7 -9.4 46.7 -7.0 45.15 -5.3 43.6 -3.6 41.45 -3.6 39.3 -3.6 37.75 -5.3 36.2 -7.0 36.2 -9.4 M0.65 -9.35 Q1.75 -8.2 1.75 -6.65 1.75 -5.1 0.65 -3.95 -0.5 -2.85 -2.05 -2.85 -3.6 -2.85 -4.75 -3.95 -5.85 -5.1 -5.85 -6.65 -5.85 -8.2 -4.75 -9.35 -3.6 -10.45 -2.05 -10.45 -0.5 -10.45 0.65 -9.35 M14.75 -25.65 Q16.1 -26.95 17.95 -26.95 19.8 -26.95 21.15 -25.65 22.45 -24.3 22.45 -22.45 22.45 -20.6 21.15 -19.25 19.8 -17.95 17.95 -17.95 16.1 -17.95 14.75 -19.25 13.45 -20.6 13.45 -22.45 13.45 -24.3 14.75 -25.65 M29.5 -44.0 L29.65 -45.5 30.25 -46.15 31.0 -45.8 29.5 -44.0" fill="#ffffff" fill-rule="evenodd" stroke="none"/>
  </g>
</svg>
