<?xml version="1.0" encoding="UTF-8" standalone="no"?>
<svg xmlns:xlink="http://www.w3.org/1999/xlink" height="33.6px" width="130.0px" xmlns="http://www.w3.org/2000/svg">
  <g transform="matrix(1.0, 0.0, 0.0, 1.0, 119.0, 25.0)">
    <path d="M-118.2 -14.35 L-118.0 -21.25 -111.8 -21.45 -118.2 -14.35" fill="#1a1a1a" fill-rule="evenodd" stroke="none"/>
    <path d="M-118.35 -10.35 L-118.2 -14.35 -111.8 -21.45 -83.05 -22.25 -118.35 -10.35 M-111.6 -5.1 L-66.55 -5.1 7.05 -5.1 7.05 -2.35 7.05 4.9 -99.6 4.9 -115.95 4.9 -115.95 2.45 -115.95 -4.2 -115.95 -5.1 -111.6 -5.1" fill="#262626" fill-rule="evenodd" stroke="none"/>
    <path d="M-118.6 -3.7 L-118.35 -10.35 -83.05 -22.25 -12.6 -24.3 -111.6 -5.1 -115.95 -5.1 -115.95 -4.2 -118.6 -3.7" fill="#333333" fill-rule="evenodd" stroke="none"/>
    <path d="M-12.6 -24.3 L11.0 -25.0 10.55 -16.85 -66.55 -5.1 -111.6 -5.1 -12.6 -24.3 M-118.8 2.9 L-118.6 -3.7 -115.95 -4.2 -115.95 2.45 -118.8 2.9" fill="#404040" fill-rule="evenodd" stroke="none"/>
    <path d="M10.55 -16.85 L9.7 -2.5 7.05 -2.35 7.05 -5.1 -66.55 -5.1 10.55 -16.85 M-118.95 6.2 L-118.8 2.9 -115.95 2.45 -115.95 4.9 -99.6 4.9 -118.95 6.2" fill="#4d4d4d" fill-rule="evenodd" stroke="none"/>
    <path d="M9.7 -2.5 L9.0 8.6 -119.0 7.35 -118.95 6.2 -99.6 4.9 7.05 4.9 7.05 -2.35 9.7 -2.5" fill="#595959" fill-rule="evenodd" stroke="none"/>
  </g>
</svg>
