<?xml version="1.0" encoding="UTF-8" standalone="no"?>
<svg xmlns:xlink="http://www.w3.org/1999/xlink" height="43.8px" width="44.7px" xmlns="http://www.w3.org/2000/svg">
  <g transform="matrix(1.0, 0.0, 0.0, 1.0, 22.35, 21.9)">
    <path d="M-9.75 2.55 L-13.0 3.55 Q-15.45 4.4 -16.5 5.1 L-16.7 4.9 Q-17.9 0.65 -19.0 -1.6 -19.95 -3.6 -21.2 -4.85 L-21.35 -4.75 -21.35 -5.0 -21.95 -9.85 Q-20.3 -8.65 -18.55 -6.3 L-18.45 -6.15 Q-15.45 -2.1 -14.85 2.8 L-11.95 2.25 -9.95 1.85 -9.75 2.55 -9.3 3.65 -9.75 2.55 -8.5 2.55 -9.3 3.65 -9.6 4.1 -10.7 5.5 Q-9.95 5.75 -7.75 7.1 L-5.2 8.7 -1.0 6.85 -0.25 6.5 Q1.75 5.6 3.2 5.25 L4.5 5.7 4.65 5.75 6.05 6.3 8.4 7.2 11.65 8.3 12.85 8.6 Q13.9 9.8 14.4 11.15 L15.35 9.95 15.7 9.3 17.4 9.7 17.85 9.8 17.8 9.9 20.9 10.5 21.2 10.5 21.25 10.55 22.1 13.35 22.35 15.3 19.8 15.45 15.95 15.75 15.8 13.5 16.0 12.15 15.8 13.5 15.15 16.2 14.25 19.2 13.9 20.1 13.75 20.05 13.7 20.1 13.0 21.35 11.75 21.5 12.75 19.7 13.4 18.05 12.05 19.35 9.1 21.7 9.05 21.75 4.65 21.9 4.5 21.9 -7.9 21.25 Q-10.4 18.8 -11.65 16.95 L-12.2 15.55 -12.45 14.9 -12.7 14.75 -12.5 14.75 -12.45 14.9 -12.3 15.0 Q-10.65 17.05 -7.8 18.75 -3.35 21.35 0.65 21.35 L4.05 20.75 4.5 20.55 Q6.2 19.85 7.95 18.55 L8.95 17.8 Q11.95 15.2 11.95 12.45 11.95 10.1 9.75 8.55 8.25 7.45 6.45 7.2 L6.05 7.15 5.15 7.1 4.5 7.15 Q1.9 7.25 -1.0 8.45 L-6.3 11.05 -12.9 6.55 Q-11.85 4.45 -9.75 2.55 M-12.4 20.65 L-11.85 20.95 -12.0 20.95 -12.4 20.65 M21.9 18.75 L21.4 20.05 21.35 20.2 14.25 21.2 14.6 20.45 14.75 20.05 15.15 19.15 15.95 18.85 21.9 18.75 M20.9 10.5 L21.25 10.55 20.9 10.5" fill="#b38484" fill-rule="evenodd" stroke="none"/>
    <path d="M-21.35 -4.75 L-21.2 -4.85 Q-19.95 -3.6 -19.0 -1.6 -17.9 0.65 -16.7 4.9 L-16.5 5.1 Q-15.45 4.4 -13.0 3.55 L-9.75 2.55 Q-11.85 4.45 -12.9 6.55 L-6.3 11.05 -1.0 8.45 Q1.9 7.25 4.5 7.15 L5.15 7.1 6.05 7.15 6.45 7.2 Q8.25 7.45 9.75 8.55 11.95 10.1 11.95 12.45 11.95 15.2 8.95 17.8 L7.95 18.55 Q6.2 19.85 4.5 20.55 L4.05 20.75 0.65 21.35 Q-3.35 21.35 -7.8 18.75 -10.65 17.05 -12.3 15.0 L-12.45 14.9 -12.5 14.75 -12.7 14.75 -12.45 14.9 -12.2 15.55 -11.65 16.95 Q-10.4 18.8 -7.9 21.25 L-11.85 20.95 -12.4 20.65 -20.1 14.65 -20.25 12.05 -20.25 11.8 Q-20.5 7.95 -20.9 5.1 L-21.2 0.5 -21.25 -0.45 -21.35 -4.75 M-9.75 2.55 L-9.7 2.5 -9.75 2.55 M22.35 15.3 L22.3 16.7 21.9 18.75 15.95 18.85 15.15 19.15 14.75 20.05 14.6 20.45 14.25 21.2 13.8 21.25 13.3 21.35 13.0 21.35 13.7 20.1 13.75 20.05 13.9 20.1 14.25 19.2 15.15 16.2 15.8 13.5 15.95 15.75 19.8 15.45 22.35 15.3" fill="#a36a6a" fill-rule="evenodd" stroke="none"/>
    <path d="M-18.15 -20.2 L-19.3 -20.3 Q-20.2 -20.3 -20.7 -19.7 -21.1 -19.2 -21.1 -18.5 -21.1 -17.2 -16.5 -8.3 L-14.1 -3.7 -12.65 -4.35 -11.95 -4.7 -11.6 -3.5 -11.85 -3.3 Q-13.3 -2.15 -13.9 -0.9 L-11.15 -2.0 -10.35 0.7 Q-12.2 1.5 -13.7 1.5 -14.3 1.5 -14.95 -0.3 L-15.7 -2.7 Q-15.95 -3.65 -16.75 -4.95 L-17.85 -6.95 -17.9 -7.1 Q-18.75 -9.25 -20.05 -11.5 -21.25 -13.45 -22.35 -14.55 L-22.3 -16.15 -21.8 -20.4 -21.5 -21.9 Q-19.95 -21.6 -18.65 -20.9 L-18.15 -20.2 M-9.6 4.1 L-9.3 3.65 -8.5 2.55 -7.15 2.55 -7.3 3.5 -6.65 3.15 -5.7 4.55 -5.4 4.5 -4.5 4.5 -5.4 5.05 -5.55 5.15 Q-7.4 6.3 -7.8 6.3 L-8.6 5.5 -8.85 5.15 -9.0 4.95 -9.6 4.1 M-4.0 4.45 L-3.85 4.45 -3.9 4.5 -3.75 4.45 -2.25 4.45 1.3 4.8 0.2 5.15 Q-0.5 5.4 -1.4 5.8 L-5.5 7.55 -4.0 4.45 M15.05 9.15 L15.7 9.3 15.35 9.95 15.05 9.15" fill="#d2b6b6" fill-rule="evenodd" stroke="none"/>
    <path d="M-22.35 -14.55 Q-21.25 -13.45 -20.05 -11.5 -18.75 -9.25 -17.9 -7.1 L-17.85 -6.95 -16.75 -4.95 Q-15.95 -3.65 -15.7 -2.7 L-14.95 -0.3 Q-14.3 1.5 -13.7 1.5 -12.2 1.5 -10.35 0.7 L-9.95 1.85 -11.95 2.25 -14.85 2.8 Q-15.45 -2.1 -18.45 -6.15 L-18.55 -6.3 Q-20.3 -8.65 -21.95 -9.85 L-22.05 -10.45 -22.35 -14.55 M-20.1 14.65 L-12.4 20.65 -12.0 20.95 -14.45 20.75 -17.25 18.2 -17.6 17.85 -20.0 15.65 -20.1 14.65 M-4.5 4.5 L-4.0 4.45 -5.5 7.55 -1.4 5.8 Q-0.5 5.4 0.2 5.15 L1.3 4.8 3.2 5.25 Q1.75 5.6 -0.25 6.5 L-1.0 6.85 -5.2 8.7 -7.75 7.1 Q-9.95 5.75 -10.7 5.5 L-9.6 4.1 -9.0 4.95 -8.85 5.15 -8.6 5.5 -7.8 6.3 Q-7.4 6.3 -5.55 5.15 L-5.4 5.05 -4.5 4.5 M12.85 8.6 L15.05 9.15 15.35 9.95 14.4 11.15 Q13.9 9.8 12.85 8.6 M11.75 21.5 L9.05 21.75 9.1 21.7 12.05 19.35 13.4 18.05 12.75 19.7 11.75 21.5" fill="#c29c9c" fill-rule="evenodd" stroke="none"/>
    <path d="M-11.95 -4.7 L-12.65 -4.35 -14.1 -3.7 -16.5 -8.3 Q-21.1 -17.2 -21.1 -18.5 -21.1 -19.2 -20.7 -19.7 -20.2 -20.3 -19.3 -20.3 L-18.15 -20.2 Q-15.6 -16.6 -13.95 -11.7 L-11.95 -4.7 M-11.15 -2.0 L-13.9 -0.9 Q-13.3 -2.15 -11.85 -3.3 L-11.6 -3.5 -11.15 -2.0 M-7.15 2.55 L-7.05 2.55 -6.65 3.15 -7.3 3.5 -7.15 2.55 M-3.85 4.45 L-3.75 4.45 -3.9 4.5 -3.85 4.45" fill="#e0cdcd" fill-rule="evenodd" stroke="none"/>
    <path d="M-18.15 -20.2 L-18.65 -20.9 Q-19.95 -21.6 -21.5 -21.9 L-21.8 -20.4 -22.3 -16.15 -22.35 -14.55 -22.05 -10.45 -21.95 -9.85 -21.35 -5.0 -21.35 -4.75 -21.25 -0.45 -21.2 0.5 -20.9 5.1 Q-20.5 7.95 -20.25 11.8 L-20.25 12.05 -20.1 14.65 -20.0 15.65 -17.6 17.85 M-10.35 0.7 L-11.15 -2.0 M-11.6 -3.5 L-11.95 -4.7 -13.95 -11.7 Q-15.6 -16.6 -18.15 -20.2 M-11.85 20.95 L-7.9 21.25 M-9.75 2.55 L-9.95 1.85 M-11.6 -3.5 L-11.15 -2.0 M-9.3 3.65 L-9.75 2.55 -8.5 2.55 -7.15 2.55 -7.05 2.55 -6.65 3.15 -5.7 4.55 -5.4 4.5 -4.5 4.5 -4.0 4.45 -3.85 4.45 -3.75 4.45 -2.25 4.45 1.3 4.8 3.2 5.25 4.5 5.7 4.65 5.75 6.05 6.3 8.4 7.2 11.65 8.3 12.85 8.6 15.05 9.15 15.7 9.3 17.4 9.7 17.85 9.8 17.8 9.9 20.9 10.5 21.2 10.5 21.25 10.55 22.1 13.35 22.35 15.3 22.3 16.7 21.9 18.75 21.4 20.05 21.35 20.2 14.25 21.2 13.8 21.25 13.3 21.35 13.0 21.35 11.75 21.5 9.05 21.75 4.65 21.9 4.5 21.9 -7.9 21.25 M-10.35 0.7 L-9.95 1.85 M-17.25 18.2 L-14.45 20.75 -12.0 20.95 -11.85 20.95 M-14.45 20.75 L-15.35 20.65 M21.25 10.55 L20.9 10.5 M15.8 13.5 L16.0 12.15 M15.8 13.5 L15.15 16.2 14.25 19.2 13.9 20.1" fill="none" stroke="#a36a6a" stroke-linecap="round" stroke-linejoin="round" stroke-opacity="0.4" stroke-width="0.05"/>
  </g>
</svg>
