<?xml version="1.0" encoding="UTF-8" standalone="no"?>
<svg xmlns:xlink="http://www.w3.org/1999/xlink" height="269.65px" width="156.3px" xmlns="http://www.w3.org/2000/svg">
  <g transform="matrix(1.0, 0.0, 0.0, 1.0, 156.3, 269.65)">
    <path d="M-84.35 -192.05 Q-81.55 -191.1 -81.45 -187.95 -81.25 -184.2 -86.05 -179.35 -90.8 -174.5 -94.5 -174.6 -97.85 -174.7 -100.9 -175.7 -105.55 -177.2 -105.7 -180.1 -105.95 -184.95 -101.4 -188.5 -99.4 -190.15 -97.5 -190.85 L-93.95 -191.45 -94.0 -192.25 -93.75 -192.3 -89.45 -192.7 -84.35 -192.05 M-80.35 -179.65 L-81.1 -180.6 Q-81.15 -182.05 -77.8 -185.9 L-77.25 -186.0 Q-75.75 -185.95 -72.65 -184.05 L-72.5 -181.7 -75.75 -180.45 Q-78.35 -179.15 -79.45 -179.2 -79.65 -179.2 -80.35 -179.65" fill="#ffffff" fill-rule="evenodd" stroke="none"/>
    <path d="M-86.75 -2.25 L-136.75 -3.6 Q-139.25 -7.35 -141.25 -11.2 -154.95 -36.7 -146.65 -63.8 -141.25 -81.2 -130.45 -94.95 L-129.4 -96.3 Q-127.6 -91.4 -122.2 -85.6 -118.05 -81.15 -113.15 -77.5 -118.1 -69.55 -123.0 -59.9 -129.85 -46.6 -133.45 -36.6 L-133.45 -36.55 -133.95 -35.25 -133.95 -34.35 -131.2 -34.3 -128.5 -35.55 Q-128.0 -34.65 -127.8 -32.8 L-127.3 -29.6 Q-125.55 -29.45 -124.65 -33.5 L-123.55 -39.05 Q-122.7 -38.9 -122.2 -37.9 L-122.6 -34.8 -122.35 -32.55 Q-122.05 -30.95 -121.3 -30.6 -120.9 -28.15 -119.9 -27.55 -118.1 -28.4 -117.45 -32.85 -116.9 -36.9 -114.4 -37.0 -114.1 -36.2 -114.1 -34.45 L-114.2 -32.0 -113.6 -28.3 Q-112.9 -26.45 -111.9 -26.45 -110.55 -26.4 -108.5 -36.55 -106.0 -48.75 -105.1 -50.85 -102.8 -56.2 -99.25 -61.9 -96.35 -66.7 -93.75 -69.5 -87.9 -67.65 -85.8 -67.55 L-75.5 -68.35 -74.65 -67.35 Q-68.6 -59.1 -68.15 -49.4 -67.95 -44.85 -68.35 -40.45 -69.1 -41.2 -69.6 -41.2 -71.15 -41.25 -73.3 -33.15 L-74.65 -28.3 Q-76.25 -22.5 -76.8 -21.4 -80.25 -14.45 -81.0 -12.3 -81.9 -9.8 -82.4 -7.2 L-84.1 -5.15 -84.85 -4.3 -86.75 -2.25 M-119.75 -106.45 L-115.5 -110.15 Q-109.7 -114.95 -103.0 -119.0 L-105.85 -122.0 -109.3 -125.95 Q-116.5 -135.25 -119.25 -145.8 -122.0 -156.2 -120.3 -167.9 L-120.2 -168.5 Q-118.7 -178.05 -111.2 -184.6 -101.3 -192.95 -89.5 -196.1 L-82.9 -197.45 Q-72.15 -199.0 -59.9 -196.55 L-59.8 -196.5 -59.25 -196.05 -56.8 -193.4 -52.4 -187.9 -51.9 -187.15 Q-44.05 -176.0 -43.6 -166.4 -43.1 -156.4 -45.2 -147.85 -45.5 -146.55 -45.95 -145.3 -49.05 -134.85 -56.5 -124.9 -63.95 -115.05 -74.8 -114.25 L-87.35 -113.75 Q-89.1 -114.05 -89.05 -114.35 L-88.95 -114.95 -89.85 -114.95 -91.4 -109.5 -91.7 -108.5 -91.7 -108.45 -92.7 -105.35 Q-94.65 -97.8 -95.1 -94.0 -101.45 -96.5 -109.05 -100.5 -112.8 -102.4 -119.75 -106.45 M-80.35 -179.65 Q-79.65 -179.2 -79.45 -179.2 -78.35 -179.15 -75.75 -180.45 L-72.5 -181.7 -72.65 -184.05 Q-75.75 -185.95 -77.25 -186.0 L-77.8 -185.9 Q-81.15 -182.05 -81.1 -180.6 L-80.35 -179.65 M-84.35 -192.05 L-89.45 -192.7 -93.75 -192.3 -94.0 -192.25 -93.95 -191.45 -97.5 -190.85 Q-99.4 -190.15 -101.4 -188.5 -105.95 -184.95 -105.7 -180.1 -105.55 -177.2 -100.9 -175.7 -97.85 -174.7 -94.5 -174.6 -90.8 -174.5 -86.05 -179.35 -81.25 -184.2 -81.45 -187.95 -81.55 -191.1 -84.35 -192.05 M-69.35 -143.65 L-68.5 -143.55 Q-63.0 -143.4 -63.7 -159.1 -63.95 -164.25 -65.1 -166.75 L-62.4 -165.8 Q-60.75 -165.05 -58.25 -163.3 L-58.0 -163.6 Q-59.05 -167.85 -60.85 -170.45 -63.4 -174.2 -67.2 -174.3 -72.7 -174.45 -74.8 -163.15 -76.25 -155.45 -75.85 -146.65 -75.75 -143.9 -74.3 -142.25 -72.7 -140.4 -69.65 -140.3 L-62.45 -141.95 -67.75 -142.0 Q-70.7 -142.0 -71.65 -143.55 L-71.2 -143.55 -69.9 -143.8 -69.35 -143.65 M-67.7 -136.3 Q-67.65 -135.75 -67.3 -136.0 L-65.2 -136.8 -63.0 -137.65 -61.85 -137.65 Q-63.35 -136.75 -64.95 -135.25 -67.85 -132.4 -70.35 -131.15 -74.4 -129.1 -78.2 -127.6 L-83.3 -126.65 -86.75 -125.8 -88.75 -126.55 -91.35 -127.2 -91.35 -127.1 -91.35 -126.75 Q-91.35 -126.3 -90.4 -125.8 -89.25 -125.1 -87.3 -125.0 L-87.15 -124.75 -85.75 -124.65 Q-77.4 -124.4 -68.1 -130.3 -64.55 -132.5 -62.15 -134.95 -60.35 -136.65 -60.0 -137.6 -58.05 -137.7 -57.45 -138.6 -59.95 -140.6 -64.0 -138.95 -67.7 -137.35 -67.7 -136.3 M-101.15 -148.9 L-101.15 -149.05 -101.0 -151.85 Q-100.85 -156.15 -101.3 -161.1 -101.5 -164.6 -102.85 -165.85 L-102.9 -165.9 -102.8 -166.0 -102.5 -166.55 -101.35 -168.4 -102.55 -169.25 Q-104.45 -170.25 -106.35 -170.35 -109.75 -170.45 -111.35 -165.5 -112.55 -161.8 -112.4 -157.8 -112.15 -153.5 -109.55 -146.85 -106.6 -139.05 -103.55 -139.0 -100.8 -138.9 -99.35 -145.05 -98.65 -147.95 -98.1 -151.65 L-99.25 -150.45 -101.05 -148.9 -101.15 -148.9" fill="#e2fcf6" fill-rule="evenodd" stroke="none"/>
    <path d="M-65.1 -166.75 Q-63.95 -164.25 -63.7 -159.1 -63.0 -143.4 -68.5 -143.55 L-69.35 -143.65 Q-70.1 -144.25 -70.1 -145.0 -70.2 -146.05 -69.1 -151.1 L-68.05 -156.4 -67.15 -162.45 Q-66.55 -165.85 -66.75 -168.65 -66.15 -168.4 -65.6 -167.55 L-65.1 -166.75 M-102.9 -165.9 L-102.85 -165.85 Q-101.5 -164.6 -101.3 -161.1 -100.85 -156.15 -101.0 -151.85 L-101.15 -149.05 -101.15 -148.9 Q-101.85 -143.3 -104.15 -143.35 L-104.7 -143.4 -105.4 -145.9 Q-106.1 -148.5 -106.25 -151.85 -106.85 -163.8 -102.95 -166.0 L-102.9 -165.9" fill="#545f63" fill-rule="evenodd" stroke="none"/>
    <path d="M-24.9 -105.85 L-22.45 -103.1 -19.35 -99.15 -19.25 -99.0 -19.5 -98.9 -20.55 -95.95 -21.9 -93.1 -26.55 -86.8 -29.65 -82.9 Q-29.65 -82.4 -24.95 -75.4 -19.9 -67.9 -18.75 -63.9 -17.65 -60.5 -16.45 -53.25 -15.15 -45.6 -14.95 -40.7 L-14.75 -36.05 Q-14.8 -34.05 -15.4 -31.5 L-15.25 -28.8 Q-14.8 -28.8 -14.85 -29.25 -13.05 -28.85 -12.55 -27.0 L-12.35 -24.4 Q-12.15 -20.75 -13.85 -13.0 -15.5 -5.2 -15.45 -3.35 L-15.5 -0.3 -45.1 -1.15 Q-43.5 -5.85 -42.2 -12.05 -40.65 -19.75 -39.9 -28.45 -39.3 -35.4 -39.45 -38.8 -39.85 -47.95 -43.15 -57.85 -45.95 -66.55 -50.7 -74.8 L-51.25 -75.75 -54.5 -74.15 Q-67.35 -68.55 -82.4 -68.95 -89.45 -69.15 -99.15 -73.5 L-102.0 -69.3 -107.65 -61.2 -108.9 -56.4 Q-111.0 -49.15 -112.2 -49.2 -113.1 -49.2 -113.7 -50.5 L-115.75 -44.0 Q-120.2 -30.5 -120.9 -30.5 L-121.3 -30.6 Q-122.05 -30.95 -122.35 -32.55 L-122.6 -34.8 -122.2 -37.9 -121.05 -42.85 Q-119.45 -48.6 -117.35 -53.8 -115.05 -59.6 -113.55 -61.25 -113.35 -61.4 -113.1 -61.5 -111.05 -69.05 -104.75 -76.25 -112.3 -80.4 -112.4 -83.5 -112.45 -84.45 -111.85 -85.0 -111.25 -85.5 -110.3 -85.5 -109.55 -85.45 -101.0 -80.35 L-100.9 -80.3 -96.3 -83.85 Q-92.8 -85.9 -92.75 -84.3 -92.7 -83.65 -95.9 -79.7 L-96.55 -78.2 Q-89.5 -75.15 -84.2 -75.0 -78.95 -74.85 -57.2 -80.95 -56.4 -81.25 -55.45 -81.8 L-63.45 -92.0 -77.75 -109.15 -79.55 -111.15 -76.45 -112.0 -76.9 -110.95 Q-76.8 -109.85 -76.25 -109.1 L-74.9 -108.15 Q-73.1 -107.4 -67.55 -107.25 -63.0 -107.15 -59.45 -108.55 -58.65 -105.15 -55.65 -98.35 -51.5 -88.7 -49.65 -88.65 L-45.25 -89.25 -43.95 -89.8 Q-42.7 -90.4 -41.5 -91.25 -39.1 -93.0 -35.3 -97.35 -31.45 -101.95 -29.45 -103.5 -27.25 -105.25 -24.9 -105.85 M-91.7 -108.5 L-91.55 -108.45 -91.7 -108.45 -91.7 -108.5 M-65.1 -166.75 L-65.6 -167.55 Q-66.15 -168.4 -66.75 -168.65 -67.7 -169.05 -68.8 -168.15 -70.65 -166.55 -71.75 -162.35 -73.0 -157.65 -72.7 -151.65 -72.9 -149.6 -72.45 -147.6 -71.85 -144.65 -69.9 -143.8 L-71.2 -143.55 -71.65 -143.55 Q-70.7 -142.0 -67.75 -142.0 L-62.45 -141.95 -69.65 -140.3 Q-72.7 -140.4 -74.3 -142.25 -75.75 -143.9 -75.85 -146.65 -76.25 -155.45 -74.8 -163.15 -72.7 -174.45 -67.2 -174.3 -63.4 -174.2 -60.85 -170.45 -59.05 -167.85 -58.0 -163.6 L-58.25 -163.3 Q-60.75 -165.05 -62.4 -165.8 L-65.1 -166.75 M-101.15 -148.9 L-101.05 -148.9 -99.25 -150.45 -98.1 -151.65 Q-98.65 -147.95 -99.35 -145.05 -100.8 -138.9 -103.55 -139.0 -106.6 -139.05 -109.55 -146.85 -112.15 -153.5 -112.4 -157.8 -112.55 -161.8 -111.35 -165.5 -109.75 -170.45 -106.35 -170.35 -104.45 -170.25 -102.55 -169.25 L-101.35 -168.4 -102.5 -166.55 -102.8 -166.0 -102.9 -165.9 -102.95 -166.0 Q-104.15 -166.95 -105.6 -165.75 -109.55 -162.65 -109.1 -153.0 -108.95 -150.4 -108.3 -148.05 -107.05 -143.95 -104.7 -143.4 L-104.15 -143.35 Q-101.85 -143.3 -101.15 -148.9 M-121.6 -55.9 Q-121.75 -52.4 -121.55 -51.2 L-121.2 -48.3 Q-120.95 -42.8 -122.35 -41.1 -122.9 -40.4 -124.3 -40.45 -125.65 -40.45 -126.35 -39.15 -127.0 -38.1 -128.0 -37.4 -128.95 -36.85 -129.6 -36.85 -130.85 -36.9 -131.25 -37.6 L-131.35 -38.4 Q-131.55 -41.15 -127.0 -47.05 -122.3 -53.25 -122.0 -55.9 L-121.6 -55.9" fill="#b3e6da" fill-rule="evenodd" stroke="none"/>
    <path d="M-66.75 -168.65 Q-66.55 -165.85 -67.15 -162.45 L-68.05 -156.4 -69.1 -151.1 Q-70.2 -146.05 -70.1 -145.0 -70.1 -144.25 -69.35 -143.65 L-69.9 -143.8 Q-71.85 -144.65 -72.45 -147.6 -72.9 -149.6 -72.7 -151.65 -73.0 -157.65 -71.75 -162.35 -70.65 -166.55 -68.8 -168.15 -67.7 -169.05 -66.75 -168.65 M-102.95 -166.0 Q-106.85 -163.8 -106.25 -151.85 -106.1 -148.5 -105.4 -145.9 L-104.7 -143.4 Q-107.05 -143.95 -108.3 -148.05 -108.95 -150.4 -109.1 -153.0 -109.55 -162.65 -105.6 -165.75 -104.15 -166.95 -102.95 -166.0" fill="#5f6c70" fill-rule="evenodd" stroke="none"/>
    <path d="M-34.85 -121.35 L-36.0 -119.35 -37.45 -117.45 Q-31.6 -112.8 -26.75 -107.75 L-24.9 -105.85 Q-27.25 -105.25 -29.45 -103.5 -31.45 -101.95 -35.3 -97.35 -39.1 -93.0 -41.5 -91.25 -42.7 -90.4 -43.95 -89.8 L-45.25 -89.25 -49.65 -88.65 Q-51.5 -88.7 -55.65 -98.35 -58.65 -105.15 -59.45 -108.55 -63.0 -107.15 -67.55 -107.25 -73.1 -107.4 -74.9 -108.15 L-76.25 -109.1 Q-76.8 -109.85 -76.9 -110.95 L-76.45 -112.0 -79.55 -111.15 -77.75 -109.15 -63.45 -92.0 -55.45 -81.8 Q-56.4 -81.25 -57.2 -80.95 -78.95 -74.85 -84.2 -75.0 -89.5 -75.15 -96.55 -78.2 L-95.9 -79.7 Q-92.7 -83.65 -92.75 -84.3 -92.8 -85.9 -96.3 -83.85 L-100.9 -80.3 -101.0 -80.35 Q-109.55 -85.45 -110.3 -85.5 -111.25 -85.5 -111.85 -85.0 -112.45 -84.45 -112.4 -83.5 -112.3 -80.4 -104.75 -76.25 -111.05 -69.05 -113.1 -61.5 -113.35 -61.4 -113.55 -61.25 -115.05 -59.6 -117.35 -53.8 -119.45 -48.6 -121.05 -42.85 L-122.2 -37.9 Q-122.7 -38.9 -123.55 -39.05 L-124.65 -33.5 Q-125.55 -29.45 -127.3 -29.6 L-127.8 -32.8 Q-128.0 -34.65 -128.5 -35.55 L-131.2 -34.3 -133.95 -34.35 -133.95 -35.25 -133.45 -36.55 -133.45 -36.6 Q-129.85 -46.6 -123.0 -59.9 -118.1 -69.55 -113.15 -77.5 -118.05 -81.15 -122.2 -85.6 -127.6 -91.4 -129.4 -96.3 L-129.3 -96.4 Q-124.95 -101.75 -119.75 -106.45 -112.8 -102.4 -109.05 -100.5 -101.45 -96.5 -95.1 -94.0 -94.65 -97.8 -92.7 -105.35 L-91.7 -108.45 -91.55 -108.45 -91.7 -108.5 -91.4 -109.5 -89.85 -114.95 -88.95 -114.95 -89.05 -114.35 Q-89.1 -114.05 -87.35 -113.75 L-74.8 -114.25 Q-63.95 -115.05 -56.5 -124.9 -49.05 -134.85 -45.95 -145.3 -45.5 -146.55 -45.2 -147.85 -43.1 -156.4 -43.6 -166.4 -44.05 -176.0 -51.9 -187.15 L-52.4 -187.9 -56.8 -193.4 -59.25 -196.05 -59.8 -196.5 -59.25 -196.45 Q-49.05 -194.4 -42.05 -189.55 -36.05 -185.4 -32.3 -179.1 L-30.95 -173.45 Q-28.95 -165.6 -28.7 -160.1 -28.25 -150.6 -36.25 -135.25 L-37.45 -133.05 Q-41.2 -126.2 -45.15 -121.1 -49.1 -115.9 -51.6 -114.75 L-50.2 -114.7 Q-42.8 -116.45 -36.25 -120.45 L-34.85 -121.35 M-45.1 -1.15 L-86.75 -2.25 -84.85 -4.3 -84.1 -5.15 -82.4 -7.2 Q-81.9 -9.8 -81.0 -12.3 -80.25 -14.45 -76.8 -21.4 -76.25 -22.5 -74.65 -28.3 L-73.3 -33.15 Q-71.15 -41.25 -69.6 -41.2 -69.1 -41.2 -68.35 -40.45 -67.95 -44.85 -68.15 -49.4 -68.6 -59.1 -74.65 -67.35 L-75.5 -68.35 -85.8 -67.55 Q-87.9 -67.65 -93.75 -69.5 -96.35 -66.7 -99.25 -61.9 -102.8 -56.2 -105.1 -50.85 -106.0 -48.75 -108.5 -36.55 -110.55 -26.4 -111.9 -26.45 -112.9 -26.45 -113.6 -28.3 L-114.2 -32.0 -114.1 -34.45 Q-114.1 -36.2 -114.4 -37.0 -116.9 -36.9 -117.45 -32.85 -118.1 -28.4 -119.9 -27.55 -120.9 -28.15 -121.3 -30.6 L-120.9 -30.5 Q-120.2 -30.5 -115.75 -44.0 L-113.7 -50.5 Q-113.1 -49.2 -112.2 -49.2 -111.0 -49.15 -108.9 -56.4 L-107.65 -61.2 -102.0 -69.3 -99.15 -73.5 Q-89.45 -69.15 -82.4 -68.95 -67.35 -68.55 -54.5 -74.15 L-51.25 -75.75 -50.7 -74.8 Q-45.95 -66.55 -43.15 -57.85 -39.85 -47.95 -39.45 -38.8 -39.3 -35.4 -39.9 -28.45 -40.65 -19.75 -42.2 -12.05 -43.5 -5.85 -45.1 -1.15 M-121.6 -55.9 L-122.0 -55.9 Q-122.3 -53.25 -127.0 -47.05 -131.55 -41.15 -131.35 -38.4 L-131.25 -37.6 Q-130.85 -36.9 -129.6 -36.85 -128.95 -36.85 -128.0 -37.4 -127.0 -38.1 -126.35 -39.15 -125.65 -40.45 -124.3 -40.45 -122.9 -40.4 -122.35 -41.1 -120.95 -42.8 -121.2 -48.3 L-121.55 -51.2 Q-121.75 -52.4 -121.6 -55.9" fill="#c8f5eb" fill-rule="evenodd" stroke="none"/>
    <path d="M-19.1 -98.75 L-18.65 -98.15 Q-14.05 -91.8 -10.65 -84.75 -5.7 -74.5 -3.4 -62.75 -1.2 -50.95 -0.3 -39.0 0.9 -22.85 -2.65 -7.45 L-4.75 0.0 -15.5 -0.3 -15.45 -3.35 Q-15.5 -5.2 -13.85 -13.0 -12.15 -20.75 -12.35 -24.4 L-12.55 -27.0 Q-13.05 -28.85 -14.85 -29.25 -14.8 -28.8 -15.25 -28.8 L-15.4 -31.5 Q-14.8 -34.05 -14.75 -36.05 L-14.95 -40.7 Q-15.15 -45.6 -16.45 -53.25 -17.65 -60.5 -18.75 -63.9 -19.9 -67.9 -24.95 -75.4 -29.65 -82.4 -29.65 -82.9 L-26.55 -86.8 -21.9 -93.1 -20.55 -95.95 -19.5 -98.9 -19.1 -98.75 M-32.3 -179.1 Q-29.1 -173.6 -27.65 -166.45 -23.6 -145.85 -31.3 -128.1 L-34.2 -122.35 -34.85 -121.35 -36.25 -120.45 Q-42.8 -116.45 -50.2 -114.7 L-51.6 -114.75 Q-49.1 -115.9 -45.15 -121.1 -41.2 -126.2 -37.45 -133.05 L-36.25 -135.25 Q-28.25 -150.6 -28.7 -160.1 -28.95 -165.6 -30.95 -173.45 L-32.3 -179.1" fill="#d1fff5" fill-rule="evenodd" stroke="none"/>
    <path d="M-67.7 -136.3 Q-67.7 -137.35 -64.0 -138.95 -59.95 -140.6 -57.45 -138.6 -58.05 -137.7 -60.0 -137.6 -60.35 -136.65 -62.15 -134.95 -64.55 -132.5 -68.1 -130.3 -77.4 -124.4 -85.75 -124.65 L-87.15 -124.75 -87.3 -125.0 Q-89.25 -125.1 -90.4 -125.8 -91.35 -126.3 -91.35 -126.75 L-91.35 -127.1 -91.35 -127.2 -88.75 -126.55 -86.75 -125.8 -83.3 -126.65 -78.2 -127.6 Q-74.4 -129.1 -70.35 -131.15 -67.85 -132.4 -64.95 -135.25 -63.35 -136.75 -61.85 -137.65 L-63.0 -137.65 -65.2 -136.8 -67.3 -136.0 Q-67.65 -135.75 -67.7 -136.3" fill="#9bc7bc" fill-rule="evenodd" stroke="none"/>
    <path d="M-19.25 -99.0 L-19.1 -98.75 -19.5 -98.9 -19.25 -99.0" fill="#d8e6e3" fill-rule="evenodd" stroke="none"/>
    <path d="M-83.65 -145.25 Q-81.9 -144.45 -80.6 -143.1 -78.45 -140.7 -78.3 -137.45 -78.2 -134.95 -80.1 -132.7 -81.55 -131.0 -83.7 -130.3 L-87.75 -131.3 -102.6 -135.4 Q-106.35 -136.5 -117.45 -138.1 -127.55 -139.55 -133.25 -141.7 L-127.15 -142.35 -120.1 -143.0 Q-109.05 -142.7 -97.3 -143.65 L-83.65 -145.25" fill="#a46628" fill-rule="evenodd" stroke="none"/>
    <path d="M-83.7 -130.3 L-87.45 -129.9 Q-95.9 -130.1 -112.15 -132.6 L-130.2 -135.6 -144.95 -138.3 Q-156.25 -140.7 -156.3 -141.65 -156.45 -144.3 -151.95 -145.0 -148.7 -145.55 -139.2 -145.25 -110.3 -144.45 -92.6 -146.5 -87.15 -146.85 -83.65 -145.25 L-97.3 -143.65 Q-109.05 -142.7 -120.1 -143.0 L-127.15 -142.35 -133.25 -141.7 Q-127.55 -139.55 -117.45 -138.1 -106.35 -136.5 -102.6 -135.4 L-87.75 -131.3 -83.7 -130.3" fill="#cf8133" fill-rule="evenodd" stroke="none"/>
    <path d="M-41.65 -102.75 L-41.85 -104.4 Q-41.95 -106.65 -41.4 -109.1 -40.75 -111.65 -40.85 -113.35 -40.9 -115.0 -42.25 -116.9 L-43.55 -118.2 -36.05 -121.55 Q-36.4 -114.35 -37.9 -109.7 -39.2 -105.8 -41.65 -102.75 M-61.2 -111.6 L-60.05 -111.9 -59.95 -111.9 -59.8 -111.9 Q-58.0 -111.85 -57.35 -108.9 L-61.0 -106.6 Q-62.85 -105.0 -64.85 -102.0 -67.5 -98.1 -72.9 -92.2 -79.2 -85.3 -86.65 -81.65 -87.75 -81.05 -97.0 -78.15 L-102.7 -76.3 -110.95 -79.9 -112.25 -80.5 -112.65 -80.7 -111.1 -80.75 Q-103.1 -81.2 -93.05 -86.3 -85.1 -90.45 -78.1 -96.15 -75.75 -98.1 -73.9 -100.9 L-71.0 -105.5 Q-68.4 -109.25 -63.35 -111.25 L-61.75 -111.5 -61.2 -111.6 M-57.1 -97.25 L-57.15 -94.3 -56.95 -92.45 Q-55.45 -93.35 -55.45 -98.0 L-55.4 -98.25 -53.1 -99.6 -52.85 -99.8 -52.6 -97.45 Q-52.35 -94.0 -51.85 -92.8 L-56.8 -87.05 -60.75 -82.5 Q-63.4 -79.65 -65.3 -78.6 L-73.45 -74.0 -76.15 -72.35 -78.15 -72.4 -86.4 -72.05 -90.3 -72.55 Q-79.25 -77.2 -72.65 -83.2 -70.7 -85.0 -67.5 -88.7 -64.65 -91.85 -62.85 -93.25 L-57.1 -97.25 M-50.05 -94.85 Q-49.85 -96.25 -49.8 -98.35 L-49.65 -102.7 -48.05 -104.55 -47.6 -101.35 -47.05 -97.8 -50.05 -94.85 M-44.8 -99.5 L-44.75 -101.1 -44.8 -105.9 -45.05 -106.85 -45.3 -107.85 -45.25 -108.25 -45.15 -108.4 -45.15 -108.55 -45.1 -108.5 Q-43.55 -106.95 -42.95 -101.95 L-42.9 -101.3 -44.8 -99.5 M-34.75 -122.1 L-34.2 -122.3 Q-30.25 -123.5 -30.4 -114.7 L-31.15 -113.25 -32.85 -109.65 -31.7 -107.9 Q-30.65 -106.5 -30.65 -105.9 L-33.55 -97.35 -34.95 -91.1 -35.4 -88.95 Q-38.9 -86.3 -43.15 -83.75 -45.95 -82.1 -48.7 -80.6 -46.85 -86.35 -41.85 -93.05 L-36.2 -100.3 Q-33.65 -103.7 -33.7 -105.05 -33.75 -106.1 -34.55 -107.0 -35.35 -107.95 -36.4 -107.7 L-36.45 -108.05 Q-35.45 -109.75 -34.55 -112.6 -33.35 -115.95 -33.45 -117.85 L-33.65 -120.1 Q-33.85 -121.15 -34.75 -122.1 M-27.9 -114.35 Q-25.85 -113.55 -25.15 -110.85 L-24.65 -108.7 -24.3 -107.15 Q-23.55 -105.05 -22.2 -103.95 L-22.45 -103.0 Q-23.2 -101.15 -24.85 -98.95 -26.1 -97.25 -27.85 -95.4 -27.0 -101.5 -27.35 -108.9 L-27.55 -111.5 -27.9 -114.35 M-71.95 -112.05 L-77.8 -110.4 Q-84.25 -108.25 -86.2 -105.9 -89.75 -101.65 -92.9 -98.9 -94.45 -97.4 -98.35 -94.45 -102.3 -91.3 -110.95 -89.8 -117.95 -88.5 -125.3 -88.7 L-126.0 -88.9 Q-129.7 -92.05 -130.4 -94.8 -128.9 -93.95 -126.0 -93.75 L-122.65 -93.65 Q-116.75 -93.5 -108.0 -96.95 -99.7 -100.2 -97.55 -103.1 L-94.05 -107.45 Q-91.35 -110.35 -89.25 -111.35 L-84.05 -114.0 -82.7 -114.6 -71.95 -112.05 M-104.75 -121.45 Q-106.8 -121.4 -107.9 -119.8 -109.1 -117.5 -110.05 -116.4 -111.0 -115.2 -113.55 -114.6 L-114.3 -114.4 -114.25 -114.5 Q-111.2 -117.6 -111.3 -119.85 -111.35 -121.1 -111.75 -122.35 L-112.1 -123.8 Q-112.0 -124.55 -109.3 -125.95 -108.65 -123.15 -105.9 -121.95 L-104.75 -121.45 M-122.3 -107.55 Q-118.9 -107.7 -114.1 -109.4 -110.4 -110.65 -107.4 -112.2 -104.15 -113.8 -102.8 -116.1 -102.1 -117.25 -99.95 -118.1 L-96.95 -118.75 -91.25 -116.95 Q-93.75 -116.45 -96.05 -115.1 -99.1 -113.35 -102.4 -109.45 -104.45 -107.05 -105.65 -106.1 -107.1 -105.0 -109.45 -104.25 L-115.4 -102.35 -120.95 -102.15 -124.55 -102.25 -127.35 -102.85 -122.55 -107.35 -122.3 -107.55 M-124.7 -82.25 L-123.85 -84.05 -116.1 -78.6 -114.45 -69.5 Q-112.85 -62.3 -110.6 -55.0 L-110.45 -54.95 -110.5 -54.7 Q-110.8 -52.4 -110.9 -41.35 L-111.1 -37.2 -113.65 -43.7 -118.05 -56.95 -121.6 -69.8 -124.7 -82.25 M-104.6 -70.4 L-106.7 -66.95 -108.05 -63.95 Q-109.35 -68.1 -110.0 -72.25 L-110.25 -74.55 -104.6 -70.4 M-128.8 -74.1 L-126.9 -65.85 -123.45 -54.3 -120.7 -46.55 -119.75 -43.8 -119.9 -38.75 Q-119.9 -31.2 -121.4 -28.9 -122.15 -29.95 -122.75 -32.3 L-123.3 -35.6 -123.0 -38.85 Q-122.55 -41.5 -122.6 -42.2 L-123.5 -46.6 Q-124.3 -50.25 -124.6 -50.45 -126.65 -48.8 -126.7 -41.25 L-126.9 -41.2 -129.4 -50.1 -129.55 -50.1 -129.55 -50.55 -129.7 -52.1 Q-129.9 -53.0 -130.25 -53.4 L-132.8 -64.45 -131.55 -68.0 -128.8 -74.1 M-131.55 -43.25 L-131.6 -43.05 Q-132.05 -36.0 -134.9 -34.25 L-135.4 -45.3 Q-135.7 -48.7 -135.45 -52.45 -133.7 -47.85 -131.55 -43.25 M-130.0 -39.7 L-127.2 -33.7 Q-127.5 -31.7 -128.05 -30.7 -128.05 -31.25 -129.2 -31.3 L-129.8 -38.1 -130.0 -39.7" fill="#9be0fd" fill-rule="evenodd" stroke="none"/>
    <path d="M-122.65 -86.35 L-116.9 -82.9 -116.1 -78.6 -123.85 -84.05 -122.65 -86.35 M-110.45 -54.95 L-110.6 -55.0 -110.45 -55.05 -110.45 -54.95 M-110.25 -74.55 L-110.95 -79.9 -102.7 -76.3 -100.2 -75.45 Q-102.75 -73.05 -104.6 -70.4 L-110.25 -74.55 M-129.55 -50.1 L-129.4 -50.1 -129.55 -50.1 M-126.9 -41.2 L-126.7 -41.25 -126.7 -40.6 -126.9 -41.2 M-130.25 -53.4 L-130.25 -53.35 -130.25 -53.4" fill="#8ec9e6" fill-rule="evenodd" stroke="none"/>
    <path d="M-43.55 -118.2 L-42.25 -116.9 Q-40.9 -115.0 -40.85 -113.35 -40.75 -111.65 -41.4 -109.1 -41.95 -106.65 -41.85 -104.4 L-41.65 -102.75 -41.0 -98.75 -41.15 -98.4 Q-41.8 -97.4 -42.15 -97.4 -42.45 -97.4 -42.9 -101.3 L-42.95 -101.95 Q-43.55 -106.95 -45.1 -108.5 L-45.15 -108.55 -45.15 -108.4 -45.25 -108.25 -45.3 -107.85 -45.05 -106.85 -44.8 -105.9 -44.75 -101.1 -44.8 -99.5 Q-45.2 -96.4 -46.15 -95.4 -46.65 -96.2 -47.05 -97.8 L-47.6 -101.35 -48.05 -104.55 Q-48.5 -106.55 -49.1 -107.5 -49.5 -106.4 -49.65 -102.7 L-49.8 -98.35 Q-49.85 -96.25 -50.05 -94.85 -50.4 -92.3 -51.35 -92.3 L-51.85 -92.8 Q-52.35 -94.0 -52.6 -97.45 L-52.85 -99.8 Q-53.4 -103.55 -54.55 -104.85 -55.35 -103.45 -55.4 -98.25 L-55.45 -98.0 Q-55.45 -93.35 -56.95 -92.45 L-57.15 -94.3 -57.1 -97.25 -57.0 -98.5 Q-56.8 -100.7 -56.95 -103.8 L-57.35 -108.75 -57.35 -108.9 Q-58.0 -111.85 -59.8 -111.9 L-59.95 -111.9 -60.05 -111.9 -61.2 -111.6 -60.65 -112.15 -60.4 -112.65 Q-59.9 -113.9 -58.65 -114.4 L-54.0 -115.6 Q-53.55 -115.7 -50.15 -117.5 -47.15 -119.05 -45.75 -119.0 -44.6 -119.0 -43.55 -118.2" fill="#b0e5ff" fill-rule="evenodd" stroke="none"/>
    <path d="M-41.65 -102.75 Q-39.2 -105.8 -37.9 -109.7 -36.4 -114.35 -36.05 -121.55 L-35.0 -122.05 -34.75 -122.1 Q-33.85 -121.15 -33.65 -120.1 L-33.45 -117.85 Q-33.35 -115.95 -34.55 -112.6 -35.45 -109.75 -36.45 -108.05 L-36.4 -107.7 Q-35.35 -107.95 -34.55 -107.0 -33.75 -106.1 -33.7 -105.05 -33.65 -103.7 -36.2 -100.3 L-41.85 -93.05 Q-46.85 -86.35 -48.7 -80.6 -63.75 -72.65 -76.15 -72.35 L-73.45 -74.0 -65.3 -78.6 Q-63.4 -79.65 -60.75 -82.5 L-56.8 -87.05 -51.85 -92.8 -51.35 -92.3 Q-50.4 -92.3 -50.05 -94.85 L-47.05 -97.8 Q-46.65 -96.2 -46.15 -95.4 -45.2 -96.4 -44.8 -99.5 L-42.9 -101.3 Q-42.45 -97.4 -42.15 -97.4 -41.8 -97.4 -41.15 -98.4 L-41.0 -98.75 -41.65 -102.75 M-57.35 -108.9 L-57.35 -108.75 -56.95 -103.8 Q-56.8 -100.7 -57.0 -98.5 L-57.1 -97.25 -62.85 -93.25 Q-64.65 -91.85 -67.5 -88.7 -70.7 -85.0 -72.65 -83.2 -79.25 -77.2 -90.3 -72.55 -93.4 -73.15 -97.65 -74.55 L-100.2 -75.45 -102.7 -76.3 -97.0 -78.15 Q-87.75 -81.05 -86.65 -81.65 -79.2 -85.3 -72.9 -92.2 -67.5 -98.1 -64.85 -102.0 -62.85 -105.0 -61.0 -106.6 L-57.35 -108.9 M-55.4 -98.25 Q-55.35 -103.45 -54.55 -104.85 -53.4 -103.55 -52.85 -99.8 L-53.1 -99.6 -55.4 -98.25 M-49.65 -102.7 Q-49.5 -106.4 -49.1 -107.5 -48.5 -106.55 -48.05 -104.55 L-49.65 -102.7 M-35.4 -88.95 L-34.95 -91.1 -33.55 -97.35 -30.65 -105.9 Q-30.65 -106.5 -31.7 -107.9 L-32.85 -109.65 -31.15 -113.25 -30.4 -114.7 -30.4 -114.65 -27.9 -114.35 -27.55 -111.5 -27.35 -108.9 Q-27.0 -101.5 -27.85 -95.4 L-29.15 -94.2 Q-31.95 -91.55 -35.4 -88.95 M-71.95 -112.05 L-65.1 -111.15 -63.35 -111.25 Q-68.4 -109.25 -71.0 -105.5 L-73.9 -100.9 Q-75.75 -98.1 -78.1 -96.15 -85.1 -90.45 -93.05 -86.3 -103.1 -81.2 -111.1 -80.75 L-112.65 -80.7 -116.9 -82.9 -122.65 -86.35 Q-124.55 -87.65 -126.0 -88.9 L-125.3 -88.7 Q-117.95 -88.5 -110.95 -89.8 -102.3 -91.3 -98.35 -94.45 -94.45 -97.4 -92.9 -98.9 -89.75 -101.65 -86.2 -105.9 -84.25 -108.25 -77.8 -110.4 L-71.95 -112.05 M-82.7 -114.6 L-84.05 -114.0 -89.25 -111.35 Q-91.35 -110.35 -94.05 -107.45 L-97.55 -103.1 Q-99.7 -100.2 -108.0 -96.95 -116.75 -93.5 -122.65 -93.65 L-126.0 -93.75 Q-128.9 -93.95 -130.4 -94.8 L-130.45 -94.9 -130.5 -95.0 -130.65 -95.9 Q-130.8 -98.9 -127.75 -102.45 L-127.35 -102.85 -124.55 -102.25 -120.95 -102.15 -115.4 -102.35 -109.45 -104.25 Q-107.1 -105.0 -105.65 -106.1 -104.45 -107.05 -102.4 -109.45 -99.1 -113.35 -96.05 -115.1 -93.75 -116.45 -91.25 -116.95 L-89.8 -116.6 -82.7 -114.6 M-114.3 -114.4 L-113.55 -114.6 Q-111.0 -115.2 -110.05 -116.4 -109.1 -117.5 -107.9 -119.8 -106.8 -121.4 -104.75 -121.45 L-96.95 -118.75 -99.95 -118.1 Q-102.1 -117.25 -102.8 -116.1 -104.15 -113.8 -107.4 -112.2 -110.4 -110.65 -114.1 -109.4 -118.9 -107.7 -122.3 -107.55 L-121.0 -108.65 Q-115.9 -112.85 -114.3 -114.4 M-124.7 -82.25 L-121.6 -69.8 -118.05 -56.95 -113.65 -43.7 -111.1 -37.2 Q-111.7 -31.4 -113.6 -28.7 L-113.95 -29.15 -114.25 -29.2 Q-115.3 -38.25 -115.8 -40.8 -116.95 -46.9 -119.0 -49.75 -119.5 -48.05 -119.75 -43.8 L-120.7 -46.55 -123.45 -54.3 -126.9 -65.85 -128.8 -74.1 -124.7 -82.25 M-110.6 -55.0 Q-112.85 -62.3 -114.45 -69.5 L-116.1 -78.6 -114.2 -77.25 -110.25 -74.55 -110.0 -72.25 Q-109.35 -68.1 -108.05 -63.95 -109.6 -60.1 -110.45 -55.05 L-110.6 -55.0 M-132.8 -64.45 L-130.25 -53.4 -130.25 -53.35 Q-131.05 -51.6 -131.55 -43.25 -133.7 -47.85 -135.45 -52.45 -134.9 -58.1 -132.8 -64.45 M-129.4 -50.1 L-126.9 -41.2 -126.7 -40.6 Q-126.75 -36.35 -127.2 -33.7 L-130.0 -39.7 -130.3 -42.65 -129.9 -46.4 -129.55 -50.1 -129.4 -50.1" fill="#e5f7ff" fill-rule="evenodd" stroke="none"/>
    <path d="M-116.9 -82.9 L-112.65 -80.7 -112.25 -80.5 -110.95 -79.9 -110.25 -74.55 -114.2 -77.25 -116.1 -78.6 -116.9 -82.9" fill="#cedee6" fill-rule="evenodd" stroke="none"/>
    <path d="M-122.05 -200.95 L-122.0 -200.95 -121.95 -200.75 -122.05 -200.95" fill="#556a77" fill-rule="evenodd" stroke="none"/>
    <path d="M-82.9 -225.5 L-83.15 -227.4 -83.45 -229.5 Q-84.35 -234.85 -86.25 -241.65 L-91.65 -259.55 Q-89.4 -263.35 -84.65 -266.55 L-83.3 -267.25 -86.3 -264.55 Q-90.25 -261.1 -90.05 -259.5 -89.8 -257.65 -87.75 -250.85 L-85.75 -244.1 -84.15 -236.25 -82.75 -229.55 -82.6 -228.4 -82.25 -226.0 -82.9 -225.5" fill="#b0bec9" fill-rule="evenodd" stroke="none"/>
    <path d="M-57.45 -202.15 L-50.0 -206.35 Q-47.1 -207.7 -44.05 -208.45 -47.1 -207.5 -50.1 -205.3 -54.55 -201.5 -57.45 -199.75 L-57.45 -202.15 M-76.5 -228.25 L-76.5 -230.0 -76.55 -233.2 Q-76.75 -240.8 -77.85 -248.5 -78.25 -251.25 -79.6 -257.0 L-80.95 -262.3 Q-75.45 -266.1 -67.2 -266.7 -59.05 -267.25 -52.6 -263.5 -56.35 -265.6 -59.95 -265.35 -66.15 -264.9 -67.75 -261.45 -68.15 -260.55 -69.2 -252.65 L-69.8 -243.35 Q-70.05 -237.4 -70.8 -233.6 L-71.4 -230.35 -71.75 -228.55 -72.4 -228.55 -74.15 -228.5 -76.5 -228.25 M-46.9 -258.75 Q-44.05 -255.4 -43.3 -250.9 L-49.45 -240.7 Q-52.15 -235.8 -53.65 -231.6 L-55.0 -227.0 -56.35 -221.7 -58.3 -223.55 -57.65 -227.25 Q-57.25 -229.2 -56.25 -231.4 L-54.7 -234.55 Q-51.6 -239.85 -51.05 -241.2 L-48.05 -247.6 Q-45.35 -253.65 -45.65 -255.8 -45.9 -257.35 -46.9 -258.75 M-80.8 -201.3 L-78.8 -200.65 Q-76.9 -200.1 -75.2 -199.85 L-75.9 -194.1 -76.15 -194.1 -83.25 -195.4 Q-81.95 -198.0 -80.8 -201.3 M-59.15 -195.55 L-61.05 -194.9 -61.3 -195.9 Q-61.6 -197.95 -61.4 -201.35 L-59.8 -201.95 Q-59.9 -199.7 -59.6 -197.7 L-59.15 -195.55" fill="#60676e" fill-rule="evenodd" stroke="none"/>
    <path d="M-90.05 -198.35 L-89.05 -198.2 -85.95 -197.5 -86.15 -196.15 -85.4 -195.9 -83.25 -195.4 -76.15 -194.1 -75.9 -194.1 Q-67.5 -193.1 -61.05 -194.9 L-59.15 -195.55 Q-58.2 -195.9 -57.3 -196.35 L-57.4 -198.7 -57.45 -199.15 -57.45 -199.75 Q-54.55 -201.5 -50.1 -205.3 -47.1 -207.5 -44.05 -208.45 L-37.95 -209.5 -36.85 -209.55 -35.1 -209.55 -34.8 -209.5 -34.8 -209.4 Q-33.35 -209.25 -32.3 -208.55 L-31.3 -208.25 Q-27.45 -206.5 -27.2 -204.2 -27.0 -201.9 -29.35 -200.0 -31.7 -198.15 -34.7 -196.7 -41.7 -193.2 -50.15 -190.5 L-52.4 -189.85 -57.45 -189.35 Q-67.3 -188.65 -76.75 -190.45 L-82.15 -191.75 Q-85.35 -193.2 -87.25 -193.9 L-94.3 -196.5 Q-97.95 -197.85 -100.5 -199.35 L-94.35 -198.85 -90.05 -198.35 M-67.65 -228.1 L-67.3 -229.8 -67.0 -230.65 -63.7 -242.85 Q-62.6 -247.75 -62.05 -252.3 L-62.25 -256.4 Q-62.15 -260.35 -60.8 -260.45 -57.7 -260.65 -52.95 -257.4 -48.6 -254.3 -48.35 -252.75 -53.2 -241.9 -55.25 -238.0 -56.7 -235.1 -58.0 -231.3 L-58.2 -230.75 -60.0 -224.85 -61.95 -226.1 Q-64.6 -227.55 -67.65 -228.1 M-64.2 -200.6 L-63.4 -195.3 -67.9 -195.0 -68.95 -197.65 -69.6 -199.7 -64.2 -200.6" fill="#454a4f" fill-rule="evenodd" stroke="none"/>
    <path d="M-72.4 -228.55 L-71.75 -228.55 -73.7 -214.2 -75.2 -199.85 Q-76.9 -200.1 -78.8 -200.65 L-80.8 -201.3 -79.4 -206.3 Q-78.2 -211.35 -77.15 -219.35 -76.65 -222.95 -76.5 -227.35 L-75.1 -227.85 -72.4 -228.55 M-61.4 -201.35 Q-61.15 -206.4 -59.95 -214.45 L-58.3 -223.55 -56.35 -221.7 -58.65 -212.4 Q-59.85 -206.6 -59.8 -201.95 L-61.4 -201.35" fill="#a63333" fill-rule="evenodd" stroke="none"/>
    <path d="M-54.6 -219.75 Q-57.15 -211.1 -57.45 -203.15 -58.5 -202.5 -59.8 -201.95 -59.85 -206.6 -58.65 -212.4 L-56.35 -221.7 -54.6 -219.75 M-83.85 -202.8 Q-83.2 -205.55 -82.7 -209.8 -81.9 -215.75 -81.85 -218.9 -81.8 -221.35 -82.1 -224.6 L-82.15 -224.85 Q-80.5 -226.35 -77.55 -227.05 L-76.5 -227.35 Q-76.65 -222.95 -77.15 -219.35 -78.2 -211.35 -79.4 -206.3 L-80.8 -201.3 Q-82.75 -202.0 -83.85 -202.8" fill="#c24545" fill-rule="evenodd" stroke="none"/>
    <path d="M-120.7 -200.75 L-120.7 -200.8 -114.25 -201.05 Q-103.4 -201.0 -90.05 -198.35 L-94.35 -198.85 -100.5 -199.35 Q-97.95 -197.85 -94.3 -196.5 L-87.25 -193.9 Q-85.35 -193.2 -82.15 -191.75 L-86.85 -193.15 -92.1 -194.85 -93.7 -195.4 -106.3 -199.35 Q-110.35 -200.35 -114.2 -200.65 -117.5 -201.0 -120.7 -200.75 M-85.95 -197.5 L-84.85 -203.65 -83.85 -202.8 Q-82.75 -202.0 -80.8 -201.3 -81.95 -198.0 -83.25 -195.4 L-85.4 -195.9 -86.15 -196.15 -85.95 -197.5 M-83.3 -267.25 Q-78.3 -269.65 -66.85 -269.65 -53.9 -269.6 -44.85 -261.95 -39.6 -257.55 -40.1 -252.55 -40.45 -248.75 -43.95 -244.65 L-50.0 -231.85 -51.2 -229.2 Q-53.25 -224.4 -54.6 -219.75 L-56.35 -221.7 -55.0 -227.0 -53.65 -231.6 Q-52.15 -235.8 -49.45 -240.7 L-43.3 -250.9 Q-44.05 -255.4 -46.9 -258.75 -48.65 -260.9 -51.2 -262.65 L-52.6 -263.5 Q-59.05 -267.25 -67.2 -266.7 -75.45 -266.1 -80.95 -262.3 L-79.6 -257.0 Q-78.25 -251.25 -77.85 -248.5 -76.75 -240.8 -76.55 -233.2 L-76.5 -230.0 -76.5 -228.25 -79.4 -227.6 Q-80.85 -227.1 -82.25 -226.0 L-82.6 -228.4 -82.75 -229.55 -84.15 -236.25 -85.75 -244.1 -87.75 -250.85 Q-89.8 -257.65 -90.05 -259.5 -90.25 -261.1 -86.3 -264.55 L-83.3 -267.25 M-57.45 -203.15 L-57.45 -202.15 -57.45 -199.75 -57.45 -199.15 -57.4 -198.7 -57.3 -196.35 Q-58.2 -195.9 -59.15 -195.55 L-59.6 -197.7 Q-59.9 -199.7 -59.8 -201.95 -58.5 -202.5 -57.45 -203.15 M-34.8 -209.5 L-30.3 -208.9 Q-26.0 -207.7 -25.6 -204.95 -24.75 -199.0 -35.7 -194.3 L-36.15 -194.1 Q-41.6 -191.85 -47.7 -190.65 L-52.4 -189.85 -50.15 -190.5 Q-41.7 -193.2 -34.7 -196.7 -31.7 -198.15 -29.35 -200.0 -27.0 -201.9 -27.2 -204.2 -27.45 -206.5 -31.3 -208.25 L-32.3 -208.55 Q-33.35 -209.25 -34.8 -209.4 L-34.8 -209.5" fill="#6c747d" fill-rule="evenodd" stroke="none"/>
    <path d="M-84.85 -203.65 L-84.85 -203.9 -83.55 -211.1 Q-82.4 -219.45 -82.9 -225.5 L-82.25 -226.0 Q-80.85 -227.1 -79.4 -227.6 L-76.5 -228.25 -74.15 -228.5 -72.4 -228.55 -75.1 -227.85 -76.5 -227.35 -77.55 -227.05 Q-80.5 -226.35 -82.15 -224.85 L-82.1 -224.6 Q-81.8 -221.35 -81.85 -218.9 -81.9 -215.75 -82.7 -209.8 -83.2 -205.55 -83.85 -202.8 L-84.85 -203.65" fill="#ff5c5c" fill-rule="evenodd" stroke="none"/>
    <path d="M-101.65 -193.25 L-102.8 -193.2 -113.25 -193.9 -115.65 -194.3 Q-125.4 -196.0 -126.05 -198.45 L-125.1 -198.9 Q-122.95 -199.85 -121.15 -200.0 -117.55 -200.25 -109.85 -197.2 -105.15 -195.4 -101.65 -193.25" fill="#373b40" fill-rule="evenodd" stroke="none"/>
    <path d="M-121.95 -200.75 L-121.65 -200.75 -120.7 -200.75 Q-117.5 -201.0 -114.2 -200.65 -110.35 -200.35 -106.3 -199.35 L-93.7 -195.4 -97.05 -194.25 -98.8 -193.55 -99.7 -193.4 -101.65 -193.25 Q-105.15 -195.4 -109.85 -197.2 -117.55 -200.25 -121.15 -200.0 -122.95 -199.85 -125.1 -198.9 L-126.05 -198.45 -126.15 -198.65 Q-126.25 -199.4 -124.55 -200.2 L-122.05 -200.95 -121.95 -200.75" fill="#282a2e" fill-rule="evenodd" stroke="none"/>
    <path d="M-52.6 -263.5 L-51.2 -262.65 Q-48.65 -260.9 -46.9 -258.75 -45.9 -257.35 -45.65 -255.8 -45.35 -253.65 -48.05 -247.6 L-51.05 -241.2 Q-51.6 -239.85 -54.7 -234.55 L-56.25 -231.4 Q-57.25 -229.2 -57.65 -227.25 L-58.3 -223.55 -60.0 -224.85 -58.2 -230.75 -58.0 -231.3 Q-56.7 -235.1 -55.25 -238.0 -53.2 -241.9 -48.35 -252.75 -48.6 -254.3 -52.95 -257.4 -57.7 -260.65 -60.8 -260.45 -62.15 -260.35 -62.25 -256.4 L-62.05 -252.3 Q-62.6 -247.75 -63.7 -242.85 L-67.0 -230.65 -67.3 -229.8 -67.65 -228.1 -69.15 -228.35 -69.85 -228.4 -71.75 -228.55 -71.4 -230.35 -70.8 -233.6 Q-70.05 -237.4 -69.8 -243.35 L-69.2 -252.65 Q-68.15 -260.55 -67.75 -261.45 -66.15 -264.9 -59.95 -265.35 -56.35 -265.6 -52.6 -263.5 M-64.2 -200.6 L-62.55 -201.0 -61.4 -201.35 Q-61.6 -197.95 -61.3 -195.9 L-61.05 -194.9 Q-67.5 -193.1 -75.9 -194.1 L-75.2 -199.85 -70.85 -199.6 -69.6 -199.7 -68.95 -197.65 -67.9 -195.0 -63.4 -195.3 -64.2 -200.6" fill="#50555c" fill-rule="evenodd" stroke="none"/>
    <path d="M-60.0 -224.85 L-58.3 -223.55 -59.95 -214.45 Q-61.15 -206.4 -61.4 -201.35 L-62.55 -201.0 -64.2 -200.6 Q-64.6 -205.35 -64.0 -209.9 -63.3 -214.9 -60.35 -223.95 L-60.0 -224.85 M-71.75 -228.55 L-69.85 -228.4 -69.15 -228.35 -67.65 -228.1 Q-71.65 -213.0 -69.85 -200.6 L-69.6 -199.7 -70.85 -199.6 -75.2 -199.85 -73.7 -214.2 -71.75 -228.55" fill="#992323" fill-rule="evenodd" stroke="none"/>
    <path d="M-67.65 -228.1 Q-64.6 -227.55 -61.95 -226.1 L-60.0 -224.85 -60.35 -223.95 Q-63.3 -214.9 -64.0 -209.9 -64.6 -205.35 -64.2 -200.6 L-69.6 -199.7 -69.85 -200.6 Q-71.65 -213.0 -67.65 -228.1" fill="#821e1e" fill-rule="evenodd" stroke="none"/>
  </g>
</svg>
