<?xml version="1.0" encoding="UTF-8" standalone="no"?>
<svg xmlns:xlink="http://www.w3.org/1999/xlink" height="300.0px" width="500.0px" xmlns="http://www.w3.org/2000/svg">
  <g transform="matrix(1.0, 0.0, 0.0, 1.0, 0.0, 0.0)">
    <path d="M500.0 300.0 L0.0 300.0 0.0 0.0 500.0 0.0 500.0 300.0" fill="#333333" fill-opacity="0.5019608" fill-rule="evenodd" stroke="none"/>
  </g>
</svg>
