<?xml version="1.0" encoding="UTF-8" standalone="no"?>
<svg xmlns:xlink="http://www.w3.org/1999/xlink" height="51.25px" width="78.05px" xmlns="http://www.w3.org/2000/svg">
  <g transform="matrix(1.0, 0.0, 0.0, 1.0, 35.5, 57.9)">
    <path d="M-35.5 -10.3 L42.55 -6.65 5.3 -48.8 -35.5 -10.3" fill="url(#gradient0)" fill-rule="evenodd" stroke="none">
      <animate attributeName="d" dur="2s" repeatCount="indefinite" values="M-35.5 -10.3 L42.55 -6.65 5.3 -48.8 -35.5 -10.3;M-32.85 -11.25 L39.9 -10.05 5.2 -57.9 -32.85 -11.25"/>
    </path>
    <path d="M-35.5 -10.3 L5.3 -48.8 42.55 -6.65 -35.5 -10.3" fill="none" stroke="#000000" stroke-linecap="round" stroke-linejoin="round" stroke-opacity="0.0" stroke-width="1.0">
      <animate attributeName="stroke" dur="2s" repeatCount="indefinite" values="#000000;#000001"/>
      <animate attributeName="stroke-width" dur="2s" repeatCount="indefinite" values="0.0;0.0"/>
      <animate attributeName="fill-opacity" dur="2s" repeatCount="indefinite" values="0.0;0.0"/>
      <animate attributeName="d" dur="2s" repeatCount="indefinite" values="M-35.5 -10.3 L5.3 -48.8 42.55 -6.65 -35.5 -10.3;M-32.85 -11.25 L5.2 -57.9 39.9 -10.05 -32.85 -11.25"/>
    </path>
  </g>
  <defs>
    <linearGradient gradientTransform="matrix(-0.0091, -0.037, 0.0413, -0.0076, -3.45, -21.7)" gradientUnits="userSpaceOnUse" id="gradient0" spreadMethod="pad" x1="-819.2" x2="819.2">
      <animateTransform additive="replace" attributeName="gradientTransform" dur="2s" from="1" repeatCount="indefinite" to="1" type="scale"/>
      <animateTransform additive="sum" attributeName="gradientTransform" dur="2s" from="-3.45 -21.7" repeatCount="indefinite" to="-3.0 -25.8" type="translate"/>
      <animateTransform additive="sum" attributeName="gradientTransform" dur="2s" from="-103.8471" repeatCount="indefinite" to="-101.2043" type="rotate"/>
      <animateTransform additive="sum" attributeName="gradientTransform" dur="2s" from="0.0381 0.0419" repeatCount="indefinite" to="0.0438 0.0398" type="scale"/>
      <animateTransform additive="sum" attributeName="gradientTransform" dur="2s" from="-3.8242" repeatCount="indefinite" to="3.6244" type="skewX"/>
      <stop offset="0.0" stop-color="#e35202">
        <animate attributeName="offset" dur="2s" repeatCount="indefinite" values="0.0;0.0"/>
        <animate attributeName="stop-color" dur="2s" repeatCount="indefinite" values="#e35202;#e35203"/>
        <animate attributeName="stop-opacity" dur="2s" repeatCount="indefinite" values="1.0;1.0"/>
      </stop>
      <stop offset="0.36470588235294116" stop-color="#ed8e02">
        <animate attributeName="offset" dur="2s" repeatCount="indefinite" values="0.36470588235294116;0.36470588235294116"/>
        <animate attributeName="stop-color" dur="2s" repeatCount="indefinite" values="#ed8e02;#ed8e03"/>
        <animate attributeName="stop-opacity" dur="2s" repeatCount="indefinite" values="1.0;1.0"/>
      </stop>
      <stop offset="0.6980392156862745" stop-color="#ede102">
        <animate attributeName="offset" dur="2s" repeatCount="indefinite" values="0.6980392156862745;0.6980392156862745"/>
        <animate attributeName="stop-color" dur="2s" repeatCount="indefinite" values="#ede102;#ede103"/>
        <animate attributeName="stop-opacity" dur="2s" repeatCount="indefinite" values="1.0;1.0"/>
      </stop>
      <stop offset="1.0" stop-color="#fefda3">
        <animate attributeName="offset" dur="2s" repeatCount="indefinite" values="1.0;1.0"/>
        <animate attributeName="stop-color" dur="2s" repeatCount="indefinite" values="#fefda3;#fefda4"/>
        <animate attributeName="stop-opacity" dur="2s" repeatCount="indefinite" values="1.0;1.0"/>
      </stop>
    </linearGradient>
  </defs>
</svg>
