<?xml version="1.0" encoding="UTF-8" standalone="no"?>
<svg xmlns:xlink="http://www.w3.org/1999/xlink" height="72.6px" width="105.85px" xmlns="http://www.w3.org/2000/svg">
  <g transform="matrix(1.0, 0.0, 0.0, 1.0, -56.55, -29.6)">
    <path d="M66.0 36.8 L153.9 29.6 162.4 102.2 56.55 97.45 66.0 36.8" fill="#121212" fill-rule="evenodd" stroke="none"/>
  </g>
</svg>
