<?xml version="1.0" encoding="UTF-8" standalone="no"?>
<svg xmlns:xlink="http://www.w3.org/1999/xlink" height="66.9px" width="195.65px" xmlns="http://www.w3.org/2000/svg">
  <g transform="matrix(1.0, 0.0, 0.0, 1.0, -8.9, 34.5)">
    <path d="M52.55 -10.9 Q46.2 -13.4 44.95 -14.35 L44.95 -13.7 Q46.25 -11.7 46.25 -10.55 46.25 -8.0 42.2 -8.0 40.6 -8.0 32.35 -10.35 L28.4 -11.1 Q37.8 -12.4 37.8 -13.9 37.8 -16.7 31.85 -17.45 L24.15 -17.7 Q25.85 -17.75 27.25 -18.55 L27.25 -19.8 24.15 -20.5 20.8 -21.0 23.0 -21.2 27.5 -21.5 28.6 -21.45 30.6 -21.4 30.75 -21.4 32.2 -23.1 Q34.25 -24.85 37.55 -24.85 40.6 -24.85 42.4 -23.6 44.05 -22.5 44.1 -20.8 L42.35 -20.9 Q43.4 -20.25 43.65 -19.2 L43.7 -18.55 43.7 -17.8 43.3 -17.7 42.85 -17.3 43.5 -17.7 43.65 -17.75 43.7 -17.8 Q45.25 -18.75 47.05 -19.4 L50.45 -19.4 50.5 -19.15 Q50.6 -18.95 50.85 -18.95 L50.75 -18.0 50.0 -17.7 50.45 -17.7 50.75 -18.0 54.85 -19.8 Q57.2 -20.65 60.3 -20.65 62.2 -20.65 63.5 -19.8 64.75 -19.0 64.75 -17.95 64.75 -15.15 60.55 -13.05 57.2 -11.4 55.05 -11.4 L53.5 -11.8 52.55 -10.9 M89.8 -31.4 L90.0 -31.2 90.0 -31.6 89.8 -31.4 Q89.05 -32.45 89.75 -33.25 L90.2 -33.3 Q92.55 -33.3 94.25 -32.0 95.9 -30.8 95.9 -29.3 95.9 -26.75 92.35 -25.8 L88.55 -25.15 88.35 -25.3 Q86.65 -26.5 86.65 -28.45 86.65 -29.15 87.75 -29.95 L89.8 -31.4 M123.85 -7.7 Q120.6 -8.85 114.65 -8.85 103.8 -8.85 93.9 -3.8 L86.9 -0.35 83.8 0.7 Q88.3 -1.25 93.7 -5.9 L99.95 -11.4 Q103.0 -13.9 104.55 -13.9 106.5 -13.9 109.4 -11.8 109.8 -15.35 112.95 -18.7 115.75 -20.25 119.9 -20.25 L123.7 -19.8 Q125.0 -19.25 125.0 -17.7 125.0 -16.0 123.3 -14.85 121.9 -13.95 120.35 -13.9 123.2 -13.6 123.95 -13.15 125.0 -12.6 125.0 -10.8 125.0 -8.85 123.85 -7.7 M169.5 23.35 Q167.5 22.2 167.5 19.35 167.5 16.9 167.75 16.4 168.05 15.8 168.85 15.3 L168.35 15.15 Q167.95 13.5 169.5 12.35 170.85 11.35 172.55 11.35 L174.35 11.45 Q175.05 11.65 174.25 12.6 L175.35 12.05 176.55 11.8 176.8 11.8 Q178.45 13.05 178.45 14.7 178.45 18.6 175.1 21.05 172.75 22.8 169.5 23.35 M112.0 17.4 Q112.35 18.2 112.35 19.1 112.35 22.15 110.2 23.5 108.25 24.75 103.8 25.15 L103.6 23.85 Q103.6 20.4 105.4 18.5 106.95 16.85 109.35 16.8 110.8 16.8 112.0 17.4 M51.85 17.45 L54.9 17.8 Q56.6 18.1 57.6 19.8 57.15 21.2 55.35 21.9 L51.7 23.15 Q52.7 23.2 54.0 23.8 55.05 24.35 55.5 24.85 54.7 25.75 52.6 26.55 50.5 27.35 48.75 27.35 43.55 27.35 38.6 23.95 34.65 21.25 33.35 18.5 L33.6 18.1 33.15 18.1 33.35 18.5 31.85 20.65 Q31.05 21.9 28.95 21.9 27.7 21.9 26.45 20.6 25.15 19.3 25.15 17.85 25.15 16.2 25.3 15.75 L25.4 15.55 Q25.75 15.15 26.25 14.85 L26.9 14.4 27.2 14.2 28.1 13.05 Q28.1 8.8 24.75 6.3 21.4 3.8 15.5 3.8 L14.35 3.85 14.35 3.4 18.2 2.95 Q23.65 2.95 26.85 5.25 28.45 6.4 31.3 10.3 33.95 13.85 36.6 15.35 40.7 17.65 47.7 17.65 L50.9 17.55 51.85 17.45 M8.95 3.6 L9.55 3.4 9.55 3.85 9.0 3.85 8.95 3.6" fill="#ac2706" fill-rule="evenodd" stroke="none"/>
    <path d="M44.1 -20.8 L46.3 -20.65 46.5 -20.65 46.65 -20.9 47.65 -21.95 Q48.75 -22.75 50.0 -22.75 L51.1 -22.7 51.7 -21.9 Q52.0 -23.0 55.9 -24.5 60.2 -26.1 64.1 -26.1 69.65 -26.1 72.75 -23.2 75.3 -20.8 75.3 -17.7 75.3 -14.6 72.45 -13.3 69.65 -11.95 64.75 -12.65 L65.75 -11.6 66.0 -10.15 Q66.0 -8.35 64.35 -8.0 L61.8 -8.0 Q60.1 -8.0 53.05 -10.7 L52.55 -10.9 53.5 -11.8 55.05 -11.4 Q57.2 -11.4 60.55 -13.05 64.75 -15.15 64.75 -17.95 64.75 -19.0 63.5 -19.8 62.2 -20.65 60.3 -20.65 57.2 -20.65 54.85 -19.8 L50.75 -18.0 50.45 -17.7 50.0 -17.7 50.75 -18.0 50.85 -18.95 Q50.6 -18.95 50.5 -19.15 L50.45 -19.4 47.05 -19.4 Q45.25 -18.75 43.7 -17.8 L43.65 -17.75 43.5 -17.7 42.85 -17.3 43.3 -17.7 43.7 -17.8 43.7 -18.55 43.65 -19.2 Q43.4 -20.25 42.35 -20.9 L44.1 -20.8 M89.75 -33.25 L90.3 -33.7 Q91.4 -34.4 92.95 -34.5 L95.95 -33.7 96.4 -33.65 98.35 -33.25 Q100.95 -32.25 100.95 -29.1 100.95 -27.25 98.85 -25.7 96.6 -24.0 93.4 -24.0 90.35 -24.0 88.55 -25.15 L92.35 -25.8 Q95.9 -26.75 95.9 -29.3 95.9 -30.8 94.25 -32.0 92.55 -33.3 90.2 -33.3 L89.75 -33.25 M123.85 -7.7 Q125.0 -8.85 125.0 -10.8 125.0 -12.6 123.95 -13.15 123.2 -13.6 120.35 -13.9 121.9 -13.95 123.3 -14.85 125.0 -16.0 125.0 -17.7 125.0 -19.25 123.7 -19.8 L119.9 -20.25 Q115.75 -20.25 112.95 -18.7 L114.35 -20.15 Q119.15 -24.45 124.75 -24.45 129.35 -24.45 132.15 -21.9 134.65 -19.65 134.65 -16.65 134.65 -14.35 134.45 -13.85 133.95 -12.3 131.7 -12.25 L131.7 -11.8 Q136.35 -10.65 136.35 -6.95 136.35 -4.9 134.25 -3.4 132.45 -2.1 130.65 -2.1 L127.9 -2.75 127.15 -3.0 Q127.5 -3.25 127.5 -3.6 127.5 -6.4 123.85 -7.7 M204.55 2.95 L195.3 3.35 173.85 2.5 147.7 0.4 158.35 0.3 158.6 0.3 Q177.8 0.9 188.4 0.95 195.15 1.2 204.55 2.95 M184.75 -24.85 L181.45 -25.35 179.25 -25.9 179.35 -26.1 182.65 -26.55 186.0 -26.75 Q187.6 -26.7 187.3 -25.3 L193.0 -25.15 Q196.2 -24.8 198.25 -23.15 197.65 -21.3 194.5 -21.4 L189.4 -21.1 178.85 -21.4 174.8 -21.5 174.8 -21.9 Q183.8 -22.3 184.75 -24.85 M176.8 11.8 Q178.3 11.9 179.7 13.45 181.0 14.9 181.0 16.0 181.0 18.65 177.6 21.45 174.55 24.0 172.75 24.0 170.75 24.0 169.5 23.35 172.75 22.8 175.1 21.05 178.45 18.6 178.45 14.7 178.45 13.05 176.8 11.8 M112.0 17.4 L113.3 18.25 Q115.1 19.8 115.1 22.2 115.1 24.35 114.15 26.0 113.1 27.95 111.05 28.6 L108.55 28.95 106.35 28.6 Q104.7 28.0 104.0 26.4 L103.8 25.15 Q108.25 24.75 110.2 23.5 112.35 22.15 112.35 19.1 112.35 18.2 112.0 17.4 M99.9 29.25 Q98.55 29.25 97.85 28.6 L97.3 27.95 96.95 26.5 Q96.95 23.15 99.7 23.45 101.75 23.65 102.3 25.25 L102.45 26.4 Q102.45 27.55 101.9 28.3 L101.65 28.6 Q101.0 29.25 99.9 29.25 M25.4 15.55 L25.3 15.75 Q25.15 16.2 25.15 17.85 25.15 19.3 26.45 20.6 27.7 21.9 28.95 21.9 31.05 21.9 31.85 20.65 L33.35 18.5 33.15 18.1 33.6 18.1 33.35 18.5 Q34.65 21.25 38.6 23.95 43.55 27.35 48.75 27.35 50.5 27.35 52.6 26.55 54.7 25.75 55.5 24.85 55.05 24.35 54.0 23.8 52.7 23.2 51.7 23.15 L55.35 21.9 Q57.15 21.2 57.6 19.8 56.6 18.1 54.9 17.8 L51.85 17.45 56.2 16.6 Q60.3 15.4 66.8 11.65 L72.5 14.1 Q75.3 15.6 75.3 18.3 75.3 27.6 60.95 27.35 61.0 30.25 59.05 31.4 57.4 32.4 53.6 32.4 49.1 32.4 42.25 29.05 35.35 25.7 34.85 23.15 34.5 23.15 32.75 23.8 31.05 24.4 30.2 24.4 24.35 24.4 24.35 18.5 24.35 16.65 25.4 15.55 M8.95 3.6 L9.0 3.85 8.9 3.6 8.95 3.6" fill="#5a1403" fill-rule="evenodd" stroke="none"/>
  </g>
</svg>
