<?xml version="1.0" encoding="UTF-8" standalone="no"?>
<svg xmlns:xlink="http://www.w3.org/1999/xlink" height="79.25px" width="79.4px" xmlns="http://www.w3.org/2000/svg">
  <g transform="matrix(1.0, 0.0, 0.0, 1.0, 39.4, 39.6)">
    <path d="M20.6 -28.35 Q21.6 -27.6 22.95 -27.65 24.2 -27.75 25.15 -28.65 L26.35 -29.8 28.3 -27.9 29.95 -26.3 28.7 -25.05 Q27.8 -24.2 27.75 -22.85 L27.75 -22.8 Q27.6 -21.55 28.45 -20.5 33.35 -13.8 34.65 -5.5 L34.65 -5.4 Q34.8 -4.15 35.8 -3.25 L35.85 -3.25 Q36.75 -2.45 38.1 -2.45 L39.95 -2.45 40.0 0.1 39.95 2.55 38.1 2.55 Q36.75 2.55 35.8 3.45 L35.85 3.45 Q34.85 4.3 34.65 5.6 33.35 13.9 28.4 20.65 27.6 21.7 27.7 23.0 27.75 24.25 28.65 25.2 L29.9 26.4 28.3 27.95 26.25 29.95 25.1 28.75 Q24.2 27.85 22.9 27.8 21.55 27.65 20.55 28.5 L20.55 28.55 Q13.8 33.4 5.55 34.7 4.3 34.8 3.5 35.8 3.4 35.8 3.35 35.9 2.5 36.8 2.5 38.1 L2.5 39.6 0.3 39.65 -2.5 39.6 -2.5 38.1 Q-2.5 36.8 -3.3 35.9 -4.2 34.8 -5.5 34.7 L-5.55 34.7 Q-13.85 33.4 -20.55 28.45 -21.6 27.65 -22.8 27.75 -24.2 27.8 -25.05 28.75 L-26.0 29.7 -27.8 27.95 -29.6 26.1 -28.7 25.2 -28.55 25.0 Q-27.8 24.15 -27.65 23.0 -27.6 21.65 -28.35 20.6 -33.35 13.9 -34.6 5.6 -34.85 4.3 -35.75 3.45 -36.75 2.55 -38.05 2.55 L-39.35 2.55 -39.4 0.1 -39.35 -2.45 -38.05 -2.45 Q-36.75 -2.45 -35.75 -3.25 -34.8 -4.15 -34.6 -5.4 L-34.6 -5.5 Q-33.4 -13.8 -28.4 -20.5 -27.65 -21.55 -27.7 -22.75 -27.8 -24.1 -28.7 -25.0 L-29.65 -25.95 -27.8 -27.9 -26.1 -29.6 -25.1 -28.6 Q-24.2 -27.65 -22.85 -27.6 -21.65 -27.55 -20.6 -28.3 -13.85 -33.35 -5.55 -34.55 L-5.5 -34.55 Q-4.2 -34.7 -3.3 -35.7 -2.5 -36.7 -2.5 -38.05 L-2.5 -39.5 0.3 -39.6 2.5 -39.55 2.5 -38.0 Q2.5 -36.75 3.35 -35.8 L3.4 -35.7 Q4.3 -34.75 5.55 -34.55 13.85 -33.35 20.6 -28.35 M11.7 -21.6 Q9.45 -22.75 7.0 -23.45 L4.85 -23.4 4.7 -23.35 Q3.75 -23.0 3.2 -22.1 L3.2 -22.15 Q2.5 -21.25 2.5 -20.15 L2.5 -14.45 Q2.5 -13.35 3.15 -12.5 L3.55 -12.05 3.65 -11.95 Q4.65 -11.0 6.05 -11.0 L6.8 -11.05 Q7.7 -11.3 8.45 -12.05 L12.5 -16.05 Q13.25 -16.8 13.5 -17.9 L13.5 -17.95 Q13.6 -19.05 13.15 -19.95 12.7 -20.95 11.9 -21.4 L11.7 -21.6 M16.05 -12.45 L12.05 -8.4 Q11.35 -7.7 11.1 -6.85 L11.0 -5.95 Q11.0 -4.5 12.05 -3.45 L12.8 -2.9 Q13.55 -2.45 14.5 -2.45 L20.2 -2.45 Q21.3 -2.45 22.25 -3.05 23.15 -3.75 23.5 -4.8 23.8 -5.85 23.55 -6.85 22.8 -9.4 21.6 -11.65 L21.6 -11.6 Q21.0 -12.7 20.05 -13.1 L20.1 -13.1 Q19.05 -13.65 18.0 -13.45 L17.9 -13.45 Q16.95 -13.25 16.3 -12.55 L16.05 -12.45 M0.0 -8.1 Q-2.7 -8.1 -4.7 -6.65 L-5.75 -5.7 Q-8.15 -3.35 -8.15 0.05 -8.15 3.4 -5.75 5.75 L-4.7 6.65 Q-2.7 8.15 0.0 8.15 3.4 8.15 5.75 5.75 8.15 3.4 8.15 0.05 8.15 -3.35 5.75 -5.7 3.4 -8.1 0.0 -8.1 M0.0 -27.5 Q11.55 -27.5 19.5 -19.35 27.65 -11.35 27.65 0.15 27.65 11.55 19.5 19.5 11.55 27.65 0.0 27.65 -9.15 27.65 -15.95 22.55 -17.8 21.35 -19.5 19.5 -27.65 11.55 -27.65 0.15 -27.65 -11.35 -19.5 -19.35 L-15.95 -22.55 Q-9.15 -27.5 0.0 -27.5 M0.0 -30.5 Q-10.15 -30.5 -17.7 -25.05 -19.8 -23.55 -21.65 -21.45 -30.7 -12.6 -30.7 0.2 -30.7 12.8 -21.65 21.65 -19.8 23.75 -17.7 25.05 -10.15 30.7 0.0 30.7 12.8 30.7 21.65 21.65 30.7 12.8 30.7 0.2 30.7 -12.6 21.65 -21.45 12.8 -30.5 0.0 -30.5 M23.55 7.05 Q23.8 5.95 23.5 4.9 L23.45 4.8 Q23.05 3.8 22.25 3.25 21.3 2.55 20.2 2.55 L14.5 2.55 Q13.5 2.55 12.8 3.0 L12.05 3.6 12.0 3.65 Q10.95 4.65 10.95 6.1 L11.05 6.95 Q11.3 7.8 12.0 8.5 L16.05 12.6 Q16.8 13.35 17.9 13.6 L17.95 13.6 20.05 13.25 20.1 13.25 Q21.0 12.8 21.6 11.8 22.8 9.5 23.55 7.05 M6.5 11.25 L6.05 11.15 Q4.6 11.15 3.6 12.15 L3.55 12.2 3.35 12.4 Q2.5 13.3 2.5 14.65 L2.5 20.25 Q2.5 21.35 3.2 22.3 L4.85 23.55 7.0 23.6 Q9.45 22.85 11.65 21.7 12.7 21.15 13.15 20.2 L13.15 20.15 Q13.6 19.1 13.45 18.05 13.3 16.95 12.45 16.15 L8.45 12.15 Q7.6 11.35 6.5 11.25 M-21.6 -11.5 Q-22.8 -9.35 -23.5 -6.95 L-23.55 -6.75 Q-23.8 -5.8 -23.45 -4.8 -23.15 -3.75 -22.2 -3.05 L-22.0 -2.95 Q-21.2 -2.45 -20.2 -2.45 L-14.6 -2.45 Q-13.15 -2.45 -12.1 -3.45 L-12.05 -3.45 Q-11.1 -4.5 -11.1 -5.9 L-11.1 -5.95 Q-11.1 -7.35 -12.05 -8.4 L-12.1 -8.4 -16.05 -12.4 Q-16.85 -13.15 -17.9 -13.35 L-17.95 -13.35 -20.0 -13.05 Q-20.95 -12.6 -21.55 -11.6 L-21.6 -11.5 M-4.85 -23.4 L-6.8 -23.5 -6.95 -23.45 Q-9.5 -22.75 -11.75 -21.4 L-11.7 -21.5 Q-12.75 -20.95 -13.2 -19.9 -13.65 -19.0 -13.5 -17.85 -13.35 -16.8 -12.5 -16.0 L-8.45 -11.95 Q-7.6 -11.05 -6.5 -10.9 L-6.0 -10.9 Q-4.55 -10.9 -3.5 -11.95 L-3.1 -12.35 Q-2.5 -13.25 -2.5 -14.4 L-2.5 -20.15 Q-2.5 -21.15 -3.0 -21.95 L-3.1 -22.15 Q-3.8 -23.1 -4.85 -23.4 M-6.2 11.05 Q-7.45 11.1 -8.45 12.1 L-12.5 16.1 Q-13.25 16.9 -13.5 17.95 L-13.5 18.0 Q-13.6 19.1 -13.15 20.1 L-13.15 20.15 -11.7 21.65 Q-9.45 22.85 -7.0 23.6 L-6.8 23.6 -4.85 23.55 Q-3.8 23.2 -3.1 22.3 L-3.0 22.05 Q-2.5 21.25 -2.5 20.25 L-2.5 14.55 Q-2.5 13.25 -3.35 12.25 L-3.5 12.1 Q-4.55 11.05 -6.0 11.05 L-6.2 11.05 M-12.1 3.6 Q-13.15 2.55 -14.5 2.55 L-20.2 2.55 Q-21.3 2.55 -22.2 3.25 L-22.15 3.25 Q-23.05 3.8 -23.4 4.8 L-23.45 4.9 Q-23.8 5.95 -23.5 7.05 -22.8 9.45 -21.65 11.6 L-21.55 11.75 Q-21.0 12.75 -20.0 13.2 L-17.9 13.5 Q-16.85 13.25 -16.05 12.55 L-16.05 12.5 -12.1 8.5 Q-11.05 7.45 -11.05 6.1 L-11.05 5.95 Q-11.1 4.65 -12.0 3.7 L-12.1 3.6" fill="#000000" fill-rule="evenodd" stroke="none"/>
  </g>
</svg>
