<?xml version="1.0" encoding="UTF-8" standalone="no"?>
<svg xmlns:xlink="http://www.w3.org/1999/xlink" height="9.5px" width="9.55px" xmlns="http://www.w3.org/2000/svg">
  <g transform="matrix(1.0, 0.0, 0.0, 1.0, 4.75, 4.75)">
    <path d="M0.35 2.3 L0.75 2.25 1.4 1.95 2.05 1.1 1.55 -1.15 1.25 -2.2 1.1 -3.4 Q1.1 -4.4 2.65 -4.75 L2.95 -4.75 2.95 -4.7 2.3 -3.8 Q1.9 -3.1 1.9 -2.45 L1.9 -2.2 2.3 -0.45 2.45 0.05 2.7 0.6 2.8 0.8 2.95 1.05 3.25 2.0 3.15 2.45 2.95 2.6 2.25 2.55 Q1.5 2.55 1.5 2.8 L1.65 3.0 1.0 3.25 0.35 3.55 0.35 2.3" fill="url(#gradient0)" fill-rule="evenodd" stroke="none"/>
    <path d="M0.35 3.55 L1.0 3.25 1.65 3.0 1.5 2.8 Q1.5 2.55 2.25 2.55 L2.95 2.6 3.15 2.45 3.25 2.0 2.95 1.05 2.8 0.8 Q3.9 1.6 4.8 2.75 L4.3 2.75 3.5 2.65 Q3.25 2.65 3.15 2.85 L2.85 3.25 2.15 3.85 Q1.05 4.75 0.4 4.75 L-0.75 4.5 -1.55 3.8 Q-2.15 3.0 -2.45 3.05 -2.9 3.05 -3.2 2.25 L-4.75 2.8 -2.05 0.75 -2.25 1.05 -2.55 2.0 -2.45 2.45 -2.15 2.65 -1.95 2.7 -0.95 2.55 -0.6 2.65 -0.85 3.0 -0.3 3.25 0.35 3.55" fill="url(#gradient1)" fill-rule="evenodd" stroke="none"/>
    <path d="M0.35 2.3 L0.35 3.55 -0.3 3.25 -0.85 3.0 -0.6 2.65 -0.95 2.55 -1.95 2.7 -2.15 2.65 -2.45 2.45 -2.55 2.0 -2.25 1.05 -2.05 0.75 -1.75 0.05 -1.6 -0.45 Q-1.25 -1.55 -1.2 -2.2 L-1.2 -2.45 Q-1.2 -3.1 -1.6 -3.8 L-2.25 -4.7 -2.25 -4.75 -1.95 -4.75 Q-0.4 -4.4 -0.4 -3.4 L-0.55 -2.2 -0.85 -1.15 -1.35 1.1 -0.7 1.95 0.05 2.25 0.35 2.3" fill="url(#gradient2)" fill-rule="evenodd" stroke="none"/>
  </g>
  <defs>
    <linearGradient gradientTransform="matrix(0.0, 0.005, 0.0034, 0.0, 0.15, -0.6)" gradientUnits="userSpaceOnUse" id="gradient0" spreadMethod="pad" x1="-819.2" x2="819.2">
      <stop offset="0.0" stop-color="#a36a6a" stop-opacity="0.0"/>
      <stop offset="1.0" stop-color="#a36a6a"/>
    </linearGradient>
    <linearGradient gradientTransform="matrix(0.0, -0.0034, 0.0058, 0.0, 0.1, 2.25)" gradientUnits="userSpaceOnUse" id="gradient1" spreadMethod="pad" x1="-819.2" x2="819.2">
      <stop offset="0.0" stop-color="#a36a6a" stop-opacity="0.0"/>
      <stop offset="1.0" stop-color="#a36a6a"/>
    </linearGradient>
    <linearGradient gradientTransform="matrix(0.0, 0.005, -0.0034, 0.0, 0.55, -0.6)" gradientUnits="userSpaceOnUse" id="gradient2" spreadMethod="pad" x1="-819.2" x2="819.2">
      <stop offset="0.0" stop-color="#a36a6a" stop-opacity="0.0"/>
      <stop offset="1.0" stop-color="#a36a6a"/>
    </linearGradient>
  </defs>
</svg>
