<?xml version="1.0" encoding="UTF-8" standalone="no"?>
<svg xmlns:xlink="http://www.w3.org/1999/xlink" height="84.2px" width="83.3px" xmlns="http://www.w3.org/2000/svg">
  <g transform="matrix(1.0, 0.0, 0.0, 1.0, -3.75, -6.55)">
    <path d="M82.1 11.1 L82.1 11.0 81.85 11.1 52.25 7.5 51.85 7.35 50.3 6.6 83.25 10.6 83.35 10.6 86.1 14.2 86.05 14.25 83.95 13.4 83.85 13.35 82.1 11.1" fill="#414f61" fill-rule="evenodd" stroke="none"/>
    <path d="M82.1 11.1 L81.85 11.1 82.1 11.0 82.1 11.1 M83.9 13.45 L83.85 13.35 83.95 13.4 83.9 13.45 M51.85 7.35 L52.25 7.5 51.8 7.45 51.85 7.35 M86.1 14.2 L86.1 14.25 86.05 14.25 86.1 14.2" fill="#444b66" fill-rule="evenodd" stroke="none"/>
    <path d="M81.85 11.1 L82.1 11.1 83.85 13.35 83.9 13.45 83.45 19.95 83.15 20.2 Q82.55 20.8 82.55 21.6 L82.3 34.35 81.55 21.6 Q81.55 20.45 82.4 19.6 L82.5 19.45 82.65 17.4 82.9 13.75 81.6 12.05 52.25 7.55 52.25 7.5 81.85 11.1" fill="#8091aa" fill-rule="evenodd" stroke="none"/>
    <path d="M82.3 34.35 L82.55 21.6 Q82.55 20.8 83.15 20.2 L83.45 19.95 83.9 13.45 83.95 13.4 86.05 14.25 86.1 14.25 84.7 33.8 84.45 36.5 84.4 38.1 82.3 34.35" fill="#394857" fill-rule="evenodd" stroke="none"/>
    <path d="M52.25 7.55 L81.6 12.05 82.9 13.75 82.65 17.4 78.65 17.25 Q78.65 14.6 63.7 20.7 L59.45 22.5 Q60.05 23.2 60.05 24.4 60.05 25.15 59.5 25.95 58.7 27.1 57.25 27.1 55.6 27.1 54.85 25.8 54.5 25.2 54.45 24.7 L53.05 25.3 51.8 7.45 52.25 7.55 M78.3 22.4 Q77.1 22.4 76.8 21.55 L76.75 20.6 Q76.75 18.95 78.7 18.7 80.6 18.45 80.6 20.3 80.6 21.05 80.0 21.7 79.35 22.4 78.3 22.4" fill="#4f5f7a" fill-rule="evenodd" stroke="none"/>
    <path d="M82.65 17.4 L82.5 19.45 82.4 19.6 Q81.55 20.45 81.55 21.6 L82.3 34.35 82.3 34.9 53.85 36.2 53.05 25.3 54.45 24.7 Q54.5 25.2 54.85 25.8 55.6 27.1 57.25 27.1 58.7 27.1 59.5 25.95 60.05 25.15 60.05 24.4 60.05 23.2 59.45 22.5 L63.7 20.7 Q78.65 14.6 78.65 17.25 L82.65 17.4 M78.3 22.4 Q79.35 22.4 80.0 21.7 80.6 21.05 80.6 20.3 80.6 18.45 78.7 18.7 76.75 18.95 76.75 20.6 L76.8 21.55 Q77.1 22.4 78.3 22.4 M77.9 27.95 L78.25 28.5 78.35 28.45 78.05 28.05 77.95 27.9 77.25 27.3 77.2 27.35 77.9 27.95" fill="#4a5a71" fill-rule="evenodd" stroke="none"/>
    <path d="M52.25 7.5 L52.25 7.55 51.8 7.45 52.25 7.5 M82.3 34.9 L82.3 34.35 82.3 34.9 52.85 37.25 51.8 7.45 53.05 25.3 53.85 36.2 82.3 34.9" fill="#5b6a8a" fill-rule="evenodd" stroke="none"/>
    <path d="M84.4 38.1 L51.1 40.8 51.1 40.75 52.85 37.25 82.3 34.9 82.3 34.35 84.4 38.1" fill="#1f272e" fill-rule="evenodd" stroke="none"/>
    <path d="M50.3 6.6 L51.85 7.35 51.8 7.45 52.85 37.25 51.1 40.75 49.85 6.55 50.3 6.6" fill="#333e4d" fill-rule="evenodd" stroke="none"/>
    <path d="M77.9 27.95 L77.2 27.35 77.25 27.3 77.95 27.9 78.05 28.05 78.35 28.45 78.25 28.5 77.9 27.95" fill="#455565" fill-rule="evenodd" stroke="none"/>
    <path d="M56.25 20.35 Q56.5 18.8 57.75 17.95 59.05 17.05 64.8 14.8 66.15 14.25 67.35 12.85 L68.85 11.2 Q70.5 10.1 71.05 11.5 71.25 12.1 71.25 13.65 L70.8 20.05 68.45 20.35 68.6 15.75 62.5 18.45 Q58.65 20.05 58.65 21.25 L58.95 21.75 59.15 22.0 56.7 22.6 Q56.2 21.65 56.2 21.15 L56.25 20.35 M75.15 19.65 L72.65 19.85 72.95 13.9 73.15 12.15 Q73.7 7.6 74.9 12.4 L75.15 19.65" fill="#b4c1d4" fill-rule="evenodd" stroke="none"/>
    <path d="M70.8 20.05 L71.25 27.65 71.25 29.5 Q71.1 30.95 70.25 31.15 L70.0 31.15 Q68.15 31.15 68.45 20.35 L70.8 20.05 M59.15 22.0 L60.7 23.6 62.75 25.65 Q62.75 26.65 61.5 26.65 L60.75 26.55 Q59.05 26.15 57.6 24.0 L56.7 22.6 59.15 22.0 M72.65 19.85 L75.15 19.65 75.45 29.05 Q75.7 31.8 74.5 32.1 L74.2 32.1 Q73.35 32.1 72.9 28.0 L72.6 24.05 72.65 19.85" fill="#a8b5c6" fill-rule="evenodd" stroke="none"/>
    <path d="M70.25 31.15 L70.25 31.5 Q70.05 33.15 69.0 33.15 67.0 33.15 67.5 20.45 L67.6 17.75 61.5 20.45 Q59.85 21.15 58.95 21.75 L58.65 21.25 Q58.65 20.05 62.5 18.45 L68.6 15.75 68.45 20.35 Q68.15 31.15 70.0 31.15 L70.25 31.15 M60.75 26.55 L61.75 27.65 Q61.75 28.65 60.5 28.65 58.4 28.65 56.6 26.0 55.2 23.95 55.2 23.15 L55.2 22.95 Q55.25 21.3 56.25 20.35 L56.2 21.15 Q56.2 21.65 56.7 22.6 L57.6 24.0 Q59.05 26.15 60.75 26.55 M73.15 12.15 L72.95 13.9 72.65 19.85 72.6 24.05 72.9 28.0 Q73.35 32.1 74.2 32.1 L74.5 32.1 Q74.4 34.1 73.2 34.1 72.35 34.1 71.9 30.0 L71.6 26.05 71.7 19.95 71.95 15.9 Q72.35 11.0 73.15 12.15" fill="#1f272e" fill-rule="evenodd" stroke="none"/>
    <path d="M84.8 87.4 L87.05 90.55 87.05 90.75 52.5 90.65 54.4 87.3 84.8 87.4" fill="#1f272e" fill-rule="evenodd" stroke="none"/>
    <path d="M83.6 57.0 L85.65 55.95 87.05 90.55 84.8 87.4 83.6 57.0" fill="#394857" fill-rule="evenodd" stroke="none"/>
    <path d="M83.6 57.0 L83.6 56.7 76.3 56.5 85.65 55.95 83.6 57.0 M69.2 56.95 L58.85 58.25 54.1 58.1 54.1 57.9 69.2 56.95" fill="#414f61" fill-rule="evenodd" stroke="none"/>
    <path d="M76.3 56.5 L83.6 56.7 83.6 57.0 84.8 87.4 83.3 66.6 82.65 57.8 76.8 58.15 74.1 59.25 74.05 59.25 72.35 59.35 72.3 59.3 68.9 58.6 55.85 58.45 58.85 58.25 69.2 56.95 73.7 58.3 76.3 56.5" fill="#8091aa" fill-rule="evenodd" stroke="none"/>
    <path d="M83.3 66.6 L84.8 87.4 55.45 86.3 55.6 77.05 57.55 75.8 Q64.3 71.65 71.1 69.65 73.7 68.85 78.9 67.6 L83.3 66.6" fill="#4a5a71" fill-rule="evenodd" stroke="none"/>
    <path d="M55.85 58.45 L68.9 58.6 72.3 59.3 72.3 59.35 72.35 59.35 74.05 59.25 74.1 59.25 76.8 58.15 82.65 57.8 83.3 66.6 78.9 67.6 Q73.7 68.85 71.1 69.65 64.3 71.65 57.55 75.8 L55.6 77.05 55.85 58.45" fill="#4f5f7a" fill-rule="evenodd" stroke="none"/>
    <path d="M72.3 59.3 L72.35 59.35 72.3 59.35 72.3 59.3" fill="#374251" fill-rule="evenodd" stroke="none"/>
    <path d="M76.3 56.5 L73.7 58.3 69.2 56.95 73.1 57.75 76.3 56.5" fill="#000000" fill-rule="evenodd" stroke="none"/>
    <path d="M58.85 58.25 L55.85 58.45 54.4 87.3 52.5 90.65 52.45 90.65 54.1 58.1 58.85 58.25" fill="#333e4d" fill-rule="evenodd" stroke="none"/>
    <path d="M84.8 87.4 L54.4 87.3 55.85 58.45 55.6 77.05 55.45 86.3 84.8 87.4" fill="#5b6a8a" fill-rule="evenodd" stroke="none"/>
    <path d="M80.9 59.6 L81.0 58.85 82.65 58.85 82.7 60.75 Q82.7 61.95 81.7 63.0 L79.9 64.3 77.95 65.75 75.25 66.35 Q75.85 64.0 78.35 62.8 L79.9 61.7 Q80.65 60.85 80.9 59.6 M65.75 69.2 Q65.7 67.75 65.15 66.95 64.5 65.95 62.5 65.6 60.05 65.2 59.45 64.8 58.35 64.15 58.1 62.5 L58.0 61.4 Q58.0 60.65 58.25 59.85 L59.75 59.85 59.75 60.15 Q59.75 62.6 63.45 63.55 67.3 64.5 67.6 65.95 L67.95 68.35 Q66.8 68.7 65.75 69.2" fill="#b4c1d4" fill-rule="evenodd" stroke="none"/>
    <path d="M81.7 63.0 Q81.6 64.25 80.4 65.3 L78.9 66.3 77.05 67.65 Q77.15 66.65 77.95 65.75 L79.9 64.3 81.7 63.0 M77.1 84.0 Q76.95 86.0 76.15 86.0 74.95 86.0 74.05 69.9 74.05 67.8 75.25 66.4 L75.05 67.9 Q75.9 83.45 77.1 84.0 M79.9 61.7 Q80.1 60.7 79.9 59.4 L80.9 59.6 Q80.65 60.85 79.9 61.7 M58.1 62.5 Q58.35 64.15 59.45 64.8 60.05 65.2 62.5 65.6 64.5 65.95 65.15 66.95 65.7 67.75 65.75 69.2 L65.7 70.45 65.35 69.35 65.15 68.95 Q64.5 67.95 62.5 67.6 60.05 67.2 59.45 66.8 58.0 65.95 58.0 63.4 L58.1 62.5 M65.0 77.85 L65.05 79.15 Q65.35 83.55 66.8 83.55 67.95 83.55 67.95 78.65 L68.1 74.05 67.95 80.65 Q67.95 85.55 66.8 85.55 65.35 85.55 65.05 81.15 L65.0 77.85" fill="#1f272e" fill-rule="evenodd" stroke="none"/>
    <path d="M77.05 67.65 L77.05 67.9 Q77.05 70.7 77.5 74.65 L78.1 81.05 Q78.1 84.0 77.15 84.0 L77.1 84.0 Q75.9 83.45 75.05 67.9 L75.25 66.4 75.25 66.35 77.95 65.75 Q77.15 66.65 77.05 67.65 M65.7 70.45 L65.75 69.2 Q66.8 68.7 67.95 68.35 L68.1 74.05 67.95 78.65 Q67.95 83.55 66.8 83.55 65.35 83.55 65.05 79.15 L65.0 77.85 Q64.85 74.8 65.4 72.15 L65.7 70.45" fill="#a8b5c6" fill-rule="evenodd" stroke="none"/>
    <path d="M37.7 55.95 L38.3 55.95 37.9 66.05 Q31.15 66.75 22.45 68.95 15.45 70.75 9.4 73.05 L9.35 73.0 8.5 65.5 8.15 64.3 8.1 64.25 8.05 64.2 7.65 63.35 6.95 56.3 37.7 55.95" fill="#4f5f7a" fill-rule="evenodd" stroke="none"/>
    <path d="M38.3 55.95 L37.7 55.95 40.45 55.35 40.4 85.8 40.45 85.85 40.35 85.85 38.05 83.15 38.25 83.05 38.3 55.95" fill="#1f252e" fill-rule="evenodd" stroke="none"/>
    <path d="M9.35 73.0 L9.4 73.05 Q15.45 70.75 22.45 68.95 31.15 66.75 37.9 66.05 L37.25 82.35 31.25 84.2 30.25 83.9 29.4 83.95 29.45 83.9 29.4 83.9 Q28.65 84.05 28.1 84.5 L27.95 84.5 8.4 87.05 8.55 77.45 9.3 74.0 9.3 73.9 9.35 73.1 9.35 73.0" fill="#4a5a71" fill-rule="evenodd" stroke="none"/>
    <path d="M37.9 66.05 L38.3 55.95 38.25 83.05 38.05 83.15 31.15 85.25 31.1 85.25 30.95 85.15 Q30.3 84.75 29.6 84.9 28.95 85.0 28.5 85.45 L28.3 85.5 8.55 87.05 8.4 87.05 27.95 84.5 28.1 84.5 Q28.65 84.05 29.4 83.9 L29.45 83.9 29.4 83.95 30.25 83.9 31.25 84.2 37.25 82.35 37.9 66.05" fill="#5b6a8a" fill-rule="evenodd" stroke="none"/>
    <path d="M40.45 55.35 L37.7 55.95 5.85 55.25 3.85 54.55 40.45 55.35" fill="#414f61" fill-rule="evenodd" stroke="none"/>
    <path d="M5.85 55.25 L6.65 63.55 7.15 64.65 7.25 64.8 7.5 65.6 8.35 73.1 8.35 73.45 8.3 73.75 7.5 77.4 8.4 87.05 8.55 87.1 6.85 90.5 6.7 90.5 6.7 90.3 5.6 78.65 6.5 74.7 5.65 67.15 4.8 65.45 3.75 54.55 3.85 54.55 5.85 55.25" fill="#333e4d" fill-rule="evenodd" stroke="none"/>
    <path d="M37.7 55.95 L6.95 56.3 7.65 63.35 8.05 64.2 8.1 64.25 8.15 64.3 8.5 65.5 9.35 73.0 9.35 73.1 9.3 73.9 9.3 74.0 8.55 77.45 8.4 87.05 7.5 77.4 8.3 73.75 8.35 73.45 8.35 73.1 7.5 65.6 7.25 64.8 7.15 64.65 6.65 63.55 5.85 55.25 37.7 55.95" fill="#8091aa" fill-rule="evenodd" stroke="none"/>
    <path d="M8.55 87.1 L8.4 87.05 8.55 87.05 8.55 87.1 M30.15 89.05 L29.95 89.05 30.0 88.85 30.15 89.05" fill="#444b66" fill-rule="evenodd" stroke="none"/>
    <path d="M38.05 83.15 L40.35 85.85 30.3 89.0 30.3 89.05 30.15 89.05 30.0 88.85 29.95 89.05 6.85 90.5 8.55 87.1 8.55 87.05 28.3 85.5 30.0 88.85 31.1 85.25 31.15 85.25 38.05 83.15" fill="#1f272e" fill-rule="evenodd" stroke="none"/>
    <path d="M28.3 85.5 L28.5 85.45 Q28.95 85.0 29.6 84.9 30.3 84.75 30.95 85.15 L31.1 85.25 30.0 88.85 28.3 85.5" fill="#29323d" fill-rule="evenodd" stroke="none"/>
    <path d="M21.0 72.15 L21.85 60.45 Q21.9 59.4 22.55 58.35 24.1 64.7 24.3 71.3 L21.0 72.15 M31.3 70.25 L32.4 68.2 Q32.55 67.3 33.4 66.75 34.15 66.35 34.7 66.75 35.1 67.6 34.85 68.8 L34.5 70.05 31.3 70.25 M11.2 70.75 L11.15 70.55 Q10.9 69.45 11.3 68.5 11.85 68.0 12.6 68.3 13.45 68.75 13.6 69.65 L16.15 73.9 13.25 75.25 12.25 73.5 Q11.55 72.1 11.2 70.75" fill="#b4c1d4" fill-rule="evenodd" stroke="none"/>
    <path d="M24.3 71.3 L24.3 74.1 24.25 75.35 Q24.15 78.25 22.9 80.85 21.05 79.4 20.8 76.35 L20.85 73.75 21.0 72.15 24.3 71.3 M31.3 70.25 L34.5 70.05 33.75 71.85 33.15 73.05 30.9 76.45 Q29.65 78.0 27.75 78.65 L27.2 77.95 27.1 77.85 31.3 70.25 M16.15 73.9 L18.9 78.5 18.25 79.4 Q16.35 79.0 15.1 77.65 L13.25 75.25 16.15 73.9" fill="#a8b5c6" fill-rule="evenodd" stroke="none"/>
    <path d="M24.3 74.1 L24.25 77.35 Q24.15 80.25 22.9 82.85 20.5 81.0 20.8 76.35 21.05 79.4 22.9 80.85 24.15 78.25 24.25 75.35 L24.3 74.1 M33.15 73.05 L32.75 73.95 Q31.55 76.4 29.9 78.55 28.65 80.1 26.75 80.75 L26.1 79.95 27.2 77.95 27.75 78.65 Q29.65 78.0 30.9 76.45 L33.15 73.05 M18.25 79.4 L18.9 80.5 18.25 81.4 Q16.35 81.0 15.1 79.65 13.5 77.9 12.35 75.7 L12.25 75.5 Q11.5 74.0 11.15 72.55 10.95 71.6 11.2 70.75 11.55 72.1 12.25 73.5 L13.25 75.25 15.1 77.65 Q16.35 79.0 18.25 79.4" fill="#1f272e" fill-rule="evenodd" stroke="none"/>
  </g>
</svg>
