<?xml version="1.0" encoding="UTF-8" standalone="no"?>
<svg xmlns:xlink="http://www.w3.org/1999/xlink" height="24.4px" width="30.45px" xmlns="http://www.w3.org/2000/svg">
  <g transform="matrix(1.0, 0.0, 0.0, 1.0, -5.7, -29.05)">
    <path d="M6.7 35.95 Q7.85 32.65 9.95 31.85 11.05 31.4 17.4 30.25 L26.4 29.05 28.95 29.4 31.15 30.4 Q32.0 30.75 32.65 32.1 L33.55 34.05 35.7 37.2 Q36.15 38.15 36.15 40.35 36.15 42.7 35.4 45.55 34.7 48.25 34.0 48.7 L33.9 48.9 34.0 49.35 34.35 49.4 34.85 49.6 35.0 50.05 34.65 50.6 Q34.25 50.95 33.95 50.95 33.0 50.95 32.7 50.15 32.55 49.8 32.55 48.9 L32.75 47.85 33.05 46.9 33.25 46.3 33.4 45.7 33.55 44.1 33.45 43.55 32.55 43.65 Q32.0 43.65 31.55 41.9 31.2 40.55 31.2 39.85 L31.3 38.25 30.2 38.6 29.7 38.3 29.3 37.95 Q29.0 37.95 28.85 36.55 L28.75 35.0 Q25.95 37.05 24.8 37.05 L23.95 36.7 23.9 37.1 Q23.9 38.45 21.55 39.35 L18.75 40.0 Q17.95 40.0 14.75 39.0 13.8 38.7 13.1 37.65 L12.0 36.05 11.7 37.45 Q11.35 38.45 11.35 38.7 L11.15 39.75 Q11.15 40.55 10.05 41.9 8.95 43.2 8.25 43.2 L7.45 43.1 Q8.15 43.7 8.8 45.1 9.55 46.6 9.55 47.6 L9.15 49.25 9.7 50.45 10.2 52.35 Q10.2 52.8 9.8 53.45 L9.7 53.4 8.4 51.55 8.15 51.2 8.0 51.1 7.2 50.7 Q6.7 50.35 6.65 49.6 L6.05 46.35 Q5.7 44.45 5.7 42.65 5.7 38.85 6.7 35.95" fill="#000000" fill-opacity="0.17254902" fill-rule="evenodd" stroke="none"/>
  </g>
</svg>
