<?xml version="1.0" encoding="UTF-8" standalone="no"?>
<svg xmlns:xlink="http://www.w3.org/1999/xlink" height="33.05px" width="32.5px" xmlns="http://www.w3.org/2000/svg">
  <g transform="matrix(1.0, 0.0, 0.0, 1.0, 0.0, 0.0)">
    <path d="M0.4 12.35 L0.4 12.25 0.45 12.35 0.4 12.35 M19.3 26.8 L19.4 26.8 19.25 26.85 19.3 26.8 M26.05 28.15 L26.0 28.15 26.0 28.1 26.05 28.15 M23.5 27.65 L23.5 27.6 23.55 27.65 23.5 27.65" fill="#ffffff" fill-rule="evenodd" stroke="none"/>
    <path d="M23.5 33.05 L0.4 30.55 0.4 12.35 0.45 12.35 0.4 12.25 0.4 10.5 0.2 10.35 0.0 9.85 0.2 9.15 0.4 8.8 0.4 6.5 0.55 6.5 1.35 6.55 1.4 6.6 1.65 6.85 1.9 7.1 1.95 7.15 2.0 7.2 2.05 7.2 2.35 7.25 2.6 7.1 3.2 6.75 3.55 6.65 3.65 6.6 4.0 6.8 4.1 6.85 4.15 6.9 4.8 7.05 5.3 7.3 5.55 7.35 5.85 7.4 6.05 7.4 7.35 7.45 8.15 7.15 8.35 7.1 8.95 6.95 9.15 6.85 9.4 6.95 10.3 7.25 10.9 7.5 11.3 7.65 11.8 7.85 12.6 8.15 13.85 8.55 14.3 8.7 14.85 8.8 15.95 8.95 16.55 8.9 17.4 8.7 18.5 8.55 18.8 8.5 18.95 8.45 19.1 8.5 19.45 8.5 20.0 8.75 20.05 8.75 20.6 9.0 20.65 9.0 21.1 8.85 21.2 8.8 21.9 9.2 22.25 9.2 23.3 9.05 23.35 9.15 23.5 9.15 23.5 27.6 23.5 27.65 23.5 32.15 23.45 32.25 23.5 32.3 23.5 33.05 M19.3 26.8 L19.25 26.85 19.4 26.8 19.3 26.8" fill="url(#gradient0)" fill-rule="evenodd" stroke="none"/>
    <path d="M32.4 2.75 L32.45 25.6 32.5 25.7 32.45 25.8 32.45 26.6 23.5 33.05 23.5 32.3 23.45 32.25 23.5 32.15 23.5 27.65 23.55 27.65 23.5 27.6 23.5 9.15 23.7 9.15 23.8 9.05 24.25 8.9 25.7 7.95 26.0 7.65 26.95 6.55 27.9 5.65 28.25 5.4 Q28.5 5.2 28.8 5.15 L29.45 5.05 29.55 5.05 Q30.5 4.8 31.15 4.15 L31.2 4.1 32.4 2.75 M26.05 28.15 L26.0 28.1 26.0 28.15 26.05 28.15" fill="url(#gradient1)" fill-rule="evenodd" stroke="none"/>
    <path d="M0.4 6.5 L0.4 6.45 0.45 6.45 1.85 5.05 Q2.4 4.55 3.0 4.15 3.7 3.65 4.4 3.3 L5.5 2.7 6.65 1.65 7.2 1.1 7.5 0.85 7.9 0.55 9.3 0.05 9.3 0.0 9.55 0.05 10.1 0.05 10.35 0.05 10.45 0.05 10.6 0.1 10.95 0.1 13.15 0.2 14.9 0.4 17.7 0.8 17.85 0.85 18.05 0.9 18.85 1.1 19.05 1.15 19.25 1.2 19.75 1.35 20.2 1.45 20.35 1.5 21.85 1.45 22.95 1.55 23.15 1.55 23.85 1.65 24.15 1.7 24.3 1.7 24.5 1.75 24.8 1.75 25.25 1.7 26.0 1.8 27.25 1.75 27.6 1.75 29.3 1.6 29.4 1.6 31.05 2.05 Q31.85 2.1 32.4 2.75 L31.2 4.1 31.15 4.15 Q30.5 4.8 29.55 5.05 L29.45 5.05 28.8 5.15 Q28.5 5.2 28.25 5.4 L27.9 5.65 26.95 6.55 26.0 7.65 25.7 7.95 24.25 8.9 23.8 9.05 23.7 9.15 23.5 9.15 23.35 9.15 23.3 9.05 22.25 9.2 21.9 9.2 21.2 8.8 21.1 8.85 20.65 9.0 20.6 9.0 20.05 8.75 20.0 8.75 19.45 8.5 19.1 8.5 18.95 8.45 18.8 8.5 18.5 8.55 17.4 8.7 16.55 8.9 15.95 8.95 14.85 8.8 14.3 8.7 13.85 8.55 12.6 8.15 11.8 7.85 11.3 7.65 10.9 7.5 10.3 7.25 9.4 6.95 9.15 6.85 8.95 6.95 8.35 7.1 8.15 7.15 7.35 7.45 6.05 7.4 5.85 7.4 5.55 7.35 5.3 7.3 4.8 7.05 4.15 6.9 4.1 6.85 4.0 6.8 3.65 6.6 3.55 6.65 3.2 6.75 2.6 7.1 2.35 7.25 2.05 7.2 2.0 7.2 1.95 7.15 1.9 7.1 1.65 6.85 1.4 6.6 1.35 6.55 0.55 6.5 0.4 6.5" fill="url(#gradient2)" fill-rule="evenodd" stroke="none"/>
  </g>
  <defs>
    <linearGradient gradientTransform="matrix(-0.0133, 0.0, 0.0, -0.0162, 11.1, 19.8)" gradientUnits="userSpaceOnUse" id="gradient0" spreadMethod="pad" x1="-819.2" x2="819.2">
      <stop offset="0.00784313725490196" stop-color="#626262"/>
      <stop offset="1.0" stop-color="#ededed" stop-opacity="0.0"/>
    </linearGradient>
    <linearGradient gradientTransform="matrix(-0.0048, 0.0, 0.0, -0.0185, 27.1, 17.9)" gradientUnits="userSpaceOnUse" id="gradient1" spreadMethod="pad" x1="-819.2" x2="819.2">
      <stop offset="0.00784313725490196" stop-color="#cccccc" stop-opacity="0.0"/>
      <stop offset="1.0" stop-color="#000000"/>
    </linearGradient>
    <linearGradient gradientTransform="matrix(0.0158, -0.0031, 0.0014, 0.007, 17.65, 4.3)" gradientUnits="userSpaceOnUse" id="gradient2" spreadMethod="pad" x1="-819.2" x2="819.2">
      <stop offset="0.00784313725490196" stop-color="#ffffff"/>
      <stop offset="1.0" stop-color="#ededed" stop-opacity="0.0"/>
    </linearGradient>
  </defs>
</svg>
