<?xml version="1.0" encoding="UTF-8" standalone="no"?>
<svg xmlns:xlink="http://www.w3.org/1999/xlink" height="318.5px" width="200.0px" xmlns="http://www.w3.org/2000/svg">
  <g transform="matrix(1.0, 0.0, 0.0, 1.0, 0.0, 0.0)">
    <path d="M0.0 318.5 L0.0 0.0 200.0 0.0 200.0 318.5 0.0 318.5" fill="#00ff00" fill-rule="evenodd" stroke="none"/>
  </g>
</svg>
