<?xml version="1.0" encoding="UTF-8" standalone="no"?>
<svg xmlns:xlink="http://www.w3.org/1999/xlink" height="199.65px" width="60.35px" xmlns="http://www.w3.org/2000/svg">
  <g transform="matrix(1.0, 0.0, 0.0, 1.0, 22.3, -143.25)">
    <path d="M24.0 160.75 Q24.25 160.55 24.55 160.45 L26.9 159.25 27.8 158.95 27.7 159.25 Q27.2 159.6 26.85 159.9 L24.5 160.9 24.25 160.9 24.0 160.75 M26.85 164.4 L26.05 168.6 25.2 169.7 25.95 165.3 26.85 164.4 M25.65 171.45 L24.7 176.85 24.3 177.1 24.0 177.25 24.7 172.75 25.65 171.45 M24.0 181.05 L23.15 185.85 22.6 185.8 23.3 181.5 23.4 181.5 24.0 181.05 M22.55 189.6 L22.1 192.4 21.4 192.8 21.95 189.5 22.55 189.6 M21.7 194.4 L21.45 195.9 20.85 196.25 21.1 194.85 21.7 194.4 M21.25 196.95 L20.7 200.25 20.15 200.55 20.65 197.45 21.25 196.95 M20.0 204.45 L19.5 207.2 19.0 207.5 19.45 204.85 20.0 204.45 M18.95 210.55 L18.5 213.15 17.95 214.05 18.35 211.15 18.95 210.55 M17.85 217.1 L17.5 219.1 17.0 219.5 17.25 218.15 17.85 217.1 M13.45 219.05 L13.7 217.7 Q13.9 218.55 14.6 218.85 L14.45 219.75 14.15 219.65 13.45 219.05 M14.2 214.6 L14.95 210.35 Q15.0 210.9 15.55 211.35 L15.85 211.6 15.2 215.05 14.6 214.95 14.2 214.6 M15.6 206.5 L16.2 202.85 Q16.4 203.95 17.05 204.45 L16.45 207.7 16.15 207.6 Q15.7 207.3 15.6 206.5 M16.85 199.1 L17.05 197.85 17.25 198.1 Q17.6 198.5 18.05 198.5 L17.8 200.05 16.85 199.1 M17.5 195.45 L17.85 193.1 Q18.2 194.15 18.75 194.65 L18.45 196.25 18.3 196.15 17.5 195.45 M18.45 190.0 L19.4 184.5 19.45 184.5 Q19.45 186.3 19.95 187.55 L19.2 192.1 Q18.35 191.3 18.45 190.0 M20.15 179.9 L20.5 177.8 Q20.6 179.0 21.2 179.95 L20.5 183.95 Q20.05 182.95 20.05 181.3 L20.15 179.9 M20.9 175.65 L21.15 174.2 21.2 174.7 Q21.4 175.35 21.7 175.35 L22.05 175.3 21.7 176.95 Q21.2 176.5 20.9 175.65 M21.7 170.6 L21.85 170.1 22.45 166.45 Q22.6 166.75 23.0 166.75 L23.5 166.65 22.7 171.2 Q22.1 171.15 21.7 170.6" fill="#d0c2ae" fill-rule="evenodd" stroke="none"/>
    <path d="M27.7 159.25 L26.85 164.4 25.95 165.3 26.85 159.9 Q27.2 159.6 27.7 159.25 M26.05 168.6 L25.65 171.45 24.7 172.75 25.2 169.7 26.05 168.6 M24.7 176.85 L24.0 181.05 23.4 181.5 23.3 181.5 24.0 177.25 24.3 177.1 24.7 176.85 M23.15 185.85 L22.55 189.6 21.95 189.5 22.6 185.8 23.15 185.85 M22.1 192.4 L21.7 194.4 21.1 194.85 21.4 192.8 22.1 192.4 M21.45 195.9 L21.25 196.95 20.65 197.45 20.85 196.25 21.45 195.9 M20.7 200.25 L20.0 204.45 19.45 204.85 20.15 200.55 20.7 200.25 M19.5 207.2 L18.95 210.55 18.35 211.15 19.0 207.5 19.5 207.2 M18.5 213.15 L17.85 217.1 17.25 218.15 17.95 214.05 18.5 213.15 M13.7 217.7 L14.2 214.6 14.6 214.95 15.2 215.05 14.6 218.85 Q13.9 218.55 13.7 217.7 M14.95 210.35 L15.6 206.5 Q15.7 207.3 16.15 207.6 L16.45 207.7 15.85 211.6 15.55 211.35 Q15.0 210.9 14.95 210.35 M16.2 202.85 L16.85 199.1 17.8 200.05 17.05 204.45 Q16.4 203.95 16.2 202.85 M17.05 197.85 L17.5 195.45 18.3 196.15 18.45 196.25 18.05 198.5 Q17.6 198.5 17.25 198.1 L17.05 197.85 M17.85 193.1 L18.45 190.0 Q18.35 191.3 19.2 192.1 L18.75 194.65 Q18.2 194.15 17.85 193.1 M19.45 184.5 L19.5 183.8 20.15 179.9 20.05 181.3 Q20.05 182.95 20.5 183.95 L19.95 187.55 Q19.45 186.3 19.45 184.5 M20.5 177.8 L20.9 175.65 Q21.2 176.5 21.7 176.95 L21.2 179.95 Q20.6 179.0 20.5 177.8 M21.15 174.2 L21.7 170.6 Q22.1 171.15 22.7 171.2 L22.05 175.3 21.7 175.35 Q21.4 175.35 21.2 174.7 L21.15 174.2 M22.45 166.45 L22.45 166.35 23.3 161.2 24.0 160.75 24.25 160.9 24.5 160.9 23.5 166.65 23.0 166.75 Q22.6 166.75 22.45 166.45" fill="#877e71" fill-rule="evenodd" stroke="none"/>
    <path d="M24.5 160.9 L26.85 159.9 25.95 165.3 25.45 165.7 Q24.35 166.45 23.5 166.65 L24.5 160.9 M22.7 171.2 L22.85 171.2 Q23.8 171.2 25.1 169.75 L25.2 169.7 24.7 172.75 24.45 173.1 22.05 175.3 22.7 171.2 M21.7 176.95 Q22.2 177.35 23.0 177.35 L24.0 177.25 23.3 181.5 Q22.4 181.4 21.55 180.4 L21.2 179.95 21.7 176.95 M22.6 185.8 L21.95 189.5 Q20.75 189.05 20.15 187.95 L19.95 187.55 20.5 183.95 Q21.15 185.4 22.6 185.8 M19.2 192.1 Q19.95 192.8 21.2 192.8 L21.4 192.8 21.1 194.85 20.0 195.15 Q19.25 195.15 18.75 194.65 L19.2 192.1 M18.05 198.5 L18.45 196.25 19.65 196.55 20.85 196.25 20.65 197.45 20.25 197.7 Q18.95 198.5 18.05 198.5 M17.8 200.05 Q18.6 200.55 19.7 200.55 L20.15 200.55 19.45 204.85 18.7 204.9 Q17.65 204.9 17.05 204.45 L17.8 200.05 M16.45 207.7 L17.4 207.75 19.0 207.5 18.35 211.15 18.25 211.2 Q17.4 211.85 16.75 211.85 L15.85 211.6 16.45 207.7 M15.2 215.05 Q16.35 215.05 17.3 214.45 L17.95 214.05 17.25 218.15 Q16.45 219.0 15.45 219.0 L14.6 218.85 15.2 215.05" fill="#696258" fill-rule="evenodd" stroke="none"/>
    <path d="M23.5 166.65 Q24.35 166.45 25.45 165.7 L25.95 165.3 25.2 169.7 25.1 169.75 Q23.8 171.2 22.85 171.2 L22.7 171.2 23.5 166.65 M22.05 175.3 L24.45 173.1 24.7 172.75 24.0 177.25 23.0 177.35 Q22.2 177.35 21.7 176.95 L22.05 175.3 M20.5 183.95 L21.2 179.95 21.55 180.4 Q22.4 181.4 23.3 181.5 L22.6 185.8 Q21.15 185.4 20.5 183.95 M19.95 187.55 L20.15 187.95 Q20.75 189.05 21.95 189.5 L21.4 192.8 21.2 192.8 Q19.95 192.8 19.2 192.1 L19.95 187.55 M18.75 194.65 Q19.25 195.15 20.0 195.15 L21.1 194.85 20.85 196.25 19.65 196.55 18.45 196.25 18.75 194.65 M18.05 198.5 Q18.95 198.5 20.25 197.7 L20.65 197.45 20.15 200.55 19.7 200.55 Q18.6 200.55 17.8 200.05 L18.05 198.5 M17.05 204.45 Q17.65 204.9 18.7 204.9 L19.45 204.85 19.0 207.5 17.4 207.75 16.45 207.7 17.05 204.45 M17.95 214.05 L17.3 214.45 Q16.35 215.05 15.2 215.05 L15.85 211.6 16.75 211.85 Q17.4 211.85 18.25 211.2 L18.35 211.15 17.95 214.05 M14.6 218.85 L15.45 219.0 Q16.45 219.0 17.25 218.15 L17.0 219.5 16.8 219.55 15.55 219.95 14.45 219.75 14.6 218.85" fill="#a89c8c" fill-rule="evenodd" stroke="none"/>
    <path d="M17.5 219.1 L0.5 319.75 0.25 321.25 -0.2 323.7 Q-0.45 324.75 -1.85 324.75 L-3.3 324.55 14.45 219.75 15.55 219.95 16.8 219.55 17.0 219.5 17.5 219.1" fill="#8a764e" fill-rule="evenodd" stroke="none"/>
    <path d="M-17.95 342.25 L-18.95 341.7 Q-19.25 341.4 -19.5 341.2 -20.55 340.1 -20.55 338.15 -20.55 337.25 -20.15 336.25 L-19.4 335.0 -17.9 334.2 -17.6 333.75 -17.45 332.9 Q-17.25 332.15 -16.25 331.45 -15.4 330.85 -14.9 330.8 L-13.95 330.5 -12.7 330.45 -11.9 330.45 -11.35 330.7 -10.75 329.85 -9.9 331.15 -9.85 331.3 -12.9 334.4 Q-15.4 336.6 -15.4 337.6 L-14.9 338.7 -15.8 339.75 -17.1 341.5 -17.95 342.25 M-4.05 321.7 L13.45 219.05 14.15 219.65 14.45 219.75 -3.3 324.55 Q-4.3 324.25 -4.3 323.35 L-4.3 323.05 -4.05 321.7" fill="#a18a5b" fill-rule="evenodd" stroke="none"/>
    <path d="M9.55 316.95 Q10.75 317.3 11.75 318.4 L12.5 319.5 9.2 321.2 8.65 320.35 Q7.7 318.9 6.35 318.4 L9.55 316.95 M-11.05 326.35 Q-9.75 326.95 -8.55 328.2 L-7.4 329.85 -9.75 331.1 -9.9 331.15 -10.75 329.85 -11.05 329.5 Q-12.25 328.2 -13.65 327.65 L-13.75 327.6 -11.05 326.35" fill="#79a826" fill-rule="evenodd" stroke="none"/>
    <path d="M4.65 318.05 L4.65 317.95 6.6 317.1 8.25 316.8 9.55 316.95 6.35 318.4 Q5.6 318.05 4.65 318.05 M-17.05 327.35 L-17.05 327.2 -14.1 326.0 -13.4 325.9 -11.05 326.35 -13.75 327.6 -15.9 327.2 -17.05 327.35" fill="#a5f037" fill-rule="evenodd" stroke="none"/>
    <path d="M0.5 319.75 L4.35 318.05 4.65 318.05 Q5.6 318.05 6.35 318.4 L0.25 321.25 0.5 319.75 M-13.4 325.9 L-13.45 325.7 -4.05 321.7 -4.3 323.05 -4.3 323.35 -11.05 326.35 -13.4 325.9" fill="#bfa06c" fill-rule="evenodd" stroke="none"/>
    <path d="M12.5 319.5 Q13.25 320.8 13.3 322.4 L13.3 322.95 9.9 324.8 9.9 324.75 Q10.15 323.0 9.2 321.2 L12.5 319.5 M-9.9 331.15 L-9.75 331.1 -7.4 329.85 Q-6.45 331.65 -6.3 333.75 L-6.3 333.9 -8.85 335.3 -8.85 335.05 -9.05 333.5 Q-9.3 332.35 -9.85 331.3 L-9.9 331.15" fill="#517019" fill-rule="evenodd" stroke="none"/>
    <path d="M6.35 318.4 Q7.7 318.9 8.65 320.35 L9.2 321.2 -7.4 329.85 -8.55 328.2 Q-9.75 326.95 -11.05 326.35 L-4.3 323.35 Q-4.3 324.25 -3.3 324.55 L-1.85 324.75 Q-0.45 324.75 -0.2 323.7 L0.25 321.25 6.35 318.4" fill="#947d54" fill-rule="evenodd" stroke="none"/>
    <path d="M9.2 321.2 Q10.15 323.0 9.9 324.75 L9.9 324.8 -6.3 333.9 -6.3 333.75 Q-6.45 331.65 -7.4 329.85 L9.2 321.2" fill="#5e4f35" fill-rule="evenodd" stroke="none"/>
    <path d="M12.8 325.25 L12.1 326.35 10.8 327.5 10.15 327.8 7.5 329.5 8.9 327.95 9.3 327.3 12.8 325.25 M-8.1 339.3 L-8.3 339.55 -11.35 341.5 -10.6 340.55 -9.85 339.55 -9.65 339.1 -9.5 338.75 -9.35 338.65 -6.75 337.0 -7.15 337.8 -7.35 338.25 -8.1 339.3" fill="#81b329" fill-rule="evenodd" stroke="none"/>
    <path d="M13.3 322.95 Q13.3 324.15 12.8 325.25 L9.3 327.3 9.9 324.8 13.3 322.95" fill="#749c24" fill-rule="evenodd" stroke="none"/>
    <path d="M9.3 327.3 Q8.65 327.55 8.25 327.75 L5.4 329.05 4.1 329.8 3.35 329.95 2.7 330.25 -0.15 332.55 -2.8 334.6 -4.0 335.7 -5.3 336.3 -5.95 336.5 -6.75 337.0 Q-6.3 335.5 -6.3 333.9 L9.9 324.8 9.3 327.3" fill="#7a6845" fill-rule="evenodd" stroke="none"/>
    <path d="M7.5 329.5 L-8.05 339.4 -8.1 339.3 -7.35 338.25 -7.15 337.8 -6.75 337.0 -5.95 336.5 -5.3 336.3 -4.0 335.7 -2.8 334.6 -0.15 332.55 2.7 330.25 3.35 329.95 4.1 329.8 5.4 329.05 8.25 327.75 Q8.65 327.55 9.3 327.3 L8.9 327.95 7.5 329.5" fill="#8c764f" fill-rule="evenodd" stroke="none"/>
    <path d="M-11.35 341.5 L-11.45 341.55 -11.5 341.55 -11.8 341.8 -11.95 341.85 -12.2 342.05 Q-13.5 342.9 -15.2 342.9 L-15.3 342.9 Q-16.75 342.9 -17.95 342.25 L-17.1 341.5 -15.8 339.75 -14.9 338.7 -15.4 337.6 Q-15.4 336.6 -12.9 334.4 L-9.85 331.3 Q-9.3 332.35 -9.05 333.5 L-8.85 335.05 -8.85 335.3 Q-8.85 337.15 -9.5 338.75 L-9.65 339.1 -9.85 339.55 -10.6 340.55 -11.35 341.5" fill="#917c52" fill-rule="evenodd" stroke="none"/>
    <path d="M-6.3 333.9 Q-6.3 335.5 -6.75 337.0 L-9.35 338.65 -9.5 338.75 Q-8.85 337.15 -8.85 335.3 L-6.3 333.9" fill="#84ab27" fill-rule="evenodd" stroke="none"/>
    <path d="M-22.3 335.05 Q-22.5 331.9 -20.6 329.5 -19.6 328.3 -18.3 327.75 L-17.8 327.55 -17.6 327.5 -17.2 327.35 -17.05 327.35 -15.9 327.2 -13.75 327.6 -13.65 327.65 -14.8 327.55 Q-16.4 327.55 -18.95 329.4 -22.15 331.8 -22.3 335.05" fill="#c2a66e" fill-rule="evenodd" stroke="none"/>
    <path d="M-19.5 341.2 L-20.15 340.55 Q-21.8 338.75 -22.15 336.25 L-22.25 335.65 -22.3 335.05 Q-22.15 331.8 -18.95 329.4 -16.4 327.55 -14.8 327.55 L-13.65 327.65 Q-12.25 328.2 -11.05 329.5 L-10.75 329.85 -11.35 330.7 -11.9 330.45 -12.7 330.45 -13.95 330.5 -14.9 330.8 Q-15.4 330.85 -16.25 331.45 -17.25 332.15 -17.45 332.9 L-17.6 333.75 -17.9 334.2 -19.4 335.0 -20.15 336.25 Q-20.55 337.25 -20.55 338.15 -20.55 340.1 -19.5 341.2" fill="#b09764" fill-rule="evenodd" stroke="none"/>
    <path d="M33.65 157.0 L33.15 158.75 32.6 160.75 Q31.3 165.5 30.8 169.3 30.65 169.8 30.65 170.3 L28.9 172.35 Q27.75 174.0 27.95 175.35 L26.7 174.85 Q26.55 174.85 26.55 174.15 26.55 172.9 28.1 168.95 29.6 165.05 29.6 163.75 L29.55 162.45 28.65 161.55 28.7 161.4 27.0 161.7 26.0 162.05 Q24.85 162.45 23.45 163.3 23.1 163.45 22.85 163.65 L22.05 164.15 21.85 164.3 Q19.65 165.8 16.6 167.95 16.45 168.0 16.25 168.15 L15.05 169.1 Q14.05 169.85 13.55 170.45 L13.25 170.45 13.25 169.65 Q13.75 168.35 15.95 166.5 L19.25 163.45 19.1 163.3 18.45 163.05 17.3 163.45 Q16.05 164.1 10.8 168.3 L10.5 168.5 10.45 168.5 10.35 168.1 Q10.35 167.5 11.25 165.45 L11.7 165.05 11.45 165.1 Q11.05 164.95 11.55 162.75 L13.75 160.95 17.5 157.4 13.9 158.15 11.55 158.4 10.2 158.25 17.85 155.15 18.0 155.15 18.0 155.2 19.45 154.45 30.4 148.5 30.6 148.4 31.15 148.05 31.35 148.15 30.7 149.3 Q30.4 150.0 30.4 150.6 L30.8 151.45 31.2 152.2 Q31.0 153.65 31.2 154.05 31.9 155.65 32.25 156.05 L32.4 156.3 Q32.95 156.8 33.65 157.0" fill="#c2a68d" fill-rule="evenodd" stroke="none"/>
    <path d="M31.35 148.15 L31.85 147.55 32.4 146.8 32.65 146.4 35.3 144.75 37.95 143.25 38.0 143.35 38.05 143.85 38.0 144.1 33.65 157.0 Q32.95 156.8 32.4 156.3 L32.25 156.05 Q31.9 155.65 31.2 154.05 31.0 153.65 31.2 152.2 L30.8 151.45 30.4 150.6 Q30.4 150.0 30.7 149.3 L31.35 148.15" fill="#93995a" fill-rule="evenodd" stroke="none"/>
  </g>
</svg>
