<?xml version="1.0" encoding="UTF-8" standalone="no"?>
<svg xmlns:xlink="http://www.w3.org/1999/xlink" height="104.9px" width="133.9px" xmlns="http://www.w3.org/2000/svg">
  <g transform="matrix(1.0, 0.0, 0.0, 1.0, 34.15, 33.9)">
    <path d="M34.15 -32.05 L34.25 -31.75 Q34.2 -31.05 33.8 -30.45 L33.1 -29.75 Q28.15 -29.85 30.95 -33.6 L31.5 -33.8 32.05 -33.9 Q33.8 -33.7 34.15 -32.05 M97.0 -15.2 L94.3 -15.15 93.45 -15.6 Q92.35 -19.35 96.3 -20.9 L96.8 -21.05 Q102.6 -18.15 97.0 -15.2 M20.95 29.45 Q19.35 30.65 17.5 29.85 12.6 27.6 16.45 23.25 17.85 21.7 19.7 21.55 27.25 24.6 20.95 29.45 M29.75 70.4 Q27.8 71.8 26.8 69.8 24.8 65.85 29.2 64.75 34.1 67.25 29.75 70.4 M-30.0 -20.45 L-29.95 -20.2 Q-30.0 -19.3 -30.6 -18.65 L-31.5 -18.05 Q-32.5 -17.85 -33.35 -18.4 -35.2 -20.55 -32.75 -21.9 L-32.05 -22.2 Q-30.35 -22.0 -30.0 -20.45 M-2.75 3.6 L-2.75 3.85 Q-6.4 8.35 -7.25 2.8 -7.45 1.6 -6.15 1.2 L-5.3 0.95 Q-2.9 1.3 -2.75 3.6" fill="#ffffff" fill-opacity="0.49803922" fill-rule="evenodd" stroke="none"/>
    <path d="M-4.35 3.4 L-4.55 3.85 -5.0 4.05 -5.45 3.85 -5.65 3.4 -5.45 2.95 -5.0 2.75 -4.55 2.95 -4.35 3.4 M-4.5 3.9 L-4.55 3.9 -4.5 3.85 -4.5 3.9 M-32.55 -20.7 L-31.95 -21.0 -31.3 -20.7 -31.05 -20.1 Q-31.05 -19.75 -31.3 -19.45 -31.6 -19.2 -31.95 -19.2 -32.3 -19.2 -32.55 -19.45 L-32.85 -20.1 -32.55 -20.7 M28.85 68.0 L28.85 67.8 29.05 67.8 29.05 68.0 28.85 68.0 M17.9 25.85 Q17.9 25.25 18.35 24.85 18.75 24.45 19.35 24.45 19.95 24.45 20.4 24.85 20.8 25.25 20.8 25.85 20.8 26.45 20.4 26.85 19.95 27.25 19.35 27.25 18.75 27.25 18.35 26.85 17.9 26.45 17.9 25.85 M96.3 -17.8 L96.3 -18.1 96.7 -18.1 96.7 -17.8 96.3 -17.8 M31.35 -31.85 L31.6 -32.45 32.2 -32.7 32.8 -32.45 33.05 -31.85 32.8 -31.25 Q32.55 -31.0 32.2 -31.0 31.85 -31.0 31.6 -31.25 31.35 -31.5 31.35 -31.85" fill="#ffffff" fill-rule="evenodd" stroke="none"/>
  </g>
</svg>
