<?xml version="1.0" encoding="UTF-8" standalone="no"?>
<svg xmlns:xlink="http://www.w3.org/1999/xlink" height="8.05px" width="32.5px" xmlns="http://www.w3.org/2000/svg">
  <g transform="matrix(1.0, 0.0, 0.0, 1.0, 42.8, -3.35)">
    <path d="M-10.3 4.45 Q-10.3 5.55 -12.15 6.55 -13.6 7.35 -14.05 8.45 -14.4 9.35 -16.95 10.3 -19.55 11.2 -21.9 11.2 -22.95 11.2 -23.2 10.85 -23.4 10.55 -24.2 10.6 L-28.25 10.5 -29.4 10.1 Q-29.75 10.5 -29.6 11.05 L-32.1 11.4 Q-40.1 11.4 -40.7 8.45 L-40.85 6.65 Q-42.8 6.15 -42.8 5.45 -42.8 4.7 -41.6 4.7 L-37.25 5.75 -35.15 5.25 -35.6 6.2 -36.7 7.2 -34.0 7.9 Q-33.55 7.9 -33.05 7.15 -32.55 6.4 -31.6 6.4 L-29.85 6.7 -27.8 7.0 -25.6 7.0 -23.4 7.15 -22.5 7.35 Q-21.35 7.35 -18.4 6.35 L-14.65 4.85 Q-12.1 3.55 -11.4 3.4 -10.3 3.2 -10.3 4.45" fill="#000000" fill-opacity="0.17254902" fill-rule="evenodd" stroke="none"/>
  </g>
</svg>
