<?xml version="1.0" encoding="UTF-8" standalone="no"?>
<svg xmlns:xlink="http://www.w3.org/1999/xlink" height="73.0px" width="70.15px" xmlns="http://www.w3.org/2000/svg">
  <g transform="matrix(1.0, 0.0, 0.0, 1.0, 35.1, 36.5)">
    <path d="M-18.0 5.55 L-18.0 2.45 -21.5 2.45 Q-21.9 2.45 -22.2 2.75 L-22.5 3.45 -22.5 7.0 -22.3 7.55 -22.2 7.7 -20.0 10.8 Q-19.75 11.1 -19.8 11.55 L-20.2 12.15 -17.65 15.65 -17.0 15.45 Q-16.6 15.5 -16.3 15.85 L-15.8 16.2 -15.75 16.2 -15.3 16.25 -15.2 16.2 -15.15 16.2 -14.7 15.85 -14.65 15.85 -12.7 13.2 -12.75 13.15 -15.0 9.95 -15.15 9.2 -14.8 8.55 -16.4 6.35 -17.0 6.55 -17.7 6.25 -18.0 5.55 M-22.5 -8.95 L-22.4 -8.85 Q-22.1 -8.6 -22.1 -8.2 L-22.1 -8.1 Q-22.1 -7.8 -22.25 -7.55 L-22.3 -7.45 -22.5 -6.95 -22.5 -3.6 -22.2 -2.9 -22.05 -2.75 -21.5 -2.6 -18.0 -2.6 -18.0 -5.55 -17.7 -6.2 -17.7 -6.25 -15.45 -9.3 -14.8 -9.7 -14.1 -9.55 -12.45 -11.8 -12.8 -12.25 -12.75 -13.05 -12.65 -13.2 -12.7 -13.25 -12.65 -13.2 -12.0 -12.8 -11.75 -12.8 -11.65 -13.2 -11.85 -13.8 -13.2 -15.65 -13.9 -15.45 Q-14.3 -15.5 -14.55 -15.8 L-15.1 -16.2 -15.2 -16.25 -15.65 -16.2 -15.7 -16.2 -16.2 -15.85 -16.2 -15.8 -18.6 -12.65 Q-18.85 -12.3 -19.25 -12.25 L-19.95 -12.4 -22.5 -8.95 M8.8 16.15 L8.75 16.1 8.7 16.1 4.95 17.35 4.2 17.3 3.7 16.7 0.95 17.6 0.95 18.2 0.45 18.8 -0.3 18.85 -4.1 17.65 -4.65 17.15 -4.75 16.4 -4.7 16.35 -7.35 15.5 -7.45 15.65 -8.0 16.15 -8.65 16.15 -8.65 16.2 -10.5 18.75 -10.55 18.8 -10.55 18.85 -10.6 18.9 -10.75 19.35 -10.75 19.4 -10.55 19.95 -10.55 20.0 -10.0 20.3 -9.9 20.35 -6.25 21.5 -5.65 22.0 Q-5.5 22.35 -5.6 22.75 L-5.6 22.8 -1.55 24.15 -1.05 23.55 -0.25 23.5 0.2 23.55 0.3 23.5 0.4 23.5 4.1 22.3 4.85 22.4 5.35 22.9 9.5 21.55 Q9.35 21.15 9.55 20.8 L10.15 20.3 10.65 19.95 10.85 19.4 10.85 19.35 10.7 18.85 10.65 18.75 8.8 16.15 M22.5 3.45 L22.35 2.9 22.25 2.8 22.2 2.75 Q21.9 2.45 21.5 2.45 L18.0 2.45 18.0 5.55 17.75 6.2 15.5 9.4 14.9 9.8 14.15 9.6 14.1 9.6 12.55 11.7 12.65 11.75 13.0 12.4 12.85 13.1 12.9 13.15 14.8 15.75 14.85 15.8 15.3 16.1 15.35 16.1 15.8 16.15 15.9 16.1 15.95 16.1 16.45 15.75 16.5 15.65 18.7 12.6 Q18.95 12.25 19.35 12.2 19.75 12.1 20.1 12.35 L22.5 8.95 22.4 8.85 Q22.1 8.55 22.1 8.15 22.1 7.75 22.4 7.45 L22.5 7.0 22.5 3.45 M0.0 -7.05 L4.2 -5.7 6.7 -2.15 6.7 2.2 4.2 5.7 0.0 7.05 -4.15 5.7 -6.7 2.2 -6.7 -2.15 -4.15 -5.7 0.0 -7.05 M1.25 -12.85 L1.25 -12.8 0.75 -12.25 0.0 -12.2 -0.1 -12.2 -3.8 -10.95 -4.55 -11.0 -5.05 -11.6 -6.55 -11.1 Q-6.4 -10.7 -6.6 -10.35 L-7.15 -9.85 -7.2 -9.8 -7.25 -9.75 -9.5 -6.6 -10.1 -6.2 Q-10.55 -6.15 -10.85 -6.4 L-10.9 -6.4 -11.8 -5.2 -11.75 -5.15 -11.4 -4.5 Q-11.35 -4.1 -11.6 -3.8 L-11.6 0.2 Q-11.6 0.6 -11.9 0.9 L-12.6 1.2 -12.6 2.8 Q-12.2 2.8 -11.9 3.1 -11.6 3.4 -11.6 3.8 L-11.45 4.0 -9.3 7.1 Q-9.05 7.4 -9.1 7.85 L-9.45 8.45 -8.55 9.65 Q-8.3 9.4 -7.9 9.45 -7.5 9.5 -7.2 9.85 L-7.15 9.85 -7.05 9.9 -3.4 11.1 -2.8 11.6 Q-2.65 11.95 -2.75 12.35 L-1.25 12.85 -0.75 12.25 0.0 12.2 3.8 10.95 4.55 11.0 5.05 11.6 6.55 11.1 Q6.4 10.7 6.6 10.35 6.8 10.0 7.2 9.85 L7.25 9.85 9.5 6.65 Q9.7 6.3 10.15 6.25 L10.9 6.4 10.95 6.45 11.85 5.2 11.8 5.2 11.4 4.5 Q11.35 4.1 11.6 3.8 L11.6 -0.2 Q11.6 -0.6 11.9 -0.9 L12.6 -1.2 12.6 -2.8 Q12.2 -2.8 11.9 -3.1 11.6 -3.4 11.6 -3.8 L9.3 -7.05 Q9.05 -7.4 9.15 -7.8 9.2 -8.2 9.5 -8.4 L8.6 -9.65 Q8.3 -9.4 7.9 -9.45 L7.25 -9.8 7.2 -9.85 7.15 -9.85 3.4 -11.1 2.8 -11.6 Q2.6 -11.95 2.75 -12.35 L1.25 -12.85 M14.7 -15.85 L14.7 -15.8 12.75 -13.2 12.7 -13.15 12.85 -12.95 15.0 -9.85 15.2 -9.1 14.85 -8.5 16.45 -6.3 17.0 -6.5 17.7 -6.2 18.0 -5.5 18.0 -2.6 21.55 -2.6 Q21.9 -2.6 22.25 -2.85 L22.25 -2.9 22.5 -3.55 22.5 -6.95 22.4 -7.4 22.2 -7.65 20.0 -10.7 Q19.75 -11.05 19.85 -11.45 19.9 -11.85 20.25 -12.1 L17.7 -15.6 17.1 -15.4 Q16.7 -15.4 16.4 -15.7 L16.25 -15.95 Q16.05 -16.1 15.8 -16.2 L15.7 -16.25 15.25 -16.2 15.2 -16.2 14.7 -15.85 M10.6 -18.85 L10.7 -19.3 10.7 -19.35 10.55 -19.9 10.5 -20.0 10.05 -20.3 10.0 -20.3 9.8 -20.35 6.25 -21.6 5.65 -22.1 5.6 -22.8 1.6 -24.1 1.15 -23.55 0.35 -23.5 -0.2 -23.5 -0.6 -23.4 -4.25 -22.2 -5.0 -22.25 -5.5 -22.85 -9.35 -21.55 -9.3 -21.25 -9.4 -20.75 -9.8 -20.35 -9.85 -20.35 -10.0 -20.3 -10.05 -20.3 -10.45 -20.05 -10.55 -19.85 -10.75 -19.35 -10.75 -19.3 -10.55 -18.75 -8.6 -16.15 -8.6 -16.1 -4.8 -17.35 -4.05 -17.3 -3.55 -16.7 -0.95 -17.6 -0.95 -18.2 -0.45 -18.75 0.3 -18.85 4.1 -17.6 4.7 -17.1 4.75 -16.35 7.35 -15.5 7.85 -16.05 8.6 -16.1 8.6 -16.15 Q8.35 -15.8 8.45 -15.4 L8.5 -15.1 8.9 -15.15 9.4 -15.55 10.7 -17.35 10.6 -17.45 Q10.3 -17.75 10.3 -18.15 10.3 -18.55 10.6 -18.85 M21.35 -29.6 L21.65 -29.4 21.7 -29.35 21.75 -29.25 22.5 -28.2 23.3 -27.05 23.35 -26.7 23.2 -26.4 23.3 -26.25 23.35 -26.25 23.7 -26.25 24.0 -26.0 24.1 -25.8 24.15 -25.45 24.05 -25.25 24.15 -25.05 24.55 -25.05 Q25.5 -24.75 26.2 -23.8 L27.35 -21.8 28.35 -20.0 28.4 -19.6 28.25 -19.4 28.4 -19.2 28.75 -19.2 29.05 -18.95 29.15 -18.75 29.2 -18.4 29.1 -18.25 29.25 -18.0 29.5 -18.05 29.8 -17.85 30.8 -16.05 Q31.15 -15.3 32.0 -14.5 L33.4 -13.25 33.45 -13.2 Q34.0 -12.75 34.65 -11.35 L34.7 -10.95 34.65 -10.9 Q34.4 -9.8 34.5 -9.45 L34.6 -8.05 34.6 -8.0 34.7 -5.75 34.6 -5.4 34.25 -5.25 34.2 -5.25 34.2 -4.95 34.55 -4.8 34.7 -4.45 34.7 -4.15 34.55 -3.8 Q34.4 -3.65 34.2 -3.65 L34.2 -3.35 34.35 -3.3 34.65 -3.1 34.7 -2.7 Q34.45 -1.9 34.8 -1.05 35.15 0.05 34.95 1.2 34.75 2.1 34.95 3.3 35.15 4.65 34.9 5.35 34.7 5.95 34.8 7.1 L34.85 9.45 34.7 11.1 34.7 11.2 34.6 11.45 34.5 11.55 34.3 11.75 34.15 12.1 33.8 12.25 33.5 12.15 33.35 12.4 33.5 12.6 33.45 13.0 33.35 13.2 33.05 13.45 32.7 13.4 32.6 13.35 32.5 13.55 32.55 13.6 32.7 13.95 32.6 14.3 31.5 15.8 30.05 17.65 30.1 17.65 28.8 19.15 27.6 20.8 27.6 20.75 26.6 22.5 26.65 22.5 Q26.15 23.75 25.4 24.15 L25.05 24.2 24.85 24.1 24.75 24.3 24.95 24.55 24.9 24.95 24.8 25.15 24.5 25.4 24.15 25.35 24.0 25.3 23.9 25.45 23.95 25.5 24.15 25.8 24.1 26.2 22.95 28.0 22.95 27.95 21.6 29.5 21.35 29.6 19.6 30.1 19.6 30.15 Q18.95 30.75 17.85 30.8 L17.5 30.7 17.3 30.4 17.05 30.45 17.05 30.5 17.1 30.85 16.85 31.15 16.65 31.25 16.25 31.3 15.95 31.05 15.9 30.85 15.65 30.95 15.7 31.1 15.65 31.5 15.35 31.7 13.35 32.4 13.4 32.4 Q12.05 33.05 11.2 33.05 L9.6 33.3 Q8.65 33.55 7.6 34.05 L7.65 34.05 5.7 34.85 3.65 35.35 1.9 35.85 0.25 36.45 0.15 36.5 -0.2 36.45 Q-1.4 35.85 -1.85 35.8 L-3.2 35.6 -3.25 35.6 -5.45 35.05 -5.5 35.05 Q-6.85 34.65 -7.7 34.4 L-9.45 33.6 -11.05 32.6 Q-11.75 32.2 -12.9 32.3 L-13.25 32.2 -13.45 31.85 -13.4 31.65 -13.65 31.6 -13.7 31.65 -14.0 31.9 -14.35 31.85 -14.55 31.75 -14.8 31.45 -14.85 31.2 -15.1 31.15 -15.3 31.35 -15.7 31.4 -17.6 30.8 -17.55 30.8 -19.65 30.05 -19.6 30.1 Q-20.55 29.7 -21.25 29.6 L-21.3 29.6 -21.6 29.45 -21.65 29.4 -22.95 27.5 Q-23.05 27.15 -23.7 26.6 L-23.85 26.25 -23.7 25.85 -23.65 25.8 -23.75 25.65 -23.8 25.65 -24.2 25.7 -24.5 25.45 -24.6 25.25 -24.6 24.85 -24.45 24.65 -24.6 24.45 -24.95 24.5 -25.25 24.3 -26.4 22.65 -27.55 21.0 -28.5 19.45 -28.5 19.4 -29.5 18.2 -30.95 16.45 -32.3 14.95 Q-33.2 14.25 -33.6 13.25 L-34.5 11.55 -34.7 11.2 -34.7 11.1 -34.7 11.05 -34.75 9.8 -34.7 9.45 -34.6 9.15 Q-34.45 8.9 -34.2 8.95 L-34.2 8.75 -34.55 8.6 -34.7 8.25 -34.7 8.05 -34.55 7.7 Q-34.4 7.55 -34.2 7.55 L-34.2 7.35 -34.25 7.35 -34.6 7.15 -34.7 6.8 Q-34.5 5.45 -34.65 4.5 L-34.65 4.45 -34.75 2.5 -34.8 0.6 -34.8 -1.15 -34.8 -2.85 -35.0 -5.0 -35.0 -7.1 -35.0 -7.15 Q-34.8 -8.0 -34.75 -9.3 L-34.7 -11.05 -34.7 -11.15 -34.6 -11.4 -34.6 -11.45 -34.2 -11.95 -34.05 -12.15 -33.7 -12.25 -33.4 -12.25 -33.3 -12.35 -33.45 -12.6 -33.45 -12.95 -33.35 -13.15 -33.05 -13.4 -32.65 -13.4 -32.6 -13.35 -32.45 -13.5 -32.65 -13.8 -32.65 -14.15 -31.45 -16.0 Q-30.95 -16.65 -30.6 -17.4 L-29.5 -19.2 -28.3 -20.8 -28.3 -20.85 -26.85 -22.3 -26.8 -22.3 Q-26.15 -22.8 -25.6 -23.9 L-25.3 -24.15 -24.9 -24.15 -24.85 -24.1 -24.7 -24.25 -24.9 -24.55 -24.9 -24.9 -24.8 -25.1 -24.5 -25.35 -24.1 -25.35 -24.0 -25.25 -23.9 -25.45 -23.95 -25.5 -24.15 -25.85 -24.0 -26.2 -22.75 -27.65 -21.7 -29.25 -21.7 -29.3 -21.65 -29.35 -21.4 -29.55 -21.25 -29.6 -19.5 -30.15 -19.4 -30.2 -17.85 -30.6 Q-17.05 -30.75 -16.15 -31.3 L-15.8 -31.4 -15.5 -31.15 -15.4 -31.0 -15.15 -31.05 -15.15 -31.45 -14.9 -31.75 -14.7 -31.85 -14.35 -31.85 -14.05 -31.6 -14.0 -31.45 -13.7 -31.55 -13.8 -31.85 -13.6 -32.2 Q-12.45 -33.1 -11.7 -33.15 L-11.65 -33.15 -10.15 -33.45 -7.65 -33.95 Q-6.45 -34.05 -5.65 -34.5 -4.7 -35.1 -3.8 -35.3 L-2.05 -35.85 -0.25 -36.45 0.1 -36.5 2.55 -35.75 4.0 -35.0 3.95 -35.0 5.55 -34.3 7.1 -33.75 9.15 -33.35 11.35 -33.15 11.4 -33.15 Q12.7 -32.95 13.35 -32.1 L13.45 -31.75 13.45 -31.65 13.7 -31.55 13.7 -31.6 14.0 -31.85 14.4 -31.85 14.6 -31.75 14.85 -31.45 14.85 -31.2 15.1 -31.1 15.35 -31.35 15.7 -31.35 17.6 -30.75 17.65 -30.75 19.35 -30.3 21.35 -29.6" fill="#000000" fill-rule="evenodd" stroke="none"/>
  </g>
</svg>
