<?xml version="1.0" encoding="UTF-8" standalone="no"?>
<svg xmlns:xlink="http://www.w3.org/1999/xlink" height="159.45px" width="190.1px" xmlns="http://www.w3.org/2000/svg">
  <g transform="matrix(1.0, 0.0, 0.0, 1.0, 85.65, 83.6)">
    <path d="M53.7 -77.45 Q51.65 -76.65 51.05 -78.65 49.7 -83.1 54.95 -83.6 60.3 -80.15 53.7 -77.45 M9.35 -71.0 Q7.9 -70.0 6.75 -71.4 2.1 -76.95 9.15 -78.35 15.1 -74.8 9.35 -71.0 M29.6 -28.1 Q26.65 -22.05 20.9 -26.7 19.3 -27.95 19.55 -30.05 20.3 -35.95 27.1 -36.35 33.4 -33.5 29.6 -28.1 M58.65 -28.1 Q57.7 -26.55 55.8 -26.25 49.2 -25.1 50.3 -31.3 51.25 -36.6 56.65 -36.8 62.2 -33.85 58.65 -28.1 M68.9 -8.4 Q66.75 -2.85 60.3 -5.0 55.05 -6.75 57.1 -12.35 58.8 -17.0 63.7 -17.6 71.95 -16.3 68.9 -8.4 M85.4 37.55 Q84.2 38.5 83.0 37.4 78.95 33.7 83.8 31.8 90.35 33.6 85.4 37.55 M101.15 8.95 Q100.35 9.35 99.75 8.55 96.8 4.3 101.75 2.75 107.4 6.0 101.15 8.95 M8.35 15.35 Q9.8 12.45 13.0 11.95 20.9 12.45 18.75 19.75 17.2 25.0 11.8 23.55 4.95 21.9 8.35 15.35 M4.35 38.75 Q2.1 40.5 0.05 38.35 -3.25 34.8 1.0 32.5 2.35 31.8 3.85 31.85 9.6 34.7 4.35 38.75 M34.1 44.1 Q31.1 46.25 30.35 42.75 29.8 40.15 32.1 38.25 33.05 37.5 34.15 37.5 L34.5 37.7 Q34.45 35.7 36.95 35.3 42.25 38.1 36.75 40.1 37.1 41.95 34.1 44.1 M20.8 56.8 Q15.7 54.4 19.9 50.25 21.05 49.1 22.5 48.9 29.95 50.25 25.0 55.9 23.2 57.95 20.8 56.8 M12.5 65.05 Q11.3 66.05 9.85 65.2 4.85 62.3 9.4 59.05 10.0 58.6 10.55 58.5 17.85 60.8 12.5 65.05 M-29.25 -69.7 Q-25.3 -68.3 -25.6 -63.65 L-25.6 -63.35 Q-30.4 -57.9 -34.45 -64.45 -35.1 -65.5 -34.35 -66.7 -32.65 -69.45 -29.25 -69.7 M-12.6 -69.25 Q-13.7 -66.2 -16.45 -67.35 L-16.8 -68.0 Q-18.1 -71.0 -15.15 -71.9 L-14.05 -71.55 Q-12.6 -70.85 -12.6 -69.25 M-54.45 -26.0 Q-58.05 -23.95 -58.25 -27.9 -58.4 -32.35 -53.9 -33.0 -47.9 -29.75 -54.45 -26.0 M-41.05 -7.15 Q-39.9 -9.65 -37.35 -10.1 -29.9 -8.5 -35.2 -3.35 -38.75 0.1 -40.95 -3.85 -41.85 -5.5 -41.05 -7.15 M-37.7 -33.05 Q-41.05 -36.0 -37.05 -38.2 -35.8 -38.9 -34.5 -38.9 -28.2 -36.45 -33.95 -32.8 -35.9 -31.55 -37.7 -33.05 M-25.6 -10.8 Q-28.6 -15.0 -23.1 -15.85 L-22.55 -15.95 Q-17.25 -13.5 -22.15 -10.15 -24.15 -8.8 -25.6 -10.8 M-3.2 -11.3 Q4.25 -8.45 -0.15 -1.75 -1.35 0.15 -3.7 -0.45 -12.55 -2.75 -7.95 -8.9 -6.65 -10.7 -4.35 -11.1 L-3.2 -11.3 M-25.9 16.0 Q-26.85 16.4 -27.55 15.55 -30.45 11.65 -25.7 10.3 -19.7 13.4 -25.9 16.0 M-77.75 33.7 Q-81.15 37.3 -84.25 33.45 -87.6 29.3 -82.8 27.6 L-79.55 26.5 Q-73.05 28.65 -77.75 33.7 M-49.55 71.05 Q-51.05 71.6 -51.55 70.05 -52.55 66.8 -49.3 66.25 -44.0 69.05 -49.55 71.05 M-70.65 75.7 Q-71.7 76.15 -72.15 75.05 -73.85 71.15 -69.75 70.05 -65.05 73.3 -70.65 75.7 M-25.95 67.65 Q-27.1 69.15 -28.8 68.1 -32.55 65.8 -30.3 61.7 -29.45 60.15 -27.8 60.1 -22.2 62.65 -25.95 67.65" fill="#ffffff" fill-opacity="0.49803922" fill-rule="evenodd" stroke="none"/>
    <path d="M1.8 35.7 Q1.8 35.3 2.1 35.05 2.4 34.75 2.8 34.75 3.2 34.75 3.5 35.05 L3.8 35.7 3.5 36.4 2.8 36.65 2.1 36.4 Q1.8 36.1 1.8 35.7 M15.65 20.3 Q14.7 21.2 13.35 21.2 12.0 21.2 11.1 20.3 10.15 19.35 10.15 18.05 10.15 16.75 11.1 15.85 12.0 14.9 13.35 14.9 14.7 14.9 15.65 15.85 16.55 16.75 16.55 18.05 16.55 19.35 15.65 20.3 M84.25 34.8 L84.55 34.8 84.4 35.0 84.25 34.8 M60.6 -8.35 Q59.55 -9.45 59.55 -10.95 59.55 -12.45 60.6 -13.55 61.7 -14.6 63.2 -14.6 64.7 -14.6 65.8 -13.55 66.85 -12.45 66.85 -10.95 66.85 -9.45 65.8 -8.35 64.7 -7.3 63.2 -7.3 61.7 -7.3 60.6 -8.35 M56.7 -29.85 Q56.05 -29.2 55.15 -29.2 54.25 -29.2 53.65 -29.85 53.0 -30.5 53.0 -31.4 53.0 -32.3 53.65 -32.95 54.25 -33.6 55.15 -33.6 56.05 -33.6 56.7 -32.95 57.3 -32.3 57.3 -31.4 57.3 -30.5 56.7 -29.85 M25.35 -33.35 Q26.55 -33.35 27.4 -32.5 28.2 -31.7 28.2 -30.55 28.2 -29.4 27.4 -28.55 26.55 -27.75 25.35 -27.75 24.15 -27.75 23.35 -28.55 22.5 -29.4 22.5 -30.55 22.5 -31.7 23.35 -32.5 24.15 -33.35 25.35 -33.35 M9.15 -75.05 L9.35 -74.5 9.15 -73.9 8.6 -73.7 Q8.3 -73.7 8.1 -73.9 7.85 -74.15 7.85 -74.5 L8.1 -75.05 8.6 -75.3 9.15 -75.05 M53.9 -80.6 L54.35 -80.6 54.35 -80.2 53.9 -80.2 53.9 -80.6 M37.0 38.2 L35.7 37.15 36.6 37.7 37.0 38.2 M33.75 39.95 L33.7 40.45 34.15 39.7 33.75 39.95 34.0 38.95 34.9 40.35 34.6 40.6 33.4 41.5 31.9 41.15 33.75 39.95 M-27.4 63.5 L-27.3 64.35 -27.4 65.2 -27.7 65.55 -27.95 65.2 -28.1 64.35 -27.95 63.5 -27.7 63.15 -27.4 63.5 M-69.85 72.75 L-69.85 73.15 -70.3 73.15 -70.3 72.75 -69.85 72.75 M-48.85 69.1 L-49.2 69.25 -49.5 69.1 -49.65 68.75 -49.5 68.4 Q-49.4 68.25 -49.2 68.25 -49.0 68.25 -48.85 68.4 L-48.75 68.75 -48.85 69.1 M-79.45 29.75 Q-78.95 30.25 -78.95 30.95 -78.95 31.65 -79.45 32.15 -79.95 32.65 -80.65 32.65 -81.35 32.65 -81.85 32.15 -82.35 31.65 -82.35 30.95 -82.35 30.25 -81.85 29.75 -81.35 29.25 -80.65 29.25 -79.95 29.25 -79.45 29.75 M-2.15 -7.6 Q-1.45 -6.85 -1.45 -5.8 -1.45 -4.75 -2.15 -4.0 -2.9 -3.3 -3.95 -3.3 -5.0 -3.3 -5.75 -4.0 -6.45 -4.75 -6.45 -5.8 -6.45 -6.85 -5.75 -7.6 -5.0 -8.3 -3.95 -8.3 -2.9 -8.3 -2.15 -7.6 M-36.6 -6.15 Q-37.0 -5.55 -37.75 -5.1 L-38.15 -5.5 Q-38.15 -6.2 -37.5 -6.65 L-36.6 -6.15 M-23.0 -12.95 L-22.9 -12.75 -23.0 -12.55 -23.2 -12.45 -23.4 -12.55 -23.5 -12.75 -23.4 -12.95 -23.2 -13.05 -23.0 -12.95 M-35.2 -35.9 Q-34.7 -35.9 -34.3 -35.6 L-34.25 -35.55 -34.3 -35.5 Q-34.7 -35.2 -35.2 -35.2 -35.7 -35.2 -36.05 -35.5 L-36.15 -35.55 -36.05 -35.6 Q-35.7 -35.9 -35.2 -35.9 M-54.65 -29.3 L-54.2 -29.7 -54.15 -28.65 -54.65 -29.3 M-14.4 -68.95 L-14.35 -69.0 -14.35 -68.95 -14.4 -68.95 M-14.85 -70.1 L-14.4 -69.9 -14.2 -69.45 -14.4 -69.0 -14.85 -68.8 -15.3 -69.0 -15.5 -69.45 -15.3 -69.9 -14.85 -70.1 M-29.0 -64.25 Q-29.45 -63.8 -30.1 -63.8 -30.75 -63.8 -31.2 -64.25 -31.65 -64.7 -31.65 -65.3 L-31.2 -66.35 Q-30.75 -66.8 -30.1 -66.8 L-29.0 -66.35 Q-28.55 -65.9 -28.55 -65.3 -28.55 -64.7 -29.0 -64.25 M11.05 61.35 L11.55 61.55 11.75 62.05 11.55 62.55 11.05 62.75 Q10.75 62.75 10.55 62.55 L10.35 62.05 10.55 61.55 11.05 61.35 M23.5 52.1 Q23.9 52.5 23.9 53.05 23.9 53.6 23.5 54.0 23.1 54.4 22.55 54.4 22.0 54.4 21.6 54.0 21.2 53.6 21.2 53.05 21.2 52.5 21.6 52.1 22.0 51.7 22.55 51.7 23.1 51.7 23.5 52.1" fill="#ffffff" fill-rule="evenodd" stroke="none"/>
  </g>
</svg>
