<?xml version="1.0" encoding="UTF-8" standalone="no"?>
<svg xmlns:xlink="http://www.w3.org/1999/xlink" height="345.0px" width="185.0px" xmlns="http://www.w3.org/2000/svg">
  <g transform="matrix(1.0, 0.0, 0.0, 1.0, -7.0, -4.0)">
    <path d="M188.0 8.0 L11.0 8.0 11.0 345.0 188.0 345.0 188.0 8.0 M192.0 349.0 L7.0 349.0 7.0 4.0 192.0 4.0 192.0 349.0" fill="url(#gradient0)" fill-rule="evenodd" stroke="none"/>
    <path d="M188.0 8.0 L188.0 345.0 11.0 345.0 11.0 8.0 188.0 8.0" fill="url(#gradient1)" fill-rule="evenodd" stroke="none"/>
  </g>
  <defs>
    <linearGradient gradientTransform="matrix(0.0, 0.1353, -0.2132, 0.0, 97.5, 177.15)" gradientUnits="userSpaceOnUse" id="gradient0" spreadMethod="pad" x1="-819.2" x2="819.2">
      <stop offset="0.19215686274509805" stop-color="#ffffff" stop-opacity="0.047058824"/>
      <stop offset="0.4235294117647059" stop-color="#325a66" stop-opacity="0.09803922"/>
      <stop offset="1.0" stop-color="#325866" stop-opacity="0.7176471"/>
      <stop offset="1.0" stop-color="#9ddff2" stop-opacity="0.4"/>
    </linearGradient>
    <linearGradient gradientTransform="matrix(0.0, 0.1353, -0.2132, 0.0, 97.5, 177.15)" gradientUnits="userSpaceOnUse" id="gradient1" spreadMethod="pad" x1="-819.2" x2="819.2">
      <stop offset="0.19215686274509805" stop-color="#ffffff" stop-opacity="0.047058824"/>
      <stop offset="0.4235294117647059" stop-color="#325a66" stop-opacity="0.09803922"/>
      <stop offset="1.0" stop-color="#325666" stop-opacity="0.4"/>
      <stop offset="1.0" stop-color="#9ddff2" stop-opacity="0.4"/>
    </linearGradient>
  </defs>
</svg>
