<?xml version="1.0" encoding="UTF-8" standalone="no"?>
<svg xmlns:xlink="http://www.w3.org/1999/xlink" height="127.9px" width="215.2px" xmlns="http://www.w3.org/2000/svg">
  <g transform="matrix(1.0, 0.0, 0.0, 1.0, 104.1, 56.65)">
    <path d="M-13.3 -43.45 Q-56.6 -43.45 -87.65 -3.25 -97.05 9.05 -104.1 23.45 L-104.1 -56.65 111.1 -56.65 111.1 71.25 45.5 71.25 50.05 65.0 Q62.9 45.6 62.9 23.0 62.9 -6.45 42.05 -24.85 20.95 -43.45 -13.3 -43.45" fill="#000000" fill-rule="evenodd" stroke="none"/>
  </g>
</svg>
