<?xml version="1.0" encoding="UTF-8" standalone="no"?>
<svg xmlns:xlink="http://www.w3.org/1999/xlink" height="39.6px" width="45.9px" xmlns="http://www.w3.org/2000/svg">
  <g transform="matrix(1.0, 0.0, 0.0, 1.0, 22.35, 19.0)">
    <path d="M-7.3 7.35 L-8.0 6.6 -8.15 6.3 -8.4 6.1 -8.5 6.05 -8.65 5.9 -8.95 5.65 -9.0 5.6 -9.05 5.6 -10.25 4.55 -10.05 4.65 -10.4 4.2 -10.5 4.15 -10.55 4.15 -10.95 3.6 -12.1 1.8 -12.25 1.65 -12.25 1.6 -12.45 1.2 Q-13.6 -1.1 -13.65 -3.75 L-13.65 -3.85 -13.65 -5.7 -13.55 -5.65 -13.5 -6.15 -13.5 -6.2 -13.45 -6.25 Q-13.15 -8.35 -12.1 -10.15 L-12.05 -10.15 -12.05 -10.2 -11.7 -10.65 Q-10.9 -12.15 -9.55 -13.35 L-9.35 -13.55 -9.3 -13.5 -9.25 -13.7 -9.0 -13.95 -8.45 -14.2 -7.8 -14.75 -7.8 -14.8 -6.95 -15.35 -6.5 -15.7 -6.45 -15.7 -6.0 -15.9 -5.75 -16.1 -5.4 -16.25 -5.35 -16.25 -3.4 -16.95 -3.3 -17.0 -3.2 -17.0 -2.25 -17.25 -2.2 -17.25 -0.35 -17.6 -0.2 -17.6 -0.1 -17.6 0.75 -17.65 1.0 -17.65 1.55 -17.65 1.8 -17.65 2.75 -17.6 2.9 -17.6 6.15 -16.95 6.3 -16.95 6.3 -16.9 7.45 -16.35 7.7 -16.25 7.75 -16.2 8.65 -15.8 9.3 -15.4 9.35 -15.35 9.45 -15.3 10.25 -14.6 10.55 -14.2 10.65 -14.1 10.7 -14.0 12.0 -12.7 12.6 -11.95 Q14.25 -9.6 14.8 -6.75 L14.8 -6.7 14.95 -5.85 14.9 -5.45 14.95 -5.1 14.9 -5.05 14.9 -4.4 15.05 -3.75 14.9 -3.05 14.8 -3.0 14.7 -2.2 14.7 -2.15 13.7 0.75 13.75 0.75 13.55 1.05 13.45 1.25 12.25 3.15 12.0 3.4 11.95 3.4 11.9 3.45 10.6 4.85 10.55 4.85 10.4 5.0 9.8 5.55 9.75 5.55 9.05 6.1 8.5 6.5 8.25 6.75 8.25 7.05 7.95 7.05 7.35 7.3 7.2 7.25 5.3 8.05 5.25 8.05 4.8 8.2 4.75 8.2 3.25 8.6 3.2 8.6 2.5 8.7 2.45 8.9 2.35 9.0 2.35 9.05 2.3 9.2 1.9 10.4 1.85 10.7 Q1.75 12.3 2.15 13.9 2.5 15.55 3.25 17.2 L4.25 19.4 3.95 19.15 2.2 17.3 0.3 14.55 Q-0.9 13.05 -1.65 11.4 L-2.0 10.3 -2.2 9.05 -3.45 8.75 -3.5 8.75 -3.55 8.5 -4.7 8.2 -5.65 7.95 -6.95 7.4 -7.3 7.35 M-2.75 -15.5 L-3.0 -15.25 -5.0 -13.05 -6.3 -11.4 -6.35 -11.3 -6.4 -11.3 -6.5 -10.95 -6.5 -11.0 -6.75 -10.35 -6.8 -10.25 -6.9 -10.15 -7.2 -9.15 -7.45 -7.95 -7.45 -7.8 -7.75 -4.65 -7.75 -4.1 -7.7 -4.0 -7.25 -1.35 -7.3 -0.9 Q-7.0 0.75 -6.3 2.15 L-6.2 2.15 -6.2 2.2 -5.85 2.9 -5.75 3.15 -5.35 3.6 -5.4 3.6 -5.1 4.05 -4.85 4.25 -4.85 4.4 -3.9 5.4 -3.7 5.55 -3.3 5.85 -3.2 5.9 -3.05 5.5 -2.55 5.9 -2.35 6.05 -2.0 6.4 -1.95 6.45 -1.8 5.9 -0.9 4.2 -0.9 4.15 -0.2 3.35 0.75 2.25 1.2 1.75 Q2.25 0.5 2.6 -1.05 L2.75 -2.7 2.7 -4.2 3.05 -3.7 3.65 -2.45 3.9 -1.9 4.25 -0.65 4.55 1.4 4.3 4.6 4.9 4.15 5.05 4.05 5.35 3.6 5.8 3.15 5.9 3.15 5.55 5.15 6.25 4.7 6.4 4.6 6.7 4.15 7.1 3.6 7.2 3.4 7.5 2.75 7.5 2.7 8.35 0.5 8.35 0.45 8.95 -1.9 9.0 -2.2 8.95 -2.2 9.0 -3.05 9.05 -3.55 9.05 -4.1 9.05 -5.0 9.05 -5.05 9.05 -5.15 8.8 -7.3 8.75 -7.35 8.75 -7.45 8.4 -8.8 8.4 -8.9 8.2 -9.55 8.05 -9.7 8.0 -9.8 7.75 -10.5 7.75 -10.45 7.6 -10.8 7.35 -11.25 7.25 -11.45 7.25 -11.55 7.2 -11.55 7.15 -11.65 7.1 -11.8 6.8 -12.3 6.6 -12.55 6.3 -13.2 6.1 -13.2 5.85 -13.45 5.7 -13.6 5.7 -13.65 5.25 -14.0 5.1 -14.15 5.05 -14.25 5.0 -14.25 4.55 -14.6 4.5 -14.7 4.25 -14.85 4.1 -14.9 3.95 -15.05 3.75 -15.1 3.65 -15.15 3.15 -15.35 3.05 -15.4 2.75 -15.5 2.6 -15.6 2.45 -15.65 2.35 -15.7 1.85 -15.85 1.75 -15.9 1.5 -16.0 1.4 -16.0 1.35 -16.05 1.0 -16.1 0.85 -16.15 0.75 -16.15 0.45 -16.2 0.1 -16.25 0.0 -16.25 -0.35 -16.2 -1.35 -16.05 -1.45 -16.0 -1.55 -16.0 -1.75 -15.9 -1.9 -15.85 -2.25 -15.7 -2.45 -15.65 -2.6 -15.6 -2.65 -15.6 -2.7 -15.55 -2.75 -15.5 M-9.45 -13.2 L-9.3 -13.4 -9.5 -13.2 -9.45 -13.2" fill="#422a08" fill-rule="evenodd" stroke="none"/>
    <path d="M-7.3 7.35 L-8.15 7.1 -8.2 7.1 -8.2 7.05 -9.3 6.05 -9.45 5.8 -9.7 5.6 -9.8 5.55 -9.9 5.4 -10.2 5.15 -10.25 5.1 -10.35 5.1 -11.55 4.0 -11.35 4.1 -11.65 3.65 -11.7 3.6 -11.8 3.6 -12.25 3.15 -13.45 1.25 -13.55 1.05 -13.7 0.7 Q-14.85 -1.6 -14.85 -4.25 L-14.85 -6.25 -14.8 -6.2 -14.75 -6.65 -14.75 -6.7 -14.7 -6.75 Q-14.35 -8.85 -13.45 -10.7 L-13.4 -10.7 -13.4 -10.75 -13.05 -11.15 Q-12.2 -12.7 -10.8 -13.9 L-10.65 -14.1 -10.5 -14.25 -10.25 -14.5 -9.75 -14.75 -9.1 -15.3 -9.1 -15.35 -8.25 -15.85 -7.75 -16.2 -7.7 -16.25 -7.25 -16.45 -7.0 -16.65 -6.7 -16.8 -4.6 -17.55 -4.55 -17.6 -3.6 -17.8 -3.55 -17.8 -1.65 -18.1 -1.55 -18.1 -1.4 -18.1 -0.5 -18.15 -0.2 -18.15 0.25 -18.15 0.5 -18.15 1.45 -18.1 1.55 -18.1 1.6 -18.1 4.95 -17.5 4.95 -17.45 5.0 -17.45 6.15 -16.95 2.9 -17.6 2.75 -17.6 1.8 -17.65 1.55 -17.65 1.0 -17.65 0.75 -17.65 -0.1 -17.6 -0.2 -17.6 -0.35 -17.6 -2.2 -17.25 -2.25 -17.25 -3.2 -17.0 -3.3 -17.0 -3.4 -16.95 -5.35 -16.25 -5.4 -16.25 -5.75 -16.1 -6.0 -15.9 -6.45 -15.7 -6.5 -15.7 -6.95 -15.35 -7.8 -14.8 -7.8 -14.75 -8.45 -14.2 -9.0 -13.95 -9.25 -13.7 -9.3 -13.5 -9.35 -13.55 -9.55 -13.35 Q-10.9 -12.15 -11.7 -10.65 L-12.05 -10.2 -12.05 -10.15 -12.1 -10.15 Q-13.15 -8.35 -13.45 -6.25 L-13.5 -6.2 -13.5 -6.15 -13.55 -5.65 -13.65 -5.7 -13.65 -3.85 -13.65 -3.75 Q-13.6 -1.1 -12.45 1.2 L-12.25 1.6 -12.25 1.65 -12.1 1.8 -10.95 3.6 -10.55 4.15 -10.5 4.15 -10.4 4.2 -10.05 4.65 -10.25 4.55 -9.05 5.6 -9.0 5.6 -8.95 5.65 -8.65 5.9 -8.5 6.05 -8.4 6.1 -8.15 6.3 -8.0 6.6 -7.3 7.35 M6.3 -16.9 L6.6 -16.8 7.05 -16.65 7.25 -16.5 7.45 -16.35 6.3 -16.9 M4.25 19.4 L4.8 20.6 2.7 18.55 0.95 16.75 -1.0 14.0 Q-2.2 12.55 -2.85 10.85 L-3.3 9.8 -3.5 8.75 -3.45 8.75 -2.2 9.05 -2.0 10.3 -1.65 11.4 Q-0.9 13.05 0.3 14.55 L2.2 17.3 3.95 19.15 4.25 19.4 M-2.75 -15.5 L-2.7 -15.55 -2.6 -15.6 -2.75 -15.5 M2.75 -15.5 L3.05 -15.4 3.15 -15.35 3.65 -15.15 3.75 -15.1 3.95 -15.05 4.1 -14.9 4.25 -14.85 4.5 -14.7 4.55 -14.6 5.0 -14.25 5.05 -14.25 5.1 -14.15 5.25 -14.0 5.7 -13.65 5.7 -13.6 5.85 -13.45 6.1 -13.2 6.3 -13.2 6.6 -12.55 6.8 -12.3 7.1 -11.8 7.15 -11.65 7.2 -11.55 7.25 -11.55 7.25 -11.45 7.35 -11.25 7.6 -10.8 7.75 -10.45 7.75 -10.5 8.0 -9.8 8.05 -9.7 8.2 -9.55 8.4 -8.9 8.4 -8.8 8.75 -7.45 8.75 -7.35 8.8 -7.3 9.05 -5.15 9.05 -5.05 9.05 -5.0 9.05 -4.1 9.05 -3.55 9.0 -3.05 8.95 -2.2 9.0 -2.2 8.95 -1.9 8.35 0.45 8.35 0.5 7.5 2.7 7.5 2.75 7.2 3.4 7.1 3.6 6.7 4.15 6.4 4.6 6.25 4.7 5.55 5.15 5.9 3.15 5.8 3.15 5.9 2.9 5.95 2.9 6.3 2.2 6.3 2.15 7.15 -0.1 7.65 -2.5 7.7 -2.75 7.6 -2.75 7.7 -3.6 7.7 -4.05 7.7 -4.65 7.7 -5.55 7.7 -5.6 7.7 -5.7 7.45 -7.85 7.4 -7.95 7.4 -8.0 7.2 -9.35 7.2 -9.45 6.95 -10.1 6.75 -10.35 6.55 -11.0 6.55 -10.95 6.35 -11.3 6.1 -11.8 6.0 -12.0 6.0 -12.1 5.9 -12.15 5.85 -12.2 5.8 -12.35 5.45 -12.85 5.3 -13.1 4.95 -13.7 4.8 -13.7 4.55 -14.0 4.45 -14.15 4.4 -14.15 4.4 -14.2 4.0 -14.55 3.9 -14.7 3.8 -14.8 3.75 -14.8 3.3 -15.15 3.2 -15.25 2.95 -15.4 2.8 -15.45 2.75 -15.5 M2.7 -4.2 L2.75 -2.7 2.6 -1.05 Q2.25 0.5 1.2 1.75 L0.75 2.25 -0.2 3.35 -0.9 4.15 -0.9 4.2 -1.8 5.9 -1.95 6.45 -2.0 6.4 -2.35 6.05 -2.55 5.9 -3.05 5.5 -3.05 5.4 -2.2 3.65 -2.2 3.6 -1.55 2.85 -0.5 1.7 -0.05 1.2 Q1.0 -0.05 1.35 -1.55 L1.45 -3.25 1.35 -5.45 1.85 -5.55 2.7 -4.2 M-9.45 -13.2 L-9.5 -13.2 -9.3 -13.4 -9.45 -13.2" fill="#ffff00" fill-rule="evenodd" stroke="none"/>
    <path d="M12.15 -10.55 L12.9 -8.8 13.35 -6.7 13.45 -4.7 Q13.45 -1.95 12.15 0.05 11.5 1.15 9.35 3.2 L9.65 2.25 9.65 2.15 10.15 -0.15 10.25 -0.5 10.35 -1.3 10.25 -1.3 10.3 -1.85 10.3 -2.5 10.05 -5.75 9.95 -6.0 9.95 -6.1 9.7 -7.15 9.75 -7.25 9.35 -8.35 9.25 -8.45 9.0 -9.1 8.8 -9.45 8.55 -9.95 8.5 -10.05 8.35 -10.3 8.25 -10.5 7.8 -11.25 7.85 -11.25 7.0 -12.25 6.95 -12.25 6.95 -12.3 6.6 -12.75 6.65 -12.75 5.85 -13.8 5.75 -13.8 5.55 -14.05 5.25 -14.3 5.15 -14.3 4.95 -14.5 4.5 -14.95 6.4 -14.5 7.95 -13.9 8.35 -13.75 8.55 -13.65 9.0 -13.4 9.3 -13.2 9.85 -13.05 9.95 -12.95 10.05 -12.9 10.6 -12.45 10.7 -12.45 11.25 -12.0 11.55 -11.55 11.5 -11.55 11.6 -11.4 12.15 -10.55 M13.95 -4.1 L13.9 -4.1 13.95 -4.15 13.95 -4.2 13.95 -4.1 M-2.2 -16.55 L-1.7 -16.6 -1.65 -16.6 -1.7 -16.6 -2.2 -16.45 -2.2 -16.55 M0.85 -16.75 L1.0 -16.75 1.0 -16.7 0.85 -16.75 M-6.45 -12.85 L-6.5 -12.75 -6.65 -12.5 -6.75 -12.3 -6.9 -12.1 -6.85 -12.1 -6.95 -12.0 -7.1 -11.8 -7.8 -10.7 -8.8 -8.05 -9.05 -7.05 -9.1 -6.75 -9.25 -6.1 Q-9.65 -4.25 -9.65 -2.2 -9.65 0.6 -7.55 3.4 L-7.35 3.65 Q-5.95 5.4 -4.3 6.4 L-4.25 6.45 -4.15 6.6 -4.0 6.8 -3.1 7.85 -2.9 8.05 -4.55 7.65 -6.8 6.8 -6.9 6.8 -7.9 6.55 -8.7 5.8 -8.85 5.45 -9.3 5.15 -9.5 4.95 -9.65 4.8 -9.95 4.55 -10.05 4.5 -10.1 4.45 -10.15 4.4 -10.2 4.35 -11.05 3.4 -11.35 3.1 -11.3 2.9 -11.2 2.7 -11.15 2.7 -11.25 2.55 Q-12.3 0.45 -12.35 -2.1 L-12.35 -2.15 -12.3 -2.1 -12.3 -2.5 -12.25 -3.15 -12.35 -3.2 -12.2 -4.35 -12.2 -4.5 Q-11.9 -6.55 -10.8 -8.3 L-9.9 -9.65 -9.5 -10.1 -8.4 -11.3 -8.35 -11.4 -8.2 -11.5 -8.2 -11.55 -7.95 -11.75 -7.9 -11.75 -7.65 -11.8 -6.85 -12.55 -6.45 -12.85 M3.6 1.65 Q3.8 4.5 2.4 7.25 L2.3 7.45 2.3 7.4 1.85 8.05 1.8 8.15 1.85 8.15 1.8 8.25 1.55 8.8 1.4 9.05 1.35 9.0 Q0.4 10.65 0.4 12.55 0.4 13.6 0.95 15.2 L0.65 14.75 0.7 14.7 Q-0.6 12.95 -0.9 11.25 L-0.9 11.15 -1.0 10.1 -0.95 10.15 -1.0 9.35 -0.95 9.35 -0.85 8.95 Q-0.4 6.35 2.3 3.9 3.2 2.85 3.6 1.65 M-9.15 -9.75 L-9.35 -9.7 -9.3 -9.5 -9.15 -9.75 M-14.1 -4.15 L-14.15 -4.1 -14.15 -4.2 -14.1 -4.15 M-13.55 -3.65 L-13.55 -3.7 -13.5 -3.65 -13.55 -3.65 M-2.75 8.45 L-2.75 8.15 -2.55 8.35 -2.5 8.35 -2.2 8.55 -2.75 8.45" fill="#d09a1e" fill-rule="evenodd" stroke="none"/>
    <path d="M9.35 3.2 L8.7 4.65 8.55 5.1 8.3 5.5 8.25 5.55 8.2 5.45 7.95 5.75 7.3 6.3 7.3 6.45 7.25 6.45 4.95 7.5 4.4 7.65 2.95 8.0 1.95 8.15 1.85 8.15 1.8 8.15 1.85 8.05 2.3 7.4 2.3 7.45 3.4 6.85 2.9 7.9 4.7 6.8 4.75 6.8 5.25 6.45 6.25 5.25 6.2 5.25 6.35 5.05 6.6 4.75 7.05 4.05 7.1 3.95 7.55 3.1 8.15 1.7 8.45 0.7 8.45 0.6 9.0 -1.7 9.05 -2.05 9.15 -2.8 9.1 -2.8 9.05 -2.8 9.1 -3.4 9.1 -4.0 8.85 -7.3 8.75 -7.55 8.5 -8.7 8.55 -8.8 8.15 -9.9 8.05 -10.0 7.8 -10.65 7.6 -11.0 7.35 -11.5 7.3 -11.6 7.15 -11.85 7.05 -12.05 7.0 -12.25 7.85 -11.25 7.8 -11.25 8.25 -10.5 8.35 -10.3 8.5 -10.05 8.55 -9.95 8.8 -9.45 9.0 -9.1 9.25 -8.45 9.35 -8.35 9.75 -7.25 9.7 -7.15 9.95 -6.1 9.95 -6.0 10.05 -5.75 10.3 -2.5 10.3 -1.85 10.25 -1.3 10.35 -1.3 10.25 -0.5 10.15 -0.15 9.65 2.15 9.65 2.25 9.35 3.2 M-5.75 -15.45 L-3.8 -16.2 -2.2 -16.55 -2.2 -16.45 -3.25 -16.0 -3.45 -15.85 -3.85 -15.65 -3.95 -15.5 -5.1 -14.5 -5.35 -14.3 -6.1 -13.4 -6.2 -13.25 -6.45 -12.85 -6.85 -12.55 -7.65 -11.8 -7.9 -11.75 -7.95 -11.75 -8.2 -11.55 -8.2 -11.5 -8.35 -11.4 -8.4 -11.3 -9.5 -10.1 -9.9 -9.65 -10.8 -8.3 Q-11.9 -6.55 -12.2 -4.5 L-12.2 -4.35 -12.35 -3.2 -12.25 -3.15 -12.3 -2.5 -12.3 -2.1 -12.35 -2.15 -12.35 -2.1 Q-12.3 0.45 -11.25 2.55 L-11.15 2.7 -11.2 2.7 -11.4 2.75 -12.2 1.55 -12.2 1.5 -12.45 1.0 Q-13.5 -1.1 -13.55 -3.65 L-13.5 -3.65 -13.5 -4.0 -13.45 -4.7 -13.55 -4.75 -13.4 -5.9 -13.4 -6.05 Q-12.75 -9.9 -9.6 -12.85 L-9.55 -12.95 -9.4 -13.05 -9.35 -13.1 -9.15 -13.3 -9.05 -13.3 -8.85 -13.35 -8.8 -13.4 -8.05 -14.1 -7.3 -14.65 -6.95 -14.85 Q-6.85 -14.85 -6.75 -14.95 L-6.35 -15.2 -6.15 -15.3 -5.8 -15.45 -5.75 -15.45 M1.0 -16.75 L1.85 -16.7 2.05 -16.7 5.2 -16.05 6.75 -15.45 7.15 -15.3 7.35 -15.2 Q7.55 -15.1 7.8 -14.95 L8.1 -14.75 8.65 -14.6 8.65 -14.65 8.75 -14.5 8.8 -14.5 8.85 -14.45 9.5 -14.0 9.75 -13.6 9.8 -13.55 9.85 -13.5 9.95 -13.4 10.0 -13.35 10.05 -13.3 11.2 -12.1 11.8 -11.35 11.75 -11.4 11.6 -11.5 11.55 -11.55 11.25 -12.0 10.7 -12.45 10.6 -12.45 10.05 -12.9 9.95 -12.95 9.85 -13.05 9.3 -13.2 9.0 -13.4 8.55 -13.65 8.35 -13.75 7.95 -13.9 6.4 -14.5 4.5 -14.95 4.4 -15.05 4.25 -15.2 4.15 -15.2 3.8 -15.5 3.65 -15.65 3.25 -15.85 3.05 -16.0 2.05 -16.45 1.55 -16.6 1.0 -16.7 1.0 -16.75 M-4.3 6.4 L-4.3 6.3 -3.9 6.65 -3.65 6.8 -2.75 7.3 -2.75 7.45 -2.15 7.8 -2.05 7.3 Q-1.55 4.75 1.1 2.35 L1.8 1.45 2.7 -0.8 2.8 -1.9 2.95 -1.55 3.3 -0.25 3.6 1.65 Q3.2 2.85 2.3 3.9 -0.4 6.35 -0.85 8.95 L-0.95 9.35 -1.0 9.35 -0.95 10.15 -1.0 10.1 -0.9 11.15 -0.9 11.25 Q-0.6 12.95 0.7 14.7 L0.65 14.75 -0.5 13.15 Q-1.7 11.5 -2.05 9.9 L-2.2 8.6 -2.2 8.55 -2.5 8.35 -2.55 8.35 -2.75 8.15 -2.75 8.1 -2.9 8.05 -3.1 7.85 -4.0 6.8 -4.15 6.6 -4.25 6.45 -4.3 6.4" fill="#956215" fill-rule="evenodd" stroke="none"/>
    <path d="M-12.75 -10.15 L-13.55 -8.0 -13.5 -8.0 -11.5 -11.35 -9.65 -13.4 -9.5 -13.5 Q-8.45 -14.45 -6.05 -15.55 L-6.0 -15.55 -5.35 -15.85 -5.75 -15.45 -5.8 -15.45 -6.15 -15.3 -6.35 -15.2 -6.75 -14.95 Q-6.85 -14.85 -6.95 -14.85 L-7.3 -14.65 -8.05 -14.1 -8.8 -13.4 -8.85 -13.35 -9.05 -13.3 -9.15 -13.3 -9.35 -13.1 -9.4 -13.05 -9.55 -12.95 -9.6 -12.85 Q-12.75 -9.9 -13.4 -6.05 L-13.4 -5.9 -13.55 -4.75 -13.45 -4.7 -13.5 -4.0 -13.5 -3.65 -13.55 -3.7 -13.55 -3.65 Q-13.5 -1.1 -12.45 1.0 L-12.2 1.5 -12.2 1.55 -11.4 2.75 -11.65 2.85 -12.8 1.1 -12.8 1.05 -13.05 0.55 Q-14.1 -1.6 -14.15 -4.1 L-14.1 -4.15 -14.1 -4.1 -14.1 -4.15 -14.1 -4.5 -14.05 -5.2 -14.15 -5.2 -14.0 -6.35 -14.0 -6.5 Q-13.65 -8.45 -12.75 -10.15 M8.65 -14.6 L8.65 -14.65 8.65 -14.6 M-2.75 7.3 L-2.75 7.15 -2.35 5.8 -2.4 6.1 Q-1.9 4.75 -0.45 3.4 L0.05 2.9 0.5 2.5 1.8 1.45 1.1 2.35 Q-1.55 4.75 -2.05 7.3 L-2.15 7.8 -2.75 7.45 -2.75 7.3 M3.4 6.85 L4.1 6.3 4.1 6.35 4.75 5.8 4.7 5.95 5.5 5.1 5.8 4.8 7.85 2.2 8.15 1.7 7.55 3.1 7.1 3.95 7.05 4.05 6.6 4.75 6.35 5.05 6.2 5.25 6.25 5.25 5.25 6.45 4.75 6.8 4.7 6.8 2.9 7.9 3.4 6.85 M8.45 -2.5 L8.55 -3.35 8.45 -3.3 8.5 -3.85 8.5 -4.5 8.5 -5.4 8.5 -5.6 8.25 -7.75 8.15 -8.0 7.9 -9.15 7.95 -9.25 7.55 -10.35 7.45 -10.45 7.2 -11.1 7.0 -11.45 6.75 -11.95 6.7 -12.1 6.55 -12.3 6.45 -12.5 6.1 -13.1 6.0 -13.25 6.05 -13.25 5.25 -14.3 5.55 -14.05 5.75 -13.8 5.85 -13.8 6.65 -12.75 6.6 -12.75 6.95 -12.3 6.95 -12.25 7.0 -12.25 7.05 -12.05 7.15 -11.85 7.3 -11.6 7.35 -11.5 7.6 -11.0 7.8 -10.65 8.05 -10.0 8.15 -9.9 8.55 -8.8 8.5 -8.7 8.75 -7.55 8.85 -7.3 9.1 -4.0 9.1 -3.4 9.05 -2.8 9.1 -2.8 8.45 -1.2 8.45 -2.15 8.45 -2.5 M0.65 14.75 L0.95 15.2 1.75 16.35 2.35 17.6 1.9 16.95 1.2 15.95 -1.1 12.7 Q-2.2 11.2 -2.55 9.75 L-2.75 8.45 -2.2 8.55 -2.2 8.6 -2.05 9.9 Q-1.7 11.5 -0.5 13.15 L0.65 14.75" fill="#ffcc00" fill-rule="evenodd" stroke="none"/>
    <path d="M12.3 -10.55 L12.15 -10.55 11.6 -11.4 11.5 -11.55 11.55 -11.55 11.6 -11.5 11.75 -11.4 11.8 -11.35 12.3 -10.55 M-6.9 -12.1 L-6.95 -11.95 -6.95 -12.0 -6.85 -12.1 -6.9 -12.1 M-8.35 -0.75 L-8.3 -0.85 -8.25 -0.75 -8.35 -0.75 M4.75 5.8 L5.4 5.1 5.65 4.8 5.8 4.8 5.5 5.1 4.7 5.95 4.75 5.8 M8.4 -2.15 L8.45 -2.5 8.45 -2.15 8.4 -2.15" fill="#ffff00" fill-rule="evenodd" stroke="none"/>
    <path d="M12.3 -10.55 Q13.45 -8.7 13.85 -6.5 L13.85 -6.35 13.95 -5.2 13.85 -5.2 13.9 -4.5 13.9 -4.1 13.95 -4.1 13.75 -2.15 Q13.5 -0.75 12.85 0.55 L12.6 1.05 12.6 1.1 11.45 2.85 11.05 2.7 11.2 3.1 9.85 4.5 9.8 4.55 9.1 5.15 8.4 5.7 8.3 5.55 8.25 5.55 8.3 5.5 8.55 5.1 8.7 4.65 9.35 3.2 Q11.5 1.15 12.15 0.05 13.45 -1.95 13.45 -4.7 L13.35 -6.7 12.9 -8.8 12.15 -10.55 12.3 -10.55 M-12.75 -10.15 L-12.4 -10.65 -10.2 -13.3 -10.15 -13.4 -10.0 -13.5 -9.95 -13.55 -9.75 -13.75 -9.65 -13.8 -9.45 -13.8 -8.65 -14.55 -7.9 -15.1 -7.35 -15.4 -6.95 -15.65 -6.75 -15.75 -6.4 -15.9 -4.4 -16.65 -3.45 -16.9 -1.6 -17.15 -1.4 -17.15 -0.6 -17.25 -0.35 -17.25 0.15 -17.25 0.4 -17.25 1.25 -17.15 1.45 -17.15 4.6 -16.55 6.15 -15.9 6.55 -15.75 6.75 -15.65 7.2 -15.4 7.5 -15.2 8.05 -15.05 8.65 -14.65 8.65 -14.6 8.1 -14.75 7.8 -14.95 Q7.55 -15.1 7.35 -15.2 L7.15 -15.3 6.75 -15.45 5.2 -16.05 2.05 -16.7 1.85 -16.7 1.0 -16.75 0.85 -16.75 0.4 -16.8 -0.05 -16.85 -0.15 -16.85 -0.5 -16.8 -1.65 -16.6 -1.7 -16.6 -2.2 -16.55 -3.8 -16.2 -5.75 -15.45 -5.35 -15.85 -6.0 -15.55 -6.05 -15.55 Q-8.45 -14.45 -9.5 -13.5 L-9.65 -13.4 -11.5 -11.35 -13.5 -8.0 -13.55 -8.0 -12.75 -10.15 M-6.95 -11.95 L-7.2 -11.45 -7.35 -11.1 -7.65 -10.45 -7.7 -10.35 -8.15 -9.15 -8.4 -7.8 -8.4 -7.75 -8.7 -4.5 -8.7 -3.85 -8.65 -3.3 -8.7 -3.35 -8.6 -2.15 -8.35 -0.75 -8.25 -0.75 Q-7.95 1.05 -7.1 2.65 L-6.75 3.4 -6.7 3.5 -6.65 3.55 -6.2 4.25 -5.9 4.6 -5.8 4.75 -5.8 4.8 -4.3 6.35 -4.3 6.4 Q-5.95 5.4 -7.35 3.65 L-7.55 3.4 Q-9.65 0.6 -9.65 -2.2 -9.65 -4.25 -9.25 -6.1 L-9.1 -6.75 -9.05 -7.05 -8.8 -8.05 -7.8 -10.7 -7.1 -11.8 -6.95 -12.0 -6.95 -11.95 M-2.35 5.8 L-1.55 4.2 -0.95 3.4 0.05 2.35 0.5 1.9 Q1.7 0.45 2.1 -1.3 L2.2 -3.1 2.8 -1.9 2.7 -0.8 1.8 1.45 0.5 2.5 0.05 2.9 -0.45 3.4 Q-1.9 4.75 -2.4 6.1 L-2.35 5.8 M5.65 4.8 L5.6 4.75 5.75 4.6 6.0 4.25 6.45 3.55 6.5 3.5 6.55 3.4 6.95 2.65 7.85 0.25 7.85 0.1 8.4 -2.15 8.45 -2.15 8.45 -1.2 9.1 -2.8 9.15 -2.8 9.05 -2.05 9.0 -1.7 8.45 0.6 8.45 0.7 8.15 1.7 7.85 2.2 5.8 4.8 5.65 4.8 M0.95 15.2 Q0.4 13.6 0.4 12.55 0.4 10.65 1.35 9.0 L1.4 9.05 0.95 10.55 Q0.55 13.3 1.55 16.0 L1.75 16.35 0.95 15.2" fill="#fffff7" fill-rule="evenodd" stroke="none"/>
    <path d="M12.25 -8.7 Q13.65 -5.4 12.85 -1.85 12.4 0.15 11.1 1.95 L10.7 2.0 10.3 2.4 10.25 2.9 Q8.2 4.9 5.6 6.1 L6.45 5.05 Q8.9 1.75 9.25 -2.45 L9.25 -2.5 Q9.5 -5.95 8.7 -9.35 7.9 -12.95 4.9 -15.45 6.8 -14.85 8.4 -13.6 L8.45 -13.5 Q10.85 -11.5 12.25 -8.8 L12.25 -8.7 M-8.65 -10.35 L-9.35 -8.05 Q-10.0 -5.1 -9.5 -1.75 -8.65 3.6 -4.7 6.9 -7.45 6.0 -9.4 4.0 L-10.4 3.0 Q-10.25 2.7 -10.4 2.45 -10.5 2.15 -10.8 2.0 L-11.2 1.95 Q-13.6 -1.75 -13.1 -5.9 -12.3 -11.6 -6.85 -14.65 L-5.2 -15.4 Q-7.45 -13.05 -8.6 -10.35 L-8.65 -10.35 M-0.55 4.8 Q1.55 2.65 2.45 0.05 3.2 3.45 1.6 6.95 L1.6 7.5 1.55 7.5 1.6 7.5 1.25 7.65 1.25 7.7 1.05 8.0 1.0 8.0 Q0.0 10.4 0.1 12.9 -1.2 10.5 -1.95 7.9 L-2.0 7.8 -1.9 7.45 Q-1.65 5.95 -0.65 4.9 L-0.55 4.8" fill="#52350c" fill-opacity="0.4117647" fill-rule="evenodd" stroke="none"/>
    <path d="M13.95 -5.2 L13.9 -5.2 13.85 -5.65 13.95 -5.55 13.95 -5.2 M13.9 -4.5 L13.9 -4.1 13.95 -4.2 13.95 -4.1 13.9 -3.45 Q13.05 -2.6 11.0 -1.6 L9.2 -0.75 8.15 -0.05 6.9 0.85 6.6 0.85 6.55 0.65 7.35 -0.35 8.15 -1.1 8.15 -1.25 8.4 -1.45 9.45 -2.15 9.65 -2.25 10.1 -2.5 12.45 -3.7 13.0 -4.0 13.9 -4.5 M2.3 -17.7 L3.25 -16.5 3.55 -16.2 3.55 -16.1 3.7 -15.85 3.75 -15.65 4.05 -15.35 Q3.9 -15.45 3.8 -15.5 L3.65 -15.65 3.45 -15.75 Q3.4 -15.65 3.25 -15.65 3.0 -15.65 2.4 -16.35 L2.05 -16.45 1.55 -16.6 1.0 -16.7 0.85 -16.75 0.4 -16.8 0.75 -17.1 0.8 -17.15 0.9 -17.2 0.95 -17.2 1.25 -17.15 1.45 -17.15 1.8 -17.1 1.15 -17.95 Q1.15 -18.85 2.3 -17.7 M6.4 -16.35 Q6.4 -16.7 6.85 -16.55 L7.55 -16.05 8.0 -15.2 8.55 -14.7 8.6 -14.65 8.65 -14.65 8.75 -14.5 8.8 -14.5 9.3 -13.65 9.55 -13.05 9.7 -12.55 9.75 -12.35 9.8 -11.4 Q9.8 -10.55 9.0 -8.6 L8.4 -7.05 8.35 -7.0 7.8 -6.2 Q7.55 -6.2 7.55 -6.9 L7.55 -7.65 8.15 -8.2 8.1 -8.3 8.15 -8.6 8.65 -10.55 8.7 -11.05 8.7 -11.45 8.55 -12.35 8.25 -13.2 8.2 -13.3 7.2 -14.7 6.55 -15.5 6.75 -15.5 6.4 -16.35 M-6.1 -12.85 L-6.35 -12.55 -10.05 -13.1 -10.7 -13.1 Q-11.1 -13.1 -11.1 -12.85 L-11.2 -12.8 -11.35 -12.7 -11.7 -12.45 -11.95 -12.45 -11.95 -13.1 Q-10.1 -14.3 -9.55 -14.35 L-9.5 -14.35 -9.2 -14.35 -8.5 -14.3 -8.35 -14.3 -6.55 -14.0 -5.35 -13.65 -5.8 -13.25 -5.7 -13.25 -6.1 -12.85 M-11.05 -9.0 L-11.15 -8.65 -10.75 -8.65 Q-9.5 -8.8 -8.45 -9.3 L-8.2 -9.4 -8.05 -9.45 -8.0 -9.5 -8.2 -9.1 Q-8.2 -8.45 -8.5 -7.75 L-8.5 -7.65 -8.5 -7.6 -10.5 -7.15 -11.75 -7.25 Q-12.2 -6.75 -12.8 -6.7 -13.35 -6.65 -13.65 -6.95 L-13.65 -7.0 -14.35 -6.75 -14.75 -6.4 -15.05 -5.85 -15.1 -6.2 -14.45 -8.05 -14.4 -8.1 -13.95 -8.2 -13.7 -8.65 -13.8 -8.65 -14.05 -8.9 -14.25 -9.35 Q-14.25 -10.15 -13.55 -9.85 L-13.4 -9.85 -13.25 -9.75 Q-13.1 -9.7 -13.1 -9.65 L-12.1 -8.85 -12.05 -8.9 -12.1 -9.2 -11.65 -9.55 Q-11.05 -9.6 -11.05 -9.0 M-8.8 -1.95 L-8.8 -2.75 -8.65 -2.6 -8.6 -2.15 -8.35 -0.75 -8.3 -0.85 -8.2 -0.35 -8.3 -0.15 -9.7 1.45 -10.8 2.65 -11.0 3.35 -11.2 4.0 -11.1 4.2 -11.2 4.35 -11.35 4.4 Q-11.75 4.4 -11.95 4.05 L-12.15 3.65 -11.9 2.5 -11.95 2.4 -11.75 2.15 -11.55 1.95 -11.05 1.35 -9.1 -1.05 Q-8.8 -1.6 -8.8 -1.95 M8.5 -5.35 L8.45 -5.65 8.5 -5.35 M10.35 3.3 L11.0 3.35 9.85 4.5 9.8 4.55 9.1 5.15 8.4 5.7 8.3 5.55 8.25 5.55 8.2 5.45 7.3 6.3 7.3 6.45 7.25 6.45 Q7.3 5.1 8.0 4.3 8.8 3.3 10.35 3.3 M-4.3 7.0 L-4.45 7.7 -4.55 7.65 -6.8 6.8 -6.9 6.8 -7.9 6.55 -8.4 6.15 -7.65 5.95 Q-7.1 5.95 -6.7 6.3 L-6.75 5.85 Q-6.75 5.5 -6.3 5.5 L-5.9 5.75 -5.8 5.45 -5.7 4.9 -4.3 6.35 -4.3 6.4 -4.3 6.3 -4.25 6.35 -4.3 7.0" fill="#3d2707" fill-opacity="0.67058825" fill-rule="evenodd" stroke="none"/>
    <path d="M2.3 -17.35 L2.35 -17.2 2.45 -17.1 2.5 -16.9 2.5 -16.85 2.55 -16.65 2.6 -16.6 2.95 -15.9 3.3 -15.35 3.25 -15.25 3.0 -15.15 2.2 -15.35 2.0 -15.75 1.65 -16.05 1.3 -16.1 Q1.1 -16.25 1.05 -16.5 L0.8 -16.85 -0.4 -17.95 -1.75 -18.1 Q-1.85 -18.45 -1.55 -18.65 -1.45 -18.3 0.65 -17.55 L0.8 -17.4 Q1.35 -16.85 1.7 -16.85 2.2 -16.8 2.3 -17.2 L2.3 -17.35 M-5.55 -14.15 L-5.35 -14.1 -5.15 -14.1 Q-4.65 -14.05 -4.3 -14.35 L-3.35 -15.05 -3.15 -15.25 Q-3.5 -14.35 -4.4 -13.8 -4.8 -13.5 -5.25 -13.35 L-6.4 -13.2 -6.5 -13.2 -6.85 -13.25 -8.35 -13.7 -9.65 -14.15 -10.15 -14.2 -10.55 -14.0 -10.7 -13.85 -11.05 -13.6 -11.2 -13.65 -11.1 -14.35 -10.35 -14.8 -10.25 -14.45 -9.25 -14.45 -8.95 -14.4 -8.0 -14.1 -7.05 -13.85 -6.4 -13.65 -5.8 -13.9 -5.55 -14.15 M-7.6 -10.2 Q-7.5 -10.2 -7.25 -10.35 L-6.6 -10.95 -6.25 -11.45 -6.15 -11.8 -5.75 -11.25 -5.75 -10.4 Q-5.75 -9.45 -7.05 -8.75 L-7.85 -8.45 -10.1 -8.15 -10.9 -8.25 -11.4 -8.35 -11.1 -8.8 -10.6 -8.8 -8.65 -9.05 Q-7.4 -9.35 -7.4 -9.9 L-7.4 -10.0 -7.6 -10.2 M-13.35 -8.25 L-14.0 -8.05 -14.45 -7.75 -14.6 -7.6 Q-14.9 -7.2 -14.75 -6.45 L-14.95 -5.2 -15.5 -6.2 -15.6 -6.4 -15.8 -6.85 -15.5 -7.6 -14.75 -8.45 -13.45 -8.8 -13.55 -8.55 -13.35 -8.25 M-7.75 -4.3 L-7.65 -5.1 -7.45 -4.95 -7.3 -4.75 -7.1 -4.5 Q-6.85 -4.05 -6.9 -3.7 -7.0 -3.15 -7.5 -2.5 L-7.75 -2.25 -7.75 -2.3 -7.25 -3.3 -7.4 -3.95 -7.75 -4.3 M-12.3 2.3 L-12.15 2.95 -12.0 3.1 -11.45 3.95 -11.15 4.3 -11.3 4.4 -12.45 4.75 Q-13.25 4.75 -14.0 4.05 L-13.95 4.05 Q-13.1 4.05 -12.45 2.65 L-12.3 2.3 M9.55 -12.9 L8.5 -10.35 7.55 -8.65 7.6 -8.5 7.6 -7.05 Q7.05 -7.25 6.9 -7.85 L6.9 -7.9 7.3 -8.65 7.25 -9.25 7.45 -9.9 7.6 -10.35 8.3 -12.25 8.3 -12.0 8.35 -11.9 8.75 -12.25 8.85 -12.1 Q9.3 -12.1 9.55 -12.9 M8.45 -13.2 L8.45 -14.05 8.6 -14.25 8.55 -13.8 8.55 -13.5 8.55 -13.4 8.45 -13.2 M13.5 -5.2 L14.7 -5.75 14.55 -6.85 Q14.75 -6.75 15.05 -6.6 L15.45 -5.95 Q15.45 -5.35 14.7 -4.7 14.2 -4.25 13.25 -3.8 12.4 -3.35 11.1 -2.85 L9.1 -2.0 7.65 -1.4 Q6.65 -0.85 6.65 -0.5 L6.7 0.0 Q6.75 0.1 7.15 0.2 L7.2 0.2 6.9 0.9 Q6.1 0.7 5.95 0.5 L5.9 -0.4 Q5.9 -1.45 7.95 -2.65 L9.1 -3.3 8.0 -2.6 8.0 -2.45 8.5 -2.45 9.1 -2.65 11.5 -3.55 Q12.55 -3.85 13.25 -4.3 L14.1 -5.1 14.1 -5.15 13.5 -5.2 M18.15 2.5 L18.1 2.7 17.7 3.25 17.4 3.9 Q16.75 4.95 16.75 5.35 L16.85 5.8 16.95 5.75 16.95 5.8 17.05 5.75 17.1 5.7 17.1 5.65 17.2 5.55 17.35 5.8 Q18.15 4.9 18.5 3.45 L18.55 3.35 18.85 3.0 19.0 2.85 19.45 2.35 19.5 2.3 19.55 2.3 20.55 2.05 20.6 2.05 Q21.15 2.05 21.8 2.65 L22.0 2.85 22.15 3.0 21.9 2.85 21.5 2.7 21.35 2.7 21.1 2.65 20.4 2.6 20.35 2.6 20.0 2.65 19.75 2.85 19.6 3.0 19.55 3.0 18.6 3.8 18.4 3.9 18.4 4.05 17.4 6.4 17.0 7.4 16.9 7.4 Q16.4 7.4 16.4 7.95 15.5 8.4 15.45 9.4 14.1 10.55 12.1 10.55 L10.5 10.2 10.0 9.5 9.45 9.25 9.0 9.15 Q7.75 8.1 7.5 6.7 L7.45 6.4 7.4 5.9 7.85 5.0 8.4 4.3 8.6 4.05 Q8.9 3.7 9.55 3.7 L10.25 3.8 Q9.9 3.95 9.55 4.55 L9.4 4.75 9.45 4.65 8.85 5.4 Q8.15 6.2 8.15 6.55 8.15 7.6 9.6 8.7 10.95 9.75 12.0 9.75 14.5 9.75 15.6 8.15 L16.45 6.2 Q16.6 4.5 17.9 2.75 L18.15 2.5 M-5.4 3.3 L-5.5 3.7 -5.6 3.4 -5.85 2.65 -5.8 2.65 -5.4 3.3 M-14.8 9.25 L-14.95 8.4 -15.3 6.85 -14.55 9.35 Q-13.75 11.05 -11.75 11.05 L-11.55 11.05 -10.4 11.65 -12.05 12.05 -12.3 12.05 -12.7 12.1 Q-13.9 12.1 -14.8 9.25 M-20.9 4.4 L-20.85 4.6 -20.75 5.4 -21.05 6.25 Q-21.35 6.75 -21.8 6.75 L-22.0 6.75 Q-22.35 6.65 -22.35 6.0 L-22.35 5.85 -22.1 6.15 -22.1 6.1 -22.0 5.75 Q-21.75 5.05 -20.9 4.4" fill="#37480d" fill-rule="evenodd" stroke="none"/>
    <path d="M2.0 -17.8 L2.3 -17.35 2.3 -17.2 Q2.2 -16.8 1.7 -16.85 1.35 -16.85 0.8 -17.4 L0.65 -17.55 1.35 -17.3 Q1.6 -17.3 1.85 -17.65 L2.0 -17.8 M-5.55 -14.15 L-5.8 -13.9 -6.4 -13.65 -7.05 -13.85 -8.0 -14.1 -8.95 -14.4 -7.25 -14.05 -5.75 -14.25 Q-5.65 -14.15 -5.55 -14.15 M-7.4 -10.0 L-7.4 -9.9 Q-7.4 -9.35 -8.65 -9.05 L-10.6 -8.8 -11.1 -8.8 -11.0 -8.95 -10.75 -9.6 -10.5 -9.6 -10.7 -8.95 -10.4 -9.0 -10.25 -9.0 -10.2 -8.9 -9.9 -8.85 Q-9.65 -8.85 -8.85 -9.2 L-8.8 -9.25 -8.75 -9.25 Q-7.55 -9.45 -7.4 -10.0 M-15.8 -6.85 L-15.9 -7.35 -15.85 -7.6 Q-15.8 -8.5 -15.1 -8.95 L-15.1 -8.9 -14.9 -8.75 -14.6 -8.65 -13.6 -8.8 -13.35 -8.85 -13.45 -8.8 -14.75 -8.45 -15.5 -7.6 -15.8 -6.85 M-9.65 -2.2 L-8.45 -3.3 -8.4 -3.4 Q-8.2 -3.2 -8.3 -2.7 L-8.45 -2.3 Q-8.45 -2.55 -8.85 -2.3 L-9.35 -1.8 Q-9.35 -2.15 -9.65 -2.2 M-9.5 -1.1 L-9.35 -1.4 -9.3 -1.65 -9.2 -1.6 -8.95 -1.65 -9.5 -1.1 M-11.6 0.35 L-11.5 0.25 -11.45 0.3 -11.6 0.35 M7.2 -16.5 L6.9 -16.65 7.0 -16.65 7.2 -16.5 M9.1 -3.3 L9.2 -3.35 9.5 -3.5 9.95 -3.75 12.85 -4.9 13.25 -5.1 13.5 -5.2 14.1 -5.15 14.1 -5.1 13.25 -4.3 Q12.55 -3.85 11.5 -3.55 L9.1 -2.65 8.5 -2.45 8.0 -2.45 8.0 -2.6 9.1 -3.3 M12.15 -4.05 L12.1 -4.15 Q11.15 -3.85 10.8 -3.55 L10.85 -3.5 12.15 -4.05 M21.1 2.65 L21.35 2.7 21.5 2.7 21.9 2.85 22.15 3.0 22.0 2.85 21.8 2.65 Q21.15 2.05 20.6 2.05 L20.55 2.05 19.55 2.3 19.5 2.3 19.45 2.35 19.0 2.85 18.85 3.0 18.55 3.35 18.5 3.45 Q18.15 4.9 17.35 5.8 L17.2 5.55 17.1 5.65 17.1 5.7 17.05 5.75 16.95 5.8 16.95 5.75 16.85 5.8 16.75 5.35 Q16.75 4.95 17.4 3.9 L17.7 3.25 18.1 2.7 18.15 2.5 Q18.45 1.35 20.2 1.3 L20.6 1.3 21.4 1.35 Q23.55 1.65 23.55 3.35 L23.5 3.7 Q23.4 5.8 21.05 5.8 20.25 5.8 20.0 5.4 L19.85 4.9 Q19.95 4.8 20.0 4.8 L20.0 4.65 Q20.0 3.9 20.9 3.9 L21.15 4.05 21.4 4.15 22.05 4.25 22.2 3.7 Q22.2 3.2 21.55 2.85 L21.4 2.75 21.1 2.65 M10.25 3.8 L9.55 3.7 Q8.9 3.7 8.6 4.05 L8.4 4.3 7.85 5.0 7.4 5.9 Q7.4 4.45 8.15 3.55 8.8 2.8 9.9 2.6 L9.9 2.65 9.5 2.8 Q9.15 2.95 9.1 3.2 L11.0 3.5 13.0 3.8 14.15 3.7 Q13.6 4.15 12.75 4.15 L11.1 3.9 10.65 3.85 10.25 3.8 M18.4 4.05 L18.4 3.9 18.6 3.8 18.35 4.3 18.3 4.3 18.4 4.05 M19.75 2.85 L20.0 2.65 20.35 2.6 Q20.05 2.65 19.75 2.85 M20.95 4.65 L21.1 4.45 20.8 4.1 Q20.5 4.05 20.5 4.35 20.5 4.7 20.75 4.7 L20.95 4.65 M13.75 1.25 Q13.45 1.3 13.45 1.55 L13.45 1.45 13.65 1.1 13.75 1.25 M-5.65 4.75 L-5.55 4.2 -5.5 4.1 -5.45 3.95 -5.4 3.8 -5.4 3.55 -5.4 3.3 -5.8 2.65 Q-4.15 3.0 -4.15 5.35 L-4.2 6.3 -4.4 7.45 -4.45 7.65 -4.9 8.9 -5.05 8.9 -5.1 8.9 -4.95 8.6 Q-4.7 8.0 -4.7 6.6 L-4.8 5.4 Q-4.95 4.75 -5.55 4.75 L-5.65 4.75 M-5.5 9.95 L-5.95 10.55 Q-8.1 13.45 -11.55 13.45 -13.35 13.45 -14.1 11.85 L-14.8 9.25 Q-13.9 12.1 -12.7 12.1 L-12.3 12.05 -12.35 12.25 Q-12.35 12.7 -10.95 12.7 -9.8 12.7 -8.4 11.95 -7.1 11.25 -6.35 10.4 L-5.65 9.65 -5.6 9.8 -5.5 9.95 M-16.0 5.2 L-16.05 5.1 Q-16.65 4.0 -17.55 3.6 L-17.55 3.55 Q-17.55 3.15 -18.05 3.2 -18.35 3.2 -18.45 3.35 L-18.85 3.3 -19.75 3.5 -20.15 3.75 -20.8 4.25 -20.9 4.4 Q-21.75 5.05 -22.0 5.75 L-22.1 6.1 -22.1 6.15 -22.35 5.85 -22.35 5.75 -22.3 5.3 -22.0 4.15 -21.9 4.0 -21.65 4.05 -20.25 3.3 -19.65 3.0 Q-19.1 3.0 -18.7 2.65 L-18.15 2.6 Q-17.5 2.6 -16.7 3.25 -15.95 3.9 -15.45 3.9 L-15.3 3.9 Q-14.55 5.0 -13.95 6.7 L-14.3 6.7 Q-14.9 6.7 -15.35 6.1 L-16.0 5.2" fill="#526c13" fill-rule="evenodd" stroke="none"/>
    <path d="M-13.7 -9.45 L-13.45 -9.9 -13.0 -9.55 -13.7 -9.45 M9.4 4.75 L9.55 4.55 Q9.9 3.95 10.25 3.8 L10.65 3.85 9.95 4.5 9.15 5.25 9.4 4.75" fill="#d09a1e" fill-rule="evenodd" stroke="none"/>
    <path d="M-8.4 -3.4 L-7.8 -4.25 -7.75 -4.25 -7.75 -4.3 -7.4 -3.95 -7.25 -3.3 -7.75 -2.3 -7.75 -2.25 -7.8 -2.2 -7.85 -2.2 Q-8.1 -1.95 -8.5 -1.65 L-8.75 -1.5 -9.55 -0.9 Q-11.0 0.05 -11.65 0.85 L-11.9 1.3 -12.0 1.45 -12.3 2.05 -12.3 2.3 -12.45 2.65 Q-13.1 4.05 -13.95 4.05 L-14.0 4.05 -14.3 3.75 -14.3 3.7 -14.4 3.7 -14.7 2.95 -14.6 2.6 -14.55 2.7 -14.45 2.8 Q-13.6 2.8 -11.85 0.75 L-10.5 -0.35 -9.65 -1.0 -9.7 -1.0 -9.5 -1.1 -8.95 -1.65 -8.7 -1.85 -8.45 -2.2 -8.45 -2.3 -8.3 -2.7 Q-8.2 -3.2 -8.4 -3.4 M9.6 -14.2 L9.6 -14.05 9.55 -13.15 9.55 -13.1 9.55 -12.9 Q9.3 -12.1 8.85 -12.1 L8.75 -12.25 8.35 -11.9 8.3 -12.0 8.3 -12.25 8.4 -12.8 8.45 -13.2 8.55 -13.4 8.55 -13.5 8.55 -13.8 8.6 -14.25 8.45 -14.05 8.4 -14.3 8.3 -14.6 8.2 -14.95 8.2 -15.0 8.1 -15.25 8.05 -15.35 Q7.75 -16.1 7.25 -16.45 L7.4 -16.4 8.3 -15.65 8.65 -14.8 Q9.0 -14.1 9.4 -14.1 L9.6 -14.2 M16.45 6.2 L15.6 8.15 Q14.5 9.75 12.0 9.75 10.95 9.75 9.6 8.7 8.15 7.6 8.15 6.55 8.15 6.2 8.85 5.4 L9.45 4.65 9.4 4.75 9.15 5.25 Q8.9 5.7 8.9 6.1 8.9 7.8 9.85 8.45 L10.0 8.5 9.95 8.7 Q9.95 9.05 10.4 9.05 10.7 9.05 10.8 8.85 L11.1 8.9 11.1 8.95 Q11.25 9.45 11.8 9.45 12.3 9.45 12.75 9.05 15.0 8.9 16.45 6.2 M-15.3 6.85 L-15.6 6.0 -15.65 5.8 -16.0 5.2 -15.35 6.1 Q-14.9 6.7 -14.3 6.7 L-13.95 6.7 -13.9 6.85 -12.3 10.2 -11.55 11.05 -11.75 11.05 Q-13.75 11.05 -14.55 9.35 L-15.3 6.85" fill="#42570f" fill-rule="evenodd" stroke="none"/>
    <path d="M0.15 -18.95 L0.35 -18.9 0.8 -18.45 0.65 -18.3 0.35 -18.25 -0.05 -18.5 -0.05 -18.65 0.15 -18.95 M1.05 -17.8 Q0.7 -17.8 0.7 -18.1 L1.05 -18.1 1.4 -17.95 1.05 -17.8 M-7.0 -14.45 L-8.1 -14.35 -7.95 -14.3 -8.6 -14.5 -8.65 -14.75 -8.1 -15.0 -7.35 -14.75 -7.0 -14.45 M-8.8 -9.25 L-8.85 -9.2 Q-9.65 -8.85 -9.9 -8.85 L-10.2 -8.9 -10.25 -9.0 -10.4 -9.05 -9.2 -9.6 -8.0 -9.8 -8.8 -9.25 M-9.3 -1.65 L-9.35 -1.8 -8.85 -2.3 Q-8.45 -2.55 -8.45 -2.3 L-8.45 -2.2 -8.7 -1.85 -8.95 -1.65 -9.2 -1.6 -9.3 -1.65 M-11.1 -0.6 L-9.75 -1.45 -9.7 -1.35 -10.95 -0.35 -12.5 1.0 -12.65 1.0 -12.55 0.65 -11.1 -0.6 M8.2 -16.4 Q8.55 -16.35 8.9 -15.8 L9.3 -15.05 9.25 -14.95 9.05 -14.95 8.3 -16.2 8.2 -16.3 8.2 -16.4 M12.15 -4.05 L10.85 -3.5 10.8 -3.55 Q11.15 -3.85 12.1 -4.15 L12.15 -4.05 M20.95 4.65 L20.75 4.7 Q20.5 4.7 20.5 4.35 20.5 4.05 20.8 4.1 L21.1 4.45 20.95 4.65 M13.35 3.15 Q13.6 3.0 13.75 3.0 L13.85 2.8 Q13.9 2.6 14.1 2.55 L14.1 2.8 Q14.1 3.5 12.45 3.5 L11.7 3.4 11.1 3.25 Q11.1 3.1 11.45 3.1 L11.85 3.2 12.4 3.2 13.35 3.15" fill="#a4d926" fill-rule="evenodd" stroke="none"/>
    <path d="M-18.75 0.7 L-18.75 0.65 -18.75 0.7" fill="#000000" fill-rule="evenodd" stroke="none"/>
    <path d="M-1.55 -18.65 L-1.35 -18.7 -1.25 -18.75 -1.25 -18.8 -1.15 -18.85 -0.05 -19.0 0.0 -19.0 0.15 -18.95 -0.05 -18.65 -0.05 -18.5 0.35 -18.25 0.65 -18.3 0.8 -18.45 0.35 -18.9 1.6 -18.1 2.0 -17.8 1.85 -17.65 Q1.6 -17.3 1.35 -17.3 L0.65 -17.55 Q-1.45 -18.3 -1.55 -18.65 M1.05 -17.8 L1.4 -17.95 1.05 -18.1 0.7 -18.1 Q0.7 -17.8 1.05 -17.8 M-8.95 -14.4 L-9.25 -14.45 -10.25 -14.45 -10.35 -14.8 -9.1 -15.35 -8.95 -15.35 -8.85 -15.35 -8.35 -15.25 -8.15 -15.2 -6.9 -14.7 -5.75 -14.25 -7.25 -14.05 -8.95 -14.4 M-7.0 -14.45 L-7.35 -14.75 -8.1 -15.0 -8.65 -14.75 -8.6 -14.5 -7.95 -14.3 -8.1 -14.35 -7.0 -14.45 M-7.6 -10.2 L-7.4 -10.0 Q-7.55 -9.45 -8.75 -9.25 L-8.8 -9.25 -8.0 -9.8 -9.2 -9.6 -10.4 -9.05 -10.25 -9.0 -10.4 -9.0 -10.7 -8.95 -10.5 -9.6 -10.4 -9.6 -8.0 -10.0 -7.7 -10.15 -7.6 -10.2 M-15.1 -8.95 L-14.85 -9.1 -14.1 -9.4 -13.7 -9.45 -13.0 -9.55 -13.0 -9.45 -13.25 -9.05 -13.35 -8.85 -13.6 -8.8 -14.6 -8.65 -14.9 -8.75 -15.1 -8.9 -15.1 -8.95 M-14.6 2.6 L-14.4 2.3 -14.1 1.75 -14.0 1.55 -14.0 1.5 -13.85 1.4 -13.8 1.35 -13.7 1.2 -13.45 0.95 -12.85 0.4 -11.25 -1.0 -10.65 -1.5 -9.65 -2.2 Q-9.35 -2.15 -9.35 -1.8 L-9.3 -1.65 -9.35 -1.4 -9.5 -1.1 -9.7 -1.0 -9.65 -1.0 -10.5 -0.35 -11.85 0.75 Q-13.6 2.8 -14.45 2.8 L-14.55 2.7 -14.6 2.6 M-11.6 0.35 L-11.45 0.3 -11.5 0.25 -11.6 0.35 M-11.1 -0.6 L-12.55 0.65 -12.65 1.0 -12.5 1.0 -10.95 -0.35 -9.7 -1.35 -9.75 -1.45 -11.1 -0.6 M7.2 -16.5 L7.0 -16.65 7.45 -16.85 7.55 -16.85 Q8.85 -16.75 9.35 -15.4 L9.4 -15.35 9.55 -14.8 9.55 -14.6 9.6 -14.25 9.6 -14.2 9.4 -14.1 Q9.0 -14.1 8.65 -14.8 L8.3 -15.65 7.4 -16.4 7.25 -16.45 7.25 -16.5 7.2 -16.5 M8.2 -16.4 L8.2 -16.3 8.3 -16.2 9.05 -14.95 9.25 -14.95 9.3 -15.05 8.9 -15.8 Q8.55 -16.35 8.2 -16.4 M14.35 1.75 L14.15 2.2 14.25 2.75 14.55 3.2 14.15 3.7 13.0 3.8 11.0 3.5 9.1 3.2 Q9.15 2.95 9.5 2.8 L9.9 2.65 9.9 2.6 10.5 2.6 11.6 2.8 11.65 2.8 12.65 3.0 13.25 2.8 13.65 2.35 13.65 2.2 13.45 1.55 Q13.45 1.3 13.75 1.25 13.9 1.3 14.05 1.45 L14.35 1.75 M13.35 3.15 L12.4 3.2 11.85 3.2 11.45 3.1 Q11.1 3.1 11.1 3.25 L11.7 3.4 12.45 3.5 Q14.1 3.5 14.1 2.8 L14.1 2.55 Q13.9 2.6 13.85 2.8 L13.75 3.0 Q13.6 3.0 13.35 3.15 M-21.9 4.0 L-21.45 3.25 -21.35 3.15 -20.9 2.7 -19.65 3.0 -20.25 3.3 -21.65 4.05 -21.9 4.0 M-18.7 2.65 L-18.2 2.05 -18.2 2.1 -18.1 1.95 -17.7 2.05 Q-17.7 2.5 -17.2 2.55 L-17.2 2.6 Q-17.2 2.95 -16.4 2.95 L-16.2 2.95 -15.3 3.9 -15.45 3.9 Q-15.95 3.9 -16.7 3.25 -17.5 2.6 -18.15 2.6 L-18.7 2.65 M-10.4 11.65 L-10.2 11.6 -9.7 11.45 -8.5 10.85 -8.4 10.7 -7.85 10.75 -7.35 10.6 -7.1 10.35 -6.9 9.9 -7.1 9.35 -6.8 8.75 -6.7 8.45 -6.6 8.25 -6.5 8.25 -5.8 8.1 Q-5.2 7.75 -5.2 6.65 -5.2 6.2 -5.35 5.7 L-5.4 5.6 -5.75 5.0 -5.65 4.75 -5.55 4.75 Q-4.95 4.75 -4.8 5.4 L-4.7 6.6 Q-4.7 8.0 -4.95 8.6 L-5.1 8.9 Q-5.75 8.8 -5.75 9.45 L-5.65 9.65 -6.35 10.4 Q-7.1 11.25 -8.4 11.95 -9.8 12.7 -10.95 12.7 -12.35 12.7 -12.35 12.25 L-12.3 12.05 -12.05 12.05 -10.4 11.65" fill="#73981b" fill-rule="evenodd" stroke="none"/>
    <path d="M17.2 9.05 L17.25 9.1 17.2 9.1 17.2 9.05" fill="#070501" fill-rule="evenodd" stroke="none"/>
    <path d="M0.7 -15.2 L1.05 -15.0 1.55 -14.5 1.55 -14.35 1.4 -14.05 1.35 -13.95 1.1 -13.95 0.45 -14.95 Q0.45 -15.25 0.7 -15.2 M-11.75 -8.8 Q-12.0 -8.55 -12.3 -8.55 L-12.6 -8.65 -12.65 -8.8 -12.4 -9.1 -12.65 -9.55 -12.65 -9.75 -12.35 -9.85 -11.6 -9.25 -11.75 -8.8 M5.75 -8.45 L5.95 -8.75 6.7 -8.8 6.75 -8.5 Q6.75 -8.05 6.45 -8.05 6.0 -8.05 5.85 -8.25 L5.75 -8.45 M15.1 2.45 L14.9 2.65 14.55 2.45 14.55 2.15 15.0 2.15 15.1 2.45 M17.25 9.1 L17.4 9.05 17.75 8.95 Q18.25 8.95 18.25 9.25 18.25 10.45 17.45 10.45 17.15 10.45 16.85 9.85 L16.65 9.15 Q16.65 8.7 17.0 8.7 17.35 8.7 17.2 9.05 L17.2 9.1 17.25 9.1 M13.05 7.95 L12.75 8.3 12.0 8.5 11.7 8.5 11.7 8.4 11.6 8.3 11.55 8.05 Q11.55 7.6 11.9 7.55 L13.0 7.75 13.05 7.95 M9.55 9.95 L9.2 10.3 9.0 10.2 9.0 10.05 Q9.0 9.75 9.3 9.75 L9.55 9.95 M8.5 11.25 L8.5 10.95 Q8.5 10.4 9.15 10.35 9.75 10.35 9.75 10.65 L9.5 11.1 Q9.15 11.4 8.8 11.4 L8.5 11.25 M-7.45 6.1 Q-7.45 5.25 -6.15 6.25 L-5.95 6.1 Q-5.7 6.1 -5.7 6.45 L-5.9 7.15 -6.55 7.6 -6.85 7.5 -6.85 7.3 -6.75 6.9 -7.45 6.1" fill="#ed6a19" fill-rule="evenodd" stroke="none"/>
    <path d="M2.2 -15.35 L2.2 -15.1 Q2.05 -13.9 1.7 -13.45 1.35 -13.15 0.9 -13.25 0.4 -13.3 0.3 -13.6 L0.25 -14.05 0.35 -14.55 Q-0.3 -14.9 -0.3 -15.0 -0.3 -15.25 0.25 -15.5 L1.05 -15.9 1.3 -16.1 1.65 -16.05 2.0 -15.75 2.2 -15.35 M-11.1 -8.8 L-11.4 -8.35 Q-11.85 -7.85 -12.4 -7.85 -13.0 -7.85 -13.35 -8.15 L-13.35 -8.25 -13.55 -8.55 -13.45 -8.8 -13.35 -8.85 -13.25 -9.05 -13.0 -9.45 -13.0 -9.55 -13.45 -9.9 -13.5 -9.95 -14.0 -10.7 Q-14.0 -11.6 -12.9 -10.95 L-12.75 -10.85 -11.75 -10.0 -11.65 -10.0 -11.75 -10.35 -11.25 -10.6 Q-10.7 -10.6 -10.7 -10.0 L-10.75 -9.6 -11.0 -8.95 -11.1 -8.8 M0.7 -15.2 Q0.45 -15.25 0.45 -14.95 L1.1 -13.95 1.35 -13.95 1.4 -14.05 1.55 -14.35 1.55 -14.5 1.05 -15.0 0.7 -15.2 M-11.75 -8.8 L-11.6 -9.25 -12.35 -9.85 -12.65 -9.75 -12.65 -9.55 -12.4 -9.1 -12.65 -8.8 -12.6 -8.65 -12.3 -8.55 Q-12.0 -8.55 -11.75 -8.8 M6.9 -7.85 Q6.5 -7.1 5.95 -7.1 5.7 -7.1 5.6 -7.25 L5.45 -7.45 5.65 -7.8 Q4.7 -7.75 4.75 -8.2 L5.15 -8.65 5.45 -8.75 6.25 -8.9 5.7 -9.4 5.6 -9.7 Q5.6 -10.35 6.55 -9.8 L7.25 -9.25 7.3 -8.65 6.9 -7.9 6.9 -7.85 M5.75 -8.45 L5.85 -8.25 Q6.0 -8.05 6.45 -8.05 6.75 -8.05 6.75 -8.5 L6.7 -8.8 5.95 -8.75 5.75 -8.45 M9.0 9.15 L9.45 9.25 10.0 9.5 10.5 10.2 10.55 10.55 10.45 11.75 Q10.2 12.4 9.55 12.4 L9.2 12.35 9.2 11.55 8.6 12.55 Q8.2 13.3 7.55 13.3 7.05 13.3 7.05 12.5 7.05 11.85 7.3 11.3 L8.15 10.1 7.4 10.2 Q7.25 9.55 8.55 9.15 L8.8 9.15 9.0 9.15 M15.45 9.4 Q15.5 8.4 16.4 7.95 16.4 7.4 16.9 7.4 L17.0 7.4 17.25 7.5 17.35 7.45 17.9 7.65 18.15 8.0 17.9 8.45 17.75 8.45 19.15 8.85 Q19.5 9.05 19.5 9.65 19.5 10.35 18.95 10.9 18.25 11.5 17.2 11.5 16.3 11.5 15.8 10.75 15.45 10.25 15.45 9.5 L15.45 9.4 M15.1 2.45 L15.0 2.15 14.55 2.15 14.55 2.45 14.9 2.65 15.1 2.45 M14.35 1.75 L14.55 1.6 14.65 1.55 15.05 1.4 Q16.0 1.2 16.0 1.6 L15.8 2.05 15.4 2.4 15.6 2.8 Q15.6 3.2 15.0 3.2 L14.7 3.2 14.55 3.2 14.25 2.75 14.15 2.2 14.35 1.75 M10.0 8.5 Q10.1 8.2 10.5 8.2 10.75 8.2 10.8 8.7 L10.8 8.85 Q10.7 9.05 10.4 9.05 9.95 9.05 9.95 8.7 L10.0 8.5 M11.1 8.9 L11.0 8.5 11.1 7.85 11.9 7.05 Q12.45 6.3 13.05 6.7 13.5 7.1 13.5 7.65 L13.1 8.6 12.75 9.05 Q12.3 9.45 11.8 9.45 11.25 9.45 11.1 8.95 L11.1 8.9 M17.2 9.05 Q17.35 8.7 17.0 8.7 16.65 8.7 16.65 9.15 L16.85 9.85 Q17.15 10.45 17.45 10.45 18.25 10.45 18.25 9.25 18.25 8.95 17.75 8.95 L17.4 9.05 17.25 9.1 17.2 9.05 M13.05 7.95 L13.0 7.75 11.9 7.55 Q11.55 7.6 11.55 8.05 L11.6 8.3 11.7 8.4 11.7 8.5 12.0 8.5 12.75 8.3 13.05 7.95 M9.55 9.95 L9.3 9.75 Q9.0 9.75 9.0 10.05 L9.0 10.2 9.2 10.3 9.55 9.95 M8.5 11.25 L8.8 11.4 Q9.15 11.4 9.5 11.1 L9.75 10.65 Q9.75 10.35 9.15 10.35 8.5 10.4 8.5 10.95 L8.5 11.25 M-4.9 8.9 Q-4.5 9.05 -4.5 9.55 -4.5 10.15 -4.95 10.15 L-5.5 9.95 -5.6 9.8 -5.65 9.65 -5.75 9.45 Q-5.75 8.8 -5.1 8.9 L-5.05 8.9 -4.9 8.9 M-17.55 3.6 Q-17.55 4.05 -18.0 4.05 -18.3 4.05 -18.45 3.85 L-18.55 3.6 -18.45 3.35 Q-18.35 3.2 -18.05 3.2 -17.55 3.15 -17.55 3.55 L-17.55 3.6 M-17.7 2.05 L-17.5 1.4 Q-17.2 0.85 -16.65 0.85 -16.05 0.85 -16.1 1.5 L-16.3 2.0 Q-15.8 2.0 -15.8 2.5 -15.8 2.85 -16.2 2.95 L-16.4 2.95 Q-17.2 2.95 -17.2 2.6 L-17.2 2.55 Q-17.7 2.5 -17.7 2.05 M-8.4 10.7 L-8.7 10.55 -8.8 10.3 -8.75 10.1 Q-8.7 9.9 -8.25 9.9 L-8.3 9.5 Q-8.3 8.9 -7.75 9.05 L-7.6 9.1 -7.55 9.1 -7.1 9.35 -6.9 9.9 -7.1 10.35 -7.35 10.6 -7.85 10.75 -8.4 10.7 M-6.6 8.25 Q-7.3 8.2 -7.4 7.85 -7.55 7.3 -7.65 7.25 -8.55 6.8 -8.55 6.1 L-8.45 5.65 Q-8.2 5.2 -7.45 5.2 -6.95 5.2 -6.55 5.6 L-6.65 5.15 Q-6.65 4.8 -6.15 4.8 L-5.9 4.85 -5.75 5.0 -5.4 5.6 -5.35 5.7 Q-5.2 6.2 -5.2 6.65 -5.2 7.75 -5.8 8.1 L-6.5 8.25 -6.6 8.25 M-7.45 6.1 L-6.75 6.9 -6.85 7.3 -6.85 7.5 -6.55 7.6 -5.9 7.15 -5.7 6.45 Q-5.7 6.1 -5.95 6.1 L-6.15 6.25 Q-7.45 5.25 -7.45 6.1" fill="#f2e49d" fill-rule="evenodd" stroke="none"/>
    <path d="M-7.4 -15.9 L-7.25 -16.35 Q-7.25 -16.95 -7.9 -16.8 -8.6 -16.65 -8.6 -15.95 L-8.55 -15.75 -8.0 -15.6 Q-7.6 -15.6 -7.4 -15.9 M-6.35 -16.45 Q-6.35 -15.8 -7.45 -15.3 L-8.05 -15.0 -8.45 -15.0 -8.85 -14.8 -8.95 -14.6 -9.15 -14.1 Q-9.4 -13.4 -9.95 -13.4 -10.3 -13.4 -10.45 -13.8 L-10.55 -14.0 -10.6 -13.95 -11.0 -13.4 -11.35 -12.9 -12.0 -12.45 Q-12.45 -12.45 -12.55 -12.75 L-12.55 -13.05 Q-12.7 -12.9 -13.0 -12.9 -13.45 -12.9 -13.55 -13.25 L-13.55 -13.6 -13.45 -14.3 -13.9 -14.75 Q-13.9 -15.5 -12.4 -16.05 L-12.1 -16.75 Q-12.0 -17.25 -11.1 -17.2 -10.15 -18.4 -9.05 -18.4 -8.4 -18.4 -8.1 -18.0 L-7.9 -17.4 Q-7.85 -17.1 -7.05 -17.0 -6.35 -16.95 -6.35 -16.45 M-10.25 -17.25 L-9.8 -17.15 -9.8 -17.2 -9.3 -17.4 Q-8.45 -17.5 -8.45 -17.7 -8.45 -18.5 -9.45 -18.25 -10.55 -18.0 -10.55 -17.25 L-10.25 -17.25 M-13.25 -14.85 L-13.25 -14.9 -13.3 -14.85 -13.25 -14.85 M-12.9 -15.6 L-13.15 -15.1 -13.0 -14.65 -13.15 -14.1 -13.15 -13.85 Q-13.1 -13.65 -12.75 -13.65 L-12.25 -13.75 -12.1 -13.65 -11.8 -13.55 -11.35 -13.95 -11.2 -14.25 -11.1 -14.25 -10.4 -14.4 -10.3 -14.25 -9.95 -14.15 Q-9.35 -14.15 -9.35 -14.9 L-9.55 -15.25 Q-10.25 -14.6 -11.4 -14.6 L-12.0 -14.7 -12.05 -14.65 -12.05 -14.7 Q-12.4 -14.85 -12.4 -15.2 L-12.2 -15.7 -12.9 -15.6 M-8.9 -16.65 Q-8.9 -17.1 -9.3 -17.1 L-9.5 -17.0 Q-9.25 -16.85 -9.25 -16.5 L-9.05 -16.2 -9.05 -16.1 Q-8.9 -16.35 -8.9 -16.65 M-9.65 -16.25 L-9.9 -16.4 -10.25 -16.65 -10.7 -16.3 Q-10.85 -15.95 -11.05 -15.95 L-11.2 -16.0 -11.25 -16.0 -11.7 -15.25 -11.0 -15.25 -9.8 -16.05 -9.65 -16.25 M-11.25 -16.75 L-11.25 -17.05 -11.55 -17.05 -11.85 -16.65 -11.7 -16.3 -11.6 -16.35 -11.55 -16.35 -11.3 -16.55 -11.25 -16.75 M-17.05 0.75 Q-16.35 0.55 -16.2 -0.6 -16.05 -1.4 -17.0 -1.4 -17.55 -1.4 -17.95 -0.75 L-17.95 -0.7 -17.6 -0.75 Q-17.0 -0.75 -17.05 0.4 L-17.05 0.75 M-15.95 0.85 Q-16.6 1.5 -16.75 2.3 -16.55 2.5 -16.5 3.15 L-16.75 3.9 Q-17.15 4.55 -17.75 4.55 -18.3 4.55 -18.65 4.1 L-18.85 4.55 Q-19.3 5.15 -19.95 5.15 -20.85 5.15 -20.95 4.2 L-20.9 3.2 -21.25 2.6 -21.1 1.95 -20.35 1.25 -20.75 0.1 -20.5 -0.6 Q-20.1 -1.2 -19.4 -1.2 -18.75 -1.2 -18.45 -0.6 -17.7 -1.9 -16.45 -1.7 -15.25 -1.5 -15.25 -0.45 -15.25 0.15 -15.95 0.85 M6.6 12.35 Q6.6 11.15 7.4 10.35 L7.1 9.95 7.1 9.65 Q7.1 9.15 7.8 8.85 7.8 8.1 8.05 7.95 8.65 7.25 9.4 7.8 10.1 8.3 9.95 8.95 11.2 8.6 11.8 10.4 11.8 11.5 10.75 11.6 10.95 12.65 9.6 12.65 L9.15 12.6 Q8.4 13.55 7.6 13.55 6.85 13.55 6.65 12.95 L6.6 12.35 M10.0 9.55 L9.95 9.5 9.9 9.5 9.9 9.55 9.8 9.8 9.65 9.9 9.35 9.55 9.1 9.0 9.35 9.9 8.95 10.25 8.55 10.55 8.5 10.7 Q8.5 11.1 9.05 11.15 L9.3 11.2 9.55 10.75 Q9.55 10.4 9.9 10.25 L9.95 10.25 10.25 9.85 10.0 9.55 M10.8 9.9 L10.7 10.25 10.35 10.8 10.55 10.8 Q11.35 10.8 11.35 10.3 11.35 9.45 10.7 9.35 L10.8 9.9 M9.4 8.55 L9.55 8.35 Q9.55 7.85 8.85 7.8 8.15 7.75 8.15 8.25 L8.25 8.65 8.5 8.95 8.5 8.9 Q8.5 8.45 9.1 8.45 L9.4 8.55 M7.65 9.55 L7.85 10.0 7.95 10.15 8.6 9.6 8.5 9.05 8.3 9.0 Q7.65 9.0 7.65 9.55 M7.9 10.65 Q7.3 10.8 7.3 11.6 7.3 12.55 8.15 12.55 8.65 12.55 8.9 12.1 L9.0 11.95 Q8.6 11.9 8.55 11.7 L8.1 11.25 7.9 10.65 M10.5 11.55 Q10.5 11.15 10.15 11.1 L9.55 11.85 Q9.6 12.05 9.95 12.05 10.5 12.05 10.5 11.55 M-5.65 5.2 Q-4.85 5.45 -4.65 6.0 L-4.7 6.45 -4.55 6.9 Q-4.1 7.25 -4.1 7.75 -4.1 8.1 -4.5 8.5 -5.05 9.1 -6.25 9.1 L-7.3 8.8 Q-7.65 8.45 -8.1 8.45 -8.95 8.45 -9.3 7.85 L-9.45 7.2 -9.15 6.15 -9.3 5.6 Q-9.3 4.35 -7.9 4.35 L-7.1 4.6 -6.75 4.5 Q-6.25 4.5 -6.05 4.8 L-5.65 5.2 M-6.45 5.7 L-6.4 5.7 Q-6.05 5.7 -6.05 5.3 -6.05 5.0 -6.4 5.0 L-6.75 5.1 -6.75 5.3 -6.7 5.5 -6.75 5.45 Q-6.95 5.25 -7.3 5.2 L-7.25 4.95 Q-7.25 4.55 -7.9 4.6 -8.6 4.65 -8.6 5.1 L-8.5 5.4 -8.05 5.6 -7.8 5.6 -7.8 5.65 -7.65 6.3 -7.75 6.6 Q-7.9 6.35 -8.25 6.3 -8.9 6.25 -8.9 7.15 L-8.85 7.5 Q-8.75 7.85 -8.3 7.85 -7.75 7.85 -7.6 7.4 L-7.0 7.55 -6.85 7.55 -6.9 7.85 -6.9 8.1 Q-6.75 8.35 -6.2 8.35 L-5.15 8.1 Q-4.65 7.9 -4.65 7.6 -4.55 7.1 -5.45 7.1 L-5.65 7.1 Q-5.5 7.0 -5.5 6.6 L-5.5 6.55 -5.3 6.55 Q-5.05 6.55 -5.0 6.0 -5.0 5.55 -5.45 5.55 -5.95 5.55 -5.95 6.0 L-5.9 6.2 -6.35 5.85 -6.45 5.7 M-20.3 0.25 L-20.2 1.0 Q-20.15 0.45 -19.45 0.45 -19.1 0.45 -18.95 0.6 L-18.55 -0.35 -18.65 -0.55 -19.25 -0.75 Q-20.3 -0.75 -20.3 0.25 M-17.9 0.6 L-18.15 0.9 -18.05 0.95 -17.75 1.4 -17.55 1.15 -17.8 0.8 -17.75 0.7 -17.7 0.3 -17.9 0.6 M-17.6 2.05 L-17.7 2.05 Q-17.8 3.15 -18.75 3.3 L-18.75 3.4 Q-18.75 3.7 -18.25 3.7 -17.55 3.7 -17.2 2.55 -17.2 2.05 -17.6 2.05 M-18.4 1.45 L-18.35 1.5 -18.4 1.45 M-19.05 2.75 L-18.5 2.35 -18.3 2.0 -18.9 1.85 -19.4 2.05 -19.3 2.3 -19.35 2.6 -19.4 2.65 -19.1 2.75 -19.05 2.75 M-19.7 1.15 L-19.3 1.4 -19.1 1.6 -19.1 1.65 -18.9 1.45 -19.1 1.25 -19.3 1.1 -19.6 0.95 -19.7 1.1 -19.7 1.15 M-19.8 2.05 L-19.7 1.95 -20.15 1.5 Q-20.7 1.65 -20.7 1.95 L-20.35 2.25 -19.8 2.05 M-19.95 2.6 Q-20.65 2.75 -20.65 3.85 -20.85 4.45 -19.95 4.45 -19.5 4.45 -19.2 3.9 L-18.9 3.3 -19.05 3.3 Q-19.95 3.3 -19.95 2.65 L-19.95 2.6" fill="#f2e49d" fill-rule="evenodd" stroke="none"/>
    <path d="M-7.4 -15.9 Q-7.6 -15.6 -8.0 -15.6 L-8.55 -15.75 -8.6 -15.95 Q-8.6 -16.65 -7.9 -16.8 -7.25 -16.95 -7.25 -16.35 L-7.4 -15.9 M-10.25 -17.25 L-10.55 -17.25 Q-10.55 -18.0 -9.45 -18.25 -8.45 -18.5 -8.45 -17.7 -8.45 -17.5 -9.3 -17.4 L-9.8 -17.2 -9.8 -17.15 -10.25 -17.25 M-12.9 -15.6 L-12.2 -15.7 -12.4 -15.2 Q-12.4 -14.85 -12.05 -14.7 L-12.05 -14.65 -12.0 -14.7 -11.4 -14.6 Q-10.25 -14.6 -9.55 -15.25 L-9.35 -14.9 Q-9.35 -14.15 -9.95 -14.15 L-10.3 -14.25 -10.4 -14.4 -11.1 -14.25 -11.2 -14.25 -11.35 -13.95 -11.8 -13.55 -12.1 -13.65 -12.25 -13.75 -12.75 -13.65 Q-13.1 -13.65 -13.15 -13.85 L-13.15 -14.1 -13.0 -14.65 -13.15 -15.1 -12.9 -15.6 M-17.05 0.75 L-17.05 0.4 Q-17.0 -0.75 -17.6 -0.75 L-17.95 -0.7 -17.95 -0.75 Q-17.55 -1.4 -17.0 -1.4 -16.05 -1.4 -16.2 -0.6 -16.35 0.55 -17.05 0.75 M-11.25 -16.75 L-11.3 -16.55 -11.55 -16.35 -11.6 -16.35 -11.7 -16.3 -11.85 -16.65 -11.55 -17.05 -11.25 -17.05 -11.25 -16.75 M10.0 9.55 L10.25 9.85 9.95 10.25 9.9 10.15 9.85 9.95 Q9.85 9.65 10.0 9.55 M9.05 11.15 Q8.5 11.1 8.5 10.7 L8.55 10.55 Q8.95 10.65 9.05 11.15 M9.4 8.55 L9.1 8.45 Q8.5 8.45 8.5 8.9 L8.5 8.95 8.25 8.65 8.15 8.25 Q8.15 7.75 8.85 7.8 9.55 7.85 9.55 8.35 L9.4 8.55 M10.8 9.9 L10.7 9.35 Q11.35 9.45 11.35 10.3 11.35 10.8 10.55 10.8 L10.35 10.8 10.7 10.25 10.8 9.9 M7.65 9.55 Q7.65 9.0 8.3 9.0 L8.5 9.05 8.6 9.6 7.95 10.15 7.85 10.0 7.65 9.55 M7.9 10.65 L8.1 11.25 8.55 11.7 Q8.6 11.9 9.0 11.95 L8.9 12.1 Q8.65 12.55 8.15 12.55 7.3 12.55 7.3 11.6 7.3 10.8 7.9 10.65 M10.5 11.55 Q10.5 12.05 9.95 12.05 9.6 12.05 9.55 11.85 L10.15 11.1 Q10.5 11.15 10.5 11.55 M-6.7 5.5 L-6.75 5.3 -6.75 5.1 -6.4 5.0 Q-6.05 5.0 -6.05 5.3 -6.05 5.7 -6.4 5.7 L-6.45 5.7 -6.7 5.5 M-5.9 6.2 L-5.95 6.0 Q-5.95 5.55 -5.45 5.55 -5.0 5.55 -5.0 6.0 -5.05 6.55 -5.3 6.55 L-5.5 6.55 -5.85 6.3 -5.9 6.2 M-5.65 7.1 L-5.45 7.1 Q-4.55 7.1 -4.65 7.6 -4.65 7.9 -5.15 8.1 L-6.2 8.35 Q-6.75 8.35 -6.9 8.1 L-6.9 7.85 -6.85 7.55 Q-6.6 7.15 -5.65 7.1 M-7.6 7.4 Q-7.75 7.85 -8.3 7.85 -8.75 7.85 -8.85 7.5 L-8.9 7.15 Q-8.9 6.25 -8.25 6.3 -7.9 6.35 -7.75 6.6 -7.6 6.75 -7.6 7.1 L-7.6 7.4 M-7.8 5.6 L-8.05 5.6 -8.5 5.4 -8.6 5.1 Q-8.6 4.65 -7.9 4.6 -7.25 4.55 -7.25 4.95 L-7.3 5.2 -7.45 5.4 -7.8 5.6 M-20.3 0.25 Q-20.3 -0.75 -19.25 -0.75 L-18.65 -0.55 -18.55 -0.35 -18.95 0.6 Q-19.1 0.45 -19.45 0.45 -20.15 0.45 -20.2 1.0 L-20.3 0.25 M-17.9 0.6 L-17.7 0.3 -17.75 0.7 -17.9 0.6 M-17.6 2.05 Q-17.2 2.05 -17.2 2.55 -17.55 3.7 -18.25 3.7 -18.75 3.7 -18.75 3.4 L-18.75 3.3 Q-17.8 3.15 -17.7 2.05 L-17.6 2.05 M-19.35 2.6 L-19.05 2.75 -19.1 2.75 -19.4 2.65 -19.35 2.6 M-19.3 1.1 L-19.7 1.15 -19.7 1.1 -19.6 0.95 -19.3 1.1 M-19.8 2.05 L-20.35 2.25 -20.7 1.95 Q-20.7 1.65 -20.15 1.5 L-19.7 1.95 -19.8 2.05 M-19.95 2.6 L-19.95 2.65 Q-19.95 3.3 -19.05 3.3 L-18.9 3.3 -19.2 3.9 Q-19.5 4.45 -19.95 4.45 -20.85 4.45 -20.65 3.85 -20.65 2.75 -19.95 2.6" fill="#fefcf8" fill-rule="evenodd" stroke="none"/>
    <path d="M-9.3 -17.1 Q-8.9 -17.1 -8.9 -16.65 -8.9 -16.0 -9.65 -15.55 -10.1 -15.25 -10.7 -15.15 L-11.35 -14.95 -11.7 -15.05 -11.85 -15.2 -11.85 -15.35 -11.75 -15.6 Q-11.65 -15.95 -11.0 -16.1 -11.0 -16.85 -10.45 -16.85 L-9.85 -16.6 -9.6 -16.9 -9.3 -17.1 M10.55 10.0 Q10.55 10.5 10.05 10.55 L10.05 10.6 Q10.05 11.5 9.3 11.5 L8.55 11.05 8.25 10.55 Q8.25 10.3 8.55 10.05 8.75 9.9 9.0 9.85 L8.85 9.45 9.05 8.95 Q9.3 8.9 9.6 9.55 L9.95 9.45 Q10.6 9.45 10.55 10.0 M-6.75 5.45 L-6.35 5.85 -5.7 6.25 -5.5 6.6 Q-5.5 7.1 -5.8 7.15 L-6.5 7.35 Q-6.75 7.55 -7.0 7.55 -7.85 7.55 -7.85 6.8 L-7.65 6.3 -7.8 5.65 -7.8 5.4 Q-7.75 5.2 -7.4 5.2 -7.0 5.2 -6.75 5.45 M-6.1 7.95 L-6.4 7.8 -6.4 7.6 -6.05 7.3 Q-5.75 7.25 -5.75 7.6 -5.75 7.95 -6.1 7.95 M-18.45 2.85 L-19.25 3.15 -19.7 2.7 Q-19.7 1.95 -18.9 1.85 -18.2 1.75 -18.2 2.35 L-18.45 2.85 M-19.25 1.65 Q-19.8 1.65 -19.9 1.1 -19.9 0.65 -19.4 0.7 -18.9 0.75 -18.9 1.15 -18.9 1.65 -19.25 1.65 M-18.55 1.1 Q-18.55 0.4 -17.9 -0.2 -17.25 -0.75 -17.25 0.25 -17.5 1.55 -18.15 1.55 -18.55 1.55 -18.55 1.1" fill="#ed6a19" fill-rule="evenodd" stroke="none"/>
  </g>
</svg>
