<?xml version="1.0" encoding="UTF-8" standalone="no"?>
<svg xmlns:xlink="http://www.w3.org/1999/xlink" height="248.45px" width="149.55px" xmlns="http://www.w3.org/2000/svg">
  <g transform="matrix(1.0, 0.0, 0.0, 1.0, 13.45, 142.8)">
    <path d="M79.0 13.85 Q82.7 10.75 87.0 8.75 92.55 6.3 100.6 7.95 107.3 9.4 110.35 11.95 113.85 14.2 126.45 20.75 131.6 23.7 134.2 31.25 136.1 36.65 136.1 41.9 136.1 45.55 134.5 52.0 132.25 60.95 128.15 68.35 119.05 84.8 103.45 88.95 L108.3 85.9 Q118.85 78.55 123.6 69.0 L123.3 69.0 Q120.1 72.9 116.0 75.4 113.1 77.2 108.5 78.95 115.3 72.95 119.25 67.1 124.75 58.95 124.05 52.15 L124.4 52.3 Q125.3 53.5 125.3 55.95 L125.25 60.2 128.7 51.3 Q129.6 48.4 129.6 42.35 L129.5 36.9 127.2 30.5 Q126.85 33.55 125.45 36.85 124.55 39.05 123.45 40.5 124.0 32.65 115.6 24.8 106.85 16.7 97.4 17.7 L99.0 17.3 102.65 16.65 Q99.65 15.15 97.6 14.3 93.8 12.7 91.15 12.7 L85.35 13.1 79.65 13.85 79.0 13.85 M118.9 44.95 Q118.9 49.65 116.4 55.5 114.05 61.1 111.75 61.75 112.8 55.7 114.75 50.4 116.1 46.7 116.1 41.95 116.1 38.35 114.45 32.55 L114.55 32.45 Q116.0 33.9 117.15 36.7 118.9 41.05 118.9 44.95" fill="#666b6b" fill-rule="evenodd" stroke="none"/>
    <path d="M79.0 13.85 L79.65 13.85 85.35 13.1 91.15 12.7 Q93.8 12.7 97.6 14.3 99.65 15.15 102.65 16.65 L99.0 17.3 97.4 17.7 Q106.85 16.7 115.6 24.8 124.0 32.65 123.45 40.5 124.55 39.05 125.45 36.85 126.85 33.55 127.2 30.5 L129.5 36.9 129.6 42.35 Q129.6 48.4 128.7 51.3 L125.25 60.2 125.3 55.95 Q125.3 53.5 124.4 52.3 L124.05 52.15 Q124.75 58.95 119.25 67.1 115.3 72.95 108.5 78.95 113.1 77.2 116.0 75.4 120.1 72.9 123.3 69.0 L123.6 69.0 Q118.85 78.55 108.3 85.9 L103.45 88.95 Q98.15 90.3 92.15 90.3 76.25 90.3 67.9 74.1 62.0 62.65 62.0 50.6 62.0 40.25 67.75 28.65 72.4 19.45 79.0 13.85 M118.9 44.95 Q118.9 41.05 117.15 36.7 116.0 33.9 114.55 32.45 L114.45 32.55 Q116.1 38.35 116.1 41.95 116.1 46.7 114.75 50.4 112.8 55.7 111.75 61.75 114.05 61.1 116.4 55.5 118.9 49.65 118.9 44.95" fill="#5a5e5e" fill-rule="evenodd" stroke="none"/>
    <path d="M123.15 -133.2 Q125.3 -128.1 125.3 -122.65 125.3 -110.95 114.9 -87.3 102.85 -62.05 99.5 -53.75 97.05 -47.5 95.25 -37.7 93.3 -27.25 93.3 -18.9 L92.95 4.35 92.6 18.95 92.7 27.4 Q92.9 41.35 93.65 71.0 L93.8 77.05 92.25 86.35 91.2 91.55 Q88.1 105.65 81.85 105.65 77.55 105.65 74.0 101.4 70.75 97.45 70.35 92.55 L71.0 92.45 59.2 92.45 59.3 92.9 Q50.0 92.35 33.3 92.5 L11.9 93.15 Q8.5 94.75 7.7 98.5 6.85 102.6 3.2 104.4 -7.25 109.45 -5.9 93.65 -5.7 92.0 -10.45 84.75 -12.9 80.9 -13.35 75.75 L-10.35 79.25 Q-7.0 82.35 -4.2 83.15 4.65 85.9 11.15 86.75 L27.25 87.55 39.35 87.1 55.55 85.15 Q64.7 84.35 71.4 78.6 L73.65 73.25 77.35 62.2 Q79.2 56.3 80.2 51.2 81.25 46.35 82.05 39.6 L85.25 16.85 Q86.9 4.6 87.5 -3.9 L87.7 -6.35 91.4 -39.7 Q94.1 -60.8 97.9 -72.0 L110.8 -99.6 Q121.7 -124.15 123.15 -133.2 M51.75 -139.95 Q54.8 -139.6 56.35 -137.25 57.8 -135.25 57.8 -132.1 57.8 -127.8 55.25 -121.25 52.55 -114.4 47.0 -105.1 41.35 -95.65 39.6 -91.9 36.2 -84.9 36.2 -80.2 36.2 -77.15 39.95 -74.2 L35.45 -76.3 Q30.25 -79.25 30.25 -83.9 30.25 -88.25 33.65 -93.65 35.7 -96.85 41.15 -104.1 52.05 -119.3 52.05 -135.15 L51.75 -139.95" fill="#7f8585" fill-rule="evenodd" stroke="none"/>
    <path d="M39.95 -74.2 L42.45 -72.5 Q43.5 -71.9 44.5 -71.4 49.15 -69.05 53.2 -69.05 55.95 -69.05 61.3 -80.55 L73.05 -105.9 Q91.7 -142.8 113.1 -142.8 118.1 -142.8 121.8 -135.9 L123.15 -133.2 Q121.7 -124.15 110.8 -99.6 L97.9 -72.0 Q94.1 -60.8 91.4 -39.7 L87.7 -6.35 87.5 -3.9 Q86.9 4.6 85.25 16.85 L82.05 39.6 Q81.25 46.35 80.2 51.2 79.2 56.3 77.35 62.2 L73.65 73.25 71.4 78.6 Q64.7 84.35 55.55 85.15 L39.35 87.1 27.25 87.55 11.15 86.75 Q4.65 85.9 -4.2 83.15 -7.0 82.35 -10.35 79.25 L-13.35 75.75 Q-13.8 70.95 -12.5 65.0 -9.85 52.55 -7.8 40.3 -5.7 28.0 -3.95 6.9 L-5.15 -24.35 -5.6 -36.7 Q-5.6 -54.75 -2.25 -72.1 1.15 -89.65 6.95 -101.0 14.0 -114.95 26.75 -127.0 40.5 -140.05 50.4 -140.05 L51.75 -139.95 52.05 -135.15 Q52.05 -119.3 41.15 -104.1 35.7 -96.85 33.65 -93.65 30.25 -88.25 30.25 -83.9 30.25 -79.25 35.45 -76.3 L39.95 -74.2 M66.95 -76.45 L67.0 -76.15 67.25 -76.55 66.95 -76.45 M39.1 -72.1 L37.45 -72.9 35.55 -73.55 Q33.6 -73.55 31.9 -72.75 30.6 -72.1 29.85 -71.15 30.05 -70.15 31.4 -69.5 32.6 -68.85 33.8 -69.1 L34.15 -69.55 34.15 -69.2 33.8 -69.1 Q31.9 -66.6 30.25 -63.2 L30.25 -61.3 Q30.65 -61.3 30.65 -60.9 33.25 -61.6 34.3 -62.95 35.3 -64.1 36.2 -67.2 L36.0 -65.7 35.8 -64.25 Q35.8 -61.7 37.4 -61.7 39.45 -61.7 40.1 -65.4 40.8 -69.0 43.35 -68.8 L39.35 -72.0 39.1 -72.1 M31.85 -17.9 L31.65 -17.85 31.95 -17.5 31.85 -17.9" fill="#929898" fill-rule="evenodd" stroke="none"/>
    <path d="M39.1 -72.1 L39.35 -72.0 43.35 -68.8 Q40.8 -69.0 40.1 -65.4 39.45 -61.7 37.4 -61.7 35.8 -61.7 35.8 -64.25 L36.0 -65.7 36.2 -67.2 Q35.3 -64.1 34.3 -62.95 33.25 -61.6 30.65 -60.9 30.65 -61.3 30.25 -61.3 L30.25 -63.2 Q31.9 -66.6 33.8 -69.1 L34.15 -69.2 34.15 -69.55 33.8 -69.1 Q32.6 -68.85 31.4 -69.5 30.05 -70.15 29.85 -71.15 30.6 -72.1 31.9 -72.75 33.6 -73.55 35.55 -73.55 L37.45 -72.9 39.1 -72.1" fill="#a1a8a8" fill-rule="evenodd" stroke="none"/>
    <path d="M36.1 -129.2 L37.9 -126.6 38.8 -125.25 Q37.15 -123.75 35.45 -121.55 29.35 -112.9 26.7 -109.8 L26.35 -109.35 Q23.3 -105.6 20.6 -101.3 L24.1 -109.5 24.85 -111.05 22.6 -113.55 22.25 -113.95 23.75 -115.9 Q30.9 -124.75 36.1 -129.2" fill="#5a5e5e" fill-rule="evenodd" stroke="none"/>
    <path d="M38.8 -125.25 L37.9 -126.6 36.1 -129.2 Q41.4 -133.85 44.7 -133.85 46.65 -133.85 47.35 -132.0 47.8 -130.8 47.8 -128.55 L47.4 -125.9 47.0 -127.45 Q46.55 -128.55 45.05 -128.55 42.35 -128.55 38.8 -125.25" fill="#505454" fill-rule="evenodd" stroke="none"/>
    <path d="M22.25 -113.95 L22.6 -113.55 24.85 -111.05 24.1 -109.5 20.6 -101.3 19.0 -98.65 Q15.7 -93.1 13.95 -88.55 12.75 -89.75 12.4 -89.75 11.85 -89.75 11.05 -88.0 L9.55 -85.25 9.55 -87.1 Q9.75 -94.35 14.05 -102.15 16.6 -106.75 22.25 -113.95" fill="#6b7070" fill-rule="evenodd" stroke="none"/>
    <path d="M20.6 -101.3 Q23.3 -105.6 26.35 -109.35 L26.7 -109.8 Q29.35 -112.9 35.45 -121.55 37.15 -123.75 38.8 -125.25 42.35 -128.55 45.05 -128.55 46.55 -128.55 47.0 -127.45 L47.4 -125.9 Q46.45 -121.75 42.65 -114.75 L39.1 -108.7 36.6 -106.9 Q31.05 -103.4 25.85 -99.05 18.05 -92.5 15.35 -87.05 L15.0 -87.45 13.95 -88.55 Q15.7 -93.1 19.0 -98.65 L20.6 -101.3" fill="#c28787" fill-rule="evenodd" stroke="none"/>
    <path d="M15.35 -87.05 Q18.05 -92.5 25.85 -99.05 31.05 -103.4 36.6 -106.9 L39.1 -108.7 35.2 -102.4 23.95 -83.95 24.75 -88.15 24.75 -90.55 Q23.85 -89.95 22.0 -85.25 L19.9 -90.8 Q19.05 -90.05 18.4 -87.75 L17.6 -84.7 Q17.25 -84.9 15.35 -87.05" fill="#b37c7c" fill-rule="evenodd" stroke="none"/>
    <path d="M97.0 -129.1 Q103.2 -133.8 107.15 -133.8 112.85 -133.8 114.0 -126.0 L112.35 -126.95 108.05 -127.6 Q104.75 -127.6 101.35 -125.8 L97.0 -129.1" fill="#505454" fill-rule="evenodd" stroke="none"/>
    <path d="M114.0 -126.0 L114.25 -121.5 Q114.25 -119.25 113.7 -116.55 L109.65 -113.75 Q104.95 -111.05 102.55 -109.45 95.45 -104.55 76.3 -82.65 L75.55 -82.65 Q74.4 -82.6 73.2 -81.95 73.75 -85.25 76.3 -91.45 L77.45 -94.05 Q80.45 -100.8 84.3 -107.15 L85.05 -108.3 Q93.45 -121.75 101.35 -125.8 104.75 -127.6 108.05 -127.6 L112.35 -126.95 114.0 -126.0" fill="#c28787" fill-rule="evenodd" stroke="none"/>
    <path d="M78.15 -109.7 Q81.6 -115.1 90.05 -123.2 93.8 -126.8 97.0 -129.1 L101.35 -125.8 Q93.45 -121.75 85.05 -108.3 L84.3 -107.15 Q80.45 -100.8 77.45 -94.05 77.8 -96.45 78.65 -99.25 79.75 -102.65 82.65 -108.9 L81.75 -109.1 78.15 -109.7" fill="#5a5e5e" fill-rule="evenodd" stroke="none"/>
    <path d="M73.2 -81.95 Q71.55 -81.15 69.8 -79.45 68.05 -77.85 67.25 -76.55 L67.0 -76.1 66.8 -77.7 Q66.8 -89.3 77.4 -108.45 L78.15 -109.7 81.75 -109.1 82.65 -108.9 Q79.75 -102.65 78.65 -99.25 77.8 -96.45 77.45 -94.05 L76.3 -91.45 Q73.75 -85.25 73.2 -81.95" fill="#6b7070" fill-rule="evenodd" stroke="none"/>
    <path d="M109.05 -104.2 Q106.5 -99.05 102.75 -93.0 97.85 -85.1 85.8 -68.7 L85.7 -68.8 86.6 -72.15 87.55 -75.7 84.75 -75.7 82.25 -75.1 79.7 -74.55 78.55 -74.55 Q78.55 -74.9 79.25 -76.4 L79.25 -78.25 77.5 -77.6 75.45 -76.7 75.3 -76.85 75.45 -77.5 75.5 -77.95 Q82.15 -82.1 91.2 -85.4 96.35 -87.3 99.75 -92.55 L108.0 -102.9 109.05 -104.2" fill="#a37171" fill-rule="evenodd" stroke="none"/>
    <path d="M113.7 -116.55 Q112.5 -111.2 109.05 -104.2 L108.0 -102.9 99.75 -92.55 Q96.35 -87.3 91.2 -85.4 82.15 -82.1 75.5 -77.95 75.85 -79.55 76.7 -81.25 L76.7 -82.65 76.3 -82.65 Q95.45 -104.55 102.55 -109.45 104.95 -111.05 109.65 -113.75 L113.7 -116.55" fill="#b37c7c" fill-rule="evenodd" stroke="none"/>
    <path d="M22.3 41.15 L24.0 39.7 Q26.8 36.7 29.75 35.05 34.2 32.45 39.85 32.45 49.05 32.45 53.05 37.2 56.8 41.6 56.8 51.55 56.8 61.65 51.15 71.15 44.1 82.85 32.3 82.85 25.8 82.85 19.2 77.1 11.15 70.3 11.15 60.2 11.15 52.85 17.9 45.35 19.95 43.05 22.3 41.15" fill="#a1a8a8" fill-rule="evenodd" stroke="none"/>
    <path d="M21.9 -18.1 L22.25 -17.65 23.5 -16.5 23.75 -16.3 23.75 -16.25 23.45 -12.95 21.0 -14.55 Q18.6 -16.55 18.6 -18.25 L18.7 -18.5 18.8 -18.55 21.9 -18.1 M30.95 -15.3 L31.4 -15.5 33.3 -16.35 34.9 -15.3 34.7 -10.65 Q34.4 -7.25 36.75 -6.95 L37.0 -7.6 37.15 -8.4 38.2 -7.45 39.05 -7.2 Q40.6 -7.2 40.45 -7.85 L41.25 -7.2 Q42.3 -8.4 42.45 -11.6 42.6 -13.55 42.4 -15.5 L42.8 -15.65 45.85 -17.55 46.05 -17.75 45.8 -17.75 45.8 -17.85 47.75 -18.7 45.25 -16.2 Q43.25 -14.3 42.9 -12.35 L41.25 -2.85 33.25 -2.85 32.85 -8.65 32.2 -8.65 Q32.2 -6.6 31.4 -3.7 L27.8 -3.95 24.35 -4.3 24.35 -6.8 25.6 -6.55 25.9 -7.9 26.45 -9.25 26.85 -8.0 27.0 -6.8 28.3 -6.8 30.75 -6.95 30.95 -15.3" fill="#818787" fill-rule="evenodd" stroke="none"/>
    <path d="M21.9 -18.1 Q21.3 -19.0 21.15 -20.05 25.8 -17.1 28.0 -17.1 L30.05 -17.45 30.9 -17.65 31.7 -17.8 32.2 -18.05 31.85 -17.9 31.65 -17.85 Q28.65 -21.1 27.4 -26.5 L27.5 -26.55 27.55 -27.15 30.3 -26.6 Q31.3 -23.9 33.05 -21.65 36.75 -17.05 42.1 -17.15 L42.75 -17.15 45.8 -17.75 45.85 -17.55 42.8 -15.65 42.4 -15.5 41.75 -15.25 41.75 -14.75 Q37.95 -13.8 34.9 -15.3 L33.3 -16.35 31.4 -15.5 30.95 -15.3 28.45 -15.05 Q25.7 -15.05 23.8 -16.3 L23.75 -16.3 23.5 -16.5 22.25 -17.65 21.9 -18.1" fill="#5a5e5e" fill-rule="evenodd" stroke="none"/>
    <path d="M23.8 -16.3 Q25.7 -15.05 28.45 -15.05 L30.95 -15.3 30.75 -6.95 28.3 -6.8 27.0 -6.8 26.85 -8.0 26.45 -9.25 25.9 -7.9 25.6 -6.55 24.35 -6.8 23.8 -6.85 Q22.95 -6.95 22.95 -7.95 22.95 -9.4 23.25 -11.7 L23.45 -12.95 23.75 -16.25 23.8 -16.3 M34.9 -15.3 Q37.95 -13.8 41.75 -14.75 L41.75 -15.25 42.4 -15.5 Q42.6 -13.55 42.45 -11.6 42.3 -8.4 41.25 -7.2 L40.45 -7.85 Q40.6 -7.2 39.05 -7.2 L38.2 -7.45 37.15 -8.4 37.0 -7.6 36.75 -6.95 Q34.4 -7.25 34.7 -10.65 L34.9 -15.3" fill="#d1c188" fill-rule="evenodd" stroke="none"/>
    <path d="M20.95 -38.05 L20.85 -40.85 20.85 -42.65 20.85 -42.8 21.95 -43.5 29.1 -41.65 28.45 -41.65 22.35 -41.1 Q21.15 -40.45 20.95 -38.05" fill="#ffd1d1" fill-rule="evenodd" stroke="none"/>
    <path d="M29.1 -41.65 L44.55 -37.75 42.0 -32.6 Q38.1 -34.75 34.3 -36.15 30.75 -37.45 24.35 -39.2 L22.95 -39.2 22.95 -35.1 23.8 -31.15 24.65 -28.75 Q23.6 -29.6 22.95 -30.75 21.75 -32.75 21.25 -35.65 L20.95 -38.05 Q21.15 -40.45 22.35 -41.1 L28.45 -41.65 29.1 -41.65" fill="#ffb2b2" fill-rule="evenodd" stroke="none"/>
    <path d="M42.0 -32.6 L40.35 -29.65 Q39.25 -28.4 37.45 -27.65 L37.3 -28.65 Q36.65 -30.95 35.15 -30.95 34.55 -30.95 34.5 -30.55 L34.5 -29.25 34.55 -27.55 34.75 -26.85 31.25 -26.6 Q29.1 -26.6 27.5 -27.15 L27.35 -28.35 Q27.1 -30.0 25.65 -30.55 L25.05 -28.4 24.65 -28.75 23.8 -31.15 22.95 -35.1 22.95 -39.2 24.35 -39.2 Q30.75 -37.45 34.3 -36.15 38.1 -34.75 42.0 -32.6" fill="#f0a8a8" fill-rule="evenodd" stroke="none"/>
    <path d="M37.45 -27.65 L34.75 -26.85 34.55 -27.55 34.5 -29.25 34.5 -30.55 Q34.55 -30.95 35.15 -30.95 36.65 -30.95 37.3 -28.65 L37.45 -27.65 M27.5 -27.15 L27.25 -27.25 Q26.05 -27.7 25.05 -28.4 L25.65 -30.55 Q27.1 -30.0 27.35 -28.35 L27.5 -27.15" fill="#bf8585" fill-rule="evenodd" stroke="none"/>
    <path d="M50.2 48.15 L51.05 49.55 Q53.4 53.15 56.65 53.6 L56.65 53.7 56.65 54.25 Q56.65 62.55 56.95 64.65 57.75 71.3 61.1 72.7 65.75 71.05 67.05 62.0 L66.2 71.3 Q64.4 80.0 60.05 80.0 56.1 80.0 55.15 72.7 54.55 68.05 55.1 63.9 55.9 58.15 53.05 55.8 51.3 54.25 50.45 52.3 49.9 50.8 49.9 49.05 49.9 48.55 50.2 48.15" fill="#818787" fill-rule="evenodd" stroke="none"/>
    <path d="M49.6 46.65 Q49.9 46.8 50.2 47.05 L50.7 47.5 51.05 47.8 53.0 49.65 Q55.05 51.35 56.7 51.55 56.8 45.2 57.5 42.2 L58.15 55.3 Q59.05 65.75 61.75 65.75 63.6 65.75 67.5 55.05 L67.75 54.25 68.3 52.5 67.6 57.65 67.2 61.1 Q67.05 61.55 67.05 62.0 65.75 71.05 61.1 72.7 57.75 71.3 56.95 64.65 56.65 62.55 56.65 54.25 L56.65 53.7 56.65 53.6 Q53.4 53.15 51.05 49.55 L50.2 48.15 49.2 46.3 49.6 46.65" fill="#5a5e5e" fill-rule="evenodd" stroke="none"/>
    <path d="M67.75 54.25 L67.5 55.05 Q63.6 65.75 61.75 65.75 59.05 65.75 58.15 55.3 L57.5 42.2 Q56.8 45.2 56.7 51.55 55.05 51.35 53.0 49.65 L51.05 47.8 50.7 47.5 50.2 47.05 Q49.9 46.8 49.6 46.65 49.75 45.75 51.05 44.6 L51.2 44.45 Q51.75 44.05 52.55 43.75 L53.6 43.45 Q54.45 42.15 55.45 41.15 56.55 40.0 59.6 40.0 61.3 40.0 63.2 41.1 65.15 42.25 65.4 43.45 L66.0 44.9 66.55 46.3 67.0 48.55 67.25 49.9 67.6 51.05 67.75 53.7 67.75 54.25" fill="#929898" fill-rule="evenodd" stroke="none"/>
    <path d="M5.6 32.0 L5.5 32.0 Q5.5 29.85 7.15 28.4 8.75 27.0 10.9 27.0 L14.3 27.45 17.4 28.05 18.85 28.55 21.2 28.8 24.2 29.0 25.9 29.1 26.95 29.05 27.95 28.65 25.7 32.8 24.65 34.7 24.6 34.75 24.35 34.9 24.0 35.1 23.1 35.5 19.7 37.0 18.85 37.0 18.55 34.45 Q18.2 32.4 18.2 29.85 L16.9 41.25 Q14.65 55.2 11.0 55.2 7.1 55.2 6.2 44.1 5.95 32.4 5.6 31.4 L5.6 32.0" fill="#929898" fill-rule="evenodd" stroke="none"/>
    <path d="M24.65 34.7 L25.75 33.8 24.1 35.95 22.4 37.85 Q20.95 39.2 18.85 39.65 18.7 39.7 18.85 39.7 L17.8 51.9 Q17.3 54.8 14.9 58.1 12.45 61.65 10.35 61.65 7.85 61.65 6.35 56.2 L5.7 53.55 5.5 52.1 Q4.95 48.55 4.95 44.35 4.95 41.9 5.3 36.6 L5.6 32.0 5.6 31.4 Q5.95 32.4 6.2 44.1 7.1 55.2 11.0 55.2 14.65 55.2 16.9 41.25 L18.2 29.85 Q18.2 32.4 18.55 34.45 L18.85 37.0 19.7 37.0 23.1 35.5 24.0 35.1 24.35 34.9 24.6 34.75 24.65 34.7" fill="#5a5e5e" fill-rule="evenodd" stroke="none"/>
    <path d="M24.1 35.95 Q23.45 38.2 22.6 39.25 L21.6 40.75 22.0 47.9 Q22.0 53.3 19.55 59.75 16.2 68.0 11.1 68.0 7.95 68.0 6.55 63.1 5.6 59.7 5.6 54.95 L5.7 53.55 6.35 56.2 Q7.85 61.65 10.35 61.65 12.45 61.65 14.9 58.1 17.3 54.8 17.8 51.9 L18.85 39.7 Q18.7 39.7 18.85 39.65 20.95 39.2 22.4 37.85 L24.1 35.95" fill="#818787" fill-rule="evenodd" stroke="none"/>
    <path d="M4.45 -78.1 Q6.35 -79.15 9.4 -79.35 L10.95 -79.4 14.55 -78.9 Q16.4 -78.2 17.3 -76.45 L17.1 -76.35 14.05 -76.95 9.4 -76.45 Q3.75 -75.2 0.0 -70.75 -0.2 -71.85 0.5 -73.25 L0.6 -73.4 1.35 -74.55 1.35 -75.3 Q2.8 -77.15 4.45 -78.1 M14.7 -73.95 L17.8 -73.95 Q20.55 -73.65 22.3 -72.2 22.05 -72.85 22.05 -74.7 23.2 -73.55 24.1 -71.3 24.95 -69.1 24.95 -67.5 24.95 -61.85 20.0 -56.55 14.95 -51.15 9.4 -51.15 6.8 -51.15 2.45 -53.4 -2.5 -56.0 -2.5 -58.65 L-2.35 -59.2 -2.25 -59.65 -1.05 -59.65 Q-1.9 -62.1 -0.65 -65.05 0.35 -67.3 1.85 -68.15 0.9 -65.8 0.9 -62.7 0.55 -60.55 1.45 -58.55 3.15 -54.6 9.4 -54.55 L9.5 -54.55 Q14.95 -54.55 18.7 -59.25 21.65 -62.95 21.65 -65.7 21.65 -69.5 18.45 -72.05 16.7 -73.35 14.7 -73.95" fill="#818787" fill-rule="evenodd" stroke="none"/>
    <path d="M1.85 -68.15 L2.05 -68.7 Q2.8 -70.5 4.15 -71.75 6.3 -73.85 9.4 -74.3 L11.3 -74.45 14.7 -73.95 Q16.7 -73.35 18.45 -72.05 21.65 -69.5 21.65 -65.7 21.65 -62.95 18.7 -59.25 14.95 -54.55 9.5 -54.55 L9.4 -54.55 Q3.15 -54.6 1.45 -58.55 0.55 -60.55 0.9 -62.7 0.9 -65.8 1.85 -68.15 M14.7 -70.95 Q12.8 -72.4 9.75 -72.4 L9.4 -72.35 7.1 -71.85 6.2 -71.55 Q4.6 -70.9 3.4 -69.1 2.05 -67.15 2.05 -65.05 2.05 -61.75 4.95 -60.4 6.75 -59.5 9.4 -59.4 L9.85 -59.4 Q12.95 -59.4 14.85 -61.45 16.7 -63.4 16.7 -66.65 16.7 -69.4 14.7 -70.95" fill="#c4c4c4" fill-rule="evenodd" stroke="none"/>
    <path d="M14.7 -70.95 Q16.7 -69.4 16.7 -66.65 16.7 -63.4 14.85 -61.45 12.95 -59.4 9.85 -59.4 L9.4 -59.4 Q6.75 -59.5 4.95 -60.4 2.05 -61.75 2.05 -65.05 2.05 -67.15 3.4 -69.1 4.6 -70.9 6.2 -71.55 L7.1 -71.85 9.4 -72.35 9.75 -72.4 Q12.8 -72.4 14.7 -70.95" fill="#e1e1e1" fill-rule="evenodd" stroke="none"/>
    <path d="M78.85 -43.85 L79.2 -44.0 Q80.1 -44.45 80.1 -45.2 80.1 -46.4 77.35 -48.45 74.55 -50.5 74.5 -52.0 78.3 -51.9 82.45 -47.6 86.9 -43.0 86.9 -37.85 86.9 -34.25 85.55 -30.9 L82.35 -24.55 82.6 -24.55 Q83.0 -25.2 84.25 -25.65 L86.2 -26.25 Q80.15 -15.05 69.55 -15.05 65.3 -15.05 59.85 -19.35 54.5 -23.55 53.45 -27.65 L55.55 -25.85 Q57.15 -24.65 58.3 -24.2 L58.45 -24.15 58.6 -24.15 58.3 -24.2 Q56.45 -25.75 55.7 -28.05 55.1 -30.0 55.1 -33.6 55.1 -36.0 55.95 -39.4 56.8 -43.0 57.9 -44.45 L57.95 -44.35 Q56.75 -42.1 56.75 -40.9 56.75 -39.65 57.7 -37.75 58.5 -36.15 59.3 -35.6 L59.1 -33.3 Q59.2 -29.8 60.8 -26.6 63.95 -20.3 71.65 -20.3 76.75 -20.3 80.05 -26.1 82.45 -30.4 82.45 -33.35 82.45 -40.15 78.85 -43.85 M64.6 -49.55 Q65.8 -50.75 67.6 -50.75 L69.8 -50.3 Q71.35 -49.8 71.65 -49.35 66.2 -48.4 60.7 -45.8 L62.5 -48.45 63.1 -48.6 64.6 -49.55" fill="#818787" fill-rule="evenodd" stroke="none"/>
    <path d="M71.0 -45.25 Q74.0 -45.3 76.25 -43.5 79.3 -40.95 79.3 -36.2 79.3 -33.3 77.4 -30.5 75.35 -27.45 72.8 -27.45 69.85 -27.45 66.9 -29.25 63.0 -31.7 63.0 -35.95 63.0 -38.4 65.15 -41.45 67.05 -44.15 69.1 -45.0 L69.55 -45.2 70.2 -45.2 71.0 -45.25" fill="#e1e1e1" fill-rule="evenodd" stroke="none"/>
    <path d="M78.85 -43.85 Q82.45 -40.15 82.45 -33.35 82.45 -30.4 80.05 -26.1 76.75 -20.3 71.65 -20.3 63.95 -20.3 60.8 -26.6 59.2 -29.8 59.1 -33.3 L59.3 -35.6 Q59.85 -40.0 62.75 -43.1 66.1 -46.55 70.8 -46.85 75.55 -47.1 78.85 -43.85 M71.0 -45.25 L70.2 -45.2 69.55 -45.2 69.1 -45.0 Q67.05 -44.15 65.15 -41.45 63.0 -38.4 63.0 -35.95 63.0 -31.7 66.9 -29.25 69.85 -27.45 72.8 -27.45 75.35 -27.45 77.4 -30.5 79.3 -33.3 79.3 -36.2 79.3 -40.95 76.25 -43.5 74.0 -45.3 71.0 -45.25" fill="#c4c4c4" fill-rule="evenodd" stroke="none"/>
    <path d="M2.3 -64.25 Q2.3 -67.15 4.1 -67.7 5.85 -68.25 5.85 -65.65 5.85 -64.95 5.3 -63.8 4.6 -62.4 3.8 -62.4 2.6 -62.4 2.3 -63.35 L2.3 -64.25" fill="#585a5a" fill-rule="evenodd" stroke="none"/>
    <path d="M76.6 -37.75 Q76.6 -41.1 78.55 -40.6 80.45 -40.15 80.45 -37.8 L80.15 -36.6 Q79.75 -35.55 79.05 -35.55 77.15 -35.55 76.7 -36.55 L76.6 -37.75" fill="#585a5a" fill-rule="evenodd" stroke="none"/>
  </g>
</svg>
