<?xml version="1.0" encoding="UTF-8" standalone="no"?>
<svg xmlns:xlink="http://www.w3.org/1999/xlink" height="308.8px" width="237.95px" xmlns="http://www.w3.org/2000/svg">
  <g transform="matrix(1.0, 0.0, 0.0, 1.0, 80.75, 457.25)">
    <path d="M38.85 -297.8 L44.85 -301.5 Q54.45 -307.85 60.15 -314.95 L62.1 -317.6 Q64.35 -320.8 65.45 -323.85 L67.15 -319.25 66.85 -319.1 66.45 -319.1 Q64.25 -309.75 63.15 -304.1 L62.25 -298.5 61.65 -292.75 61.45 -289.4 61.35 -284.25 61.35 -282.95 61.5 -279.9 61.55 -279.85 61.5 -279.85 Q58.35 -277.85 54.6 -275.85 49.35 -273.05 44.3 -271.15 L42.9 -270.6 34.25 -275.7 27.1 -279.45 25.95 -281.2 24.5 -283.15 23.25 -284.6 Q26.7 -286.05 30.2 -287.85 33.55 -289.5 37.0 -291.55 L41.35 -294.2 Q49.15 -299.1 54.7 -303.6 L38.95 -297.7 38.85 -297.8 M64.15 -271.5 L64.25 -270.35 64.55 -266.65 Q64.75 -262.95 65.1 -259.2 L62.45 -260.45 Q61.65 -260.9 60.95 -261.3 L60.75 -256.9 61.55 -254.6 61.5 -254.45 Q53.95 -260.85 51.1 -260.7 46.35 -260.5 41.85 -256.85 38.3 -254.0 35.65 -249.7 34.9 -252.1 33.45 -255.15 31.95 -258.2 30.7 -260.05 L30.8 -263.1 Q41.35 -264.2 53.65 -267.8 L61.1 -270.25 64.15 -271.5 M77.7 -161.7 L78.2 -156.15 78.55 -153.2 75.3 -153.0 74.75 -165.65 74.75 -166.15 Q76.15 -163.85 77.7 -161.7 M68.0 -152.65 L52.75 -151.9 Q52.7 -159.25 52.8 -161.7 L53.6 -171.3 54.1 -177.15 Q54.1 -179.05 54.75 -179.95 55.4 -181.0 57.05 -181.45 57.6 -181.55 61.45 -183.55 L65.25 -185.55 64.75 -185.5 60.1 -184.75 Q58.15 -184.65 55.8 -185.25 53.1 -186.0 52.85 -187.1 L56.7 -187.35 58.95 -187.65 Q53.7 -199.0 49.15 -222.5 45.15 -242.9 45.1 -249.9 L45.15 -252.3 Q45.2 -253.35 45.65 -254.2 L46.65 -255.7 48.05 -255.9 Q55.15 -256.25 59.9 -246.8 62.65 -241.45 64.6 -232.9 L64.9 -231.8 Q66.3 -225.2 67.85 -214.35 L68.65 -208.95 Q69.6 -202.75 70.05 -201.05 71.4 -196.2 72.35 -189.7 L71.95 -182.5 Q70.95 -171.2 68.0 -152.65 M16.95 -150.15 L-2.5 -149.2 -6.3 -168.6 Q-8.05 -178.0 -8.1 -182.95 -8.1 -185.4 -7.55 -188.5 -7.05 -191.05 -7.2 -192.3 L-7.2 -192.75 -4.6 -193.05 -0.65 -193.8 Q2.5 -194.65 5.5 -196.05 L6.55 -196.55 6.9 -196.75 Q13.3 -200.2 17.65 -205.8 L17.95 -206.2 Q20.8 -210.05 22.2 -215.15 L23.2 -215.8 26.25 -217.85 27.75 -214.45 28.65 -211.9 Q28.65 -211.0 24.1 -208.75 20.95 -207.2 18.45 -206.3 L18.4 -206.2 18.3 -205.85 Q18.3 -204.55 22.8 -203.85 L27.7 -203.4 Q27.15 -202.2 23.55 -199.05 L23.6 -199.0 23.05 -198.6 23.05 -198.4 22.95 -198.5 19.5 -195.35 19.5 -194.95 29.55 -197.8 28.95 -195.65 27.85 -186.7 Q27.15 -181.7 21.4 -163.7 L16.95 -150.15 M34.85 -228.1 L35.05 -228.1 34.85 -227.9 34.85 -228.0 34.85 -228.1 M37.75 -198.75 L37.75 -198.7 37.75 -198.75 M29.65 -223.4 L29.75 -223.5 29.75 -223.3 29.65 -223.4" fill="#425d6b" fill-rule="evenodd" stroke="none"/>
    <path d="M67.15 -319.25 L68.1 -316.8 69.65 -312.4 71.55 -306.95 76.3 -293.45 78.15 -288.35 Q73.15 -284.25 63.9 -279.3 L63.65 -279.2 62.9 -278.8 Q51.9 -273.0 45.05 -270.65 L44.2 -270.4 43.9 -269.95 42.9 -270.6 44.3 -271.15 Q49.35 -273.05 54.6 -275.85 58.35 -277.85 61.5 -279.85 L61.55 -279.85 61.5 -279.9 61.35 -282.95 61.35 -284.25 61.45 -289.4 61.65 -292.75 62.25 -298.5 63.15 -304.1 Q64.25 -309.75 66.45 -319.1 L66.85 -319.1 67.15 -319.25 M17.35 -288.9 L23.8 -290.85 Q30.85 -293.35 37.85 -297.2 L38.95 -297.7 54.7 -303.6 Q49.15 -299.1 41.35 -294.2 L37.0 -291.55 Q33.55 -289.5 30.2 -287.85 26.7 -286.05 23.25 -284.6 L20.2 -287.35 17.35 -288.9" fill="#4f6d80" fill-rule="evenodd" stroke="none"/>
    <path d="M63.65 -279.2 L64.15 -271.5 61.1 -270.25 53.65 -267.8 Q41.35 -264.2 30.8 -263.1 L30.6 -267.7 30.45 -269.15 30.0 -272.15 Q29.25 -275.25 27.75 -278.15 L27.1 -279.45 34.25 -275.7 42.9 -270.6 43.9 -269.95 44.2 -270.4 45.05 -270.65 Q51.9 -273.0 62.9 -278.8 L63.65 -279.2 M32.0 -150.9 L26.25 -150.6 28.0 -157.5 Q31.0 -168.7 31.1 -172.1 31.1 -174.25 31.65 -180.15 L32.7 -190.45 33.65 -200.2 29.85 -199.35 25.8 -198.55 23.05 -198.4 23.05 -198.6 23.6 -199.0 32.85 -205.2 32.7 -205.3 32.65 -205.4 30.3 -205.25 Q28.85 -204.8 26.05 -205.2 L22.05 -205.65 22.2 -205.65 Q24.2 -206.1 28.95 -207.8 L34.15 -209.6 Q33.8 -211.85 31.6 -217.25 29.6 -222.25 29.6 -222.9 29.55 -223.25 29.65 -223.4 L29.75 -223.3 Q33.5 -219.6 34.7 -219.1 L34.85 -227.9 Q35.25 -219.95 36.4 -209.75 L37.7 -199.1 37.75 -198.75 37.75 -198.7 37.15 -197.85 37.25 -196.65 37.25 -196.6 Q37.3 -193.75 34.2 -168.85 L32.0 -150.9 M-20.6 -194.45 Q-20.75 -200.35 -20.55 -205.45 L-20.5 -207.7 -13.6 -207.05 Q-1.45 -207.65 5.7 -220.45 8.5 -225.6 9.25 -230.75 10.0 -235.85 8.3 -238.55 13.1 -240.1 16.8 -241.75 L21.9 -244.45 23.85 -245.8 Q26.4 -247.7 27.8 -249.7 L28.75 -251.3 28.8 -251.35 Q30.4 -254.8 30.7 -260.05 31.95 -258.2 33.45 -255.15 34.9 -252.1 35.65 -249.7 36.35 -247.35 36.35 -245.55 L36.4 -244.8 Q34.55 -240.5 34.6 -235.65 L34.8 -235.55 34.6 -235.0 33.1 -231.75 Q30.45 -226.9 26.05 -223.65 24.55 -222.6 22.8 -221.7 23.25 -220.4 22.7 -217.5 L22.3 -215.55 22.2 -215.15 Q20.8 -210.05 17.95 -206.2 L17.65 -205.8 Q13.3 -200.2 6.9 -196.75 L6.55 -196.55 5.5 -196.05 Q2.5 -194.65 -0.65 -193.8 L-4.6 -193.05 -7.2 -192.75 -7.75 -192.75 Q-15.4 -192.35 -20.6 -194.45" fill="#324752" fill-rule="evenodd" stroke="none"/>
    <path d="M75.3 -153.0 L68.0 -152.65 Q70.95 -171.2 71.95 -182.5 L72.35 -189.7 Q73.9 -179.85 74.75 -166.15 L74.75 -165.65 75.3 -153.0 M26.25 -150.6 L16.95 -150.15 21.4 -163.7 Q27.15 -181.7 27.85 -186.7 L28.95 -195.65 29.55 -197.8 19.5 -194.95 19.5 -195.35 22.95 -198.5 23.05 -198.4 25.8 -198.55 29.85 -199.35 33.65 -200.2 32.7 -190.45 31.65 -180.15 Q31.1 -174.25 31.1 -172.1 31.0 -168.7 28.0 -157.5 L26.25 -150.6 M35.65 -249.7 Q38.3 -254.0 41.85 -256.85 46.35 -260.5 51.1 -260.7 53.95 -260.85 61.5 -254.45 L60.5 -252.9 60.0 -247.65 59.9 -246.8 Q55.15 -256.25 48.05 -255.9 L46.65 -255.7 Q43.0 -254.75 39.35 -249.95 37.5 -247.5 36.4 -244.8 L36.35 -245.55 Q36.35 -247.35 35.65 -249.7 M22.2 -215.15 L22.3 -215.55 22.7 -217.5 Q23.25 -220.4 22.8 -221.7 24.55 -222.6 26.05 -223.65 30.45 -226.9 33.1 -231.75 L34.6 -235.0 34.85 -228.1 34.85 -228.0 34.85 -227.9 34.7 -219.1 Q33.5 -219.6 29.75 -223.3 L29.75 -223.5 29.65 -223.4 Q29.55 -223.25 29.6 -222.9 29.6 -222.25 31.6 -217.25 33.8 -211.85 34.15 -209.6 L28.95 -207.8 Q24.2 -206.1 22.2 -205.65 L22.05 -205.65 26.05 -205.2 Q28.85 -204.8 30.3 -205.25 L32.65 -205.4 32.7 -205.3 32.85 -205.2 23.6 -199.0 23.55 -199.05 Q27.15 -202.2 27.7 -203.4 L22.8 -203.85 Q18.3 -204.55 18.3 -205.85 L18.4 -206.2 18.45 -206.3 Q20.95 -207.2 24.1 -208.75 28.65 -211.0 28.65 -211.9 L27.75 -214.45 26.25 -217.85 23.2 -215.8 22.2 -215.15 M22.8 -166.35 Q23.15 -166.35 23.55 -165.95 L23.45 -166.4 22.8 -166.35" fill="#3a505e" fill-rule="evenodd" stroke="none"/>
    <path d="M65.1 -259.2 L65.9 -249.25 65.9 -249.2 Q65.4 -247.2 65.2 -245.4 L65.0 -244.1 Q64.75 -242.05 64.8 -234.35 L64.9 -231.8 64.6 -232.9 Q62.65 -241.45 59.9 -246.8 L60.0 -247.65 60.5 -252.9 61.5 -254.45 61.55 -254.6 60.75 -256.9 60.95 -261.3 Q61.65 -260.9 62.45 -260.45 L65.1 -259.2 M75.3 -189.2 L77.7 -161.7 Q76.15 -163.85 74.75 -166.15 73.9 -179.85 72.35 -189.7 71.4 -196.2 70.05 -201.05 69.6 -202.75 68.65 -208.95 L70.3 -202.15 Q71.0 -199.0 72.4 -195.6 L73.65 -192.5 75.3 -189.2 M52.75 -151.9 L32.0 -150.9 34.2 -168.85 Q37.3 -193.75 37.25 -196.6 L37.25 -196.65 37.15 -197.85 37.75 -198.7 37.75 -198.75 37.7 -199.1 36.4 -209.75 Q35.25 -219.95 34.85 -227.9 L35.05 -228.1 34.85 -228.1 34.6 -235.0 34.8 -235.55 34.6 -235.65 Q34.55 -240.5 36.4 -244.8 37.5 -247.5 39.35 -249.95 43.0 -254.75 46.65 -255.7 L45.65 -254.2 Q45.2 -253.35 45.15 -252.3 L45.1 -249.9 Q45.15 -242.9 49.15 -222.5 53.7 -199.0 58.95 -187.65 L56.7 -187.35 52.85 -187.1 Q53.1 -186.0 55.8 -185.25 58.15 -184.65 60.1 -184.75 L64.75 -185.5 65.25 -185.55 61.45 -183.55 Q57.6 -181.55 57.05 -181.45 55.4 -181.0 54.75 -179.95 54.1 -179.05 54.1 -177.15 L53.6 -171.3 52.8 -161.7 Q52.7 -159.25 52.75 -151.9 M-2.5 -149.2 L-12.15 -148.7 Q-12.7 -154.2 -13.0 -163.25 L-13.1 -166.05 -13.15 -168.15 -13.5 -185.65 -13.2 -186.9 -14.55 -186.85 Q-16.2 -186.35 -20.4 -186.9 L-20.6 -194.45 Q-15.4 -192.35 -7.75 -192.75 L-7.2 -192.75 -7.2 -192.3 Q-7.05 -191.05 -7.55 -188.5 -8.1 -185.4 -8.1 -182.95 -8.05 -178.0 -6.3 -168.6 L-2.5 -149.2 M-9.1 -169.55 L-9.05 -169.6 -9.3 -169.7 -9.15 -169.55 -9.1 -169.55" fill="#527285" fill-rule="evenodd" stroke="none"/>
    <path d="M37.85 -297.2 L38.85 -297.8 38.95 -297.7 37.85 -297.2" fill="#258cb8" fill-rule="evenodd" stroke="none"/>
    <path d="M-79.05 -238.1 Q-80.0 -242.35 -80.5 -247.1 -80.95 -252.1 -80.65 -256.55 L-80.25 -256.05 Q-79.35 -254.95 -77.55 -254.7 L-75.9 -254.7 Q-68.45 -255.05 -60.4 -259.95 -57.25 -261.9 -53.95 -264.6 L-52.1 -266.1 Q-47.5 -270.3 -44.85 -274.6 L-43.2 -277.75 Q-41.8 -281.0 -41.55 -284.3 L-41.5 -286.05 -41.55 -287.65 Q-41.8 -289.6 -42.6 -291.2 -39.4 -290.95 -37.0 -289.9 -33.45 -288.35 -32.7 -288.3 L-32.65 -288.3 -32.65 -288.5 -32.55 -288.4 -32.05 -288.1 Q-29.05 -286.35 -26.4 -285.05 L-23.5 -283.7 -24.55 -285.15 -27.2 -288.35 -28.5 -289.85 Q-31.15 -293.15 -31.5 -296.55 L-30.9 -296.95 Q-27.55 -298.75 -22.25 -299.0 L-16.5 -298.6 -13.25 -297.75 -12.9 -298.2 -11.9 -297.6 -11.3 -297.25 -11.0 -297.05 Q-10.3 -296.35 -9.7 -295.25 -8.3 -292.8 -8.25 -291.15 -8.25 -290.15 -8.5 -289.3 -9.15 -287.0 -11.6 -285.8 -13.95 -284.6 -20.05 -283.85 -17.25 -282.45 -12.25 -281.55 L-11.85 -281.45 -7.35 -280.85 Q-3.15 -284.0 2.1 -286.45 L2.25 -286.55 3.8 -287.25 Q9.25 -289.45 13.05 -289.65 15.2 -289.75 17.35 -288.9 L20.2 -287.35 23.25 -284.6 24.5 -283.15 25.95 -281.2 27.1 -279.45 27.75 -278.15 Q29.25 -275.25 30.0 -272.15 L25.9 -267.4 20.9 -262.15 Q16.1 -257.75 8.05 -257.35 2.75 -257.05 0.25 -258.05 -2.45 -259.1 -4.7 -262.3 L-4.6 -261.5 Q-4.6 -258.2 -6.6 -252.95 -8.7 -247.3 -12.1 -242.2 -20.9 -229.15 -31.35 -228.65 -39.2 -228.25 -43.7 -232.65 -46.4 -235.35 -47.05 -238.2 -48.85 -236.8 -51.9 -235.3 L-54.7 -234.1 Q-57.85 -232.7 -60.2 -232.0 L-64.05 -231.2 Q-71.6 -230.85 -77.4 -236.35 L-79.05 -238.1 M4.2 -283.5 Q2.9 -283.45 1.3 -282.85 L-1.75 -281.65 -2.2 -281.5 -4.4 -279.7 Q-5.45 -278.5 -5.45 -277.35 L-5.15 -276.55 -4.7 -276.15 -3.75 -275.85 Q-1.45 -275.95 0.8 -276.85 2.45 -277.45 4.1 -278.55 5.5 -279.45 6.3 -280.2 7.45 -281.25 7.45 -281.95 7.45 -283.4 6.3 -283.6 L4.2 -283.5 M-26.75 -278.6 Q-28.25 -280.6 -28.45 -282.3 L-28.85 -282.25 -29.95 -278.4 -31.0 -275.25 -33.95 -268.2 -37.3 -260.55 Q-35.3 -263.25 -31.3 -266.1 -24.4 -271.05 -18.45 -270.95 L-23.9 -275.6 -24.05 -275.7 -26.75 -278.6 M-39.35 -253.3 Q-39.35 -251.35 -37.4 -249.75 -35.2 -247.95 -32.05 -248.1 -24.05 -248.5 -17.15 -254.55 -11.1 -259.85 -9.55 -265.0 -7.95 -270.2 -11.8 -270.1 L-18.85 -269.35 -18.8 -269.0 -21.05 -268.65 -21.45 -268.55 Q-25.05 -267.6 -30.25 -264.6 -39.4 -259.35 -39.35 -253.3" fill="#eafbfa" fill-rule="evenodd" stroke="none"/>
    <path d="M-80.65 -256.55 Q-80.15 -263.65 -77.65 -269.45 -76.05 -273.1 -73.8 -276.25 L-70.4 -280.2 Q-68.0 -282.7 -65.3 -284.65 -56.85 -290.7 -46.0 -291.25 L-42.6 -291.2 Q-41.8 -289.6 -41.55 -287.65 L-41.5 -286.05 -41.55 -284.3 Q-41.8 -281.0 -43.2 -277.75 L-44.85 -274.6 Q-47.5 -270.3 -52.1 -266.1 L-53.95 -264.6 Q-57.25 -261.9 -60.4 -259.95 -68.45 -255.05 -75.9 -254.7 L-77.55 -254.7 Q-79.35 -254.95 -80.25 -256.05 L-80.65 -256.55 M-31.55 -298.65 Q-29.9 -301.95 -25.95 -302.1 -20.55 -302.4 -13.65 -298.65 L-12.9 -298.2 -13.25 -297.75 -16.5 -298.6 -22.25 -299.0 Q-27.55 -298.75 -30.9 -296.95 L-31.5 -296.55 -31.6 -297.8 -31.55 -298.65 M4.2 -283.5 L6.3 -283.6 Q7.45 -283.4 7.45 -281.95 7.45 -281.25 6.3 -280.2 5.5 -279.45 4.1 -278.55 2.45 -277.45 0.8 -276.85 -1.45 -275.95 -3.75 -275.85 L-4.7 -276.15 -5.15 -276.55 -5.45 -277.35 Q-5.45 -278.5 -4.4 -279.7 L-2.2 -281.5 -1.75 -281.65 1.3 -282.85 Q2.9 -283.45 4.2 -283.5 M-39.35 -253.3 Q-39.4 -259.35 -30.25 -264.6 -25.05 -267.6 -21.45 -268.55 L-21.05 -268.65 -18.8 -269.0 -18.85 -269.35 -11.8 -270.1 Q-7.95 -270.2 -9.55 -265.0 -11.1 -259.85 -17.15 -254.55 -24.05 -248.5 -32.05 -248.1 -35.2 -247.95 -37.4 -249.75 -39.35 -251.35 -39.35 -253.3" fill="#ffffff" fill-rule="evenodd" stroke="none"/>
    <path d="M-20.5 -207.7 Q-23.7 -208.45 -27.25 -210.05 L-28.3 -210.45 Q-13.95 -211.75 -4.7 -220.4 3.65 -228.25 3.55 -236.85 3.55 -238.5 2.85 -240.85 L1.6 -244.0 1.6 -244.75 5.2 -244.25 10.0 -244.05 15.95 -244.8 Q23.15 -246.5 28.75 -251.35 L28.8 -251.35 28.75 -251.3 27.8 -249.7 Q26.4 -247.7 23.85 -245.8 L21.9 -244.45 16.8 -241.75 Q13.1 -240.1 8.3 -238.55 10.0 -235.85 9.25 -230.75 8.5 -225.6 5.7 -220.45 -1.45 -207.65 -13.6 -207.05 L-20.5 -207.7 M-32.05 -212.6 Q-35.1 -214.65 -36.15 -216.7 -38.45 -212.4 -39.9 -211.25 -42.45 -209.25 -48.05 -208.95 L-51.7 -209.05 Q-55.9 -209.5 -60.05 -211.55 L-63.65 -213.6 Q-70.05 -217.65 -74.1 -224.8 L-70.55 -221.5 Q-67.3 -218.95 -64.3 -218.2 L-60.1 -216.9 -58.0 -216.3 -52.1 -215.75 -51.75 -215.75 Q-47.1 -216.1 -45.6 -219.1 -44.85 -220.7 -44.85 -224.3 L-44.85 -226.05 -38.3 -219.6 Q-34.05 -215.25 -32.05 -212.6 M-3.0 -289.3 L-0.95 -286.45 2.05 -286.55 2.1 -286.45 Q-3.15 -284.0 -7.35 -280.85 L-11.85 -281.45 -12.25 -281.55 -7.9 -284.9 -6.65 -286.0 -3.0 -289.3" fill="#b8c7c6" fill-rule="evenodd" stroke="none"/>
    <path d="M-28.3 -210.45 L-31.65 -212.35 -32.05 -212.6 Q-34.05 -215.25 -38.3 -219.6 L-44.85 -226.05 -44.85 -224.3 Q-44.85 -220.7 -45.6 -219.1 -47.1 -216.1 -51.75 -215.75 L-52.1 -215.75 -58.0 -216.3 -60.1 -216.9 -64.3 -218.2 Q-67.3 -218.95 -70.55 -221.5 L-74.1 -224.8 -75.1 -226.65 Q-76.4 -229.2 -77.35 -232.05 -78.35 -234.9 -79.05 -238.1 L-77.4 -236.35 Q-71.6 -230.85 -64.05 -231.2 L-60.2 -232.0 Q-57.85 -232.7 -54.7 -234.1 L-51.9 -235.3 Q-48.85 -236.8 -47.05 -238.2 -46.4 -235.35 -43.7 -232.65 -39.2 -228.25 -31.35 -228.65 -20.9 -229.15 -12.1 -242.2 -8.7 -247.3 -6.6 -252.95 -4.6 -258.2 -4.6 -261.5 L-4.7 -262.3 Q-2.45 -259.1 0.25 -258.05 2.75 -257.05 8.05 -257.35 16.1 -257.75 20.9 -262.15 L25.9 -267.4 30.0 -272.15 30.45 -269.15 30.6 -267.7 30.8 -263.1 30.7 -260.05 Q30.4 -254.8 28.8 -251.35 L28.75 -251.35 Q23.15 -246.5 15.95 -244.8 L10.0 -244.05 5.2 -244.25 1.6 -244.75 1.6 -244.0 2.85 -240.85 Q3.55 -238.5 3.55 -236.85 3.65 -228.25 -4.7 -220.4 -13.95 -211.75 -28.3 -210.45 M-32.65 -288.5 Q-33.15 -292.9 -32.5 -295.9 L-31.55 -298.65 -31.6 -297.8 -31.5 -296.55 Q-31.15 -293.15 -28.5 -289.85 L-27.2 -288.35 -24.55 -285.15 -23.5 -283.7 -26.4 -285.05 Q-29.05 -286.35 -32.05 -288.1 L-32.55 -288.4 -32.65 -288.5 M-11.0 -297.05 Q-6.5 -294.25 -4.75 -292.25 L-4.25 -291.45 -3.3 -289.8 -3.15 -289.55 -3.0 -289.3 -6.65 -286.0 -7.9 -284.9 -12.25 -281.55 Q-17.25 -282.45 -20.05 -283.85 -13.95 -284.6 -11.6 -285.8 -9.15 -287.0 -8.5 -289.3 -8.25 -290.15 -8.25 -291.15 -8.3 -292.8 -9.7 -295.25 -10.3 -296.35 -11.0 -297.05 M-26.75 -278.6 L-24.05 -275.7 -23.9 -275.6 -18.45 -270.95 Q-24.4 -271.05 -31.3 -266.1 -35.3 -263.25 -37.3 -260.55 L-33.95 -268.2 -31.0 -275.25 -29.95 -278.4 -28.85 -282.25 -28.45 -282.3 Q-28.25 -280.6 -26.75 -278.6" fill="#cededd" fill-rule="evenodd" stroke="none"/>
    <path d="M65.9 -249.25 L65.9 -249.2 65.9 -249.25 M79.8 -179.55 L79.75 -179.7 79.8 -179.55" fill="#f131f5" fill-rule="evenodd" stroke="none"/>
    <path d="M65.9 -249.2 L66.55 -242.05 66.6 -241.4 Q67.85 -228.25 71.75 -215.85 L75.25 -189.4 75.3 -189.2 73.65 -192.5 72.4 -195.6 Q71.0 -199.0 70.3 -202.15 L68.65 -208.95 67.85 -214.35 Q66.3 -225.2 64.9 -231.8 L64.8 -234.35 Q64.75 -242.05 65.0 -244.1 L65.2 -245.4 Q65.4 -247.2 65.9 -249.2 M-12.15 -148.7 L-17.55 -148.45 -18.75 -161.1 -19.15 -165.55 -18.9 -165.65 -19.15 -165.6 Q-20.05 -177.2 -20.4 -186.9 -16.2 -186.35 -14.55 -186.85 L-13.2 -186.9 -13.5 -185.65 -13.15 -168.15 -13.1 -166.05 -13.0 -163.25 Q-12.7 -154.2 -12.15 -148.7" fill="#597c91" fill-rule="evenodd" stroke="none"/>
    <path d="M22.8 -166.35 L23.45 -166.4 23.55 -165.95 Q23.15 -166.35 22.8 -166.35 M-9.1 -169.55 L-9.3 -169.7 -9.05 -169.6 -9.1 -169.55" fill="#b524b8" fill-rule="evenodd" stroke="none"/>
    <path d="M-9.3 -169.7 L-9.1 -169.55 -9.15 -169.55 -9.3 -169.7" fill="#d52bd9" fill-rule="evenodd" stroke="none"/>
    <path d="M-19.15 -165.55 L-19.15 -165.6 -18.9 -165.65 -19.15 -165.55" fill="#33b2ff" fill-rule="evenodd" stroke="none"/>
    <path d="M46.95 -446.75 L50.75 -448.65 54.15 -449.85 Q58.9 -451.35 64.15 -451.6 72.65 -452.0 81.95 -449.6 90.1 -447.5 91.45 -445.55 L89.4 -445.45 82.7 -444.4 82.8 -444.85 81.5 -445.5 Q77.5 -447.25 73.55 -448.0 L73.45 -448.05 62.6 -448.6 61.5 -448.55 58.15 -448.25 56.85 -448.1 50.0 -446.2 45.4 -444.4 46.2 -445.9 46.95 -446.75 M61.65 -439.05 L67.5 -440.8 74.0 -441.55 74.9 -441.6 Q79.3 -441.8 85.3 -440.5 90.9 -439.3 94.3 -437.55 L91.85 -437.45 86.1 -436.9 77.6 -438.35 74.25 -438.6 66.9 -438.95 66.25 -438.95 61.65 -439.05 M69.15 -433.65 L69.1 -433.7 74.65 -433.3 80.95 -432.8 Q92.85 -432.0 98.95 -432.3 L103.8 -432.85 103.5 -432.45 100.95 -430.7 Q99.25 -429.75 97.05 -428.75 L92.1 -429.5 92.05 -429.5 89.5 -429.9 87.35 -430.25 82.45 -431.05 82.4 -431.05 80.65 -431.35 78.25 -431.8 74.75 -432.45 69.3 -433.65 69.15 -433.65 M74.6 -402.75 L76.8 -405.95 Q79.55 -409.5 83.85 -413.3 88.65 -417.45 94.0 -420.85 L91.65 -418.45 89.25 -416.25 94.1 -418.6 Q97.05 -420.1 98.45 -420.95 L93.95 -417.3 Q89.95 -414.05 86.85 -410.95 L82.7 -408.0 80.35 -406.25 76.95 -403.7 76.1 -403.0 74.35 -401.45 74.45 -401.9 74.6 -402.75 M81.55 -403.8 L94.5 -407.65 Q103.35 -410.55 106.65 -412.95 L106.75 -412.85 104.2 -410.7 Q101.0 -407.85 99.25 -406.85 104.35 -407.75 113.55 -412.25 122.45 -416.55 125.2 -419.4 L121.0 -411.5 Q117.1 -404.5 115.15 -402.15 L115.2 -401.55 122.75 -407.3 Q127.5 -411.15 129.25 -414.35 132.35 -411.15 135.35 -405.9 138.2 -400.85 139.75 -396.2 L140.35 -396.2 140.4 -399.05 140.55 -401.6 Q140.3 -404.85 138.75 -408.7 L135.05 -417.05 135.0 -417.65 Q139.0 -416.0 144.45 -411.1 L147.6 -405.2 149.8 -401.2 Q153.0 -390.55 155.3 -377.5 L155.35 -377.1 155.7 -374.85 156.3 -370.85 156.8 -367.8 Q151.65 -361.9 139.7 -355.7 125.6 -349.15 123.25 -347.8 L122.95 -347.8 127.7 -351.55 132.9 -355.95 128.7 -353.25 Q125.9 -351.45 124.65 -350.85 L124.3 -350.8 125.8 -352.15 Q126.5 -352.8 126.7 -353.55 125.0 -353.15 120.45 -350.0 L115.75 -346.5 115.2 -345.75 115.2 -346.1 115.75 -346.5 118.15 -349.8 Q121.35 -354.35 123.35 -358.7 125.95 -364.1 128.05 -369.5 L128.6 -370.8 129.65 -373.55 130.55 -376.15 129.1 -373.55 126.0 -369.4 Q123.45 -366.2 119.5 -362.05 119.3 -364.75 118.05 -369.0 L116.75 -372.95 115.9 -375.45 Q112.85 -383.55 111.45 -385.85 111.1 -385.2 111.3 -383.15 L112.7 -372.75 112.85 -371.8 112.3 -372.75 110.9 -374.95 Q109.4 -377.05 107.45 -378.8 L106.8 -379.4 105.65 -380.3 Q104.2 -381.35 102.65 -382.2 97.0 -385.3 90.05 -384.95 84.9 -384.7 80.2 -380.4 L79.1 -379.3 78.85 -379.0 77.9 -377.95 Q72.75 -375.7 68.35 -371.95 L67.25 -371.0 66.7 -370.5 64.2 -368.0 64.75 -369.05 65.3 -370.45 65.5 -370.9 66.25 -372.8 66.4 -373.2 Q68.6 -376.9 71.95 -381.65 L72.1 -381.9 72.25 -382.15 72.6 -382.5 Q73.8 -383.8 77.35 -386.3 L78.2 -386.95 78.3 -387.0 80.95 -388.75 Q86.9 -392.6 94.45 -396.15 L90.05 -395.95 83.35 -394.55 80.35 -393.7 79.9 -393.55 77.75 -392.9 76.2 -392.45 75.9 -392.6 75.9 -392.7 Q79.1 -395.4 85.1 -397.2 89.3 -398.5 96.95 -400.4 103.05 -402.3 106.95 -404.7 110.15 -406.55 112.55 -409.05 107.25 -405.85 98.9 -403.45 L88.6 -400.85 92.95 -402.1 89.55 -402.95 Q89.9 -402.95 89.9 -403.3 91.7 -403.85 94.3 -404.9 L94.95 -405.15 95.0 -405.2 96.3 -405.75 94.95 -405.35 94.85 -405.35 94.15 -405.25 83.5 -403.7 81.55 -403.8 M62.3 -365.5 L62.6 -365.8 62.8 -365.5 62.45 -365.35 62.3 -365.5 M114.4 -444.05 L116.85 -440.85 118.9 -438.2 119.15 -438.2 120.05 -438.35 Q122.4 -438.45 123.4 -437.7 125.9 -435.95 129.15 -434.5 L128.7 -434.5 123.55 -434.85 124.6 -433.5 124.9 -433.05 Q125.8 -431.9 125.95 -431.25 L123.05 -433.4 121.8 -434.55 Q120.75 -435.3 117.35 -435.15 L114.4 -434.9 Q115.25 -435.65 117.95 -436.65 L106.05 -440.4 107.85 -440.6 112.55 -440.25 115.8 -439.5 114.4 -444.05 M89.25 -416.25 L89.0 -416.15 89.15 -416.15 89.25 -416.25 M99.25 -406.85 L98.45 -406.8 99.05 -406.8 99.25 -406.85 M106.1 -398.6 L109.7 -401.0 112.25 -403.65 113.4 -404.95 Q112.4 -404.1 108.3 -401.7 103.15 -398.6 101.2 -397.95 97.85 -396.9 92.6 -393.1 L87.15 -388.85 87.2 -388.75 96.05 -393.1 Q101.75 -395.85 103.35 -397.15 L106.1 -398.6 M103.15 -332.7 Q111.0 -331.1 114.2 -332.15 112.7 -330.7 110.25 -329.35 L102.4 -329.2 Q96.4 -329.4 93.45 -331.0 L93.55 -331.15 102.0 -332.6 103.15 -332.8 103.15 -332.7 M94.7 -324.75 Q97.7 -321.85 103.15 -319.25 105.7 -318.0 108.2 -317.3 L112.25 -316.5 110.6 -315.4 Q101.25 -315.65 96.95 -317.05 94.8 -317.8 90.2 -320.15 85.2 -322.7 80.55 -324.45 L80.6 -324.6 Q81.4 -325.1 83.6 -325.5 L86.4 -325.9 92.2 -325.2 94.7 -324.75 M78.45 -318.2 Q78.35 -317.2 78.4 -316.0 L78.4 -315.9 Q78.25 -312.2 78.8 -308.95 79.85 -302.65 82.5 -297.55 78.55 -300.1 75.25 -303.75 74.7 -310.75 75.55 -315.7 76.15 -319.45 77.25 -320.9 77.25 -320.7 77.45 -320.6 L77.6 -320.55 78.45 -318.2" fill="#d4ad32" fill-rule="evenodd" stroke="none"/>
    <path d="M82.7 -444.4 L89.4 -445.45 91.45 -445.55 Q90.1 -447.5 81.95 -449.6 72.65 -452.0 64.15 -451.6 58.9 -451.35 54.15 -449.85 L50.75 -448.65 46.95 -446.75 Q47.6 -447.35 48.6 -447.95 L51.4 -449.7 56.85 -453.6 Q62.45 -456.75 71.8 -457.2 83.3 -457.75 96.05 -454.0 105.15 -451.3 109.7 -448.2 L114.6 -447.1 115.25 -446.9 Q122.35 -444.5 128.6 -438.75 L133.35 -433.9 Q141.65 -424.05 147.45 -408.2 L146.75 -408.9 144.45 -411.1 Q139.0 -416.0 135.0 -417.65 L135.05 -417.05 138.75 -408.7 Q140.3 -404.85 140.55 -401.6 L140.4 -399.05 140.35 -396.2 139.75 -396.2 Q138.2 -400.85 135.35 -405.9 132.35 -411.15 129.25 -414.35 127.5 -411.15 122.75 -407.3 L115.2 -401.55 115.15 -402.15 Q117.1 -404.5 121.0 -411.5 L125.2 -419.4 Q122.45 -416.55 113.55 -412.25 104.35 -407.75 99.25 -406.85 101.0 -407.85 104.2 -410.7 L106.75 -412.85 106.65 -412.95 Q103.35 -410.55 94.5 -407.65 L81.55 -403.8 80.0 -403.9 84.15 -407.95 90.6 -413.6 86.85 -410.95 Q89.95 -414.05 93.95 -417.3 L98.45 -420.95 Q97.05 -420.1 94.1 -418.6 L89.25 -416.25 91.65 -418.45 94.0 -420.85 Q88.65 -417.45 83.85 -413.3 79.55 -409.5 76.8 -405.95 L74.6 -402.75 74.95 -404.15 Q75.55 -406.55 76.55 -408.8 77.9 -411.9 80.05 -414.8 83.05 -418.95 87.6 -422.55 91.7 -425.85 95.95 -427.8 L97.95 -428.65 97.05 -428.75 Q99.25 -429.75 100.95 -430.7 L103.5 -432.45 103.8 -432.85 98.95 -432.3 Q92.85 -432.0 80.95 -432.8 L74.65 -433.3 69.1 -433.7 69.15 -433.65 69.1 -433.65 68.8 -433.75 69.1 -433.75 69.2 -433.75 69.3 -433.8 74.55 -434.5 78.4 -435.0 78.55 -435.05 88.25 -436.3 86.1 -436.9 91.85 -437.45 94.3 -437.55 Q90.9 -439.3 85.3 -440.5 79.3 -441.8 74.9 -441.6 L74.0 -441.55 67.5 -440.8 61.65 -439.05 60.75 -439.1 Q62.25 -440.3 65.1 -441.3 L70.8 -442.85 70.85 -442.85 71.35 -442.9 73.85 -443.4 77.95 -443.95 81.85 -444.25 82.7 -444.3 82.7 -444.4 M75.9 -392.7 Q76.35 -393.65 77.6 -394.8 79.15 -396.2 82.0 -397.8 L83.55 -398.65 86.75 -400.15 88.6 -400.85 98.9 -403.45 Q107.25 -405.85 112.55 -409.05 110.15 -406.55 106.95 -404.7 103.05 -402.3 96.95 -400.4 89.3 -398.5 85.1 -397.2 79.1 -395.4 75.9 -392.7 M114.4 -444.05 L115.8 -439.5 112.55 -440.25 107.85 -440.6 106.05 -440.4 117.95 -436.65 Q115.25 -435.65 114.4 -434.9 L117.35 -435.15 Q120.75 -435.3 121.8 -434.55 L123.05 -433.4 125.95 -431.25 Q125.8 -431.9 124.9 -433.05 L124.6 -433.5 123.55 -434.85 128.7 -434.5 129.15 -434.5 Q125.9 -435.95 123.4 -437.7 122.4 -438.45 120.05 -438.35 L119.15 -438.2 118.9 -438.2 116.85 -440.85 114.4 -444.05 M89.25 -416.25 L89.15 -416.15 89.0 -416.15 89.25 -416.25 M99.25 -406.85 L99.05 -406.8 98.45 -406.8 99.25 -406.85 M106.1 -398.6 L103.35 -397.15 Q101.75 -395.85 96.05 -393.1 L87.2 -388.75 87.15 -388.85 92.6 -393.1 Q97.85 -396.9 101.2 -397.95 103.15 -398.6 108.3 -401.7 112.4 -404.1 113.4 -404.95 L112.25 -403.65 109.7 -401.0 106.1 -398.6" fill="#edc638" fill-rule="evenodd" stroke="none"/>
    <path d="M45.4 -444.4 L50.0 -446.2 56.85 -448.1 58.15 -448.25 61.5 -448.55 Q66.3 -447.85 72.05 -446.0 L73.7 -445.45 74.6 -445.2 77.95 -443.95 73.85 -443.4 71.35 -442.9 70.85 -443.0 63.85 -443.95 59.35 -444.45 Q53.8 -444.85 49.7 -444.65 L45.7 -444.05 45.5 -443.95 45.4 -444.4 M86.1 -436.9 L88.25 -436.3 78.55 -435.05 78.4 -435.0 74.5 -435.3 74.1 -435.3 68.15 -435.7 59.8 -436.2 62.6 -437.15 66.4 -438.7 66.9 -438.95 74.25 -438.6 77.6 -438.35 86.1 -436.9 M80.05 -414.8 Q77.9 -411.9 76.55 -408.8 75.55 -406.55 74.95 -404.15 L73.2 -402.7 Q69.95 -400.0 68.9 -399.95 L66.55 -401.7 65.9 -402.25 65.95 -401.3 Q66.05 -399.5 65.7 -398.25 L64.85 -399.85 62.85 -402.4 61.35 -403.75 59.9 -404.75 55.1 -408.55 54.95 -408.7 54.3 -408.8 Q52.5 -409.25 50.75 -410.25 49.6 -410.95 48.4 -411.9 L47.6 -412.6 46.4 -413.75 Q44.2 -416.0 42.85 -418.05 42.15 -419.1 41.75 -420.1 41.25 -421.1 41.1 -421.9 L40.9 -422.7 40.75 -423.75 40.75 -424.55 40.8 -425.65 41.3 -428.45 37.65 -426.4 Q33.7 -424.15 33.8 -423.55 L34.5 -420.7 Q35.4 -417.8 36.0 -417.45 L38.35 -417.15 39.15 -417.05 Q40.8 -414.9 43.65 -412.8 L50.6 -408.3 Q52.85 -406.9 54.55 -405.5 58.1 -402.6 59.3 -399.65 L56.6 -399.15 56.4 -399.15 56.15 -399.05 56.2 -399.1 56.25 -399.2 56.1 -399.3 56.1 -399.15 55.0 -399.25 43.55 -399.75 36.25 -399.05 37.05 -399.85 Q38.0 -400.8 39.35 -401.75 L43.95 -404.6 42.55 -405.45 Q40.1 -406.6 37.3 -407.45 L33.2 -408.3 32.9 -408.05 32.15 -407.3 Q32.8 -408.35 33.75 -411.65 L33.75 -412.05 Q31.75 -409.05 24.9 -402.25 19.15 -396.5 19.2 -395.6 22.45 -389.4 23.75 -386.15 L22.55 -385.5 21.6 -384.9 22.15 -384.9 22.5 -384.95 23.25 -384.95 26.65 -384.65 29.85 -384.45 31.45 -384.4 32.15 -384.45 38.6 -385.25 41.6 -386.25 48.3 -387.6 49.1 -387.8 49.35 -387.85 49.9 -387.95 50.05 -388.05 49.95 -387.85 50.05 -387.9 52.65 -387.9 54.3 -388.0 51.75 -385.35 51.4 -384.95 49.05 -382.8 50.55 -382.9 52.5 -383.4 56.15 -384.55 57.9 -385.3 58.3 -385.3 Q61.4 -385.45 64.85 -383.65 68.4 -381.75 68.6 -379.6 68.75 -377.15 62.25 -371.0 L57.5 -366.8 53.75 -363.6 52.8 -362.85 Q45.75 -357.35 42.75 -354.45 39.75 -351.55 38.4 -348.6 35.05 -345.05 33.45 -341.5 30.6 -342.2 27.35 -343.7 20.65 -346.85 18.25 -351.55 19.2 -354.55 15.75 -358.5 L14.65 -359.55 12.85 -360.9 12.8 -360.95 11.7 -361.55 10.55 -363.45 7.65 -368.1 6.0 -370.9 5.95 -371.0 6.05 -370.9 7.15 -369.95 9.1 -368.2 9.55 -367.75 11.95 -365.6 15.35 -362.45 16.75 -361.1 17.3 -360.55 18.75 -360.35 24.85 -360.3 Q29.75 -360.55 36.1 -362.05 40.55 -363.15 45.65 -364.8 50.7 -366.45 54.2 -368.25 L57.25 -370.05 57.95 -370.55 Q62.5 -373.95 62.2 -377.85 62.1 -379.05 61.65 -380.1 60.9 -382.0 59.55 -381.9 58.8 -381.9 56.45 -380.9 L51.55 -378.8 Q44.85 -375.85 41.35 -375.65 37.8 -375.5 33.5 -377.0 31.0 -377.85 29.45 -379.0 L28.3 -380.75 27.95 -380.6 24.0 -378.65 18.1 -375.7 18.0 -376.1 Q19.1 -377.35 22.0 -381.95 L22.4 -382.45 18.7 -385.1 17.1 -386.25 15.05 -387.55 12.4 -385.4 9.5 -382.8 10.75 -385.6 11.55 -387.25 9.85 -385.8 8.25 -384.25 6.15 -382.25 4.25 -380.35 0.0 -375.95 -2.55 -373.1 0.45 -369.6 0.45 -369.55 0.8 -369.2 1.9 -367.85 2.25 -367.4 2.5 -367.15 2.9 -366.65 4.6 -364.8 5.35 -363.65 6.95 -360.65 7.5 -359.0 Q7.6 -357.4 6.35 -356.45 5.05 -355.5 2.6 -355.35 -0.25 -355.25 -4.05 -358.0 L-6.5 -360.0 -11.4 -364.15 -15.0 -367.0 -16.75 -368.2 -17.6 -368.75 Q-19.85 -370.15 -22.05 -371.0 L-22.15 -371.1 Q-25.2 -372.3 -28.0 -372.55 L-27.3 -373.95 -25.75 -373.5 Q-22.55 -372.45 -16.9 -369.45 L-14.95 -368.4 -12.6 -367.15 -4.3 -362.65 Q-3.25 -362.7 -2.6 -363.2 -1.9 -363.7 -2.0 -364.45 -2.1 -365.65 -3.2 -367.6 L-4.45 -369.5 -6.2 -372.1 -6.65 -372.9 Q-7.85 -373.95 -10.3 -374.4 -12.85 -374.9 -12.95 -376.85 L-12.75 -378.25 Q-11.7 -381.35 -5.85 -386.55 L0.15 -393.7 1.05 -394.75 Q7.85 -402.55 13.7 -408.4 L22.85 -417.6 29.65 -424.95 Q33.75 -427.4 38.5 -429.0 L41.8 -430.1 42.95 -433.05 Q44.65 -437.15 46.8 -439.85 L46.5 -437.5 Q46.05 -433.8 46.5 -431.4 47.65 -424.55 53.5 -418.85 L56.3 -416.5 59.15 -414.1 Q64.15 -419.45 73.2 -423.6 L73.2 -423.65 75.35 -424.55 77.75 -425.5 75.2 -426.0 72.4 -426.6 67.1 -427.6 67.1 -428.05 71.25 -429.4 74.4 -430.45 Q74.65 -430.5 74.9 -430.65 L76.4 -431.15 78.25 -431.8 80.65 -431.35 82.4 -431.05 82.45 -431.05 82.45 -431.0 82.4 -431.0 Q83.15 -429.85 87.3 -429.55 89.6 -429.4 92.05 -429.5 L92.1 -429.5 92.05 -429.3 Q91.15 -429.25 88.65 -427.75 86.05 -426.1 85.1 -424.75 83.9 -423.05 82.55 -421.65 L81.25 -420.5 Q80.95 -420.05 80.55 -417.55 L80.05 -414.8 M0.95 -337.45 L7.0 -339.65 12.65 -341.6 Q13.65 -341.65 16.95 -338.8 L18.15 -337.75 20.35 -335.9 22.65 -333.3 Q21.7 -332.7 15.55 -329.8 L9.15 -326.8 8.2 -326.75 7.8 -326.7 7.35 -326.7 6.4 -326.65 6.3 -326.65 5.55 -326.6 4.95 -328.4 4.75 -328.95 Q2.85 -334.4 0.95 -337.45 M33.05 -328.95 L33.0 -328.95 32.95 -328.9 32.85 -328.9 32.85 -329.0 32.9 -329.0 33.05 -328.95 M18.35 -325.45 L20.35 -325.05 34.1 -326.1 34.75 -324.7 35.2 -323.7 34.2 -322.8 30.8 -319.75 30.85 -319.55 Q33.85 -320.3 36.25 -321.3 37.45 -318.2 37.7 -315.45 L37.8 -313.9 Q37.85 -310.0 36.95 -306.25 36.0 -302.3 33.9 -298.55 L32.75 -296.6 27.05 -292.4 Q25.35 -291.25 23.85 -290.4 16.55 -286.35 7.5 -285.9 1.95 -285.65 -2.35 -287.5 -2.1 -297.65 -1.15 -302.6 L-0.8 -304.4 -0.2 -307.45 Q0.05 -309.15 -0.05 -312.1 L-0.25 -314.55 Q-0.4 -316.75 -3.45 -319.0 L-3.9 -319.25 -10.15 -323.2 -10.1 -324.75 -10.15 -325.7 Q-7.95 -325.0 -4.1 -324.6 L-3.05 -324.5 6.15 -324.1 6.15 -324.55 6.35 -324.6 6.3 -324.15 10.7 -324.25 10.85 -324.25 Q13.65 -324.4 18.35 -325.45 M81.1 -345.75 L79.75 -344.85 Q77.95 -343.85 75.8 -343.75 72.4 -343.6 68.1 -344.75 65.55 -345.4 64.35 -346.2 63.5 -346.8 63.45 -347.45 63.4 -348.1 64.15 -349.35 L64.2 -349.45 Q65.2 -351.3 66.6 -351.9 L67.5 -352.2 69.55 -352.5 70.9 -352.4 71.55 -352.25 72.35 -352.0 Q76.0 -350.9 80.35 -346.45 L81.1 -345.75 M64.5 -350.7 L64.25 -350.5 64.15 -350.55 64.5 -350.7 M64.0 -365.75 L62.55 -365.1 62.5 -365.1 62.3 -365.0 62.2 -364.95 Q61.75 -364.7 61.35 -364.55 L60.85 -364.25 60.8 -364.25 60.75 -364.35 60.8 -364.4 61.3 -364.7 61.35 -364.75 62.4 -365.3 62.45 -365.35 62.8 -365.5 64.4 -366.4 64.6 -366.5 64.5 -366.4 64.0 -365.75 M82.4 -391.35 L82.2 -391.45 82.4 -391.45 82.4 -391.35 M74.7 -373.05 L74.95 -372.8 74.5 -372.5 74.7 -373.05 M74.5 -372.5 L74.3 -372.05 74.0 -372.2 74.5 -372.5 M72.6 -361.0 L72.5 -360.95 72.6 -361.1 72.6 -361.0 M21.2 -331.05 L21.8 -331.05 21.2 -330.85 21.2 -331.05 M6.0 -320.8 L6.05 -320.7 6.15 -320.7 6.0 -320.8 M6.2 -321.1 L6.4 -321.05 6.4 -321.1 6.2 -321.1 M25.0 -294.65 L25.25 -294.45 25.45 -294.7 25.0 -294.65" fill="#eccfa4" fill-rule="evenodd" stroke="none"/>
    <path d="M61.5 -448.55 L62.6 -448.6 73.45 -448.05 73.55 -448.0 Q77.5 -447.25 81.5 -445.5 L82.8 -444.85 82.7 -444.4 82.7 -444.3 81.85 -444.25 77.95 -443.95 74.6 -445.2 73.7 -445.45 72.05 -446.0 Q66.3 -447.85 61.5 -448.55 M97.05 -428.75 L97.95 -428.65 95.95 -427.8 Q91.7 -425.85 87.6 -422.55 83.05 -418.95 80.05 -414.8 L80.55 -417.55 Q80.95 -420.05 81.25 -420.5 L82.55 -421.65 Q83.9 -423.05 85.1 -424.75 86.05 -426.1 88.65 -427.75 91.15 -429.25 92.05 -429.3 L92.1 -429.5 97.05 -428.75 M74.95 -404.15 L74.6 -402.75 74.45 -401.9 74.35 -401.45 76.1 -403.0 76.95 -403.7 80.35 -406.25 79.3 -404.65 75.35 -398.35 75.4 -398.15 80.5 -400.45 85.95 -402.65 84.75 -401.15 Q83.95 -400.3 82.65 -399.9 L85.05 -400.35 87.45 -401.1 86.75 -400.15 83.55 -398.65 82.0 -397.8 Q79.15 -396.2 77.6 -394.8 76.35 -393.65 75.9 -392.7 L75.9 -392.6 75.85 -392.45 76.2 -392.45 77.75 -392.9 79.9 -393.55 80.35 -393.7 83.35 -394.55 82.55 -393.1 79.55 -389.05 77.35 -386.3 Q73.8 -383.8 72.6 -382.5 L72.25 -382.15 72.1 -381.9 72.05 -381.85 71.95 -381.65 Q68.6 -376.9 66.4 -373.2 L66.25 -372.8 65.5 -370.9 65.3 -370.45 64.75 -369.05 64.2 -368.0 63.05 -366.35 62.6 -365.8 62.3 -365.5 61.35 -364.75 61.25 -364.7 60.65 -364.35 60.75 -364.35 60.8 -364.25 60.85 -364.25 61.35 -364.55 Q61.75 -364.7 62.2 -364.95 L62.3 -365.0 62.5 -365.1 62.55 -365.1 64.0 -365.75 61.9 -363.3 61.55 -362.95 Q57.8 -358.7 57.05 -357.45 L56.85 -357.2 56.85 -357.15 59.0 -357.65 60.4 -358.3 63.3 -360.0 64.25 -360.6 63.85 -357.9 63.6 -356.95 63.5 -356.75 62.4 -353.2 60.55 -348.75 64.05 -350.5 64.15 -350.55 64.25 -350.5 64.5 -350.7 64.95 -351.0 Q65.7 -351.55 66.6 -351.9 65.2 -351.3 64.2 -349.45 L64.15 -349.35 Q63.4 -348.1 63.45 -347.45 63.5 -346.8 64.35 -346.2 65.55 -345.4 68.1 -344.75 72.4 -343.6 75.8 -343.75 77.95 -343.85 79.75 -344.85 L81.1 -345.75 Q86.85 -340.25 90.45 -340.4 95.85 -340.65 99.9 -347.2 101.1 -349.0 101.85 -350.95 103.8 -356.05 103.05 -361.8 L104.0 -359.85 Q105.7 -355.95 106.0 -351.75 106.2 -349.7 105.2 -344.15 L105.3 -344.05 Q107.85 -347.5 108.9 -351.15 L109.1 -352.0 Q109.5 -353.85 109.5 -356.1 L109.15 -359.4 108.85 -360.95 Q107.75 -365.5 105.2 -368.35 L102.65 -370.65 107.1 -370.8 Q108.35 -371.05 108.75 -372.55 L108.8 -374.45 108.75 -374.85 Q108.5 -377.4 107.3 -378.7 L107.45 -378.8 Q109.4 -377.05 110.9 -374.95 L112.3 -372.75 112.85 -371.8 114.15 -368.8 Q115.05 -366.4 115.5 -363.7 115.95 -360.8 115.75 -358.15 114.8 -349.85 106.65 -342.95 L104.6 -341.35 101.75 -339.45 Q99.95 -338.35 98.0 -337.4 L97.7 -337.3 96.9 -336.95 93.3 -335.6 90.45 -335.15 Q84.85 -334.85 78.7 -336.05 L77.8 -336.3 77.7 -336.3 76.1 -336.7 74.35 -337.15 Q71.45 -337.95 69.35 -338.95 66.35 -340.25 64.7 -341.9 L64.45 -342.2 63.75 -342.9 63.55 -342.05 60.8 -344.7 57.75 -330.25 57.8 -330.2 57.7 -330.1 57.25 -329.45 56.55 -328.4 55.0 -326.25 Q52.6 -323.0 50.5 -321.25 L54.95 -323.2 Q53.05 -319.45 50.4 -316.6 51.4 -316.75 54.9 -319.55 58.45 -322.35 59.05 -322.45 L54.7 -312.1 52.3 -307.0 49.45 -301.45 44.95 -297.85 Q41.15 -295.15 31.95 -290.1 24.55 -285.95 18.1 -284.1 14.85 -283.2 11.25 -282.6 L3.3 -281.9 Q1.55 -281.8 -1.35 -282.55 L-2.8 -282.9 -3.9 -284.55 -4.05 -285.0 -4.45 -285.35 -6.2 -288.45 -7.35 -290.9 -4.35 -288.55 -2.35 -287.5 Q1.95 -285.65 7.5 -285.9 16.55 -286.35 23.85 -290.4 25.35 -291.25 27.05 -292.4 L32.75 -296.6 33.9 -298.55 Q36.0 -302.3 36.95 -306.25 37.85 -310.0 37.8 -313.9 L37.7 -315.45 Q37.45 -318.2 36.25 -321.3 33.85 -320.3 30.85 -319.55 L30.8 -319.75 34.2 -322.8 35.2 -323.7 34.75 -324.7 34.1 -326.1 20.35 -325.05 18.35 -325.45 24.95 -327.3 Q31.35 -329.15 32.85 -329.0 L32.85 -328.9 32.95 -328.9 33.0 -328.95 33.05 -328.95 33.1 -328.95 37.45 -329.55 42.0 -329.3 Q40.7 -330.85 37.15 -331.4 L32.1 -331.65 32.0 -331.65 27.2 -331.5 23.45 -331.2 25.7 -330.9 27.65 -330.6 Q22.4 -328.55 17.15 -327.7 L9.15 -326.8 15.55 -329.8 Q21.7 -332.7 22.65 -333.3 L20.35 -335.9 18.15 -337.75 16.95 -338.8 Q13.65 -341.65 12.65 -341.6 L7.0 -339.65 0.95 -337.45 0.05 -338.95 Q-5.35 -346.15 -15.55 -345.65 L-15.6 -345.65 -15.75 -348.1 -10.05 -349.0 -7.4 -348.9 -6.75 -347.95 -5.0 -347.25 Q-0.85 -345.3 0.85 -340.6 7.2 -343.35 11.25 -345.6 15.85 -348.2 17.5 -350.05 L18.25 -351.55 Q20.65 -346.85 27.35 -343.7 30.6 -342.2 33.45 -341.5 35.05 -345.05 38.4 -348.6 39.75 -351.55 42.75 -354.45 45.75 -357.35 52.8 -362.85 L53.75 -363.6 57.5 -366.8 62.25 -371.0 Q68.75 -377.15 68.6 -379.6 68.4 -381.75 64.85 -383.65 61.4 -385.45 58.3 -385.3 L57.9 -385.3 56.15 -384.55 52.5 -383.4 50.55 -382.9 49.05 -382.8 51.4 -384.95 51.75 -385.35 54.3 -388.0 52.65 -387.9 50.05 -387.9 49.95 -387.85 50.05 -388.05 49.9 -387.95 49.35 -387.85 49.1 -387.8 48.3 -387.6 41.6 -386.25 38.6 -385.25 32.15 -384.45 31.45 -384.4 29.85 -384.45 26.65 -384.65 23.25 -384.95 22.5 -384.95 22.15 -384.9 21.6 -384.9 22.55 -385.5 23.75 -386.15 Q22.45 -389.4 19.2 -395.6 19.15 -396.5 24.9 -402.25 31.75 -409.05 33.75 -412.05 L33.75 -411.65 Q32.8 -408.35 32.15 -407.3 L31.65 -406.8 29.8 -404.75 27.8 -402.05 26.85 -400.4 Q25.6 -398.1 25.3 -396.35 28.15 -397.55 32.75 -398.5 L36.25 -399.05 43.55 -399.75 55.0 -399.25 56.1 -399.15 56.1 -399.3 56.25 -399.2 56.2 -399.1 56.15 -399.05 56.4 -399.15 56.6 -399.15 59.3 -399.65 Q58.1 -402.6 54.55 -405.5 52.85 -406.9 50.6 -408.3 L43.65 -412.8 Q40.8 -414.9 39.15 -417.05 L38.35 -417.15 36.0 -417.45 Q35.4 -417.8 34.5 -420.7 L33.8 -423.55 Q33.7 -424.15 37.65 -426.4 L41.3 -428.45 40.8 -425.65 40.75 -424.55 40.75 -423.75 40.9 -422.7 41.1 -421.9 Q41.25 -421.1 41.75 -420.1 42.15 -419.1 42.85 -418.05 44.2 -416.0 46.4 -413.75 L47.6 -412.6 48.4 -411.9 Q49.6 -410.95 50.75 -410.25 52.5 -409.25 54.3 -408.8 L54.95 -408.7 55.1 -408.55 59.9 -404.75 61.35 -403.75 62.85 -402.4 64.85 -399.85 65.7 -398.25 Q66.05 -399.5 65.95 -401.3 L65.9 -402.25 66.55 -401.7 68.9 -399.95 Q69.95 -400.0 73.2 -402.7 L74.95 -404.15 M-28.0 -372.55 Q-25.2 -372.3 -22.15 -371.1 L-22.05 -371.0 Q-19.85 -370.15 -17.6 -368.75 L-16.75 -368.2 -15.0 -367.0 -11.4 -364.15 -6.5 -360.0 -4.05 -358.0 Q-0.25 -355.25 2.6 -355.35 5.05 -355.5 6.35 -356.45 7.6 -357.4 7.5 -359.0 L6.95 -360.65 5.35 -363.65 4.6 -364.8 2.9 -366.65 2.5 -367.15 2.25 -367.4 1.9 -367.85 0.8 -369.2 0.45 -369.55 0.45 -369.6 -2.55 -373.1 0.0 -375.95 4.25 -380.35 6.15 -382.25 8.25 -384.25 9.85 -385.8 11.55 -387.25 10.75 -385.6 9.5 -382.8 8.15 -380.25 7.8 -379.45 4.65 -373.25 4.25 -372.55 5.95 -371.0 6.0 -370.9 7.65 -368.1 10.55 -363.45 11.7 -361.55 9.55 -362.5 6.65 -363.5 8.85 -361.85 Q9.45 -361.35 10.25 -360.8 L10.4 -360.65 Q13.25 -358.3 13.65 -355.4 13.9 -354.2 12.95 -352.65 9.8 -351.3 7.9 -351.2 3.5 -351.0 -1.4 -353.95 -3.75 -355.35 -9.2 -359.85 L-10.15 -360.6 Q-15.85 -365.35 -19.45 -367.3 -21.35 -368.3 -23.15 -368.9 -26.2 -370.0 -29.3 -370.0 L-30.4 -370.0 Q-33.65 -369.8 -36.6 -368.6 L-38.7 -367.5 -38.45 -369.55 -38.05 -370.45 -37.05 -370.6 Q-35.0 -370.9 -33.9 -371.55 -32.4 -372.55 -30.45 -372.65 L-28.0 -372.55 M28.15 -404.95 L28.05 -404.9 28.35 -404.65 28.4 -404.7 28.15 -404.95 M43.05 -397.95 L42.9 -397.95 42.95 -397.85 43.05 -397.85 43.05 -397.95 M92.05 -429.5 Q89.6 -429.4 87.3 -429.55 83.15 -429.85 82.4 -431.0 L82.45 -431.0 82.45 -431.05 87.35 -430.25 89.5 -429.9 92.05 -429.5 M94.95 -405.15 L94.85 -405.35 94.95 -405.35 96.3 -405.75 95.0 -405.2 94.95 -405.15 M11.35 -282.4 L11.3 -282.4 11.25 -282.6 11.35 -282.4 M74.7 -373.05 L74.8 -373.2 76.5 -376.05 76.55 -374.95 Q76.6 -374.0 76.8 -373.3 77.1 -372.2 77.75 -371.6 L77.85 -371.5 78.6 -371.1 79.25 -370.95 79.7 -370.85 80.65 -370.85 80.85 -370.65 78.7 -369.25 78.1 -368.7 77.75 -368.45 76.5 -367.3 76.4 -367.15 Q74.35 -367.45 73.9 -369.05 L73.7 -370.0 74.0 -370.0 73.85 -370.7 73.7 -370.05 73.6 -370.85 73.6 -371.2 73.65 -371.3 74.0 -372.2 74.3 -372.05 74.5 -372.5 74.95 -372.8 74.7 -373.05 M41.5 -394.7 L41.55 -394.75 41.5 -394.75 41.5 -394.7 M32.1 -390.2 L32.0 -390.2 32.0 -390.15 32.1 -390.2 M25.0 -394.95 L24.95 -394.95 24.9 -394.45 25.0 -394.95 M21.2 -331.05 L21.2 -330.85 21.8 -331.05 21.2 -331.05 M6.0 -320.8 L6.15 -320.7 6.05 -320.7 6.0 -320.8" fill="#e6bf88" fill-rule="evenodd" stroke="none"/>
    <path d="M70.8 -442.85 L65.1 -441.3 Q62.25 -440.3 60.75 -439.1 L61.65 -439.05 66.25 -438.95 66.4 -438.7 62.6 -437.15 59.8 -436.2 68.15 -435.7 74.1 -435.3 74.5 -435.3 78.4 -435.0 74.55 -434.5 69.3 -433.8 69.2 -433.75 69.1 -433.75 68.8 -433.75 69.1 -433.65 69.15 -433.65 69.3 -433.65 74.75 -432.45 78.25 -431.8 76.4 -431.15 74.9 -430.65 Q74.65 -430.5 74.4 -430.45 L71.25 -429.4 67.1 -428.05 67.1 -427.6 72.4 -426.6 75.2 -426.0 77.75 -425.5 75.35 -424.55 73.2 -423.65 73.2 -423.6 Q64.15 -419.45 59.15 -414.1 L56.3 -416.5 53.5 -418.85 Q47.65 -424.55 46.5 -431.4 46.05 -433.8 46.5 -437.5 L46.8 -439.85 Q44.65 -437.15 42.95 -433.05 L41.8 -430.1 38.5 -429.0 Q33.75 -427.4 29.65 -424.95 L22.85 -417.6 13.7 -408.4 Q7.85 -402.55 1.05 -394.75 L0.15 -393.7 -5.85 -386.55 Q-11.7 -381.35 -12.75 -378.25 L-12.95 -376.85 Q-12.85 -374.9 -10.3 -374.4 -7.85 -373.95 -6.65 -372.9 L-6.2 -372.1 -4.45 -369.5 -3.2 -367.6 Q-2.1 -365.65 -2.0 -364.45 -1.9 -363.7 -2.6 -363.2 -3.25 -362.7 -4.3 -362.65 L-12.6 -367.15 -14.95 -368.4 -16.9 -369.45 Q-22.55 -372.45 -25.75 -373.5 L-27.3 -373.95 -27.1 -374.45 -24.8 -378.75 -22.75 -380.1 -19.45 -382.5 -17.95 -383.65 Q-13.55 -387.05 -12.25 -388.8 -12.3 -389.7 -13.65 -389.6 -16.2 -389.5 -18.3 -388.5 L-15.5 -391.85 Q-12.1 -395.65 -3.75 -402.4 L-3.4 -402.7 -2.15 -403.65 0.75 -405.95 1.7 -406.7 8.65 -411.75 17.55 -418.05 20.25 -420.4 Q22.75 -422.8 26.35 -426.95 L30.55 -429.95 31.45 -430.55 32.75 -431.85 34.25 -434.0 Q36.55 -437.9 37.35 -438.85 39.6 -441.5 43.9 -443.7 L43.95 -443.7 45.4 -444.4 45.5 -443.95 45.7 -444.05 49.7 -444.65 Q53.8 -444.85 59.35 -444.45 L63.85 -443.95 70.85 -443.0 70.8 -442.85 M36.25 -399.05 L32.75 -398.5 Q28.15 -397.55 25.3 -396.35 25.6 -398.1 26.85 -400.4 L27.8 -402.05 29.8 -404.75 31.65 -406.8 32.15 -407.3 32.9 -408.05 33.2 -408.3 37.3 -407.45 Q40.1 -406.6 42.55 -405.45 L43.95 -404.6 39.35 -401.75 Q38.0 -400.8 37.05 -399.85 L36.25 -399.05 M-15.6 -345.65 L-15.55 -345.65 Q-5.35 -346.15 0.05 -338.95 L0.95 -337.45 Q2.85 -334.4 4.75 -328.95 L4.95 -328.4 5.55 -326.6 5.1 -326.6 4.95 -326.55 -4.8 -327.2 -10.7 -327.85 -10.75 -327.85 -10.9 -327.85 -10.9 -329.65 -10.85 -330.25 Q-10.85 -336.35 -10.4 -341.55 -10.45 -342.2 -13.45 -343.35 L-15.6 -344.1 -15.6 -345.65 M-2.35 -287.5 L-4.35 -288.55 -7.35 -290.9 Q-9.2 -294.9 -9.8 -298.3 L-10.35 -303.95 -10.4 -304.65 Q-8.65 -307.1 -8.8 -309.1 -9.05 -312.25 -9.85 -313.7 L-10.3 -314.35 -10.25 -316.75 -10.1 -316.75 Q-7.8 -315.8 -6.7 -315.85 -5.1 -315.95 -4.6 -317.1 L-3.9 -319.1 -3.45 -319.0 Q-0.4 -316.75 -0.25 -314.55 L-0.05 -312.1 Q0.05 -309.15 -0.2 -307.45 L-0.8 -304.4 -1.15 -302.6 Q-2.1 -297.65 -2.35 -287.5 M107.45 -378.8 L107.3 -378.7 Q108.5 -377.4 108.75 -374.85 L108.8 -374.45 108.75 -372.55 Q108.35 -371.05 107.1 -370.8 L102.65 -370.65 99.95 -372.15 98.35 -372.7 Q94.7 -373.85 90.0 -373.6 85.8 -373.4 81.85 -371.25 L81.25 -370.9 80.85 -370.65 80.65 -370.85 79.7 -370.85 79.25 -370.95 78.6 -371.1 77.85 -371.5 77.75 -371.6 Q77.1 -372.2 76.8 -373.3 76.6 -374.0 76.55 -374.95 L76.5 -376.05 77.9 -377.95 78.85 -379.0 79.1 -379.3 80.2 -380.4 Q84.9 -384.7 90.05 -384.95 97.0 -385.3 102.65 -382.2 104.2 -381.35 105.65 -380.3 L106.8 -379.4 107.45 -378.8 M9.5 -382.8 L12.4 -385.4 15.05 -387.55 17.1 -386.25 18.7 -385.1 22.4 -382.45 22.0 -381.95 Q19.1 -377.35 18.0 -376.1 L18.1 -375.7 24.0 -378.65 27.95 -380.6 28.3 -380.75 29.45 -379.0 Q31.0 -377.85 33.5 -377.0 37.8 -375.5 41.35 -375.65 44.85 -375.85 51.55 -378.8 L56.45 -380.9 Q58.8 -381.9 59.55 -381.9 60.9 -382.0 61.65 -380.1 62.1 -379.05 62.2 -377.85 62.5 -373.95 57.95 -370.55 L57.25 -370.05 54.2 -368.25 Q50.7 -366.45 45.65 -364.8 40.55 -363.15 36.1 -362.05 29.75 -360.55 24.85 -360.3 L18.75 -360.35 17.3 -360.55 16.75 -361.1 15.35 -362.45 11.95 -365.6 9.55 -367.75 9.1 -368.2 7.15 -369.95 6.05 -370.9 5.95 -371.0 4.25 -372.55 4.65 -373.25 7.8 -379.45 8.15 -380.25 9.5 -382.8 M85.15 -381.85 Q82.95 -381.25 81.25 -379.25 79.45 -377.3 79.65 -375.3 L87.6 -375.7 Q90.5 -376.1 92.75 -377.5 94.6 -378.7 94.55 -379.4 94.45 -380.9 85.4 -381.85 L85.15 -381.85" fill="#f0dab9" fill-rule="evenodd" stroke="none"/>
    <path d="M26.35 -426.95 Q22.75 -422.8 20.25 -420.4 L17.55 -418.05 8.65 -411.75 1.7 -406.7 0.75 -405.95 -2.15 -403.65 -3.4 -402.7 -3.75 -402.4 Q-12.1 -395.65 -15.5 -391.85 L-18.3 -388.5 Q-16.2 -389.5 -13.65 -389.6 -12.3 -389.7 -12.25 -388.8 -13.55 -387.05 -17.95 -383.65 L-19.45 -382.5 -22.75 -380.1 -24.8 -378.75 -27.1 -374.45 -27.3 -373.95 -28.0 -372.55 -30.45 -372.65 Q-32.4 -372.55 -33.9 -371.55 -35.0 -370.9 -37.05 -370.6 L-38.05 -370.45 Q-36.7 -374.05 -31.75 -379.45 L-23.35 -387.85 -18.6 -392.05 -4.6 -403.6 -4.3 -403.8 -4.2 -403.85 -2.3 -405.4 1.0 -408.0 Q9.8 -414.9 19.1 -421.65 L26.35 -426.95 M-10.9 -327.85 L-10.9 -327.7 -11.35 -327.9 Q-15.15 -329.25 -16.85 -328.9 L-16.35 -329.5 -15.8 -330.2 -15.8 -330.25 Q-15.4 -331.1 -15.65 -332.55 -16.0 -334.5 -15.7 -340.7 L-15.6 -344.1 -13.45 -343.35 Q-10.45 -342.2 -10.4 -341.55 -10.85 -336.35 -10.85 -330.25 L-10.9 -329.65 -10.9 -327.85 M-3.9 -319.25 L-3.9 -319.1 -4.6 -317.1 Q-5.1 -315.95 -6.7 -315.85 -7.8 -315.8 -10.1 -316.75 L-10.25 -316.8 -10.15 -323.2 -3.9 -319.25" fill="#ffecd1" fill-rule="evenodd" stroke="none"/>
    <path d="M28.15 -404.95 L28.4 -404.7 28.35 -404.65 28.05 -404.9 28.15 -404.95" fill="#ab8c28" fill-rule="evenodd" stroke="none"/>
    <path d="M71.35 -442.9 L70.85 -442.85 70.8 -442.85 70.85 -443.0 71.35 -442.9 M66.4 -438.7 L66.25 -438.95 66.9 -438.95 66.4 -438.7 M85.15 -381.85 L85.4 -381.85 Q94.45 -380.9 94.55 -379.4 94.6 -378.7 92.75 -377.5 90.5 -376.1 87.6 -375.7 L79.65 -375.3 Q79.45 -377.3 81.25 -379.25 82.95 -381.25 85.15 -381.85 M25.0 -394.95 L24.9 -394.45 24.95 -394.95 25.0 -394.95 M6.2 -321.1 L6.4 -321.1 6.4 -321.05 6.2 -321.1 M25.0 -294.65 L25.45 -294.7 25.25 -294.45 25.0 -294.65 M-16.15 -349.15 L-15.85 -349.15 -15.85 -348.9 -16.15 -349.15 M-3.45 -319.0 L-3.9 -319.1 -3.9 -319.25 -3.45 -319.0 M-10.1 -316.75 L-10.25 -316.75 -10.25 -316.8 -10.1 -316.75" fill="#f3e1c7" fill-rule="evenodd" stroke="none"/>
    <path d="M43.05 -397.95 L43.05 -397.85 42.95 -397.85 42.9 -397.95 43.05 -397.95" fill="#151540" fill-rule="evenodd" stroke="none"/>
    <path d="M86.85 -410.95 L90.6 -413.6 84.15 -407.95 80.0 -403.9 81.55 -403.8 83.5 -403.7 94.15 -405.25 94.85 -405.35 94.95 -405.15 94.3 -404.9 Q91.7 -403.85 89.9 -403.3 89.9 -402.95 89.55 -402.95 L92.95 -402.1 88.6 -400.85 86.75 -400.15 87.45 -401.1 85.05 -400.35 82.65 -399.9 Q83.95 -400.3 84.75 -401.15 L85.95 -402.65 80.5 -400.45 75.4 -398.15 75.35 -398.35 79.3 -404.65 80.35 -406.25 82.7 -408.0 86.85 -410.95 M-7.4 -348.9 L-10.05 -349.0 -15.75 -348.1 -15.85 -348.9 -15.85 -349.15 -16.15 -349.15 -23.6 -354.5 -29.5 -358.9 Q-38.35 -365.6 -38.6 -367.25 L-38.7 -367.5 -36.6 -368.6 Q-33.65 -369.8 -30.4 -370.0 L-29.3 -370.0 Q-26.2 -370.0 -23.15 -368.9 -21.35 -368.3 -19.45 -367.3 -15.85 -365.35 -10.15 -360.6 L-9.2 -359.85 Q-3.75 -355.35 -1.4 -353.95 3.5 -351.0 7.9 -351.2 9.8 -351.3 12.95 -352.65 10.65 -349.25 2.2 -344.15 0.25 -347.0 -4.15 -351.25 -8.35 -355.2 -11.9 -357.75 L-11.55 -355.5 Q-11.35 -354.45 -9.5 -351.95 L-7.4 -348.9 M9.15 -326.8 L17.15 -327.7 Q22.4 -328.55 27.65 -330.6 L25.7 -330.9 23.45 -331.2 27.2 -331.5 32.0 -331.65 32.1 -331.65 37.15 -331.4 Q40.7 -330.85 42.0 -329.3 L37.45 -329.55 33.1 -328.95 33.05 -328.95 32.9 -329.0 32.85 -329.0 Q31.35 -329.15 24.95 -327.3 L18.35 -325.45 Q13.65 -324.4 10.85 -324.25 L10.7 -324.25 6.3 -324.15 6.35 -324.6 6.15 -324.55 6.15 -324.1 -3.05 -324.5 -4.1 -324.6 Q-7.95 -325.0 -10.15 -325.7 L-10.2 -327.45 -10.9 -327.7 -10.9 -327.85 -10.75 -327.85 -10.7 -327.85 -4.8 -327.2 4.95 -326.55 5.1 -326.6 5.55 -326.6 6.3 -326.65 6.4 -326.65 7.35 -326.7 7.8 -326.7 8.2 -326.75 9.15 -326.8 M11.25 -282.6 Q14.85 -283.2 18.1 -284.1 24.55 -285.95 31.95 -290.1 41.15 -295.15 44.95 -297.85 L49.45 -301.45 52.3 -307.0 54.7 -312.1 59.05 -322.45 Q58.45 -322.35 54.9 -319.55 51.4 -316.75 50.4 -316.6 53.05 -319.45 54.95 -323.2 L55.1 -323.3 55.2 -323.35 Q59.85 -325.8 62.95 -329.3 L63.1 -327.85 Q63.6 -325.15 64.65 -322.15 L64.3 -322.05 Q64.4 -318.7 63.05 -315.15 61.7 -311.65 58.9 -307.95 L58.45 -307.3 Q53.9 -301.3 46.4 -295.85 L44.6 -294.55 Q42.15 -292.9 39.75 -291.4 L35.8 -289.2 Q33.7 -288.0 31.5 -286.95 25.25 -284.0 18.8 -282.25 L17.95 -282.0 Q15.75 -282.85 13.65 -282.75 L13.0 -282.65 11.35 -282.4 11.25 -282.6 M57.8 -330.2 L57.75 -330.25 60.8 -344.7 63.55 -342.05 Q61.6 -336.2 57.8 -330.2 M77.35 -386.3 L79.55 -389.05 82.55 -393.1 83.35 -394.55 90.05 -395.95 94.45 -396.15 Q86.9 -392.6 80.95 -388.75 L78.3 -387.0 78.2 -386.95 77.35 -386.3 M82.4 -391.35 L82.4 -391.45 82.2 -391.45 82.4 -391.35" fill="#d1ac7a" fill-rule="evenodd" stroke="none"/>
    <path d="M54.95 -323.2 L50.5 -321.25 Q52.6 -323.0 55.0 -326.25 L56.55 -328.4 57.25 -329.45 57.7 -330.1 57.8 -330.2 Q61.6 -336.2 63.55 -342.05 L63.75 -342.9 64.45 -342.2 64.7 -341.9 Q66.35 -340.25 69.35 -338.95 71.45 -337.95 74.35 -337.15 L76.1 -336.7 77.7 -336.3 77.8 -336.3 78.7 -336.05 Q77.95 -335.25 72.05 -333.65 67.1 -332.35 65.4 -332.15 L65.1 -332.15 65.5 -331.9 Q67.5 -330.6 74.3 -330.95 L81.55 -331.95 82.65 -332.0 70.95 -325.8 Q74.3 -324.95 84.15 -329.45 91.25 -332.7 96.9 -336.95 L97.7 -337.3 98.0 -337.4 Q99.95 -338.35 101.75 -339.45 L104.6 -341.35 106.65 -342.95 Q114.8 -349.85 115.75 -358.15 115.95 -360.8 115.5 -363.7 115.05 -366.4 114.15 -368.8 L112.85 -371.8 112.7 -372.75 111.3 -383.15 Q111.1 -385.2 111.45 -385.85 112.85 -383.55 115.9 -375.45 L116.75 -372.95 118.05 -369.0 Q119.3 -364.75 119.5 -362.05 123.45 -366.2 126.0 -369.4 L129.1 -373.55 130.55 -376.15 129.65 -373.55 128.6 -370.8 128.05 -369.5 Q125.95 -364.1 123.35 -358.7 121.35 -354.35 118.15 -349.8 L115.75 -346.5 115.2 -346.1 115.2 -345.75 115.75 -346.5 120.45 -350.0 Q125.0 -353.15 126.7 -353.55 126.5 -352.8 125.8 -352.15 L124.3 -350.8 124.65 -350.85 Q125.9 -351.45 128.7 -353.25 L132.9 -355.95 127.7 -351.55 122.95 -347.8 123.25 -347.8 Q125.6 -349.15 139.7 -355.7 151.65 -361.9 156.8 -367.8 L157.2 -365.05 Q144.2 -348.8 121.65 -338.95 114.85 -336.0 107.9 -333.95 L105.0 -333.2 104.65 -333.05 103.15 -332.7 103.15 -332.8 102.0 -332.6 93.55 -331.15 93.45 -331.0 Q96.4 -329.4 102.4 -329.2 L110.25 -329.35 108.5 -328.55 Q102.85 -326.1 94.5 -325.0 L94.7 -324.75 92.2 -325.2 86.4 -325.9 83.6 -325.5 Q81.4 -325.1 80.6 -324.6 L80.55 -324.45 Q85.2 -322.7 90.2 -320.15 94.8 -317.8 96.95 -317.05 101.25 -315.65 110.6 -315.4 L107.25 -313.5 Q104.95 -312.55 100.35 -312.35 92.6 -311.95 85.45 -314.75 L82.65 -316.1 Q80.15 -317.35 78.6 -318.9 L78.45 -318.2 77.6 -320.55 77.45 -320.6 Q77.25 -320.7 77.25 -320.9 76.15 -319.45 75.55 -315.7 74.7 -310.75 75.25 -303.75 72.4 -306.9 70.0 -310.95 L67.6 -315.35 66.6 -317.45 66.2 -318.3 64.65 -322.1 64.65 -322.15 Q63.6 -325.15 63.1 -327.85 L62.95 -329.3 Q59.85 -325.8 55.2 -323.35 L55.1 -323.3 54.95 -323.2 M62.6 -365.8 L63.05 -366.35 64.2 -368.0 66.7 -370.5 67.25 -371.0 68.35 -371.95 Q72.75 -375.7 77.9 -377.95 L76.5 -376.05 74.8 -373.2 74.7 -373.05 74.5 -372.5 74.0 -372.2 73.75 -372.0 73.55 -371.9 72.6 -371.25 71.85 -370.75 68.15 -368.55 64.6 -366.5 64.4 -366.4 62.8 -365.5 62.6 -365.8" fill="#b8962c" fill-rule="evenodd" stroke="none"/>
    <path d="M102.65 -370.65 L105.2 -368.35 Q107.75 -365.5 108.85 -360.95 107.4 -364.5 104.5 -366.3 102.55 -367.5 99.75 -368.0 L101.7 -365.4 Q103.15 -362.85 104.0 -359.85 L103.05 -361.8 Q103.8 -356.05 101.85 -350.95 L101.7 -354.15 Q101.2 -360.55 98.65 -364.55 L96.15 -367.95 95.8 -368.4 92.7 -368.4 89.05 -368.1 89.7 -367.6 Q92.15 -365.65 92.4 -363.2 92.75 -358.45 88.4 -355.2 84.8 -352.45 80.05 -352.25 L77.7 -352.4 76.55 -352.65 76.55 -353.05 Q81.75 -354.75 82.95 -355.45 87.15 -357.95 86.8 -362.4 86.6 -365.45 84.05 -367.15 L83.6 -367.0 Q77.45 -365.35 75.45 -362.05 L77.0 -366.55 77.15 -367.0 77.75 -368.45 78.1 -368.7 78.7 -369.25 80.85 -370.65 81.25 -370.9 81.85 -371.25 Q85.8 -373.4 90.0 -373.6 94.7 -373.85 98.35 -372.7 L99.95 -372.15 102.65 -370.65" fill="#b39465" fill-rule="evenodd" stroke="none"/>
    <path d="M101.85 -350.95 Q101.1 -349.0 99.9 -347.2 95.85 -340.65 90.45 -340.4 86.85 -340.25 81.1 -345.75 L80.35 -346.45 Q76.0 -350.9 72.35 -352.0 L71.55 -352.25 73.2 -358.4 Q73.85 -360.75 75.4 -363.85 L77.0 -366.55 75.45 -362.05 Q77.45 -365.35 83.6 -367.0 L84.05 -367.15 Q86.6 -365.45 86.8 -362.4 87.15 -357.95 82.95 -355.45 81.75 -354.75 76.55 -353.05 L76.55 -352.65 77.7 -352.4 80.05 -352.25 Q84.8 -352.45 88.4 -355.2 92.75 -358.45 92.4 -363.2 92.15 -365.65 89.7 -367.6 L89.05 -368.1 92.7 -368.4 95.8 -368.4 96.15 -367.95 98.65 -364.55 Q101.2 -360.55 101.7 -354.15 L101.85 -350.95 M84.4 -363.8 L84.25 -364.15 84.15 -364.3 82.55 -364.2 Q80.65 -363.8 78.35 -361.95 77.05 -360.95 76.5 -360.1 L76.35 -359.0 76.0 -358.0 76.5 -357.35 Q77.8 -355.6 79.3 -355.65 80.8 -355.75 82.5 -357.65 84.7 -360.05 84.4 -363.8 M93.5 -364.55 L94.15 -362.45 94.65 -360.3 Q94.85 -358.1 90.0 -353.8 L86.85 -351.05 85.95 -350.4 84.15 -349.8 83.35 -349.25 82.95 -348.6 Q83.0 -348.1 83.7 -347.15 L84.4 -345.7 Q85.05 -345.4 85.65 -345.15 L87.75 -344.65 Q92.65 -344.9 96.05 -347.85 100.1 -351.5 99.65 -358.05 L98.95 -360.5 97.85 -362.75 Q97.5 -363.4 95.6 -363.9 L93.5 -364.55" fill="#cca874" fill-rule="evenodd" stroke="none"/>
    <path d="M108.85 -360.95 L109.15 -359.4 109.5 -356.1 Q109.5 -353.85 109.1 -352.0 L108.9 -351.15 Q107.85 -347.5 105.3 -344.05 L105.2 -344.15 Q106.2 -349.7 106.0 -351.75 105.7 -355.95 104.0 -359.85 103.15 -362.85 101.7 -365.4 L99.75 -368.0 Q102.55 -367.5 104.5 -366.3 107.4 -364.5 108.85 -360.95 M66.6 -351.9 Q65.7 -351.55 64.95 -351.0 L64.5 -350.7 64.15 -350.55 64.05 -350.5 60.55 -348.75 62.4 -353.2 63.5 -356.75 63.6 -356.95 63.85 -357.9 64.25 -360.6 63.3 -360.0 60.4 -358.3 59.0 -357.65 56.85 -357.15 56.85 -357.2 57.05 -357.45 Q57.8 -358.7 61.55 -362.95 L61.9 -363.3 64.0 -365.75 64.5 -366.4 64.6 -366.5 68.15 -368.55 71.85 -370.75 72.6 -371.25 73.55 -371.9 73.75 -372.0 74.0 -372.2 73.65 -371.3 73.6 -371.2 73.6 -370.85 73.7 -370.05 73.65 -370.0 73.7 -370.0 73.9 -369.05 Q74.35 -367.45 76.4 -367.15 L76.5 -367.3 77.75 -368.45 77.15 -367.0 77.0 -366.55 75.4 -363.85 Q73.85 -360.75 73.2 -358.4 L71.55 -352.25 70.9 -352.4 69.55 -352.5 67.5 -352.2 66.6 -351.9 M93.5 -364.55 L95.6 -363.9 Q97.5 -363.4 97.85 -362.75 L98.95 -360.5 99.65 -358.05 Q100.1 -351.5 96.05 -347.85 92.65 -344.9 87.75 -344.65 L85.65 -345.15 Q85.05 -345.4 84.4 -345.7 L83.7 -347.15 Q83.0 -348.1 82.95 -348.6 L83.35 -349.25 84.15 -349.8 85.95 -350.4 86.85 -351.05 90.0 -353.8 Q94.85 -358.1 94.65 -360.3 L94.15 -362.45 93.5 -364.55 M84.4 -363.8 Q84.7 -360.05 82.5 -357.65 80.8 -355.75 79.3 -355.65 77.8 -355.6 76.5 -357.35 L76.0 -358.0 76.35 -359.0 76.5 -360.1 Q77.05 -360.95 78.35 -361.95 80.65 -363.8 82.55 -364.2 L84.15 -364.3 84.25 -364.15 84.4 -363.8 M72.6 -361.0 L72.6 -361.1 72.5 -360.95 72.6 -361.0" fill="#d4af78" fill-rule="evenodd" stroke="none"/>
    <path d="M78.7 -336.05 Q84.85 -334.85 90.45 -335.15 L93.3 -335.6 96.9 -336.95 Q91.25 -332.7 84.15 -329.45 74.3 -324.95 70.95 -325.8 L82.65 -332.0 81.55 -331.95 74.3 -330.95 Q67.5 -330.6 65.5 -331.9 L65.1 -332.15 65.4 -332.15 Q67.1 -332.35 72.05 -333.65 77.95 -335.25 78.7 -336.05" fill="#a18126" fill-rule="evenodd" stroke="none"/>
    <path d="M41.5 -394.7 L41.5 -394.75 41.55 -394.75 41.5 -394.7" fill="#447ad1" fill-rule="evenodd" stroke="none"/>
    <path d="M32.1 -390.2 L32.0 -390.15 32.0 -390.2 32.1 -390.2" fill="#948879" fill-rule="evenodd" stroke="none"/>
    <path d="M18.25 -351.55 L17.5 -350.05 Q15.85 -348.2 11.25 -345.6 7.2 -343.35 0.85 -340.6 -0.85 -345.3 -5.0 -347.25 L-6.75 -347.95 -7.4 -348.9 -9.5 -351.95 Q-11.35 -354.45 -11.55 -355.5 L-11.9 -357.75 Q-8.35 -355.2 -4.15 -351.25 0.25 -347.0 2.2 -344.15 10.65 -349.25 12.95 -352.65 13.9 -354.2 13.65 -355.4 13.25 -358.3 10.4 -360.65 L10.25 -360.8 Q9.45 -361.35 8.85 -361.85 L6.65 -363.5 9.55 -362.5 11.7 -361.55 12.8 -360.95 12.85 -360.9 14.65 -359.55 15.75 -358.5 Q19.2 -354.55 18.25 -351.55" fill="#c29f72" fill-rule="evenodd" stroke="none"/>
    <path d="M43.5 -436.3 Q43.7 -432.6 44.5 -430.25 46.85 -423.65 53.5 -419.0 54.9 -418.05 56.55 -417.1 L59.8 -415.2 63.1 -413.15 Q66.0 -410.8 67.3 -407.55 L67.6 -406.85 68.35 -404.6 68.6 -403.7 Q69.0 -401.9 68.8 -400.65 L67.75 -402.05 65.4 -404.25 63.7 -405.3 62.1 -406.1 Q59.05 -407.65 56.75 -409.05 L56.6 -409.2 55.95 -409.2 Q54.1 -409.25 52.25 -410.0 50.95 -410.5 49.65 -411.25 L48.7 -411.8 47.35 -412.75 Q44.8 -414.6 43.15 -416.4 L41.75 -418.25 40.75 -419.95 40.45 -420.7 40.15 -421.7 40.0 -422.5 39.9 -423.6 Q39.75 -424.95 39.85 -426.45 L40.1 -428.1 40.75 -431.3 Q41.75 -435.65 43.45 -438.7 L43.5 -436.3" fill="#cca730" fill-rule="evenodd" stroke="none"/>
    <path d="M22.95 -395.5 Q22.6 -396.45 22.6 -396.85 22.6 -397.25 26.4 -402.05 L25.7 -400.4 Q24.7 -398.1 24.45 -396.35 L24.45 -395.95 24.25 -395.9 23.75 -395.75 22.95 -395.5 M28.75 -385.75 L28.7 -385.55 Q25.65 -385.25 23.75 -386.0 L24.6 -387.25 25.05 -388.5 Q25.0 -389.7 23.85 -392.9 L23.15 -394.95 24.2 -394.95 24.15 -394.45 24.25 -394.95 25.55 -395.05 25.55 -394.75 26.5 -392.1 26.75 -391.5 28.6 -386.5 26.85 -386.25 28.5 -385.8 28.75 -385.75" fill="#d1ac7a" fill-rule="evenodd" stroke="none"/>
    <path d="M22.95 -395.5 L23.75 -395.75 24.25 -395.9 24.45 -395.95 26.9 -396.55 32.0 -397.5 32.3 -397.55 34.6 -397.8 38.45 -397.85 38.5 -397.85 38.5 -397.9 45.45 -397.35 47.0 -397.2 48.15 -397.0 Q54.3 -396.1 57.0 -394.5 55.1 -392.05 48.65 -389.55 L46.2 -388.7 45.6 -388.55 44.15 -388.05 44.0 -387.95 43.55 -387.85 43.35 -387.8 42.75 -387.6 37.45 -386.25 31.6 -385.45 30.4 -385.5 29.4 -385.6 28.75 -385.75 28.5 -385.8 26.85 -386.25 28.6 -386.5 26.75 -391.5 26.5 -392.1 25.55 -394.75 25.55 -395.05 24.25 -394.95 24.2 -394.95 23.15 -394.95 21.35 -394.95 22.4 -395.35 22.95 -395.5 M35.2 -387.9 L40.9 -389.6 Q43.3 -390.5 46.5 -392.25 L46.9 -392.45 48.4 -393.3 50.6 -394.6 48.3 -394.65 43.75 -394.85 36.45 -395.05 34.0 -395.15 31.7 -395.25 30.4 -395.3 29.95 -395.3 27.05 -395.1 27.2 -393.4 27.4 -392.95 28.0 -391.55 28.6 -390.25 Q29.45 -388.45 31.4 -387.0 L34.05 -387.6 35.2 -387.9" fill="#b5936a" fill-rule="evenodd" stroke="none"/>
    <path d="M36.45 -395.05 L43.75 -394.85 48.3 -394.65 50.6 -394.6 48.4 -393.3 46.9 -392.45 46.5 -392.25 Q43.3 -390.5 40.9 -389.6 L35.2 -387.9 36.0 -388.35 Q38.95 -390.15 40.3 -392.05 L35.1 -391.45 35.45 -392.2 36.45 -395.05 M28.0 -391.55 L27.4 -392.95 27.2 -393.4 27.05 -395.1 29.95 -395.3 29.9 -394.85 Q30.05 -392.7 30.6 -391.4 L28.7 -391.6 28.0 -391.55 M37.35 -394.75 L37.3 -394.75 37.3 -394.7 37.35 -394.75" fill="#d4c693" fill-rule="evenodd" stroke="none"/>
    <path d="M29.95 -395.3 L30.4 -395.3 31.7 -395.25 34.0 -395.15 36.45 -395.05 35.45 -392.2 35.1 -391.45 34.9 -391.45 Q33.35 -391.25 30.6 -391.4 30.05 -392.7 29.9 -394.85 L29.95 -395.3" fill="#876e36" fill-rule="evenodd" stroke="none"/>
    <path d="M35.2 -387.9 L34.05 -387.6 31.4 -387.0 Q29.45 -388.45 28.6 -390.25 L28.0 -391.55 28.7 -391.6 30.6 -391.4 Q31.3 -389.55 32.8 -389.65 34.0 -389.7 35.0 -391.3 L34.9 -391.45 35.1 -391.45 40.3 -392.05 Q38.95 -390.15 36.0 -388.35 L35.2 -387.9 M29.9 -390.2 L29.8 -390.2 29.8 -390.15 29.9 -390.2" fill="#eddea5" fill-rule="evenodd" stroke="none"/>
    <path d="M34.9 -391.45 L35.0 -391.3 Q34.0 -389.7 32.8 -389.65 31.3 -389.55 30.6 -391.4 33.35 -391.25 34.9 -391.45" fill="#a68742" fill-rule="evenodd" stroke="none"/>
  </g>
</svg>
