<?xml version="1.0" encoding="UTF-8" standalone="no"?>
<svg xmlns:xlink="http://www.w3.org/1999/xlink" height="7.5px" width="121.0px" xmlns="http://www.w3.org/2000/svg">
  <g transform="matrix(1.0, 0.0, 0.0, 1.0, 0.0, 3.75)">
    <path d="M121.0 2.6 L121.0 3.75 0.0 3.75 0.0 2.6 121.0 2.6" fill="#f2f2f2" fill-rule="evenodd" stroke="none"/>
    <path d="M0.0 -0.4 L0.0 -3.75 121.0 -3.75 121.0 -0.4 0.0 -0.4" fill="#ffffff" fill-rule="evenodd" stroke="none"/>
    <path d="M121.0 0.6 L121.0 2.6 0.0 2.6 0.0 0.6 121.0 0.6" fill="#e6e6e6" fill-rule="evenodd" stroke="none"/>
    <path d="M121.0 -0.4 L121.0 0.6 0.0 0.6 0.0 -0.4 121.0 -0.4" fill="#d9d9d9" fill-rule="evenodd" stroke="none"/>
  </g>
</svg>
