<?xml version="1.0" encoding="UTF-8" standalone="no"?>
<svg xmlns:xlink="http://www.w3.org/1999/xlink" height="250.1px" width="103.85px" xmlns="http://www.w3.org/2000/svg">
  <g transform="matrix(1.0, 0.0, 0.0, 1.0, 0.0, 0.0)">
    <path d="M21.25 248.75 L21.7 249.4 22.0 249.7 Q21.7 250.1 21.45 250.1 L21.15 250.0 21.25 250.0 21.25 249.4 21.25 248.8 21.25 248.75" fill="#69614b" fill-rule="evenodd" stroke="none"/>
    <path d="M7.3 236.45 L7.8 236.05 8.1 235.3 40.6 235.3 40.9 234.8 Q41.2 234.9 41.3 235.3 L44.45 235.3 44.8 235.1 45.05 235.3 77.2 235.3 77.5 234.6 Q77.9 234.75 77.95 235.3 L86.2 235.3 86.35 235.1 86.45 235.3 100.05 235.3 100.05 235.6 100.05 235.75 Q100.75 236.45 102.45 241.25 102.45 241.7 102.1 241.7 L101.9 241.65 103.85 243.95 103.8 244.0 Q103.55 244.2 103.3 244.2 L103.25 244.2 103.35 244.35 103.3 244.85 Q103.2 244.85 102.85 245.0 102.3 245.0 101.65 244.4 L101.65 244.2 101.65 244.15 101.4 242.0 101.3 241.3 101.05 240.3 100.95 239.45 100.85 238.7 100.85 238.35 100.65 237.6 100.55 237.55 99.95 236.45 66.3 236.45 66.0 235.8 Q65.75 235.9 65.6 236.45 L62.55 236.45 62.2 236.15 61.95 236.45 34.95 236.45 34.1 236.45 31.1 236.45 30.6 236.45 30.3 235.55 Q29.95 235.7 29.85 236.45 L21.8 236.45 21.7 236.15 21.55 236.45 7.3 236.45 M100.15 245.5 Q100.05 245.85 99.55 245.85 99.05 245.85 98.7 245.45 99.0 245.3 99.1 244.75 L99.1 244.2 99.1 243.85 99.1 243.45 99.4 243.65 99.5 244.0 99.55 244.2 Q99.75 245.15 100.15 245.5 M97.9 245.0 L97.75 245.0 97.55 245.0 97.25 245.15 Q97.15 244.7 97.3 244.3 L97.3 244.1 97.45 243.55 97.55 243.6 97.65 244.2 97.9 245.0 M94.7 245.85 L94.65 245.85 94.5 245.85 94.0 246.3 Q93.1 246.3 92.1 244.65 L91.8 245.0 Q91.45 245.0 91.3 244.5 L91.75 244.2 92.75 243.05 92.85 242.85 92.85 242.9 92.55 244.5 92.95 245.5 Q93.55 245.3 94.2 244.2 L94.25 244.05 94.35 244.2 94.9 244.8 94.7 245.85 M90.85 244.7 L90.45 245.0 Q90.05 245.0 89.95 244.7 L90.85 244.7 M89.5 244.65 L88.8 245.75 Q88.3 245.75 88.2 244.75 L87.85 244.85 Q87.4 244.85 87.15 244.2 L87.15 244.15 87.4 243.25 88.35 242.3 88.4 242.35 88.05 243.2 Q87.95 243.85 88.1 244.2 L88.4 244.55 89.5 244.65 M82.2 245.1 L81.85 245.3 Q81.55 245.3 81.35 244.6 81.15 245.25 80.8 245.25 80.45 245.25 80.25 245.05 L80.55 244.2 80.6 243.95 81.5 242.65 81.6 242.7 Q81.65 243.45 81.95 244.05 L82.0 244.2 82.2 245.1 M38.1 244.45 L37.75 244.9 37.9 244.2 37.95 244.05 38.0 244.2 38.1 244.45 M37.7 244.95 L37.6 244.95 Q37.25 244.95 37.2 244.55 L36.9 244.85 Q36.3 244.85 36.3 243.9 L36.35 243.65 36.25 243.6 36.05 244.3 36.05 244.2 36.4 241.95 37.2 243.5 37.5 244.2 37.7 244.95 M35.8 244.55 L35.7 244.55 35.3 244.3 35.3 244.2 35.05 242.3 35.2 242.25 Q35.3 242.1 35.4 242.1 L35.8 244.2 35.8 244.55 M30.8 244.5 L30.45 244.85 30.2 244.6 Q30.0 245.4 29.7 245.4 L29.35 244.85 29.35 244.2 29.5 243.0 29.6 243.0 29.7 242.85 Q30.2 243.25 30.65 244.2 L30.7 244.3 30.8 244.5 M28.95 245.1 L28.6 245.3 Q27.9 245.3 27.6 243.05 L27.5 243.05 27.4 243.35 27.3 243.7 Q27.1 242.35 27.45 241.6 L27.65 241.5 27.85 241.4 28.6 244.2 28.75 245.15 28.95 245.1 M27.1 244.45 L26.85 245.0 26.65 245.0 26.45 244.95 26.45 244.5 26.4 244.2 26.25 243.45 26.4 242.85 26.6 242.85 27.0 244.2 27.1 244.45 M5.4 242.75 Q4.75 242.75 4.55 242.15 L4.5 241.55 6.0 239.3 6.15 239.1 5.95 239.15 5.5 239.1 5.6 238.9 5.5 238.85 5.55 238.75 Q5.75 238.2 6.3 237.5 L6.9 236.9 6.75 237.75 6.5 238.85 6.25 239.8 6.15 240.0 5.3 241.8 5.5 242.45 5.4 242.75" fill="#69614b" fill-rule="evenodd" stroke="none"/>
    <path d="M6.9 236.9 L6.95 236.45 7.3 236.45 21.55 236.45 21.7 236.15 21.8 236.45 29.85 236.45 Q29.95 235.7 30.3 235.55 L30.6 236.45 30.75 237.45 30.75 237.85 30.3 238.25 30.0 237.7 29.8 237.05 29.8 236.7 29.25 237.0 28.8 237.1 27.3 237.55 26.55 237.55 25.6 237.6 24.2 237.65 Q24.1 238.4 23.7 238.4 23.1 238.4 23.25 237.7 L22.6 237.4 22.15 237.25 22.05 237.25 22.05 237.45 21.85 238.85 21.55 239.0 21.15 238.25 21.35 237.2 20.6 237.3 20.7 238.35 20.55 239.25 20.35 239.3 Q19.95 239.3 19.95 238.35 L20.05 237.5 19.55 237.65 19.45 237.95 19.0 238.85 18.6 238.1 17.9 237.95 16.5 238.0 Q16.0 237.3 15.15 238.0 14.85 238.25 14.55 237.9 L13.7 238.3 12.9 238.45 Q12.55 238.45 12.4 237.8 L10.9 239.3 Q10.2 239.3 10.3 238.4 10.4 237.7 10.15 237.35 L9.2 238.0 Q8.65 237.5 8.2 237.8 L7.65 238.05 Q7.5 237.85 7.15 238.25 L6.55 238.85 6.5 238.85 6.75 237.75 6.9 236.9 M31.1 236.45 L34.1 236.45 32.35 237.7 32.25 237.7 32.25 238.0 Q32.25 238.55 32.05 238.7 31.8 238.55 31.8 238.0 L31.85 237.5 31.35 237.05 31.1 236.45 M34.95 236.45 L61.95 236.45 62.2 236.15 62.55 236.45 65.6 236.45 Q65.75 235.9 66.0 235.8 L66.3 236.45 99.95 236.45 100.55 237.55 100.65 237.6 100.85 238.35 100.1 238.4 99.5 238.3 98.7 238.2 96.15 238.1 94.6 237.95 94.0 237.95 94.0 237.75 93.9 237.5 93.8 237.4 93.9 239.7 93.7 240.75 93.45 240.8 Q92.65 240.8 92.85 238.2 L92.85 237.8 90.35 237.8 90.05 238.4 Q89.6 239.1 89.1 239.3 L89.1 239.0 89.3 237.9 89.35 237.8 88.55 237.85 87.75 237.9 87.75 238.05 87.75 238.55 Q87.65 238.85 87.25 239.0 86.95 238.9 86.95 238.55 L87.0 238.0 86.5 238.0 85.8 238.1 84.95 237.75 Q84.45 237.2 83.7 237.3 L83.25 237.4 81.4 237.9 81.25 237.95 81.1 238.25 80.4 239.15 Q80.1 239.1 80.1 238.6 L80.15 238.1 79.3 238.25 78.85 239.85 78.6 239.9 Q78.25 239.9 78.25 239.25 78.25 238.95 78.55 238.35 L77.95 238.35 76.25 238.25 75.1 238.05 72.85 238.0 71.95 237.95 Q72.0 237.35 71.4 237.5 70.7 237.65 70.25 238.0 L70.65 239.25 70.3 240.35 69.6 238.4 69.15 238.55 69.0 237.8 68.9 239.1 68.65 240.5 68.55 240.5 68.4 240.5 68.3 240.5 Q67.9 240.3 68.05 238.85 L68.05 238.0 67.35 237.5 Q67.3 236.9 66.55 237.05 L66.45 237.1 66.45 237.4 66.45 238.9 66.25 239.5 65.85 240.05 Q65.45 239.9 65.35 239.15 L65.35 238.05 65.4 237.5 64.9 237.8 64.5 238.15 64.0 238.4 Q63.2 238.5 62.85 237.8 L62.5 237.5 61.95 239.25 Q61.45 238.85 61.45 238.4 L61.6 237.55 61.45 237.6 60.85 237.85 60.3 238.0 59.95 238.8 59.9 238.85 59.85 238.65 59.9 238.05 59.4 238.05 59.0 237.9 58.05 237.75 Q56.3 237.8 54.75 238.6 L53.25 238.7 52.6 238.25 52.0 238.15 50.5 238.5 49.95 238.35 48.95 237.9 47.6 237.5 47.05 237.3 Q46.8 237.15 46.25 237.3 L45.8 237.35 Q45.5 237.1 45.1 237.2 L45.15 237.8 45.1 238.55 44.55 239.45 44.1 239.0 44.3 237.8 44.35 237.65 43.3 237.75 Q43.2 237.55 42.9 237.6 L42.85 237.6 42.85 237.65 42.4 239.15 41.95 239.25 41.85 238.9 42.1 237.9 42.15 237.8 41.75 237.85 Q40.9 238.25 40.35 237.4 L40.05 237.25 40.05 237.45 39.8 238.25 39.45 239.0 Q39.1 238.75 39.1 238.35 L39.3 237.6 39.5 237.2 39.1 237.25 Q38.55 237.3 38.2 236.95 37.35 236.8 36.4 237.3 35.65 237.45 35.35 236.9 L34.95 236.45" fill="#756d54" fill-rule="evenodd" stroke="none"/>
    <path d="M76.25 244.7 L76.05 244.7 75.7 244.65 75.6 244.65 75.45 243.35 75.5 242.4 Q75.55 241.65 75.75 241.2 L75.5 241.0 Q74.8 241.1 74.4 241.55 74.2 241.85 73.75 241.8 L73.75 242.1 73.75 242.75 73.3 243.95 Q72.95 243.65 72.9 242.65 L72.85 242.1 72.9 241.15 72.65 241.6 72.5 241.6 72.2 241.15 72.1 240.85 71.75 240.0 71.5 240.3 71.15 240.6 71.1 240.6 71.25 241.1 71.5 242.3 Q71.5 243.2 71.1 243.8 70.4 243.4 70.35 241.35 L70.3 240.75 69.5 240.5 69.1 239.9 69.4 241.45 69.5 241.85 69.75 243.9 69.7 244.2 69.6 244.3 69.3 244.35 Q68.7 244.35 68.6 242.2 L68.55 240.6 68.55 240.5 68.65 240.5 68.9 239.1 69.0 237.8 69.15 238.55 69.6 238.4 70.3 240.35 70.65 239.25 70.25 238.0 Q70.7 237.65 71.4 237.5 72.0 237.35 71.95 237.95 L72.85 238.0 75.1 238.05 76.25 238.25 77.95 238.35 78.55 238.35 Q78.25 238.95 78.25 239.25 78.25 239.9 78.6 239.9 L78.85 239.85 79.3 238.25 80.15 238.1 80.1 238.6 Q80.1 239.1 80.4 239.15 L81.1 238.25 81.25 237.95 81.4 237.9 83.25 237.4 83.7 237.3 Q84.45 237.2 84.95 237.75 L85.8 238.1 86.5 238.0 87.0 238.0 86.95 238.55 Q86.95 238.9 87.25 239.0 87.65 238.85 87.75 238.55 L87.75 238.05 87.75 237.9 88.55 237.85 89.35 237.8 89.3 237.9 89.1 239.0 89.1 239.3 Q89.6 239.1 90.05 238.4 L90.35 237.8 92.85 237.8 92.85 238.2 Q92.65 240.8 93.45 240.8 L93.7 240.75 93.9 239.7 93.8 237.4 93.9 237.5 94.0 237.75 94.0 237.95 94.6 237.95 96.15 238.1 98.7 238.2 99.5 238.3 100.1 238.4 100.85 238.35 100.85 238.7 100.95 239.45 101.05 240.3 101.3 241.3 100.2 241.45 100.2 241.65 100.15 242.05 99.75 242.45 99.4 241.7 98.75 242.0 Q97.7 241.45 97.75 240.4 L97.7 240.6 97.75 242.55 97.65 243.45 97.6 243.6 97.55 243.6 97.45 243.55 Q96.8 243.2 96.65 241.65 L96.15 241.15 95.85 240.55 95.7 240.1 95.2 240.5 Q94.8 241.05 94.4 240.25 L94.15 239.65 93.9 240.05 93.85 240.8 93.9 242.25 Q93.9 243.15 93.45 243.8 92.9 243.65 92.85 242.9 L92.85 242.85 92.85 242.3 92.85 240.5 92.65 240.55 92.3 240.25 Q92.3 239.85 92.05 239.8 L91.5 240.75 90.25 241.7 89.3 241.8 Q88.9 241.8 88.9 241.45 L88.85 240.35 88.85 240.3 88.75 240.35 87.35 240.4 86.85 240.15 86.55 240.65 Q86.35 241.1 85.75 240.95 L85.55 239.8 84.75 240.85 Q84.6 240.7 84.6 240.1 L84.1 241.0 83.7 242.35 83.6 242.8 Q83.6 243.45 83.1 243.6 L82.75 243.05 82.6 242.7 82.45 242.5 Q82.1 241.9 82.15 241.0 L82.25 239.95 Q82.35 239.25 81.9 239.05 L81.6 239.5 81.45 239.65 81.3 240.65 81.25 240.8 80.95 241.75 80.55 242.3 80.05 241.6 80.05 241.5 Q80.05 240.65 80.4 239.95 L80.35 239.95 80.2 240.05 79.85 241.8 79.75 242.2 79.05 244.25 78.6 243.45 78.65 242.25 Q78.7 241.4 78.9 240.8 L78.8 240.8 78.15 239.9 Q77.4 240.2 76.8 240.85 L76.65 242.45 76.65 242.55 76.35 244.55 76.3 244.65 76.25 244.7 M30.6 236.45 L31.1 236.45 31.35 237.05 31.85 237.5 31.8 238.0 Q31.8 238.55 32.05 238.7 32.25 238.55 32.25 238.0 L32.25 237.7 32.35 237.7 34.1 236.45 34.95 236.45 35.35 236.9 Q35.65 237.45 36.4 237.3 37.35 236.8 38.2 236.95 38.55 237.3 39.1 237.25 L39.5 237.2 39.3 237.6 39.1 238.35 Q39.1 238.75 39.45 239.0 L39.8 238.25 40.05 237.45 40.05 237.25 40.35 237.4 Q40.9 238.25 41.75 237.85 L42.15 237.8 42.1 237.9 41.85 238.9 41.95 239.25 42.4 239.15 42.85 237.65 42.85 237.6 42.9 237.6 Q43.2 237.55 43.3 237.75 L44.35 237.65 44.3 237.8 44.1 239.0 44.55 239.45 45.1 238.55 45.15 237.8 45.1 237.2 Q45.5 237.1 45.8 237.35 L46.25 237.3 Q46.8 237.15 47.05 237.3 L47.6 237.5 48.95 237.9 49.95 238.35 50.5 238.5 52.0 238.15 52.6 238.25 53.25 238.7 54.75 238.6 Q56.3 237.8 58.05 237.75 L59.0 237.9 59.4 238.05 59.9 238.05 59.85 238.65 59.9 238.85 59.95 238.8 60.3 238.0 60.85 237.85 61.45 237.6 61.6 237.55 61.45 238.4 Q61.45 238.85 61.95 239.25 L62.5 237.5 62.85 237.8 Q63.2 238.5 64.0 238.4 L64.5 238.15 64.9 237.8 65.4 237.5 65.35 238.05 65.35 239.15 Q65.45 239.9 65.85 240.05 L66.25 239.5 66.45 238.9 66.45 237.4 66.45 237.1 66.55 237.05 Q67.3 236.9 67.35 237.5 L68.05 238.0 68.05 238.85 Q67.9 240.3 68.3 240.5 L68.25 240.55 67.8 241.0 67.45 240.55 67.05 240.25 Q67.15 241.4 66.65 242.7 L66.6 242.8 Q66.45 243.5 65.8 243.6 L65.55 243.1 65.3 242.15 65.25 240.85 Q65.35 240.2 65.05 239.95 L64.8 240.7 Q64.65 241.2 64.15 241.3 L64.0 240.85 63.9 242.0 63.7 243.95 Q63.6 243.95 63.25 244.1 62.6 244.1 62.8 243.2 L62.95 241.05 62.95 240.9 62.7 241.0 62.55 240.6 62.35 241.65 62.25 242.15 62.1 242.75 62.2 242.8 61.95 242.85 Q61.6 242.85 61.5 242.65 L61.45 242.0 61.55 241.3 61.3 240.55 Q61.25 240.1 60.9 240.2 60.5 240.7 60.2 241.45 L59.8 241.0 Q59.65 240.0 60.0 239.4 L59.9 239.4 Q59.05 239.3 58.45 239.65 L58.8 242.1 58.75 243.05 58.35 243.3 Q58.05 243.0 58.05 242.65 L58.0 242.45 58.05 241.55 57.75 240.05 57.65 240.05 57.15 240.1 56.95 240.85 56.9 241.45 Q56.8 242.15 56.0 241.9 L55.95 239.5 55.65 240.1 55.45 240.9 55.35 242.35 55.2 243.45 54.9 243.5 Q54.6 243.3 54.55 242.2 L54.55 242.0 Q54.55 240.95 54.8 240.4 L54.6 239.95 53.85 241.05 53.45 241.25 Q53.0 240.5 53.05 239.35 L52.9 239.95 Q52.75 240.85 52.15 241.45 L51.8 240.85 51.3 239.65 51.2 240.1 51.0 241.3 50.8 242.3 50.35 242.8 50.0 242.1 Q49.85 241.45 49.95 240.7 50.0 240.15 49.75 239.95 49.8 240.6 49.25 240.55 L49.35 241.25 49.3 242.15 49.0 242.3 48.9 242.15 48.75 242.0 48.75 241.95 48.6 241.25 48.8 240.1 48.65 240.15 Q48.1 240.2 48.0 239.65 L47.85 239.25 47.95 239.6 48.1 240.3 47.9 241.7 Q47.65 242.65 47.2 243.0 L47.1 243.05 46.8 242.7 46.8 242.5 Q46.8 241.8 47.1 240.45 L47.5 239.1 47.35 239.1 Q46.75 239.65 46.0 239.9 L45.65 242.05 45.3 244.25 Q45.25 244.25 45.15 244.35 L44.85 244.4 Q44.25 244.4 44.4 243.6 L44.5 242.15 44.85 239.85 44.75 239.75 43.6 239.65 43.85 240.5 43.9 241.75 43.9 242.15 Q43.8 243.2 43.35 243.5 42.9 243.4 42.85 242.85 L42.9 242.0 42.75 240.4 42.75 240.35 42.35 240.6 42.15 240.7 42.3 241.55 42.25 242.45 41.55 242.45 41.55 242.2 41.4 240.6 41.2 240.45 40.65 239.95 40.2 241.0 39.75 242.35 Q39.5 242.85 39.1 242.5 38.3 241.8 38.15 240.25 38.15 239.7 37.8 239.5 L37.45 240.4 Q37.0 240.45 37.0 239.95 36.95 239.6 36.45 239.8 36.4 240.25 35.95 240.4 L35.75 239.95 35.2 239.8 Q34.9 240.35 34.45 239.9 L33.95 239.65 33.9 239.8 33.7 241.0 33.6 241.8 33.35 242.5 Q33.1 242.4 33.0 242.2 L32.8 241.75 32.7 240.85 32.45 239.5 32.05 240.4 Q32.0 241.2 31.55 241.45 L31.2 240.25 Q31.05 239.7 30.8 239.95 L30.4 241.0 30.05 241.3 29.85 240.85 Q29.6 240.35 29.5 239.65 29.5 238.85 28.95 238.55 L28.55 239.05 28.05 239.7 Q27.55 240.0 27.4 239.5 L27.15 238.75 Q26.65 239.0 26.1 239.85 25.85 240.3 25.5 240.15 L25.65 240.9 25.65 241.2 25.35 241.85 Q25.0 241.5 24.95 240.9 L24.9 240.45 Q24.9 240.05 25.05 239.8 24.8 239.05 24.3 239.7 L24.3 239.95 24.15 242.6 24.15 243.0 24.15 243.1 23.85 243.15 Q23.5 243.15 23.35 242.85 23.1 242.35 23.25 241.1 L23.25 240.0 23.35 239.75 23.05 239.35 22.0 240.15 22.0 240.45 21.75 241.55 21.55 241.7 21.1 241.1 21.1 240.55 Q20.8 240.45 20.85 239.85 20.5 239.55 20.2 239.95 L19.75 240.3 19.75 240.75 19.55 241.35 19.35 241.7 Q18.75 241.4 18.7 240.5 L18.7 240.3 18.75 239.85 18.0 239.9 Q17.75 239.6 17.2 239.7 L17.55 241.85 17.65 243.0 17.55 243.2 17.6 243.25 17.35 243.3 Q17.0 243.3 16.8 242.15 L16.75 241.9 16.65 240.85 16.75 239.85 15.95 240.15 15.5 240.2 15.1 240.0 15.3 240.9 15.45 241.85 15.45 242.15 15.1 242.9 Q14.5 242.45 14.5 241.7 L14.5 241.4 14.35 240.5 Q14.35 240.0 14.5 239.7 L13.8 239.8 13.5 240.0 13.6 240.6 13.65 241.0 13.65 241.7 13.65 242.1 13.45 242.85 13.3 242.45 13.1 241.8 12.9 240.6 12.9 240.35 12.05 240.9 12.1 241.45 12.1 241.8 11.95 243.05 11.85 243.15 11.55 243.2 11.15 242.85 10.85 241.7 10.3 242.0 9.25 241.8 8.95 241.5 8.7 242.3 8.4 243.05 7.95 243.15 Q7.8 242.9 7.8 242.5 L7.8 242.45 Q7.8 242.0 8.1 241.05 L8.6 240.05 8.2 239.65 7.75 240.0 7.15 239.9 Q6.65 240.4 6.25 239.8 L6.5 238.85 6.55 238.85 7.15 238.25 Q7.5 237.85 7.65 238.05 L8.2 237.8 Q8.65 237.5 9.2 238.0 L10.15 237.35 Q10.4 237.7 10.3 238.4 10.2 239.3 10.9 239.3 L12.4 237.8 Q12.55 238.45 12.9 238.45 L13.7 238.3 14.55 237.9 Q14.85 238.25 15.15 238.0 16.0 237.3 16.5 238.0 L17.9 237.95 18.6 238.1 19.0 238.85 19.45 237.95 19.55 237.65 20.05 237.5 19.95 238.35 Q19.95 239.3 20.35 239.3 L20.55 239.25 20.7 238.35 20.6 237.3 21.35 237.2 21.15 238.25 21.55 239.0 21.85 238.85 22.05 237.45 22.05 237.25 22.15 237.25 22.6 237.4 23.25 237.7 Q23.1 238.4 23.7 238.4 24.1 238.4 24.2 237.65 L25.6 237.6 26.55 237.55 27.3 237.55 28.8 237.1 29.25 237.0 29.8 236.7 29.8 237.05 30.0 237.7 30.3 238.25 30.75 237.85 30.75 237.45 30.6 236.45 M49.25 240.5 Q49.35 240.1 49.1 239.8 L49.1 239.85 49.25 240.5" fill="#857c5f" fill-rule="evenodd" stroke="none"/>
    <path d="M101.65 244.4 L101.6 245.05 Q101.45 245.75 100.75 245.75 L100.15 245.5 Q99.75 245.15 99.55 244.2 L99.5 244.0 99.4 243.65 99.1 243.45 99.1 243.85 99.1 244.2 99.1 244.75 Q99.0 245.3 98.7 245.45 L98.45 245.45 97.9 245.0 97.65 244.2 97.55 243.6 97.6 243.6 97.65 243.45 97.75 242.55 97.7 240.6 97.75 240.4 Q97.7 241.45 98.75 242.0 L99.4 241.7 99.75 242.45 100.15 242.05 100.2 241.65 100.2 241.45 101.3 241.3 101.4 242.0 101.65 244.15 101.65 244.2 101.65 244.4 M97.25 245.15 L97.25 245.2 97.2 245.5 96.8 245.75 96.35 245.9 94.7 245.9 94.7 245.85 94.9 244.8 94.35 244.2 94.25 244.05 94.2 244.2 Q93.55 245.3 92.95 245.5 L92.55 244.5 92.85 242.9 Q92.9 243.65 93.45 243.8 93.9 243.15 93.9 242.25 L93.85 240.8 93.9 240.05 94.15 239.65 94.4 240.25 Q94.8 241.05 95.2 240.5 L95.7 240.1 95.85 240.55 96.15 241.15 96.65 241.65 Q96.8 243.2 97.45 243.55 L97.3 244.1 97.3 244.3 Q97.15 244.7 97.25 245.15 M91.3 244.5 L90.85 244.7 89.95 244.7 89.5 244.65 88.4 244.55 88.1 244.2 Q87.95 243.85 88.05 243.2 L88.4 242.35 88.35 242.3 87.4 243.25 87.15 244.15 87.15 244.2 Q86.6 245.55 85.8 245.55 85.05 245.55 84.75 244.2 L84.6 243.5 84.5 244.2 Q84.15 245.9 83.2 245.9 82.5 245.9 82.2 245.1 L82.0 244.2 81.95 244.05 Q81.65 243.45 81.6 242.7 L81.5 242.65 80.6 243.95 80.55 244.2 80.25 245.05 80.05 245.45 Q79.7 246.2 79.0 246.2 78.55 246.2 78.15 245.8 L77.9 245.3 77.4 245.4 Q76.65 245.4 76.25 244.7 L76.3 244.65 76.35 244.55 76.65 242.55 76.65 242.45 76.8 240.85 Q77.4 240.2 78.15 239.9 L78.8 240.8 78.9 240.8 Q78.7 241.4 78.65 242.25 L78.6 243.45 79.05 244.25 79.75 242.2 79.85 241.8 80.2 240.05 80.35 239.95 80.4 239.95 Q80.05 240.65 80.05 241.5 L80.05 241.6 80.55 242.3 80.95 241.75 81.25 240.8 81.3 240.65 81.45 239.65 81.6 239.5 81.9 239.05 Q82.35 239.25 82.25 239.95 L82.15 241.0 Q82.1 241.9 82.45 242.5 L82.6 242.7 82.75 243.05 83.1 243.6 Q83.6 243.45 83.6 242.8 L83.7 242.35 84.1 241.0 84.6 240.1 Q84.6 240.7 84.75 240.85 L85.55 239.8 85.75 240.95 Q86.35 241.1 86.55 240.65 L86.85 240.15 87.35 240.4 88.75 240.35 88.85 240.35 88.9 241.45 Q88.9 241.8 89.3 241.8 L90.25 241.7 91.5 240.75 92.05 239.8 Q92.3 239.85 92.3 240.25 L92.65 240.55 92.85 240.5 92.85 242.3 92.85 242.85 92.75 243.05 91.75 244.2 91.3 244.5 M75.7 244.65 L74.45 245.35 Q73.85 245.35 73.75 244.7 L73.75 244.2 73.75 243.95 73.5 243.95 73.45 244.2 Q73.2 244.9 72.55 245.2 L70.9 245.75 70.6 245.15 69.5 245.75 68.35 246.1 67.8 246.2 Q67.2 246.2 66.85 245.85 L66.8 245.8 66.8 245.9 66.65 245.9 66.25 245.45 65.7 244.85 65.5 245.1 65.05 245.15 Q64.8 245.15 64.45 244.85 64.05 244.5 63.85 244.5 L63.5 244.85 62.9 245.15 61.85 244.5 61.75 244.85 61.2 245.0 60.85 244.2 60.6 245.2 Q60.25 246.1 59.5 246.45 L58.95 245.35 59.0 244.35 58.65 244.4 58.6 244.4 Q58.2 245.65 57.5 246.1 L57.3 245.9 57.35 244.7 Q57.2 245.25 56.05 245.25 55.25 245.25 54.75 244.75 L52.3 245.2 50.55 245.5 49.7 245.45 48.95 245.8 Q48.15 245.8 47.8 245.15 L47.4 245.5 46.7 245.7 Q45.7 245.7 45.45 244.95 L44.7 245.25 Q44.1 245.25 43.75 244.75 L43.4 245.0 43.15 244.7 43.0 244.25 42.7 244.35 Q42.1 245.7 41.0 245.7 L40.25 245.6 39.9 245.2 39.65 245.05 39.2 245.1 Q38.45 245.1 38.1 244.45 L38.0 244.2 37.95 244.05 37.9 244.2 37.75 244.9 37.7 245.0 37.7 244.95 37.5 244.2 37.2 243.5 36.4 241.95 36.05 244.2 36.05 244.3 36.05 245.0 35.85 245.0 35.8 244.55 35.8 244.2 35.4 242.1 Q35.3 242.1 35.2 242.25 L35.05 242.3 35.3 244.2 35.3 244.3 35.3 244.6 Q35.35 245.8 34.3 245.9 L33.65 245.25 33.2 245.15 Q32.65 245.15 32.1 245.5 L31.45 245.75 30.8 244.5 30.7 244.3 30.65 244.2 Q30.2 243.25 29.7 242.85 L29.6 243.0 29.5 243.0 29.35 244.2 29.35 244.85 29.4 245.5 29.1 244.7 29.1 244.8 29.1 244.9 29.05 245.05 28.95 245.1 28.75 245.15 28.6 244.2 27.85 241.4 27.65 241.5 27.45 241.6 Q27.1 242.35 27.3 243.7 L27.3 243.75 27.35 244.2 27.35 245.9 27.1 244.45 27.0 244.2 26.6 242.85 26.4 242.85 26.15 242.85 26.25 243.45 26.4 244.2 26.45 244.5 26.45 244.95 Q26.4 245.45 26.0 245.5 L25.9 245.5 25.35 245.35 24.85 245.15 24.7 245.45 24.1 245.75 23.55 245.3 23.0 245.0 22.8 245.5 22.5 245.9 22.0 245.2 21.7 244.9 21.25 244.25 21.25 244.2 21.25 244.3 21.25 244.9 21.25 245.5 20.85 245.5 20.6 245.15 20.6 245.7 20.05 245.75 18.3 245.65 16.1 245.15 15.85 245.5 15.4 245.9 15.1 245.55 14.85 245.35 Q14.75 245.45 14.8 245.75 L14.45 245.9 14.1 245.95 13.7 246.1 Q13.2 246.05 13.35 245.9 L13.2 245.0 13.1 245.9 13.1 246.75 12.85 246.75 12.75 246.55 12.65 246.3 12.15 245.2 11.7 245.65 Q11.05 245.65 10.9 244.9 L10.6 245.5 10.6 245.6 10.6 245.75 10.35 246.0 9.85 245.9 8.9 246.1 7.85 245.9 Q7.4 245.65 7.25 245.1 7.15 244.75 7.35 244.2 L7.45 243.95 7.0 244.05 6.9 244.2 5.85 245.1 Q4.75 245.1 5.0 244.2 L5.4 242.75 5.5 242.45 5.3 241.8 6.15 240.0 6.25 239.8 Q6.65 240.4 7.15 239.9 L7.75 240.0 8.2 239.65 8.6 240.05 8.1 241.05 Q7.8 242.0 7.8 242.45 L7.8 242.5 Q7.8 242.9 7.95 243.15 L8.4 243.05 8.7 242.3 8.95 241.5 9.25 241.8 10.3 242.0 10.85 241.7 11.15 242.85 11.55 243.2 11.85 243.15 11.95 243.05 12.1 241.8 12.1 241.45 12.05 240.9 12.9 240.35 12.9 240.6 13.1 241.8 13.3 242.45 13.45 242.85 13.65 242.1 13.65 241.7 13.65 241.0 13.6 240.6 13.5 240.0 13.8 239.8 14.5 239.7 Q14.35 240.0 14.35 240.5 L14.5 241.4 14.5 241.7 Q14.5 242.45 15.1 242.9 L15.45 242.15 15.45 241.85 15.3 240.9 15.1 240.0 15.5 240.2 15.95 240.15 16.75 239.85 16.65 240.85 16.75 241.9 16.8 242.15 Q17.0 243.3 17.35 243.3 L17.6 243.25 17.55 243.2 17.65 243.0 17.55 241.85 17.2 239.7 Q17.75 239.6 18.0 239.9 L18.75 239.85 18.7 240.3 18.7 240.5 Q18.75 241.4 19.35 241.7 L19.55 241.35 19.75 240.75 19.75 240.3 20.2 239.95 Q20.5 239.55 20.85 239.85 20.8 240.45 21.1 240.55 L21.1 241.1 21.55 241.7 21.75 241.55 22.0 240.45 22.0 240.15 23.05 239.35 23.35 239.75 23.25 240.0 23.25 241.1 Q23.1 242.35 23.35 242.85 23.5 243.15 23.85 243.15 L24.15 243.1 24.15 243.0 24.15 242.6 24.3 239.95 24.3 239.7 Q24.8 239.05 25.05 239.8 24.9 240.05 24.9 240.45 L24.95 240.9 Q25.0 241.5 25.35 241.85 L25.65 241.2 25.65 240.9 25.5 240.15 Q25.85 240.3 26.1 239.85 26.65 239.0 27.15 238.75 L27.4 239.5 Q27.55 240.0 28.05 239.7 L28.55 239.05 28.95 238.55 Q29.5 238.85 29.5 239.65 29.6 240.35 29.85 240.85 L30.05 241.3 30.4 241.0 30.8 239.95 Q31.05 239.7 31.2 240.25 L31.55 241.45 Q32.0 241.2 32.05 240.4 L32.45 239.5 32.7 240.85 32.8 241.75 33.0 242.2 Q33.1 242.4 33.35 242.5 L33.6 241.8 33.7 241.0 33.9 239.8 33.95 239.65 34.45 239.9 Q34.9 240.35 35.2 239.8 L35.75 239.95 35.95 240.4 Q36.4 240.25 36.45 239.8 36.95 239.6 37.0 239.95 37.0 240.45 37.45 240.4 L37.8 239.5 Q38.15 239.7 38.15 240.25 38.3 241.8 39.1 242.5 39.5 242.85 39.75 242.35 L40.2 241.0 40.65 239.95 41.2 240.45 41.4 240.6 41.55 242.2 41.55 242.45 42.25 242.45 42.3 241.55 42.15 240.7 42.35 240.6 42.75 240.35 42.75 240.4 42.9 242.0 42.85 242.85 Q42.9 243.4 43.35 243.5 43.8 243.2 43.9 242.15 L43.9 241.75 43.85 240.5 43.6 239.65 44.75 239.75 44.85 239.85 44.5 242.15 44.4 243.6 Q44.25 244.4 44.85 244.4 L45.15 244.35 Q45.25 244.25 45.3 244.25 L45.65 242.05 46.0 239.9 Q46.75 239.65 47.35 239.1 L47.5 239.1 47.1 240.45 Q46.8 241.8 46.8 242.5 L46.8 242.7 47.1 243.05 47.2 243.0 Q47.65 242.65 47.9 241.7 L48.1 240.3 47.95 239.6 47.85 239.25 48.0 239.65 Q48.1 240.2 48.65 240.15 L48.8 240.1 48.6 241.25 48.75 241.95 48.75 242.0 48.9 242.15 49.0 242.3 49.3 242.15 49.35 241.25 49.25 240.55 Q49.8 240.6 49.75 239.95 50.0 240.15 49.95 240.7 49.85 241.45 50.0 242.1 L50.35 242.8 50.8 242.3 51.0 241.3 51.2 240.1 51.3 239.65 51.8 240.85 52.15 241.45 Q52.75 240.85 52.9 239.95 L53.05 239.35 Q53.0 240.5 53.45 241.25 L53.85 241.05 54.6 239.95 54.8 240.4 Q54.55 240.95 54.55 242.0 L54.55 242.2 Q54.6 243.3 54.9 243.5 L55.2 243.45 55.35 242.35 55.45 240.9 55.65 240.1 55.95 239.5 56.0 241.9 Q56.8 242.15 56.9 241.45 L56.95 240.85 57.15 240.1 57.65 240.05 57.75 240.05 58.05 241.55 58.0 242.45 58.05 242.65 Q58.05 243.0 58.35 243.3 L58.75 243.05 58.8 242.1 58.45 239.65 Q59.05 239.3 59.9 239.4 L60.0 239.4 Q59.65 240.0 59.8 241.0 L60.2 241.45 Q60.5 240.7 60.9 240.2 61.25 240.1 61.3 240.55 L61.55 241.3 61.45 242.0 61.5 242.65 Q61.6 242.85 61.95 242.85 L62.2 242.8 62.1 242.75 62.25 242.15 62.35 241.65 62.55 240.6 62.7 241.0 62.95 240.9 62.95 241.05 62.8 243.2 Q62.6 244.1 63.25 244.1 63.6 243.95 63.7 243.95 L63.9 242.0 64.0 240.85 64.15 241.3 Q64.65 241.2 64.8 240.7 L65.05 239.95 Q65.35 240.2 65.25 240.85 L65.3 242.15 65.55 243.1 65.8 243.6 Q66.45 243.5 66.6 242.8 L66.65 242.7 Q67.15 241.4 67.05 240.25 L67.45 240.55 67.8 241.0 68.25 240.55 68.3 240.5 68.4 240.5 68.55 240.5 68.55 240.6 68.6 242.2 Q68.7 244.35 69.3 244.35 L69.6 244.3 69.7 244.2 69.75 243.9 69.5 241.85 69.4 241.45 69.1 239.9 69.5 240.5 70.3 240.75 70.35 241.35 Q70.4 243.4 71.1 243.8 71.5 243.2 71.5 242.3 L71.25 241.1 71.1 240.6 71.15 240.6 71.5 240.3 71.75 240.0 72.1 240.85 72.2 241.15 72.5 241.6 72.65 241.6 72.9 241.15 72.85 242.1 72.9 242.65 Q72.95 243.65 73.3 243.95 L73.75 242.75 73.75 242.1 73.75 241.8 Q74.2 241.85 74.4 241.55 74.8 241.1 75.5 241.0 L75.75 241.2 Q75.55 241.65 75.5 242.4 L75.45 243.35 75.6 244.65 75.7 244.65 M49.25 240.5 L49.1 239.85 49.1 239.8 Q49.35 240.1 49.25 240.5" fill="#968c6c" fill-rule="evenodd" stroke="none"/>
    <path d="M88.75 240.35 L88.85 240.3 88.85 240.35 88.75 240.35" fill="#c2b58b" fill-rule="evenodd" stroke="none"/>
    <path d="M6.55 213.4 Q7.2 213.7 7.75 214.3 L7.7 214.35 3.95 219.05 2.55 217.85 6.55 213.4 M29.85 215.7 L30.9 215.55 33.3 215.2 30.65 220.35 26.65 221.0 29.85 215.7 M38.2 214.7 L42.0 214.45 45.45 214.35 Q61.05 213.9 66.0 214.35 L66.5 214.4 66.95 214.45 69.35 219.75 66.95 219.5 Q61.8 218.9 40.7 219.3 L36.6 219.65 38.2 214.7 M93.65 209.95 Q93.65 209.25 94.2 209.1 94.0 208.9 94.2 209.05 94.4 208.85 94.65 208.75 L100.2 212.2 Q99.45 212.35 98.9 212.8 L98.85 212.85 98.8 212.9 98.7 212.85 93.65 209.95 M8.8 232.7 L15.55 232.7 32.85 232.65 34.6 232.65 50.9 232.6 Q51.25 232.8 52.05 232.6 L55.7 232.6 62.35 232.6 81.1 232.55 95.8 232.5 97.25 232.5 99.05 232.5 99.05 233.7 97.3 233.7 10.6 233.7 5.85 233.7 5.85 232.8 5.9 232.8 6.8 232.7 7.2 232.7 8.8 232.7" fill="#a6a6a6" fill-rule="evenodd" stroke="none"/>
    <path d="M3.95 219.05 L7.7 214.35 7.75 214.3 7.85 214.35 8.6 215.65 Q9.05 216.7 9.85 217.3 L6.5 222.05 5.75 221.25 5.15 220.5 3.95 219.05 M94.0 215.6 L94.3 215.2 94.35 215.1 94.35 214.35 94.25 213.4 94.2 213.35 93.7 211.15 97.7 214.75 97.55 215.25 97.1 218.45 96.45 220.75 96.3 220.95 94.0 215.6 M4.8 236.4 L3.2 233.75 3.2 233.7 5.85 233.7 10.6 233.7 4.8 236.4 M81.1 232.55 L62.35 232.6 62.35 232.55 65.8 230.2 69.0 227.85 69.6 227.4 70.25 226.45 69.85 226.4 69.5 226.4 67.7 226.65 Q65.85 227.15 64.15 228.0 L63.0 228.6 61.8 229.2 58.8 230.9 56.9 231.9 55.7 232.6 52.05 232.6 Q51.25 232.8 50.9 232.6 L34.6 232.65 32.85 232.65 29.2 232.05 28.45 231.9 27.7 231.7 Q26.75 231.5 26.0 231.0 L25.65 230.7 25.4 230.35 25.4 230.0 Q25.5 229.4 26.0 229.1 L26.2 229.0 27.65 228.45 28.6 228.1 30.85 227.4 31.95 227.1 35.35 226.3 38.7 225.7 42.35 225.2 43.7 225.05 45.05 224.9 48.55 224.4 51.95 223.8 53.3 223.55 56.8 223.15 58.95 223.0 60.45 222.85 64.3 222.7 65.9 222.65 68.75 222.65 69.05 222.65 70.65 222.75 74.4 223.15 76.65 223.5 77.15 223.6 80.15 224.15 81.55 224.5 85.15 225.7 Q86.7 226.4 87.9 227.6 88.55 228.2 88.4 229.1 L88.2 229.5 Q87.5 230.3 86.5 230.7 L85.25 231.15 83.75 231.7 82.15 232.25 81.1 232.55" fill="#575757" fill-rule="evenodd" stroke="none"/>
    <path d="M6.55 213.4 L2.55 217.85 Q1.95 217.45 1.55 217.45 L1.45 217.45 1.3 217.45 0.8 217.6 4.65 213.9 Q5.1 213.05 6.0 213.2 L6.55 213.4 M94.65 208.75 L96.05 208.65 Q96.2 208.4 96.95 209.0 97.45 209.2 98.45 209.9 L101.85 212.25 101.15 212.1 100.2 212.2 94.65 208.75 M98.9 230.3 L102.1 233.7 101.65 233.7 99.05 233.7 99.05 232.5 99.25 232.5 98.9 230.3 M3.2 233.7 L5.3 230.9 5.9 232.8 5.85 232.8 5.85 233.7 3.2 233.7" fill="#f0f0f0" fill-rule="evenodd" stroke="none"/>
    <path d="M2.55 217.85 L3.95 219.05 5.15 220.5 5.75 221.25 6.5 222.05 Q7.55 223.1 8.35 223.4 L8.85 223.5 9.5 223.5 11.35 223.65 12.3 223.7 14.55 223.45 17.65 222.9 18.75 222.65 19.55 222.45 26.0 221.1 26.65 221.0 30.65 220.35 35.15 219.8 36.6 219.65 40.7 219.3 Q61.8 218.9 66.95 219.5 L69.35 219.75 71.15 220.0 78.7 221.1 80.3 221.4 82.5 221.8 86.45 222.65 87.0 222.65 94.75 221.8 95.7 221.4 96.3 220.95 96.45 220.75 97.1 218.45 97.55 215.25 97.7 214.75 97.8 214.35 98.15 213.65 Q98.4 213.2 98.8 212.9 L98.85 212.85 98.9 212.8 Q99.45 212.35 100.2 212.2 L101.15 212.1 101.85 212.25 102.3 212.6 102.55 212.85 102.55 212.9 102.85 213.4 102.85 213.45 102.9 213.5 102.9 213.65 102.95 213.65 103.15 214.3 103.15 214.35 103.2 214.45 102.25 217.3 Q100.35 222.75 96.45 227.1 L94.75 226.4 93.45 225.85 Q89.45 224.15 85.25 222.95 L80.6 221.95 80.15 221.85 80.1 221.85 79.75 221.75 77.0 221.2 76.65 221.15 74.65 220.9 70.8 220.4 67.6 220.0 58.3 219.75 48.85 220.1 39.75 221.15 30.3 222.85 26.0 223.8 20.65 225.2 12.2 227.7 Q9.0 225.95 5.75 224.55 4.15 223.8 2.5 223.2 L1.9 222.5 1.75 222.25 0.95 221.0 0.55 220.0 0.45 218.75 0.5 218.4 Q0.5 217.9 0.8 217.65 L0.75 217.65 0.8 217.6 1.3 217.45 1.45 217.45 1.55 217.45 Q1.95 217.45 2.55 217.85" fill="#3b3b3b" fill-rule="evenodd" stroke="none"/>
    <path d="M1.15 223.65 L1.05 223.5 0.9 223.15 0.45 222.1 0.2 221.3 Q-0.15 219.8 0.05 218.8 0.25 217.9 0.75 217.65 L0.8 217.65 Q0.5 217.9 0.5 218.4 L0.45 218.75 0.55 220.0 0.95 221.0 1.75 222.25 1.9 222.5 2.5 223.2 2.55 223.25 3.05 223.85 3.25 224.1 4.95 226.2 5.2 226.6 5.75 227.35 7.25 229.75 7.6 230.35 8.8 232.7 7.2 232.7 7.0 232.25 6.45 230.95 5.75 229.4 5.55 229.05 3.65 226.1 Q2.6 224.7 1.15 223.65 M74.65 220.9 L76.65 221.15 77.0 221.2 79.75 221.75 79.95 221.95 80.1 221.85 80.15 221.85 80.6 221.95 Q83.8 223.15 86.85 224.7 91.15 226.75 94.75 229.85 L95.2 230.25 95.75 230.75 95.8 232.5 81.1 232.55 82.15 232.25 83.75 231.7 85.25 231.15 86.5 230.7 Q87.5 230.3 88.2 229.5 L88.4 229.1 Q88.55 228.2 87.9 227.6 86.7 226.4 85.15 225.7 L81.55 224.5 80.15 224.15 77.15 223.6 76.65 223.5 74.4 223.15 70.65 222.75 69.05 222.65 68.75 222.65 65.9 222.65 64.3 222.7 60.45 222.85 58.95 223.0 56.8 223.15 53.3 223.55 51.95 223.8 48.55 224.4 45.05 224.9 43.7 225.05 42.35 225.2 38.7 225.7 35.35 226.3 31.95 227.1 30.85 227.4 28.6 228.1 27.65 228.45 26.2 229.0 26.0 229.1 Q25.5 229.4 25.4 230.0 L25.4 230.35 25.65 230.7 26.0 231.0 Q26.75 231.5 27.7 231.7 L28.45 231.9 29.2 232.05 32.85 232.65 15.55 232.7 20.15 229.65 23.55 227.75 26.0 226.65 30.3 225.1 Q35.65 223.5 41.25 222.65 L52.65 221.3 Q58.25 221.1 63.85 221.2 L70.15 221.15 74.65 220.9" fill="#525252" fill-rule="evenodd" stroke="none"/>
    <path d="M2.5 223.2 Q4.15 223.8 5.75 224.55 9.0 225.95 12.2 227.7 L20.65 225.2 26.0 223.8 30.3 222.85 39.75 221.15 48.85 220.1 58.3 219.75 67.6 220.0 70.8 220.4 74.65 220.9 70.15 221.15 63.85 221.2 Q58.25 221.1 52.65 221.3 L41.25 222.65 Q35.65 223.5 30.3 225.1 L26.0 226.65 23.55 227.75 20.15 229.65 15.55 232.7 8.8 232.7 7.6 230.35 7.25 229.75 5.75 227.35 5.2 226.6 4.95 226.2 3.25 224.1 3.05 223.85 2.55 223.25 2.5 223.2 M79.75 221.75 L80.1 221.85 79.95 221.95 79.75 221.75 M80.6 221.95 L85.25 222.95 Q89.45 224.15 93.45 225.85 L94.75 226.4 96.45 227.1 95.75 230.75 95.2 230.25 94.75 229.85 Q91.15 226.75 86.85 224.7 83.8 223.15 80.6 221.95" fill="#474747" fill-rule="evenodd" stroke="none"/>
    <path d="M82.95 216.35 L85.35 216.85 91.7 216.3 95.7 221.4 94.75 221.8 87.0 222.65 82.95 216.35 M102.85 213.45 L102.9 213.5 102.85 213.45 M103.45 217.55 L103.35 218.05 103.35 218.15 Q103.2 218.0 103.35 217.95 103.2 217.7 103.45 217.55 M103.3 218.25 Q102.8 220.05 101.1 223.65 L100.7 224.55 Q99.4 227.2 99.15 228.45 L99.1 228.6 Q98.8 229.8 98.85 229.95 L98.7 230.1 98.85 230.25 98.9 230.3 99.25 232.5 99.05 232.5 97.25 232.5 97.35 231.1 97.5 230.25 98.1 227.55 98.7 226.05 Q99.4 224.5 100.35 223.05 L101.2 221.45 101.35 221.15 102.15 219.75 Q102.6 218.9 103.3 218.25 M22.3 237.95 L5.75 237.95 5.5 236.35 97.3 233.7 99.05 233.7 101.65 233.7 96.8 236.35 22.3 237.95 M5.3 230.9 Q4.65 228.55 3.3 226.65 L3.15 226.45 1.45 224.2 1.15 223.65 Q2.6 224.7 3.65 226.1 L5.55 229.05 5.75 229.4 6.45 230.95 7.0 232.25 7.2 232.7 6.8 232.7 5.9 232.8 5.3 230.9" fill="#7d7d7d" fill-rule="evenodd" stroke="none"/>
    <path d="M9.85 217.3 L10.8 217.8 11.1 217.85 11.15 217.9 8.35 223.4 Q7.55 223.1 6.5 222.05 L9.85 217.3 M91.7 216.3 L94.0 215.6 96.3 220.95 95.7 221.4 91.7 216.3 M62.35 232.55 L62.35 232.6 62.35 232.55" fill="#6b6b6b" fill-rule="evenodd" stroke="none"/>
    <path d="M11.1 217.85 L11.2 217.85 15.55 217.75 12.3 223.7 11.35 223.65 9.5 223.5 8.85 223.5 8.35 223.4 11.15 217.9 11.1 217.85 M18.2 217.45 L19.55 217.25 20.85 217.0 22.9 216.65 18.75 222.65 17.65 222.9 14.55 223.45 18.2 217.45 M75.6 215.35 L79.85 215.85 82.5 221.8 80.3 221.4 78.7 221.1 75.6 215.35" fill="#808080" fill-rule="evenodd" stroke="none"/>
    <path d="M15.55 217.75 L18.2 217.45 14.55 223.45 12.3 223.7 15.55 217.75 M22.9 216.65 L26.0 216.15 29.55 215.7 29.85 215.7 26.65 221.0 26.0 221.1 19.55 222.45 18.75 222.65 22.9 216.65 M66.95 214.45 L74.65 215.25 75.6 215.35 78.7 221.1 71.15 220.0 69.35 219.75 66.95 214.45 M79.85 215.85 L82.95 216.35 87.0 222.65 86.45 222.65 82.5 221.8 79.85 215.85" fill="#999999" fill-rule="evenodd" stroke="none"/>
    <path d="M5.75 237.95 L5.7 237.95 4.8 236.4 10.6 233.7 97.3 233.7 5.5 236.35 5.75 237.95" fill="#636363" fill-rule="evenodd" stroke="none"/>
    <path d="M33.3 215.2 L36.7 214.85 38.2 214.7 36.6 219.65 35.15 219.8 30.65 220.35 33.3 215.2 M101.15 236.15 L100.45 237.95 91.8 237.95 101.15 236.15" fill="#bababa" fill-rule="evenodd" stroke="none"/>
    <path d="M103.2 214.45 Q103.65 216.1 103.45 217.55 103.2 217.7 103.35 217.95 103.2 218.0 103.35 218.15 L103.3 218.25 Q102.6 218.9 102.15 219.75 L101.35 221.15 101.2 221.45 100.35 223.05 Q99.4 224.5 98.7 226.05 L98.1 227.55 97.5 230.25 97.35 231.1 97.25 232.5 95.8 232.5 95.75 230.75 96.45 227.1 Q100.35 222.75 102.25 217.3 L103.2 214.45 M62.35 232.6 L55.7 232.6 56.9 231.9 58.8 230.9 61.8 229.2 63.0 228.6 64.15 228.0 Q65.85 227.15 67.7 226.65 L69.5 226.4 69.85 226.4 70.25 226.45 69.6 227.4 69.0 227.85 65.8 230.2 62.35 232.55 62.35 232.6" fill="#666666" fill-rule="evenodd" stroke="none"/>
    <path d="M93.7 211.15 L93.7 210.95 Q93.5 210.2 93.65 209.95 L98.7 212.85 98.8 212.9 Q98.4 213.2 98.15 213.65 L97.8 214.35 97.7 214.75 93.7 211.15" fill="#8c8c8c" fill-rule="evenodd" stroke="none"/>
    <path d="M102.1 233.7 L101.15 236.15 91.8 237.95 22.3 237.95 96.8 236.35 101.65 233.7 102.1 233.7" fill="#a3a3a3" fill-rule="evenodd" stroke="none"/>
    <path d="M90.3 226.45 L91.05 227.0 91.45 227.3 91.75 228.0 91.7 228.4 Q93.6 227.95 93.7 226.45 93.7 225.9 93.35 225.45 92.7 224.8 91.5 224.8 90.25 224.8 90.2 225.8 L90.3 226.45 M90.75 228.9 L90.6 228.8 Q89.7 228.35 89.4 227.8 L89.2 226.7 Q89.2 224.7 91.5 224.7 93.25 224.7 94.1 225.7 94.7 226.45 94.7 227.35 94.7 230.45 89.95 230.45 L86.05 229.8 Q84.45 229.05 84.05 228.85 L79.8 226.65 75.85 224.75 Q72.55 223.35 70.5 223.35 67.6 223.35 66.65 224.1 66.05 224.55 66.05 225.75 L66.2 226.7 66.55 227.45 67.55 228.5 Q68.4 229.15 69.15 229.15 L70.0 228.9 69.85 228.75 Q69.6 228.45 68.8 228.25 68.35 228.2 68.0 227.7 67.65 227.3 67.65 227.0 67.65 224.7 70.0 224.7 71.4 224.7 71.9 225.8 L71.9 225.95 Q72.55 226.6 72.55 227.9 L72.1 229.45 Q71.25 230.95 69.15 230.95 67.45 230.95 66.0 229.65 64.25 228.15 64.25 225.8 64.25 224.7 64.65 223.7 65.25 222.2 66.55 222.05 L68.7 221.7 70.95 221.55 73.0 221.8 73.8 222.1 75.35 222.65 Q79.95 225.1 81.85 225.9 L85.3 227.7 Q87.85 228.95 89.85 228.95 L90.75 228.9 M52.8 223.45 L53.35 222.65 Q53.0 222.5 52.25 222.9 L51.6 223.0 51.05 222.65 50.8 222.0 50.65 221.05 Q50.25 221.2 50.0 222.35 L49.65 222.85 49.05 223.05 48.45 222.9 Q47.45 222.25 47.15 222.35 L47.6 223.25 47.75 223.85 47.55 224.4 47.0 224.75 Q46.2 224.95 46.05 225.2 L47.1 225.55 47.65 225.85 47.9 226.45 47.75 227.05 Q47.3 227.8 47.35 228.05 L48.3 227.6 48.9 227.45 49.45 227.7 49.8 228.2 Q50.0 228.95 50.25 229.1 L50.45 228.5 Q50.55 228.15 50.8 227.95 51.05 227.75 51.4 227.75 L52.0 227.95 52.55 228.35 Q52.7 228.0 52.3 227.2 L52.25 226.55 Q52.3 226.2 52.6 226.0 52.85 225.75 53.2 225.75 L54.1 225.6 Q53.95 225.3 53.2 225.0 L52.7 224.6 52.55 224.0 52.8 223.45 M71.55 227.0 Q71.55 226.2 71.2 225.75 L70.9 225.2 Q70.6 224.8 70.0 224.8 68.65 224.8 68.65 226.1 L68.75 226.15 68.85 226.25 68.9 226.35 69.05 226.4 Q70.25 226.7 70.65 227.2 L70.65 227.25 70.95 227.65 70.95 228.3 70.9 228.5 71.25 228.05 71.55 227.0 M51.8 222.9 L54.05 222.85 Q54.7 223.5 53.55 224.95 55.1 225.55 55.1 226.5 55.1 227.45 53.25 227.65 L53.2 227.65 Q53.95 229.25 53.25 229.95 52.65 230.55 51.4 229.65 51.0 231.0 50.25 231.0 49.25 231.0 48.8 229.35 47.25 230.25 46.65 229.65 45.95 228.95 46.9 227.4 45.05 227.0 45.05 226.1 45.05 225.1 46.75 224.65 45.85 223.15 46.45 222.55 47.2 221.8 49.0 222.95 49.55 220.95 50.65 220.95 51.6 220.95 51.8 222.8 L51.8 222.9 M37.75 225.8 Q37.75 228.15 36.0 229.65 34.55 230.95 32.85 230.95 30.75 230.95 29.9 229.45 29.45 228.7 29.45 227.9 29.45 226.6 30.1 225.95 L30.1 225.8 Q30.6 224.7 32.0 224.7 34.35 224.7 34.35 227.0 L34.0 227.7 33.2 228.25 Q32.4 228.45 32.15 228.75 L32.0 228.9 32.85 229.15 Q33.6 229.15 34.45 228.5 L35.45 227.45 35.8 226.7 35.95 225.75 Q35.95 224.55 35.35 224.1 34.4 223.35 31.5 223.35 29.45 223.35 26.15 224.75 L22.2 226.65 17.95 228.85 15.95 229.8 12.05 230.45 Q7.3 230.45 7.3 227.35 7.3 226.45 7.9 225.7 8.75 224.7 10.5 224.7 12.8 224.7 12.8 226.7 L12.6 227.8 Q12.3 228.35 11.4 228.8 L11.25 228.9 12.15 228.95 Q14.15 228.95 16.7 227.7 L20.15 225.9 26.65 222.65 28.2 222.1 29.0 221.8 31.05 221.55 33.3 221.7 35.45 222.05 Q36.75 222.2 37.35 223.7 37.75 224.7 37.75 225.8 M8.65 225.45 Q8.3 225.9 8.3 226.45 8.4 227.95 10.35 228.4 L10.25 228.0 Q10.25 227.6 10.55 227.3 L10.95 227.0 11.7 226.45 11.8 225.8 Q11.75 224.8 10.5 224.8 9.3 224.8 8.7 225.45 L8.65 225.45 M31.1 225.2 L30.8 225.75 Q30.45 226.2 30.45 227.0 30.45 227.55 30.75 228.05 L30.8 228.05 31.15 228.5 31.05 228.3 Q30.95 227.95 31.1 227.65 L31.35 227.25 31.4 227.2 Q31.75 226.7 32.95 226.4 L33.1 226.35 33.2 226.25 33.25 226.15 33.35 226.1 Q33.35 224.8 32.0 224.8 31.4 224.8 31.1 225.2" fill="#8a8a8a" fill-rule="evenodd" stroke="none"/>
    <path d="M90.3 226.45 L90.2 225.8 Q90.25 224.8 91.5 224.8 92.7 224.8 93.35 225.45 93.7 225.9 93.7 226.45 93.6 227.95 91.7 228.4 L91.75 228.0 91.45 227.3 91.05 227.0 90.3 226.45 M71.55 227.0 L71.25 228.05 70.9 228.5 70.95 228.3 70.95 227.65 70.65 227.25 70.65 227.2 Q70.25 226.7 69.05 226.4 L68.9 226.35 68.85 226.25 68.75 226.15 68.65 226.1 Q68.65 224.8 70.0 224.8 70.6 224.8 70.9 225.2 L71.2 225.75 Q71.55 226.2 71.55 227.0 M52.8 223.45 L52.55 224.0 52.7 224.6 53.2 225.0 Q53.95 225.3 54.1 225.6 L53.2 225.75 Q52.85 225.75 52.6 226.0 52.3 226.2 52.25 226.55 L52.3 227.2 Q52.7 228.0 52.55 228.35 L52.0 227.95 51.4 227.75 Q51.05 227.75 50.8 227.95 50.55 228.15 50.45 228.5 L50.25 229.1 Q50.0 228.95 49.8 228.2 L49.45 227.7 48.9 227.45 48.3 227.6 47.35 228.05 Q47.3 227.8 47.75 227.05 L47.9 226.45 47.65 225.85 47.1 225.55 46.05 225.2 Q46.2 224.95 47.0 224.75 L47.55 224.4 47.75 223.85 47.6 223.25 47.15 222.35 Q47.45 222.25 48.45 222.9 L49.05 223.05 49.65 222.85 50.0 222.35 Q50.25 221.2 50.65 221.05 L50.8 222.0 51.05 222.65 51.6 223.0 52.25 222.9 Q53.0 222.5 53.35 222.65 L52.8 223.45 M31.1 225.2 Q31.4 224.8 32.0 224.8 33.35 224.8 33.35 226.1 L33.25 226.15 33.2 226.25 33.1 226.35 32.95 226.4 Q31.75 226.7 31.4 227.2 L31.35 227.25 31.1 227.65 Q30.95 227.95 31.05 228.3 L31.15 228.5 30.8 228.05 30.75 228.05 Q30.45 227.55 30.45 227.0 30.45 226.2 30.8 225.75 L31.1 225.2 M8.65 225.45 L8.7 225.45 Q9.3 224.8 10.5 224.8 11.75 224.8 11.8 225.8 L11.7 226.45 10.95 227.0 10.55 227.3 Q10.25 227.6 10.25 228.0 L10.35 228.4 Q8.4 227.95 8.3 226.45 8.3 225.9 8.65 225.45" fill="#bababa" fill-rule="evenodd" stroke="none"/>
    <path d="M50.25 211.8 L51.45 214.35 51.1 214.4 48.25 214.5 47.55 214.4 47.05 211.45 49.65 211.8 50.25 211.8" fill="#999999" fill-rule="evenodd" stroke="none"/>
    <path d="M43.95 21.95 Q44.25 22.75 45.1 23.15 L45.5 23.3 46.9 23.45 47.4 23.45 47.4 23.35 47.4 23.2 47.2 22.75 47.7 19.95 47.95 17.8 47.7 17.05 Q46.65 13.55 46.65 12.65 46.65 11.3 46.95 9.7 47.35 7.65 48.0 7.2 L48.05 7.15 48.15 7.45 47.85 8.8 Q47.5 10.2 47.5 10.6 L47.7 12.3 47.9 13.15 Q49.0 13.0 49.75 11.85 L50.4 10.45 50.25 9.15 Q50.0 8.85 48.25 8.5 L48.65 7.5 48.75 7.3 49.35 6.6 Q50.0 6.05 50.25 6.05 50.55 6.05 51.0 7.95 L51.45 9.5 Q51.45 10.75 50.4 12.05 L49.65 13.05 48.75 13.15 48.1 13.35 47.95 13.3 48.75 16.0 Q49.95 19.7 49.95 20.55 L49.85 21.5 49.65 22.0 50.05 22.4 50.4 22.65 Q50.4 23.1 49.65 23.55 L49.65 23.65 49.3 23.75 48.65 23.95 48.55 23.95 45.55 24.3 44.95 24.1 44.45 23.55 44.0 22.75 43.9 22.4 43.95 21.95 M50.0 4.95 Q50.2 4.6 50.55 4.45 L50.0 4.95 49.9 5.1 49.3 6.1 Q49.35 5.55 49.65 5.4 L49.9 5.1 50.0 4.95 M53.4 21.55 L52.75 18.85 52.2 19.6 51.9 19.1 Q51.9 18.8 52.55 18.1 L52.45 17.7 52.35 17.35 51.85 18.25 51.45 18.25 51.4 17.9 Q51.65 16.65 52.0 15.95 L51.9 15.65 52.15 14.9 52.5 12.6 52.4 11.25 52.65 9.75 52.65 8.8 52.8 9.0 Q53.1 8.6 53.1 7.6 L52.65 5.85 52.0 5.15 52.45 4.7 Q52.65 4.7 53.1 6.1 L53.75 7.6 Q53.75 10.5 53.9 11.6 L54.55 16.5 54.75 17.85 54.8 18.25 54.8 18.7 54.75 19.4 Q54.5 20.55 53.4 21.55 M51.3 5.8 L51.5 5.6 52.1 6.9 51.3 5.8 M51.75 8.55 L51.75 9.15 51.0 7.05 51.75 8.55 M53.4 13.35 L53.05 12.6 52.95 12.6 Q53.35 13.2 53.05 14.15 L52.65 15.6 Q52.65 15.9 52.8 16.05 L53.2 15.15 53.55 14.0 53.4 13.35 M51.85 13.7 L51.95 13.25 51.85 13.65 51.85 13.7 51.25 15.8 51.15 15.55 51.65 14.1 51.85 13.7 M47.4 18.9 Q47.4 20.75 46.5 21.3 46.15 21.2 46.15 20.8 L46.5 18.9 46.5 18.0 Q46.55 17.4 47.2 17.25 L47.4 18.9 M55.6 30.6 L55.3 35.75 55.3 36.0 Q54.85 42.75 55.0 46.75 55.15 51.6 53.8 57.4 L53.0 61.1 53.8 63.95 53.2 70.05 52.65 74.5 52.4 76.35 52.3 79.8 Q52.3 83.6 52.65 87.2 L53.15 91.5 Q53.95 97.25 55.4 101.2 54.6 101.55 54.05 102.7 53.1 99.6 52.35 95.95 L51.85 93.5 51.8 94.95 51.75 95.5 51.85 97.55 51.7 97.95 51.45 98.15 Q51.05 98.15 50.7 96.5 50.35 96.3 50.35 95.65 L50.4 95.2 49.5 92.1 49.0 91.45 48.4 90.6 47.95 89.1 47.55 86.15 47.6 83.6 47.75 82.35 Q47.85 81.75 48.3 81.65 48.75 81.5 48.8 82.15 L48.8 84.7 Q48.85 86.25 49.05 87.35 49.15 89.05 49.5 89.85 L49.45 88.0 49.5 85.05 49.2 81.6 49.45 79.05 49.65 75.6 49.95 75.6 50.45 76.7 50.75 77.65 50.85 77.55 51.1 76.15 Q50.95 75.35 51.1 73.7 L50.85 72.5 50.6 71.2 50.65 69.8 Q50.65 68.55 51.5 68.8 L51.7 67.1 51.7 66.85 51.75 66.85 51.75 66.4 Q51.7 65.55 52.1 65.25 L52.45 63.55 52.5 63.25 52.5 57.75 51.15 61.45 51.65 58.7 52.0 55.5 Q51.95 54.4 52.6 54.1 53.4 53.75 53.65 52.95 54.3 50.55 54.3 48.75 54.3 46.5 53.25 41.8 52.2 37.1 52.2 34.5 L52.3 32.65 53.35 32.2 55.6 30.6 M52.3 111.55 L52.3 112.4 52.65 112.45 53.9 112.6 55.4 112.4 Q55.8 114.0 55.8 116.9 55.8 123.4 52.7 146.45 L52.65 146.85 51.65 154.4 51.6 154.65 51.3 158.9 50.5 170.6 51.05 172.0 Q51.55 173.8 52.65 184.15 L53.0 187.85 53.3 190.05 53.5 191.5 53.65 192.65 53.7 193.05 53.75 193.55 53.75 193.7 53.65 194.1 53.8 194.15 53.85 195.35 Q53.8 196.9 53.2 197.85 L53.0 198.15 51.85 193.05 51.7 193.05 51.75 195.25 Q51.75 196.7 51.15 196.95 L50.55 196.2 50.55 195.3 50.7 195.3 50.85 195.55 51.0 193.6 50.2 189.2 50.15 189.0 49.85 187.15 49.5 184.45 49.15 179.1 49.15 177.65 50.2 181.75 51.15 186.0 Q51.75 188.25 52.65 190.05 L52.8 189.9 52.9 189.55 50.85 180.55 50.1 178.2 49.5 176.05 49.35 174.8 51.3 157.0 Q51.35 143.25 52.0 136.3 L52.45 128.65 52.2 128.5 52.05 128.05 51.75 129.95 51.75 131.75 51.5 133.6 51.35 134.5 Q51.1 135.2 50.7 135.2 49.95 135.2 49.95 134.35 49.95 132.6 50.4 128.1 L50.65 126.55 50.85 125.05 51.2 123.1 Q51.45 122.25 52.3 122.25 52.75 122.25 53.0 122.65 L53.2 123.1 Q53.5 121.8 53.4 119.25 53.5 118.55 53.75 118.4 L53.65 115.65 53.55 115.65 52.3 117.45 52.3 115.35 51.3 115.2 52.3 111.55 M47.05 57.9 L47.2 56.25 47.55 56.25 48.1 56.2 48.85 57.9 48.9 58.05 49.15 58.5 49.15 58.7 48.75 60.25 48.5 62.1 48.45 62.1 Q47.8 62.1 47.95 61.5 47.95 60.4 48.3 59.35 L48.45 58.85 47.05 57.9 M45.05 31.4 L45.4 31.55 46.35 31.7 46.9 31.65 47.05 31.65 48.6 31.9 49.4 31.95 49.3 33.35 47.8 33.4 46.0 33.05 45.25 32.85 45.15 32.3 45.0 31.5 45.05 31.4 M49.0 38.25 L49.2 39.9 49.35 41.6 Q49.35 44.45 48.8 44.45 48.25 44.45 48.2 43.7 L48.2 42.35 48.05 41.3 Q48.05 40.8 47.7 40.75 L47.25 40.6 Q47.1 40.35 46.9 38.75 L46.7 36.5 Q46.7 35.3 48.3 36.7 L48.25 37.5 48.8 37.85 49.0 38.25 M47.45 54.55 L47.35 54.55 Q46.7 54.55 46.4 54.15 L46.2 53.7 Q46.2 51.95 47.3 51.7 48.25 51.5 48.4 52.75 L48.4 53.2 Q48.4 54.5 47.45 54.55 M49.75 51.3 L49.7 51.3 Q48.7 51.3 48.75 50.15 48.75 49.55 49.15 49.55 L49.65 49.7 50.25 49.85 51.0 49.3 51.6 48.7 51.75 49.2 51.75 49.3 51.3 50.35 51.0 50.9 50.35 50.85 50.15 51.1 Q49.95 51.3 49.75 51.3 M47.95 65.45 L47.5 68.5 Q47.5 68.85 47.95 68.85 L47.75 69.5 47.9 69.3 48.2 68.75 48.5 68.25 Q48.95 67.45 49.3 67.45 L49.7 67.75 49.75 68.05 49.55 69.3 48.75 70.85 47.9 72.55 Q47.3 73.55 46.85 73.55 L46.65 73.55 Q45.75 73.3 46.35 71.15 45.95 71.1 45.95 70.55 45.95 70.0 46.75 67.6 L47.3 66.1 Q47.5 65.45 47.9 65.45 L47.95 65.45 M51.5 71.35 L51.55 71.65 51.6 71.3 51.5 71.35 M49.3 97.65 Q49.3 97.25 49.65 97.0 L50.7 99.05 51.2 101.25 50.9 103.55 50.85 104.6 Q50.7 105.6 50.45 105.6 49.75 105.6 49.8 103.8 49.8 103.15 50.15 101.3 L49.75 99.4 49.3 97.65 M52.0 118.65 L52.05 119.35 51.85 120.25 51.65 120.3 Q51.3 120.3 51.25 119.8 L51.25 119.2 Q51.25 118.5 51.4 118.2 51.9 118.3 52.0 118.65 M47.65 180.9 L47.65 182.9 Q48.2 182.0 48.8 181.9 L48.85 181.2 48.9 181.95 49.25 186.05 49.2 186.15 48.9 187.15 Q48.6 189.75 48.6 191.2 L48.8 193.5 48.7 194.2 Q48.3 193.8 48.25 192.65 L48.2 190.85 48.1 187.6 48.25 186.3 48.0 186.25 47.95 184.3 47.65 184.75 47.1 185.05 Q46.05 185.05 46.2 181.8 46.2 180.65 46.7 178.9 L47.2 177.5 Q47.55 176.9 47.9 177.4 L48.15 178.25 47.9 179.7 47.65 180.9" fill="#78624e" fill-rule="evenodd" stroke="none"/>
    <path d="M44.2 19.4 L44.15 19.85 44.05 20.3 43.85 21.55 43.8 21.8 43.9 22.4 44.0 22.75 44.45 23.55 44.95 24.1 45.55 24.3 48.55 23.95 48.65 23.95 49.3 23.75 49.65 23.65 51.0 23.1 51.75 22.7 53.4 21.55 Q54.5 20.55 54.75 19.4 L54.8 18.7 54.8 18.25 54.75 17.85 54.55 16.5 54.8 16.7 55.65 17.75 Q56.25 18.65 56.25 19.3 L56.0 20.55 55.55 21.4 53.95 23.3 53.75 23.5 53.5 23.7 53.35 23.8 Q50.4 26.4 47.95 26.4 45.85 26.4 44.35 25.7 L44.3 25.65 43.9 25.4 43.8 25.35 43.05 24.6 42.6 23.8 Q42.35 23.25 42.35 22.6 L42.4 22.4 42.45 22.05 42.6 21.75 42.9 21.25 43.05 21.05 43.85 19.9 44.2 19.4 M55.85 24.25 L56.4 24.8 56.65 25.7 55.95 26.95 55.8 27.1 55.8 27.2 54.9 28.1 52.95 30.15 49.9 31.0 49.4 31.15 47.05 31.65 46.9 31.65 46.35 31.7 45.4 31.55 45.05 31.4 45.0 31.35 44.7 31.25 Q43.7 30.7 43.7 30.0 L43.95 29.6 44.3 28.85 44.5 28.95 44.55 29.05 44.7 29.15 45.05 29.4 Q46.0 30.0 47.2 30.0 50.15 30.0 53.45 26.95 55.0 25.6 55.8 24.3 L55.85 24.25" fill="#e0d2a1" fill-rule="evenodd" stroke="none"/>
    <path d="M43.1 42.2 L43.2 43.35 43.2 45.1 43.0 49.7 Q42.55 49.7 42.0 49.35 L40.95 49.15 40.95 47.2 41.15 46.3 41.45 43.35 41.15 39.9 40.95 39.7 40.8 39.25 40.8 38.6 Q40.4 36.4 40.3 34.65 L41.25 35.0 Q41.45 35.65 42.45 35.1 L42.65 35.1 42.65 35.35 43.1 42.2 M38.0 30.85 L37.1 29.35 Q36.45 28.15 36.45 27.7 36.45 26.85 40.15 23.8 39.5 24.55 39.1 25.85 38.0 28.5 38.0 30.85 M42.85 26.1 L42.95 26.2 43.6 26.8 43.65 26.9 43.6 27.0 Q43.6 28.05 44.3 28.85 L43.95 29.6 41.8 31.2 Q41.25 31.65 41.15 32.3 L40.95 32.3 Q40.95 30.45 41.6 28.5 42.05 26.95 42.85 26.1" fill="#918768" fill-rule="evenodd" stroke="none"/>
    <path d="M43.05 24.6 L43.8 25.35 43.9 25.4 44.3 25.65 44.35 25.7 Q45.85 26.4 47.95 26.4 50.4 26.4 53.35 23.8 L53.4 23.85 52.65 25.0 51.25 26.5 49.4 27.5 47.25 28.3 Q45.95 28.3 44.4 27.4 L44.3 27.3 44.2 27.25 43.65 26.9 43.6 26.8 42.95 26.2 42.85 26.1 42.7 25.65 Q42.7 25.35 43.05 24.6" fill="#b8ac84" fill-rule="evenodd" stroke="none"/>
    <path d="M56.0 20.55 L56.75 21.5 Q56.75 22.75 55.85 24.25 L55.8 24.2 55.8 24.3 Q55.0 25.6 53.45 26.95 50.15 30.0 47.2 30.0 46.0 30.0 45.05 29.4 L44.7 29.15 44.55 29.05 44.5 28.95 44.3 28.85 Q43.6 28.05 43.6 27.0 L43.65 26.9 44.2 27.25 44.3 27.3 44.4 27.4 Q45.95 28.3 47.25 28.3 L49.4 27.5 51.25 26.5 52.65 25.0 53.4 23.85 53.5 23.8 53.5 23.7 53.75 23.5 53.95 23.3 55.55 21.4 56.0 20.55 M55.95 26.95 L56.15 27.75 Q56.15 28.6 55.65 29.35 55.05 30.2 53.8 30.85 L52.7 31.4 52.45 31.5 49.45 31.95 49.4 31.95 48.6 31.9 47.05 31.65 49.4 31.15 49.9 31.0 52.95 30.15 54.9 28.1 55.8 27.2 55.8 27.1 55.95 26.95" fill="#a39875" fill-rule="evenodd" stroke="none"/>
    <path d="M55.8 200.35 L56.55 199.7 56.75 199.6 56.75 199.55 57.2 199.2 57.6 199.15 57.7 199.15 58.0 199.35 58.15 199.7 58.1 199.85 57.95 200.0 57.05 200.75 55.7 201.75 55.7 201.55 55.8 200.35 M50.7 219.7 L50.4 219.7 47.7 219.7 47.7 219.65 47.3 217.65 47.05 214.25 47.55 214.4 48.25 214.5 51.1 214.4 51.1 215.65 51.0 217.3 50.95 217.8 50.7 219.65 50.7 219.7 M47.0 201.75 L47.75 201.85 49.05 202.0 50.7 201.65 50.75 202.4 50.95 204.2 50.95 204.3 51.0 205.75 51.55 206.6 51.25 207.1 50.95 207.55 51.6 211.6 50.25 211.8 49.65 211.8 47.05 211.45 47.0 211.45 47.0 211.35 46.95 210.85 47.0 201.75" fill="#575757" fill-rule="evenodd" stroke="none"/>
    <path d="M55.5 218.5 L53.4 219.2 50.7 219.65 50.95 219.65 50.7 219.7 50.7 219.65 50.95 217.8 51.0 217.3 51.1 215.65 51.1 214.4 51.45 214.35 54.05 213.7 55.05 213.5 55.55 213.3 55.65 214.5 55.7 215.65 55.7 216.85 55.6 217.9 55.5 218.5 M44.85 219.5 Q43.05 219.15 41.9 218.25 L41.8 217.55 41.55 215.65 41.3 213.15 41.35 212.7 41.45 212.35 41.5 212.25 Q42.7 213.05 44.05 213.5 L44.15 214.15 44.3 215.65 44.55 217.6 44.85 219.5 M43.1 206.55 L43.05 205.75 42.95 205.5 42.95 205.35 42.95 205.3 42.95 205.05 42.85 204.4 42.6 202.05 42.55 201.65 42.15 199.65 41.85 198.4 41.85 198.0 42.3 198.75 42.85 199.4 43.2 199.85 43.6 200.15 Q44.15 202.25 44.35 204.9 L44.45 205.5 44.5 206.1 44.65 208.4 44.8 210.5 43.4 209.5 43.4 209.45 43.2 209.15 43.2 208.35 43.2 207.8 43.1 206.55 M51.6 211.6 L50.95 207.55 51.25 207.1 51.55 206.6 51.0 205.75 50.95 204.3 50.95 204.2 50.75 202.4 50.7 201.65 Q51.1 201.45 51.75 201.2 L53.4 200.4 53.7 204.0 53.8 205.5 53.9 210.9 53.55 211.05 52.3 211.45 51.6 211.6" fill="#6b6b6b" fill-rule="evenodd" stroke="none"/>
    <path d="M55.45 196.05 L55.85 197.45 55.9 198.25 55.8 200.35 55.7 201.55 55.7 201.75 55.65 203.55 55.7 204.0 56.0 205.5 56.0 205.65 56.1 206.1 56.15 206.25 56.2 206.6 56.35 207.9 56.1 209.0 55.65 209.7 Q55.05 210.35 53.95 210.8 L53.9 210.9 53.8 205.5 53.7 204.0 53.4 200.4 53.55 200.2 54.2 199.6 55.1 198.3 55.4 197.0 55.45 196.05 M56.55 198.4 L56.6 198.25 Q56.75 197.4 57.8 197.4 58.5 197.4 59.05 198.4 L59.5 199.95 59.05 200.85 58.4 201.3 58.65 200.95 58.85 200.1 58.4 198.7 Q57.95 197.9 57.3 197.9 56.7 197.9 56.55 198.4 M58.4 209.7 L58.55 212.4 58.3 215.3 58.25 215.65 Q57.9 216.95 56.75 217.9 L56.0 218.4 55.85 218.45 55.45 218.65 55.5 218.5 55.6 217.9 55.7 216.85 55.7 215.65 55.65 214.5 55.55 213.3 55.95 213.1 Q57.0 212.6 57.6 211.5 L57.75 211.15 58.4 209.7" fill="#7d7d7d" fill-rule="evenodd" stroke="none"/>
    <path d="M56.75 199.55 L56.7 199.35 56.6 198.85 56.55 198.4 Q56.7 197.9 57.3 197.9 57.95 197.9 58.4 198.7 L58.85 200.1 58.65 200.95 58.4 201.3 58.3 201.3 Q57.7 201.3 57.2 200.65 L57.05 200.75 57.95 200.0 58.1 199.85 58.15 199.7 58.0 199.35 57.7 199.15 57.6 199.15 57.2 199.2 56.75 199.55 M47.7 219.7 L46.85 219.65 45.35 219.55 44.85 219.5 44.55 217.6 44.3 215.65 44.15 214.15 44.05 213.5 44.25 213.6 45.95 214.0 47.05 214.25 47.3 217.65 47.7 219.65 47.7 219.7 M43.6 200.15 L44.15 200.5 Q45.55 201.25 46.75 201.7 L47.0 201.75 46.95 210.85 47.0 211.35 47.0 211.45 45.35 210.8 44.95 210.6 44.8 210.5 44.65 208.4 44.5 206.1 44.45 205.5 44.35 204.9 Q44.15 202.25 43.6 200.15" fill="#474747" fill-rule="evenodd" stroke="none"/>
    <path d="M41.9 218.25 L41.5 217.9 41.2 217.55 40.25 216.3 39.9 209.8 40.1 209.4 40.1 210.1 40.15 210.2 41.1 212.0 41.4 212.2 41.5 212.25 41.45 212.35 41.35 212.7 41.3 213.15 41.55 215.65 41.8 217.55 41.9 218.25" fill="#7a7a7a" fill-rule="evenodd" stroke="none"/>
    <path d="M41.85 198.0 L41.9 197.7 43.7 196.05 43.7 196.7 43.65 196.8 43.75 196.85 44.2 197.65 43.2 199.85 42.85 199.4 42.3 198.75 41.85 198.0 M53.2 197.85 Q53.8 196.9 53.85 195.35 L55.1 196.65 55.4 197.0 55.1 198.3 54.2 199.6 53.2 197.85 M53.55 211.05 L53.9 210.9 53.95 210.8 Q55.05 210.35 55.65 209.7 L57.6 211.5 Q57.0 212.6 55.95 213.1 L55.55 213.3 55.05 213.5 53.55 211.05 M43.2 207.8 L43.2 208.35 43.2 209.15 43.4 209.45 41.4 212.2 41.1 212.0 40.15 210.2 40.1 210.1 43.2 207.8" fill="#d6d6d6" fill-rule="evenodd" stroke="none"/>
    <path d="M53.8 194.15 L54.6 194.7 55.45 196.05 55.4 197.0 55.1 196.65 53.85 195.35 53.8 194.15 M56.2 206.6 L57.3 207.55 57.9 208.45 58.0 208.5 58.05 208.5 58.4 209.7 57.75 211.15 57.6 211.5 55.65 209.7 56.1 209.0 56.35 207.9 56.2 206.6 M40.1 209.4 L40.4 209.0 41.2 207.95 43.1 206.55 43.2 207.8 40.1 210.1 40.1 209.4 M41.9 197.7 L42.05 197.05 42.9 195.75 43.4 195.0 43.6 194.9 43.7 196.05 41.9 197.7" fill="#f0f0f0" fill-rule="evenodd" stroke="none"/>
    <path d="M47.7 199.5 L48.9 199.6 Q51.1 199.6 52.6 198.45 L53.0 198.15 53.2 197.85 54.2 199.6 53.55 200.2 53.4 200.4 51.75 201.2 Q51.1 201.45 50.7 201.65 L49.05 202.0 47.75 201.85 47.75 201.7 47.7 199.5 M51.6 211.6 L52.3 211.45 53.55 211.05 55.05 213.5 54.05 213.7 51.45 214.35 50.25 211.8 51.6 211.6" fill="#a6a6a6" fill-rule="evenodd" stroke="none"/>
    <path d="M44.2 197.65 Q44.8 198.5 46.3 199.05 L47.7 199.5 47.75 201.7 47.75 201.85 47.0 201.75 46.75 201.7 Q45.55 201.25 44.15 200.5 L43.6 200.15 43.2 199.85 44.2 197.65 M44.95 210.6 L45.35 210.8 47.0 211.45 47.05 211.45 47.55 214.4 47.05 214.25 45.95 214.0 44.25 213.6 44.55 212.15 44.95 210.6" fill="#8c8c8c" fill-rule="evenodd" stroke="none"/>
    <path d="M44.8 210.5 L44.95 210.6 44.55 212.15 44.25 213.6 44.05 213.5 Q42.7 213.05 41.5 212.25 L41.4 212.2 43.4 209.45 43.4 209.5 44.8 210.5" fill="#808080" fill-rule="evenodd" stroke="none"/>
    <path d="M49.8 5.05 L50.0 4.95 49.9 5.1 49.8 5.05 M50.65 6.5 L50.65 6.55 50.6 6.55 50.65 6.5 M55.65 29.35 L55.6 30.6 53.35 32.2 52.3 32.65 52.45 31.5 52.7 31.4 53.8 30.85 Q55.05 30.2 55.65 29.35" fill="#524335" fill-rule="evenodd" stroke="none"/>
    <path d="M49.3 33.35 L49.4 31.95 49.45 31.95 52.45 31.5 52.3 32.65 49.3 33.35" fill="#403429" fill-rule="evenodd" stroke="none"/>
    <path d="M40.3 34.65 Q38.0 33.9 38.0 31.4 L38.0 30.85 Q38.0 28.5 39.1 25.85 39.5 24.55 40.15 23.8 41.1 22.45 42.4 22.4 L42.35 22.6 Q42.35 23.25 42.6 23.8 L43.05 24.6 Q42.7 25.35 42.7 25.65 L42.85 26.1 Q42.05 26.95 41.6 28.5 40.95 30.45 40.95 32.3 L40.95 32.95 40.95 33.05 40.95 33.5 41.15 34.55 41.25 35.0 40.3 34.65" fill="#786f56" fill-rule="evenodd" stroke="none"/>
    <path d="M45.45 34.2 L44.85 34.55 44.4 34.65 Q44.3 34.65 44.3 34.8 L43.0 35.1 42.65 35.1 42.45 35.1 Q41.45 35.65 41.25 35.0 L41.15 34.55 40.95 33.5 40.95 33.05 40.95 32.95 41.15 32.3 Q41.25 31.65 41.8 31.2 L43.95 29.6 43.7 30.0 Q43.7 30.7 44.7 31.25 L45.0 31.35 45.05 31.4 45.0 31.5 45.15 32.3 45.05 32.85 45.35 33.7 45.45 34.2" fill="#6e664f" fill-rule="evenodd" stroke="none"/>
    <path d="M44.3 34.8 Q44.2 36.5 43.3 39.8 L43.1 42.2 42.65 35.35 43.0 35.1 44.3 34.8 M41.15 46.3 L40.05 46.3 40.05 42.85 40.6 41.65 40.8 39.9 40.95 39.7 41.15 39.9 41.45 43.35 41.15 46.3" fill="#474133" fill-rule="evenodd" stroke="none"/>
    <path d="M50.55 4.45 L50.85 4.25 51.2 4.1 52.4 3.65 52.95 3.55 53.5 3.6 53.7 4.6 53.75 7.6 53.1 6.1 Q52.65 4.7 52.45 4.7 L52.0 5.15 52.65 5.85 53.1 7.6 Q53.1 8.6 52.8 9.0 L52.65 8.8 52.65 9.75 52.4 11.25 52.5 12.6 52.15 14.9 51.9 15.65 52.0 15.95 Q51.65 16.65 51.4 17.9 L51.45 18.25 51.85 18.25 52.35 17.35 52.45 17.7 52.55 18.1 Q51.9 18.8 51.9 19.1 L52.2 19.6 52.75 18.85 53.4 21.55 51.75 22.7 51.0 23.1 49.65 23.65 49.65 23.55 Q50.4 23.1 50.4 22.65 L50.05 22.4 49.65 22.0 49.85 21.5 49.95 20.55 Q49.95 19.7 48.75 16.0 L47.95 13.3 48.1 13.35 48.75 13.15 49.65 13.05 50.4 12.05 Q51.45 10.75 51.45 9.5 L51.0 7.95 Q50.55 6.05 50.25 6.05 50.0 6.05 49.35 6.6 L48.75 7.3 48.65 7.5 48.25 8.5 48.2 8.65 47.7 10.9 47.7 12.3 47.5 10.6 Q47.5 10.2 47.85 8.8 L48.15 7.45 48.05 7.15 48.9 5.85 49.8 5.05 49.9 5.1 49.65 5.4 Q49.35 5.55 49.3 6.1 L49.9 5.1 50.0 4.95 50.55 4.45 M51.3 5.8 L52.1 6.9 51.5 5.6 51.3 5.8 M50.65 6.5 L50.6 6.55 50.65 6.55 50.65 6.5 M53.4 13.35 L53.55 14.0 53.2 15.15 52.8 16.05 Q52.65 15.9 52.65 15.6 L53.05 14.15 Q53.35 13.2 52.95 12.6 L53.05 12.6 53.4 13.35 M51.75 8.55 L51.0 7.05 51.75 9.15 51.75 8.55 M51.85 13.7 L51.65 14.1 51.15 15.55 51.25 15.8 51.85 13.7 51.85 13.65 51.95 13.25 51.85 13.7 M54.05 102.7 Q53.65 103.5 53.4 104.65 L52.65 107.95 52.3 109.35 52.3 111.55 51.3 115.2 52.3 115.35 52.3 117.45 53.55 115.65 53.65 115.65 53.75 118.4 Q53.5 118.55 53.4 119.25 53.5 121.8 53.2 123.1 L53.0 122.65 Q52.75 122.25 52.3 122.25 51.45 122.25 51.2 123.1 L50.85 125.05 50.65 126.55 50.4 128.1 Q49.95 132.6 49.95 134.35 49.95 135.2 50.7 135.2 51.1 135.2 51.35 134.5 L51.5 133.6 51.75 131.75 51.75 129.95 52.05 128.05 52.2 128.5 52.45 128.65 52.0 136.3 Q51.35 143.25 51.3 157.0 L49.35 174.8 49.5 176.05 50.1 178.2 50.85 180.55 52.9 189.55 52.8 189.9 52.65 190.05 Q51.75 188.25 51.15 186.0 L50.2 181.75 49.15 177.65 49.15 179.1 49.5 184.45 49.85 187.15 50.15 189.0 50.2 189.2 51.0 193.6 50.85 195.55 50.7 195.3 50.55 195.3 50.55 196.2 51.15 196.95 Q51.75 196.7 51.75 195.25 L51.7 193.05 51.85 193.05 53.0 198.15 52.6 198.45 Q51.1 199.6 48.9 199.6 L47.7 199.5 46.3 199.05 Q44.8 198.5 44.2 197.65 L43.75 196.85 43.7 196.7 43.7 196.05 43.6 194.9 43.5 194.65 43.6 194.4 43.5 194.0 43.45 193.9 43.4 193.3 43.4 193.05 43.25 191.5 43.15 190.05 42.9 186.85 Q43.75 183.45 44.2 179.8 L44.4 178.0 Q44.75 174.35 44.6 170.55 L44.7 169.2 44.7 168.45 Q44.7 165.1 45.6 160.15 46.1 157.35 46.65 155.65 L46.4 154.8 Q46.15 153.05 46.4 151.5 L47.5 147.45 48.35 149.4 Q47.85 146.9 47.45 142.45 46.9 136.75 46.9 132.9 L46.6 129.25 46.65 128.95 45.45 125.65 Q44.8 123.45 45.65 121.3 L46.45 119.05 47.1 117.3 47.3 117.55 46.9 118.95 Q46.9 119.35 47.2 119.45 L47.95 118.75 48.25 117.9 48.6 117.1 48.9 116.25 48.05 113.85 Q47.85 113.55 47.6 112.65 L47.55 112.55 47.4 111.45 47.05 107.85 46.65 103.65 46.5 99.85 46.35 101.25 46.3 107.5 46.95 113.2 46.9 114.5 46.05 116.25 45.95 116.2 45.85 115.9 46.1 114.75 46.35 113.15 45.75 108.4 Q45.6 106.8 45.6 103.65 L45.85 98.85 46.4 96.4 46.45 96.2 46.15 91.9 45.85 89.4 45.1 81.7 Q44.9 80.15 45.45 78.8 45.55 79.4 45.9 79.4 46.5 79.4 46.55 78.6 L46.4 77.15 46.5 74.75 46.4 74.3 46.6 73.6 46.65 73.55 46.85 73.55 Q47.3 73.55 47.9 72.55 L48.75 70.85 49.55 69.3 49.75 68.05 49.7 67.75 49.3 67.45 Q48.95 67.45 48.5 68.25 L48.2 68.75 47.9 69.3 48.05 68.85 47.95 68.85 Q47.5 68.85 47.5 68.5 L47.95 65.45 48.3 63.15 48.5 62.1 48.75 60.25 49.15 58.7 49.15 58.5 48.9 58.05 48.85 57.9 48.1 56.2 48.65 56.05 49.45 55.6 47.45 54.55 Q48.4 54.5 48.4 53.2 L48.4 52.75 48.8 51.95 49.5 51.6 49.75 51.3 Q49.95 51.3 50.15 51.1 L50.35 50.85 51.0 50.9 51.3 50.35 51.75 49.3 51.75 49.2 51.8 48.95 Q51.6 48.35 51.55 47.4 L51.05 46.25 50.7 45.1 50.05 42.9 49.65 40.55 49.95 38.1 49.8 36.8 49.4 34.3 49.3 33.35 52.3 32.65 52.2 34.5 Q52.2 37.1 53.25 41.8 54.3 46.5 54.3 48.75 54.3 50.55 53.65 52.95 53.4 53.75 52.6 54.1 51.95 54.4 52.0 55.5 L51.65 58.7 51.15 61.45 52.5 57.75 52.5 63.25 52.45 63.55 52.1 65.25 Q51.7 65.55 51.75 66.4 L51.75 66.85 51.7 66.85 51.7 67.1 51.5 68.8 Q50.65 68.55 50.65 69.8 L50.6 71.2 50.85 72.5 51.1 73.7 Q50.95 75.35 51.1 76.15 L50.85 77.55 50.75 77.65 50.45 76.7 49.95 75.6 49.65 75.6 49.45 79.05 49.2 81.6 49.5 85.05 49.45 88.0 49.5 89.85 Q49.15 89.05 49.05 87.35 48.85 86.25 48.8 84.7 L48.8 82.15 Q48.75 81.5 48.3 81.65 47.85 81.75 47.75 82.35 L47.6 83.6 47.55 86.15 47.95 89.1 48.4 90.6 49.0 91.45 49.5 92.1 50.4 95.2 50.35 95.65 Q50.35 96.3 50.7 96.5 51.05 98.15 51.45 98.15 L51.7 97.95 51.85 97.55 51.75 95.5 51.8 94.95 51.85 93.5 52.35 95.95 Q53.1 99.6 54.05 102.7 M50.4 39.95 Q50.4 41.0 51.55 44.8 L52.0 46.25 52.2 45.25 51.6 42.15 50.65 39.0 50.4 39.95 M49.85 59.8 L49.5 61.8 Q49.1 63.85 49.05 64.9 L49.7 62.45 50.15 60.3 50.2 60.05 49.85 59.8 M46.4 81.9 Q46.4 81.4 46.0 80.85 L45.7 80.9 45.55 81.9 Q45.55 82.9 46.0 82.9 L46.35 82.4 46.4 81.9 M46.75 76.25 L46.7 77.0 Q46.7 77.8 47.05 77.95 L47.35 76.7 47.2 75.5 46.75 76.25 M52.0 118.65 Q51.9 118.3 51.4 118.2 51.25 118.5 51.25 119.2 L51.25 119.8 Q51.3 120.3 51.65 120.3 L51.85 120.25 52.05 119.35 52.0 118.65 M49.3 97.65 L49.75 99.4 50.15 101.3 Q49.8 103.15 49.8 103.8 49.75 105.6 50.45 105.6 50.7 105.6 50.85 104.6 L50.9 103.55 51.2 101.25 50.7 99.05 49.65 97.0 Q49.3 97.25 49.3 97.65 M51.5 71.35 L51.6 71.3 51.55 71.65 51.5 71.35 M49.15 119.1 Q49.15 118.45 48.4 118.6 47.65 118.8 47.65 120.15 47.65 120.75 48.05 120.75 L48.8 120.0 49.15 119.1 M46.4 121.3 Q46.55 121.6 46.9 121.6 L47.2 121.3 47.45 120.8 47.4 120.5 Q46.7 120.1 46.4 121.3 M48.15 141.3 L48.45 144.9 48.9 148.5 48.75 150.3 49.25 151.55 Q49.55 148.2 49.05 145.05 L48.75 142.3 Q48.6 138.55 48.1 134.95 L47.9 133.25 47.65 131.85 47.45 131.15 47.55 134.05 48.15 141.3 M47.2 165.0 L47.7 163.0 47.7 162.7 47.3 162.4 Q46.65 162.4 46.3 163.65 L45.55 165.3 45.55 170.35 45.8 170.35 Q46.3 170.35 46.65 166.75 L47.2 165.0 M46.2 161.85 L45.8 163.85 46.05 162.9 46.8 160.05 Q47.2 158.75 47.1 157.5 L46.75 158.55 46.2 161.85 M47.65 180.9 L47.9 179.7 48.15 178.25 47.9 177.4 Q47.55 176.9 47.2 177.5 L46.7 178.9 Q46.2 180.65 46.2 181.8 46.05 185.05 47.1 185.05 L47.65 184.75 47.95 184.3 48.0 186.25 48.25 186.3 48.1 187.6 48.2 190.85 48.25 192.65 Q48.3 193.8 48.7 194.2 L48.8 193.5 48.6 191.2 Q48.6 189.75 48.9 187.15 L49.2 186.15 49.25 186.05 48.9 181.95 48.85 181.2 48.8 181.9 Q48.2 182.0 47.65 182.9 L47.65 180.9" fill="#5e4d3d" fill-rule="evenodd" stroke="none"/>
    <path d="M53.5 3.6 L52.95 3.55 52.4 3.65 51.2 4.1 50.85 4.25 50.55 4.45 Q50.2 4.6 50.0 4.95 L49.8 5.05 48.9 5.85 48.05 7.15 48.0 7.2 Q47.35 7.65 46.95 9.7 46.65 11.3 46.65 12.65 46.65 13.55 47.7 17.05 L47.95 17.8 47.7 19.95 47.2 22.75 47.4 23.2 47.4 23.35 47.4 23.45 46.9 23.45 45.5 23.3 45.1 23.15 Q44.25 22.75 43.95 21.95 L44.0 21.1 44.05 20.3 44.15 19.85 44.2 19.4 44.2 19.2 44.25 18.7 44.5 16.65 44.6 16.05 45.35 11.25 Q47.25 0.0 49.45 0.0 52.6 0.0 53.5 3.6 M47.4 18.9 L47.2 17.25 Q46.55 17.4 46.5 18.0 L46.5 18.9 46.15 20.8 Q46.15 21.2 46.5 21.3 47.4 20.75 47.4 18.9 M42.9 186.85 L42.65 182.0 Q42.65 179.3 44.2 161.95 45.6 144.95 46.65 141.4 L45.15 132.3 Q43.05 120.8 43.05 119.4 43.05 118.65 44.0 113.7 45.0 108.75 45.0 102.75 L44.45 90.3 Q43.8 81.35 43.8 77.45 43.8 73.4 44.75 70.05 L45.15 68.45 Q46.35 64.8 47.05 57.9 L48.45 58.85 48.3 59.35 Q47.95 60.4 47.95 61.5 47.8 62.1 48.45 62.1 L48.5 62.1 48.3 63.15 47.95 65.45 47.9 65.45 Q47.5 65.45 47.3 66.1 L46.75 67.6 Q45.95 70.0 45.95 70.55 45.95 71.1 46.35 71.15 45.75 73.3 46.65 73.55 L46.6 73.6 46.4 74.3 46.5 74.75 46.4 77.15 46.55 78.6 Q46.5 79.4 45.9 79.4 45.55 79.4 45.45 78.8 44.9 80.15 45.1 81.7 L45.85 89.4 46.15 91.9 46.45 96.2 46.4 96.4 45.85 98.85 45.6 103.65 Q45.6 106.8 45.75 108.4 L46.35 113.15 46.1 114.75 45.85 115.9 45.95 116.2 46.05 116.25 46.9 114.5 46.95 113.2 46.3 107.5 46.35 101.25 46.5 99.85 46.65 103.65 47.05 107.85 47.4 111.45 47.55 112.55 47.6 112.65 Q47.85 113.55 48.05 113.85 L48.9 116.25 48.6 117.1 48.25 117.9 47.95 118.75 47.2 119.45 Q46.9 119.35 46.9 118.95 L47.3 117.55 47.1 117.3 46.45 119.05 45.65 121.3 Q44.8 123.45 45.45 125.65 L46.65 128.95 46.6 129.25 46.9 132.9 Q46.9 136.75 47.45 142.45 47.85 146.9 48.35 149.4 L47.5 147.45 46.4 151.5 Q46.15 153.05 46.4 154.8 L46.65 155.65 Q46.1 157.35 45.6 160.15 44.7 165.1 44.7 168.45 L44.7 169.2 44.6 170.55 Q44.75 174.35 44.4 178.0 L44.2 179.8 Q43.75 183.45 42.9 186.85 M47.2 56.25 L46.2 55.45 46.05 55.2 Q45.4 54.15 45.4 52.5 45.4 51.05 46.1 49.8 L46.75 48.9 46.65 47.85 Q46.3 40.85 45.65 36.0 L45.45 34.2 45.35 33.7 45.25 32.85 46.0 33.05 47.8 33.4 49.3 33.35 49.4 34.3 49.8 36.8 49.95 38.1 49.65 40.55 50.05 42.9 50.7 45.1 51.05 46.25 51.55 47.4 Q51.6 48.35 51.8 48.95 L51.75 49.2 51.6 48.7 51.0 49.3 50.25 49.85 49.65 49.7 49.15 49.55 Q48.75 49.55 48.75 50.15 48.7 51.3 49.7 51.3 L49.75 51.3 49.5 51.6 48.8 51.95 48.4 52.75 Q48.25 51.5 47.3 51.7 46.2 51.95 46.2 53.7 L46.4 54.15 Q46.7 54.55 47.35 54.55 L47.45 54.55 49.45 55.6 48.65 56.05 48.1 56.2 47.55 56.25 47.2 56.25 M49.0 38.25 L48.8 37.85 48.25 37.5 48.3 36.7 Q46.7 35.3 46.7 36.5 L46.9 38.75 Q47.1 40.35 47.25 40.6 L47.7 40.75 Q48.05 40.8 48.05 41.3 L48.2 42.35 48.2 43.7 Q48.25 44.45 48.8 44.45 49.35 44.45 49.35 41.6 L49.2 39.9 49.0 38.25 M50.4 39.95 L50.65 39.0 51.6 42.15 52.2 45.25 52.0 46.25 51.55 44.8 Q50.4 41.0 50.4 39.95 M47.95 68.85 L48.05 68.85 47.9 69.3 47.75 69.5 47.95 68.85 M49.85 59.8 L50.2 60.05 50.15 60.3 49.7 62.45 49.05 64.9 Q49.1 63.85 49.5 61.8 L49.85 59.8 M46.75 76.25 L47.2 75.5 47.35 76.7 47.05 77.95 Q46.7 77.8 46.7 77.0 L46.75 76.25 M46.4 81.9 L46.35 82.4 46.0 82.9 Q45.55 82.9 45.55 81.9 L45.7 80.9 46.0 80.85 Q46.4 81.4 46.4 81.9 M49.15 119.1 L48.8 120.0 48.05 120.75 Q47.65 120.75 47.65 120.15 47.65 118.8 48.4 118.6 49.15 118.45 49.15 119.1 M46.4 121.3 Q46.7 120.1 47.4 120.5 L47.45 120.8 47.2 121.3 46.9 121.6 Q46.55 121.6 46.4 121.3 M48.15 141.3 L47.55 134.05 47.45 131.15 47.65 131.85 47.9 133.25 48.1 134.95 Q48.6 138.55 48.75 142.3 L49.05 145.05 Q49.55 148.2 49.25 151.55 L48.75 150.3 48.9 148.5 48.45 144.9 48.15 141.3 M47.2 165.0 L46.65 166.75 Q46.3 170.35 45.8 170.35 L45.55 170.35 45.55 165.3 46.3 163.65 Q46.65 162.4 47.3 162.4 L47.7 162.7 47.7 163.0 47.2 165.0 M46.2 161.85 L46.75 158.55 47.1 157.5 Q47.2 158.75 46.8 160.05 L46.05 162.9 45.8 163.85 46.2 161.85" fill="#91765e" fill-rule="evenodd" stroke="none"/>
  </g>
</svg>
