<?xml version="1.0" encoding="UTF-8" standalone="no"?>
<svg xmlns:xlink="http://www.w3.org/1999/xlink" height="10.0px" width="43.0px" xmlns="http://www.w3.org/2000/svg">
  <g transform="matrix(1.0, 0.0, 0.0, 1.0, 0.0, 0.0)">
    <path d="M32.0 10.0 L22.0 10.0 22.0 0.0 32.0 0.0 32.0 10.0" fill="#569bbe" fill-rule="evenodd" stroke="none"/>
    <path d="M21.0 0.0 L21.0 10.0 11.0 10.0 11.0 0.0 21.0 0.0" fill="#c8e0ea" fill-rule="evenodd" stroke="none"/>
    <path d="M0.0 0.0 L10.0 0.0 10.0 10.0 0.0 10.0 0.0 0.0" fill="#ffb521" fill-rule="evenodd" stroke="none"/>
    <path d="M43.0 10.0 L33.0 10.0 33.0 0.0 43.0 0.0 43.0 10.0" fill="#4d5d6b" fill-rule="evenodd" stroke="none"/>
    <path d="M43.0 10.0 L33.0 10.0 33.0 0.0 43.0 0.0 43.0 10.0 M32.0 10.0 L22.0 10.0 22.0 0.0 32.0 0.0 32.0 10.0 M21.0 0.0 L11.0 0.0 11.0 10.0 21.0 10.0 21.0 0.0 M0.0 0.0 L10.0 0.0 10.0 10.0 0.0 10.0 0.0 0.0" fill="none" stroke="#000000" stroke-linecap="round" stroke-linejoin="round" stroke-opacity="0.2" stroke-width="0.05"/>
  </g>
</svg>
