<?xml version="1.0" encoding="UTF-8" standalone="no"?>
<svg xmlns:xlink="http://www.w3.org/1999/xlink" height="299.4px" width="233.3px" xmlns="http://www.w3.org/2000/svg">
  <g transform="matrix(1.0, 0.0, 0.0, 1.0, 116.65, 149.7)">
    <path d="M-52.5 57.1 L-52.5 57.15 Q-52.5 71.75 -49.65 85.85 -46.75 99.9 -46.75 104.2 -46.75 110.55 -48.55 118.75 L-47.7 117.5 -46.65 114.1 Q-45.35 110.15 -43.8 107.1 L-42.8 105.45 -43.25 93.75 -42.65 87.35 -42.1 81.95 Q-42.1 80.2 -43.9 77.5 L-45.65 74.7 Q-45.65 74.3 -44.3 71.8 -43.35 70.0 -43.05 68.35 L-42.95 67.1 -42.95 67.05 Q-47.4 59.2 -51.9 53.0 L-51.95 52.9 -52.5 57.1 M30.2 -139.45 L30.9 -138.8 31.15 -138.6 31.4 -138.3 32.7 -136.9 Q34.55 -134.75 35.7 -131.7 L36.6 -129.05 37.4 -128.7 44.35 -125.7 44.7 -125.5 46.75 -124.6 49.95 -123.2 56.05 -120.5 65.95 -116.35 66.05 -116.3 66.25 -116.2 66.45 -116.15 72.55 -113.85 77.85 -112.15 Q83.5 -110.55 88.4 -109.8 L90.35 -109.55 93.75 -109.25 95.9 -109.2 96.5 -109.2 98.85 -109.35 Q103.0 -109.85 106.15 -111.65 L106.2 -111.7 106.3 -111.75 107.1 -112.3 109.35 -114.15 110.45 -115.35 Q113.15 -118.6 116.15 -124.35 L116.3 -124.35 116.4 -123.5 116.5 -122.8 116.55 -122.45 116.55 -122.3 116.65 -120.65 Q116.65 -116.6 114.4 -111.05 L112.8 -107.55 112.2 -106.4 110.9 -104.05 110.9 -104.0 Q108.75 -100.2 106.0 -96.45 L104.35 -94.25 103.5 -93.2 100.8 -90.0 98.1 -87.05 Q95.4 -84.2 92.7 -81.8 L92.4 -81.55 90.35 -79.85 Q86.85 -77.05 83.4 -75.1 78.9 -72.55 74.45 -71.5 L68.45 -70.75 66.9 -70.75 Q62.15 -71.25 57.8 -72.5 L48.85 -75.2 46.75 -75.9 46.15 -76.15 44.05 -76.85 43.15 -77.2 39.2 -78.6 37.4 -79.3 35.05 -80.15 33.05 -80.9 32.95 -80.95 29.05 -82.55 Q28.85 -81.15 28.15 -80.3 27.3 -79.1 25.6 -79.0 L25.9 -78.5 25.05 -77.7 25.6 -77.15 25.75 -76.75 Q25.75 -75.9 24.75 -75.9 L25.05 -75.55 25.15 -75.05 24.9 -74.7 24.45 -74.15 24.85 -73.2 24.8 -72.7 Q27.4 -72.55 29.4 -71.4 L30.0 -71.05 30.75 -70.45 31.4 -70.3 32.15 -70.05 Q35.4 -68.8 35.4 -66.0 L35.4 -65.4 35.05 -57.25 35.0 -56.65 34.8 -54.05 36.3 -53.5 Q42.0 -52.1 54.2 -45.6 L54.25 -45.5 58.05 -43.6 59.05 -43.05 60.45 -42.25 61.15 -41.85 62.35 -41.1 62.35 -41.35 Q62.95 -41.55 63.4 -41.35 L68.15 -39.45 69.85 -36.55 Q71.85 -33.4 73.65 -33.4 74.45 -33.4 77.25 -34.7 L77.8 -34.35 78.2 -34.2 78.35 -33.5 Q79.25 -30.25 81.0 -30.25 82.0 -30.25 84.1 -31.65 L87.8 -29.9 Q89.05 -25.4 89.05 -21.2 89.05 -18.3 88.55 -15.0 L88.45 -14.2 Q92.1 -8.15 93.4 -2.0 94.15 1.45 94.15 4.95 90.05 25.45 87.35 33.25 L87.8 37.25 88.5 40.5 93.8 60.45 Q98.8 78.75 98.8 86.4 L98.55 96.05 Q97.1 102.45 95.4 106.6 L90.2 119.65 Q89.25 122.4 88.6 124.8 L88.65 126.0 88.1 132.05 88.1 138.35 Q87.95 141.5 87.25 142.85 L87.3 143.1 87.6 143.85 Q87.6 144.2 86.15 144.35 L85.8 144.4 81.75 144.65 66.35 144.8 64.5 144.8 60.3 144.7 57.55 144.35 Q57.05 144.2 57.05 143.1 57.05 142.65 57.45 142.35 L57.35 141.8 Q57.35 141.05 57.6 140.6 57.1 139.3 56.9 136.65 L56.9 131.2 Q54.45 127.8 53.1 122.65 50.35 112.0 50.35 104.2 50.35 99.9 53.25 85.85 56.1 71.75 56.1 57.15 L56.1 57.1 55.25 50.0 49.6 57.35 44.3 63.35 Q43.6 65.75 43.6 66.9 L44.2 68.35 45.05 70.1 45.25 70.5 Q46.55 73.2 46.55 75.45 46.55 77.25 44.35 81.2 42.15 85.2 42.15 86.9 L43.6 90.0 Q45.1 92.95 45.1 95.35 45.1 98.5 44.0 105.8 L43.35 109.95 Q46.05 113.9 48.05 119.05 49.6 123.0 50.3 126.5 52.85 132.35 56.1 142.85 L58.2 149.7 -62.3 149.7 Q-62.25 147.95 -61.25 144.8 L-62.75 144.8 -78.15 144.65 -82.2 144.4 -82.55 144.35 Q-84.0 144.2 -84.0 143.85 L-83.7 143.1 -83.65 142.85 Q-84.35 141.5 -84.5 138.35 L-84.5 132.05 -85.05 126.0 -85.0 124.8 Q-85.65 122.4 -86.6 119.65 L-91.8 106.6 Q-93.5 102.45 -94.95 96.05 L-95.2 86.4 Q-95.2 78.75 -90.2 60.45 L-84.9 40.5 -84.2 37.25 -83.75 33.25 Q-86.45 25.45 -90.55 4.95 -90.55 1.45 -89.8 -2.0 -88.2 -9.35 -83.3 -16.55 L-81.85 -25.35 -80.8 -26.45 -79.4 -27.9 -78.9 -28.35 Q-78.1 -27.85 -77.25 -27.85 -76.5 -27.85 -74.0 -32.6 L-71.5 -34.4 -70.55 -35.1 -70.35 -35.25 -70.1 -35.1 Q-69.25 -34.5 -68.5 -34.5 L-67.45 -35.1 -67.05 -35.45 -63.25 -39.65 -62.7 -40.3 -62.05 -40.7 -57.55 -43.05 -54.7 -43.9 -54.6 -43.9 Q-53.6 -45.4 -52.9 -45.55 -52.3 -45.6 -52.1 -44.75 L-51.4 -45.15 Q-50.5 -45.6 -49.55 -45.65 L-33.15 -56.3 -32.55 -56.65 -32.15 -56.9 -31.55 -57.25 -30.1 -57.4 -30.2 -57.95 -29.85 -59.35 -29.8 -59.45 -29.7 -60.7 -29.4 -62.65 -29.35 -62.9 -29.15 -63.6 -29.4 -64.95 -29.5 -65.4 -30.45 -70.05 -30.6 -71.05 -30.7 -71.6 Q-30.7 -73.9 -29.0 -73.75 L-27.9 -74.8 -27.4 -75.05 Q-25.3 -76.0 -21.2 -75.85 L-16.25 -75.2 -15.9 -75.85 -16.6 -76.75 -16.8 -77.65 -16.7 -78.0 -16.95 -77.9 -17.9 -77.65 -19.05 -77.9 -20.3 -79.0 Q-21.25 -80.25 -21.25 -82.05 L-20.85 -84.1 -20.75 -84.55 -20.5 -85.9 -23.2 -84.85 -32.95 -80.95 -33.05 -80.9 -35.05 -80.15 -37.4 -79.3 -39.2 -78.6 -43.15 -77.2 -44.05 -76.85 -46.15 -76.15 -46.75 -75.9 -48.85 -75.2 -57.8 -72.5 Q-62.15 -71.25 -66.9 -70.75 L-68.45 -70.75 -74.45 -71.5 Q-78.9 -72.55 -83.4 -75.1 -86.85 -77.05 -90.35 -79.85 L-92.4 -81.55 -92.7 -81.8 Q-95.4 -84.2 -98.1 -87.05 L-100.8 -90.0 -103.5 -93.2 -104.35 -94.25 -106.0 -96.45 Q-108.75 -100.2 -110.9 -104.0 L-110.9 -104.05 -112.2 -106.4 -112.8 -107.55 -114.4 -111.05 Q-116.65 -116.6 -116.65 -120.65 L-116.55 -122.3 -116.55 -122.45 -116.5 -122.8 -116.4 -123.5 -116.3 -124.35 -116.15 -124.35 Q-113.15 -118.6 -110.45 -115.35 L-109.35 -114.15 -107.1 -112.3 -106.3 -111.75 -106.2 -111.7 -106.15 -111.65 Q-103.0 -109.85 -98.85 -109.35 L-96.5 -109.2 -95.9 -109.2 -93.75 -109.25 -90.35 -109.55 -88.4 -109.8 Q-83.5 -110.55 -77.85 -112.15 L-72.55 -113.85 -66.25 -116.2 -66.05 -116.3 -65.95 -116.35 -56.05 -120.5 -49.95 -123.2 -46.75 -124.6 -44.7 -125.5 -44.35 -125.7 -37.4 -128.7 -32.5 -130.75 -30.0 -131.75 -29.15 -132.1 -28.7 -133.05 -28.05 -134.15 -27.2 -135.3 -26.05 -136.65 -25.95 -136.7 -25.05 -137.7 -24.95 -137.85 -23.45 -139.35 -23.3 -139.45 -23.2 -139.5 -21.35 -141.15 -18.45 -143.3 Q-14.55 -145.95 -10.05 -147.55 -4.95 -149.35 0.9 -149.65 L1.45 -149.65 3.45 -149.7 Q15.85 -149.7 25.4 -143.3 27.9 -141.6 30.2 -139.45" fill="url(#gradient0)" fill-rule="evenodd" stroke="none"/>
  </g>
  <defs>
    <linearGradient gradientTransform="matrix(0.0, -0.1932, 0.1424, 0.0, 0.0, -14.0)" gradientUnits="userSpaceOnUse" id="gradient0" spreadMethod="pad" x1="-819.2" x2="819.2">
      <stop offset="0.023529411764705882" stop-color="#4040bd" stop-opacity="0.5529412"/>
      <stop offset="1.0" stop-color="#fab961" stop-opacity="0.33333334"/>
    </linearGradient>
  </defs>
</svg>
