<?xml version="1.0" encoding="UTF-8" standalone="no"?>
<svg xmlns:xlink="http://www.w3.org/1999/xlink" height="7.9px" width="8.6px" xmlns="http://www.w3.org/2000/svg">
  <g transform="matrix(1.0, 0.0, 0.0, 1.0, 5.05, 3.6)">
    <path d="M-5.05 4.3 Q-0.8 2.0 3.55 1.15 3.2 1.4 2.8 1.6 -0.4 3.3 -3.8 4.1 L-5.05 4.3 M1.25 -3.6 Q-1.25 -2.0 -4.4 1.3 -4.2 -0.1 -2.15 -1.75 -0.4 -3.15 1.25 -3.6" fill="#cca9a9" fill-rule="evenodd" stroke="none"/>
    <path d="M-5.05 4.3 Q-0.8 2.0 3.55 1.15 3.2 1.4 2.8 1.6 -0.4 3.3 -3.8 4.1 L-5.05 4.3 M1.25 -3.6 Q-1.25 -2.0 -4.4 1.3 -4.2 -0.1 -2.15 -1.75 -0.4 -3.15 1.25 -3.6" fill="none" stroke="#a36a6a" stroke-linecap="round" stroke-linejoin="round" stroke-opacity="0.4" stroke-width="0.05"/>
  </g>
</svg>
