<?xml version="1.0" encoding="UTF-8" standalone="no"?>
<svg xmlns:xlink="http://www.w3.org/1999/xlink" height="235.25px" width="111.45px" xmlns="http://www.w3.org/2000/svg">
  <g transform="matrix(1.0, 0.0, 0.0, 1.0, 55.4, 142.75)">
    <path d="M11.8 -140.65 L11.8 -140.7 Q28.0 -137.85 32.1 -136.2 L36.35 -133.5 36.4 -131.3 36.45 -130.6 36.5 -128.0 36.6 -119.5 36.85 -110.65 36.9 -107.8 36.25 -109.25 32.95 -116.8 32.8 -116.45 32.6 -116.4 32.45 -109.65 Q32.1 -104.95 31.6 -102.55 L30.85 -107.65 30.05 -112.35 29.75 -106.55 29.7 -102.25 Q29.75 -99.45 30.65 -94.4 L30.8 -93.65 31.75 -88.65 31.65 -88.65 31.45 -88.65 31.65 -88.6 34.1 -58.9 34.1 -58.6 33.1 -53.45 32.75 -53.75 32.55 -54.8 32.3 -55.95 31.9 -55.95 31.2 -52.55 Q30.75 -50.55 30.4 -50.2 L29.95 -50.55 Q29.05 -54.35 28.35 -60.45 L28.35 -60.75 28.15 -65.4 27.9 -70.95 28.6 -71.1 28.4 -73.85 27.9 -74.25 27.75 -74.35 27.3 -85.6 27.45 -85.6 27.3 -85.65 27.15 -86.95 27.15 -87.45 27.25 -87.3 28.85 -85.95 28.75 -87.85 28.65 -91.5 Q28.6 -92.45 28.7 -93.3 L28.65 -94.4 28.7 -95.25 28.35 -97.15 28.05 -98.5 28.2 -100.35 28.35 -103.85 28.3 -107.3 27.85 -110.65 27.0 -115.5 25.95 -119.4 25.9 -119.5 Q24.45 -124.4 23.65 -128.0 L23.1 -130.6 22.9 -131.3 22.8 -132.25 Q15.45 -139.15 11.8 -140.65 M-39.35 -99.8 L-39.45 -110.65 -39.45 -119.5 -39.45 -122.3 Q-37.0 -125.1 -32.55 -128.0 -30.7 -129.3 -28.35 -130.6 L-27.1 -131.3 Q-23.0 -133.65 -17.75 -136.05 L-17.35 -136.2 -16.7 -136.5 -17.8 -135.65 -18.2 -135.35 -19.7 -134.05 -22.0 -131.3 -22.35 -130.9 -22.6 -130.6 -22.75 -130.35 -23.65 -128.8 -23.95 -128.2 -24.05 -128.05 -24.05 -128.0 -24.5 -127.2 Q-24.55 -127.6 -29.7 -119.5 L-32.8 -114.65 -32.35 -110.65 Q-31.75 -105.95 -30.65 -100.95 L-30.4 -99.95 -29.3 -94.4 -28.85 -92.7 -28.7 -94.4 Q-28.15 -98.3 -27.05 -102.15 L-26.95 -102.65 -26.95 -102.4 -27.4 -96.9 -27.55 -94.4 -27.9 -87.05 -27.95 -86.45 -27.95 -82.65 -27.8 -76.2 -27.55 -73.8 -27.1 -69.05 -26.55 -64.4 -26.45 -63.35 -26.45 -63.25 -26.25 -62.0 -25.45 -56.85 -24.25 -50.15 -23.15 -45.6 -22.7 -44.05 -22.1 -42.0 -21.55 -40.4 -20.85 -38.6 -19.95 -36.15 -19.75 -35.75 -19.55 -35.2 Q-19.9 -32.1 -19.9 -28.4 L-19.85 -27.65 -19.7 -24.55 -19.5 -19.95 -19.5 -18.95 -20.25 -24.55 -20.4 -25.75 Q-20.85 -29.8 -21.25 -32.15 L-20.8 -21.35 -21.8 -20.6 Q-22.4 -19.6 -22.75 -19.25 L-23.1 -24.55 -23.5 -28.65 -23.45 -32.65 -23.45 -38.5 -23.85 -38.5 Q-25.1 -36.8 -25.2 -34.95 -25.8 -37.05 -27.2 -44.05 L-27.3 -44.6 -28.65 -51.05 -31.45 -84.85 Q-31.3 -84.85 -31.35 -85.85 L-31.3 -86.1 -31.8 -85.9 -31.95 -85.9 -32.2 -85.95 -33.0 -94.4 -33.05 -95.5 Q-33.8 -103.75 -33.4 -108.55 -34.5 -107.15 -35.45 -100.75 -36.1 -96.95 -36.2 -94.4 L-36.25 -92.15 -36.65 -92.15 -37.0 -94.4 -37.35 -97.35 Q-37.95 -101.8 -38.6 -103.35 L-39.35 -99.8 M-16.8 -122.3 L-16.65 -122.45 Q-15.25 -124.3 -13.7 -125.65 L-10.95 -128.0 -6.95 -130.6 -5.45 -131.3 Q-1.15 -133.1 3.55 -133.1 6.9 -133.1 9.95 -131.3 L11.2 -130.6 14.15 -128.0 Q17.25 -124.75 20.1 -119.5 L22.0 -115.7 20.1 -118.55 16.2 -123.5 13.9 -125.35 10.9 -127.0 7.6 -128.8 Q5.4 -129.7 3.2 -129.7 L1.05 -129.35 -2.45 -122.6 -1.2 -129.3 -1.35 -129.3 -4.45 -126.0 -3.4 -128.25 -2.65 -129.75 Q-12.2 -126.0 -17.95 -119.15 -20.6 -116.0 -24.95 -108.2 L-23.9 -110.65 -22.1 -114.2 -20.75 -116.6 Q-20.5 -116.85 -20.4 -117.25 L-18.9 -119.5 -16.8 -122.3 M29.15 -40.55 L30.1 -37.05 Q30.05 -38.85 30.65 -41.55 L31.25 -44.05 31.65 -45.6 31.6 -46.0 32.05 -44.05 Q32.85 -40.75 34.45 -37.3 L36.2 -33.4 36.5 -30.15 36.6 -29.1 36.45 -19.15 35.85 -21.95 35.55 -21.95 35.55 -21.3 35.65 -19.5 35.8 -18.6 35.85 -17.6 34.55 -17.6 33.1 -17.6 32.15 -28.3 31.75 -24.55 31.7 -22.25 31.5 -17.1 31.4 -14.25 Q30.5 -14.45 30.15 -14.6 L29.15 -40.55 M-27.0 -30.75 L-26.85 -30.15 -26.4 -26.7 Q-25.75 -27.45 -25.45 -28.85 L-25.05 -30.7 -24.8 -24.55 -24.5 -20.7 Q-24.15 -16.65 -23.45 -13.2 L-22.75 -10.0 -20.8 -13.2 -20.8 -13.25 -20.5 -13.8 -20.0 -1.95 -24.55 -1.95 -27.0 -30.75" fill="#4b3d3d" fill-rule="evenodd" stroke="none"/>
    <path d="M27.0 -115.5 L27.85 -110.65 28.3 -107.3 28.35 -103.85 28.2 -100.35 28.05 -98.5 26.6 -103.85 24.65 -109.4 24.1 -110.65 23.55 -112.2 23.45 -112.4 22.25 -115.1 22.0 -115.7 20.1 -119.5 Q17.25 -124.75 14.15 -128.0 L11.2 -130.6 9.95 -131.3 Q6.9 -133.1 3.55 -133.1 -1.15 -133.1 -5.45 -131.3 L-6.95 -130.6 -10.95 -128.0 -13.7 -125.65 Q-15.25 -124.3 -16.65 -122.45 L-16.8 -122.3 Q-18.8 -122.85 -19.3 -124.85 -9.45 -136.2 3.8 -136.2 7.2 -136.2 12.55 -132.85 L19.05 -127.95 Q20.5 -126.85 23.8 -120.45 25.35 -117.4 27.0 -115.5 M34.1 -58.9 L31.65 -88.6 31.65 -88.65 31.75 -88.65 32.55 -88.9 37.5 -72.35 Q41.65 -72.25 45.5 -71.1 L45.25 -68.75 Q45.1 -66.9 43.9 -63.35 L42.35 -59.4 Q40.25 -54.3 35.1 -47.3 L34.15 -58.6 34.1 -58.9 M55.85 -64.55 L55.75 -63.35 Q54.4 -55.85 48.85 -49.85 45.6 -46.4 41.9 -44.35 45.75 -48.85 48.5 -56.15 L50.8 -63.35 51.8 -68.35 Q54.35 -66.7 55.85 -64.55 M51.3 84.9 L54.5 92.5 53.15 92.5 51.3 84.9 M35.9 92.5 L-22.35 92.5 -22.05 90.4 -20.85 81.65 -22.5 80.4 Q-25.25 78.35 -26.75 72.3 -27.3 69.8 -27.35 67.45 L-27.2 63.65 -27.15 63.35 Q-26.6 59.75 -24.85 56.35 L-23.25 53.0 -23.15 52.85 -21.9 49.2 -22.15 48.5 Q-22.95 45.7 -24.45 41.35 L-26.6 34.3 -25.7 33.45 -24.05 31.85 -23.1 30.85 -21.5 29.4 -18.25 25.85 Q-15.0 22.0 -12.2 17.6 L-10.5 14.55 Q-8.2 10.25 -6.35 5.5 L-5.65 3.65 -5.35 2.6 -4.75 3.65 -4.4 4.3 -3.7 5.5 -3.1 6.4 -2.7 7.25 Q-3.2 8.15 -3.15 9.05 -3.05 9.95 0.15 14.05 L0.45 14.55 Q3.3 18.65 3.55 24.75 3.7 28.0 3.05 31.85 L2.75 33.45 1.1 39.7 Q-1.55 48.25 -1.45 51.2 L-1.25 52.5 Q-1.0 53.65 -0.4 54.4 0.65 55.85 2.15 55.85 3.6 55.85 5.35 54.75 6.9 53.65 7.95 53.65 9.2 53.65 10.6 54.65 11.95 55.55 12.65 55.55 13.95 55.55 14.6 54.85 15.3 54.05 15.25 52.45 L14.4 50.05 14.1 49.35 13.95 48.9 13.4 47.65 Q9.75 41.5 8.45 35.55 L8.1 33.45 7.8 31.85 6.65 25.55 Q7.0 18.85 8.7 14.55 L9.35 13.15 10.4 12.0 12.25 9.05 Q12.5 8.55 12.4 6.5 12.4 6.0 11.75 5.55 L11.8 5.5 12.6 4.6 13.3 3.65 14.55 1.85 14.55 1.7 14.7 1.5 15.35 0.55 15.5 0.35 15.55 0.55 15.5 0.85 15.9 1.65 16.2 3.15 16.4 3.65 17.0 5.5 Q18.6 10.05 20.85 14.55 L22.6 17.95 23.5 18.9 23.75 19.25 Q26.85 23.0 28.4 24.3 L33.9 28.8 34.85 29.6 35.3 30.0 34.9 31.85 34.55 33.45 34.4 34.25 33.45 39.6 32.1 48.6 33.45 51.9 35.85 56.35 Q37.95 59.9 38.8 63.65 39.75 67.85 39.05 72.3 38.05 78.35 35.5 80.4 L34.05 81.55 34.25 83.65 34.45 85.2 34.5 85.75 34.65 86.05 35.9 92.5 M-46.95 -53.05 Q-51.65 -56.9 -53.7 -61.2 L-54.05 -62.0 Q-55.15 -64.55 -55.35 -67.2 L-55.4 -68.25 Q-54.35 -70.4 -51.1 -71.35 -51.3 -69.5 -51.15 -66.35 L-50.85 -62.0 -50.8 -61.45 -49.15 -56.65 -48.4 -55.25 -48.15 -55.25 -47.6 -54.15 -46.95 -53.05 M-40.4 -86.55 L-40.35 -86.55 -40.4 -86.5 -40.4 -86.55 M-22.1 -114.2 L-23.9 -110.65 -24.95 -108.2 -25.95 -105.5 -26.2 -104.8 -26.95 -102.65 -27.05 -102.15 Q-28.15 -98.3 -28.7 -94.4 L-28.85 -92.7 -29.3 -94.4 -30.4 -99.95 -30.65 -100.95 -30.35 -100.85 Q-29.15 -109.2 -25.3 -116.35 -24.95 -115.65 -23.55 -114.9 L-22.1 -114.2 M25.5 -46.65 L26.3 -50.0 27.5 -55.4 28.35 -60.15 28.95 -44.55 28.65 -44.7 Q27.3 -45.3 25.5 -46.65 M16.9 -25.75 L16.9 -24.55 16.9 -24.5 17.45 -24.15 Q18.4 -23.55 18.95 -22.25 L19.1 -22.25 20.05 -21.05 21.75 -18.85 22.15 -18.0 22.65 -15.55 22.45 -13.9 Q21.9 -11.8 19.65 -9.7 L19.65 -9.65 19.4 -9.4 17.1 -7.25 15.85 -5.8 Q15.8 -3.25 15.05 -1.1 L14.9 -0.65 14.5 0.55 13.95 1.6 12.55 3.6 12.5 3.65 11.25 5.05 10.8 4.75 Q9.55 4.75 8.4 5.5 L8.15 5.75 8.2 5.5 8.55 3.65 8.55 3.6 10.05 0.55 11.75 -2.7 12.25 -3.7 13.95 -6.7 12.15 -5.8 9.95 -4.6 Q5.05 -1.95 0.5 -1.95 L-0.7 -2.1 -0.3 0.55 0.15 3.65 0.4 5.5 0.55 6.3 0.35 6.25 Q-0.15 6.0 -0.4 6.0 L-1.8 6.3 -2.2 5.5 -2.9 3.65 -3.05 3.4 -3.75 0.55 -4.15 -1.15 -4.2 -1.65 -4.6 -2.15 -4.75 -2.35 -5.9 -3.1 -6.55 -3.45 -8.0 -4.3 -8.45 -4.45 Q-12.3 -6.0 -12.3 -6.65 -12.4 -9.0 -10.9 -11.6 L-9.05 -13.9 -8.45 -14.6 -6.15 -17.05 -6.15 -16.9 -6.1 -16.9 -4.55 -13.9 -4.55 -13.85 -4.1 -12.4 -4.0 -11.95 -3.35 -11.1 Q-1.05 -8.0 4.1 -8.0 7.45 -8.0 10.3 -10.5 L11.9 -12.2 12.7 -13.85 12.75 -13.9 Q13.0 -14.9 12.9 -15.9 L13.1 -18.0 13.4 -21.45 13.55 -21.65 16.9 -25.75 M-23.95 -128.2 L-23.95 -128.0 -24.05 -128.05 -23.95 -128.2 M-33.05 -86.0 L-32.2 -85.95 -31.95 -85.9 -31.8 -85.9 -31.35 -85.85 Q-31.3 -84.85 -31.45 -84.85 L-28.65 -51.05 -28.25 -45.9 -31.05 -46.15 -31.25 -46.2 -34.0 -46.75 -35.1 -47.0 -36.75 -47.5 -36.9 -47.7 -38.2 -48.45 -38.3 -48.5 -38.75 -48.7 Q-39.85 -49.15 -40.8 -50.1 -41.9 -51.0 -42.4 -52.1 L-42.95 -53.3 -43.75 -55.25 -44.35 -56.9 Q-45.2 -59.45 -45.3 -62.0 L-45.35 -62.05 Q-45.55 -67.0 -43.9 -72.35 L-43.3 -72.35 -35.6 -71.8 -33.35 -71.55 -33.05 -86.0 M-29.0 49.9 L-29.25 50.1 -29.4 49.9 -29.0 49.9" fill="#13131a" fill-rule="evenodd" stroke="none"/>
    <path d="M11.8 -140.65 Q15.45 -139.15 22.8 -132.25 L22.9 -131.3 23.1 -130.6 23.65 -128.0 Q24.45 -124.4 25.9 -119.5 L25.95 -119.4 27.0 -115.5 Q25.35 -117.4 23.8 -120.45 20.5 -126.85 19.05 -127.95 L12.55 -132.85 Q7.2 -136.2 3.8 -136.2 -9.45 -136.2 -19.3 -124.85 L-19.55 -126.5 -19.5 -128.0 -19.55 -130.6 -19.55 -131.3 -19.7 -134.05 -18.2 -135.35 -17.8 -135.65 -16.7 -136.5 -15.6 -136.95 -14.3 -138.05 Q-7.7 -141.95 -0.95 -142.55 L0.8 -142.75 1.8 -142.75 Q6.65 -142.75 11.4 -140.75 L11.8 -140.65 M37.35 -89.7 L37.7 -89.7 Q39.8 -89.7 41.9 -88.8 L44.6 -86.1 Q46.85 -84.1 46.2 -77.8 L45.5 -71.1 Q41.65 -72.25 37.5 -72.35 L32.55 -88.9 34.3 -89.4 37.35 -89.7 M51.35 -80.75 Q55.55 -75.1 56.0 -70.35 56.2 -67.3 55.85 -64.55 54.35 -66.7 51.8 -68.35 52.4 -72.35 52.2 -76.2 52.1 -78.4 51.35 -80.75 M-55.4 -68.25 Q-55.5 -70.45 -54.65 -72.95 L-54.25 -74.05 Q-53.2 -76.65 -51.25 -79.4 -46.45 -86.1 -40.4 -86.55 -42.0 -85.75 -43.6 -84.45 -46.15 -82.2 -47.75 -79.65 -50.25 -75.4 -50.9 -73.0 L-51.1 -71.35 Q-54.35 -70.4 -55.4 -68.25 M-25.4 -116.8 L-25.3 -116.35 Q-29.15 -109.2 -30.35 -100.85 L-30.65 -100.95 Q-31.75 -105.95 -32.35 -110.65 L-32.8 -114.65 -29.7 -119.5 Q-24.55 -127.6 -24.5 -127.2 L-24.05 -128.0 -24.05 -128.05 -23.95 -128.0 -23.65 -124.4 Q-23.55 -122.85 -24.5 -120.3 L-24.8 -119.5 Q-25.45 -117.6 -25.4 -116.8 M-34.2 -86.15 L-33.05 -86.0 -33.35 -71.55 -35.6 -71.8 -43.3 -72.35 -43.9 -72.35 -42.75 -76.0 -42.65 -76.0 Q-41.95 -78.0 -40.9 -79.7 L-41.0 -79.8 Q-38.1 -85.3 -34.2 -86.15" fill="#1f1f2b" fill-rule="evenodd" stroke="none"/>
    <path d="M28.05 -98.5 L28.35 -97.15 28.7 -95.25 28.65 -94.4 28.7 -93.3 Q28.6 -92.45 28.65 -91.5 L28.75 -87.85 28.85 -85.95 27.25 -87.3 27.15 -87.45 25.4 -89.85 24.5 -92.2 24.0 -94.4 23.95 -94.65 23.6 -96.15 23.35 -96.85 23.05 -98.65 22.9 -99.15 22.9 -98.6 22.8 -94.4 22.6 -90.05 21.6 -94.4 21.15 -95.95 21.0 -95.8 20.75 -94.4 Q20.4 -92.0 20.35 -90.35 L20.35 -89.1 20.1 -89.3 19.0 -89.75 18.35 -90.0 16.95 -90.3 16.9 -90.5 16.5 -93.85 16.4 -94.4 14.85 -103.85 14.6 -103.4 14.85 -97.65 15.0 -95.25 15.0 -94.4 Q15.15 -92.25 15.4 -91.1 L13.8 -91.9 13.4 -92.1 Q11.8 -92.8 10.95 -92.7 L11.05 -94.4 11.1 -96.0 10.05 -103.85 9.95 -104.55 8.8 -110.65 Q7.95 -115.5 7.7 -118.5 L7.1 -110.65 6.9 -108.4 6.7 -103.85 6.5 -97.7 5.35 -111.75 5.2 -110.65 4.6 -104.65 4.5 -103.85 Q3.8 -98.05 2.5 -94.4 L2.45 -94.2 2.4 -94.25 2.35 -94.4 2.9 -103.85 3.25 -110.65 3.5 -115.05 2.95 -110.65 2.25 -105.2 2.1 -103.85 1.4 -96.2 1.35 -94.4 1.4 -92.85 Q0.5 -93.3 -0.8 -93.2 L-2.3 -93.05 -2.45 -93.0 -3.7 -92.7 -5.35 -92.35 -6.95 -111.75 -7.45 -111.75 -7.7 -110.65 Q-8.25 -108.6 -9.75 -103.85 L-10.25 -102.4 -11.75 -97.85 -12.15 -96.55 -12.9 -94.4 -13.3 -92.85 -13.45 -94.55 -13.0 -97.55 -12.45 -102.25 -15.55 -95.2 -15.95 -94.4 -17.15 -91.6 -17.2 -91.7 -17.0 -94.4 -16.55 -98.05 -16.5 -99.65 -16.4 -100.15 Q-16.15 -103.8 -16.2 -105.6 -16.25 -106.5 -16.45 -106.65 L-21.55 -91.15 -22.05 -90.85 -23.05 -90.3 -27.9 -87.05 -27.55 -94.4 -27.4 -96.9 -26.95 -102.4 -26.95 -102.65 -26.2 -104.8 -25.95 -105.5 -24.95 -108.2 Q-20.6 -116.0 -17.95 -119.15 -12.2 -126.0 -2.65 -129.75 L-3.4 -128.25 -4.45 -126.0 -1.35 -129.3 -1.2 -129.3 -2.45 -122.6 1.05 -129.35 3.2 -129.7 Q5.4 -129.7 7.6 -128.8 L10.9 -127.0 13.9 -125.35 16.2 -123.5 20.1 -118.55 22.0 -115.7 22.25 -115.1 23.45 -112.4 22.9 -112.5 19.55 -113.05 Q18.5 -113.05 16.95 -112.35 16.25 -112.85 15.8 -114.7 L15.2 -117.15 14.8 -117.15 Q15.0 -116.75 14.55 -115.45 L13.85 -113.75 9.9 -120.3 Q7.2 -125.0 5.6 -126.45 3.9 -120.9 4.0 -118.3 L-0.25 -117.65 Q-2.65 -117.3 -2.45 -114.9 L-3.0 -117.9 Q-3.9 -116.8 -7.2 -116.35 L-11.3 -115.7 -11.6 -123.15 Q-13.1 -120.2 -16.1 -115.3 L-21.05 -107.8 -21.1 -108.2 Q-20.75 -109.2 -20.2 -112.55 L-26.25 -103.5 -26.5 -100.35 -26.4 -98.15 -24.9 -100.65 Q-23.35 -103.25 -22.8 -103.7 L-22.85 -104.1 Q-22.6 -103.2 -23.15 -100.5 L-23.7 -97.75 -23.7 -97.0 -18.45 -105.85 Q-13.65 -114.2 -13.25 -115.7 L-12.85 -115.7 -12.9 -110.6 -12.9 -106.7 -12.85 -105.6 -11.6 -111.0 Q-10.1 -115.35 -7.45 -115.25 L-4.75 -115.25 -3.05 -102.2 -2.65 -102.2 Q-2.25 -111.15 -1.55 -112.95 0.05 -116.8 6.05 -115.25 5.95 -116.55 6.65 -118.6 L7.65 -122.0 9.55 -114.75 Q11.0 -109.3 11.8 -107.1 L12.15 -107.1 Q12.1 -107.95 12.75 -109.85 13.5 -111.75 13.4 -113.05 L15.15 -109.3 Q16.35 -106.05 16.85 -105.2 L17.25 -105.2 17.6 -107.75 18.15 -110.85 Q19.05 -110.05 22.75 -109.65 L24.65 -109.4 26.6 -103.85 28.05 -98.5 M28.35 -60.45 Q29.05 -54.35 29.95 -50.55 L30.4 -50.2 Q30.75 -50.55 31.2 -52.55 L31.9 -55.95 32.3 -55.95 32.55 -54.8 32.75 -53.75 33.1 -53.45 34.1 -58.6 34.15 -58.6 35.1 -47.3 35.5 -42.15 36.2 -33.4 34.45 -37.3 Q32.85 -40.75 32.05 -44.05 L31.6 -46.0 31.65 -45.6 31.25 -44.05 30.65 -41.55 Q30.05 -38.85 30.1 -37.05 L29.15 -40.55 28.95 -44.55 28.35 -60.15 28.3 -60.45 28.35 -60.45 M-28.65 -51.05 L-27.3 -44.6 -27.2 -44.05 Q-25.8 -37.05 -25.2 -34.95 -25.1 -36.8 -23.85 -38.5 L-23.45 -38.5 -23.45 -32.65 -23.5 -28.65 -23.1 -24.55 -22.75 -19.25 Q-22.4 -19.6 -21.8 -20.6 L-20.8 -21.35 -20.5 -13.8 -20.8 -13.25 -20.8 -13.2 -22.75 -10.0 -23.45 -13.2 Q-24.15 -16.65 -24.5 -20.7 L-24.8 -24.55 -25.05 -30.7 -25.45 -28.85 Q-25.75 -27.45 -26.4 -26.7 L-26.85 -30.15 -27.0 -30.75 -28.25 -45.9 -28.65 -51.05" fill="#5e4949" fill-rule="evenodd" stroke="none"/>
    <path d="M28.35 -60.75 L28.35 -60.45 28.3 -60.45 28.35 -60.75 M34.1 -58.6 L34.1 -58.9 34.15 -58.6 34.1 -58.6 M23.45 -112.4 L23.55 -112.2 24.1 -110.65 24.65 -109.4 22.75 -109.65 Q19.05 -110.05 18.15 -110.85 L17.6 -107.75 17.25 -105.2 16.85 -105.2 Q16.35 -106.05 15.15 -109.3 L13.4 -113.05 Q13.5 -111.75 12.75 -109.85 12.1 -107.95 12.15 -107.1 L11.8 -107.1 Q11.0 -109.3 9.55 -114.75 L7.65 -122.0 6.65 -118.6 Q5.95 -116.55 6.05 -115.25 0.05 -116.8 -1.55 -112.95 -2.25 -111.15 -2.65 -102.2 L-3.05 -102.2 -4.75 -115.25 -7.45 -115.25 Q-10.1 -115.35 -11.6 -111.0 L-12.85 -105.6 -12.9 -106.7 -12.9 -110.6 -12.85 -115.7 -13.25 -115.7 Q-13.65 -114.2 -18.45 -105.85 L-23.7 -97.0 -23.7 -97.75 -23.15 -100.5 Q-22.6 -103.2 -22.85 -104.1 L-22.8 -103.7 Q-23.35 -103.25 -24.9 -100.65 L-26.4 -98.15 -26.5 -100.35 -26.25 -103.5 -20.2 -112.55 Q-20.75 -109.2 -21.1 -108.2 L-21.05 -107.8 -16.1 -115.3 Q-13.1 -120.2 -11.6 -123.15 L-11.3 -115.7 -7.2 -116.35 Q-3.9 -116.8 -3.0 -117.9 L-2.45 -114.9 Q-2.65 -117.3 -0.25 -117.65 L4.0 -118.3 Q3.9 -120.9 5.6 -126.45 7.2 -125.0 9.9 -120.3 L13.85 -113.75 14.55 -115.45 Q15.0 -116.75 14.8 -117.15 L15.2 -117.15 15.8 -114.7 Q16.25 -112.85 16.95 -112.35 18.5 -113.05 19.55 -113.05 L22.9 -112.5 23.45 -112.4" fill="#755b5b" fill-rule="evenodd" stroke="none"/>
    <path d="M27.15 -87.45 L27.15 -86.95 27.3 -85.65 27.45 -85.6 27.3 -85.6 27.75 -74.35 26.9 -75.1 26.8 -75.4 26.75 -77.1 Q26.6 -77.85 26.05 -78.4 L23.65 -81.25 25.25 -81.25 25.4 -82.7 25.65 -83.65 25.7 -86.55 25.7 -86.7 25.6 -88.5 25.5 -86.8 23.2 -88.8 23.1 -87.85 Q22.7 -87.95 22.6 -88.1 L22.25 -88.4 Q22.1 -87.75 21.3 -87.4 20.85 -87.85 19.55 -87.85 L19.0 -89.75 20.1 -89.3 20.35 -89.1 20.35 -90.35 Q20.4 -92.0 20.75 -94.4 L21.0 -95.8 21.15 -95.95 21.6 -94.4 22.6 -90.05 22.8 -94.4 22.9 -98.6 23.05 -98.65 23.35 -96.85 23.6 -96.15 23.95 -94.65 24.0 -94.4 24.5 -92.2 25.4 -89.85 27.15 -87.45 M1.4 -96.2 L2.1 -103.85 2.25 -105.2 2.95 -110.65 3.5 -115.05 3.25 -110.65 2.9 -103.85 2.35 -94.4 2.4 -94.25 2.45 -94.2 2.5 -94.4 Q3.8 -98.05 4.5 -103.85 L4.6 -104.65 5.2 -110.65 5.35 -111.75 6.5 -97.7 6.7 -103.85 6.9 -108.4 7.1 -110.65 7.7 -118.5 Q7.95 -115.5 8.8 -110.65 L9.95 -104.55 10.05 -103.85 11.1 -96.0 Q9.6 -96.55 9.25 -98.5 L8.7 -102.85 8.45 -102.85 7.35 -98.9 6.25 -95.55 5.5 -101.55 3.85 -97.0 2.85 -94.4 2.15 -92.65 2.1 -92.7 1.75 -94.4 1.4 -96.2 M13.4 -92.1 L13.8 -91.9 15.4 -91.1 Q15.15 -92.25 15.0 -94.4 L15.0 -95.25 14.85 -97.65 14.6 -103.4 14.85 -103.85 16.4 -94.4 16.5 -93.85 16.9 -90.5 16.95 -90.3 18.35 -90.0 18.25 -88.4 17.95 -88.4 15.0 -90.15 Q13.55 -90.9 13.4 -92.1 M-0.8 -93.2 L-0.75 -89.95 -2.05 -89.95 -7.35 -89.75 -7.5 -89.95 -7.9 -100.6 Q-7.55 -100.6 -7.95 -100.95 L-7.9 -100.75 -11.1 -94.4 -11.55 -93.35 -12.75 -91.2 -12.4 -94.4 -12.15 -96.55 -11.75 -97.85 -10.25 -102.4 -9.75 -103.85 Q-8.25 -108.6 -7.7 -110.65 L-7.45 -111.75 -6.95 -111.75 -5.35 -92.35 -3.7 -92.7 -2.45 -93.0 -2.3 -93.05 -0.8 -93.2 M-13.0 -97.55 L-13.95 -95.35 -14.35 -94.4 Q-15.35 -92.0 -15.4 -91.2 L-15.55 -94.4 -15.55 -95.2 -12.45 -102.25 -13.0 -97.55 M-16.4 -100.15 L-19.05 -94.4 -20.6 -90.65 -20.75 -90.5 -21.0 -90.3 -23.0 -89.1 Q-27.3 -86.7 -27.3 -86.35 L-26.9 -84.85 Q-26.5 -83.75 -26.65 -83.3 L-25.05 -83.3 -23.35 -83.75 -22.1 -84.05 -21.0 -84.05 Q-24.8 -81.8 -25.1 -80.6 -25.4 -79.9 -25.5 -78.0 L-25.5 -77.7 -27.8 -76.2 -27.95 -82.65 -27.95 -86.45 -27.9 -87.05 -23.05 -90.3 -22.05 -90.85 -21.55 -91.15 -16.45 -106.65 Q-16.25 -106.5 -16.2 -105.6 -16.15 -103.8 -16.4 -100.15 M-16.5 -36.05 L-15.9 -37.15 -15.65 -37.5 -15.25 -37.7 -13.4 -38.35 -10.4 -39.1 -10.8 -38.85 -11.1 -38.7 -13.8 -37.05 Q-14.85 -36.45 -15.55 -36.15 L-16.5 -36.05 M12.85 -39.3 Q13.2 -39.2 13.55 -39.45 16.9 -38.95 18.05 -38.05 L18.55 -37.45 17.55 -36.6 Q16.9 -36.6 15.5 -37.3 L14.2 -37.9 14.05 -38.15 12.85 -39.3 M19.55 -30.5 L17.05 -25.9 16.9 -25.75 13.55 -21.65 13.4 -21.45 12.15 -20.45 11.65 -19.95 7.7 -17.55 6.5 -17.1 Q3.8 -16.1 0.9 -16.15 -2.0 -16.15 -4.55 -17.1 L-5.3 -17.35 -5.55 -17.5 -7.05 -18.25 -8.6 -19.15 -11.55 -21.7 Q-12.75 -23.05 -13.75 -24.55 L-15.4 -27.05 -17.95 -31.35 -15.7 -28.7 -15.35 -28.35 -12.65 -25.7 -11.6 -24.55 -8.75 -21.8 -6.35 -20.2 Q-3.45 -18.5 0.0 -18.15 L1.35 -18.15 2.5 -18.7 Q8.65 -20.1 11.5 -21.7 L11.8 -21.95 14.15 -23.65 15.1 -24.55 17.0 -26.7 19.55 -30.5" fill="#d8b59e" fill-rule="evenodd" stroke="none"/>
    <path d="M31.75 -88.65 L30.8 -93.65 30.65 -94.4 Q29.75 -99.45 29.7 -102.25 L29.75 -106.55 30.05 -112.35 30.85 -107.65 31.6 -102.55 Q32.1 -104.95 32.45 -109.65 L32.6 -116.4 32.8 -116.45 32.95 -116.8 36.25 -109.25 36.9 -107.8 37.0 -103.85 37.25 -94.4 37.35 -89.7 34.3 -89.4 32.55 -88.9 31.75 -88.65 M-39.3 -86.55 L-39.3 -87.05 -39.35 -87.35 -39.4 -94.4 -39.35 -99.8 -38.6 -103.35 Q-37.95 -101.8 -37.35 -97.35 L-37.0 -94.4 -36.65 -92.15 -36.25 -92.15 -36.2 -94.4 Q-36.1 -96.95 -35.45 -100.75 -34.5 -107.15 -33.4 -108.55 -33.8 -103.75 -33.05 -95.5 L-33.0 -94.4 -32.2 -85.95 -33.05 -86.0 -34.2 -86.15 -36.4 -86.45 -39.3 -86.55" fill="#3b3030" fill-rule="evenodd" stroke="none"/>
    <path d="M41.9 -88.8 Q45.95 -87.2 50.05 -82.45 L51.35 -80.75 Q52.1 -78.4 52.2 -76.2 52.4 -72.35 51.8 -68.35 L49.35 -69.6 45.5 -71.1 46.2 -77.8 Q46.85 -84.1 44.6 -86.1 L41.9 -88.8 M-40.35 -86.55 L-39.65 -86.55 -39.3 -86.55 -36.4 -86.45 -34.2 -86.15 Q-38.1 -85.3 -41.0 -79.8 L-40.9 -79.7 Q-41.95 -78.0 -42.65 -76.0 L-42.75 -76.0 -43.9 -72.35 Q-48.3 -72.3 -51.1 -71.35 L-50.9 -73.0 Q-50.25 -75.4 -47.75 -79.65 -46.15 -82.2 -43.6 -84.45 -42.0 -85.75 -40.4 -86.55 L-40.4 -86.5 -40.35 -86.55 M-19.7 -134.05 L-19.55 -131.3 -19.55 -130.6 -19.5 -128.0 -19.55 -126.5 -19.3 -124.85 -19.7 -124.45 Q-22.85 -120.75 -25.1 -116.65 L-25.4 -116.8 Q-25.45 -117.6 -24.8 -119.5 L-24.5 -120.3 Q-23.55 -122.85 -23.65 -124.4 L-23.95 -128.0 -23.95 -128.2 -23.65 -128.8 -22.75 -130.35 -22.6 -130.6 -22.35 -130.9 -22.0 -131.3 -19.7 -134.05" fill="#ffd066" fill-rule="evenodd" stroke="none"/>
    <path d="M41.9 -44.35 L41.35 -44.05 Q40.35 -43.55 39.35 -43.15 L38.25 -42.75 38.15 -42.7 35.6 -42.15 35.5 -42.15 35.1 -47.3 Q40.25 -54.3 42.35 -59.4 L43.9 -63.35 Q45.1 -66.9 45.25 -68.75 L45.5 -71.1 49.35 -69.6 51.8 -68.35 50.8 -63.35 48.5 -56.15 Q45.75 -48.85 41.9 -44.35 M-31.1 41.05 L-33.05 38.2 -32.6 37.8 -30.1 35.35 -29.2 34.45 -28.1 33.45 -27.1 32.55 -26.85 33.45 -26.6 34.3 -24.45 41.35 Q-22.95 45.7 -22.15 48.5 L-21.9 49.2 -23.15 52.85 -24.4 51.05 -31.1 41.05 M-38.3 -48.05 Q-41.85 -49.55 -45.0 -51.6 L-46.05 -52.4 -46.45 -52.7 -46.95 -53.05 -47.6 -54.15 -48.15 -55.25 -48.4 -55.25 -49.15 -56.65 -50.8 -61.45 -50.85 -62.0 -51.15 -66.35 Q-51.3 -69.5 -51.1 -71.35 -48.3 -72.3 -43.9 -72.35 -45.55 -67.0 -45.35 -62.05 L-45.3 -62.0 Q-45.2 -59.45 -44.35 -56.9 L-43.75 -55.25 -42.95 -53.3 -42.4 -52.1 Q-41.9 -51.0 -40.8 -50.1 -39.85 -49.15 -38.75 -48.7 L-38.3 -48.5 -38.2 -48.45 -36.9 -47.7 -36.75 -47.5 -38.1 -48.0 -38.15 -48.0 -38.3 -48.05 M-16.8 -122.3 L-18.9 -119.5 -20.4 -117.25 Q-20.5 -116.85 -20.75 -116.6 L-22.1 -114.2 -23.55 -114.9 Q-24.95 -115.65 -25.3 -116.35 L-25.4 -116.8 -25.1 -116.65 Q-22.85 -120.75 -19.7 -124.45 L-19.3 -124.85 Q-18.8 -122.85 -16.8 -122.3 M35.95 27.5 L36.2 27.9 38.15 31.85 38.5 32.8 38.8 33.45 Q39.9 35.9 40.6 38.1 L39.0 41.2 33.45 51.9 32.1 48.6 33.45 39.6 34.4 34.25 34.55 33.45 34.9 31.85 35.3 30.0 35.95 27.5 M17.1 -7.25 Q17.65 -6.1 17.6 -5.55 17.7 -3.6 15.5 0.35 L15.35 0.55 14.7 1.5 14.55 1.7 14.55 1.85 13.3 3.65 12.6 4.6 11.8 5.5 11.75 5.55 10.8 6.65 10.55 6.9 10.35 7.35 10.3 7.95 9.3 7.95 9.3 7.05 10.85 5.5 11.25 5.05 12.5 3.65 12.55 3.6 13.95 1.6 14.5 0.55 14.9 -0.65 15.05 -1.1 Q15.8 -3.25 15.85 -5.8 L17.1 -7.25 M-5.9 -3.1 L-4.75 -2.35 -4.6 -2.15 -4.2 -1.65 -4.15 -1.15 -3.75 0.55 -3.05 3.4 -2.9 3.65 -2.2 5.5 -1.8 6.3 0.35 9.75 1.15 10.4 1.3 10.5 Q2.15 12.0 2.2 13.4 L0.55 11.7 -2.7 7.25 -3.1 6.4 -3.7 5.5 -4.4 4.3 -4.75 3.65 -5.35 2.6 -6.0 0.55 -6.3 -0.95 Q-6.3 -2.0 -5.9 -3.1" fill="#e1b859" fill-rule="evenodd" stroke="none"/>
    <path d="M11.1 -96.0 L11.05 -94.4 10.95 -92.7 Q11.8 -92.8 13.4 -92.1 13.55 -90.9 15.0 -90.15 L17.95 -88.4 18.25 -88.4 18.35 -90.0 19.0 -89.75 19.55 -87.85 Q20.85 -87.85 21.3 -87.4 22.1 -87.75 22.25 -88.4 L22.6 -88.1 Q22.7 -87.95 23.1 -87.85 L22.95 -82.0 Q21.3 -82.35 19.8 -83.1 L16.8 -84.25 13.8 -85.0 Q12.15 -85.35 10.75 -85.0 9.15 -84.7 7.75 -83.45 L7.55 -83.25 5.1 -80.5 5.2 -80.35 Q3.35 -77.4 3.95 -70.6 L4.15 -69.3 3.7 -68.6 3.85 -68.35 4.15 -67.8 4.5 -67.2 5.1 -66.6 Q5.9 -64.95 7.3 -63.35 L8.55 -62.0 9.95 -60.65 Q11.65 -59.2 13.75 -57.8 22.85 -51.75 22.85 -48.35 22.9 -46.0 22.55 -44.05 L22.1 -42.3 Q21.4 -39.6 19.5 -36.75 19.2 -36.95 18.8 -37.25 L18.55 -37.45 18.05 -38.05 Q16.9 -38.95 13.55 -39.45 13.2 -39.2 12.85 -39.3 L12.7 -39.4 11.75 -39.4 11.75 -39.3 14.65 -36.6 Q14.95 -36.2 15.55 -35.75 L16.4 -34.95 17.1 -33.45 16.7 -32.95 15.0 -30.85 Q13.8 -29.55 12.4 -28.55 L12.35 -28.5 11.25 -28.3 10.75 -28.25 10.0 -27.95 9.4 -29.0 8.55 -30.2 4.6 -29.3 -1.5 -28.4 Q-2.9 -28.4 -9.05 -30.15 L-10.0 -30.45 -9.5 -29.65 -9.3 -29.1 Q-12.4 -30.45 -14.85 -32.75 L-14.95 -32.95 -15.45 -33.4 Q-15.2 -34.85 -14.3 -35.85 -12.8 -37.55 -8.85 -39.1 L-9.5 -39.1 -10.8 -38.85 -10.4 -39.1 -13.4 -38.35 -15.25 -37.7 -15.65 -37.5 -15.9 -37.15 -16.5 -36.05 -17.45 -35.6 -17.2 -35.1 -18.1 -36.0 Q-20.45 -38.35 -20.95 -41.8 L-21.2 -44.05 -21.3 -45.15 -21.3 -45.55 Q-21.4 -48.4 -19.85 -50.75 -18.1 -53.35 -15.35 -54.85 L-13.2 -56.1 -10.2 -58.1 -8.1 -59.8 -5.75 -62.0 -4.8 -63.35 -4.25 -64.55 Q-3.45 -65.95 -3.1 -67.45 -2.85 -68.4 -2.75 -69.3 L-2.7 -70.8 Q-2.7 -73.65 -3.3 -76.35 -3.75 -78.65 -4.65 -80.95 -4.95 -81.8 -5.6 -82.45 L-7.3 -83.75 -10.45 -85.15 -11.25 -85.45 -15.3 -86.3 -21.9 -84.6 -22.75 -84.3 -26.2 -83.5 -26.25 -83.6 -22.85 -85.8 -23.0 -89.1 -21.0 -90.3 -20.75 -90.5 -20.6 -90.65 -19.05 -94.4 -16.4 -100.15 -16.5 -99.65 -16.55 -98.05 -17.0 -94.4 -17.2 -91.7 -17.15 -91.6 -15.95 -94.4 -15.55 -95.2 -15.55 -94.4 -15.4 -91.2 Q-15.35 -92.0 -14.35 -94.4 L-13.95 -95.35 -13.0 -97.55 -13.45 -94.55 -13.3 -92.85 -12.9 -94.4 -12.15 -96.55 -12.4 -94.4 -12.75 -91.2 -11.55 -93.35 -11.1 -94.4 -7.9 -100.75 -7.95 -100.95 Q-7.55 -100.6 -7.9 -100.6 L-7.5 -89.95 -7.35 -89.75 -2.05 -89.95 -0.75 -89.95 -0.8 -93.2 Q0.5 -93.3 1.4 -92.85 L1.35 -94.4 1.4 -96.2 1.75 -94.4 2.1 -92.7 2.15 -92.65 2.85 -94.4 3.85 -97.0 5.5 -101.55 6.25 -95.55 7.35 -98.9 8.45 -102.85 8.7 -102.85 9.25 -98.5 Q9.6 -96.55 11.1 -96.0 M22.9 -98.6 L22.9 -99.15 23.05 -98.65 22.9 -98.6 M25.5 -86.8 L25.6 -88.5 25.7 -86.7 25.7 -86.55 25.65 -83.65 25.4 -82.7 25.45 -86.15 25.5 -86.8 M-15.55 -36.15 Q-16.25 -35.85 -16.6 -35.9 L-16.5 -36.05 -15.55 -36.15" fill="#e8d7c5" fill-rule="evenodd" stroke="none"/>
    <path d="M28.15 -65.4 L28.35 -60.75 28.3 -60.45 28.35 -60.15 27.5 -55.4 26.3 -50.0 25.5 -46.65 24.95 -44.5 24.85 -44.05 23.95 -41.15 22.6 -37.25 21.5 -34.3 21.25 -33.7 20.9 -32.95 19.75 -30.75 19.55 -30.5 17.0 -26.7 15.1 -24.55 14.15 -23.65 11.8 -21.95 11.5 -21.7 Q8.65 -20.1 2.5 -18.7 L1.35 -18.15 0.0 -18.15 Q-3.45 -18.5 -6.35 -20.2 L-8.75 -21.8 -11.6 -24.55 -12.65 -25.7 -15.35 -28.35 -15.7 -28.7 -17.95 -31.35 -18.0 -31.5 -18.55 -32.95 -19.45 -34.9 -19.55 -35.2 -19.75 -35.75 -19.95 -36.15 -20.85 -38.6 -21.55 -40.4 -22.1 -42.0 -22.7 -44.05 -23.15 -45.6 -24.25 -50.15 -25.45 -56.85 -26.25 -62.0 -26.45 -63.25 -17.75 -55.15 -17.3 -55.5 -10.4 -62.0 -10.35 -62.05 -8.95 -63.35 -8.4 -63.9 Q-6.75 -65.45 -5.35 -67.2 L-5.15 -67.45 -4.65 -68.6 -4.95 -69.15 -5.35 -69.6 -10.9 -77.0 -13.25 -80.2 -15.25 -82.9 Q-15.85 -83.65 -16.8 -83.7 L-17.05 -83.6 -17.7 -83.25 -23.2 -79.45 -25.5 -77.7 -25.5 -78.0 Q-25.4 -79.9 -25.1 -80.6 -24.8 -81.8 -21.0 -84.05 L-22.1 -84.05 -23.35 -83.75 -25.05 -83.3 -26.65 -83.3 Q-26.5 -83.75 -26.9 -84.85 L-27.3 -86.35 Q-27.3 -86.7 -23.0 -89.1 L-22.85 -85.8 -26.25 -83.6 -26.4 -83.45 -26.2 -83.5 -22.75 -84.3 -21.9 -84.6 -15.3 -86.3 -11.25 -85.45 -10.45 -85.15 -7.3 -83.75 -5.6 -82.45 Q-4.95 -81.8 -4.65 -80.95 -3.75 -78.65 -3.3 -76.35 -2.7 -73.65 -2.7 -70.8 L-2.75 -69.3 Q-2.85 -68.4 -3.1 -67.45 -3.45 -65.95 -4.25 -64.55 L-4.8 -63.35 -5.75 -62.0 -8.1 -59.8 -10.2 -58.1 -13.2 -56.1 -15.35 -54.85 Q-18.1 -53.35 -19.85 -50.75 -21.4 -48.4 -21.3 -45.55 L-21.3 -45.15 -21.2 -44.05 -20.95 -41.8 Q-20.45 -38.35 -18.1 -36.0 L-17.2 -35.1 -17.45 -35.6 -16.5 -36.05 -16.6 -35.9 Q-16.25 -35.85 -15.55 -36.15 -14.85 -36.45 -13.8 -37.05 L-11.1 -38.7 -10.8 -38.85 -9.5 -39.1 -8.85 -39.1 Q-12.8 -37.55 -14.3 -35.85 -15.2 -34.85 -15.45 -33.4 L-14.95 -32.95 -14.85 -32.75 Q-12.4 -30.45 -9.3 -29.1 L-9.5 -29.65 -10.0 -30.45 -9.05 -30.15 Q-2.9 -28.4 -1.5 -28.4 L4.6 -29.3 8.55 -30.2 9.4 -29.0 10.0 -27.95 10.75 -28.25 11.25 -28.3 12.35 -28.5 12.4 -28.45 12.45 -28.55 12.4 -28.55 Q13.8 -29.55 15.0 -30.85 L16.7 -32.95 17.1 -33.45 16.4 -34.95 15.55 -35.75 Q14.95 -36.2 14.65 -36.6 L11.75 -39.3 11.75 -39.4 12.7 -39.4 12.85 -39.3 14.05 -38.15 14.2 -37.9 15.5 -37.3 Q16.9 -36.6 17.55 -36.6 L18.55 -37.45 18.8 -37.25 Q19.2 -36.95 19.5 -36.75 21.4 -39.6 22.1 -42.3 L22.55 -44.05 Q22.9 -46.0 22.85 -48.35 22.85 -51.75 13.75 -57.8 11.65 -59.2 9.95 -60.65 L8.55 -62.0 7.3 -63.35 Q5.9 -64.95 5.1 -66.6 L7.85 -63.9 8.55 -63.35 17.45 -55.5 17.9 -55.15 28.15 -65.4 M4.15 -69.3 L3.95 -70.6 Q3.35 -77.4 5.2 -80.35 L5.1 -80.5 7.55 -83.25 7.75 -83.45 Q9.15 -84.7 10.75 -85.0 12.15 -85.35 13.8 -85.0 L16.8 -84.25 19.8 -83.1 Q21.3 -82.35 22.95 -82.0 L23.1 -87.85 23.2 -88.8 25.5 -86.8 25.45 -86.15 25.4 -82.7 25.25 -81.25 23.65 -81.25 26.05 -78.4 Q26.6 -77.85 26.75 -77.1 L26.8 -75.4 26.9 -75.1 25.5 -76.25 21.45 -79.45 15.6 -83.25 14.95 -83.6 14.75 -83.7 Q13.7 -83.65 13.2 -82.9 L11.4 -80.2 4.3 -69.6 4.15 -69.3 M22.3 -70.55 L22.3 -70.65 22.35 -70.55 22.3 -70.55" fill="#dfc7b0" fill-rule="evenodd" stroke="none"/>
    <path d="M27.75 -74.35 L27.9 -74.25 28.4 -73.85 28.6 -71.1 27.9 -70.95 25.35 -70.6 24.7 -70.5 25.25 -70.15 24.4 -68.95 23.8 -68.3 25.65 -67.75 Q20.95 -63.65 19.55 -63.55 18.2 -63.45 14.2 -64.6 L11.9 -65.4 13.05 -63.4 Q12.5 -63.9 10.0 -65.4 8.1 -66.7 8.25 -68.05 L8.3 -68.3 8.4 -68.5 7.75 -68.5 3.85 -68.35 3.7 -68.6 4.15 -69.3 4.3 -69.6 11.4 -80.2 13.2 -82.9 Q13.7 -83.65 14.75 -83.7 L14.95 -83.6 15.6 -83.25 21.45 -79.45 25.5 -76.25 26.9 -75.1 27.75 -74.35 M22.3 -70.55 L22.35 -70.55 22.3 -70.65 22.3 -70.55 M-27.8 -76.2 L-25.5 -77.7 -23.2 -79.45 -17.7 -83.25 -17.05 -83.6 -16.8 -83.7 Q-15.85 -83.65 -15.25 -82.9 L-13.25 -80.2 -10.9 -77.0 -5.35 -69.6 -4.95 -69.15 -9.35 -68.7 -9.15 -68.3 -9.05 -67.65 Q-9.0 -66.6 -10.45 -65.5 L-10.65 -65.4 -13.5 -63.4 -12.55 -65.4 -14.85 -64.6 Q-18.65 -63.45 -20.0 -63.55 -21.5 -63.65 -26.5 -67.75 L-24.65 -68.3 -25.1 -68.75 -27.1 -69.05 -27.55 -73.8 -27.8 -76.2" fill="#40353f" fill-rule="evenodd" stroke="none"/>
    <path d="M27.9 -70.95 L28.15 -65.4 17.9 -55.15 17.45 -55.5 8.55 -63.35 7.85 -63.9 5.1 -66.6 4.5 -67.2 4.15 -67.8 3.85 -68.35 7.75 -68.5 8.4 -68.5 8.3 -68.3 8.25 -68.05 Q8.1 -66.7 10.0 -65.4 12.5 -63.9 13.05 -63.4 L11.9 -65.4 14.2 -64.6 Q18.2 -63.45 19.55 -63.55 20.95 -63.65 25.65 -67.75 L23.8 -68.3 24.4 -68.95 25.25 -70.15 24.7 -70.5 25.35 -70.6 27.9 -70.95 M-4.95 -69.15 L-4.65 -68.6 -5.15 -67.45 -5.35 -67.2 Q-6.75 -65.45 -8.4 -63.9 L-8.95 -63.35 -10.35 -62.05 -10.4 -62.0 -17.3 -55.5 -17.75 -55.15 -26.45 -63.25 -26.45 -63.35 -26.55 -64.4 -27.1 -69.05 -25.1 -68.75 -24.65 -68.3 -26.5 -67.75 Q-21.5 -63.65 -20.0 -63.55 -18.65 -63.45 -14.85 -64.6 L-12.55 -65.4 -13.5 -63.4 -10.65 -65.4 -10.45 -65.5 Q-9.0 -66.6 -9.05 -67.65 L-9.15 -68.3 -9.35 -68.7 -4.95 -69.15" fill="#5e4f5e" fill-rule="evenodd" stroke="none"/>
    <path d="M34.55 -17.6 L34.6 -13.9 34.65 3.95 36.15 27.5 35.95 27.5 35.3 30.0 34.85 29.6 33.9 28.8 32.1 8.15 Q31.05 -3.55 29.75 -12.5 29.85 -9.7 29.05 -2.9 28.1 4.6 27.05 6.5 27.15 4.3 26.7 0.75 26.15 -3.05 25.45 -5.0 L25.5 -4.6 24.3 11.8 23.8 19.0 23.5 18.9 22.6 17.95 20.85 14.55 Q18.6 10.05 17.0 5.5 L16.4 3.65 16.2 3.15 15.9 1.65 15.5 0.85 15.55 0.55 15.5 0.35 Q17.7 -3.6 17.6 -5.55 17.65 -6.1 17.1 -7.25 L19.4 -9.4 19.65 -9.65 19.65 -9.7 Q21.9 -11.8 22.45 -13.9 L22.65 -15.55 22.15 -18.0 21.75 -18.85 20.05 -21.05 19.1 -22.25 18.95 -22.25 Q18.4 -23.55 17.45 -24.15 L16.9 -24.5 16.9 -24.55 16.9 -25.75 17.05 -25.9 19.55 -30.5 19.75 -30.75 20.9 -32.95 21.25 -33.7 21.5 -34.3 22.6 -37.25 23.95 -41.15 24.85 -44.05 24.95 -44.5 25.5 -46.65 Q27.3 -45.3 28.65 -44.7 L28.95 -44.55 29.15 -40.55 30.15 -14.6 Q30.5 -14.45 31.4 -14.25 L31.5 -17.1 31.7 -22.25 31.75 -24.55 32.15 -28.3 33.1 -17.6 34.55 -17.6 M-6.15 -17.05 L-8.45 -14.6 -9.05 -13.9 -10.9 -11.6 Q-12.4 -9.0 -12.3 -6.65 -12.3 -6.0 -8.45 -4.45 L-8.0 -4.3 -6.55 -3.45 -5.9 -3.1 Q-6.3 -2.0 -6.3 -0.95 L-6.0 0.55 -5.35 2.6 -5.65 3.65 -6.35 5.5 Q-8.2 10.25 -10.5 14.55 L-12.2 17.6 -13.1 13.95 Q-15.5 3.4 -15.65 -2.05 L-16.1 -12.1 -16.5 -12.1 -17.75 1.1 Q-18.65 12.0 -18.4 16.8 L-18.75 16.8 -21.85 6.85 -21.8 8.65 Q-21.65 11.8 -19.85 19.7 L-18.25 25.85 -21.5 29.4 Q-23.75 21.55 -24.9 15.3 -26.35 7.6 -27.35 -3.4 L-28.45 -13.9 -29.35 -22.1 Q-30.9 -36.1 -31.3 -44.65 L-31.25 -46.2 -31.05 -46.15 -28.25 -45.9 -27.0 -30.75 -24.55 -1.95 -20.0 -1.95 -20.5 -13.8 -20.8 -21.35 -21.25 -32.15 Q-20.85 -29.8 -20.4 -25.75 L-20.25 -24.55 -19.5 -18.95 -19.5 -19.95 -19.7 -24.55 -19.85 -27.65 -19.9 -28.4 Q-19.9 -32.1 -19.55 -35.2 L-19.45 -34.9 -18.55 -32.95 -18.0 -31.5 -17.95 -31.35 -15.4 -27.05 -13.75 -24.55 Q-12.75 -23.05 -11.55 -21.7 L-8.6 -19.15 -7.05 -18.25 -5.55 -17.5 -6.1 -16.95 -6.15 -17.05" fill="#211b1b" fill-rule="evenodd" stroke="none"/>
    <path d="M13.4 -21.45 L13.1 -18.0 12.9 -15.9 Q13.0 -14.9 12.75 -13.9 L12.7 -13.85 11.9 -12.2 10.3 -10.5 Q7.45 -8.0 4.1 -8.0 -1.05 -8.0 -3.35 -11.1 L-4.0 -11.95 -4.1 -12.4 -4.55 -13.85 -4.55 -13.9 -6.1 -16.9 -6.1 -16.95 -5.55 -17.5 -5.3 -17.35 -4.55 -17.1 Q-2.0 -16.15 0.9 -16.15 3.8 -16.1 6.5 -17.1 L7.7 -17.55 11.65 -19.95 12.15 -20.45 13.4 -21.45" fill="#a67159" fill-rule="evenodd" stroke="none"/>
    <path d="M0.55 6.3 L0.4 5.5 0.15 3.65 -0.3 0.55 -0.7 -2.1 0.5 -1.95 Q5.05 -1.95 9.95 -4.6 L12.15 -5.8 13.95 -6.7 12.25 -3.7 11.75 -2.7 10.05 0.55 8.55 3.6 8.55 3.65 8.2 5.5 8.15 5.75 7.35 6.4 Q5.75 7.95 4.75 7.95 L3.35 7.6 Q2.8 7.15 2.15 6.95 L2.0 6.9 0.55 6.3" fill="#09090d" fill-rule="evenodd" stroke="none"/>
    <path d="M38.15 -42.7 L38.35 -35.05 38.35 -34.85 38.55 -29.65 38.55 -29.4 38.65 -24.55 38.65 -21.75 Q39.2 -18.6 40.3 -13.9 L43.1 -2.15 Q48.4 18.9 52.8 27.5 L52.7 27.65 52.15 28.55 51.6 29.45 Q46.4 19.15 43.05 6.7 41.2 0.25 39.05 -10.95 L39.45 0.55 39.55 3.65 39.6 5.5 40.05 14.55 40.4 19.35 Q40.95 26.35 42.3 31.85 L42.7 33.45 43.8 36.75 45.65 42.9 47.05 46.75 52.2 61.3 52.95 63.65 53.65 65.75 47.65 67.7 47.3 67.75 45.9 64.05 45.8 63.65 42.55 53.85 39.0 41.2 40.6 38.1 Q39.9 35.9 38.8 33.45 L38.5 32.8 38.15 31.85 36.2 27.9 35.95 27.5 36.15 27.5 34.65 3.95 34.6 -13.9 34.55 -17.6 35.85 -17.6 35.8 -18.6 35.65 -20.6 35.55 -21.3 35.55 -21.95 35.85 -21.95 36.45 -19.15 36.6 -29.1 36.5 -30.15 35.6 -42.15 38.15 -42.7 M-32.6 37.8 Q-35.9 29.4 -37.05 22.15 -37.6 18.5 -38.2 2.95 L-38.55 -13.9 -38.55 -24.3 -38.3 -48.05 -38.15 -48.0 -38.1 -48.0 -36.75 -47.5 -35.1 -47.0 -34.0 -46.75 -31.25 -46.2 -31.3 -44.65 Q-30.9 -36.1 -29.35 -22.1 L-28.45 -13.9 -27.35 -3.4 Q-26.35 7.6 -24.9 15.3 -23.75 21.55 -21.5 29.4 L-23.1 30.85 -24.05 31.85 -25.7 33.45 -26.6 34.3 -26.85 33.45 -27.1 32.55 -28.1 33.45 -29.2 34.45 -29.3 33.45 -29.5 31.85 -31.55 14.55 -32.8 3.65 -33.15 0.55 -34.9 -13.9 -35.2 -16.6 -35.15 -13.9 Q-34.95 -4.5 -34.9 8.65 -34.5 18.8 -33.2 24.95 -32.2 29.7 -30.1 35.35 L-32.6 37.8 M23.5 18.9 L23.8 19.0 24.3 11.8 25.5 -4.6 25.45 -5.0 Q26.15 -3.05 26.7 0.75 27.15 4.3 27.05 6.5 28.1 4.6 29.05 -2.9 29.85 -9.7 29.75 -12.5 31.05 -3.55 32.1 8.15 L33.9 28.8 28.4 24.3 Q26.85 23.0 23.75 19.25 L23.5 18.9 M-12.2 17.6 Q-15.0 22.0 -18.25 25.85 L-19.85 19.7 Q-21.65 11.8 -21.8 8.65 L-21.85 6.85 -18.75 16.8 -18.4 16.8 Q-18.65 12.0 -17.75 1.1 L-16.5 -12.1 -16.1 -12.1 -15.65 -2.05 Q-15.5 3.4 -13.1 13.95 L-12.2 17.6" fill="#2b2323" fill-rule="evenodd" stroke="none"/>
    <path d="M-1.8 6.3 L-0.4 6.0 Q-0.15 6.0 0.35 6.25 L0.55 6.3 2.0 6.9 2.15 6.95 Q2.8 7.15 3.35 7.6 L4.75 7.95 Q5.75 7.95 7.35 6.4 L8.15 5.75 8.4 5.5 Q9.55 4.75 10.8 4.75 L11.25 5.05 10.85 5.5 9.3 7.05 9.3 7.95 10.3 7.95 10.35 7.35 10.55 6.9 10.8 6.65 11.75 5.55 Q12.4 6.0 12.4 6.5 12.5 8.55 12.25 9.05 L10.4 12.0 9.35 13.15 8.7 14.55 Q7.0 18.85 6.65 25.55 L7.8 31.85 8.1 33.45 8.45 35.55 Q9.75 41.5 13.4 47.65 L13.95 48.9 14.1 49.35 14.4 50.05 15.25 52.45 Q15.3 54.05 14.6 54.85 13.95 55.55 12.65 55.55 11.95 55.55 10.6 54.65 9.2 53.65 7.95 53.65 6.9 53.65 5.35 54.75 3.6 55.85 2.15 55.85 0.65 55.85 -0.4 54.4 -1.0 53.65 -1.25 52.5 L-1.45 51.2 Q-1.55 48.25 1.1 39.7 L2.75 33.45 3.05 31.85 Q3.7 28.0 3.55 24.75 3.3 18.65 0.45 14.55 L0.15 14.05 Q-3.05 9.95 -3.15 9.05 -3.2 8.15 -2.7 7.25 L0.55 11.7 0.9 12.35 Q1.65 13.3 2.2 13.4 2.15 12.0 1.3 10.5 L1.1 10.15 Q0.45 8.95 0.35 9.75 L-1.8 6.3" fill="#b8a783" fill-rule="evenodd" stroke="none"/>
    <path d="M0.35 9.75 Q0.45 8.95 1.1 10.15 L1.3 10.5 1.15 10.4 0.35 9.75" fill="#87704e" fill-rule="evenodd" stroke="none"/>
    <path d="M47.65 67.7 L50.75 82.45 51.3 84.9 53.15 92.5 46.4 92.5 45.6 91.7 45.9 92.5 35.9 92.5 34.65 86.05 34.5 85.75 34.45 85.2 34.25 83.65 34.05 81.55 35.5 80.4 Q38.05 78.35 39.05 72.3 39.75 67.85 38.8 63.65 37.95 59.9 35.85 56.35 L33.45 51.9 39.0 41.2 42.55 53.85 45.8 63.65 45.9 64.05 47.3 67.75 47.65 67.7 M-22.35 92.5 L-42.2 92.5 Q-40.85 89.25 -39.5 84.65 -36.65 74.8 -34.9 67.45 L-34.05 63.65 Q-32.25 55.1 -32.25 50.8 -32.4 44.95 -31.15 41.2 L-31.1 41.05 -24.4 51.05 -26.9 50.55 -29.0 49.9 -29.4 49.9 -29.25 50.1 -29.25 50.15 -27.15 52.8 -25.65 54.7 -28.15 58.6 Q-30.05 61.1 -30.5 62.35 L-30.5 63.2 -27.15 63.35 -27.2 63.65 -27.35 67.45 Q-27.3 69.8 -26.75 72.3 -25.25 78.35 -22.5 80.4 L-20.85 81.65 -22.05 90.4 -22.35 92.5" fill="#2e2e40" fill-rule="evenodd" stroke="none"/>
    <path d="M-23.15 52.85 L-23.25 53.0 -24.85 56.35 Q-26.6 59.75 -27.15 63.35 L-30.5 63.2 -30.5 62.35 Q-30.05 61.1 -28.15 58.6 L-25.65 54.7 -27.15 52.8 -29.25 50.15 -29.25 50.1 -29.0 49.9 -26.9 50.55 -24.4 51.05 -23.15 52.85" fill="#232330" fill-rule="evenodd" stroke="none"/>
    <path d="M5.5 -76.35 Q9.15 -81.6 14.35 -83.35 L20.6 -84.6 Q18.05 -83.55 15.0 -81.35 9.75 -78.0 5.5 -76.35" fill="#4b3d3d" fill-rule="evenodd" stroke="none"/>
    <path d="M-23.4 -70.4 L-23.35 -70.4 -23.35 -70.5 -23.4 -70.4 M-25.05 -68.75 L-26.25 -70.0 -22.35 -72.45 Q-20.3 -73.4 -17.15 -73.4 -14.8 -73.4 -12.65 -72.25 L-10.65 -70.65 -9.3 -68.7 -9.1 -68.35 -9.0 -67.8 Q-8.95 -66.85 -10.35 -65.9 L-10.55 -65.8 Q-12.9 -64.5 -13.4 -64.0 L-12.45 -65.8 -14.7 -65.1 Q-18.55 -64.05 -19.9 -64.15 -21.35 -64.2 -26.45 -67.9 L-24.6 -68.35 -25.05 -68.75 M-20.35 -68.05 L-19.65 -68.1 -19.1 -68.3 -18.9 -68.45 -18.75 -68.65 Q-18.2 -69.0 -18.25 -69.35 L-18.3 -69.9 -18.6 -70.25 -19.2 -70.45 Q-20.15 -70.45 -20.55 -70.0 L-20.45 -70.4 -20.9 -70.0 -22.75 -68.45 -23.1 -68.1 -23.3 -68.0 -21.55 -66.55 Q-20.4 -65.65 -17.1 -65.75 -13.85 -65.8 -11.35 -67.6 L-11.7 -68.05 -11.75 -68.15 -11.95 -68.45 Q-13.35 -70.25 -15.85 -71.0 L-15.45 -70.45 Q-14.5 -69.35 -14.55 -68.3 L-14.6 -68.25 -15.15 -67.3 -15.6 -67.2 Q-18.5 -66.2 -20.35 -68.05" fill="#13131a" fill-rule="evenodd" stroke="none"/>
    <path d="M-20.55 -70.0 L-20.9 -68.5 -20.85 -68.25 -23.1 -68.1 -22.75 -68.45 -20.9 -70.0 -20.45 -70.4 -20.55 -70.0 M-11.7 -68.05 L-14.55 -68.3 Q-14.5 -69.35 -15.45 -70.45 L-15.85 -71.0 Q-13.35 -70.25 -11.95 -68.45 L-11.75 -68.15 -11.7 -68.05" fill="#b7b5ae" fill-rule="evenodd" stroke="none"/>
    <path d="M-20.85 -68.25 L-20.9 -68.5 -20.55 -70.0 Q-20.15 -70.45 -19.2 -70.45 L-18.6 -70.25 -18.3 -69.9 -18.25 -69.35 Q-18.2 -69.0 -18.75 -68.65 L-18.9 -68.45 -19.1 -68.3 -19.65 -68.1 -20.35 -68.05 Q-20.8 -68.0 -20.85 -68.25" fill="#ffffff" fill-rule="evenodd" stroke="none"/>
    <path d="M-20.85 -68.25 Q-20.8 -68.0 -20.35 -68.05 -18.5 -66.2 -15.6 -67.2 L-15.15 -67.3 -14.6 -68.25 -14.55 -68.3 -11.7 -68.05 -11.35 -67.6 Q-13.85 -65.8 -17.1 -65.75 -20.4 -65.65 -21.55 -66.55 L-23.3 -68.0 -23.1 -68.1 -20.85 -68.25" fill="#d4d3cf" fill-rule="evenodd" stroke="none"/>
    <path d="M19.6 -70.0 Q19.1 -70.45 18.15 -70.45 L17.55 -70.25 17.35 -69.9 17.3 -69.35 17.35 -69.3 Q17.4 -68.95 17.9 -68.65 L18.15 -68.45 Q18.75 -68.05 19.6 -68.05 18.0 -66.2 14.95 -67.2 L14.5 -67.3 Q13.95 -67.85 13.9 -68.45 L13.8 -68.9 Q13.75 -69.6 14.4 -70.45 L14.85 -71.0 Q12.45 -70.3 11.4 -68.7 L11.1 -68.3 11.0 -68.15 10.7 -67.6 Q13.4 -65.8 16.65 -65.75 20.0 -65.65 21.0 -66.55 L22.55 -68.0 21.6 -68.85 20.4 -69.7 19.95 -70.0 19.4 -70.4 19.6 -70.0 M12.0 -65.8 L13.15 -64.0 Q12.6 -64.5 10.1 -65.8 8.15 -66.95 8.3 -68.15 L8.35 -68.35 8.4 -68.55 Q9.35 -70.85 11.4 -72.25 13.45 -73.4 15.8 -73.4 18.95 -73.4 21.1 -72.45 L24.7 -70.35 25.3 -70.0 24.45 -68.95 23.85 -68.35 25.7 -67.9 Q21.1 -64.2 19.65 -64.15 18.3 -64.05 14.35 -65.1 L12.0 -65.8 M22.3 -70.4 L22.35 -70.4 22.3 -70.5 22.3 -70.4" fill="#13131a" fill-rule="evenodd" stroke="none"/>
    <path d="M19.6 -68.05 Q18.75 -68.05 18.15 -68.45 L17.9 -68.65 Q17.4 -68.95 17.35 -69.3 L17.3 -69.35 17.35 -69.9 17.55 -70.25 18.15 -70.45 Q19.1 -70.45 19.6 -70.0 L19.8 -69.6 20.05 -68.75 20.1 -68.5 Q20.25 -68.0 19.6 -68.05" fill="#ffffff" fill-rule="evenodd" stroke="none"/>
    <path d="M19.6 -70.0 L19.4 -70.4 19.95 -70.0 20.4 -69.7 21.6 -68.85 20.05 -68.75 19.8 -69.6 19.6 -70.0 M11.1 -68.3 L11.4 -68.7 Q12.45 -70.3 14.85 -71.0 L14.4 -70.45 Q13.75 -69.6 13.8 -68.9 L13.9 -68.45 11.1 -68.3" fill="#b7b5ae" fill-rule="evenodd" stroke="none"/>
    <path d="M21.6 -68.85 L22.55 -68.0 21.0 -66.55 Q20.0 -65.65 16.65 -65.75 13.4 -65.8 10.7 -67.6 L11.0 -68.15 11.1 -68.3 13.9 -68.45 Q13.95 -67.85 14.5 -67.3 L14.95 -67.2 Q18.0 -66.2 19.6 -68.05 20.25 -68.0 20.1 -68.5 L20.05 -68.75 21.6 -68.85" fill="#d4d3cf" fill-rule="evenodd" stroke="none"/>
    <path d="M4.65 -31.0 Q7.5 -31.85 7.45 -33.2 L7.45 -33.4 9.65 -33.75 11.2 -33.7 12.7 -33.65 13.2 -33.7 13.9 -34.0 13.25 -33.2 12.05 -32.8 8.15 -31.9 Q5.5 -30.55 5.4 -29.0 5.2 -28.05 2.25 -27.8 L-2.7 -28.05 Q-6.6 -28.5 -6.6 -29.35 L-6.4 -29.85 -6.15 -30.45 Q-6.2 -31.3 -9.3 -31.45 L-9.85 -31.45 -12.85 -31.6 -12.5 -32.05 -11.4 -31.85 -9.9 -32.1 -7.55 -32.4 Q-7.3 -31.2 -5.25 -30.6 L-5.6 -30.25 Q-5.25 -29.75 -2.35 -28.95 L1.4 -28.35 Q3.35 -28.5 4.05 -29.0 4.85 -29.6 4.65 -31.0" fill="#d8b59e" fill-rule="evenodd" stroke="none"/>
    <path d="M7.45 -33.4 L7.45 -33.2 Q7.5 -31.85 4.65 -31.0 L-0.15 -30.25 -4.65 -30.45 -5.25 -30.6 Q-7.3 -31.2 -7.55 -32.4 L-7.55 -32.6 -6.85 -33.35 -6.25 -33.75 -5.9 -33.75 Q-3.6 -33.7 -1.3 -32.85 L5.9 -34.4 6.25 -34.55 6.3 -34.55 7.0 -34.1 7.45 -33.4 M3.05 -32.45 Q3.05 -32.2 3.45 -31.9 L3.95 -32.3 4.2 -32.85 4.1 -33.15 Q3.0 -33.45 3.05 -32.45 M5.4 -33.4 L5.1 -33.75 4.7 -33.7 4.6 -33.35 4.7 -33.0 5.0 -33.05 5.4 -33.4 M-6.1 -32.75 L-6.1 -32.55 -6.0 -32.45 -5.8 -32.4 -5.5 -32.45 -5.25 -33.1 Q-6.15 -33.25 -6.1 -32.75 M-4.0 -32.8 L-4.05 -32.95 -4.55 -32.9 -4.9 -32.55 -4.8 -32.15 Q-4.0 -32.6 -4.0 -32.8" fill="#ddad99" fill-rule="evenodd" stroke="none"/>
    <path d="M5.4 -33.4 L5.0 -33.05 4.7 -33.0 4.6 -33.35 4.7 -33.7 5.1 -33.75 5.4 -33.4 M3.05 -32.45 Q3.0 -33.45 4.1 -33.15 L4.2 -32.85 3.95 -32.3 3.45 -31.9 Q3.05 -32.2 3.05 -32.45 M-4.0 -32.8 Q-4.0 -32.6 -4.8 -32.15 L-4.9 -32.55 -4.55 -32.9 -4.05 -32.95 -4.0 -32.8 M-6.1 -32.75 Q-6.15 -33.25 -5.25 -33.1 L-5.5 -32.45 -5.8 -32.4 -6.0 -32.45 -6.1 -32.55 -6.1 -32.75" fill="#fae7d4" fill-rule="evenodd" stroke="none"/>
    <path d="M6.3 -34.55 L6.25 -34.55 5.9 -34.4 -1.3 -32.85 Q-3.6 -33.7 -5.9 -33.75 L-6.25 -33.75 -8.1 -33.65 -9.95 -33.05 -10.2 -33.0 -10.3 -33.0 -10.95 -33.1 -11.0 -33.1 -11.65 -33.95 -11.55 -34.0 -10.2 -34.0 -10.35 -34.55 Q-10.4 -34.85 -10.6 -35.0 -11.15 -35.55 -11.15 -35.8 L-10.05 -35.6 -1.4 -34.5 Q0.85 -34.7 5.5 -35.9 L10.0 -37.15 10.95 -36.0 11.65 -35.0 12.55 -35.35 13.15 -35.5 14.4 -35.8 14.45 -35.85 14.5 -35.85 14.05 -35.3 Q13.8 -35.2 13.7 -35.1 13.4 -34.9 13.15 -34.8 L12.75 -34.65 11.7 -34.45 10.95 -34.4 10.85 -34.35 6.3 -34.55" fill="#a67159" fill-rule="evenodd" stroke="none"/>
    <path d="M4.65 -31.0 Q4.85 -29.6 4.05 -29.0 3.35 -28.5 1.4 -28.35 L-2.35 -28.95 Q-5.25 -29.75 -5.6 -30.25 L-5.25 -30.6 -4.65 -30.45 -0.15 -30.25 4.65 -31.0 M-7.55 -32.4 L-9.9 -32.1 -11.4 -31.85 -12.5 -32.05 -13.2 -32.4 -13.1 -32.55 -13.1 -32.7 -11.8 -32.9 -11.0 -33.1 -10.95 -33.1 -10.3 -33.0 -10.2 -33.0 -9.95 -33.05 -8.1 -33.65 -6.25 -33.75 -6.85 -33.35 -7.55 -32.6 -7.55 -32.4 M13.9 -34.0 L13.2 -33.7 12.7 -33.65 11.2 -33.7 9.65 -33.75 7.45 -33.4 7.0 -34.1 6.3 -34.55 10.85 -34.35 10.95 -34.4 11.7 -34.45 12.75 -34.65 13.15 -34.8 Q13.4 -34.9 13.7 -35.1 13.8 -35.2 14.05 -35.3 L14.7 -35.35 Q14.75 -34.7 14.2 -34.3 L13.9 -34.0" fill="#c69575" fill-rule="evenodd" stroke="none"/>
    <path d="M1.25 -45.85 Q1.3 -44.5 0.65 -43.4 -0.1 -42.05 -1.5 -42.0 -3.35 -41.9 -3.45 -44.65 -3.5 -45.9 -3.05 -47.25 L-2.95 -47.45 -2.45 -48.15 -2.25 -48.5 Q-1.9 -48.95 -0.95 -49.0 -0.2 -49.05 0.5 -48.2 1.2 -47.25 1.25 -45.85" fill="#fae7d4" fill-rule="evenodd" stroke="none"/>
    <path d="M3.6 -41.95 Q4.2 -41.95 4.2 -41.35 L4.25 -41.2 3.9 -40.15 3.0 -40.35 1.75 -39.9 Q1.0 -39.35 1.0 -39.05 1.0 -38.75 1.5 -38.55 -0.1 -37.95 -1.7 -37.9 L-3.75 -38.05 -3.65 -38.15 Q-3.25 -38.55 -3.25 -39.0 L-3.65 -39.55 Q-4.1 -40.0 -4.75 -39.95 L-5.35 -39.95 -5.65 -39.3 -5.75 -39.4 Q-6.4 -40.0 -6.4 -40.75 -6.45 -41.45 -6.0 -41.55 L-5.75 -41.6 Q-5.55 -41.65 -3.65 -40.95 -1.8 -40.3 -1.0 -40.3 -0.25 -40.35 1.45 -41.15 L3.5 -41.95 3.6 -41.95" fill="#a67159" fill-rule="evenodd" stroke="none"/>
    <path d="M3.9 -40.15 L4.25 -41.2 4.2 -41.35 Q4.2 -41.95 3.6 -41.95 L3.25 -43.0 2.8 -44.4 4.45 -43.05 5.9 -41.65 6.0 -41.3 Q6.1 -40.25 5.3 -39.25 4.55 -38.25 3.1 -37.6 1.05 -36.85 0.5 -36.3 L0.0 -35.8 -1.1 -34.6 Q-1.85 -34.55 -3.5 -35.65 L-4.75 -36.4 Q-7.25 -38.1 -8.1 -39.55 L-7.95 -39.9 -7.2 -41.8 Q-6.6 -43.45 -5.5 -44.3 L-5.5 -43.95 -6.0 -41.55 Q-6.45 -41.45 -6.4 -40.75 -6.4 -40.0 -5.75 -39.4 L-5.65 -39.3 -5.05 -39.0 -3.95 -38.15 -3.75 -38.05 -1.7 -37.9 Q-0.1 -37.95 1.5 -38.55 L2.0 -38.8 Q3.35 -39.45 3.9 -40.15" fill="#dfc7b0" fill-rule="evenodd" stroke="none"/>
    <path d="M3.9 -40.15 Q3.35 -39.45 2.0 -38.8 L1.5 -38.55 Q1.0 -38.75 1.0 -39.05 1.0 -39.35 1.75 -39.9 L3.0 -40.35 3.9 -40.15 M-3.75 -38.05 L-3.95 -38.15 -5.05 -39.0 -5.65 -39.3 -5.35 -39.95 -4.75 -39.95 Q-4.1 -40.0 -3.65 -39.55 L-3.25 -39.0 Q-3.25 -38.55 -3.65 -38.15 L-3.75 -38.05" fill="#7a5342" fill-rule="evenodd" stroke="none"/>
    <path d="M-4.35 -76.3 Q-8.6 -77.95 -13.85 -81.3 -16.9 -83.5 -19.45 -84.55 L-13.2 -83.3 Q-8.0 -81.55 -4.35 -76.3" fill="#4b3d3d" fill-rule="evenodd" stroke="none"/>
  </g>
</svg>
