<?xml version="1.0" encoding="UTF-8" standalone="no"?>
<svg xmlns:xlink="http://www.w3.org/1999/xlink" height="8.5px" width="36.95px" xmlns="http://www.w3.org/2000/svg">
  <g transform="matrix(1.0, 0.0, 0.0, 1.0, 0.65, 2.15)">
    <path d="M-0.65 6.35 L-0.1 -2.15 36.3 -1.35 -0.65 6.35" fill="#ffffff" fill-rule="evenodd" stroke="none"/>
  </g>
</svg>
