<?xml version="1.0" encoding="UTF-8" standalone="no"?>
<svg xmlns:xlink="http://www.w3.org/1999/xlink" height="46.55px" width="43.75px" xmlns="http://www.w3.org/2000/svg">
  <g transform="matrix(1.0, 0.0, 0.0, 1.0, 21.5, 23.35)">
    <path d="M-2.3 -21.2 Q-6.2 -18.6 -8.2 -12.7 L-8.65 -11.15 -9.25 -11.2 -9.8 -11.65 -10.0 -12.0 -9.85 -12.45 Q-10.6 -12.45 -11.5 -13.05 L-12.2 -13.65 Q-12.85 -14.4 -12.85 -15.45 L-12.7 -16.65 -12.6 -17.15 -12.35 -17.75 -12.35 -17.9 -10.9 -19.95 -10.1 -20.6 -10.1 -20.65 -9.7 -20.9 -9.6 -20.95 -9.7 -21.1 -9.4 -21.1 -7.55 -21.6 Q-6.6 -21.6 -5.8 -21.0 L-5.2 -20.45 -5.15 -20.3 -5.2 -20.55 Q-5.2 -21.0 -4.65 -21.35 L-3.65 -21.6 -2.55 -21.4 -2.3 -21.2 M13.25 -21.8 L13.65 -21.7 14.1 -21.45 13.25 -21.8 M7.8 -12.4 L7.6 -12.25 7.45 -12.15 7.05 -12.7 Q6.3 -13.8 6.05 -14.8 L5.85 -15.7 5.8 -16.0 Q5.85 -15.25 6.15 -14.6 6.6 -13.35 7.8 -12.4 M5.95 -11.7 L5.8 -11.55 5.6 -12.65 Q5.45 -13.25 5.45 -13.85 L5.5 -14.4 5.5 -13.65 Q5.55 -12.65 5.95 -11.7 M1.45 -4.9 L1.45 -4.95 1.5 -4.9 1.45 -4.9 M-12.95 19.65 L-13.35 20.0 -13.05 19.55 -12.95 19.65 M-18.45 10.1 L-18.7 10.2 -18.5 10.05 -18.45 10.1 M-19.35 -7.7 Q-20.1 -9.85 -20.1 -11.35 -20.1 -14.05 -18.45 -16.35 L-17.15 -17.9 -17.1 -17.95 Q-15.1 -19.95 -12.7 -20.65 -14.95 -19.4 -16.3 -17.95 -18.55 -15.4 -18.55 -11.9 -18.55 -8.1 -16.75 -5.1 L-18.0 -6.25 -19.2 -7.75 -19.35 -7.7 M-9.6 -20.95 L-9.4 -21.1 -9.6 -20.95 M-13.35 -2.8 L-13.3 -2.9 -13.3 -3.1 -13.05 -4.7 -12.85 -4.7 -11.3 0.3 -10.05 4.8 Q-10.85 3.95 -11.7 2.1 -12.55 0.25 -12.8 -1.15 -12.6 0.75 -13.7 4.25 -13.6 2.5 -14.15 -0.05 L-14.85 -3.1 Q-14.05 -1.7 -13.45 -1.45 L-13.35 -2.8" fill="#e0cdcd" fill-rule="evenodd" stroke="none"/>
    <path d="M20.6 -14.35 L21.5 -12.45 22.05 -10.2 21.9 -8.85 21.3 -7.1 20.7 -6.2 Q20.8 -8.15 20.4 -8.9 L20.25 -7.65 19.9 -6.5 19.8 -6.6 Q19.4 -8.3 17.5 -9.45 L14.3 -10.8 Q17.55 -8.7 18.2 -7.0 16.8 -8.9 11.25 -10.65 L10.0 -11.1 Q9.0 -11.55 8.3 -12.05 L7.8 -12.4 Q6.6 -13.35 6.15 -14.6 6.85 -13.5 8.7 -12.4 9.9 -11.7 10.9 -11.35 L12.6 -11.0 13.45 -11.0 Q12.8 -11.35 12.3 -11.65 L11.2 -12.2 Q9.9 -12.95 9.25 -13.55 L14.15 -12.1 14.4 -12.0 Q17.3 -11.0 18.7 -9.65 L18.75 -9.4 18.75 -9.6 18.7 -9.65 Q18.45 -10.8 17.25 -11.95 L16.85 -12.3 15.05 -13.65 15.05 -13.9 Q16.3 -13.5 17.45 -12.35 L17.65 -12.1 19.55 -9.4 18.6 -12.4 18.55 -12.45 17.1 -15.5 17.2 -15.55 19.45 -12.6 19.55 -12.45 Q20.85 -10.55 21.2 -9.0 L21.3 -9.15 21.4 -9.5 21.1 -12.45 20.95 -13.05 20.6 -14.2 20.6 -14.35 M8.9 -10.05 Q9.6 -8.5 9.9 -5.95 L9.85 -5.95 9.8 -5.9 Q9.6 -7.15 7.35 -9.55 L6.85 -10.15 Q6.25 -10.9 5.95 -11.7 5.55 -12.65 5.5 -13.65 5.95 -12.1 7.2 -10.8 L7.55 -10.4 Q8.75 -9.1 9.15 -8.2 L9.2 -8.3 9.0 -9.5 8.9 -10.05" fill="#e2cece" fill-rule="evenodd" stroke="none"/>
    <path d="M-8.95 -7.9 L-8.6 -4.85 Q-8.2 -3.05 -6.85 -0.4 -7.3 -1.95 -7.3 -3.65 L-7.1 -5.7 Q-7.1 -2.5 -5.8 0.55 L-5.75 0.6 -6.0 -0.7 -6.25 -2.8 -5.95 -5.8 -5.7 -1.85 Q-5.3 0.55 -4.45 2.4 L-3.65 3.9 -3.95 2.4 -4.05 1.65 -4.2 0.0 -4.05 -1.55 -3.4 1.05 -3.35 1.2 -2.7 3.4 -2.8 2.55 -2.9 1.9 -2.65 0.55 -2.2 -0.7 Q-1.5 -2.55 -1.5 -3.6 L-1.7 -5.15 -0.9 -4.95 -0.9 -4.8 -0.55 -4.05 -0.55 -4.0 -0.35 -3.65 -0.1 -2.95 -1.05 -3.1 -1.0 -2.5 -0.95 -1.45 -1.0 -1.45 Q-1.65 -0.6 -1.9 0.25 L-2.15 1.7 -1.95 3.35 -2.0 3.65 -2.25 5.15 -3.3 4.4 -4.5 3.25 -5.8 1.45 -4.95 3.8 -5.0 3.8 -5.05 3.85 -5.4 3.45 -6.45 2.0 -6.75 1.55 -7.5 0.05 -7.6 -0.15 Q-9.1 -3.55 -8.95 -7.9 M-2.65 -5.85 L-4.5 -4.9 -2.05 -6.95 -3.8 -6.6 -5.3 -6.75 Q-3.8 -7.6 -2.2 -9.05 -0.35 -10.75 -0.2 -11.65 L0.0 -11.55 -0.7 -9.7 Q-1.45 -8.45 -3.05 -7.55 -1.2 -7.75 1.45 -10.0 2.65 -11.05 3.3 -12.0 2.7 -9.85 1.2 -8.4 0.1 -7.35 -2.65 -5.85 M22.05 -10.2 L22.25 -7.75 22.1 -7.7 22.2 -6.8 22.05 -5.45 21.8 -4.4 Q21.2 -2.4 21.2 -1.2 21.2 1.0 21.85 2.3 20.6 0.7 20.5 -0.8 L20.7 -1.35 21.1 -3.05 21.5 -5.35 21.3 -7.1 21.9 -8.85 22.05 -10.2 M-6.1 12.5 L-7.05 13.85 -7.95 14.9 -8.0 14.85 -7.65 13.85 -7.3 12.45 Q-6.75 10.35 -6.75 9.9 L-6.85 8.45 -6.75 7.35 -6.75 7.3 -6.75 6.85 -6.75 5.1 -6.35 8.05 Q-6.15 10.15 -6.1 12.5 M-10.15 16.5 L-12.85 19.55 -12.95 19.65 -13.05 19.55 Q-12.45 18.6 -11.95 17.25 -11.25 15.5 -10.85 13.85 L-10.85 13.7 -10.85 13.65 -10.8 13.45 -10.2 11.6 -9.8 10.45 -9.2 8.15 -9.3 10.15 Q-9.5 13.35 -10.15 16.5 M-17.95 22.2 L-19.7 23.2 Q-17.7 21.5 -16.3 19.55 -14.9 17.55 -14.05 15.3 L-13.6 13.85 -13.05 11.05 -14.65 12.8 -15.65 13.6 -15.75 13.3 -14.75 12.0 -14.75 11.95 -14.85 11.95 Q-15.7 13.15 -17.15 13.5 L-18.45 13.65 -18.5 13.65 -19.8 13.35 -21.5 12.35 Q-19.8 13.1 -18.45 12.85 -17.9 12.75 -17.4 12.45 L-17.15 12.3 Q-15.85 11.5 -15.45 10.15 -14.8 8.25 -14.75 7.0 L-14.5 4.65 -14.45 4.1 -14.45 3.5 Q-15.2 7.5 -17.15 9.25 L-18.45 10.1 -18.5 10.05 -18.45 10.0 -17.15 8.15 -16.35 6.0 Q-15.9 4.3 -15.9 2.9 -15.9 0.75 -17.15 -2.35 L-18.0 -4.3 -18.45 -5.25 -19.2 -7.15 -19.35 -7.7 -19.2 -7.75 -18.0 -6.25 -16.75 -5.1 Q-18.55 -8.1 -18.55 -11.9 -18.55 -15.4 -16.3 -17.95 -14.95 -19.4 -12.7 -20.65 L-9.7 -21.1 -9.6 -20.95 -9.7 -20.9 -10.1 -20.65 -10.1 -20.6 -10.2 -20.8 Q-13.1 -20.35 -15.1 -17.35 L-16.35 -14.9 Q-16.95 -13.3 -16.95 -11.6 -16.95 -8.8 -15.45 -6.1 -16.05 -8.8 -16.05 -9.8 -16.05 -12.1 -15.35 -13.9 -14.45 -16.3 -12.35 -17.9 L-12.6 -17.15 -12.7 -16.65 -12.85 -15.45 -14.05 -12.7 -14.1 -12.35 Q-14.5 -10.75 -14.5 -8.35 -14.5 -7.35 -13.9 -4.8 L-13.35 -2.8 -13.45 -1.45 Q-14.05 -1.7 -14.85 -3.1 L-14.15 -0.05 Q-13.6 2.5 -13.7 4.25 -12.6 0.75 -12.8 -1.15 -12.55 0.25 -11.7 2.1 -10.85 3.95 -10.05 4.8 L-11.3 0.3 -12.85 -4.7 -13.05 -4.7 -13.3 -3.1 -13.45 -4.8 -13.25 -6.65 -13.05 -9.2 -11.0 -1.8 Q-9.8 2.15 -9.8 5.25 L-9.8 5.75 -9.95 7.1 Q-10.15 8.5 -10.4 8.75 L-10.4 8.95 -10.55 6.8 Q-10.85 4.15 -11.55 2.45 L-11.55 7.55 Q-11.65 9.5 -11.9 11.2 -12.2 13.05 -12.75 14.55 -14.2 18.65 -17.95 22.2 M12.85 -18.35 L12.8 -18.2 Q11.4 -19.3 6.4 -19.8 L5.5 -19.6 5.5 -19.4 7.7 -18.35 9.95 -17.35 Q8.35 -17.0 5.95 -17.75 3.55 -18.5 2.85 -19.55 1.45 -19.1 0.1 -17.9 L-1.9 -15.55 -0.95 -17.3 0.2 -18.85 Q-4.35 -15.05 -5.3 -13.25 -4.95 -14.85 -3.45 -17.05 -2.2 -18.85 -0.85 -19.9 L-0.95 -19.9 -1.25 -19.85 -1.9 -19.6 -3.15 -19.1 -1.3 -20.45 0.8 -21.4 1.7 -21.25 2.65 -22.0 3.3 -22.45 3.75 -22.75 3.8 -22.7 3.95 -22.75 4.0 -22.65 3.3 -22.15 3.1 -22.0 2.95 -21.85 2.85 -21.65 2.8 -21.6 2.7 -21.45 4.15 -21.95 6.6 -22.45 7.1 -22.45 4.05 -21.0 Q5.95 -21.2 8.75 -20.35 11.55 -19.5 12.85 -18.35 M2.45 -21.0 L2.45 -21.05 2.35 -20.95 2.25 -20.95 2.2 -21.05 1.95 -20.9 1.8 -20.9 0.65 -20.65 Q-0.15 -20.45 -0.15 -20.25 L-0.05 -20.2 0.2 -20.3 1.0 -20.35 1.25 -20.2 0.25 -19.6 -0.65 -18.75 -0.55 -18.65 -0.25 -18.85 -0.05 -19.15 0.85 -19.65 1.5 -19.9 Q1.7 -19.6 2.1 -19.6 L2.85 -19.6 3.05 -19.6 3.65 -19.7 Q4.5 -19.85 4.9 -20.2 L3.0 -20.7 2.95 -20.8 2.85 -20.85 3.7 -21.25 4.2 -21.65 4.15 -21.75 2.45 -21.0 M2.25 -21.25 L2.25 -21.3 2.1 -21.2 2.25 -21.25 M-2.7 3.4 L-2.7 3.5 -2.65 3.5 -2.7 3.4 M-13.05 5.3 L-12.9 7.9 -12.9 8.95 -12.9 9.05 -13.05 11.05 -12.9 9.05 -12.9 8.95 -12.9 7.9 -13.05 5.3" fill="#d7bbbb" fill-rule="evenodd" stroke="none"/>
    <path d="M0.05 -4.9 Q0.7 -3.2 1.8 -2.25 0.95 -2.6 0.2 -3.3 L-0.35 -3.85 -0.5 -4.1 -0.9 -4.95 0.0 -4.9 0.05 -4.9 M-2.2 6.15 L-3.55 5.25 Q-4.05 7.9 -5.05 10.3 L-6.1 12.5 Q-6.15 10.15 -6.35 8.05 L-6.75 5.1 -6.75 6.85 -6.75 7.3 -6.75 7.35 -6.85 8.45 -6.85 8.25 -6.85 8.5 -7.05 9.55 Q-7.5 11.85 -8.45 13.85 L-8.85 14.55 -10.15 16.5 Q-9.5 13.35 -9.3 10.15 L-9.2 8.15 -9.8 10.45 -10.2 11.6 -10.8 13.45 -10.8 13.3 -10.85 13.65 -10.85 13.7 -10.9 13.85 -11.05 14.35 Q-12.0 16.85 -14.7 19.5 L-14.75 19.55 -17.95 22.2 Q-14.2 18.65 -12.75 14.55 -12.2 13.05 -11.9 11.2 -11.65 9.5 -11.55 7.55 L-11.55 2.45 Q-10.85 4.15 -10.55 6.8 L-10.4 8.95 -10.4 8.75 Q-10.15 8.5 -9.95 7.1 L-9.8 5.75 -9.8 5.25 Q-9.8 2.15 -11.0 -1.8 L-13.05 -9.2 -13.25 -6.65 -13.45 -4.8 -13.3 -3.1 -13.3 -2.9 -13.35 -2.8 -13.9 -4.8 Q-14.5 -7.35 -14.5 -8.35 -14.5 -10.75 -14.1 -12.35 L-14.05 -12.7 -12.85 -15.45 Q-12.85 -14.4 -12.2 -13.65 L-12.35 -12.95 -12.65 -11.3 -12.45 -8.15 -12.25 -8.15 -11.95 -10.1 Q-11.8 -11.35 -11.3 -11.8 L-11.25 -12.05 -11.25 -11.85 -11.3 -11.8 Q-12.15 -8.05 -10.05 -3.45 L-9.9 -3.15 -8.7 1.25 Q-7.9 4.35 -8.3 6.55 L-7.7 3.35 -7.45 0.75 -7.5 0.05 -6.75 1.55 -6.45 2.0 -5.4 3.45 -5.05 3.85 -3.55 5.25 -5.05 3.85 -5.0 3.8 -4.95 3.8 -5.8 1.45 -4.5 3.25 -3.3 4.4 -2.25 5.15 -2.25 5.45 -2.2 6.15 M2.45 -21.0 L4.15 -21.75 4.2 -21.65 3.7 -21.25 2.85 -20.85 2.95 -20.8 3.0 -20.7 4.9 -20.2 Q4.5 -19.85 3.65 -19.7 L3.05 -19.6 2.85 -19.6 2.1 -19.6 Q1.7 -19.6 1.5 -19.9 L0.85 -19.65 -0.05 -19.15 -0.25 -18.85 -0.55 -18.65 -0.65 -18.75 0.25 -19.6 1.25 -20.2 1.0 -20.35 0.2 -20.3 -0.05 -20.2 -0.15 -20.25 Q-0.15 -20.45 0.65 -20.65 L1.8 -20.9 1.95 -20.9 2.2 -21.05 2.25 -20.95 2.35 -20.95 2.45 -21.05 2.45 -21.0 M-12.35 -17.9 Q-14.45 -16.3 -15.35 -13.9 -16.05 -12.1 -16.05 -9.8 -16.05 -8.8 -15.45 -6.1 -16.95 -8.8 -16.95 -11.6 -16.95 -13.3 -16.35 -14.9 L-15.1 -17.35 Q-13.1 -20.35 -10.2 -20.8 L-10.1 -20.6 -10.9 -19.95 -12.35 -17.9 M-1.95 3.35 L-2.15 1.7 -1.9 0.25 Q-1.65 -0.6 -1.0 -1.45 L-0.95 -1.45 -1.1 -0.35 -1.2 0.25 -1.35 0.85 -1.5 1.4 -1.7 2.3 -1.95 3.35 M-6.85 8.25 L-6.75 7.35 -6.85 8.25" fill="#c29c9c" fill-rule="evenodd" stroke="none"/>
    <path d="M-2.3 -21.2 Q1.9 -24.05 8.2 -23.1 L11.65 -22.45 11.9 -22.35 13.25 -21.8 14.1 -21.45 14.6 -21.15 15.55 -20.45 Q18.5 -18.0 20.35 -14.8 L20.6 -14.35 20.6 -14.2 20.95 -13.05 21.1 -12.45 21.4 -9.5 21.3 -9.15 21.2 -9.0 Q20.85 -10.55 19.55 -12.45 L19.45 -12.6 17.2 -15.55 17.1 -15.5 18.55 -12.45 18.6 -12.4 19.55 -9.4 17.65 -12.1 17.45 -12.35 Q16.3 -13.5 15.05 -13.9 L15.05 -13.65 16.85 -12.3 17.25 -11.95 Q18.45 -10.8 18.7 -9.65 L18.75 -9.6 18.75 -9.4 18.7 -9.65 Q17.3 -11.0 14.4 -12.0 L14.15 -12.1 9.25 -13.55 Q9.9 -12.95 11.2 -12.2 L12.3 -11.65 Q12.8 -11.35 13.45 -11.0 L12.6 -11.0 10.9 -11.35 Q9.9 -11.7 8.7 -12.4 6.85 -13.5 6.15 -14.6 5.85 -15.25 5.8 -16.0 L5.85 -15.7 6.05 -14.8 Q6.3 -13.8 7.05 -12.7 L7.45 -12.15 8.2 -11.2 8.55 -10.7 8.6 -10.6 8.9 -10.05 9.0 -9.5 9.2 -8.3 9.15 -8.2 Q8.75 -9.1 7.55 -10.4 L7.2 -10.8 Q5.95 -12.1 5.5 -13.65 L5.5 -14.4 5.45 -13.85 Q5.45 -13.25 5.6 -12.65 L5.8 -11.55 5.8 -11.05 5.65 -9.7 Q5.3 -8.35 4.35 -7.1 3.0 -5.35 1.5 -4.9 L1.45 -4.95 3.1 -6.7 3.1 -6.8 3.1 -6.75 Q2.65 -6.3 1.7 -5.7 0.55 -4.9 0.05 -4.9 L0.0 -4.9 -0.9 -4.95 -1.7 -5.15 -1.5 -3.6 Q-1.5 -2.55 -2.2 -0.7 L-2.65 0.55 -2.9 1.9 -2.8 2.55 -2.7 3.4 -3.35 1.2 -3.4 1.05 -4.05 -1.55 -4.2 0.0 -4.05 1.65 -3.95 2.4 -3.65 3.9 -4.45 2.4 Q-5.3 0.55 -5.7 -1.85 L-5.95 -5.8 -6.25 -2.8 -6.0 -0.7 -5.75 0.6 -5.8 0.55 Q-7.1 -2.5 -7.1 -5.7 L-7.3 -3.65 Q-7.3 -1.95 -6.85 -0.4 -8.2 -3.05 -8.6 -4.85 L-8.95 -7.9 -8.75 -10.4 -8.65 -11.15 -8.2 -12.7 Q-6.2 -18.6 -2.3 -21.2 M-2.65 -5.85 Q-2.3 -5.35 -1.7 -5.15 -2.3 -5.35 -2.65 -5.85 0.1 -7.35 1.2 -8.4 2.7 -9.85 3.3 -12.0 2.65 -11.05 1.45 -10.0 -1.2 -7.75 -3.05 -7.55 -1.45 -8.45 -0.7 -9.7 L0.0 -11.55 -0.2 -11.65 Q-0.35 -10.75 -2.2 -9.05 -3.8 -7.6 -5.3 -6.75 L-3.8 -6.6 -2.05 -6.95 -4.5 -4.9 -2.65 -5.85 M-0.1 -2.95 L0.15 -2.3 0.4 -0.45 0.65 0.7 0.7 1.85 Q0.7 3.4 0.3 5.25 -0.15 7.1 -0.15 8.9 L-0.1 11.55 Q0.05 12.8 0.55 13.85 L0.5 13.85 Q-1.8 9.2 -2.15 6.5 L-2.2 6.15 -2.25 5.45 -2.25 5.15 -2.0 3.65 -1.95 3.35 -1.7 2.3 -1.5 1.4 -1.35 0.85 -1.2 0.25 -1.1 -0.35 -0.95 -1.45 -1.0 -2.5 -1.05 -3.1 -0.1 -2.95 M12.85 -18.35 Q11.55 -19.5 8.75 -20.35 5.95 -21.2 4.05 -21.0 L7.1 -22.45 6.6 -22.45 4.15 -21.95 2.7 -21.45 2.8 -21.6 2.85 -21.65 2.95 -21.85 3.1 -22.0 3.3 -22.15 4.0 -22.65 3.95 -22.75 3.8 -22.7 3.75 -22.75 3.3 -22.45 2.65 -22.0 1.7 -21.25 0.8 -21.4 -1.3 -20.45 -3.15 -19.1 -1.9 -19.6 -1.25 -19.85 -0.95 -19.9 -0.85 -19.9 Q-2.2 -18.85 -3.45 -17.05 -4.95 -14.85 -5.3 -13.25 -4.35 -15.05 0.2 -18.85 L-0.95 -17.3 -1.9 -15.55 0.1 -17.9 Q1.45 -19.1 2.85 -19.55 3.55 -18.5 5.95 -17.75 8.35 -17.0 9.95 -17.35 L7.7 -18.35 5.5 -19.4 5.5 -19.6 6.4 -19.8 Q11.4 -19.3 12.8 -18.2 L12.85 -18.35 M2.25 -21.25 L2.1 -21.2 2.25 -21.3 2.25 -21.25 M5.5 -14.4 L5.45 -14.4 5.45 -13.85 5.45 -14.4 5.5 -14.4 M1.0 -11.65 L1.05 -11.65 1.0 -11.85 1.0 -11.65 M0.15 0.2 L0.1 0.15 -0.35 1.4 -0.85 2.5 Q-1.05 2.4 -1.05 1.6 L-1.0 1.1 -1.35 1.75 -1.65 4.45 -1.55 5.5 -0.75 3.25 -1.0 4.7 -1.05 6.05 -1.0 6.6 -1.05 6.95 -1.0 8.5 Q0.2 4.65 0.2 2.05 L0.15 0.2 M-2.7 3.4 L-2.65 3.5 -2.7 3.5 -2.7 3.4" fill="url(#gradient0)" fill-rule="evenodd" stroke="none"/>
    <path d="M-8.65 -11.15 L-8.75 -10.4 -8.95 -7.9 Q-9.1 -3.55 -7.6 -0.15 L-7.5 0.05 -7.45 0.75 -7.7 3.35 -8.3 6.55 Q-7.9 4.35 -8.7 1.25 L-9.9 -3.15 -10.05 -3.45 Q-12.15 -8.05 -11.3 -11.8 L-11.25 -11.85 -11.25 -12.05 -11.3 -11.8 Q-11.8 -11.35 -11.95 -10.1 L-12.25 -8.15 -12.45 -8.15 -12.65 -11.3 -12.35 -12.95 -12.2 -13.65 -11.5 -13.05 Q-10.6 -12.45 -9.85 -12.45 L-10.0 -12.0 -9.8 -11.65 -9.25 -11.2 -8.65 -11.15" fill="#b38484" fill-rule="evenodd" stroke="none"/>
    <path d="M0.15 0.2 L0.2 2.05 Q0.2 4.65 -1.0 8.5 L-1.05 6.95 -1.0 6.6 -1.05 6.05 -1.0 4.7 -0.75 3.25 -1.55 5.5 -1.65 4.45 -1.35 1.75 -1.0 1.1 -1.05 1.6 Q-1.05 2.4 -0.85 2.5 L-0.35 1.4 0.1 0.15 0.15 0.2" fill="#f2dfdf" fill-rule="evenodd" stroke="none"/>
    <path d="M13.25 -21.8 L11.9 -22.35 11.65 -22.45 8.2 -23.1 Q1.9 -24.05 -2.3 -21.2 -6.2 -18.6 -8.2 -12.7 L-8.65 -11.15 -8.75 -10.4 -8.95 -7.9 M-1.7 -5.15 Q-2.3 -5.35 -2.65 -5.85 M14.1 -21.45 L13.65 -21.7 13.25 -21.8 14.1 -21.45 14.6 -21.15 15.55 -20.45 Q18.5 -18.0 20.35 -14.8 L20.6 -14.35 21.5 -12.45 22.05 -10.2 22.25 -7.75 22.2 -6.8 22.05 -5.45 21.8 -4.4 Q21.2 -2.4 21.2 -1.2 21.2 1.0 21.85 2.3 20.6 0.7 20.5 -0.8 L20.7 -1.35 21.1 -3.05 21.5 -5.35 21.3 -7.1 20.7 -6.2 Q20.8 -8.15 20.4 -8.9 L20.25 -7.65 19.9 -6.5 19.8 -6.6 Q19.4 -8.3 17.5 -9.45 L14.3 -10.8 Q17.55 -8.7 18.2 -7.0 L18.3 -6.7 18.3 -6.8 18.2 -7.0 Q16.8 -8.9 11.25 -10.65 L10.0 -11.1 Q9.0 -11.55 8.3 -12.05 L7.8 -12.4 M7.45 -12.15 L8.2 -11.2 8.55 -10.7 8.6 -10.6 M8.9 -10.05 Q9.6 -8.5 9.9 -5.95 L9.9 -5.9 9.85 -5.95 9.8 -5.9 Q9.6 -7.15 7.35 -9.55 L6.85 -10.15 Q6.25 -10.9 5.95 -11.7 5.55 -12.65 5.5 -13.65 L5.5 -14.4 5.45 -13.85 Q5.45 -13.25 5.6 -12.65 L5.8 -11.55 5.8 -11.05 5.65 -9.7 Q5.3 -8.35 4.35 -7.1 3.0 -5.35 1.5 -4.9 L1.4 -4.9 1.45 -4.9 1.45 -4.95 3.1 -6.7 3.1 -6.8 3.1 -6.75 Q2.65 -6.3 1.7 -5.7 0.55 -4.9 0.05 -4.9 0.7 -3.2 1.8 -2.25 0.95 -2.6 0.2 -3.3 L-0.35 -3.85 -0.5 -4.1 -0.9 -4.95 -0.9 -4.8 -0.55 -4.05 -0.55 -4.0 -0.35 -3.65 -0.1 -2.95 0.15 -2.3 0.4 -0.45 0.65 0.7 0.7 1.85 Q0.7 3.4 0.3 5.25 -0.15 7.1 -0.15 8.9 L-0.1 11.55 Q0.05 12.8 0.55 13.85 L0.7 14.1 0.7 14.3 0.6 14.15 0.5 13.9 0.5 13.85 Q-1.8 9.2 -2.15 6.5 L-2.2 6.15 -3.55 5.25 Q-4.05 7.9 -5.05 10.3 L-6.1 12.5 -7.05 13.85 -7.95 14.9 -8.0 14.95 -8.0 14.85 -7.65 13.85 -7.3 12.45 Q-6.75 10.35 -6.75 9.9 L-6.85 8.45 -6.85 8.25 -6.85 8.5 -7.05 9.55 Q-7.5 11.85 -8.45 13.85 L-8.85 14.55 -10.15 16.5 -12.85 19.55 -12.95 19.65 -13.35 20.0 -13.8 20.5 -13.95 20.5 -13.35 20.0 -13.05 19.55 Q-12.45 18.6 -11.95 17.25 -11.25 15.5 -10.85 13.85 L-10.85 13.7 -10.9 13.85 -11.05 14.35 Q-12.0 16.85 -14.7 19.5 L-14.75 19.55 -17.95 22.2 -19.7 23.2 Q-17.7 21.5 -16.3 19.55 -14.9 17.55 -14.05 15.3 L-13.6 13.85 -13.05 11.05 -14.65 12.8 -15.65 13.6 -16.25 13.85 -16.6 13.95 -17.15 14.2 -17.25 14.2 -17.25 14.05 -17.15 14.05 -16.6 13.95 -16.4 13.85 -15.75 13.3 -14.75 12.0 -14.75 11.95 -14.85 11.95 Q-15.7 13.15 -17.15 13.5 L-18.45 13.65 -18.5 13.65 -19.8 13.35 -21.5 12.35 Q-19.8 13.1 -18.45 12.85 -17.9 12.75 -17.4 12.45 L-17.15 12.3 Q-15.85 11.5 -15.45 10.15 -14.8 8.25 -14.75 7.0 L-14.5 4.65 -14.45 4.1 -14.45 3.5 Q-15.2 7.5 -17.15 9.25 L-18.45 10.1 -18.7 10.2 -18.5 10.05 -18.45 10.0 -17.15 8.15 -16.35 6.0 Q-15.9 4.3 -15.9 2.9 -15.9 0.75 -17.15 -2.35 L-18.0 -4.3 -18.45 -5.25 -19.2 -7.15 -19.35 -7.7 Q-20.1 -9.85 -20.1 -11.35 -20.1 -14.05 -18.45 -16.35 L-17.15 -17.9 -17.1 -17.95 Q-15.1 -19.95 -12.7 -20.65 L-9.7 -21.1 -9.4 -21.1 -7.55 -21.6 Q-6.6 -21.6 -5.8 -21.0 L-5.2 -20.45 -5.15 -20.3 -5.2 -20.55 Q-5.2 -21.0 -4.65 -21.35 L-3.65 -21.6 -2.55 -21.4 -2.3 -21.2 M6.15 -14.6 Q6.6 -13.35 7.8 -12.4 M6.15 -14.6 Q5.85 -15.25 5.8 -16.0 L5.85 -15.7 M6.05 -14.8 Q6.3 -13.8 7.05 -12.7 L7.45 -12.15 M5.45 -13.85 L5.45 -14.4 5.5 -14.4 M0.05 -4.9 L0.0 -4.9 -0.9 -4.95 -1.7 -5.15 M22.1 -7.7 L22.2 -6.8 M21.3 -7.1 L21.9 -8.85 22.05 -10.2 M-10.1 -20.6 L-10.1 -20.65 -9.7 -20.9 -9.6 -20.95 M-9.4 -21.1 L-9.6 -20.95 M-12.6 -17.15 L-12.35 -17.75 -12.35 -17.9 -12.6 -17.15 -12.7 -16.65 M-12.85 -15.45 Q-12.85 -14.4 -12.2 -13.65 L-11.5 -13.05 Q-10.6 -12.45 -9.85 -12.45 L-10.0 -12.0 -9.8 -11.65 -9.25 -11.2 -8.65 -11.15 M-7.6 -0.15 Q-9.1 -3.55 -8.95 -7.9 M-15.45 -6.1 Q-16.05 -8.8 -16.05 -9.8 -16.05 -12.1 -15.35 -13.9 -14.45 -16.3 -12.35 -17.9 L-10.9 -19.95 -10.1 -20.6 M-0.95 -1.45 L-1.0 -2.5 M-0.95 -1.45 L-1.1 -0.35 -1.2 0.25 -1.35 0.85 -1.5 1.4 -1.7 2.3 -1.95 3.35 M-2.0 3.65 L-2.25 5.15 -2.25 5.45 -2.2 6.15 M-5.05 3.85 L-3.55 5.25 M-7.5 0.05 L-6.75 1.55 -6.45 2.0 M-5.4 3.45 L-5.05 3.85 M-6.75 7.35 L-6.85 8.25 M-6.75 7.3 L-6.75 6.85 M-13.05 11.05 L-12.9 9.05 -12.9 8.95 -12.9 7.9 -13.05 5.3 M-10.85 13.7 L-10.85 13.65 -10.8 13.3 -10.8 13.45" fill="none" stroke="#a36a6a" stroke-linecap="round" stroke-linejoin="round" stroke-opacity="0.4" stroke-width="0.05"/>
  </g>
  <defs>
    <radialGradient cx="0" cy="0" gradientTransform="matrix(0.0266, -0.0043, 0.0028, 0.0174, 8.35, -14.7)" gradientUnits="userSpaceOnUse" id="gradient0" r="819.2" spreadMethod="pad">
      <stop offset="0.0" stop-color="#ffffff"/>
      <stop offset="0.3137254901960784" stop-color="#f2eaea"/>
      <stop offset="0.6823529411764706" stop-color="#e0cbcb"/>
      <stop offset="0.7607843137254902" stop-color="#cca9a9"/>
      <stop offset="1.0" stop-color="#e0cbcb"/>
    </radialGradient>
  </defs>
</svg>
