<?xml version="1.0" encoding="UTF-8" standalone="no"?>
<svg xmlns:xlink="http://www.w3.org/1999/xlink" height="24.3px" width="12.8px" xmlns="http://www.w3.org/2000/svg">
  <g transform="matrix(1.0, 0.0, 0.0, 1.0, 6.8, 12.15)">
    <path d="M-5.05 11.15 L-5.1 11.05 -5.0 11.1 -5.05 11.15" fill="#000000" fill-rule="evenodd" stroke="none"/>
    <path d="M-0.25 -5.85 L-0.05 -5.6 1.5 -2.35 1.9 -0.85 3.35 6.1 -4.3 10.7 -4.55 9.1 Q-4.45 3.05 -2.95 -1.35 -1.9 -4.6 -0.5 -5.6 L-0.3 -5.75 -0.25 -5.85" fill="url(#gradient0)" fill-rule="evenodd" stroke="none"/>
    <path d="M-5.1 11.05 L-5.55 8.1 Q-5.45 2.05 -3.95 -2.35 -2.9 -5.6 -1.5 -6.6 L-1.3 -6.75 -0.25 -5.85 -0.3 -5.75 -0.5 -5.6 Q-1.9 -4.6 -2.95 -1.35 -4.45 3.05 -4.55 9.1 L-4.3 10.7 -4.95 11.05 -5.1 11.05" fill="#b3aba4" fill-rule="evenodd" stroke="none"/>
    <path d="M3.35 6.1 L1.9 -0.85 1.5 -2.35 -0.05 -5.6 -0.25 -5.85 -1.3 -6.75 -1.5 -6.6 Q-2.9 -5.6 -3.95 -2.35 -5.45 2.05 -5.55 8.1 L-5.1 11.05 -5.05 11.15 -6.8 12.15 -6.8 12.0 Q-6.8 1.8 -4.3 -5.5 -2.65 -10.4 -0.55 -12.0 L-0.2 -12.15 Q2.15 -10.85 4.0 -5.5 L5.0 -1.65 6.0 4.5 3.35 6.1" fill="url(#gradient1)" fill-rule="evenodd" stroke="none"/>
    <path d="M1.55 2.65 L1.95 4.1 2.4 6.1 Q-0.45 7.05 -2.75 9.3 L-3.55 10.15 Q-3.25 5.9 -2.1 2.7 L-2.1 2.65 Q-1.35 0.2 -0.3 -0.8 0.7 0.2 1.55 2.7 L1.55 2.65" fill="#262626" fill-rule="evenodd" stroke="none"/>
  </g>
  <defs>
    <linearGradient gradientTransform="matrix(0.002, 0.0043, -0.0065, 0.003, -2.85, 1.95)" gradientUnits="userSpaceOnUse" id="gradient0" spreadMethod="pad" x1="-819.2" x2="819.2">
      <stop offset="0.0" stop-color="#e6e6e6"/>
      <stop offset="1.0" stop-color="#b3aba4"/>
    </linearGradient>
    <linearGradient gradientTransform="matrix(0.0, 0.0129, -0.0078, 0.0, -0.4, -1.3)" gradientUnits="userSpaceOnUse" id="gradient1" spreadMethod="pad" x1="-819.2" x2="819.2">
      <stop offset="0.0" stop-color="#666666"/>
      <stop offset="1.0" stop-color="#0d0d0d"/>
    </linearGradient>
  </defs>
</svg>
