<?xml version="1.0" encoding="UTF-8" standalone="no"?>
<svg xmlns:xlink="http://www.w3.org/1999/xlink" height="54.05px" width="41.55px" xmlns="http://www.w3.org/2000/svg">
  <g transform="matrix(1.0, 0.0, 0.0, 1.0, 19.9, 26.95)">
    <path d="M9.45 -15.4 L9.95 -15.35 10.6 -15.25 11.0 -15.2 11.35 -15.2 10.3 -14.85 10.15 -14.8 10.15 -14.75 9.95 -14.4 10.0 -14.2 Q12.9 -13.65 12.9 -12.65 L12.45 -11.45 Q11.9 -10.6 11.8 -10.0 L11.7 -9.45 11.3 -7.0 11.7 -6.15 12.15 -5.05 9.15 1.5 9.6 1.5 9.3 2.8 8.05 3.3 8.3 2.65 7.3 2.7 7.3 2.1 7.8 0.1 7.45 -1.15 Q7.1 -1.9 7.1 -2.45 7.1 -4.7 9.1 -8.4 L9.8 -9.75 11.05 -12.15 Q11.05 -13.0 8.4 -14.35 8.3 -14.7 9.15 -15.25 L9.45 -15.4 M16.95 8.45 L19.0 9.8 17.5 9.75 15.3 9.95 14.9 10.05 14.4 10.15 Q13.3 10.15 10.9 9.1 8.5 8.05 7.95 8.05 L7.95 7.8 9.05 7.0 9.1 6.95 12.2 8.9 14.7 8.65 15.35 8.55 16.95 8.45 M-15.1 21.3 L-15.05 21.1 -14.1 14.85 Q-13.8 18.75 -13.1 19.9 -12.0 21.65 -8.25 21.65 L-6.0 21.3 -4.85 21.1 -5.1 19.5 -5.15 17.25 -4.9 13.0 Q-4.9 11.8 -6.15 11.15 -7.1 10.65 -8.5 10.65 L-11.25 11.0 -11.75 11.0 -11.75 10.4 Q-11.65 9.05 -10.6 8.55 L-8.5 8.05 Q-8.75 7.6 -9.95 6.95 -9.9 5.1 -7.65 -2.9 -5.5 -10.35 -5.5 -14.35 L-5.55 -15.0 -3.05 -16.55 -2.95 -16.6 -2.15 -17.25 -1.1 -18.35 -0.85 -18.75 -0.7 -19.05 -0.85 -19.15 -1.7 -19.15 -2.25 -19.05 -0.85 -19.65 0.4 -20.25 1.75 -20.4 1.75 -19.65 0.9 -14.35 -0.1 -11.45 -1.1 -8.15 -2.5 -0.85 Q-2.95 2.25 -2.7 4.7 L-4.8 3.45 -3.3 6.2 Q-2.3 8.1 -2.35 8.9 L-3.45 9.15 -4.7 9.3 -5.35 9.1 -6.15 8.9 -7.4 9.05 -7.75 9.05 -5.35 10.2 -2.6 11.0 Q-1.35 13.15 -0.6 14.95 0.1 16.65 0.5 19.15 L0.55 19.45 Q-1.8 21.95 -4.05 23.15 -5.7 24.05 -7.9 24.55 L-9.6 24.6 -10.6 24.6 Q-12.3 24.6 -13.45 23.95 -14.9 23.1 -15.1 21.3 M-10.0 -26.95 L-10.0 -26.9 -10.0 -26.95 M-5.1 -18.05 L-5.05 -18.05 -5.1 -18.05" fill="#d2b6b6" fill-rule="evenodd" stroke="none"/>
    <path d="M3.45 -17.15 L4.45 -16.65 4.75 -16.5 Q5.75 -16.0 6.8 -15.85 L7.3 -15.75 6.85 -15.6 6.2 -15.35 6.2 -15.0 Q8.3 -14.2 8.3 -13.5 L7.45 -10.45 7.35 -10.1 5.75 -6.1 Q4.55 -3.05 3.9 0.35 L2.8 3.6 Q2.8 3.95 3.1 3.9 L3.8 3.9 3.15 4.85 Q3.5 4.8 4.95 3.95 5.65 3.55 6.15 3.3 L6.8 3.1 7.3 3.1 Q6.95 3.75 5.6 4.6 L5.6 4.7 7.25 4.85 9.15 4.85 Q8.2 5.75 5.2 7.65 L5.1 7.55 5.1 7.75 4.95 9.6 Q7.45 10.0 10.55 11.65 L11.65 12.25 12.75 12.9 8.2 13.05 5.2 13.05 Q4.8 13.0 4.3 11.85 3.85 10.7 3.35 10.6 L4.05 9.55 4.45 7.75 Q4.55 6.45 4.1 5.75 3.5 4.9 2.4 4.9 1.85 4.9 1.4 5.45 L0.75 6.25 0.75 6.55 0.25 9.6 0.35 9.9 -0.25 10.05 -0.45 9.25 -0.7 8.15 0.05 2.65 Q0.3 0.7 0.5 0.25 L0.7 -1.35 Q0.65 -2.5 0.9 -5.1 L1.0 -5.7 Q1.3 -8.2 2.95 -14.9 L3.3 -16.7 3.45 -17.15 M14.35 -20.7 L14.6 -20.55 14.75 -20.5 Q17.9 -19.05 17.9 -17.6 17.9 -16.35 15.45 -15.7 L14.0 -15.4 13.45 -15.3 13.35 -15.3 12.9 -15.25 14.35 -20.7 M-13.7 -23.6 L-12.05 -17.35 -12.8 -17.35 -16.9 -17.7 -17.2 -17.8 Q-18.55 -18.65 -18.45 -19.4 -18.35 -20.7 -14.95 -22.75 L-13.7 -23.6" fill="#b38484" fill-rule="evenodd" stroke="none"/>
    <path d="M2.75 -23.6 L3.25 -25.2 3.45 -24.8 4.05 -24.25 4.75 -23.35 4.75 -23.05 4.65 -22.35 3.45 -17.15 3.3 -16.7 2.95 -14.9 Q1.3 -8.2 1.0 -5.7 L0.9 -5.1 Q0.65 -2.5 0.7 -1.35 L0.5 0.25 Q0.3 0.7 0.05 2.65 L-0.7 8.15 -0.45 9.25 -0.25 10.05 0.15 12.35 -0.05 13.1 -0.15 13.35 -1.1 10.8 -0.15 13.35 0.35 14.65 2.15 19.8 2.1 20.3 Q1.85 21.95 0.35 22.85 -0.5 23.3 -2.95 24.0 L-7.9 24.55 Q-5.7 24.05 -4.05 23.15 -1.8 21.95 0.55 19.45 L0.5 19.15 Q0.1 16.65 -0.6 14.95 -1.35 13.15 -2.6 11.0 L-5.35 10.2 -7.75 9.05 -7.4 9.05 -6.15 8.9 -5.35 9.1 -4.7 9.3 -3.45 9.15 -2.35 8.9 Q-2.3 8.1 -3.3 6.2 L-4.8 3.45 -2.7 4.7 Q-2.95 2.25 -2.5 -0.85 L-1.1 -8.15 -0.1 -11.45 0.9 -14.35 1.75 -19.65 1.75 -20.4 0.4 -20.25 Q1.85 -21.1 2.55 -22.25 L2.65 -22.95 2.75 -23.6 M7.3 -15.75 L7.65 -15.7 8.1 -15.65 9.0 -15.5 9.45 -15.4 9.15 -15.25 Q8.3 -14.7 8.4 -14.35 11.05 -13.0 11.05 -12.15 L9.8 -9.75 9.1 -8.4 Q7.1 -4.7 7.1 -2.45 7.1 -1.9 7.45 -1.15 L7.8 0.1 7.3 2.1 7.3 2.7 8.3 2.65 8.05 3.3 9.3 2.8 9.6 1.5 9.85 1.85 10.2 2.1 10.55 2.35 10.6 2.4 10.2 2.85 10.15 3.05 11.25 3.3 11.15 5.2 11.1 5.55 11.05 5.6 11.0 5.6 Q10.55 5.8 10.0 6.25 L9.8 6.45 9.1 6.95 9.05 7.0 7.95 7.8 7.95 8.05 Q8.5 8.05 10.9 9.1 13.3 10.15 14.4 10.15 L14.9 10.05 15.3 9.95 17.5 9.75 19.0 9.8 20.3 11.1 Q20.85 11.85 20.6 12.5 L16.3 12.75 12.75 12.9 11.65 12.25 10.55 11.65 Q7.45 10.0 4.95 9.6 L5.1 7.75 5.1 7.55 5.2 7.65 Q8.2 5.75 9.15 4.85 L7.25 4.85 5.6 4.7 5.6 4.6 Q6.95 3.75 7.3 3.1 L6.8 3.1 6.15 3.3 Q5.65 3.55 4.95 3.95 3.5 4.8 3.15 4.85 L3.8 3.9 3.1 3.9 Q2.8 3.95 2.8 3.6 L3.9 0.35 Q4.55 -3.05 5.75 -6.1 L7.35 -10.1 7.45 -10.45 8.3 -13.5 Q8.3 -14.2 6.2 -15.0 L6.2 -15.35 6.85 -15.6 7.3 -15.75 M9.6 1.45 L9.6 1.5 9.6 1.45 M10.0 5.15 L11.0 5.6 10.0 5.15 M-1.1 6.0 L-0.9 7.2 -0.7 8.15 -0.9 7.2 -1.1 6.0" fill="#c29c9c" fill-rule="evenodd" stroke="none"/>
    <path d="M10.45 -17.75 L10.4 -17.75 10.4 -17.8 10.45 -17.75" fill="#29172d" fill-rule="evenodd" stroke="none"/>
    <path d="M2.65 -22.95 L2.6 -23.05 2.75 -23.6 2.65 -22.95" fill="#49294d" fill-rule="evenodd" stroke="none"/>
    <path d="M9.95 -15.35 L10.05 -15.75 10.4 -17.8 11.15 -21.55 Q12.25 -21.6 14.35 -20.7 L12.9 -15.25 12.85 -15.25 12.15 -15.2 11.4 -15.2 11.35 -15.2 11.0 -15.2 10.6 -15.25 9.95 -15.35 M20.6 12.5 L20.9 12.5 21.65 12.35 20.9 14.35 20.3 15.25 3.7 15.1 0.35 14.65 -0.15 13.35 -0.05 13.1 0.15 12.35 -0.25 10.05 0.35 9.9 0.45 9.85 0.6 10.1 0.9 10.5 Q1.45 11.05 1.95 11.05 L3.35 10.6 Q3.85 10.7 4.3 11.85 4.8 13.0 5.2 13.05 L8.2 13.05 12.75 12.9 16.3 12.75 20.6 12.5 M2.1 20.3 L1.75 23.75 Q-7.35 29.75 -15.45 25.05 L-15.1 21.3 Q-14.9 23.1 -13.45 23.95 -12.3 24.6 -10.6 24.6 L-9.6 24.6 -7.9 24.55 -2.95 24.0 Q-0.5 23.3 0.35 22.85 1.85 21.95 2.1 20.3 M10.4 -17.75 L10.45 -17.75 10.4 -17.8 10.4 -17.75 M-9.9 -26.3 L-8.85 -17.55 -10.3 -17.45 -10.8 -17.45 -12.05 -17.35 -13.7 -23.6 -13.6 -23.65 -10.3 -26.05 -9.95 -26.3 -9.9 -26.3" fill="#a36a6a" fill-rule="evenodd" stroke="none"/>
    <path d="M-15.05 21.1 Q-15.6 20.8 -15.85 20.8 L-15.6 16.1 Q-15.5 15.15 -14.75 14.3 L-14.05 14.3 -14.1 14.85 -15.05 21.1 M0.25 9.6 L0.75 6.55 0.75 6.25 1.4 5.45 Q1.85 4.9 2.4 4.9 3.5 4.9 4.1 5.75 4.55 6.45 4.45 7.75 L4.05 9.55 3.35 10.6 1.95 11.05 Q1.45 11.05 0.9 10.5 L0.6 10.1 0.45 9.85 0.25 9.6" fill="#000000" fill-rule="evenodd" stroke="none"/>
    <path d="M0.35 9.9 L0.25 9.6 0.45 9.85 0.35 9.9" fill="#39203d" fill-rule="evenodd" stroke="none"/>
    <path d="M13.6 6.75 L14.3 7.05 Q15.8 7.8 16.95 8.45 L15.35 8.55 14.7 8.65 12.2 8.9 9.1 6.95 9.8 6.45 11.4 7.3 12.2 7.0 13.6 6.75 M-14.05 14.3 L-14.0 13.9 -14.0 13.8 -14.15 11.85 -14.1 11.7 -13.7 10.95 -13.9 10.7 -14.35 10.3 -14.15 10.1 -13.65 9.35 -14.2 9.2 -14.2 9.15 -15.55 8.1 -13.95 6.6 -14.75 6.4 -14.75 6.35 -14.75 6.3 -14.75 6.05 -14.8 5.9 -14.8 5.65 Q-14.25 4.2 -14.25 3.65 L-16.15 -4.6 -14.95 -4.85 -14.95 -5.0 Q-15.35 -5.25 -15.35 -6.15 L-15.3 -6.45 -15.1 -7.15 Q-14.95 -8.0 -14.1 -8.95 -12.85 -10.35 -12.85 -10.65 -12.85 -11.8 -14.25 -12.6 -15.65 -13.45 -15.65 -13.75 -15.65 -14.35 -13.85 -15.2 L-12.8 -15.65 -12.45 -15.6 -11.3 -15.55 -10.55 -15.55 -8.9 -15.75 -6.65 -16.05 -6.1 -16.1 -5.75 -16.15 -4.8 -17.9 -5.05 -18.05 -2.65 -18.9 -2.25 -19.05 -1.7 -19.15 -0.85 -19.15 -0.7 -19.05 -0.85 -18.75 -1.1 -18.35 -2.15 -17.25 -2.95 -16.6 -3.05 -16.55 -5.55 -15.0 -5.5 -14.35 Q-5.5 -10.35 -7.65 -2.9 -9.9 5.1 -9.95 6.95 -8.75 7.6 -8.5 8.05 L-10.6 8.55 Q-11.65 9.05 -11.75 10.4 L-11.75 11.0 -11.25 11.0 -8.5 10.65 Q-7.1 10.65 -6.15 11.15 -4.9 11.8 -4.9 13.0 L-5.15 17.25 -5.1 19.5 -4.85 21.1 -6.0 21.3 -8.25 21.65 Q-12.0 21.65 -13.1 19.9 -13.8 18.75 -14.1 14.85 L-14.05 14.3 M12.9 -15.25 L13.35 -15.3 13.35 -15.2 12.65 -14.7 13.3 -14.5 15.1 -14.7 15.95 -14.4 16.05 -14.1 15.0 -13.15 Q13.9 -12.4 13.9 -11.6 13.9 -11.3 14.35 -11.05 14.75 -10.85 14.75 -10.45 L14.15 -9.1 12.15 -5.05 11.7 -6.15 11.3 -7.0 11.7 -9.45 11.8 -10.0 Q11.9 -10.6 12.45 -11.45 L12.9 -12.65 Q12.9 -13.65 10.0 -14.2 L9.95 -14.4 10.15 -14.75 10.15 -14.8 10.3 -14.85 11.35 -15.2 11.4 -15.2 12.15 -15.2 12.85 -15.25 12.9 -15.25" fill="#e0cdcd" fill-rule="evenodd" stroke="none"/>
    <path d="M11.15 -21.55 L11.3 -22.4 11.35 -22.4 Q13.0 -22.0 14.5 -21.25 16.8 -20.1 18.65 -18.2 L19.4 -17.3 Q19.15 -15.4 16.05 -10.15 L15.35 -8.95 15.3 -8.9 12.7 -4.5 12.35 -3.85 9.6 1.45 9.6 1.5 9.15 1.5 12.15 -5.05 14.15 -9.1 14.75 -10.45 Q14.75 -10.85 14.35 -11.05 13.9 -11.3 13.9 -11.6 13.9 -12.4 15.0 -13.15 L16.05 -14.1 15.95 -14.4 15.1 -14.7 13.3 -14.5 12.65 -14.7 13.35 -15.2 13.35 -15.3 13.45 -15.3 14.0 -15.4 15.45 -15.7 Q17.9 -16.35 17.9 -17.6 17.9 -19.05 14.75 -20.5 L14.6 -20.55 14.35 -20.7 Q12.25 -21.6 11.15 -21.55 M11.05 5.6 L13.6 6.75 12.2 7.0 11.4 7.3 9.8 6.45 10.0 6.25 Q10.55 5.8 11.0 5.6 L11.05 5.6 M-14.35 10.3 L-14.6 10.0 -14.2 9.2 -13.65 9.35 -14.15 10.1 -14.35 10.3 M-15.55 8.1 L-15.25 7.5 -14.95 6.85 -14.85 6.65 -14.75 6.4 -13.95 6.6 -15.55 8.1 M-16.75 -5.0 L-17.2 -7.1 -19.9 -18.45 Q-19.35 -20.85 -17.25 -22.65 L-15.75 -23.65 -10.9 -26.5 -10.0 -26.95 -10.0 -26.9 -9.9 -26.3 -9.95 -26.3 -10.3 -26.05 -13.6 -23.65 -13.7 -23.6 -14.95 -22.75 Q-18.35 -20.7 -18.45 -19.4 -18.55 -18.65 -17.2 -17.8 L-16.9 -17.7 -12.8 -17.35 -12.05 -17.35 -10.8 -17.45 -10.3 -17.45 -8.85 -17.55 -5.7 -17.9 -5.6 -17.9 -5.1 -18.05 -5.05 -18.05 -4.8 -17.9 -5.75 -16.15 -6.1 -16.1 -6.65 -16.05 -8.9 -15.75 -10.55 -15.55 -11.3 -15.55 -12.45 -15.6 -12.8 -15.65 -13.85 -15.2 Q-15.65 -14.35 -15.65 -13.75 -15.65 -13.45 -14.25 -12.6 -12.85 -11.8 -12.85 -10.65 -12.85 -10.35 -14.1 -8.95 -14.95 -8.0 -15.1 -7.15 L-15.3 -6.45 -15.35 -6.15 Q-15.35 -5.25 -14.95 -5.0 L-14.95 -4.85 -16.15 -4.6 -14.25 3.65 Q-14.25 4.2 -14.8 5.65 -15.35 1.85 -16.25 -2.65 L-16.75 -5.0" fill="#f2eaea" fill-rule="evenodd" stroke="none"/>
    <path d="M2.75 -23.6 L3.25 -25.2 3.45 -24.8 4.05 -24.25 4.75 -23.35 4.75 -23.05 4.65 -22.35 3.45 -17.15 4.45 -16.65 4.75 -16.5 Q5.75 -16.0 6.8 -15.85 L7.3 -15.75 M7.65 -15.7 L8.1 -15.65 9.0 -15.5 9.45 -15.4 9.95 -15.35 10.05 -15.75 10.4 -17.8 11.15 -21.55 11.3 -22.4 11.35 -22.4 Q13.0 -22.0 14.5 -21.25 16.8 -20.1 18.65 -18.2 L19.4 -17.3 Q19.15 -15.4 16.05 -10.15 L15.35 -8.95 15.3 -8.9 12.7 -4.5 12.35 -3.85 9.6 1.45 9.6 1.5 9.85 1.85 10.2 2.1 10.55 2.35 10.6 2.4 10.2 2.85 10.15 3.05 11.25 3.3 11.15 5.2 M11.1 5.55 L11.05 5.6 13.6 6.75 14.3 7.05 Q15.8 7.8 16.95 8.45 L19.0 9.8 20.3 11.1 Q20.85 11.85 20.6 12.5 L20.9 12.5 21.65 12.35 20.9 14.35 20.3 15.25 3.7 15.1 0.35 14.65 2.15 19.8 2.1 20.3 1.75 23.75 Q-7.35 29.75 -15.45 25.05 L-15.1 21.3 -15.05 21.1 Q-15.6 20.8 -15.85 20.8 L-15.6 16.1 Q-15.5 15.15 -14.75 14.3 L-14.05 14.3 -14.0 13.9 -14.0 13.8 -14.15 11.85 -14.1 11.7 -13.7 10.95 -13.9 10.7 -14.35 10.3 -14.6 10.0 -14.2 9.2 -14.2 9.15 -15.55 8.1 -15.25 7.5 -14.95 6.85 -14.85 6.65 -14.75 6.4 -14.75 6.35 -14.75 6.3 -14.8 5.9 -14.85 5.7 -15.25 4.2 -16.05 1.35 -16.15 0.7 -17.2 -3.45 M14.35 -20.7 Q12.25 -21.6 11.15 -21.55 M14.0 -15.4 L15.45 -15.7 Q17.9 -16.35 17.9 -17.6 17.9 -19.05 14.75 -20.5 L14.6 -20.55 14.35 -20.7 M12.9 -15.25 L13.35 -15.3 13.45 -15.3 M10.45 -17.75 L10.4 -17.75 M11.0 -15.2 L11.35 -15.2 11.4 -15.2 12.15 -15.2 12.85 -15.25 M2.65 -22.95 L2.6 -23.05 2.75 -23.6 2.65 -22.95 2.55 -22.25 Q1.85 -21.1 0.4 -20.25 M-7.9 24.55 L-2.95 24.0 Q-0.5 23.3 0.35 22.85 1.85 21.95 2.1 20.3 M3.45 -17.15 L3.3 -16.7 2.95 -14.9 Q1.3 -8.2 1.0 -5.7 L0.9 -5.1 Q0.65 -2.5 0.7 -1.35 L0.5 0.25 Q0.3 0.7 0.05 2.65 L-0.7 8.15 -0.45 9.25 -0.25 10.05 0.35 9.9 M0.25 9.6 L0.75 6.55 0.75 6.25 1.4 5.45 Q1.85 4.9 2.4 4.9 3.5 4.9 4.1 5.75 4.55 6.45 4.45 7.75 L4.05 9.55 3.35 10.6 Q3.85 10.7 4.3 11.85 4.8 13.0 5.2 13.05 L8.2 13.05 12.75 12.9 M9.3 2.8 L9.6 1.5 M9.95 -15.35 L10.6 -15.25 M11.05 5.6 L11.0 5.6 10.0 5.15 M9.6 1.45 L9.6 1.5 M3.35 10.6 L1.95 11.05 Q1.45 11.05 0.9 10.5 L0.6 10.1 0.45 9.85 0.35 9.9 M0.45 9.85 L0.25 9.6 M20.6 12.5 L16.3 12.75 12.75 12.9 M-16.75 -5.0 L-17.2 -7.1 -19.9 -18.45 Q-19.35 -20.85 -17.25 -22.65 L-15.75 -23.65 -10.9 -26.5 -10.0 -26.95 M-8.85 -17.55 L-5.7 -17.9 -5.6 -17.9 M-5.1 -18.05 L-5.05 -18.05 -2.65 -18.9 M-2.25 -19.05 L-0.85 -19.65 0.4 -20.25 M-9.95 -26.3 L-10.3 -26.05 -13.6 -23.65 M-12.05 -17.35 L-10.8 -17.45 -10.3 -17.45 -8.85 -17.55 M-14.8 5.65 L-14.8 5.9 -14.75 6.05 -14.75 6.3 M-13.7 -23.6 L-14.95 -22.75 Q-18.35 -20.7 -18.45 -19.4 -18.55 -18.65 -17.2 -17.8 L-16.9 -17.7 -12.8 -17.35 -12.05 -17.35 M-0.7 8.15 L-0.9 7.2 -1.1 6.0 M-14.1 14.85 L-14.05 14.3 M-9.6 24.6 L-10.6 24.6 Q-12.3 24.6 -13.45 23.95 -14.9 23.1 -15.1 21.3 M-15.05 21.1 L-14.1 14.85 M-0.15 13.35 L-0.05 13.1 0.15 12.35 -0.25 10.05 M-1.1 10.8 L-0.15 13.35 0.35 14.65 M-14.8 5.65 Q-15.35 1.85 -16.25 -2.65" fill="none" stroke="#a36a6a" stroke-linecap="round" stroke-linejoin="round" stroke-opacity="0.4" stroke-width="0.05"/>
  </g>
</svg>
