<?xml version="1.0" encoding="UTF-8" standalone="no"?>
<svg xmlns:xlink="http://www.w3.org/1999/xlink" height="4.65px" width="13.9px" xmlns="http://www.w3.org/2000/svg">
  <g transform="matrix(1.0, 0.0, 0.0, 1.0, 6.85, 2.35)">
    <path d="M1.55 -0.45 L1.65 -0.15 1.95 -0.15 2.7 -0.25 2.85 -0.6 2.9 -0.6 3.1 -0.65 3.65 -0.75 3.6 -0.45 3.05 -0.3 -1.95 0.6 -2.15 0.6 -3.05 0.45 -3.1 0.45 -3.7 0.35 -3.75 0.3 -3.4 -0.15 -3.25 -0.15 -3.1 -0.15 -3.0 -0.15 -3.2 0.1 -3.0 0.25 -2.3 0.25 -2.15 0.3 -2.1 0.5 -1.85 0.5 -1.7 0.3 -0.85 0.2 -0.85 0.3 -0.65 0.35 -0.45 0.15 -0.25 0.15 -0.05 0.05 0.35 -0.35 0.45 -0.35 1.55 -0.45" fill="#d2b6b6" fill-rule="evenodd" stroke="none"/>
    <path d="M-3.1 0.45 L-3.05 0.45 -2.15 0.6 -1.95 0.6 3.05 -0.3 3.6 -0.45 3.65 -0.75 3.75 -0.75 4.05 -0.75 4.25 -0.8 4.35 -0.3 Q4.35 -0.1 3.55 0.25 L3.45 0.3 3.45 0.15 3.25 -0.15 Q-0.45 0.55 -0.45 1.0 L-0.4 1.1 0.15 1.25 -1.95 1.2 -2.0 1.2 -2.7 1.0 -3.2 0.95 -3.1 0.5 -3.1 0.45" fill="#c29c9c" fill-rule="evenodd" stroke="none"/>
    <path d="M4.5 -1.6 L4.45 -1.65 7.05 -1.15 4.85 -0.25 Q4.8 0.5 3.95 0.75 L2.4 1.15 0.95 1.95 -0.8 2.3 -1.9 2.0 -2.85 1.45 -3.25 1.35 -5.2 0.8 Q-5.15 0.4 -4.8 0.25 L-5.4 0.1 -6.85 -0.2 -6.2 -0.6 -6.1 -0.55 -5.4 -0.25 -4.35 -0.2 -3.85 -0.2 -4.2 0.05 -4.4 0.35 Q-4.4 0.65 -3.2 0.95 L-2.7 1.0 -2.0 1.2 -1.95 1.2 0.15 1.25 2.8 0.55 3.3 0.4 3.45 0.3 3.55 0.25 Q4.35 -0.1 4.35 -0.3 L4.25 -0.8 5.4 -1.05 Q4.7 -1.45 4.5 -1.6" fill="#b38484" fill-opacity="0.29803923" fill-rule="evenodd" stroke="none"/>
    <path d="M2.85 -0.6 L2.7 -0.25 1.95 -0.15 1.65 -0.15 1.55 -0.45 2.85 -0.6 M-0.45 0.15 L-0.65 0.35 -0.85 0.3 -0.85 0.2 -0.85 0.1 -0.55 -0.15 -0.45 0.05 -0.45 0.15 M-1.7 0.3 L-1.85 0.5 -2.1 0.5 -2.15 0.3 -2.15 0.2 Q-2.55 0.1 -2.55 0.0 L-2.5 -0.15 -2.0 -0.1 -1.15 -0.2 -1.65 0.25 -1.7 0.3 M4.05 -0.75 L3.3 -2.35 4.45 -1.6 4.5 -1.6 Q4.7 -1.45 5.4 -1.05 L4.25 -0.8 4.05 -0.75 M-6.1 -0.55 L-5.05 -1.5 -5.0 -1.5 -4.1 -0.6 -4.35 -0.2 -5.4 -0.25 -6.1 -0.55" fill="#f2eaea" fill-rule="evenodd" stroke="none"/>
    <path d="M-3.0 -0.15 L-3.1 -0.15 -3.25 -0.15 -2.75 -0.75 Q-3.05 -0.8 -4.45 -1.95 L-4.05 -2.35 -2.0 -1.2 -0.6 -0.25 -1.15 -0.2 -2.0 -0.1 -2.5 -0.15 -2.6 -0.15 -2.95 -0.15 -3.0 -0.15" fill="#f2eaea" fill-opacity="0.29803923" fill-rule="evenodd" stroke="none"/>
    <path d="M-3.25 -0.15 L-3.4 -0.15 -3.55 -0.15 -3.85 -0.2 -4.35 -0.2 -4.1 -0.6 -5.0 -1.5 -4.45 -1.95 Q-3.05 -0.8 -2.75 -0.75 L-3.25 -0.15" fill="#f2eaea" fill-opacity="0.6" fill-rule="evenodd" stroke="none"/>
    <path d="M0.35 -0.35 L-0.05 0.05 -0.25 0.15 -0.45 0.15 -0.45 0.05 -0.55 -0.15 -0.85 0.1 -0.85 0.2 -1.7 0.3 -1.65 0.25 -1.15 -0.2 -0.6 -0.25 0.35 -0.35 M-2.15 0.3 L-2.3 0.25 -3.0 0.25 -3.2 0.1 -3.0 -0.15 -2.95 -0.15 -2.6 -0.15 -2.5 -0.15 -2.55 0.0 Q-2.55 0.1 -2.15 0.2 L-2.15 0.3" fill="#e0cdcd" fill-rule="evenodd" stroke="none"/>
    <path d="M-3.4 -0.15 L-3.75 0.3 -3.7 0.35 -3.1 0.45 -3.1 0.5 -3.2 0.95 Q-4.4 0.65 -4.4 0.35 L-4.2 0.05 -3.85 -0.2 -3.55 -0.15 -3.4 -0.15 M3.3 0.4 L2.8 0.55 0.15 1.25 -0.4 1.1 -0.45 1.0 Q-0.45 0.55 3.25 -0.15 L3.45 0.15 3.45 0.3 3.3 0.4" fill="#b38484" fill-rule="evenodd" stroke="none"/>
    <path d="M2.85 -0.6 L1.55 -0.45 0.45 -0.35 M-3.0 -0.15 L-3.1 -0.15 -3.25 -0.15 -3.4 -0.15 M3.65 -0.75 L3.1 -0.65 2.9 -0.6 M4.5 -1.6 L4.45 -1.65 7.05 -1.15 M-6.2 -0.6 L-6.1 -0.55 M-0.6 -0.25 L0.35 -0.35 M3.75 -0.75 L4.05 -0.75 4.25 -0.8 5.4 -1.05 Q4.7 -1.45 4.5 -1.6 M3.45 0.3 L3.55 0.25 Q4.35 -0.1 4.35 -0.3 L4.25 -0.8 M0.15 1.25 L2.8 0.55 3.3 0.4 M0.15 1.25 L-1.95 1.2 -2.0 1.2 -2.7 1.0 -3.2 0.95 Q-4.4 0.65 -4.4 0.35 L-4.2 0.05 -3.85 -0.2 -4.35 -0.2 -5.4 -0.25 -6.1 -0.55 M-3.0 -0.15 L-2.95 -0.15 -2.6 -0.15 -2.5 -0.15 -2.0 -0.1 -1.15 -0.2 -0.6 -0.25 M-3.85 -0.2 L-3.55 -0.15 -3.4 -0.15" fill="none" stroke="#a36a6a" stroke-linecap="round" stroke-linejoin="round" stroke-opacity="0.54509807" stroke-width="0.05"/>
  </g>
</svg>
