<?xml version="1.0" encoding="UTF-8" standalone="no"?>
<svg xmlns:xlink="http://www.w3.org/1999/xlink" height="40.8px" width="137.1px" xmlns="http://www.w3.org/2000/svg">
  <g transform="matrix(1.0, 0.0, 0.0, 1.0, 68.55, 20.4)">
    <path d="M16.55 -15.2 L16.65 -16.25 Q17.8 -15.5 20.05 -10.75 L22.5 -5.75 Q22.75 -5.95 25.9 -7.35 L26.5 -7.65 26.65 -7.7 30.95 -6.75 36.75 -5.55 36.95 -5.55 36.75 -5.55 Q36.7 -7.7 28.3 -10.8 L31.2 -10.8 Q32.75 -10.0 34.8 -9.8 L36.2 -9.7 37.5 -9.7 37.85 -9.75 38.3 -9.85 43.7 -9.3 52.1 -9.2 51.5 -8.9 Q50.05 -8.95 44.95 -7.7 L40.7 -6.6 40.4 -6.75 Q40.05 -6.75 40.05 -6.45 L40.7 -6.6 50.55 -1.8 40.05 -2.05 30.2 -1.8 Q37.7 2.2 38.8 4.15 L38.55 4.25 Q28.35 0.55 26.0 -0.05 L11.1 -3.05 16.2 -3.8 20.3 -4.35 18.4 -10.35 16.55 -15.2 M0.45 -18.25 L4.75 -14.1 Q8.45 -10.2 9.05 -9.0 L9.5 -9.25 9.5 -4.35 9.2 -4.35 Q8.2 -6.75 5.0 -11.85 L0.45 -18.25 M13.85 0.9 L13.85 1.2 0.7 4.25 0.6 3.95 7.7 0.2 9.95 0.5 13.85 0.9" fill="#f2eaea" fill-rule="evenodd" stroke="none"/>
    <path d="M2.0 -8.2 L2.5 -7.9 Q2.5 -9.15 1.25 -13.8 L0.4 -16.8 6.15 -4.65 1.25 -3.55 -0.6 -3.15 -4.55 -2.45 -4.55 -2.15 -0.8 -2.05 1.05 -1.95 5.95 -1.4 Q4.15 -0.5 -2.05 3.3 L-8.6 7.35 -7.05 7.35 -2.9 6.6 0.6 5.9 Q7.25 4.55 9.25 4.55 9.75 4.55 16.0 7.15 L23.1 10.1 23.25 9.75 23.4 9.05 Q23.4 7.9 22.8 6.6 L21.6 4.25 27.65 4.75 28.7 4.9 31.0 5.25 Q31.35 5.25 31.7 5.55 L31.8 5.3 Q31.8 5.7 32.2 5.7 L33.15 5.55 Q33.55 5.55 38.15 7.3 44.05 9.6 51.35 12.85 L51.5 12.9 51.7 12.8 51.8 13.05 52.05 13.6 51.15 13.45 35.5 10.15 35.45 10.4 Q35.5 11.45 36.05 12.25 L36.05 12.55 36.05 13.55 25.25 10.8 25.25 11.4 26.1 13.2 26.25 14.85 25.4 14.6 26.2 17.15 Q24.7 16.1 22.4 14.85 L20.0 13.55 Q12.9 9.8 9.55 9.8 L6.25 11.8 6.75 10.15 7.65 7.65 -1.75 13.0 -5.1 14.25 -11.7 15.05 -13.2 14.75 -13.2 13.5 Q-12.6 10.5 -12.6 9.2 L-17.85 12.0 -17.85 11.7 Q-17.55 10.4 -17.55 7.65 L-22.8 10.15 -28.55 12.75 -28.65 12.9 -28.95 12.9 -28.55 12.75 -24.95 6.15 -30.2 9.55 -35.15 12.6 -44.45 18.05 -39.45 13.15 -33.3 7.35 -34.5 7.8 -32.4 6.05 -28.2 2.25 -28.35 2.1 Q-31.45 3.0 -38.8 5.85 -45.65 8.25 -50.1 8.25 L-52.65 8.05 -53.25 7.95 -55.35 7.65 -56.6 7.15 -63.25 4.5 -66.65 3.15 Q-61.85 1.8 -55.95 1.8 L-51.15 2.35 -49.55 2.6 Q-44.3 3.45 -41.6 4.25 L-42.15 3.4 -39.9 2.8 -36.35 1.8 -36.65 1.2 Q-37.9 0.3 -41.2 -3.3 L-45.6 -8.6 -43.8 -8.6 -40.7 -8.3 -38.3 -8.05 Q-39.15 -8.75 -44.45 -11.25 L-47.6 -12.75 -55.75 -16.6 -48.0 -16.95 Q-44.75 -16.95 -42.15 -15.95 L-41.6 -15.7 Q-38.85 -14.45 -37.65 -14.45 L-38.75 -16.25 Q-39.85 -17.9 -39.85 -18.95 L-39.8 -19.6 -39.5 -19.85 Q-39.1 -19.45 -36.75 -17.8 L-35.3 -16.5 -35.6 -15.8 -36.0 -14.75 -37.2 -11.75 Q-34.3 -14.15 -33.05 -14.25 L-33.55 -13.65 -33.9 -12.95 Q-33.9 -11.85 -31.6 -11.1 -29.3 -10.3 -29.3 -8.55 L-29.5 -7.35 -29.1 -7.4 Q-23.95 -8.15 -16.4 -11.45 L-4.25 -16.6 -6.05 -14.15 -10.35 -9.15 -10.7 -9.0 -10.6 -8.85 -10.35 -9.15 -9.4 -9.5 -5.0 -11.15 Q-5.0 -10.45 -5.35 -8.65 L-3.9 -10.05 -3.4 -10.5 -3.15 -9.7 -2.7 -8.15 -2.7 -7.05 -11.8 -5.95 -20.95 -4.8 -33.95 -3.05 -33.95 -2.9 -33.9 -2.75 Q-31.6 -2.75 -24.1 -0.75 L-22.25 -0.25 -13.2 2.4 Q-13.5 2.7 -13.85 2.7 L-21.0 3.0 -19.85 5.2 -18.75 7.35 -3.65 0.3 -8.15 -0.45 Q-11.9 -1.4 -12.3 -1.8 L-0.3 -5.45 2.75 -6.15 2.0 -8.2 M-11.15 -8.25 L-10.6 -8.85 -10.95 -8.65 -11.15 -8.25 M-29.8 -7.35 L-29.5 -7.35 -29.8 -7.35 -30.5 -7.3 -30.5 -7.25 -29.8 -7.35 M6.25 -1.3 L5.95 -1.4 6.15 -1.5 6.25 -1.3 6.45 -1.2 6.3 -1.25 6.25 -1.3 M46.15 6.25 L45.15 5.25 42.9 2.1 49.05 1.2 54.9 0.6 53.1 -0.1 50.85 -1.2 63.7 -1.5 68.2 -1.3 Q65.9 -0.85 60.4 1.85 L57.55 3.4 55.05 3.85 51.85 4.45 Q47.05 5.4 46.15 6.25 M55.5 -5.75 L55.45 -5.55 54.95 -5.7 Q53.1 -6.2 52.1 -6.75 54.15 -8.0 60.35 -8.85 L66.35 -9.55 55.5 -5.75 M56.05 -12.5 L53.35 -12.6 47.5 -12.35 45.65 -12.3 45.65 -12.0 Q45.3 -11.85 45.35 -11.5 L43.55 -11.0 42.0 -11.7 Q41.9 -12.3 42.4 -12.85 L42.9 -13.85 39.35 -13.0 37.9 -12.7 36.8 -12.5 36.3 -13.85 39.0 -15.75 40.4 -16.7 43.15 -18.4 42.2 -16.7 Q41.2 -15.25 40.3 -14.8 L40.3 -14.45 40.65 -14.45 41.2 -14.6 41.7 -14.8 41.35 -14.8 41.15 -14.8 41.3 -14.85 41.35 -14.8 41.35 -14.85 48.1 -16.9 Q45.4 -15.55 44.1 -15.15 L44.1 -14.75 49.95 -14.35 53.95 -13.9 Q54.55 -13.85 54.35 -14.2 56.65 -15.95 60.3 -18.2 L56.05 -12.5" fill="#d2b6b6" fill-rule="evenodd" stroke="none"/>
    <path d="M16.55 -15.2 L18.4 -10.35 20.3 -4.35 16.2 -3.8 11.1 -3.05 26.0 -0.05 Q28.35 0.55 38.55 4.25 L38.8 4.15 Q37.7 2.2 30.2 -1.8 L40.05 -2.05 50.55 -1.8 40.7 -6.6 40.05 -6.45 Q40.05 -6.75 40.4 -6.75 L40.7 -6.6 44.95 -7.7 Q50.05 -8.95 51.5 -8.9 L52.1 -9.2 43.7 -9.3 38.3 -9.85 43.55 -11.0 45.35 -11.5 Q47.05 -11.95 47.5 -12.35 47.05 -11.95 45.35 -11.5 45.3 -11.85 45.65 -12.0 L45.65 -12.3 47.5 -12.35 53.35 -12.6 56.05 -12.5 55.1 -11.15 Q56.6 -10.55 60.85 -10.2 L61.1 -10.2 Q65.15 -9.9 66.75 -10.1 L66.75 -9.7 66.35 -9.55 60.35 -8.85 Q54.15 -8.0 52.1 -6.75 53.1 -6.2 54.95 -5.7 L55.45 -5.55 55.5 -5.75 55.5 -5.35 68.55 -1.4 68.2 -1.3 63.7 -1.5 50.85 -1.2 53.1 -0.1 54.9 0.6 49.05 1.2 42.9 2.1 45.15 5.25 46.15 6.25 46.05 6.3 50.4 10.8 51.5 12.5 51.7 12.8 51.5 12.9 51.35 12.85 Q44.05 9.6 38.15 7.3 33.55 5.55 33.15 5.55 L32.2 5.7 Q31.8 5.7 31.8 5.3 L31.7 5.55 Q31.35 5.25 31.0 5.25 L28.7 4.9 27.65 4.75 21.6 4.25 22.8 6.6 Q23.4 7.9 23.4 9.05 L23.25 9.75 23.1 10.1 16.0 7.15 Q9.75 4.55 9.25 4.55 7.25 4.55 0.6 5.9 L-2.9 6.6 -7.05 7.35 -8.6 7.35 -2.05 3.3 Q4.15 -0.5 5.95 -1.4 L1.05 -1.95 -0.8 -2.05 -4.55 -2.15 -4.55 -2.45 -0.6 -3.15 1.25 -3.55 6.15 -4.65 0.4 -16.8 -0.3 -18.8 0.45 -18.25 5.0 -11.85 Q8.2 -6.75 9.2 -4.35 L9.5 -4.35 9.5 -9.25 Q12.3 -10.95 13.05 -11.9 13.4 -11.15 13.4 -9.0 13.7 -9.9 13.95 -10.0 L14.85 -10.1 15.6 -9.85 15.95 -9.35 16.3 -12.65 16.55 -15.2 M28.3 -10.8 Q36.7 -7.7 36.75 -5.55 L36.95 -5.55 36.75 -5.55 30.95 -6.75 26.65 -7.7 29.85 -9.05 28.3 -10.45 28.3 -10.8 M-3.4 -10.5 L-2.45 -10.8 Q-2.1 -10.8 -0.6 -9.85 L0.05 -9.45 2.0 -8.2 2.75 -6.15 -0.3 -5.45 -12.3 -1.8 Q-11.9 -1.4 -8.15 -0.45 L-3.65 0.3 -18.75 7.35 -19.85 5.2 -21.0 3.0 -13.85 2.7 Q-13.5 2.7 -13.2 2.4 L-22.25 -0.25 -24.1 -0.75 Q-31.6 -2.75 -33.9 -2.75 L-33.95 -2.9 -33.95 -3.05 -20.95 -4.8 -11.8 -5.95 -2.7 -7.05 -2.7 -8.15 -3.15 -9.7 -3.4 -10.5 M6.25 -1.3 L6.15 -1.5 5.95 -1.4 6.25 -1.3 6.3 -1.25 6.45 -1.2 6.25 -1.3 M41.3 -14.85 L41.35 -14.85 41.35 -14.8 41.3 -14.85 M48.1 -16.9 L57.2 -19.25 62.05 -20.4 60.7 -18.75 60.3 -18.2 Q56.65 -15.95 54.35 -14.2 54.55 -13.85 53.95 -13.9 L49.95 -14.35 44.1 -14.75 44.1 -15.15 Q45.4 -15.55 48.1 -16.9 M13.85 0.9 L9.95 0.5 7.7 0.2 0.6 3.95 0.7 4.25 13.85 1.2 13.85 0.9 M-45.6 -0.65 L-44.35 0.75 -42.65 2.75 -42.15 3.4 -41.6 4.25 Q-44.3 3.45 -49.55 2.6 L-51.15 2.35 -55.95 1.8 Q-61.85 1.8 -66.65 3.15 L-67.0 3.0 -68.55 2.25 -67.0 2.0 -61.65 0.35 Q-55.25 -1.75 -50.7 -1.75 L-49.5 -1.65 -47.2 -1.2 Q-45.75 -0.65 -45.6 -0.65" fill="#e0cdcd" fill-rule="evenodd" stroke="none"/>
    <path d="M38.3 -9.85 L37.85 -9.75 37.75 -9.95 37.15 -11.45 37.1 -11.6 36.8 -12.5 37.9 -12.7 39.35 -13.0 42.9 -13.85 42.4 -12.85 Q41.9 -12.3 42.0 -11.7 L43.55 -11.0 38.3 -9.85 M52.05 13.6 Q52.65 15.2 52.6 16.8 L50.3 15.45 Q48.15 14.5 44.6 13.55 39.15 12.05 36.45 12.05 L36.05 12.1 36.05 12.25 Q35.5 11.45 35.45 10.4 L35.5 10.15 51.15 13.45 52.05 13.6 M36.05 13.55 L35.9 16.8 30.65 15.7 26.35 14.9 26.25 14.85 26.1 13.2 25.25 11.4 25.25 10.8 36.05 13.55 M26.2 17.15 L26.45 17.85 26.45 19.3 24.65 19.3 9.05 13.15 8.25 13.8 7.9 14.4 Q7.85 14.2 7.4 14.2 L5.3 15.5 Q3.25 16.75 2.25 16.8 L2.15 16.45 3.6 12.4 3.6 10.6 Q1.7 13.65 -4.4 16.1 L-5.75 16.65 -16.95 20.4 -19.55 20.4 -16.6 13.65 -16.6 13.15 Q-17.5 14.15 -19.3 15.15 L-22.05 16.8 Q-22.0 15.7 -21.15 12.75 L-20.6 10.9 Q-23.6 11.95 -24.95 13.5 -26.0 14.7 -32.5 16.85 L-33.85 17.3 -34.9 17.65 -33.95 16.6 -33.05 15.65 -29.45 11.45 -29.35 11.3 -29.7 11.3 -31.5 12.15 -45.45 19.05 -44.45 18.05 -35.15 12.6 -30.2 9.55 -24.95 6.15 -28.55 12.75 -28.95 12.9 -28.65 12.9 -28.55 12.75 -22.8 10.15 -17.55 7.65 Q-17.55 10.4 -17.85 11.7 L-17.85 12.0 -12.6 9.2 Q-12.6 10.5 -13.2 13.5 L-13.2 14.75 -11.7 15.05 -5.1 14.25 -1.75 13.0 7.65 7.65 6.75 10.15 6.25 11.8 9.55 9.8 Q12.9 9.8 20.0 13.55 L22.4 14.85 Q24.7 16.1 26.2 17.15 M-46.75 -2.4 L-48.05 -4.4 -50.0 -7.55 -48.9 -7.0 -47.8 -6.45 -47.8 -6.8 -52.1 -11.7 -55.85 -16.05 -56.15 -16.6 -55.75 -16.6 -47.6 -12.75 -44.45 -11.25 Q-39.15 -8.75 -38.3 -8.05 L-40.7 -8.3 -43.8 -8.6 -45.6 -8.6 -41.2 -3.3 Q-37.9 0.3 -36.65 1.2 L-36.35 1.8 -39.9 2.8 -42.15 3.4 -42.65 2.75 -44.35 0.75 -45.6 -0.65 -46.75 -2.4 M-55.35 7.65 L-53.25 7.95 -52.65 8.05 -50.1 8.25 Q-45.65 8.25 -38.8 5.85 -31.45 3.0 -28.35 2.1 L-28.2 2.25 -32.4 6.05 -34.5 7.8 -45.25 11.7 -48.35 10.55 -52.75 8.75 -53.6 8.4 -55.35 7.65" fill="#c29c9c" fill-rule="evenodd" stroke="none"/>
    <path d="M26.65 -7.7 L26.5 -7.65 25.9 -7.35 Q22.75 -5.95 22.5 -5.75 L20.05 -10.75 Q17.8 -15.5 16.65 -16.25 L16.55 -15.2 M38.3 -9.85 L37.85 -9.75 37.5 -9.7 36.2 -9.7 34.8 -9.8 Q32.75 -10.0 31.2 -10.8 L28.3 -10.8 M26.65 -7.7 L29.85 -9.05 28.3 -10.45 28.3 -10.8 M9.5 -9.25 Q12.3 -10.95 13.05 -11.9 13.4 -11.15 13.4 -9.0 13.7 -9.9 13.95 -10.0 L14.85 -10.1 15.6 -9.85 15.95 -9.35 16.3 -12.65 16.55 -15.2 M2.0 -8.2 L2.5 -7.9 Q2.5 -9.15 1.25 -13.8 L0.4 -16.8 -0.3 -18.8 0.45 -18.25 4.75 -14.1 Q8.45 -10.2 9.05 -9.0 L9.5 -9.25 M-3.4 -10.5 L-2.45 -10.8 Q-2.1 -10.8 -0.6 -9.85 L0.05 -9.45 2.0 -8.2 M-3.4 -10.5 L-3.9 -10.05 -5.35 -8.65 Q-5.0 -10.45 -5.0 -11.15 L-9.4 -9.5 -10.35 -9.15 -10.6 -8.85 M-11.15 -8.25 L-10.95 -8.65 -10.6 -8.85 M-10.7 -9.0 L-10.35 -9.15 -6.05 -14.15 -4.25 -16.6 -16.4 -11.45 Q-23.95 -8.15 -29.1 -7.4 L-29.5 -7.35 -29.8 -7.35 M51.7 12.8 L51.5 12.5 50.4 10.8 46.05 6.3 46.15 6.25 Q47.05 5.4 51.85 4.45 L55.05 3.85 57.55 3.4 60.4 1.85 Q65.9 -0.85 68.2 -1.3 L68.55 -1.4 55.5 -5.35 55.5 -5.75 M66.35 -9.55 L66.75 -9.7 66.75 -10.1 Q65.15 -9.9 61.1 -10.2 L60.85 -10.2 Q56.6 -10.55 55.1 -11.15 L56.05 -12.5 M47.5 -12.35 Q47.05 -11.95 45.35 -11.5 L43.55 -11.0 38.3 -9.85 M36.8 -12.5 L36.3 -13.85 39.0 -15.75 40.4 -16.7 43.15 -18.4 42.2 -16.7 Q41.2 -15.25 40.3 -14.8 L40.3 -14.45 41.15 -14.8 41.3 -14.85 41.35 -14.85 48.1 -16.9 57.2 -19.25 62.05 -20.4 60.7 -18.75 60.3 -18.2 56.05 -12.5 M37.85 -9.75 L37.75 -9.95 37.15 -11.45 37.1 -11.6 36.8 -12.5 M41.35 -14.8 L41.7 -14.8 41.2 -14.6 40.65 -14.45 40.3 -14.45 40.85 -14.6 41.35 -14.8 M66.35 -9.55 L55.5 -5.75 M52.05 13.6 Q52.65 15.2 52.6 16.8 L50.3 15.45 Q48.15 14.5 44.6 13.55 39.15 12.05 36.45 12.05 L36.05 12.1 36.05 12.25 36.05 12.55 36.05 13.55 35.9 16.8 30.65 15.7 26.35 14.9 M26.25 14.85 L25.4 14.6 26.2 17.15 26.45 17.85 26.45 19.3 24.65 19.3 9.05 13.15 8.25 13.8 7.9 14.4 Q7.85 14.2 7.4 14.2 L5.3 15.5 Q3.25 16.75 2.25 16.8 L2.15 16.8 2.15 16.45 3.6 12.4 3.6 10.6 Q1.7 13.65 -4.4 16.1 L-5.75 16.65 -16.95 20.4 -19.55 20.4 -16.6 13.65 -16.6 13.15 Q-17.5 14.15 -19.3 15.15 L-22.05 16.8 Q-22.0 15.7 -21.15 12.75 L-20.6 10.9 Q-23.6 11.95 -24.95 13.5 -26.0 14.7 -32.5 16.85 L-33.85 17.3 -34.9 17.65 -33.95 16.6 -33.05 15.65 -29.45 11.45 -29.35 11.3 -29.7 11.3 -31.5 12.15 -45.45 19.05 -46.0 19.65 M51.7 12.8 L51.8 13.05 52.05 13.6 M-44.45 18.05 L-45.45 19.05 M-55.75 -16.6 L-48.0 -16.95 Q-44.75 -16.95 -42.15 -15.95 L-41.6 -15.7 Q-38.85 -14.45 -37.65 -14.45 L-38.75 -16.25 Q-39.85 -17.9 -39.85 -18.95 L-39.8 -19.6 -39.5 -19.85 Q-39.1 -19.45 -36.75 -17.8 L-35.3 -16.5 -35.6 -15.8 -36.0 -14.75 -37.2 -11.75 Q-34.3 -14.15 -33.05 -14.25 L-33.55 -13.65 -33.9 -12.95 Q-33.9 -11.85 -31.6 -11.1 -29.3 -10.3 -29.3 -8.55 L-29.5 -7.35 M-55.75 -16.6 L-56.15 -16.6 -55.85 -16.05 -52.1 -11.7 -47.8 -6.8 -47.8 -6.45 -48.9 -7.0 -50.0 -7.55 -48.05 -4.4 -46.75 -2.4 M-45.6 -0.65 Q-45.75 -0.65 -47.2 -1.2 L-49.5 -1.65 -50.7 -1.75 Q-55.25 -1.75 -61.65 0.35 L-67.0 2.0 -68.55 2.25 -67.0 3.0 -66.65 3.15 M-55.35 7.65 L-53.6 8.4 -52.75 8.75 -48.35 10.55 -45.25 11.7 -34.5 7.8 -33.3 7.35 -39.45 13.15 -44.45 18.05 M-55.35 7.65 L-56.6 7.15 -63.25 4.5 -66.65 3.15" fill="none" stroke="#a36a6a" stroke-linecap="round" stroke-linejoin="round" stroke-opacity="0.4" stroke-width="0.05"/>
  </g>
</svg>
