<?xml version="1.0" encoding="UTF-8" standalone="no"?>
<svg xmlns:xlink="http://www.w3.org/1999/xlink" height="26.0px" width="45.5px" xmlns="http://www.w3.org/2000/svg">
  <g transform="matrix(1.0, 0.0, 0.0, 1.0, 3.15, 1.0)">
    <path d="M29.35 -1.0 L30.05 -0.7 42.05 11.3 42.35 12.0 42.05 12.7 30.05 24.7 29.35 25.0 Q28.95 25.0 28.65 24.7 28.35 24.4 28.35 24.0 L28.35 17.85 16.5 17.85 15.8 17.55 15.5 16.85 15.5 7.15 Q15.5 6.75 15.8 6.45 16.1 6.15 16.5 6.15 L28.35 6.15 28.35 0.0 Q28.35 -0.4 28.65 -0.7 28.95 -1.0 29.35 -1.0 M9.85 -1.0 Q10.25 -1.0 10.55 -0.7 L10.85 0.0 10.85 6.15 13.45 6.15 Q13.85 6.15 14.15 6.45 L14.45 7.15 14.45 16.85 14.15 17.55 13.45 17.85 10.85 17.85 10.85 24.0 10.55 24.7 Q10.25 25.0 9.85 25.0 L9.15 24.7 -2.85 12.7 -3.15 12.0 -2.85 11.3 9.15 -0.7 9.85 -1.0" fill="#ffffff" fill-rule="evenodd" stroke="none"/>
    <path d="M35.45 7.15 L35.45 16.85 25.75 16.85 25.75 7.15 35.45 7.15" fill="#161b1e" fill-rule="evenodd" stroke="none"/>
    <path d="M29.35 24.0 L29.35 0.0 41.35 12.0 29.35 24.0" fill="#161b1e" fill-rule="evenodd" stroke="none"/>
    <path d="M3.75 16.85 L3.75 7.15 13.45 7.15 13.45 16.85 3.75 16.85" fill="#161b1e" fill-rule="evenodd" stroke="none"/>
    <path d="M9.85 0.0 L9.85 24.0 -2.15 12.0 9.85 0.0" fill="#161b1e" fill-rule="evenodd" stroke="none"/>
    <path d="M16.5 16.85 L16.5 7.15 26.2 7.15 26.2 16.85 16.5 16.85" fill="#161b1e" fill-rule="evenodd" stroke="none"/>
  </g>
</svg>
