<?xml version="1.0" encoding="UTF-8" standalone="no"?>
<svg xmlns:xlink="http://www.w3.org/1999/xlink" height="124.8px" width="139.35px" xmlns="http://www.w3.org/2000/svg">
  <g transform="matrix(1.0, 0.0, 0.0, 1.0, 63.5, 61.35)">
    <path d="M34.35 -56.1 Q33.0 -59.55 36.6 -60.75 L39.1 -61.35 Q45.25 -58.1 39.35 -54.65 35.8 -52.6 34.35 -56.1 M25.6 -22.55 Q24.1 -18.1 19.1 -19.85 12.05 -22.3 15.75 -28.65 17.7 -32.05 21.45 -32.4 28.05 -29.85 25.6 -22.55 M37.45 -18.2 Q41.1 -21.7 45.75 -23.15 54.05 -21.7 51.85 -14.5 57.9 -13.25 56.2 -6.1 55.15 -1.6 50.65 -0.6 42.25 1.25 42.5 -6.75 42.55 -8.25 43.0 -9.5 37.6 -10.15 36.8 -16.5 36.65 -17.45 37.45 -18.2 M3.25 -47.4 Q-2.1 -41.95 -5.3 -47.55 -6.8 -50.1 -5.35 -52.5 -3.05 -56.3 1.05 -56.6 8.95 -53.25 3.25 -47.4 M72.85 2.2 Q78.45 4.7 73.55 8.15 72.65 8.8 71.5 8.65 64.55 7.85 69.0 3.3 69.85 2.45 71.1 2.4 L72.85 2.2 M57.75 19.35 Q65.45 22.4 60.05 27.75 59.5 28.3 58.6 28.4 52.5 29.0 53.65 22.8 54.25 19.5 57.75 19.35 M3.05 11.0 Q4.65 7.8 7.75 6.95 18.2 7.4 16.05 16.75 14.3 24.3 6.5 20.7 -0.25 17.55 3.05 11.0 M0.1 29.1 Q-7.55 27.15 -3.35 21.25 -1.95 19.2 0.35 18.75 8.5 21.75 3.3 28.05 2.05 29.6 0.1 29.1 M15.55 40.5 L16.9 40.2 Q24.65 42.6 19.55 49.5 19.0 50.25 17.95 50.15 L15.6 49.7 Q13.5 54.8 9.45 52.8 7.75 52.0 7.7 50.05 7.65 45.3 12.25 44.6 12.35 41.2 15.55 40.5 M26.4 25.6 Q32.7 27.45 28.65 32.65 26.85 35.0 23.95 33.95 19.35 32.25 21.8 27.85 22.6 26.4 24.3 26.0 L26.4 25.6 M-11.4 -52.0 Q-11.3 -49.7 -11.85 -47.6 -12.9 -43.45 -17.4 -43.5 -26.05 -43.65 -25.5 -51.8 -25.45 -52.7 -24.8 -53.5 -21.85 -57.15 -16.95 -57.3 -11.65 -57.1 -11.4 -52.0 M-34.05 -28.75 Q-37.0 -31.9 -33.55 -34.05 -31.95 -35.0 -30.3 -35.3 -23.95 -32.55 -29.45 -28.45 -32.0 -26.55 -34.05 -28.75 M-38.65 -23.9 Q-37.9 -25.0 -36.65 -25.1 -30.05 -22.95 -33.8 -18.3 -34.7 -17.15 -36.2 -17.6 -41.8 -19.35 -38.65 -23.9 M-31.7 -10.8 Q-25.45 -8.6 -28.4 -3.45 -30.45 0.0 -34.2 -1.7 -38.25 -3.45 -36.35 -7.75 -35.1 -10.55 -31.7 -10.8 M-17.05 -4.85 Q-20.3 -2.95 -21.2 -6.4 -22.5 -11.25 -17.25 -11.75 -10.7 -8.7 -17.05 -4.85 M-9.0 -7.25 Q-9.35 -11.8 -4.95 -12.95 3.5 -13.3 3.35 -4.75 3.3 -1.2 -0.6 -0.85 -8.55 -0.05 -9.0 -7.25 M-18.2 48.75 Q-19.65 50.55 -21.7 49.3 -26.6 46.35 -23.0 42.2 -21.6 40.65 -19.7 40.4 -13.8 43.45 -18.2 48.75 M-22.7 13.35 Q-23.75 13.75 -24.4 12.85 -27.55 8.75 -22.5 7.3 -16.2 10.6 -22.7 13.35 M-53.3 22.2 Q-55.05 26.6 -59.55 25.25 -65.65 23.25 -62.35 17.95 -60.4 14.8 -56.65 15.2 -51.3 17.25 -53.3 22.2 M-47.9 56.65 Q-41.35 59.0 -45.95 63.05 L-48.1 63.0 Q-50.95 60.8 -50.45 59.05 -53.55 62.5 -55.15 57.35 -55.45 56.5 -54.75 55.65 -53.5 54.0 -51.75 53.5 -49.3 54.3 -49.2 57.1 L-49.2 57.35 -49.25 57.5 -47.9 56.65" fill="#ffffff" fill-opacity="0.49803922" fill-rule="evenodd" stroke="none"/>
    <path d="M-47.65 60.0 L-47.6 60.0 -47.45 60.7 -47.95 60.15 -47.75 60.15 -47.65 60.0 M-60.55 20.4 Q-60.55 19.4 -59.8 18.7 -59.1 18.0 -58.1 18.0 -57.1 18.0 -56.35 18.7 -55.65 19.4 -55.65 20.4 -55.65 21.4 -56.35 22.1 -57.1 22.8 -58.1 22.8 -59.1 22.8 -59.8 22.1 -60.55 21.4 -60.55 20.4 M-21.1 43.9 Q-20.8 43.4 -20.35 43.4 -19.9 43.4 -19.55 43.9 -19.25 44.4 -19.25 45.1 -19.25 45.8 -19.55 46.3 L-20.35 46.8 -21.1 46.3 -21.45 45.1 -21.1 43.9 M-22.35 10.3 L-22.35 10.5 -22.55 10.5 -22.55 10.3 -22.35 10.3 M-5.95 -6.85 Q-5.95 -8.15 -5.05 -9.1 -4.1 -10.0 -2.8 -10.0 -1.5 -10.0 -0.55 -9.1 0.35 -8.15 0.35 -6.85 0.35 -5.55 -0.55 -4.6 -1.5 -3.7 -2.8 -3.7 -4.1 -3.7 -5.05 -4.6 -5.95 -5.55 -5.95 -6.85 M-17.65 -8.75 L-17.1 -8.5 -16.9 -7.95 -17.1 -7.35 -17.65 -7.15 -18.15 -7.35 -18.4 -7.95 -18.15 -8.5 -17.65 -8.75 M-32.1 -7.9 Q-31.3 -7.9 -30.7 -7.3 -30.15 -6.75 -30.15 -5.95 -30.15 -5.15 -30.7 -4.55 -31.3 -4.0 -32.1 -4.0 -32.9 -4.0 -33.45 -4.55 -34.05 -5.15 -34.05 -5.95 -34.05 -6.75 -33.45 -7.3 -32.9 -7.9 -32.1 -7.9 M-35.3 -21.25 L-35.5 -20.7 -36.05 -20.5 -36.55 -20.7 -36.8 -21.25 -36.55 -21.75 -36.05 -22.0 -35.5 -21.75 -35.3 -21.25 M-31.85 -32.2 L-31.1 -32.5 -30.3 -32.2 Q-30.0 -31.9 -30.0 -31.45 -30.0 -31.0 -30.3 -30.7 -30.65 -30.4 -31.1 -30.4 -31.55 -30.4 -31.85 -30.7 -32.2 -31.0 -32.2 -31.45 L-31.85 -32.2 M-21.85 -53.25 Q-20.6 -54.5 -18.85 -54.5 -17.1 -54.5 -15.8 -53.25 -14.6 -52.0 -14.6 -50.25 -14.6 -48.5 -15.8 -47.2 -17.1 -46.0 -18.85 -46.0 -20.6 -46.0 -21.85 -47.2 -23.1 -48.5 -23.1 -50.25 -23.1 -52.0 -21.85 -53.25 M26.8 28.9 Q27.25 29.35 27.25 29.95 L26.8 31.0 Q26.35 31.45 25.7 31.45 25.05 31.45 24.6 31.0 24.15 30.55 24.15 29.95 24.15 29.35 24.6 28.9 25.05 28.45 25.7 28.45 26.35 28.45 26.8 28.9 M11.15 49.05 Q12.8 47.55 14.7 46.4 L15.5 43.9 16.7 43.35 18.65 44.7 18.15 46.7 Q13.4 46.4 10.6 49.75 10.8 49.35 11.15 49.05 M0.3 21.8 Q1.2 21.8 1.85 22.45 2.45 23.1 2.45 24.0 2.45 24.9 1.85 25.55 1.2 26.2 0.3 26.2 -0.6 26.2 -1.2 25.55 -1.85 24.9 -1.85 24.0 -1.85 23.1 -1.2 22.45 -0.6 21.8 0.3 21.8 M6.2 11.35 Q7.45 10.05 9.25 10.05 11.05 10.05 12.35 11.35 13.6 12.65 13.6 14.45 13.6 16.25 12.35 17.55 11.05 18.85 9.25 18.85 7.45 18.85 6.2 17.55 4.9 16.25 4.9 14.45 4.9 12.65 6.2 11.35 M59.0 22.85 Q59.45 23.3 59.45 23.9 59.45 24.5 59.0 24.95 58.55 25.4 57.95 25.4 57.35 25.4 56.9 24.95 56.45 24.5 56.45 23.9 56.45 23.3 56.9 22.85 57.35 22.4 57.95 22.4 58.55 22.4 59.0 22.85 M72.65 5.45 L71.6 5.7 70.55 5.45 72.65 5.45 M46.1 -20.05 L47.55 -19.45 Q48.45 -19.1 48.5 -18.2 48.7 -12.95 53.3 -9.9 L53.25 -8.4 Q52.4 -2.15 46.0 -4.15 45.3 -6.9 45.8 -9.75 45.95 -10.7 45.25 -10.9 41.45 -12.3 39.95 -15.95 L40.9 -17.0 Q42.65 -18.75 44.8 -19.5 L46.1 -20.05 M22.5 -28.35 Q23.35 -27.3 23.35 -25.85 23.35 -24.4 22.5 -23.35 21.65 -22.3 20.45 -22.3 19.25 -22.3 18.4 -23.35 17.55 -24.4 17.55 -25.85 17.55 -27.3 18.4 -28.35 19.25 -29.4 20.45 -29.4 21.65 -29.4 22.5 -28.35 M37.2 -57.6 Q37.2 -58.0 37.5 -58.25 37.75 -58.55 38.15 -58.55 L38.85 -58.25 39.1 -57.6 38.85 -56.9 38.15 -56.65 Q37.75 -56.65 37.5 -56.9 37.2 -57.2 37.2 -57.6 M0.7 -53.4 L2.5 -51.85 Q2.5 -50.7 1.9 -49.8 0.3 -47.25 -2.15 -48.6 L-2.35 -49.4 Q-2.55 -52.8 0.7 -53.4" fill="#ffffff" fill-rule="evenodd" stroke="none"/>
  </g>
</svg>
