<?xml version="1.0" encoding="UTF-8" standalone="no"?>
<svg xmlns:xlink="http://www.w3.org/1999/xlink" height="7.95px" width="8.0px" xmlns="http://www.w3.org/2000/svg">
  <g transform="matrix(1.0, 0.0, 0.0, 1.0, 4.0, 3.95)">
    <path d="M2.1 -2.1 Q1.25 -2.95 0.0 -2.95 -1.25 -2.95 -2.15 -2.1 -3.0 -1.2 -3.0 0.0 -3.0 1.25 -2.15 2.1 -1.25 3.0 0.0 3.0 1.25 3.0 2.1 2.1 3.0 1.25 3.0 0.05 3.0 -1.2 2.1 -2.1 M2.8 -2.8 Q4.0 -1.6 4.0 0.05 4.0 1.65 2.8 2.8 1.7 4.0 0.0 4.0 -1.65 4.0 -2.85 2.8 -4.0 1.65 -4.0 0.0 -4.0 -1.6 -2.85 -2.8 -1.65 -3.95 0.0 -3.95 1.7 -3.95 2.8 -2.8" fill="#a4f4fd" fill-rule="evenodd" stroke="none"/>
    <path d="M2.1 -2.1 Q3.0 -1.2 3.0 0.05 3.0 1.25 2.1 2.1 1.25 3.0 0.0 3.0 -1.25 3.0 -2.15 2.1 -3.0 1.25 -3.0 0.0 -3.0 -1.2 -2.15 -2.1 -1.25 -2.95 0.0 -2.95 1.25 -2.95 2.1 -2.1" fill="#04d1e0" fill-rule="evenodd" stroke="none"/>
  </g>
</svg>
