<?xml version="1.0" encoding="UTF-8" standalone="no"?>
<svg xmlns:xlink="http://www.w3.org/1999/xlink" height="48.6px" width="45.05px" xmlns="http://www.w3.org/2000/svg">
  <g transform="matrix(1.0, 0.0, 0.0, 1.0, 0.0, -4.25)">
    <path d="M34.05 10.7 L34.5 10.15 Q35.9 8.7 37.5 8.6 L38.9 8.95 Q40.15 9.5 41.6 11.05 44.15 13.95 44.15 17.4 44.15 19.7 42.8 23.35 L41.3 26.6 40.2 28.35 39.05 29.6 38.15 30.35 38.05 30.45 35.15 32.5 34.3 32.95 34.15 33.05 31.35 34.35 33.8 32.5 35.0 31.55 37.8 28.55 34.4 30.1 37.5 27.1 39.25 24.5 Q41.45 20.75 41.45 16.85 41.45 14.35 40.4 12.05 L40.35 11.9 Q39.7 10.55 38.85 9.9 38.05 9.3 37.1 9.3 36.1 9.35 35.05 9.95 L34.05 10.7 M41.1 29.15 L41.15 29.2 Q42.15 30.15 43.0 31.5 L43.2 31.8 43.9 33.1 43.2 33.55 41.6 34.4 40.55 33.05 39.5 31.4 Q39.5 31.0 40.0 30.4 L40.1 30.35 40.2 30.2 40.3 30.1 40.7 29.6 40.85 29.45 40.85 29.4 40.95 29.3 41.1 29.15 M18.45 4.8 Q19.7 4.35 21.05 4.25 25.9 4.05 29.75 7.7 31.4 9.35 32.65 11.25 32.95 11.4 33.25 11.9 L34.1 13.75 34.9 16.05 35.35 18.25 Q33.65 23.0 30.65 26.05 28.85 27.9 26.65 29.15 L26.55 29.05 29.25 26.35 Q32.85 22.05 32.7 18.4 L32.7 16.45 32.55 16.45 30.95 19.1 31.2 15.95 Q31.2 13.6 29.9 11.25 28.9 9.5 27.45 8.1 26.25 7.1 23.95 5.9 L23.9 5.85 Q21.25 4.55 19.85 4.65 L18.45 4.8 M7.35 27.6 L7.65 27.55 8.4 27.65 8.5 27.6 8.55 27.85 Q8.55 28.85 3.3 32.8 L2.85 32.05 3.3 31.1 3.7 30.7 6.0 28.65 6.6 28.2 7.35 27.6 M9.5 30.65 L9.6 30.7 Q9.2 31.35 8.1 31.85 L8.0 31.9 7.8 32.05 Q7.55 32.15 7.35 32.3 L6.3 32.8 5.85 31.85 7.05 30.9 8.55 29.65 Q8.15 30.05 9.5 30.65" fill="#f2eaea" fill-rule="evenodd" stroke="none"/>
    <path d="M34.3 32.95 L35.15 32.5 38.05 30.45 38.15 30.35 39.05 29.6 40.2 28.35 41.1 29.15 40.95 29.3 40.85 29.4 40.7 29.6 40.3 30.1 40.2 30.2 40.1 30.35 40.0 30.4 38.7 31.3 38.55 31.4 37.8 32.1 37.6 32.15 Q36.8 32.3 36.25 32.8 35.6 33.45 35.6 34.2 35.6 34.8 36.05 35.15 L36.9 35.45 Q37.45 35.45 38.0 34.8 L38.5 34.15 39.8 36.95 40.75 39.9 40.75 39.95 40.35 43.0 40.25 43.4 39.9 45.1 39.5 41.45 39.3 41.55 38.45 41.6 Q37.85 41.6 37.25 40.7 36.65 39.8 36.65 38.7 36.65 38.0 36.95 37.1 33.8 37.85 33.8 34.55 33.8 33.45 34.15 33.05 L34.3 32.95 M42.8 47.9 Q42.65 49.25 41.6 50.75 40.55 52.45 39.2 52.75 L38.6 52.85 37.4 52.5 Q36.65 52.1 36.65 51.65 L37.1 50.85 37.25 50.65 37.35 50.6 37.75 51.25 38.7 51.45 Q40.05 51.4 42.8 47.9 M37.8 49.85 L37.15 49.65 37.1 49.05 37.2 48.65 37.5 48.9 38.15 49.1 39.0 48.85 39.05 48.95 Q38.35 49.3 37.8 49.85 M18.15 18.6 L17.25 17.25 Q16.65 16.15 16.65 15.45 16.65 13.65 18.45 11.7 20.35 9.6 22.5 9.6 24.75 9.6 26.4 11.1 28.35 12.85 28.35 15.9 L28.35 16.8 Q28.1 15.15 26.7 13.55 25.3 11.95 23.9 11.8 L23.45 11.75 23.4 11.75 Q21.45 11.85 19.5 13.2 17.4 14.65 17.4 16.2 17.4 17.5 18.15 18.6 M25.15 24.8 Q24.55 25.6 22.6 26.45 20.45 27.35 18.9 27.35 16.95 27.35 15.9 26.05 L14.55 23.8 15.7 23.5 Q17.55 25.75 18.35 26.05 L19.55 26.45 20.05 26.45 Q23.2 26.3 25.15 24.8 M5.35 40.1 L4.9 39.55 4.8 39.2 4.5 38.15 5.75 38.9 6.3 39.2 7.25 39.5 Q8.95 39.5 9.4 38.3 L9.45 38.6 Q9.45 40.85 7.55 40.85 L5.85 40.4 5.35 40.1 M9.45 37.3 Q8.75 36.75 7.65 34.7 L8.6 35.45 Q9.35 36.05 9.65 36.05 L10.95 35.7 11.65 35.15 Q12.4 34.4 12.55 33.6 L12.75 35.0 Q12.75 36.15 12.15 36.95 11.55 37.7 10.8 37.7 L9.65 37.4 9.45 37.3 M23.55 35.3 L21.45 33.65 21.9 33.6 22.4 33.65 Q24.3 33.65 27.2 31.65 L31.65 28.25 Q31.7 29.05 31.0 30.0 L29.85 31.4 29.85 31.55 31.65 30.8 33.05 29.9 Q32.45 32.0 31.4 33.25 L29.5 35.05 Q26.9 35.9 24.8 36.15 L24.6 36.0 23.65 35.4 23.55 35.3 M38.95 37.25 L38.45 37.1 38.05 37.4 Q37.7 37.85 37.7 38.6 37.7 39.1 38.0 39.5 38.35 39.95 38.9 39.95 39.35 39.95 39.65 39.5 L39.95 38.6 Q39.95 37.9 39.6 37.6 L38.95 37.25" fill="#c9a7a7" fill-rule="evenodd" stroke="none"/>
    <path d="M34.05 10.7 L35.05 9.95 Q36.1 9.35 37.1 9.3 38.05 9.3 38.85 9.9 L39.0 10.9 38.95 11.3 38.7 11.9 38.25 12.7 Q38.35 11.75 37.75 11.0 37.1 10.15 36.05 10.2 35.6 10.25 34.95 10.8 34.2 11.5 34.2 12.2 34.2 13.35 35.15 13.3 L35.7 13.0 35.9 12.3 35.65 12.9 35.15 13.0 34.8 12.75 34.7 12.2 Q34.7 11.75 35.0 11.35 35.4 10.95 35.9 10.95 36.35 10.9 36.65 11.45 L36.95 12.4 Q36.95 13.5 36.0 14.7 L34.9 16.05 34.1 13.75 33.25 11.9 33.65 11.3 34.05 10.7 M43.9 33.1 Q45.05 35.45 45.05 37.85 L44.8 38.85 44.7 39.35 44.6 39.65 43.75 42.85 43.35 44.15 43.3 44.4 41.3 45.3 41.7 42.95 42.05 40.95 42.3 39.35 38.7 31.3 40.0 30.4 Q39.5 31.0 39.5 31.4 L40.55 33.05 41.6 34.4 43.2 33.55 43.9 33.1 M40.7 29.6 L40.85 29.4 40.85 29.45 40.7 29.6 M37.8 32.1 Q38.45 32.0 38.45 32.65 38.45 33.9 37.2 33.9 L36.8 33.8 36.75 33.2 Q36.75 32.4 37.6 32.15 L37.8 32.1 M26.65 29.15 L26.55 29.2 26.55 29.05 26.65 29.15 M17.65 5.15 L16.95 6.4 16.1 8.1 15.1 9.2 14.3 10.75 Q13.65 12.45 13.65 13.85 13.65 16.95 15.45 19.65 17.2 22.35 19.2 22.35 21.6 22.35 23.55 21.0 25.5 19.65 25.5 17.9 25.5 17.1 25.0 16.15 L24.45 15.15 Q24.2 14.8 23.85 14.65 L22.5 14.3 Q19.95 14.4 19.95 16.3 19.95 17.15 20.9 17.15 L21.6 17.05 21.9 16.85 21.05 16.65 21.0 16.3 21.3 15.7 Q21.6 15.3 21.95 15.3 L23.55 15.6 Q24.3 16.1 24.3 16.95 24.3 18.3 23.1 19.1 22.0 19.85 20.3 19.9 19.2 19.95 18.3 18.8 L18.15 18.6 Q17.4 17.5 17.4 16.2 17.4 14.65 19.5 13.2 21.45 11.85 23.4 11.75 L23.45 11.75 23.9 11.8 Q25.3 11.95 26.7 13.55 28.1 15.15 28.35 16.8 L28.35 17.1 28.35 17.35 28.35 17.55 28.35 17.7 Q28.25 21.15 26.25 23.7 L25.45 24.55 25.15 24.8 Q23.2 26.3 20.05 26.45 L19.55 26.45 18.35 26.05 Q17.55 25.75 15.7 23.5 L14.65 22.25 Q13.2 20.55 12.45 19.1 11.4 17.2 11.2 15.1 L11.1 13.75 11.1 13.4 Q11.2 11.05 13.05 8.85 L14.1 7.65 14.3 7.55 14.25 7.5 Q15.85 5.95 17.65 5.15 M13.9 24.0 Q13.9 25.1 14.5 26.25 L15.4 27.6 Q13.95 27.7 11.3 29.4 L10.45 30.0 10.65 30.65 Q10.65 31.25 10.0 31.8 L10.45 32.15 10.5 32.85 10.25 33.75 10.2 33.8 Q9.8 34.4 9.05 34.4 8.45 34.4 7.85 33.7 L7.8 33.65 Q7.25 33.1 7.2 32.7 L6.0 34.35 7.05 35.15 7.1 35.2 Q7.65 36.05 7.65 37.1 7.65 37.7 7.35 37.85 L6.6 38.0 6.4 38.0 Q5.1 37.9 4.5 36.7 L3.55 37.45 3.4 37.6 Q2.3 38.4 1.55 38.45 0.65 38.45 0.05 38.05 L0.0 37.65 Q0.0 36.5 0.45 35.3 1.2 33.2 3.3 31.1 L2.85 32.05 3.3 32.8 Q8.55 28.85 8.55 27.85 L8.5 27.6 8.4 27.65 7.65 27.55 7.35 27.6 Q11.0 25.0 13.9 24.0 M25.2 37.2 L23.25 37.5 Q21.05 37.6 20.2 36.75 L18.3 34.05 20.1 34.4 23.4 35.25 23.55 35.3 23.65 35.4 24.6 36.0 24.8 36.15 25.2 37.2 M9.6 30.7 L9.55 30.65 9.5 30.65 Q8.15 30.05 8.55 29.65 L7.05 30.9 5.85 31.85 6.3 32.8 7.35 32.3 Q7.55 32.15 7.8 32.05 L8.0 31.9 8.1 31.85 Q9.2 31.35 9.6 30.7 M10.0 31.8 L9.9 31.7 9.9 31.85 10.0 31.8 M4.2 42.85 L4.25 43.0 5.2 44.65 Q5.8 45.5 6.45 45.8 L6.55 45.95 6.25 46.6 5.4 47.2 5.95 47.8 6.0 48.7 5.85 49.7 Q4.8 50.05 4.3 47.35 L3.95 44.7 3.9 43.65 4.05 42.7 4.2 42.85 M34.05 30.25 L34.3 30.2 34.2 30.25 34.05 30.25" fill="#e0cdcd" fill-rule="evenodd" stroke="none"/>
    <path d="M38.85 9.9 Q39.7 10.55 40.35 11.9 L40.4 12.05 Q41.45 14.35 41.45 16.85 41.45 20.75 39.25 24.5 L37.5 27.1 34.4 30.1 37.8 28.55 35.0 31.55 33.8 32.5 31.35 34.35 31.2 34.4 29.5 35.05 31.4 33.25 Q32.45 32.0 33.05 29.9 L31.65 30.8 29.85 31.55 29.85 31.4 31.0 30.0 Q31.7 29.05 31.65 28.25 L27.2 31.65 Q24.3 33.65 22.4 33.65 L21.9 33.6 21.45 33.65 23.55 35.3 23.4 35.25 20.1 34.4 18.3 34.05 20.2 36.75 Q21.05 37.6 23.25 37.5 L25.2 37.2 25.2 37.4 Q25.2 38.55 24.0 38.6 20.25 38.75 15.55 35.15 13.05 33.15 11.65 31.35 L12.15 32.4 12.5 33.4 12.55 33.6 Q12.4 34.4 11.65 35.15 L10.95 35.7 9.65 36.05 Q9.35 36.05 8.6 35.45 L7.65 34.7 Q8.75 36.75 9.45 37.3 L8.85 36.8 9.15 37.5 9.4 38.3 Q8.95 39.5 7.25 39.5 L6.3 39.2 5.75 38.9 4.5 38.15 4.8 39.2 4.9 39.55 5.35 40.1 5.25 41.35 Q5.25 42.55 5.55 43.75 L5.85 44.65 6.35 45.35 6.45 45.35 7.2 45.6 7.5 46.15 7.45 46.75 Q7.3 46.95 6.75 47.0 7.8 48.9 7.8 49.85 7.8 51.1 6.45 51.15 5.05 51.2 4.15 50.45 L3.85 50.1 3.7 50.0 3.15 48.3 2.05 44.8 1.25 42.25 0.2 39.3 0.05 38.05 Q0.65 38.45 1.55 38.45 2.3 38.4 3.4 37.6 L3.55 37.45 4.5 36.7 Q5.1 37.9 6.4 38.0 L6.6 38.0 7.35 37.85 Q7.65 37.7 7.65 37.1 7.65 36.05 7.1 35.2 L7.05 35.15 6.0 34.35 7.2 32.7 Q7.25 33.1 7.8 33.65 L7.85 33.7 Q8.45 34.4 9.05 34.4 9.8 34.4 10.2 33.8 L10.25 33.75 10.5 32.85 10.45 32.15 10.0 31.8 Q10.65 31.25 10.65 30.65 L10.45 30.0 11.3 29.4 Q13.95 27.7 15.4 27.6 L14.5 26.25 Q13.9 25.1 13.9 24.0 L14.0 23.95 14.55 23.8 15.9 26.05 Q16.95 27.35 18.9 27.35 20.45 27.35 22.6 26.45 24.55 25.6 25.15 24.8 L25.45 24.55 26.25 23.7 Q28.25 21.15 28.35 17.7 L28.35 17.55 28.35 17.35 28.35 17.1 28.35 16.8 28.35 15.9 Q28.35 12.85 26.4 11.1 24.75 9.6 22.5 9.6 20.35 9.6 18.45 11.7 16.65 13.65 16.65 15.45 16.65 16.15 17.25 17.25 L18.15 18.6 18.3 18.8 Q19.2 19.95 20.3 19.9 22.0 19.85 23.1 19.1 24.3 18.3 24.3 16.95 24.3 16.1 23.55 15.6 L21.95 15.3 Q21.6 15.3 21.3 15.7 L21.0 16.3 21.05 16.65 21.9 16.85 21.6 17.05 20.9 17.15 Q19.95 17.15 19.95 16.3 19.95 14.4 22.5 14.3 L23.85 14.65 Q24.2 14.8 24.45 15.15 L25.0 16.15 Q25.5 17.1 25.5 17.9 25.5 19.65 23.55 21.0 21.6 22.35 19.2 22.35 17.2 22.35 15.45 19.65 13.65 16.95 13.65 13.85 13.65 12.45 14.3 10.75 L15.1 9.2 16.1 8.1 16.95 6.4 17.65 5.15 18.15 4.9 18.45 4.8 19.85 4.65 Q21.25 4.55 23.9 5.85 L23.95 5.9 Q26.25 7.1 27.45 8.1 28.9 9.5 29.9 11.25 31.2 13.6 31.2 15.95 L30.95 19.1 32.55 16.45 32.7 16.45 32.7 18.4 Q32.85 22.05 29.25 26.35 L26.55 29.05 26.55 29.2 26.65 29.15 Q28.85 27.9 30.65 26.05 33.65 23.0 35.35 18.25 L34.9 16.05 36.0 14.7 Q36.95 13.5 36.95 12.4 L36.65 11.45 Q36.35 10.9 35.9 10.95 35.4 10.95 35.0 11.35 34.7 11.75 34.7 12.2 L34.8 12.75 35.15 13.0 35.65 12.9 35.9 12.3 35.7 13.0 35.15 13.3 Q34.2 13.35 34.2 12.2 34.2 11.5 34.95 10.8 35.6 10.25 36.05 10.2 37.1 10.15 37.75 11.0 38.35 11.75 38.25 12.7 L38.7 11.9 38.95 11.3 39.0 10.9 38.85 9.9 M43.3 44.4 L42.7 46.25 42.8 47.5 42.8 47.9 Q40.05 51.4 38.7 51.45 L37.75 51.25 37.35 50.6 37.85 49.85 37.8 49.85 Q38.35 49.3 39.05 48.95 L39.0 48.85 38.15 49.1 37.5 48.9 37.2 48.65 Q37.35 48.3 37.9 48.05 L38.25 47.85 Q39.45 47.5 39.5 47.0 L39.9 45.1 40.25 43.4 40.35 43.0 40.75 39.95 40.75 39.9 39.8 36.95 38.5 34.15 38.0 34.8 Q37.45 35.45 36.9 35.45 L36.05 35.15 Q35.6 34.8 35.6 34.2 35.6 33.45 36.25 32.8 36.8 32.3 37.6 32.15 36.75 32.4 36.75 33.2 L36.8 33.8 37.2 33.9 Q38.45 33.9 38.45 32.65 38.45 32.0 37.8 32.1 L38.55 31.4 38.7 31.3 42.3 39.35 42.05 40.95 41.7 42.95 41.3 45.3 43.3 44.4 M14.1 7.65 L14.25 7.5 14.3 7.55 14.1 7.65 M9.6 30.7 L9.5 30.65 9.55 30.65 9.6 30.7 M10.0 31.8 L9.9 31.85 9.9 31.7 10.0 31.8 M4.2 42.85 L4.05 42.7 3.9 43.65 3.95 44.7 4.3 47.35 Q4.8 50.05 5.85 49.7 L6.0 48.7 5.95 47.8 5.4 47.2 6.25 46.6 6.55 45.95 6.45 45.8 Q5.8 45.5 5.2 44.65 L4.25 43.0 4.2 42.85 M34.05 30.25 L34.2 30.25 34.3 30.2 34.05 30.25 M38.95 37.25 L39.6 37.6 Q39.95 37.9 39.95 38.6 L39.65 39.5 Q39.35 39.95 38.9 39.95 38.35 39.95 38.0 39.5 37.7 39.1 37.7 38.6 37.7 37.85 38.05 37.4 L38.45 37.1 38.95 37.25" fill="#d2b6b6" fill-rule="evenodd" stroke="none"/>
    <path d="M40.2 28.35 L41.3 26.6 42.8 23.35 Q44.15 19.7 44.15 17.4 44.15 13.95 41.6 11.05 40.15 9.5 38.9 8.95 L37.5 8.6 Q35.9 8.7 34.5 10.15 L34.05 10.7 M31.35 34.35 L34.15 33.05 34.3 32.95 35.15 32.5 38.05 30.45 38.15 30.35 39.05 29.6 40.2 28.35 41.1 29.15 41.15 29.2 Q42.15 30.15 43.0 31.5 L43.2 31.8 43.9 33.1 Q45.05 35.45 45.05 37.85 L44.8 38.85 44.7 39.35 44.6 39.65 43.75 42.85 43.35 44.15 M43.3 44.4 L42.7 46.25 42.8 47.5 42.8 47.9 Q42.65 49.25 41.6 50.75 40.55 52.45 39.2 52.75 L38.6 52.85 37.4 52.5 Q36.65 52.1 36.65 51.65 L37.1 50.85 37.25 50.65 37.35 50.6 37.85 49.85 37.8 49.85 37.15 49.65 37.1 49.05 37.2 48.65 Q37.35 48.3 37.9 48.05 L38.25 47.85 Q39.45 47.5 39.5 47.0 L39.9 45.1 39.5 41.45 39.3 41.55 38.45 41.6 Q37.85 41.6 37.25 40.7 36.65 39.8 36.65 38.7 36.65 38.0 36.95 37.1 33.8 37.85 33.8 34.55 33.8 33.45 34.15 33.05 L34.3 32.95 M18.45 4.8 Q19.7 4.35 21.05 4.25 25.9 4.05 29.75 7.7 31.4 9.35 32.65 11.25 32.95 11.4 33.25 11.9 L33.65 11.3 34.05 10.7 M34.9 16.05 L35.35 18.25 M18.45 4.8 L18.15 4.9 17.65 5.15 M21.9 16.85 L21.05 16.65 21.0 16.3 21.3 15.7 Q21.6 15.3 21.95 15.3 L23.55 15.6 Q24.3 16.1 24.3 16.95 24.3 18.3 23.1 19.1 22.0 19.85 20.3 19.9 19.2 19.95 18.3 18.8 L18.15 18.6 Q17.4 17.5 17.4 16.2 17.4 14.65 19.5 13.2 21.45 11.85 23.4 11.75 L23.45 11.75 23.9 11.8 Q25.3 11.95 26.7 13.55 28.1 15.15 28.35 16.8 L28.35 17.1 28.35 17.35 28.35 17.55 28.35 17.7 Q28.25 21.15 26.25 23.7 L25.45 24.55 M14.55 23.8 L14.0 23.95 13.9 24.0 M0.05 38.05 L0.2 39.3 1.25 42.25 2.05 44.8 3.15 48.3 3.7 50.0 3.85 50.1 4.15 50.45 Q5.05 51.2 6.45 51.15 7.8 51.1 7.8 49.85 7.8 48.9 6.75 47.0 7.3 46.95 7.45 46.75 L7.5 46.15 7.2 45.6 6.45 45.35 6.35 45.35 5.85 44.65 5.55 43.75 Q5.25 42.55 5.25 41.35 L5.35 40.1 4.9 39.55 M9.4 38.3 L9.15 37.5 8.85 36.8 9.45 37.3 M12.5 33.4 L12.15 32.4 11.65 31.35 Q13.05 33.15 15.55 35.15 20.25 38.75 24.0 38.6 25.2 38.55 25.2 37.4 L25.2 37.2 M23.4 35.25 L23.55 35.3 M29.5 35.05 L31.2 34.4 31.35 34.35 M33.25 11.9 L34.1 13.75 34.9 16.05 M14.1 7.65 L13.05 8.85 Q11.2 11.05 11.1 13.4 L11.1 13.75 11.2 15.1 Q11.4 17.2 12.45 19.1 13.2 20.55 14.65 22.25 L15.7 23.5 Q17.55 25.75 18.35 26.05 L19.55 26.45 20.05 26.45 Q23.2 26.3 25.15 24.8 M14.25 7.5 L14.1 7.65 M14.25 7.5 Q15.85 5.95 17.65 5.15 M15.7 23.5 L14.55 23.8 M12.55 33.6 L12.75 35.0 Q12.75 36.15 12.15 36.95 11.55 37.7 10.8 37.7 L9.65 37.4 9.45 37.3 M3.3 31.1 Q1.2 33.2 0.45 35.3 0.0 36.5 0.0 37.65 L0.05 38.05 M3.7 30.7 L6.0 28.65 6.6 28.2 7.35 27.6 Q11.0 25.0 13.9 24.0 M9.4 38.3 L9.45 38.6 Q9.45 40.85 7.55 40.85 L5.85 40.4 5.35 40.1 M1.25 42.25 L0.4 40.15 0.2 39.3 M23.65 35.4 L24.6 36.0 24.8 36.15 Q26.9 35.9 29.5 35.05 M24.8 36.15 L25.2 37.2" fill="none" stroke="#a36a6a" stroke-linecap="round" stroke-linejoin="round" stroke-opacity="0.6" stroke-width="0.05"/>
    <path d="M35.15 13.0 L34.8 12.75 34.7 12.2 Q34.7 11.75 35.0 11.35 35.4 10.95 35.9 10.95 36.35 10.9 36.65 11.45 L36.95 12.4 Q36.95 13.5 36.0 14.7 L34.9 16.05" fill="none" stroke="#a36a6a" stroke-linecap="round" stroke-linejoin="round" stroke-opacity="0.4627451" stroke-width="0.05"/>
  </g>
</svg>
