<?xml version="1.0" encoding="UTF-8" standalone="no"?>
<svg xmlns:xlink="http://www.w3.org/1999/xlink" height="55.55px" width="71.2px" xmlns="http://www.w3.org/2000/svg">
  <g transform="matrix(1.0, 0.0, 0.0, 1.0, 39.05, 59.05)">
    <path d="M16.85 -5.75 L3.55 -15.6 -3.35 -59.05 6.1 -43.05 16.85 -5.75" fill="url(#gradient0)" fill-rule="evenodd" stroke="none"/>
    <path d="M32.15 -15.0 L19.65 -6.55 -21.65 -3.5 -39.05 -9.4 32.15 -15.0" fill="url(#gradient1)" fill-rule="evenodd" stroke="none"/>
    <path d="M-39.05 -9.4 L-3.35 -59.05 3.55 -15.6 -39.05 -9.4" fill="url(#gradient2)" fill-rule="evenodd" stroke="none"/>
  </g>
  <defs>
    <linearGradient gradientTransform="matrix(0.0, 0.0, 0.0, 0.0, 0.0, 0.0)" gradientUnits="userSpaceOnUse" id="gradient0" spreadMethod="pad" x1="-819.2" x2="819.2">
      <stop offset="0.0" stop-color="#ab7d66"/>
      <stop offset="0.5411764705882353" stop-color="#8f6650"/>
      <stop offset="1.0" stop-color="#876f64"/>
    </linearGradient>
    <linearGradient gradientTransform="matrix(-0.0054, 0.0216, -0.0099, -0.0023, -6.9, 1.3)" gradientUnits="userSpaceOnUse" id="gradient1" spreadMethod="pad" x1="-819.2" x2="819.2">
      <stop offset="0.0" stop-color="#ab5428"/>
      <stop offset="0.5411764705882353" stop-color="#7d492b"/>
      <stop offset="1.0" stop-color="#7d685d"/>
    </linearGradient>
    <linearGradient gradientTransform="matrix(-0.0038, -0.0738, 0.1054, -0.0108, 43.05, -35.6)" gradientUnits="userSpaceOnUse" id="gradient2" spreadMethod="pad" x1="-819.2" x2="819.2">
      <stop offset="0.0" stop-color="#e35202"/>
      <stop offset="0.36470588235294116" stop-color="#ed8e02"/>
      <stop offset="0.6980392156862745" stop-color="#ede102"/>
      <stop offset="1.0" stop-color="#fefda3"/>
    </linearGradient>
  </defs>
</svg>
