<?xml version="1.0" encoding="UTF-8" standalone="no"?>
<svg xmlns:xlink="http://www.w3.org/1999/xlink" height="16.45px" width="39.05px" xmlns="http://www.w3.org/2000/svg">
  <g transform="matrix(1.0, 0.0, 0.0, 1.0, 19.5, 8.25)">
    <path d="M17.7 -4.15 L17.2 -2.9 Q16.65 -1.65 15.8 -1.4 L13.4 -0.45 10.75 0.3 9.45 -0.2 9.35 -0.25 8.2 -0.7 6.75 -0.5 6.1 -0.6 6.2 -1.0 Q12.6 -2.0 17.2 -5.5 L17.7 -4.15" fill="#f2eaea" fill-rule="evenodd" stroke="none"/>
    <path d="M6.2 -1.0 L6.1 -0.6 6.75 -0.5 8.2 -0.7 9.35 -0.25 9.45 -0.2 10.75 0.3 13.4 -0.45 15.8 -1.4 Q16.65 -1.65 17.2 -2.9 L17.7 -4.15 18.4 -2.55 18.85 -1.6 16.75 -0.15 14.5 1.1 Q10.65 2.8 8.4 2.8 L5.9 2.6 5.15 1.95 4.95 1.65 4.0 0.5 1.45 0.1 Q-0.35 0.05 -0.9 -0.5 L-0.7 -0.6 6.2 -1.0" fill="#e0cdcd" fill-rule="evenodd" stroke="none"/>
    <path d="M-0.7 -0.6 L-0.9 -0.5 Q-0.35 0.05 1.45 0.1 L4.0 0.5 4.95 1.65 5.15 1.95 5.9 2.6 8.4 2.8 Q10.65 2.8 14.5 1.1 L16.75 -0.15 18.85 -1.6 19.55 0.05 Q11.9 4.75 3.0 5.5 2.3 4.8 1.3 4.25 L1.15 4.2 -1.6 2.8 Q-2.2 2.45 -3.4 -0.75 L-0.7 -0.6 M-14.35 -4.0 L-15.1 -4.3 Q-15.5 -4.3 -16.85 -1.85 L-17.75 -0.2 -19.5 -2.65 -19.1 -4.15 -18.0 -8.25 Q-16.85 -5.7 -14.35 -4.0" fill="#d2b6b6" fill-rule="evenodd" stroke="none"/>
    <path d="M-3.4 -0.75 Q-2.2 2.45 -1.6 2.8 L1.15 4.2 1.3 4.25 Q2.3 4.8 3.0 5.5 -0.15 5.75 -3.4 5.55 -13.2 4.8 -17.75 -0.2 L-16.85 -1.85 Q-15.5 -4.3 -15.1 -4.3 L-14.35 -4.0 Q-10.5 -1.35 -3.4 -0.75" fill="#c29c9c" fill-rule="evenodd" stroke="none"/>
    <path d="M17.7 -4.15 L17.2 -5.5 Q12.6 -2.0 6.2 -1.0 L-0.7 -0.6 -3.4 -0.75 Q-10.5 -1.35 -14.35 -4.0 -16.85 -5.7 -18.0 -8.25 L-19.1 -4.15 -19.5 -2.65 -17.75 -0.2 Q-13.2 4.8 -3.4 5.55 -0.15 5.75 3.0 5.5 11.9 4.75 19.55 0.05 L18.85 -1.6 18.4 -2.55 17.7 -4.15 Z" fill="none" stroke="#a36a6a" stroke-linecap="round" stroke-linejoin="round" stroke-opacity="0.4" stroke-width="0.05"/>
    <path d="M-9.1 -2.55 L-10.05 -0.2 Q-11.25 3.35 -12.3 3.05 -13.35 2.55 -13.3 0.0 L-13.05 -3.25 -12.15 -5.4 -12.05 -5.45 -9.2 -5.6 -8.9 -5.45 -9.1 -2.55 M-10.95 -1.45 Q-11.1 -1.9 -11.6 -1.95 -12.05 -2.0 -12.35 -1.45 L-12.6 -0.5 -12.6 0.2 -12.6 0.55 -12.05 0.9 -12.0 0.9 -11.9 0.9 Q-10.95 0.9 -10.8 -0.65 L-10.9 -1.35 -10.95 -1.45" fill="#e0cdcd" fill-rule="evenodd" stroke="none"/>
    <path d="M-10.95 -1.45 L-10.9 -1.35 -10.8 -0.65 Q-10.95 0.9 -11.9 0.9 L-12.0 0.9 -12.05 0.9 -12.6 0.55 -12.6 0.2 -12.6 -0.5 -12.35 -1.45 Q-12.05 -2.0 -11.6 -1.95 -11.1 -1.9 -10.95 -1.45" fill="#a36a6a" fill-rule="evenodd" stroke="none"/>
    <path d="M-14.0 6.2 L-14.15 5.75 -14.2 5.15 -14.2 4.9 -14.25 4.8 -14.1 3.0 -13.75 -0.35 -13.05 -3.25 -13.3 0.0 Q-13.35 2.55 -12.3 3.05 -11.25 3.35 -10.05 -0.2 L-9.1 -2.55 -9.5 1.55 Q-10.45 7.55 -13.1 6.95 L-13.9 6.05 -14.0 6.2 M-8.9 -5.45 Q-7.7 -5.15 -7.25 -4.3 L-7.25 -3.0 -7.3 -3.0 Q-7.4 -3.65 -8.05 -3.7 -8.45 -3.8 -9.1 -2.55 L-8.9 -5.45" fill="#d2b6b6" fill-rule="evenodd" stroke="none"/>
    <path d="M-14.0 6.2 L-13.9 6.05 -13.1 6.95 Q-10.45 7.55 -9.5 1.55 L-9.1 -2.55 Q-8.45 -3.8 -8.05 -3.7 -7.4 -3.65 -7.3 -3.0 L-7.2 -2.85 -7.2 -2.2 -7.55 0.75 Q-8.05 4.1 -9.05 6.05 L-9.2 6.35 Q-10.35 8.1 -12.0 7.75 -13.65 7.4 -14.0 6.2" fill="#c29c9c" fill-rule="evenodd" stroke="none"/>
    <path d="M-13.05 -3.25 L-13.75 -0.35 -14.1 3.0 -14.25 4.8 -14.2 4.9 -14.2 5.15 -14.15 5.75 -14.0 6.2 M-9.1 -2.55 L-10.05 -0.2 Q-11.25 3.35 -12.3 3.05 -13.35 2.55 -13.3 0.0 L-13.05 -3.25 -12.15 -5.4 -12.05 -5.45 -9.2 -5.6 -8.9 -5.45 Q-7.7 -5.15 -7.25 -4.3 L-7.25 -3.0 -7.2 -2.85 -7.2 -2.2 -7.55 0.75 Q-8.05 4.1 -9.05 6.05 L-9.2 6.35 Q-10.35 8.1 -12.0 7.75 -13.65 7.4 -14.0 6.2 M-7.3 -3.0 L-7.2 -2.85 M-9.1 -2.55 Q-8.45 -3.8 -8.05 -3.7 -7.4 -3.65 -7.3 -3.0" fill="none" stroke="#a36a6a" stroke-linecap="round" stroke-linejoin="round" stroke-opacity="0.49803922" stroke-width="0.05"/>
    <path d="M-5.55 -0.3 L-5.6 -0.35 Q-5.85 -0.75 -6.25 -0.75 L-6.9 -0.2 -7.05 0.7 -6.95 1.35 -6.9 1.7 -6.4 1.95 -6.3 1.95 Q-5.4 1.85 -5.4 0.35 -5.4 0.05 -5.55 -0.3 M-7.7 -1.75 L-7.05 -3.85 -7.05 -3.9 Q-6.2 -4.5 -4.5 -4.3 L-4.2 -4.2 -4.1 -1.55 -4.7 0.7 Q-5.45 4.1 -6.4 3.9 -7.35 3.6 -7.6 1.2 L-7.7 -1.75" fill="#e0cdcd" fill-rule="evenodd" stroke="none"/>
    <path d="M-5.55 -0.3 Q-5.4 0.05 -5.4 0.35 -5.4 1.85 -6.3 1.95 L-6.4 1.95 -6.9 1.7 -6.95 1.35 -7.05 0.7 -6.9 -0.2 -6.25 -0.75 Q-5.85 -0.75 -5.6 -0.35 L-5.55 -0.3" fill="#a36a6a" fill-rule="evenodd" stroke="none"/>
    <path d="M-4.2 -4.2 Q-3.1 -4.05 -2.6 -3.35 L-2.45 -2.15 -2.5 -2.15 Q-2.7 -2.75 -3.3 -2.7 -3.65 -2.75 -4.1 -1.55 L-4.05 2.3 Q-4.35 7.85 -6.7 7.55 L-7.5 6.8 -7.65 6.95 -7.8 6.6 -7.9 6.05 -7.95 5.8 -7.95 5.7 -8.0 4.05 -8.0 0.9 -7.7 -1.75 -7.6 1.2 Q-7.35 3.6 -6.4 3.9 -5.45 4.1 -4.7 0.7 L-4.1 -1.55 -4.2 -4.2" fill="#d2b6b6" fill-rule="evenodd" stroke="none"/>
    <path d="M-2.4 -2.0 L-2.4 -1.4 -2.4 1.35 Q-2.55 4.45 -3.15 6.35 L-3.3 6.65 Q-4.2 8.35 -5.7 8.2 -7.15 8.0 -7.65 6.95 L-7.5 6.8 -6.7 7.55 Q-4.35 7.85 -4.05 2.3 L-4.1 -1.55 Q-3.65 -2.75 -3.3 -2.7 -2.7 -2.75 -2.5 -2.15 L-2.4 -2.0" fill="#c29c9c" fill-rule="evenodd" stroke="none"/>
    <path d="M-7.7 -1.75 L-7.05 -3.85 -7.05 -3.9 Q-6.2 -4.5 -4.5 -4.3 L-4.2 -4.2 Q-3.1 -4.05 -2.6 -3.35 L-2.45 -2.15 -2.4 -2.0 -2.4 -1.4 -2.4 1.35 Q-2.55 4.45 -3.15 6.35 L-3.3 6.65 Q-4.2 8.35 -5.7 8.2 -7.15 8.0 -7.65 6.95 L-7.8 6.6 -7.9 6.05 -7.95 5.8 -7.95 5.7 -8.0 4.05 -8.0 0.9 -7.7 -1.75 -7.6 1.2 Q-7.35 3.6 -6.4 3.9 -5.45 4.1 -4.7 0.7 L-4.1 -1.55 Q-3.65 -2.75 -3.3 -2.7 -2.7 -2.75 -2.5 -2.15 L-2.4 -2.0" fill="none" stroke="#a36a6a" stroke-linecap="round" stroke-linejoin="round" stroke-opacity="0.49803922" stroke-width="0.05"/>
  </g>
</svg>
