<?xml version="1.0" encoding="UTF-8" standalone="no"?>
<svg xmlns:xlink="http://www.w3.org/1999/xlink" height="53.2px" width="65.75px" xmlns="http://www.w3.org/2000/svg">
  <g transform="matrix(1.0, 0.0, 0.0, 1.0, 36.35, 26.8)">
    <path d="M-7.05 -7.75 L-7.8 -5.6 -7.8 -5.45 6.5 2.1 7.7 1.75 8.0 1.7 12.1 0.55 Q14.75 0.15 14.6 1.85 L13.6 2.85 13.9 3.7 13.7 5.9 23.6 11.0 21.95 8.5 20.2 5.75 16.0 -0.4 -7.05 -7.75 M-10.15 1.2 L-11.5 5.05 -1.3 14.2 -1.05 13.7 Q-2.45 12.75 -3.5 10.85 L-4.5 9.3 -5.4 6.85 -7.15 6.75 Q-7.95 6.7 -8.35 6.25 -8.85 5.85 -8.8 5.3 -8.7 4.05 -6.95 3.65 L-10.15 1.2 M-12.45 7.65 L-14.55 13.45 -18.05 23.05 Q-17.6 23.35 -17.2 23.6 L-7.05 21.7 -5.3 21.3 -12.45 7.65 M4.3 19.15 L6.45 18.7 11.55 17.35 8.65 15.15 8.7 15.7 8.55 16.4 6.9 16.7 6.65 16.7 Q5.55 16.4 5.6 14.95 L4.3 15.1 2.25 15.0 1.9 15.0 1.5 16.05 1.25 16.35 4.3 19.15" fill="#94b7af" fill-rule="evenodd" stroke="none"/>
    <path d="M-3.6 -18.05 L-5.3 -13.05 -5.65 -11.7 9.05 -5.7 -3.6 -18.05 M21.9 14.45 L23.15 14.15 25.2 13.5 24.8 12.95 13.6 6.8 13.65 7.5 13.3 8.7 21.9 14.45 M4.3 2.55 L4.55 2.45 5.5 2.3 -2.1 -1.65 4.3 2.55" fill="#d7f0d5" fill-rule="evenodd" stroke="none"/>
    <path d="M-8.45 -3.6 L-8.75 -2.7 -10.15 1.2 -6.95 3.65 -4.3 3.2 -0.1 3.05 0.55 3.0 0.8 2.55 -8.45 -3.6 M-11.5 5.05 L-12.45 7.65 -5.3 21.3 3.95 19.25 4.3 19.15 1.25 16.35 Q0.6 17.0 -0.2 16.95 -1.0 16.85 -1.3 16.25 L-1.4 15.1 -1.3 14.2 -11.5 5.05 M11.55 17.35 L19.45 15.15 14.8 12.25 Q14.4 12.85 13.15 12.75 12.15 12.65 11.1 11.75 L10.75 12.15 8.05 14.1 8.35 14.45 8.65 15.15 11.55 17.35" fill="#7da2a1" fill-rule="evenodd" stroke="none"/>
    <path d="M-2.05 -24.0 Q-1.95 -23.2 -3.6 -18.05 L9.05 -5.7 -5.65 -11.7 -6.95 -7.9 -7.05 -7.75 16.0 -0.4 13.45 -3.8 11.95 -6.1 11.8 -6.25 9.1 -9.95 7.8 -11.8 7.2 -12.65 6.9 -13.0 -2.05 -24.0 M-7.8 -5.45 L-7.95 -4.9 -8.45 -3.6 0.8 2.55 1.2 2.95 4.3 2.55 -2.1 -1.65 5.5 2.3 6.5 2.1 -7.8 -5.45 M19.45 15.15 L20.15 14.95 21.9 14.45 13.3 8.7 12.8 9.7 Q15.0 10.1 14.9 11.55 L14.95 11.9 14.8 12.25 19.45 15.15 M24.8 12.95 L23.6 11.0 13.7 5.9 13.6 6.8 24.8 12.95" fill="#c2e0ca" fill-rule="evenodd" stroke="none"/>
    <path d="M-6.95 3.65 Q-8.7 4.05 -8.8 5.3 -8.85 5.85 -8.35 6.25 -7.95 6.7 -7.15 6.75 L-5.4 6.85 -4.5 9.3 -3.5 10.85 Q-2.45 12.75 -1.05 13.7 L-1.3 14.2 -1.4 15.1 -1.3 16.25 Q-1.0 16.85 -0.2 16.95 0.6 17.0 1.25 16.35 L1.5 16.05 1.9 15.0 2.25 15.0 4.3 15.1 5.6 14.95 Q5.55 16.4 6.65 16.7 L6.9 16.7 8.55 16.4 8.7 15.7 8.65 15.15 8.35 14.45 8.05 14.1 10.75 12.15 11.1 11.75 Q12.15 12.65 13.15 12.75 14.4 12.85 14.8 12.25 L14.95 11.9 14.9 11.55 Q15.0 10.1 12.8 9.7 L13.3 8.7 13.65 7.5 13.6 6.8 13.7 5.9 13.9 3.7 13.6 2.85 14.6 1.85 Q14.75 0.15 12.1 0.55 L8.0 1.7 7.7 1.75 6.5 2.1 5.5 2.3 4.55 2.45 4.3 2.55 1.2 2.95 0.55 3.0 -0.1 3.05 -4.3 3.2 -6.95 3.65 M4.95 5.45 L5.2 5.45 5.4 5.35 Q6.15 7.45 6.05 8.45 5.95 9.15 5.4 9.1 4.95 9.05 4.5 6.75 L4.3 5.6 4.5 5.65 4.6 5.5 4.95 5.45 M7.2 7.55 L7.2 7.1 6.95 5.95 7.05 5.05 7.7 4.95 9.25 4.45 10.4 4.0 11.5 3.75 11.6 4.7 11.7 4.95 11.55 5.7 11.2 7.0 11.2 7.25 10.3 9.0 9.95 9.4 Q8.75 11.25 7.1 12.0 L5.0 12.45 4.55 12.5 2.75 12.6 Q0.25 12.35 -1.85 8.9 L-1.95 8.6 -2.9 6.75 -2.6 6.8 2.9 5.8 Q2.95 6.6 3.3 7.65 L3.45 8.0 Q4.2 9.8 5.45 9.9 L5.9 9.95 Q6.05 9.8 6.15 9.8 L6.85 9.25 7.1 8.35 7.15 8.0 7.15 7.9 7.2 7.55" fill="#000000" fill-rule="evenodd" stroke="none"/>
    <path d="M-14.55 13.45 L-18.2 17.05 -21.95 20.65 -19.55 22.1 -18.05 23.05 -14.55 13.45 M-9.7 -14.8 L-2.4 -24.15 -7.9 -22.2 -8.95 -21.85 -11.65 -20.85 -15.2 -15.6 -16.25 -13.95 -17.45 -12.15 -18.4 -10.6 -19.35 -9.05 -20.4 -7.25 -20.7 -6.8 -22.15 -4.3 -27.6 5.1 -32.9 14.65 -32.8 14.75 -9.7 -14.8" fill="#61818e" fill-rule="evenodd" stroke="none"/>
    <path d="M-2.4 -24.15 L-2.05 -24.0 -2.1 -24.25 -2.4 -24.15" fill="#5f5e43" fill-rule="evenodd" stroke="none"/>
    <path d="M-2.05 -24.0 L-2.4 -24.15 -9.7 -14.8 -18.2 17.05 -14.55 13.45 -12.45 7.65 -11.5 5.05 -10.15 1.2 -8.75 -2.7 -8.45 -3.6 -7.95 -4.9 -7.8 -5.45 -7.8 -5.6 -7.05 -7.75 -6.95 -7.9 -5.65 -11.7 -5.3 -13.05 -3.6 -18.05 Q-1.95 -23.2 -2.05 -24.0" fill="#537379" fill-rule="evenodd" stroke="none"/>
    <path d="M4.95 5.45 L4.6 5.5 4.5 5.65 4.3 5.6 4.5 6.75 Q4.95 9.05 5.4 9.1 5.95 9.15 6.05 8.45 6.15 7.45 5.4 5.35 L5.2 5.45 4.95 5.45" fill="#475c33" fill-rule="evenodd" stroke="none"/>
    <path d="M11.2 7.0 L11.55 5.7 11.7 4.95 11.6 4.7 11.5 3.75 10.4 4.0 9.25 4.45 7.7 4.95 7.05 5.05 6.95 5.95 7.2 7.1 7.2 7.55 11.2 7.0 M3.45 8.0 L3.3 7.65 Q2.95 6.6 2.9 5.8 L-2.6 6.8 -2.9 6.75 -1.95 8.6 -1.85 8.9 3.45 8.0" fill="#b1bfde" fill-rule="evenodd" stroke="none"/>
    <path d="M7.2 7.55 L7.15 7.9 7.15 8.0 7.1 8.35 6.85 9.25 6.15 9.8 Q6.05 9.8 5.9 9.95 L5.45 9.9 Q4.2 9.8 3.45 8.0 L-1.85 8.9 Q0.25 12.35 2.75 12.6 L4.55 12.5 5.0 12.45 7.1 12.0 Q8.75 11.25 9.95 9.4 L10.3 9.0 11.2 7.25 11.2 7.0 7.2 7.55" fill="#ffffff" fill-rule="evenodd" stroke="none"/>
    <path d="M0.55 3.0 L1.2 2.95 0.8 2.55 0.55 3.0" fill="#bfbfa6" fill-rule="evenodd" stroke="none"/>
    <path d="M-32.9 14.65 L-33.05 15.0 -33.15 15.35 -32.8 14.75 -32.9 14.65" fill="#81805c" fill-rule="evenodd" stroke="none"/>
    <path d="M-18.2 17.05 L-9.7 -14.8 -32.8 14.75 -33.15 15.35 -32.95 15.35 -32.2 15.6 Q-28.25 17.15 -24.2 19.3 L-21.95 20.65 -18.2 17.05" fill="#6f8e96" fill-rule="evenodd" stroke="none"/>
    <path d="M-32.9 14.65 L-27.6 5.1 -22.15 -4.3 -20.7 -6.8 -20.4 -7.25 -19.35 -9.05 -18.4 -10.6 -17.45 -12.15 -16.25 -13.95 -15.2 -15.6 -11.65 -20.85 -8.95 -21.85 -7.9 -22.2 -2.4 -24.15 -2.1 -24.25 -2.05 -24.0 6.9 -13.0 7.2 -12.65 7.8 -11.8 9.1 -9.95 11.8 -6.25 11.95 -6.1 13.45 -3.8 16.0 -0.4 20.2 5.75 21.95 8.5 23.6 11.0 24.8 12.95 25.2 13.5 23.15 14.15 21.9 14.45 20.15 14.95 19.45 15.15 11.55 17.35 6.45 18.7 4.3 19.15 3.95 19.25 -5.3 21.3 -7.05 21.7 -17.2 23.6 Q-17.6 23.35 -18.05 23.05 L-19.55 22.1 -21.95 20.65 -24.2 19.3 Q-28.25 17.15 -32.2 15.6 L-17.0 26.4 Q6.25 19.75 29.4 13.25 L-0.6 -26.8 -12.25 -23.05 -36.35 12.75 Q-34.65 13.85 -33.05 15.0 L-32.9 14.65" fill="#aeddeb" fill-opacity="0.21176471" fill-rule="evenodd" stroke="none"/>
  </g>
</svg>
