<?xml version="1.0" encoding="UTF-8" standalone="no"?>
<svg xmlns:xlink="http://www.w3.org/1999/xlink" height="59.1px" width="58.0px" xmlns="http://www.w3.org/2000/svg">
  <g transform="matrix(1.0, 0.0, 0.0, 1.0, 28.65, 27.3)">
    <path d="M-16.75 -13.4 Q-13.55 -14.8 -11.05 -15.4 -6.15 -17.4 3.1 -17.4 6.8 -17.4 8.8 -16.0 L14.15 -14.55 20.8 -13.5 23.65 -12.3 16.4 -6.6 13.3 -5.4 Q10.6 -4.35 -0.45 -2.55 -10.8 -6.35 -21.15 -10.3 L-16.75 -13.4" fill="#f7d701" fill-rule="evenodd" stroke="none"/>
    <path d="M18.65 -2.2 Q19.85 -0.9 22.45 6.0 21.75 9.2 21.4 12.3 L12.95 19.05 11.9 18.35 Q10.6 17.5 9.85 16.55 L9.4 15.75 9.65 4.55 18.65 -2.2" fill="#c87e08" fill-rule="evenodd" stroke="none"/>
    <path d="M-22.6 -2.8 L3.8 7.05 3.8 23.6 -3.55 20.75 -5.1 17.9 Q-5.95 16.1 -7.0 15.4 -14.75 10.05 -17.25 6.1 L-22.6 -2.8" fill="#f09a0f" fill-rule="evenodd" stroke="none"/>
    <path d="M-16.75 -13.4 L-21.15 -10.3 Q-10.8 -6.35 -0.45 -2.55 L-1.9 -2.3 Q-4.65 -2.3 -8.2 -3.75 -11.65 -5.2 -17.1 -5.2 L-17.25 -5.05 -25.45 -8.4 Q-20.65 -11.6 -16.75 -13.4 M16.4 -6.6 L23.65 -12.3 20.8 -13.5 27.35 -12.9 22.35 -9.0 16.4 -6.6" fill="#ffb700" fill-rule="evenodd" stroke="none"/>
    <path d="M-26.4 -8.75 L-25.45 -8.4 -17.25 -5.05 -13.65 -3.75 Q-7.6 -1.25 -1.4 1.1 -0.25 2.8 3.55 4.95 4.5 5.75 5.25 7.65 L5.85 9.45 5.85 10.85 5.85 28.0 0.6 25.75 -1.9 22.85 -3.55 20.75 3.8 23.6 3.8 7.05 -22.6 -2.8 -25.2 -6.85 -25.9 -8.15 -26.4 -8.75 M6.05 8.6 L5.85 8.15 5.85 4.1 Q6.9 3.25 8.1 2.45 6.3 4.7 6.05 8.6" fill="#f06d17" fill-rule="evenodd" stroke="none"/>
    <path d="M11.3 -0.2 L13.55 -1.15 14.4 -1.35 15.8 -1.85 18.05 -2.55 18.65 -2.2 9.65 4.55 9.4 15.75 6.05 8.6 Q6.3 4.7 8.1 2.45 L8.1 2.3 9.75 1.0 11.3 -0.2 M12.95 19.05 L21.4 12.3 Q21.15 13.6 21.05 15.05 L15.0 20.15 12.95 19.05" fill="#b8500c" fill-rule="evenodd" stroke="none"/>
    <path d="M21.15 -8.05 L23.65 -6.0 18.65 -2.2 18.05 -2.55 15.8 -1.85 14.4 -1.35 13.55 -1.15 11.3 -0.2 21.15 -8.05 M24.6 -5.3 L26.15 -4.1 23.3 13.0 21.05 15.05 Q21.15 13.6 21.4 12.3 L21.85 11.8 24.6 -5.3 M5.85 10.85 L5.85 9.45 5.85 8.15 6.05 8.6 9.4 15.75 9.15 22.05 12.95 19.05 15.0 20.15 10.0 24.55 9.65 23.7 Q7.95 20.4 7.6 18.95 L5.95 11.1 5.85 10.85" fill="#a65527" fill-rule="evenodd" stroke="none"/>
    <path d="M23.65 -6.0 L24.85 -6.95 24.6 -5.3 21.85 11.8 21.4 12.3 Q21.75 9.2 22.45 6.0 19.85 -0.9 18.65 -2.2 L23.65 -6.0 M9.4 15.75 L9.85 16.55 Q10.6 17.5 11.9 18.35 L12.95 19.05 9.15 22.05 9.4 15.75" fill="#ba7c1f" fill-rule="evenodd" stroke="none"/>
    <path d="M-26.6 -8.85 L-26.4 -8.75 -26.6 -8.75 -26.6 -8.85" fill="#c9672a" fill-rule="evenodd" stroke="none"/>
    <path d="M-26.4 -8.75 L-25.9 -8.15 -25.2 -6.85 -22.6 -2.8 -23.65 -3.15 Q-22.2 5.5 -20.9 14.1 L-3.55 20.75 -1.9 22.85 0.6 25.75 -22.2 16.1 -26.6 -8.75 -26.4 -8.75" fill="#e36416" fill-rule="evenodd" stroke="none"/>
    <path d="M-22.6 -2.8 L-17.25 6.1 Q-14.75 10.05 -7.0 15.4 -5.95 16.1 -5.1 17.9 L-3.55 20.75 -20.9 14.1 Q-22.2 5.5 -23.65 -3.15 L-22.6 -2.8" fill="#e68e0d" fill-rule="evenodd" stroke="none"/>
    <path d="M27.35 -12.9 L27.7 -13.25 26.15 -4.1 24.6 -5.3 24.85 -6.95 23.65 -6.0 21.15 -8.05 22.35 -9.0 27.35 -12.9 M5.85 28.0 L5.85 10.85 5.95 11.1 7.6 18.95 Q7.95 20.4 9.65 23.7 L10.0 24.55 5.85 28.0" fill="#964d23" fill-rule="evenodd" stroke="none"/>
    <path d="M-0.45 -2.55 Q10.6 -4.35 13.3 -5.4 L16.4 -6.6 7.35 0.4 -0.45 -2.55" fill="#ffe757" fill-rule="evenodd" stroke="none"/>
    <path d="M22.35 -9.0 L21.15 -8.05 11.3 -0.2 9.75 1.0 8.8 1.5 7.0 2.05 -13.65 -3.75 -17.25 -5.05 -17.1 -5.2 Q-11.65 -5.2 -8.2 -3.75 -4.65 -2.3 -1.9 -2.3 L-0.45 -2.55 7.35 0.4 16.4 -6.6 22.35 -9.0" fill="#ffc900" fill-rule="evenodd" stroke="none"/>
    <path d="M-1.4 1.1 Q-7.6 -1.25 -13.65 -3.75 L7.0 2.05 8.8 1.5 9.75 1.0 8.1 2.3 8.1 2.45 Q6.9 3.25 5.85 4.1 L-1.4 1.1" fill="#fff4cc" fill-rule="evenodd" stroke="none"/>
    <path d="M5.85 9.45 L5.25 7.65 Q4.5 5.75 3.55 4.95 -0.25 2.8 -1.4 1.1 L5.85 4.1 5.85 8.15 5.85 9.45" fill="#ff862b" fill-rule="evenodd" stroke="none"/>
    <path d="M20.8 -13.5 L-2.0 -23.6 -16.75 -13.4 Q-20.65 -11.6 -25.45 -8.4 L-26.4 -8.75 -26.6 -8.85 Q-13.9 -17.4 -1.3 -26.0 13.2 -19.55 27.7 -13.25 L27.35 -12.9 20.8 -13.5" fill="#edaa00" fill-rule="evenodd" stroke="none"/>
    <path d="M20.8 -13.5 L14.15 -14.55 8.8 -16.0 Q6.8 -17.4 3.1 -17.4 -6.15 -17.4 -11.05 -15.4 -13.55 -14.8 -16.75 -13.4 L-2.0 -23.6 20.8 -13.5" fill="#f0ce02" fill-rule="evenodd" stroke="none"/>
    <path d="M27.7 -13.25 Q13.2 -19.55 -1.3 -26.0 -13.9 -17.4 -26.6 -8.85 L-26.6 -8.75 -22.2 16.1 0.6 25.75 5.85 28.0 10.0 24.55 15.0 20.15 21.05 15.05 23.3 13.0 26.15 -4.1 27.7 -13.25 M-16.05 -17.75 L-1.2 -27.3 29.35 -14.35 25.3 13.35 4.9 31.8 -23.65 18.5 -28.65 -10.15 Q-25.05 -11.85 -16.05 -17.75" fill="#fff300" fill-opacity="0.18039216" fill-rule="evenodd" stroke="none"/>
  </g>
</svg>
