<?xml version="1.0" encoding="UTF-8" standalone="no"?>
<svg xmlns:xlink="http://www.w3.org/1999/xlink" height="45.3px" width="55.4px" xmlns="http://www.w3.org/2000/svg">
  <g transform="matrix(1.0, 0.0, 0.0, 1.0, 27.0, 24.95)">
    <use height="43.8" transform="matrix(1.0, 0.0, 0.0, 1.0, -27.0, -24.95)" width="47.7" xlink:href="#shape0"/>
    <use height="7.7" transform="matrix(1.0, 0.0, 0.0, 1.0, 2.7, 11.85)" width="25.7" xlink:href="#shape1"/>
  </g>
  <defs>
    <g id="shape0" transform="matrix(1.0, 0.0, 0.0, 1.0, 27.0, 24.95)">
      <path d="M3.2 -17.3 L3.2 -17.4 7.75 -22.05 Q6.15 -19.65 5.7 -18.75 L5.1 -17.25 Q4.45 -14.5 6.5 -12.1 8.3 -9.85 14.4 -5.15 L15.3 -4.5 17.15 -3.0 Q21.85 1.35 20.35 4.9 19.55 6.7 18.4 8.25 L19.2 5.45 Q19.95 2.3 17.3 -0.7 L16.75 -1.3 Q14.9 -3.1 11.1 -5.8 6.3 -9.15 4.85 -10.75 2.15 -13.55 2.8 -16.25 L3.2 -17.3" fill="#b3b3b3" fill-rule="evenodd" stroke="none"/>
      <path d="M3.2 -17.3 L2.8 -16.25 Q2.15 -13.55 4.85 -10.75 6.3 -9.15 11.1 -5.8 14.9 -3.1 16.75 -1.3 L17.3 -0.7 Q19.95 2.3 19.2 5.45 L18.4 8.25 15.45 10.9 14.3 11.6 12.2 12.65 14.35 10.7 Q16.55 8.45 17.0 6.65 17.45 4.65 15.9 2.1 14.35 -0.5 10.85 -3.65 L5.4 -8.45 Q3.1 -10.7 2.4 -12.3 L2.4 -12.35 2.15 -12.85 1.6 -11.65 0.9 -10.2 Q0.8 -9.75 0.85 -8.5 L0.85 -8.3 0.7 -7.05 0.85 -4.5 0.95 -2.85 0.25 -3.75 -0.55 -5.0 Q-1.15 -6.3 -1.25 -7.65 -1.4 -9.3 -0.95 -11.05 -0.55 -12.75 1.65 -15.5 L3.2 -17.3 M10.35 13.65 L10.15 13.75 10.35 13.6 10.35 13.65" fill="url(#gradient0)" fill-rule="evenodd" stroke="none"/>
      <path d="M12.2 12.65 L12.1 12.8 11.3 13.2 11.65 12.75 Q12.8 11.2 13.05 10.05 13.85 6.7 11.55 4.05 L6.95 -0.1 4.5 -2.25 Q3.3 -3.4 2.8 -4.75 L1.95 -7.55 Q1.5 -9.55 1.85 -11.05 L2.4 -12.25 2.4 -12.3 Q3.1 -10.7 5.4 -8.45 L10.85 -3.65 Q14.35 -0.5 15.9 2.1 17.45 4.65 17.0 6.65 16.55 8.45 14.35 10.7 L12.2 12.65" fill="#8c8c8c" fill-rule="evenodd" stroke="none"/>
      <path d="M11.3 13.2 L10.4 13.6 10.35 13.65 10.35 13.6 11.15 12.75 Q12.5 11.45 12.75 10.55 13.55 7.2 11.1 4.7 9.95 3.5 5.6 0.75 2.45 -1.2 0.95 -2.85 L0.85 -4.5 0.7 -7.05 0.85 -8.3 0.85 -8.5 Q0.8 -9.75 0.9 -10.2 L1.6 -11.65 2.15 -12.85 2.4 -12.35 2.4 -12.3 2.4 -12.25 1.85 -11.05 Q1.5 -9.55 1.95 -7.55 L2.8 -4.75 Q3.3 -3.4 4.5 -2.25 L6.95 -0.1 11.55 4.05 Q13.85 6.7 13.05 10.05 12.8 11.2 11.65 12.75 L11.3 13.2" fill="#a3a3a3" fill-rule="evenodd" stroke="none"/>
      <path d="M-15.15 12.4 L-12.8 11.7 Q-7.9 10.95 -5.2 12.3 -3.15 13.4 -0.9 16.2 L0.4 17.85 0.6 18.15 Q-1.85 16.85 -5.95 17.5 L-10.9 18.3 -11.7 17.25 -14.55 17.05 Q-18.3 16.55 -20.8 15.2 -19.1 15.5 -16.65 14.45 L-15.35 14.0 -14.3 13.55 -15.15 12.4 M-2.35 16.15 Q-5.4 14.35 -7.35 13.9 -9.35 13.4 -14.0 13.95 L-11.85 16.9 -6.6 16.35 -2.35 16.15" fill="#a3a3a3" fill-rule="evenodd" stroke="none"/>
      <path d="M-10.9 18.3 L-14.4 18.85 Q-17.4 19.05 -20.4 17.3 L-21.65 16.45 Q-24.55 14.2 -27.0 10.6 -22.75 13.4 -21.65 13.7 L-20.4 13.55 -18.25 13.2 -15.15 12.4 -14.3 13.55 -15.35 14.0 -16.65 14.45 Q-19.1 15.5 -20.8 15.2 -18.3 16.55 -14.55 17.05 L-11.7 17.25 -10.9 18.3" fill="#b3b3b3" fill-rule="evenodd" stroke="none"/>
      <path d="M-2.35 16.15 L-6.6 16.35 -11.85 16.9 -14.0 13.95 Q-9.35 13.4 -7.35 13.9 -5.4 14.35 -2.35 16.15" fill="#8c8c8c" fill-rule="evenodd" stroke="none"/>
      <path d="M-5.5 -16.75 L-5.4 -16.8 -4.7 -15.95 -1.35 -12.8 0.85 -10.6 1.1 -7.65 1.0 -7.6 -1.0 -11.0 -3.7 -14.1 Q-2.85 -11.45 -4.55 -8.6 -5.5 -6.85 -9.15 -3.1 -12.5 0.55 -13.6 2.7 -15.3 6.1 -13.85 9.45 -12.9 11.6 -10.5 13.65 L-10.25 13.85 -10.35 14.0 -11.55 13.4 -14.8 11.6 -18.95 8.8 -21.45 6.3 -21.75 5.75 -21.8 5.7 -22.0 5.05 Q-20.7 1.7 -16.7 -0.9 -8.4 -6.1 -7.85 -6.65 -5.0 -9.0 -4.5 -12.1 -4.2 -13.65 -4.55 -14.95 L-4.85 -15.7 -5.5 -16.75" fill="#d4d4d4" fill-rule="evenodd" stroke="none"/>
      <path d="M-5.5 -16.75 L-4.85 -15.7 -4.55 -14.95 Q-4.2 -13.65 -4.5 -12.1 -5.0 -9.0 -7.85 -6.65 -8.4 -6.1 -16.7 -0.9 -20.7 1.7 -22.0 5.05 L-22.05 4.4 -22.05 4.25 Q-21.9 2.95 -21.2 1.8 -19.95 -0.85 -17.45 -2.95 L-17.35 -3.15 -15.5 -4.7 Q-11.55 -8.45 -9.05 -12.65 -8.25 -14.35 -7.85 -16.2 -7.4 -18.8 -9.1 -21.2 L-12.25 -24.95 -6.8 -20.25 -1.3 -14.65 Q-0.3 -13.6 0.15 -12.6 L0.85 -10.6 -1.35 -12.8 -4.7 -15.95 -5.4 -16.8 -5.45 -16.85 -5.6 -16.9 -5.5 -16.75" fill="#ffffff" fill-rule="evenodd" stroke="none"/>
      <path d="M-10.35 14.0 L-10.25 13.85 -10.5 13.65 Q-12.9 11.6 -13.85 9.45 -15.3 6.1 -13.6 2.7 -12.5 0.55 -9.15 -3.1 -5.5 -6.85 -4.55 -8.6 -2.85 -11.45 -3.7 -14.1 L-1.0 -11.0 1.0 -7.6 1.1 -7.65 1.1 -7.35 0.9 -6.5 0.95 -6.3 0.45 -5.65 0.45 -5.5 0.55 -5.25 0.15 -4.25 Q-1.2 -1.2 -4.6 1.0 L-5.8 1.8 -9.4 4.6 Q-10.5 5.55 -10.9 6.95 -11.8 10.45 -9.5 13.2 -8.5 14.5 -6.8 15.65 L-9.6 14.35 -10.35 14.0" fill="#eaeaea" fill-rule="evenodd" stroke="none"/>
      <path d="M7.85 -1.45 L7.8 -1.5 Q4.5 -4.6 -0.25 -4.6 -5.05 -4.6 -8.2 -1.45 -11.55 1.65 -11.55 6.15 -11.55 10.5 -8.2 13.5 L-8.2 13.55 Q-5.05 16.85 -0.25 16.85 4.5 16.85 7.8 13.55 L7.85 13.55 Q11.0 10.5 11.0 6.15 11.0 1.65 7.85 -1.45 M8.8 14.5 Q5.05 18.2 -0.25 18.2 -5.55 18.2 -9.2 14.5 -12.9 11.15 -12.9 6.15 -12.9 1.2 -9.2 -2.45 -5.55 -6.0 -0.25 -6.0 5.05 -6.0 8.8 -2.45 12.35 1.2 12.35 6.15 12.35 11.15 8.8 14.5" fill="#545454" fill-rule="evenodd" stroke="none"/>
      <path d="M7.85 -1.45 Q11.0 1.65 11.0 6.15 11.0 10.5 7.85 13.55 L7.8 13.55 Q4.5 16.85 -0.25 16.85 -5.05 16.85 -8.2 13.55 L-8.2 13.5 Q-11.55 10.5 -11.55 6.15 -11.55 1.65 -8.2 -1.45 -5.05 -4.6 -0.25 -4.6 4.5 -4.6 7.8 -1.5 L7.85 -1.45" fill="#404040" fill-rule="evenodd" stroke="none"/>
      <path d="M5.4 -1.1 Q8.0 1.45 8.0 5.15 8.0 8.75 5.4 11.25 L5.35 11.25 Q2.65 13.95 -1.25 13.95 -5.2 13.95 -7.8 11.25 L-7.8 11.2 Q-10.55 8.75 -10.55 5.15 -10.55 1.45 -7.8 -1.1 -5.2 -3.7 -1.25 -3.7 2.65 -3.7 5.35 -1.15 L5.4 -1.1" fill="#333333" fill-rule="evenodd" stroke="none"/>
      <path d="M2.45 -0.15 Q4.35 1.75 4.35 4.4 4.35 7.0 2.45 8.8 L2.4 8.8 Q0.45 10.8 -2.4 10.8 -5.2 10.8 -7.1 8.8 -9.1 7.0 -9.1 4.4 -9.1 1.75 -7.1 -0.15 -5.2 -2.0 -2.4 -2.0 0.45 -2.0 2.4 -0.15 L2.45 -0.15" fill="#212121" fill-rule="evenodd" stroke="none"/>
      <path d="M-0.35 -1.8 Q1.0 -0.9 1.0 0.8 1.0 2.5 -0.35 4.05 L-0.4 4.1 Q-1.8 5.7 -3.9 6.25 -5.95 6.8 -7.3 5.9 L-7.3 5.85 Q-8.8 5.1 -8.8 3.4 -8.8 1.7 -7.3 0.05 -5.95 -1.5 -3.9 -2.05 -1.8 -2.6 -0.4 -1.75 L-0.35 -1.8" fill="#171717" fill-rule="evenodd" stroke="none"/>
    </g>
    <radialGradient cx="0" cy="0" gradientTransform="matrix(0.0563, 0.009, -0.0106, 0.0438, 0.75, 12.45)" gradientUnits="userSpaceOnUse" id="gradient0" r="819.2" spreadMethod="pad">
      <stop offset="0.0" stop-color="#808080"/>
      <stop offset="1.0" stop-color="#c4c4c4"/>
    </radialGradient>
    <g id="shape1" transform="matrix(1.0, 0.0, 0.0, 1.0, -2.7, -11.85)">
      <path d="M4.2 16.45 Q7.05 13.5 9.2 12.5 L15.8 12.3 20.2 14.05 22.95 14.65 24.05 14.35 26.8 12.85 28.4 11.95 27.4 13.0 26.75 13.7 Q25.15 14.75 23.75 15.2 L20.0 15.6 16.85 15.0 Q12.95 13.8 9.65 14.15 6.35 14.55 4.2 16.45" fill="#ffffff" fill-rule="evenodd" stroke="none"/>
      <path d="M20.0 15.6 L23.75 15.2 Q25.15 14.75 26.75 13.7 24.5 15.95 22.2 17.4 18.4 19.85 15.35 19.5 L8.45 17.65 6.2 17.3 Q8.95 15.6 12.95 15.55 14.85 15.45 18.8 15.65 L20.0 15.6" fill="url(#gradient1)" fill-rule="evenodd" stroke="none"/>
      <path d="M4.2 16.45 Q6.35 14.55 9.65 14.15 12.95 13.8 16.85 15.0 L20.0 15.6 18.8 15.65 Q14.85 15.45 12.95 15.55 8.95 15.6 6.2 17.3 4.3 17.2 2.7 17.95 L3.15 17.45 4.2 16.45" fill="#bfbfbf" fill-rule="evenodd" stroke="none"/>
    </g>
    <radialGradient cx="0" cy="0" gradientTransform="matrix(0.0263, 0.0068, -0.0134, 0.0502, 4.9, 15.65)" gradientUnits="userSpaceOnUse" id="gradient1" r="819.2" spreadMethod="pad">
      <stop offset="0.0" stop-color="#bfbfbf"/>
      <stop offset="1.0" stop-color="#ffffff"/>
    </radialGradient>
  </defs>
</svg>
