<?xml version="1.0" encoding="UTF-8" standalone="no"?>
<svg xmlns:xlink="http://www.w3.org/1999/xlink" height="20.45px" width="40.5px" xmlns="http://www.w3.org/2000/svg">
  <g transform="matrix(1.0, 0.0, 0.0, 1.0, 20.3, 0.45)">
    <path d="M-0.35 9.25 Q0.15 8.85 1.25 8.7 2.15 8.6 3.65 7.45 5.15 6.2 9.15 5.25 L11.55 4.05 11.55 8.25 10.8 8.6 Q10.9 6.85 11.2 5.8 10.05 6.35 8.95 6.85 L9.1 9.45 8.35 9.85 8.4 7.05 8.0 7.2 6.55 7.6 Q5.7 7.8 5.05 8.1 L4.85 8.2 Q4.15 8.55 3.7 9.1 L3.05 9.7 3.3 11.05 Q3.3 12.0 2.85 12.0 2.35 12.0 2.5 11.0 L2.6 9.9 2.05 9.95 1.4 9.85 Q0.6 9.85 -0.2 10.65 -0.65 10.65 -0.75 10.05 -0.75 9.55 -0.35 9.25 M7.25 12.35 L7.25 12.4 6.85 13.5 6.75 13.5 6.2 12.95 Q5.75 12.95 5.55 12.25 L5.45 11.75 5.45 11.7 5.4 11.45 6.0 8.85 6.35 8.95 Q7.2 9.35 7.25 12.2 L7.25 12.35 M6.0 16.45 L5.85 15.9 5.85 14.55 Q5.9 13.25 6.35 13.25 7.0 13.25 6.85 15.45 7.0 17.8 6.35 17.8 L6.1 16.85 6.0 16.45" fill="#ad7c54" fill-rule="evenodd" stroke="none"/>
    <path d="M-0.35 9.25 Q-0.75 9.55 -0.75 10.05 -0.65 10.65 -0.2 10.65 0.6 9.85 1.4 9.85 L2.05 9.95 2.6 9.9 2.5 11.0 Q2.35 12.0 2.85 12.0 3.3 12.0 3.3 11.05 L3.05 9.7 3.7 9.1 Q4.15 8.55 4.85 8.2 4.65 8.5 4.55 9.55 L4.5 11.15 Q4.25 13.4 5.15 13.4 5.55 13.4 5.55 13.05 L5.45 11.75 5.55 12.25 Q5.75 12.95 6.2 12.95 L6.75 13.5 6.85 13.5 7.25 12.4 7.25 12.35 Q7.7 12.2 7.7 9.7 7.9 7.75 7.15 7.75 6.45 7.75 6.35 8.95 L6.0 8.85 5.4 11.45 5.05 8.1 Q5.7 7.8 6.55 7.6 L8.0 7.2 8.4 7.05 8.35 9.85 8.0 10.0 8.0 18.0 4.0 20.0 4.0 14.0 0.0 16.0 0.0 14.0 0.0 13.15 -0.1 13.55 -0.2 13.55 -0.75 12.6 -0.95 10.65 -1.65 9.8 -3.2 9.5 -4.5 9.15 -4.85 9.0 Q-6.0 8.35 -7.2 7.65 L-7.65 6.9 -8.7 6.65 Q-10.45 6.4 -10.35 5.6 L-11.05 5.55 -11.15 8.05 Q-11.3 10.6 -11.65 10.6 -12.3 10.6 -12.55 6.35 L-11.8 5.35 Q-13.2 4.8 -15.0 3.2 L-16.7 2.7 -17.65 1.95 -19.45 0.6 -19.8 0.7 -20.0 0.7 -20.3 0.2 Q-20.3 -0.45 -19.2 -0.45 L-16.65 1.3 Q-15.1 1.65 -14.7 1.95 L-13.65 2.75 -12.9 2.5 Q-12.45 2.5 -11.0 3.45 -9.5 4.4 -9.25 4.85 -8.9 5.4 -7.85 5.6 L-5.95 6.7 Q-2.45 7.85 -0.95 8.75 -0.6 8.9 -0.35 9.25 M9.1 9.45 L8.95 6.85 Q10.05 6.35 11.2 5.8 10.9 6.85 10.8 8.6 L10.15 8.95 9.85 8.8 Q9.6 8.8 9.4 9.3 L9.1 9.45 M6.1 16.85 L6.35 17.8 Q7.0 17.8 6.85 15.45 7.0 13.25 6.35 13.25 5.9 13.25 5.85 14.55 L5.85 15.9 6.0 16.45 Q5.55 16.15 5.55 15.6 5.8 13.7 5.2 13.7 4.85 13.7 4.65 15.0 L4.55 16.3 Q4.25 18.3 5.35 18.3 6.0 18.3 6.1 16.85" fill="#8c7f74" fill-rule="evenodd" stroke="none"/>
    <path d="M4.85 8.2 L5.05 8.1 5.4 11.45 5.45 11.7 5.45 11.75 5.55 13.05 Q5.55 13.4 5.15 13.4 4.25 13.4 4.5 11.15 L4.55 9.55 Q4.65 8.5 4.85 8.2 M10.15 8.95 L9.4 9.3 Q9.6 8.8 9.85 8.8 L10.15 8.95 M6.35 8.95 Q6.45 7.75 7.15 7.75 7.9 7.75 7.7 9.7 7.7 12.2 7.25 12.35 L7.25 12.2 Q7.2 9.35 6.35 8.95 M6.1 16.85 Q6.0 18.3 5.35 18.3 4.25 18.3 4.55 16.3 L4.65 15.0 Q4.85 13.7 5.2 13.7 5.8 13.7 5.55 15.6 5.55 16.15 6.0 16.45 L6.1 16.85" fill="#999999" fill-rule="evenodd" stroke="none"/>
    <path d="M-3.2 9.5 L-1.65 9.8 -0.95 10.65 -0.75 12.6 -0.2 13.55 -0.1 13.55 0.0 13.15 0.0 14.0 -2.15 12.95 -1.9 11.55 Q-1.9 11.35 -2.15 11.3 L-2.65 12.65 -3.0 12.5 -3.05 11.7 -3.25 10.45 -3.2 9.5 M-4.0 14.35 L-4.0 20.0 -12.0 16.0 -12.0 12.0 -14.2 10.9 -13.85 7.8 -13.9 7.55 -13.85 7.7 -13.4 7.7 Q-12.9 7.7 -12.9 6.35 -12.9 5.8 -13.6 5.6 -13.2 4.25 -15.05 4.25 -15.7 4.25 -15.7 5.0 -15.7 6.95 -14.45 7.5 L-14.8 10.6 -20.0 8.0 -20.0 0.7 -19.8 0.7 -19.45 0.6 -17.65 1.95 -16.7 2.7 -15.0 3.2 Q-13.2 4.8 -11.8 5.35 L-12.55 6.35 Q-12.3 10.6 -11.65 10.6 -11.3 10.6 -11.15 8.05 L-11.05 5.55 -10.35 5.6 Q-10.45 6.4 -8.7 6.65 L-7.65 6.9 -7.2 7.65 Q-6.0 8.35 -4.85 9.0 L-4.5 9.15 Q-5.05 9.7 -5.05 11.2 L-4.65 11.95 -5.0 14.45 -4.45 15.35 -4.0 14.35 M-8.75 8.95 Q-8.5 7.25 -10.0 7.25 -10.7 7.25 -10.75 9.3 -10.75 10.35 -9.9 10.3 -9.75 11.6 -9.15 11.6 -8.6 11.6 -8.6 11.05 L-8.75 8.95 M-5.9 9.0 Q-6.4 9.0 -6.5 10.55 -6.25 14.85 -5.55 14.85 -5.2 14.85 -5.2 14.35 L-5.3 11.65 Q-5.45 9.0 -5.9 9.0 M-17.05 3.05 L-17.3 2.75 -17.65 3.3 -17.35 3.65 -17.05 3.05 M-5.05 16.9 L-5.05 16.25 Q-5.1 15.65 -5.5 15.65 -6.15 15.65 -6.0 17.45 -6.15 18.7 -5.45 18.7 -5.05 18.7 -5.05 16.9 M-6.35 13.95 L-6.6 13.75 Q-7.5 14.65 -7.5 17.75 -7.5 18.25 -7.05 18.25 -6.75 18.25 -6.35 13.95 M-8.7 12.85 Q-8.7 13.4 -8.25 13.4 -7.45 13.4 -7.45 12.55 L-7.8 11.8 Q-8.7 11.8 -8.7 12.85" fill="#c9bc9e" fill-rule="evenodd" stroke="none"/>
    <path d="M-2.15 12.95 L-2.65 12.65 -2.15 11.3 Q-1.9 11.35 -1.9 11.55 L-2.15 12.95 M-3.0 12.5 L-4.0 12.1 -4.0 13.85 -4.15 12.4 -4.15 12.0 -4.1 11.55 Q-4.05 10.05 -3.65 10.05 L-3.25 10.45 -3.05 11.7 -3.0 12.5 M-14.2 10.9 L-14.35 11.85 -14.5 11.9 -14.85 10.85 -14.8 10.6 -14.45 7.5 -14.2 6.7 -13.9 7.55 -13.85 7.8 -14.2 10.9 M-5.9 9.0 Q-5.45 9.0 -5.3 11.65 L-5.2 14.35 Q-5.2 14.85 -5.55 14.85 -6.25 14.85 -6.5 10.55 -6.4 9.0 -5.9 9.0 M-17.05 3.05 L-17.35 3.65 -17.65 3.3 -17.3 2.75 -17.05 3.05 M-6.35 13.95 Q-6.75 18.25 -7.05 18.25 -7.5 18.25 -7.5 17.75 -7.5 14.65 -6.6 13.75 L-6.35 13.95" fill="#e6a870" fill-rule="evenodd" stroke="none"/>
    <path d="M-4.0 13.85 L-3.9 14.1 -4.0 14.35 -4.45 15.35 -5.0 14.45 -4.65 11.95 -5.05 11.2 Q-5.05 9.7 -4.5 9.15 L-3.2 9.5 -3.25 10.45 -3.65 10.05 Q-4.05 10.05 -4.1 11.55 L-4.15 12.0 -4.15 12.4 -4.0 13.85 M-8.75 8.95 L-8.6 11.05 Q-8.6 11.6 -9.15 11.6 -9.75 11.6 -9.9 10.3 -10.75 10.35 -10.75 9.3 -10.7 7.25 -10.0 7.25 -8.5 7.25 -8.75 8.95 M-14.45 7.5 Q-15.7 6.95 -15.7 5.0 -15.7 4.25 -15.05 4.25 -13.2 4.25 -13.6 5.6 -12.9 5.8 -12.9 6.35 -12.9 7.7 -13.4 7.7 L-13.85 7.7 -13.9 7.55 -14.2 6.7 -14.45 7.5 M-5.05 16.9 Q-5.05 18.7 -5.45 18.7 -6.15 18.7 -6.0 17.45 -6.15 15.65 -5.5 15.65 -5.1 15.65 -5.05 16.25 L-5.05 16.9 M-8.7 12.85 Q-8.7 11.8 -7.8 11.8 L-7.45 12.55 Q-7.45 13.4 -8.25 13.4 -8.7 13.4 -8.7 12.85" fill="#cccccc" fill-rule="evenodd" stroke="none"/>
    <path d="M20.0 0.6 L20.0 8.0 19.05 8.5 19.15 7.5 Q19.15 4.95 18.9 4.65 18.55 4.95 18.55 8.7 L18.55 8.75 18.05 9.0 18.05 8.65 Q18.05 3.55 17.85 2.35 L18.5 1.55 Q19.25 0.95 19.55 0.85 L20.0 0.6 M17.05 9.5 L16.0 10.0 16.0 12.0 12.0 14.0 12.0 8.0 11.95 8.05 12.05 6.8 12.35 5.1 Q14.25 4.0 15.4 3.5 L15.3 4.55 Q15.3 5.0 15.75 5.0 16.15 5.0 16.25 3.95 16.25 3.4 15.95 3.25 L16.5 3.05 16.75 3.0 16.65 3.4 16.5 4.85 Q16.5 5.4 16.8 5.6 L17.45 4.4 17.25 7.3 17.05 9.5" fill="#8c7f74" fill-rule="evenodd" stroke="none"/>
    <path d="M11.95 8.05 L11.55 8.25 11.55 4.05 12.05 3.8 Q13.85 2.5 14.5 2.35 16.7 1.7 17.3 1.05 17.8 0.35 19.45 -0.35 20.2 -0.35 20.2 0.3 L20.0 0.6 19.55 0.85 Q19.25 0.95 18.5 1.55 L17.85 2.35 Q18.05 3.55 18.05 8.65 L18.05 9.0 17.55 9.25 17.7 7.7 Q17.7 7.3 17.3 7.3 L17.25 7.3 17.45 4.4 17.5 4.3 17.55 3.3 17.6 2.5 16.75 3.0 16.5 3.05 15.95 3.25 Q16.25 3.4 16.25 3.95 16.15 5.0 15.75 5.0 15.3 5.0 15.3 4.55 L15.4 3.5 Q14.25 4.0 12.35 5.1 L12.05 6.8 11.95 8.05 M19.05 8.5 L19.0 8.9 18.8 9.0 18.55 8.75 18.55 8.7 Q18.55 4.95 18.9 4.65 19.15 4.95 19.15 7.5 L19.05 8.5" fill="#ad7c54" fill-rule="evenodd" stroke="none"/>
    <path d="M17.55 9.25 L17.1 9.95 17.05 9.6 17.05 9.5 17.25 7.3 17.3 7.3 Q17.7 7.3 17.7 7.7 L17.55 9.25 M16.75 3.0 L17.6 2.5 17.55 3.3 17.5 4.3 17.45 4.4 16.8 5.6 Q16.5 5.4 16.5 4.85 L16.65 3.4 16.75 3.0" fill="#999999" fill-rule="evenodd" stroke="none"/>
  </g>
</svg>
