<?xml version="1.0" encoding="UTF-8" standalone="no"?>
<svg xmlns:xlink="http://www.w3.org/1999/xlink" height="38.3px" width="63.8px" xmlns="http://www.w3.org/2000/svg">
  <g transform="matrix(1.0, 0.0, 0.0, 1.0, 26.4, 71.25)">
    <path d="M-26.4 -61.25 L-12.15 -54.15 -16.65 -51.9 -22.4 -54.75 -26.4 -56.75 -26.4 -61.25 M-24.85 -47.8 L-20.35 -45.55 -6.65 -38.7 -6.05 -38.4 -6.05 -33.9 -24.85 -43.3 -24.85 -47.8 M-0.3 -41.3 L7.4 -37.45 7.4 -32.95 -0.3 -36.8 -0.3 -41.3 M14.3 -58.35 L-6.4 -68.7 -6.4 -70.2 14.3 -59.85 14.3 -58.35 M33.9 -51.7 L17.4 -59.95 17.4 -61.45 35.4 -52.45 33.9 -51.7" fill="#d9ae9b" fill-rule="evenodd" stroke="none"/>
    <path d="M-26.4 -61.25 L-6.4 -71.25 14.3 -60.9 17.4 -62.45 37.4 -52.45 7.4 -37.45 -0.3 -41.3 -6.05 -38.4 -6.65 -38.7 -20.35 -45.55 -24.85 -47.8 -16.65 -51.9 -12.15 -54.15 -26.4 -61.25 M-22.85 -60.5 L-10.2 -54.15 -22.85 -47.8 -21.35 -47.05 -6.05 -39.4 -0.3 -42.3 7.4 -38.45 33.9 -51.7 35.4 -52.45 17.4 -61.45 14.3 -59.85 -6.4 -70.2 -24.4 -61.25 -22.85 -60.5" fill="#ffbeb6" fill-rule="evenodd" stroke="none"/>
    <path d="M14.3 -58.35 L17.4 -59.95 33.9 -51.7 7.4 -38.45 -0.3 -42.3 -6.05 -39.4 -21.35 -47.05 -10.2 -52.65 -10.2 -54.15 -22.85 -60.5 -6.4 -68.7 14.3 -58.35" fill="#8c7b74" fill-rule="evenodd" stroke="none"/>
    <path d="M-6.05 -38.4 L-0.3 -41.3 -0.3 -36.8 -6.05 -33.9 -6.05 -38.4 M7.4 -37.45 L37.4 -52.45 37.4 -47.95 33.3 -45.9 7.4 -32.95 7.4 -37.45 M17.4 -59.95 L14.3 -58.35 14.3 -59.85 17.4 -61.45 17.4 -59.95 M-6.4 -68.7 L-22.85 -60.5 -24.4 -61.25 -6.4 -70.2 -6.4 -68.7 M-10.2 -54.15 L-10.2 -52.65 -21.35 -47.05 -22.85 -47.8 -10.2 -54.15" fill="#8b5a5a" fill-rule="evenodd" stroke="none"/>
    <path d="M37.4 -52.45 L17.4 -62.45 14.3 -60.9 -6.4 -71.25 -26.4 -61.25 -26.4 -56.75 -22.4 -54.75 M37.4 -52.45 L37.4 -47.95 33.3 -45.9" fill="none" stroke="#660000" stroke-linecap="round" stroke-linejoin="miter" stroke-miterlimit="3.0" stroke-opacity="0.6" stroke-width="0.05"/>
    <path d="M-26.4 -61.25 L-12.15 -54.15 -16.65 -51.9 -24.85 -47.8 -20.35 -45.55 -6.65 -38.7 -6.05 -38.4 -0.3 -41.3 7.4 -37.45 37.4 -52.45 M33.3 -45.9 L7.4 -32.95 -0.3 -36.8 -6.05 -33.9 -24.85 -43.3 -24.85 -47.8 M17.4 -59.95 L14.3 -58.35 -6.4 -68.7 -22.85 -60.5 -10.2 -54.15 -10.2 -52.65 -21.35 -47.05 -6.05 -39.4 -0.3 -42.3 7.4 -38.45 33.9 -51.7 17.4 -59.95 17.4 -61.45 14.3 -59.85 14.3 -58.35 M33.9 -51.7 L35.4 -52.45 17.4 -61.45 M7.4 -32.95 L7.4 -37.45 M-22.4 -54.75 L-16.65 -51.9 M-6.4 -70.2 L-24.4 -61.25 -22.85 -60.5 M-6.4 -70.2 L-6.4 -68.7 M-0.3 -41.3 L-0.3 -36.8 M-6.05 -33.9 L-6.05 -38.4 M-10.2 -54.15 L-22.85 -47.8 -21.35 -47.05 M14.3 -59.85 L-6.4 -70.2" fill="none" stroke="#660000" stroke-linecap="round" stroke-linejoin="miter" stroke-miterlimit="3.0" stroke-opacity="0.3019608" stroke-width="0.05"/>
  </g>
</svg>
