<?xml version="1.0" encoding="UTF-8" standalone="no"?>
<svg xmlns:xlink="http://www.w3.org/1999/xlink" height="11.4px" width="18.95px" xmlns="http://www.w3.org/2000/svg">
  <g transform="matrix(1.0, 0.0, 0.0, 1.0, 7.1, 9.1)">
    <path d="M11.85 -0.8 L5.65 2.3 -0.55 -0.8 5.65 -3.85 11.85 -0.8" fill="#000000" fill-opacity="0.14117648" fill-rule="evenodd" stroke="none"/>
    <path d="M5.35 -7.05 L0.75 -4.75 -3.4 -6.8 -4.5 -5.1 -7.1 -6.4 -1.95 -8.95 -0.5 -8.25 1.25 -9.1 5.35 -7.05" fill="#fe8181" fill-rule="evenodd" stroke="none"/>
    <path d="M7.05 -4.45 L1.95 -1.9 1.95 -0.1 -7.1 -4.6 -7.1 -6.4 -4.5 -5.1 -3.4 -6.8 0.75 -4.75 5.35 -7.05 7.05 -4.45" fill="#cc0000" fill-rule="evenodd" stroke="none"/>
    <path d="M1.95 -0.1 L1.95 -1.9 7.05 -4.45 7.05 -2.65 1.95 -0.1" fill="#a90101" fill-rule="evenodd" stroke="none"/>
  </g>
</svg>
