<?xml version="1.0" encoding="UTF-8" standalone="no"?>
<svg xmlns:xlink="http://www.w3.org/1999/xlink" height="105.25px" width="45.0px" xmlns="http://www.w3.org/2000/svg">
  <g transform="matrix(1.0, 0.0, 0.0, 1.0, 23.7, 135.9)">
    <path d="M21.3 -106.0 L20.3 -106.65 Q10.7 -112.75 -1.1 -117.1 0.2 -119.2 -1.1 -122.3 9.8 -115.35 20.3 -111.35 L21.25 -111.0 21.3 -110.95 21.3 -106.0 M-1.05 -85.9 Q8.8 -79.15 20.3 -74.95 L21.25 -74.6 21.3 -74.6 21.3 -64.55 20.3 -65.2 Q9.9 -72.1 -1.1 -75.55 L-1.1 -75.6 Q0.8 -80.2 -1.1 -85.9 L-1.05 -85.9 M21.25 -48.65 L21.3 -48.65 21.3 -46.25 21.3 -46.0 21.3 -43.8 20.3 -44.45 Q10.15 -51.3 -1.1 -54.8 L-1.1 -54.85 Q0.45 -56.45 -1.1 -60.0 9.6 -53.05 20.3 -49.0 L21.25 -48.65" fill="#e66f3c" fill-opacity="0.8" fill-rule="evenodd" stroke="none"/>
    <path d="M21.3 -106.0 L-1.1 -117.1 -1.1 -106.7 21.3 -105.65 M21.25 -74.6 Q20.8 -75.0 20.3 -75.2 L-1.05 -85.9 -1.1 -85.95 -1.1 -85.9 M21.3 -64.55 L20.3 -64.85 -1.1 -75.55 21.3 -49.4 M-1.1 -75.55 L-1.1 -75.6 -1.1 -60.0 21.25 -48.65 M21.3 -43.8 L-1.1 -54.8 10.55 -42.5 21.3 -43.05 M21.3 -94.9 L10.55 -93.1 21.3 -80.55 M-1.1 -54.85 L-1.1 -54.8 M10.55 -42.5 L21.3 -31.15 M-1.1 -135.9 L-1.1 -122.3 21.25 -111.0 M-1.1 -122.3 L-1.1 -117.1 M-1.05 -85.9 L21.25 -79.75 -1.1 -91.15 -1.1 -85.95 M-1.1 -75.6 L-1.1 -85.9 M-1.1 -60.0 L-1.1 -54.85 -1.1 -41.85 10.55 -42.5 M-1.1 -41.85 L-1.1 -36.65 M-1.1 -106.7 L-1.1 -91.15 M21.3 -95.5 L-1.1 -106.7 10.55 -93.1 -1.1 -91.15 M21.3 -30.65 L-1.1 -41.85" fill="none" stroke="#999999" stroke-linecap="round" stroke-linejoin="round" stroke-width="0.05"/>
    <path d="M-2.25 -100.0 L-2.25 -98.45 Q-2.7 -96.55 -2.25 -95.0 L-2.25 -93.4 Q-12.8 -89.55 -23.7 -82.8 L-23.7 -89.2 -23.65 -89.2 Q-12.8 -93.1 -2.25 -100.0 M-23.7 -38.55 L-23.7 -51.8 -23.65 -51.85 Q-12.7 -55.7 -2.25 -62.6 L-2.25 -59.0 Q-2.55 -55.95 -2.25 -53.05 L-2.25 -49.2 Q-12.85 -45.2 -23.7 -38.55" fill="#b8562f" fill-opacity="0.8" fill-rule="evenodd" stroke="none"/>
    <path d="M-2.25 -116.55 L-13.35 -102.95 -2.25 -100.5 M-23.7 -90.25 L-13.35 -102.95 -23.7 -105.3 M-23.7 -106.4 L-2.25 -117.1 M-2.25 -132.4 Q-12.95 -127.05 -23.7 -121.65 M-2.25 -93.4 L-23.7 -82.8 M-23.65 -89.2 L-2.25 -100.0 M-23.65 -51.85 Q-12.95 -57.2 -2.25 -62.6 M-2.25 -49.2 L-23.7 -38.55 M-23.7 -64.85 L-2.25 -63.05 M-2.25 -76.3 L-23.7 -65.6 M-23.7 -66.5 L-2.25 -92.8" fill="none" stroke="#6f6f6f" stroke-linecap="round" stroke-linejoin="round" stroke-width="0.05"/>
  </g>
</svg>
