<?xml version="1.0" encoding="UTF-8" standalone="no"?>
<svg xmlns:xlink="http://www.w3.org/1999/xlink" height="48.0px" width="78.0px" xmlns="http://www.w3.org/2000/svg">
  <g transform="matrix(1.0, 0.0, 0.0, 1.0, 39.0, 24.0)">
    <path d="M-38.95 0.0 L-39.0 0.0 9.0 -24.0 7.8 -20.6 -20.2 -6.6 -20.1 -6.6 -38.95 0.0 M9.8 8.4 L11.0 5.0 39.0 -9.0 37.85 -5.6 37.8 -5.6 9.8 8.4" fill="#ffffff" fill-rule="evenodd" stroke="none"/>
    <path d="M-20.1 -6.6 L9.8 8.4 9.0 24.0 -38.95 0.0 -20.1 -6.6" fill="url(#gradient0)" fill-rule="evenodd" stroke="none"/>
  </g>
  <defs>
    <linearGradient gradientTransform="matrix(0.0, -0.0188, 0.0187, 0.0, -14.6, 8.7)" gradientUnits="userSpaceOnUse" id="gradient0" spreadMethod="pad" x1="-819.2" x2="819.2">
      <stop offset="0.0" stop-color="#ffffff" stop-opacity="0.0"/>
      <stop offset="1.0" stop-color="#ffffff"/>
    </linearGradient>
  </defs>
</svg>
