<?xml version="1.0" encoding="UTF-8" standalone="no"?>
<svg xmlns:xlink="http://www.w3.org/1999/xlink" height="166.3px" width="46.7px" xmlns="http://www.w3.org/2000/svg">
  <g transform="matrix(1.0, 0.0, 0.0, 1.0, 24.5, 179.55)">
    <path d="M22.15 -137.8 L22.15 -137.75 Q21.25 -133.95 22.15 -130.95 10.6 -126.45 -1.2 -119.3 L-1.2 -119.35 Q-0.15 -122.9 -1.2 -126.1 10.65 -129.9 22.15 -137.75 L22.15 -137.8 M22.15 -51.1 L22.2 -51.15 22.15 -51.05 Q20.6 -43.95 22.15 -37.6 L22.2 -37.55 22.15 -37.55 22.1 -37.5 Q10.65 -33.3 -1.1 -25.95 L-1.15 -25.9 Q1.05 -33.55 -1.15 -39.5 10.8 -43.55 22.15 -51.1 M22.15 -88.55 L22.15 -88.5 Q20.5 -84.4 22.15 -81.75 10.8 -77.65 -1.0 -70.15 L-1.2 -70.05 Q0.3 -73.85 -1.2 -76.85 10.6 -80.9 22.1 -88.5 L22.15 -88.55" fill="#b8562f" fill-opacity="0.8" fill-rule="evenodd" stroke="none"/>
    <path d="M-1.2 -93.85 L-1.5 -93.9 Q-11.7 -100.7 -24.5 -105.4 -23.2 -107.5 -24.5 -110.6 -12.55 -103.05 -1.2 -98.9 -2.3 -96.95 -1.2 -93.85 M-24.5 -63.9 Q-22.6 -68.5 -24.5 -74.2 L-24.45 -74.2 Q-13.8 -66.85 -1.2 -62.55 -2.95 -57.4 -1.2 -52.25 -12.45 -60.1 -24.5 -63.85 L-24.5 -63.9 M-24.5 -43.15 Q-22.95 -44.8 -24.5 -48.3 -12.9 -40.75 -1.2 -36.6 -3.05 -34.85 -1.2 -31.45 -12.2 -39.25 -24.5 -43.1 L-24.5 -43.15" fill="#e66f3c" fill-opacity="0.8" fill-rule="evenodd" stroke="none"/>
    <path d="M22.15 -179.55 L22.15 -154.75 22.15 -137.8 22.15 -137.75 22.15 -130.95 22.15 -120.8 22.15 -105.55 22.15 -105.5 22.15 -88.55 22.15 -88.5 22.15 -81.75 22.15 -81.7 22.15 -64.75 22.15 -51.15 22.15 -51.1 M22.15 -51.05 L22.15 -37.6 M22.15 -37.55 L22.15 -25.0 M22.15 -130.95 L-1.2 -119.3 22.1 -120.8 22.15 -120.8 M22.15 -137.75 L22.15 -137.8 M-1.2 -109.15 L22.1 -120.8 22.15 -120.8 M22.15 -154.75 L10.5 -140.45 22.15 -137.75 -1.2 -126.15 -1.2 -126.1 M-1.2 -126.15 L10.5 -140.45 -1.2 -143.1 M22.15 -81.75 L-1.1 -70.05 -1.2 -70.05 M-1.2 -53.05 L-1.15 -53.1 22.15 -81.7 M22.1 -88.5 L22.15 -88.55 M-1.2 -93.85 L22.15 -105.55 M-1.2 -93.75 L10.45 -91.1 22.15 -105.5 M-1.2 -76.85 L-1.15 -76.9 10.45 -91.1 22.1 -88.5 -1.15 -76.9 M-1.1 -70.05 L-1.0 -70.15 M-1.2 -39.5 L-1.15 -39.5 22.1 -51.15 -1.15 -53.1 22.15 -64.75 M22.15 -51.15 L22.1 -51.15 22.15 -51.15 M22.1 -37.5 L-1.1 -25.95 M-1.15 -25.9 L-1.2 -25.9" fill="none" stroke="#6f6f6f" stroke-linecap="round" stroke-linejoin="round" stroke-width="0.05"/>
    <path d="M-1.2 -119.3 L-1.2 -112.5 -1.2 -109.15 -1.2 -98.9 -1.2 -93.85 -1.5 -93.9 -24.5 -95.0 -1.2 -83.35 -1.2 -93.75 -1.2 -93.85 M-1.2 -126.1 L-1.2 -143.1 -24.5 -154.75 -24.5 -130.95 -1.4 -136.25 -24.2 -147.85 M-1.2 -143.1 L-1.2 -166.0 M-1.2 -70.05 L-1.2 -67.8 -1.2 -62.55 -1.2 -53.05 -1.2 -52.25 -1.2 -39.5 -1.2 -36.6 -1.2 -31.45 -1.2 -25.9 -1.2 -18.45 -1.2 -13.25 M-1.5 -93.9 L-1.2 -93.75 M-1.2 -83.35 L-1.2 -83.3 -1.2 -76.85 -1.2 -70.05 M-24.5 -130.95 L-24.5 -124.2 -12.85 -121.7 -24.5 -130.95 -1.2 -119.35 -1.2 -126.1 M-24.5 -110.6 L-24.5 -105.4 -24.5 -95.05 -24.5 -95.0 -12.85 -81.4 -1.2 -83.3 M-1.5 -93.9 L-24.5 -105.4 M-24.5 -124.2 L-24.5 -110.6 -1.2 -98.9 -24.5 -124.2 -1.2 -112.5 -12.85 -121.7 -1.2 -119.3 -1.2 -119.35 M-24.5 -79.5 L-24.5 -74.25 -24.45 -74.2 -1.2 -67.8 -24.5 -79.5 -24.5 -95.05 M-24.5 -74.2 L-24.5 -63.9 -24.5 -63.85 -1.2 -52.25 M-24.5 -74.2 L-24.5 -74.25 M-24.5 -79.5 L-12.85 -81.4 -1.2 -67.8 M-24.5 -48.3 L-24.5 -43.15 -24.5 -43.1 -1.2 -31.45 -12.85 -30.8 -1.2 -18.45 -24.5 -30.15 -24.5 -24.95 M-24.5 -48.3 L-24.5 -63.9 M-24.5 -30.15 L-12.85 -30.8 -24.5 -43.1 M-24.5 -43.15 L-24.5 -30.15 M-1.2 -62.55 L-24.45 -74.2 M-24.5 -48.3 L-1.2 -36.6 -24.5 -63.85" fill="none" stroke="#999999" stroke-linecap="round" stroke-linejoin="round" stroke-width="0.05"/>
  </g>
</svg>
