<?xml version="1.0" encoding="UTF-8" standalone="no"?>
<svg xmlns:xlink="http://www.w3.org/1999/xlink" height="2.25px" width="1.5px" xmlns="http://www.w3.org/2000/svg">
  <g transform="matrix(1.0, 0.0, 0.0, 1.0, 5.5, 3.8)">
    <path d="M-4.0 -3.05 L-4.0 -1.55 -5.5 -2.3 -5.5 -3.8 -4.0 -3.05" fill="#990000" fill-rule="evenodd" stroke="none"/>
    <path d="M-4.0 -3.05 L-5.5 -3.8 -5.5 -2.3 -4.0 -1.55 -4.0 -3.05 Z" fill="none" stroke="#660000" stroke-linecap="round" stroke-linejoin="round" stroke-opacity="0.3019608" stroke-width="0.05"/>
  </g>
</svg>
