<?xml version="1.0" encoding="UTF-8" standalone="no"?>
<svg xmlns:xlink="http://www.w3.org/1999/xlink" height="28.3px" width="23.05px" xmlns="http://www.w3.org/2000/svg">
  <g transform="matrix(1.0, 0.0, 0.0, 1.0, 12.25, 94.6)">
    <path d="M5.4 -93.9 L4.7 -94.25 5.4 -94.6 6.1 -94.25 5.4 -93.9 M-12.2 -74.2 L-12.25 -74.2 -9.5 -75.55 -9.5 -74.4 -9.5 -74.35 -5.8 -72.55 -0.6 -75.15 -0.6 -76.7 2.1 -75.35 -6.25 -71.2 -12.2 -74.2 M-7.75 -78.75 L-6.25 -79.5 -5.15 -78.95 -4.7 -78.75 -6.25 -78.0 -7.75 -78.75 M-5.15 -87.65 L-5.15 -87.7 -3.95 -88.3 -2.8 -87.7 -3.95 -87.1 -5.15 -87.65" fill="#ffeede" fill-rule="evenodd" stroke="none"/>
    <path d="M4.7 -94.25 L5.4 -93.9 5.4 -74.3 4.7 -74.65 4.7 -94.25 M-6.25 -68.95 L-12.25 -71.95 -12.2 -71.95 -12.2 -74.2 -6.25 -71.2 -6.25 -68.95 M-7.75 -77.9 L-7.75 -78.75 -6.25 -78.0 -6.25 -76.1 -7.75 -76.85 -7.75 -77.9 M-5.15 -78.95 L-5.15 -87.65 -3.95 -87.1 -3.95 -77.35 -4.7 -77.75 -4.7 -78.75 -5.15 -78.95" fill="#fff3e3" fill-rule="evenodd" stroke="none"/>
    <path d="M5.4 -93.9 L6.1 -94.25 6.1 -74.65 5.4 -74.3 5.4 -93.9 M2.1 -75.35 L2.1 -73.15 -6.25 -68.95 -6.25 -71.2 2.1 -75.35 M-2.8 -87.7 L-2.75 -78.8 -2.75 -77.95 -3.95 -77.35 -3.95 -87.1 -2.8 -87.7 M-6.25 -76.1 L-6.25 -78.0 -4.7 -78.75 -4.7 -77.75 -4.7 -76.9 -6.25 -76.1" fill="#c4b6ac" fill-rule="evenodd" stroke="none"/>
    <path d="M9.8 -75.35 L10.75 -74.9 -0.4 -69.3 -1.4 -69.8 9.75 -75.4 9.8 -75.35 M-9.5 -77.0 L-7.75 -77.9 -7.75 -76.85 -6.25 -76.1 -4.7 -76.9 -4.7 -77.75 -3.95 -77.35 -2.75 -77.95 -2.75 -78.8 -0.6 -77.75 -5.8 -75.15 -9.5 -77.0" fill="#a88783" fill-rule="evenodd" stroke="none"/>
    <path d="M-0.4 -66.3 L-1.4 -66.8 -1.4 -69.8 -0.4 -69.3 -0.4 -66.3 M-9.5 -75.55 L-9.5 -77.0 -5.8 -75.15 -5.8 -72.55 -9.5 -74.35 -9.5 -74.4 -9.5 -75.55" fill="#a58774" fill-rule="evenodd" stroke="none"/>
    <path d="M10.75 -74.9 L10.8 -74.9 10.8 -71.9 -0.4 -66.3 -0.4 -69.3 10.75 -74.9 M-0.6 -77.75 L-0.6 -76.7 -0.6 -75.15 -5.8 -72.55 -5.8 -75.15 -0.6 -77.75" fill="#85536b" fill-rule="evenodd" stroke="none"/>
    <path d="M10.8 -71.9 L-0.4 -66.3 -1.4 -66.8 M2.1 -73.15 L-6.25 -68.95 -12.25 -71.95 M-3.95 -77.35 L-2.75 -77.95 M-9.5 -74.35 L-5.8 -72.55 M-6.25 -76.1 L-7.75 -76.85 M-3.95 -77.35 L-4.7 -77.75 M-0.6 -75.15 L-5.8 -72.55" fill="none" stroke="#660000" stroke-linecap="round" stroke-linejoin="miter" stroke-miterlimit="3.0" stroke-opacity="0.101960786" stroke-width="0.05"/>
    <path d="M4.7 -94.25 L5.4 -93.9 6.1 -94.25 5.4 -94.6 4.7 -94.25 4.7 -74.65 5.4 -74.3 5.4 -93.9 M5.4 -74.3 L6.1 -74.65 6.1 -94.25 M9.75 -75.4 L9.8 -75.4 9.8 -75.35 10.75 -74.9 10.8 -74.9 10.8 -71.9 M-1.4 -66.8 L-1.4 -69.8 9.75 -75.4 9.8 -75.35 M2.1 -75.35 L2.1 -73.15 M-12.25 -71.95 L-12.2 -71.95 -12.2 -74.2 -12.25 -74.2 -9.5 -75.55 -9.5 -77.0 -7.75 -77.9 -7.75 -78.75 -6.25 -79.5 -5.15 -78.95 -5.15 -87.65 -5.15 -87.7 -3.95 -88.3 -2.8 -87.7 -2.75 -78.8 -0.6 -77.75 -0.6 -76.7 2.1 -75.35 -6.25 -71.2 -6.25 -68.95 M-3.95 -87.1 L-5.15 -87.65 M-2.8 -87.7 L-3.95 -87.1 -3.95 -77.35 M-2.75 -77.95 L-2.75 -78.8 M-9.5 -74.4 L-9.5 -75.55 M-9.5 -74.35 L-9.5 -74.4 -9.5 -74.35 M-5.8 -72.55 L-5.8 -75.15 -9.5 -77.0 M-6.25 -78.0 L-7.75 -78.75 M-7.75 -76.85 L-7.75 -77.9 M-6.25 -78.0 L-6.25 -76.1 -4.7 -76.9 -4.7 -77.75 -4.7 -78.75 -6.25 -78.0 M-0.6 -76.7 L-0.6 -75.15 M-0.6 -77.75 L-5.8 -75.15 M-5.15 -78.95 L-4.7 -78.75 M-0.4 -66.3 L-0.4 -69.3 -1.4 -69.8 M-6.25 -71.2 L-12.2 -74.2 M-0.4 -69.3 L10.75 -74.9" fill="none" stroke="#660000" stroke-linecap="round" stroke-linejoin="miter" stroke-miterlimit="3.0" stroke-opacity="0.3019608" stroke-width="0.05"/>
  </g>
</svg>
