<?xml version="1.0" encoding="UTF-8" standalone="no"?>
<svg xmlns:xlink="http://www.w3.org/1999/xlink" height="63.45px" width="130.35px" xmlns="http://www.w3.org/2000/svg">
  <g transform="matrix(1.0, 0.0, 0.0, 1.0, 45.9, 27.35)">
    <path d="M13.65 -21.4 L25.2 -19.5 36.15 -21.4 Q43.85 -21.4 46.0 -20.3 47.2 -19.7 47.6 -18.5 L47.25 -17.8 Q46.9 -17.3 46.35 -17.3 44.15 -18.45 43.0 -18.45 34.65 -18.45 30.3 -17.1 25.95 -15.75 24.75 -15.75 L15.85 -16.85 Q14.45 -16.85 10.6 -15.45 L1.7 -12.3 Q-12.9 -7.8 -30.3 -7.8 -34.65 -7.8 -34.05 -10.5 -34.05 -12.15 -20.3 -18.45 L-18.05 -19.45 Q-17.8 -23.05 -13.05 -24.15 -10.1 -24.85 -8.1 -26.3 -6.7 -27.35 -3.95 -27.35 1.0 -27.35 4.25 -26.15 6.05 -25.5 9.45 -23.4 11.4 -22.2 13.6 -21.25 L14.05 -21.05 13.6 -21.25 13.65 -21.4 M24.05 -1.05 L13.8 -0.15 Q7.65 -0.15 -1.8 -1.9 L-11.6 -3.5 Q-11.9 -3.25 -11.9 -4.35 -11.9 -5.45 -6.6 -6.6 -5.05 -6.6 -4.55 -6.25 L-3.4 -5.55 Q-0.65 -4.5 12.75 -4.5 L25.95 -5.85 Q35.35 -7.2 44.15 -7.35 L50.4 -7.35 61.45 -5.3 Q68.85 -3.95 78.2 -3.95 82.65 -3.95 83.95 -2.6 84.65 -1.9 84.4 -1.25 84.4 0.25 83.8 0.55 L81.25 0.7 Q74.1 0.35 66.05 2.15 L58.65 4.2 Q52.3 5.85 49.25 5.85 45.2 5.85 40.6 4.05 36.4 2.15 35.4 1.95 L26.45 1.05 Q25.55 0.95 24.8 -0.05 L24.05 -1.05 M58.85 18.65 Q45.0 20.4 35.75 22.55 -17.75 13.1 -10.75 21.45 -3.8 29.75 11.9 33.35 27.55 37.0 10.85 35.8 -5.85 34.55 -22.4 23.85 L-35.25 20.15 Q-45.9 17.05 -45.9 14.9 -45.9 14.25 5.65 7.35 13.85 7.35 20.55 10.25 L27.8 13.65 Q37.7 15.75 58.4 17.75 L58.85 18.65 M-32.25 16.55 L-31.95 16.65 -31.8 16.3 -32.25 16.55" fill="url(#gradient0)" fill-rule="evenodd" stroke="none"/>
    <path d="M13.65 -21.4 L13.6 -21.25 13.35 -21.35 13.65 -21.4" fill="url(#gradient1)" fill-rule="evenodd" stroke="none"/>
  </g>
  <defs>
    <linearGradient gradientTransform="matrix(0.0729, 0.0, 0.0, 0.0175, 15.95, 21.7)" gradientUnits="userSpaceOnUse" id="gradient0" spreadMethod="pad" x1="-819.2" x2="819.2">
      <stop offset="0.0" stop-color="#ffffff"/>
      <stop offset="0.9921568627450981" stop-color="#ffffff" stop-opacity="0.0"/>
    </linearGradient>
    <linearGradient gradientTransform="matrix(2.0E-4, 0.0, 0.0, 1.0E-4, 13.5, -21.35)" gradientUnits="userSpaceOnUse" id="gradient1" spreadMethod="pad" x1="-819.2" x2="819.2">
      <stop offset="0.0" stop-color="#ffffff"/>
      <stop offset="0.9921568627450981" stop-color="#ffffff" stop-opacity="0.0"/>
    </linearGradient>
  </defs>
</svg>
