<?xml version="1.0" encoding="UTF-8" standalone="no"?>
<svg xmlns:xlink="http://www.w3.org/1999/xlink" height="112.95px" width="56.0px" xmlns="http://www.w3.org/2000/svg">
  <g transform="matrix(1.0, 0.0, 0.0, 1.0, 28.0, 56.45)">
    <path d="M23.4 -49.0 L23.35 -50.05 Q25.95 -47.65 28.0 -44.8 L28.0 56.5 15.95 50.5 15.95 -41.8 18.85 -39.9 Q19.75 -39.35 20.7 -38.9 17.9 -30.5 21.25 -26.2 22.6 -25.2 21.3 -25.75 L20.7 -26.2 23.35 -23.0 Q25.1 -35.9 23.4 -49.0 M9.0 -46.55 L9.0 47.0 -28.0 28.5 -28.0 -50.2 Q-25.25 -48.4 -23.25 -45.9 L-22.85 -45.8 -22.85 -56.45 Q-9.75 -46.0 4.75 -36.25 L4.25 -50.05 9.0 -46.55" fill="url(#gradient0)" fill-rule="evenodd" stroke="none"/>
  </g>
  <defs>
    <linearGradient gradientTransform="matrix(0.0, 0.1211, -0.0342, 0.0, 0.0, -68.7)" gradientUnits="userSpaceOnUse" id="gradient0" spreadMethod="pad" x1="-819.2" x2="819.2">
      <stop offset="0.0" stop-color="#ffffff"/>
      <stop offset="1.0" stop-color="#ffffff" stop-opacity="0.0"/>
    </linearGradient>
  </defs>
</svg>
