<?xml version="1.0" encoding="UTF-8" standalone="no"?>
<svg xmlns:xlink="http://www.w3.org/1999/xlink" height="35.45px" width="41.8px" xmlns="http://www.w3.org/2000/svg">
  <g transform="matrix(1.0, 0.0, 0.0, 1.0, 20.9, 17.7)">
    <path d="M2.45 -12.9 L12.5 -12.9 20.9 -5.0 20.35 9.0 12.35 11.0 10.4 16.25 -0.1 17.75 1.2 14.7 -4.0 10.65 -10.0 12.8 -10.35 9.9 -17.55 2.0 -20.35 -6.3 -20.9 -11.5 -18.45 -11.5 -15.05 -17.7 -13.75 -15.4 -4.7 -16.3 2.45 -12.9" fill="#bcd7fe" fill-rule="evenodd" stroke="none"/>
    <path d="M2.45 -12.9 L-4.7 -16.3 -13.75 -15.4 -15.05 -17.7 -18.45 -11.5 -20.9 -11.5 -20.35 -6.3 -17.55 2.0 -10.35 9.9 -10.0 12.8 -4.0 10.65 1.2 14.7 -0.1 17.75 10.4 16.25 12.35 11.0 20.35 9.0 20.9 -5.0 12.5 -12.9 2.45 -12.9 Z" fill="none" stroke="#ffffff" stroke-linecap="round" stroke-linejoin="round" stroke-width="0.05"/>
  </g>
</svg>
