<?xml version="1.0" encoding="UTF-8" standalone="no"?>
<svg xmlns:xlink="http://www.w3.org/1999/xlink" height="9.9px" width="12.55px" xmlns="http://www.w3.org/2000/svg">
  <g transform="matrix(1.0, 0.0, 0.0, 1.0, 0.3, 0.25)">
    <path d="M10.25 8.55 L10.2 8.6 9.15 9.15 9.1 9.1 8.0 9.65 0.85 6.1 1.9 5.55 3.05 4.95 3.1 5.0 5.05 3.95 5.1 4.0 12.2 7.55 12.25 7.55 12.2 7.6 10.25 8.55" fill="#000000" fill-opacity="0.14117648" fill-rule="evenodd" stroke="none"/>
    <path d="M6.45 9.05 L6.45 7.1 7.5 7.1 7.5 9.05 6.45 9.05 M1.5 6.05 L0.45 6.05 0.45 4.1 1.5 4.1 1.5 6.05 M8.45 6.1 L9.5 6.1 9.5 8.05 8.45 8.05 8.45 6.1" fill="#7b7b7b" fill-rule="evenodd" stroke="none"/>
    <path d="M10.1 4.8 L10.1 4.85 9.8 5.7 2.8 2.2 3.55 0.0 10.55 3.5 10.1 4.8" fill="#ffffff" fill-rule="evenodd" stroke="none"/>
    <path d="M-0.05 4.1 L2.75 2.65 2.8 2.7 9.9 6.25 9.95 6.25 9.9 6.3 7.1 7.65 -0.05 4.1" fill="#dddddd" fill-rule="evenodd" stroke="none"/>
    <path d="M10.1 4.8 L10.1 4.85" fill="none" stroke="#ffffff" stroke-linecap="round" stroke-linejoin="round" stroke-width="0.05"/>
    <path d="M-0.05 4.1 L7.1 7.65" fill="none" stroke="#ffffff" stroke-linecap="round" stroke-linejoin="round" stroke-width="0.5"/>
    <path d="M3.55 0.0 L10.55 3.5" fill="none" stroke="#dddddd" stroke-linecap="round" stroke-linejoin="round" stroke-width="0.5"/>
  </g>
</svg>
