<?xml version="1.0" encoding="UTF-8" standalone="no"?>
<svg xmlns:xlink="http://www.w3.org/1999/xlink" height="5.35px" width="1.4px" xmlns="http://www.w3.org/2000/svg">
  <g transform="matrix(1.0, 0.0, 0.0, 1.0, 0.7, 0.25)">
    <path d="M0.4 1.05 L0.35 0.45 Q0.25 0.5 0.3 0.75 L0.35 1.25 0.4 1.05 M0.0 0.5 L0.7 0.1 0.7 4.75 0.0 5.1 0.0 0.5 M0.4 2.55 L0.4 2.5 0.3 2.8 0.3 2.9 0.35 2.9 0.4 2.9 0.4 2.55 M-0.1 1.05 L-0.2 2.15 -0.3 2.15 -0.3 2.1 -0.15 0.7 -0.1 1.05 M-0.4 1.95 L-0.45 3.45 -0.5 3.45 -0.55 2.95 -0.4 1.8 -0.4 1.95 M-0.15 2.9 L-0.15 2.95 -0.15 3.35 -0.3 4.4 -0.35 4.25 -0.2 2.9 -0.15 2.9" fill="#8c8c8c" fill-rule="evenodd" stroke="none"/>
    <path d="M0.4 1.05 L0.35 1.25 0.3 0.75 Q0.25 0.5 0.35 0.45 L0.4 1.05 M0.7 0.1 L0.0 0.5 -0.7 0.1 0.0 0.5 0.0 5.1 -0.7 4.75 -0.7 0.1 0.0 -0.25 0.7 0.1 M0.4 2.55 L0.4 2.9 0.35 2.9 0.3 2.9 0.3 2.8 0.4 2.5 0.4 2.55 M-0.15 2.9 L-0.2 2.9 -0.35 4.25 -0.3 4.4 -0.15 3.35 -0.15 2.95 -0.15 2.9 M-0.4 1.95 L-0.4 1.8 -0.55 2.95 -0.5 3.45 -0.45 3.45 -0.4 1.95 M-0.1 1.05 L-0.15 0.7 -0.3 2.1 -0.3 2.15 -0.2 2.15 -0.1 1.05" fill="#cccccc" fill-rule="evenodd" stroke="none"/>
    <path d="M0.0 0.5 L0.7 0.1 0.0 -0.25 -0.7 0.1 0.0 0.5 0.0 5.1 0.7 4.75 0.7 0.1 M0.0 5.1 L-0.7 4.75 -0.7 0.1" fill="none" stroke="#660000" stroke-linecap="round" stroke-linejoin="round" stroke-opacity="0.3019608" stroke-width="0.05"/>
  </g>
</svg>
