<?xml version="1.0" encoding="UTF-8" standalone="no"?>
<svg xmlns:xlink="http://www.w3.org/1999/xlink" height="92.0px" width="48.0px" xmlns="http://www.w3.org/2000/svg">
  <g transform="matrix(1.0, 0.0, 0.0, 1.0, 24.0, 46.0)">
    <path d="M24.0 -22.0 L24.0 -6.0 20.0 -8.0 20.0 -24.0 24.0 -22.0 M-6.0 -3.95 L-6.0 -11.05 6.0 -5.05 6.0 2.05 20.0 9.05 20.0 1.95 24.0 3.95 24.0 46.0 20.0 44.0 20.0 16.1 6.0 9.1 6.0 37.0 -6.0 31.0 -6.0 3.1 -20.0 -3.9 -20.0 24.0 -24.0 22.0 -24.0 -20.05 -20.0 -18.05 -20.0 -10.95 -6.0 -3.95 M-20.0 -44.0 L-20.0 -28.0 -24.0 -30.0 -24.0 -46.0 -23.95 -46.0 -20.0 -44.0 M6.0 -31.0 L6.0 -15.0 -6.0 -21.0 -6.0 -37.0 6.0 -31.0" fill="url(#gradient0)" fill-rule="evenodd" stroke="none"/>
  </g>
  <defs>
    <linearGradient gradientTransform="matrix(0.0, 0.0435, -0.0281, 0.0, -11.6, -8.9)" gradientUnits="userSpaceOnUse" id="gradient0" spreadMethod="pad" x1="-819.2" x2="819.2">
      <stop offset="0.0" stop-color="#ffffff"/>
      <stop offset="1.0" stop-color="#ffffff" stop-opacity="0.0"/>
    </linearGradient>
  </defs>
</svg>
