<?xml version="1.0" encoding="UTF-8" standalone="no"?>
<svg xmlns:xlink="http://www.w3.org/1999/xlink" height="46.9px" width="163.05px" xmlns="http://www.w3.org/2000/svg">
  <g transform="matrix(1.0, 0.0, 0.0, 1.0, 91.75, -44.65)">
    <path d="M70.75 64.9 Q71.3 64.9 71.3 65.4 L70.55 66.45 69.3 67.5 69.55 68.1 Q69.55 69.15 68.0 69.15 L67.75 69.5 67.85 69.15 67.35 68.1 Q68.05 67.7 68.4 66.9 68.75 65.7 69.65 66.0 69.75 64.9 70.75 64.9 M66.65 69.25 L65.7 70.7 65.35 70.3 66.9 67.6 Q67.25 67.6 67.25 67.95 L66.65 69.25 M32.25 72.75 L31.75 72.65 31.7 72.25 Q31.7 69.95 33.35 69.95 33.7 69.95 33.7 70.4 L32.25 72.75 M29.2 79.45 Q27.9 82.65 27.0 82.65 L26.5 82.1 28.75 78.5 Q29.35 78.5 29.2 79.45 M30.1 78.45 L30.05 78.5 29.85 78.55 29.35 77.8 Q29.35 77.0 29.85 77.0 30.25 77.0 30.25 77.55 L30.1 78.45 M25.55 82.0 L25.65 82.2 Q24.75 84.4 24.2 84.4 L23.2 84.25 22.75 83.85 Q22.75 82.9 25.05 82.0 L25.55 82.0 M21.0 84.25 Q20.3 84.0 19.75 84.75 19.1 85.55 18.65 85.55 L17.7 85.0 16.55 84.85 Q16.45 85.4 16.05 85.4 L15.45 84.9 Q15.45 82.9 16.65 82.9 17.25 82.9 17.25 83.7 17.35 83.4 17.85 83.4 18.55 83.4 18.55 84.1 L18.65 84.15 Q18.9 84.15 20.25 83.15 20.65 83.15 21.0 84.25 M5.5 85.3 Q4.8 85.3 4.8 84.9 4.8 84.15 6.0 84.15 L6.45 84.55 Q6.45 85.3 5.5 85.3 M0.45 83.15 L3.4 83.9 Q3.9 83.9 3.9 84.4 3.9 85.5 2.0 85.5 1.3 85.5 1.2 85.0 L1.0 85.35 1.1 84.75 Q0.6 83.85 0.45 83.15 M12.6 84.0 Q13.05 83.55 13.45 83.55 14.25 83.55 14.15 84.25 L12.35 85.5 Q11.75 85.5 11.35 84.95 L10.45 85.7 9.9 85.2 Q9.9 84.9 10.75 84.1 11.6 83.25 12.05 83.25 12.75 83.25 12.6 84.0 M61.2 72.45 Q60.95 73.25 60.25 73.25 L59.75 72.7 60.35 71.6 Q60.95 70.75 61.2 70.75 L61.8 71.25 63.4 69.85 Q64.25 69.85 64.65 71.65 64.65 72.2 64.05 72.2 L63.25 71.6 Q62.55 72.7 62.0 72.7 L61.2 72.45 M58.65 72.3 Q58.65 72.85 58.15 72.85 L57.5 72.4 55.8 72.95 55.25 72.45 Q57.6 70.95 57.65 70.95 58.45 70.95 58.65 72.3 M52.65 70.9 L50.5 72.25 49.95 71.9 49.5 72.15 49.0 71.65 49.95 70.3 50.5 70.85 50.6 70.9 51.5 70.2 Q52.3 70.2 52.65 70.9 M-79.05 49.9 L-79.15 49.95 Q-79.4 49.95 -79.75 45.0 -79.75 44.65 -79.45 44.65 -79.1 44.65 -79.0 46.4 L-78.95 48.15 -79.05 49.9 M-78.4 48.0 Q-78.2 48.0 -77.75 49.65 -77.3 51.4 -77.3 52.5 L-77.05 52.45 Q-76.65 52.45 -76.6 53.05 L-76.6 53.65 Q-76.6 54.5 -75.9 55.55 -75.9 56.35 -76.65 56.35 -77.2 56.35 -77.7 54.35 L-78.05 55.2 Q-78.5 55.2 -78.5 54.2 -78.45 53.25 -77.95 53.2 L-78.75 48.4 -78.7 48.1 -78.4 48.0 M-73.9 59.45 Q-74.6 59.45 -74.65 57.6 -74.65 56.75 -74.2 56.75 L-73.6 58.6 -73.65 59.3 -73.9 59.45 M-71.05 61.8 L-71.45 60.4 Q-71.45 59.9 -70.95 59.9 -70.5 59.9 -70.0 61.6 L-69.3 61.35 -68.3 63.2 Q-68.3 63.8 -68.9 63.8 -69.45 63.8 -69.55 63.15 -69.75 63.6 -70.45 63.6 -71.15 63.6 -71.15 62.75 -71.8 62.95 -71.8 62.4 -71.8 61.85 -71.05 61.8 M-66.9 64.3 Q-66.9 63.7 -66.35 63.7 L-64.85 66.2 Q-64.85 66.8 -65.45 66.8 L-65.8 66.65 -66.35 66.75 Q-66.8 66.75 -66.8 66.25 -66.8 65.85 -66.35 65.8 L-66.9 64.3 M-62.05 66.3 Q-61.45 66.3 -61.4 66.95 L-61.25 68.15 -60.6 67.75 Q-60.1 67.75 -60.1 68.2 L-60.5 68.85 -61.3 69.35 Q-62.0 69.35 -62.35 68.4 L-62.7 68.65 Q-63.3 68.65 -63.3 68.2 -62.35 66.3 -62.05 66.3 M-47.05 72.75 Q-47.05 73.2 -47.5 73.2 L-47.85 72.95 -48.85 73.7 -49.5 73.4 -49.95 73.6 Q-50.7 73.6 -51.35 72.6 L-52.2 72.9 Q-52.8 72.9 -52.75 72.3 L-52.2 71.75 -51.0 71.35 -48.85 72.15 Q-48.3 71.8 -47.95 71.8 L-47.05 72.75 M-54.85 71.4 Q-55.4 71.4 -56.1 70.05 L-56.5 70.8 Q-56.75 71.4 -57.15 71.4 -57.55 71.4 -57.55 71.0 -56.6 68.0 -55.95 68.0 L-54.15 70.8 Q-54.15 71.4 -54.85 71.4 M-19.05 80.7 Q-19.05 81.15 -19.5 81.15 -20.4 81.15 -20.5 80.0 -20.5 79.4 -20.05 79.4 L-19.05 80.7 M-18.95 87.45 L-19.3 87.05 Q-18.8 84.9 -18.3 84.9 -17.9 84.9 -17.6 86.8 -17.5 87.1 -16.8 87.4 L-16.75 88.3 Q-16.75 89.35 -17.1 89.35 -17.7 89.35 -18.45 87.05 L-18.5 87.0 Q-18.55 87.45 -18.95 87.45 M-13.6 91.35 L-14.55 91.2 Q-15.35 91.2 -15.15 90.6 -15.15 88.1 -14.35 88.1 L-13.2 90.9 Q-13.2 91.35 -13.6 91.35 M-11.0 90.6 Q-11.0 89.55 -10.25 89.55 L-9.35 90.7 -10.4 91.55 Q-10.9 91.55 -11.0 90.6 M-1.65 83.9 Q-2.45 85.2 -3.55 84.85 L-3.45 85.1 -3.65 85.3 Q-4.45 85.3 -4.45 83.75 -4.45 82.5 -3.95 82.5 -3.45 82.5 -3.35 82.95 L-3.2 83.7 -2.3 83.1 Q-1.7 83.1 -1.65 83.9 M-25.9 78.7 Q-26.15 78.7 -26.25 78.95 L-26.5 78.3 Q-26.5 76.5 -25.7 76.5 -25.3 76.5 -24.8 78.2 -24.3 77.7 -24.2 77.7 -23.65 77.7 -23.15 78.75 L-22.75 79.85 -23.1 80.0 Q-23.55 80.0 -24.0 79.2 -24.25 79.25 -24.75 79.65 -25.35 79.65 -25.8 78.75 L-25.9 78.7 M-27.45 78.05 Q-27.9 78.05 -28.2 76.9 -28.2 76.2 -27.8 76.2 L-27.05 77.65 Q-27.05 78.05 -27.45 78.05 M-89.85 55.0 L-89.3 57.2 -89.35 57.5 -89.55 57.6 Q-90.15 57.6 -90.1 55.2 L-90.05 55.05 -89.85 55.0 M-86.55 56.8 L-86.5 56.8 Q-86.15 55.0 -85.6 55.0 -85.2 55.0 -85.2 55.3 L-85.65 57.2 Q-86.15 58.75 -86.4 58.75 -87.25 58.75 -87.25 57.5 L-87.35 57.35 Q-87.7 57.7 -88.25 57.7 -89.05 57.7 -89.05 57.3 L-88.6 56.85 Q-88.1 56.75 -87.85 56.25 L-87.75 55.6 Q-87.65 55.15 -87.25 55.15 -86.8 55.15 -86.55 56.8 M-84.35 55.2 Q-83.95 55.2 -83.75 57.8 L-84.05 57.9 -84.65 55.3 -84.35 55.2 M-91.4 54.1 Q-91.1 54.35 -90.85 56.55 L-90.85 57.15 -91.2 57.25 Q-91.65 57.25 -91.75 55.1 -91.75 54.3 -91.4 54.1" fill="#bcce00" fill-rule="evenodd" stroke="none"/>
  </g>
</svg>
