<?xml version="1.0" encoding="UTF-8" standalone="no"?>
<svg xmlns:xlink="http://www.w3.org/1999/xlink" height="34.05px" width="51.65px" xmlns="http://www.w3.org/2000/svg">
  <g transform="matrix(1.0, 0.0, 0.0, 1.0, 25.8, 17.0)">
    <path d="M7.95 -6.95 L10.2 2.5 15.85 1.45 16.95 7.3 25.85 7.3 25.85 17.05 -8.3 14.05 -25.8 5.95 -24.65 -9.5 -5.2 -17.0 -3.6 -13.7 -5.75 -8.8 1.3 -3.7 3.3 -6.95 7.95 -6.95" fill="#bcd7fe" fill-rule="evenodd" stroke="none"/>
    <path d="M7.95 -6.95 L10.2 2.5 15.85 1.45 16.95 7.3 25.85 7.3 25.85 17.05 -8.3 14.05 -25.8 5.95 -24.65 -9.5 -5.2 -17.0 -3.6 -13.7 -5.75 -8.8 1.3 -3.7 3.3 -6.95 7.95 -6.95 Z" fill="none" stroke="#ffffff" stroke-linecap="round" stroke-linejoin="round" stroke-width="0.05"/>
  </g>
</svg>
