<?xml version="1.0" encoding="UTF-8" standalone="no"?>
<svg xmlns:xlink="http://www.w3.org/1999/xlink" height="80.1px" width="209.8px" xmlns="http://www.w3.org/2000/svg">
  <g transform="matrix(1.0, 0.0, 0.0, 1.0, 0.0, -41.0)">
    <path d="M97.25 98.4 L97.25 85.65 110.3 85.65 110.3 100.25 97.25 98.4" fill="#808080" fill-rule="evenodd" stroke="none"/>
    <path d="M110.3 100.25 L110.3 121.1 97.25 121.1 97.25 98.4 110.3 100.25" fill="url(#gradient0)" fill-rule="evenodd" stroke="none"/>
    <path d="M97.25 98.4 L97.25 85.65 110.3 85.65 110.3 100.25 110.3 121.1 M97.25 121.1 L97.25 98.4 Z" fill="none" stroke="#660000" stroke-linecap="round" stroke-linejoin="round" stroke-opacity="0.3019608" stroke-width="0.05"/>
    <path d="M201.3 87.9 L201.3 49.5 8.5 49.5 8.5 87.9 201.3 87.9 M207.8 87.9 Q207.8 90.6 205.9 92.5 204.0 94.4 201.3 94.4 L8.5 94.4 Q5.8 94.4 3.9 92.5 2.0 90.6 2.0 87.9 L2.0 49.5 Q2.0 46.8 3.9 44.9 5.8 43.0 8.5 43.0 L201.3 43.0 Q204.0 43.0 205.9 44.9 207.8 46.8 207.8 49.5 L207.8 87.9" fill="url(#gradient1)" fill-rule="evenodd" stroke="none"/>
    <path d="M201.3 87.9 L8.5 87.9 8.5 49.5 201.3 49.5 201.3 87.9 M207.8 87.9 L207.8 49.5 Q207.8 46.8 205.9 44.9 204.0 43.0 201.3 43.0 L8.5 43.0 Q5.8 43.0 3.9 44.9 2.0 46.8 2.0 49.5 L2.0 87.9 Q2.0 90.6 3.9 92.5 5.8 94.4 8.5 94.4 L201.3 94.4 Q204.0 94.4 205.9 92.5 207.8 90.6 207.8 87.9 M209.8 87.9 Q209.8 91.4 207.3 93.9 204.8 96.4 201.3 96.4 L8.5 96.4 Q5.0 96.4 2.5 93.9 0.0 91.4 0.0 87.9 L0.0 49.5 Q0.0 46.0 2.5 43.5 5.0 41.0 8.5 41.0 L201.3 41.0 Q204.8 41.0 207.3 43.5 209.8 46.0 209.8 49.5 L209.8 87.9" fill="url(#gradient2)" fill-rule="evenodd" stroke="none"/>
    <path d="M209.8 87.9 Q209.8 91.4 207.3 93.9 204.8 96.4 201.3 96.4 L8.5 96.4 Q5.0 96.4 2.5 93.9 0.0 91.4 0.0 87.9 L0.0 49.5 Q0.0 46.0 2.5 43.5 5.0 41.0 8.5 41.0 L201.3 41.0 Q204.8 41.0 207.3 43.5 209.8 46.0 209.8 49.5 L209.8 87.9 Z" fill="none" stroke="#660000" stroke-linecap="round" stroke-linejoin="round" stroke-opacity="0.3019608" stroke-width="0.05"/>
  </g>
  <defs>
    <linearGradient gradientTransform="matrix(0.008, 0.0, 0.0, 0.0223, 103.75, 103.9)" gradientUnits="userSpaceOnUse" id="gradient0" spreadMethod="pad" x1="-819.2" x2="819.2">
      <stop offset="0.0" stop-color="#a2a2a2"/>
      <stop offset="1.0" stop-color="#adaeaf"/>
    </linearGradient>
    <linearGradient gradientTransform="matrix(0.1256, 0.0, 0.0, 0.0332, 104.9, 70.2)" gradientUnits="userSpaceOnUse" id="gradient1" spreadMethod="pad" x1="-819.2" x2="819.2">
      <stop offset="0.0" stop-color="#cc0000"/>
      <stop offset="1.0" stop-color="#a85a83"/>
    </linearGradient>
    <linearGradient gradientTransform="matrix(0.1521, 0.0408, -0.0065, 0.0244, 104.9, 70.2)" gradientUnits="userSpaceOnUse" id="gradient2" spreadMethod="pad" x1="-819.2" x2="819.2">
      <stop offset="0.0" stop-color="#fbfbfb"/>
      <stop offset="1.0" stop-color="#e7eef5"/>
    </linearGradient>
  </defs>
</svg>
