<?xml version="1.0" encoding="UTF-8" standalone="no"?>
<svg xmlns:xlink="http://www.w3.org/1999/xlink" height="24.9px" width="25.3px" xmlns="http://www.w3.org/2000/svg">
  <g transform="matrix(1.0, 0.0, 0.0, 1.0, 13.65, 11.65)">
    <path d="M6.25 9.85 L6.2 9.9 6.25 9.85 M-8.25 -8.25 L-7.9 -8.6 -7.85 -8.5 -8.25 -8.25" fill="url(#gradient0)" fill-rule="evenodd" stroke="none"/>
    <path d="M0.05 -7.75 L0.35 -7.7 0.75 -7.6 1.95 -7.15 2.8 -6.7 3.6 -6.2 4.8 -5.15 5.0 -4.9 6.0 -3.65 6.25 -3.35 6.3 -3.2 6.95 -1.85 7.35 -0.45 7.45 -0.05 7.5 0.35 7.55 1.55 7.55 1.6 7.55 2.0 7.35 3.65 7.3 4.0 7.05 4.85 6.35 6.35 6.3 6.4 6.15 6.7 4.9 8.2 4.8 8.3 4.75 8.3 Q2.65 9.55 0.0 9.55 -2.65 9.55 -4.75 8.3 -5.85 7.7 -6.75 6.75 L-8.25 4.8 Q-9.55 2.65 -9.55 0.0 L-9.55 -0.05 Q-9.55 -2.7 -8.3 -4.8 L-6.9 -6.6 -6.8 -6.7 -5.2 -7.4 -4.4 -7.65 -3.25 -7.9 -2.0 -7.95 -1.1 -7.95 -0.1 -7.8 -0.05 -7.8 -0.25 -5.15 -0.3 -4.25 -1.1 -4.1 -0.3 -4.25 -0.7 0.0 -0.8 -0.4 -0.7 0.0 -3.5 2.4 -4.35 3.15 -4.65 3.4 -3.95 3.0 -3.35 2.6 -0.25 0.8 0.05 1.25 0.8 0.25 0.4 -4.2 0.05 -7.75 M0.35 -7.7 L0.4 -4.2 0.35 -7.7 M5.0 -4.9 L4.0 -3.9 5.0 -4.9 M0.75 -4.2 L0.4 -4.2 0.75 -4.2 0.75 -7.6 0.75 -4.2 1.1 -4.1 2.15 -3.7 2.2 -3.65 2.15 -3.7 1.1 -4.1 0.75 -4.2 M3.6 -6.2 L2.2 -3.65 3.6 -6.2 M0.25 0.5 L0.3 0.5 -0.1 0.7 0.25 0.5 M4.25 -0.35 L4.15 -1.1 3.85 -1.9 4.15 -1.1 4.25 -0.35 7.35 -0.45 4.25 -0.35 4.3 0.0 4.25 0.4 4.15 1.1 3.9 1.8 3.7 2.15 3.5 2.5 3.05 3.0 3.05 3.05 2.15 3.7 1.1 4.15 0.0 4.25 -0.65 4.2 -1.1 4.15 -2.1 3.7 -2.4 3.55 -2.7 3.3 -3.0 3.05 -3.0 3.0 -3.35 2.6 -3.0 3.0 -3.0 3.05 -2.7 3.3 -2.4 3.55 -2.1 3.7 -1.1 4.15 -0.65 4.2 0.0 4.25 1.1 4.15 2.15 3.7 3.05 3.05 3.05 3.0 3.5 2.5 3.7 2.15 3.9 1.8 4.15 1.1 4.25 0.4 4.3 0.0 4.25 -0.35 M3.65 -2.25 L3.05 -3.0 2.2 -3.65 3.05 -3.0 3.65 -2.25 6.0 -3.65 3.65 -2.25 3.7 -2.1 3.85 -1.9 3.7 -2.1 3.65 -2.25 M6.25 -3.35 L3.85 -1.9 6.25 -3.35 M1.45 -5.4 L1.95 -7.15 1.45 -5.4 M6.95 -1.85 L5.45 -1.45 6.95 -1.85 M-4.25 -7.4 L-5.0 -6.9 -6.0 -6.05 -6.0 -6.0 -6.0 -6.05 -5.0 -6.9 -4.25 -7.4 -4.4 -7.65 -4.25 -7.4 -4.05 -7.5 -3.7 -7.7 -3.25 -7.9 -3.7 -7.7 -4.05 -7.5 -4.25 -7.4 M-0.1 -7.8 L-0.6 -6.3 -1.1 -7.95 -0.6 -6.3 -0.1 -7.8 M-5.2 -7.4 L-6.4 -6.4 -7.85 -4.55 Q-8.5 -3.5 -8.75 -2.3 L-9.05 -0.05 -9.05 0.0 -8.75 2.4 -7.85 4.55 -6.4 6.4 -6.4 6.45 -4.5 7.9 -2.3 8.8 0.0 9.05 2.35 8.8 4.55 7.85 6.15 6.7 4.55 7.85 2.35 8.8 0.0 9.05 -2.3 8.8 -4.5 7.9 -6.4 6.45 -6.4 6.4 -7.85 4.55 -8.75 2.4 -9.05 0.0 -9.05 -0.05 -8.75 -2.3 Q-8.5 -3.5 -7.85 -4.55 L-6.4 -6.4 -5.2 -7.4 M-7.1 -4.7 L-5.65 -3.15 -7.7 -3.7 -5.65 -3.15 -7.1 -4.7 -7.4 -4.25 -7.7 -3.7 -8.25 -2.2 -8.45 -0.9 -8.25 -2.2 -7.7 -3.7 -7.4 -4.25 -7.1 -4.7 -6.0 -6.0 -7.1 -4.7 M-4.2 -0.65 L-6.25 -0.2 -8.45 -0.9 -6.25 -0.2 -4.2 -0.65 -4.1 -1.1 -3.95 -1.55 -4.1 -1.1 -4.2 -0.65 -4.25 0.0 -4.25 0.4 -4.2 0.75 -4.1 1.1 -4.1 1.15 -4.0 1.5 -3.85 1.85 -3.65 2.15 -3.5 2.4 -3.65 2.15 -3.85 1.85 -4.0 1.5 -4.1 1.15 -4.1 1.1 -4.2 0.75 -4.25 0.4 -4.25 0.0 -4.2 -0.65 M-3.4 -2.5 L-5.65 -3.15 -3.95 -1.55 -5.65 -3.15 -3.4 -2.5 -3.0 -3.0 -2.1 -3.7 -1.95 -3.8 -2.1 -3.7 -3.0 -3.0 -3.4 -2.5 -3.7 -2.1 -3.95 -1.55 -3.7 -2.1 -3.4 -2.5 M-3.15 -3.55 L-3.55 -5.45 -1.95 -3.8 -3.55 -5.45 -3.15 -3.55 M-8.75 -2.3 L-8.25 -2.2 -8.75 -2.3 M-6.4 -6.4 L-6.0 -6.0 -6.4 -6.4 M-8.45 -0.9 L-8.5 0.0 -8.45 -0.9 M-7.15 -1.9 L-5.4 -1.45 -7.15 -1.9 M-7.4 -4.25 L-7.85 -4.55 -7.4 -4.25 M-1.1 -4.1 L-0.6 -6.3 -0.25 -5.15 -0.6 -6.3 -1.1 -4.1 -1.6 -3.95 -1.95 -3.8 -1.6 -3.95 -1.1 -4.1 M-3.9 -3.95 L-5.2 -5.25 -3.9 -3.95 M-1.9 -7.15 L-1.45 -5.4 -1.9 -7.15 M-1.6 -3.95 L-3.7 -7.7 -1.6 -3.95 M-4.05 -7.5 L-3.55 -5.45 -5.0 -6.9 -3.55 -5.45 -4.05 -7.5 M-6.65 5.3 L-3.65 2.85 -3.95 3.0 -3.65 2.85 -6.65 5.3 -6.0 6.0 -6.0 6.05 -4.25 7.4 -4.15 7.45 -4.25 7.4 -6.0 6.05 -6.0 6.0 -6.65 5.3 -7.35 4.35 -7.35 4.3 -7.35 4.35 -6.65 5.3 M-3.1 7.95 L-1.65 4.25 -4.15 7.45 -1.65 4.25 -3.1 7.95 -2.2 8.25 0.0 8.5 0.9 8.45 0.0 8.5 -2.2 8.25 -3.1 7.95 -4.15 7.45 -3.1 7.95 M-0.65 4.2 L-0.65 8.05 0.3 4.5 0.9 8.45 0.3 4.5 -0.65 8.05 -0.65 4.2 M-5.25 1.8 L-7.15 1.95 -5.25 1.8 -4.1 1.15 -5.25 1.8 -7.9 3.25 -5.25 1.8 M-8.25 2.2 L-8.75 2.4 -8.25 2.2 -8.5 0.75 -8.5 0.35 -8.5 0.0 -8.5 0.35 -8.5 0.75 -8.25 2.2 -7.9 3.25 -7.7 3.6 -7.55 4.0 -7.35 4.3 -7.55 4.0 -7.7 3.6 -7.9 3.25 -8.25 2.2 M-9.05 0.0 L-8.5 0.0 -9.05 0.0 M-7.85 4.55 L-7.35 4.3 -7.85 4.55 M-4.5 7.9 L-4.25 7.4 -4.5 7.9 M-6.4 6.45 L-6.0 6.05 -6.4 6.45 M-2.2 8.25 L-2.3 8.8 -2.2 8.25 M-3.9 4.0 L-5.2 5.3 -3.9 4.0 M-1.9 7.15 L-1.45 5.4 -1.9 7.15 M-7.35 4.35 L-4.35 3.15 -7.35 4.35 M-3.85 1.85 L-7.55 4.0 -3.85 1.85 M-2.4 3.55 L-4.6 6.65 -2.7 3.3 -4.6 6.65 -2.4 3.55 M-4.0 1.5 L-7.7 3.6 -4.0 1.5 M-8.5 0.75 L-4.2 0.75 -8.5 0.75 M7.55 2.0 L5.45 1.5 7.55 2.0 M6.05 6.05 L6.05 6.0 6.8 5.15 7.05 4.85 6.8 5.15 6.05 6.0 6.05 6.05 6.35 6.35 6.05 6.05 4.8 7.1 4.3 7.4 3.8 7.65 2.2 8.25 3.8 7.65 4.3 7.4 4.8 7.1 6.05 6.05 M2.35 8.8 L2.2 8.25 2.35 8.8 M4.55 7.85 L4.3 7.4 4.55 7.85 M2.2 8.25 L0.9 8.45 2.2 8.25 M0.0 9.05 L0.0 8.5 0.0 9.05 M1.95 7.15 L1.5 5.4 1.95 7.15 M5.3 5.25 L4.0 3.95 5.3 5.25 M4.3 0.0 L7.45 -0.05 4.3 0.0 M6.8 5.15 L4.0 2.9 7.3 4.0 4.0 2.9 6.8 5.15 M7.35 3.65 L3.9 1.8 7.35 3.65 M7.5 0.35 L4.25 0.4 7.5 0.35 M4.8 7.1 L2.4 4.1 3.8 7.65 2.4 4.1 4.8 7.1 M-6.25 -0.2 L-8.5 0.35 -6.25 -0.2 -4.25 0.4 -6.25 -0.2" fill="#f3f2f1" fill-rule="evenodd" stroke="none"/>
    <path d="M6.2 9.9 L3.85 11.7 Q1.25 13.25 -2.0 13.25 -5.2 13.25 -7.8 11.7 -9.1 10.95 -10.25 9.85 L-12.1 7.45 Q-13.65 4.85 -13.65 1.6 L-13.65 1.55 Q-13.65 -1.65 -12.1 -4.25 -11.4 -5.55 -10.25 -6.65 L-8.25 -8.25 -7.85 -8.5 Q-5.25 -10.1 -2.0 -10.05 0.25 -10.1 2.2 -9.35 L3.85 -8.55 6.25 -6.65 8.15 -4.25 Q9.25 -2.35 9.55 -0.05 L9.55 0.0 9.65 1.55 9.65 1.6 Q9.65 4.85 8.1 7.45 L6.25 9.85 6.2 9.9 M7.55 1.55 L7.5 0.35 7.45 -0.05 7.35 -0.45 6.95 -1.85 6.3 -3.2 6.25 -3.35 6.0 -3.65 5.0 -4.9 4.8 -5.15 3.6 -6.2 2.8 -6.7 1.95 -7.15 0.75 -7.6 0.35 -7.7 0.05 -7.75 -0.05 -7.8 -0.1 -7.8 -1.1 -7.95 -2.0 -7.95 -3.25 -7.9 -4.4 -7.65 -5.2 -7.4 -6.8 -6.7 -6.9 -6.6 -8.75 -5.15 -10.3 -3.2 Q-11.55 -1.1 -11.55 1.55 L-11.55 1.6 Q-11.55 4.25 -10.25 6.4 L-8.75 8.35 -6.75 9.9 Q-5.5 10.6 -4.1 10.95 L-2.0 11.15 Q0.65 11.15 2.8 9.9 L4.8 8.35 4.85 8.3 4.9 8.2 6.15 6.7 6.3 6.4 6.35 6.35 7.05 4.85 7.3 4.0 7.35 3.65 7.55 2.0 7.55 1.6 7.55 1.55" fill="url(#gradient1)" fill-rule="evenodd" stroke="none"/>
    <path d="M-0.05 -7.8 L0.05 -7.75 0.4 -4.2 0.8 0.25 0.05 1.25 -0.25 0.8 -0.1 0.7 -0.25 0.8 -3.35 2.6 -3.95 3.0 -4.65 3.4 -4.35 3.15 -3.5 2.4 -0.7 0.0 -0.3 -4.25 -0.25 -5.15 -0.05 -7.8 M0.25 0.5 L0.5 -0.3 0.1 -0.35 0.5 -0.3 0.25 0.5 -0.1 0.7 0.3 0.5 0.25 0.5 M-0.1 -0.35 L-0.3 -0.35 -0.7 0.0 -0.3 -0.35 -0.1 -0.35 0.1 -0.35 0.0 -0.4 -0.1 -0.35" fill="#ffcc00" fill-rule="evenodd" stroke="none"/>
    <path d="M-7.9 -8.6 L-5.85 -10.1 Q-3.25 -11.7 0.0 -11.65 3.25 -11.7 5.85 -10.15 L8.25 -8.25 Q9.4 -7.15 10.15 -5.85 11.65 -3.25 11.65 -0.05 L11.65 0.0 Q11.65 3.25 10.1 5.85 L8.25 8.25 6.25 9.85 8.1 7.45 Q9.65 4.85 9.65 1.6 L9.65 1.55 9.55 0.0 9.55 -0.05 Q9.25 -2.35 8.15 -4.25 L6.25 -6.65 3.85 -8.55 2.2 -9.35 Q0.25 -10.1 -2.0 -10.05 -5.25 -10.1 -7.85 -8.5 L-7.9 -8.6" fill="url(#gradient2)" fill-rule="evenodd" stroke="none"/>
    <path d="M4.8 8.35 L2.8 9.9 Q0.65 11.15 -2.0 11.15 L-4.1 10.95 Q-5.5 10.6 -6.75 9.9 L-8.75 8.35 -10.25 6.4 Q-11.55 4.25 -11.55 1.6 L-11.55 1.55 Q-11.55 -1.1 -10.3 -3.2 L-8.75 -5.15 -6.9 -6.6 -8.3 -4.8 Q-9.55 -2.7 -9.55 -0.05 L-9.55 0.0 Q-9.55 2.65 -8.25 4.8 L-6.75 6.75 Q-5.85 7.7 -4.75 8.3 -2.65 9.55 0.0 9.55 2.65 9.55 4.75 8.3 L4.8 8.35" fill="url(#gradient3)" fill-rule="evenodd" stroke="none"/>
    <path d="M-7.9 -8.6 L-5.85 -10.1 Q-3.25 -11.7 0.0 -11.65 3.25 -11.7 5.85 -10.15 L8.25 -8.25 Q9.4 -7.15 10.15 -5.85 11.65 -3.25 11.65 -0.05 M11.65 0.0 Q11.65 3.25 10.1 5.85 L8.25 8.25 6.25 9.85 6.2 9.9 3.85 11.7 Q1.25 13.25 -2.0 13.25 -5.2 13.25 -7.8 11.7 -9.1 10.95 -10.25 9.85 L-12.1 7.45 Q-13.65 4.85 -13.65 1.6 M-13.65 1.55 Q-13.65 -1.65 -12.1 -4.25 -11.4 -5.55 -10.25 -6.65 L-8.25 -8.25 -7.9 -8.6 M-7.85 -8.5 Q-5.25 -10.1 -2.0 -10.05 0.25 -10.1 2.2 -9.35 L3.85 -8.55 6.25 -6.65 8.15 -4.25 Q9.25 -2.35 9.55 -0.05 L9.55 0.0 9.65 1.55 M9.65 1.6 Q9.65 4.85 8.1 7.45 L6.25 9.85 6.2 9.9 M0.05 -7.75 L0.35 -7.7 0.75 -7.6 1.95 -7.15 2.8 -6.7 3.6 -6.2 4.8 -5.15 5.0 -4.9 6.0 -3.65 6.25 -3.35 6.3 -3.2 6.95 -1.85 7.35 -0.45 7.45 -0.05 7.5 0.35 7.55 1.55 M7.55 1.6 L7.55 2.0 7.35 3.65 7.3 4.0 7.05 4.85 6.35 6.35 6.3 6.4 6.15 6.7 4.9 8.2 4.85 8.3 4.8 8.35 2.8 9.9 Q0.65 11.15 -2.0 11.15 L-4.1 10.95 Q-5.5 10.6 -6.75 9.9 L-8.75 8.35 -10.25 6.4 Q-11.55 4.25 -11.55 1.6 M-11.55 1.55 Q-11.55 -1.1 -10.3 -3.2 L-8.75 -5.15 -6.9 -6.6 -6.8 -6.7 -5.2 -7.4 -4.4 -7.65 -3.25 -7.9 -2.0 -7.95 -1.1 -7.95 -0.1 -7.8 -0.05 -7.8 0.05 -7.75 M0.4 -4.2 L0.75 -4.2 1.1 -4.1 2.15 -3.7 2.2 -3.65 3.05 -3.0 3.65 -2.25 3.7 -2.1 3.85 -1.9 4.15 -1.1 4.25 -0.35 M-6.0 -6.0 L-6.0 -6.05 -5.0 -6.9 -4.25 -7.4 -4.05 -7.5 -3.7 -7.7 -3.25 -7.9 M6.15 6.7 L4.55 7.85 2.35 8.8 0.0 9.05 -2.3 8.8 -4.5 7.9 -6.4 6.45 -6.4 6.4 -7.85 4.55 -8.75 2.4 -9.05 0.0 -9.05 -0.05 -8.75 -2.3 Q-8.5 -3.5 -7.85 -4.55 L-6.4 -6.4 -5.2 -7.4 M-8.25 -8.25 L-7.85 -8.5 M-7.1 -4.7 L-7.4 -4.25 -7.7 -3.7 -8.25 -2.2 -8.45 -0.9 M-4.2 -0.65 L-4.1 -1.1 -3.95 -1.55 M-3.4 -2.5 L-3.0 -3.0 -2.1 -3.7 -1.95 -3.8 M-7.1 -4.7 L-6.0 -6.0 M-8.5 0.0 L-8.45 -0.9 M4.75 8.3 Q2.65 9.55 0.0 9.55 -2.65 9.55 -4.75 8.3 -5.85 7.7 -6.75 6.75 L-8.25 4.8 Q-9.55 2.65 -9.55 0.0 L-9.55 -0.05 Q-9.55 -2.7 -8.3 -4.8 L-6.9 -6.6 M-1.1 -4.1 L-0.3 -4.25 M-1.1 -4.1 L-1.6 -3.95 -1.95 -3.8 M-3.4 -2.5 L-3.7 -2.1 -3.95 -1.55 M-4.2 -0.65 L-4.25 0.0 -4.25 0.4 -4.2 0.75 -4.1 1.1 -4.1 1.15 -4.0 1.5 -3.85 1.85 -3.65 2.15 -3.5 2.4 M-3.35 2.6 L-3.0 3.0 -3.0 3.05 -2.7 3.3 -2.4 3.55 -2.1 3.7 -1.1 4.15 -0.65 4.2 0.0 4.25 1.1 4.15 2.15 3.7 3.05 3.05 3.05 3.0 3.5 2.5 3.7 2.15 3.9 1.8 4.15 1.1 4.25 0.4 4.3 0.0 4.25 -0.35 M-6.65 5.3 L-6.0 6.0 -6.0 6.05 -4.25 7.4 -4.15 7.45 M-3.1 7.95 L-2.2 8.25 0.0 8.5 0.9 8.45 2.2 8.25 M-8.25 2.2 L-8.5 0.75 -8.5 0.35 -8.5 0.0 M-7.35 4.3 L-7.55 4.0 -7.7 3.6 -7.9 3.25 -8.25 2.2 M-6.65 5.3 L-7.35 4.35 -7.35 4.3 M-3.1 7.95 L-4.15 7.45 M7.05 4.85 L6.8 5.15 6.05 6.0 6.05 6.05 4.8 7.1 4.3 7.4 3.8 7.65 2.2 8.25 M4.9 8.2 L4.8 8.3 4.75 8.3" fill="none" stroke="#660000" stroke-linecap="round" stroke-linejoin="round" stroke-opacity="0.3019608" stroke-width="0.05"/>
    <path d="M-6.0 -6.0 L-6.4 -6.4 M-8.25 -2.2 L-8.75 -2.3 M-8.75 2.4 L-8.25 2.2 M-2.3 8.8 L-2.2 8.25 M-6.0 6.05 L-6.4 6.45 M6.05 6.05 L6.35 6.35 M2.2 8.25 L2.35 8.8" fill="none" stroke="#660000" stroke-linecap="round" stroke-linejoin="round" stroke-opacity="0.4" stroke-width="0.05"/>
    <path d="M-4.25 -7.4 L-4.4 -7.65 M-7.85 -4.55 L-7.4 -4.25 M-8.5 0.0 L-9.05 0.0 M-7.35 4.3 L-7.85 4.55 M-4.25 7.4 L-4.5 7.9 M4.3 7.4 L4.55 7.85 M0.0 8.5 L0.0 9.05" fill="none" stroke="#660000" stroke-linecap="round" stroke-linejoin="round" stroke-width="0.05"/>
    <path d="M4.0 -3.9 L5.0 -4.9 M5.45 -1.45 L6.95 -1.85 M1.95 -7.15 L1.45 -5.4 M-5.4 -1.45 L-7.15 -1.9 M-1.45 -5.4 L-1.9 -7.15 M-5.2 -5.25 L-3.9 -3.95 M-7.15 1.95 L-5.25 1.8 M-1.45 5.4 L-1.9 7.15 M-5.2 5.3 L-3.9 4.0 M5.45 1.5 L7.55 2.0 M4.0 3.95 L5.3 5.25 M1.5 5.4 L1.95 7.15" fill="none" stroke="#cccc00" stroke-linecap="round" stroke-linejoin="round" stroke-width="0.05"/>
    <path d="M0.05 -7.75 L0.4 -4.2 0.35 -7.7 M0.75 -4.2 L0.75 -7.6 M2.2 -3.65 L3.6 -6.2 M-0.25 0.8 L0.05 1.25 0.8 0.25 0.4 -4.2 M4.25 -0.35 L7.35 -0.45 M3.65 -2.25 L6.0 -3.65 M3.85 -1.9 L6.25 -3.35 M-1.1 -7.95 L-0.6 -6.3 -0.1 -7.8 M-7.7 -3.7 L-5.65 -3.15 -7.1 -4.7 M-8.45 -0.9 L-6.25 -0.2 -4.2 -0.65 M-3.95 -1.55 L-5.65 -3.15 -3.4 -2.5 M-1.95 -3.8 L-3.55 -5.45 -3.15 -3.55 M-0.3 -4.25 L-0.25 -5.15 -0.6 -6.3 -1.1 -4.1 M-0.3 -4.25 L-0.7 0.0 M-5.0 -6.9 L-3.55 -5.45 -4.05 -7.5 M-3.7 -7.7 L-1.6 -3.95 M-0.25 -5.15 L-0.05 -7.8 M-3.95 3.0 L-3.65 2.85 -6.65 5.3 M-4.15 7.45 L-1.65 4.25 -3.1 7.95 M0.9 8.45 L0.3 4.5 -0.65 8.05 -0.65 4.2 M-5.25 1.8 L-4.1 1.15 M-7.9 3.25 L-5.25 1.8 M-4.2 0.75 L-8.5 0.75 M-7.7 3.6 L-4.0 1.5 M-2.7 3.3 L-4.6 6.65 -2.4 3.55 M-7.55 4.0 L-3.85 1.85 M-4.35 3.15 L-7.35 4.35 M3.8 7.65 L2.4 4.1 4.8 7.1 M4.25 0.4 L7.5 0.35 M3.9 1.8 L7.35 3.65 M7.3 4.0 L4.0 2.9 6.8 5.15 M7.45 -0.05 L4.3 0.0 M-6.25 -0.2 L-4.25 0.4 M-8.5 0.35 L-6.25 -0.2" fill="none" stroke="#660000" stroke-linecap="round" stroke-linejoin="round" stroke-opacity="0.6" stroke-width="0.05"/>
    <path d="M0.1 -0.35 L0.5 -0.3 0.25 0.5 -0.1 0.7 -0.25 0.8 M-0.7 0.0 L-0.3 -0.35 -0.1 -0.35 M0.1 -0.35 L-0.1 -0.35 M-0.7 0.0 L-3.5 2.4 -4.35 3.15 -4.65 3.4 -3.95 3.0 -3.35 2.6 -0.25 0.8" fill="none" stroke="#660000" stroke-linecap="round" stroke-linejoin="round" stroke-opacity="0.6" stroke-width="0.05"/>
  </g>
  <defs>
    <linearGradient gradientTransform="matrix(0.011, 0.0, -0.0013, 0.0134, -1.3, 0.55)" gradientUnits="userSpaceOnUse" id="gradient0" spreadMethod="pad" x1="-819.2" x2="819.2">
      <stop offset="0.0" stop-color="#de907e"/>
      <stop offset="1.0" stop-color="#b86b58"/>
    </linearGradient>
    <linearGradient gradientTransform="matrix(0.011, 0.0, -0.0013, 0.0134, -3.3, 2.15)" gradientUnits="userSpaceOnUse" id="gradient1" spreadMethod="pad" x1="-819.2" x2="819.2">
      <stop offset="0.0" stop-color="#de907e"/>
      <stop offset="1.0" stop-color="#b86b58"/>
    </linearGradient>
    <linearGradient gradientTransform="matrix(0.0057, 0.0118, -0.0126, 0.0069, 1.7, -0.35)" gradientUnits="userSpaceOnUse" id="gradient2" spreadMethod="pad" x1="-819.2" x2="819.2">
      <stop offset="0.0" stop-color="#dfcfb9"/>
      <stop offset="1.0" stop-color="#ad9762"/>
    </linearGradient>
    <linearGradient gradientTransform="matrix(-0.0068, -0.0089, 0.0053, -0.004, -6.5, 2.55)" gradientUnits="userSpaceOnUse" id="gradient3" spreadMethod="pad" x1="-819.2" x2="819.2">
      <stop offset="0.0" stop-color="#dfcfb9"/>
      <stop offset="1.0" stop-color="#ad9762"/>
    </linearGradient>
  </defs>
</svg>
