<?xml version="1.0" encoding="UTF-8" standalone="no"?>
<svg xmlns:xlink="http://www.w3.org/1999/xlink" height="28.4px" width="52.2px" xmlns="http://www.w3.org/2000/svg">
  <g transform="matrix(1.0, 0.0, 0.0, 1.0, 26.55, 13.4)">
    <path d="M25.65 -10.75 Q25.65 -8.7 19.45 -8.7 13.5 -8.7 13.5 -10.55 13.5 -13.4 21.7 -13.4 25.35 -13.4 25.65 -10.75 M-21.4 9.2 L-22.65 12.7 Q-23.55 15.1 -25.1 15.0 -26.65 14.85 -26.55 13.25 -25.0 6.3 -22.35 6.3 -21.8 6.3 -21.35 7.5 -21.1 8.1 -21.4 9.2" fill="#1e1e1e" fill-rule="evenodd" stroke="none"/>
    <path d="M14.85 -10.65 Q14.85 -11.0 15.3 -11.6 L16.1 -12.25 Q17.0 -12.25 17.55 -10.35 17.55 -9.2 16.5 -9.2 15.1 -9.2 14.85 -10.65 M18.4 -11.0 Q18.4 -12.25 19.25 -12.25 20.45 -12.25 20.95 -10.55 20.95 -9.65 19.65 -9.65 18.25 -9.65 18.4 -11.0 M24.45 -10.7 Q24.45 -9.55 23.05 -9.55 21.9 -9.55 21.9 -10.9 21.9 -11.85 22.9 -11.85 24.4 -11.85 24.45 -10.7 M-22.05 9.15 Q-22.05 10.25 -22.65 10.25 -23.45 10.25 -23.25 9.15 -23.45 7.85 -22.65 7.85 -22.2 7.85 -22.1 8.5 L-22.05 9.15 M-23.25 10.9 L-23.2 11.75 Q-23.2 12.25 -23.8 12.25 -24.5 12.25 -24.45 11.0 -24.5 10.05 -23.9 10.05 -23.4 10.05 -23.25 10.9" fill="#ffffff" fill-rule="evenodd" stroke="none"/>
  </g>
</svg>
