<?xml version="1.0" encoding="UTF-8" standalone="no"?>
<svg xmlns:xlink="http://www.w3.org/1999/xlink" height="26.25px" width="32.95px" xmlns="http://www.w3.org/2000/svg">
  <g transform="matrix(1.0, 0.0, 0.0, 1.0, 10.35, 16.6)">
    <path d="M-8.4 -2.45 L-8.3 -2.4 -8.2 -2.35 -8.15 -1.9 -7.65 -1.6 -7.6 -1.55 -7.6 -1.45 -7.65 -1.35 -7.5 -1.3 -7.35 -1.15 -7.35 -1.05 -7.4 -0.6 -7.6 -0.25 Q-7.8 -0.05 -8.05 0.0 L-7.9 0.3 -7.9 0.35 -7.85 0.55 -7.85 0.6 -8.0 0.95 -8.5 1.05 -9.45 0.85 -9.6 -0.05 -10.15 -0.4 Q-10.5 -0.85 -10.15 -1.25 L-10.1 -1.3 -10.05 -1.3 -9.95 -1.3 -10.1 -1.5 -10.1 -1.6 -10.05 -1.7 -9.25 -2.0 -8.5 -2.45 -8.4 -2.45 M-9.5 -0.7 L-9.6 -0.95 -9.65 -1.05 -9.65 -0.95 -9.6 -0.75 -9.6 -0.7 -9.5 -0.7 M-8.25 -0.9 L-8.25 -0.85 -8.15 -0.9 -8.25 -0.9" fill="#660000" fill-rule="evenodd" stroke="none"/>
    <path d="M-6.15 1.65 Q-6.15 2.2 -6.85 2.2 L-8.25 1.55 Q-9.45 1.25 -9.45 0.85 -9.45 0.75 -9.3 0.75 L-8.8 1.0 -8.75 0.8 -8.3 0.8 -6.8 1.1 Q-6.15 1.35 -6.15 1.65" fill="#000000" fill-opacity="0.14117648" fill-rule="evenodd" stroke="none"/>
    <path d="M-8.7 -1.5 L-8.5 -1.3 -8.45 -1.3 -8.45 -1.25 -8.4 -1.0 -8.4 -0.75 -8.45 -0.75 -8.7 -0.55 -8.85 -0.4 -8.95 -0.65 -8.7 -1.1 -8.8 -1.5 -8.7 -1.5 M-7.6 -1.2 L-7.45 -1.1 -7.45 -1.0 -7.45 -0.75 Q-7.45 -0.15 -8.15 -0.15 L-8.2 -0.15 -8.2 -0.1 -8.2 -0.05 -8.2 0.0 -8.2 0.1 -8.05 0.35 -8.0 0.55 -8.15 0.9 -8.15 0.95 -8.7 1.15 -8.75 1.15 -8.85 1.15 -8.9 1.15 -8.95 1.15 -9.2 1.0 -9.35 0.8 -9.3 0.8 -8.55 0.5 -8.8 0.3 -8.6 0.15 -8.65 -0.1 -8.6 -0.15 -8.5 -0.35 -8.45 -0.35 -7.75 -0.6 -7.7 -0.6 -7.6 -1.2 M-9.75 -1.1 L-9.75 -1.0 -9.75 -0.75 -9.75 -0.7 -9.75 -0.65 -9.7 -0.65 -9.65 -0.6 -9.6 -0.6 -9.45 -0.55 -9.5 -0.3 -9.6 -0.3 Q-9.95 -0.3 -9.95 -0.75 L-9.8 -1.1 -9.75 -1.1" fill="#717223" fill-rule="evenodd" stroke="none"/>
    <path d="M-8.7 -1.5 L-8.8 -1.5 -8.7 -1.1 -8.95 -0.65 -8.85 -0.4 -9.05 -0.25 -9.1 -0.25 -9.2 -0.35 -9.25 -0.4 -9.25 -0.45 -9.3 -0.5 -9.3 -0.55 -9.35 -0.6 -9.5 -0.9 -9.35 -1.25 -8.9 -1.5 -8.7 -1.5 M-8.35 -0.6 L-7.95 -0.9 -7.7 -1.25 -7.6 -1.2 -7.7 -0.6 -7.75 -0.6 -8.45 -0.35 -8.5 -0.35 -8.35 -0.6 M-8.2 -0.1 L-8.2 -0.05 -8.2 -0.1 M-9.35 0.8 L-9.45 0.4 -9.45 0.3 -9.55 0.0 -9.45 -0.15 -9.05 0.3 -8.75 0.05 -8.65 -0.05 -8.65 -0.1 -8.6 0.15 -8.8 0.3 -8.55 0.5 -9.3 0.8 -9.35 0.8 M-9.5 -0.15 Q-10.2 -0.2 -10.2 -0.8 -10.2 -1.2 -9.95 -1.2 L-9.75 -1.1 -9.8 -1.1 -9.95 -0.75 Q-9.95 -0.3 -9.6 -0.3 L-9.5 -0.3 -9.55 -0.25 -9.5 -0.15 M-9.2 -0.5 L-9.15 -0.55 -9.2 -0.5" fill="#b0b336" fill-rule="evenodd" stroke="none"/>
    <path d="M-8.7 -0.55 L-8.45 -0.75 -8.4 -0.75 -8.3 -0.7 -8.35 -0.6 -8.5 -0.35 -8.6 -0.15 -8.65 -0.1 -8.65 -0.05 -8.75 0.05 -8.8 0.15 -8.9 0.1 -8.65 -0.35 -8.95 -0.1 -8.95 -0.15 -8.75 -0.45 -8.8 -0.45 -8.7 -0.55 M-9.35 -0.6 L-9.3 -0.55 -9.3 -0.5 -9.25 -0.45 -9.25 -0.4 -9.2 -0.35 -9.1 -0.25 -9.05 -0.2 -9.1 -0.15 -9.2 -0.2 -9.25 -0.15 -9.35 -0.55 -9.35 -0.6" fill="#a00101" fill-rule="evenodd" stroke="none"/>
    <path d="M-8.85 -0.4 L-8.7 -0.55 -8.8 -0.45 -8.75 -0.45 -8.95 -0.15 -8.95 -0.1 -8.65 -0.35 -8.9 0.1 -8.8 0.15 -8.75 0.05 -9.05 0.3 -9.45 -0.15 -9.5 -0.15 -9.55 -0.25 -9.5 -0.3 -9.45 -0.55 -9.45 -0.6 -9.4 -0.6 -9.35 -0.6 -9.35 -0.55 -9.25 -0.15 -9.2 -0.2 -9.1 -0.15 -9.05 -0.2 -9.1 -0.25 -9.05 -0.25 -8.85 -0.4" fill="#cc0000" fill-rule="evenodd" stroke="none"/>
    <path d="M-9.95 -1.5 L-9.95 -1.6 -9.6 -1.8 -9.15 -1.95 -8.55 -2.4 -8.45 -2.35 -8.5 -2.3 -8.7 -2.05 -8.9 -1.5 -8.75 -1.35 Q-8.6 -1.35 -8.35 -1.55 L-8.2 -1.8 -8.0 -1.75 -8.1 -1.5 Q-8.2 -1.2 -8.65 -1.2 L-9.05 -1.35 -9.8 -1.5 -9.95 -1.5" fill="#ffcc00" fill-rule="evenodd" stroke="none"/>
    <path d="M-9.95 -1.5 L-9.8 -1.5 -9.05 -1.35 -8.65 -1.2 Q-8.2 -1.2 -8.1 -1.5 L-8.0 -1.75 -7.75 -1.55 Q-7.75 -1.35 -8.1 -1.15 L-8.95 -0.95 -9.7 -1.25 -9.75 -1.25 -9.95 -1.5 M-8.2 -1.8 L-8.35 -1.55 Q-8.6 -1.35 -8.75 -1.35 L-8.9 -1.5 -8.7 -2.05 -8.5 -2.3 -8.45 -2.35 -8.25 -2.1 -8.35 -1.8 -8.2 -1.8" fill="#dc9c0a" fill-rule="evenodd" stroke="none"/>
    <path d="M7.25 7.5 L7.05 7.75 6.6 7.85 6.1 7.75 5.9 7.5 6.1 7.25 6.6 7.15 7.05 7.25 7.25 7.5" fill="#000000" fill-opacity="0.14117648" fill-rule="evenodd" stroke="none"/>
    <path d="M6.05 7.0 L6.05 6.75 6.4 6.75 6.4 7.05 6.2 6.95 6.05 7.0" fill="#ffffff" fill-rule="evenodd" stroke="none"/>
    <path d="M6.4 7.4 L6.4 7.5 6.05 7.5 6.05 7.2 6.15 7.25 6.4 7.4" fill="#ffffff" fill-rule="evenodd" stroke="none"/>
    <path d="M6.05 7.2 L6.05 7.0 6.2 6.95 6.4 7.05 6.4 7.4 6.15 7.25 6.05 7.2" fill="#bbbbbb" fill-rule="evenodd" stroke="none"/>
    <path d="M6.7 7.0 L6.25 7.1 5.75 7.0 5.55 6.8 5.75 6.55 6.25 6.45 6.7 6.55 6.9 6.8 6.7 7.0" fill="#ffffff" fill-rule="evenodd" stroke="none"/>
    <path d="M8.9 8.35 L8.7 8.6 8.25 8.7 7.75 8.6 7.55 8.35 7.75 8.1 8.25 8.0 8.7 8.1 8.9 8.35" fill="#000000" fill-opacity="0.14117648" fill-rule="evenodd" stroke="none"/>
    <path d="M7.7 7.6 L8.05 7.6 8.05 7.9 7.85 7.8 7.7 7.85 7.7 7.6" fill="#ffffff" fill-rule="evenodd" stroke="none"/>
    <path d="M8.05 8.25 L8.05 8.35 7.7 8.35 7.7 8.05 7.8 8.1 8.05 8.25" fill="#ffffff" fill-rule="evenodd" stroke="none"/>
    <path d="M7.7 8.05 L7.7 7.85 7.85 7.8 8.05 7.9 8.05 8.25 7.8 8.1 7.7 8.05" fill="#bbbbbb" fill-rule="evenodd" stroke="none"/>
    <path d="M8.35 7.85 L7.9 7.95 7.4 7.85 7.2 7.65 7.4 7.4 7.9 7.3 8.35 7.4 8.55 7.65 8.35 7.85" fill="#ffffff" fill-rule="evenodd" stroke="none"/>
    <path d="M10.1 7.55 L9.9 7.8 9.45 7.9 8.95 7.8 8.75 7.55 8.95 7.3 9.45 7.2 9.9 7.3 10.1 7.55" fill="#000000" fill-opacity="0.14117648" fill-rule="evenodd" stroke="none"/>
    <path d="M9.25 6.8 L9.25 7.1 9.05 7.0 8.9 7.05 8.9 6.8 9.25 6.8" fill="#ffffff" fill-rule="evenodd" stroke="none"/>
    <path d="M9.25 7.45 L9.25 7.55 8.9 7.55 8.9 7.25 9.0 7.3 9.25 7.45" fill="#ffffff" fill-rule="evenodd" stroke="none"/>
    <path d="M8.9 7.25 L8.9 7.05 9.05 7.0 9.25 7.1 9.25 7.45 9.0 7.3 8.9 7.25" fill="#bbbbbb" fill-rule="evenodd" stroke="none"/>
    <path d="M9.55 7.05 L9.1 7.15 8.6 7.05 8.4 6.85 8.6 6.6 9.1 6.5 9.55 6.6 9.75 6.85 9.55 7.05" fill="#ffffff" fill-rule="evenodd" stroke="none"/>
    <path d="M11.7 9.3 L11.5 9.55 11.05 9.65 10.55 9.55 10.35 9.3 10.55 9.05 11.05 8.95 11.5 9.05 11.7 9.3" fill="#000000" fill-opacity="0.14117648" fill-rule="evenodd" stroke="none"/>
    <path d="M10.85 8.85 L10.65 8.75 10.5 8.8 10.5 8.55 10.85 8.55 10.85 8.85" fill="#ffffff" fill-rule="evenodd" stroke="none"/>
    <path d="M10.85 9.2 L10.85 9.3 10.5 9.3 10.5 9.0 10.6 9.05 10.85 9.2" fill="#ffffff" fill-rule="evenodd" stroke="none"/>
    <path d="M10.5 9.0 L10.5 8.8 10.65 8.75 10.85 8.85 10.85 9.2 10.6 9.05 10.5 9.0" fill="#bbbbbb" fill-rule="evenodd" stroke="none"/>
    <path d="M11.15 8.8 L10.7 8.9 10.2 8.8 10.0 8.6 10.2 8.35 10.7 8.25 11.15 8.35 11.35 8.6 11.15 8.8" fill="#ffffff" fill-rule="evenodd" stroke="none"/>
    <path d="M-1.3 -12.65 L-1.25 -12.65 -1.25 -12.6 -1.3 -12.65" fill="#96dfeb" fill-rule="evenodd" stroke="none"/>
    <path d="M-1.3 -12.65 L-1.9 -13.35 -2.3 -13.4 -2.5 -13.1 -2.55 -12.8 -2.25 -11.7 -1.45 -11.0 -0.5 -10.8 Q-0.05 -10.9 0.0 -11.45 L0.05 -11.65 -0.2 -12.8 0.5 -12.4 0.45 -11.85 0.3 -11.3 0.2 -10.85 Q0.1 -10.55 0.35 -10.15 L0.5 -10.1 0.7 -10.0 1.1 -9.9 Q1.4 -9.9 1.55 -10.05 L1.6 -11.15 1.85 -11.4 2.0 -11.65 2.0 -11.2 Q1.9 -10.4 1.6 -9.9 L1.7 -9.6 1.9 -9.35 2.65 -9.15 2.95 -9.05 Q2.9 -9.6 3.0 -10.05 L3.1 -11.1 4.15 -10.6 3.95 -10.5 Q3.35 -10.2 3.35 -9.5 L3.55 -8.8 Q3.75 -8.45 4.1 -8.25 L4.95 -8.15 5.3 -7.8 5.8 -7.7 6.1 -7.9 6.1 -8.15 6.1 -8.2 6.25 -9.55 6.5 -9.4 6.4 -8.65 Q6.4 -8.05 6.7 -7.5 7.0 -6.9 7.55 -6.65 8.5 -6.2 9.15 -7.25 L8.6 -7.95 8.25 -8.15 8.0 -8.15 7.8 -7.85 7.5 -7.9 7.45 -8.45 7.55 -8.9 7.85 -8.75 8.3 -8.25 8.6 -8.15 8.95 -8.05 9.1 -8.15 9.5 -7.95 9.45 -6.95 9.25 -6.3 9.4 -5.9 9.7 -5.65 10.45 -5.55 10.5 -5.85 10.55 -5.85 11.0 -5.15 11.4 -5.1 11.65 -5.45 11.5 -6.1 11.3 -6.85 11.5 -6.9 13.45 -5.95 13.3 -5.65 Q12.9 -5.5 12.5 -5.65 L12.25 -5.4 12.35 -4.95 12.3 -4.9 12.55 -4.4 12.95 -4.1 13.45 -4.4 14.05 -4.8 14.6 -5.4 16.05 -4.65 13.75 -1.4 13.7 -1.45 -5.0 -10.85 -2.7 -14.05 -1.6 -13.45 -1.45 -13.15 -1.25 -12.65 -1.3 -12.65 M10.0 4.9 L-8.75 -4.45 -8.75 -4.95 9.8 4.3 10.0 4.35 10.0 4.9 M-8.45 -6.05 L-7.5 -7.4 -7.4 -7.35 11.3 1.95 10.3 3.35 10.3 3.3 -8.45 -6.05 M-6.8 -8.35 L-5.7 -9.9 -5.6 -9.85 13.1 -0.55 11.95 1.05 11.9 1.05 -6.8 -8.35" fill="#e83a28" fill-rule="evenodd" stroke="none"/>
    <path d="M-5.0 -10.85 L13.7 -1.45 13.75 -1.4 16.05 -4.65 14.6 -5.4 14.9 -5.8 15.0 -6.05 22.6 -2.2 22.6 -1.05 16.05 -3.45 10.0 4.9 10.0 4.35 9.8 4.3 -8.75 -4.95 -9.0 -5.1 -9.25 -5.4 -9.25 -5.85 -8.9 -6.1 -8.5 -6.1 -8.45 -6.05 10.3 3.3 10.3 3.35 11.3 1.95 -7.4 -7.35 -7.5 -7.4 -7.65 -7.7 -7.65 -8.1 -7.3 -8.4 -6.9 -8.35 -6.8 -8.35 11.9 1.05 11.95 1.05 13.1 -0.55 -5.6 -9.85 -5.7 -9.9 -5.9 -10.2 -5.85 -10.6 -5.5 -10.9 -5.1 -10.85 -5.0 -10.85" fill="#a75050" fill-rule="evenodd" stroke="none"/>
    <path d="M-1.4 -16.45 Q-0.95 -16.2 -0.6 -15.4 -0.3 -14.75 -0.3 -14.1 L-0.35 -13.95 -0.65 -13.7 -1.1 -13.85 -1.5 -14.2 -1.85 -15.5 -1.85 -15.2 -1.55 -14.0 -0.95 -12.75 Q-0.6 -12.0 -0.6 -11.45 L-0.65 -11.3 Q-0.7 -10.7 -1.2 -10.6 L-2.1 -10.8 -2.9 -11.5 -3.2 -12.6 -3.15 -12.9 -2.95 -13.2 -2.6 -13.15 Q-2.2 -12.95 -1.95 -12.4 L-2.0 -12.0 -2.0 -11.7 -1.8 -11.65 -1.8 -11.85 Q-1.8 -12.3 -2.1 -12.95 L-2.65 -14.15 -2.95 -15.5 -2.9 -15.8 Q-2.8 -16.3 -2.35 -16.5 L-1.4 -16.45 M3.1 -11.95 L3.4 -12.25 3.6 -12.15 4.7 -11.9 Q5.6 -11.5 5.6 -9.85 L5.45 -8.0 5.45 -7.95 5.5 -7.7 5.15 -7.5 4.65 -7.6 4.3 -7.95 3.45 -8.05 2.9 -8.55 2.7 -9.3 Q2.7 -10.0 3.3 -10.3 L4.45 -10.4 4.45 -10.7 3.65 -10.65 Q3.15 -10.85 3.05 -11.45 L3.1 -11.7 3.1 -11.95 M1.8 -12.4 Q2.45 -12.1 2.45 -11.05 L2.35 -9.85 2.25 -8.85 2.0 -8.95 1.25 -9.15 1.05 -9.4 1.0 -9.65 1.4 -11.05 1.4 -11.45 1.2 -11.2 1.0 -10.95 0.9 -9.8 0.45 -9.7 0.0 -9.8 -0.15 -9.9 -0.3 -10.0 -0.5 -10.65 -0.35 -11.1 -0.25 -11.65 -0.15 -12.55 -0.15 -12.9 0.2 -13.05 0.5 -12.9 0.7 -12.8 1.05 -12.55 1.8 -12.4 M7.85 -9.4 L8.25 -8.7 8.55 -8.15 8.25 -7.85 7.95 -7.95 7.65 -8.05 7.2 -8.55 7.1 -8.95 6.8 -8.25 6.8 -7.7 7.15 -7.65 7.35 -7.95 7.6 -7.95 7.95 -7.75 8.5 -7.05 Q7.85 -6.0 6.9 -6.45 6.35 -6.7 6.05 -7.3 5.75 -7.85 5.75 -8.45 5.75 -9.3 6.15 -9.75 6.55 -10.3 7.2 -10.0 L7.85 -9.4 M9.3 -11.1 L9.6 -11.2 Q9.8 -11.1 10.05 -10.95 L10.3 -10.5 10.2 -9.75 10.0 -7.8 10.05 -7.85 11.0 -8.05 11.4 -7.65 11.5 -7.4 11.55 -7.1 11.4 -6.85 10.65 -6.65 10.85 -5.9 11.0 -5.25 10.75 -4.9 10.35 -4.95 9.85 -5.75 9.85 -5.65 9.8 -5.35 9.0 -5.45 8.75 -5.7 8.55 -6.1 8.8 -6.75 Q8.8 -8.2 9.15 -10.7 L9.3 -11.1 M4.5 -9.45 Q3.75 -9.5 3.7 -9.0 L3.8 -9.0 4.05 -9.0 4.35 -9.1 4.4 -9.15 4.45 -9.3 4.55 -9.45 4.5 -9.45 M4.5 -9.5 L4.55 -9.45 4.55 -9.5 4.5 -9.5 M12.35 -8.45 L12.65 -8.8 13.0 -8.75 13.5 -8.3 13.5 -8.15 13.55 -7.1 14.3 -8.2 Q14.4 -8.1 14.55 -8.05 15.05 -7.8 15.2 -7.15 L14.7 -6.5 14.25 -5.6 13.4 -4.6 12.8 -4.15 12.3 -3.9 Q12.05 -4.0 11.9 -4.25 L11.65 -4.65 11.7 -4.75 11.55 -5.2 11.85 -5.45 Q12.3 -5.3 12.65 -5.45 L12.85 -5.85 12.75 -6.5 12.65 -7.1 12.55 -7.8 12.35 -8.45" fill="#ffcc00" fill-rule="evenodd" stroke="none"/>
    <path d="M-1.55 -16.15 Q-1.15 -15.95 -0.9 -15.3 L-0.65 -14.1 -0.65 -14.0 -0.65 -14.05 -0.65 -14.0 -0.95 -14.1 -1.2 -14.3 -1.55 -15.55 -1.55 -15.6 -1.7 -15.7 -1.9 -15.8 -2.1 -15.7 -2.15 -15.5 -2.15 -15.2 -1.85 -13.85 -1.2 -12.6 -1.2 -12.55 -0.9 -11.45 -0.95 -11.35 -0.9 -11.4 -0.95 -11.35 -0.95 -11.3 Q-0.95 -11.0 -1.25 -10.9 L-1.95 -11.05 -2.65 -11.7 -2.9 -12.6 -2.85 -12.85 -2.85 -12.9 -2.7 -12.85 -2.25 -12.4 -2.3 -12.1 -2.3 -12.05 Q-2.4 -11.45 -2.1 -11.35 L-1.7 -11.35 -1.55 -11.45 -1.5 -11.65 -1.5 -11.85 -1.8 -13.1 -2.35 -14.25 -2.65 -15.5 -2.6 -15.7 -2.25 -16.2 -1.55 -16.15 M3.35 -11.5 L3.4 -11.7 3.4 -11.9 3.6 -11.85 3.65 -11.85 4.6 -11.65 4.55 -11.65 Q5.3 -11.25 5.3 -9.85 L5.15 -8.05 5.15 -7.95 5.15 -7.9 5.15 -7.8 4.75 -7.9 4.6 -8.1 4.55 -8.15 4.45 -8.2 4.3 -8.25 3.55 -8.35 Q3.3 -8.45 3.15 -8.7 L3.0 -9.3 Q3.0 -9.8 3.45 -10.05 L4.35 -10.1 4.4 -10.1 4.55 -10.15 4.7 -10.25 4.75 -10.4 4.75 -10.7 4.7 -10.9 4.55 -11.05 3.65 -10.95 Q3.45 -11.15 3.35 -11.5 M0.8 -12.35 L0.95 -12.25 1.1 -12.25 1.7 -12.1 Q2.1 -11.85 2.15 -11.05 L2.05 -9.9 1.95 -9.25 1.45 -9.4 1.35 -9.45 1.35 -9.5 1.3 -9.65 1.7 -11.0 1.7 -11.5 1.7 -11.55 1.6 -11.7 1.45 -11.75 1.4 -11.75 1.3 -11.75 Q1.05 -11.75 0.95 -11.35 L0.8 -11.2 0.65 -11.0 0.55 -10.0 0.45 -10.0 0.2 -10.05 0.15 -10.05 0.05 -10.15 -0.05 -10.2 0.0 -10.2 -0.05 -10.2 -0.15 -10.6 -0.15 -10.65 -0.05 -11.0 -0.05 -10.95 -0.05 -11.05 0.1 -11.6 0.15 -12.55 0.15 -12.75 0.35 -12.65 0.4 -12.6 0.6 -12.55 0.8 -12.35 M9.45 -10.8 L9.6 -10.85 9.85 -10.7 9.95 -10.45 9.85 -9.8 9.7 -7.85 9.7 -7.65 9.85 -7.55 10.05 -7.5 10.2 -7.6 10.9 -7.75 10.85 -7.75 11.1 -7.55 11.15 -7.3 11.2 -7.25 11.25 -7.15 11.2 -7.1 10.55 -6.9 10.55 -6.95 10.4 -6.8 10.35 -6.6 10.55 -5.8 10.65 -5.3 10.65 -5.2 10.45 -5.25 10.1 -5.85 10.15 -5.85 10.0 -6.05 9.8 -6.05 9.6 -5.95 9.55 -5.75 9.55 -5.65 9.15 -5.75 9.0 -5.9 8.9 -6.1 Q8.9 -6.4 9.05 -6.5 L9.15 -6.75 Q9.1 -8.2 9.45 -10.7 L9.45 -10.8 M4.0 -9.7 L3.95 -9.7 Q3.55 -9.7 3.55 -9.2 3.55 -8.7 3.9 -8.7 L4.15 -8.75 4.3 -8.85 4.35 -8.85 Q4.85 -8.85 4.85 -9.2 L4.6 -9.6 Q4.55 -9.8 4.3 -9.8 L4.0 -9.7 M6.6 -7.5 L6.7 -7.4 Q7.2 -7.2 7.35 -7.4 L7.4 -7.5 7.5 -7.65 7.85 -7.5 8.15 -7.1 Q7.7 -6.45 7.05 -6.75 6.55 -6.95 6.3 -7.45 6.05 -7.95 6.05 -8.45 6.05 -9.2 6.4 -9.6 L7.1 -9.7 7.6 -9.25 8.0 -8.55 8.1 -8.45 8.25 -8.2 8.05 -8.25 8.1 -8.2 8.05 -8.25 8.0 -8.3 7.75 -8.3 7.5 -8.6 Q7.5 -9.15 7.2 -9.25 L7.25 -9.25 7.05 -9.25 6.9 -9.2 Q6.55 -8.95 6.45 -8.3 L6.5 -7.65 6.55 -7.5 6.6 -7.5 M3.7 -8.7 L3.65 -8.75 3.7 -8.7 M4.2 -8.75 L4.25 -8.75 4.2 -8.75 M4.3 -8.75 L4.35 -8.8 4.3 -8.8 4.3 -8.75 M12.7 -8.45 L12.75 -8.55 12.85 -8.5 12.95 -8.5 13.2 -8.25 13.2 -8.2 13.25 -7.0 13.35 -6.85 13.5 -6.75 13.7 -6.8 13.65 -6.8 13.8 -6.9 14.4 -7.75 14.85 -7.25 14.45 -6.65 14.4 -6.6 13.95 -5.8 13.25 -4.85 12.65 -4.45 12.3 -4.25 12.15 -4.4 12.15 -4.45 11.95 -4.65 12.0 -4.7 12.0 -4.8 12.0 -4.85 11.95 -5.05 12.8 -5.2 12.95 -5.3 13.15 -5.75 13.2 -5.95 13.1 -6.5 13.1 -6.55 12.95 -7.2 12.95 -7.25 12.85 -7.9 12.7 -8.45" fill="#ffff99" fill-rule="evenodd" stroke="none"/>
  </g>
</svg>
