<?xml version="1.0" encoding="UTF-8" standalone="no"?>
<svg xmlns:xlink="http://www.w3.org/1999/xlink" height="29.15px" width="58.25px" xmlns="http://www.w3.org/2000/svg">
  <g transform="matrix(1.0, 0.0, 0.0, 1.0, 36.5, 91.1)">
    <path d="M7.15 -81.7 L8.2 -81.15 7.15 -81.65 7.15 -81.7" fill="#d9ae9b" fill-rule="evenodd" stroke="none"/>
    <path d="M-6.75 -90.15 L19.75 -76.8 18.25 -76.05 8.2 -81.15 7.15 -81.7 -6.7 -88.7 -6.75 -90.15 M-16.5 -88.45 L-13.35 -86.85 -13.35 -85.35 -13.4 -85.35 -16.5 -86.95 -16.5 -88.45 M2.95 -62.9 L-2.8 -65.8 -2.8 -70.3 2.95 -67.4 2.95 -62.9" fill="#6596a1" fill-rule="evenodd" stroke="none"/>
    <path d="M-6.7 -88.7 L7.15 -81.7 7.15 -81.65 8.2 -81.15 18.25 -76.05 3.0 -68.4 -2.8 -71.3 -10.5 -67.45 -33.0 -78.7 -16.5 -86.95 -13.4 -85.35 -13.35 -85.35 -6.7 -88.7" fill="#46595d" fill-rule="evenodd" stroke="none"/>
    <path d="M-6.75 -90.15 L-6.7 -88.7 -13.35 -85.35 -13.35 -86.85 -6.75 -90.15 M-33.0 -78.7 L-34.5 -79.45 -16.5 -88.45 -16.5 -86.95 -33.0 -78.7 M21.75 -76.8 L21.75 -72.3 3.0 -62.9 2.95 -62.9 2.95 -67.4 3.0 -67.4 3.55 -67.7 3.95 -67.9 12.75 -72.3 17.25 -74.55 21.75 -76.8 M-2.8 -65.8 L-10.5 -61.95 -10.5 -66.45 -2.8 -70.3 -2.8 -65.8" fill="#516b87" fill-rule="evenodd" stroke="none"/>
    <path d="M18.25 -76.05 L19.75 -76.8 -6.75 -90.15 -13.35 -86.85 -16.5 -88.45 -34.5 -79.45 -33.0 -78.7 -10.5 -67.45 -2.8 -71.3 3.0 -68.4 18.25 -76.05 M13.6 -80.9 L21.75 -76.8 17.25 -74.55 12.75 -72.3 3.95 -67.9 3.55 -67.7 3.0 -67.4 2.95 -67.4 -2.8 -70.3 -10.5 -66.45 -36.5 -79.45 -16.5 -89.45 -13.4 -87.9 -7.05 -91.05 -7.0 -91.1 13.6 -80.9" fill="#6cb1ae" fill-rule="evenodd" stroke="none"/>
    <path d="M-10.5 -61.95 L-32.4 -72.9 -36.5 -74.95 -36.5 -79.45 -10.5 -66.45 -10.5 -61.95" fill="url(#gradient0)" fill-rule="evenodd" stroke="none"/>
    <path d="M13.6 -80.9 L21.75 -76.8 21.75 -72.3 3.0 -62.9 2.95 -62.9 M-32.4 -72.9 L-36.5 -74.95 -36.5 -79.45 -16.5 -89.45 -13.4 -87.9 -7.05 -91.05 -7.0 -91.1 13.6 -80.9" fill="none" stroke="#660000" stroke-linecap="round" stroke-linejoin="miter" stroke-miterlimit="3.0" stroke-opacity="0.6" stroke-width="0.05"/>
    <path d="M18.25 -76.05 L19.75 -76.8 -6.75 -90.15 -6.7 -88.7 7.15 -81.7 8.2 -81.15 18.25 -76.05 3.0 -68.4 -2.8 -71.3 -10.5 -67.45 -33.0 -78.7 -34.5 -79.45 -16.5 -88.45 -13.35 -86.85 -6.75 -90.15 M7.15 -81.65 L7.15 -81.7 M2.95 -62.9 L-2.8 -65.8 -10.5 -61.95 -32.4 -72.9 M2.95 -67.4 L2.95 -62.9 M21.75 -76.8 L17.25 -74.55 12.75 -72.3 3.95 -67.9 3.55 -67.7 3.0 -67.4 2.95 -67.4 -2.8 -70.3 -2.8 -65.8 M-16.5 -88.45 L-16.5 -86.95 -13.4 -85.35 -13.35 -85.35 -13.35 -86.85 M-6.7 -88.7 L-13.35 -85.35 M-2.8 -70.3 L-10.5 -66.45 -10.5 -61.95 M-16.5 -86.95 L-33.0 -78.7 M-10.5 -66.45 L-36.5 -79.45" fill="none" stroke="#660000" stroke-linecap="round" stroke-linejoin="miter" stroke-miterlimit="3.0" stroke-opacity="0.3019608" stroke-width="0.05"/>
  </g>
  <defs>
    <linearGradient gradientTransform="matrix(0.0159, 0.0, 0.0, 0.0107, -23.5, -70.7)" gradientUnits="userSpaceOnUse" id="gradient0" spreadMethod="pad" x1="-819.2" x2="819.2">
      <stop offset="0.0" stop-color="#80bccc"/>
      <stop offset="1.0" stop-color="#6596a1"/>
    </linearGradient>
  </defs>
</svg>
