<?xml version="1.0" encoding="UTF-8" standalone="no"?>
<svg xmlns:xlink="http://www.w3.org/1999/xlink" height="73.7px" width="32.0px" xmlns="http://www.w3.org/2000/svg">
  <g transform="matrix(1.0, 0.0, 0.0, 1.0, 13.5, 58.95)">
    <path d="M0.6 -58.15 L2.2 -58.95 3.8 -58.15 3.75 -58.15 2.2 -57.35 0.6 -58.15 2.2 -57.35 2.15 -14.35 2.2 -14.35 3.15 -14.85 3.2 -24.2 3.75 -24.5 5.2 -25.2 7.25 -24.2 7.2 -24.2 5.2 -23.2 5.2 -22.35 5.25 -17.45 5.2 -12.7 7.25 -12.7 4.65 -11.4 4.6 -11.4 4.6 8.1 4.65 8.1 8.9 8.1 5.7 9.75 5.65 9.75 4.6 10.25 3.65 10.7 3.6 10.7 3.6 13.7 -7.55 8.1 -7.55 5.1 -5.15 3.9 -5.1 3.9 -2.35 2.55 -2.35 -14.85 0.55 -16.3 0.6 -58.15 M3.75 -23.15 L3.8 -23.15 3.75 -23.15 M0.55 -15.15 L2.15 -14.35 0.55 -15.15 0.55 -16.3 0.55 -15.15 M3.15 -14.85 L3.15 -13.7 3.15 -14.85 M3.15 -13.7 L5.2 -12.7 3.15 -13.7 M5.2 -23.2 L3.2 -24.2 5.2 -23.2 M4.6 10.3 L4.65 10.4 4.55 10.35 4.6 10.3 M-2.35 4.65 L-2.35 2.55 -2.35 4.65 4.6 8.1 -2.35 4.65 M4.6 -11.4 L-2.35 -14.85 4.6 -11.4 M3.6 10.7 L-7.55 5.1 3.6 10.7" fill="#f7f4ee" fill-rule="evenodd" stroke="none"/>
    <path d="M4.6 10.3 L4.6 10.25 5.65 9.75 4.6 10.3 M5.7 9.75 L5.7 9.8 5.65 9.75 5.7 9.75" fill="#faf9f3" fill-rule="evenodd" stroke="none"/>
    <path d="M2.2 -57.35 L3.75 -58.15 3.75 -51.7 3.75 -51.3 3.75 -37.5 3.75 -33.1 3.75 -27.4 3.75 -24.5 3.2 -24.2 3.15 -14.85 2.2 -14.35 2.15 -14.35 2.2 -57.35 M7.2 -24.2 L7.2 -23.75 7.2 -15.05 9.6 -13.85 9.55 -13.85 9.55 4.1 13.25 5.9 13.2 5.9 13.2 8.9 13.25 8.9 3.65 13.7 3.6 13.7 3.6 10.7 3.65 10.7 4.6 10.25 4.6 10.3 4.55 10.35 4.65 10.4 4.6 10.3 5.65 9.75 5.7 9.8 5.7 9.75 8.9 8.1 4.65 8.1 4.6 8.1 4.6 -11.4 4.65 -11.4 7.25 -12.7 5.2 -12.7 5.25 -17.45 5.2 -22.35 5.2 -23.2 7.2 -24.2 M7.2 -13.7 L5.2 -12.7 7.2 -13.7 7.2 -15.05 7.2 -13.7 7.25 -13.7 7.2 -13.7 M7.25 -12.7 L9.55 -13.85 7.25 -12.7 M9.55 5.65 L4.65 8.1 9.55 5.65 9.55 4.1 9.55 5.65 9.6 5.65 9.55 5.65 M13.2 5.9 L8.9 8.1 13.2 5.9" fill="#a5a8c0" fill-rule="evenodd" stroke="none"/>
    <path d="M3.75 -58.15 L3.8 -58.15 2.2 -58.95 0.6 -58.15 2.2 -57.35 3.75 -58.15 3.75 -51.7 3.75 -51.3 3.75 -37.5 3.75 -33.1 3.75 -27.4 3.75 -24.5 5.2 -25.2 7.25 -24.2 7.2 -24.2 7.2 -23.75 7.2 -15.05 9.6 -13.85 9.55 -13.85 9.55 4.1 13.25 5.9 13.2 5.9 13.2 8.9 13.25 8.9 M3.65 13.7 L3.6 13.7 M-7.55 8.1 L-7.55 5.1 -5.15 3.9 M-5.1 3.9 L-2.35 2.55 -2.35 -14.85 0.55 -16.3 0.6 -58.15 M7.2 -24.2 L5.2 -23.2 5.2 -22.35 5.25 -17.45 5.2 -12.7 M7.2 -13.7 L7.2 -15.05 M3.8 -23.15 L3.75 -23.15 M3.15 -14.85 L3.2 -24.2 3.75 -24.5 M0.55 -15.15 L0.55 -16.3 M3.15 -13.7 L3.15 -14.85 M2.2 -14.35 L2.15 -14.35 2.2 -57.35 M7.2 -13.7 L7.25 -13.7 7.2 -13.7 M9.55 -13.85 L7.25 -12.7 4.65 -11.4 4.6 -11.4 4.6 8.1 4.65 8.1 M9.55 5.65 L9.55 4.1 M3.2 -24.2 L5.2 -23.2 M9.55 5.65 L9.6 5.65 9.55 5.65 M4.6 10.25 L3.65 10.7 3.6 10.7 3.6 13.7 M5.65 9.75 L4.6 10.25 M8.9 8.1 L5.7 9.75 M5.65 9.75 L5.7 9.75 M8.9 8.1 L13.2 5.9 M-2.35 2.55 L-2.35 4.65 M-7.55 5.1 L3.6 10.7 M-2.35 -14.85 L4.6 -11.4" fill="none" stroke="#660000" stroke-linecap="round" stroke-linejoin="miter" stroke-miterlimit="3.0" stroke-opacity="0.3019608" stroke-width="0.05"/>
    <path d="M13.25 8.9 L3.65 13.7 M3.6 13.7 L-7.55 8.1 M5.2 -12.7 L7.2 -13.7 M2.15 -14.35 L0.55 -15.15 M3.15 -14.85 L2.2 -14.35 M5.2 -12.7 L3.15 -13.7 M4.65 8.1 L9.55 5.65 M-2.35 4.65 L4.6 8.1" fill="none" stroke="#660000" stroke-linecap="round" stroke-linejoin="miter" stroke-miterlimit="3.0" stroke-opacity="0.101960786" stroke-width="0.05"/>
    <path d="M6.4 -22.65 L18.5 6.95 M3.8 -22.9 L2.5 14.75 M1.85 -23.95 L-13.5 7.2" fill="none" stroke="#422222" stroke-linecap="round" stroke-linejoin="miter" stroke-miterlimit="3.0" stroke-opacity="0.17254902" stroke-width="0.05"/>
  </g>
</svg>
