<?xml version="1.0" encoding="UTF-8" standalone="no"?>
<svg xmlns:xlink="http://www.w3.org/1999/xlink" height="47.0px" width="91.2px" xmlns="http://www.w3.org/2000/svg">
  <g transform="matrix(1.0, 0.0, 0.0, 1.0, 46.4, 27.15)">
    <path d="M15.75 -16.5 Q15.35 -16.8 15.4 -17.5 L15.45 -18.25 M4.7 -21.15 L4.55 -23.75 4.45 -24.45 M9.5 -18.8 Q9.15 -20.0 9.2 -21.4 L9.2 -21.7 M21.55 -12.85 L21.65 -13.35 21.5 -14.0 21.4 -14.3 M28.2 -9.5 Q27.55 -10.4 27.7 -11.55 L27.75 -12.25 M33.25 -6.75 Q32.75 -7.0 32.85 -7.65 L32.8 -8.35 32.7 -8.95 M39.2 -4.6 Q38.9 -5.85 39.2 -7.2 M44.8 -2.6 L44.65 -4.45 44.55 -4.9 M40.2 -0.7 L40.5 -3.95 M30.2 4.35 L30.2 2.35 30.2 1.9 M24.6 7.4 L24.45 5.25 24.45 4.95 M18.95 10.45 L19.0 7.95 19.1 7.55 M14.0 12.3 Q13.55 11.2 13.7 10.0 L13.75 9.55 M8.95 15.05 Q8.45 15.15 8.45 14.65 L8.4 13.05 8.4 12.3 M3.2 18.25 L3.4 17.25 3.3 15.5 M35.3 1.75 L35.4 -0.7 M-41.35 0.3 Q-41.25 -1.05 -41.45 -2.3 L-41.5 -3.0 M-46.0 -1.15 Q-46.35 -2.7 -46.3 -4.3 L-46.4 -5.05 M-0.75 -24.6 Q-1.2 -24.35 -1.05 -24.75 -0.8 -25.55 -1.0 -27.15 M-2.75 19.85 L-2.45 16.35 M-7.95 17.1 L-7.9 16.8 -7.55 15.35 -7.4 14.55 M-12.75 14.65 Q-12.95 12.55 -12.75 10.45 M-18.1 11.3 Q-17.7 10.8 -17.65 9.85 L-17.65 8.7 M-36.85 2.5 L-36.85 0.0 -36.85 -0.7 M-31.65 4.95 Q-32.1 4.6 -32.0 3.8 L-31.95 2.35 M-27.05 6.8 Q-27.35 6.8 -27.25 6.4 -27.0 5.0 -27.35 3.8 M-21.85 9.3 L-22.25 6.55 -22.25 6.25" fill="none" stroke="#660000" stroke-linecap="round" stroke-linejoin="round" stroke-opacity="0.5019608" stroke-width="0.05"/>
  </g>
</svg>
