<?xml version="1.0" encoding="UTF-8" standalone="no"?>
<svg xmlns:xlink="http://www.w3.org/1999/xlink" height="23.1px" width="41.55px" xmlns="http://www.w3.org/2000/svg">
  <g transform="matrix(1.0, 0.0, 0.0, 1.0, 13.5, 16.85)">
    <path d="M6.45 -6.3 Q9.4 -6.3 11.45 -5.25 13.55 -4.25 13.55 -2.75 13.55 -1.3 11.45 -0.25 L7.75 1.5 Q6.45 2.95 3.55 4.6 0.65 6.25 -3.5 6.25 -7.6 6.25 -10.55 4.75 -13.5 3.3 -13.5 1.25 -13.5 -0.85 -10.55 -2.3 -7.6 -3.8 -4.75 -3.75 L-0.95 -4.15 1.75 -5.4 Q3.55 -6.3 6.45 -6.3 M11.9 -2.4 L12.05 -2.75 Q11.9 -3.4 10.8 -3.9 9.0 -4.8 6.45 -4.8 3.95 -4.8 2.45 -4.05 L-0.4 -2.75 -4.75 -2.25 Q-7.3 -2.25 -9.9 -0.95 -11.85 0.0 -12.0 1.25 L-11.9 1.6 Q-11.55 2.6 -9.9 3.4 -7.25 4.7 -3.5 4.75 0.2 4.75 2.85 3.3 5.45 1.8 6.65 0.5 L7.15 0.15 10.8 -1.6 11.9 -2.4" fill="#ffffff" fill-rule="evenodd" stroke="none"/>
    <path d="M-11.9 1.6 L-12.0 1.25 Q-11.85 0.0 -9.9 -0.95 -7.3 -2.25 -4.75 -2.25 L-0.4 -2.75 2.45 -4.05 Q3.95 -4.8 6.45 -4.8 9.0 -4.8 10.8 -3.9 11.9 -3.4 12.05 -2.75 L11.9 -2.4 Q11.55 -2.85 10.8 -3.2 9.0 -4.1 6.45 -4.1 3.95 -4.1 2.45 -3.35 L-0.4 -2.05 -4.75 -1.55 Q-7.3 -1.55 -9.9 -0.25 -11.55 0.55 -11.9 1.6" fill="#f5e4d5" fill-rule="evenodd" stroke="none"/>
    <path d="M-11.9 1.6 Q-11.55 0.55 -9.9 -0.25 -7.3 -1.55 -4.75 -1.55 L-0.4 -2.05 2.45 -3.35 Q3.95 -4.1 6.45 -4.1 9.0 -4.1 10.8 -3.2 11.55 -2.85 11.9 -2.4 L10.8 -1.6 7.15 0.15 6.65 0.5 Q5.45 1.8 2.85 3.3 0.2 4.75 -3.5 4.75 -7.25 4.7 -9.9 3.4 -11.55 2.6 -11.9 1.6" fill="url(#gradient0)" fill-rule="evenodd" stroke="none"/>
    <path d="M6.45 -6.3 Q9.4 -6.3 11.45 -5.25 13.55 -4.25 13.55 -2.75 13.55 -1.3 11.45 -0.25 L7.75 1.5 Q6.45 2.95 3.55 4.6 0.65 6.25 -3.5 6.25 -7.6 6.25 -10.55 4.75 -13.5 3.3 -13.5 1.25 -13.5 -0.85 -10.55 -2.3 -7.6 -3.8 -4.75 -3.75 L-0.95 -4.15 1.75 -5.4 Q3.55 -6.3 6.45 -6.3 M11.9 -2.4 L12.05 -2.75 Q11.9 -3.4 10.8 -3.9 9.0 -4.8 6.45 -4.8 3.95 -4.8 2.45 -4.05 L-0.4 -2.75 -4.75 -2.25 Q-7.3 -2.25 -9.9 -0.95 -11.85 0.0 -12.0 1.25 L-11.9 1.6 Q-11.55 0.55 -9.9 -0.25 -7.3 -1.55 -4.75 -1.55 L-0.4 -2.05 2.45 -3.35 Q3.95 -4.1 6.45 -4.1 9.0 -4.1 10.8 -3.2 11.55 -2.85 11.9 -2.4 L10.8 -1.6 7.15 0.15 6.65 0.5 Q5.45 1.8 2.85 3.3 0.2 4.75 -3.5 4.75 -7.25 4.7 -9.9 3.4 -11.55 2.6 -11.9 1.6" fill="none" stroke="#660000" stroke-linecap="round" stroke-linejoin="round" stroke-opacity="0.3019608" stroke-width="0.05"/>
    <path d="M5.75 1.15 Q5.55 -0.7 6.35 -2.25 L6.55 -2.4 8.3 -0.1 Q8.15 -2.0 8.95 -3.55 L9.15 -3.7 Q11.3 -1.6 12.2 1.9 M8.3 -0.1 Q9.1 1.35 9.6 3.2" fill="none" stroke="#999999" stroke-linecap="round" stroke-linejoin="round" stroke-width="0.05"/>
    <path d="M18.25 -7.15 L16.7 -7.75 Q14.75 -8.7 14.8 -10.05 14.75 -11.3 16.35 -12.2 15.75 -11.65 15.75 -10.95 15.75 -9.8 17.4 -8.95 19.1 -8.15 21.45 -8.1 23.75 -8.15 25.4 -8.95 27.1 -9.8 27.1 -10.95 L26.6 -12.15 Q28.05 -11.25 28.05 -10.05 28.0 -8.7 26.05 -7.75 L24.55 -7.15 21.4 -6.75 18.25 -7.15" fill="#c8c9c7" fill-rule="evenodd" stroke="none"/>
    <path d="M16.65 -13.3 Q18.6 -14.25 21.35 -14.25 24.1 -14.25 26.05 -13.3 28.0 -12.3 28.0 -10.95 28.0 -9.6 26.05 -8.6 24.1 -7.65 21.35 -7.6 18.6 -7.65 16.65 -8.6 14.7 -9.6 14.75 -10.95 14.7 -12.3 16.65 -13.3" fill="#ffffff" fill-rule="evenodd" stroke="none"/>
    <path d="M16.65 -13.3 Q18.6 -14.25 21.35 -14.25 24.1 -14.25 26.05 -13.3 28.0 -12.3 28.0 -10.95 28.0 -9.6 26.05 -8.6 24.1 -7.65 21.35 -7.6 18.6 -7.65 16.65 -8.6 14.7 -9.6 14.75 -10.95 14.7 -12.3 16.65 -13.3 Z" fill="none" stroke="#660000" stroke-linecap="round" stroke-linejoin="round" stroke-opacity="0.3019608" stroke-width="0.05"/>
    <path d="M17.35 -12.95 Q19.05 -13.8 21.4 -13.75 23.7 -13.8 25.35 -12.95 L26.55 -12.1 Q27.05 -11.6 27.05 -10.95 27.05 -9.8 25.35 -8.95 23.7 -8.1 21.4 -8.1 19.05 -8.1 17.35 -8.95 15.7 -9.8 15.75 -10.95 15.7 -11.65 16.3 -12.2 L17.35 -12.95" fill="url(#gradient1)" fill-rule="evenodd" stroke="none"/>
    <path d="M21.95 -9.6 L21.4 -9.6 Q20.3 -9.6 19.55 -10.0 18.75 -10.4 18.75 -10.9 L19.0 -11.55 19.55 -11.85 Q20.3 -12.25 21.4 -12.25 L22.8 -12.0 22.05 -11.6 Q21.55 -11.1 21.55 -10.7 21.55 -9.95 21.95 -9.6" fill="#ffffff" fill-rule="evenodd" stroke="none"/>
    <path d="M22.8 -12.0 L23.25 -11.85 23.6 -11.65 23.85 -11.45 24.05 -10.9 Q24.05 -10.4 23.25 -10.0 L22.75 -9.75 21.95 -9.6 Q21.55 -9.95 21.55 -10.7 21.55 -11.1 22.05 -11.6 L22.8 -12.0" fill="#c8c9c7" fill-rule="evenodd" stroke="none"/>
    <path d="M21.65 -10.95 L21.4 -10.95 Q20.7 -10.95 20.2 -11.25 19.7 -11.5 19.7 -11.8 19.7 -12.0 19.85 -12.2 L20.2 -12.4 21.4 -12.7 21.6 -12.7 22.15 -11.75 21.65 -10.95" fill="#ffffff" fill-rule="evenodd" stroke="none"/>
    <path d="M21.6 -12.7 L21.65 -12.7 21.85 -12.65 22.4 -12.55 22.4 -12.5 22.65 -12.4 23.0 -12.15 23.15 -11.8 Q23.15 -11.5 22.65 -11.25 L22.15 -11.05 21.65 -10.95 22.15 -11.75 21.6 -12.7" fill="#c8c9c7" fill-rule="evenodd" stroke="none"/>
    <path d="M21.2 -12.0 L20.4 -12.2 Q19.95 -12.4 20.0 -12.7 L20.1 -13.0 20.4 -13.15 21.4 -13.4 22.15 -13.3 21.65 -13.4 21.55 -12.8 21.2 -12.0" fill="#ffffff" fill-rule="evenodd" stroke="none"/>
    <path d="M21.2 -12.0 L21.55 -12.8 21.65 -13.4 22.15 -13.3 22.35 -13.2 22.4 -13.15 22.7 -13.0 22.8 -12.7 Q22.8 -12.4 22.4 -12.2 L21.4 -12.0 21.2 -12.0" fill="#c8c9c7" fill-rule="evenodd" stroke="none"/>
    <path d="M23.35 -14.05 L23.0 -13.45 Q22.6 -12.8 21.35 -12.8 20.1 -12.85 19.4 -13.2 L19.25 -13.3 19.15 -13.6 19.4 -14.1 19.8 -14.35 21.4 -14.7 22.95 -14.35 23.35 -14.05" fill="#ffffff" fill-rule="evenodd" stroke="none"/>
    <path d="M19.25 -13.3 L19.4 -13.2 Q20.1 -12.85 21.35 -12.8 22.6 -12.8 23.0 -13.45 L23.35 -14.05 23.4 -14.0 23.6 -13.6 Q23.6 -13.15 22.95 -12.8 22.3 -12.45 21.4 -12.45 20.45 -12.45 19.8 -12.8 19.35 -13.0 19.25 -13.3" fill="#c8c9c7" fill-rule="evenodd" stroke="none"/>
    <path d="M19.25 -13.3 Q19.35 -13.0 19.8 -12.8 20.45 -12.45 21.4 -12.45 22.3 -12.45 22.95 -12.8 23.6 -13.15 23.6 -13.6 L23.4 -14.0 23.35 -14.05 22.95 -14.35 21.4 -14.7 19.8 -14.35 19.4 -14.1 19.15 -13.6 19.25 -13.3 Z" fill="none" stroke="#660000" stroke-linecap="round" stroke-linejoin="round" stroke-opacity="0.3019608" stroke-width="0.05"/>
    <path d="M22.8 -13.95 L22.95 -13.6 22.5 -13.05 21.45 -12.8 20.3 -13.05 19.85 -13.6 20.0 -13.95 20.3 -14.15 21.45 -14.4 22.5 -14.15 22.8 -13.95" fill="#00cccc" fill-rule="evenodd" stroke="none"/>
    <path d="M21.7 -14.55 L21.4 -14.5 20.85 -14.65 Q20.55 -14.75 20.6 -14.95 L20.65 -15.1 20.85 -15.2 21.4 -15.35 21.5 -15.35 21.4 -15.15 21.7 -14.55" fill="#ffffff" fill-rule="evenodd" stroke="none"/>
    <path d="M21.5 -15.35 L22.0 -15.2 22.15 -15.1 22.25 -14.95 22.0 -14.65 21.7 -14.55 21.4 -15.15 21.5 -15.35" fill="#c8c9c7" fill-rule="evenodd" stroke="none"/>
    <path d="M21.8 -15.05 L21.4 -15.05 20.85 -15.15 20.6 -15.45 20.65 -15.65 20.85 -15.75 21.4 -15.85 21.55 -15.85 21.65 -15.45 21.8 -15.05" fill="#ffffff" fill-rule="evenodd" stroke="none"/>
    <path d="M21.8 -15.05 L21.65 -15.45 21.55 -15.85 22.0 -15.75 22.15 -15.65 22.25 -15.45 22.0 -15.15 21.8 -15.05" fill="#c8c9c7" fill-rule="evenodd" stroke="none"/>
    <path d="M20.6 -15.75 L20.5 -15.8 Q20.15 -16.0 20.15 -16.25 L20.3 -16.5 20.5 -16.7 21.4 -16.85 22.3 -16.7 22.4 -16.65 22.1 -16.25 21.05 -16.05 Q20.6 -15.9 20.6 -15.75" fill="#ffffff" fill-rule="evenodd" stroke="none"/>
    <path d="M22.4 -16.65 L22.55 -16.5 22.7 -16.25 22.3 -15.8 21.4 -15.6 20.6 -15.75 Q20.6 -15.9 21.05 -16.05 L22.1 -16.25 22.4 -16.65" fill="#c8c9c7" fill-rule="evenodd" stroke="none"/>
    <path d="M20.6 -15.75 L20.5 -15.8 Q20.15 -16.0 20.15 -16.25 L20.3 -16.5 20.5 -16.7 21.4 -16.85 22.3 -16.7 22.4 -16.65 22.55 -16.5 22.7 -16.25 22.3 -15.8 21.4 -15.6 20.6 -15.75 Z" fill="none" stroke="#660000" stroke-linecap="round" stroke-linejoin="round" stroke-opacity="0.3019608" stroke-width="0.05"/>
    <path d="M21.3 -14.15 L21.3 -14.05 Q21.3 -13.7 21.7 -13.55 L21.95 -13.15 22.15 -13.2 21.45 -13.1 20.7 -13.25 Q20.4 -13.4 20.4 -13.6 L20.5 -13.85 20.7 -13.95 21.3 -14.15" fill="#ffffff" fill-rule="evenodd" stroke="none"/>
    <path d="M21.3 -14.15 L21.45 -14.15 22.15 -13.95 22.4 -13.85 22.5 -13.6 22.15 -13.25 22.15 -13.2 21.95 -13.15 21.7 -13.55 Q21.3 -13.7 21.3 -14.05 L21.3 -14.15" fill="#c8c9c7" fill-rule="evenodd" stroke="none"/>
    <path d="M21.7 -13.95 L21.4 -13.9 20.85 -14.05 20.6 -14.35 20.65 -14.55 20.85 -14.65 21.4 -14.75 21.65 -14.75 21.6 -14.35 21.7 -13.95" fill="#ffffff" fill-rule="evenodd" stroke="none"/>
    <path d="M21.65 -14.75 L21.8 -14.7 21.95 -14.7 22.0 -14.65 22.15 -14.55 22.25 -14.35 22.0 -14.05 21.7 -13.95 21.6 -14.35 21.65 -14.75" fill="#c8c9c7" fill-rule="evenodd" stroke="none"/>
  </g>
  <defs>
    <linearGradient gradientTransform="matrix(0.0, 0.0065, -0.0058, 0.0, 0.05, 0.0)" gradientUnits="userSpaceOnUse" id="gradient0" spreadMethod="pad" x1="-819.2" x2="819.2">
      <stop offset="0.0" stop-color="#19b3b3"/>
      <stop offset="1.0" stop-color="#008282"/>
    </linearGradient>
    <linearGradient gradientTransform="matrix(1.0, 0.0, 0.0, 1.0, 0.0, 0.0)" gradientUnits="userSpaceOnUse" id="gradient1" spreadMethod="pad" x1="-819.2" x2="819.2">
      <stop offset="0.0" stop-color="#19b3b3"/>
      <stop offset="1.0" stop-color="#008282"/>
    </linearGradient>
  </defs>
</svg>
