<?xml version="1.0" encoding="UTF-8" standalone="no"?>
<svg xmlns:xlink="http://www.w3.org/1999/xlink" height="53.45px" width="38.55px" xmlns="http://www.w3.org/2000/svg">
  <g transform="matrix(1.0, 0.0, 0.0, 1.0, 19.25, 26.7)">
    <path d="M19.3 -12.8 L17.8 -12.05 10.25 4.3 6.45 5.45 6.1 5.45 6.1 12.6 -5.9 26.75 -15.05 25.85 -17.9 21.75 -15.9 20.6 -19.25 3.4 -15.25 -2.25 -15.95 -13.7 -6.45 -23.7 -2.9 -26.7 16.95 -19.25 19.3 -12.8" fill="#bcd7fe" fill-rule="evenodd" stroke="none"/>
    <path d="M19.3 -12.8 L16.95 -19.25 -2.9 -26.7 -6.45 -23.7 -15.95 -13.7 -15.25 -2.25 -19.25 3.4 -15.9 20.6 -17.9 21.75 -15.05 25.85 -5.9 26.75 6.1 12.6 6.1 5.45 6.45 5.45 10.25 4.3 17.8 -12.05 19.3 -12.8 Z" fill="none" stroke="#ffffff" stroke-linecap="round" stroke-linejoin="round" stroke-width="0.05"/>
  </g>
</svg>
