<?xml version="1.0" encoding="UTF-8" standalone="no"?>
<svg xmlns:xlink="http://www.w3.org/1999/xlink" height="14.1px" width="20.25px" xmlns="http://www.w3.org/2000/svg">
  <g transform="matrix(1.0, 0.0, 0.0, 1.0, 13.1, 8.45)">
    <path d="M-1.2 5.65 L-11.8 0.3 -3.55 -3.85 7.15 1.5 -1.2 5.65" fill="#663e3e" fill-opacity="0.5019608" fill-rule="evenodd" stroke="none"/>
    <path d="M-11.8 -3.5 L-11.45 -3.65 -11.25 -3.7 -11.1 -3.7 -11.8 -3.5" fill="#feda9e" fill-rule="evenodd" stroke="none"/>
    <path d="M-9.6 -3.85 L-6.3 -0.2 -6.3 3.2 -11.8 0.45 -11.8 -3.5 -11.1 -3.7 -11.05 -3.7 -9.6 -3.85" fill="#edcca0" fill-rule="evenodd" stroke="none"/>
    <path d="M-6.3 -0.2 L-5.9 0.2 2.3 -3.85 2.3 -0.8 -5.95 3.4 -6.3 3.2 -6.3 -0.2" fill="#c28394" fill-rule="evenodd" stroke="none"/>
    <path d="M-0.4 -8.45 L-0.35 -8.45 3.35 -4.4 2.3 -3.85 -5.9 0.2 -6.3 -0.2 -9.6 -3.85 -0.4 -8.45" fill="url(#gradient0)" fill-rule="evenodd" stroke="none"/>
    <path d="M-0.4 -8.45 L-9.6 -3.85 -11.05 -3.7 -11.1 -3.7 -11.25 -3.7 -11.75 -3.65 -13.1 -3.5 -3.85 -8.15 -0.4 -8.45" fill="url(#gradient1)" fill-rule="evenodd" stroke="none"/>
    <path d="M2.3 -3.85 L3.35 -4.4 -0.35 -8.45 -0.4 -8.45 -9.6 -3.85 -6.3 -0.2 -5.9 0.2 2.3 -3.85 M-11.8 0.45 L-11.8 -3.5 M-11.45 -3.65 L-11.75 -3.65 -13.1 -3.5 -3.85 -8.15 -0.4 -8.45 M-11.1 -3.7 L-11.05 -3.7 -9.6 -3.85" fill="none" stroke="#660000" stroke-linecap="round" stroke-linejoin="round" stroke-opacity="0.3019608" stroke-width="0.05"/>
    <path d="M2.3 -0.8 L-5.95 3.4 -6.3 3.2 -11.8 0.45" fill="none" stroke="#660000" stroke-linecap="round" stroke-linejoin="round" stroke-opacity="0.101960786" stroke-width="0.05"/>
    <path d="M2.3 -3.85 L2.3 -0.8" fill="none" stroke="#660000" stroke-linecap="round" stroke-linejoin="round" stroke-opacity="0.3019608" stroke-width="0.05"/>
    <path d="M-8.65 -0.9 L-8.65 0.3 -9.9 -0.3 -9.9 -1.55 -8.65 -0.9" fill="#990000" fill-rule="evenodd" stroke="none"/>
    <path d="M-8.65 -0.9 L-9.9 -1.55 -9.9 -0.3 -8.65 0.3 -8.65 -0.9 Z" fill="none" stroke="#660000" stroke-linecap="round" stroke-linejoin="round" stroke-opacity="0.3019608" stroke-width="0.05"/>
    <path d="M-0.45 -1.75 L-0.45 0.7 1.2 -0.1 1.2 -2.6 -0.45 -1.75" fill="#c27713" fill-rule="evenodd" stroke="none"/>
    <path d="M-0.45 -1.75 L-0.45 0.7 1.2 -0.1 1.2 -2.6 -0.45 -1.75 Z" fill="none" stroke="#660000" stroke-linecap="round" stroke-linejoin="round" stroke-opacity="0.3019608" stroke-width="0.05"/>
    <path d="M-3.35 -0.3 L-3.35 0.9 -2.1 0.3 -2.1 -0.95 -3.35 -0.3" fill="#990000" fill-rule="evenodd" stroke="none"/>
    <path d="M-3.35 -0.3 L-2.1 -0.95 -2.1 0.3 -3.35 0.9 -3.35 -0.3 Z" fill="none" stroke="#660000" stroke-linecap="round" stroke-linejoin="round" stroke-opacity="0.3019608" stroke-width="0.05"/>
  </g>
  <defs>
    <linearGradient gradientTransform="matrix(-0.004, -0.0069, -0.0046, 0.0027, -3.15, -4.05)" gradientUnits="userSpaceOnUse" id="gradient0" spreadMethod="pad" x1="-819.2" x2="819.2">
      <stop offset="0.0" stop-color="#9c5f0e"/>
      <stop offset="1.0" stop-color="#731f1f"/>
    </linearGradient>
    <linearGradient gradientTransform="matrix(0.0078, 0.0, 0.0, 0.003, -6.75, -6.0)" gradientUnits="userSpaceOnUse" id="gradient1" spreadMethod="pad" x1="-819.2" x2="819.2">
      <stop offset="0.0" stop-color="#9c5f0e"/>
      <stop offset="1.0" stop-color="#731f1f"/>
    </linearGradient>
  </defs>
</svg>
