<?xml version="1.0" encoding="UTF-8" standalone="no"?>
<svg xmlns:xlink="http://www.w3.org/1999/xlink" height="61.7px" width="57.95px" xmlns="http://www.w3.org/2000/svg">
  <g transform="matrix(1.0, 0.0, 0.0, 1.0, 29.0, 30.85)">
    <path d="M14.6 -4.25 L14.95 -16.7 15.0 -16.7 22.15 -19.15 22.15 -19.1 23.15 -13.2 Q25.1 -0.65 27.25 16.45 L27.25 16.5 28.5 26.7 28.75 28.85 28.95 30.85 21.15 26.95 20.55 24.6 20.45 24.65 19.3 24.9 18.65 20.8 16.35 6.55 14.6 -4.25" fill="url(#gradient0)" fill-rule="evenodd" stroke="none"/>
    <path d="M5.75 27.3 L5.75 28.05 4.8 27.8 4.75 27.8 -6.2 25.25 -6.3 25.25 -7.75 24.9 -7.1 20.8 -4.8 6.55 -3.05 -4.25 -3.45 -16.7 -3.5 -16.7 -3.9 -17.2 -1.25 -30.85 5.75 -21.35 5.75 27.3 M-10.65 -19.1 L-11.6 -13.2 Q-13.6 -0.65 -15.75 16.45 L-15.75 16.5 -16.65 24.05 -16.95 26.7 -17.2 28.85 -17.25 29.15 -17.45 30.85 -21.0 29.05 -21.0 18.65 -21.0 18.6 -21.05 18.6 -29.0 12.3 -15.4 -28.75 -10.65 -19.1" fill="url(#gradient1)" fill-rule="evenodd" stroke="none"/>
  </g>
  <defs>
    <linearGradient gradientTransform="matrix(1.0, 0.0, 0.0, 1.0, 7.8, 274.7)" gradientUnits="userSpaceOnUse" id="gradient0" spreadMethod="pad" x1="-819.2" x2="819.2">
      <stop offset="0.0" stop-color="#ffffff"/>
      <stop offset="1.0" stop-color="#ffffff" stop-opacity="0.0"/>
    </linearGradient>
    <linearGradient gradientTransform="matrix(0.0, 0.0347, -0.0364, 0.0, -19.9, 10.05)" gradientUnits="userSpaceOnUse" id="gradient1" spreadMethod="pad" x1="-819.2" x2="819.2">
      <stop offset="0.0" stop-color="#ffffff"/>
      <stop offset="1.0" stop-color="#ffffff" stop-opacity="0.0"/>
    </linearGradient>
  </defs>
</svg>
