<?xml version="1.0" encoding="UTF-8" standalone="no"?>
<svg xmlns:xlink="http://www.w3.org/1999/xlink" height="7.7px" width="2.0px" xmlns="http://www.w3.org/2000/svg">
  <g transform="matrix(1.0, 0.0, 0.0, 1.0, 1.0, 2.45)">
    <path d="M0.0 -1.4 L1.0 -1.95 1.0 4.75 0.0 5.25 0.0 -1.4 M0.55 1.5 L0.45 1.95 0.45 2.1 0.5 2.1 0.55 2.05 0.6 1.6 0.55 1.5 M0.4 -1.05 L0.5 -0.3 0.55 -0.55 0.5 -1.45 0.4 -1.05 M-0.15 -0.6 L-0.3 1.0 -0.4 1.0 -0.45 0.9 -0.2 -1.1 -0.15 -0.6 M-0.55 0.75 L-0.65 2.9 -0.75 2.9 -0.8 2.15 -0.6 0.5 -0.55 0.5 -0.55 0.75 M-0.2 2.15 L-0.25 2.75 -0.4 4.25 -0.45 4.25 -0.55 4.0 -0.3 2.05 -0.25 2.05 -0.2 2.15" fill="#8c8c8c" fill-rule="evenodd" stroke="none"/>
    <path d="M-1.0 -1.95 L0.0 -2.45 1.0 -1.95 0.0 -1.4 -1.0 -1.95 0.0 -1.4 0.0 5.25 -1.0 4.75 -1.0 -1.95 M0.4 -1.05 L0.5 -1.45 0.55 -0.55 0.5 -0.3 0.4 -1.05 M0.55 1.5 L0.6 1.6 0.55 2.05 0.5 2.1 0.45 2.1 0.45 1.95 0.55 1.5 M-0.2 2.15 L-0.25 2.05 -0.3 2.05 -0.55 4.0 -0.45 4.25 -0.4 4.25 -0.25 2.75 -0.2 2.15 M-0.55 0.75 L-0.55 0.5 -0.6 0.5 -0.8 2.15 -0.75 2.9 -0.65 2.9 -0.55 0.75 M-0.15 -0.6 L-0.2 -1.1 -0.45 0.9 -0.4 1.0 -0.3 1.0 -0.15 -0.6" fill="#cccccc" fill-rule="evenodd" stroke="none"/>
    <path d="M1.0 -1.95 L0.0 -2.45 -1.0 -1.95 0.0 -1.4 1.0 -1.95 1.0 4.75 0.0 5.25 -1.0 4.75 -1.0 -1.95 M0.0 5.25 L0.0 -1.4" fill="none" stroke="#660000" stroke-linecap="round" stroke-linejoin="round" stroke-opacity="0.3019608" stroke-width="0.05"/>
  </g>
</svg>
