<?xml version="1.0" encoding="UTF-8" standalone="no"?>
<svg xmlns:xlink="http://www.w3.org/1999/xlink" height="6.2px" width="12.1px" xmlns="http://www.w3.org/2000/svg">
  <g transform="matrix(1.0, 0.0, 0.0, 1.0, 5.35, 7.2)">
    <path d="M4.7 -5.45 L0.6 -3.4 -0.25 -5.3 3.55 -7.2 4.7 -5.45 M-0.65 -3.75 L-2.95 -4.9 -2.95 -6.0 -1.25 -5.2 -0.65 -3.75 M-3.95 -6.5 L-3.95 -5.4 -5.35 -6.1 -4.8 -6.95 -3.95 -6.5" fill="#1f1d38" fill-opacity="0.6" fill-rule="evenodd" stroke="none"/>
    <path d="M3.7 -2.15 L3.9 -1.65 3.7 -1.2 3.25 -1.0 2.8 -1.2 2.6 -1.7 2.8 -2.15 3.25 -2.3 3.7 -2.15 M6.55 -2.6 Q6.35 -2.4 6.1 -2.4 L5.65 -2.6 5.45 -3.1 5.65 -3.55 6.1 -3.7 6.55 -3.55 6.75 -3.05 6.55 -2.6" fill="#ffffff" fill-rule="evenodd" stroke="none"/>
  </g>
</svg>
