<?xml version="1.0" encoding="UTF-8" standalone="no"?>
<svg xmlns:xlink="http://www.w3.org/1999/xlink" height="48.0px" width="36.0px" xmlns="http://www.w3.org/2000/svg">
  <g transform="matrix(1.0, 0.0, 0.0, 1.0, 12.0, 38.0)">
    <path d="M0.3 6.5 L-3.2 4.75 -3.2 1.75 -2.65 2.0 0.35 3.5 0.35 6.5 0.3 6.5" fill="#7e645e" fill-rule="evenodd" stroke="none"/>
    <path d="M8.0 -36.0 L8.0 -34.9 1.1 -31.45 0.3 -31.85 0.0 -32.0 0.3 -31.85 Q0.15 -31.9 -0.05 -32.0 L0.0 -32.0 6.9 -35.45 8.0 -36.0 M3.9 -30.0 L3.9 -28.9 -2.95 -25.5 -4.0 -26.0 -4.0 -26.05 -4.0 -26.0 -4.05 -26.05 -4.0 -26.05 3.9 -30.0 M-3.2 4.75 L-4.85 5.6 -4.85 5.55 -4.85 0.9 -3.65 1.5 -3.2 1.75 -3.2 4.75" fill="#602860" fill-rule="evenodd" stroke="none"/>
    <path d="M8.0 -34.9 L8.0 -36.0 20.0 -30.0 18.9 -29.45 8.0 -34.9 M8.0 -36.0 L6.9 -35.45 4.9 -36.45 6.0 -37.0 8.0 -36.0" fill="#94756a" fill-rule="evenodd" stroke="none"/>
    <path d="M8.0 -34.9 L18.9 -29.45 20.0 -30.0 8.0 -36.0 6.0 -37.0 8.0 -38.0 24.0 -30.0 4.0 -20.0 -8.0 -26.0 -4.0 -28.0 0.0 -30.0 -4.0 -32.0 4.9 -36.45 6.9 -35.45 0.0 -32.0 -0.05 -32.0 Q0.15 -31.9 0.3 -31.85 L1.1 -31.45 8.0 -34.9 M-2.95 -25.5 L3.9 -28.9 3.9 -30.0 0.3 -31.85 3.9 -30.0 -4.0 -26.05 -4.05 -26.05 -4.0 -26.0 -2.95 -25.5 4.0 -22.0 18.9 -29.45 4.0 -22.0 -2.95 -25.5" fill="#8f776f" fill-rule="evenodd" stroke="none"/>
    <path d="M24.0 -30.0 L24.0 0.0 4.0 10.0 4.0 -20.0 24.0 -30.0" fill="#522251" fill-rule="evenodd" stroke="none"/>
    <path d="M4.0 10.0 L0.3 8.15 0.3 6.5 0.35 6.5 0.35 3.5 -2.65 2.0 -3.65 1.5 -4.85 0.9 -4.85 5.55 -4.85 5.6 -8.0 4.0 -8.0 -26.0 4.0 -20.0 4.0 10.0 M-4.0 -28.0 L-4.0 -32.0 0.0 -30.0 -4.0 -28.0" fill="#755d54" fill-rule="evenodd" stroke="none"/>
    <path d="M8.0 -36.0 L8.0 -34.9 18.9 -29.45 20.0 -30.0 8.0 -36.0 6.9 -35.45 0.0 -32.0 0.3 -31.85 1.1 -31.45 8.0 -34.9 M6.0 -37.0 L4.9 -36.45 M3.9 -30.0 L3.9 -28.9 -2.95 -25.5 4.0 -22.0 18.9 -29.45 M0.3 -31.85 L3.9 -30.0 -4.0 -26.05 -4.0 -26.0 -2.95 -25.5 M6.0 -37.0 L8.0 -38.0 24.0 -30.0 24.0 0.0 4.0 10.0 0.3 8.15 0.3 6.5 M-4.85 5.6 L-8.0 4.0 -8.0 -26.0 -4.0 -28.0 -4.0 -32.0 4.9 -36.45 M24.0 -30.0 L4.0 -20.0 4.0 10.0 M0.35 3.5 L0.35 6.5 0.3 6.5 M0.3 -31.85 Q0.15 -31.9 -0.05 -32.0 L0.0 -32.0 M-4.0 -26.0 L-4.05 -26.05 -4.0 -26.05 M-4.0 -28.0 L0.0 -30.0 -4.0 -32.0 M-4.85 5.6 L-4.85 5.55 -4.85 0.9 M4.0 -20.0 L-8.0 -26.0" fill="none" stroke="#660000" stroke-linecap="round" stroke-linejoin="round" stroke-opacity="0.3019608" stroke-width="0.05"/>
  </g>
</svg>
