<?xml version="1.0" encoding="UTF-8" standalone="no"?>
<svg xmlns:xlink="http://www.w3.org/1999/xlink" height="33.55px" width="1.0px" xmlns="http://www.w3.org/2000/svg">
  <g transform="matrix(1.0, 0.0, 0.0, 1.0, 0.5, 16.8)">
    <path d="M0.0 16.25 L0.0 -14.85" fill="none" stroke="#660000" stroke-linecap="round" stroke-linejoin="miter" stroke-miterlimit="3.0" stroke-opacity="0.3019608" stroke-width="1.0"/>
    <path d="M0.0 -14.85 L0.0 -16.3" fill="none" stroke="#ffffcc" stroke-linecap="round" stroke-linejoin="miter" stroke-miterlimit="3.0" stroke-width="1.0"/>
  </g>
</svg>
