<?xml version="1.0" encoding="UTF-8" standalone="no"?>
<svg xmlns:xlink="http://www.w3.org/1999/xlink" height="38.0px" width="48.85px" xmlns="http://www.w3.org/2000/svg">
  <g transform="matrix(1.0, 0.0, 0.0, 1.0, 24.85, 20.05)">
    <path d="M-24.0 5.95 L0.0 -6.05 24.0 5.95 0.0 17.95 -24.0 5.95" fill="#96847f" fill-rule="evenodd" stroke="none"/>
    <path d="M6.35 -2.0 L21.2 5.45 21.2 6.55 -0.2 17.4 -0.2 17.3 -14.9 9.95 6.35 -0.7 6.35 -2.0" fill="#000000" fill-opacity="0.14117648" fill-rule="evenodd" stroke="none"/>
    <path d="M6.5 -10.75 L7.1 -11.05 7.05 -11.05 6.5 -10.75" fill="#e3dabe" fill-rule="evenodd" stroke="none"/>
    <path d="M1.15 -18.25 L10.35 -13.65 -0.8 -8.1 -0.8 -7.3 0.4 -6.7 -10.85 -1.05 -22.05 -6.65 1.15 -18.25" fill="#96847f" fill-rule="evenodd" stroke="none"/>
    <path d="M1.1 -19.05 L1.15 -19.05 11.15 -14.05 10.35 -13.65 1.15 -18.25 1.1 -19.05 M-0.8 -8.1 L1.2 -7.1 0.4 -6.7 -0.8 -7.3 -0.8 -8.1" fill="#b59da4" fill-rule="evenodd" stroke="none"/>
    <path d="M3.05 2.95 L3.1 0.65 5.1 -0.35 5.05 1.95 3.05 2.95 M-2.95 7.95 L-2.9 5.65 -0.9 4.65 -0.95 6.95 -2.95 7.95 M-6.95 9.95 L-8.95 10.95 -8.9 8.65 -6.9 7.65 -6.95 9.95 M-14.95 9.95 L-18.95 7.95 -18.95 6.9 -18.9 5.9 -18.9 5.85 -18.9 5.9 -14.9 7.9 -18.9 5.9 -18.9 4.9 -14.9 6.95 -14.9 7.75 -14.9 7.9 -14.9 8.9 -14.95 9.95 M-14.9 8.9 L-18.95 6.9 -14.9 8.9" fill="#736561" fill-rule="evenodd" stroke="none"/>
    <path d="M-24.85 -7.05 L-10.85 -0.05 -10.9 3.9 -14.9 1.9 -18.9 -0.1 -22.95 -2.1 -24.85 -3.05 -24.85 -7.05 M1.1 -19.05 L1.15 -18.25 -22.05 -6.65 -22.85 -7.05 1.1 -19.05" fill="#e4c4bc" fill-rule="evenodd" stroke="none"/>
    <path d="M13.15 -14.05 L11.25 -13.1 9.15 -12.1 7.05 -11.05 7.1 -11.05 6.5 -10.75 1.15 -8.1 3.2 -7.1 3.15 -7.05 1.3 -6.1 -1.75 -4.65 Q-6.25 -2.4 -10.8 -0.1 L-10.85 -0.05 -24.85 -7.05 1.15 -20.05 13.15 -14.05 M10.35 -13.65 L11.15 -14.05 1.15 -19.05 1.1 -19.05 -22.85 -7.05 -22.05 -6.65 -10.85 -1.05 0.4 -6.7 1.2 -7.1 -0.8 -8.1 10.35 -13.65" fill="#fff5f2" fill-rule="evenodd" stroke="none"/>
    <path d="M-22.95 -2.1 L-18.9 -0.1 -14.9 1.9 -10.9 3.9 -10.9 3.95 -10.9 9.35 -10.95 11.95 -14.95 9.95 -14.9 8.9 -14.9 7.9 -14.9 7.75 -14.9 6.95 -18.9 4.9 -18.9 5.9 -18.9 5.85 -18.9 5.9 -18.95 6.9 -18.95 7.95 -22.95 5.95 -22.95 -2.1 M-18.9 4.9 L-18.9 -0.1 -18.9 4.9 M-14.9 6.95 L-14.9 1.9 -14.9 6.95" fill="#c4a9a2" fill-rule="evenodd" stroke="none"/>
    <path d="M7.05 -11.05 L9.15 -12.1 11.25 -13.1 13.15 -14.05 13.15 -10.05 11.05 -9.0 11.05 -1.05 5.05 1.95 5.1 -0.35 3.1 0.65 3.05 2.95 1.05 3.95 1.05 -2.0 3.2 -3.1 3.15 -3.1 3.15 -5.1 7.1 -7.05 11.05 -9.0 7.1 -7.05 3.15 -5.1 3.15 -3.1 3.2 -3.1 1.05 -2.0 1.05 3.95 1.05 5.95 -0.95 6.95 -0.9 4.65 -2.9 5.65 -2.95 7.95 -6.95 9.95 -6.9 7.65 -8.9 8.65 -8.95 10.95 -10.9 11.95 -10.95 11.95 -10.9 9.35 -10.9 3.95 -10.85 3.95 -10.9 3.9 -10.85 -0.05 -10.8 -0.1 Q-6.25 -2.4 -1.75 -4.65 L1.3 -6.1 3.15 -7.05 3.2 -7.1 1.15 -8.1 6.5 -10.75 7.05 -11.05 M3.15 -7.05 L3.15 -5.1 3.15 -7.05 M1.05 -2.0 L-10.85 3.95 1.05 -2.0" fill="#948086" fill-rule="evenodd" stroke="none"/>
    <path d="M7.05 -11.05 L9.15 -12.1 11.25 -13.1 13.15 -14.05 1.15 -20.05 -24.85 -7.05 -10.85 -0.05 -10.8 -0.1 Q-6.25 -2.4 -1.75 -4.65 L1.3 -6.1 3.15 -7.05 3.2 -7.1 1.15 -8.1 6.5 -10.75 M7.1 -11.05 L7.05 -11.05 6.5 -10.75 M10.35 -13.65 L11.15 -14.05 1.15 -19.05 1.1 -19.05 1.15 -18.25 10.35 -13.65 -0.8 -8.1 1.2 -7.1 0.4 -6.7 -10.85 -1.05 -22.05 -6.65 -22.85 -7.05 1.1 -19.05 M11.05 -9.0 L7.1 -7.05 3.15 -5.1 3.15 -3.1 3.2 -3.1 1.05 -2.0 1.05 3.95 3.05 2.95 3.1 0.65 5.1 -0.35 5.05 1.95 11.05 -1.05 11.05 -9.0 13.15 -10.05 13.15 -14.05 M3.15 -5.1 L3.15 -7.05 M5.05 1.95 L3.05 2.95 M-0.95 6.95 L1.05 5.95 1.05 3.95 M1.05 5.95 L1.1 5.95 1.05 5.95 M-24.85 -7.05 L-24.85 -3.05 -22.95 -2.1 -18.9 -0.1 -14.9 1.9 -10.9 3.9 -10.85 -0.05 M0.4 -6.7 L-0.8 -7.3 -0.8 -8.1 M-2.95 7.95 L-2.9 5.65 -0.9 4.65 -0.95 6.95 -2.95 7.95 -6.95 9.95 -8.95 10.95 -10.9 11.95 -10.95 11.95 -14.95 9.95 -18.95 7.95 -22.95 5.95 -22.95 -2.1 M-6.95 9.95 L-6.9 7.65 -8.9 8.65 -8.95 10.95 M-10.9 3.9 L-10.85 3.95 1.05 -2.0 M-10.9 3.95 L-10.9 3.9 M-10.9 3.95 L-10.9 9.35 -10.95 11.95 M-18.9 5.85 L-18.9 5.9 -14.9 7.9 -14.9 7.75 -14.9 6.95 -18.9 4.9 -18.9 5.9 -18.95 6.9 -14.9 8.9 -14.95 9.95 M-18.95 6.9 L-18.95 7.95 M-14.9 7.9 L-14.9 8.9 M-14.9 1.9 L-14.9 6.95 M-18.9 -0.1 L-18.9 4.9 M1.15 -18.25 L-22.05 -6.65" fill="none" stroke="#660000" stroke-linecap="round" stroke-linejoin="round" stroke-opacity="0.3019608" stroke-width="0.05"/>
    <path d="M5.8 -5.9 L6.6 -6.3 6.6 -5.65 5.8 -5.25 5.8 -4.2 5.8 -3.9 5.85 -3.7 5.95 -3.6 6.2 -3.7 6.35 -3.8 6.5 -3.95 6.6 -4.0 6.6 -3.3 6.3 -3.1 5.9 -2.9 5.15 -2.75 Q4.9 -2.85 4.9 -3.4 L4.9 -4.8 4.55 -4.65 4.55 -5.3 4.9 -5.45 4.9 -6.3 5.8 -6.75 5.8 -5.9 M8.15 -6.45 L7.95 -6.2 7.8 -5.85 7.75 -5.4 7.8 -5.0 7.95 -4.75 8.1 -4.7 8.35 -4.75 8.55 -4.9 8.75 -5.15 8.9 -5.5 8.9 -5.95 8.9 -6.4 8.75 -6.6 8.55 -6.65 8.35 -6.6 8.15 -6.45 M9.8 -6.4 Q9.8 -5.7 9.4 -5.05 L8.35 -4.1 7.25 -3.95 Q6.9 -4.25 6.9 -4.95 6.9 -5.7 7.3 -6.3 L8.35 -7.25 9.4 -7.35 Q9.8 -7.15 9.8 -6.4 M4.3 -5.15 L4.4 -5.2 4.4 -4.25 4.35 -4.25 4.15 -4.2 3.95 -4.1 3.6 -3.9 3.3 -3.65 3.3 -1.65 2.5 -1.25 2.5 -4.25 3.3 -4.65 3.3 -4.2 3.8 -4.8 4.2 -5.1 4.3 -5.15 M0.65 -2.65 L0.1 -2.5 -0.35 -2.2 -0.7 -1.85 -0.75 -1.85 -0.75 -2.55 -0.3 -2.9 0.3 -3.25 1.35 -3.5 1.65 -2.9 1.65 -0.85 0.85 -0.45 0.85 -0.75 0.65 -0.5 0.45 -0.3 0.2 -0.05 -0.1 0.1 -0.75 0.15 -1.0 -0.35 -0.85 -1.0 -0.5 -1.5 0.1 -1.95 0.85 -2.4 0.65 -2.65 M0.6 -0.95 L0.85 -1.2 0.85 -1.8 0.45 -1.6 0.15 -1.35 -0.05 -1.15 -0.1 -0.9 -0.1 -0.75 0.0 -0.7 0.1 -0.65 0.35 -0.75 0.6 -0.95 M13.1 -8.45 L13.1 -6.55 12.25 -6.1 12.25 -7.6 12.2 -7.95 12.15 -8.15 12.0 -8.25 11.75 -8.15 11.55 -8.0 11.25 -7.75 11.25 -5.65 10.4 -5.2 10.4 -8.2 11.25 -8.6 11.25 -8.3 11.7 -8.8 12.15 -9.15 12.85 -9.2 13.1 -8.45 M-7.7 -0.3 L-7.7 3.8 -8.55 4.25 -8.55 3.95 -8.95 4.45 -9.4 4.75 Q-9.9 5.0 -10.15 4.75 L-10.45 3.75 -10.35 3.0 -10.1 2.4 -9.7 1.85 -9.25 1.55 -8.85 1.4 -8.55 1.4 -8.55 0.1 -7.7 -0.3 M-6.2 -0.35 L-5.6 -1.65 -4.75 -2.1 -4.75 -2.05 -5.6 -0.6 -6.2 -0.35 M-6.05 0.65 L-6.2 1.2 -5.1 0.65 -5.25 0.25 -5.6 0.3 -6.05 0.65 M-5.55 -0.3 L-4.6 -0.45 Q-4.25 -0.25 -4.25 0.45 L-4.25 0.8 -6.2 1.75 -5.95 2.15 -5.3 2.05 -4.8 1.7 -4.4 1.25 -4.3 1.2 -4.3 1.95 -4.85 2.4 -5.4 2.75 -6.65 2.95 Q-7.05 2.75 -7.05 2.05 -7.05 1.3 -6.65 0.65 -6.25 0.0 -5.55 -0.3 M-2.85 -1.55 L-2.25 -1.95 -1.8 -2.1 -1.35 -2.15 -1.35 -1.35 -1.45 -1.3 -1.6 -1.35 -1.75 -1.4 -2.0 -1.35 -2.25 -1.3 -2.75 -0.8 -2.95 0.0 -2.75 0.55 -2.25 0.5 -1.95 0.3 -1.7 0.1 -1.6 -0.05 -1.45 -0.25 -1.35 -0.3 -1.35 0.5 -1.75 0.9 -2.25 1.2 -2.9 1.4 -3.4 1.4 -3.75 1.05 -3.85 0.45 -3.7 -0.35 -3.35 -1.0 -2.85 -1.55 M-8.75 2.0 L-8.9 2.05 -9.4 2.55 -9.6 3.3 -9.45 3.85 -9.05 3.85 -8.75 3.65 -8.55 3.45 -8.55 1.95 -8.75 2.0" fill="#003399" fill-rule="evenodd" stroke="none"/>
    <path d="M5.8 -5.9 L6.6 -6.3 6.6 -5.65 5.8 -5.25 5.8 -4.2 5.8 -3.9 5.85 -3.7 5.95 -3.6 6.2 -3.7 6.35 -3.8 6.5 -3.95 6.6 -4.0 6.6 -3.3 6.3 -3.1 5.9 -2.9 5.15 -2.75 Q4.9 -2.85 4.9 -3.4 L4.9 -4.8 4.55 -4.65 4.55 -5.3 4.9 -5.45 4.9 -6.3 5.8 -6.75 5.8 -5.9 M8.15 -6.45 L7.95 -6.2 7.8 -5.85 7.75 -5.4 7.8 -5.0 7.95 -4.75 8.1 -4.7 8.35 -4.75 8.55 -4.9 8.75 -5.15 8.9 -5.5 8.9 -5.95 8.9 -6.4 8.75 -6.6 8.55 -6.65 8.35 -6.6 8.15 -6.45 M9.8 -6.4 Q9.8 -5.7 9.4 -5.05 L8.35 -4.1 7.25 -3.95 Q6.9 -4.25 6.9 -4.95 6.9 -5.7 7.3 -6.3 L8.35 -7.25 9.4 -7.35 Q9.8 -7.15 9.8 -6.4 M4.3 -5.15 L4.4 -5.2 4.4 -4.25 4.35 -4.25 4.15 -4.2 3.95 -4.1 3.6 -3.9 3.3 -3.65 3.3 -1.65 2.5 -1.25 2.5 -4.25 3.3 -4.65 3.3 -4.2 3.8 -4.8 4.2 -5.1 4.3 -5.15 M0.65 -2.65 L0.1 -2.5 -0.35 -2.2 -0.7 -1.85 -0.75 -1.85 -0.75 -2.55 -0.3 -2.9 0.3 -3.25 1.35 -3.5 1.65 -2.9 1.65 -0.85 0.85 -0.45 0.85 -0.75 0.65 -0.5 0.45 -0.3 0.2 -0.05 -0.1 0.1 -0.75 0.15 -1.0 -0.35 -0.85 -1.0 -0.5 -1.5 0.1 -1.95 0.85 -2.4 0.65 -2.65 M0.6 -0.95 L0.85 -1.2 0.85 -1.8 0.45 -1.6 0.15 -1.35 -0.05 -1.15 -0.1 -0.9 -0.1 -0.75 0.0 -0.7 0.1 -0.65 0.35 -0.75 0.6 -0.95 M13.1 -8.45 L13.1 -6.55 12.25 -6.1 12.25 -7.6 12.2 -7.95 12.15 -8.15 12.0 -8.25 11.75 -8.15 11.55 -8.0 11.25 -7.75 11.25 -5.65 10.4 -5.2 10.4 -8.2 11.25 -8.6 11.25 -8.3 11.7 -8.8 12.15 -9.15 12.85 -9.2 13.1 -8.45 M-7.7 -0.3 L-7.7 3.8 -8.55 4.25 -8.55 3.95 -8.95 4.45 -9.4 4.75 Q-9.9 5.0 -10.15 4.75 L-10.45 3.75 -10.35 3.0 -10.1 2.4 -9.7 1.85 -9.25 1.55 -8.85 1.4 -8.55 1.4 -8.55 0.1 -7.7 -0.3 M-6.2 -0.35 L-5.6 -1.65 -4.75 -2.1 -4.75 -2.05 -5.6 -0.6 -6.2 -0.35 M-6.05 0.65 L-6.2 1.2 -5.1 0.65 -5.25 0.25 -5.6 0.3 -6.05 0.65 M-5.55 -0.3 L-4.6 -0.45 Q-4.25 -0.25 -4.25 0.45 L-4.25 0.8 -6.2 1.75 -5.95 2.15 -5.3 2.05 -4.8 1.7 -4.4 1.25 -4.3 1.2 -4.3 1.95 -4.85 2.4 -5.4 2.75 -6.65 2.95 Q-7.05 2.75 -7.05 2.05 -7.05 1.3 -6.65 0.65 -6.25 0.0 -5.55 -0.3 M-2.85 -1.55 L-2.25 -1.95 -1.8 -2.1 -1.35 -2.15 -1.35 -1.35 -1.45 -1.3 -1.6 -1.35 -1.75 -1.4 -2.0 -1.35 -2.25 -1.3 -2.75 -0.8 -2.95 0.0 -2.75 0.55 -2.25 0.5 -1.95 0.3 -1.7 0.1 -1.6 -0.05 -1.45 -0.25 -1.35 -0.3 -1.35 0.5 -1.75 0.9 -2.25 1.2 -2.9 1.4 -3.4 1.4 -3.75 1.05 -3.85 0.45 -3.7 -0.35 -3.35 -1.0 -2.85 -1.55 M-8.75 2.0 L-8.9 2.05 -9.4 2.55 -9.6 3.3 -9.45 3.85 -9.05 3.85 -8.75 3.65 -8.55 3.45 -8.55 1.95 -8.75 2.0" fill="none" stroke="#00ffff" stroke-linecap="round" stroke-linejoin="round" stroke-opacity="0.2" stroke-width="0.05"/>
    <path d="M8.5 2.45 L11.95 0.75 11.6 0.6 4.4 4.2 4.75 4.35 8.15 2.65 10.45 3.8 7.05 5.5 7.35 5.65 10.8 3.95 13.1 5.1 9.65 6.8 10.0 7.0 13.45 5.3 15.75 6.4 12.3 8.15 12.65 8.3 16.1 6.6 18.4 7.75 14.95 9.45 15.3 9.65 22.5 6.05 22.15 5.85 18.7 7.55 16.4 6.4 19.85 4.7 19.5 4.55 16.1 6.25 13.8 5.1 17.2 3.4 16.85 3.2 13.45 4.95 11.15 3.8 14.55 2.1 14.2 1.9 10.8 3.6 8.5 2.45" fill="#ffffff" fill-rule="evenodd" stroke="none"/>
  </g>
</svg>
