<?xml version="1.0" encoding="UTF-8" standalone="no"?>
<svg xmlns:xlink="http://www.w3.org/1999/xlink" height="18.0px" width="36.0px" xmlns="http://www.w3.org/2000/svg">
  <g transform="matrix(1.0, 0.0, 0.0, 1.0, 18.0, 9.0)">
    <path d="M8.0 -4.0 L18.0 1.0 15.2 2.4 4.8 7.6 2.0 9.0 -18.0 -1.0 -15.2 -2.4 -4.8 -7.6 -2.0 -9.0 8.0 -4.0 M0.0 5.2 L-10.4 0.0 -15.2 -2.4 -10.4 0.0 -4.7 -2.85 -10.4 0.0 0.0 5.2 5.7 2.35 -4.7 -2.85 0.0 -5.2 -4.8 -7.6 0.0 -5.2 10.4 0.0 15.2 2.4 10.4 0.0 0.0 -5.2 -4.7 -2.85 5.7 2.35 10.4 0.0 5.7 2.35 0.0 5.2 4.8 7.6 0.0 5.2" fill="#f19974" fill-rule="evenodd" stroke="none"/>
    <path d="M8.0 -4.0 L18.0 1.0 15.2 2.4 4.8 7.6 2.0 9.0 -18.0 -1.0 -15.2 -2.4 -4.8 -7.6 -2.0 -9.0 8.0 -4.0 M-4.8 -7.6 L0.0 -5.2 10.4 0.0 15.2 2.4 M0.0 -5.2 L-4.7 -2.85 5.7 2.35 10.4 0.0 M5.7 2.35 L0.0 5.2 4.8 7.6 M-15.2 -2.4 L-10.4 0.0 -4.7 -2.85 M-10.4 0.0 L0.0 5.2" fill="none" stroke="#ffffff" stroke-linecap="round" stroke-linejoin="round" stroke-opacity="0.5019608" stroke-width="0.05"/>
    <path d="M8.0 -6.0 L8.0 -4.0 -7.95 4.0 -8.0 2.0 8.0 -6.0" fill="#000000" fill-opacity="0.2" fill-rule="evenodd" stroke="none"/>
    <path d="M8.0 -6.0 L8.0 -4.0 M-7.95 4.0 L-8.0 2.0" fill="none" stroke="#996600" stroke-linecap="round" stroke-linejoin="round" stroke-width="0.05"/>
    <path d="M8.0 -4.0 L-7.95 4.0" fill="none" stroke="#660000" stroke-linecap="round" stroke-linejoin="round" stroke-opacity="0.101960786" stroke-width="0.05"/>
    <path d="M-8.0 2.0 L8.0 -6.0 Z" fill="none" stroke="#ffffff" stroke-linecap="round" stroke-linejoin="round" stroke-width="0.05"/>
  </g>
</svg>
