<?xml version="1.0" encoding="UTF-8" standalone="no"?>
<svg xmlns:xlink="http://www.w3.org/1999/xlink" height="69.45px" width="45.0px" xmlns="http://www.w3.org/2000/svg">
  <g transform="matrix(1.0, 0.0, 0.0, 1.0, 23.7, 100.1)">
    <path d="M-1.05 -85.9 Q8.8 -79.15 20.3 -74.95 L21.25 -74.6 21.3 -74.6 21.3 -64.55 20.3 -65.2 Q9.9 -72.1 -1.1 -75.55 L-1.1 -75.6 Q0.8 -80.2 -1.1 -85.9 L-1.05 -85.9 M-1.1 -54.85 Q0.45 -56.45 -1.1 -60.0 9.6 -53.05 20.3 -49.0 L21.25 -48.65 21.3 -48.65 21.3 -46.25 21.3 -46.0 21.3 -43.8 20.3 -44.45 Q10.15 -51.3 -1.1 -54.8 L-1.1 -54.85" fill="#e66f3c" fill-opacity="0.8" fill-rule="evenodd" stroke="none"/>
    <path d="M21.25 -74.6 Q20.8 -75.0 20.3 -75.2 L-1.05 -85.9 21.3 -79.95 -1.1 -91.15 -1.1 -85.95 -1.1 -85.9 -1.1 -75.6 -1.1 -60.0 21.25 -48.65 M21.3 -64.55 L20.3 -64.85 -1.1 -75.55 21.3 -49.4 M-1.1 -54.85 L-1.1 -54.8 21.3 -43.8 M21.3 -43.05 L10.55 -42.5 21.3 -31.15 M-1.1 -85.95 L-1.05 -85.9 M-1.1 -75.6 L-1.1 -75.55 M-1.1 -60.0 L-1.1 -54.85 -1.1 -41.85 10.55 -42.5 -1.1 -54.8 M-1.1 -41.85 L-1.1 -36.65 M21.3 -30.65 L-1.1 -41.85" fill="none" stroke="#999999" stroke-linecap="round" stroke-linejoin="round" stroke-width="0.05"/>
    <path d="M-23.7 -38.55 L-23.7 -51.8 -23.65 -51.85 Q-12.7 -55.7 -2.25 -62.6 L-2.25 -59.0 Q-2.55 -55.95 -2.25 -53.05 L-2.25 -49.2 Q-12.85 -45.2 -23.7 -38.55" fill="#b8562f" fill-opacity="0.8" fill-rule="evenodd" stroke="none"/>
    <path d="M-23.65 -51.85 Q-12.95 -57.2 -2.25 -62.6 M-2.25 -49.2 L-23.7 -38.55 M-23.7 -64.85 L-2.25 -63.05 M-2.25 -76.3 L-23.7 -65.6 M-23.7 -82.6 L-2.25 -93.3 M-23.7 -66.5 L-2.25 -92.8 M-23.7 -89.4 L-2.25 -100.1" fill="none" stroke="#6f6f6f" stroke-linecap="round" stroke-linejoin="round" stroke-width="0.05"/>
  </g>
</svg>
