<?xml version="1.0" encoding="UTF-8" standalone="no"?>
<svg xmlns:xlink="http://www.w3.org/1999/xlink" height="15.25px" width="20.45px" xmlns="http://www.w3.org/2000/svg">
  <g transform="matrix(1.0, 0.0, 0.0, 1.0, 10.25, 7.65)">
    <path d="M-10.25 4.75 L-10.25 -0.3 -2.65 2.55 -2.65 7.6 -10.25 4.75" fill="#333333" fill-rule="evenodd" stroke="none"/>
    <path d="M-6.9 -7.4 L-7.95 1.25 -10.15 1.0 -9.1 -7.65 -6.9 -7.4" fill="#333333" fill-rule="evenodd" stroke="none"/>
    <path d="M10.15 -3.3 L10.1 7.45 -4.2 7.4 -4.15 -3.35 10.15 -3.3" fill="#333333" fill-rule="evenodd" stroke="none"/>
    <path d="M10.2 -3.35 L10.15 1.55 -4.15 1.5 -4.1 -3.4 10.2 -3.35" fill="#555555" fill-rule="evenodd" stroke="none"/>
  </g>
</svg>
