<?xml version="1.0" encoding="UTF-8" standalone="no"?>
<svg xmlns:xlink="http://www.w3.org/1999/xlink" height="26.95px" width="30.7px" xmlns="http://www.w3.org/2000/svg">
  <g transform="matrix(1.0, 0.0, 0.0, 1.0, 15.4, 15.0)">
    <path d="M9.0 -7.4 L8.45 -8.1 Q8.45 -8.5 9.15 -8.5 9.85 -8.5 10.2 -8.0 L10.45 -7.3 10.3 -6.95 9.9 -6.75 9.0 -7.4 M14.0 -1.4 Q14.0 -2.15 14.65 -2.1 15.3 -2.1 15.3 -1.45 15.3 -0.65 14.7 -0.65 14.0 -0.65 14.0 -1.4 M14.0 -3.95 Q13.2 -3.95 13.2 -4.6 13.2 -5.3 14.1 -5.3 14.75 -5.3 14.75 -4.6 14.75 -3.95 14.0 -3.95 M-1.95 -13.95 Q-2.45 -13.95 -2.45 -14.35 -2.45 -14.95 -1.65 -15.0 -0.85 -15.05 -0.85 -14.5 -0.85 -13.95 -1.95 -13.95 M-9.85 11.95 Q-10.3 11.95 -10.3 11.45 -10.3 11.05 -9.85 11.05 -9.4 11.05 -9.4 11.45 -9.4 11.95 -9.85 11.95 M-14.65 2.45 L-14.95 2.6 -15.3 2.4 -15.4 2.15 Q-15.4 1.7 -14.95 1.7 -14.5 1.7 -14.5 2.15 L-14.65 2.45" fill="#ffffff" fill-rule="evenodd" stroke="none"/>
  </g>
</svg>
