<?xml version="1.0" encoding="UTF-8" standalone="no"?>
<svg xmlns:xlink="http://www.w3.org/1999/xlink" height="12.6px" width="12.6px" xmlns="http://www.w3.org/2000/svg">
  <g transform="matrix(1.0, 0.0, 0.0, 1.0, 6.3, 6.3)">
    <path d="M4.45 -4.45 Q6.3 -2.6 6.3 0.0 6.3 2.6 4.45 4.45 2.6 6.3 0.0 6.3 -2.6 6.3 -4.45 4.45 -6.3 2.6 -6.3 0.0 -6.3 -2.6 -4.45 -4.45 -2.6 -6.3 0.0 -6.3 2.6 -6.3 4.45 -4.45 M2.85 3.75 Q4.45 2.2 4.45 0.05 4.45 -2.1 2.85 -3.65 1.3 -5.25 -0.85 -5.25 -3.0 -5.25 -4.55 -3.65 -6.15 -2.1 -6.15 0.05 -6.15 2.2 -4.55 3.75 -3.0 5.35 -0.85 5.35 1.3 5.35 2.85 3.75" fill="#ffffff" fill-rule="evenodd" stroke="none"/>
  </g>
</svg>
