<?xml version="1.0" encoding="UTF-8" standalone="no"?>
<svg xmlns:xlink="http://www.w3.org/1999/xlink" height="30.4px" width="38.85px" xmlns="http://www.w3.org/2000/svg">
  <g transform="matrix(1.0, 0.0, 0.0, 1.0, 11.85, 14.45)">
    <path d="M27.0 -1.2 Q27.0 9.2 22.95 12.65 19.35 15.7 8.4 15.95 L3.05 15.95 Q-11.85 14.7 -11.85 2.45 -11.85 -3.65 -8.65 -6.55 -5.3 -9.6 7.15 -14.45 18.0 -14.25 23.3 -9.0 27.0 -5.35 27.0 -1.2" fill="#00ff00" fill-rule="evenodd" stroke="none"/>
  </g>
</svg>
