<?xml version="1.0" encoding="UTF-8" standalone="no"?>
<svg xmlns:xlink="http://www.w3.org/1999/xlink" height="129.2px" width="127.4px" xmlns="http://www.w3.org/2000/svg">
  <g transform="matrix(1.0, 0.0, 0.0, 1.0, 68.85, 73.9)">
    <path d="M5.7 -49.7 L8.15 -58.65 7.75 -49.45 Q23.5 -47.2 35.3 -35.4 L39.15 -31.15 52.85 -40.85 40.15 -29.9 41.4 -28.2 45.7 -29.8 42.5 -26.55 Q46.75 -19.9 48.3 -13.05 L53.6 -12.45 49.15 -9.45 Q49.9 -5.85 50.0 -1.9 L58.55 -0.1 49.85 2.2 Q49.7 17.8 39.6 30.55 L51.95 42.0 38.3 32.1 37.9 32.6 55.35 50.65 34.6 36.15 Q30.95 39.6 26.55 42.45 L34.25 55.3 24.9 43.5 Q13.8 50.0 0.0 50.0 -13.7 50.0 -24.75 43.6 L-27.95 47.25 -26.4 42.55 Q-30.65 39.85 -34.5 36.2 L-48.2 47.95 -36.65 34.0 Q-45.15 24.9 -48.25 13.6 L-48.35 13.15 -51.25 13.25 -56.05 13.3 -49.15 9.95 -49.3 9.0 Q-49.9 5.6 -49.95 2.35 L-68.85 0.5 -50.0 -1.15 Q-49.9 -12.05 -45.2 -21.7 L-49.05 -24.55 -44.3 -23.45 Q-40.9 -29.85 -35.4 -35.4 L-29.6 -40.7 -33.25 -49.1 -25.8 -43.15 Q-16.5 -49.0 -5.75 -49.85 L-3.55 -73.9 -0.2 -49.95 0.0 -50.0 5.7 -49.7" fill="#ff0000" fill-rule="evenodd" stroke="none"/>
  </g>
</svg>
