<?xml version="1.0" encoding="UTF-8" standalone="no"?>
<svg xmlns:xlink="http://www.w3.org/1999/xlink" height="19.6px" width="34.7px" xmlns="http://www.w3.org/2000/svg">
  <g transform="matrix(1.0, 0.0, 0.0, 1.0, 19.35, 20.75)">
    <path d="M1.65 -19.2 L0.9 -18.75 Q0.55 -18.75 0.3 -19.1 L0.1 -19.55 Q0.1 -20.75 0.95 -20.75 1.8 -20.75 1.8 -19.75 L1.65 -19.2 M7.8 -7.3 Q7.8 -7.85 8.4 -7.85 8.95 -7.85 8.95 -7.35 8.95 -6.8 8.35 -6.8 8.05 -6.8 7.9 -7.05 L7.8 -7.3 M2.1 -11.5 L1.95 -11.2 1.6 -11.0 Q1.05 -11.0 1.1 -11.5 1.1 -11.9 1.6 -11.95 2.1 -12.05 2.1 -11.5 M3.05 -6.95 L3.5 -6.5 Q3.5 -6.05 3.05 -6.05 2.6 -6.05 2.6 -6.5 2.6 -6.95 3.05 -6.95 M15.15 -11.4 Q14.9 -11.05 14.5 -11.05 13.8 -11.05 13.8 -11.65 13.8 -12.45 14.6 -12.55 15.35 -12.65 15.35 -11.9 L15.15 -11.4 M12.75 -3.2 Q12.25 -3.2 12.25 -3.7 12.25 -4.2 12.75 -4.2 13.25 -4.2 13.25 -3.7 13.25 -3.2 12.75 -3.2 M-9.15 -14.5 L-9.1 -14.05 Q-9.1 -13.25 -9.95 -13.25 -10.8 -13.25 -10.8 -14.05 -10.8 -14.9 -9.85 -14.9 -9.3 -14.9 -9.15 -14.5 M-0.45 -17.8 Q-1.05 -17.8 -1.05 -18.45 -1.05 -19.05 -0.45 -18.95 0.1 -18.9 0.1 -18.4 L-0.1 -18.0 -0.45 -17.8 M-18.7 -1.15 Q-19.4 -1.15 -19.35 -1.7 -19.35 -2.35 -18.55 -2.45 -17.75 -2.55 -17.75 -1.75 -17.75 -1.15 -18.7 -1.15 M-7.05 -7.0 Q-7.5 -7.0 -7.5 -7.35 -7.5 -7.75 -7.1 -7.75 -6.7 -7.75 -6.7 -7.35 -6.7 -7.0 -7.05 -7.0 M-9.95 -2.4 Q-10.3 -2.4 -10.25 -2.7 L-9.95 -3.0 Q-9.65 -3.05 -9.65 -2.7 -9.65 -2.4 -9.95 -2.4 M-2.6 -11.9 Q-2.95 -11.9 -2.95 -12.25 L-2.55 -12.6 Q-2.2 -12.55 -2.2 -12.2 -2.2 -11.9 -2.6 -11.9" fill="#ffffff" fill-rule="evenodd" stroke="none"/>
  </g>
</svg>
