<?xml version="1.0" encoding="UTF-8" standalone="no"?>
<svg xmlns:xlink="http://www.w3.org/1999/xlink" height="14.45px" width="11.75px" xmlns="http://www.w3.org/2000/svg">
  <g transform="matrix(1.0, 0.0, 0.0, 1.0, -2.45, -0.65)">
    <path d="M7.5 11.25 L2.45 11.25 2.45 4.55 7.5 4.55 7.5 0.65 14.2 7.9 7.5 15.1 7.5 11.25" fill="#ffffff" fill-rule="evenodd" stroke="none"/>
  </g>
</svg>
