<?xml version="1.0" encoding="UTF-8" standalone="no"?>
<svg xmlns:xlink="http://www.w3.org/1999/xlink" height="9.8px" width="3.9px" xmlns="http://www.w3.org/2000/svg">
  <g transform="matrix(1.0, 0.0, 0.0, 1.0, 6.2, 4.35)">
    <path d="M-4.6 -2.9 Q-3.75 -5.2 -2.3 -3.9 L-3.05 1.8 Q-3.55 5.45 -5.55 5.45 -6.3 5.45 -6.2 5.25 L-5.25 0.9 Q-5.25 -1.15 -4.6 -2.9" fill="#ffffff" fill-rule="evenodd" stroke="none"/>
  </g>
</svg>
