<?xml version="1.0" encoding="UTF-8" standalone="no"?>
<svg xmlns:xlink="http://www.w3.org/1999/xlink" height="44.95px" width="56.4px" xmlns="http://www.w3.org/2000/svg">
  <g transform="matrix(1.0, 0.0, 0.0, 1.0, 27.4, 25.75)">
    <path d="M9.35 -4.85 L9.6 -4.4 11.3 -5.2 11.35 -6.4 Q10.55 -12.75 3.45 -11.7 L2.95 -10.8 1.9 -11.25 2.05 -12.6 -7.1 -9.0 -7.5 -9.7 Q-8.7 -9.2 -9.6 -8.4 -16.3 -2.7 -9.95 1.45 L-9.55 2.95 -10.8 3.5 -11.0 4.1 Q-11.4 5.65 -10.05 6.75 -9.0 7.7 -7.8 6.9 L-4.3 9.25 -4.95 9.05 Q-4.85 10.7 -3.75 11.4 3.1 15.3 3.95 8.15 L3.4 8.4 8.9 4.55 9.45 5.1 12.9 0.95 11.5 0.9 9.35 -4.85 M1.85 -14.95 Q8.35 -14.45 12.5 -9.35 L29.0 -7.9 14.0 2.3 18.25 19.2 5.4 13.35 4.05 13.7 1.55 14.0 0.05 14.3 Q-4.5 14.65 -8.15 11.9 -9.4 10.95 -10.75 10.35 -18.8 7.4 -27.4 5.4 L-13.45 -6.7 -17.6 -25.75 -2.6 -14.7 1.85 -14.95" fill="#ffff00" fill-rule="evenodd" stroke="none"/>
    <path d="M9.35 -4.85 L11.5 0.9 12.9 0.95 9.45 5.1 8.9 4.55 3.4 8.4 3.95 8.15 Q3.1 15.3 -3.75 11.4 -4.85 10.7 -4.95 9.05 L-4.3 9.25 -7.8 6.9 Q-9.0 7.7 -10.05 6.75 -11.4 5.65 -11.0 4.1 L-10.8 3.5 -9.55 2.95 -9.95 1.45 Q-16.3 -2.7 -9.6 -8.4 -8.7 -9.2 -7.5 -9.7 L-7.1 -9.0 2.05 -12.6 1.9 -11.25 2.95 -10.8 3.45 -11.7 Q10.55 -12.75 11.35 -6.4 L11.3 -5.2 9.6 -4.4 9.35 -4.85" fill="#ffffff" fill-rule="evenodd" stroke="none"/>
  </g>
</svg>
