<?xml version="1.0" encoding="UTF-8" standalone="no"?>
<svg xmlns:xlink="http://www.w3.org/1999/xlink" height="23.8px" width="26.75px" xmlns="http://www.w3.org/2000/svg">
  <g transform="matrix(1.0, 0.0, 0.0, 1.0, 13.35, 11.9)">
    <path d="M12.6 -1.15 L12.6 -1.2 Q13.4 -0.2 13.4 1.3 13.4 2.75 12.6 3.8 11.7 4.9 10.45 4.85 L10.35 4.85 Q9.5 7.05 7.7 8.9 L7.55 9.0 Q4.0 11.7 -1.05 11.7 -6.1 11.7 -9.75 9.0 L-9.85 8.9 Q-13.35 5.35 -13.35 0.3 -13.35 -4.7 -9.75 -8.3 -6.1 -11.9 -1.05 -11.9 4.0 -11.9 7.55 -8.3 10.25 -5.7 10.9 -2.25 11.85 -2.1 12.6 -1.15" fill="#370d0d" fill-rule="evenodd" stroke="none"/>
    <path d="M12.0 -0.8 Q12.65 -0.05 12.65 1.15 12.65 2.3 12.0 3.1 11.35 3.9 10.5 3.9 9.65 3.9 8.95 3.1 8.35 2.3 8.35 1.15 8.35 -0.05 8.95 -0.8 9.65 -1.6 10.5 -1.6 11.35 -1.6 12.0 -0.8" fill="url(#gradient0)" fill-rule="evenodd" stroke="none"/>
    <path d="M-1.0 -11.0 Q3.7 -11.0 7.05 -7.65 10.4 -4.3 10.4 0.4 10.4 5.2 7.05 8.55 3.7 11.9 -1.0 11.9 -5.75 11.9 -9.15 8.55 -12.5 5.2 -12.5 0.4 -12.5 -4.3 -9.15 -7.65 -5.75 -11.0 -1.0 -11.0" fill="url(#gradient1)" fill-rule="evenodd" stroke="none"/>
    <path d="M7.3 -0.6 Q7.95 0.15 7.95 1.35 7.95 2.5 7.3 3.3 6.65 4.1 5.8 4.1 4.95 4.1 4.25 3.3 3.65 2.5 3.65 1.35 3.65 0.15 4.25 -0.6 4.95 -1.4 5.8 -1.4 6.65 -1.4 7.3 -0.6" fill="url(#gradient2)" fill-rule="evenodd" stroke="none"/>
  </g>
  <defs>
    <radialGradient cx="0" cy="0" gradientTransform="matrix(0.0061, 0.0, 0.0, 0.0061, 10.8, -0.3)" gradientUnits="userSpaceOnUse" id="gradient0" r="819.2" spreadMethod="pad">
      <stop offset="0.0" stop-color="#ffffff"/>
      <stop offset="1.0" stop-color="#ecc6c6"/>
    </radialGradient>
    <radialGradient cx="0" cy="0" gradientTransform="matrix(0.0211, 0.0, 0.0, 0.0211, 3.05, -3.8)" gradientUnits="userSpaceOnUse" id="gradient1" r="819.2" spreadMethod="pad">
      <stop offset="0.0" stop-color="#e9a7a7"/>
      <stop offset="0.0784313725490196" stop-color="#da6969"/>
      <stop offset="0.17647058823529413" stop-color="#b74040"/>
      <stop offset="0.47843137254901963" stop-color="#882222"/>
      <stop offset="0.8352941176470589" stop-color="#3e0f0f"/>
      <stop offset="1.0" stop-color="#38651b"/>
    </radialGradient>
    <radialGradient cx="0" cy="0" gradientTransform="matrix(0.0061, 0.0, 0.0, 0.0061, 6.1, -0.1)" gradientUnits="userSpaceOnUse" id="gradient2" r="819.2" spreadMethod="pad">
      <stop offset="0.0" stop-color="#ffffff"/>
      <stop offset="1.0" stop-color="#ecc6c6"/>
    </radialGradient>
  </defs>
</svg>
