<?xml version="1.0" encoding="UTF-8" standalone="no"?>
<svg xmlns:xlink="http://www.w3.org/1999/xlink" height="20.8px" width="10.1px" xmlns="http://www.w3.org/2000/svg">
  <g transform="matrix(1.0, 0.0, 0.0, 1.0, -7.2, 9.75)">
    <path d="M16.8 -5.0 Q17.3 -2.25 17.3 0.15 17.3 2.4 16.35 5.9 14.95 11.05 12.5 11.05 9.15 11.05 7.85 7.35 7.2 5.5 7.2 3.2 7.2 -1.2 8.85 -5.1 10.8 -9.75 13.9 -9.75 15.9 -9.75 16.8 -5.0" fill="#a30e00" fill-rule="evenodd" stroke="none"/>
  </g>
</svg>
