<?xml version="1.0" encoding="UTF-8" standalone="no"?>
<svg xmlns:xlink="http://www.w3.org/1999/xlink" height="8.05px" width="7.0px" xmlns="http://www.w3.org/2000/svg">
  <g transform="matrix(1.0, 0.0, 0.0, 1.0, 3.4, 3.65)">
    <path d="M-1.1 -1.7 L-0.5 -1.45 -0.25 -0.75 Q-0.25 -0.35 -0.5 -0.05 L-1.1 0.2 -1.7 -0.05 -1.9 -0.75 -1.7 -1.45 -1.1 -1.7" fill="#a447e2" fill-rule="evenodd" stroke="none"/>
    <path d="M2.2 -2.15 Q3.1 -1.05 3.1 0.4 3.1 1.85 2.2 2.85 1.35 3.9 0.1 3.9 -1.15 3.9 -2.05 2.85 -2.9 1.85 -2.9 0.4 -2.9 -1.05 -2.05 -2.15 -1.15 -3.15 0.1 -3.15 1.35 -3.15 2.2 -2.15 M-1.1 -1.7 L-1.7 -1.45 -1.9 -0.75 -1.7 -0.05 -1.1 0.2 -0.5 -0.05 Q-0.25 -0.35 -0.25 -0.75 L-0.5 -1.45 -1.1 -1.7" fill="#741cb0" fill-rule="evenodd" stroke="none"/>
    <path d="M2.2 -2.15 Q3.1 -1.05 3.1 0.4 3.1 1.85 2.2 2.85 1.35 3.9 0.1 3.9 -1.15 3.9 -2.05 2.85 -2.9 1.85 -2.9 0.4 -2.9 -1.05 -2.05 -2.15 -1.15 -3.15 0.1 -3.15 1.35 -3.15 2.2 -2.15 Z" fill="none" stroke="#48126d" stroke-linecap="round" stroke-linejoin="round" stroke-width="1.0"/>
  </g>
</svg>
