<?xml version="1.0" encoding="UTF-8" standalone="no"?>
<svg xmlns:xlink="http://www.w3.org/1999/xlink" height="76.25px" width="74.4px" xmlns="http://www.w3.org/2000/svg">
  <g transform="matrix(1.0, 0.0, 0.0, 1.0, 37.2, 38.15)">
    <path d="M37.2 -38.15 L37.2 38.1 -37.2 38.1 -37.2 -38.15 37.2 -38.15" fill="#00ff00" fill-rule="evenodd" stroke="none"/>
  </g>
</svg>
