<?xml version="1.0" encoding="UTF-8" standalone="no"?>
<svg xmlns:xlink="http://www.w3.org/1999/xlink" height="27.85px" width="30.25px" xmlns="http://www.w3.org/2000/svg">
  <g transform="matrix(1.0, 0.0, 0.0, 1.0, 15.1, 12.7)">
    <path d="M14.65 -0.55 Q14.65 -6.65 10.35 -10.95 L8.25 -12.7 10.7 -10.7 Q15.15 -6.25 15.15 0.05 15.15 6.3 10.7 10.7 6.3 15.15 0.0 15.15 -6.25 15.15 -10.7 10.7 -15.1 6.3 -15.1 0.05 -15.1 -6.25 -10.7 -10.7 -9.55 -11.85 -8.25 -12.65 L-10.35 -10.95 Q-14.6 -6.65 -14.6 -0.55 -14.6 5.5 -10.35 9.75 -6.05 14.05 0.0 14.05 6.1 14.05 10.35 9.75 14.65 5.5 14.65 -0.55" fill="#ffffff" fill-rule="evenodd" stroke="none"/>
  </g>
</svg>
