<?xml version="1.0" encoding="UTF-8" standalone="no"?>
<svg xmlns:xlink="http://www.w3.org/1999/xlink" height="4.15px" width="6.55px" xmlns="http://www.w3.org/2000/svg">
  <g transform="matrix(1.0, 0.0, 0.0, 1.0, -1.15, 1.0)">
    <path d="M1.65 0.45 L6.75 -0.5 7.2 1.7 2.1 2.65 1.65 0.45" fill="#ffcc00" fill-rule="evenodd" stroke="none"/>
    <path d="M1.65 0.45 L6.75 -0.5 7.2 1.7 2.1 2.65 1.65 0.45 Z" fill="none" stroke="#ba4a01" stroke-linecap="round" stroke-linejoin="round" stroke-width="1.0"/>
  </g>
</svg>
