<?xml version="1.0" encoding="UTF-8" standalone="no"?>
<svg xmlns:xlink="http://www.w3.org/1999/xlink" height="20.1px" width="37.2px" xmlns="http://www.w3.org/2000/svg">
  <g transform="matrix(1.0, 0.0, 0.0, 1.0, 20.85, 20.25)">
    <path d="M0.85 -18.5 Q0.1 -18.5 0.1 -19.3 0.1 -20.1 0.9 -20.25 1.65 -20.4 1.65 -19.45 1.65 -18.5 0.85 -18.5 M9.05 -7.45 L9.5 -7.0 Q9.5 -6.55 9.05 -6.55 8.6 -6.55 8.6 -7.0 8.6 -7.45 9.05 -7.45 M1.95 -11.45 Q1.8 -11.3 1.65 -11.3 1.2 -11.3 1.2 -11.75 1.2 -12.15 1.65 -12.15 L2.1 -11.7 1.95 -11.45 M3.3 -6.55 Q3.7 -6.55 3.7 -6.2 3.7 -5.75 3.3 -5.75 3.05 -5.75 2.95 -6.0 L2.9 -6.2 Q2.9 -6.55 3.3 -6.55 M15.65 -10.95 Q15.3 -10.95 15.15 -11.2 L15.05 -11.5 Q15.05 -12.1 15.8 -12.1 16.35 -12.1 16.35 -11.6 L16.2 -11.25 Q15.95 -10.95 15.65 -10.95 M13.3 -2.6 Q13.1 -2.6 13.0 -2.75 L12.95 -2.95 Q12.95 -3.35 13.3 -3.3 L13.65 -3.0 Q13.65 -2.6 13.3 -2.6 M-20.85 -0.65 Q-20.85 -1.15 -20.25 -1.15 L-19.9 -0.9 -19.85 -0.65 Q-19.85 -0.15 -20.35 -0.15 -20.85 -0.15 -20.85 -0.65 M-1.15 -18.7 Q-1.15 -19.1 -0.65 -19.15 -0.15 -19.25 -0.15 -18.7 L-0.3 -18.4 -0.65 -18.2 Q-1.15 -18.2 -1.15 -18.7 M-11.25 -12.85 Q-11.95 -12.85 -11.95 -13.6 -11.95 -14.25 -11.25 -14.35 -10.6 -14.5 -10.6 -13.6 -10.6 -12.85 -11.25 -12.85 M-10.75 -1.5 Q-11.15 -1.5 -11.05 -1.8 L-10.75 -2.1 Q-10.45 -2.15 -10.45 -1.8 -10.45 -1.5 -10.75 -1.5 M-8.15 -6.45 Q-8.5 -6.45 -8.5 -6.8 L-8.1 -7.15 Q-7.75 -7.15 -7.75 -6.8 -7.75 -6.45 -8.15 -6.45 M-2.85 -11.6 Q-3.2 -11.6 -3.2 -11.95 -3.2 -12.55 -2.5 -11.95 -2.5 -11.6 -2.85 -11.6" fill="#ffffff" fill-rule="evenodd" stroke="none"/>
  </g>
</svg>
