<?xml version="1.0" encoding="UTF-8" standalone="no"?>
<svg xmlns:xlink="http://www.w3.org/1999/xlink" height="60.0px" width="60.0px" xmlns="http://www.w3.org/2000/svg">
  <g transform="matrix(1.0, 0.0, 0.0, 1.0, 30.0, 30.0)">
    <path d="M21.2 -21.2 Q30.0 -12.35 30.0 0.0 30.0 12.35 21.2 21.2 12.35 30.0 0.0 30.0 -12.35 30.0 -21.2 21.2 -30.0 12.35 -30.0 0.0 -30.0 -12.35 -21.2 -21.2 -12.35 -30.0 0.0 -30.0 12.35 -30.0 21.2 -21.2" fill="#ffffff" fill-opacity="0.4" fill-rule="evenodd" stroke="none"/>
    <path d="M15.5 -15.5 Q22.0 -9.1 22.0 0.0 22.0 9.1 15.5 15.5 9.1 22.0 0.0 22.0 -9.1 22.0 -15.5 15.5 -22.0 9.1 -22.0 0.0 -22.0 -9.1 -15.5 -15.5 -9.1 -22.0 0.0 -22.0 9.1 -22.0 15.5 -15.5" fill="#ffffff" fill-rule="evenodd" stroke="none"/>
  </g>
</svg>
