<?xml version="1.0" encoding="UTF-8" standalone="no"?>
<svg xmlns:xlink="http://www.w3.org/1999/xlink" height="4.0px" width="2.0px" xmlns="http://www.w3.org/2000/svg">
  <g transform="matrix(1.0, 0.0, 0.0, 1.0, 0.0, 0.0)">
    <path d="M2.0 0.0 L2.0 4.0 0.0 4.0 0.0 0.0 2.0 0.0" fill="#e3b602" fill-rule="evenodd" stroke="none"/>
    <path d="M0.0 2.65 L2.0 2.65 2.0 4.0 0.0 4.0 0.0 2.65" fill="#a08001" fill-rule="evenodd" stroke="none"/>
  </g>
</svg>
