<?xml version="1.0" encoding="UTF-8" standalone="no"?>
<svg xmlns:xlink="http://www.w3.org/1999/xlink" height="20.15px" width="38.8px" xmlns="http://www.w3.org/2000/svg">
  <g transform="matrix(1.0, 0.0, 0.0, 1.0, 21.55, 19.55)">
    <path d="M1.6 -18.8 Q1.6 -18.0 0.85 -18.0 0.2 -18.0 0.2 -18.7 L0.25 -19.2 Q0.35 -19.55 0.9 -19.55 1.65 -19.55 1.6 -18.8 M9.7 -6.5 L9.65 -6.3 9.4 -6.25 Q9.05 -6.25 9.05 -6.55 L9.45 -6.8 9.7 -6.5 M16.25 -11.25 Q16.25 -11.75 16.75 -11.75 17.25 -11.75 17.25 -11.25 17.25 -10.75 16.75 -10.75 16.45 -10.75 16.35 -11.0 L16.25 -11.25 M13.7 -2.75 Q14.0 -2.7 14.0 -2.5 L13.75 -2.25 Q13.4 -2.25 13.4 -2.5 L13.7 -2.75 M-0.75 -18.35 Q-1.15 -18.35 -1.15 -18.75 -1.15 -19.1 -0.75 -19.1 L-0.35 -18.75 Q-0.35 -18.35 -0.75 -18.35 M-11.7 -13.5 L-11.6 -13.2 Q-11.6 -12.5 -12.25 -12.5 -12.7 -12.5 -12.8 -13.1 L-12.6 -13.5 -12.05 -13.75 -11.7 -13.5 M-2.85 -11.05 Q-3.25 -11.05 -3.25 -11.4 L-2.9 -11.75 Q-2.55 -11.7 -2.55 -11.4 -2.55 -11.05 -2.85 -11.05 M-20.7 0.2 L-20.9 0.5 -21.1 0.6 -21.55 0.15 -21.05 -0.15 Q-20.85 -0.15 -20.75 0.05 L-20.7 0.2" fill="#ffffff" fill-rule="evenodd" stroke="none"/>
  </g>
</svg>
