<?xml version="1.0" encoding="UTF-8" standalone="no"?>
<svg xmlns:xlink="http://www.w3.org/1999/xlink" height="6.75px" width="9.85px" xmlns="http://www.w3.org/2000/svg">
  <g transform="matrix(1.0, 0.0, 0.0, 1.0, 0.3, 3.3)">
    <path d="M4.6 -3.3 L8.0 -3.3 9.55 -1.6 9.55 -1.35 7.05 -1.35 7.05 1.0 9.55 1.0 9.55 1.65 7.75 3.45 5.0 3.45 3.0 1.45 -0.3 1.45 -0.3 -1.45 2.95 -1.45 4.6 -3.3" fill="#ffffff" fill-rule="evenodd" stroke="none"/>
  </g>
</svg>
