<?xml version="1.0" encoding="UTF-8" standalone="no"?>
<svg xmlns:xlink="http://www.w3.org/1999/xlink" height="18.25px" width="9.0px" xmlns="http://www.w3.org/2000/svg">
  <g transform="matrix(1.0, 0.0, 0.0, 1.0, 16.7, 18.05)">
    <path d="M-9.7 -18.05 L-7.7 -7.8 -14.95 0.2 -16.7 -9.8 -9.7 -18.05" fill="#d2e1f0" fill-rule="evenodd" stroke="none"/>
  </g>
</svg>
