<?xml version="1.0" encoding="UTF-8" standalone="no"?>
<svg xmlns:xlink="http://www.w3.org/1999/xlink" height="16.8px" width="16.8px" xmlns="http://www.w3.org/2000/svg">
  <g transform="matrix(1.0, 0.0, 0.0, 1.0, 8.4, 8.4)">
    <path d="M5.95 -5.95 Q8.4 -3.5 8.4 0.0 8.4 3.5 5.95 5.95 3.5 8.4 0.0 8.4 -3.5 8.4 -5.95 5.95 -8.4 3.5 -8.4 0.0 -8.4 -3.5 -5.95 -5.95 -3.5 -8.4 0.0 -8.4 3.5 -8.4 5.95 -5.95" fill="#444444" fill-rule="evenodd" stroke="none"/>
  </g>
</svg>
