<?xml version="1.0" encoding="UTF-8" standalone="no"?>
<svg xmlns:xlink="http://www.w3.org/1999/xlink" height="13.5px" width="12.55px" xmlns="http://www.w3.org/2000/svg">
  <g transform="matrix(1.0, 0.0, 0.0, 1.0, -22.8, 14.3)">
    <path d="M26.2 -8.3 L23.1 -14.0 28.55 -10.45 35.35 -13.85 31.3 -7.75 34.65 -0.8 28.9 -5.35 23.05 -2.5 26.2 -8.3" fill="#ffffff" fill-rule="evenodd" stroke="none"/>
    <path d="M27.4 -9.6 L28.95 -14.3 29.7 -9.35 34.7 -7.3 29.55 -6.45 27.45 -1.05 27.1 -6.6 22.8 -8.45 27.4 -9.6" fill="#ffffff" fill-rule="evenodd" stroke="none"/>
  </g>
</svg>
