<?xml version="1.0" encoding="UTF-8" standalone="no"?>
<svg xmlns:xlink="http://www.w3.org/1999/xlink" height="3.25px" width="3.7px" xmlns="http://www.w3.org/2000/svg">
  <g transform="matrix(1.0, 0.0, 0.0, 1.0, 8.1, 22.75)">
    <path d="M-4.8 -20.1 Q-5.35 -19.5 -6.3 -19.5 -8.2 -19.5 -8.1 -21.15 -8.1 -22.75 -6.25 -22.75 -4.4 -22.75 -4.4 -21.15 -4.4 -20.55 -4.8 -20.1" fill="#ff0000" fill-rule="evenodd" stroke="none"/>
  </g>
</svg>
