<?xml version="1.0" encoding="UTF-8" standalone="no"?>
<svg xmlns:xlink="http://www.w3.org/1999/xlink" height="57.85px" width="38.05px" xmlns="http://www.w3.org/2000/svg">
  <g transform="matrix(1.0, 0.0, 0.0, 1.0, 16.8, 30.55)">
    <use height="29.4" id="_p1" transform="matrix(1.0, 0.0, 0.0, 1.0, -7.95, -16.2)" width="14.65" xlink:href="#sprite0"/>
  </g>
  <defs/>
</svg>
