<?xml version="1.0" encoding="UTF-8" standalone="no"?>
<svg xmlns:xlink="http://www.w3.org/1999/xlink" height="19.65px" width="19.65px" xmlns="http://www.w3.org/2000/svg">
  <g transform="matrix(1.0, 0.0, 0.0, 1.0, 8.7, 9.45)">
    <use height="12.4" transform="matrix(1.0, 0.0, 0.0, 1.0, -7.85, -6.1)" width="14.2" xlink:href="#shape0"/>
  </g>
  <defs>
    <g id="shape0" transform="matrix(1.0, 0.0, 0.0, 1.0, 7.85, 6.1)">
      <path d="M3.15 -4.3 L3.15 -4.2 3.4 -4.05 5.2 -1.9 4.9 -2.0 4.4 -1.9 4.35 -1.9 3.5 -1.6 3.4 -1.7 3.0 -2.75 2.2 -4.1 Q1.9 -4.35 1.75 -4.1 1.4 -3.65 1.65 -2.65 L1.1 -2.6 -0.3 -2.25 -0.55 -2.1 -0.5 -1.55 -0.5 -1.1 -0.65 -1.2 -0.7 -1.25 -0.9 -1.35 -1.25 -1.45 -1.65 -1.45 Q-2.2 -1.35 -2.55 -0.85 -3.3 0.2 -2.55 0.8 L-2.0 1.1 -2.0 1.35 -2.1 1.95 -2.15 2.1 Q-2.65 2.85 -2.0 4.15 L-0.6 6.25 -1.7 6.0 Q-3.25 5.55 -3.85 4.3 L-4.45 2.7 -7.55 0.45 -7.85 0.15 -6.5 0.7 -5.45 0.9 Q-5.95 0.3 -5.55 -1.1 L-4.8 -3.0 -4.75 -3.05 -4.2 -0.95 -4.2 -0.9 -4.1 -0.85 -4.1 -1.65 -3.9 -2.1 -3.6 -2.7 Q-2.65 -4.0 -0.9 -4.75 L0.75 -5.1 Q2.05 -5.1 3.15 -4.3" fill="#e1a495" fill-rule="evenodd" stroke="none"/>
      <path d="M3.4 -4.05 L3.15 -4.2 3.15 -4.3 3.25 -4.2 3.4 -4.05 M-0.6 6.25 L-2.0 4.15 Q-2.65 2.85 -2.15 2.1 L-2.1 1.95 -2.0 1.35 -2.0 1.1 -1.0 1.15 Q-0.45 0.95 -0.2 0.65 L0.0 -0.1 -0.15 -0.65 -0.5 -1.1 -0.5 -1.55 -0.55 -2.1 -0.3 -2.25 1.1 -2.6 1.65 -2.65 1.75 -2.35 2.1 -1.75 2.65 -0.75 2.85 -0.55 3.35 -0.35 4.0 -0.45 4.85 -0.7 5.65 -1.05 5.8 -0.75 Q6.65 1.3 6.15 2.0 L6.0 2.4 5.4 3.1 4.5 3.8 1.05 6.1 -0.6 6.25" fill="#fcc4b6" fill-rule="evenodd" stroke="none"/>
      <path d="M3.15 -4.3 Q2.05 -5.1 0.75 -5.1 L0.9 -5.75 1.4 -6.05 2.2 -5.85 Q3.45 -4.8 3.15 -4.3 M-2.0 1.1 L-2.55 0.8 Q-3.3 0.2 -2.55 -0.85 -2.2 -1.35 -1.65 -1.45 L-1.25 -1.45 -0.9 -1.35 -0.7 -1.25 -0.65 -1.2 -0.5 -1.1 -0.15 -0.65 0.0 -0.1 -0.2 0.65 Q-0.45 0.95 -1.0 1.15 L-2.0 1.1 M-1.35 -1.05 L-1.6 -1.0 -1.6 -0.75 -1.55 -0.65 Q-1.3 -0.45 -1.15 -0.65 L-1.35 -1.05 M-0.95 0.95 Q-0.6 0.5 -1.1 0.15 -1.7 -0.05 -1.95 0.3 -2.2 0.65 -1.9 0.9 L-0.95 0.95" fill="#660000" fill-rule="evenodd" stroke="none"/>
      <path d="M-1.35 -1.05 L-1.15 -0.65 Q-1.3 -0.45 -1.55 -0.65 L-1.6 -0.75 -1.6 -1.0 -1.35 -1.05 M-0.95 0.95 L-1.9 0.9 Q-2.2 0.65 -1.95 0.3 -1.7 -0.05 -1.1 0.15 -0.6 0.5 -0.95 0.95" fill="#ffffff" fill-rule="evenodd" stroke="none"/>
      <path d="M1.65 -2.65 Q1.4 -3.65 1.75 -4.1 1.9 -4.35 2.2 -4.1 L3.0 -2.75 3.4 -1.7 3.05 -1.25 Q2.9 -1.05 3.25 -0.85 3.65 -0.65 5.0 -1.15 L5.75 -1.5 5.8 -1.5 5.8 -1.2 5.65 -1.05 4.85 -0.7 4.0 -0.45 3.35 -0.35 2.85 -0.55 2.65 -0.75 2.1 -1.75 1.75 -2.35 1.65 -2.65" fill="#ffcc00" fill-rule="evenodd" stroke="none"/>
      <path d="M3.4 -1.7 L3.5 -1.6 4.35 -1.9 4.4 -1.9 4.9 -2.0 5.2 -1.9 5.6 -1.75 5.75 -1.5 5.0 -1.15 Q3.65 -0.65 3.25 -0.85 2.9 -1.05 3.05 -1.25 L3.4 -1.7" fill="#e4a512" fill-rule="evenodd" stroke="none"/>
      <path d="M-2.0 1.1 L-2.55 0.8 Q-3.3 0.2 -2.55 -0.85 -2.2 -1.35 -1.65 -1.45 L-1.25 -1.45 -0.9 -1.35 -0.7 -1.25 -0.65 -1.2 -0.5 -1.1 -0.15 -0.65 0.0 -0.1 -0.2 0.65 Q-0.45 0.95 -1.0 1.15 L-2.0 1.1 Z" fill="none" stroke="#000000" stroke-linecap="round" stroke-linejoin="round" stroke-opacity="0.4" stroke-width="0.05"/>
    </g>
  </defs>
</svg>
