<?xml version="1.0" encoding="UTF-8" standalone="no"?>
<svg xmlns:xlink="http://www.w3.org/1999/xlink" height="255.7px" width="286.65px" xmlns="http://www.w3.org/2000/svg">
  <g transform="matrix(1.0, 0.0, 0.0, 1.0, 170.7, 7.75)">
    <use height="163.4" transform="matrix(0.9897, 0.0, 0.0, 0.9897, 32.0407, -6.1605)" width="66.2" xlink:href="#sprite0"/>
    <use height="57.85" transform="matrix(0.8826, 0.4409, -0.4409, 0.8826, 19.145, 78.2888)" width="38.05" xlink:href="#sprite4"/>
    <use height="146.8" transform="matrix(-0.9615, -0.231, -0.231, 0.9615, 51.8644, 106.5651)" width="196.05" xlink:href="#sprite8"/>
    <use height="30.4" transform="matrix(0.7043, 0.689, -0.689, 0.7043, 31.5284, 78.1847)" width="20.05" xlink:href="#sprite12"/>
    <use height="33.0" transform="matrix(0.6459, 0.5018, -0.5018, 0.6459, 29.5188, 63.1536)" width="33.0" xlink:href="#sprite17"/>
    <use height="43.7" transform="matrix(-0.92, 0.0, 0.0, 0.92, 37.7442, 157.9718)" width="43.4" xlink:href="#sprite23"/>
    <use height="49.55" transform="matrix(0.9659, -0.1839, 0.1839, 0.9659, 0.4493, 136.529)" width="36.6" xlink:href="#sprite29"/>
    <use height="43.45" transform="matrix(0.9833, 0.0181, -0.0181, 0.9833, 4.4735, 114.0937)" width="25.5" xlink:href="#sprite34"/>
    <use height="45.1" transform="matrix(0.9175, -0.0642, 0.0642, 0.9175, 31.1348, 176.417)" width="31.0" xlink:href="#sprite40"/>
    <use height="50.85" transform="matrix(0.9313, -0.317, 0.317, 0.9313, 18.7689, 150.5341)" width="32.25" xlink:href="#sprite46"/>
    <use height="29.15" transform="matrix(0.9264, 0.0, 0.0, 0.8454, 13.9476, 107.6488)" width="30.4" xlink:href="#sprite50"/>
    <use height="46.15" transform="matrix(0.9803, -0.0945, 0.0945, 0.9803, 20.7974, 125.5363)" width="27.4" xlink:href="#sprite55"/>
    <use height="53.3" transform="matrix(0.7354, 0.0419, -0.1595, 0.9753, 9.2426, 98.3815)" width="65.0" xlink:href="#sprite59"/>
    <use height="47.7" transform="matrix(0.9294, 0.0, -0.0998, 0.8418, 15.8071, 75.4197)" width="62.75" xlink:href="#sprite65"/>
    <use height="113.0" transform="matrix(0.9897, 0.0, 0.0, 0.9897, -6.9419, -4.5373)" width="124.15" xlink:href="#sprite73"/>
    <use height="22.75" transform="matrix(0.9831, -0.0861, 0.0861, 0.9831, 22.0787, 106.543)" width="24.65" xlink:href="#sprite86"/>
    <use height="30.4" transform="matrix(0.9599, -0.2309, 0.2309, 0.9599, 41.9702, 83.4465)" width="20.05" xlink:href="#sprite89"/>
    <use height="57.85" transform="matrix(0.5112, 0.8407, -0.8407, 0.5112, 67.5983, 80.757)" width="42.4" xlink:href="#sprite93"/>
    <use height="37.15" transform="matrix(0.7955, -0.2104, 0.2104, 0.7955, 35.5271, 78.0305)" width="34.95" xlink:href="#sprite98"/>
  </g>
  <defs>
    <g id="sprite0" transform="matrix(1.0, 0.0, 0.0, 1.0, 28.35, 96.5)">
      <use height="163.4" id="_p3" transform="matrix(1.0, 0.0, 0.0, 1.0, -28.35, -96.5)" width="66.2" xlink:href="#sprite1"/>
    </g>
    <g id="sprite1" transform="matrix(1.0, 0.0, 0.0, 1.0, 107.05, 103.4)">
      <use height="90.15" id="_col1a" transform="matrix(1.0, 0.0, 0.0, 1.0, -93.35, -89.7)" width="52.5" xlink:href="#sprite2"/>
      <use height="27.4" id="_col3" transform="matrix(1.0, 0.0, 0.0, 1.0, -90.6, -85.15)" width="27.4" xlink:href="#sprite3"/>
      <use height="8.3" transform="matrix(1.0, 0.0, 0.0, 1.0, -87.4, -81.85)" width="7.2" xlink:href="#shape2"/>
    </g>
    <g id="sprite2" transform="matrix(1.0, 0.0, 0.0, 1.0, 26.25, 45.1)">
      <use height="90.15" transform="matrix(1.0, 0.0, 0.0, 1.0, -26.25, -45.1)" width="52.5" xlink:href="#shape0"/>
    </g>
    <g id="shape0" transform="matrix(1.0, 0.0, 0.0, 1.0, 26.25, 45.1)">
      <path d="M9.15 -42.55 L9.35 -42.45 9.95 -42.2 13.8 -40.3 14.5 -39.75 Q16.25 -38.2 17.8 -36.25 20.8 -32.8 22.85 -28.6 25.5 -22.8 26.0 -16.55 26.35 -13.55 26.2 -10.4 25.65 -6.95 24.6 -3.45 23.4 0.6 21.65 5.1 19.2 10.9 16.95 17.2 15.35 21.2 14.65 25.75 13.8 29.6 14.5 33.6 15.0 36.75 17.3 39.55 19.55 41.65 22.55 43.55 L24.45 43.2 20.6 44.4 12.75 44.75 Q9.1 44.05 5.4 42.0 L1.75 39.35 -2.1 35.35 -2.45 35.0 -2.8 34.45 -5.05 30.6 Q-6.3 27.5 -7.0 23.8 -8.2 16.5 -8.2 6.5 -8.2 -3.6 -11.7 -9.35 -15.2 -15.3 -20.8 -17.4 -22.7 -18.3 -23.95 -19.35 -25.5 -20.9 -26.05 -23.35 L-20.95 -23.0 Q-14.5 -22.8 -8.55 -21.05 -7.0 -20.55 -5.6 -19.85 L-5.4 -19.85 -5.05 -20.2 -4.7 -20.35 Q-2.3 -18.8 -1.05 -15.3 -0.7 -13.55 0.15 -12.15 L0.5 -11.3 0.5 -8.15 Q1.2 -17.25 -2.8 -25.95 2.25 -25.45 6.1 -20.7 8.9 -17.05 11.0 -13.2 12.05 -19.5 11.85 -25.8 11.7 -33.8 8.9 -41.15 8.55 -42.05 8.55 -42.75 L9.15 -42.55" fill="#d6baba" fill-rule="evenodd" stroke="none"/>
      <path d="M-26.05 -23.35 Q-26.4 -24.75 -26.2 -26.3 -26.05 -33.1 -23.75 -34.7 -18.35 -40.65 -9.6 -43.8 -3.85 -45.7 1.4 -44.85 5.35 -44.2 9.15 -42.55 L8.55 -42.75 Q8.55 -42.05 8.9 -41.15 11.7 -33.8 11.85 -25.8 12.05 -19.5 11.0 -13.2 8.9 -17.05 6.1 -20.7 2.25 -25.45 -2.8 -25.95 1.2 -17.25 0.5 -8.15 L0.5 -11.3 0.15 -12.15 Q-0.7 -13.55 -1.05 -15.3 -2.3 -18.8 -4.7 -20.35 L-5.05 -20.2 -5.4 -19.85 -5.6 -19.85 Q-7.0 -20.55 -8.55 -21.05 -14.5 -22.8 -20.95 -23.0 L-26.05 -23.35" fill="#ffffff" fill-rule="evenodd" stroke="none"/>
      <path d="M9.15 -42.55 L9.35 -42.45 9.95 -42.2 13.8 -40.3 14.5 -39.75 Q16.25 -38.2 17.8 -36.25 20.8 -32.8 22.85 -28.6 25.5 -22.8 26.0 -16.55 26.35 -13.55 26.2 -10.4 25.65 -6.95 24.6 -3.45 23.4 0.6 21.65 5.1 19.2 10.9 16.95 17.2 15.35 21.2 14.65 25.75 13.8 29.6 14.5 33.6 15.0 36.75 17.3 39.55 19.55 41.65 22.55 43.55 L24.45 43.2 20.6 44.4 12.75 44.75 Q9.1 44.05 5.4 42.0 L1.75 39.35 -2.1 35.35 -2.45 35.0 -2.8 34.45 -5.05 30.6 Q-6.3 27.5 -7.0 23.8 -8.2 16.5 -8.2 6.5 -8.2 -3.6 -11.7 -9.35 -15.2 -15.3 -20.8 -17.4 -22.7 -18.3 -23.95 -19.35 -25.5 -20.9 -26.05 -23.35 -26.4 -24.75 -26.2 -26.3 -26.05 -33.1 -23.75 -34.7 -18.35 -40.65 -9.6 -43.8 -3.85 -45.7 1.4 -44.85 5.35 -44.2 9.15 -42.55 Z" fill="none" stroke="#000000" stroke-linecap="round" stroke-linejoin="round" stroke-opacity="0.3019608" stroke-width="0.05"/>
    </g>
    <g id="sprite3" transform="matrix(1.0, 0.0, 0.0, 1.0, 13.7, 13.7)">
      <use height="27.4" transform="matrix(1.0, 0.0, 0.0, 1.0, -13.7, -13.7)" width="27.4" xlink:href="#shape1"/>
    </g>
    <g id="shape1" transform="matrix(1.0, 0.0, 0.0, 1.0, 13.7, 13.7)">
      <path d="M1.5 -13.6 L2.4 -13.5 2.8 -13.4 3.9 -13.15 Q7.1 -12.25 9.65 -9.7 13.7 -5.65 13.7 0.0 13.7 5.65 9.65 9.65 5.65 13.7 0.0 13.7 -5.65 13.7 -9.7 9.65 -12.6 6.75 -13.4 3.0 L-13.65 0.8 -11.0 1.25 Q-3.55 1.25 -0.3 -6.15 1.3 -9.9 1.5 -13.6" fill="#d6baba" fill-rule="evenodd" stroke="none"/>
      <path d="M-13.65 0.8 L-13.7 0.0 Q-13.7 -5.65 -9.7 -9.7 -5.65 -13.7 0.0 -13.7 L1.5 -13.6 Q1.3 -9.9 -0.3 -6.15 -3.55 1.25 -11.0 1.25 L-13.65 0.8" fill="#ffffff" fill-rule="evenodd" stroke="none"/>
      <path d="M-13.65 0.8 L-13.7 0.0 Q-13.7 -5.65 -9.7 -9.7 -5.65 -13.7 0.0 -13.7 L1.5 -13.6 2.4 -13.5 2.8 -13.4 3.9 -13.15 Q7.1 -12.25 9.65 -9.7 13.7 -5.65 13.7 0.0 13.7 5.65 9.65 9.65 5.65 13.7 0.0 13.7 -5.65 13.7 -9.7 9.65 -12.6 6.75 -13.4 3.0 L-13.65 0.8 Z" fill="none" stroke="#000000" stroke-linecap="round" stroke-linejoin="round" stroke-opacity="0.3019608" stroke-width="0.05"/>
    </g>
    <g id="shape2" transform="matrix(1.0, 0.0, 0.0, 1.0, -16.7, 21.25)">
      <path d="M16.7 -14.2 Q16.7 -15.1 17.85 -15.1 18.95 -15.1 18.95 -13.85 18.95 -12.95 17.85 -12.95 17.35 -12.95 17.0 -13.55 16.7 -14.0 16.7 -14.2 M18.75 -18.1 Q18.75 -19.45 21.35 -20.8 23.9 -22.15 23.9 -19.5 23.9 -18.8 23.1 -17.75 22.1 -16.55 21.05 -16.55 19.5 -16.55 19.0 -17.25 18.75 -17.6 18.75 -18.1" fill="#ffffff" fill-rule="evenodd" stroke="none"/>
    </g>
    <g id="sprite4" transform="matrix(1.0, 0.0, 0.0, 1.0, 16.25, 29.0)">
      <use height="28.0" id="_col0" transform="matrix(0.9918, 0.1221, -0.1221, 0.9918, -3.8281, -14.5535)" width="11.15" xlink:href="#sprite5"/>
      <use height="57.85" id="_p7" transform="matrix(1.0, 0.0, 0.0, 1.0, -16.25, -29.0)" width="38.05" xlink:href="#sprite6"/>
    </g>
    <g id="sprite5" transform="matrix(1.0, 0.0, 0.0, 1.0, 5.45, 1.45)">
      <use height="28.0" transform="matrix(1.0, 0.0, 0.0, 1.0, -5.45, -1.45)" width="11.15" xlink:href="#shape3"/>
    </g>
    <g id="shape3" transform="matrix(1.0, 0.0, 0.0, 1.0, 5.45, 1.45)">
      <path d="M3.7 0.7 Q4.3 1.25 4.6 2.1 L3.85 0.9 3.7 0.7 M-0.55 26.25 Q-2.8 25.8 -3.65 24.7 -4.4 23.85 -4.4 22.75 L-5.4 5.15 Q-5.5 3.8 -5.2 2.7 L-4.6 1.3 Q-3.4 -1.05 -0.1 -1.45 L0.15 11.35 -0.1 22.1 -0.05 23.3 -0.5 24.65 -0.55 26.25" fill="#efcdaf" fill-rule="evenodd" stroke="none"/>
      <path d="M3.7 0.7 L3.85 0.9 4.6 2.1 5.65 4.95 5.7 5.15 4.85 22.75 Q4.5 24.1 3.7 25.15 2.5 26.3 0.5 26.55 L0.25 26.45 -0.55 26.25 -0.5 24.65 -0.05 23.3 -0.1 22.1 0.15 11.35 -0.1 -1.45 Q1.65 -1.2 2.95 -0.2 L3.6 0.55 3.7 0.7" fill="#c6886a" fill-rule="evenodd" stroke="none"/>
      <path d="M3.85 0.9 L4.6 2.1 5.65 4.95 5.7 5.15 4.85 22.75 Q4.5 24.1 3.7 25.15 M-3.65 24.7 Q-4.4 23.85 -4.4 22.75 L-5.4 5.15 Q-5.5 3.8 -5.2 2.7" fill="none" stroke="#000000" stroke-linecap="round" stroke-linejoin="round" stroke-opacity="0.3019608" stroke-width="0.05"/>
    </g>
    <g id="sprite6" transform="matrix(1.0, 0.0, 0.0, 1.0, 16.8, 30.55)">
      <use height="33.65" id="_col2" transform="matrix(0.8944, -0.0586, 0.0349, 0.5327, -13.6359, 0.2907)" width="30.4" xlink:href="#sprite7"/>
    </g>
    <g id="sprite7" transform="matrix(1.0, 0.0, 0.0, 1.0, 4.5, 6.05)">
      <use height="33.65" transform="matrix(1.0, 0.0, 0.0, 1.0, -4.5, -6.05)" width="30.4" xlink:href="#shape4"/>
    </g>
    <g id="shape4" transform="matrix(1.0, 0.0, 0.0, 1.0, 4.5, 6.05)">
      <path d="M4.9 26.1 Q4.05 26.55 3.15 26.95 1.65 24.95 0.5 22.95 -1.1 20.8 -2.0 18.55 L-4.4 19.8 Q-3.5 13.9 -1.1 8.75 L-4.5 9.35 -2.25 4.7 Q-1.75 3.45 -0.85 2.35 L-2.25 1.95 Q-1.6 0.7 -0.35 -0.3 1.0 -1.3 2.65 -2.05 L2.4 -2.55 1.9 -3.2 1.9 -3.7 2.05 -4.1 7.2 -3.95 8.3 -4.7 Q10.3 -6.95 11.45 -5.45 L11.95 -4.7 13.2 -2.55 14.2 -1.05 10.05 -1.2 Q6.95 -1.3 9.55 0.2 12.95 1.95 14.85 5.35 L15.1 5.6 14.45 5.6 Q10.05 4.85 11.85 8.6 12.85 10.75 13.2 13.0 L11.35 11.75 Q10.3 11.0 9.2 10.75 6.05 9.75 7.45 12.4 9.05 14.9 9.2 18.05 7.2 17.15 6.45 19.3 5.3 22.45 4.9 26.1" fill="#ffffff" fill-rule="evenodd" stroke="none"/>
      <path d="M11.95 -4.7 L17.5 -5.35 16.25 -4.1 19.6 -2.55 23.15 -1.05 23.25 -0.7 22.0 -0.55 20.15 -0.7 25.9 9.85 22.15 7.35 23.25 12.65 24.0 16.4 20.65 13.5 Q21.15 18.3 18.35 23.3 17.85 24.05 17.6 24.95 L16.85 24.8 Q15.75 23.7 15.2 22.45 L5.8 27.6 5.15 26.1 4.9 26.1 Q5.3 22.45 6.45 19.3 7.2 17.15 9.2 18.05 9.05 14.9 7.45 12.4 6.05 9.75 9.2 10.75 10.3 11.0 11.35 11.75 L13.2 13.0 Q12.85 10.75 11.85 8.6 10.05 4.85 14.45 5.6 L15.1 5.6 14.85 5.35 Q12.95 1.95 9.55 0.2 6.95 -1.3 10.05 -1.2 L14.2 -1.05 13.2 -2.55 11.95 -4.7" fill="#d6baba" fill-rule="evenodd" stroke="none"/>
      <path d="M4.9 26.1 Q4.05 26.55 3.15 26.95 1.65 24.95 0.5 22.95 -1.1 20.8 -2.0 18.55 L-4.4 19.8 Q-3.5 13.9 -1.1 8.75 L-4.5 9.35 -2.25 4.7 Q-1.75 3.45 -0.85 2.35 L-2.25 1.95 Q-1.6 0.7 -0.35 -0.3 1.0 -1.3 2.65 -2.05 L2.4 -2.55 1.9 -3.2 1.9 -3.7 2.05 -4.1 7.2 -3.95 8.3 -4.7 Q10.3 -6.95 11.45 -5.45 L11.95 -4.7 17.5 -5.35 16.25 -4.1 19.6 -2.55 23.15 -1.05 23.25 -0.7 22.0 -0.55 20.15 -0.7 25.9 9.85 22.15 7.35 23.25 12.65 24.0 16.4 20.65 13.5 Q21.15 18.3 18.35 23.3 17.85 24.05 17.6 24.95 L16.85 24.8 Q15.75 23.7 15.2 22.45 L5.8 27.6 5.15 26.1 4.9 26.1 Z" fill="none" stroke="#000000" stroke-linecap="round" stroke-linejoin="round" stroke-opacity="0.3019608" stroke-width="0.05"/>
    </g>
    <g id="sprite8" transform="matrix(1.0, 0.0, 0.0, 1.0, 31.85, 19.65)">
      <use height="18.15" transform="matrix(1.0, 0.0, 0.0, 1.0, -8.75, 0.3)" width="17.85" xlink:href="#sprite9"/>
      <clipPath id="clipPath0" transform="matrix(1.0, 0.0, 0.0, 1.0, 31.85, 19.65)">
        <use height="146.8" transform="matrix(1.0, 0.0, 0.0, 1.0, -31.85, -19.65)" width="196.05" xlink:href="#shape6"/>
      </clipPath>
    </g>
    <g id="sprite9" transform="matrix(1.0, 0.0, 0.0, 1.0, 8.8, 2.35)">
      <use height="17.85" id="_col0" transform="matrix(1.0, 0.0, 0.0, 1.0, -8.8, -2.05)" width="17.65" xlink:href="#sprite10"/>
      <use height="16.55" id="_p7" transform="matrix(1.0, 0.0, 0.0, 1.0, -6.85, -2.35)" width="15.9" xlink:href="#sprite11"/>
    </g>
    <g id="sprite10" transform="matrix(1.0, 0.0, 0.0, 1.0, 8.65, 8.7)">
      <use height="17.85" transform="matrix(1.0, 0.0, 0.0, 1.0, -8.65, -8.7)" width="17.65" xlink:href="#shape5"/>
    </g>
    <g id="shape5" transform="matrix(1.0, 0.0, 0.0, 1.0, 8.65, 8.7)">
      <path d="M-4.8 -6.05 Q-4.95 -4.15 -4.35 -2.2 L-3.95 -0.85 -6.0 -0.45 -6.0 -0.7 -6.0 -0.45 -3.95 -0.85 -4.35 -2.2 Q-4.95 -4.15 -4.8 -6.05 M-7.15 4.7 L-8.65 4.3 -8.35 1.95 Q-8.5 -0.85 -6.0 -0.7 -6.45 -2.2 -6.6 -4.4 -6.7 -6.05 -6.15 -7.7 L-6.1 -7.85 -5.7 -8.7 1.65 -8.35 2.0 -5.9 Q2.05 -4.35 1.55 -2.8 L0.8 -0.45 Q0.35 0.75 0.35 2.05 0.2 3.85 -1.3 4.85 L-1.7 5.15 Q-2.45 5.45 -3.2 5.15 -3.8 4.7 -4.1 4.7 -4.65 4.55 -5.1 4.7 -5.45 5.0 -5.45 5.6 L-5.25 6.2 Q-5.7 6.2 -6.0 5.8 L-7.15 4.7 -7.15 4.55 Q-7.45 1.95 -6.0 -0.45 -7.45 1.95 -7.15 4.55 L-7.15 4.7 M-3.95 -0.85 Q-3.5 2.05 -5.1 4.7 -3.5 2.05 -3.95 -0.85" fill="#efcdaf" fill-rule="evenodd" stroke="none"/>
      <path d="M4.6 -8.25 L5.3 -7.2 5.65 -6.75 7.0 -3.25 8.9 2.35 Q9.2 3.35 8.75 5.15 6.7 6.2 4.6 7.35 2.1 8.85 -0.25 9.15 L-0.8 8.15 -1.6 6.65 -3.8 7.05 -1.6 6.65 -0.8 8.15 -2.75 8.0 -3.8 7.05 -5.25 6.2 -5.45 5.6 Q-5.45 5.0 -5.1 4.7 -4.65 4.55 -4.1 4.7 -3.8 4.7 -3.2 5.15 -2.45 5.45 -1.7 5.15 L-1.3 4.85 Q0.2 3.85 0.35 2.05 0.35 0.75 0.8 -0.45 L1.55 -2.8 Q2.05 -4.35 2.0 -5.9 L1.65 -8.35 1.65 -8.4 1.85 -8.35 4.6 -8.25 M4.75 -0.85 L3.3 0.3 2.55 1.0 1.4 3.35 0.9 5.15 Q0.8 5.8 0.5 6.05 -0.25 6.5 -1.3 6.5 L-1.85 6.05 -2.0 6.05 -3.5 5.6 -4.1 4.7 -3.5 5.6 -2.0 6.05 -1.85 6.05 -1.3 6.5 Q-0.25 6.5 0.5 6.05 0.8 5.8 0.9 5.15 L1.4 3.35 2.55 1.0 3.3 0.3 4.75 -0.85 M2.7 4.3 L2.7 3.7 1.4 3.35 2.7 3.7 Q4.05 2.95 4.2 1.65 4.5 -0.15 3.3 0.3 4.5 -0.15 4.2 1.65 4.05 2.95 2.7 3.7 L2.7 4.3 4.35 4.45 4.6 4.7 Q5.35 5.0 5.35 5.6 5.35 5.0 4.6 4.7 L4.35 4.45 2.7 4.3 3.0 5.8 2.85 6.05 1.4 7.8 2.85 6.05 3.0 5.8 2.7 4.3 M-1.3 6.5 L-1.6 6.65 -1.3 6.5" fill="#c6886a" fill-rule="evenodd" stroke="none"/>
      <path d="M-6.0 -0.7 L-6.0 -0.45 -3.95 -0.85 -4.35 -2.2 Q-4.95 -4.15 -4.8 -6.05 M-5.7 -8.7 L-6.1 -7.85 -6.15 -7.7 Q-6.7 -6.05 -6.6 -4.4 -6.45 -2.2 -6.0 -0.7 -8.5 -0.85 -8.35 1.95 L-8.65 4.3 -7.15 4.7 -7.15 4.55 Q-7.45 1.95 -6.0 -0.45 M-0.8 8.15 L-0.25 9.15 Q2.1 8.85 4.6 7.35 6.7 6.2 8.75 5.15 9.2 3.35 8.9 2.35 L7.0 -3.25 5.65 -6.75 5.3 -7.2 4.6 -8.25 M-4.1 4.7 L-3.5 5.6 -2.0 6.05 -1.85 6.05 -1.3 6.5 Q-0.25 6.5 0.5 6.05 0.8 5.8 0.9 5.15 L1.4 3.35 2.55 1.0 3.3 0.3 4.75 -0.85 M1.4 3.35 L2.7 3.7 Q4.05 2.95 4.2 1.65 4.5 -0.15 3.3 0.3 M5.35 5.6 Q5.35 5.0 4.6 4.7 L4.35 4.45 2.7 4.3 3.0 5.8 2.85 6.05 1.4 7.8 M2.7 3.7 L2.7 4.3 M-7.15 4.7 L-6.0 5.8 Q-5.7 6.2 -5.25 6.2 L-5.45 5.6 Q-5.45 5.0 -5.1 4.7 -3.5 2.05 -3.95 -0.85 M-0.8 8.15 L-1.6 6.65 -3.8 7.05 -2.75 8.0 -0.8 8.15 M-1.6 6.65 L-1.3 6.5 M-5.25 6.2 L-3.8 7.05" fill="none" stroke="#000000" stroke-linecap="round" stroke-linejoin="round" stroke-opacity="0.4" stroke-width="0.05"/>
    </g>
    <g id="shape6" transform="matrix(1.0, 0.0, 0.0, 1.0, 31.85, 19.65)">
      <path d="M24.65 -16.4 Q30.75 -19.65 44.3 -19.65 L49.9 -19.1 56.4 -18.6 62.4 -17.9 Q95.45 -12.7 131.75 -1.75 168.05 9.15 163.75 38.45 159.4 67.75 136.95 107.05 114.45 146.35 49.75 108.8 L24.25 100.1 Q-39.8 108.65 -30.7 83.1 -21.65 57.55 -19.55 49.25 -17.5 40.9 -14.0 37.2 -10.5 33.45 -11.5 29.8 -12.55 26.15 -9.55 24.1 -6.55 22.7 -5.65 19.7 -4.8 16.7 1.25 18.15 L1.5 17.8 1.4 17.4 Q3.6 13.8 4.4 10.65 4.55 10.2 5.0 9.65 5.7 7.7 9.75 1.3 14.1 -5.65 15.75 -7.75 21.1 -14.55 24.65 -16.4 M-9.15 -2.25 Q-5.55 -0.1 -5.55 2.25 L-5.25 4.05 Q-5.25 4.95 -4.35 6.45 L-3.5 8.25 Q-3.5 9.3 -4.4 9.3 -4.8 9.3 -5.6 8.55 L-6.15 8.65 -7.05 8.55 Q-8.25 8.7 -8.55 9.65 L-11.5 10.1 Q-17.2 10.1 -19.75 8.4 -21.65 7.15 -21.65 5.1 -21.65 3.45 -20.3 1.35 -19.05 -0.65 -17.45 -1.8 -13.3 -4.8 -9.15 -2.25" fill="#00ff00" fill-rule="evenodd" stroke="none"/>
    </g>
    <g id="sprite12" transform="matrix(1.0, 0.0, 0.0, 1.0, 10.05, 15.25)">
      <use height="30.4" id="_p2" transform="matrix(1.0, 0.0, 0.0, 1.0, -10.05, -15.25)" width="20.05" xlink:href="#sprite13"/>
    </g>
    <g id="sprite13" transform="matrix(1.0, 0.0, 0.0, 1.0, 10.05, 15.25)">
      <use height="30.4" id="_p5" transform="matrix(1.0, 0.0, 0.0, 1.0, -10.05, -15.25)" width="20.05" xlink:href="#sprite14"/>
    </g>
    <g id="sprite14" transform="matrix(1.0, 0.0, 0.0, 1.0, 10.05, 15.25)">
      <use height="28.0" id="_col0" transform="matrix(0.9552, -0.2927, 0.2927, 0.9552, -10.0342, -11.5985)" width="12.4" xlink:href="#sprite15"/>
      <use height="0.0" id="_p7" transform="matrix(1.0, 0.0, 0.0, 1.0, 0.3, 3.3)" width="0.0" xlink:href="#sprite16"/>
    </g>
    <g id="sprite15" transform="matrix(1.0, 0.0, 0.0, 1.0, 6.2, -0.3)">
      <use height="28.0" transform="matrix(1.0, 0.0, 0.0, 1.0, -6.2, 0.3)" width="12.4" xlink:href="#shape7"/>
    </g>
    <g id="shape7" transform="matrix(1.0, 0.0, 0.0, 1.0, 6.2, -0.3)">
      <path d="M3.25 1.5 Q5.3 3.1 6.2 6.75 L5.5 24.35 4.35 26.8 3.15 27.6 Q1.45 28.6 -0.55 28.15 L-0.4 26.55 0.0 22.65 Q0.25 18.35 0.15 13.0 L-0.2 0.3 Q1.7 0.4 3.25 1.5" fill="#c6886a" fill-rule="evenodd" stroke="none"/>
      <path d="M-0.2 0.3 L0.15 13.0 Q0.25 18.35 0.0 22.65 L-0.4 26.55 -0.55 28.15 -2.1 27.65 Q-3.4 27.15 -4.0 26.55 -4.8 25.75 -4.85 24.65 L-6.2 6.95 Q-6.25 4.65 -5.35 3.25 -3.85 0.8 -0.2 0.3" fill="#efcdaf" fill-rule="evenodd" stroke="none"/>
      <path d="M4.35 26.8 L5.5 24.35 6.2 6.75 Q5.3 3.1 3.25 1.5 M-4.0 26.55 Q-4.8 25.75 -4.85 24.65 L-6.2 6.95 Q-6.25 4.65 -5.35 3.25" fill="none" stroke="#000000" stroke-linecap="round" stroke-linejoin="round" stroke-opacity="0.3019608" stroke-width="0.05"/>
    </g>
    <g id="sprite17" transform="matrix(1.0, 0.0, 0.0, 1.0, 20.3, 17.2)">
      <use height="33.0" id="_p2" transform="matrix(1.0, 0.0, 0.0, 1.0, -20.3, -17.2)" width="33.0" xlink:href="#sprite18"/>
    </g>
    <g id="sprite18" transform="matrix(1.0, 0.0, 0.0, 1.0, 20.3, 17.2)">
      <use height="33.0" id="_p5" transform="matrix(1.0, 0.0, 0.0, 1.0, -20.3, -17.2)" width="33.0" xlink:href="#sprite19"/>
    </g>
    <g id="sprite19" transform="matrix(1.0, 0.0, 0.0, 1.0, 20.3, 17.2)">
      <use height="33.0" id="_p7" transform="matrix(1.0, 0.0, 0.0, 1.0, -20.3, -17.2)" width="33.0" xlink:href="#sprite20"/>
    </g>
    <g id="sprite20" transform="matrix(1.0, 0.0, 0.0, 1.0, 20.3, 17.2)">
      <use height="14.0" id="_col0" transform="matrix(1.0, 0.0, 0.0, 1.0, -6.95, -6.95)" width="13.8" xlink:href="#sprite21"/>
      <use height="22.3" id="_p1" transform="matrix(-0.7987, 0.5992, 0.5992, 0.7987, -0.6469, -17.1943)" width="24.6" xlink:href="#sprite22"/>
    </g>
    <g id="sprite21" transform="matrix(1.0, 0.0, 0.0, 1.0, 6.95, 6.95)">
      <use height="14.0" transform="matrix(1.0, 0.0, 0.0, 1.0, -6.95, -6.95)" width="13.8" xlink:href="#shape8"/>
    </g>
    <g id="shape8" transform="matrix(1.0, 0.0, 0.0, 1.0, 6.95, 6.95)">
      <path d="M0.4 -6.9 Q2.15 -6.95 3.7 -5.9 L5.6 -4.1 Q6.35 -3.05 6.6 -1.7 L6.85 1.2 Q6.75 2.95 5.65 4.3 L4.95 5.2 4.35 5.75 Q3.2 6.65 1.95 6.9 L1.05 7.0 Q2.3 5.95 3.0 3.85 L3.85 -1.05 Q3.75 -3.05 1.1 -6.05 L0.4 -6.9" fill="#c6886a" fill-rule="evenodd" stroke="none"/>
      <path d="M0.4 -6.9 L1.1 -6.05 Q3.75 -3.05 3.85 -1.05 L3.0 3.85 Q2.3 5.95 1.05 7.0 L0.95 7.05 0.8 7.05 -1.15 6.95 -1.4 6.7 Q-4.05 6.25 -5.55 4.25 -6.55 2.95 -6.8 1.45 -7.2 -0.5 -6.65 -2.3 -6.05 -4.2 -4.55 -5.45 L-3.45 -6.25 -2.8 -6.5 0.4 -6.9" fill="#efcdaf" fill-rule="evenodd" stroke="none"/>
      <path d="M4.95 5.2 L5.65 4.3 Q6.75 2.95 6.85 1.2 L6.6 -1.7 Q6.35 -3.05 5.6 -4.1 L3.7 -5.9 Q2.15 -6.95 0.4 -6.9 L-2.8 -6.5" fill="none" stroke="#000000" stroke-linecap="round" stroke-linejoin="round" stroke-opacity="0.3019608" stroke-width="0.05"/>
    </g>
    <g id="sprite23" transform="matrix(1.0, 0.0, 0.0, 1.0, 13.2, 13.4)">
      <use height="43.7" id="_p8" transform="matrix(1.0, 0.0, 0.0, 1.0, -13.2, -13.4)" width="43.4" xlink:href="#sprite24"/>
    </g>
    <g id="sprite24" transform="matrix(1.0, 0.0, 0.0, 1.0, 15.2, 17.55)">
      <use height="31.7" id="_p7b" transform="matrix(1.0, 0.0, 0.0, 1.0, -15.2, -5.55)" width="40.2" xlink:href="#sprite25"/>
      <use height="32.1" id="_col0" transform="matrix(1.0, 0.0, 0.0, 1.0, -13.75, -16.35)" width="36.1" xlink:href="#sprite26"/>
      <use height="34.55" id="_p7" transform="matrix(1.0, 0.0, 0.0, 1.0, -14.4, -17.55)" width="42.6" xlink:href="#sprite27"/>
    </g>
    <g id="sprite26" transform="matrix(1.0, 0.0, 0.0, 1.0, 18.05, 16.05)">
      <use height="32.1" transform="matrix(1.0, 0.0, 0.0, 1.0, -18.05, -16.05)" width="36.1" xlink:href="#shape9"/>
    </g>
    <g id="shape9" transform="matrix(1.0, 0.0, 0.0, 1.0, 18.05, 16.05)">
      <path d="M-1.1 -15.25 L-0.25 -13.75 Q0.7 -11.8 2.35 -9.3 L6.8 -3.9 Q9.45 -0.9 11.6 0.55 13.9 2.05 16.35 2.7 L17.65 4.5 17.0 5.15 17.0 5.35 17.2 5.5 17.2 5.65 Q19.15 7.65 16.5 8.6 L16.35 8.3 15.55 7.8 15.35 7.8 15.05 7.65 14.55 7.45 Q12.9 7.15 11.25 8.3 11.1 8.3 11.1 8.45 11.25 8.45 11.4 8.6 11.25 8.45 11.1 8.45 11.1 8.3 11.25 8.3 12.9 7.15 14.55 7.45 L15.05 7.65 15.35 7.8 15.55 7.8 16.35 8.3 12.9 9.95 11.4 8.6 9.75 9.45 8.8 9.75 Q7.95 9.75 7.8 10.45 L7.65 10.6 Q7.65 10.95 8.15 11.4 L9.45 12.25 9.6 12.25 Q7.8 12.75 5.0 11.75 2.2 10.6 1.2 7.65 0.05 4.5 -0.75 3.35 -1.75 2.2 -4.7 2.2 L-8.15 2.2 -8.35 1.85 -8.65 1.4 -8.8 0.55 -9.5 -2.4 Q-9.8 -4.85 -9.5 -7.0 -8.8 -10.3 -8.65 -13.1 L-8.5 -16.05 -1.1 -15.25" fill="#efcdaf" fill-rule="evenodd" stroke="none"/>
      <path d="M-8.5 -16.05 L-8.65 -13.1 Q-8.8 -10.3 -9.5 -7.0 -9.8 -4.85 -9.5 -2.4 L-8.8 0.55 -8.65 1.4 -8.35 1.85 -8.15 2.2 -4.7 2.2 Q-1.75 2.2 -0.75 3.35 0.05 4.5 1.2 7.65 2.2 10.6 5.0 11.75 7.8 12.75 9.6 12.25 L9.45 12.25 8.15 11.4 Q7.65 10.95 7.65 10.6 L7.8 10.45 Q7.95 9.75 8.8 9.75 L9.75 9.45 11.4 8.6 12.9 9.95 16.35 8.3 16.5 8.6 16.7 9.1 Q16.85 10.1 15.7 10.75 L14.05 12.1 13.55 14.4 11.25 16.05 5.15 15.05 3.2 14.55 Q1.4 12.9 0.9 11.25 L0.05 10.25 Q-1.25 8.6 -3.25 7.8 -4.85 7.0 -6.7 6.8 L-14.1 5.15 Q-14.25 5.0 -14.4 5.0 -15.25 5.0 -15.55 4.35 -17.4 3.5 -17.7 1.7 L-17.85 1.55 -18.05 0.55 Q-18.05 -1.4 -17.4 -4.05 -16.7 -6.35 -16.4 -9.3 L-15.9 -12.6 Q-14.25 -13.9 -12.45 -14.9 -10.45 -15.75 -8.5 -16.05 M14.05 12.1 L13.25 10.45 14.05 12.1 M13.25 10.45 L13.05 10.25 13.05 10.45 13.25 10.45 M12.9 9.95 L12.9 10.1 13.05 10.25 12.9 10.1 12.9 9.95 M11.75 11.4 Q10.25 12.4 9.6 12.25 10.25 12.4 11.75 11.4" fill="#c6886a" fill-rule="evenodd" stroke="none"/>
      <path d="M13.05 10.25 L13.25 10.45 13.05 10.45 13.05 10.25" fill="#e89f48" fill-rule="evenodd" stroke="none"/>
      <path d="M16.5 8.6 Q19.15 7.65 17.2 5.65 L17.2 5.5 17.0 5.35 17.0 5.15 17.65 4.5 16.35 2.7 Q13.9 2.05 11.6 0.55 9.45 -0.9 6.8 -3.9 L2.35 -9.3 Q0.7 -11.8 -0.25 -13.75 L-1.1 -15.25 M9.6 12.25 L9.45 12.25 8.15 11.4 Q7.65 10.95 7.65 10.6 L7.8 10.45 Q7.95 9.75 8.8 9.75 L9.75 9.45 11.4 8.6 Q11.25 8.45 11.1 8.45 11.1 8.3 11.25 8.3 12.9 7.15 14.55 7.45 L15.05 7.65 15.35 7.8 15.55 7.8 16.35 8.3 16.5 8.6 16.7 9.1 Q16.85 10.1 15.7 10.75 L14.05 12.1 13.55 14.4 11.25 16.05 5.15 15.05 3.2 14.55 Q1.4 12.9 0.9 11.25 L0.05 10.25 Q-1.25 8.6 -3.25 7.8 -4.85 7.0 -6.7 6.8 L-14.1 5.15 Q-14.25 5.0 -14.4 5.0 -15.25 5.0 -15.55 4.35 -17.4 3.5 -17.7 1.7 M-17.85 1.55 L-18.05 0.55 Q-18.05 -1.4 -17.4 -4.05 -16.7 -6.35 -16.4 -9.3 L-15.9 -12.6 M13.25 10.45 L14.05 12.1 M13.25 10.45 L13.05 10.25 12.9 10.1 12.9 9.95 11.4 8.6 M12.9 9.95 L16.35 8.3 M9.6 12.25 Q10.25 12.4 11.75 11.4" fill="none" stroke="#000000" stroke-linecap="round" stroke-linejoin="round" stroke-opacity="0.3019608" stroke-width="0.05"/>
    </g>
    <g id="sprite27" transform="matrix(1.0, 0.0, 0.0, 1.0, 19.6, 18.3)">
      <use height="33.25" id="_p1" transform="matrix(1.0, 0.0, 0.0, 1.0, -19.6, -17.85)" width="36.8" xlink:href="#sprite28"/>
    </g>
    <g id="sprite29" transform="matrix(1.0, 0.0, 0.0, 1.0, 17.3, 4.3)">
      <use height="49.55" id="_p2" transform="matrix(1.0, 0.0, 0.0, 1.0, -17.3, -4.3)" width="36.6" xlink:href="#sprite30"/>
    </g>
    <g id="sprite30" transform="matrix(1.0, 0.0, 0.0, 1.0, 17.2, 20.7)">
      <use height="49.55" id="_p6" transform="matrix(1.0, 0.0, 0.0, 1.0, -17.2, -20.7)" width="36.6" xlink:href="#sprite31"/>
    </g>
    <g id="sprite31" transform="matrix(1.0, 0.0, 0.0, 1.0, 17.2, 20.7)">
      <use height="37.35" id="_col0" transform="matrix(1.0, 0.0, 0.0, 1.0, -6.9, -18.65)" width="13.8" xlink:href="#sprite32"/>
      <use height="47.2" id="_p7" transform="matrix(0.9969, -0.0749, 0.0749, 0.9969, -17.1777, -18.2215)" width="33.15" xlink:href="#sprite33"/>
    </g>
    <g id="sprite32" transform="matrix(1.0, 0.0, 0.0, 1.0, 6.9, 18.65)">
      <use height="37.35" transform="matrix(1.0, 0.0, 0.0, 1.0, -6.9, -18.65)" width="13.8" xlink:href="#shape10"/>
    </g>
    <g id="shape10" transform="matrix(1.0, 0.0, 0.0, 1.0, 6.9, 18.65)">
      <path d="M0.05 -18.6 Q3.4 -18.45 5.5 -16.1 L5.95 -15.65 6.9 -13.35 6.75 12.25 Q6.45 14.0 5.75 15.25 4.05 18.45 0.3 18.7 -0.7 11.7 -0.55 11.15 L0.15 -5.25 0.05 -18.6" fill="#c6886a" fill-rule="evenodd" stroke="none"/>
      <path d="M0.05 -18.6 L0.15 -5.25 -0.55 11.15 Q-0.7 11.7 0.3 18.7 -3.55 17.8 -5.25 16.05 -6.8 14.5 -6.65 12.15 L-6.9 -13.5 -5.45 -16.15 -4.05 -17.4 Q-2.4 -18.9 0.05 -18.6" fill="#efcdaf" fill-rule="evenodd" stroke="none"/>
      <path d="M5.75 15.25 Q6.45 14.0 6.75 12.25 L6.9 -13.35 5.95 -15.65 M-5.45 -16.15 L-6.9 -13.5 -6.65 12.15 Q-6.8 14.5 -5.25 16.05" fill="none" stroke="#000000" stroke-linecap="round" stroke-linejoin="round" stroke-opacity="0.3019608" stroke-width="0.05"/>
    </g>
    <g id="sprite33" transform="matrix(1.0, 0.0, 0.0, 1.0, 16.2, 21.05)">
      <use height="33.65" id="_col2" transform="matrix(0.9408, 0.3967, -0.1349, 0.5595, -11.6672, -4.7199)" width="30.4" xlink:href="#sprite7"/>
    </g>
    <g id="sprite34" transform="matrix(1.0, 0.0, 0.0, 1.0, 16.6, 2.6)">
      <use height="43.45" id="_p2" transform="matrix(1.0, 0.0, 0.0, 1.0, -16.6, -2.6)" width="25.5" xlink:href="#sprite35"/>
    </g>
    <g id="sprite35" transform="matrix(1.0, 0.0, 0.0, 1.0, 16.5, 19.0)">
      <use height="43.45" id="_p6" transform="matrix(1.0, 0.0, 0.0, 1.0, -16.5, -19.0)" width="25.5" xlink:href="#sprite36"/>
    </g>
    <g id="sprite36" transform="matrix(1.0, 0.0, 0.0, 1.0, 16.5, 19.0)">
      <use height="37.35" id="_col0" transform="matrix(1.0, 0.0, 0.0, 1.0, -8.4, -18.65)" width="16.75" xlink:href="#sprite37"/>
      <use height="29.5" id="_col3" transform="matrix(1.0, 0.0, 0.0, 1.0, -8.85, -18.65)" width="17.4" xlink:href="#sprite38"/>
      <use height="43.45" id="_p7" transform="matrix(1.0, 0.0, 0.0, 1.0, -16.5, -19.0)" width="25.5" xlink:href="#sprite39"/>
    </g>
    <g id="sprite37" transform="matrix(1.0, 0.0, 0.0, 1.0, 8.4, 18.65)">
      <use height="37.35" transform="matrix(1.0, 0.0, 0.0, 1.0, -8.4, -18.65)" width="16.75" xlink:href="#shape11"/>
    </g>
    <g id="shape11" transform="matrix(1.0, 0.0, 0.0, 1.0, 8.4, 18.65)">
      <path d="M0.35 18.7 Q-0.8 11.7 -0.65 11.15 -0.1 3.65 0.15 -5.25 L0.05 -18.6 Q3.95 -18.45 6.35 -16.1 L6.9 -15.65 8.0 -13.35 Q8.95 -2.1 7.25 12.75 7.05 14.2 5.9 16.35 4.7 18.45 0.35 18.7" fill="#c6886a" fill-rule="evenodd" stroke="none"/>
      <path d="M0.05 -18.6 L0.15 -5.25 Q-0.1 3.65 -0.65 11.15 -0.8 11.7 0.35 18.7 -4.1 17.8 -5.65 16.3 -7.25 14.75 -7.3 12.05 -9.05 0.05 -8.0 -13.5 -7.25 -15.05 -6.3 -16.15 L-4.7 -17.4 Q-2.8 -18.9 0.05 -18.6" fill="#efcdaf" fill-rule="evenodd" stroke="none"/>
      <path d="M5.9 16.35 Q7.05 14.2 7.25 12.75 8.95 -2.1 8.0 -13.35 L6.9 -15.65 M-6.3 -16.15 Q-7.25 -15.05 -8.0 -13.5 -9.05 0.05 -7.3 12.05 -7.25 14.75 -5.65 16.3" fill="none" stroke="#000000" stroke-linecap="round" stroke-linejoin="round" stroke-opacity="0.3019608" stroke-width="0.05"/>
    </g>
    <g id="sprite38" transform="matrix(1.0, 0.0, 0.0, 1.0, 8.85, 18.65)">
      <use height="29.5" transform="matrix(1.0, 0.0, 0.0, 1.0, -8.85, -18.65)" width="17.4" xlink:href="#shape12"/>
    </g>
    <g id="shape12" transform="matrix(1.0, 0.0, 0.0, 1.0, 8.85, 18.65)">
      <path d="M0.05 -18.6 Q3.95 -18.45 6.35 -16.1 L6.9 -15.65 8.0 -13.35 Q8.55 -8.55 8.55 -3.7 L8.55 -1.6 8.45 -1.6 7.8 5.8 Q7.75 8.15 5.85 9.6 3.9 11.05 -0.5 10.8 L-0.55 9.25 -0.3 3.7 0.0 -2.4 0.05 -4.5 0.15 -4.5 0.15 -5.25 0.05 -18.6 M8.55 -3.7 L8.45 -1.6 8.55 -3.7" fill="#d6baba" fill-rule="evenodd" stroke="none"/>
      <path d="M0.05 -18.6 L0.15 -5.25 0.15 -4.5 0.05 -4.5 0.0 -2.4 -0.3 3.7 -0.55 9.25 -0.5 10.8 Q-3.0 10.45 -4.85 9.55 -6.75 8.65 -7.7 7.2 -8.65 5.75 -8.6 1.8 L-8.6 1.7 -8.85 -3.25 -8.85 -4.3 -8.85 -3.25 -8.85 -4.3 -8.85 -5.35 -8.8 -5.35 -8.65 -7.9 -8.0 -13.5 Q-7.25 -15.05 -6.3 -16.15 L-4.7 -17.4 Q-2.8 -18.9 0.05 -18.6" fill="#ffffff" fill-rule="evenodd" stroke="none"/>
      <path d="M-0.5 10.8 Q3.9 11.05 5.85 9.6 7.75 8.15 7.8 5.8 L8.45 -1.6 8.55 -3.7 Q8.55 -8.55 8.0 -13.35 M-8.0 -13.5 L-8.65 -7.9 -8.8 -5.35 M-8.85 -5.35 L-8.85 -4.3 -8.85 -3.25 -8.6 1.7 -8.6 1.8 Q-8.65 5.75 -7.7 7.2 -6.75 8.65 -4.85 9.55 -3.0 10.45 -0.5 10.8 M-8.85 -4.3 L-8.85 -3.25" fill="none" stroke="#000000" stroke-linecap="round" stroke-linejoin="round" stroke-opacity="0.3019608" stroke-width="0.05"/>
    </g>
    <g id="sprite40" transform="matrix(1.0, 0.0, 0.0, 1.0, 20.3, 17.75)">
      <use height="45.1" transform="matrix(1.0, 0.0, 0.0, 1.0, -20.3, -17.75)" width="31.0" xlink:href="#sprite41"/>
    </g>
    <g id="sprite41" transform="matrix(1.0, 0.0, 0.0, 1.0, 19.0, 20.9)">
      <use height="40.1" id="_p7b" transform="matrix(1.0, 0.0, 0.0, 1.0, -19.0, -15.9)" width="29.6" xlink:href="#sprite42"/>
      <use height="33.4" id="_col0" transform="matrix(1.0, 0.0, 0.0, 1.0, -16.15, -20.0)" width="25.45" xlink:href="#sprite43"/>
      <use height="38.7" id="_p7" transform="matrix(1.0, 0.0, 0.0, 1.0, -17.95, -20.9)" width="29.95" xlink:href="#sprite44"/>
    </g>
    <g id="sprite43" transform="matrix(1.0, 0.0, 0.0, 1.0, 12.75, 16.7)">
      <use height="33.4" transform="matrix(1.0, 0.0, 0.0, 1.0, -12.75, -16.7)" width="25.45" xlink:href="#shape13"/>
    </g>
    <g id="shape13" transform="matrix(1.0, 0.0, 0.0, 1.0, 12.75, 16.7)">
      <path d="M9.0 -12.95 L9.65 -9.55 9.8 -8.4 9.8 -7.25 Q9.95 -4.35 10.6 -1.25 11.25 1.65 12.4 4.75 L12.7 6.55 10.8 11.25 Q8.0 9.15 6.25 11.75 L5.9 12.55 4.75 11.4 5.9 12.55 6.25 11.75 Q8.0 9.15 10.8 11.25 L10.6 13.35 10.45 14.3 Q8.65 15.45 7.7 14.65 L6.05 13.5 Q5.9 17.25 1.85 16.6 -0.1 16.75 0.05 14.65 -1.7 17.55 -5.3 15.6 L-5.6 14.95 -4.95 12.4 -4.65 8.95 -4.95 12.4 -5.6 14.95 -7.55 16.45 -10.5 15.95 -12.45 14.3 -12.45 14.0 Q-12.1 12.7 -10.35 12.2 L-7.4 13.35 -6.45 13.2 -6.75 12.2 -6.25 10.9 -4.65 8.95 Q-4.15 8.95 -3.85 9.6 -3.5 10.25 -3.5 11.25 -4.55 11.55 -4.15 12.2 L-3.65 12.7 -3.65 13.2 -2.35 13.5 -2.05 13.35 -1.9 13.35 -0.1 13.5 -0.1 12.4 -0.1 12.05 0.2 11.4 0.7 12.2 1.7 13.05 1.7 13.35 1.85 13.85 3.95 13.85 1.85 13.85 1.7 13.35 3.95 13.85 4.45 13.65 4.6 13.2 4.6 11.4 4.75 11.4 6.25 7.65 3.15 3.45 1.05 -0.1 Q1.2 -2.55 1.5 -4.5 1.7 -6.6 0.85 -11.3 L-0.1 -16.5 -0.1 -16.7 Q3.0 -16.7 5.25 -15.85 L6.4 -15.4 7.7 -14.75 8.85 -13.6 Q8.85 -13.25 9.0 -12.95 M-0.1 13.5 L0.05 14.65 -0.1 13.5 M7.55 12.2 L7.85 11.9 Q8.85 11.9 9.0 12.55 L9.0 13.05 7.55 12.7 7.55 12.2 7.55 12.7 9.0 13.05 9.0 12.55 Q8.85 11.9 7.85 11.9 L7.55 12.2 M5.9 12.55 L6.05 13.5 5.9 12.55" fill="#c6886a" fill-rule="evenodd" stroke="none"/>
      <path d="M9.65 -9.55 L9.0 -12.95 9.3 -12.15 9.65 -9.55 M-0.1 -16.5 L0.85 -11.3 Q1.7 -6.6 1.5 -4.5 1.2 -2.55 1.05 -0.1 L3.15 3.45 6.25 7.65 4.75 11.4 4.6 11.4 2.8 10.6 Q1.35 10.1 0.2 11.4 1.35 10.1 2.8 10.6 L4.6 11.4 4.6 13.2 4.45 13.65 Q4.1 11.75 2.0 12.7 L1.7 13.05 2.0 12.7 Q4.1 11.75 4.45 13.65 L3.95 13.85 1.7 13.35 1.7 13.05 0.7 12.2 0.2 11.4 -0.1 12.05 -0.25 12.05 -3.0 11.1 -3.5 11.25 -3.0 11.1 -0.25 12.05 -0.1 12.4 -0.1 13.5 -1.9 13.35 Q-0.75 12.4 -3.0 12.4 -3.35 12.4 -3.65 12.7 -3.35 12.4 -3.0 12.4 -0.75 12.4 -1.9 13.35 L-3.65 13.2 -3.65 12.7 -4.15 12.2 Q-4.55 11.55 -3.5 11.25 -3.5 10.25 -3.85 9.6 -4.15 8.95 -4.65 8.95 L-6.25 10.9 -6.75 12.2 -6.45 13.2 -7.4 13.35 -10.35 12.2 Q-12.1 12.7 -12.45 14.0 L-12.45 14.3 -12.6 14.0 -12.75 13.2 Q-12.6 11.55 -12.1 9.95 -11.8 7.2 -11.15 4.6 L-9.5 -0.3 Q-8.85 -1.9 -8.55 -3.35 L-7.55 -7.45 -6.75 -10.85 Q-6.75 -16.5 -0.75 -16.5 L-0.1 -16.5 M-3.65 13.2 L-1.9 13.35 -2.05 13.35 -2.35 13.5 -3.65 13.2 M-7.4 8.3 L-9.85 8.15 -12.1 9.95 -9.85 8.15 -7.4 8.3" fill="#efcdaf" fill-rule="evenodd" stroke="none"/>
      <path d="M-0.1 12.4 L-0.25 12.05 -0.1 12.05 -0.1 12.4" fill="#c16308" fill-rule="evenodd" stroke="none"/>
      <path d="M9.0 -12.95 L9.65 -9.55 M9.0 -12.95 Q8.85 -13.25 8.85 -13.6 M4.75 11.4 L5.9 12.55 6.25 11.75 Q8.0 9.15 10.8 11.25 L12.7 6.55 12.4 4.75 Q11.25 1.65 10.6 -1.25 9.95 -4.35 9.8 -7.25 L9.8 -8.4 9.65 -9.55 M-12.45 14.3 L-12.6 14.0 -12.75 13.2 Q-12.6 11.55 -12.1 9.95 -11.8 7.2 -11.15 4.6 L-9.5 -0.3 Q-8.85 -1.9 -8.55 -3.35 L-7.55 -7.45 -6.75 -10.85 M-0.25 12.05 L-3.0 11.1 -3.5 11.25 M-0.1 13.5 L-0.1 12.4 M-0.25 12.05 L-0.1 12.05 0.2 11.4 Q1.35 10.1 2.8 10.6 L4.6 11.4 4.75 11.4 M-4.65 8.95 L-4.95 12.4 -5.6 14.95 -5.3 15.6 Q-1.7 17.55 0.05 14.65 L-0.1 13.5 M-0.1 12.05 L-0.1 12.4 M-12.45 14.3 L-10.5 15.95 -7.55 16.45 -5.6 14.95 M-12.1 9.95 L-9.85 8.15 -7.4 8.3 M10.8 11.25 L10.6 13.35 10.45 14.3 Q8.65 15.45 7.7 14.65 L6.05 13.5 Q5.9 17.25 1.85 16.6 -0.1 16.75 0.05 14.65 M6.05 13.5 L5.9 12.55" fill="none" stroke="#000000" stroke-linecap="round" stroke-linejoin="round" stroke-opacity="0.4" stroke-width="0.05"/>
      <path d="M-3.65 12.7 Q-3.35 12.4 -3.0 12.4 -0.75 12.4 -1.9 13.35 L-3.65 13.2 -3.65 12.7 M1.7 13.05 L2.0 12.7 Q4.1 11.75 4.45 13.65 M3.95 13.85 L1.85 13.85 1.7 13.35 1.7 13.05 M-6.75 12.2 L-6.45 13.2 -7.4 13.35 -10.35 12.2 M7.55 12.2 L7.55 12.7 9.0 13.05 9.0 12.55 Q8.85 11.9 7.85 11.9 L7.55 12.2 M3.95 13.85 L4.45 13.65" fill="none" stroke="#000000" stroke-linecap="round" stroke-linejoin="round" stroke-opacity="0.15294118" stroke-width="0.05"/>
    </g>
    <g id="sprite44" transform="matrix(1.0, 0.0, 0.0, 1.0, 15.0, 19.4)">
      <use height="38.65" id="_p1" transform="matrix(1.0, 0.0, 0.0, 1.0, -15.0, -19.35)" width="29.95" xlink:href="#sprite45"/>
    </g>
    <g id="sprite46" transform="matrix(1.0, 0.0, 0.0, 1.0, 15.55, 10.25)">
      <use height="50.85" id="_p2" transform="matrix(1.0, 0.0, 0.0, 1.0, -15.55, -10.25)" width="32.25" xlink:href="#sprite47"/>
    </g>
    <g id="sprite47" transform="matrix(1.0, 0.0, 0.0, 1.0, 15.45, 26.65)">
      <use height="50.85" id="_p6" transform="matrix(1.0, 0.0, 0.0, 1.0, -15.45, -26.65)" width="32.25" xlink:href="#sprite48"/>
    </g>
    <g id="sprite48" transform="matrix(1.0, 0.0, 0.0, 1.0, 15.45, 26.65)">
      <use height="37.35" id="_col0" transform="matrix(1.0, 0.0, 0.0, 1.0, -6.9, -18.65)" width="13.8" xlink:href="#sprite32"/>
      <use height="50.85" id="_p7" transform="matrix(1.0, 0.0, 0.0, 1.0, -15.45, -26.65)" width="32.25" xlink:href="#sprite49"/>
    </g>
    <g id="sprite49" transform="matrix(1.0, 0.0, 0.0, 1.0, 16.0, 28.2)">
      <use height="33.65" id="_col2" transform="matrix(1.021, 0.0492, 0.0358, 0.6471, -16.0109, -1.5864)" width="30.4" xlink:href="#sprite7"/>
    </g>
    <g id="sprite50" transform="matrix(1.0, 0.0, 0.0, 1.0, 15.6, 14.55)">
      <use height="29.15" id="_p2" transform="matrix(1.0, 0.0, 0.0, 1.0, -15.6, -14.55)" width="30.4" xlink:href="#sprite51"/>
    </g>
    <g id="sprite51" transform="matrix(1.0, 0.0, 0.0, 1.0, 12.55, 20.5)">
      <use height="29.15" id="_p6" transform="matrix(1.0, 0.0, 0.0, 1.0, -12.55, -20.5)" width="30.4" xlink:href="#sprite52"/>
    </g>
    <g id="sprite52" transform="matrix(1.0, 0.0, 0.0, 1.0, 12.55, 20.5)">
      <use height="29.15" id="_col3" transform="matrix(1.0, 0.0, 0.0, 1.0, -12.55, -20.5)" width="30.4" xlink:href="#sprite53"/>
      <use height="29.15" id="_p7" transform="matrix(1.0, 0.0, 0.0, 1.0, -12.55, -20.5)" width="30.4" xlink:href="#sprite54"/>
    </g>
    <g id="sprite53" transform="matrix(1.0, 0.0, 0.0, 1.0, 15.2, 14.6)">
      <use height="29.15" transform="matrix(1.0, 0.0, 0.0, 1.0, -15.2, -14.6)" width="30.4" xlink:href="#shape14"/>
    </g>
    <g id="shape14" transform="matrix(1.0, 0.0, 0.0, 1.0, 15.2, 14.6)">
      <path d="M-14.2 2.05 L-14.55 0.8 Q-15.4 -2.05 -15.15 -3.75 -14.8 -6.05 -11.55 -9.8 -8.55 -13.6 -2.3 -14.6 L2.45 -14.25 Q1.95 -10.8 3.0 -2.0 4.0 6.75 -1.5 8.75 L-2.8 8.95 -5.05 9.1 Q-8.1 8.95 -10.55 7.15 -10.85 6.95 -11.2 7.15 L-11.35 7.3 -11.85 6.65 Q-13.15 4.8 -13.85 3.0 L-14.0 2.6 -14.2 2.05" fill="#ffffff" fill-rule="evenodd" stroke="none"/>
      <path d="M-11.35 7.3 L-11.2 7.15 Q-10.85 6.95 -10.55 7.15 -8.1 8.95 -5.05 9.1 L-2.8 8.95 -1.5 8.75 Q4.0 6.75 3.0 -2.0 1.95 -10.8 2.45 -14.25 L5.4 -13.45 7.55 -12.6 7.9 -12.45 Q8.4 -12.3 9.05 -11.8 L9.85 -11.45 10.2 -11.15 10.35 -11.0 11.35 -10.3 12.85 -8.2 14.5 -4.55 Q15.45 -1.45 15.15 2.35 14.65 9.6 8.55 12.55 2.45 15.85 -3.65 13.7 L-3.8 13.55 -6.25 12.2 Q-6.6 11.95 -6.9 11.75 L-7.6 11.25 -8.75 10.1 -8.9 9.9 -9.55 9.25 -10.35 8.45 -11.35 7.3" fill="#d6baba" fill-rule="evenodd" stroke="none"/>
      <path d="M2.45 -14.25 L-2.3 -14.6 Q-8.55 -13.6 -11.55 -9.8 -14.8 -6.05 -15.15 -3.75 -15.4 -2.05 -14.55 0.8 L-14.2 2.05 M2.45 -14.25 L5.4 -13.45 7.55 -12.6 7.9 -12.45 Q8.4 -12.3 9.05 -11.8 L9.85 -11.45 10.2 -11.15 10.35 -11.0 11.35 -10.3 12.85 -8.2 14.5 -4.55 Q15.45 -1.45 15.15 2.35 14.65 9.6 8.55 12.55 2.45 15.85 -3.65 13.7 M-3.8 13.55 L-6.25 12.2" fill="none" stroke="#000000" stroke-linecap="round" stroke-linejoin="round" stroke-opacity="0.3019608" stroke-width="0.05"/>
    </g>
    <g id="sprite55" transform="matrix(1.0, 0.0, 0.0, 1.0, 13.55, 2.85)">
      <use height="46.15" id="_p2" transform="matrix(1.0, 0.0, 0.0, 1.0, -13.55, -2.85)" width="27.4" xlink:href="#sprite56"/>
    </g>
    <g id="sprite56" transform="matrix(1.0, 0.0, 0.0, 1.0, 13.45, 19.25)">
      <use height="46.15" id="_p6" transform="matrix(1.0, 0.0, 0.0, 1.0, -13.45, -19.25)" width="27.4" xlink:href="#sprite57"/>
    </g>
    <g id="sprite57" transform="matrix(1.0, 0.0, 0.0, 1.0, 13.45, 19.25)">
      <use height="37.35" id="_col0" transform="matrix(1.0, 0.0, 0.0, 1.0, -8.4, -18.65)" width="16.75" xlink:href="#sprite37"/>
      <use height="29.5" id="_col3" transform="matrix(1.0, 0.0, 0.0, 1.0, -8.75, -18.95)" width="17.4" xlink:href="#sprite38"/>
      <use height="46.15" id="_p7" transform="matrix(1.0, 0.0, 0.0, 1.0, -13.45, -19.25)" width="27.4" xlink:href="#sprite58"/>
    </g>
    <g id="sprite59" transform="matrix(1.0, 0.0, 0.0, 1.0, 26.3, 11.5)">
      <use height="53.7" id="_p2" transform="matrix(1.0, 0.0, -0.0697, 0.9926, -22.5799, -11.4948)" width="61.3" xlink:href="#sprite60"/>
    </g>
    <g id="sprite60" transform="matrix(1.0, 0.0, 0.0, 1.0, 19.55, 21.1)">
      <use height="53.7" id="_p5" transform="matrix(1.0, 0.0, 0.0, 1.0, -19.55, -21.1)" width="61.3" xlink:href="#sprite61"/>
    </g>
    <g id="sprite61" transform="matrix(1.0, 0.0, 0.0, 1.0, 19.65, 21.1)">
      <use height="22.55" id="_col0" transform="matrix(1.0, 0.0, 0.0, 1.0, -10.7, -20.8)" width="28.0" xlink:href="#sprite62"/>
      <use height="53.7" id="_p7" transform="matrix(1.0, 0.0, 0.0, 1.0, -19.65, -21.1)" width="61.3" xlink:href="#sprite63"/>
    </g>
    <g id="sprite62" transform="matrix(1.0, 0.0, 0.0, 1.0, 10.7, 20.8)">
      <use height="22.55" transform="matrix(1.0, 0.0, 0.0, 1.0, -10.7, -20.8)" width="28.0" xlink:href="#shape15"/>
    </g>
    <g id="shape15" transform="matrix(1.0, 0.0, 0.0, 1.0, 10.7, 20.8)">
      <path d="M-1.05 1.4 Q-2.9 1.1 -4.4 0.4 -6.55 -0.1 -8.2 -1.4 -10.2 -2.4 -10.7 -4.95 L-10.55 -6.1 -10.2 -8.45 Q-9.7 -11.75 -8.7 -14.75 -8.2 -16.45 -6.2 -17.95 -4.2 -19.6 -1.55 -20.45 L2.8 -20.8 3.65 -20.8 Q3.65 -18.95 4.65 -17.3 L4.85 -16.85 5.2 -14.75 4.65 -12.95 Q2.95 -10.1 3.15 -7.1 3.15 -4.1 1.45 -1.9 L-1.05 1.4 M-4.9 -7.45 Q-6.2 -7.1 -5.7 -6.25 -5.4 -6.1 -5.2 -6.45 -5.05 -6.45 -5.05 -6.6 L-4.9 -7.45 -4.9 -9.75 -4.9 -7.45" fill="#efcdaf" fill-rule="evenodd" stroke="none"/>
      <path d="M-1.05 1.4 L1.45 -1.9 Q3.15 -4.1 3.15 -7.1 2.95 -10.1 4.65 -12.95 L5.2 -14.75 4.85 -16.85 4.65 -17.3 Q3.65 -18.95 3.65 -20.8 L4.45 -20.65 8.8 -19.45 9.65 -18.95 Q10.9 -18.15 12.5 -17.8 L13.8 -17.3 14.1 -16.8 Q14.65 -15.9 14.5 -14.75 14.4 -12.55 15.5 -10.1 L17.15 -5.6 Q17.8 -3.75 15.15 -1.9 12.3 -0.1 10.3 0.4 L5.8 1.75 1.8 1.75 0.3 1.75 -0.7 1.6 Q-0.85 1.4 -1.05 1.4 M-4.9 -7.45 L-5.05 -6.6 Q-5.05 -6.45 -5.2 -6.45 -5.4 -6.1 -5.7 -6.25 -6.2 -7.1 -4.9 -7.45" fill="#c6886a" fill-rule="evenodd" stroke="none"/>
      <path d="M3.65 -20.8 L2.8 -20.8 -1.55 -20.45 Q-4.2 -19.6 -6.2 -17.95 -8.2 -16.45 -8.7 -14.75 -9.7 -11.75 -10.2 -8.45 L-10.55 -6.1 -10.7 -4.95 Q-10.2 -2.4 -8.2 -1.4 -6.55 -0.1 -4.4 0.4 -2.9 1.1 -1.05 1.4 M3.65 -20.8 L4.45 -20.65 8.8 -19.45 M12.5 -17.8 L13.8 -17.3 14.1 -16.8 Q14.65 -15.9 14.5 -14.75 14.4 -12.55 15.5 -10.1 L17.15 -5.6 Q17.8 -3.75 15.15 -1.9 12.3 -0.1 10.3 0.4 L5.8 1.75 1.8 1.75 0.3 1.75 -0.7 1.6 M-4.9 -7.45 L-5.05 -6.6 Q-5.05 -6.45 -5.2 -6.45 -5.4 -6.1 -5.7 -6.25 -6.2 -7.1 -4.9 -7.45 L-4.9 -9.75" fill="none" stroke="#000000" stroke-linecap="round" stroke-linejoin="round" stroke-opacity="0.3019608" stroke-width="0.05"/>
    </g>
    <g id="sprite63" transform="matrix(1.0, 0.0, 0.0, 1.0, 23.55, 28.2)">
      <use height="27.8" id="_p1" transform="matrix(1.0, 0.0, 0.0, 1.0, -18.35, -13.8)" width="46.2" xlink:href="#sprite64"/>
    </g>
    <g id="sprite65" transform="matrix(1.0, 0.0, 0.0, 1.0, 26.0, 22.25)">
      <use height="47.7" id="_p2" transform="matrix(1.0, 0.0, 0.0, 1.0, -26.0, -22.25)" width="62.75" xlink:href="#sprite66"/>
    </g>
    <g id="sprite66" transform="matrix(1.0, 0.0, 0.0, 1.0, 8.0, 6.35)">
      <use height="47.7" id="_p5" transform="matrix(1.0, 0.0, 0.0, 1.0, -8.0, -6.35)" width="62.75" xlink:href="#sprite67"/>
    </g>
    <g id="sprite67" transform="matrix(1.0, 0.0, 0.0, 1.0, 8.0, 6.35)">
      <use height="25.5" id="_p7b" transform="matrix(1.0, 0.0, 0.0, 1.0, -8.0, 0.5)" width="17.6" xlink:href="#sprite68"/>
      <use height="35.0" id="_col0" transform="matrix(0.9077, 0.0, 0.0, 0.9077, -2.1503, 0.0158)" width="41.35" xlink:href="#sprite69"/>
      <use height="47.7" id="_p7" transform="matrix(1.0, 0.0, 0.0, 1.0, -4.65, -6.35)" width="59.4" xlink:href="#sprite70"/>
    </g>
    <g id="sprite69" transform="matrix(1.0, 0.0, 0.0, 1.0, 22.2, 17.5)">
      <use height="35.0" transform="matrix(1.0, 0.0, 0.0, 1.0, -22.2, -17.5)" width="41.35" xlink:href="#shape16"/>
    </g>
    <g id="shape16" transform="matrix(1.0, 0.0, 0.0, 1.0, 22.2, 17.5)">
      <path d="M11.7 -16.6 L13.8 -16.15 14.7 -15.8 15.95 -15.1 17.45 -14.15 Q18.35 -13.35 18.7 -12.3 19.2 -10.95 19.15 -9.5 19.05 -7.7 18.55 -6.0 17.75 -3.2 16.25 -0.95 L14.1 2.45 Q12.7 4.5 10.9 6.2 L4.7 14.1 Q2.65 15.75 0.15 16.4 L-1.0 16.7 -2.3 17.0 -4.55 17.3 -6.75 17.5 -6.75 17.45 Q-5.75 14.95 -5.4 12.35 L-4.9 10.55 -4.45 9.4 Q-3.6 7.5 -5.3 6.3 L-5.45 5.95 -5.1 5.75 -4.2 5.55 -1.7 4.65 Q0.75 3.65 2.75 2.0 L4.85 0.35 7.4 -1.6 Q9.35 -3.15 11.15 -4.85 L12.65 -6.55 13.4 -8.0 Q13.6 -8.6 13.4 -9.15 12.4 -12.05 9.4 -12.4 L7.7 -12.15 5.65 -11.3 1.25 -9.2 Q-1.15 -8.1 -3.7 -7.55 L-5.95 -7.5 Q-7.45 -7.85 -8.5 -9.0 L-9.0 -9.95 Q-9.35 -11.15 -8.75 -12.35 L-7.15 -15.5 Q-5.7 -16.35 -3.45 -16.8 L-3.2 -16.85 1.5 -17.5 1.65 -17.5 10.9 -16.7 11.55 -16.6 11.7 -16.6" fill="#c6886a" fill-rule="evenodd" stroke="none"/>
      <path d="M-3.2 -16.85 L-3.45 -16.8 -3.5 -16.8 -3.2 -16.85 M-7.15 -15.5 L-8.75 -12.35 Q-9.35 -11.15 -9.0 -9.95 L-8.5 -9.0 Q-7.45 -7.85 -5.95 -7.5 L-3.7 -7.55 Q-1.15 -8.1 1.25 -9.2 L5.65 -11.3 7.7 -12.15 9.4 -12.4 Q12.4 -12.05 13.4 -9.15 13.6 -8.6 13.4 -8.0 L12.65 -6.55 11.15 -4.85 Q9.35 -3.15 7.4 -1.6 L4.85 0.35 2.75 2.0 Q0.75 3.65 -1.7 4.65 L-4.2 5.55 -5.1 5.75 -5.45 5.95 -5.3 6.3 Q-3.6 7.5 -4.45 9.4 L-4.9 10.55 -5.4 12.35 Q-5.75 14.95 -6.75 17.45 L-9.5 17.3 Q-12.35 17.0 -14.95 15.85 -18.15 14.45 -19.85 11.4 L-19.65 6.85 -18.4 0.1 -18.3 -0.25 -18.3 -0.3 -18.75 -1.7 -18.7 -2.95 -18.75 -1.7 -18.9 -2.15 -18.7 -2.95 -18.65 -3.2 -18.6 -3.4 -17.9 -5.55 -16.9 -7.45 Q-16.15 -8.7 -14.9 -9.55 L-14.1 -10.1 -14.85 -9.55 Q-16.75 -8.2 -17.55 -6.15 L-18.6 -3.4 -17.55 -6.15 Q-16.75 -8.2 -14.85 -9.55 L-14.1 -10.1 -13.65 -10.5 -12.0 -11.9 -10.95 -12.85 -8.25 -14.8 -8.0 -14.95 -7.15 -15.5 -7.75 -15.05 -8.25 -14.8 -7.75 -15.05 -7.15 -15.5 M-12.45 1.15 L-15.95 0.65 -18.3 -0.25 -15.95 0.65 -12.45 1.15 M-11.0 0.05 L-9.7 2.8 Q-9.0 4.4 -7.3 5.0 L-5.1 5.75 -7.3 5.0 Q-9.0 4.4 -9.7 2.8 L-11.0 0.05" fill="#efcdaf" fill-rule="evenodd" stroke="none"/>
      <path d="M4.7 14.1 L10.9 6.2 Q12.7 4.5 14.1 2.45 L16.25 -0.95 Q17.75 -3.2 18.55 -6.0 19.05 -7.7 19.15 -9.5 19.2 -10.95 18.7 -12.3 18.35 -13.35 17.45 -14.15 L15.95 -15.1 14.7 -15.8 13.8 -16.15 11.7 -16.6 M11.55 -16.6 L10.9 -16.7 1.65 -17.5 1.5 -17.5 -3.2 -16.85 -3.45 -16.8 Q-5.7 -16.35 -7.15 -15.5 M-4.2 5.55 L-5.1 5.75 -7.3 5.0 Q-9.0 4.4 -9.7 2.8 L-11.0 0.05 M-6.75 17.45 L-6.75 17.5 M-8.25 -14.8 L-7.75 -15.05 -7.15 -15.5 M-18.6 -3.4 L-17.55 -6.15 Q-16.75 -8.2 -14.85 -9.55 L-14.1 -10.1 -13.65 -10.5 -12.0 -11.9 -10.95 -12.85 -8.25 -14.8 M-18.6 -3.4 L-18.65 -3.2 -18.7 -2.95 -18.75 -1.7 -18.3 -0.3 -18.3 -0.25 -15.95 0.65 -12.45 1.15 M-19.85 11.4 L-19.65 6.85 -18.4 0.1 -18.3 -0.25" fill="none" stroke="#000000" stroke-linecap="round" stroke-linejoin="round" stroke-opacity="0.3019608" stroke-width="0.05"/>
      <path d="M4.65 -3.45 Q2.1 -2.25 -0.9 -1.0 -3.95 0.25 -5.2 0.45 L-10.25 0.65 -11.1 0.7 -11.95 0.25 -14.7 -0.95 -15.1 -1.1 -16.35 -1.5 -19.35 -2.4 Q-20.0 -2.65 -22.1 -4.4 -21.8 -6.35 -19.9 -7.85 -16.35 -10.65 -12.0 -11.8 L-11.45 -10.5 Q-11.0 -9.35 -9.95 -8.6 -6.85 -6.1 -3.45 -5.1 L0.25 -3.9 Q1.8 -3.5 5.2 -3.9 L4.05 -3.4 4.55 -3.45 4.65 -3.45 M-12.65 -0.1 L-12.2 0.1 -12.45 0.0 -12.65 -0.1" fill="#efcdaf" fill-rule="evenodd" stroke="none"/>
      <path d="M4.65 -3.45 L5.05 -3.45 5.2 -3.55 5.3 -3.5 5.1 -0.9 4.35 2.4 Q3.8 4.1 2.5 5.4 -2.2 9.95 -7.85 8.0 -12.2 6.55 -16.0 3.95 L-17.7 3.65 Q-21.95 1.75 -22.2 -2.95 L-22.2 -3.0 -22.2 -3.5 -22.1 -4.4 Q-20.0 -2.65 -19.35 -2.4 L-16.35 -1.5 -15.1 -1.1 -14.7 -0.95 -11.95 0.25 -11.1 0.7 -10.25 0.65 -5.2 0.45 Q-3.95 0.25 -0.9 -1.0 2.1 -2.25 4.65 -3.45 M-12.65 -0.1 L-12.45 0.0 -12.2 0.1 -12.65 -0.1" fill="#c6886a" fill-rule="evenodd" stroke="none"/>
      <path d="M-22.1 -4.4 L-22.2 -3.5 -22.2 -3.0 -22.2 -2.95 Q-21.95 1.75 -17.7 3.65 L-16.0 3.95 Q-12.2 6.55 -7.85 8.0 -2.2 9.95 2.5 5.4 3.8 4.1 4.35 2.4 L5.1 -0.9 5.3 -3.5 M-12.0 -11.8 Q-16.35 -10.65 -19.9 -7.85 -21.8 -6.35 -22.1 -4.4 M5.2 -3.9 L5.2 -3.55" fill="none" stroke="#000000" stroke-linecap="round" stroke-linejoin="round" stroke-opacity="0.3019608" stroke-width="0.05"/>
    </g>
    <g id="sprite70" transform="matrix(1.0, 0.0, 0.0, 1.0, 21.25, 21.5)">
      <use height="32.9" id="_p1" transform="matrix(1.0, 0.0, 0.0, 1.0, -21.25, -15.9)" width="35.4" xlink:href="#sprite71"/>
    </g>
    <g id="sprite71" transform="matrix(1.0, 0.0, 0.0, 1.0, 21.25, 15.9)">
      <use height="26.0" transform="matrix(1.0, 0.0, 0.0, 1.0, -21.25, -15.9)" width="24.3" xlink:href="#shape17"/>
      <use height="18.6" id="_col2" transform="matrix(1.0, 0.0, 0.0, 1.0, -18.45, -8.95)" width="18.1" xlink:href="#sprite72"/>
      <use height="32.35" transform="matrix(1.0, 0.0, 0.0, 1.0, -7.6, -15.35)" width="21.75" xlink:href="#shape19"/>
    </g>
    <g id="shape17" transform="matrix(1.0, 0.0, 0.0, 1.0, 21.25, 15.9)">
      <path d="M-8.25 -9.4 L-11.45 -10.3 -10.65 -10.8 -9.8 -11.25 -9.7 -11.3 -9.55 -11.4 Q-2.7 -15.3 3.05 -15.9 1.35 -14.5 -1.05 -13.55 -3.45 -12.6 -5.55 -11.15 L-6.8 -10.35 -8.25 -9.4 M-19.5 -1.2 L-17.7 -0.9 -16.95 -0.65 -17.05 -0.2 -17.1 2.9 -16.85 6.25 -16.45 10.1 Q-18.3 7.65 -18.85 4.55 L-19.45 0.3 -19.5 -0.3 -19.5 -1.2 M-7.95 -10.5 L-7.95 -10.65 -8.25 -10.55 -7.95 -10.5" fill="#764701" fill-rule="evenodd" stroke="none"/>
      <path d="M-10.65 -10.8 L-11.45 -10.3 -8.25 -9.4 -9.85 -8.35 -14.25 -5.25 Q-16.35 -3.6 -16.95 -0.75 L-17.05 -0.2 -16.95 -0.65 -17.7 -0.9 -19.5 -1.2 -19.15 -3.65 Q-18.8 -5.3 -17.25 -6.8 -16.75 -7.3 -10.65 -10.8 M-7.95 -10.5 L-8.25 -10.55 -7.95 -10.65 -7.95 -10.5" fill="#996600" fill-rule="evenodd" stroke="none"/>
      <path d="M-8.25 -9.4 L-6.8 -10.35 -5.55 -11.15 Q-3.45 -12.6 -1.05 -13.55 1.35 -14.5 3.05 -15.9 -2.7 -15.3 -9.55 -11.4 M-9.7 -11.3 L-9.8 -11.25 -10.65 -10.8 Q-16.75 -7.3 -17.25 -6.8 -18.8 -5.3 -19.15 -3.65 L-19.5 -1.2 -19.5 -0.3 -19.45 0.3 -18.85 4.55 Q-18.3 7.65 -16.45 10.1 L-16.85 6.25 -17.1 2.9 -17.05 -0.2 -16.95 -0.75 Q-16.35 -3.6 -14.25 -5.25 L-9.85 -8.35 -8.25 -9.4 Z" fill="none" stroke="#000000" stroke-linecap="round" stroke-linejoin="round" stroke-opacity="0.4" stroke-width="0.05"/>
      <path d="M-17.1 -8.7 L-16.75 -9.2 Q-15.95 -10.15 -15.1 -10.15 L-14.45 -9.95 -13.55 -9.45 Q-13.6 -9.05 -15.1 -8.15 L-15.45 -7.9 Q-16.55 -8.6 -17.1 -8.7 M-9.75 -13.95 Q-9.05 -14.75 -7.95 -14.75 L-6.95 -14.65 Q-6.6 -14.45 -6.25 -13.45 -7.1 -12.35 -9.65 -11.45 L-10.0 -11.7 -10.35 -12.3 Q-10.35 -13.2 -9.75 -13.95 M-21.15 2.05 L-21.25 0.8 Q-21.25 0.05 -20.6 -0.35 -20.15 -0.6 -19.4 -0.15 L-19.45 0.15 -19.15 2.65 -19.3 1.75 -19.7 1.75 -21.15 2.05" fill="#ffffcc" fill-rule="evenodd" stroke="none"/>
      <path d="M-17.1 -8.7 Q-16.55 -8.6 -15.45 -7.9 L-16.8 -7.1 -17.2 -7.2 -17.4 -7.9 -17.1 -8.7 M-21.15 2.05 L-19.7 1.75 -19.3 1.75 -19.15 2.65 -19.05 3.75 -19.1 4.25 -19.6 4.35 Q-20.1 4.35 -20.6 3.55 L-21.15 2.05" fill="#bfb695" fill-rule="evenodd" stroke="none"/>
      <path d="M-9.75 -13.95 Q-10.35 -13.2 -10.35 -12.3 L-10.0 -11.7 -9.65 -11.45 Q-7.1 -12.35 -6.25 -13.45 -6.6 -14.45 -6.95 -14.65 L-7.95 -14.75 Q-9.05 -14.75 -9.75 -13.95 M-15.45 -7.9 L-15.1 -8.15 Q-13.6 -9.05 -13.55 -9.45 L-14.45 -9.95 -15.1 -10.15 Q-15.95 -10.15 -16.75 -9.2 L-17.1 -8.7 M-15.45 -7.9 L-16.8 -7.1 -17.2 -7.2 -17.4 -7.9 -17.1 -8.7 M-19.15 2.65 L-19.45 0.15 -19.4 -0.15 Q-20.15 -0.6 -20.6 -0.35 -21.25 0.05 -21.25 0.8 L-21.15 2.05 M-19.15 2.65 L-19.05 3.75 -19.1 4.25 -19.6 4.35 Q-20.1 4.35 -20.6 3.55 L-21.15 2.05" fill="none" stroke="#000000" stroke-linecap="round" stroke-linejoin="round" stroke-opacity="0.4" stroke-width="0.05"/>
    </g>
    <g id="sprite72" transform="matrix(1.0, 0.0, 0.0, 1.0, 9.05, 9.25)">
      <use height="18.6" transform="matrix(1.0, 0.0, 0.0, 1.0, -9.05, -9.25)" width="18.1" xlink:href="#shape18"/>
    </g>
    <g id="shape18" transform="matrix(1.0, 0.0, 0.0, 1.0, 9.05, 9.25)">
      <path d="M-8.85 -3.05 Q-8.35 -5.6 -6.45 -6.95 L-3.4 -8.95 -2.25 -9.25 0.35 -8.95 3.7 -8.3 9.05 -7.5 Q6.0 -4.85 4.75 -3.0 3.5 -1.15 2.95 1.05 L0.95 -0.25 -2.8 -2.55 -3.8 -3.0 -7.5 -3.2 -8.85 -3.05" fill="#ffffff" fill-rule="evenodd" stroke="none"/>
      <path d="M2.95 1.05 L2.9 1.35 2.8 1.8 Q2.55 3.1 2.55 4.5 2.55 6.55 2.95 9.25 L2.9 9.3 -3.65 4.8 Q-5.25 3.7 -7.65 3.6 -9.05 2.15 -9.05 0.6 L-9.05 -1.4 -9.0 -2.05 -8.85 -3.05 -7.5 -3.2 -3.8 -3.0 -2.8 -2.55 0.95 -0.25 2.95 1.05" fill="#d6baba" fill-rule="evenodd" stroke="none"/>
      <path d="M-8.85 -3.05 Q-8.35 -5.6 -6.45 -6.95 L-3.4 -8.95 -2.25 -9.25 0.35 -8.95 3.7 -8.3 9.05 -7.5 Q6.0 -4.85 4.75 -3.0 3.5 -1.15 2.95 1.05 L2.9 1.35 2.8 1.8 Q2.55 3.1 2.55 4.5 2.55 6.55 2.95 9.25 L3.0 9.35 2.9 9.3 -3.65 4.8 Q-5.25 3.7 -7.65 3.6 -9.05 2.15 -9.05 0.6 L-9.05 -1.4 -9.0 -2.05 -8.85 -3.05 Z" fill="none" stroke="#000000" stroke-linecap="round" stroke-linejoin="round" stroke-opacity="0.4" stroke-width="0.05"/>
    </g>
    <g id="shape19" transform="matrix(1.0, 0.0, 0.0, 1.0, 7.6, 15.35)">
      <path d="M-0.55 -9.75 L0.95 -10.95 2.1 -11.85 Q3.9 -13.2 6.2 -14.15 8.85 -15.4 11.7 -15.35 L13.4 -14.65 14.15 -14.25 5.6 -6.65 4.55 -5.6 2.7 -7.3 -0.55 -9.75 M-6.8 2.05 Q-5.05 2.85 -3.25 4.7 L-2.35 5.7 -2.55 7.1 Q-2.7 8.85 -1.9 10.45 -0.3 13.55 1.6 16.2 0.0 17.1 -1.95 17.0 -3.55 15.05 -4.95 12.6 L-6.25 10.0 -6.9 7.65 -6.95 7.1 -6.8 2.05" fill="#764701" fill-rule="evenodd" stroke="none"/>
      <path d="M-0.55 -9.75 L2.7 -7.3 4.55 -5.6 2.9 -3.55 Q-0.5 0.5 -2.35 5.7 L-3.25 4.7 Q-5.05 2.85 -6.8 2.05 L-5.85 -0.1 Q-4.05 -5.45 -0.55 -9.75" fill="#996600" fill-rule="evenodd" stroke="none"/>
      <path d="M5.6 -6.65 L14.15 -14.25 13.4 -14.65 11.7 -15.35 Q8.85 -15.4 6.2 -14.15 3.9 -13.2 2.1 -11.85 L0.95 -10.95 -0.55 -9.75 Q-4.05 -5.45 -5.85 -0.1 L-6.8 2.05 M-2.35 5.7 Q-0.5 0.5 2.9 -3.55 L4.55 -5.6 M-2.35 5.7 L-2.55 7.1 Q-2.7 8.85 -1.9 10.45 -0.3 13.55 1.6 16.2 0.0 17.1 -1.95 17.0 -3.55 15.05 -4.95 12.6 L-6.25 10.0 -6.9 7.65 -6.95 7.1 -6.8 2.05" fill="none" stroke="#000000" stroke-linecap="round" stroke-linejoin="round" stroke-opacity="0.4" stroke-width="0.05"/>
      <path d="M3.1 -9.65 Q2.55 -10.4 2.55 -11.3 L2.8 -12.25 Q3.05 -13.0 3.3 -13.0 L3.75 -13.1 4.75 -13.35 4.8 -13.35 5.45 -11.7 Q5.45 -10.75 3.85 -10.0 L3.1 -9.65 M-2.4 -2.2 Q-3.1 -2.95 -3.1 -4.6 L-2.8 -5.3 -1.45 -6.0 Q-0.45 -6.35 0.7 -5.5 1.85 -4.7 1.7 -3.65 1.45 -5.1 -0.45 -3.3 L-2.4 -2.2 M-7.1 8.6 L-7.4 8.1 Q-8.0 6.45 -6.9 5.45 L-5.4 5.25 Q-3.6 4.8 -3.1 6.7 L-3.05 6.8 -4.75 6.65 Q-6.9 6.85 -7.1 8.6" fill="#ffffcc" fill-rule="evenodd" stroke="none"/>
      <path d="M4.8 -13.35 L5.25 -13.3 Q5.75 -13.05 6.2 -12.85 L6.35 -12.75 6.6 -12.6 Q7.55 -11.8 7.55 -10.95 7.55 -10.0 6.95 -9.3 6.25 -8.45 5.0 -8.45 4.55 -8.45 4.0 -8.85 L3.55 -9.2 3.1 -9.65 3.85 -10.0 Q5.45 -10.75 5.45 -11.7 L4.8 -13.35 M1.7 -3.65 L1.7 -3.45 Q1.5 -2.55 0.85 -2.1 0.2 -1.6 -0.8 -1.6 -1.85 -1.6 -2.4 -2.2 L-0.45 -3.3 Q1.45 -5.1 1.7 -3.65 M-3.05 6.8 Q-2.8 7.95 -3.25 9.15 L-3.7 9.65 Q-5.5 10.2 -6.8 8.95 L-7.1 8.6 Q-6.9 6.85 -4.75 6.65 L-3.05 6.8" fill="#bfb695" fill-rule="evenodd" stroke="none"/>
      <path d="M4.8 -13.35 L5.25 -13.3 Q5.75 -13.05 6.2 -12.85 M6.35 -12.75 L6.6 -12.6 Q7.55 -11.8 7.55 -10.95 7.55 -10.0 6.95 -9.3 6.25 -8.45 5.0 -8.45 4.55 -8.45 4.0 -8.85 L3.55 -9.2 3.1 -9.65 Q2.55 -10.4 2.55 -11.3 L2.8 -12.25 Q3.05 -13.0 3.3 -13.0 L3.75 -13.1 4.75 -13.35 4.8 -13.35 M-2.4 -2.2 Q-3.1 -2.95 -3.1 -4.6 L-2.8 -5.3 -1.45 -6.0 Q-0.45 -6.35 0.7 -5.5 1.85 -4.7 1.7 -3.65 L1.7 -3.45 Q1.5 -2.55 0.85 -2.1 0.2 -1.6 -0.8 -1.6 -1.85 -1.6 -2.4 -2.2 M-7.1 8.6 L-7.4 8.1 Q-8.0 6.45 -6.9 5.45 L-5.4 5.25 Q-3.6 4.8 -3.1 6.7 L-3.05 6.8 Q-2.8 7.95 -3.25 9.15 L-3.7 9.65 Q-5.5 10.2 -6.8 8.95 L-7.1 8.6" fill="none" stroke="#000000" stroke-linecap="round" stroke-linejoin="round" stroke-opacity="0.4" stroke-width="0.05"/>
    </g>
    <g id="sprite73" transform="matrix(1.0, 0.0, 0.0, 1.0, 49.55, 50.0)">
      <use height="113.0" id="_p3" transform="matrix(1.0, 0.0, 0.0, 1.0, -49.55, -50.0)" width="124.15" xlink:href="#sprite74"/>
    </g>
    <g id="sprite74" transform="matrix(1.0, 0.0, 0.0, 1.0, 49.55, 50.0)">
      <use height="63.95" id="_col0a" transform="matrix(1.0, 0.0, 0.0, 1.0, -31.35, -25.9)" width="63.3" xlink:href="#sprite75"/>
      <use height="10.05" transform="matrix(1.0, 0.0, 0.0, 1.0, -26.4, 24.0)" width="24.85" xlink:href="#sprite76"/>
      <use height="28.7" transform="matrix(0.9958, 0.088, 0.0, 1.0, -32.563, 2.769)" width="42.9" xlink:href="#sprite77"/>
      <use height="54.9" id="_col1" transform="matrix(1.0, 0.0, 0.0, 1.0, -29.5, -29.9)" width="65.15" xlink:href="#sprite82"/>
      <use height="19.0" id="_col0c" transform="matrix(1.0, 0.0, 0.0, 1.0, 11.4, 11.95)" width="20.95" xlink:href="#sprite83"/>
      <use height="74.85" id="_p4" transform="matrix(1.0, 0.0, 0.0, 1.0, -39.7, -26.3)" width="61.3" xlink:href="#sprite84"/>
    </g>
    <g id="sprite75" transform="matrix(1.0, 0.0, 0.0, 1.0, 31.35, 31.95)">
      <use height="63.95" transform="matrix(1.0, 0.0, 0.0, 1.0, -31.35, -31.95)" width="63.3" xlink:href="#shape20"/>
    </g>
    <g id="shape20" transform="matrix(1.0, 0.0, 0.0, 1.0, 31.35, 31.95)">
      <path d="M-19.5 28.2 L-22.1 26.65 Q-27.15 23.0 -26.25 17.45 L-26.1 16.25 Q-25.6 14.5 -26.1 13.1 L-26.25 12.75 -26.8 12.05 -26.95 11.9 Q-28.55 9.8 -29.4 7.55 -30.95 3.9 -31.3 0.45 -31.65 -8.75 -27.5 -17.1 -23.3 -26.45 -14.45 -29.55 -4.75 -32.85 5.15 -31.65 L5.85 -31.6 7.9 -29.9 Q13.45 -25.9 12.95 -19.0 12.25 -10.65 9.3 -2.7 7.55 1.65 3.4 3.55 -5.3 7.9 -13.95 11.7 L-15.0 11.55 Q-17.95 9.45 -19.35 11.9 -20.55 11.55 -21.6 12.25 L-22.45 13.1 -23.15 12.95 -25.4 12.05 -25.6 12.05 -26.25 11.7 -26.25 11.9 -26.1 12.05 -25.6 12.75 -25.4 13.1 Q-24.9 14.5 -25.4 16.25 L-25.6 17.45 -25.05 17.6 -21.6 18.15 -15.15 19.7 Q-13.45 20.05 -11.85 20.9 -10.85 21.45 -9.95 22.3 -8.9 23.0 -7.9 24.05 L-7.55 24.2 -7.9 24.4 Q-12.9 28.4 -19.5 28.2" fill="#efcdaf" fill-rule="evenodd" stroke="none"/>
      <path d="M-19.5 28.2 Q-12.9 28.4 -7.9 24.4 L-7.55 24.2 -7.9 24.05 Q-8.9 23.0 -9.95 22.3 -10.85 21.45 -11.85 20.9 -13.45 20.05 -15.15 19.7 L-21.6 18.15 -25.05 17.6 -25.6 17.45 -25.4 16.25 Q-24.9 14.5 -25.4 13.1 L-25.6 12.75 -26.1 12.05 -26.25 11.9 -26.25 11.7 -25.6 12.05 -25.4 12.05 -23.15 12.95 -22.45 13.1 -21.6 12.25 Q-20.55 11.55 -19.35 11.9 -17.95 9.45 -15.0 11.55 L-13.95 11.7 Q-5.3 7.9 3.4 3.55 7.55 1.65 9.3 -2.7 12.25 -10.65 12.95 -19.0 13.45 -25.9 7.9 -29.9 L5.85 -31.6 5.8 -31.65 7.55 -31.5 10.7 -30.45 12.95 -29.55 Q15.55 -28.55 18.65 -26.8 27.85 -21.75 30.45 -12.55 32.9 -3.55 31.35 0.8 29.95 4.95 28.55 6.15 27.15 7.2 26.8 8.95 25.95 11.7 24.55 14.35 L22.65 17.45 18.15 22.15 16.75 23.35 16.6 23.35 12.75 25.8 Q7.2 28.9 2.0 30.3 -3.9 32.0 -9.45 32.0 L-10.15 32.0 -13.8 31.0 -17.4 29.4 -19.5 28.2" fill="#c6886a" fill-rule="evenodd" stroke="none"/>
      <path d="M5.85 -31.6 L5.15 -31.65 Q-4.75 -32.85 -14.45 -29.55 -23.3 -26.45 -27.5 -17.1 -31.65 -8.75 -31.3 0.45 -30.95 3.9 -29.4 7.55 -28.55 9.8 -26.95 11.9 L-26.8 12.05 -26.25 12.75 -26.1 13.1 Q-25.6 14.5 -26.1 16.25 L-26.25 17.45 Q-27.15 23.0 -22.1 26.65 L-19.5 28.2 M5.85 -31.6 L5.8 -31.65 7.55 -31.5 10.7 -30.45 12.95 -29.55 Q15.55 -28.55 18.65 -26.8 27.85 -21.75 30.45 -12.55 32.9 -3.55 31.35 0.8 29.95 4.95 28.55 6.15 27.15 7.2 26.8 8.95 25.95 11.7 24.55 14.35 L22.65 17.45 18.15 22.15 16.75 23.35 16.6 23.35 12.75 25.8 Q7.2 28.9 2.0 30.3 -3.9 32.0 -9.45 32.0 L-10.15 32.0 -13.8 31.0 -17.4 29.4 -19.5 28.2" fill="none" stroke="#000000" stroke-linecap="round" stroke-linejoin="round" stroke-opacity="0.3019608" stroke-width="0.05"/>
    </g>
    <g id="sprite76" transform="matrix(1.0, 0.0, 0.0, 1.0, 12.45, 5.0)">
      <use height="10.05" transform="matrix(1.0, 0.0, 0.0, 1.0, -12.45, -5.0)" width="24.85" xlink:href="#shape21"/>
    </g>
    <g id="shape21" transform="matrix(1.0, 0.0, 0.0, 1.0, 12.45, 5.0)">
      <path d="M-10.5 -3.95 L-10.55 -2.4 Q-10.55 -1.85 -11.15 -1.5 -11.8 -1.2 -12.25 -2.3 L-12.45 -3.35 Q-12.45 -5.05 -11.4 -5.0 -10.4 -4.95 -10.5 -3.95 M8.2 5.05 Q5.4 5.05 3.8 4.25 2.55 3.55 2.55 2.7 2.55 -0.05 7.5 0.3 12.4 0.65 12.4 2.85 12.4 3.5 11.75 4.1 10.65 5.05 8.2 5.05" fill="#f29595" fill-opacity="0.5294118" fill-rule="evenodd" stroke="none"/>
    </g>
    <g id="sprite77" transform="matrix(1.0, 0.0, 0.0, 1.0, 20.8, 22.05)">
      <use height="6.05" id="yeux" transform="matrix(3.5469, 0.6759, 0.0, 3.8129, -7.3594, -22.0349)" width="8.3" xlink:href="#sprite78"/>
      <use height="6.05" transform="matrix(-0.7089, 0.0624, 0.9139, 3.339, -14.9276, -20.8291)" width="8.3" xlink:href="#sprite78"/>
    </g>
    <g id="sprite78" transform="matrix(1.0, 0.0, 0.0, 1.0, 3.4, 5.95)">
      <use height="6.05" transform="matrix(1.0, 0.0, 0.0, 1.0, -3.4, -5.95)" width="8.3" xlink:href="#sprite79"/>
    </g>
    <g id="sprite79" transform="matrix(1.0, 0.0, 0.0, 1.0, 3.65, 3.45)">
      <use height="3.95" transform="matrix(1.0, 0.0, 0.0, 1.0, -3.35, -3.45)" width="7.75" xlink:href="#sprite80"/>
      <use height="3.8" transform="matrix(1.0, 0.0, 0.0, 1.0, -2.85, -1.2)" width="6.4" xlink:href="#sprite81"/>
    </g>
    <g id="sprite80" transform="matrix(1.0, 0.0, 0.0, 1.0, 3.85, 2.2)">
      <use height="1.45" transform="matrix(1.0, 0.0, 0.0, 1.0, -2.45, -2.2)" width="4.45" xlink:href="#shape22"/>
    </g>
    <g id="shape22" transform="matrix(1.0, 0.0, 0.0, 1.0, 2.45, 2.2)">
      <path d="M-2.25 -0.95 L-1.35 -1.5 -0.15 -1.9 1.25 -1.95 1.8 -1.85" fill="none" stroke="#000000" stroke-linecap="round" stroke-linejoin="round" stroke-opacity="0.5019608" stroke-width="0.4"/>
    </g>
    <g id="sprite81" transform="matrix(1.0, 0.0, 0.0, 1.0, 3.2, 2.15)">
      <use height="3.45" transform="matrix(1.0, 0.0, 0.0, 1.0, -3.0, -2.15)" width="5.5" xlink:href="#shape23"/>
    </g>
    <g id="shape23" transform="matrix(1.0, 0.0, 0.0, 1.0, 3.0, 2.15)">
      <path d="M0.5 0.75 L0.2 0.85 0.05 0.9 -1.0 1.1 -1.1 1.1 -1.5 0.9 -1.6 0.75 -1.7 0.5 -1.8 0.1 -1.65 -0.65 -0.8 -0.95 -0.15 -1.2 0.5 -0.5 0.6 -0.05 0.55 0.65 0.5 0.75 M0.05 0.4 L0.0 0.35 -1.2 0.6 -1.3 0.7 -0.45 0.85 0.05 0.4 M-0.2 -0.05 L-0.3 -0.15 -0.6 0.0 -1.05 0.4 -0.9 0.35 -0.2 0.15 -0.2 0.1 -0.2 -0.05" fill="#096f6f" fill-rule="evenodd" stroke="none"/>
      <path d="M1.8 -0.75 L1.8 -0.45 1.75 -0.2 1.6 0.0 1.3 0.4 1.1 0.5 0.5 0.75 0.55 0.65 0.6 -0.05 0.5 -0.5 -0.15 -1.2 1.6 -1.05 1.8 -0.75 M-1.65 -0.65 L-1.8 0.1 -1.7 0.5 -1.6 0.75 -1.5 0.9 -1.1 1.1 -1.0 1.1 -2.35 1.2 -2.5 1.2 -2.55 1.1 -2.6 0.55 -2.35 0.2 -1.7 -0.55 -1.65 -0.65" fill="#fbfbfb" fill-rule="evenodd" stroke="none"/>
      <path d="M0.05 0.4 L-0.45 0.85 -1.3 0.7 -1.2 0.6 0.0 0.35 0.05 0.4" fill="#00ffff" fill-rule="evenodd" stroke="none"/>
      <path d="M-0.2 -0.05 L-0.2 0.1 -0.2 0.15 -0.9 0.35 -1.05 0.4 -0.6 0.0 -0.3 -0.15 -0.2 -0.05" fill="#054746" fill-rule="evenodd" stroke="none"/>
      <path d="M0.5 0.75 L0.55 0.65 0.6 -0.05 0.5 -0.5 -0.15 -1.2 M-1.65 -0.65 L-1.8 0.1 -1.7 0.5 -1.6 0.75 -1.5 0.9 -1.1 1.1 -1.0 1.1" fill="none" stroke="#000000" stroke-linecap="round" stroke-linejoin="round" stroke-opacity="0.4" stroke-width="0.05"/>
      <path d="M0.3 -2.05 L0.2 -1.65 M0.05 0.9 L0.35 1.15 M-2.15 -0.6 L-1.7 -0.55 M-0.8 -0.95 L-1.1 -1.5 M-2.5 1.2 L-2.55 1.1 -2.6 0.55 M-2.35 0.2 L-2.9 0.0" fill="none" stroke="#000000" stroke-linecap="round" stroke-linejoin="round" stroke-opacity="0.5019608" stroke-width="0.2"/>
      <path d="M1.8 -0.75 L1.8 -0.45 M1.8 -0.75 Q1.8 -1.35 2.2 -1.65 M-0.15 -1.2 L1.6 -1.05 1.8 -0.75 M-0.15 -1.2 L-0.8 -0.95 -1.65 -0.65 M-1.7 -0.55 L-1.65 -0.65 M-2.6 0.55 L-2.35 0.2 -1.7 -0.55" fill="none" stroke="#000000" stroke-linecap="round" stroke-linejoin="round" stroke-opacity="0.5019608" stroke-width="0.6000000000000001"/>
      <path d="M1.3 0.4 L1.1 0.5" fill="none" stroke="#000000" stroke-linecap="round" stroke-linejoin="round" stroke-opacity="0.3529412" stroke-width="0.2"/>
      <path d="M1.6 0.0 L1.3 0.4 M1.1 0.5 L0.5 0.75 0.2 0.85 0.05 0.9 M-1.0 1.1 L0.05 0.9" fill="none" stroke="#000000" stroke-linecap="round" stroke-linejoin="round" stroke-opacity="0.3529412" stroke-width="0.4"/>
    </g>
    <g id="sprite82" transform="matrix(1.0, 0.0, 0.0, 1.0, 27.65, 27.4)">
      <use height="54.9" transform="matrix(1.0, 0.0, 0.0, 1.0, -27.65, -27.4)" width="65.15" xlink:href="#shape24"/>
    </g>
    <g id="shape24" transform="matrix(1.0, 0.0, 0.0, 1.0, 27.65, 27.4)">
      <path d="M-3.85 -26.7 L-3.45 -26.7 -0.6 -27.05 2.8 -27.4 5.9 -27.4 11.45 -26.45 16.3 -25.1 19.8 -23.95 Q22.45 -23.05 25.0 -21.65 L24.85 -20.95 22.5 -15.5 15.1 -5.95 15.7 -7.05 Q16.95 -9.75 17.5 -12.65 L17.8 -14.6 15.9 -11.8 Q12.6 -6.95 8.5 -3.2 L8.4 -3.1 7.65 -2.4 6.25 -1.1 7.8 -0.4 8.7 1.75 Q6.1 0.15 2.55 -0.75 L1.0 -1.0 -3.95 -1.8 -16.2 -3.85 Q-25.4 -5.45 -27.65 -7.6 L-27.65 -8.35 -27.5 -9.15 -26.85 -10.85 -25.85 -12.55 -25.2 -13.65 -23.75 -16.1 Q-22.15 -18.5 -19.65 -20.15 -17.55 -21.5 -15.35 -22.65 L-12.1 -24.35 Q-10.85 -25.0 -9.2 -25.35 L-3.85 -26.7 -5.5 -26.15 -9.9 -23.55 Q-12.3 -21.85 -14.3 -19.65 -12.3 -21.85 -9.9 -23.55 L-5.5 -26.15 -3.85 -26.7 M-19.0 -13.9 Q-17.6 -16.35 -15.6 -18.35 L-14.3 -19.65 -15.6 -18.35 Q-17.6 -16.35 -19.0 -13.9 M4.65 -18.2 L6.15 -19.6 8.55 -21.7 Q10.5 -23.35 12.2 -25.45 10.5 -23.35 8.55 -21.7 L6.15 -19.6 4.65 -18.2 -2.4 -11.9 4.65 -18.2 M26.0 -21.0 L25.2 -21.45 25.0 -21.65 26.0 -21.0" fill="#ffffff" fill-rule="evenodd" stroke="none"/>
      <path d="M25.2 -21.45 L24.85 -20.95 25.0 -21.65 25.2 -21.45" fill="#d5891a" fill-rule="evenodd" stroke="none"/>
      <path d="M8.7 1.75 L7.8 -0.4 6.25 -1.1 7.65 -2.4 8.4 -3.1 8.5 -3.2 Q12.6 -6.95 15.9 -11.8 L17.8 -14.6 17.5 -12.65 Q16.95 -9.75 15.7 -7.05 L15.1 -5.95 22.5 -15.5 Q21.75 -13.15 20.2 -11.0 L19.05 -9.4 17.85 -8.0 Q16.15 -5.9 13.85 -4.35 16.15 -5.9 17.85 -8.0 L19.05 -9.4 20.2 -11.0 Q21.75 -13.15 22.5 -15.5 L24.85 -20.95 25.2 -21.45 26.0 -21.0 26.1 -20.9 27.45 -19.75 30.9 -16.2 33.85 -12.25 35.45 -8.15 36.85 -3.25 Q37.55 0.05 37.5 3.3 37.4 6.25 36.65 9.2 L35.65 13.15 Q34.05 19.8 28.95 24.2 L28.4 24.65 27.1 25.45 Q25.5 26.25 23.95 26.65 L23.2 27.2 20.7 27.5 Q18.95 27.4 17.45 26.65 L16.3 25.7 Q15.5 24.75 15.35 23.55 L15.3 22.9 Q16.2 13.15 13.9 8.8 11.55 4.45 8.7 1.75 M32.95 11.35 L34.35 9.3 Q36.35 6.6 37.5 3.3 36.35 6.6 34.35 9.3 L32.95 11.35 29.7 14.4 32.95 11.35 M29.15 0.7 L31.15 -3.25 31.55 -4.35 33.05 -9.3 33.85 -12.25 33.05 -9.3 31.55 -4.35 31.15 -3.25 29.15 0.7 28.95 0.95 26.35 4.0 23.2 7.0 26.35 4.0 28.95 0.95 29.15 0.7" fill="#d6baba" fill-rule="evenodd" stroke="none"/>
      <path d="M25.0 -21.65 Q22.45 -23.05 19.8 -23.95 L16.3 -25.1 11.45 -26.45 5.9 -27.4 2.8 -27.4 -0.6 -27.05 -3.45 -26.7 -3.85 -26.7 -9.2 -25.35 Q-10.85 -25.0 -12.1 -24.35 L-15.35 -22.65 Q-17.55 -21.5 -19.65 -20.15 -22.15 -18.5 -23.75 -16.1 L-25.2 -13.65 -25.85 -12.55 -26.85 -10.85 -27.5 -9.15 -27.65 -8.35 -27.65 -7.6 M15.3 22.9 L15.35 23.55 Q15.5 24.75 16.3 25.7 L17.45 26.65 Q18.95 27.4 20.7 27.5 L23.2 27.2 23.95 26.65 Q25.5 26.25 27.1 25.45 L28.4 24.65 28.95 24.2 Q34.05 19.8 35.65 13.15 L36.65 9.2 Q37.4 6.25 37.5 3.3 37.55 0.05 36.85 -3.25 L35.45 -8.15 33.85 -12.25 30.9 -16.2 27.45 -19.75 26.1 -20.9 26.0 -21.0 25.2 -21.45 25.0 -21.65" fill="none" stroke="#000000" stroke-linecap="round" stroke-linejoin="round" stroke-opacity="0.3019608" stroke-width="0.05"/>
      <path d="M-14.3 -19.65 L-15.6 -18.35 Q-17.6 -16.35 -19.0 -13.9 M32.95 11.35 L29.7 14.4 M4.65 -18.2 L-2.4 -11.9 M19.05 -9.4 L17.85 -8.0 Q16.15 -5.9 13.85 -4.35 M29.15 0.7 L28.95 0.95 26.35 4.0 23.2 7.0" fill="none" stroke="#000000" stroke-linecap="round" stroke-linejoin="round" stroke-opacity="0.08235294" stroke-width="0.05"/>
      <path d="M-3.85 -26.7 L-5.5 -26.15 -9.9 -23.55 Q-12.3 -21.85 -14.3 -19.65 M37.5 3.3 Q36.35 6.6 34.35 9.3 L32.95 11.35 M12.2 -25.45 Q10.5 -23.35 8.55 -21.7 L6.15 -19.6 4.65 -18.2 M22.5 -15.5 Q21.75 -13.15 20.2 -11.0 L19.05 -9.4 M24.85 -20.95 L22.5 -15.5 M33.85 -12.25 L33.05 -9.3 31.55 -4.35 31.15 -3.25 29.15 0.7" fill="none" stroke="#000000" stroke-linecap="round" stroke-linejoin="round" stroke-opacity="0.15294118" stroke-width="0.05"/>
    </g>
    <g id="sprite83" transform="matrix(1.0, 0.0, 0.0, 1.0, 10.1, 9.4)">
      <use height="19.0" transform="matrix(1.0, 0.0, 0.0, 1.0, -10.1, -9.4)" width="20.95" xlink:href="#shape25"/>
    </g>
    <g id="shape25" transform="matrix(1.0, 0.0, 0.0, 1.0, 10.1, 9.4)">
      <path d="M-8.45 9.6 L-8.5 9.6 -8.75 9.4 -8.45 9.6 M-9.9 7.75 L-10.1 7.05 -10.05 7.05 -9.9 7.75 M5.6 -8.35 L6.35 -7.5 Q6.8 -6.95 6.2 -6.15 L5.4 -5.2 Q4.3 -4.25 3.0 -3.7 0.95 -2.95 -0.35 -4.15 L-0.4 -5.05 0.2 -5.8 1.2 -6.75 Q3.3 -7.8 5.6 -8.35" fill="#efcdaf" fill-rule="evenodd" stroke="none"/>
      <path d="M-3.3 -5.25 L1.25 -7.5 Q3.5 -8.75 5.9 -9.05 L8.6 -9.4 10.85 -9.05 Q9.15 -2.65 4.95 3.0 L4.8 3.2 3.4 4.65 0.35 6.75 -1.6 7.75 Q-3.2 8.6 -4.8 9.05 L-8.45 9.6 -8.75 9.4 -8.8 9.35 -8.9 9.25 -9.55 8.45 -9.9 7.75 -10.05 7.05 -10.1 7.05 -4.8 -2.35 Q-4.4 -3.6 -3.3 -5.25 M5.6 -8.35 Q3.3 -7.8 1.2 -6.75 L0.2 -5.8 -0.4 -5.05 -0.35 -4.15 Q0.95 -2.95 3.0 -3.7 4.3 -4.25 5.4 -5.2 L6.2 -6.15 Q6.8 -6.95 6.35 -7.5 L5.6 -8.35 M-4.2 1.05 L-0.6 -2.2 0.6 -2.85 Q2.7 -3.7 4.0 -2.5 4.4 -0.55 2.9 1.3 L1.2 3.2 -0.1 4.2 1.2 3.2 2.9 1.3 Q4.4 -0.55 4.0 -2.5 2.7 -3.7 0.6 -2.85 L-0.6 -2.2 -4.2 1.05" fill="#c6886a" fill-rule="evenodd" stroke="none"/>
      <path d="M-3.3 -5.25 L1.25 -7.5 Q3.5 -8.75 5.9 -9.05 L8.6 -9.4 10.85 -9.05 Q9.15 -2.65 4.95 3.0 L4.8 3.2 3.4 4.65 0.35 6.75 -1.6 7.75 Q-3.2 8.6 -4.8 9.05 L-8.45 9.6 -8.75 9.4 -8.8 9.35 -8.9 9.25 -9.7 8.55 -9.9 7.75 -10.05 7.05 M-0.1 4.2 L1.2 3.2 2.9 1.3 Q4.4 -0.55 4.0 -2.5 2.7 -3.7 0.6 -2.85 L-0.6 -2.2 -4.2 1.05" fill="none" stroke="#000000" stroke-linecap="round" stroke-linejoin="round" stroke-opacity="0.3019608" stroke-width="0.05"/>
    </g>
    <g id="sprite84" transform="matrix(1.0, 0.0, 0.0, 1.0, 28.45, 30.95)">
      <use height="34.0" id="_col1c" transform="matrix(1.0, 0.1027, 0.0, 1.0, -28.45, -20.2502)" width="56.9" xlink:href="#sprite85"/>
    </g>
    <g id="sprite85" transform="matrix(1.0, 0.0, 0.0, 1.0, 31.65, 17.0)">
      <use height="34.0" transform="matrix(1.0, 0.0, 0.0, 1.0, -31.65, -17.0)" width="56.9" xlink:href="#shape26"/>
    </g>
    <g id="shape26" transform="matrix(1.0, 0.0, 0.0, 1.0, 31.65, 17.0)">
      <path d="M-21.3 -16.5 Q-14.25 -16.3 -6.3 -16.8 0.55 -17.55 6.35 -15.35 L6.75 -14.95 8.75 -14.25 14.0 -10.7 14.4 -10.35 13.65 -9.65 12.25 -8.35 13.8 -7.65 15.15 -4.4 Q16.2 -1.95 16.4 1.05 16.55 3.3 16.0 5.5 L15.7 6.3 14.15 9.8 12.85 11.65 11.35 13.1 12.6 9.5 12.8 8.15 12.75 7.45 Q12.65 5.9 12.2 4.6 L7.95 -6.2 7.8 -6.6 Q6.75 -9.1 5.05 -11.1 L2.35 -13.95 1.85 -6.35 1.55 -3.65 0.55 1.65 Q-0.05 4.25 -0.95 6.75 L-2.2 10.0 -4.15 14.75 -4.1 10.2 -4.45 5.35 -5.05 -0.05 -5.05 -0.25 Q-4.5 -1.7 -4.75 -3.3 L-5.4 -7.65 -4.85 -9.25 -6.2 -9.05 Q-9.7 -7.4 -12.3 -4.45 -13.2 -3.45 -13.75 -2.15 -14.75 0.2 -14.55 2.75 L-13.6 11.05 Q-13.35 12.85 -11.55 14.35 -14.1 13.3 -15.05 12.25 -19.8 6.85 -20.4 -0.25 -20.6 -2.5 -20.25 -4.75 L-19.7 -6.85 Q-19.3 -7.9 -18.4 -8.55 L-19.5 -8.3 -22.55 -7.1 -23.35 -6.5 Q-24.75 -4.95 -25.1 -2.7 -25.5 -0.4 -25.0 1.75 L-23.9 4.75 -22.25 8.0 -22.35 8.05 -24.2 7.3 Q-26.45 6.4 -27.7 4.55 -29.05 2.65 -30.05 0.3 L-31.25 -2.25 Q-31.7 -3.35 -31.65 -4.4 L-31.55 -7.9 Q-31.55 -9.6 -30.65 -11.05 -29.05 -13.45 -26.7 -14.75 L-25.5 -15.15 -21.4 -15.55 -21.3 -16.5 M-21.65 -12.5 L-21.4 -15.55 -21.65 -12.5" fill="#ffffff" fill-rule="evenodd" stroke="none"/>
      <path d="M14.4 -10.35 L14.45 -10.2 Q18.65 -7.1 21.45 -2.1 22.8 0.25 24.35 2.25 L25.05 4.1 25.25 4.4 25.2 7.05 24.95 10.6 24.9 10.85 24.85 11.15 24.2 12.8 21.3 15.65 20.25 16.55 Q19.3 17.35 19.1 16.7 20.3 15.1 20.35 12.95 L20.45 10.6 Q20.55 8.45 19.85 6.6 19.85 8.65 19.45 10.6 19.2 12.05 18.25 13.0 16.5 14.7 14.0 15.3 L11.35 15.65 Q10.25 15.85 9.55 15.65 L11.35 13.1 12.85 11.65 14.15 9.8 15.7 6.3 16.0 5.5 Q16.55 3.3 16.4 1.05 16.2 -1.95 15.15 -4.4 L13.8 -7.65 12.25 -8.35 13.65 -9.65 14.4 -10.35 M4.0 9.1 L3.6 9.5 -1.25 13.85 -1.7 13.9 -2.0 14.0 Q-3.4 14.3 -4.15 14.75 L-2.2 10.0 -0.95 6.75 Q-0.05 4.25 0.55 1.65 L1.55 -3.65 1.85 -6.35 2.35 -13.95 5.05 -11.1 Q6.75 -9.1 7.8 -6.6 L7.95 -6.2 7.75 -6.35 7.75 -6.2 7.75 -6.15 Q8.4 -3.5 8.15 -0.5 7.95 2.3 6.8 4.75 5.7 7.2 4.0 9.1 M-11.9 13.3 L-11.55 14.35 Q-13.35 12.85 -13.6 11.05 L-14.55 2.75 Q-14.75 0.2 -13.75 -2.15 -13.2 -3.45 -12.3 -4.45 -9.7 -7.4 -6.2 -9.05 L-4.85 -9.25 -5.4 -7.65 -4.75 -3.3 Q-4.5 -1.7 -5.05 -0.25 L-6.3 -6.25 -6.65 -6.3 -6.75 -6.25 -6.85 -6.2 -7.05 -6.05 -7.4 -6.0 Q-9.05 -4.05 -10.1 -1.5 -13.15 5.65 -11.9 13.3 M7.75 -6.35 L7.8 -6.6 7.75 -6.35" fill="#d6baba" fill-rule="evenodd" stroke="none"/>
      <path d="M7.75 -6.35 L7.95 -6.2 7.75 -6.15 7.75 -6.2 7.75 -6.35" fill="#660000" fill-opacity="0.28235295" fill-rule="evenodd" stroke="none"/>
      <path d="M12.2 4.6 L11.7 4.85 Q11.5 4.9 10.7 5.4 L7.9 6.75 Q5.95 7.6 4.0 9.1 5.7 7.2 6.8 4.75 7.95 2.3 8.15 -0.5 8.4 -3.5 7.75 -6.15 L7.95 -6.2 12.2 4.6 M-5.05 -0.05 Q-6.35 4.25 -7.0 8.6 -7.2 10.15 -7.85 11.4 L-8.35 12.25 -10.25 12.35 -11.1 13.15 -11.9 13.3 Q-13.15 5.65 -10.1 -1.5 -9.05 -4.05 -7.4 -6.0 L-7.05 -6.05 -6.85 -6.2 -6.75 -6.25 -6.65 -6.3 -6.3 -6.25 -5.05 -0.25 -5.05 -0.05" fill="#631300" fill-opacity="0.3529412" fill-rule="evenodd" stroke="none"/>
      <path d="M25.2 7.05 L24.95 10.6 24.9 10.85 24.85 11.15 24.2 12.8 21.3 15.65 20.25 16.55 Q19.3 17.35 19.1 16.7 20.3 15.1 20.35 12.95 L20.45 10.6 Q20.55 8.45 19.85 6.6 19.85 8.65 19.45 10.6 19.2 12.05 18.25 13.0 16.5 14.7 14.0 15.3 L11.35 15.65 Q10.25 15.85 9.55 15.65 L11.35 13.1 12.6 9.5 12.8 8.15 12.75 7.45 Q12.65 5.9 12.2 4.6 L7.95 -6.2 7.75 -6.35 M4.0 9.1 L3.6 9.5 -1.25 13.85 -1.7 13.9 -2.0 14.0 Q-3.4 14.3 -4.15 14.75 L-4.1 10.2 -4.45 5.35 -5.05 -0.05 -5.05 -0.25 -6.3 -6.25 -6.65 -6.3 -6.75 -6.25 -6.85 -6.2 -7.05 -6.05 -7.4 -6.0 Q-9.05 -4.05 -10.1 -1.5 -13.15 5.65 -11.9 13.3 L-11.55 14.35 Q-14.1 13.3 -15.05 12.25 -19.8 6.85 -20.4 -0.25 -20.6 -2.5 -20.25 -4.75 L-19.7 -6.85 Q-19.3 -7.9 -18.4 -8.55 L-19.5 -8.3 -22.55 -7.1 -23.35 -6.5 Q-24.75 -4.95 -25.1 -2.7 -25.5 -0.4 -25.0 1.75 L-23.9 4.75 -22.25 8.0 -22.35 8.05 -24.2 7.3 Q-26.45 6.4 -27.7 4.55 -29.05 2.65 -30.05 0.3 L-31.25 -2.25 Q-31.7 -3.35 -31.65 -4.4 L-31.55 -7.9 Q-31.55 -9.6 -30.65 -11.05 -29.05 -13.45 -26.7 -14.75 L-25.5 -15.15 -21.4 -15.55 -21.3 -16.5 M7.75 -6.2 L7.75 -6.15 Q8.4 -3.5 8.15 -0.5 7.95 2.3 6.8 4.75 5.7 7.2 4.0 9.1 M7.8 -6.6 L7.75 -6.35 M-21.4 -15.55 L-21.65 -12.5" fill="none" stroke="#000000" stroke-linecap="round" stroke-linejoin="round" stroke-opacity="0.3019608" stroke-width="0.05"/>
    </g>
    <g id="sprite86" transform="matrix(1.0, 0.0, 0.0, 1.0, 21.25, 9.65)">
      <use height="15.85" id="_col0" transform="matrix(0.9083, 0.1732, -0.2258, 1.1839, -17.6497, -9.6619)" width="23.15" xlink:href="#sprite87"/>
      <use height="18.25" id="_p7" transform="matrix(1.0, 0.0, 0.0, 1.0, -12.1, -7.8)" width="13.85" xlink:href="#sprite88"/>
    </g>
    <g id="sprite87" transform="matrix(1.0, 0.0, 0.0, 1.0, 11.55, 5.5)">
      <use height="15.85" transform="matrix(1.0, 0.0, 0.0, 1.0, -11.55, -5.5)" width="23.15" xlink:href="#shape27"/>
    </g>
    <g id="shape27" transform="matrix(1.0, 0.0, 0.0, 1.0, 11.55, 5.5)">
      <path d="M6.35 -3.2 L6.5 -3.15 6.55 -3.25 6.6 -3.25 6.6 -3.3 6.85 -3.25 7.45 -3.1 8.25 -2.85 8.35 -2.75 8.75 -2.45 9.0 -2.35 9.35 -2.2 9.4 -2.15 9.6 -1.95 9.8 -1.75 9.85 -1.75 11.3 0.95 Q11.8 2.75 11.4 4.4 L8.45 5.2 Q5.2 5.8 2.25 4.65 L1.2 4.2 -0.45 3.8 -0.75 3.75 0.0 3.15 Q1.05 2.6 0.15 1.9 L-0.1 1.9 -0.85 2.7 -2.4 2.95 -3.3 3.05 -5.75 3.4 -7.9 3.55 -5.65 2.45 -3.85 1.7 -2.15 0.8 -1.9 0.7 -1.2 0.4 -0.9 0.1 -0.7 -0.05 -0.7 -0.15 -0.7 -0.3 -0.85 -0.5 -2.65 -0.2 -4.45 0.2 -6.3 0.7 -8.2 1.2 -10.2 1.7 -11.4 1.9 -11.55 1.45 -11.5 0.95 -11.3 0.65 -11.3 0.6 Q-10.15 -0.15 -8.85 -0.6 L-5.2 -1.7 -0.75 -2.1 -0.4 -2.15 -0.3 -2.2 0.1 -2.25 0.5 -2.75 0.75 -3.3 0.6 -3.4 -1.25 -3.5 -2.55 -3.8 -3.55 -3.85 -4.55 -3.9 -5.55 -3.8 -6.65 -3.75 -7.65 -3.55 -8.7 -3.3 -9.7 -2.95 -10.8 -2.55 -10.65 -3.35 -9.85 -4.4 -9.3 -4.75 -7.75 -5.5 1.75 -5.15 1.75 -5.1 2.05 -5.0 2.85 -4.9 2.9 -4.9 4.4 -3.95 Q5.4 -3.5 6.35 -3.2 M9.0 -2.35 L8.65 -2.45 6.5 -3.15 8.65 -2.45 9.0 -2.35 M-2.55 7.15 Q-3.2 8.1 -4.2 8.8 L-5.15 9.2 -4.65 7.85 -3.75 6.6 -2.3 6.7 -2.55 7.15" fill="#efcdaf" fill-rule="evenodd" stroke="none"/>
      <path d="M11.4 4.4 L11.35 4.65 10.3 6.75 10.15 7.0 9.75 7.4 9.35 7.75 7.75 8.35 7.1 8.6 4.4 8.8 Q2.5 8.15 0.95 7.4 L-0.2 6.8 -1.65 7.6 -2.35 8.45 -3.1 9.2 Q-3.8 9.75 -4.55 10.15 L-5.2 10.35 -6.15 9.65 -6.25 9.35 -6.4 9.25 -4.6 6.25 -3.85 5.1 -3.9 5.1 -4.65 5.35 -5.15 5.5 -6.35 5.65 -7.15 5.65 -8.8 5.2 Q-9.75 4.8 -9.9 4.2 L-9.6 2.9 -10.6 2.65 -11.4 1.9 -10.2 1.7 -8.2 1.2 -6.3 0.7 -4.45 0.2 -2.65 -0.2 -0.85 -0.5 -0.7 -0.3 -0.7 -0.15 -0.7 -0.05 -0.9 0.1 -1.2 0.4 -1.9 0.7 -2.15 0.8 -3.85 1.7 -5.65 2.45 -7.9 3.55 -5.75 3.4 -3.3 3.05 -2.4 2.95 -0.85 2.7 -0.1 1.9 0.15 1.9 Q1.05 2.6 0.0 3.15 L-0.75 3.75 -0.45 3.8 1.2 4.2 2.25 4.65 Q5.2 5.8 8.45 5.2 L11.4 4.4 M-5.2 -1.7 L-7.8 -1.5 -10.6 -1.65 -10.75 -1.9 -10.9 -2.45 -10.8 -2.55 -9.7 -2.95 -8.7 -3.3 -7.65 -3.55 -6.65 -3.75 -5.55 -3.8 -4.55 -3.9 -3.55 -3.85 -2.55 -3.8 -1.25 -3.5 0.6 -3.4 0.75 -3.3 0.5 -2.75 0.1 -2.25 -0.3 -2.2 -0.4 -2.15 -0.75 -2.1 -5.2 -1.7 M-9.6 2.9 L-2.15 0.8 -9.6 2.9 M-0.3 -2.2 L-0.75 -2.1 -0.3 -2.2 M-3.15 4.7 L-3.85 5.1 -3.15 4.7 M-2.55 7.15 L-2.3 6.7 -3.75 6.6 -4.65 7.85 -5.15 9.2 -4.2 8.8 Q-3.2 8.1 -2.55 7.15" fill="#c6886a" fill-rule="evenodd" stroke="none"/>
      <path d="M2.9 -4.9 L4.4 -4.0 6.35 -3.2 6.5 -3.15 8.65 -2.45 9.0 -2.35 9.35 -2.2 9.4 -2.15 M9.6 -1.95 L9.8 -1.75 M9.35 7.75 L7.75 8.35 7.1 8.6 4.4 8.8 Q2.5 8.15 0.95 7.4 L-0.2 6.8 -1.65 7.6 -2.35 8.45 -3.1 9.2 Q-3.8 9.75 -4.55 10.15 L-5.2 10.35 -6.15 9.65 -6.25 9.35 -6.4 9.25 -4.6 6.25 -3.85 5.1 -3.9 5.1 -4.65 5.35 -5.15 5.5 -6.35 5.65 -7.15 5.65 -8.8 5.2 Q-9.75 4.8 -9.9 4.2 L-9.6 2.9 -10.6 2.65 -11.4 1.9 -11.55 1.45 -11.5 0.95 -11.3 0.65 -11.3 0.6 Q-10.15 -0.15 -8.85 -0.6 L-5.2 -1.7 -7.8 -1.5 -10.6 -1.65 -10.75 -1.9 -10.9 -2.45 -10.65 -3.35 -9.85 -4.4 -9.3 -4.75 -7.75 -5.5 1.75 -5.15 M1.75 -5.1 L2.05 -5.0 2.85 -4.9 2.9 -4.9 M-2.15 0.8 L-9.6 2.9 M-0.75 -2.1 L-0.3 -2.2 0.1 -2.25 M-5.2 -1.7 L-0.75 -2.1 M-2.15 0.8 L-1.9 0.7 -1.2 0.4 M-3.85 5.1 L-3.15 4.7" fill="none" stroke="#000000" stroke-linecap="round" stroke-linejoin="round" stroke-opacity="0.3019608" stroke-width="0.05"/>
    </g>
    <g id="sprite89" transform="matrix(1.0, 0.0, 0.0, 1.0, 10.45, 15.8)">
      <use height="30.4" id="_p2" transform="matrix(1.0, 0.0, 0.0, 1.0, -10.45, -15.8)" width="20.05" xlink:href="#sprite90"/>
    </g>
    <g id="sprite90" transform="matrix(1.0, 0.0, 0.0, 1.0, 10.05, 15.25)">
      <use height="30.4" id="_p5" transform="matrix(1.0, 0.0, 0.0, 1.0, -10.05, -15.25)" width="20.05" xlink:href="#sprite91"/>
    </g>
    <g id="sprite91" transform="matrix(1.0, 0.0, 0.0, 1.0, 10.05, 15.25)">
      <use height="28.0" id="_col0" transform="matrix(0.9552, -0.2927, 0.2927, 0.9552, -10.0342, -11.5985)" width="12.4" xlink:href="#sprite15"/>
      <use height="30.4" id="_p7" transform="matrix(1.0, 0.0, 0.0, 1.0, -10.05, -15.25)" width="20.05" xlink:href="#sprite92"/>
    </g>
    <g id="sprite93" transform="matrix(1.0, 0.0, 0.0, 1.0, 20.6, 29.0)">
      <use height="57.85" id="_p2" transform="matrix(1.0, 0.0, 0.0, 1.0, -20.6, -29.0)" width="42.4" xlink:href="#sprite94"/>
    </g>
    <g id="sprite94" transform="matrix(1.0, 0.0, 0.0, 1.0, 20.6, 29.0)">
      <use height="57.85" id="_p5" transform="matrix(1.0, 0.0, 0.0, 1.0, -20.6, -29.0)" width="42.4" xlink:href="#sprite95"/>
    </g>
    <g id="sprite95" transform="matrix(1.0, 0.0, 0.0, 1.0, 20.6, 29.0)">
      <use height="28.0" id="_col0" transform="matrix(0.9918, 0.1221, -0.1221, 0.9918, -4.6711, -14.6573)" width="12.0" xlink:href="#sprite96"/>
      <use height="57.85" id="_p7" transform="matrix(1.0, 0.0, 0.0, 1.0, -20.6, -29.0)" width="42.4" xlink:href="#sprite97"/>
    </g>
    <g id="sprite96" transform="matrix(1.0, 0.0, 0.0, 1.0, 6.3, 1.45)">
      <use height="28.0" transform="matrix(1.0, 0.0, 0.0, 1.0, -6.3, -1.45)" width="12.0" xlink:href="#shape28"/>
    </g>
    <g id="shape28" transform="matrix(1.0, 0.0, 0.0, 1.0, 6.3, 1.45)">
      <path d="M3.7 0.7 Q4.3 1.25 4.6 2.1 L3.85 0.9 3.7 0.7 M-0.55 26.25 Q-2.8 25.8 -3.65 24.7 -4.4 23.85 -4.4 22.75 -4.2 10.2 -6.3 6.75 L-5.4 5.15 -5.0 3.6 -4.95 3.55 -3.7 3.3 Q-1.8 3.3 -0.15 6.15 L0.1 6.6 0.15 11.35 -0.1 22.1 -0.05 23.3 -0.5 24.65 -0.55 26.25" fill="#efcdaf" fill-rule="evenodd" stroke="none"/>
      <path d="M3.7 0.7 L3.85 0.9 4.6 2.1 5.65 4.95 5.7 5.15 4.85 22.75 Q4.5 24.1 3.7 25.15 2.5 26.3 0.5 26.55 L0.25 26.45 -0.55 26.25 -0.5 24.65 -0.05 23.3 -0.1 22.1 0.15 11.35 0.1 6.6 -0.15 6.15 Q-1.8 3.3 -3.7 3.3 L-4.95 3.55 -5.0 3.6 -4.8 2.95 -4.4 2.0 -4.4 1.9 -4.35 1.75 -3.9 0.55 Q-3.4 -1.05 -0.1 -1.45 1.65 -1.2 2.95 -0.2 L3.6 0.55 3.7 0.7" fill="#c6886a" fill-rule="evenodd" stroke="none"/>
      <path d="M3.85 0.9 L4.6 2.1 5.65 4.95 5.7 5.15 4.85 22.75 Q4.5 24.1 3.7 25.15 M-3.65 24.7 Q-4.4 23.85 -4.4 22.75 -4.2 10.2 -6.3 6.75" fill="none" stroke="#000000" stroke-linecap="round" stroke-linejoin="round" stroke-opacity="0.3019608" stroke-width="0.05"/>
    </g>
    <g id="sprite97" transform="matrix(1.0, 0.0, 0.0, 1.0, 21.15, 30.55)">
      <use height="33.65" id="_col2" transform="matrix(0.8944, -0.0586, 0.0396, 0.6048, -13.8145, -2.0958)" width="30.4" xlink:href="#sprite7"/>
    </g>
    <g id="sprite98" transform="matrix(1.0, 0.0, 0.0, 1.0, 14.6, 17.15)">
      <use height="37.15" id="_p2" transform="matrix(1.0, 0.0, 0.0, 1.0, -14.6, -17.15)" width="34.95" xlink:href="#sprite99"/>
    </g>
    <g id="sprite99" transform="matrix(1.0, 0.0, 0.0, 1.0, 7.6, 10.1)">
      <use height="37.15" id="_p5" transform="matrix(1.0, 0.0, 0.0, 1.0, -7.6, -10.1)" width="34.95" xlink:href="#sprite100"/>
    </g>
    <g id="sprite100" transform="matrix(1.0, 0.0, 0.0, 1.0, 14.6, 17.15)">
      <use height="14.0" id="_col0" transform="matrix(1.0, 0.0, 0.0, 1.0, -6.95, -6.95)" width="13.8" xlink:href="#sprite21"/>
      <use height="37.15" id="_p7" transform="matrix(1.0, 0.0, 0.0, 1.0, -14.6, -17.15)" width="34.95" xlink:href="#sprite101"/>
    </g>
    <g id="sprite101" transform="matrix(1.0, 0.0, 0.0, 1.0, 16.5, 16.65)">
      <use height="22.3" id="_p1" transform="matrix(0.7987, 0.5992, -0.5992, 0.7987, -3.1531, -16.6443)" width="24.6" xlink:href="#sprite22"/>
    </g>
  </defs>
</svg>
