<?xml version="1.0" encoding="UTF-8" standalone="no"?>
<svg xmlns:xlink="http://www.w3.org/1999/xlink" height="35.9px" width="39.5px" xmlns="http://www.w3.org/2000/svg">
  <g transform="matrix(1.0, 0.0, 0.0, 1.0, 14.45, 24.05)">
    <use height="1.55" transform="matrix(1.0, 0.0, 0.0, 1.0, -2.4, -24.05)" width="1.65" xlink:href="#shape0"/>
  </g>
  <defs>
    <g id="shape0" transform="matrix(1.0, 0.0, 0.0, 1.0, 2.4, 24.05)">
      <path d="M-0.95 -22.8 Q-1.25 -22.5 -1.65 -22.5 -2.45 -22.5 -2.4 -23.3 -2.4 -23.85 -1.55 -24.0 -0.75 -24.2 -0.75 -23.3 L-0.95 -22.8" fill="#ff9900" fill-rule="evenodd" stroke="none"/>
    </g>
  </defs>
</svg>
