<?xml version="1.0" encoding="UTF-8" standalone="no"?>
<svg xmlns:xlink="http://www.w3.org/1999/xlink" height="19.55px" width="17.3px" xmlns="http://www.w3.org/2000/svg">
  <g transform="matrix(1.0, 0.0, 0.0, 1.0, 26.55, 0.6)">
    <path d="M-23.9 -0.05 L-24.2 -0.45 -24.0 -0.6 -13.45 -0.25 -9.25 1.8 -9.45 2.0 -10.5 2.7 -13.15 5.0 Q-15.5 6.9 -17.2 10.85 L-19.55 16.2 Q-20.2 17.6 -22.45 18.8 -24.9 19.85 -26.25 13.25 -27.65 6.65 -22.95 1.1 L-22.8 1.1 -23.3 0.6 -23.9 -0.05" fill="#631300" fill-opacity="0.3529412" fill-rule="evenodd" stroke="none"/>
  </g>
</svg>
