<?xml version="1.0" encoding="UTF-8" standalone="no"?>
<svg xmlns:xlink="http://www.w3.org/1999/xlink" height="19.4px" width="34.2px" xmlns="http://www.w3.org/2000/svg">
  <g transform="matrix(1.0, 0.0, 0.0, 1.0, 13.4, 9.15)">
    <path d="M19.15 -1.65 L19.15 -0.15 19.15 2.05 19.1 10.25 8.75 10.15 8.85 2.0 8.8 -0.2 8.9 -1.8 8.95 -5.05 14.4 -5.05 19.25 -5.4 19.15 -1.65" fill="#b8c9cf" fill-rule="evenodd" stroke="none"/>
    <path d="M8.95 -5.05 L8.95 -9.15 19.25 -9.05 19.25 -5.4 14.4 -5.05 8.95 -5.05" fill="#e0e8eb" fill-rule="evenodd" stroke="none"/>
    <path d="M19.15 -1.65 L20.75 -1.65 20.8 -0.25 19.15 -0.15 19.15 -1.65 M-13.4 -0.15 L-13.35 -1.95 8.9 -1.8 8.8 -0.2 -13.4 -0.15" fill="#725327" fill-rule="evenodd" stroke="none"/>
    <path d="M19.15 -0.15 L20.8 -0.25 20.75 2.1 19.15 2.05 19.15 -0.15 M8.85 2.0 L-13.35 1.8 -13.4 -0.15 8.8 -0.2 8.85 2.0" fill="#000000" fill-rule="evenodd" stroke="none"/>
    <path d="M20.8 -0.25 L20.75 -1.65 19.15 -1.65 19.15 -0.15 20.8 -0.25 M19.15 2.05 L19.1 10.25 8.75 10.15 8.85 2.0 -13.35 1.8 -13.4 -0.15 -13.35 -1.95 8.9 -1.8 8.95 -5.05 8.95 -9.15 19.25 -9.05 19.25 -5.4 19.15 -1.65 M8.85 2.0 L8.8 -0.2 8.9 -1.8 M19.15 -0.15 L19.15 2.05" fill="none" stroke="#000000" stroke-linecap="round" stroke-linejoin="round" stroke-opacity="0.4" stroke-width="0.05"/>
  </g>
</svg>
