<?xml version="1.0" encoding="UTF-8" standalone="no"?>
<svg xmlns:xlink="http://www.w3.org/1999/xlink" height="265.1px" width="283.2px" xmlns="http://www.w3.org/2000/svg">
  <g transform="matrix(1.0, 0.0, 0.0, 1.0, 176.05, 18.05)">
    <use height="116.5" transform="matrix(1.0, 0.0, 0.0, 1.0, -0.1, 71.4)" width="77.7" xlink:href="#sprite0"/>
    <use height="57.85" transform="matrix(0.8856, 0.4579, -0.4579, 0.8856, 7.7911, 67.9632)" width="59.85" xlink:href="#sprite3"/>
    <use height="146.8" transform="matrix(-0.9682, -0.2469, -0.2469, 0.9682, 51.788, 104.4906)" width="196.05" xlink:href="#sprite8"/>
    <use height="30.75" transform="matrix(0.892, 0.4456, -0.4456, 0.892, 18.8948, 67.2513)" width="40.3" xlink:href="#sprite12"/>
    <use height="44.75" transform="matrix(0.8794, 0.4696, -0.4696, 0.8794, 15.718, 46.3396)" width="45.25" xlink:href="#sprite17"/>
    <use height="38.95" transform="matrix(-0.999, 0.0, 0.0, 0.999, 36.9365, 157.6132)" width="40.2" xlink:href="#sprite23"/>
    <use height="52.5" transform="matrix(0.9934, -0.0392, 0.0392, 0.9934, -5.8774, 129.0883)" width="53.85" xlink:href="#sprite29"/>
    <use height="43.1" transform="matrix(0.9906, 0.0791, -0.0791, 0.9906, 7.1053, 107.381)" width="31.35" xlink:href="#sprite34"/>
    <use height="40.55" transform="matrix(0.9969, -0.0665, 0.0665, 0.9969, 34.4854, 173.3836)" width="30.7" xlink:href="#sprite40"/>
    <use height="51.8" transform="matrix(0.9573, -0.2711, 0.2711, 0.9573, 23.0456, 148.9502)" width="41.8" xlink:href="#sprite46"/>
    <use height="34.25" transform="matrix(1.0, 0.0, 0.0, 1.0, 9.9, 98.15)" width="46.3" xlink:href="#sprite50"/>
    <use height="45.0" transform="matrix(0.9696, -0.2246, 0.2246, 0.9696, 24.7461, 122.439)" width="29.7" xlink:href="#sprite55"/>
    <use height="44.05" transform="matrix(1.0, 0.0, 0.0181, 1.0002, 1.3944, 95.1977)" width="67.05" xlink:href="#sprite60"/>
    <use height="44.2" transform="matrix(1.0475, 0.0, 0.0556, 1.049, -2.8329, 70.7225)" width="79.15" xlink:href="#sprite66"/>
    <use height="115.6" transform="matrix(1.0, 0.0, 0.0, 1.0, -13.2, -17.25)" width="108.25" xlink:href="#sprite73"/>
    <use height="26.45" transform="matrix(0.9276, 0.3669, -0.3669, 0.9276, 48.7743, 117.4483)" width="23.2" xlink:href="#sprite86"/>
    <use height="30.75" transform="matrix(0.9989, -0.0397, 0.0397, 0.9989, 37.9852, 81.6858)" width="40.3" xlink:href="#sprite90"/>
    <use height="62.85" transform="matrix(0.9989, -0.0397, 0.0397, 0.9989, 38.7748, 83.3563)" width="64.1" xlink:href="#sprite94"/>
    <use height="48.0" transform="matrix(0.9989, -0.0397, 0.0397, 0.9989, 34.299, 65.9447)" width="56.75" xlink:href="#sprite98"/>
  </g>
  <defs>
    <g id="sprite0" transform="matrix(1.0, 0.0, 0.0, 1.0, 46.95, 20.45)">
      <use height="116.5" id="_p7" transform="matrix(1.0, 0.0, 0.0, 1.0, -46.95, -20.45)" width="77.7" xlink:href="#sprite1"/>
    </g>
    <g id="sprite1" transform="matrix(1.0, 0.0, 0.0, 1.0, 46.95, 20.45)">
      <use height="44.65" id="_p1" transform="matrix(1.0, 0.0, 0.0, 1.0, -28.55, -20.45)" width="58.2" xlink:href="#sprite2"/>
    </g>
    <g id="sprite3" transform="matrix(1.0, 0.0, 0.0, 1.0, 32.0, 29.0)">
      <use height="57.85" id="_p2" transform="matrix(1.0, 0.0, 0.0, 1.0, -32.0, -29.0)" width="59.85" xlink:href="#sprite4"/>
    </g>
    <g id="sprite4" transform="matrix(1.0, 0.0, 0.0, 1.0, 32.55, 30.55)">
      <use height="28.0" id="_col0" transform="matrix(0.9918, 0.1221, -0.1221, 0.9918, -4.3781, -16.1035)" width="11.15" xlink:href="#sprite5"/>
      <use height="57.85" id="_p7" transform="matrix(1.0, 0.0, 0.0, 1.0, -25.3, -30.55)" width="46.55" xlink:href="#sprite6"/>
    </g>
    <g id="sprite5" transform="matrix(1.0, 0.0, 0.0, 1.0, 5.45, 1.45)">
      <use height="28.0" transform="matrix(1.0, 0.0, 0.0, 1.0, -5.45, -1.45)" width="11.15" xlink:href="#shape0"/>
    </g>
    <g id="shape0" transform="matrix(1.0, 0.0, 0.0, 1.0, 5.45, 1.45)">
      <path d="M3.7 0.7 Q4.3 1.25 4.6 2.1 L3.85 0.9 3.7 0.7 M-0.55 26.25 Q-2.8 25.8 -3.65 24.7 -4.4 23.85 -4.4 22.75 L-5.4 5.15 Q-5.5 3.8 -5.2 2.7 L-4.6 1.3 Q-3.4 -1.05 -0.1 -1.45 L0.15 11.35 -0.1 22.1 -0.05 23.3 -0.5 24.65 -0.55 26.25" fill="#efcdaf" fill-rule="evenodd" stroke="none"/>
      <path d="M3.7 0.7 L3.85 0.9 4.6 2.1 5.65 4.95 5.7 5.15 4.85 22.75 Q4.5 24.1 3.7 25.15 2.5 26.3 0.5 26.55 L0.25 26.45 -0.55 26.25 -0.5 24.65 -0.05 23.3 -0.1 22.1 0.15 11.35 -0.1 -1.45 Q1.65 -1.2 2.95 -0.2 L3.6 0.55 3.7 0.7" fill="#c6886a" fill-rule="evenodd" stroke="none"/>
      <path d="M3.85 0.9 L4.6 2.1 5.65 4.95 5.7 5.15 4.85 22.75 Q4.5 24.1 3.7 25.15 M-3.65 24.7 Q-4.4 23.85 -4.4 22.75 L-5.4 5.15 Q-5.5 3.8 -5.2 2.7" fill="none" stroke="#000000" stroke-linecap="round" stroke-linejoin="round" stroke-opacity="0.3019608" stroke-width="0.05"/>
    </g>
    <g id="sprite6" transform="matrix(1.0, 0.0, 0.0, 1.0, 25.3, 30.55)">
      <use height="33.65" id="_col2" transform="matrix(0.8944, -0.0586, 0.0675, 1.0316, -14.7336, -16.4277)" width="30.4" xlink:href="#sprite7"/>
    </g>
    <g id="sprite7" transform="matrix(1.0, 0.0, 0.0, 1.0, 4.5, 6.05)">
      <use height="33.65" transform="matrix(1.0, 0.0, 0.0, 1.0, -4.5, -6.05)" width="30.4" xlink:href="#shape1"/>
    </g>
    <g id="shape1" transform="matrix(1.0, 0.0, 0.0, 1.0, 4.5, 6.05)">
      <path d="M4.9 26.1 Q4.05 26.55 3.15 26.95 1.65 24.95 0.5 22.95 -1.1 20.8 -2.0 18.55 L-4.4 19.8 Q-3.5 13.9 -1.1 8.75 L-4.5 9.35 -2.25 4.7 Q-1.75 3.45 -0.85 2.35 L-2.25 1.95 Q-1.6 0.7 -0.35 -0.3 1.0 -1.3 2.65 -2.05 L2.4 -2.55 1.9 -3.2 1.9 -3.7 2.05 -4.1 7.2 -3.95 8.3 -4.7 Q10.3 -6.95 11.45 -5.45 L11.95 -4.7 13.2 -2.55 14.2 -1.05 10.05 -1.2 Q6.95 -1.3 9.55 0.2 12.95 1.95 14.85 5.35 L15.1 5.6 14.45 5.6 Q10.05 4.85 11.85 8.6 12.85 10.75 13.2 13.0 L11.35 11.75 Q10.3 11.0 9.2 10.75 6.05 9.75 7.45 12.4 9.05 14.9 9.2 18.05 7.2 17.15 6.45 19.3 5.3 22.45 4.9 26.1" fill="#ffffff" fill-rule="evenodd" stroke="none"/>
      <path d="M11.95 -4.7 L17.5 -5.35 16.25 -4.1 19.6 -2.55 23.15 -1.05 23.25 -0.7 22.0 -0.55 20.15 -0.7 25.9 9.85 22.15 7.35 23.25 12.65 24.0 16.4 20.65 13.5 Q21.15 18.3 18.35 23.3 17.85 24.05 17.6 24.95 L16.85 24.8 Q15.75 23.7 15.2 22.45 L5.8 27.6 5.15 26.1 4.9 26.1 Q5.3 22.45 6.45 19.3 7.2 17.15 9.2 18.05 9.05 14.9 7.45 12.4 6.05 9.75 9.2 10.75 10.3 11.0 11.35 11.75 L13.2 13.0 Q12.85 10.75 11.85 8.6 10.05 4.85 14.45 5.6 L15.1 5.6 14.85 5.35 Q12.95 1.95 9.55 0.2 6.95 -1.3 10.05 -1.2 L14.2 -1.05 13.2 -2.55 11.95 -4.7" fill="#d6baba" fill-rule="evenodd" stroke="none"/>
      <path d="M4.9 26.1 Q4.05 26.55 3.15 26.95 1.65 24.95 0.5 22.95 -1.1 20.8 -2.0 18.55 L-4.4 19.8 Q-3.5 13.9 -1.1 8.75 L-4.5 9.35 -2.25 4.7 Q-1.75 3.45 -0.85 2.35 L-2.25 1.95 Q-1.6 0.7 -0.35 -0.3 1.0 -1.3 2.65 -2.05 L2.4 -2.55 1.9 -3.2 1.9 -3.7 2.05 -4.1 7.2 -3.95 8.3 -4.7 Q10.3 -6.95 11.45 -5.45 L11.95 -4.7 17.5 -5.35 16.25 -4.1 19.6 -2.55 23.15 -1.05 23.25 -0.7 22.0 -0.55 20.15 -0.7 25.9 9.85 22.15 7.35 23.25 12.65 24.0 16.4 20.65 13.5 Q21.15 18.3 18.35 23.3 17.85 24.05 17.6 24.95 L16.85 24.8 Q15.75 23.7 15.2 22.45 L5.8 27.6 5.15 26.1 4.9 26.1 Z" fill="none" stroke="#000000" stroke-linecap="round" stroke-linejoin="round" stroke-opacity="0.3019608" stroke-width="0.05"/>
    </g>
    <g id="sprite8" transform="matrix(1.0, 0.0, 0.0, 1.0, 31.85, 19.65)">
      <use height="18.15" transform="matrix(1.0, 0.0, 0.0, 1.0, -8.75, 0.3)" width="17.85" xlink:href="#sprite9"/>
      <clipPath id="clipPath0" transform="matrix(1.0, 0.0, 0.0, 1.0, 31.85, 19.65)">
        <use height="146.8" transform="matrix(1.0, 0.0, 0.0, 1.0, -31.85, -19.65)" width="196.05" xlink:href="#shape3"/>
      </clipPath>
    </g>
    <g id="sprite9" transform="matrix(1.0, 0.0, 0.0, 1.0, 8.8, 2.35)">
      <use height="17.85" id="_col0" transform="matrix(1.0, 0.0, 0.0, 1.0, -8.8, -2.05)" width="17.65" xlink:href="#sprite10"/>
      <use height="16.55" id="_p7" transform="matrix(1.0, 0.0, 0.0, 1.0, -6.85, -2.35)" width="15.9" xlink:href="#sprite11"/>
    </g>
    <g id="sprite10" transform="matrix(1.0, 0.0, 0.0, 1.0, 8.65, 8.7)">
      <use height="17.85" transform="matrix(1.0, 0.0, 0.0, 1.0, -8.65, -8.7)" width="17.65" xlink:href="#shape2"/>
    </g>
    <g id="shape2" transform="matrix(1.0, 0.0, 0.0, 1.0, 8.65, 8.7)">
      <path d="M-4.8 -6.05 Q-4.95 -4.15 -4.35 -2.2 L-3.95 -0.85 -6.0 -0.45 -6.0 -0.7 -6.0 -0.45 -3.95 -0.85 -4.35 -2.2 Q-4.95 -4.15 -4.8 -6.05 M-7.15 4.7 L-8.65 4.3 -8.35 1.95 Q-8.5 -0.85 -6.0 -0.7 -6.45 -2.2 -6.6 -4.4 -6.7 -6.05 -6.15 -7.7 L-6.1 -7.85 -5.7 -8.7 1.65 -8.35 2.0 -5.9 Q2.05 -4.35 1.55 -2.8 L0.8 -0.45 Q0.35 0.75 0.35 2.05 0.2 3.85 -1.3 4.85 L-1.7 5.15 Q-2.45 5.45 -3.2 5.15 -3.8 4.7 -4.1 4.7 -4.65 4.55 -5.1 4.7 -5.45 5.0 -5.45 5.6 L-5.25 6.2 Q-5.7 6.2 -6.0 5.8 L-7.15 4.7 -7.15 4.55 Q-7.45 1.95 -6.0 -0.45 -7.45 1.95 -7.15 4.55 L-7.15 4.7 M-3.95 -0.85 Q-3.5 2.05 -5.1 4.7 -3.5 2.05 -3.95 -0.85" fill="#efcdaf" fill-rule="evenodd" stroke="none"/>
      <path d="M4.6 -8.25 L5.3 -7.2 5.65 -6.75 7.0 -3.25 8.9 2.35 Q9.2 3.35 8.75 5.15 6.7 6.2 4.6 7.35 2.1 8.85 -0.25 9.15 L-0.8 8.15 -1.6 6.65 -3.8 7.05 -1.6 6.65 -0.8 8.15 -2.75 8.0 -3.8 7.05 -5.25 6.2 -5.45 5.6 Q-5.45 5.0 -5.1 4.7 -4.65 4.55 -4.1 4.7 -3.8 4.7 -3.2 5.15 -2.45 5.45 -1.7 5.15 L-1.3 4.85 Q0.2 3.85 0.35 2.05 0.35 0.75 0.8 -0.45 L1.55 -2.8 Q2.05 -4.35 2.0 -5.9 L1.65 -8.35 1.65 -8.4 1.85 -8.35 4.6 -8.25 M4.75 -0.85 L3.3 0.3 2.55 1.0 1.4 3.35 0.9 5.15 Q0.8 5.8 0.5 6.05 -0.25 6.5 -1.3 6.5 L-1.85 6.05 -2.0 6.05 -3.5 5.6 -4.1 4.7 -3.5 5.6 -2.0 6.05 -1.85 6.05 -1.3 6.5 Q-0.25 6.5 0.5 6.05 0.8 5.8 0.9 5.15 L1.4 3.35 2.55 1.0 3.3 0.3 4.75 -0.85 M2.7 4.3 L2.7 3.7 1.4 3.35 2.7 3.7 Q4.05 2.95 4.2 1.65 4.5 -0.15 3.3 0.3 4.5 -0.15 4.2 1.65 4.05 2.95 2.7 3.7 L2.7 4.3 4.35 4.45 4.6 4.7 Q5.35 5.0 5.35 5.6 5.35 5.0 4.6 4.7 L4.35 4.45 2.7 4.3 3.0 5.8 2.85 6.05 1.4 7.8 2.85 6.05 3.0 5.8 2.7 4.3 M-1.3 6.5 L-1.6 6.65 -1.3 6.5" fill="#c6886a" fill-rule="evenodd" stroke="none"/>
      <path d="M-6.0 -0.7 L-6.0 -0.45 -3.95 -0.85 -4.35 -2.2 Q-4.95 -4.15 -4.8 -6.05 M-5.7 -8.7 L-6.1 -7.85 -6.15 -7.7 Q-6.7 -6.05 -6.6 -4.4 -6.45 -2.2 -6.0 -0.7 -8.5 -0.85 -8.35 1.95 L-8.65 4.3 -7.15 4.7 -7.15 4.55 Q-7.45 1.95 -6.0 -0.45 M-0.8 8.15 L-0.25 9.15 Q2.1 8.85 4.6 7.35 6.7 6.2 8.75 5.15 9.2 3.35 8.9 2.35 L7.0 -3.25 5.65 -6.75 5.3 -7.2 4.6 -8.25 M-4.1 4.7 L-3.5 5.6 -2.0 6.05 -1.85 6.05 -1.3 6.5 Q-0.25 6.5 0.5 6.05 0.8 5.8 0.9 5.15 L1.4 3.35 2.55 1.0 3.3 0.3 4.75 -0.85 M1.4 3.35 L2.7 3.7 Q4.05 2.95 4.2 1.65 4.5 -0.15 3.3 0.3 M5.35 5.6 Q5.35 5.0 4.6 4.7 L4.35 4.45 2.7 4.3 3.0 5.8 2.85 6.05 1.4 7.8 M2.7 3.7 L2.7 4.3 M-7.15 4.7 L-6.0 5.8 Q-5.7 6.2 -5.25 6.2 L-5.45 5.6 Q-5.45 5.0 -5.1 4.7 -3.5 2.05 -3.95 -0.85 M-0.8 8.15 L-1.6 6.65 -3.8 7.05 -2.75 8.0 -0.8 8.15 M-1.6 6.65 L-1.3 6.5 M-5.25 6.2 L-3.8 7.05" fill="none" stroke="#000000" stroke-linecap="round" stroke-linejoin="round" stroke-opacity="0.4" stroke-width="0.05"/>
    </g>
    <g id="shape3" transform="matrix(1.0, 0.0, 0.0, 1.0, 31.85, 19.65)">
      <path d="M24.65 -16.4 Q30.75 -19.65 44.3 -19.65 L49.9 -19.1 56.4 -18.6 62.4 -17.9 Q95.45 -12.7 131.75 -1.75 168.05 9.15 163.75 38.45 159.4 67.75 136.95 107.05 114.45 146.35 49.75 108.8 L24.25 100.1 Q-39.8 108.65 -30.7 83.1 -21.65 57.55 -19.55 49.25 -17.5 40.9 -14.0 37.2 -10.5 33.45 -11.5 29.8 -12.55 26.15 -9.55 24.1 -6.55 22.7 -5.65 19.7 -4.8 16.7 1.25 18.15 L1.5 17.8 1.4 17.4 Q3.6 13.8 4.4 10.65 4.55 10.2 5.0 9.65 5.7 7.7 9.75 1.3 14.1 -5.65 15.75 -7.75 21.1 -14.55 24.65 -16.4 M-9.15 -2.25 Q-5.55 -0.1 -5.55 2.25 L-5.25 4.05 Q-5.25 4.95 -4.35 6.45 L-3.5 8.25 Q-3.5 9.3 -4.4 9.3 -4.8 9.3 -5.6 8.55 L-6.15 8.65 -7.05 8.55 Q-8.25 8.7 -8.55 9.65 L-11.5 10.1 Q-17.2 10.1 -19.75 8.4 -21.65 7.15 -21.65 5.1 -21.65 3.45 -20.3 1.35 -19.05 -0.65 -17.45 -1.8 -13.3 -4.8 -9.15 -2.25" fill="#00ff00" fill-rule="evenodd" stroke="none"/>
    </g>
    <g id="sprite12" transform="matrix(1.0, 0.0, 0.0, 1.0, 20.25, 15.5)">
      <use height="30.75" id="_p2" transform="matrix(1.0, 0.0, 0.0, 1.0, -20.25, -15.5)" width="40.3" xlink:href="#sprite13"/>
    </g>
    <g id="sprite13" transform="matrix(1.0, 0.0, 0.0, 1.0, 20.25, 15.5)">
      <use height="30.55" id="_p5" transform="matrix(1.0, 0.0, 0.0, 1.0, -10.2, -15.4)" width="20.25" xlink:href="#sprite14"/>
    </g>
    <g id="sprite14" transform="matrix(1.0, 0.0, 0.0, 1.0, 10.2, 15.4)">
      <use height="28.0" id="_col0" transform="matrix(0.9552, -0.2927, 0.2927, 0.9552, -10.0342, -11.5985)" width="12.4" xlink:href="#sprite15"/>
      <use height="30.55" id="_p7" transform="matrix(1.0, 0.0, 0.0, 1.0, -10.2, -15.4)" width="20.25" xlink:href="#sprite16"/>
    </g>
    <g id="sprite15" transform="matrix(1.0, 0.0, 0.0, 1.0, 6.2, -0.3)">
      <use height="28.0" transform="matrix(1.0, 0.0, 0.0, 1.0, -6.2, 0.3)" width="12.4" xlink:href="#shape4"/>
    </g>
    <g id="shape4" transform="matrix(1.0, 0.0, 0.0, 1.0, 6.2, -0.3)">
      <path d="M3.25 1.5 Q5.3 3.1 6.2 6.75 L5.5 24.35 4.35 26.8 3.15 27.6 Q1.45 28.6 -0.55 28.15 L-0.4 26.55 0.0 22.65 Q0.25 18.35 0.15 13.0 L-0.2 0.3 Q1.7 0.4 3.25 1.5" fill="#c6886a" fill-rule="evenodd" stroke="none"/>
      <path d="M-0.2 0.3 L0.15 13.0 Q0.25 18.35 0.0 22.65 L-0.4 26.55 -0.55 28.15 -2.1 27.65 Q-3.4 27.15 -4.0 26.55 -4.8 25.75 -4.85 24.65 L-6.2 6.95 Q-6.25 4.65 -5.35 3.25 -3.85 0.8 -0.2 0.3" fill="#efcdaf" fill-rule="evenodd" stroke="none"/>
      <path d="M4.35 26.8 L5.5 24.35 6.2 6.75 Q5.3 3.1 3.25 1.5 M-4.0 26.55 Q-4.8 25.75 -4.85 24.65 L-6.2 6.95 Q-6.25 4.65 -5.35 3.25" fill="none" stroke="#000000" stroke-linecap="round" stroke-linejoin="round" stroke-opacity="0.3019608" stroke-width="0.05"/>
    </g>
    <g id="sprite17" transform="matrix(1.0, 0.0, 0.0, 1.0, 30.15, 20.3)">
      <use height="44.75" id="_p2" transform="matrix(1.0, 0.0, 0.0, 1.0, -30.15, -20.3)" width="45.25" xlink:href="#sprite18"/>
    </g>
    <g id="sprite18" transform="matrix(1.0, 0.0, 0.0, 1.0, 30.15, 20.3)">
      <use height="37.75" id="_p5" transform="matrix(1.0, 0.0, 0.0, 1.0, -25.45, -17.2)" width="38.15" xlink:href="#sprite19"/>
    </g>
    <g id="sprite19" transform="matrix(1.0, 0.0, 0.0, 1.0, 25.45, 17.2)">
      <use height="37.75" id="_p7" transform="matrix(1.0, 0.0, 0.0, 1.0, -25.45, -17.2)" width="38.15" xlink:href="#sprite20"/>
    </g>
    <g id="sprite20" transform="matrix(1.0, 0.0, 0.0, 1.0, 25.45, 17.2)">
      <use height="14.1" id="_col0" transform="matrix(1.0, 0.0, 0.0, 1.0, -7.0, -7.05)" width="14.0" xlink:href="#sprite21"/>
      <use height="22.3" id="_p1" transform="matrix(-0.7987, 0.5992, 0.5992, 0.7987, -0.6469, -17.1943)" width="24.6" xlink:href="#sprite22"/>
    </g>
    <g id="sprite21" transform="matrix(1.0, 0.0, 0.0, 1.0, 7.0, 7.05)">
      <use height="14.1" transform="matrix(1.0, 0.0, 0.0, 1.0, -7.0, -7.05)" width="14.0" xlink:href="#shape5"/>
    </g>
    <g id="shape5" transform="matrix(1.0, 0.0, 0.0, 1.0, 7.0, 7.05)">
      <path d="M1.05 7.0 Q2.3 5.95 3.0 3.85 L3.85 -1.05 Q3.75 -3.05 1.1 -6.05 L0.4 -6.9 Q0.6 -7.15 0.7 -6.9 L0.95 -6.9 Q4.1 -6.6 5.85 -4.25 7.35 -2.15 6.9 1.2 6.55 3.6 4.95 5.2 L4.35 5.75 Q3.2 6.65 1.95 6.9 L1.05 7.0" fill="#c6886a" fill-rule="evenodd" stroke="none"/>
      <path d="M0.4 -6.9 L1.1 -6.05 Q3.75 -3.05 3.85 -1.05 L3.0 3.85 Q2.3 5.95 1.05 7.0 L0.95 7.05 0.8 7.05 -1.15 6.95 -1.4 6.7 Q-4.05 6.25 -5.55 4.25 -6.85 2.5 -6.9 0.45 L-7.0 -1.2 Q-6.5 -3.55 -4.9 -5.15 -4.75 -5.55 -4.2 -5.75 -3.55 -6.4 -2.6 -6.55 -1.25 -7.25 0.4 -6.9" fill="#efcdaf" fill-rule="evenodd" stroke="none"/>
      <path d="M4.95 5.2 Q6.55 3.6 6.9 1.2 7.35 -2.15 5.85 -4.25 4.1 -6.6 0.95 -6.9 L0.7 -6.9 Q0.6 -7.15 0.4 -6.9 -1.25 -7.25 -2.6 -6.55" fill="none" stroke="#000000" stroke-linecap="round" stroke-linejoin="round" stroke-opacity="0.3019608" stroke-width="0.05"/>
    </g>
    <g id="sprite23" transform="matrix(1.0, 0.0, 0.0, 1.0, 13.2, 12.95)">
      <use height="38.95" id="_p8" transform="matrix(1.0, 0.0, 0.0, 1.0, -13.2, -12.95)" width="40.2" xlink:href="#sprite24"/>
    </g>
    <g id="sprite24" transform="matrix(1.0, 0.0, 0.0, 1.0, 15.2, 17.1)">
      <use height="27.4" id="_p7b" transform="matrix(1.0, 0.0, 0.0, 1.0, -15.2, -5.55)" width="40.2" xlink:href="#sprite25"/>
      <use height="32.1" id="_col0" transform="matrix(1.0, 0.0, 0.0, 1.0, -13.75, -16.35)" width="36.1" xlink:href="#sprite26"/>
      <use height="33.25" id="_p7" transform="matrix(1.0, 0.0, 0.0, 1.0, -14.4, -17.1)" width="36.8" xlink:href="#sprite27"/>
    </g>
    <g id="sprite26" transform="matrix(1.0, 0.0, 0.0, 1.0, 18.05, 16.05)">
      <use height="32.1" transform="matrix(1.0, 0.0, 0.0, 1.0, -18.05, -16.05)" width="36.1" xlink:href="#shape6"/>
    </g>
    <g id="shape6" transform="matrix(1.0, 0.0, 0.0, 1.0, 18.05, 16.05)">
      <path d="M-1.1 -15.25 L-0.25 -13.75 Q0.7 -11.8 2.35 -9.3 L6.8 -3.9 Q9.45 -0.9 11.6 0.55 13.9 2.05 16.35 2.7 L17.65 4.5 17.0 5.15 17.0 5.35 17.2 5.5 17.2 5.65 Q19.15 7.65 16.5 8.6 L16.35 8.3 15.55 7.8 15.35 7.8 15.05 7.65 14.55 7.45 Q12.9 7.15 11.25 8.3 11.1 8.3 11.1 8.45 11.25 8.45 11.4 8.6 11.25 8.45 11.1 8.45 11.1 8.3 11.25 8.3 12.9 7.15 14.55 7.45 L15.05 7.65 15.35 7.8 15.55 7.8 16.35 8.3 12.9 9.95 11.4 8.6 9.75 9.45 8.8 9.75 Q7.95 9.75 7.8 10.45 L7.65 10.6 Q7.65 10.95 8.15 11.4 L9.45 12.25 9.6 12.25 Q7.8 12.75 5.0 11.75 2.2 10.6 1.2 7.65 0.05 4.5 -0.75 3.35 -1.75 2.2 -4.7 2.2 L-8.15 2.2 -8.35 1.85 -8.65 1.4 -8.8 0.55 -9.5 -2.4 Q-9.8 -4.85 -9.5 -7.0 -8.8 -10.3 -8.65 -13.1 L-8.5 -16.05 -1.1 -15.25" fill="#efcdaf" fill-rule="evenodd" stroke="none"/>
      <path d="M-8.5 -16.05 L-8.65 -13.1 Q-8.8 -10.3 -9.5 -7.0 -9.8 -4.85 -9.5 -2.4 L-8.8 0.55 -8.65 1.4 -8.35 1.85 -8.15 2.2 -4.7 2.2 Q-1.75 2.2 -0.75 3.35 0.05 4.5 1.2 7.65 2.2 10.6 5.0 11.75 7.8 12.75 9.6 12.25 L9.45 12.25 8.15 11.4 Q7.65 10.95 7.65 10.6 L7.8 10.45 Q7.95 9.75 8.8 9.75 L9.75 9.45 11.4 8.6 12.9 9.95 16.35 8.3 16.5 8.6 16.7 9.1 Q16.85 10.1 15.7 10.75 L14.05 12.1 13.55 14.4 11.25 16.05 5.15 15.05 3.2 14.55 Q1.4 12.9 0.9 11.25 L0.05 10.25 Q-1.25 8.6 -3.25 7.8 -4.85 7.0 -6.7 6.8 L-14.1 5.15 Q-14.25 5.0 -14.4 5.0 -15.25 5.0 -15.55 4.35 -17.4 3.5 -17.7 1.7 L-17.85 1.55 -18.05 0.55 Q-18.05 -1.4 -17.4 -4.05 -16.7 -6.35 -16.4 -9.3 L-15.9 -12.6 Q-14.25 -13.9 -12.45 -14.9 -10.45 -15.75 -8.5 -16.05 M14.05 12.1 L13.25 10.45 14.05 12.1 M13.25 10.45 L13.05 10.25 13.05 10.45 13.25 10.45 M12.9 9.95 L12.9 10.1 13.05 10.25 12.9 10.1 12.9 9.95 M11.75 11.4 Q10.25 12.4 9.6 12.25 10.25 12.4 11.75 11.4" fill="#c6886a" fill-rule="evenodd" stroke="none"/>
      <path d="M13.05 10.25 L13.25 10.45 13.05 10.45 13.05 10.25" fill="#e89f48" fill-rule="evenodd" stroke="none"/>
      <path d="M16.5 8.6 Q19.15 7.65 17.2 5.65 L17.2 5.5 17.0 5.35 17.0 5.15 17.65 4.5 16.35 2.7 Q13.9 2.05 11.6 0.55 9.45 -0.9 6.8 -3.9 L2.35 -9.3 Q0.7 -11.8 -0.25 -13.75 L-1.1 -15.25 M9.6 12.25 L9.45 12.25 8.15 11.4 Q7.65 10.95 7.65 10.6 L7.8 10.45 Q7.95 9.75 8.8 9.75 L9.75 9.45 11.4 8.6 Q11.25 8.45 11.1 8.45 11.1 8.3 11.25 8.3 12.9 7.15 14.55 7.45 L15.05 7.65 15.35 7.8 15.55 7.8 16.35 8.3 16.5 8.6 16.7 9.1 Q16.85 10.1 15.7 10.75 L14.05 12.1 13.55 14.4 11.25 16.05 5.15 15.05 3.2 14.55 Q1.4 12.9 0.9 11.25 L0.05 10.25 Q-1.25 8.6 -3.25 7.8 -4.85 7.0 -6.7 6.8 L-14.1 5.15 Q-14.25 5.0 -14.4 5.0 -15.25 5.0 -15.55 4.35 -17.4 3.5 -17.7 1.7 M-17.85 1.55 L-18.05 0.55 Q-18.05 -1.4 -17.4 -4.05 -16.7 -6.35 -16.4 -9.3 L-15.9 -12.6 M13.25 10.45 L14.05 12.1 M13.25 10.45 L13.05 10.25 12.9 10.1 12.9 9.95 11.4 8.6 M12.9 9.95 L16.35 8.3 M9.6 12.25 Q10.25 12.4 11.75 11.4" fill="none" stroke="#000000" stroke-linecap="round" stroke-linejoin="round" stroke-opacity="0.3019608" stroke-width="0.05"/>
    </g>
    <g id="sprite27" transform="matrix(1.0, 0.0, 0.0, 1.0, 19.6, 17.85)">
      <use height="33.25" id="_p1" transform="matrix(1.0, 0.0, 0.0, 1.0, -19.6, -17.85)" width="36.8" xlink:href="#sprite28"/>
    </g>
    <g id="sprite29" transform="matrix(1.0, 0.0, 0.0, 1.0, 29.55, 4.4)">
      <use height="52.5" id="_p2" transform="matrix(1.0, 0.0, 0.0, 1.0, -29.55, -4.4)" width="53.85" xlink:href="#sprite30"/>
    </g>
    <g id="sprite30" transform="matrix(1.0, 0.0, 0.0, 1.0, 29.45, 20.8)">
      <use height="52.5" id="_p6" transform="matrix(1.0, 0.0, 0.0, 1.0, -24.0, -20.8)" width="43.9" xlink:href="#sprite31"/>
    </g>
    <g id="sprite31" transform="matrix(1.0, 0.0, 0.0, 1.0, 24.0, 20.8)">
      <use height="37.35" id="_col0" transform="matrix(1.0, 0.0, 0.0, 1.0, -8.0, -18.65)" width="16.0" xlink:href="#sprite32"/>
      <use height="49.6" id="_p7" transform="matrix(0.9969, -0.0749, 0.0749, 0.9969, -24.0105, -17.758)" width="40.3" xlink:href="#sprite33"/>
    </g>
    <g id="sprite32" transform="matrix(1.0, 0.0, 0.0, 1.0, 8.0, 18.65)">
      <use height="37.35" transform="matrix(1.1594, 0.0, 0.0, 1.0, -8.0, -18.65)" width="13.8" xlink:href="#shape7"/>
    </g>
    <g id="shape7" transform="matrix(1.0, 0.0, 0.0, 1.0, 6.9, 18.65)">
      <path d="M0.05 -18.6 Q3.4 -18.45 5.5 -16.1 L5.95 -15.65 6.9 -13.35 6.75 12.25 Q6.45 14.0 5.75 15.25 4.05 18.45 0.3 18.7 -0.7 11.7 -0.55 11.15 L0.15 -5.25 0.05 -18.6" fill="#d6baba" fill-rule="evenodd" stroke="none"/>
      <path d="M0.05 -18.6 L0.15 -5.25 -0.55 11.15 Q-0.7 11.7 0.3 18.7 -3.55 17.8 -5.25 16.05 -6.8 14.5 -6.65 12.15 L-6.9 -13.5 -5.45 -16.15 -4.05 -17.4 Q-2.4 -18.9 0.05 -18.6" fill="#ffffff" fill-rule="evenodd" stroke="none"/>
      <path d="M5.75 15.25 Q6.45 14.0 6.75 12.25 L6.9 -13.35 5.95 -15.65 M-5.45 -16.15 L-6.9 -13.5 -6.65 12.15 Q-6.8 14.5 -5.25 16.05" fill="none" stroke="#000000" stroke-linecap="round" stroke-linejoin="round" stroke-opacity="0.3019608" stroke-width="0.05"/>
    </g>
    <g id="sprite33" transform="matrix(1.0, 0.0, 0.0, 1.0, 23.05, 21.1)">
      <use height="33.65" id="_col2" transform="matrix(1.0203, -0.0668, 0.077, 1.1768, -16.3576, -19.0691)" width="30.4" xlink:href="#sprite7"/>
    </g>
    <g id="sprite34" transform="matrix(1.0, 0.0, 0.0, 1.0, 18.85, 2.25)">
      <use height="43.1" id="_p2" transform="matrix(1.0, 0.0, 0.0, 1.0, -18.85, -2.25)" width="31.35" xlink:href="#sprite35"/>
    </g>
    <g id="sprite35" transform="matrix(1.0, 0.0, 0.0, 1.0, 18.75, 18.65)">
      <use height="43.1" id="_p6" transform="matrix(1.0, 0.0, 0.0, 1.0, -13.4, -18.65)" width="22.4" xlink:href="#sprite36"/>
    </g>
    <g id="sprite36" transform="matrix(1.0, 0.0, 0.0, 1.0, 13.4, 18.65)">
      <use height="37.35" id="_col0" transform="matrix(1.0, 0.0, 0.0, 1.0, -8.0, -18.65)" width="16.0" xlink:href="#sprite37"/>
      <use height="33.8" id="_col3" transform="matrix(1.0, 0.0, 0.0, 1.0, -8.2, -18.65)" width="17.2" xlink:href="#sprite38"/>
      <use height="43.1" id="_p7" transform="matrix(1.0, 0.0, 0.0, 1.0, -13.4, -18.65)" width="22.05" xlink:href="#sprite39"/>
    </g>
    <g id="sprite37" transform="matrix(1.0, 0.0, 0.0, 1.0, 8.0, 18.65)">
      <use height="37.35" transform="matrix(1.1594, 0.0, 0.0, 1.0, -8.0, -18.65)" width="13.8" xlink:href="#shape7"/>
    </g>
    <g id="sprite38" transform="matrix(1.0, 0.0, 0.0, 1.0, 8.2, 18.65)">
      <use height="33.8" transform="matrix(1.0, 0.0, 0.0, 1.0, -8.2, -18.65)" width="17.2" xlink:href="#shape8"/>
    </g>
    <g id="shape8" transform="matrix(1.0, 0.0, 0.0, 1.0, 8.2, 18.65)">
      <path d="M-0.6 15.15 L-0.55 11.35 -0.3 5.8 Q0.0 0.55 0.15 -5.25 L0.05 -18.6 Q3.95 -18.45 6.35 -16.1 L6.9 -15.65 8.0 -13.35 9.0 7.6 Q8.5 10.9 6.2 12.6 3.85 14.25 -0.6 15.15" fill="#d6baba" fill-rule="evenodd" stroke="none"/>
      <path d="M-0.6 15.15 Q-3.15 14.9 -4.9 14.0 -6.65 13.05 -7.6 10.95 -8.55 8.9 -8.0 3.75 L-8.0 -13.5 Q-7.25 -15.05 -6.3 -16.15 L-4.7 -17.4 Q-2.8 -18.9 0.05 -18.6 L0.15 -5.25 Q0.0 0.55 -0.3 5.8 L-0.55 11.35 -0.6 15.15" fill="#ffffff" fill-rule="evenodd" stroke="none"/>
      <path d="M-6.3 -16.15 Q-7.25 -15.05 -8.0 -13.5 L-8.0 3.75 Q-8.55 8.9 -7.6 10.95 -6.65 13.05 -4.9 14.0 -3.15 14.9 -0.6 15.15 3.85 14.25 6.2 12.6 8.5 10.9 9.0 7.6 L8.0 -13.35 6.9 -15.65" fill="none" stroke="#000000" stroke-linecap="round" stroke-linejoin="round" stroke-opacity="0.3019608" stroke-width="0.05"/>
    </g>
    <g id="sprite40" transform="matrix(1.0, 0.0, 0.0, 1.0, 20.0, 17.7)">
      <use height="40.55" transform="matrix(1.0, 0.0, 0.0, 1.0, -20.0, -17.7)" width="30.7" xlink:href="#sprite41"/>
    </g>
    <g id="sprite41" transform="matrix(1.0, 0.0, 0.0, 1.0, 18.7, 20.85)">
      <use height="35.6" id="_p7b" transform="matrix(1.0, 0.0, 0.0, 1.0, -18.7, -15.9)" width="29.3" xlink:href="#sprite42"/>
      <use height="33.4" id="_col0" transform="matrix(1.0, 0.0, 0.0, 1.0, -16.15, -20.0)" width="25.45" xlink:href="#sprite43"/>
      <use height="38.65" id="_p7" transform="matrix(1.0, 0.0, 0.0, 1.0, -18.2, -20.85)" width="30.2" xlink:href="#sprite44"/>
    </g>
    <g id="sprite43" transform="matrix(1.0, 0.0, 0.0, 1.0, 12.75, 16.7)">
      <use height="33.4" transform="matrix(1.0, 0.0, 0.0, 1.0, -12.75, -16.7)" width="25.45" xlink:href="#shape9"/>
    </g>
    <g id="shape9" transform="matrix(1.0, 0.0, 0.0, 1.0, 12.75, 16.7)">
      <path d="M9.0 -12.95 L9.65 -9.55 9.8 -8.4 9.8 -7.25 Q9.95 -4.35 10.6 -1.25 11.25 1.65 12.4 4.75 L12.7 6.55 10.8 11.25 Q8.0 9.15 6.25 11.75 L5.9 12.55 4.75 11.4 5.9 12.55 6.25 11.75 Q8.0 9.15 10.8 11.25 L10.6 13.35 10.45 14.3 Q8.65 15.45 7.7 14.65 L6.05 13.5 Q5.9 17.25 1.85 16.6 -0.1 16.75 0.05 14.65 -1.7 17.55 -5.3 15.6 L-5.6 14.95 -4.95 12.4 -4.65 8.95 -4.95 12.4 -5.6 14.95 -7.55 16.45 -10.5 15.95 -12.45 14.3 -12.45 14.0 Q-12.1 12.7 -10.35 12.2 L-7.4 13.35 -6.45 13.2 -6.75 12.2 -6.25 10.9 -4.65 8.95 Q-4.15 8.95 -3.85 9.6 -3.5 10.25 -3.5 11.25 -4.55 11.55 -4.15 12.2 L-3.65 12.7 -3.65 13.2 -2.35 13.5 -2.05 13.35 -1.9 13.35 -0.1 13.5 -0.1 12.4 -0.1 12.05 0.2 11.4 0.7 12.2 1.7 13.05 1.7 13.35 1.85 13.85 3.95 13.85 1.85 13.85 1.7 13.35 3.95 13.85 4.45 13.65 4.6 13.2 4.6 11.4 4.75 11.4 6.25 7.65 3.15 3.45 1.05 -0.1 Q1.2 -2.55 1.5 -4.5 1.7 -6.6 0.85 -11.3 L-0.1 -16.5 -0.1 -16.7 Q3.0 -16.7 5.25 -15.85 L6.4 -15.4 7.7 -14.75 8.85 -13.6 Q8.85 -13.25 9.0 -12.95 M-0.1 13.5 L0.05 14.65 -0.1 13.5 M7.55 12.2 L7.85 11.9 Q8.85 11.9 9.0 12.55 L9.0 13.05 7.55 12.7 7.55 12.2 7.55 12.7 9.0 13.05 9.0 12.55 Q8.85 11.9 7.85 11.9 L7.55 12.2 M5.9 12.55 L6.05 13.5 5.9 12.55" fill="#c6886a" fill-rule="evenodd" stroke="none"/>
      <path d="M9.65 -9.55 L9.0 -12.95 9.3 -12.15 9.65 -9.55 M-0.1 -16.5 L0.85 -11.3 Q1.7 -6.6 1.5 -4.5 1.2 -2.55 1.05 -0.1 L3.15 3.45 6.25 7.65 4.75 11.4 4.6 11.4 2.8 10.6 Q1.35 10.1 0.2 11.4 1.35 10.1 2.8 10.6 L4.6 11.4 4.6 13.2 4.45 13.65 Q4.1 11.75 2.0 12.7 L1.7 13.05 2.0 12.7 Q4.1 11.75 4.45 13.65 L3.95 13.85 1.7 13.35 1.7 13.05 0.7 12.2 0.2 11.4 -0.1 12.05 -0.25 12.05 -3.0 11.1 -3.5 11.25 -3.0 11.1 -0.25 12.05 -0.1 12.4 -0.1 13.5 -1.9 13.35 Q-0.75 12.4 -3.0 12.4 -3.35 12.4 -3.65 12.7 -3.35 12.4 -3.0 12.4 -0.75 12.4 -1.9 13.35 L-2.05 13.35 -2.35 13.5 -3.65 13.2 -1.9 13.35 -3.65 13.2 -3.65 12.7 -4.15 12.2 Q-4.55 11.55 -3.5 11.25 -3.5 10.25 -3.85 9.6 -4.15 8.95 -4.65 8.95 L-6.25 10.9 -6.75 12.2 -6.45 13.2 -7.4 13.35 -10.35 12.2 Q-12.1 12.7 -12.45 14.0 L-12.45 14.3 -12.6 14.0 -12.75 13.2 Q-12.6 11.55 -12.1 9.95 -11.8 7.2 -11.15 4.6 L-9.5 -0.3 Q-8.85 -1.9 -8.55 -3.35 L-7.55 -7.45 -6.75 -10.85 Q-6.75 -16.5 -0.75 -16.5 L-0.1 -16.5 M-7.4 8.3 L-9.85 8.15 -12.1 9.95 -9.85 8.15 -7.4 8.3" fill="#efcdaf" fill-rule="evenodd" stroke="none"/>
      <path d="M-0.1 12.4 L-0.25 12.05 -0.1 12.05 -0.1 12.4" fill="#c16308" fill-rule="evenodd" stroke="none"/>
      <path d="M9.0 -12.95 L9.65 -9.55 M9.0 -12.95 Q8.85 -13.25 8.85 -13.6 M4.75 11.4 L5.9 12.55 6.25 11.75 Q8.0 9.15 10.8 11.25 L12.7 6.55 12.4 4.75 Q11.25 1.65 10.6 -1.25 9.95 -4.35 9.8 -7.25 L9.8 -8.4 9.65 -9.55 M-12.45 14.3 L-12.6 14.0 -12.75 13.2 Q-12.6 11.55 -12.1 9.95 -11.8 7.2 -11.15 4.6 L-9.5 -0.3 Q-8.85 -1.9 -8.55 -3.35 L-7.55 -7.45 -6.75 -10.85 M-0.25 12.05 L-3.0 11.1 -3.5 11.25 M-0.1 13.5 L-0.1 12.4 M-0.25 12.05 L-0.1 12.05 0.2 11.4 Q1.35 10.1 2.8 10.6 L4.6 11.4 4.75 11.4 M-4.65 8.95 L-4.95 12.4 -5.6 14.95 -5.3 15.6 Q-1.7 17.55 0.05 14.65 L-0.1 13.5 M-0.1 12.05 L-0.1 12.4 M-12.45 14.3 L-10.5 15.95 -7.55 16.45 -5.6 14.95 M-12.1 9.95 L-9.85 8.15 -7.4 8.3 M10.8 11.25 L10.6 13.35 10.45 14.3 Q8.65 15.45 7.7 14.65 L6.05 13.5 Q5.9 17.25 1.85 16.6 -0.1 16.75 0.05 14.65 M6.05 13.5 L5.9 12.55" fill="none" stroke="#000000" stroke-linecap="round" stroke-linejoin="round" stroke-opacity="0.4" stroke-width="0.05"/>
      <path d="M-3.65 12.7 Q-3.35 12.4 -3.0 12.4 -0.75 12.4 -1.9 13.35 L-3.65 13.2 -3.65 12.7 M3.95 13.85 L1.85 13.85 1.7 13.35 1.7 13.05 2.0 12.7 Q4.1 11.75 4.45 13.65 M-6.75 12.2 L-6.45 13.2 -7.4 13.35 -10.35 12.2 M7.55 12.2 L7.55 12.7 9.0 13.05 9.0 12.55 Q8.85 11.9 7.85 11.9 L7.55 12.2 M3.95 13.85 L4.45 13.65" fill="none" stroke="#000000" stroke-linecap="round" stroke-linejoin="round" stroke-opacity="0.15294118" stroke-width="0.05"/>
    </g>
    <g id="sprite44" transform="matrix(1.0, 0.0, 0.0, 1.0, 15.25, 19.35)">
      <use height="38.65" id="_p1" transform="matrix(1.0, 0.0, 0.0, 1.0, -15.0, -19.35)" width="29.95" xlink:href="#sprite45"/>
    </g>
    <g id="sprite46" transform="matrix(1.0, 0.0, 0.0, 1.0, 19.75, 4.6)">
      <use height="51.8" id="_p2" transform="matrix(1.0, 0.0, 0.0, 1.0, -19.75, -4.6)" width="41.8" xlink:href="#sprite47"/>
    </g>
    <g id="sprite47" transform="matrix(1.0, 0.0, 0.0, 1.0, 19.65, 21.0)">
      <use height="51.8" id="_p6" transform="matrix(1.0, 0.0, 0.0, 1.0, -15.8, -21.0)" width="33.6" xlink:href="#sprite48"/>
    </g>
    <g id="sprite48" transform="matrix(1.0, 0.0, 0.0, 1.0, 15.8, 21.0)">
      <use height="37.35" id="_col0" transform="matrix(1.0, 0.0, 0.0, 1.0, -8.0, -18.65)" width="16.0" xlink:href="#sprite32"/>
      <use height="51.8" id="_p7" transform="matrix(1.0, 0.0, 0.0, 1.0, -15.8, -21.0)" width="33.6" xlink:href="#sprite49"/>
    </g>
    <g id="sprite49" transform="matrix(1.0, 0.0, 0.0, 1.0, 16.35, 22.55)">
      <use height="33.65" id="_col2" transform="matrix(1.0203, -0.0668, 0.077, 1.1768, -16.3576, -19.0691)" width="30.4" xlink:href="#sprite7"/>
    </g>
    <g id="sprite50" transform="matrix(1.0, 0.0, 0.0, 1.0, 22.85, 18.1)">
      <use height="34.25" id="_p2" transform="matrix(1.0, 0.0, 0.0, 1.0, -22.85, -18.1)" width="46.3" xlink:href="#sprite51"/>
    </g>
    <g id="sprite51" transform="matrix(1.0, 0.0, 0.0, 1.0, 19.8, 24.05)">
      <use height="29.55" id="_p6" transform="matrix(1.0, 0.0, 0.0, 1.0, -12.8, -20.75)" width="30.8" xlink:href="#sprite52"/>
    </g>
    <g id="sprite52" transform="matrix(1.0, 0.0, 0.0, 1.0, 12.8, 20.75)">
      <use height="29.15" id="_col3" transform="matrix(1.0, 0.0, 0.0, 1.0, -12.55, -20.5)" width="30.4" xlink:href="#sprite53"/>
      <use height="29.55" id="_p7" transform="matrix(1.0, 0.0, 0.0, 1.0, -12.8, -20.75)" width="30.8" xlink:href="#sprite54"/>
    </g>
    <g id="sprite53" transform="matrix(1.0, 0.0, 0.0, 1.0, 15.2, 14.6)">
      <use height="29.15" transform="matrix(1.0, 0.0, 0.0, 1.0, -15.2, -14.6)" width="30.4" xlink:href="#shape10"/>
    </g>
    <g id="shape10" transform="matrix(1.0, 0.0, 0.0, 1.0, 15.2, 14.6)">
      <path d="M-14.2 2.05 L-14.55 0.8 Q-15.4 -2.05 -15.15 -3.75 -14.8 -6.05 -11.55 -9.8 -8.55 -13.6 -2.3 -14.6 L2.45 -14.25 Q1.95 -10.8 3.0 -2.0 4.0 6.75 -1.5 8.75 L-2.8 8.95 -5.05 9.1 Q-8.1 8.95 -10.55 7.15 -10.85 6.95 -11.2 7.15 L-11.35 7.3 -11.85 6.65 Q-13.15 4.8 -13.85 3.0 L-14.0 2.6 -14.2 2.05" fill="#ffffff" fill-rule="evenodd" stroke="none"/>
      <path d="M-11.35 7.3 L-11.2 7.15 Q-10.85 6.95 -10.55 7.15 -8.1 8.95 -5.05 9.1 L-2.8 8.95 -1.5 8.75 Q4.0 6.75 3.0 -2.0 1.95 -10.8 2.45 -14.25 L5.4 -13.45 7.55 -12.6 7.9 -12.45 Q8.4 -12.3 9.05 -11.8 L9.85 -11.45 10.2 -11.15 10.35 -11.0 11.35 -10.3 12.85 -8.2 14.5 -4.55 Q15.45 -1.45 15.15 2.35 14.65 9.6 8.55 12.55 2.45 15.85 -3.65 13.7 L-3.8 13.55 -6.25 12.2 Q-6.6 11.95 -6.9 11.75 L-7.6 11.25 -8.75 10.1 -8.9 9.9 -9.55 9.25 -10.35 8.45 -11.35 7.3" fill="#d6baba" fill-rule="evenodd" stroke="none"/>
      <path d="M2.45 -14.25 L-2.3 -14.6 Q-8.55 -13.6 -11.55 -9.8 -14.8 -6.05 -15.15 -3.75 -15.4 -2.05 -14.55 0.8 L-14.2 2.05 M2.45 -14.25 L5.4 -13.45 7.55 -12.6 7.9 -12.45 Q8.4 -12.3 9.05 -11.8 L9.85 -11.45 10.2 -11.15 10.35 -11.0 11.35 -10.3 12.85 -8.2 14.5 -4.55 Q15.45 -1.45 15.15 2.35 14.65 9.6 8.55 12.55 2.45 15.85 -3.65 13.7 M-3.8 13.55 L-6.25 12.2" fill="none" stroke="#000000" stroke-linecap="round" stroke-linejoin="round" stroke-opacity="0.3019608" stroke-width="0.05"/>
    </g>
    <g id="sprite55" transform="matrix(1.0, 0.0, 0.0, 1.0, 12.7, 2.85)">
      <use height="45.0" id="_p2" transform="matrix(1.0, 0.0, 0.0, 1.0, -12.7, -2.85)" width="29.7" xlink:href="#sprite56"/>
    </g>
    <g id="sprite56" transform="matrix(1.0, 0.0, 0.0, 1.0, 12.6, 19.25)">
      <use height="45.0" id="_p6" transform="matrix(1.0, 0.0, 0.0, 1.0, -8.9, -19.25)" width="20.95" xlink:href="#sprite57"/>
    </g>
    <g id="sprite57" transform="matrix(1.0, 0.0, 0.0, 1.0, 8.9, 19.25)">
      <use height="37.35" id="_col0" transform="matrix(1.0, 0.0, 0.0, 1.0, -8.0, -18.65)" width="16.0" xlink:href="#sprite37"/>
      <use height="31.6" id="_col3" transform="matrix(1.0, 0.0, 0.0, 1.0, -8.15, -18.95)" width="17.25" xlink:href="#sprite58"/>
      <use height="45.0" id="_p7" transform="matrix(1.0, 0.0, 0.0, 1.0, -8.9, -19.25)" width="20.95" xlink:href="#sprite59"/>
    </g>
    <g id="sprite58" transform="matrix(1.0, 0.0, 0.0, 1.0, 8.25, 18.65)">
      <use height="31.6" transform="matrix(1.0, 0.0, 0.0, 1.0, -8.25, -18.65)" width="17.25" xlink:href="#shape11"/>
    </g>
    <g id="shape11" transform="matrix(1.0, 0.0, 0.0, 1.0, 8.25, 18.65)">
      <path d="M-0.5 12.9 L-0.55 11.35 -0.3 5.8 Q0.0 0.55 0.15 -5.25 L0.05 -18.6 Q3.95 -18.45 6.35 -16.1 L6.9 -15.65 8.0 -13.35 9.0 7.6 Q8.55 9.9 6.25 11.55 3.9 13.15 -0.5 12.9" fill="#d6baba" fill-rule="evenodd" stroke="none"/>
      <path d="M0.05 -18.6 L0.15 -5.25 Q0.0 0.55 -0.3 5.8 L-0.55 11.35 -0.5 12.9 Q-3.0 12.55 -4.85 11.65 -6.75 10.75 -7.7 9.3 -8.65 7.85 -8.0 3.75 L-8.0 -13.5 Q-7.25 -15.05 -6.3 -16.15 L-4.7 -17.4 Q-2.8 -18.9 0.05 -18.6" fill="#ffffff" fill-rule="evenodd" stroke="none"/>
      <path d="M-0.5 12.9 Q3.9 13.15 6.25 11.55 8.55 9.9 9.0 7.6 L8.0 -13.35 M-8.0 -13.5 L-8.0 3.75 Q-8.65 7.85 -7.7 9.3 -6.75 10.75 -4.85 11.65 -3.0 12.55 -0.5 12.9 Z" fill="none" stroke="#000000" stroke-linecap="round" stroke-linejoin="round" stroke-opacity="0.3019608" stroke-width="0.05"/>
    </g>
    <g id="sprite60" transform="matrix(1.0, 0.0, 0.0, 1.0, 30.8, 11.35)">
      <use height="44.35" id="_p2" transform="matrix(1.0, 0.0, -0.0697, 0.9926, -27.6904, -11.3459)" width="63.95" xlink:href="#sprite61"/>
    </g>
    <g id="sprite61" transform="matrix(1.0, 0.0, 0.0, 1.0, 24.65, 20.95)">
      <use height="44.25" id="_p5" transform="matrix(1.0, 0.0, 0.0, 1.0, -13.95, -20.9)" width="37.4" xlink:href="#sprite62"/>
    </g>
    <g id="sprite62" transform="matrix(1.0, 0.0, 0.0, 1.0, 14.05, 20.9)">
      <use height="22.55" id="_col0" transform="matrix(1.0, 0.0, 0.0, 1.0, -10.7, -20.8)" width="28.0" xlink:href="#sprite63"/>
      <use height="44.25" id="_p7" transform="matrix(1.0, 0.0, 0.0, 1.0, -14.05, -20.9)" width="37.4" xlink:href="#sprite64"/>
    </g>
    <g id="sprite63" transform="matrix(1.0, 0.0, 0.0, 1.0, 10.7, 20.8)">
      <use height="22.55" transform="matrix(1.0, 0.0, 0.0, 1.0, -10.7, -20.8)" width="28.0" xlink:href="#shape12"/>
    </g>
    <g id="shape12" transform="matrix(1.0, 0.0, 0.0, 1.0, 10.7, 20.8)">
      <path d="M-1.05 1.4 Q-2.9 1.1 -4.4 0.4 -6.55 -0.1 -8.2 -1.4 -10.2 -2.4 -10.7 -4.95 L-10.55 -6.1 -10.2 -8.45 Q-9.7 -11.75 -8.7 -14.75 -8.2 -16.45 -6.2 -17.95 -4.2 -19.6 -1.55 -20.45 L2.8 -20.8 3.65 -20.8 Q3.65 -18.95 4.65 -17.3 L4.85 -16.85 5.2 -14.75 4.65 -12.95 Q2.95 -10.1 3.15 -7.1 3.15 -4.1 1.45 -1.9 L-1.05 1.4 M-4.9 -7.45 Q-6.2 -7.1 -5.7 -6.25 -5.4 -6.1 -5.2 -6.45 -5.05 -6.45 -5.05 -6.6 L-4.9 -7.45 -4.9 -9.75 -4.9 -7.45" fill="#efcdaf" fill-rule="evenodd" stroke="none"/>
      <path d="M-1.05 1.4 L1.45 -1.9 Q3.15 -4.1 3.15 -7.1 2.95 -10.1 4.65 -12.95 L5.2 -14.75 4.85 -16.85 4.65 -17.3 Q3.65 -18.95 3.65 -20.8 L4.45 -20.65 8.8 -19.45 9.65 -18.95 Q10.9 -18.15 12.5 -17.8 L13.8 -17.3 14.1 -16.8 Q14.65 -15.9 14.5 -14.75 14.4 -12.55 15.5 -10.1 L17.15 -5.6 Q17.8 -3.75 15.15 -1.9 12.3 -0.1 10.3 0.4 L5.8 1.75 1.8 1.75 0.3 1.75 -0.7 1.6 Q-0.85 1.4 -1.05 1.4 M-4.9 -7.45 L-5.05 -6.6 Q-5.05 -6.45 -5.2 -6.45 -5.4 -6.1 -5.7 -6.25 -6.2 -7.1 -4.9 -7.45" fill="#c6886a" fill-rule="evenodd" stroke="none"/>
      <path d="M3.65 -20.8 L2.8 -20.8 -1.55 -20.45 Q-4.2 -19.6 -6.2 -17.95 -8.2 -16.45 -8.7 -14.75 -9.7 -11.75 -10.2 -8.45 L-10.55 -6.1 -10.7 -4.95 Q-10.2 -2.4 -8.2 -1.4 -6.55 -0.1 -4.4 0.4 -2.9 1.1 -1.05 1.4 M3.65 -20.8 L4.45 -20.65 8.8 -19.45 M12.5 -17.8 L13.8 -17.3 14.1 -16.8 Q14.65 -15.9 14.5 -14.75 14.4 -12.55 15.5 -10.1 L17.15 -5.6 Q17.8 -3.75 15.15 -1.9 12.3 -0.1 10.3 0.4 L5.8 1.75 1.8 1.75 0.3 1.75 -0.7 1.6 M-4.9 -7.45 L-5.05 -6.6 Q-5.05 -6.45 -5.2 -6.45 -5.4 -6.1 -5.7 -6.25 -6.2 -7.1 -4.9 -7.45 L-4.9 -9.75" fill="none" stroke="#000000" stroke-linecap="round" stroke-linejoin="round" stroke-opacity="0.3019608" stroke-width="0.05"/>
    </g>
    <g id="sprite64" transform="matrix(1.0, 0.0, 0.0, 1.0, 17.95, 28.0)">
      <use height="28.6" id="_p1" transform="matrix(1.0, 0.0, 0.0, 1.0, -17.0, -14.3)" width="34.05" xlink:href="#sprite65"/>
    </g>
    <g id="sprite66" transform="matrix(1.0, 0.0, 0.0, 1.0, 37.35, 19.95)">
      <use height="44.2" id="_p2" transform="matrix(1.0, 0.0, 0.0, 1.0, -37.35, -19.95)" width="79.15" xlink:href="#sprite67"/>
    </g>
    <g id="sprite67" transform="matrix(1.0, 0.0, 0.0, 1.0, 19.35, 4.05)">
      <use height="41.1" id="_p5" transform="matrix(1.0, 0.0, 0.0, 1.0, -7.5, -2.8)" width="54.35" xlink:href="#sprite68"/>
    </g>
    <g id="sprite68" transform="matrix(1.0, 0.0, 0.0, 1.0, 7.5, 2.8)">
      <use height="25.5" id="_p7b" transform="matrix(1.0, 0.0, 0.0, 1.0, -7.5, 0.5)" width="20.35" xlink:href="#sprite69"/>
      <use height="35.0" id="_col0" transform="matrix(0.9077, 0.0, 0.0, 0.9077, -0.0172, 0.0158)" width="39.75" xlink:href="#sprite70"/>
      <use height="41.1" id="_p7" transform="matrix(1.0, 0.0, 0.0, 1.0, -4.2, -2.8)" width="51.05" xlink:href="#sprite71"/>
    </g>
    <g id="sprite70" transform="matrix(1.0, 0.0, 0.0, 1.0, 19.85, 17.5)">
      <use height="35.0" transform="matrix(1.0, 0.0, 0.0, 1.0, -19.85, -17.5)" width="39.75" xlink:href="#shape13"/>
    </g>
    <g id="shape13" transform="matrix(1.0, 0.0, 0.0, 1.0, 19.85, 17.5)">
      <path d="M11.7 -16.6 L13.8 -16.15 17.95 -14.65 19.05 -13.85 19.75 -12.5 19.9 -10.65 Q19.85 -9.1 19.4 -7.6 18.55 -4.9 17.05 -2.35 L14.1 2.45 Q12.7 4.5 10.9 6.2 L4.95 13.8 4.7 14.1 Q2.65 15.75 0.15 16.4 L-1.0 16.7 -2.3 17.0 -4.55 17.3 -6.75 17.5 -6.75 17.45 Q-5.75 14.95 -5.4 12.35 L-4.9 10.55 -4.45 9.4 Q-3.6 7.5 -5.3 6.3 L-5.45 5.95 -5.1 5.75 -4.2 5.55 -1.7 4.65 Q0.75 3.65 2.75 2.0 L4.85 0.35 7.4 -1.6 Q9.35 -3.15 11.15 -4.85 L12.65 -6.55 13.4 -8.0 Q13.6 -8.6 13.4 -9.15 12.4 -12.05 9.4 -12.4 L7.7 -12.15 5.65 -11.3 1.25 -9.2 Q-1.15 -8.1 -3.7 -7.55 L-5.95 -7.5 Q-7.45 -7.85 -8.5 -9.0 L-9.0 -9.95 Q-9.35 -11.15 -8.75 -12.35 L-7.15 -15.5 Q-5.7 -16.35 -3.45 -16.8 L-3.2 -16.85 1.5 -17.5 1.65 -17.5 10.9 -16.7 11.55 -16.6 11.7 -16.6" fill="#c6886a" fill-rule="evenodd" stroke="none"/>
      <path d="M-3.2 -16.85 L-3.45 -16.8 -3.5 -16.8 -3.2 -16.85 M-7.15 -15.5 L-8.75 -12.35 Q-9.35 -11.15 -9.0 -9.95 L-8.5 -9.0 Q-7.45 -7.85 -5.95 -7.5 L-3.7 -7.55 Q-1.15 -8.1 1.25 -9.2 L5.65 -11.3 7.7 -12.15 9.4 -12.4 Q12.4 -12.05 13.4 -9.15 13.6 -8.6 13.4 -8.0 L12.65 -6.55 11.15 -4.85 Q9.35 -3.15 7.4 -1.6 L4.85 0.35 2.75 2.0 Q0.75 3.65 -1.7 4.65 L-4.2 5.55 -5.1 5.75 -5.45 5.95 -5.3 6.3 Q-3.6 7.5 -4.45 9.4 L-4.9 10.55 -5.4 12.35 Q-5.75 14.95 -6.75 17.45 L-9.5 17.3 Q-12.35 17.0 -14.95 15.85 -18.15 14.45 -19.85 11.4 L-19.8 10.5 -19.65 6.85 -18.4 0.1 -18.3 -0.25 -18.3 -0.3 -18.4 -0.6 -18.45 -0.75 -18.75 -1.7 -18.7 -2.95 -18.75 -1.7 -18.9 -2.15 -18.7 -2.95 -18.65 -3.2 -18.6 -3.4 -17.55 -6.15 Q-16.75 -8.2 -14.85 -9.55 L-14.1 -10.1 -14.85 -9.55 Q-16.75 -8.2 -17.55 -6.15 L-18.6 -3.4 -17.9 -5.55 -16.9 -7.45 Q-16.15 -8.7 -14.9 -9.55 L-14.1 -10.1 -13.65 -10.5 -12.0 -11.9 -10.95 -12.85 -8.25 -14.8 -7.75 -15.05 -7.15 -15.5 -7.75 -15.05 -8.25 -14.8 -8.0 -14.95 -7.15 -15.5 M-12.45 1.15 L-15.95 0.65 -18.3 -0.25 -15.95 0.65 -12.45 1.15 M-5.1 5.75 L-7.3 5.0 Q-9.0 4.4 -9.7 2.8 L-11.0 0.05 -9.7 2.8 Q-9.0 4.4 -7.3 5.0 L-5.1 5.75" fill="#efcdaf" fill-rule="evenodd" stroke="none"/>
      <path d="M4.95 13.8 L10.9 6.2 Q12.7 4.5 14.1 2.45 L17.05 -2.35 Q18.55 -4.9 19.4 -7.6 19.85 -9.1 19.9 -10.65 L19.75 -12.5 19.05 -13.85 17.95 -14.65 13.8 -16.15 11.7 -16.6 M11.55 -16.6 L10.9 -16.7 1.65 -17.5 1.5 -17.5 -3.2 -16.85 -3.45 -16.8 Q-5.7 -16.35 -7.15 -15.5 M-4.2 5.55 L-5.1 5.75 M-8.25 -14.8 L-7.75 -15.05 -7.15 -15.5 M-8.25 -14.8 L-10.95 -12.85 -12.0 -11.9 -13.65 -10.5 -14.1 -10.1 -14.85 -9.55 Q-16.75 -8.2 -17.55 -6.15 L-18.6 -3.4 -18.65 -3.2 -18.7 -2.95 -18.75 -1.7 -18.45 -0.75 -18.4 -0.6 -18.3 -0.3 -18.3 -0.25 -15.95 0.65 -12.45 1.15 M-11.0 0.05 L-9.7 2.8 Q-9.0 4.4 -7.3 5.0 L-5.1 5.75 M-18.3 -0.25 L-18.4 0.1 -19.65 6.85 -19.8 10.5" fill="none" stroke="#000000" stroke-linecap="round" stroke-linejoin="round" stroke-opacity="0.3019608" stroke-width="0.05"/>
    </g>
    <g id="sprite71" transform="matrix(1.0, 0.0, 0.0, 1.0, 20.8, 17.95)">
      <use height="33.6" id="_p1" transform="matrix(1.0, 0.0, 0.0, 1.0, -19.35, -15.85)" width="40.9" xlink:href="#sprite72"/>
    </g>
    <g id="sprite72" transform="matrix(1.0, 0.0, 0.0, 1.0, 19.35, 15.85)">
      <use height="31.7" transform="matrix(1.0, 0.0, 0.0, 1.0, -19.3, -15.85)" width="38.65" xlink:href="#shape14"/>
    </g>
    <g id="shape14" transform="matrix(1.0, 0.0, 0.0, 1.0, 19.3, 15.85)">
      <path d="M-13.2 4.25 L-14.8 2.9 Q-16.3 0.7 -16.05 -2.3 -15.8 -5.35 -13.65 -7.35 -11.55 -9.45 -8.85 -9.4 -6.2 -9.4 -4.5 -7.35 -4.6 -5.5 -5.0 -3.75 -6.1 2.95 -13.2 4.25 M-4.85 2.2 L-5.5 3.0 Q-6.15 3.4 -6.65 3.95 L-4.85 2.2 M-10.85 -5.35 L-9.8 -5.7 Q-9.95 -6.7 -11.4 -6.5 L-12.75 -5.85 Q-15.7 -2.8 -13.4 -0.15 -12.9 0.35 -12.45 0.05 -12.3 0.05 -12.3 0.2 -11.6 1.2 -10.2 1.2 -9.1 1.25 -7.95 0.35 -7.0 -0.7 -6.8 -2.1 -6.7 -3.7 -7.4 -4.6 L-7.7 -4.85 Q-8.4 -5.6 -9.55 -5.65 L-10.85 -5.35" fill="#ffcc00" fill-rule="evenodd" stroke="none"/>
      <path d="M-4.5 -7.35 L-3.4 -5.15 Q-3.05 -3.7 -3.25 -2.2 -3.45 0.2 -4.65 1.95 L-4.85 2.2 -6.65 3.95 Q-8.35 4.95 -10.3 5.0 -11.95 4.85 -13.2 4.25 -6.1 2.95 -5.0 -3.75 -4.6 -5.5 -4.5 -7.35 M-12.45 0.05 Q-12.9 0.35 -13.4 -0.15 -15.7 -2.8 -12.75 -5.85 L-11.4 -6.5 Q-9.95 -6.7 -9.8 -5.7 L-10.85 -5.35 -11.3 -5.05 -11.6 -4.85 -11.75 -4.85 -11.8 -4.7 Q-12.75 -3.75 -12.85 -2.25 -13.0 -1.0 -12.45 0.05" fill="#e6941a" fill-rule="evenodd" stroke="none"/>
      <path d="M-13.2 4.25 L-14.8 2.9 Q-16.3 0.7 -16.05 -2.3 -15.8 -5.35 -13.65 -7.35 -11.55 -9.45 -8.85 -9.4 -6.2 -9.4 -4.5 -7.35 L-3.4 -5.15 Q-3.05 -3.7 -3.25 -2.2 -3.45 0.2 -4.65 1.95 L-4.85 2.2 -5.5 3.0 Q-6.15 3.4 -6.65 3.95 -8.35 4.95 -10.3 5.0 -11.95 4.85 -13.2 4.25 M-10.85 -5.35 L-9.55 -5.65 Q-8.4 -5.6 -7.7 -4.85 L-7.4 -4.6 Q-6.7 -3.7 -6.8 -2.1 -7.0 -0.7 -7.95 0.35 -9.1 1.25 -10.2 1.2 -11.6 1.2 -12.3 0.2 -12.3 0.05 -12.45 0.05 -13.0 -1.0 -12.85 -2.25 -12.75 -3.75 -11.8 -4.7 L-11.75 -4.85 -11.6 -4.85 -11.3 -5.05 -10.85 -5.35" fill="none" stroke="#000000" stroke-linecap="round" stroke-linejoin="round" stroke-opacity="0.2" stroke-width="0.05"/>
      <path d="M-7.45 -2.2 L-10.05 -2.55 -10.2 -4.3 Q-13.1 -6.4 -2.8 -10.45 5.95 -13.85 10.95 -15.3 L11.25 -14.8 11.75 -13.85 Q9.95 -13.2 8.35 -12.25 2.55 -9.0 -2.8 -4.95 L-4.1 -6.25 -5.05 -5.45 -6.0 -4.15 -7.45 -2.2 M-17.95 7.0 L-19.25 5.55 Q-19.75 2.3 -16.5 0.2 L-14.75 -0.6 -13.9 -0.3 Q-14.55 -0.1 -14.9 0.5 -17.15 3.1 -17.8 6.5 L-17.95 7.0 M-5.35 12.65 Q-8.6 10.35 -10.35 6.8 -12.65 2.45 -11.35 -1.25 L-10.2 -2.2 -8.25 -0.95 -8.45 -0.95 Q-5.35 5.7 -0.7 7.45 L-0.5 7.6 Q-1.65 8.45 -3.45 8.1 L-3.75 8.1 Q-5.2 8.9 -5.35 10.85 L-5.35 12.65" fill="#996600" fill-rule="evenodd" stroke="none"/>
      <path d="M10.95 -15.3 L12.4 -15.6 Q13.85 -16.1 15.8 -15.6 17.55 -15.3 19.35 -12.25 12.85 -11.9 9.65 -10.45 L8.7 -10.15 8.5 -9.95 Q5.15 -8.35 0.45 -5.15 L-1.65 -3.85 Q-4.7 -2.2 -7.0 -2.2 L-7.45 -2.2 -6.0 -4.15 -5.05 -5.45 -4.1 -6.25 -2.8 -4.95 Q2.55 -9.0 8.35 -12.25 9.95 -13.2 11.75 -13.85 L11.25 -14.8 10.95 -15.3 M-13.9 -0.3 L-13.45 -0.1 -13.45 0.05 Q-13.1 -0.1 -12.95 0.2 -16.2 4.05 -15.85 9.4 L-17.95 7.0 -17.8 6.5 Q-17.15 3.1 -14.9 0.5 -14.55 -0.1 -13.9 -0.3 M-0.5 7.6 L0.45 7.95 0.75 8.1 Q4.5 9.4 6.75 9.4 9.15 9.25 10.45 10.2 L10.8 14.4 2.85 15.85 Q-1.15 15.05 -4.1 13.45 L-5.35 12.65 -5.35 10.85 Q-5.2 8.9 -3.75 8.1 L-3.45 8.1 Q-1.65 8.45 -0.5 7.6" fill="#764701" fill-rule="evenodd" stroke="none"/>
      <path d="M10.95 -15.3 L12.4 -15.6 Q13.85 -16.1 15.8 -15.6 17.55 -15.3 19.35 -12.25 12.85 -11.9 9.65 -10.45 L8.7 -10.15 8.5 -9.95 Q5.15 -8.35 0.45 -5.15 L-1.65 -3.85 Q-4.7 -2.2 -7.0 -2.2 L-7.45 -2.2 -10.05 -2.55 -10.2 -4.3 Q-13.1 -6.4 -2.8 -10.45 5.95 -13.85 10.95 -15.3 M-17.95 7.0 L-19.25 5.55 Q-19.75 2.3 -16.5 0.2 L-14.75 -0.6 -13.9 -0.3 -13.45 -0.1 -13.45 0.05 Q-13.1 -0.1 -12.95 0.2 -16.2 4.05 -15.85 9.4 L-17.95 7.0 M-5.35 12.65 Q-8.6 10.35 -10.35 6.8 -12.65 2.45 -11.35 -1.25 L-10.2 -2.2 -8.25 -0.95 M-8.45 -0.95 Q-5.35 5.7 -0.7 7.45 L-0.5 7.6 0.45 7.95 0.75 8.1 Q4.5 9.4 6.75 9.4 9.15 9.25 10.45 10.2 L10.8 14.4 2.85 15.85 Q-1.15 15.05 -4.1 13.45 L-5.35 12.65" fill="none" stroke="#000000" stroke-linecap="round" stroke-linejoin="round" stroke-opacity="0.4" stroke-width="0.05"/>
      <path d="M-13.05 -6.95 Q-11.05 -6.15 -13.35 -4.65 -14.8 -3.8 -14.9 -4.8 -15.25 -6.3 -13.05 -6.95 M-10.9 -7.8 Q-10.95 -8.0 -9.85 -8.3 L-9.15 -8.65 -7.65 -8.65 Q-7.1 -8.65 -7.4 -8.3 L-7.6 -8.15 -8.45 -7.8 -10.7 -7.65 -10.9 -7.8" fill="#ffffff" fill-rule="evenodd" stroke="none"/>
    </g>
    <g id="sprite73" transform="matrix(1.0, 0.0, 0.0, 1.0, 56.1, 59.8)">
      <use height="115.6" id="_p3" transform="matrix(1.0, 0.0, 0.0, 1.0, -56.1, -59.8)" width="108.25" xlink:href="#sprite74"/>
    </g>
    <g id="sprite74" transform="matrix(1.0, 0.0, 0.0, 1.0, 56.1, 59.8)">
      <use height="63.95" id="_col0a" transform="matrix(1.0, 0.0, 0.0, 1.0, -31.35, -25.9)" width="63.3" xlink:href="#sprite75"/>
      <use height="28.7" transform="matrix(0.9958, 0.088, 0.0, 1.0, -32.563, 2.769)" width="42.9" xlink:href="#sprite76"/>
      <use height="12.9" id="_col1d" transform="matrix(1.0, 0.0, 0.0, 1.0, -32.3, 5.25)" width="38.3" xlink:href="#sprite81"/>
      <use height="19.55" transform="matrix(1.0, 0.0, 0.0, 1.0, -26.55, -0.6)" width="17.3" xlink:href="#shape19"/>
      <use height="86.9" id="_col1" transform="matrix(1.0, 0.0, 0.0, 1.0, -42.9, -43.45)" width="85.85" xlink:href="#sprite82"/>
      <use height="42.75" id="_p4" transform="matrix(1.0, 0.0, 0.0, 1.0, -28.0497, 13.0502)" width="46.6" xlink:href="#sprite83"/>
      <use height="19.35" id="_col0c" transform="matrix(1.0, 0.0, 0.0, 1.0, 12.55, 11.7)" width="17.9" xlink:href="#sprite85"/>
    </g>
    <g id="sprite75" transform="matrix(1.0, 0.0, 0.0, 1.0, 31.35, 31.95)">
      <use height="63.95" transform="matrix(1.0, 0.0, 0.0, 1.0, -31.35, -31.95)" width="63.3" xlink:href="#shape15"/>
    </g>
    <g id="shape15" transform="matrix(1.0, 0.0, 0.0, 1.0, 31.35, 31.95)">
      <path d="M-19.5 28.2 L-22.1 26.65 Q-27.15 23.0 -26.25 17.45 L-26.1 16.25 Q-25.6 14.5 -26.1 13.1 L-26.25 12.75 -26.8 12.05 -26.95 11.9 Q-28.55 9.8 -29.4 7.55 -30.95 3.9 -31.3 0.45 -31.65 -8.75 -27.5 -17.1 -23.3 -26.45 -14.45 -29.55 -4.75 -32.85 5.15 -31.65 L5.85 -31.6 7.9 -29.9 Q13.45 -25.9 12.95 -19.0 12.25 -10.65 9.3 -2.7 7.55 1.65 3.4 3.55 -5.3 7.9 -13.95 11.7 L-15.0 11.55 Q-17.95 9.45 -19.35 11.9 -20.55 11.55 -21.6 12.25 L-22.45 13.1 -23.15 12.95 -25.4 12.05 -25.6 12.05 -26.25 11.7 -26.25 11.9 -26.1 12.05 -25.6 12.75 -25.4 13.1 Q-24.9 14.5 -25.4 16.25 L-25.6 17.45 -25.05 17.6 -21.6 18.15 -15.15 19.7 Q-13.45 20.05 -11.85 20.9 -10.85 21.45 -9.95 22.3 -8.9 23.0 -7.9 24.05 L-7.55 24.2 -7.9 24.4 Q-12.9 28.4 -19.5 28.2" fill="#efcdaf" fill-rule="evenodd" stroke="none"/>
      <path d="M-19.5 28.2 Q-12.9 28.4 -7.9 24.4 L-7.55 24.2 -7.9 24.05 Q-8.9 23.0 -9.95 22.3 -10.85 21.45 -11.85 20.9 -13.45 20.05 -15.15 19.7 L-21.6 18.15 -25.05 17.6 -25.6 17.45 -25.4 16.25 Q-24.9 14.5 -25.4 13.1 L-25.6 12.75 -26.1 12.05 -26.25 11.9 -26.25 11.7 -25.6 12.05 -25.4 12.05 -23.15 12.95 -22.45 13.1 -21.6 12.25 Q-20.55 11.55 -19.35 11.9 -17.95 9.45 -15.0 11.55 L-13.95 11.7 Q-5.3 7.9 3.4 3.55 7.55 1.65 9.3 -2.7 12.25 -10.65 12.95 -19.0 13.45 -25.9 7.9 -29.9 L5.85 -31.6 5.8 -31.65 7.55 -31.5 10.7 -30.45 12.95 -29.55 Q15.55 -28.55 18.65 -26.8 27.85 -21.75 30.45 -12.55 32.9 -3.55 31.35 0.8 29.95 4.95 28.55 6.15 27.15 7.2 26.8 8.95 25.95 11.7 24.55 14.35 L22.65 17.45 18.15 22.15 16.75 23.35 16.6 23.35 12.75 25.8 Q7.2 28.9 2.0 30.3 -3.9 32.0 -9.45 32.0 L-10.15 32.0 -13.8 31.0 -17.4 29.4 -19.5 28.2" fill="#c6886a" fill-rule="evenodd" stroke="none"/>
      <path d="M5.85 -31.6 L5.15 -31.65 Q-4.75 -32.85 -14.45 -29.55 -23.3 -26.45 -27.5 -17.1 -31.65 -8.75 -31.3 0.45 -30.95 3.9 -29.4 7.55 -28.55 9.8 -26.95 11.9 L-26.8 12.05 -26.25 12.75 -26.1 13.1 Q-25.6 14.5 -26.1 16.25 L-26.25 17.45 Q-27.15 23.0 -22.1 26.65 L-19.5 28.2 M5.85 -31.6 L5.8 -31.65 7.55 -31.5 10.7 -30.45 12.95 -29.55 Q15.55 -28.55 18.65 -26.8 27.85 -21.75 30.45 -12.55 32.9 -3.55 31.35 0.8 29.95 4.95 28.55 6.15 27.15 7.2 26.8 8.95 25.95 11.7 24.55 14.35 L22.65 17.45 18.15 22.15 16.75 23.35 16.6 23.35 12.75 25.8 Q7.2 28.9 2.0 30.3 -3.9 32.0 -9.45 32.0 L-10.15 32.0 -13.8 31.0 -17.4 29.4 -19.5 28.2" fill="none" stroke="#000000" stroke-linecap="round" stroke-linejoin="round" stroke-opacity="0.3019608" stroke-width="0.05"/>
    </g>
    <g id="sprite76" transform="matrix(1.0, 0.0, 0.0, 1.0, 20.8, 22.05)">
      <use height="6.05" id="yeux" transform="matrix(3.5469, 0.6759, 0.0, 3.8129, -7.3594, -22.0349)" width="8.3" xlink:href="#sprite77"/>
      <use height="6.05" transform="matrix(-0.7089, 0.0624, 0.9139, 3.339, -14.9276, -20.8291)" width="8.3" xlink:href="#sprite77"/>
    </g>
    <g id="sprite77" transform="matrix(1.0, 0.0, 0.0, 1.0, 3.4, 5.95)">
      <use height="3.3" transform="matrix(1.0, 0.0, 0.0, 1.0, -2.8, -3.2)" width="6.6" xlink:href="#sprite78"/>
    </g>
    <g id="sprite78" transform="matrix(1.0, 0.0, 0.0, 1.0, 3.05, 0.7)">
      <use height="3.3" transform="matrix(1.0, 0.0, 0.0, 1.0, -3.05, -0.7)" width="6.6" xlink:href="#sprite79"/>
    </g>
    <g id="sprite79" transform="matrix(1.0, 0.0, 0.0, 1.0, 3.4, 1.65)">
      <use height="2.9" transform="matrix(1.0, 0.0, 0.0, 1.0, -3.4, -1.55)" width="5.55" xlink:href="#shape16"/>
      <use height="2.9" id="_col3" transform="matrix(1.0, 0.0, 0.0, 1.0, -1.85, -1.55)" width="2.5" xlink:href="#sprite80"/>
    </g>
    <g id="shape16" transform="matrix(1.0, 0.0, 0.0, 1.0, 3.4, 1.55)">
      <path d="M1.2 -1.45 Q2.05 -0.75 1.7 0.0 L1.3 0.75 0.55 1.05 0.65 0.7 0.65 0.05 0.5 -0.55 -0.15 -1.55 1.2 -1.45 M-1.65 -0.95 L-1.8 -0.1 -1.75 0.45 -1.65 0.75 -1.5 1.0 -1.15 1.3 -1.0 1.35 -2.4 1.3 -2.5 1.1 -2.55 0.35 -1.65 -0.95" fill="#fbfbfb" fill-rule="evenodd" stroke="none"/>
      <path d="M2.15 -1.35 L1.2 -1.45 Q2.05 -0.75 1.7 0.0 L1.3 0.75 M-0.15 -1.55 L-1.65 -0.95 M-2.55 0.35 L-2.95 0.5 -3.4 0.55 M-2.55 0.35 L-1.65 -0.95 M-0.15 -1.55 L1.2 -1.45" fill="none" stroke="#000000" stroke-linecap="round" stroke-linejoin="round" stroke-opacity="0.2509804" stroke-width="0.05"/>
      <path d="M0.55 1.05 L0.65 0.7 0.65 0.05 0.5 -0.55 -0.15 -1.55 M-1.65 -0.95 L-1.8 -0.1 -1.75 0.45 -1.65 0.75 -1.5 1.0 -1.15 1.3 -1.0 1.35" fill="none" stroke="#000000" stroke-linecap="round" stroke-linejoin="round" stroke-opacity="0.4" stroke-width="0.05"/>
    </g>
    <g id="sprite80" transform="matrix(1.0, 0.0, 0.0, 1.0, 1.25, 1.45)">
      <use height="2.9" transform="matrix(1.0, 0.0, 0.0, 1.0, -1.25, -1.45)" width="2.5" xlink:href="#shape17"/>
    </g>
    <g id="shape17" transform="matrix(1.0, 0.0, 0.0, 1.0, 1.25, 1.45)">
      <path d="M-0.1 0.8 L0.1 0.8 0.25 0.75 -0.1 0.8" fill="#cccccc" fill-rule="evenodd" stroke="none"/>
      <path d="M0.25 0.75 L0.45 0.7 0.6 0.6 0.65 0.65 0.15 1.15 Q-0.55 1.4 -0.7 0.9 L-0.6 0.7 -0.1 0.8 0.25 0.75" fill="#ffffff" fill-rule="evenodd" stroke="none"/>
      <path d="M0.45 0.7 L0.25 0.75 0.1 0.8 -0.1 0.8 -0.4 0.5 -0.55 0.0 Q-0.55 -1.05 0.1 -0.85 0.75 -0.7 0.75 0.05 L0.6 0.5 0.45 0.7" fill="#666666" fill-rule="evenodd" stroke="none"/>
      <path d="M1.1 -0.45 L1.25 0.15 1.25 0.8 1.15 1.15 0.85 1.25 -0.4 1.45 -0.55 1.4 -0.9 1.1 -1.05 0.85 -1.15 0.55 -1.2 0.0 -1.05 -0.85 0.45 -1.45 1.1 -0.45 M0.45 0.7 L0.6 0.5 0.75 0.05 Q0.75 -0.7 0.1 -0.85 -0.55 -1.05 -0.55 0.0 L-0.4 0.5 -0.1 0.8 -0.6 0.7 -0.7 0.9 Q-0.55 1.4 0.15 1.15 L0.65 0.65 0.6 0.6 0.45 0.7" fill="#999999" fill-rule="evenodd" stroke="none"/>
      <path d="M1.1 -0.45 L1.25 0.15 1.25 0.8 1.15 1.15 0.85 1.25 -0.4 1.45 -0.55 1.4 -0.9 1.1 -1.05 0.85 -1.15 0.55 -1.2 0.0 -1.05 -0.85 0.45 -1.45 1.1 -0.45 Z" fill="none" stroke="#000000" stroke-linecap="round" stroke-linejoin="round" stroke-opacity="0.4" stroke-width="0.05"/>
    </g>
    <g id="sprite81" transform="matrix(1.0, 0.0, 0.0, 1.0, 19.6, 6.9)">
      <use height="12.9" transform="matrix(1.0, 0.0, 0.0, 1.0, -19.6, -6.9)" width="38.3" xlink:href="#shape18"/>
    </g>
    <g id="shape18" transform="matrix(1.0, 0.0, 0.0, 1.0, 19.6, 6.9)">
      <path d="M9.0 -0.45 L7.35 0.95 7.35 1.0 11.0 0.15 14.85 -0.35 16.35 -0.4 16.7 -0.4 17.45 -0.45 14.2 0.65 15.3 1.2 Q16.4 1.8 16.85 2.4 L17.15 2.85 12.4 2.4 11.8 2.4 13.05 1.65 14.05 1.35 Q12.05 1.65 9.35 2.55 L2.3 3.85 -1.1 4.9 -1.45 5.05 -1.65 5.15 -1.5 4.95 -1.15 4.8 -0.7 4.6 3.4 2.6 8.95 -0.5 9.0 -0.45 M18.7 5.45 L18.7 5.55 18.7 5.45 M-19.6 -5.3 L-18.2 -4.55 Q-18.05 -4.65 -18.05 -5.75 L-18.05 -6.9 -15.4 -3.25 -15.0 -4.8 -14.95 -4.85 -14.25 -2.0 Q-15.0 -2.8 -16.65 -2.9 L-18.3 -2.7 -18.25 -2.6 -18.6 -3.5 -19.6 -5.25 -19.6 -5.3" fill="#bfa6a6" fill-rule="evenodd" stroke="none"/>
      <path d="M17.15 2.85 L18.0 4.15 18.05 4.3 18.7 5.45 18.7 5.55 17.2 4.95 15.7 4.4 16.1 5.3 16.2 6.0 12.65 4.65 8.15 4.5 3.1 5.3 0.85 5.75 -0.45 6.0 -0.55 6.0 Q-1.65 6.05 -2.15 5.45 L-2.2 5.4 -2.15 5.4 -2.55 4.15 -1.7 4.55 -1.2 4.8 -1.15 4.8 -1.5 4.95 -1.65 5.15 -1.45 5.05 -1.1 4.9 2.3 3.85 9.35 2.55 Q12.05 1.65 14.05 1.35 L13.05 1.65 11.8 2.4 12.4 2.4 17.15 2.85 M-14.25 -2.0 L-14.0 -0.8 Q-13.45 1.05 -12.65 1.05 L-12.35 1.0 -12.1 0.75 -12.1 2.2 Q-12.15 2.75 -12.35 3.0 L-12.65 3.1 -12.7 3.1 Q-13.45 3.1 -14.6 0.8 -15.75 -1.5 -16.9 -1.5 L-17.3 -1.45 -17.75 -1.25 -18.25 -2.6 -18.3 -2.7 -16.65 -2.9 Q-15.0 -2.8 -14.25 -2.0 M-2.15 5.4 L-2.15 5.45 -2.15 5.4" fill="#a38d8d" fill-rule="evenodd" stroke="none"/>
      <path d="M9.0 -0.45 L7.35 0.95 7.35 1.0 11.0 0.15 14.85 -0.35 16.35 -0.4 16.7 -0.4 17.45 -0.45 14.2 0.65 15.3 1.2 Q16.4 1.8 16.85 2.4 L17.15 2.85 18.0 4.15 18.05 4.3 18.7 5.45 18.7 5.55 17.2 4.95 15.7 4.4 16.1 5.3 16.2 6.0 12.65 4.65 8.15 4.5 3.1 5.3 0.85 5.75 -0.45 6.0 -0.55 6.0 Q-1.65 6.05 -2.15 5.45 L-2.15 5.4 -2.55 4.15 -1.7 4.55 -1.2 4.8 -1.15 4.8 -0.7 4.6 3.4 2.6 8.95 -0.5 M-19.6 -5.3 L-18.2 -4.55 Q-18.05 -4.65 -18.05 -5.75 L-18.05 -6.9 -15.4 -3.25 -15.0 -4.8 -14.95 -4.85 -14.25 -2.0 -14.0 -0.8 Q-13.45 1.05 -12.65 1.05 L-12.35 1.0 -12.1 0.75 -12.1 2.2 Q-12.15 2.75 -12.35 3.0 L-12.65 3.1 -12.7 3.1 Q-13.45 3.1 -14.6 0.8 -15.75 -1.5 -16.9 -1.5 L-17.3 -1.45 -17.75 -1.25 -18.25 -2.6 -18.6 -3.5 -19.6 -5.25 M-1.65 5.15 L-1.5 4.95 -1.15 4.8" fill="none" stroke="#000000" stroke-linecap="round" stroke-linejoin="round" stroke-opacity="0.3019608" stroke-width="0.05"/>
    </g>
    <g id="shape19" transform="matrix(1.0, 0.0, 0.0, 1.0, 26.55, 0.6)">
      <path d="M-23.9 -0.05 L-24.2 -0.45 -24.0 -0.6 -13.45 -0.25 -9.25 1.8 -9.45 2.0 -10.5 2.7 -13.15 5.0 Q-15.5 6.9 -17.2 10.85 L-19.55 16.2 Q-20.2 17.6 -22.45 18.8 -24.9 19.85 -26.25 13.25 -27.65 6.65 -22.95 1.1 L-22.8 1.1 -23.3 0.6 -23.9 -0.05" fill="#631300" fill-opacity="0.3529412" fill-rule="evenodd" stroke="none"/>
    </g>
    <g id="sprite82" transform="matrix(1.0, 0.0, 0.0, 1.0, 42.9, 43.45)">
      <use height="86.9" transform="matrix(1.0, 0.0, 0.0, 1.0, -42.9, -43.45)" width="85.85" xlink:href="#shape20"/>
    </g>
    <g id="shape20" transform="matrix(1.0, 0.0, 0.0, 1.0, 42.9, 43.45)">
      <path d="M22.5 -34.8 L22.65 -34.95 22.65 -34.8 22.5 -34.8 M-30.1 3.7 Q-29.75 2.85 -29.05 2.35 L-29.05 2.5 -30.1 3.7" fill="#996600" fill-rule="evenodd" stroke="none"/>
      <path d="M22.5 -34.8 L22.65 -34.8 23.45 -33.25 24.9 -30.1 25.3 -28.8 25.8 -27.35 26.35 -26.05 28.8 -22.25 28.9 -22.1 29.05 -21.95 31.7 -19.35 35.15 -15.95 36.35 -14.85 38.45 -12.5 40.2 -10.15 Q41.75 -7.55 42.25 -4.95 42.95 -2.15 42.95 0.6 L42.6 4.85 42.45 5.45 42.45 5.5 42.25 6.3 42.05 5.35 37.55 -3.9 37.9 -0.55 37.9 -0.45 37.05 4.65 36.35 6.3 Q33.75 12.05 32.9 18.8 L32.9 18.85 Q32.7 20.4 33.05 21.95 33.4 24.2 34.3 26.3 L35.3 28.9 35.65 29.55 Q36.25 30.5 37.5 31.3 L35.15 31.45 25.1 31.85 30.0 37.35 31.95 38.75 Q25.9 39.65 20.4 35.8 L20.25 35.65 Q21.25 39.85 23.85 42.95 L23.85 43.45 Q20.55 42.25 18.3 40.35 L14.15 36.7 12.85 35.3 11.7 33.9 Q11.2 33.4 11.05 32.9 L11.05 32.85 Q12.4 30.95 15.2 29.9 16.95 27.65 17.45 25.05 L17.75 24.05 17.95 23.0 17.9 21.9 17.8 21.4 13.3 20.4 12.6 20.05 Q11.05 19.0 10.5 17.6 10.35 15.7 11.9 13.8 L12.6 12.75 Q15.7 8.95 12.95 4.95 L11.15 2.95 10.0 1.8 7.6 0.6 3.9 -0.55 3.75 -0.55 3.55 -0.6 -1.45 -0.45 -2.15 -0.25 -2.75 -0.1 -3.35 0.1 -6.3 0.9 -9.25 1.8 -13.45 -0.25 -24.0 -0.6 -24.2 -0.45 Q-26.6 0.4 -29.05 2.5 L-29.05 2.35 Q-29.75 2.85 -30.1 3.7 -31.5 4.95 -32.15 6.3 L-33.1 8.45 -35.55 15.5 -35.8 16.2 -36.25 17.55 -37.2 21.75 -37.2 21.8 Q-37.55 24.55 -37.55 27.5 L-37.55 30.45 -38.4 28.9 -39.3 26.8 Q-40.65 22.3 -40.65 17.45 -40.5 11.2 -39.45 5.1 -38.05 -2.35 -32.15 -6.85 -34.45 -3.55 -36.35 0.25 -38.4 4.75 -38.4 9.8 -38.4 12.2 -37.9 14.65 -37.05 -2.85 -19.5 -5.15 -16.75 -5.45 -14.3 -4.1 -7.35 0.1 0.25 -4.1 6.15 -7.2 12.6 -6.35 13.1 -14.0 12.25 -20.2 17.3 -19.85 21.45 -17.25 20.9 -21.45 19.35 -25.1 16.75 -31.0 11.7 -34.6 13.8 -33.9 15.55 -32.35 L15.8 -32.15 19.65 -28.9 21.45 -27.7 22.3 -27.15 22.5 -34.8 M-5.45 -29.4 L-3.0 -25.6 Q-0.75 -22.8 4.45 -22.15 L4.45 -20.9 Q3.9 -20.4 0.8 -19.2 L-0.4 -18.85 Q-3.0 -17.6 -5.65 -16.4 L-6.3 -16.6 Q-5.95 -17.6 -5.65 -20.05 -5.1 -21.9 -3.45 -22.9 L-3.35 -22.8 -2.5 -21.95 Q-1.45 -20.9 0.8 -19.2 -1.45 -20.9 -2.5 -21.95 L-3.35 -22.8 -3.35 -23.0 Q-4.4 -24.4 -4.95 -26.1 -5.45 -27.7 -5.45 -29.4 M28.05 -6.85 Q32.55 -5.15 33.6 -1.65 L33.6 -2.5 Q33.6 -10.85 28.4 -15.0 33.6 -10.85 33.6 -2.5 L33.6 -1.65 Q32.55 -5.15 28.05 -6.85 M24.05 -24.55 Q24.75 -23.5 25.25 -21.25 L25.45 -17.8 25.25 -15.7 25.45 -17.8 25.25 -21.25 Q24.75 -23.5 24.05 -24.55" fill="#d6baba" fill-rule="evenodd" stroke="none"/>
      <path d="M11.7 -34.6 Q16.75 -31.0 19.35 -25.1 20.9 -21.45 21.45 -17.25 17.3 -19.85 12.25 -20.2 13.1 -14.0 12.6 -6.35 6.15 -7.2 0.25 -4.1 -7.35 0.1 -14.3 -4.1 -16.75 -5.45 -19.5 -5.15 -37.05 -2.85 -37.9 14.65 -38.4 12.2 -38.4 9.8 -38.4 4.75 -36.35 0.25 -34.45 -3.55 -32.15 -6.85 -38.05 -2.35 -39.45 5.1 -40.5 11.2 -40.65 17.45 -40.65 22.3 -39.3 26.8 -41.0 22.5 -42.05 17.6 -42.6 15.0 -42.75 12.4 -43.25 7.9 -42.05 3.9 L-40.35 -1.1 -40.15 -1.8 -39.85 -2.65 -37.1 -8.05 -36.95 -8.2 -36.85 -8.4 -36.7 -8.55 -33.4 -12.65 -32.15 -13.95 -32.0 -13.95 -32.0 -14.0 -31.75 -15.2 -31.75 -15.4 -30.7 -20.45 -30.45 -21.05 Q-30.1 -21.4 -28.7 -23.3 -27.5 -25.25 -25.4 -25.9 L-21.4 -27.65 -21.4 -27.7 -21.95 -28.45 -21.4 -27.7 -21.95 -28.45 -33.2 -43.45 Q-27.65 -37.7 -20.55 -34.95 L-10.8 -32.75 -7.9 -32.85 3.2 -34.75 7.8 -35.25 11.7 -34.6 M-36.25 17.55 L-35.8 16.2 -35.55 15.5 -35.8 16.25 -36.25 17.55 M-33.1 8.45 L-32.15 6.3 Q-31.5 4.95 -30.1 3.7 L-29.05 2.5 Q-26.6 0.4 -24.2 -0.45 L-23.9 -0.05 -24.2 -0.4 Q-26.6 0.45 -29.05 2.55 L-30.1 3.75 Q-31.5 4.95 -32.15 6.35 L-33.1 8.45 M-9.25 1.8 L-6.3 0.9 -9.25 1.85 -9.3 1.9 -9.25 1.8 M-3.35 0.1 L-2.75 -0.1 -2.7 -0.1 -2.15 -0.25 -1.45 -0.45 3.55 -0.6 -1.45 -0.4 -2.15 -0.25 -2.7 -0.05 -3.35 0.1 M7.6 0.6 L10.0 1.8 11.15 2.95 10.0 1.85 7.6 0.6 M13.3 20.4 L17.8 21.4 17.9 21.9 17.8 21.45 13.3 20.4 M11.05 32.9 Q11.2 33.4 11.7 33.9 L12.85 35.3 11.7 33.95 11.05 32.9 M20.25 35.65 L20.4 35.8 Q25.9 39.65 31.95 38.75 L32.0 38.8 Q25.95 39.65 20.4 35.85 L20.25 35.65 M35.15 31.45 L37.5 31.3 37.55 31.35 35.15 31.45 M32.9 18.85 L32.9 18.8 Q33.75 12.05 36.35 6.3 L37.05 4.65 36.35 6.35 Q33.75 12.05 32.9 18.85 M42.05 5.35 L42.25 6.3 42.45 5.5 42.45 5.45 42.6 4.85 42.45 5.5 42.25 6.35 42.05 5.35 M-5.3 -8.75 Q-6.3 -10.0 -7.35 -10.7 L-12.4 -14.15 Q-15.15 -15.7 -18.1 -16.75 L-21.95 -17.1 -25.25 -16.75 -29.05 -15.7 -32.0 -14.0 -29.05 -15.7 -25.25 -16.75 -21.95 -17.1 -18.1 -16.75 Q-15.15 -15.7 -12.4 -14.15 L-7.35 -10.7 Q-6.3 -10.0 -5.3 -8.75 M-3.45 -22.9 Q-5.1 -21.9 -5.65 -20.05 -5.95 -17.6 -6.3 -16.6 L-5.65 -16.4 Q-3.0 -17.6 -0.4 -18.85 L0.8 -19.2 Q3.9 -20.4 4.45 -20.9 L4.45 -22.15 Q-0.75 -22.8 -3.0 -25.6 L-5.45 -29.4 Q-5.45 -27.7 -4.95 -26.1 -4.4 -24.4 -3.35 -23.0 L-3.45 -22.9 M2.35 -25.95 Q-1.3 -26.8 -2.5 -27.7 L-5.65 -30.3 -5.45 -29.4 -5.65 -30.3 -2.5 -27.7 Q-1.3 -26.8 2.35 -25.95" fill="#ffffff" fill-rule="evenodd" stroke="none"/>
      <path d="M-3.45 -22.9 L-3.35 -23.0 -3.35 -22.8 -3.45 -22.9 M37.5 31.3 L37.55 31.3 37.5 31.3 M31.95 38.75 L32.0 38.75 31.95 38.75" fill="#660000" fill-opacity="0.28235295" fill-rule="evenodd" stroke="none"/>
      <path d="M-2.75 -0.1 L-2.15 -0.25 -2.7 -0.1 -2.75 -0.1" fill="#7e4b01" fill-rule="evenodd" stroke="none"/>
      <path d="M22.65 -34.8 L22.65 -34.95 22.5 -34.95 22.5 -34.8 22.3 -27.15 21.45 -27.7 19.65 -28.9 15.8 -32.15 15.55 -32.35 Q13.8 -33.9 11.7 -34.6 M-39.3 26.8 L-38.4 28.9 -37.55 30.45 -37.55 27.5 Q-37.55 24.55 -37.2 21.8 L-37.2 21.75 -36.25 17.55 -35.8 16.2 -35.55 15.5 -33.1 8.45 -32.15 6.3 Q-31.5 4.95 -30.1 3.7 L-29.05 2.5 Q-26.6 0.4 -24.2 -0.45 L-24.0 -0.6 -13.45 -0.25 -9.25 1.8 -6.3 0.9 -3.35 0.1 -2.75 -0.1 -2.15 -0.25 -1.45 -0.45 3.55 -0.6 3.75 -0.55 3.9 -0.55 7.6 0.6 10.0 1.8 11.15 2.95 12.95 4.95 Q15.7 8.95 12.6 12.75 L11.9 13.8 Q10.35 15.7 10.5 17.6 11.05 19.0 12.6 20.05 L13.3 20.4 17.8 21.4 17.9 21.9 17.95 23.0 17.75 24.05 17.45 25.05 Q16.95 27.65 15.2 29.9 12.4 30.95 11.05 32.85 L11.05 32.9 Q11.2 33.4 11.7 33.9 L12.85 35.3 14.15 36.7 18.3 40.35 Q20.55 42.25 23.85 43.45 M23.85 42.95 Q21.25 39.85 20.25 35.65 L20.4 35.8 Q25.9 39.65 31.95 38.75 L30.0 37.35 25.1 31.85 35.15 31.45 37.5 31.3 Q36.25 30.5 35.65 29.55 L35.3 28.9 34.3 26.3 Q33.4 24.2 33.05 21.95 32.7 20.4 32.9 18.85 L32.9 18.8 Q33.75 12.05 36.35 6.3 L37.05 4.65 37.9 -0.45 37.9 -0.55 37.55 -3.9 42.05 5.35 42.25 6.3 42.45 5.5 42.45 5.45 42.6 4.85 42.95 0.6 Q42.95 -2.15 42.25 -4.95 41.75 -7.55 40.2 -10.15 L38.45 -12.5 36.35 -14.85 35.15 -15.95 31.7 -19.35 29.05 -21.95 28.9 -22.1 28.8 -22.25 26.35 -26.05 25.8 -27.35 25.3 -28.8 24.9 -30.1 23.45 -33.25 22.65 -34.8 M-10.8 -32.75 L-7.9 -32.9 3.2 -34.8 7.8 -35.25 11.7 -34.6 M-10.8 -32.75 L-20.55 -34.95 Q-27.65 -37.7 -33.2 -43.45 L-21.95 -28.45 -21.4 -27.7 M-30.7 -20.45 L-31.75 -15.4 -31.75 -15.2 -32.0 -14.0 -29.05 -15.7 -25.25 -16.75 -21.95 -17.1 -18.1 -16.75 Q-15.15 -15.7 -12.4 -14.15 L-7.35 -10.7 Q-6.3 -10.0 -5.3 -8.75 M-3.35 -23.0 Q-4.4 -24.4 -4.95 -26.1 -5.45 -27.7 -5.45 -29.4 L-5.65 -30.3 -2.5 -27.7 Q-1.3 -26.8 2.35 -25.95 M25.25 -15.7 L25.45 -17.8 25.25 -21.25 Q24.75 -23.5 24.05 -24.55 M28.4 -15.0 Q33.6 -10.85 33.6 -2.5 L33.6 -1.65 Q32.55 -5.15 28.05 -6.85 M37.5 31.3 L37.55 31.3 37.5 31.3 M23.85 42.95 L24.05 43.45 23.85 43.45 M31.95 38.75 L32.0 38.75 31.95 38.75 M-30.7 -20.45 L-30.45 -21.1 Q-30.1 -21.45 -28.7 -23.35 -27.5 -25.25 -25.4 -25.95 L-21.4 -27.7 M-33.4 -12.65 L-32.15 -14.0 -32.0 -14.0 M-33.4 -12.65 L-36.7 -8.55 -36.85 -8.4 -36.95 -8.2 -37.1 -8.05 -39.85 -2.65 M-40.35 -1.1 L-42.05 3.9 Q-43.25 7.9 -42.75 12.4 -42.6 15.0 -42.05 17.6 -41.0 22.5 -39.3 26.8 M-40.35 -1.1 L-40.15 -1.85 -39.85 -2.65 M-23.9 -0.05 L-24.2 -0.45 M-3.35 -22.8 L-2.5 -21.95 Q-1.45 -20.9 0.8 -19.2 M-3.35 -23.0 L-3.35 -22.8 M-9.25 1.8 L-9.3 1.9 -9.45 2.0 -10.5 2.7 M-23.9 -0.05 L-23.3 0.6 -22.8 1.1" fill="none" stroke="#000000" stroke-linecap="round" stroke-linejoin="round" stroke-opacity="0.3019608" stroke-width="0.05"/>
    </g>
    <g id="sprite83" transform="matrix(1.0, 0.0, 0.0, 1.0, 22.25, 11.8)">
      <use height="23.45" id="_col1" transform="matrix(1.0, 0.0, 0.0, 1.0, -21.85, -6.65)" width="43.7" xlink:href="#sprite84"/>
    </g>
    <g id="sprite84" transform="matrix(1.0, 0.0, 0.0, 1.0, 24.2, -0.15)">
      <use height="23.45" transform="matrix(1.0, 0.0, 0.0, 1.0, -24.2, 0.15)" width="43.7" xlink:href="#shape21"/>
    </g>
    <g id="shape21" transform="matrix(1.0, 0.0, 0.0, 1.0, 24.2, -0.15)">
      <path d="M17.6 5.9 L17.1 6.4 Q15.7 8.15 14.45 10.4 L9.8 17.85 8.9 18.9 9.1 19.1 Q6.65 20.8 1.1 22.4 -4.6 23.75 -7.05 23.6 -9.65 23.4 -13.65 22.2 -17.6 21.0 -20.9 17.85 -22.5 16.15 -23.15 14.4 L-23.35 14.4 -23.5 13.75 -23.5 13.7 Q-24.05 12.65 -24.05 11.8 L-24.05 11.45 Q-21.8 12.3 -16.25 12.3 -12.75 12.3 -8.6 13.55 -7.55 13.7 -5.8 14.75 L-3.4 15.45 Q0.25 15.45 3.55 13.9 5.65 13.55 7.35 12.3 L8.9 10.4 Q9.8 9.35 10.3 8.0 L11.2 6.95 Q11.85 5.2 13.6 3.65 L14.3 3.1 17.6 5.9 M1.3 16.3 L1.1 15.8 -0.6 15.8 -1.15 15.95 -0.95 16.85 0.95 16.85 1.3 16.3 M5.65 15.95 L5.95 15.6 Q4.95 15.1 4.6 15.1 L4.05 15.1 3.9 15.45 Q3.9 15.95 4.05 15.95 L5.65 15.95 M-12.6 17.0 L-10.35 17.0 Q-9.65 16.85 -10.7 16.3 L-14.35 14.55 -16.25 13.7 -19.35 14.9 -17.95 15.8 -12.6 17.0 M-7.4 14.4 L-8.95 14.55 Q-8.25 16.5 -6.35 16.5 -5.5 16.5 -5.15 16.15 L-4.95 15.6 Q-6.0 14.4 -7.4 14.4 M-16.05 17.85 Q-17.1 17.85 -17.1 18.55 -16.75 21.0 -13.65 21.0 -11.9 21.0 -11.9 19.95 -12.6 19.1 -14.15 18.4 -15.55 17.85 -16.05 17.85 M-23.15 14.4 L-23.5 13.75 -23.15 14.4 M-23.15 12.65 Q-22.85 14.05 -21.45 14.05 L-20.75 13.55 Q-21.1 12.15 -23.0 12.15 L-23.15 12.65" fill="#d6baba" fill-rule="evenodd" stroke="none"/>
      <path d="M-24.05 11.45 L-24.2 10.4 Q-24.2 6.05 -22.85 5.05 -19.0 10.75 -17.6 10.75 -14.0 9.55 -11.2 10.05 -8.6 10.6 -5.3 12.3 -2.0 13.9 2.15 13.9 L3.55 13.9 Q0.25 15.45 -3.4 15.45 L-5.8 14.75 Q-7.55 13.7 -8.6 13.55 -12.75 12.3 -16.25 12.3 -21.8 12.3 -24.05 11.45 M8.9 10.4 Q9.8 9.2 10.5 7.45 10.65 6.6 12.2 4.15 L12.55 3.3 12.75 3.3 13.95 3.1 Q13.95 2.95 14.15 2.95 L14.3 3.1 13.6 3.65 Q11.85 5.2 11.2 6.95 L10.3 8.0 Q9.8 9.35 8.9 10.4 M5.65 15.95 L4.05 15.95 Q3.9 15.95 3.9 15.45 L4.05 15.1 4.6 15.1 Q4.95 15.1 5.95 15.6 L5.65 15.95 M1.3 16.3 L0.95 16.85 -0.95 16.85 -1.15 15.95 -0.6 15.8 1.1 15.8 1.3 16.3 M-16.05 17.85 Q-15.55 17.85 -14.15 18.4 -12.6 19.1 -11.9 19.95 -11.9 21.0 -13.65 21.0 -16.75 21.0 -17.1 18.55 -17.1 17.85 -16.05 17.85 M-7.4 14.4 Q-6.0 14.4 -4.95 15.6 L-5.15 16.15 Q-5.5 16.5 -6.35 16.5 -8.25 16.5 -8.95 14.55 L-7.4 14.4 M-23.15 12.65 L-23.0 12.15 Q-21.1 12.15 -20.75 13.55 L-21.45 14.05 Q-22.85 14.05 -23.15 12.65" fill="#ffffff" fill-rule="evenodd" stroke="none"/>
      <path d="M16.75 1.05 L17.25 0.85 17.25 1.4 Q17.25 1.75 17.75 2.1 L18.3 1.75 Q19.5 1.75 19.5 2.75 L19.5 3.1 17.6 5.9 14.3 3.1 14.3 2.95 15.15 1.75 15.35 1.55 15.5 1.4 Q16.05 1.05 16.75 1.05" fill="#d6baba" fill-opacity="0.5019608" fill-rule="evenodd" stroke="none"/>
      <path d="M12.75 3.3 L13.8 0.15 Q16.2 0.15 16.75 1.05 16.05 1.05 15.5 1.4 L15.35 1.55 15.15 1.75 14.3 2.95 14.3 3.1 14.15 2.95 Q13.95 2.95 13.95 3.1 L12.75 3.3" fill="#ffffff" fill-opacity="0.5019608" fill-rule="evenodd" stroke="none"/>
      <path d="M17.1 6.4 Q15.7 8.15 14.45 10.4 L9.8 17.85 Q9.8 18.55 9.25 18.9 L9.1 18.9 9.1 19.1 Q6.65 20.8 1.1 22.4 -4.6 23.75 -7.05 23.6 -9.65 23.4 -13.65 22.2 -17.6 21.0 -20.9 17.85 -22.5 16.15 -23.15 14.4 M-23.5 13.75 L-23.5 13.7 Q-24.05 12.65 -24.05 11.8 L-24.05 11.45 -24.2 10.4 Q-24.2 6.05 -22.85 5.05 -19.0 10.75 -17.6 10.75 -14.0 9.55 -11.2 10.05 -8.6 10.6 -5.3 12.3 -2.0 13.9 2.15 13.9 L3.55 13.9 Q5.65 13.55 7.35 12.3 L8.9 10.4 Q9.8 9.2 10.5 7.45 10.65 6.6 12.2 4.15 L12.55 3.3 M9.1 18.9 L8.9 18.9 9.8 17.85 M-23.5 13.75 L-23.15 14.4" fill="none" stroke="#000000" stroke-linecap="round" stroke-linejoin="round" stroke-opacity="0.3019608" stroke-width="0.05"/>
      <path d="M19.5 3.1 L17.6 5.9 M12.75 3.3 L13.8 0.15" fill="none" stroke="#000000" stroke-linecap="round" stroke-linejoin="round" stroke-opacity="0.15294118" stroke-width="0.05"/>
    </g>
    <g id="sprite85" transform="matrix(1.0, 0.0, 0.0, 1.0, 8.95, 9.65)">
      <use height="19.35" transform="matrix(1.0, 0.0, 0.0, 1.0, -8.95, -9.65)" width="17.9" xlink:href="#shape22"/>
    </g>
    <g id="shape22" transform="matrix(1.0, 0.0, 0.0, 1.0, 8.95, 9.65)">
      <path d="M-1.5 -6.7 Q-1.15 -7.25 -0.6 -7.4 1.35 -8.45 3.25 -8.8 L3.95 -8.95 Q6.9 -7.4 4.1 -5.15 2.0 -3.4 -0.6 -4.1 -0.95 -4.45 -1.45 -4.6 -1.9 -5.2 -1.85 -5.8 L-1.9 -5.75 -1.85 -5.85 -1.85 -6.0 Q-1.85 -6.55 -1.5 -6.7 M-3.5 -4.55 L-3.55 -4.45 -3.5 -4.55 M-8.95 7.0 L-8.9 7.0 -8.05 8.55 -6.3 9.6 -6.35 9.6 -8.05 8.6 -8.1 8.55 -8.95 7.05 -8.95 7.0" fill="#efcdaf" fill-rule="evenodd" stroke="none"/>
      <path d="M1.5 4.05 L3.25 2.3 Q5.3 -0.1 3.95 -2.9 3.6 -3.25 3.25 -3.4 1.35 -3.9 -0.05 -3.4 -0.75 -3.25 -1.25 -2.7 L-4.2 0.75 -1.25 -2.7 Q-0.75 -3.25 -0.05 -3.4 1.35 -3.9 3.25 -3.4 3.6 -3.25 3.95 -2.9 5.3 -0.1 3.25 2.3 L1.5 4.05 M-1.5 -6.7 L-1.5 -6.75 -1.45 -6.8 -0.75 -8.05 -0.75 -8.1 Q1.75 -9.55 4.1 -9.65 L6.7 -8.8 Q10.0 -5.3 8.45 -0.1 7.55 2.5 6.15 4.4 0.95 10.45 -6.3 9.6 L-8.05 8.55 -8.9 7.0 -8.95 7.0 -3.6 -4.45 -3.55 -4.45 -3.5 -4.55 -1.9 -5.75 -1.85 -5.8 Q-1.9 -5.2 -1.45 -4.6 -0.95 -4.45 -0.6 -4.1 2.0 -3.4 4.1 -5.15 6.9 -7.4 3.95 -8.95 L3.25 -8.8 Q1.35 -8.45 -0.6 -7.4 -1.15 -7.25 -1.5 -6.7" fill="#c6886a" fill-rule="evenodd" stroke="none"/>
      <path d="M-4.2 0.75 L-1.25 -2.7 Q-0.75 -3.25 -0.05 -3.4 1.35 -3.9 3.25 -3.4 3.6 -3.25 3.95 -2.9 5.3 -0.1 3.25 2.3 L1.5 4.05 M-6.3 9.6 Q0.95 10.45 6.15 4.4 7.55 2.5 8.45 -0.1 10.0 -5.3 6.7 -8.8 L4.1 -9.65 Q1.75 -9.55 -0.75 -8.1 L-0.75 -8.05 -1.45 -6.8 -1.5 -6.75 -1.5 -6.7 M-8.9 7.0 L-8.05 8.55 -6.3 9.6" fill="none" stroke="#000000" stroke-linecap="round" stroke-linejoin="round" stroke-opacity="0.3019608" stroke-width="0.05"/>
    </g>
    <g id="sprite86" transform="matrix(1.0, 0.0, 0.0, 1.0, 14.9, 4.35)">
      <use height="26.45" id="_p5" transform="matrix(1.0, 0.0, 0.0, 1.0, -14.9, -4.35)" width="23.2" xlink:href="#sprite87"/>
    </g>
    <g id="sprite87" transform="matrix(1.0, 0.0, 0.0, 1.0, 14.15, 7.5)">
      <use height="22.7" id="_col0" transform="matrix(1.0, 0.0, 0.0, 1.0, -13.6, -3.75)" width="21.65" xlink:href="#sprite88"/>
      <use height="26.45" id="_p7" transform="matrix(1.0, 0.0, 0.0, 1.0, -14.15, -7.5)" width="23.2" xlink:href="#sprite89"/>
    </g>
    <g id="sprite88" transform="matrix(1.0, 0.0, 0.0, 1.0, 13.6, 3.75)">
      <use height="22.7" transform="matrix(1.0, 0.0, 0.0, 1.0, -13.6, -3.75)" width="21.65" xlink:href="#shape23"/>
    </g>
    <g id="shape23" transform="matrix(1.0, 0.0, 0.0, 1.0, 13.6, 3.75)">
      <path d="M-10.75 15.3 L-10.75 14.95 Q-10.75 14.45 -10.4 14.1 -10.25 13.45 -9.9 13.1 L-9.6 12.0 Q-9.1 9.95 -9.75 7.65 -11.1 9.15 -10.9 10.65 L-11.55 10.65 -13.55 10.65 Q-13.75 7.2 -12.75 4.2 L-11.7 1.35 -9.9 -0.45 -8.6 -1.5 -7.8 -2.25 -7.0 -2.8 -5.15 -3.5 -4.8 -3.75 0.85 -3.6 1.25 0.05 Q1.6 6.15 0.65 12.3 0.35 12.65 0.35 12.95 L-1.45 14.6 -3.3 14.1 Q-5.8 13.1 -6.45 15.45 L-10.75 15.3" fill="#efcdaf" fill-rule="evenodd" stroke="none"/>
      <path d="M6.5 -3.15 L6.7 -2.35 6.8 -1.8 Q8.8 6.0 7.65 11.3 L4.35 14.3 Q2.5 15.8 0.65 15.8 L0.2 15.6 Q-0.15 15.6 -0.3 15.95 L-2.5 17.6 -4.95 17.75 -7.6 18.95 Q-8.95 18.25 -9.9 17.1 L-10.05 16.95 Q-10.75 16.1 -10.75 15.3 L-6.45 15.45 Q-5.8 13.1 -3.3 14.1 L-1.45 14.6 0.35 12.95 Q0.35 12.65 0.65 12.3 1.6 6.15 1.25 0.05 L0.85 -3.6 6.5 -3.15 M-10.4 14.1 L-13.55 12.0 -13.55 11.6 -13.55 10.65 -11.55 10.65 -10.9 10.65 Q-11.1 9.15 -9.75 7.65 -9.1 9.95 -9.6 12.0 L-9.9 13.1 Q-10.25 13.45 -10.4 14.1 M-0.3 15.95 L-1.15 16.25 Q-2.8 17.1 -4.45 17.25 L-6.45 15.45 -4.45 17.25 Q-2.8 17.1 -1.15 16.25 L-0.3 15.95 M-4.45 17.25 L-4.95 17.75 -4.45 17.25" fill="#c6886a" fill-rule="evenodd" stroke="none"/>
      <path d="M6.5 -3.15 L6.7 -2.35 6.8 -1.8 Q8.8 6.0 7.65 11.3 L4.35 14.3 Q2.5 15.8 0.65 15.8 L0.2 15.6 Q-0.15 15.6 -0.3 15.95 L-2.5 17.6 -4.95 17.75 -7.6 18.95 Q-8.95 18.25 -9.9 17.1 L-10.05 16.95 Q-10.75 16.1 -10.75 15.3 L-10.75 14.95 Q-10.75 14.45 -10.4 14.1 L-13.55 12.0 -13.55 11.6 -13.55 10.65 Q-13.75 7.2 -12.75 4.2 L-11.7 1.35 -9.9 -0.45 -8.6 -1.5 -7.8 -2.25 -7.0 -2.8 M-6.45 15.45 L-4.45 17.25 Q-2.8 17.1 -1.15 16.25 L-0.3 15.95 M-9.75 7.65 Q-9.1 9.95 -9.6 12.0 L-9.9 13.1 Q-10.25 13.45 -10.4 14.1 M-4.95 17.75 L-4.45 17.25" fill="none" stroke="#000000" stroke-linecap="round" stroke-linejoin="round" stroke-opacity="0.3019608" stroke-width="0.05"/>
    </g>
    <g id="sprite90" transform="matrix(1.0, 0.0, 0.0, 1.0, 20.65, 16.05)">
      <use height="30.75" id="_p2" transform="matrix(1.0, 0.0, 0.0, 1.0, -20.65, -16.05)" width="40.3" xlink:href="#sprite91"/>
    </g>
    <g id="sprite91" transform="matrix(1.0, 0.0, 0.0, 1.0, 20.25, 15.5)">
      <use height="30.55" id="_p5" transform="matrix(1.0, 0.0, 0.0, 1.0, -10.2, -15.4)" width="20.25" xlink:href="#sprite92"/>
    </g>
    <g id="sprite92" transform="matrix(1.0, 0.0, 0.0, 1.0, 10.2, 15.4)">
      <use height="28.0" id="_col0" transform="matrix(0.9552, -0.2927, 0.2927, 0.9552, -10.0342, -11.5985)" width="12.4" xlink:href="#sprite15"/>
      <use height="30.55" id="_p7" transform="matrix(1.0, 0.0, 0.0, 1.0, -10.2, -15.4)" width="20.25" xlink:href="#sprite93"/>
    </g>
    <g id="sprite94" transform="matrix(1.0, 0.0, 0.0, 1.0, 21.95, 34.0)">
      <use height="62.85" id="_p2" transform="matrix(1.0, 0.0, 0.0, 1.0, -21.95, -34.0)" width="64.1" xlink:href="#sprite95"/>
    </g>
    <g id="sprite95" transform="matrix(1.0, 0.0, 0.0, 1.0, 21.95, 34.0)">
      <use height="62.85" id="_p5" transform="matrix(1.0, 0.0, 0.0, 1.0, -14.2, -34.0)" width="43.35" xlink:href="#sprite96"/>
    </g>
    <g id="sprite96" transform="matrix(1.0, 0.0, 0.0, 1.0, 14.2, 34.0)">
      <use height="28.0" id="_col0" transform="matrix(0.9918, 0.1221, -0.1221, 0.9918, -3.8281, -14.5535)" width="11.15" xlink:href="#sprite5"/>
      <use height="62.85" id="_p7" transform="matrix(1.0, 0.0, 0.0, 1.0, -14.2, -34.0)" width="43.35" xlink:href="#sprite97"/>
    </g>
    <g id="sprite97" transform="matrix(1.0, 0.0, 0.0, 1.0, 14.75, 35.55)">
      <use height="33.65" id="_col2" transform="matrix(0.8944, -0.0586, 0.0675, 1.0316, -14.7336, -16.4277)" width="30.4" xlink:href="#sprite7"/>
    </g>
    <g id="sprite98" transform="matrix(1.0, 0.0, 0.0, 1.0, 20.75, 20.75)">
      <use height="48.0" id="_p2" transform="matrix(1.0, 0.0, 0.0, 1.0, -20.75, -20.75)" width="56.75" xlink:href="#sprite99"/>
    </g>
    <g id="sprite99" transform="matrix(1.0, 0.0, 0.0, 1.0, 13.75, 13.7)">
      <use height="36.75" id="_p5" transform="matrix(1.0, 0.0, 0.0, 1.0, -8.9, -10.1)" width="43.5" xlink:href="#sprite100"/>
    </g>
    <g id="sprite100" transform="matrix(1.0, 0.0, 0.0, 1.0, 15.9, 17.15)">
      <use height="14.1" id="_col0" transform="matrix(1.0, 0.0, 0.0, 1.0, -7.0, -7.05)" width="14.0" xlink:href="#sprite21"/>
      <use height="36.75" id="_p7" transform="matrix(1.0, 0.0, 0.0, 1.0, -15.9, -17.15)" width="43.5" xlink:href="#sprite101"/>
    </g>
    <g id="sprite101" transform="matrix(1.0, 0.0, 0.0, 1.0, 17.8, 16.65)">
      <use height="22.3" id="_p1" transform="matrix(0.7987, 0.5992, -0.5992, 0.7987, -3.1531, -16.6443)" width="24.6" xlink:href="#sprite22"/>
    </g>
  </defs>
</svg>
