<?xml version="1.0" encoding="UTF-8" standalone="no"?>
<svg xmlns:xlink="http://www.w3.org/1999/xlink" height="85.15px" width="97.55px" xmlns="http://www.w3.org/2000/svg">
  <g transform="matrix(1.0, 0.0, 0.0, 1.0, 35.45, 42.1)">
    <use height="1.5" transform="matrix(1.0, 0.0, 0.0, 1.0, -7.0, -23.25)" width="1.5" xlink:href="#shape0"/>
  </g>
  <defs>
    <g id="shape0" transform="matrix(1.0, 0.0, 0.0, 1.0, 7.0, 23.25)">
      <path d="M-6.25 -21.75 L-7.0 -22.5 Q-7.15 -23.35 -6.25 -23.25 L-5.5 -22.5 -6.25 -21.75" fill="#ff0000" fill-rule="evenodd" stroke="none"/>
    </g>
  </defs>
</svg>
