<?xml version="1.0" encoding="UTF-8" standalone="no"?>
<svg xmlns:xlink="http://www.w3.org/1999/xlink" height="15.6px" width="1.6px" xmlns="http://www.w3.org/2000/svg">
  <g transform="matrix(1.0, 0.0, 0.0, 1.0, 4.95, 20.2)">
    <path d="M-4.55 -20.2 Q-3.55 -20.3 -3.4 -18.6 L-3.4 -16.65 -3.4 -14.75 -3.4 -12.7 -3.35 -8.85 Q-3.35 -5.55 -3.5 -4.75 L-3.55 -4.7 -3.6 -4.6 -3.65 -4.6 Q-4.05 -4.75 -4.05 -5.55 L-4.65 -7.65 -4.9 -13.65 -4.9 -16.9 Q-4.85 -20.15 -4.55 -20.2" fill="#ffffff" fill-opacity="0.7019608" fill-rule="evenodd" stroke="none"/>
  </g>
</svg>
