{
  "db_name": "PostgreSQL",
  "query": "\n            DELETE FROM zones\n            WHERE x = $1 AND y = $2\n            RETURNING *;\n        ",
  "describe": {
    "columns": [
      {
        "ordinal": 0,
        "name": "x",
        "type_info": "Int4"
      },
      {
        "ordinal": 1,
        "name": "y",
        "type_info": "Int4"
      },
      {
        "ordinal": 2,
        "name": "location_end",
        "type_info": "Timestamptz"
      },
      {
        "ordinal": 3,
        "name": "owner",
        "type_info": "Varchar"
      },
      {
        "ordinal": 4,
        "name": "name",
        "type_info": "Varchar"
      },
      {
        "ordinal": 5,
        "name": "created_at",
        "type_info": "Timestamptz"
      },
      {
        "ordinal": 6,
        "name": "owner_id",
        "type_info": "Int4"
      },
      {
        "ordinal": 7,
        "name": "description",
        "type_info": "Text"
      }
    ],
    "parameters": {
      "Left": [
        "Int4",
        "Int4"
      ]
    },
    "nullable": [
      false,
      false,
      true,
      true,
      true,
      false,
      true,
      true
    ]
  },
  "hash": "d346c794d5fb0e09c2ed25f8e40c1eb1399fa950b3450e75aef03b0847dd4afc"
}
