{
  "db_name": "PostgreSQL",
  "query": "\n        SELECT cx, cy, data, compressed FROM chunks\n        WHERE cx = $1 AND cy = $2\n        FOR UPDATE;\n    ",
  "describe": {
    "columns": [
      {
        "ordinal": 0,
        "name": "cx",
        "type_info": "Int4"
      },
      {
        "ordinal": 1,
        "name": "cy",
        "type_info": "Int4"
      },
      {
        "ordinal": 2,
        "name": "data",
        "type_info": "Bytea"
      },
      {
        "ordinal": 3,
        "name": "compressed",
        "type_info": "Bool"
      }
    ],
    "parameters": {
      "Left": [
        "Int4",
        "Int4"
      ]
    },
    "nullable": [
      false,
      false,
      true,
      false
    ]
  },
  "hash": "4790b68f4cee3a30fc52f83e38b473978a38f063633b8645e0df9fb16033a612"
}
