{
  "db_name": "PostgreSQL",
  "query": "\n            INSERT INTO chunks(cx, cy, data, compressed, created_at, last_checked_at)\n            VALUES ($1, $2, NULL, TRUE, $3, $3)\n            ON CONFLICT DO NOTHING;\n        ",
  "describe": {
    "columns": [],
    "parameters": {
      "Left": [
        "Int4",
        "Int4",
        "Timestamptz"
      ]
    },
    "nullable": []
  },
  "hash": "33f30e873c30df5254fa8a8a8d2c46b4d6ca1856a5587e9a39f21e560f849729"
}
