{
  "db_name": "PostgreSQL",
  "query": "\n            INSERT INTO chunks_history(cx, cy, data, compressed, is_delta, valid_since)\n            VALUES ($1, $2, $3, $4, $5, $6);\n        ",
  "describe": {
    "columns": [],
    "parameters": {
      "Left": [
        "Int4",
        "Int4",
        "Bytea",
        "Bool",
        "Bool",
        "Timestamptz"
      ]
    },
    "nullable": []
  },
  "hash": "43fa7de7a7dc794e2f81d52aef95fb91014fc0df2ca51d21eb1aac9e02f4dd4a"
}
