{
  "db_name": "PostgreSQL",
  "query": "\n        SELECT cx, cy FROM chunks WHERE NOT compressed\n        ORDER BY (cx, cy);\n    ",
  "describe": {
    "columns": [
      {
        "ordinal": 0,
        "name": "cx",
        "type_info": "Int4"
      },
      {
        "ordinal": 1,
        "name": "cy",
        "type_info": "Int4"
      }
    ],
    "parameters": {
      "Left": []
    },
    "nullable": [
      false,
      false
    ]
  },
  "hash": "dff8f0ca8763f60d903c9f7b9182de8b5be78ff20f8bb43a1d1dfbd358c5f38e"
}
