{
  "db_name": "PostgreSQL",
  "query": "\n            SELECT data, compressed, created_at FROM chunks\n            WHERE cx = $1 AND cy = $2;\n        ",
  "describe": {
    "columns": [
      {
        "ordinal": 0,
        "name": "data",
        "type_info": "Bytea"
      },
      {
        "ordinal": 1,
        "name": "compressed",
        "type_info": "Bool"
      },
      {
        "ordinal": 2,
        "name": "created_at",
        "type_info": "Timestamptz"
      }
    ],
    "parameters": {
      "Left": [
        "Int4",
        "Int4"
      ]
    },
    "nullable": [
      true,
      false,
      false
    ]
  },
  "hash": "4bb4a15a29a5e48f5bcb5e1a130c90f1484ce1bd37c8743630c26af1ffe09cf8"
}
