{
	"textures": [
		{
			"image": "hero.png",
			"format": "RGBA8888",
			"size": {
				"w": 985,
				"h": 251
			},
			"scale": 1,
			"frames": [
				{
					"filename": "running/33.png",
					"rotated": false,
					"trimmed": true,
					"sourceSize": {
						"w": 104,
						"h": 67
					},
					"spriteSourceSize": {
						"x": 0,
						"y": 4,
						"w": 82,
						"h": 56
					},
					"frame": {
						"x": 1,
						"y": 1,
						"w": 82,
						"h": 56
					},
					"anchor": {
						"x": 0.576923,
						"y": 0.865672
					}
				},
				{
					"filename": "running/35.png",
					"rotated": false,
					"trimmed": true,
					"sourceSize": {
						"w": 104,
						"h": 67
					},
					"spriteSourceSize": {
						"x": 0,
						"y": 4,
						"w": 80,
						"h": 56
					},
					"frame": {
						"x": 1,
						"y": 59,
						"w": 80,
						"h": 56
					},
					"anchor": {
						"x": 0.576923,
						"y": 0.865672
					}
				},
				{
					"filename": "running/37.png",
					"rotated": false,
					"trimmed": true,
					"sourceSize": {
						"w": 104,
						"h": 67
					},
					"spriteSourceSize": {
						"x": 0,
						"y": 4,
						"w": 80,
						"h": 56
					},
					"frame": {
						"x": 85,
						"y": 1,
						"w": 80,
						"h": 56
					},
					"anchor": {
						"x": 0.576923,
						"y": 0.865672
					}
				},
				{
					"filename": "running/38.png",
					"rotated": false,
					"trimmed": true,
					"sourceSize": {
						"w": 104,
						"h": 67
					},
					"spriteSourceSize": {
						"x": 0,
						"y": 4,
						"w": 80,
						"h": 56
					},
					"frame": {
						"x": 1,
						"y": 117,
						"w": 80,
						"h": 56
					},
					"anchor": {
						"x": 0.576923,
						"y": 0.865672
					}
				},
				{
					"filename": "running/36.png",
					"rotated": false,
					"trimmed": true,
					"sourceSize": {
						"w": 104,
						"h": 67
					},
					"spriteSourceSize": {
						"x": 0,
						"y": 4,
						"w": 80,
						"h": 55
					},
					"frame": {
						"x": 83,
						"y": 59,
						"w": 80,
						"h": 55
					},
					"anchor": {
						"x": 0.576923,
						"y": 0.865672
					}
				},
				{
					"filename": "running/39.png",
					"rotated": false,
					"trimmed": true,
					"sourceSize": {
						"w": 104,
						"h": 67
					},
					"spriteSourceSize": {
						"x": 0,
						"y": 4,
						"w": 80,
						"h": 55
					},
					"frame": {
						"x": 167,
						"y": 1,
						"w": 80,
						"h": 55
					},
					"anchor": {
						"x": 0.576923,
						"y": 0.865672
					}
				},
				{
					"filename": "running/34.png",
					"rotated": false,
					"trimmed": true,
					"sourceSize": {
						"w": 104,
						"h": 67
					},
					"spriteSourceSize": {
						"x": 0,
						"y": 8,
						"w": 82,
						"h": 51
					},
					"frame": {
						"x": 249,
						"y": 1,
						"w": 82,
						"h": 51
					},
					"anchor": {
						"x": 0.576923,
						"y": 0.865672
					}
				},
				{
					"filename": "landing/97.png",
					"rotated": false,
					"trimmed": true,
					"sourceSize": {
						"w": 104,
						"h": 67
					},
					"spriteSourceSize": {
						"x": 19,
						"y": 28,
						"w": 85,
						"h": 39
					},
					"frame": {
						"x": 333,
						"y": 1,
						"w": 85,
						"h": 39
					},
					"anchor": {
						"x": 0.576923,
						"y": 0.865672
					}
				},
				{
					"filename": "braking/40.png",
					"rotated": false,
					"trimmed": true,
					"sourceSize": {
						"w": 104,
						"h": 67
					},
					"spriteSourceSize": {
						"x": 23,
						"y": 15,
						"w": 57,
						"h": 48
					},
					"frame": {
						"x": 1,
						"y": 175,
						"w": 57,
						"h": 48
					},
					"anchor": {
						"x": 0.576923,
						"y": 0.865672
					}
				},
				{
					"filename": "landing/96.png",
					"rotated": false,
					"trimmed": true,
					"sourceSize": {
						"w": 104,
						"h": 67
					},
					"spriteSourceSize": {
						"x": 30,
						"y": 27,
						"w": 64,
						"h": 39
					},
					"frame": {
						"x": 83,
						"y": 116,
						"w": 64,
						"h": 39
					},
					"anchor": {
						"x": 0.576923,
						"y": 0.865672
					}
				},
				{
					"filename": "startRunning/32.png",
					"rotated": false,
					"trimmed": true,
					"sourceSize": {
						"w": 104,
						"h": 67
					},
					"spriteSourceSize": {
						"x": 25,
						"y": 13,
						"w": 55,
						"h": 47
					},
					"frame": {
						"x": 420,
						"y": 1,
						"w": 55,
						"h": 47
					},
					"anchor": {
						"x": 0.576923,
						"y": 0.865672
					}
				},
				{
					"filename": "braking/47.png",
					"rotated": false,
					"trimmed": true,
					"sourceSize": {
						"w": 104,
						"h": 67
					},
					"spriteSourceSize": {
						"x": 35,
						"y": 17,
						"w": 54,
						"h": 43
					},
					"frame": {
						"x": 477,
						"y": 1,
						"w": 54,
						"h": 43
					},
					"anchor": {
						"x": 0.576923,
						"y": 0.865672
					}
				},
				{
					"filename": "braking/50.png",
					"rotated": false,
					"trimmed": true,
					"sourceSize": {
						"w": 104,
						"h": 67
					},
					"spriteSourceSize": {
						"x": 35,
						"y": 17,
						"w": 54,
						"h": 43
					},
					"frame": {
						"x": 477,
						"y": 1,
						"w": 54,
						"h": 43
					},
					"anchor": {
						"x": 0.576923,
						"y": 0.865672
					}
				},
				{
					"filename": "braking/49.png",
					"rotated": false,
					"trimmed": true,
					"sourceSize": {
						"w": 104,
						"h": 67
					},
					"spriteSourceSize": {
						"x": 35,
						"y": 17,
						"w": 54,
						"h": 43
					},
					"frame": {
						"x": 533,
						"y": 1,
						"w": 54,
						"h": 43
					},
					"anchor": {
						"x": 0.576923,
						"y": 0.865672
					}
				},
				{
					"filename": "braking/48.png",
					"rotated": false,
					"trimmed": true,
					"sourceSize": {
						"w": 104,
						"h": 67
					},
					"spriteSourceSize": {
						"x": 36,
						"y": 17,
						"w": 53,
						"h": 43
					},
					"frame": {
						"x": 589,
						"y": 1,
						"w": 53,
						"h": 43
					},
					"anchor": {
						"x": 0.576923,
						"y": 0.865672
					}
				},
				{
					"filename": "braking/41.png",
					"rotated": false,
					"trimmed": true,
					"sourceSize": {
						"w": 104,
						"h": 67
					},
					"spriteSourceSize": {
						"x": 30,
						"y": 17,
						"w": 50,
						"h": 44
					},
					"frame": {
						"x": 644,
						"y": 1,
						"w": 50,
						"h": 44
					},
					"anchor": {
						"x": 0.576923,
						"y": 0.865672
					}
				},
				{
					"filename": "braking/46.png",
					"rotated": false,
					"trimmed": true,
					"sourceSize": {
						"w": 104,
						"h": 67
					},
					"spriteSourceSize": {
						"x": 35,
						"y": 18,
						"w": 51,
						"h": 42
					},
					"frame": {
						"x": 696,
						"y": 1,
						"w": 51,
						"h": 42
					},
					"anchor": {
						"x": 0.576923,
						"y": 0.865672
					}
				},
				{
					"filename": "braking/45.png",
					"rotated": false,
					"trimmed": true,
					"sourceSize": {
						"w": 104,
						"h": 67
					},
					"spriteSourceSize": {
						"x": 36,
						"y": 19,
						"w": 50,
						"h": 41
					},
					"frame": {
						"x": 749,
						"y": 1,
						"w": 50,
						"h": 41
					},
					"anchor": {
						"x": 0.576923,
						"y": 0.865672
					}
				},
				{
					"filename": "startRunning/31.png",
					"rotated": false,
					"trimmed": true,
					"sourceSize": {
						"w": 104,
						"h": 67
					},
					"spriteSourceSize": {
						"x": 32,
						"y": 15,
						"w": 48,
						"h": 45
					},
					"frame": {
						"x": 801,
						"y": 1,
						"w": 48,
						"h": 45
					},
					"anchor": {
						"x": 0.576923,
						"y": 0.865672
					}
				},
				{
					"filename": "breathing/10.png",
					"rotated": false,
					"trimmed": true,
					"sourceSize": {
						"w": 104,
						"h": 67
					},
					"spriteSourceSize": {
						"x": 35,
						"y": 16,
						"w": 45,
						"h": 44
					},
					"frame": {
						"x": 851,
						"y": 1,
						"w": 45,
						"h": 44
					},
					"anchor": {
						"x": 0.576923,
						"y": 0.865672
					}
				},
				{
					"filename": "breathing/11.png",
					"rotated": false,
					"trimmed": true,
					"sourceSize": {
						"w": 104,
						"h": 67
					},
					"spriteSourceSize": {
						"x": 35,
						"y": 16,
						"w": 45,
						"h": 44
					},
					"frame": {
						"x": 898,
						"y": 1,
						"w": 45,
						"h": 44
					},
					"anchor": {
						"x": 0.576923,
						"y": 0.865672
					}
				},
				{
					"filename": "jumping/60.png",
					"rotated": false,
					"trimmed": true,
					"sourceSize": {
						"w": 104,
						"h": 67
					},
					"spriteSourceSize": {
						"x": 37,
						"y": 16,
						"w": 39,
						"h": 45
					},
					"frame": {
						"x": 945,
						"y": 1,
						"w": 39,
						"h": 45
					},
					"anchor": {
						"x": 0.576923,
						"y": 0.865672
					}
				},
				{
					"filename": "endJumping/73.png",
					"rotated": false,
					"trimmed": true,
					"sourceSize": {
						"w": 104,
						"h": 67
					},
					"spriteSourceSize": {
						"x": 40,
						"y": 7,
						"w": 36,
						"h": 53
					},
					"frame": {
						"x": 60,
						"y": 175,
						"w": 36,
						"h": 53
					},
					"anchor": {
						"x": 0.576923,
						"y": 0.865672
					}
				},
				{
					"filename": "endJumping/91.png",
					"rotated": false,
					"trimmed": true,
					"sourceSize": {
						"w": 104,
						"h": 67
					},
					"spriteSourceSize": {
						"x": 39,
						"y": 5,
						"w": 40,
						"h": 56
					},
					"frame": {
						"x": 98,
						"y": 157,
						"w": 40,
						"h": 56
					},
					"anchor": {
						"x": 0.576923,
						"y": 0.865672
					}
				},
				{
					"filename": "landing/99.png",
					"rotated": false,
					"trimmed": true,
					"sourceSize": {
						"w": 104,
						"h": 67
					},
					"spriteSourceSize": {
						"x": 38,
						"y": 27,
						"w": 44,
						"h": 35
					},
					"frame": {
						"x": 98,
						"y": 215,
						"w": 44,
						"h": 35
					},
					"anchor": {
						"x": 0.576923,
						"y": 0.865672
					}
				},
				{
					"filename": "endJumping/92.png",
					"rotated": false,
					"trimmed": true,
					"sourceSize": {
						"w": 104,
						"h": 67
					},
					"spriteSourceSize": {
						"x": 39,
						"y": 5,
						"w": 40,
						"h": 56
					},
					"frame": {
						"x": 140,
						"y": 157,
						"w": 40,
						"h": 56
					},
					"anchor": {
						"x": 0.576923,
						"y": 0.865672
					}
				},
				{
					"filename": "landing/98.png",
					"rotated": false,
					"trimmed": true,
					"sourceSize": {
						"w": 104,
						"h": 67
					},
					"spriteSourceSize": {
						"x": 39,
						"y": 28,
						"w": 43,
						"h": 34
					},
					"frame": {
						"x": 144,
						"y": 215,
						"w": 43,
						"h": 34
					},
					"anchor": {
						"x": 0.576923,
						"y": 0.865672
					}
				},
				{
					"filename": "landing/95.png",
					"rotated": false,
					"trimmed": true,
					"sourceSize": {
						"w": 104,
						"h": 67
					},
					"spriteSourceSize": {
						"x": 35,
						"y": 25,
						"w": 49,
						"h": 38
					},
					"frame": {
						"x": 333,
						"y": 42,
						"w": 49,
						"h": 38
					},
					"anchor": {
						"x": 0.576923,
						"y": 0.865672
					}
				},
				{
					"filename": "jumping/62.png",
					"rotated": false,
					"trimmed": true,
					"sourceSize": {
						"w": 104,
						"h": 67
					},
					"spriteSourceSize": {
						"x": 43,
						"y": 7,
						"w": 34,
						"h": 54
					},
					"frame": {
						"x": 384,
						"y": 42,
						"w": 34,
						"h": 54
					},
					"anchor": {
						"x": 0.576923,
						"y": 0.865672
					}
				},
				{
					"filename": "endJumping/82.png",
					"rotated": false,
					"trimmed": true,
					"sourceSize": {
						"w": 104,
						"h": 67
					},
					"spriteSourceSize": {
						"x": 35,
						"y": 13,
						"w": 44,
						"h": 48
					},
					"frame": {
						"x": 420,
						"y": 50,
						"w": 44,
						"h": 48
					},
					"anchor": {
						"x": 0.576923,
						"y": 0.865672
					}
				},
				{
					"filename": "endJumping/74.png",
					"rotated": false,
					"trimmed": true,
					"sourceSize": {
						"w": 104,
						"h": 67
					},
					"spriteSourceSize": {
						"x": 40,
						"y": 8,
						"w": 36,
						"h": 52
					},
					"frame": {
						"x": 466,
						"y": 50,
						"w": 36,
						"h": 52
					},
					"anchor": {
						"x": 0.576923,
						"y": 0.865672
					}
				},
				{
					"filename": "endJumping/90.png",
					"rotated": false,
					"trimmed": true,
					"sourceSize": {
						"w": 104,
						"h": 67
					},
					"spriteSourceSize": {
						"x": 39,
						"y": 7,
						"w": 40,
						"h": 54
					},
					"frame": {
						"x": 504,
						"y": 46,
						"w": 40,
						"h": 54
					},
					"anchor": {
						"x": 0.576923,
						"y": 0.865672
					}
				},
				{
					"filename": "endJumping/89.png",
					"rotated": false,
					"trimmed": true,
					"sourceSize": {
						"w": 104,
						"h": 67
					},
					"spriteSourceSize": {
						"x": 36,
						"y": 11,
						"w": 43,
						"h": 50
					},
					"frame": {
						"x": 546,
						"y": 46,
						"w": 43,
						"h": 50
					},
					"anchor": {
						"x": 0.576923,
						"y": 0.865672
					}
				},
				{
					"filename": "endJumping/83.png",
					"rotated": false,
					"trimmed": true,
					"sourceSize": {
						"w": 104,
						"h": 67
					},
					"spriteSourceSize": {
						"x": 35,
						"y": 13,
						"w": 44,
						"h": 48
					},
					"frame": {
						"x": 591,
						"y": 46,
						"w": 44,
						"h": 48
					},
					"anchor": {
						"x": 0.576923,
						"y": 0.865672
					}
				},
				{
					"filename": "endJumping/81.png",
					"rotated": false,
					"trimmed": true,
					"sourceSize": {
						"w": 104,
						"h": 67
					},
					"spriteSourceSize": {
						"x": 36,
						"y": 13,
						"w": 43,
						"h": 48
					},
					"frame": {
						"x": 637,
						"y": 47,
						"w": 43,
						"h": 48
					},
					"anchor": {
						"x": 0.576923,
						"y": 0.865672
					}
				},
				{
					"filename": "endJumping/75.png",
					"rotated": false,
					"trimmed": true,
					"sourceSize": {
						"w": 104,
						"h": 67
					},
					"spriteSourceSize": {
						"x": 38,
						"y": 8,
						"w": 37,
						"h": 52
					},
					"frame": {
						"x": 682,
						"y": 47,
						"w": 37,
						"h": 52
					},
					"anchor": {
						"x": 0.576923,
						"y": 0.865672
					}
				},
				{
					"filename": "endJumping/93.png",
					"rotated": false,
					"trimmed": true,
					"sourceSize": {
						"w": 104,
						"h": 67
					},
					"spriteSourceSize": {
						"x": 42,
						"y": 2,
						"w": 37,
						"h": 59
					},
					"frame": {
						"x": 721,
						"y": 45,
						"w": 37,
						"h": 59
					},
					"anchor": {
						"x": 0.576923,
						"y": 0.865672
					}
				},
				{
					"filename": "jumping/63.png",
					"rotated": false,
					"trimmed": true,
					"sourceSize": {
						"w": 104,
						"h": 67
					},
					"spriteSourceSize": {
						"x": 41,
						"y": 7,
						"w": 36,
						"h": 54
					},
					"frame": {
						"x": 760,
						"y": 44,
						"w": 36,
						"h": 54
					},
					"anchor": {
						"x": 0.576923,
						"y": 0.865672
					}
				},
				{
					"filename": "endJumping/88.png",
					"rotated": false,
					"trimmed": true,
					"sourceSize": {
						"w": 104,
						"h": 67
					},
					"spriteSourceSize": {
						"x": 37,
						"y": 11,
						"w": 42,
						"h": 50
					},
					"frame": {
						"x": 798,
						"y": 48,
						"w": 42,
						"h": 50
					},
					"anchor": {
						"x": 0.576923,
						"y": 0.865672
					}
				},
				{
					"filename": "endJumping/76.png",
					"rotated": false,
					"trimmed": true,
					"sourceSize": {
						"w": 104,
						"h": 67
					},
					"spriteSourceSize": {
						"x": 37,
						"y": 9,
						"w": 38,
						"h": 51
					},
					"frame": {
						"x": 842,
						"y": 48,
						"w": 38,
						"h": 51
					},
					"anchor": {
						"x": 0.576923,
						"y": 0.865672
					}
				},
				{
					"filename": "endJumping/80.png",
					"rotated": false,
					"trimmed": true,
					"sourceSize": {
						"w": 104,
						"h": 67
					},
					"spriteSourceSize": {
						"x": 36,
						"y": 12,
						"w": 42,
						"h": 49
					},
					"frame": {
						"x": 882,
						"y": 47,
						"w": 42,
						"h": 49
					},
					"anchor": {
						"x": 0.576923,
						"y": 0.865672
					}
				},
				{
					"filename": "endJumping/84.png",
					"rotated": false,
					"trimmed": true,
					"sourceSize": {
						"w": 104,
						"h": 67
					},
					"spriteSourceSize": {
						"x": 36,
						"y": 13,
						"w": 43,
						"h": 48
					},
					"frame": {
						"x": 926,
						"y": 48,
						"w": 43,
						"h": 48
					},
					"anchor": {
						"x": 0.576923,
						"y": 0.865672
					}
				},
				{
					"filename": "jumping/61.png",
					"rotated": false,
					"trimmed": true,
					"sourceSize": {
						"w": 104,
						"h": 67
					},
					"spriteSourceSize": {
						"x": 42,
						"y": 7,
						"w": 35,
						"h": 54
					},
					"frame": {
						"x": 165,
						"y": 59,
						"w": 35,
						"h": 54
					},
					"anchor": {
						"x": 0.576923,
						"y": 0.865672
					}
				},
				{
					"filename": "endJumping/85.png",
					"rotated": false,
					"trimmed": true,
					"sourceSize": {
						"w": 104,
						"h": 67
					},
					"spriteSourceSize": {
						"x": 36,
						"y": 13,
						"w": 43,
						"h": 48
					},
					"frame": {
						"x": 202,
						"y": 58,
						"w": 43,
						"h": 48
					},
					"anchor": {
						"x": 0.576923,
						"y": 0.865672
					}
				},
				{
					"filename": "landing/103.png",
					"rotated": false,
					"trimmed": true,
					"sourceSize": {
						"w": 104,
						"h": 67
					},
					"spriteSourceSize": {
						"x": 36,
						"y": 22,
						"w": 44,
						"h": 38
					},
					"frame": {
						"x": 149,
						"y": 116,
						"w": 44,
						"h": 38
					},
					"anchor": {
						"x": 0.576923,
						"y": 0.865672
					}
				},
				{
					"filename": "jumping/64.png",
					"rotated": false,
					"trimmed": true,
					"sourceSize": {
						"w": 104,
						"h": 67
					},
					"spriteSourceSize": {
						"x": 41,
						"y": 7,
						"w": 36,
						"h": 54
					},
					"frame": {
						"x": 182,
						"y": 156,
						"w": 36,
						"h": 54
					},
					"anchor": {
						"x": 0.576923,
						"y": 0.865672
					}
				},
				{
					"filename": "jumping/59.png",
					"rotated": false,
					"trimmed": true,
					"sourceSize": {
						"w": 104,
						"h": 67
					},
					"spriteSourceSize": {
						"x": 35,
						"y": 24,
						"w": 42,
						"h": 37
					},
					"frame": {
						"x": 189,
						"y": 212,
						"w": 42,
						"h": 37
					},
					"anchor": {
						"x": 0.576923,
						"y": 0.865672
					}
				},
				{
					"filename": "braking/42.png",
					"rotated": false,
					"trimmed": true,
					"sourceSize": {
						"w": 104,
						"h": 67
					},
					"spriteSourceSize": {
						"x": 35,
						"y": 19,
						"w": 45,
						"h": 42
					},
					"frame": {
						"x": 760,
						"y": 100,
						"w": 45,
						"h": 42
					},
					"anchor": {
						"x": 0.576923,
						"y": 0.865672
					}
				},
				{
					"filename": "braking/43.png",
					"rotated": false,
					"trimmed": true,
					"sourceSize": {
						"w": 104,
						"h": 67
					},
					"spriteSourceSize": {
						"x": 35,
						"y": 20,
						"w": 45,
						"h": 41
					},
					"frame": {
						"x": 807,
						"y": 101,
						"w": 45,
						"h": 41
					},
					"anchor": {
						"x": 0.576923,
						"y": 0.865672
					}
				},
				{
					"filename": "braking/44.png",
					"rotated": false,
					"trimmed": true,
					"sourceSize": {
						"w": 104,
						"h": 67
					},
					"spriteSourceSize": {
						"x": 35,
						"y": 20,
						"w": 45,
						"h": 41
					},
					"frame": {
						"x": 854,
						"y": 101,
						"w": 45,
						"h": 41
					},
					"anchor": {
						"x": 0.576923,
						"y": 0.865672
					}
				},
				{
					"filename": "breathing/13.png",
					"rotated": false,
					"trimmed": true,
					"sourceSize": {
						"w": 104,
						"h": 67
					},
					"spriteSourceSize": {
						"x": 35,
						"y": 16,
						"w": 45,
						"h": 44
					},
					"frame": {
						"x": 901,
						"y": 98,
						"w": 45,
						"h": 44
					},
					"anchor": {
						"x": 0.576923,
						"y": 0.865672
					}
				},
				{
					"filename": "jumping/66.png",
					"rotated": false,
					"trimmed": true,
					"sourceSize": {
						"w": 104,
						"h": 67
					},
					"spriteSourceSize": {
						"x": 40,
						"y": 7,
						"w": 36,
						"h": 54
					},
					"frame": {
						"x": 948,
						"y": 98,
						"w": 36,
						"h": 54
					},
					"anchor": {
						"x": 0.576923,
						"y": 0.865672
					}
				},
				{
					"filename": "jumping/65.png",
					"rotated": false,
					"trimmed": true,
					"sourceSize": {
						"w": 104,
						"h": 67
					},
					"spriteSourceSize": {
						"x": 42,
						"y": 7,
						"w": 35,
						"h": 54
					},
					"frame": {
						"x": 220,
						"y": 154,
						"w": 35,
						"h": 54
					},
					"anchor": {
						"x": 0.576923,
						"y": 0.865672
					}
				},
				{
					"filename": "breathing/14.png",
					"rotated": false,
					"trimmed": true,
					"sourceSize": {
						"w": 104,
						"h": 67
					},
					"spriteSourceSize": {
						"x": 35,
						"y": 16,
						"w": 45,
						"h": 44
					},
					"frame": {
						"x": 202,
						"y": 108,
						"w": 45,
						"h": 44
					},
					"anchor": {
						"x": 0.576923,
						"y": 0.865672
					}
				},
				{
					"filename": "landing/100.png",
					"rotated": false,
					"trimmed": true,
					"sourceSize": {
						"w": 104,
						"h": 67
					},
					"spriteSourceSize": {
						"x": 38,
						"y": 26,
						"w": 43,
						"h": 36
					},
					"frame": {
						"x": 233,
						"y": 210,
						"w": 43,
						"h": 36
					},
					"anchor": {
						"x": 0.576923,
						"y": 0.865672
					}
				},
				{
					"filename": "jumping/67.png",
					"rotated": false,
					"trimmed": true,
					"sourceSize": {
						"w": 104,
						"h": 67
					},
					"spriteSourceSize": {
						"x": 40,
						"y": 7,
						"w": 36,
						"h": 53
					},
					"frame": {
						"x": 257,
						"y": 154,
						"w": 36,
						"h": 53
					},
					"anchor": {
						"x": 0.576923,
						"y": 0.865672
					}
				},
				{
					"filename": "landing/104.png",
					"rotated": false,
					"trimmed": true,
					"sourceSize": {
						"w": 104,
						"h": 67
					},
					"spriteSourceSize": {
						"x": 36,
						"y": 19,
						"w": 44,
						"h": 41
					},
					"frame": {
						"x": 278,
						"y": 209,
						"w": 44,
						"h": 41
					},
					"anchor": {
						"x": 0.576923,
						"y": 0.865672
					}
				},
				{
					"filename": "endJumping/86.png",
					"rotated": false,
					"trimmed": true,
					"sourceSize": {
						"w": 104,
						"h": 67
					},
					"spriteSourceSize": {
						"x": 36,
						"y": 13,
						"w": 43,
						"h": 48
					},
					"frame": {
						"x": 249,
						"y": 104,
						"w": 43,
						"h": 48
					},
					"anchor": {
						"x": 0.576923,
						"y": 0.865672
					}
				},
				{
					"filename": "breathing/16.png",
					"rotated": false,
					"trimmed": true,
					"sourceSize": {
						"w": 104,
						"h": 67
					},
					"spriteSourceSize": {
						"x": 35,
						"y": 16,
						"w": 45,
						"h": 44
					},
					"frame": {
						"x": 247,
						"y": 58,
						"w": 45,
						"h": 44
					},
					"anchor": {
						"x": 0.576923,
						"y": 0.865672
					}
				},
				{
					"filename": "jumping/69.png",
					"rotated": false,
					"trimmed": true,
					"sourceSize": {
						"w": 104,
						"h": 67
					},
					"spriteSourceSize": {
						"x": 40,
						"y": 7,
						"w": 36,
						"h": 53
					},
					"frame": {
						"x": 294,
						"y": 54,
						"w": 36,
						"h": 53
					},
					"anchor": {
						"x": 0.576923,
						"y": 0.865672
					}
				},
				{
					"filename": "braking/51.png",
					"rotated": false,
					"trimmed": true,
					"sourceSize": {
						"w": 104,
						"h": 67
					},
					"spriteSourceSize": {
						"x": 36,
						"y": 17,
						"w": 44,
						"h": 43
					},
					"frame": {
						"x": 294,
						"y": 109,
						"w": 44,
						"h": 43
					},
					"anchor": {
						"x": 0.576923,
						"y": 0.865672
					}
				},
				{
					"filename": "braking/54.png",
					"rotated": false,
					"trimmed": true,
					"sourceSize": {
						"w": 104,
						"h": 67
					},
					"spriteSourceSize": {
						"x": 36,
						"y": 17,
						"w": 44,
						"h": 43
					},
					"frame": {
						"x": 294,
						"y": 109,
						"w": 44,
						"h": 43
					},
					"anchor": {
						"x": 0.576923,
						"y": 0.865672
					}
				},
				{
					"filename": "braking/57.png",
					"rotated": false,
					"trimmed": true,
					"sourceSize": {
						"w": 104,
						"h": 67
					},
					"spriteSourceSize": {
						"x": 36,
						"y": 17,
						"w": 44,
						"h": 43
					},
					"frame": {
						"x": 294,
						"y": 109,
						"w": 44,
						"h": 43
					},
					"anchor": {
						"x": 0.576923,
						"y": 0.865672
					}
				},
				{
					"filename": "landing/105.png",
					"rotated": false,
					"trimmed": true,
					"sourceSize": {
						"w": 104,
						"h": 67
					},
					"spriteSourceSize": {
						"x": 36,
						"y": 17,
						"w": 44,
						"h": 43
					},
					"frame": {
						"x": 294,
						"y": 109,
						"w": 44,
						"h": 43
					},
					"anchor": {
						"x": 0.576923,
						"y": 0.865672
					}
				},
				{
					"filename": "jumping/70.png",
					"rotated": false,
					"trimmed": true,
					"sourceSize": {
						"w": 104,
						"h": 67
					},
					"spriteSourceSize": {
						"x": 40,
						"y": 7,
						"w": 36,
						"h": 53
					},
					"frame": {
						"x": 295,
						"y": 154,
						"w": 36,
						"h": 53
					},
					"anchor": {
						"x": 0.576923,
						"y": 0.865672
					}
				},
				{
					"filename": "endJumping/87.png",
					"rotated": false,
					"trimmed": true,
					"sourceSize": {
						"w": 104,
						"h": 67
					},
					"spriteSourceSize": {
						"x": 37,
						"y": 12,
						"w": 42,
						"h": 49
					},
					"frame": {
						"x": 340,
						"y": 82,
						"w": 42,
						"h": 49
					},
					"anchor": {
						"x": 0.576923,
						"y": 0.865672
					}
				},
				{
					"filename": "jumping/68.png",
					"rotated": false,
					"trimmed": true,
					"sourceSize": {
						"w": 104,
						"h": 67
					},
					"spriteSourceSize": {
						"x": 42,
						"y": 7,
						"w": 34,
						"h": 53
					},
					"frame": {
						"x": 384,
						"y": 98,
						"w": 34,
						"h": 53
					},
					"anchor": {
						"x": 0.576923,
						"y": 0.865672
					}
				},
				{
					"filename": "breathing/12.png",
					"rotated": false,
					"trimmed": true,
					"sourceSize": {
						"w": 104,
						"h": 67
					},
					"spriteSourceSize": {
						"x": 36,
						"y": 16,
						"w": 44,
						"h": 44
					},
					"frame": {
						"x": 420,
						"y": 100,
						"w": 44,
						"h": 44
					},
					"anchor": {
						"x": 0.576923,
						"y": 0.865672
					}
				},
				{
					"filename": "braking/52.png",
					"rotated": false,
					"trimmed": true,
					"sourceSize": {
						"w": 104,
						"h": 67
					},
					"spriteSourceSize": {
						"x": 35,
						"y": 17,
						"w": 45,
						"h": 43
					},
					"frame": {
						"x": 466,
						"y": 104,
						"w": 45,
						"h": 43
					},
					"anchor": {
						"x": 0.576923,
						"y": 0.865672
					}
				},
				{
					"filename": "braking/55.png",
					"rotated": false,
					"trimmed": true,
					"sourceSize": {
						"w": 104,
						"h": 67
					},
					"spriteSourceSize": {
						"x": 35,
						"y": 17,
						"w": 45,
						"h": 43
					},
					"frame": {
						"x": 466,
						"y": 104,
						"w": 45,
						"h": 43
					},
					"anchor": {
						"x": 0.576923,
						"y": 0.865672
					}
				},
				{
					"filename": "breathing/1.png",
					"rotated": false,
					"trimmed": true,
					"sourceSize": {
						"w": 104,
						"h": 67
					},
					"spriteSourceSize": {
						"x": 35,
						"y": 17,
						"w": 45,
						"h": 43
					},
					"frame": {
						"x": 466,
						"y": 104,
						"w": 45,
						"h": 43
					},
					"anchor": {
						"x": 0.576923,
						"y": 0.865672
					}
				},
				{
					"filename": "jumping/58.png",
					"rotated": false,
					"trimmed": true,
					"sourceSize": {
						"w": 104,
						"h": 67
					},
					"spriteSourceSize": {
						"x": 35,
						"y": 17,
						"w": 45,
						"h": 43
					},
					"frame": {
						"x": 466,
						"y": 104,
						"w": 45,
						"h": 43
					},
					"anchor": {
						"x": 0.576923,
						"y": 0.865672
					}
				},
				{
					"filename": "endJumping/77.png",
					"rotated": false,
					"trimmed": true,
					"sourceSize": {
						"w": 104,
						"h": 67
					},
					"spriteSourceSize": {
						"x": 37,
						"y": 10,
						"w": 38,
						"h": 50
					},
					"frame": {
						"x": 513,
						"y": 102,
						"w": 38,
						"h": 50
					},
					"anchor": {
						"x": 0.576923,
						"y": 0.865672
					}
				},
				{
					"filename": "jumping/72.png",
					"rotated": false,
					"trimmed": true,
					"sourceSize": {
						"w": 104,
						"h": 67
					},
					"spriteSourceSize": {
						"x": 40,
						"y": 7,
						"w": 36,
						"h": 53
					},
					"frame": {
						"x": 553,
						"y": 98,
						"w": 36,
						"h": 53
					},
					"anchor": {
						"x": 0.576923,
						"y": 0.865672
					}
				},
				{
					"filename": "breathing/15.png",
					"rotated": false,
					"trimmed": true,
					"sourceSize": {
						"w": 104,
						"h": 67
					},
					"spriteSourceSize": {
						"x": 36,
						"y": 16,
						"w": 44,
						"h": 44
					},
					"frame": {
						"x": 591,
						"y": 96,
						"w": 44,
						"h": 44
					},
					"anchor": {
						"x": 0.576923,
						"y": 0.865672
					}
				},
				{
					"filename": "landing/94.png",
					"rotated": false,
					"trimmed": true,
					"sourceSize": {
						"w": 104,
						"h": 67
					},
					"spriteSourceSize": {
						"x": 37,
						"y": 16,
						"w": 43,
						"h": 44
					},
					"frame": {
						"x": 637,
						"y": 97,
						"w": 43,
						"h": 44
					},
					"anchor": {
						"x": 0.576923,
						"y": 0.865672
					}
				},
				{
					"filename": "jumping/71.png",
					"rotated": false,
					"trimmed": true,
					"sourceSize": {
						"w": 104,
						"h": 67
					},
					"spriteSourceSize": {
						"x": 42,
						"y": 7,
						"w": 34,
						"h": 53
					},
					"frame": {
						"x": 682,
						"y": 101,
						"w": 34,
						"h": 53
					},
					"anchor": {
						"x": 0.576923,
						"y": 0.865672
					}
				},
				{
					"filename": "endJumping/78.png",
					"rotated": false,
					"trimmed": true,
					"sourceSize": {
						"w": 104,
						"h": 67
					},
					"spriteSourceSize": {
						"x": 36,
						"y": 11,
						"w": 40,
						"h": 49
					},
					"frame": {
						"x": 718,
						"y": 106,
						"w": 40,
						"h": 49
					},
					"anchor": {
						"x": 0.576923,
						"y": 0.865672
					}
				},
				{
					"filename": "endJumping/79.png",
					"rotated": false,
					"trimmed": true,
					"sourceSize": {
						"w": 104,
						"h": 67
					},
					"spriteSourceSize": {
						"x": 36,
						"y": 12,
						"w": 41,
						"h": 48
					},
					"frame": {
						"x": 340,
						"y": 133,
						"w": 41,
						"h": 48
					},
					"anchor": {
						"x": 0.576923,
						"y": 0.865672
					}
				},
				{
					"filename": "braking/53.png",
					"rotated": false,
					"trimmed": true,
					"sourceSize": {
						"w": 104,
						"h": 67
					},
					"spriteSourceSize": {
						"x": 35,
						"y": 17,
						"w": 45,
						"h": 43
					},
					"frame": {
						"x": 383,
						"y": 153,
						"w": 45,
						"h": 43
					},
					"anchor": {
						"x": 0.576923,
						"y": 0.865672
					}
				},
				{
					"filename": "braking/56.png",
					"rotated": false,
					"trimmed": true,
					"sourceSize": {
						"w": 104,
						"h": 67
					},
					"spriteSourceSize": {
						"x": 35,
						"y": 17,
						"w": 45,
						"h": 43
					},
					"frame": {
						"x": 383,
						"y": 153,
						"w": 45,
						"h": 43
					},
					"anchor": {
						"x": 0.576923,
						"y": 0.865672
					}
				},
				{
					"filename": "breathing/2.png",
					"rotated": false,
					"trimmed": true,
					"sourceSize": {
						"w": 104,
						"h": 67
					},
					"spriteSourceSize": {
						"x": 35,
						"y": 17,
						"w": 45,
						"h": 43
					},
					"frame": {
						"x": 333,
						"y": 183,
						"w": 45,
						"h": 43
					},
					"anchor": {
						"x": 0.576923,
						"y": 0.865672
					}
				},
				{
					"filename": "breathing/4.png",
					"rotated": false,
					"trimmed": true,
					"sourceSize": {
						"w": 104,
						"h": 67
					},
					"spriteSourceSize": {
						"x": 35,
						"y": 17,
						"w": 45,
						"h": 43
					},
					"frame": {
						"x": 380,
						"y": 198,
						"w": 45,
						"h": 43
					},
					"anchor": {
						"x": 0.576923,
						"y": 0.865672
					}
				},
				{
					"filename": "breathing/5.png",
					"rotated": false,
					"trimmed": true,
					"sourceSize": {
						"w": 104,
						"h": 67
					},
					"spriteSourceSize": {
						"x": 35,
						"y": 17,
						"w": 45,
						"h": 43
					},
					"frame": {
						"x": 760,
						"y": 144,
						"w": 45,
						"h": 43
					},
					"anchor": {
						"x": 0.576923,
						"y": 0.865672
					}
				},
				{
					"filename": "breathing/7.png",
					"rotated": false,
					"trimmed": true,
					"sourceSize": {
						"w": 104,
						"h": 67
					},
					"spriteSourceSize": {
						"x": 35,
						"y": 17,
						"w": 45,
						"h": 43
					},
					"frame": {
						"x": 807,
						"y": 144,
						"w": 45,
						"h": 43
					},
					"anchor": {
						"x": 0.576923,
						"y": 0.865672
					}
				},
				{
					"filename": "breathing/8.png",
					"rotated": false,
					"trimmed": true,
					"sourceSize": {
						"w": 104,
						"h": 67
					},
					"spriteSourceSize": {
						"x": 35,
						"y": 17,
						"w": 45,
						"h": 43
					},
					"frame": {
						"x": 854,
						"y": 144,
						"w": 45,
						"h": 43
					},
					"anchor": {
						"x": 0.576923,
						"y": 0.865672
					}
				},
				{
					"filename": "breathing/17.png",
					"rotated": false,
					"trimmed": true,
					"sourceSize": {
						"w": 104,
						"h": 67
					},
					"spriteSourceSize": {
						"x": 35,
						"y": 16,
						"w": 45,
						"h": 44
					},
					"frame": {
						"x": 901,
						"y": 144,
						"w": 45,
						"h": 44
					},
					"anchor": {
						"x": 0.576923,
						"y": 0.865672
					}
				},
				{
					"filename": "breathing/3.png",
					"rotated": false,
					"trimmed": true,
					"sourceSize": {
						"w": 104,
						"h": 67
					},
					"spriteSourceSize": {
						"x": 36,
						"y": 17,
						"w": 44,
						"h": 43
					},
					"frame": {
						"x": 591,
						"y": 142,
						"w": 44,
						"h": 43
					},
					"anchor": {
						"x": 0.576923,
						"y": 0.865672
					}
				},
				{
					"filename": "landing/101.png",
					"rotated": false,
					"trimmed": true,
					"sourceSize": {
						"w": 104,
						"h": 67
					},
					"spriteSourceSize": {
						"x": 38,
						"y": 26,
						"w": 43,
						"h": 36
					},
					"frame": {
						"x": 637,
						"y": 143,
						"w": 43,
						"h": 36
					},
					"anchor": {
						"x": 0.576923,
						"y": 0.865672
					}
				},
				{
					"filename": "breathing/19.png",
					"rotated": false,
					"trimmed": true,
					"sourceSize": {
						"w": 104,
						"h": 67
					},
					"spriteSourceSize": {
						"x": 35,
						"y": 16,
						"w": 45,
						"h": 44
					},
					"frame": {
						"x": 430,
						"y": 149,
						"w": 45,
						"h": 44
					},
					"anchor": {
						"x": 0.576923,
						"y": 0.865672
					}
				},
				{
					"filename": "breathing/20.png",
					"rotated": false,
					"trimmed": true,
					"sourceSize": {
						"w": 104,
						"h": 67
					},
					"spriteSourceSize": {
						"x": 35,
						"y": 16,
						"w": 45,
						"h": 44
					},
					"frame": {
						"x": 477,
						"y": 154,
						"w": 45,
						"h": 44
					},
					"anchor": {
						"x": 0.576923,
						"y": 0.865672
					}
				},
				{
					"filename": "breathing/18.png",
					"rotated": false,
					"trimmed": true,
					"sourceSize": {
						"w": 104,
						"h": 67
					},
					"spriteSourceSize": {
						"x": 36,
						"y": 16,
						"w": 44,
						"h": 44
					},
					"frame": {
						"x": 524,
						"y": 154,
						"w": 44,
						"h": 44
					},
					"anchor": {
						"x": 0.576923,
						"y": 0.865672
					}
				},
				{
					"filename": "breathing/23.png",
					"rotated": false,
					"trimmed": true,
					"sourceSize": {
						"w": 104,
						"h": 67
					},
					"spriteSourceSize": {
						"x": 35,
						"y": 17,
						"w": 45,
						"h": 43
					},
					"frame": {
						"x": 430,
						"y": 195,
						"w": 45,
						"h": 43
					},
					"anchor": {
						"x": 0.576923,
						"y": 0.865672
					}
				},
				{
					"filename": "breathing/25.png",
					"rotated": false,
					"trimmed": true,
					"sourceSize": {
						"w": 104,
						"h": 67
					},
					"spriteSourceSize": {
						"x": 35,
						"y": 17,
						"w": 45,
						"h": 43
					},
					"frame": {
						"x": 477,
						"y": 200,
						"w": 45,
						"h": 43
					},
					"anchor": {
						"x": 0.576923,
						"y": 0.865672
					}
				},
				{
					"filename": "breathing/6.png",
					"rotated": false,
					"trimmed": true,
					"sourceSize": {
						"w": 104,
						"h": 67
					},
					"spriteSourceSize": {
						"x": 36,
						"y": 17,
						"w": 44,
						"h": 43
					},
					"frame": {
						"x": 524,
						"y": 200,
						"w": 44,
						"h": 43
					},
					"anchor": {
						"x": 0.576923,
						"y": 0.865672
					}
				},
				{
					"filename": "breathing/21.png",
					"rotated": false,
					"trimmed": true,
					"sourceSize": {
						"w": 104,
						"h": 67
					},
					"spriteSourceSize": {
						"x": 36,
						"y": 16,
						"w": 44,
						"h": 44
					},
					"frame": {
						"x": 570,
						"y": 187,
						"w": 44,
						"h": 44
					},
					"anchor": {
						"x": 0.576923,
						"y": 0.865672
					}
				},
				{
					"filename": "startRunning/30.png",
					"rotated": false,
					"trimmed": true,
					"sourceSize": {
						"w": 104,
						"h": 67
					},
					"spriteSourceSize": {
						"x": 36,
						"y": 16,
						"w": 44,
						"h": 44
					},
					"frame": {
						"x": 616,
						"y": 187,
						"w": 44,
						"h": 44
					},
					"anchor": {
						"x": 0.576923,
						"y": 0.865672
					}
				},
				{
					"filename": "breathing/9.png",
					"rotated": false,
					"trimmed": true,
					"sourceSize": {
						"w": 104,
						"h": 67
					},
					"spriteSourceSize": {
						"x": 36,
						"y": 17,
						"w": 44,
						"h": 43
					},
					"frame": {
						"x": 662,
						"y": 181,
						"w": 44,
						"h": 43
					},
					"anchor": {
						"x": 0.576923,
						"y": 0.865672
					}
				},
				{
					"filename": "breathing/26.png",
					"rotated": false,
					"trimmed": true,
					"sourceSize": {
						"w": 104,
						"h": 67
					},
					"spriteSourceSize": {
						"x": 35,
						"y": 17,
						"w": 45,
						"h": 43
					},
					"frame": {
						"x": 708,
						"y": 157,
						"w": 45,
						"h": 43
					},
					"anchor": {
						"x": 0.576923,
						"y": 0.865672
					}
				},
				{
					"filename": "breathing/28.png",
					"rotated": false,
					"trimmed": true,
					"sourceSize": {
						"w": 104,
						"h": 67
					},
					"spriteSourceSize": {
						"x": 35,
						"y": 17,
						"w": 45,
						"h": 43
					},
					"frame": {
						"x": 708,
						"y": 202,
						"w": 45,
						"h": 43
					},
					"anchor": {
						"x": 0.576923,
						"y": 0.865672
					}
				},
				{
					"filename": "startRunning/29.png",
					"rotated": false,
					"trimmed": true,
					"sourceSize": {
						"w": 104,
						"h": 67
					},
					"spriteSourceSize": {
						"x": 35,
						"y": 17,
						"w": 45,
						"h": 43
					},
					"frame": {
						"x": 755,
						"y": 189,
						"w": 45,
						"h": 43
					},
					"anchor": {
						"x": 0.576923,
						"y": 0.865672
					}
				},
				{
					"filename": "breathing/22.png",
					"rotated": false,
					"trimmed": true,
					"sourceSize": {
						"w": 104,
						"h": 67
					},
					"spriteSourceSize": {
						"x": 36,
						"y": 17,
						"w": 44,
						"h": 43
					},
					"frame": {
						"x": 802,
						"y": 189,
						"w": 44,
						"h": 43
					},
					"anchor": {
						"x": 0.576923,
						"y": 0.865672
					}
				},
				{
					"filename": "breathing/24.png",
					"rotated": false,
					"trimmed": true,
					"sourceSize": {
						"w": 104,
						"h": 67
					},
					"spriteSourceSize": {
						"x": 36,
						"y": 17,
						"w": 44,
						"h": 43
					},
					"frame": {
						"x": 848,
						"y": 189,
						"w": 44,
						"h": 43
					},
					"anchor": {
						"x": 0.576923,
						"y": 0.865672
					}
				},
				{
					"filename": "breathing/27.png",
					"rotated": false,
					"trimmed": true,
					"sourceSize": {
						"w": 104,
						"h": 67
					},
					"spriteSourceSize": {
						"x": 36,
						"y": 17,
						"w": 44,
						"h": 43
					},
					"frame": {
						"x": 894,
						"y": 190,
						"w": 44,
						"h": 43
					},
					"anchor": {
						"x": 0.576923,
						"y": 0.865672
					}
				},
				{
					"filename": "landing/102.png",
					"rotated": false,
					"trimmed": true,
					"sourceSize": {
						"w": 104,
						"h": 67
					},
					"spriteSourceSize": {
						"x": 37,
						"y": 24,
						"w": 43,
						"h": 36
					},
					"frame": {
						"x": 940,
						"y": 190,
						"w": 43,
						"h": 36
					},
					"anchor": {
						"x": 0.576923,
						"y": 0.865672
					}
				}
			]
		}
	],
	"meta": {
		"app": "https://www.codeandweb.com/texturepacker",
		"version": "3.0",
		"smartupdate": "$TexturePacker:SmartUpdate:920557656acb7f6f3c14b8f4dc63777b:dc3ca65266bba70329aa7a4d0da2833e:eec64b416d3f54b5cb5181ef71d8f236$"
	}
}
