<?xml version="1.0" encoding="UTF-8" standalone="no"?>
<svg xmlns:ffdec="https://www.free-decompiler.com/flash" xmlns:xlink="http://www.w3.org/1999/xlink" ffdec:objectType="shape" height="16.0px" width="259.5px" xmlns="http://www.w3.org/2000/svg">
  <g transform="matrix(1.0, 0.0, 0.0, 1.0, 0.0, 16.0)">
    <path d="M90.6 0.0 L0.0 0.0 0.0 -12.0 4.0 -16.0 90.6 -16.0 90.6 0.0" fill="url(#gradient0)" fill-rule="evenodd" stroke="none"/>
    <path d="M90.6 0.0 L90.6 -16.0 259.5 -16.0 259.5 0.0 90.6 0.0" fill="url(#gradient1)" fill-rule="evenodd" stroke="none"/>
  </g>
  <defs>
    <linearGradient gradientTransform="matrix(0.0476, 0.0, 0.0, 0.0098, 175.55, -8.0)" gradientUnits="userSpaceOnUse" id="gradient0" spreadMethod="pad" x1="-819.2" x2="819.2">
      <stop offset="0.0" stop-color="#517127"/>
      <stop offset="1.0" stop-color="#517127" stop-opacity="0.0"/>
    </linearGradient>
    <linearGradient gradientTransform="matrix(0.0646, 0.0, 0.0, 0.0098, 205.95, -8.0)" gradientUnits="userSpaceOnUse" id="gradient1" spreadMethod="pad" x1="-819.2" x2="819.2">
      <stop offset="0.0" stop-color="#517127"/>
      <stop offset="1.0" stop-color="#517127" stop-opacity="0.0"/>
    </linearGradient>
  </defs>
</svg>
