<?xml version="1.0" encoding="UTF-8" standalone="no"?>
<svg xmlns:ffdec="https://www.free-decompiler.com/flash" xmlns:xlink="http://www.w3.org/1999/xlink" ffdec:objectType="shape" height="16.0px" width="16.0px" xmlns="http://www.w3.org/2000/svg">
  <g transform="matrix(1.0, 0.0, 0.0, 1.0, 0.0, 0.0)">
    <pattern ffdec:smoothed="false" height="16" id="PatternID_235_1" overflow="visible" patternTransform="matrix(1.0, 0.0, 0.0, 1.0, 0.0, 0.0)" patternUnits="userSpaceOnUse" viewBox="0 0 16 16" width="16">
      <image height="16" width="16" xlink:href="data:image/PNG;base64,iVBORw0KGgoAAAANSUhEUgAAABAAAAAQCAYAAAAf8/9hAAAAb0lEQVR4Xq2QCwqAMAxDd9CethebVGGk6UcpPgg4Sh7BtX5if0jLRlTVxe5cYE5RRELsTgk4QbWkWxMEL2sCpQCxd7UilPib3yxJS5Ugk6SlTFD9j2PuBBjDCTATAXIfjbEAMxEgz5QCu3OBcWuyXB/f2nBQCNvvAAAAAElFTkSuQmCC"/>
    </pattern>
    <path d="M0.0 0.0 L16.0 0.0 16.0 16.0 0.0 16.0 0.0 0.0" ffdec:fill-bitmapId="234" style="fill:url(#PatternID_235_1)"/>
  </g>
</svg>
