<?xml version="1.0" encoding="UTF-8" standalone="no"?>
<svg xmlns:ffdec="https://www.free-decompiler.com/flash" xmlns:xlink="http://www.w3.org/1999/xlink" ffdec:objectType="shape" height="16.0px" width="16.0px" xmlns="http://www.w3.org/2000/svg">
  <g transform="matrix(1.0, 0.0, 0.0, 1.0, 0.0, 0.0)">
    <pattern ffdec:smoothed="false" height="16" id="PatternID_70_1" overflow="visible" patternTransform="matrix(1.0, 0.0, 0.0, 1.0, 0.0, 0.0)" patternUnits="userSpaceOnUse" viewBox="0 0 16 16" width="16">
      <image height="16" width="16" xlink:href="data:image/PNG;base64,iVBORw0KGgoAAAANSUhEUgAAABAAAAAQCAYAAAAf8/9hAAAAoUlEQVR4Xp2Ouw2AMAxEU9JQULMRK7AFO7AEOzAFI4DECjS0SHyEkR0cQgCR+CQ3Ud67U+o/4D6EBOosQYFYAnNFsEhA8Nql4hUAoxZIVhBEgl0LQlcQbAtCVph2mGJYttoIfFeYdhYMpRb4rLjaz/ko6HNlJH8rHu22gCX4zwUxZGeI21mAtzVa3hbRtwQPWxjG41UW+ArbuYlCQDdi0DsHKnXpBpdYd5UAAAAASUVORK5CYII="/>
    </pattern>
    <path d="M0.0 0.0 L16.0 0.0 16.0 16.0 0.0 16.0 0.0 0.0" ffdec:fill-bitmapId="69" style="fill:url(#PatternID_70_1)"/>
  </g>
</svg>
