<?xml version="1.0" encoding="UTF-8" standalone="no"?>
<svg xmlns:ffdec="https://www.free-decompiler.com/flash" xmlns:xlink="http://www.w3.org/1999/xlink" ffdec:objectType="shape" height="16.0px" width="16.0px" xmlns="http://www.w3.org/2000/svg">
  <g transform="matrix(1.0, 0.0, 0.0, 1.0, 0.0, 0.0)">
    <pattern ffdec:smoothed="false" height="16" id="PatternID_64_1" overflow="visible" patternTransform="matrix(1.0, 0.0, 0.0, 1.0, 0.0, 0.0)" patternUnits="userSpaceOnUse" viewBox="0 0 16 16" width="16">
      <image height="16" width="16" xlink:href="data:image/PNG;base64,iVBORw0KGgoAAAANSUhEUgAAABAAAAAQCAYAAAAf8/9hAAAAm0lEQVR4XmNgoAL4TwZGAf/3RkHwen+G/wtdGf63GUNwohREAxi8ANL7gHgKpiHopqNgELiVx4CC0Q0BC4AxyAYQBtkGwlDN3xpRMUgMxQB0G5AxumYYRjEAXZIYTLQLcGGyDYBqRMaIaCQGg9SDwNsSSgwAxhCKASeTGf6v9mb4P8sOPwapwWoAqRikGdkAUgG6gSQDYBBS0QUAWNxlds1YOxYAAAAASUVORK5CYII="/>
    </pattern>
    <path d="M0.0 0.0 L16.0 0.0 16.0 16.0 0.0 16.0 0.0 0.0" ffdec:fill-bitmapId="63" style="fill:url(#PatternID_64_1)"/>
  </g>
</svg>
