<?xml version="1.0" encoding="UTF-8" standalone="no"?>
<svg xmlns:ffdec="https://www.free-decompiler.com/flash" xmlns:xlink="http://www.w3.org/1999/xlink" ffdec:objectType="shape" height="16.0px" width="16.0px" xmlns="http://www.w3.org/2000/svg">
  <g transform="matrix(1.0, 0.0, 0.0, 1.0, 0.0, 0.0)">
    <pattern ffdec:smoothed="false" height="16" id="PatternID_251_1" overflow="visible" patternTransform="matrix(1.0, 0.0, 0.0, 1.0, 0.0, 0.0)" patternUnits="userSpaceOnUse" viewBox="0 0 16 16" width="16">
      <image height="16" width="16" xlink:href="data:image/PNG;base64,iVBORw0KGgoAAAANSUhEUgAAABAAAAAQCAYAAAAf8/9hAAAAkklEQVR4XrWR3Q2AIAyE2Y9RmMNH12AGfXEBfXYNExfAXM2Z+kOoRi65pJT2A4pzlZQyNilB67J7Gmex994EkWY0xBhvtkDkVBQjpgn8ApCcFSCbTdOmEMLpBswVARQHqIfIGDDUXpshKUJBziYAT9Tuu0GMWD3vpqOB34Zi/Y0mgG5ATq9xw/qAJ3M2RcBL/6MNjiRiCf3Hm0AAAAAASUVORK5CYII="/>
    </pattern>
    <path d="M0.0 0.0 L16.0 0.0 16.0 16.0 0.0 16.0 0.0 0.0" ffdec:fill-bitmapId="250" style="fill:url(#PatternID_251_1)"/>
  </g>
</svg>
