<?xml version="1.0" encoding="UTF-8" standalone="no"?>
<svg xmlns:ffdec="https://www.free-decompiler.com/flash" xmlns:xlink="http://www.w3.org/1999/xlink" ffdec:objectType="shape" height="5.15px" width="2.1px" xmlns="http://www.w3.org/2000/svg">
  <g transform="matrix(1.0, 0.0, 0.0, 1.0, 1.05, 5.15)">
    <path d="M-0.05 -5.15 L1.05 -5.15 1.05 0.0 -0.05 0.0 -0.05 -3.1 -1.05 -3.1 -1.05 -4.1 -0.05 -4.1 -0.05 -5.15" fill="#ffffff" fill-rule="evenodd" stroke="none"/>
  </g>
</svg>
