<?xml version="1.0" encoding="UTF-8" standalone="no"?>
<svg xmlns:ffdec="https://www.free-decompiler.com/flash" xmlns:xlink="http://www.w3.org/1999/xlink" ffdec:objectType="shape" height="5.1px" width="3.05px" xmlns="http://www.w3.org/2000/svg">
  <g transform="matrix(1.0, 0.0, 0.0, 1.0, 1.5, 5.1)">
    <path d="M1.55 -5.1 L1.55 0.0 -1.5 0.0 -1.5 -5.1 1.55 -5.1 M0.5 -1.0 L0.5 -4.0 -0.5 -4.0 -0.5 -1.0 0.5 -1.0" fill="#ffffff" fill-rule="evenodd" stroke="none"/>
  </g>
</svg>
