<?xml version="1.0" encoding="UTF-8" standalone="no"?>
<svg xmlns:ffdec="https://www.free-decompiler.com/flash" xmlns:xlink="http://www.w3.org/1999/xlink" ffdec:objectType="shape" height="16.0px" width="16.0px" xmlns="http://www.w3.org/2000/svg">
  <g transform="matrix(1.0, 0.0, 0.0, 1.0, 0.0, 0.0)">
    <pattern ffdec:smoothed="false" height="16" id="PatternID_259_1" overflow="visible" patternTransform="matrix(1.0, 0.0, 0.0, 1.0, 0.0, 0.0)" patternUnits="userSpaceOnUse" viewBox="0 0 16 16" width="16">
      <image height="16" width="16" xlink:href="data:image/PNG;base64,iVBORw0KGgoAAAANSUhEUgAAABAAAAAQCAYAAAAf8/9hAAAAoElEQVR4XmNgoCP4D8Vkg///v/ESbQhMIQoGGUCsIf9RAFQjCP8sJc4lYH0gxbgwPkNQnIuOYZoXyXNgNQBsM1QCA8MMAWk+osaFYQDEv4Zwp2FgmGY/fpb/N7W4UQwA6wVJggzAhW8BNW1T5vwfKYhqAFwzPtwtzf6/WoLtf5k4G4YBEEMMIc5DtxUfRjYAbgiSBLEYBWA1mVRAsQEkAQDITwNErDyjSgAAAABJRU5ErkJggg=="/>
    </pattern>
    <path d="M0.0 0.0 L16.0 0.0 16.0 16.0 0.0 16.0 0.0 0.0" ffdec:fill-bitmapId="258" style="fill:url(#PatternID_259_1)"/>
  </g>
</svg>
