<?xml version="1.0" encoding="UTF-8" standalone="no"?>
<svg xmlns:ffdec="https://www.free-decompiler.com/flash" xmlns:xlink="http://www.w3.org/1999/xlink" ffdec:objectType="shape" height="93.8px" width="70.0px" xmlns="http://www.w3.org/2000/svg">
  <g transform="matrix(1.0, 0.0, 0.0, 1.0, 0.0, 0.0)">
    <path d="M35.0 0.0 L70.0 17.7 70.0 76.1 35.0 93.8 0.0 76.1 0.0 17.7 35.0 0.0" fill="#00ccff" fill-rule="evenodd" stroke="none"/>
  </g>
</svg>
