<?xml version="1.0" encoding="UTF-8" standalone="no"?>
<svg xmlns:ffdec="https://www.free-decompiler.com/flash" xmlns:xlink="http://www.w3.org/1999/xlink" ffdec:objectType="shape" height="32.0px" width="192.0px" xmlns="http://www.w3.org/2000/svg">
  <g transform="matrix(1.0, 0.0, 0.0, 1.0, 81.0, 26.0)">
    <path d="M106.0 -26.0 Q111.0 -26.0 111.0 -21.1 L111.0 1.1 Q111.0 6.0 106.0 6.0 L-76.0 6.0 Q-81.0 6.0 -81.0 1.1 L-81.0 -21.1 Q-81.0 -26.0 -76.0 -26.0 L106.0 -26.0" fill="#595c3c" fill-opacity="0.8980392" fill-rule="evenodd" stroke="none"/>
  </g>
</svg>
