<?xml version="1.0" encoding="UTF-8" standalone="no"?>
<svg xmlns:xlink="http://www.w3.org/1999/xlink" height="274.0px" width="184.9px" xmlns="http://www.w3.org/2000/svg">
  <g transform="matrix(1.0, 0.0, 0.0, 1.0, 86.7, 274.0)">
    <path d="M18.75 -273.8 L18.45 -263.4 29.2 -274.0 48.75 -274.0 98.2 -225.6 98.15 -219.85 90.45 -219.85 90.45 0.0 -81.35 0.0 -81.35 -132.95 -86.65 -132.95 -86.7 -138.95 -50.3 -138.95 -13.25 -174.35 -13.2 -178.1 -8.35 -178.2 -3.4 -225.5 -12.75 -225.5 -12.7 -232.7 1.25 -246.45 1.25 -262.55 -1.65 -262.2 -1.55 -255.85 -4.35 -255.9 -4.2 -261.85 -8.4 -261.35 -8.35 -256.05 -12.4 -256.15 -12.55 -268.6 -8.45 -269.3 -8.4 -264.7 -4.1 -265.45 -3.95 -270.05 -1.7 -270.4 -1.65 -265.85 1.25 -266.3 1.65 -270.95 4.9 -271.5 4.8 -266.9 8.45 -267.5 8.3 -272.05 11.1 -272.55 11.25 -268.0 15.45 -268.7 15.25 -273.2 18.75 -273.8 M8.65 -263.5 L4.7 -263.0 4.4 -249.5 10.4 -255.45 8.95 -255.5 8.65 -263.5 M15.8 -260.75 L15.65 -264.4 11.4 -263.85 11.65 -256.7 15.8 -260.75" fill="#000000" fill-rule="evenodd" stroke="none"/>
  </g>
</svg>
