<?xml version="1.0" encoding="UTF-8" standalone="no"?>
<svg xmlns:xlink="http://www.w3.org/1999/xlink" height="18.55px" width="22.6px" xmlns="http://www.w3.org/2000/svg">
  <g transform="matrix(1.0, 0.0, 0.0, 1.0, 1.35, 16.75)">
    <path d="M17.7 -15.45 Q16.75 -14.95 15.85 -14.25 L14.3 -12.9 13.9 -12.4 12.8 -10.85 Q11.9 -9.55 11.3 -7.9 L10.7 -5.55 10.55 -5.3 9.2 -5.4 6.9 -5.05 Q5.3 -4.6 3.7 -3.5 L2.2 -2.3 Q0.4 -0.55 -0.4 1.8 L-0.4 1.75 -0.8 0.7 1.8 -3.2 Q4.65 -7.4 4.95 -11.25 L8.9 -13.3 Q13.05 -15.05 17.7 -15.45" fill="#000000" fill-rule="evenodd" stroke="none"/>
    <path d="M-0.8 0.7 L-1.35 -0.8 Q3.65 -6.25 3.55 -10.6 L3.8 -11.65 5.0 -12.4 Q9.85 -15.3 14.85 -16.2 L17.1 -16.45 17.75 -16.55 20.15 -16.7 20.95 -16.75 21.25 -16.75 Q19.4 -16.45 17.7 -15.45 13.05 -15.05 8.9 -13.3 L4.95 -11.25 Q4.65 -7.4 1.8 -3.2 L-0.8 0.7" fill="#3a3d62" fill-rule="evenodd" stroke="none"/>
  </g>
</svg>
