<?xml version="1.0" encoding="UTF-8" standalone="no"?>
<svg xmlns:xlink="http://www.w3.org/1999/xlink" height="9.0px" width="35.05px" xmlns="http://www.w3.org/2000/svg">
  <g transform="matrix(1.0, 0.0, 0.0, 1.0, -9.0, 35.05)">
    <pattern height="9" id="PatternID_153_1" overflow="visible" patternTransform="matrix(1.0, 0.0, 0.0, 1.0, 9.0, -35.05)" patternUnits="userSpaceOnUse" viewBox="0 0 3 9" width="3">
      <image height="9" width="3" xlink:href="data:image/PNG;base64,iVBORw0KGgoAAAANSUhEUgAAAAMAAAAJCAYAAAD3s5bZAAAAO0lEQVR42mNgAIIXOQr/QTTDgXK+/4eipf+DaIYPq9jAHBANlgExwDIgABaFARAHLoChDC6TayzwH4QBlDMtK9CBwZIAAAAASUVORK5CYII="/>
    </pattern>
    <path d="M9.0 -35.05 L12.0 -35.05 12.0 -26.05 9.0 -26.05 9.0 -35.05" style="fill:url(#PatternID_153_1)"/>
    <pattern height="9" id="PatternID_153_2" overflow="visible" patternTransform="matrix(1.0, 0.0, 0.0, 1.0, 17.0, -35.05)" patternUnits="userSpaceOnUse" viewBox="0 0 3 9" width="3">
      <image height="9" width="3" xlink:href="data:image/PNG;base64,iVBORw0KGgoAAAANSUhEUgAAAAMAAAAJCAYAAAD3s5bZAAAAO0lEQVR42mNgAIIXOQr/QTTDgXK+/4eipf+DaIYPq9jAHBANlgExwDIgABaFARAHLoChDC6TayzwH4QBlDMtK9CBwZIAAAAASUVORK5CYII="/>
    </pattern>
    <path d="M17.0 -35.05 L20.0 -35.05 20.0 -26.05 17.0 -26.05 17.0 -35.05" style="fill:url(#PatternID_153_2)"/>
    <pattern height="9" id="PatternID_153_3" overflow="visible" patternTransform="matrix(1.0, 0.0, 0.0, 1.0, 25.0, -35.05)" patternUnits="userSpaceOnUse" viewBox="0 0 3 9" width="3">
      <image height="9" width="3" xlink:href="data:image/PNG;base64,iVBORw0KGgoAAAANSUhEUgAAAAMAAAAJCAYAAAD3s5bZAAAAO0lEQVR42mNgAIIXOQr/QTTDgXK+/4eipf+DaIYPq9jAHBANlgExwDIgABaFARAHLoChDC6TayzwH4QBlDMtK9CBwZIAAAAASUVORK5CYII="/>
    </pattern>
    <path d="M25.0 -35.05 L28.0 -35.05 28.0 -26.05 25.0 -26.05 25.0 -35.05" style="fill:url(#PatternID_153_3)"/>
    <pattern height="9" id="PatternID_153_4" overflow="visible" patternTransform="matrix(1.0, 0.0, 0.0, 1.0, 33.0, -35.05)" patternUnits="userSpaceOnUse" viewBox="0 0 3 9" width="3">
      <image height="9" width="3" xlink:href="data:image/PNG;base64,iVBORw0KGgoAAAANSUhEUgAAAAMAAAAJCAYAAAD3s5bZAAAAO0lEQVR42mNgAIIXOQr/QTTDgXK+/4eipf+DaIYPq9jAHBANlgExwDIgABaFARAHLoChDC6TayzwH4QBlDMtK9CBwZIAAAAASUVORK5CYII="/>
    </pattern>
    <path d="M33.0 -35.05 L36.0 -35.05 36.0 -26.05 33.0 -26.05 33.0 -35.05" style="fill:url(#PatternID_153_4)"/>
    <pattern height="9" id="PatternID_153_5" overflow="visible" patternTransform="matrix(1.0, 0.0, 0.0, 1.0, 41.05, -35.05)" patternUnits="userSpaceOnUse" viewBox="0 0 3 9" width="3">
      <image height="9" width="3" xlink:href="data:image/PNG;base64,iVBORw0KGgoAAAANSUhEUgAAAAMAAAAJCAYAAAD3s5bZAAAAO0lEQVR42mNgAIIXOQr/QTTDgXK+/4eipf+DaIYPq9jAHBANlgExwDIgABaFARAHLoChDC6TayzwH4QBlDMtK9CBwZIAAAAASUVORK5CYII="/>
    </pattern>
    <path d="M41.05 -35.05 L44.05 -35.05 44.05 -26.05 41.05 -26.05 41.05 -35.05" style="fill:url(#PatternID_153_5)"/>
  </g>
</svg>
