<?xml version="1.0" encoding="UTF-8" standalone="no"?>
<svg xmlns:xlink="http://www.w3.org/1999/xlink" height="19.0px" width="221.5px" xmlns="http://www.w3.org/2000/svg">
  <g transform="matrix(1.0, 0.0, 0.0, 1.0, 0.0, 0.0)">
    <path d="M221.5 9.0 L221.5 19.0 0.0 19.0 0.0 9.0 221.5 9.0" fill="#7c7c7c" fill-rule="evenodd" stroke="none"/>
    <path d="M221.5 9.0 L0.0 9.0 0.0 0.0 221.5 0.0 221.5 9.0" fill="#8f8f8f" fill-rule="evenodd" stroke="none"/>
  </g>
</svg>
