<?xml version="1.0" encoding="UTF-8" standalone="no"?>
<svg xmlns:xlink="http://www.w3.org/1999/xlink" height="6.0px" width="16.0px" xmlns="http://www.w3.org/2000/svg">
  <g transform="matrix(1.0, 0.0, 0.0, 1.0, 17.2, 5.5)">
    <pattern height="6" id="PatternID_164_1" overflow="visible" patternTransform="matrix(1.0, 0.0, 0.0, 1.0, -17.2, -5.5)" patternUnits="userSpaceOnUse" viewBox="0 0 16 6" width="16">
      <image height="6" width="16" xlink:href="data:image/PNG;base64,iVBORw0KGgoAAAANSUhEUgAAABAAAAAGCAYAAADKfB7nAAAAJUlEQVR42mNgQAL/kQADqeA/FkCRZpIMIWQAQcP+kwCoZgiMBgBOibtFJ9XZhgAAAABJRU5ErkJggg=="/>
    </pattern>
    <path d="M-1.2 -5.5 L-1.2 0.5 -17.2 0.5 -17.2 -5.5 -1.2 -5.5" style="fill:url(#PatternID_164_1)"/>
  </g>
</svg>
