<?xml version="1.0" encoding="UTF-8" standalone="no"?>
<svg xmlns:xlink="http://www.w3.org/1999/xlink" height="15.0px" width="15.0px" xmlns="http://www.w3.org/2000/svg">
  <g transform="matrix(1.0, 0.0, 0.0, 1.0, 0.0, 15.0)">
    <pattern height="15" id="PatternID_125_1" overflow="visible" patternTransform="matrix(1.0, 0.0, 0.0, 1.0, 0.0, -15.0)" patternUnits="userSpaceOnUse" viewBox="0 0 15 15" width="15">
      <image height="15" width="15" xlink:href="data:image/PNG;base64,iVBORw0KGgoAAAANSUhEUgAAAA8AAAAPCAYAAAA71pVKAAAAg0lEQVR42mNgwAKc3ryRRscMhABMocevXwXoGK8hyJq8fv2qR8fIhuDVKLh48X90jNMAmGaYxs7/CMBw69Z/ESCNbABcMzaN2Gxm+PED0wB0zf+hmpFtBmuG0iRphrmEKJthNsA0kmSzCCl+xhZoIIUgm5BprBopjmeKUhjFaZucXAUA8JTMnIekRocAAAAASUVORK5CYII="/>
    </pattern>
    <path d="M15.0 -15.0 L15.0 0.0 0.0 0.0 0.0 -15.0 15.0 -15.0" style="fill:url(#PatternID_125_1)"/>
  </g>
</svg>
