<?xml version="1.0" encoding="UTF-8" standalone="no"?>
<svg xmlns:xlink="http://www.w3.org/1999/xlink" height="15.0px" width="15.0px" xmlns="http://www.w3.org/2000/svg">
  <g transform="matrix(1.0, 0.0, 0.0, 1.0, 0.0, 15.0)">
    <pattern height="15" id="PatternID_123_1" overflow="visible" patternTransform="matrix(1.0, 0.0, 0.0, 1.0, 0.0, -15.0)" patternUnits="userSpaceOnUse" viewBox="0 0 15 15" width="15">
      <image height="15" width="15" xlink:href="data:image/PNG;base64,iVBORw0KGgoAAAANSUhEUgAAAA8AAAAPCAYAAAA71pVKAAAAlUlEQVR42mNgGD5Az9XpPzomWuNyE/H/U/REwXSHljCYJmgASMFuK6n/NWpCGHi2gSh+A0CSIBtBis85yP7/5asMthlmAEHNICeCFD50Vfh/3Fbm/3R9iGHd2sKENcNsAdkIciqy0wlqxudnHWsr3Jo1DQ0bQQpgNoKciqwRJI9XM8wAdAyTwxtdMEXYMFEJhWyNpAAAZMyND/lQ3yYAAAAASUVORK5CYII="/>
    </pattern>
    <path d="M15.0 -15.0 L15.0 0.0 0.0 0.0 0.0 -15.0 15.0 -15.0" style="fill:url(#PatternID_123_1)"/>
  </g>
</svg>
