<?xml version="1.0" encoding="UTF-8" standalone="no"?>
<svg xmlns:xlink="http://www.w3.org/1999/xlink" height="36.0px" width="14.0px" xmlns="http://www.w3.org/2000/svg">
  <g transform="matrix(1.0, 0.0, 0.0, 1.0, 0.0, 36.0)">
    <pattern height="36" id="PatternID_554_1" overflow="visible" patternTransform="matrix(1.0, 0.0, 0.0, 1.0, 0.0, -36.0)" patternUnits="userSpaceOnUse" viewBox="0 0 14 36" width="14">
      <image height="36" width="14" xlink:href="data:image/PNG;base64,iVBORw0KGgoAAAANSUhEUgAAAA4AAAAkCAYAAAC5fwuBAAAALElEQVR42mNgGAWDHVTYa/5HxiNaI7pCQngANZKimWx/jmoc1TiqcVQjBRoBehTxxqivFv4AAAAASUVORK5CYII="/>
    </pattern>
    <path d="M14.0 -36.0 L14.0 0.0 0.0 0.0 0.0 -36.0 14.0 -36.0" style="fill:url(#PatternID_554_1)"/>
  </g>
</svg>
