<?xml version="1.0" encoding="UTF-8" standalone="no"?>
<svg xmlns:xlink="http://www.w3.org/1999/xlink" height="50.5px" width="52.25px" xmlns="http://www.w3.org/2000/svg">
  <g transform="matrix(1.0, 0.0, 0.0, 1.0, 25.9, 24.95)">
    <path d="M-9.0 -11.85 L-7.35 -14.5 -0.45 -24.6 -0.05 -24.9 0.45 -24.9 0.85 -24.6 7.85 -14.5 9.5 -11.85 -9.0 -11.85 M4.5 -8.9 L4.5 -6.55 -4.15 -6.55 -4.15 -8.9 4.5 -8.9" fill="#1d4901" fill-rule="evenodd" stroke="none"/>
    <path d="M9.5 -11.85 L9.5 -11.8 9.6 -11.2 9.35 -10.7 Q9.15 -10.45 8.8 -10.45 L4.5 -10.45 4.5 -8.9 -4.15 -8.9 -4.15 -10.45 -8.4 -10.45 Q-8.75 -10.45 -8.9 -10.7 L-9.2 -11.2 -9.05 -11.8 -9.0 -11.85 9.5 -11.85 M4.5 -6.55 L4.5 -5.1 4.25 -4.5 Q4.05 -4.25 3.7 -4.25 L-3.35 -4.25 Q-3.7 -4.25 -3.9 -4.5 L-4.15 -5.1 -4.15 -6.55 4.5 -6.55" fill="#183a01" fill-rule="evenodd" stroke="none"/>
    <path d="M8.8 -12.2 L3.7 -12.2 3.7 -6.5 -3.35 -6.5 -3.35 -12.2 -8.4 -12.2 0.2 -24.7 8.8 -12.2" fill="url(#gradient0)" fill-rule="evenodd" stroke="none"/>
    <path d="M13.25 -9.05 L15.9 -7.4 26.0 -0.5 26.3 -0.1 26.3 0.4 26.0 0.8 15.9 7.8 13.25 9.45 13.25 -9.05 M10.3 4.45 L7.95 4.45 7.95 -4.2 10.3 -4.2 10.3 4.45" fill="#1d4901" fill-rule="evenodd" stroke="none"/>
    <path d="M13.25 9.45 L13.2 9.45 12.6 9.55 12.1 9.3 11.85 8.75 11.85 4.45 10.3 4.45 10.3 -4.2 11.85 -4.2 11.85 -8.45 Q11.85 -8.8 12.1 -8.95 12.3 -9.2 12.6 -9.25 L13.2 -9.1 13.25 -9.05 13.25 9.45 M7.95 4.45 L6.5 4.45 5.9 4.2 Q5.65 4.0 5.65 3.65 L5.65 -3.4 Q5.65 -3.75 5.9 -3.95 L6.5 -4.2 7.95 -4.2 7.95 4.45" fill="#183a01" fill-rule="evenodd" stroke="none"/>
    <path d="M13.6 8.75 L13.6 3.65 7.9 3.65 7.9 -3.4 13.6 -3.4 13.6 -8.45 26.1 0.15 13.6 8.75" fill="url(#gradient1)" fill-rule="evenodd" stroke="none"/>
    <path d="M-12.8 -9.05 L-15.45 -7.4 -25.55 -0.5 -25.85 -0.1 -25.85 0.4 -25.55 0.8 -15.45 7.8 -12.8 9.45 -12.8 -9.05 M-9.85 4.45 L-7.5 4.45 -7.5 -4.2 -9.85 -4.2 -9.85 4.45" fill="#1d4901" fill-rule="evenodd" stroke="none"/>
    <path d="M-12.8 9.45 L-12.75 9.45 -12.15 9.55 Q-11.85 9.5 -11.65 9.3 -11.4 9.1 -11.4 8.75 L-11.4 4.45 -9.85 4.45 -9.85 -4.2 -11.4 -4.2 -11.4 -8.45 -11.65 -8.95 Q-11.85 -9.2 -12.15 -9.25 L-12.75 -9.1 -12.8 -9.05 -12.8 9.45 M-7.5 4.45 L-6.05 4.45 -5.45 4.2 Q-5.2 4.0 -5.2 3.65 L-5.2 -3.4 Q-5.2 -3.75 -5.45 -3.95 L-6.05 -4.2 -7.5 -4.2 -7.5 4.45" fill="#183a01" fill-rule="evenodd" stroke="none"/>
    <path d="M-13.15 8.75 L-13.15 3.65 -7.45 3.65 -7.45 -3.4 -13.15 -3.4 -13.15 -8.45 -25.65 0.15 -13.15 8.75" fill="url(#gradient2)" fill-rule="evenodd" stroke="none"/>
    <path d="M-9.0 12.45 L-7.35 15.1 -0.45 25.2 -0.05 25.5 0.45 25.5 0.85 25.2 7.85 15.1 9.5 12.45 -9.0 12.45 M4.5 9.5 L4.5 7.15 -4.15 7.15 -4.15 9.5 4.5 9.5" fill="#1d4901" fill-rule="evenodd" stroke="none"/>
    <path d="M9.5 12.45 L9.5 12.4 9.6 11.8 9.35 11.3 Q9.15 11.05 8.8 11.05 L4.5 11.05 4.5 9.5 -4.15 9.5 -4.15 11.05 -8.4 11.05 Q-8.75 11.05 -8.9 11.3 L-9.2 11.8 -9.05 12.4 -9.0 12.45 9.5 12.45 M4.5 7.15 L4.5 5.7 4.25 5.1 Q4.05 4.85 3.7 4.85 L-3.35 4.85 Q-3.7 4.85 -3.9 5.1 L-4.15 5.7 -4.15 7.15 4.5 7.15" fill="#183a01" fill-rule="evenodd" stroke="none"/>
    <path d="M8.8 12.8 L3.7 12.8 3.7 7.1 -3.35 7.1 -3.35 12.8 -8.4 12.8 0.2 25.3 8.8 12.8" fill="url(#gradient3)" fill-rule="evenodd" stroke="none"/>
  </g>
  <defs>
    <linearGradient gradientTransform="matrix(0.0, 0.007, -0.0105, 0.0, 0.2, -13.1)" gradientUnits="userSpaceOnUse" id="gradient0" spreadMethod="pad" x1="-819.2" x2="819.2">
      <stop offset="0.0" stop-color="#62a400"/>
      <stop offset="1.0" stop-color="#99ff00"/>
    </linearGradient>
    <linearGradient gradientTransform="matrix(-0.007, 0.0, 0.0, -0.0105, 14.5, 0.15)" gradientUnits="userSpaceOnUse" id="gradient1" spreadMethod="pad" x1="-819.2" x2="819.2">
      <stop offset="0.0" stop-color="#62a400"/>
      <stop offset="1.0" stop-color="#99ff00"/>
    </linearGradient>
    <linearGradient gradientTransform="matrix(0.007, 0.0, 0.0, -0.0105, -14.05, 0.15)" gradientUnits="userSpaceOnUse" id="gradient2" spreadMethod="pad" x1="-819.2" x2="819.2">
      <stop offset="0.0" stop-color="#62a400"/>
      <stop offset="1.0" stop-color="#99ff00"/>
    </linearGradient>
    <linearGradient gradientTransform="matrix(0.0, -0.007, -0.0105, 0.0, 0.2, 13.7)" gradientUnits="userSpaceOnUse" id="gradient3" spreadMethod="pad" x1="-819.2" x2="819.2">
      <stop offset="0.0" stop-color="#62a400"/>
      <stop offset="1.0" stop-color="#99ff00"/>
    </linearGradient>
  </defs>
</svg>
