<?xml version="1.0" encoding="UTF-8" standalone="no"?>
<svg xmlns:xlink="http://www.w3.org/1999/xlink" height="32.15px" width="34.1px" xmlns="http://www.w3.org/2000/svg">
  <g transform="matrix(1.0, 0.0, 0.0, 1.0, -15.4, 45.55)">
    <path d="M15.4 -45.55 L49.5 -45.55 49.5 -13.4 15.4 -13.4 15.4 -45.55" fill="#666633" fill-rule="evenodd" stroke="none"/>
  </g>
</svg>
