<?xml version="1.0" encoding="UTF-8" standalone="no"?>
<svg xmlns:xlink="http://www.w3.org/1999/xlink" height="325.25px" width="188.85px" xmlns="http://www.w3.org/2000/svg">
  <g transform="matrix(1.0, 0.0, 0.0, 1.0, 94.4, 325.25)">
    <path d="M38.9 -210.5 L38.9 -228.85 45.45 -229.1 44.25 -210.5 49.3 -210.5 49.15 -229.2 54.75 -229.4 54.75 -210.5 59.45 -210.5 61.8 -187.05 69.1 -187.3 67.65 -210.5 78.55 -210.5 78.9 -187.6 94.45 -188.15 94.25 -182.95 90.85 -182.15 86.7 0.0 -83.45 0.0 -94.4 -261.0 -79.6 -260.65 -78.3 -279.6 -64.25 -279.8 -64.3 -291.5 -64.05 -325.25 -62.8 -325.25 Q-62.3 -314.0 -62.3 -291.5 L-62.35 -279.8 -19.55 -280.45 -18.1 -259.25 0.9 -258.85 0.15 -185.0 33.85 -186.1 35.05 -210.5 38.9 -210.5" fill="#000000" fill-rule="evenodd" stroke="none"/>
  </g>
</svg>
