<?xml version="1.0" encoding="UTF-8" standalone="no"?>
<svg xmlns:xlink="http://www.w3.org/1999/xlink" height="7.0px" width="40.0px" xmlns="http://www.w3.org/2000/svg">
  <g transform="matrix(1.0, 0.0, 0.0, 1.0, 0.0, 0.0)">
    <pattern height="7" id="PatternID_531_1" overflow="visible" patternTransform="matrix(1.0, 0.0, 0.0, 1.0, 0.0, 0.0)" patternUnits="userSpaceOnUse" viewBox="0 0 40 7" width="40">
      <image height="7" width="40" xlink:href="data:image/PNG;base64,iVBORw0KGgoAAAANSUhEUgAAACgAAAAHCAIAAAD1ZpjZAAAAOklEQVR42mPwjwodEMSQWpwNRAWNFfRBEOuACGFxdHoiHRB2iyu7m2mB4H7FaTFdfUwjXxJEDAOVqgGd1ltMQstVnAAAAABJRU5ErkJggg=="/>
    </pattern>
    <path d="M0.0 0.0 L40.0 0.0 40.0 7.0 0.0 7.0 0.0 0.0" style="fill:url(#PatternID_531_1)"/>
  </g>
</svg>
