<?xml version="1.0" encoding="UTF-8" standalone="no"?>
<svg xmlns:xlink="http://www.w3.org/1999/xlink" height="57.4px" width="70.05px" xmlns="http://www.w3.org/2000/svg">
  <g transform="matrix(1.0, 0.0, 0.0, 1.0, 0.0, 0.0)">
    <path d="M70.05 0.0 L70.05 57.4 0.0 57.4 0.0 0.0 70.05 0.0" fill="#00ff00" fill-rule="evenodd" stroke="none"/>
  </g>
</svg>
