<?xml version="1.0" encoding="UTF-8" standalone="no"?>
<svg xmlns:xlink="http://www.w3.org/1999/xlink" height="6.05px" width="7.0px" xmlns="http://www.w3.org/2000/svg">
  <g transform="matrix(1.0, 0.0, 0.0, 1.0, -84.0, 42.0)">
    <pattern height="14" id="PatternID_78_1" overflow="visible" patternTransform="matrix(1.0, 0.0, 0.0, 0.4322, 84.0, -42.0)" patternUnits="userSpaceOnUse" viewBox="0 0 7 14" width="7">
      <image height="14" width="7" xlink:href="data:image/PNG;base64,iVBORw0KGgoAAAANSUhEUgAAAAcAAAAOCAYAAADjXQYbAAAAMklEQVR42mNggIK7J3f8T44M/t9aWfCfAR2ABEGSK2b2YkrCdOOUGDUWaixWSZixyGIATJ1T2x7+T3QAAAAASUVORK5CYII="/>
    </pattern>
    <path d="M84.0 -42.0 L91.0 -42.0 91.0 -35.95 84.0 -35.95 84.0 -42.0" style="fill:url(#PatternID_78_1)"/>
  </g>
</svg>
