<?xml version="1.0" encoding="UTF-8" standalone="no"?>
<svg xmlns:xlink="http://www.w3.org/1999/xlink" height="56.0px" width="63.0px" xmlns="http://www.w3.org/2000/svg">
  <g transform="matrix(1.0, 0.0, 0.0, 1.0, 0.0, 56.0)">
    <pattern height="56" id="PatternID_312_1" overflow="visible" patternTransform="matrix(1.0, 0.0, 0.0, 1.0, 0.0, -56.0)" patternUnits="userSpaceOnUse" viewBox="0 0 63 56" width="63">
      <image height="56" width="63" xlink:href="data:image/PNG;base64,iVBORw0KGgoAAAANSUhEUgAAAD8AAAA4CAYAAABKWiBnAAAAd0lEQVR42u3TsQ2AIBQEUNZhCtdye6xsUUMBcu+Sa+je5VOKiKyY86jtbu8NHh4e/vfgL4VPHCD69Ked26qNhb8eYFf44wC7w7sDROPj/zw8PDw8PDw8PDw8PDw8PDw8PDw8PDw8PDw8PDw8PDw8PDw8PDz8AP4CNKkHLYHKNJwAAAAASUVORK5CYII="/>
    </pattern>
    <path d="M63.0 -56.0 L63.0 0.0 0.0 0.0 0.0 -56.0 63.0 -56.0" style="fill:url(#PatternID_312_1)"/>
  </g>
</svg>
