<?xml version="1.0" encoding="UTF-8" standalone="no"?>
<svg xmlns:xlink="http://www.w3.org/1999/xlink" height="6.25px" width="1.8px" xmlns="http://www.w3.org/2000/svg">
  <g transform="matrix(1.0, 0.0, 0.0, 1.0, 0.0, 0.0)">
    <path d="M1.5 0.25 L1.8 0.9 1.5 1.5 0.9 1.8 0.25 1.5 0.0 0.9 0.25 0.25 Q0.55 0.0 0.9 0.0 L1.5 0.25 M1.5 4.7 L1.8 5.35 1.5 5.95 0.9 6.25 0.25 5.95 0.0 5.35 0.25 4.7 Q0.55 4.45 0.9 4.45 L1.5 4.7" fill="#a3ff36" fill-rule="evenodd" stroke="none"/>
  </g>
</svg>
