<?xml version="1.0" encoding="UTF-8" standalone="no"?>
<svg xmlns:xlink="http://www.w3.org/1999/xlink" height="101.0px" width="101.0px" xmlns="http://www.w3.org/2000/svg">
  <g transform="matrix(1.0, 0.0, 0.0, 1.0, 0.5, 0.5)">
    <path d="M100.0 100.0 L0.0 100.0 0.0 0.0 100.0 0.0 100.0 100.0" fill="#00ff00" fill-opacity="0.0" fill-rule="evenodd" stroke="none"/>
    <path d="M95.0 95.0 L5.0 95.0 5.0 5.0 95.0 5.0 95.0 95.0" fill="url(#gradient0)" fill-rule="evenodd" stroke="none"/>
    <path d="M88.0 0.0 L82.0 0.0 M100.0 0.0 L94.0 0.0 M100.0 12.0 L100.0 6.0 M100.0 24.0 L100.0 18.0 M100.0 36.0 L100.0 30.0 M100.0 48.0 L100.0 42.0 M100.0 60.0 L100.0 54.0 M100.0 72.0 L100.0 66.0 M100.0 84.0 L100.0 78.0 M100.0 96.0 L100.0 90.0 M52.0 0.0 L46.0 0.0 M64.0 0.0 L58.0 0.0 M76.0 0.0 L70.0 0.0 M4.0 0.0 L0.0 0.0 0.0 6.0 M16.0 0.0 L10.0 0.0 M28.0 0.0 L22.0 0.0 M40.0 0.0 L34.0 0.0 M0.0 36.0 L0.0 42.0 M0.0 24.0 L0.0 30.0 M0.0 12.0 L0.0 18.0 M0.0 84.0 L0.0 90.0 M0.0 72.0 L0.0 78.0 M0.0 60.0 L0.0 66.0 M0.0 48.0 L0.0 54.0 M68.0 100.0 L74.0 100.0 M56.0 100.0 L62.0 100.0 M44.0 100.0 L50.0 100.0 M32.0 100.0 L38.0 100.0 M20.0 100.0 L26.0 100.0 M8.0 100.0 L14.0 100.0 M0.0 96.0 L0.0 100.0 2.0 100.0 M92.0 100.0 L98.0 100.0 M80.0 100.0 L86.0 100.0" fill="none" stroke="#ffffff" stroke-linecap="round" stroke-linejoin="round" stroke-width="1.0"/>
    <path d="M12.0 5.0 L12.0 95.0 5.0 95.0 5.0 5.0 12.0 5.0 M35.05 42.7 L35.05 31.5 53.55 50.0 35.05 68.5 35.05 57.3 28.35 57.3 28.35 42.7 35.05 42.7" fill="#ffffff" fill-rule="evenodd" stroke="none"/>
  </g>
  <defs>
    <linearGradient gradientTransform="matrix(0.0549, 0.0, 0.0, 0.0549, 50.0, 50.0)" gradientUnits="userSpaceOnUse" id="gradient0" spreadMethod="pad" x1="-819.2" x2="819.2">
      <stop offset="0.0" stop-color="#ffffff" stop-opacity="0.49803922"/>
      <stop offset="1.0" stop-color="#ffffff" stop-opacity="0.0"/>
    </linearGradient>
  </defs>
</svg>
