<?xml version="1.0" encoding="UTF-8" standalone="no"?>
<svg xmlns:xlink="http://www.w3.org/1999/xlink" height="3.65px" width="3.65px" xmlns="http://www.w3.org/2000/svg">
  <g transform="matrix(1.0, 0.0, 0.0, 1.0, 1.8, 1.85)">
    <path d="M-1.8 -1.85 L1.85 -1.85 1.85 1.8 -1.8 1.8 -1.8 -1.85" fill="#99ff00" fill-rule="evenodd" stroke="none"/>
  </g>
</svg>
