<?xml version="1.0" encoding="UTF-8" standalone="no"?>
<svg xmlns:xlink="http://www.w3.org/1999/xlink" height="77.25px" width="141.3px" xmlns="http://www.w3.org/2000/svg">
  <g transform="matrix(1.0, 0.0, 0.0, 1.0, 70.65, 38.6)">
    <path d="M-32.7 -33.9 Q-27.4 -38.6 -19.65 -38.6 -11.95 -38.6 -6.6 -33.95 -0.65 -28.8 -0.65 -20.1 -0.65 -17.55 -1.0 -15.25 5.95 -20.3 15.35 -21.8 26.05 -23.5 33.25 -19.3 41.35 -14.5 41.35 -3.6 41.35 0.95 39.95 4.65 43.5 6.15 47.3 8.7 55.9 14.45 55.9 17.2 55.9 21.0 52.8 25.35 L52.75 25.45 Q58.3 25.8 61.05 27.1 64.2 28.55 64.2 31.75 L64.15 32.7 66.2 32.95 Q70.55 33.6 70.55 35.25 L70.65 36.7 Q70.5 37.4 69.05 37.8 L49.4 38.65 34.2 38.45 Q-34.3 38.35 -49.15 36.65 L-52.0 36.25 Q-54.35 37.6 -55.75 37.6 -64.2 37.6 -66.5 33.05 -67.35 31.35 -67.35 26.3 -67.35 19.25 -64.5 17.6 -69.15 14.65 -69.65 14.4 -69.65 13.8 -70.15 12.55 -70.65 11.3 -70.65 5.4 -70.65 -2.65 -65.5 -6.7 -61.0 -10.25 -54.15 -9.7 L-49.05 -8.75 Q-46.6 -10.9 -43.65 -12.6 -39.85 -11.15 -37.2 -9.55 -38.65 -14.5 -38.65 -19.6 -38.65 -28.6 -32.7 -33.9" fill="#ffffff" fill-rule="evenodd" stroke="none"/>
  </g>
</svg>
