<?xml version="1.0" encoding="UTF-8" standalone="no"?>
<svg xmlns:xlink="http://www.w3.org/1999/xlink" height="29.3px" width="23.4px" xmlns="http://www.w3.org/2000/svg">
  <g transform="matrix(1.0, 0.0, 0.0, 1.0, -4.85, -0.85)">
    <path d="M16.7 0.85 L16.85 1.1 17.0 1.2 18.7 3.05 19.5 3.95 28.25 3.95 28.25 30.15 4.85 30.15 4.85 3.95 13.0 3.95 14.8 2.35 Q15.9 1.4 16.5 1.15 L16.7 0.85 M16.8 1.75 L15.05 3.35 14.3 3.95 18.6 3.95 16.8 1.75 M24.5 7.35 L8.4 7.35 8.4 26.55 24.5 26.55 24.5 7.35 M25.15 6.9 L25.15 27.1 7.8 27.1 7.8 6.9 25.15 6.9 M26.25 5.8 L6.75 5.8 6.75 28.15 26.25 28.15 26.25 5.8" fill="#000000" fill-rule="evenodd" stroke="none"/>
    <path d="M19.5 12.95 Q20.25 12.65 19.2 12.55 L19.5 12.95 M18.25 11.7 L18.1 11.35 Q18.1 10.8 19.0 11.0 L19.05 11.2 Q18.95 11.8 18.25 11.7 M13.3 9.9 L13.6 9.95 13.65 10.2 12.75 10.7 12.85 10.05 Q12.85 9.9 13.3 9.9 M12.4 12.05 L12.5 11.95 Q13.25 12.15 12.4 12.05 M22.05 13.55 L22.05 13.6 Q22.7 13.85 22.05 13.55 M21.5 9.4 L23.45 11.9 22.1 17.15 17.8 19.4 17.15 22.3 18.4 20.8 18.15 19.95 19.3 19.3 20.25 19.55 19.05 20.35 Q19.3 20.65 19.45 20.5 20.3 20.45 21.05 19.9 L21.4 21.05 19.85 22.0 19.25 21.65 17.05 23.95 17.55 25.2 18.3 24.8 19.05 25.45 19.85 24.2 19.8 26.25 20.95 24.35 21.05 25.15 21.55 24.6 22.15 24.6 22.05 25.7 22.6 24.5 22.65 25.7 23.25 24.5 23.1 25.85 23.95 24.7 23.95 25.45 24.9 24.45 23.55 27.8 23.45 27.2 22.45 26.3 22.25 26.3 22.15 26.5 22.05 26.65 21.25 26.0 20.6 27.15 17.75 26.95 16.6 26.55 15.85 26.85 15.05 26.55 11.75 27.05 11.45 24.5 10.75 27.15 10.1 26.65 8.2 26.25 9.35 24.45 10.0 26.25 10.5 24.25 12.05 24.25 12.35 25.1 12.7 24.45 13.85 24.9 15.3 20.45 14.05 20.6 14.3 19.55 13.95 18.55 12.8 18.3 11.65 18.7 9.55 18.25 9.8 16.25 9.8 17.75 10.85 17.75 10.4 15.65 10.9 15.1 10.45 12.55 11.5 10.8 11.45 9.85 Q12.5 9.2 13.65 8.9 L11.85 10.55 12.1 11.35 11.4 11.7 11.2 12.9 12.55 13.7 11.4 14.25 12.8 15.2 12.4 15.8 13.2 15.65 14.0 16.3 12.85 17.35 14.95 16.8 15.5 17.5 15.25 16.3 14.2 16.15 15.0 15.2 17.55 15.1 17.1 14.75 18.75 14.7 19.5 14.15 17.75 13.0 19.05 13.25 18.4 12.0 19.05 12.3 20.6 12.1 19.9 11.3 20.9 10.8 18.8 10.5 18.9 9.35 17.65 9.15 17.4 9.85 16.75 10.1 16.1 13.15 17.05 14.3 15.4 13.55 15.45 12.95 15.05 12.4 15.15 11.8 14.95 10.95 15.15 10.8 15.45 10.8 15.5 10.7 14.55 10.4 14.3 9.45 13.8 8.85 14.0 8.8 15.35 8.85 16.9 8.55 Q19.0 8.35 20.6 9.8 L21.5 9.4 M16.15 18.2 Q16.5 18.55 17.0 18.55 17.5 18.55 17.9 18.2 L18.25 17.3 Q18.25 16.8 17.9 16.45 17.5 16.05 17.0 16.05 16.5 16.05 16.15 16.45 15.75 16.8 15.75 17.3 15.75 17.8 16.15 18.2 M8.85 25.45 Q9.0 26.0 8.9 25.5 L8.85 25.45 M13.05 13.6 L13.65 12.9 15.0 13.15 13.45 14.75 13.05 13.6 M18.35 15.9 Q19.3 15.55 18.35 15.55 18.1 16.0 18.35 15.9" fill="#000000" fill-rule="evenodd" stroke="none"/>
  </g>
</svg>
