{
  "rules": [
    {
      "zone": "quartier",
      "darkness": 75
    }, {
      "zone": "impasse",
      "darkness": 75
    }, {
      "zone": "masure",
      "darkness": 75
    }, {
      "zone": "catacombes",
      "darkness": 100
    }, {
      "zone": "catacombes_ss",
      "darkness": 100
    }, {
      "zone": { "start": "villa", "end": "villa0d" },
      "darkness": 55
    }, {
      "zone": "cave",
      "darkness": 55

    }
  ]
}