{
  "raysAtRespawn":true,							// Bug des rayons qui ne fonctionnent pas au respawn
  "startAgainMusicIfSameID":true,				// Evite qu'une musique recommence si on met deux fois de suite un e_music avec le même ID
  "lifeSharingInMulti":true,					// Bug de l'option Partage de vies en Multi
  "consecutiveScoreLevels":true,				// Bug des paliers de points consécutifs

  "raysOnHighestLine":true,						// Bug des rayons (hors TP) qui ne fonctionnent pas en Y = 0
  "teleportersOnHighestLine":false,				// Bug des TP qui ne fonctionnent pas en Y = 0
  "fruitsStuckInColumns":false,					// Bug des fruits qui se coincent dans une case de 1 de large
  "respawnOfLateralVorticesOnLowestLine":false,	// Corrige le point de spawn d'un vortex latéral placé tout en bas du niveau
  "canBeStuckOnTopOfLateralVortices":true,		// Evite qu'on puisse se bloquer au-dessus d'un vortex latéral
  "lycheesBreakOrder":true						// Permet de pouvoir décarapacer un litchi sans casser l'ordre
}
