[
  {
    "id": "101",
    "name": "Cerise",
    "description": "Vous avez vaincu le boss Cerise !",
    "require": {
      "1240": 1
    },
    "give": [{
      "type": "family",
      "id": "5015"
    }],
    "remove": []
  },
  {
    "id": "102",
    "name": "Orange",
    "description": "Vous avez vaincu le boss Orange !",
    "require": {
      "1241": 1
    },
    "give": [{
      "type": "family",
      "id": "5016"
    }],
    "remove": []
  },
  {
    "id": "103",
    "name": "Pomme",
    "description": "Vous avez vaincu le boss Pomme !",
    "require": {
      "1242": 1
    },
    "give": [{
      "type": "family",
      "id": "5017"
    }],
    "remove": []
  },
  {
    "id": "104",
    "name": "Banane",
    "description": "Vous avez vaincu le boss Banane !",
    "require": {
      "1243": 1
    },
    "give": [{
      "type": "family",
      "id": "5018"
    }],
    "remove": []
  },
  {
    "id": "105",
    "name": "Citron",
    "description": "Vous avez vaincu le boss Citron !",
    "require": {
      "1244": 1
    },
    "give": [{
      "type": "family",
      "id": "5019"
    }],
    "remove": []
  },
  {
    "id": "106",
    "name": "Bombino",
    "description": "Vous avez vaincu le boss Bombino !",
    "require": {
      "1245": 1
    },
    "give": [{
      "type": "family",
      "id": "5020"
    }],
    "remove": []
  },
  {
    "id": "107",
    "name": "Poire",
    "description": "Vous avez vaincu le boss Poire !",
    "require": {
      "1246": 1
    },
    "give": [{
      "type": "family",
      "id": "5021"
    }],
    "remove": []
  },
  {
    "id": "108",
    "name": "Abricot",
    "description": "Vous avez vaincu le boss Abricot !",
    "require": {
      "1247": 1
    },
    "give": [{
      "type": "family",
      "id": "5022"
    }],
    "remove": []
  },
  {
    "id": "109",
    "name": "Litchi",
    "description": "Vous avez vaincu le boss Litchi !",
    "require": {
      "1248": 1
    },
    "give": [{
      "type": "family",
      "id": "5023"
    }],
    "remove": []
  },
  {
    "id": "110",
    "name": "Fraise",
    "description": "Vous avez vaincu le boss Fraise !",
    "require": {
      "1249": 1
    },
    "give": [{
      "type": "family",
      "id": "5024"
    }],
    "remove": []
  },
  {
    "id": "111",
    "name": "Kiwi",
    "description": "Vous avez vaincu le boss Kiwi !",
    "require": {
      "1250": 1
    },
    "give": [{
      "type": "family",
      "id": "5025"
    }],
    "remove": []
  },
  {
    "id": "112",
    "name": "Pastèque",
    "description": "Vous avez vaincu le boss Pastèque !",
    "require": {
      "1251": 1
    },
    "give": [{
      "type": "family",
      "id": "5026"
    }],
    "remove": []
  },
  {
    "id": "113",
    "name": "Ananas",
    "description": "Vous avez vaincu le boss Ananas !",
    "require": {
      "1252": 1
    },
    "give": [{
      "type": "family",
      "id": "5027"
    }],
    "remove": []
  },
  {
    "id": "114",
    "name": "Blob",
    "description": "Vous avez vaincu le boss Blob !",
    "require": {
      "1253": 1
    },
    "give": [{
      "type": "family",
      "id": "5028"
    }],
    "remove": []
  },
  {
    "id": "115",
    "name": "Framboise",
    "description": "Vous avez vaincu le boss Framboise !",
    "require": {
      "1254": 1
    },
    "give": [{
      "type": "family",
      "id": "5029"
    }],
    "remove": []
  },
  {
    "id": "116",
    "name": "Georges",
    "description": "Vous avez vaincu le boss Georges !",
    "require": {
      "1255": 1
    },
    "give": [{
      "type": "family",
      "id": "5030"
    }],
    "remove": []
  }
]