<?xml version="1.0" encoding="UTF-8" standalone="no"?>
<!-- Created with Inkscape (http://www.inkscape.org/) -->

<svg
   xmlns:dc="http://purl.org/dc/elements/1.1/"
   xmlns:cc="http://creativecommons.org/ns#"
   xmlns:rdf="http://www.w3.org/1999/02/22-rdf-syntax-ns#"
   xmlns:svg="http://www.w3.org/2000/svg"
   xmlns="http://www.w3.org/2000/svg"
   xmlns:sodipodi="http://sodipodi.sourceforge.net/DTD/sodipodi-0.dtd"
   xmlns:inkscape="http://www.inkscape.org/namespaces/inkscape"
   width="13.791377"
   height="29.999907"
   viewBox="0 0 13.791377 29.999907"
   version="1.1"
   id="svg2391"
   inkscape:export-filename="C:\Enfants\Hammerfest\Eternalfest\projets\SVG\SkyKey.png"
   inkscape:export-xdpi="13.491893"
   inkscape:export-ydpi="13.491893"
   inkscape:version="0.92.4 (5da689c313, 2019-01-14)"
   sodipodi:docname="SkyKey.svg">
  <defs
     id="defs2385" />
  <sodipodi:namedview
     id="base"
     pagecolor="#ffffff"
     bordercolor="#666666"
     borderopacity="1.0"
     inkscape:pageopacity="0.0"
     inkscape:pageshadow="2"
     inkscape:zoom="28.266667"
     inkscape:cx="7.2399467"
     inkscape:cy="14.999906"
     inkscape:document-units="px"
     inkscape:current-layer="g2472"
     showgrid="false"
     inkscape:snap-global="true"
     fit-margin-top="0"
     fit-margin-left="0"
     fit-margin-right="0"
     fit-margin-bottom="0"
     inkscape:window-width="1920"
     inkscape:window-height="1017"
     inkscape:window-x="-8"
     inkscape:window-y="-8"
     inkscape:window-maximized="1"
     units="px" />
  <metadata
     id="metadata2388">
    <rdf:RDF>
      <cc:Work
         rdf:about="">
        <dc:format>image/svg+xml</dc:format>
        <dc:type
           rdf:resource="http://purl.org/dc/dcmitype/StillImage" />
        <dc:title></dc:title>
      </cc:Work>
    </rdf:RDF>
  </metadata>
  <g
     inkscape:label="Calque 1"
     inkscape:groupmode="layer"
     id="layer1"
     transform="translate(47.354491,-109.34003)">
    <g
       id="g2404"
       transform="translate(36.471794,-35.727472)">
      <g
         id="g2513">
        <g
           inkscape:export-ydpi="13.041437"
           inkscape:export-xdpi="13.041437"
           transform="translate(-9.428083,66.989011)"
           id="g2501">
          <g
             id="g2472"
             transform="matrix(8.1738571,0,0,7.8427591,1016.729,-279.31152)">
            <g
               id="g2579">
              <g
                 id="g3351"
                 transform="matrix(0.5,0,0,0.5,-66.302068,23.741008)">
                <path
                   style="opacity:1;fill:#000000;fill-opacity:1;fill-rule:nonzero;stroke:#be5f07;stroke-width:0.2800867;stroke-linecap:square;stroke-linejoin:round;stroke-miterlimit:4;stroke-dasharray:none;stroke-dashoffset:0;stroke-opacity:1"
                   d="m -133.38041,51.138692 c -0.31384,-0.06826 -0.52819,-0.263837 -0.69832,-0.637167 -0.11311,-0.248198 -0.15677,-0.415332 -0.15685,-0.600453 -1e-4,-0.197807 0.0323,-0.329122 0.14516,-0.58945 0.3009,-0.693768 0.84852,-1.345118 1.22008,-1.451202 0.0292,-0.0083 0.0342,-0.128533 0.0456,-1.098892 0.007,-0.599248 0.0109,-1.091155 0.009,-1.093126 -0.002,-0.002 -0.25042,0.0088 -0.55118,0.02384 -0.30077,0.01508 -0.5858,0.02789 -0.63343,0.02847 l -0.0866,10e-4 -0.006,-0.276601 -0.006,-0.276602 0.16508,-0.01183 c 0.0908,-0.0065 0.3717,-0.01787 0.62422,-0.02524 l 0.45914,-0.01341 v -0.647388 -0.647387 l 0.14961,-1.81e-4 c 0.0823,-9.9e-5 0.19835,-0.006 0.25794,-0.01319 l 0.10833,-0.01301 v 0.704477 0.704477 h 0.68097 l 0.49919,0.009 v 0.183163 0.02578 0.236011 h -0.53349 -0.71527 l 0.0137,0.777204 c 0.008,0.427462 0.0137,0.928427 0.0137,1.113256 v 0.336053 l 0.13237,0.06317 c 0.49967,0.238471 0.93956,0.8408 1.06882,1.463504 0.0335,0.161542 0.0391,0.246491 0.0298,0.456426 -0.006,0.141868 -0.025,0.306863 -0.0416,0.366656 -0.14874,0.533871 -0.54973,0.823257 -1.26163,0.910497 -0.25036,0.03068 -0.7743,0.02622 -0.9313,-0.0079 z"
                   id="path3227"
                   inkscape:connector-curvature="0"
                   sodipodi:nodetypes="ccccccccccccccccccccccccccccccscccccccc" />
                <path
                   style="opacity:1;fill:#fedc54;fill-opacity:1;fill-rule:nonzero;stroke:none;stroke-width:0.15560375;stroke-linecap:square;stroke-linejoin:round;stroke-miterlimit:4;stroke-dasharray:none;stroke-dashoffset:0;stroke-opacity:1"
                   d="m -132.84277,48.076007 0.0146,-2.407583 -1.26946,0.05837 -0.0146,-0.583662 1.24027,-0.04377 0.0146,-1.284048 0.52529,-0.02918 0.0146,1.400773 1.163,0.02792 v 0.444954 l -1.23597,0.0086 0.0292,2.407584"
                   id="path2490"
                   inkscape:connector-curvature="0"
                   sodipodi:nodetypes="cccccccccccc" />
                <path
                   sodipodi:nodetypes="ccsssc"
                   style="fill:#fedc54;fill-opacity:1;stroke-width:0.26458332"
                   d="m -134.09253,50.500233 c -0.25516,-0.560029 -0.22416,-0.83771 0.17664,-1.581945 0.26737,-0.496476 0.71698,-0.975954 0.99913,-1.065505 0.77525,-0.246055 1.7909,0.836182 1.7909,1.908313 0,0.992674 -0.55237,1.418397 -1.84036,1.418397 -0.62022,0 -0.8913,-0.163487 -1.12631,-0.67926 z"
                   id="path2476"
                   inkscape:connector-curvature="0" />
                <path
                   sodipodi:nodetypes="ccsscc"
                   id="path2476-1"
                   d="m -131.28236,48.999314 c -0.58046,2.170785 -1.19661,1.451289 -1.79491,2.176933 0.0371,0.0014 0.0755,0.0021 0.11548,0.0021 1.28799,0 1.84032,-0.425691 1.84032,-1.418365 0,-0.259333 -0.0598,-0.519121 -0.16089,-0.760695 z"
                   style="opacity:0.05;fill:#000000;fill-opacity:1;stroke-width:0.26458332"
                   inkscape:connector-curvature="0" />
                <path
                   sodipodi:nodetypes="ssss"
                   style="fill:#fcb81b;fill-opacity:1;stroke-width:0.26458332"
                   d="m -133.76178,50.448256 c -0.52637,-0.678817 0.29966,-1.86014 0.75828,-2.156282 0.4688,-0.302712 1.06019,-0.06256 1.40893,0.702837 0.64689,1.419783 -1.21918,2.676052 -2.16721,1.453445 z"
                   id="path2474"
                   inkscape:connector-curvature="0" />
                <path
                   style="opacity:1;fill:#ffffff;fill-opacity:1;fill-rule:nonzero;stroke:none;stroke-width:0.03286369;stroke-linecap:square;stroke-linejoin:round;stroke-miterlimit:4;stroke-dasharray:none;stroke-dashoffset:0;stroke-opacity:1"
                   d="m -133.07579,49.212098 c -0.10618,-0.05051 -0.41095,-0.426208 -0.2418,-0.613581 0.16915,-0.187374 0.38887,-0.486218 0.60949,-0.329102 0.22062,0.157116 0.35789,0.318887 0.41122,0.577433 0.0533,0.258545 -0.35674,0.44322 -0.52284,0.427509 -0.16609,-0.01571 -0.2157,-0.04437 -0.25607,-0.06226 -0.0404,-0.01789 0.10619,0.05051 0,-10e-7 z"
                   id="path3145"
                   inkscape:connector-curvature="0"
                   sodipodi:nodetypes="zzzzzzz" />
                <ellipse
                   style="opacity:1;fill:#be5f07;fill-opacity:1;fill-rule:nonzero;stroke:none;stroke-width:0.39962438;stroke-linecap:square;stroke-linejoin:round;stroke-miterlimit:4;stroke-dasharray:none;stroke-dashoffset:0;stroke-opacity:1"
                   id="path3229"
                   cx="-132.63368"
                   cy="45.369877"
                   rx="0.30953062"
                   ry="0.3198483" />
                <ellipse
                   style="opacity:1;fill:#fedc54;fill-opacity:1;fill-rule:nonzero;stroke:none;stroke-width:0.3112075;stroke-linecap:square;stroke-linejoin:round;stroke-miterlimit:4;stroke-dasharray:none;stroke-dashoffset:0;stroke-opacity:1"
                   id="path3231"
                   cx="-132.62337"
                   cy="45.333763"
                   rx="0.22698914"
                   ry="0.22183029" />
                <path
                   style="opacity:1;fill:#fcb81b;fill-opacity:1;fill-rule:nonzero;stroke:none;stroke-width:0.3112075;stroke-linecap:square;stroke-linejoin:round;stroke-miterlimit:4;stroke-dasharray:none;stroke-dashoffset:0;stroke-opacity:1"
                   d="m -131.16634,45.473796 -1.20898,0.196984 1.22085,-0.011 z"
                   id="path3233"
                   inkscape:connector-curvature="0"
                   sodipodi:nodetypes="cccc" />
                <path
                   sodipodi:nodetypes="cccc"
                   inkscape:connector-curvature="0"
                   id="path3250"
                   d="m -132.85736,43.815314 0.15321,-0.0091 -0.16781,1.293165 z"
                   style="opacity:1;fill:#ffffff;fill-opacity:1;fill-rule:nonzero;stroke:none;stroke-width:0.28008676;stroke-linecap:square;stroke-linejoin:round;stroke-miterlimit:4;stroke-dasharray:none;stroke-dashoffset:0;stroke-opacity:1" />
                <path
                   inkscape:connector-curvature="0"
                   id="path3252"
                   d="m -134.11223,45.143132 -7.4e-4,0.141463 1.24101,-0.185216 z"
                   style="opacity:1;fill:#ffffff;fill-opacity:1;fill-rule:nonzero;stroke:none;stroke-width:0.28008676;stroke-linecap:square;stroke-linejoin:round;stroke-miterlimit:4;stroke-dasharray:none;stroke-dashoffset:0;stroke-opacity:1" />
                <path
                   sodipodi:nodetypes="ccssssc"
                   transform="matrix(0.03112075,0,0,0.03112075,-134.37562,43.656831)"
                   inkscape:connector-curvature="0"
                   id="path3263"
                   d="m 46.763155,233.79251 c 7.086872,6.49926 48.42223,-58.03758 41.722324,-63.86359 l 0.936205,2.07257 c 3.073428,6.80395 4.55062,14.77103 3.973655,21.43148 -0.904297,10.43912 -4.94062,19.30552 -12.202932,26.80561 -7.159978,7.3944 -16.027745,12.03772 -25.583006,13.3957 -2.455615,0.34899 -7.846117,0.4454 -8.846246,0.15823 z"
                   style="opacity:0.2;fill:#be5f07;fill-opacity:1;fill-rule:nonzero;stroke:none;stroke-width:2.10989022;stroke-linecap:square;stroke-linejoin:round;stroke-miterlimit:4;stroke-dasharray:none;stroke-dashoffset:0;stroke-opacity:1" />
              </g>
            </g>
          </g>
        </g>
      </g>
    </g>
  </g>
</svg>
