<?xml version="1.0" encoding="UTF-8" standalone="no"?>
<!-- Created with Inkscape (http://www.inkscape.org/) -->

<svg
  xmlns:dc="http://purl.org/dc/elements/1.1/"
  xmlns:cc="http://creativecommons.org/ns#"
  xmlns:rdf="http://www.w3.org/1999/02/22-rdf-syntax-ns#"
  xmlns:svg="http://www.w3.org/2000/svg"
  xmlns="http://www.w3.org/2000/svg"
  xmlns:xlink="http://www.w3.org/1999/xlink"
  xmlns:sodipodi="http://sodipodi.sourceforge.net/DTD/sodipodi-0.dtd"
  xmlns:inkscape="http://www.inkscape.org/namespaces/inkscape"
  width="23.687958"
  height="21.055414"
  viewBox="0 0 23.687958 21.055414"
  version="1.1"
  id="svg8"
  inkscape:version="0.92.4 (5da689c313, 2019-01-14)"
  sodipodi:docname="vieLubrique.svg"
  inkscape:export-filename="C:\Autres\Twin\Eternalfest\saint-valentin\src\assets\sprites\objets\vieSulfureuse.png"
  inkscape:export-xdpi="324.2099"
  inkscape:export-ydpi="324.2099">
 <defs
   id="defs2">
  <linearGradient
    inkscape:collect="always"
    id="linearGradient983">
   <stop
     style="stop-color:#c83737;stop-opacity:1"
     offset="0"
     id="stop979" />
   <stop
     style="stop-color:#800080;stop-opacity:1"
     offset="1"
     id="stop981" />
  </linearGradient>
  <linearGradient
    inkscape:collect="always"
    xlink:href="#linearGradient983"
    id="linearGradient985"
    x1="-0.50030398"
    y1="-18.199989"
    x2="-1.049093"
    y2="-1.949945"
    gradientUnits="userSpaceOnUse" />
 </defs>
 <sodipodi:namedview
   id="base"
   pagecolor="#ffffff"
   bordercolor="#666666"
   borderopacity="1.0"
   inkscape:pageopacity="0.0"
   inkscape:pageshadow="2"
   inkscape:zoom="12.880662"
   inkscape:cx="3.3854971"
   inkscape:cy="10.805908"
   inkscape:document-units="px"
   inkscape:current-layer="use2"
   showgrid="false"
   fit-margin-top="0"
   fit-margin-left="0"
   fit-margin-right="0"
   fit-margin-bottom="0"
   units="px"
   inkscape:window-width="1366"
   inkscape:window-height="705"
   inkscape:window-x="-8"
   inkscape:window-y="-8"
   inkscape:window-maximized="1"
   inkscape:snap-global="true" />
 <metadata
   id="metadata5">
  <rdf:RDF>
   <cc:Work
     rdf:about="">
    <dc:format>image/svg+xml</dc:format>
    <dc:type
      rdf:resource="http://purl.org/dc/dcmitype/StillImage" />
    <dc:title />
   </cc:Work>
  </rdf:RDF>
 </metadata>
 <g
   inkscape:label="Calque 1"
   inkscape:groupmode="layer"
   id="layer1"
   transform="translate(-27.523622,-46.930901)">
  <g
    transform="translate(39.318809,67.986315)"
    id="use2">
   <path
     style="opacity:1;vector-effect:none;fill:#000000;fill-opacity:1;stroke:none;stroke-width:4;stroke-linecap:round;stroke-linejoin:miter;stroke-miterlimit:4;stroke-dasharray:none;stroke-dashoffset:0;stroke-opacity:1;paint-order:markers fill stroke"
     d="M 7.7050781 0.001953125 C 7.4960002 -0.002827959 7.2848958 0.001953125 7.0703125 0.017578125 C 6.2119792 0.080078125 5.3091146 0.30572913 4.3632812 0.6953125 C 3.4174479 1.0848959 2.4278646 1.6388019 1.3945312 2.3554688 L 1.0957031 2.65625 C 0.5623699 3.4229167 0.22382811 4.2265625 0.080078125 5.0703125 C -0.063671859 5.9140625 -0.013411442 6.7979167 0.23242188 7.71875 C 0.47825519 8.6395833 0.91927086 9.5977866 1.5546875 10.595703 C 2.1901041 11.59362 3.0199219 12.630078 4.0449219 13.705078 L 10.894531 20.755859 L 11.695312 21.054688 C 11.961979 21.054688 12.211979 20.955859 12.445312 20.755859 C 15.211979 18.322526 17.994922 15.572526 20.794922 12.505859 C 21.611589 11.630859 22.255729 10.767969 22.726562 9.9179688 C 23.197396 9.0679687 23.496094 8.23125 23.621094 7.40625 C 23.746094 6.58125 23.697396 5.76875 23.476562 4.96875 C 23.255729 4.16875 22.861589 3.3804687 22.294922 2.6054688 L 21.996094 2.3554688 C 20.96276 1.6388019 19.973177 1.0848959 19.027344 0.6953125 C 18.08151 0.30572913 17.178646 0.080078125 16.320312 0.017578125 C 15.461979 -0.044921875 14.647786 0.055729125 13.876953 0.3203125 C 13.10612 0.58489587 12.378647 1.013802 11.695312 1.6054688 C 11.01198 1.013802 10.284505 0.58489587 9.5136719 0.3203125 C 8.9355468 0.12187497 8.332312 0.016296377 7.7050781 0.001953125 z "
     id="path892"
     transform="translate(-11.795187,-21.055414)" />
   <path
     style="fill:url(#linearGradient985);fill-rule:evenodd;stroke:none;fill-opacity:1"
     d="m -4.50026,-20.19994 l -2.349609,0.34961 c -0.8,0.266667 -1.633333,0.667838 -2.5,1.201171 h -0.05078 l -0.04883,0.04883 l -0.75,0.5 c -1.583971,2.406419 -0.813665,5.309261 2.083984,8.6621094 c 4.765621,5.0878846 -0.457314,-0.320411 4.765621,5.0878846 l 0.300781,0.300781 l 2,2.09961 l 0.548828,0.5 v -0.050782 l 0.09961,-0.048828 v -0.050781 c 2.699999,-2.4 5.434504,-5.0821606 8.201171,-8.0488286 c 0.225526,-0.244546 0.340419,-0.4805454 0.535157,-0.7226564 c 2.19424,-2.728002 2.528958,-5.309839 0.814453,-7.728514 l -0.75,-0.5 L 7.700912,-19.04955 l -0.75,-0.34961 L 6.49974,-19.60033 L 6.099349,-19.750721 L 3.300521,-20.19994 l 0.04883,0.05078 l -0.498046,0.05078 c -6.05e-4,-7.63e-4 -0.0013,-0.0012 -0.002,-0.002 c -1.066666,0.133334 -2.031771,0.617837 -2.898437,1.451171 l -0.451172,0.449219 l -0.5,-0.449219 c -0.466667,-0.433334 -0.949218,-0.766666 -1.449218,-1 z m 13.083984,5.595706 c -0.01688,0.130551 -0.04213,0.259584 -0.06641,0.388672 c 0.0248,-0.129481 0.04874,-0.258998 0.06641,-0.388672 z m -12.205077,9.589843 c 6.528645,6.2661077 3.264323,3.1330539 0,0 z"
     id="path851-8"
     inkscape:connector-curvature="0"
     sodipodi:nodetypes="cccccccccccccccccccccccccccccccccccc" />
   <path
     style="fill:#ffffff;fill-rule:evenodd;stroke:none;opacity:0.9"
     inkscape:connector-curvature="0"
     id="path851"
     d="m -9.55,-15.8 q 0,-1.05 1,-2.05 q 1.25,-1.4 2.55,-1 q 1.3,0.35 1.5,0.85 q 0.2,0.45 -4,3.35 q -0.95,-0.05 -1.05,-1.15" />
   <path
     style="fill:#ffffff;fill-rule:evenodd;stroke:none;opacity:0.3;fill-opacity:1"
     d="M 5.7460938 1.15625 L 4.9453125 1.2050781 C 4.1453125 1.4717448 3.3119792 1.8729167 2.4453125 2.40625 L 2.3945312 2.40625 L 2.3457031 2.4550781 C 1.8457031 3.0884115 1.5957031 3.9546875 1.5957031 5.0546875 C 1.6290365 6.8880208 2.5611979 7.8046875 4.3945312 7.8046875 C 6.4945313 7.8046875 7.9111979 6.5721354 8.6445312 4.1054688 C 8.6778646 2.1388021 7.7127604 1.15625 5.7460938 1.15625 z M 5.7949219 2.2050781 C 6.6615885 2.4384115 7.1615885 2.7213542 7.2949219 3.0546875 C 7.4282552 3.3546875 6.0949219 4.4729167 3.2949219 6.40625 C 2.6615885 6.3729167 2.3127604 5.9891927 2.2460938 5.2558594 C 2.2460938 4.5558594 2.5794271 3.8717448 3.2460938 3.2050781 C 4.0794271 2.2717448 4.9282552 1.9384115 5.7949219 2.2050781 z "
     id="path882"
     transform="translate(-11.795187,-21.055414)" />
   <path
     style="fill:#000000;fill-rule:evenodd;stroke:none;opacity:0.2"
     d="M 7.2949219 0.85546875 C 7.8615885 1.3221354 8.4294271 1.9888021 8.9960938 2.8554688 L 11.044922 5.8046875 C 11.444922 5.8046875 11.727865 4.9229167 11.894531 3.15625 L 11.746094 2.40625 L 11.294922 2.8554688 L 10.794922 2.40625 C 10.328255 1.9729167 9.8457031 1.6395833 9.3457031 1.40625 L 7.2949219 0.85546875 z "
     id="path880"
     transform="translate(-11.795187,-21.055414)" />
   <path
     style="opacity:0.2;fill:#ffffff;fill-rule:evenodd;stroke:none;fill-opacity:1"
     d="M 15.095703 0.85546875 L 15.144531 0.90625 L 15.496094 1.1054688 L 15.544922 1.15625 L 15.644531 1.2050781 C 16.611198 1.8384115 17.095703 2.5729167 17.095703 3.40625 C 17.095703 4.23005 16.916843 4.9981868 16.650391 5.7402344 C 16.162361 7.0993491 15.120039 8.2883157 13.75 9.3769531 C 13.386185 9.6660418 13.125309 9.9871125 12.695312 10.255859 C 11.812034 10.821158 11.118103 11.408868 10.5625 12.011719 C 10.069731 12.546392 9.6803289 13.092211 9.4453125 13.65625 L 8.9960938 14.505859 L 8.9960938 14.554688 L 8.7460938 15.005859 L 8.5957031 15.355469 C 8.4957031 15.722135 8.2786458 16.005078 7.9453125 16.205078 L 8.4453125 16.705078 L 8.7460938 17.005859 L 10.746094 19.105469 L 12.095703 16.755859 C 12.770672 15.73252 13.611441 15.05976 14.414062 14.306641 C 14.840203 13.906783 15.182126 13.329544 15.644531 13.005859 C 16.278754 12.576438 16.770187 12.203472 17.273438 11.748047 C 19.026501 10.431334 20.035733 8.7645156 20.28125 7.03125 C 20.387036 6.5430957 20.445312 6.0637784 20.445312 5.5546875 C 20.445312 4.1880208 19.995703 3.0717448 19.095703 2.2050781 L 18.294922 1.4550781 L 17.894531 1.3046875 L 15.095703 0.85546875 z "
     id="path887"
     transform="translate(-11.795187,-21.055414)" />
   <path
     style="fill:#000000;fill-rule:evenodd;stroke:none;opacity:0.2;fill-opacity:1"
     inkscape:connector-curvature="0"
     id="path859"
     d="m 3.35,-20.15 l 0.35,0.2 l 0.05,0.05 l 0.1,0.05 q 1.45,0.95 1.45,2.2 q 0,4.1 -4.4,6.85 q -2.5,1.6 -3.25,3.4 l -0.45,0.85 v 0.05 l -0.25,0.45 L -3.2,-5.7 q -0.15,0.55 -0.65,0.85 l 0.5,0.5 L -3.5,-4.5 l -0.3,-0.3 l -0.1,-0.1 q 0.5,-1.9 0.5,-4.45 q 0,-1.45 1.85,-2.2 q 0.55,-0.2 2,-2 Q 1.5,-14.9 3.1,-15.8 Q 4,-16.3 4,-17.6 q 0,-1.05 -1.15,-2.5 l 0.5,-0.05" />
   <path
     style="opacity:1;vector-effect:none;fill:#000000;fill-opacity:1;stroke:none;stroke-width:4;stroke-linecap:round;stroke-linejoin:miter;stroke-miterlimit:4;stroke-dasharray:none;stroke-dashoffset:0;stroke-opacity:1;paint-order:markers fill stroke"
     d="m 3.456766,-20.510492 c -1.469874,0.01452 -2.89727882,0.635591 -3.990234,1.603516 c -0.32053982,-0.388943 -1.0067136,-0.739588 -0.7247889,0.08787 c 0.1542282,1.522491 1.1484122,2.760185 1.6432959,4.170249 C 0.60962962,-15.5396 0.28117829,-16.439059 0.13315904,-17.311303 c -0.0234768,-0.704641 -0.11133171,-1.857669 0.87756346,-1.830607 c 0.6028035,0.225697 0.1934293,1.217055 0.4584877,1.742993 c 0.1242873,0.772281 0.2768496,1.539617 0.4309148,2.306398 c 0.3737114,-1.33241 0.1801661,-2.72555 0.177474,-4.086915 c 0.251058,-0.769428 1.2341895,-0.454153 1.8418666,-0.51928 c 0.5792294,0.545763 0.6565408,1.709607 0.8091462,2.549139 c 0.086963,0.609726 0.1061288,1.633893 0.1409466,1.995361 c 0.1361396,-1.583056 0.1928213,-3.17187 0.3366526,-4.754333 c -0.1844616,-0.746236 -1.1796485,-0.549351 -1.749445,-0.601941 z m 1.203125,7.697266 c -0.057601,1.986832 1.1811324,3.9579126 0.720767,5.2885491 C 4.3316528,-8.2361848 3.8450387,-9.2384565 2.9465208,-10.197561 c 0.9774304,1.8202811 2.1239178,3.5776951 0.678797,4.7956798 C 3.2070877,-6.1174763 2.8188221,-6.8562706 2.320372,-7.5184943 c 0.2333234,1.218258 0.9119822,2.3354463 0.923503,3.5978463 C 3.7981859,-4.7357113 4.6219245,-5.4209352 5.5937542,-5.6484219 C 6.3801051,-5.9483221 6.952519,-6.8142713 6.7127173,-7.6590113 C 6.4144146,-9.4702636 5.5968404,-10.93383 4.8815714,-12.491722 c -0.063304,-0.113945 -0.1366385,-0.222581 -0.2216804,-0.321504 z m -1.416016,8.892578 c -0.035114,0.3467181 0.011849,0.331678 0,0 z"
     id="path892-6"
     inkscape:connector-curvature="0"
     sodipodi:nodetypes="ccccccccccccccccccccccccccc" />
  </g>
 </g>
</svg>
