<?xml version="1.0" encoding="UTF-8" standalone="no"?>
<svg
  xmlns:dc="http://purl.org/dc/elements/1.1/"
  xmlns:cc="http://creativecommons.org/ns#"
  xmlns:rdf="http://www.w3.org/1999/02/22-rdf-syntax-ns#"
  xmlns:svg="http://www.w3.org/2000/svg"
  xmlns="http://www.w3.org/2000/svg"
  xmlns:xlink="http://www.w3.org/1999/xlink"
  xmlns:sodipodi="http://sodipodi.sourceforge.net/DTD/sodipodi-0.dtd"
  xmlns:inkscape="http://www.inkscape.org/namespaces/inkscape"
  height="54.0px"
  width="23.0px"
  version="1.1"
  id="svg16"
  sodipodi:docname="07.svg"
  inkscape:version="0.92.4 (5da689c313, 2019-01-14)">
 <metadata
   id="metadata20">
  <rdf:RDF>
   <cc:Work
     rdf:about="">
    <dc:format>image/svg+xml</dc:format>
    <dc:type
      rdf:resource="http://purl.org/dc/dcmitype/StillImage" />
    <dc:title></dc:title>
   </cc:Work>
  </rdf:RDF>
 </metadata>
 <sodipodi:namedview
   pagecolor="#ffffff"
   bordercolor="#666666"
   borderopacity="1"
   objecttolerance="10"
   gridtolerance="10"
   guidetolerance="10"
   inkscape:pageopacity="0"
   inkscape:pageshadow="2"
   inkscape:window-width="1366"
   inkscape:window-height="705"
   id="namedview18"
   showgrid="false"
   inkscape:zoom="12.361274"
   inkscape:cx="13.569976"
   inkscape:cy="21.467343"
   inkscape:window-x="-8"
   inkscape:window-y="-8"
   inkscape:window-maximized="1"
   inkscape:current-layer="svg16" />
 <defs
   id="defs14">
  <g
    id="sprite0"
    transform="matrix(1.0, 0.0, 0.0, 1.0, 4.4, 10.8)">
   <use
     height="19.9"
     transform="matrix(1.0, 0.0, 0.0, 1.0, -4.4, -10.8)"
     width="8.85"
     xlink:href="#shape0"
     id="use6" />
  </g>
  <g
    id="shape0"
    transform="matrix(1.0, 0.0, 0.0, 1.0, 4.4, 10.8)">
   <path
     d="M1.6 -0.8 Q1.6 1.1 0.25 1.1 -1.65 1.1 -1.65 -0.55 -1.65 -2.1 0.1 -2.3 L0.3 -2.35 Q1.6 -2.35 1.6 -0.8"
     fill="#ffffff"
     fill-opacity="0.15294118"
     fill-rule="evenodd"
     stroke="none"
     id="path9" />
   <path
     d="M0.25 -10.8 Q0.3 -1.3 4.45 -0.55 L1.5 1.05 0.15 9.1 -1.0 1.3 Q-1.45 0.75 -3.4 -0.1 -5.35 -1.0 -3.5 -1.3 L-1.5 -1.85 Q-0.35 -2.6 0.25 -10.8 M1.6 -0.8 Q1.6 -2.35 0.3 -2.35 L0.1 -2.3 Q-1.65 -2.1 -1.65 -0.55 -1.65 1.1 0.25 1.1 1.6 1.1 1.6 -0.8"
     fill="#ffffff"
     fill-opacity="0.07450981"
     fill-rule="evenodd"
     stroke="none"
     id="path11" />
  </g>
 </defs>
 <g
   id="g938"
   transform="matrix(18.175518,0,0,18.175518,3644.8668,-2518.261)"
   style="opacity:0.6">
  <path
    sodipodi:nodetypes="ccccccccccc"
    inkscape:connector-curvature="0"
    id="path896"
    d="m -200.08482,140.28964 c -0.0626,0.002 -0.11034,0.0617 -0.10665,0.12246 c -0.002,0.0625 0.0381,0.0793 0.0588,0.1176 c 0.0682,0.10803 0.1434,0.21168 0.20597,0.32319 c 0.0807,-0.14352 0.26713,-0.35438 0.263,-0.41755 c 0.0103,-0.0552 -0.0161,-0.12263 -0.0735,-0.13926 c -0.0517,-0.0147 -0.11773,-0.0142 -0.1541,0.0316 c -0.0196,0.0228 -0.0316,0.0518 -0.0349,0.0816 c -0.006,-0.0527 -0.0408,-0.10562 -0.0941,-0.11937 c -0.0215,-3e-5 -0.0433,-0.002 -0.0645,-2.7e-4 z"
    style="opacity:0.5;fill:#ff0000;fill-rule:evenodd;stroke:none;stroke-width:0.01322917;stroke-linecap:butt;stroke-linejoin:miter;stroke-miterlimit:4;stroke-dasharray:none;stroke-opacity:1" />
  <path
    sodipodi:nodetypes="ccccccccccc"
    inkscape:connector-curvature="0"
    id="path896-4"
    d="m -200.00525,140.3498 c -0.0312,0.001 -0.055,0.0307 -0.0531,0.061 c -0.001,0.0311 0.019,0.0395 0.0293,0.0586 c 0.034,0.0538 0.0714,0.10546 0.10262,0.16102 c 0.0402,-0.0715 0.13309,-0.17656 0.13103,-0.20804 c 0.005,-0.0275 -0.008,-0.0611 -0.0366,-0.0694 c -0.0258,-0.007 -0.0587,-0.007 -0.0768,0.0157 c -0.01,0.0114 -0.0157,0.0258 -0.0174,0.0406 c -0.003,-0.0263 -0.0203,-0.0526 -0.0469,-0.0595 c -0.0107,-2e-5 -0.0216,-0.001 -0.0321,-1.4e-4 z"
    style="opacity:0.5;fill:#ff0000;fill-opacity:1;fill-rule:evenodd;stroke:none;stroke-width:0.00659114;stroke-linecap:butt;stroke-linejoin:miter;stroke-miterlimit:4;stroke-dasharray:none;stroke-opacity:1" />
 </g>
</svg>
