<?xml version="1.0" encoding="UTF-8" standalone="no"?>
<!-- Created with Inkscape (http://www.inkscape.org/) -->

<svg
  xmlns:dc="http://purl.org/dc/elements/1.1/"
  xmlns:cc="http://creativecommons.org/ns#"
  xmlns:rdf="http://www.w3.org/1999/02/22-rdf-syntax-ns#"
  xmlns:svg="http://www.w3.org/2000/svg"
  xmlns="http://www.w3.org/2000/svg"
  xmlns:sodipodi="http://sodipodi.sourceforge.net/DTD/sodipodi-0.dtd"
  xmlns:inkscape="http://www.inkscape.org/namespaces/inkscape"
  width="120"
  height="120"
  viewBox="0 0 120 120"
  version="1.1"
  id="svg8"
  inkscape:version="0.92.4 (5da689c313, 2019-01-14)"
  sodipodi:docname="03.svg">
 <defs
   id="defs2" />
 <sodipodi:namedview
   id="base"
   pagecolor="#ffffff"
   bordercolor="#666666"
   borderopacity="1.0"
   inkscape:pageopacity="0.0"
   inkscape:pageshadow="2"
   inkscape:zoom="0.9899495"
   inkscape:cx="155.32654"
   inkscape:cy="-100.99252"
   inkscape:document-units="px"
   inkscape:current-layer="layer1"
   showgrid="false"
   units="px"
   inkscape:window-width="1366"
   inkscape:window-height="705"
   inkscape:window-x="-8"
   inkscape:window-y="-8"
   inkscape:window-maximized="1"
   inkscape:snap-global="false" />
 <metadata
   id="metadata5">
  <rdf:RDF>
   <cc:Work
     rdf:about="">
    <dc:format>image/svg+xml</dc:format>
    <dc:type
      rdf:resource="http://purl.org/dc/dcmitype/StillImage" />
    <dc:title></dc:title>
   </cc:Work>
  </rdf:RDF>
 </metadata>
 <g
   inkscape:label="Calque 1"
   inkscape:groupmode="layer"
   id="layer1"
   transform="translate(0,-221.125)">
  <path
    style="opacity:1;vector-effect:none;fill:#ff0000;fill-opacity:1;stroke:none;stroke-width:4.17399359;stroke-linecap:round;stroke-linejoin:miter;stroke-miterlimit:4;stroke-dasharray:none;stroke-dashoffset:0;stroke-opacity:1;paint-order:markers fill stroke"
    d="M 53.349609 2.9140625 C 50.432041 2.973325 47.812293 3.6103381 46.814453 6.0957031 C 47.977713 13.428933 44.645604 22.690834 51.427734 28.121094 C 52.214531 28.934627 52.985024 29.794457 53.740234 30.673828 A 30 30 0 0 0 30.058594 58.304688 C 27.241594 57.401118 24.5746 56.109356 22.205078 54.083984 C 15.890057 50.465064 5.0571706 52.774526 3.4003906 60.597656 C 3.7597006 64.982306 1.3320044 73.463304 6.3027344 75.458984 C 13.635964 74.295724 22.899818 77.62588 28.330078 70.84375 C 29.237119 69.966519 30.200746 69.110639 31.189453 68.275391 A 30 30 0 0 0 55.410156 89.626953 C 54.501535 92.654121 53.168928 95.518544 51.007812 98.046875 C 47.388892 104.3619 49.700308 115.19478 57.523438 116.85156 C 61.908082 116.49225 70.387132 118.91995 72.382812 113.94922 C 71.219553 106.61599 74.551661 97.352135 67.769531 91.921875 C 67.010847 91.13741 66.267055 90.31252 65.537109 89.466797 A 30 30 0 0 0 89.376953 65.929688 C 91.916782 66.819839 94.320241 68.061442 96.478516 69.90625 C 102.79354 73.52517 113.62447 71.215708 115.28125 63.392578 C 114.92194 59.007938 117.34964 50.52693 112.37891 48.53125 C 105.04568 49.69451 95.783774 46.362401 90.353516 53.144531 C 90.045792 53.442142 89.717645 53.73256 89.400391 54.027344 A 30 30 0 0 0 63.830078 30.28125 C 64.737851 27.304288 66.060684 24.486582 68.189453 21.996094 C 71.808373 15.681074 69.498911 4.8501394 61.675781 3.1933594 C 59.483456 3.3730144 56.267178 2.8548 53.349609 2.9140625 z M 62.693359 35.154297 A 25 25 0 0 1 84.882812 57.775391 C 80.875688 60.6503 76.31572 62.711813 71.292969 62.511719 C 75.600463 63.387573 80.175184 63.73604 84.552734 64.630859 A 25 25 0 0 1 62.089844 84.898438 C 59.781124 81.278272 58.229598 77.248568 58.404297 72.863281 C 57.620581 76.717631 57.241244 80.778988 56.533203 84.728516 A 25 25 0 0 1 35.541016 65.044922 C 39.112541 62.802421 43.079346 61.306843 47.388672 61.478516 C 43.371737 60.661741 39.128518 60.291473 35.023438 59.521484 A 25 25 0 0 1 57.138672 35.195312 C 59.43016 38.802896 60.968835 42.816083 60.794922 47.181641 C 61.589266 43.27502 61.96599 39.154063 62.693359 35.154297 z "
    transform="translate(0,221.125)"
    id="path10" />
 </g>
</svg>
