<?xml version="1.0" encoding="UTF-8" standalone="no"?>
<!-- Created with Inkscape (http://www.inkscape.org/) -->

<svg
  xmlns:dc="http://purl.org/dc/elements/1.1/"
  xmlns:cc="http://creativecommons.org/ns#"
  xmlns:rdf="http://www.w3.org/1999/02/22-rdf-syntax-ns#"
  xmlns:svg="http://www.w3.org/2000/svg"
  xmlns="http://www.w3.org/2000/svg"
  xmlns:sodipodi="http://sodipodi.sourceforge.net/DTD/sodipodi-0.dtd"
  xmlns:inkscape="http://www.inkscape.org/namespaces/inkscape"
  width="105"
  height="105"
  viewBox="0 0 105 105"
  version="1.1"
  id="svg8"
  inkscape:version="0.92.4 (5da689c313, 2019-01-14)"
  sodipodi:docname="02.svg">
 <defs
   id="defs2" />
 <sodipodi:namedview
   id="base"
   pagecolor="#ffffff"
   bordercolor="#666666"
   borderopacity="1.0"
   inkscape:pageopacity="0.0"
   inkscape:pageshadow="2"
   inkscape:zoom="2.8"
   inkscape:cx="32.211215"
   inkscape:cy="69.211229"
   inkscape:document-units="px"
   inkscape:current-layer="layer1"
   showgrid="false"
   units="px"
   inkscape:window-width="1366"
   inkscape:window-height="705"
   inkscape:window-x="-8"
   inkscape:window-y="-8"
   inkscape:window-maximized="1" />
 <metadata
   id="metadata5">
  <rdf:RDF>
   <cc:Work
     rdf:about="">
    <dc:format>image/svg+xml</dc:format>
    <dc:type
      rdf:resource="http://purl.org/dc/dcmitype/StillImage" />
    <dc:title />
   </cc:Work>
  </rdf:RDF>
 </metadata>
 <g
   inkscape:label="Calque 1"
   inkscape:groupmode="layer"
   id="layer1"
   transform="translate(0,-1017.5197)">
  <path
    style="fill:#ffffff;fill-rule:evenodd;stroke:none;stroke-width:0.49996281;opacity:0.9"
    d="m 27.437661,1020.02 c -6.882094,-0.017 -12.759667,2.4304 -17.630328,7.3424 c -4.7671507,4.7749 -7.1943094,10.5158 -7.2956443,17.2144 H 2.5 c 0.00342,0.026 0.00632,0.058 0.00974,0.084 c -0.00172,0.1408 -0.00813,0.2793 -0.00779,0.4209 c -0.00577,2.3933 0.2905932,4.6637 0.874698,6.8156 c 3.008773,25.9742 8.330393,68.3634 48.464897,68.1214 c 36.200057,-0.2182 47.076214,-50.3695 49.826615,-68.4679 c 0.49737,-1.9383 0.76119,-3.9733 0.79094,-6.1049 c 0.003,-0.029 0.0409,-0.3623 0.0409,-0.3623 h -0.0331 c -0.0231,-6.905 -2.46655,-12.8033 -7.330713,-17.6921 c -4.870663,-4.9119 -10.737586,-7.3591 -17.603056,-7.3423 c -6.882094,-0.017 -12.759668,2.4304 -17.630328,7.3423 c -4.820698,4.8287 -7.250051,10.644 -7.29954,17.4396 h -0.237668 c -0.07534,-6.8074 -2.514067,-12.6318 -7.324866,-17.4669 c -4.870661,-4.912 -10.737586,-7.3591 -17.603056,-7.3424 z"
    id="path855-4"
    inkscape:connector-curvature="0" />
 </g>
</svg>
