<?xml version="1.0" encoding="UTF-8" standalone="no"?>
<!-- Created with Inkscape (http://www.inkscape.org/) -->

<svg
  xmlns:dc="http://purl.org/dc/elements/1.1/"
  xmlns:cc="http://creativecommons.org/ns#"
  xmlns:rdf="http://www.w3.org/1999/02/22-rdf-syntax-ns#"
  xmlns:svg="http://www.w3.org/2000/svg"
  xmlns="http://www.w3.org/2000/svg"
  xmlns:sodipodi="http://sodipodi.sourceforge.net/DTD/sodipodi-0.dtd"
  xmlns:inkscape="http://www.inkscape.org/namespaces/inkscape"
  width="43.707115"
  height="19.695431"
  viewBox="0 0 43.707115 19.695431"
  version="1.1"
  id="svg8"
  inkscape:version="0.92.4 (5da689c313, 2019-01-14)"
  sodipodi:docname="03.svg">
 <defs
   id="defs2" />
 <sodipodi:namedview
   id="base"
   pagecolor="#ffffff"
   bordercolor="#666666"
   borderopacity="1.0"
   inkscape:pageopacity="0.0"
   inkscape:pageshadow="2"
   inkscape:zoom="16.603125"
   inkscape:cx="17.772346"
   inkscape:cy="5.3014238"
   inkscape:document-units="px"
   inkscape:current-layer="layer1"
   showgrid="false"
   fit-margin-top="0"
   fit-margin-left="0"
   fit-margin-right="0"
   fit-margin-bottom="0"
   inkscape:snap-global="true"
   inkscape:window-width="1366"
   inkscape:window-height="705"
   inkscape:window-x="-8"
   inkscape:window-y="-8"
   inkscape:window-maximized="1"
   units="px" />
 <metadata
   id="metadata5">
  <rdf:RDF>
   <cc:Work
     rdf:about="">
    <dc:format>image/svg+xml</dc:format>
    <dc:type
      rdf:resource="http://purl.org/dc/dcmitype/StillImage" />
    <dc:title></dc:title>
   </cc:Work>
  </rdf:RDF>
 </metadata>
 <g
   inkscape:label="Calque 1"
   inkscape:groupmode="layer"
   id="layer1"
   transform="translate(-24.441093,-19.357119)">
  <g
    id="g33"
    transform="matrix(3.7795698,0,0,3.7795698,-67.935661,-53.804277)">
   <path
     id="path124-7"
     transform="matrix(0.26458333,0,0,0.26458333,24.441093,19.357119)"
     d="m 14.972656,1.6132812 c -1.190125,-0.025321 -2.392588,0.148338 -3.539062,0.4414063 C 9.4005783,2.5343851 7.5059762,3.5003503 5.890625,4.8203125 C 4.3633633,5.8706697 3.1166391,7.2864264 1.5019531,8.2128906 C 1.0069522,8.5724371 0.12787692,8.7164477 0.08203125,9.4492188 C -0.02593851,10.107234 0.55293138,10.545924 1.1152344,10.716797 c 0.4611061,0.280743 0.9935744,-0.01614 1.4648437,0.138672 c 0.4977562,0.305881 1.0923812,0.312727 1.6171875,0.517578 c 0.55584,0.452863 1.2765336,0.405078 1.9433594,0.472656 c 0.7910135,0.180624 1.6497773,0.357362 2.4316406,0.107422 c 0.9173594,0.327534 1.8404794,-0.324818 2.7500004,-0.0293 c -0.100033,0.605249 0.36872,1.03779 0.677734,1.490237 c 0.246561,0.612424 0.760394,1.301825 1.511719,1.152344 c 1.312229,-0.312809 2.130678,-1.529019 3.314453,-2.105468 c 1.104707,-0.764667 2.511402,-0.528755 3.71875,-0.19336 c 0.49686,0.225615 1.29977,0.08188 1.28125,-0.59375 C 21.657953,10.261139 20.680553,9.0850144 19.59375,8.234375 C 19.127795,7.8571215 19.66484,7.3475686 19.980469,7.0839844 c 0.73864,-0.7355414 0.708902,-1.8750327 0.341797,-2.78125 C 20.111308,3.5271451 19.608204,2.83616 18.837891,2.546875 C 18.706499,2.4823207 18.57224,2.4224186 18.4375,2.3652344 C 17.33922,1.8639462 16.162782,1.6386027 14.972656,1.6132812 Z m 6.853516,10.0605468 c -0.01852,0.675625 0.782436,0.819365 1.279297,0.59375 c 1.207347,-0.335395 2.614043,-0.571307 3.71875,0.19336 c 1.183774,0.576449 2.002224,1.792659 3.314453,2.105468 c 0.751325,0.149481 1.26711,-0.53992 1.513672,-1.152344 c 0.309014,-0.452447 0.775814,-0.884988 0.675781,-1.490234 c 0.909521,-0.295521 1.834594,0.356831 2.751953,0.0293 c 0.781863,0.24994 1.640627,0.0732 2.431641,-0.107422 c 0.666826,-0.06758 1.385566,-0.01979 1.941406,-0.472656 c 0.524806,-0.204851 1.121384,-0.211697 1.619141,-0.517578 c 0.471269,-0.15481 1.001784,0.142071 1.46289,-0.138672 c 0.562303,-0.170873 1.141173,-0.609563 1.033203,-1.2675782 C 43.522514,8.7164477 42.643438,8.5724371 42.148438,8.2128906 C 40.533755,7.2864226 39.287027,5.8706697 37.759766,4.8203125 C 36.144414,3.5003503 34.251765,2.5343851 32.21875,2.0546875 C 29.925801,1.4685508 27.40945,1.362658 25.212891,2.3652344 C 25.07815,2.4224186 24.943891,2.4823207 24.8125,2.546875 C 24.042187,2.83616 23.539083,3.5271451 23.328125,4.3027344 c -0.367106,0.9062173 -0.396844,2.0457086 0.341797,2.78125 c 0.315628,0.2635842 0.852674,0.7731371 0.386719,1.1503906 c -1.086804,0.8506394 -2.06225,2.026764 -2.230469,3.439453 z"
     style="opacity:1;fill:#f9f9f9;fill-opacity:1;fill-rule:nonzero;stroke:none;stroke-width:0.99999994;stroke-linecap:round;stroke-linejoin:round;stroke-miterlimit:4;stroke-dasharray:none;stroke-dashoffset:0;stroke-opacity:1;paint-order:fill markers stroke"
     inkscape:connector-curvature="0" />
   <path
     id="path37-2"
     transform="matrix(0.26458333,0,0,0.26458333,24.441093,19.357119)"
     d="m 15.169922,2.3183594 c -0.756507,-0.04928 -1.535739,0.015012 -2.533203,0.1835937 C 10.867552,2.8009516 9.4699774,3.2620444 8.1035156,3.9980469 C 7.3812706,4.3870623 4.3073755,6.6650446 3.8886719,7.1210938 C 3.3020249,7.7600682 1.863792,8.8136052 1.1328125,9.140625 C 0.68514258,9.3409022 0.31087637,9.5713145 0.30078125,9.6523438 c -0.0102047,0.081033 0.17746696,0.2591485 0.41601563,0.3945312 c 0.33199372,0.188372 0.58615632,0.221848 1.08398432,0.146484 c 0.572247,-0.08663 0.6826414,-0.06383 0.9238282,0.185547 c 0.220233,0.227717 0.3539282,0.276381 0.6835937,0.25 c 0.2809323,-0.0223 0.5620678,0.05997 0.8886719,0.261719 c 0.372926,0.2304 0.6354967,0.291189 1.203125,0.275391 c 0.3993676,-0.01096 0.9101965,0.06683 1.1367188,0.173828 c 0.2708787,0.127899 0.6283659,0.15703 1.0429687,0.08594 c 0.3467339,-0.05949 0.8090156,-0.06317 1.0273437,-0.0098 c 0.2183434,0.05348 0.721112,0.0028 1.1171876,-0.111328 c 0.4813682,-0.138747 0.8282822,-0.155954 1.0468752,-0.05274 c 0.179867,0.08493 0.478975,0.129404 0.664062,0.09766 c 0.322129,-0.05526 0.330166,-0.04538 0.195313,0.240235 c -0.221027,0.468098 -0.149645,0.832213 0.195312,0.996094 c 0.22337,0.106204 0.317948,0.265236 0.341797,0.578124 c 0.02797,0.366841 0.102384,0.464251 0.488281,0.646485 c 0.555727,0.262412 0.923585,0.09856 2.261719,-1.017578 c 1.589367,-1.325696 3.247948,-1.792038 4.716797,-1.324219 c 1.579279,0.502987 1.608359,0.486372 1.078125,-0.636719 C 20.509571,10.190388 19.942957,9.5477356 19.193359,8.9941406 C 18.453082,8.447432 18.386225,7.3115606 19.0625,6.7949219 C 19.252686,6.6496368 19.518585,6.2952116 19.654297,6.0078125 C 19.873736,5.5431498 19.872801,5.3951443 19.640625,4.671875 C 19.292527,3.5890063 18.931279,3.2689066 17.560547,2.8242188 C 16.659725,2.5319781 15.926428,2.3676397 15.169922,2.3183594 Z m 13.310547,0 c -0.756507,0.049279 -1.489803,0.2136187 -2.390625,0.5058594 c -1.370733,0.4446878 -1.73022,0.7647044 -2.078125,1.8476562 c -0.232177,0.7232693 -0.235065,0.8712748 -0.01563,1.3359375 c 0.135711,0.2873991 0.403564,0.6418243 0.59375,0.7871094 c 0.676274,0.5166387 0.607464,1.6525101 -0.132813,2.1992187 c -0.749597,0.553595 -1.316211,1.1962474 -1.61914,1.8378904 c -0.530234,1.123091 -0.499202,1.139706 1.080078,0.636719 c 1.468849,-0.467819 3.12743,-0.0015 4.716797,1.324219 c 1.338134,1.116136 1.705992,1.27999 2.261718,1.017578 c 0.385898,-0.182234 0.45836,-0.279644 0.486328,-0.646485 c 0.02385,-0.312888 0.118427,-0.47192 0.341797,-0.578124 c 0.344958,-0.163881 0.41634,-0.527996 0.195313,-0.996094 C 31.785063,11.304225 31.7931,11.294353 32.115229,11.349609 c 0.185088,0.03175 0.484195,-0.01273 0.664063,-0.09766 c 0.218593,-0.103219 0.565507,-0.08601 1.046875,0.05274 c 0.396075,0.114103 0.898844,0.164808 1.117187,0.111328 c 0.218329,-0.05341 0.68061,-0.04973 1.027344,0.0098 c 0.414603,0.07109 0.77209,0.04196 1.042969,-0.08594 c 0.226522,-0.106999 0.739304,-0.184789 1.138672,-0.173828 c 0.567628,0.0158 0.830199,-0.04499 1.203125,-0.275391 c 0.326604,-0.201751 0.605786,-0.284018 0.886719,-0.261719 c 0.329665,0.02638 0.46336,-0.02228 0.683593,-0.25 c 0.241187,-0.249373 0.353535,-0.272173 0.925781,-0.185547 c 0.497829,0.07536 0.751991,0.04189 1.083985,-0.146484 C 43.174096,9.9114923 43.359814,9.7333768 43.349609,9.6523438 C 43.339514,9.5713145 42.965248,9.3409022 42.517578,9.140625 C 41.786599,8.8136052 40.348366,7.7600682 39.761719,7.1210938 C 39.343015,6.6650446 36.26912,4.3870623 35.546875,3.9980469 C 34.180413,3.2620444 32.784792,2.8009516 31.015625,2.5019531 C 30.01816,2.3333654 29.236975,2.2690805 28.480469,2.3183594 Z M 14.216797,2.5917969 c 0.674669,-0.01601 1.326878,0.047424 1.988281,0.1855469 c 1.976315,0.4127206 3.080035,1.1863084 3.199219,2.2421874 c 0.06652,0.5894136 -0.190381,1.2139792 -0.583985,1.4199219 C 18.355147,6.6828547 18.086149,7.4486175 18.21875,8.1542969 c 0.141165,0.7513436 0.319287,1.0135627 0.861328,1.2695312 c 0.524255,0.2475591 1.04043,0.8214109 1.263672,1.4042969 l 0.175781,0.457031 l -0.298828,-0.05078 c -0.164069,-0.02759 -0.453472,-0.115628 -0.644531,-0.197266 c -0.191055,-0.08164 -0.727537,-0.138039 -1.191406,-0.125 c -0.786928,0.0223 -0.846789,0.0059 -0.894532,-0.242187 c -0.02797,-0.146154 -0.0039,-0.36806 0.05469,-0.492188 c 0.10114,-0.2141477 0.08741,-0.217428 -0.300781,-0.0918 c -0.357997,0.11588 -0.439685,0.09762 -0.644532,-0.1445318 C 16.415584,9.7238566 16.406606,9.6092938 16.554688,9.40625 C 16.781724,9.0949303 16.70366,8.9228418 16.400391,9.0644531 c -0.288983,0.134967 -0.658628,-0.046157 -0.638672,-0.3125 C 15.770412,8.6363752 15.899877,8.438483 16.048828,8.3125 C 16.388041,8.0255583 16.346865,7.8771416 15.960938,7.9941406 C 15.694821,8.0748335 15.65103,8.0556203 15.5,7.7910156 C 15.291559,7.4257621 15.446392,7.0696751 15.822266,7.0507812 c 0.427521,-0.021543 0.457037,-0.2396851 0.04492,-0.3339843 C 15.173183,6.5579811 15.27125,5.6307597 15.976562,5.6835938 c 0.293821,0.021921 0.358242,-0.2012585 0.09375,-0.3261719 C 15.71258,5.1885148 15.754143,4.7376846 16.138672,4.6210938 c 0.175786,-0.053291 0.342672,-0.1468612 0.371094,-0.2070313 C 16.577306,4.2710452 15.083723,3.7486661 14.539062,3.7246094 c -0.797873,-0.03515 -2.533209,0.4820683 -3.662109,1.0917968 C 9.7421008,5.4293474 8.907424,5.7048974 8.2050781,5.6953125 c -0.2714834,-0.0037 -0.3484489,0.038556 -0.2753906,0.15625 c 0.081978,0.1320189 0.066768,0.1688169 -0.087891,0.1894531 C 7.7334378,6.0553778 7.6426771,6.1667714 7.6328125,6.2988281 C 7.6203401,6.4672439 7.3702056,6.6138202 6.7246094,6.8320312 C 6.2346995,6.9976124 5.8283998,7.1743795 5.8222656,7.2246094 c -0.00605,0.05023 -0.1433394,0.074417 -0.3046875,0.054688 L 5.2246094,7.2441406 l 0.2304687,0.1875 c 0.2212914,0.181304 0.195359,0.2059829 -0.6855469,0.6328125 C 4.2660264,8.3084216 3.8601047,8.5583309 3.8671875,8.6210938 c 0.034016,0.300548 -1.8929493,1.191227 -2.6035156,1.203125 C 0.76932857,9.8325337 0.61135788,9.7948386 0.66210938,9.6875 C 0.6794952,9.6504606 0.97838353,9.4958504 1.3261719,9.3417969 C 1.673964,9.1877055 2.5637792,8.563842 3.3046875,7.9570312 C 7.1673306,4.7934873 8.2165455,4.1205194 10.5,3.3417969 c 1.404461,-0.4789607 2.592348,-0.7233165 3.716797,-0.75 z m 15.216797,0 c 1.124449,0.026684 2.314289,0.2710393 3.71875,0.75 c 2.283454,0.7787225 3.330716,1.4516866 7.193359,4.6152343 c 0.740908,0.6068108 1.632677,1.2306743 1.980469,1.3847657 C 42.67396,9.4958504 42.972849,9.6504606 42.990234,9.6875 c 0.05075,0.1073386 -0.109172,0.1450337 -0.603515,0.1367188 c -0.710567,-0.011898 -2.635578,-0.902577 -2.601563,-1.203125 c 0.0071,-0.062763 -0.400792,-0.3126722 -0.904297,-0.5566407 C 37.999954,7.6376235 37.974021,7.6129446 38.195312,7.4316406 l 0.230469,-0.1875 l -0.292969,0.035156 c -0.161348,0.019729 -0.29864,-0.00446 -0.304687,-0.054688 c -0.0061,-0.05023 -0.412434,-0.226997 -0.902344,-0.3925782 C 36.280185,6.6138202 36.030051,6.4672439 36.017578,6.2988281 c -0.0099,-0.1320567 -0.09867,-0.2434503 -0.207031,-0.2578125 c -0.154658,-0.020636 -0.171822,-0.057434 -0.08984,-0.1894531 c 0.07306,-0.1176945 -0.0039,-0.1599539 -0.275391,-0.15625 C 34.742967,5.7048974 33.90829,5.4293474 32.773438,4.8164062 c -1.1289,-0.6097285 -2.864236,-1.1269464 -3.66211,-1.0917968 c -0.54466,0.024057 -2.038243,0.5464358 -1.970703,0.6894531 c 0.02842,0.06017 0.195308,0.1537399 0.371094,0.2070313 c 0.384529,0.1165908 0.428045,0.567421 0.07031,0.7363281 c -0.264529,0.1249134 -0.202023,0.3480931 0.0918,0.3261719 c 0.705313,-0.052834 0.805333,0.8743873 0.111328,1.0332031 c -0.412116,0.094299 -0.384552,0.312441 0.04297,0.3339843 c 0.375874,0.018894 0.53266,0.3749809 0.324219,0.7402344 c -0.15103,0.2646047 -0.196774,0.2838179 -0.462891,0.203125 c -0.385927,-0.116999 -0.42515,0.031418 -0.08594,0.3183594 c 0.148989,0.125983 0.276463,0.3238752 0.285156,0.4394531 c 0.01996,0.2663433 -0.349689,0.447467 -0.638672,0.3125 C 26.946731,8.9228418 26.868667,9.0949303 27.095703,9.40625 c 0.148082,0.2030438 0.139103,0.3176066 -0.04492,0.5351562 C 26.845935,10.183561 26.7662,10.201818 26.408203,10.085938 c -0.388195,-0.125632 -0.403874,-0.1223517 -0.302734,0.0918 c 0.05862,0.124128 0.08266,0.346034 0.05469,0.492188 c -0.04774,0.248088 -0.107603,0.264487 -0.894531,0.242187 c -0.463869,-0.01304 -0.998398,0.04336 -1.189453,0.125 c -0.191059,0.08164 -0.482415,0.169675 -0.646484,0.197266 l -0.298829,0.05078 l 0.175782,-0.457031 c 0.223241,-0.582886 0.739417,-1.1567378 1.263671,-1.4042969 c 0.542076,-0.2559715 0.72016,-0.5181906 0.861326,-1.2695342 C 25.564242,7.4486175 25.297197,6.6828547 24.832031,6.4394531 C 24.438427,6.2335104 24.179574,5.6089448 24.246094,5.0195312 c 0.119183,-1.055879 1.224857,-1.8294668 3.201172,-2.2421874 c 0.661403,-0.1381224 1.311658,-0.201557 1.986328,-0.1855469 z M 15.691406,3.2753906 c -0.07134,-0.012703 -0.101346,0.00507 -0.06445,0.064453 c 0.06523,0.1049952 0.401362,0.319319 0.748047,0.4765624 c 0.486648,0.2207245 0.575074,0.2345942 0.388672,0.060547 C 16.490866,3.6222319 15.905413,3.3134996 15.691406,3.2753906 Z m 12.269532,0 c -0.214007,0.038109 -0.801413,0.3468413 -1.074219,0.6015625 c -0.186403,0.1740473 -0.09798,0.1601776 0.388672,-0.060547 c 0.346684,-0.1572434 0.684765,-0.3715672 0.75,-0.4765624 c 0.03689,-0.059386 0.0069,-0.077156 -0.06445,-0.064453 z m -10.734376,0.578125 c -0.02597,0.010182 -0.04741,0.030763 -0.06055,0.058594 c -0.05737,0.121474 0.127859,0.8836758 0.1875,0.7714844 c 0.08258,-0.1553764 0.04832,-0.7840822 -0.04492,-0.828125 c -0.02627,-0.012473 -0.05606,-0.012136 -0.08203,-0.00195 z m 9.197266,0 c -0.02597,-0.010182 -0.05576,-0.010519 -0.08203,0.00195 c -0.09324,0.044043 -0.125552,0.6727486 -0.04297,0.828125 c 0.05964,0.1121914 0.244873,-0.6500104 0.1875,-0.7714844 c -0.01313,-0.027831 -0.03653,-0.048411 -0.0625,-0.058594 z M 14.464844,4.1074219 c 1.052953,0.00567 1.114102,0.060307 0.945312,0.8691406 C 15.330106,5.3601316 15.236095,5.6801337 15.201172,5.6875 c -1.390243,0.293178 -2.088971,0.4879134 -2.462891,0.6816406 c -0.254853,0.1320567 -0.473565,0.2583839 -0.484375,0.28125 c -0.01096,0.023055 0.419493,-0.1093593 0.955078,-0.2929687 c 0.9648,-0.3307465 1.908293,-0.4648172 1.810547,-0.2578125 c -0.02797,0.059074 -0.273721,0.1312684 -0.546875,0.1621094 C 13.486245,6.3730636 12.474525,6.9057586 11.5,7.8261719 c -0.390535,0.3688441 -0.518417,0.3812 -0.634766,0.056641 C 10.562683,7.0388213 12.483812,5.780478 14.755859,5.3359375 l 0.457032,-0.087891 l -0.433594,-0.078125 c -0.237921,-0.042822 -0.575046,-0.057102 -0.75,-0.03125 c -0.786856,0.1156535 -2.086843,0.6697416 -2.710938,1.15625 c -0.691343,0.5389341 -1.032018,0.584275 -0.970703,0.1289062 c 0.137499,-1.0210469 2.455715,-2.3254544 4.117188,-2.3164058 z m 14.720703,0 c 1.661473,-0.00905 3.981679,1.2953593 4.119141,2.3164062 c 0.06132,0.4553688 -0.27936,0.4100279 -0.970704,-0.1289062 C 31.70989,5.8084135 30.40795,5.2543254 29.621094,5.1386719 c -0.174955,-0.025852 -0.512117,-0.011572 -0.75,0.03125 L 28.4375,5.2480469 l 0.457031,0.087891 c 2.272048,0.4445405 4.193176,1.7028838 3.890625,2.546875 C 32.668807,8.2073719 32.542879,8.195016 32.152344,7.8261719 C 31.177819,6.9057586 30.166099,6.3730636 29.179688,6.2617188 C 28.906533,6.2308778 28.660781,6.1586834 28.632812,6.0996094 c -0.09775,-0.2070047 0.845747,-0.072934 1.810547,0.2578125 c 0.535586,0.1836094 0.964086,0.3160238 0.953125,0.2929687 c -0.01081,-0.022866 -0.227568,-0.1491933 -0.482422,-0.28125 C 30.540142,6.1754134 29.841414,5.980678 28.451172,5.6875 C 28.416249,5.6801337 28.320285,5.3601316 28.240234,4.9765625 C 28.071444,4.1677285 28.132593,4.1130912 29.185547,4.1074219 Z M 14.931641,4.4101562 c -0.651841,0.00787 -1.950062,0.2686917 -2.50586,0.5566407 c -0.766461,0.3971036 -0.55618,0.4005281 0.480469,0.00781 C 13.419514,4.7802258 14.179427,4.6130876 14.59375,4.60156 c 0.414319,-0.011717 0.739384,-0.058792 0.722656,-0.1054687 c -0.02226,-0.062088 -0.167485,-0.088561 -0.384765,-0.085938 z m 13.789062,0 c -0.21728,-0.00262 -0.364457,0.023849 -0.386719,0.085938 c -0.01673,0.046677 0.31029,0.093752 0.72461,0.1054687 c 0.414323,0.011528 1.172283,0.1786658 1.685547,0.3730469 c 1.036648,0.3927156 1.24693,0.3892911 0.480468,-0.00781 C 30.668812,4.6788479 29.372544,4.4180281 28.720703,4.4101562 Z M 17.826172,4.8242188 c -0.220158,-0.027213 -0.587841,0.5294844 -0.40625,0.6152343 c 0.07196,0.034016 0.139555,-0.014155 0.148437,-0.1054687 c 0.0091,-0.091465 0.109259,-0.2378443 0.22461,-0.3261719 c 0.158513,-0.1213984 0.167149,-0.1669638 0.0332,-0.1835937 z m 7.998047,0 c -0.133985,0.01663 -0.125311,0.062195 0.0332,0.1835937 c 0.115351,0.088328 0.217492,0.2347073 0.226562,0.3261719 c 0.0089,0.091313 0.07452,0.1394845 0.146485,0.1054687 c 0.181591,-0.08575 -0.186093,-0.6424469 -0.40625,-0.6152343 z m -8.425781,0.8300781 c -0.25788,0.035988 -0.585096,0.2248805 -0.597657,0.3925781 c -0.0083,0.1125543 0.03168,0.22842 0.08984,0.2558594 c 0.05824,0.02759 -0.0015,0.1290885 -0.132813,0.2265625 c -0.130998,0.097172 -0.244431,0.2591041 -0.251953,0.359375 c -0.02003,0.2655496 0.297742,0.6582636 0.451172,0.5585937 c 0.06841,-0.044447 0.04287,-0.1189983 -0.05664,-0.1660156 c -0.24567,-0.1159937 -0.203839,-0.429582 0.08594,-0.6445312 c 0.16543,-0.1227213 0.201471,-0.1945766 0.117188,-0.234375 C 16.848322,6.2818524 17.020759,5.9380265 17.384766,5.84375 c 0.205606,-0.053254 0.311628,-0.128964 0.234375,-0.1679688 c -0.05632,-0.02845 -0.134744,-0.03348 -0.220703,-0.021484 z m 8.853515,0 c -0.08596,-0.011996 -0.164379,-0.00697 -0.220703,0.021484 c -0.07725,0.039005 0.02877,0.1147153 0.234375,0.1679688 c 0.364006,0.094277 0.538397,0.4381024 0.283203,0.5585938 c -0.08428,0.039798 -0.05019,0.1116537 0.115234,0.234375 C 26.953839,6.851668 26.995669,7.1652563 26.75,7.28125 c -0.09955,0.047017 -0.12505,0.1215684 -0.05664,0.1660156 c 0.15343,0.09967 0.471204,-0.2930441 0.451172,-0.5585937 C 27.13701,6.788401 27.023577,6.6264685 26.892578,6.5292969 C 26.761217,6.4318229 26.701523,6.3303249 26.759766,6.3027344 c 0.05817,-0.027439 0.09816,-0.1433051 0.08984,-0.2558594 C 26.837049,5.8791774 26.509832,5.6902845 26.251953,5.6542969 Z M 10.019531,5.71875 c 0.109772,-0.010259 0.163295,0.015068 0.128907,0.087891 C 10.097376,5.9148107 9.6084603,6.1817979 9.0625,6.4003906 C 8.5165397,6.6189985 7.8034189,6.9535479 7.4785156,7.1445312 C 6.6370416,7.639158 4.6318129,9.1397945 4.6699219,9.2460938 c 0.017764,0.049134 0.532931,-0.2801901 1.1464843,-0.7324219 C 7.6901335,7.1325305 10.047839,5.9990947 9.9140625,6.5429688 C 9.8872279,6.6519325 9.5892202,6.8754496 9.25,7.0410156 C 8.9107874,7.2065967 8.278493,7.5818939 7.8457031,7.875 C 6.0982726,9.0584381 4.2113584,10.139008 3.8183594,10.179688 c -0.4712391,0.04879 -0.6009119,0.008 -0.7519532,-0.2304692 c -0.082885,-0.1308851 0.03871,-0.262058 0.5625,-0.6035157 C 3.9969566,9.1057409 4.4587668,8.7983311 4.6542969,8.6621094 C 4.8498118,8.5258952 5.2700021,8.2334145 5.5878906,8.0117188 C 5.9057867,7.7900117 6.5118249,7.4502329 6.9335938,7.2558594 C 7.3553588,7.0614783 7.9671083,6.7161565 8.2949219,6.4882812 C 8.8461329,6.1051165 9.6902161,5.7495281 10.019531,5.71875 Z m 23.611328,0 c 0.329316,0.030778 1.173399,0.3863665 1.72461,0.7695312 c 0.327813,0.2278753 0.941516,0.5731971 1.363281,0.7675782 c 0.421769,0.1943735 1.025854,0.5341523 1.34375,0.7558594 c 0.317889,0.2216957 0.738079,0.5141764 0.933594,0.6503906 c 0.19553,0.1362217 0.65734,0.4436315 1.02539,0.6835937 c 0.52379,0.3414577 0.645385,0.4726306 0.5625,0.6035157 c -0.151041,0.2384502 -0.278761,0.2792622 -0.75,0.2304692 C 39.440985,10.139008 37.552118,9.0584381 35.804688,7.875 C 35.371898,7.5818939 34.741556,7.2065967 34.402344,7.0410156 C 34.063124,6.8754496 33.763163,6.6519325 33.736328,6.5429688 c -0.133776,-0.5438741 2.223929,0.5895617 4.097656,1.9707031 c 0.613554,0.4522318 1.130674,0.7815557 1.148438,0.7324219 C 39.020531,9.1397945 37.013349,7.639158 36.171875,7.1445312 C 35.846972,6.9535479 35.133851,6.6189985 34.587891,6.4003906 C 34.04193,6.1817979 33.554968,5.9148107 33.503906,5.8066406 c -0.03439,-0.072823 0.01718,-0.09815 0.126953,-0.087891 z M 14.896484,6.4316406 c 0.06341,0.00731 0.111437,0.024174 0.140625,0.054688 C 15.260971,6.7203192 15.159867,6.791996 14.410156,6.929688 C 13.908798,7.021757 13.555437,7.196051 13.138672,7.5566406 C 12.47199,8.1334343 12.405009,8.3654315 13.046875,7.875 c 0.475094,-0.3629858 2.162362,-0.9992709 2.056641,-0.7753906 c -0.03628,0.076762 -0.430252,0.3146433 -0.875,0.5273437 c -0.444749,0.2127118 -1.020524,0.5497833 -1.279297,0.75 c -0.815668,0.6310942 -1.046356,0.7343216 -1.283203,0.578125 C 11.48199,8.8337175 11.481019,8.7359613 11.658203,8.3886719 C 11.776276,8.1571758 12.186932,7.7171928 12.570312,7.4121094 C 13.26029,6.863047 14.452635,6.3804597 14.896484,6.4316406 Z m 13.857422,0 c 0.44385,-0.051181 1.638148,0.4314064 2.328125,0.9804688 c 0.38338,0.3050834 0.792084,0.7450664 0.910157,0.9765625 c 0.177184,0.3472894 0.176212,0.4450456 -0.0078,0.5664062 c -0.236848,0.1561966 -0.467536,0.052969 -1.283203,-0.578125 c -0.258773,-0.2002167 -0.834549,-0.5372882 -1.279297,-0.75 C 28.977127,7.4142527 28.585112,7.1763716 28.548828,7.0996094 C 28.443107,6.8757291 30.13039,7.5120142 30.605469,7.875 c 0.641866,0.4904315 0.574885,0.2584343 -0.0918,-0.3183594 C 30.096907,7.196051 29.743546,7.0217568 29.242188,6.9296875 C 28.492477,6.7919955 28.38942,6.7203187 28.613281,6.4863281 c 0.02919,-0.030513 0.07722,-0.047376 0.140625,-0.054688 z M 10.255859,7.125 c 0.06135,-0.010109 0.109085,-0.00811 0.138672,0.00586 c 0.07181,0.034016 -0.146032,0.1667581 -0.4824216,0.2949218 C 9.3568476,7.6373592 7.9119653,8.4889558 6.6699219,9.3378906 L 6.1894531,9.6679688 L 6.6113281,9.5390625 C 6.8436557,9.4685743 7.4451469,9.1263973 7.9492188,8.7792969 C 8.4532943,8.4321851 9.2146533,7.9749286 9.640625,7.7636719 c 0.623153,-0.309052 0.778581,-0.3399484 0.791016,-0.1601563 c 0.01096,0.1596095 -0.329146,0.4570938 -1.1894535,1.0410156 C 6.9641906,10.190679 5.9009574,10.713756 4.9726562,10.746094 C 4.532432,10.76159 4.3280059,10.617888 4.5644531,10.457031 c 0.078425,-0.05337 0.3305938,-0.196432 0.5585938,-0.318359 C 5.351028,10.016744 6.2783998,9.4212516 7.1855469,8.8164062 C 8.6510129,7.8392977 9.8264008,7.1957645 10.255859,7.125 Z m 23.138672,0 c 0.429459,0.070765 1.604847,0.7142977 3.070313,1.6914062 c 0.907147,0.6048454 1.836472,1.2003378 2.064453,1.3222658 c 0.228,0.121927 0.478215,0.264992 0.556641,0.318359 c 0.236447,0.160857 0.03397,0.304559 -0.40625,0.289063 C 37.751386,10.713756 36.6862,10.190679 34.408203,8.6445312 C 33.547896,8.0606094 33.209742,7.7631251 33.220703,7.6035156 c 0.01243,-0.1797921 0.165909,-0.1488957 0.789063,0.1601563 c 0.425971,0.2112567 1.18733,0.6685132 1.691406,1.015625 c 0.504072,0.3471004 1.105563,0.6892774 1.33789,0.7597656 l 0.423829,0.1289063 L 36.980469,9.3378906 C 35.738425,8.4889558 34.293543,7.6373592 33.738281,7.4257812 C 33.401892,7.2976175 33.186001,7.1648751 33.257812,7.1308594 C 33.2874,7.1168879 33.33318,7.1148908 33.394531,7.125 Z M 16.851562,7.78125 c -0.04152,-0.014419 -0.04236,0.024387 -0.01953,0.1132812 c 0.03024,0.1176189 0.152064,0.2609228 0.269531,0.3164063 c 0.117506,0.055483 0.178042,0.1759246 0.134766,0.2675781 c -0.114066,0.2415118 0.169743,0.5774469 0.470703,0.5566406 c 0.136403,-0.00945 0.276531,-0.076437 0.310547,-0.1484374 c 0.04509,-0.095509 0.0061,-0.1112048 -0.140625,-0.058594 c -0.303496,0.1088126 -0.62423,-0.092281 -0.515625,-0.3222656 c 0.06074,-0.1286173 -0.02572,-0.310406 -0.24414,-0.5117188 C 16.976192,7.8642383 16.893085,7.7956689 16.851562,7.78125 Z m 9.947266,0 c -0.04152,0.014419 -0.122676,0.082988 -0.263672,0.2128906 C 26.316737,8.1954534 26.228325,8.3772421 26.289062,8.5058594 C 26.397667,8.7358436 26.076934,8.9369376 25.773438,8.828125 C 25.626678,8.775514 25.589676,8.79121 25.634766,8.886719 c 0.03402,0.072 0.17219,0.1389886 0.308593,0.1484374 c 0.30096,0.020806 0.586723,-0.3151288 0.472657,-0.5566406 c -0.04328,-0.091653 0.01726,-0.2120946 0.134765,-0.2675781 c 0.117506,-0.055483 0.237342,-0.1987874 0.267578,-0.3164063 c 0.02283,-0.088894 0.02199,-0.1277001 -0.01953,-0.1132812 z M 14.712891,7.853516 c 0.0961,-0.00288 0.18248,0.011302 0.257812,0.046875 l 0.298828,0.140625 l -0.521484,0.2070313 c -0.775688,0.3069354 -1.14552,0.5581264 -1.296875,0.8789062 c -0.117921,0.249978 -0.07727,0.2407938 0.310547,-0.066406 c 0.501486,-0.3972888 1.743763,-0.8722453 1.808593,-0.6914063 c 0.02306,0.064819 -0.234322,0.221609 -0.572265,0.3476563 c -0.337928,0.1260094 -0.937452,0.5025823 -1.332031,0.8378906 c -0.530245,0.4505919 -0.76365,0.5757929 -0.894532,0.4804689 c -0.0974,-0.070941 -0.133546,-0.2654096 -0.08203,-0.4316408 c 0.258978,-0.8359256 1.350757,-1.7298639 2.023438,-1.75 z m 14.226562,0 c 0.672681,0.020136 1.76446,0.9140744 2.023438,1.75 c 0.05152,0.1662312 0.01341,0.3606989 -0.08398,0.43164 C 30.748025,10.13048 30.51462,10.005279 29.984375,9.5546875 C 29.589796,9.2193792 28.990271,8.8428063 28.652344,8.7167969 C 28.314401,8.5907496 28.057023,8.4339595 28.080078,8.3691406 c 0.06483,-0.180839 1.309045,0.2941212 1.810547,0.6914063 c 0.387817,0.3072 0.428468,0.3163842 0.310547,0.066406 C 30.049817,8.8061733 29.678031,8.5549823 28.902344,8.2480469 L 28.380859,8.0410156 l 0.298829,-0.140625 c 0.07533,-0.035573 0.163668,-0.049752 0.259765,-0.046875 z M 10.875,8.4707031 c 0.05096,0.0045 0.112315,0.017932 0.205078,0.03125 c 0.275414,0.039534 0.172418,0.1430797 -1.042969,1.0566407 C 8.4479503,10.753132 7.9319494,11.047121 7.3125,11.113281 C 6.8841624,11.159014 6.4199992,11.050139 6.4824219,10.917969 C 6.49754,10.886221 6.8046626,10.691772 7.1660156,10.486328 C 7.5273385,10.280911 8.2686411,9.7846056 8.8125,9.3847656 C 10.112608,8.4289382 10.741157,8.1527889 9.6699219,9.0078125 C 9.2212995,9.3658849 8.6395963,9.7958317 8.3769531,9.9628906 C 8.1143138,10.129946 7.9470159,10.288627 8.0058594,10.316406 C 8.1257082,10.373024 9.204103,9.6784021 10.125,8.9511719 c 0.537004,-0.4240715 0.597115,-0.4939727 0.75,-0.4804688 z m 21.902344,0 c 0.152884,-0.013504 0.211043,0.056397 0.748047,0.4804688 c 0.920897,0.7272302 1.999291,1.4218521 2.11914,1.3652341 c 0.05884,-0.02778 -0.108454,-0.18646 -0.371093,-0.3535154 C 35.010794,9.7958317 34.429091,9.3658849 33.980469,9.0078125 C 32.909233,8.1527889 33.539735,8.4289382 34.839844,9.3847656 c 0.543859,0.39984 1.283208,0.8961454 1.644531,1.1015624 c 0.361353,0.205444 0.670429,0.399893 0.685547,0.431641 c 0.06242,0.13217 -0.403694,0.241045 -0.832031,0.195312 c -0.61945,-0.06616 -1.135451,-0.360149 -2.72461,-1.5546872 C 32.397895,8.6450328 32.296851,8.541487 32.572266,8.5019531 c 0.09276,-0.013318 0.154116,-0.026749 0.205078,-0.03125 z m -17.494141,0.375 c 0.276945,-0.049053 0.230068,0.1461501 -0.208984,0.4609375 C 14.568461,9.6692485 13.961182,10.346416 14.087891,10.40625 c 0.04751,0.0223 0.24099,-0.122416 0.429687,-0.320312 c 0.358148,-0.3756099 1.260666,-0.8825504 1.150391,-0.6464849 c -0.03477,0.074684 -0.124687,0.1420001 -0.199219,0.1503907 c -0.07453,0.00831 -0.412424,0.3076832 -0.75,0.6640622 c -0.817886,0.863411 -0.98733,0.981788 -1.193359,0.832032 c -0.125823,-0.09146 -0.117483,-0.273592 0.0293,-0.654297 c 0,0 0,-0.002 0,-0.002 c 0.263383,-0.6806619 0.696703,-1.1483141 1.345703,-1.4492192 c 0.162122,-0.075165 0.290497,-0.1184145 0.382812,-0.1347657 z m 13.083985,0 c 0.09231,0.016351 0.220689,0.0596 0.382812,0.1347657 c 0.648998,0.3009043 1.082319,0.7705134 1.345703,1.4511722 c 0.146781,0.380709 0.157073,0.562833 0.03125,0.654297 c -0.206029,0.149756 -0.377426,0.03138 -1.195312,-0.832032 c -0.337576,-0.356379 -0.675468,-0.6557473 -0.75,-0.6640622 c -0.07453,-0.00839 -0.164447,-0.075707 -0.199219,-0.1503907 c -0.110275,-0.2360655 0.792242,0.270875 1.15039,0.6464849 c 0.188697,0.197896 0.382179,0.342611 0.429688,0.320312 C 29.689209,10.346416 29.083882,9.6692485 28.578125,9.3066406 C 28.139072,8.9918532 28.090243,8.7966496 28.367188,8.8457031 Z M 11.222656,9.1914062 c 0.05117,0.024189 -0.16222,0.243554 -0.474609,0.4863282 c -0.312416,0.242759 -0.579897,0.4054316 -0.595703,0.3613276 c -0.01587,-0.044069 0.197558,-0.2635094 0.474609,-0.4863276 c 0.277039,-0.222841 0.54454,-0.3855058 0.595703,-0.3613282 z m 21.205078,0 c 0.05116,-0.024178 0.320617,0.1384872 0.597657,0.3613282 C 33.302441,9.7755526 33.515874,9.9949932 33.5,10.039062 c -0.01581,0.0441 -0.285241,-0.1185686 -0.597656,-0.3613276 C 32.589954,9.4349602 32.37656,9.2155952 32.427734,9.1914062 Z M 11.751953,9.3574219 c 0.06526,-0.00273 0.111095,0.00726 0.121094,0.035156 c 0.01852,0.051402 -0.330725,0.380597 -0.777344,0.7324221 c -0.881371,0.694322 -1.9163494,1.162817 -2.236328,1.011719 C 8.6811703,11.052549 8.7119232,11.01069 9.1269531,10.765625 c 0.2574992,-0.15205 0.5467671,-0.361697 0.6425781,-0.464844 c 0.095811,-0.103143 0.2065599,-0.13706 0.2460938,-0.07617 c 0.06966,0.107263 1.033228,-0.4304278 1.126953,-0.6289059 c 0.04997,-0.1058173 0.413607,-0.2300838 0.609375,-0.2382812 z m 20.148438,0 c 0.195768,0.0082 0.5594,0.1324639 0.609375,0.2382812 c 0.09372,0.1984781 1.057296,0.7361689 1.126953,0.6289059 c 0.03953,-0.06089 0.150282,-0.02697 0.246093,0.07617 c 0.09581,0.103147 0.385079,0.312794 0.642579,0.464844 c 0.41503,0.245065 0.445782,0.286924 0.267578,0.371094 C 34.47299,11.287817 33.438011,10.819322 32.556641,10.125 C 32.110021,9.7731751 31.758824,9.4439797 31.777344,9.3925781 c 0.01,-0.027893 0.05779,-0.037889 0.123047,-0.035156 z m -15.84375,0.1679687 c 0.175596,0.082923 -0.128819,0.5749544 -0.611329,0.9843754 c -0.252623,0.214337 -0.517047,0.517899 -0.58789,0.675781 c -0.110929,0.247257 -0.08117,0.240167 0.214844,-0.05078 c 0.597577,-0.58746 1.047381,-0.882631 1.220703,-0.800782 c 0.226167,0.10681 0.122474,0.286115 -0.304688,0.529297 c -0.195061,0.111043 -0.578536,0.39905 -0.853515,0.638672 c -0.367408,0.320164 -0.549534,0.398661 -0.683594,0.298828 c -0.151786,-0.113008 -0.125388,-0.249577 0.154297,-0.820312 c 0.33309,-0.679714 1.216145,-1.5660604 1.451172,-1.4550784 z m 11.537109,0 c 0.235026,-0.110982 1.118082,0.7753644 1.451172,1.4550784 c 0.279685,0.570735 0.306083,0.707304 0.154297,0.820312 c -0.13406,0.09983 -0.314233,0.02134 -0.681641,-0.298828 c -0.274979,-0.239622 -0.660407,-0.527629 -0.855469,-0.638672 c -0.427162,-0.243182 -0.530854,-0.422487 -0.304687,-0.529297 c 0.173321,-0.08185 0.625094,0.213307 1.222656,0.800782 c 0.296013,0.290948 0.325773,0.298038 0.214844,0.05078 c -0.07084,-0.157882 -0.335305,-0.461444 -0.587891,-0.675781 C 27.724522,10.100345 27.418153,9.6083135 27.59375,9.5253906 Z m -15.519531,0.359375 c 0.0194,-0.00106 0.02499,0.010001 0.01367,0.037109 c -0.04845,0.1161074 -0.19099,0.2883364 -0.31836,0.3828134 c -0.127332,0.09445 -0.217171,0.213593 -0.199219,0.263671 c 0.01814,0.05008 0.157892,-0.01554 0.310547,-0.144531 c 0.153298,-0.129638 0.370758,-0.189342 0.486329,-0.134766 c 0.244081,0.115276 0.233531,0.162145 -0.0957,0.416016 c -0.488477,0.376668 -1.439392,0.40071 -1.242187,0.03125 c 0.116575,-0.218433 0.909142,-0.8441749 1.044922,-0.8515628 z m 19.501953,0 c 0.135779,0.00739 0.928347,0.6331294 1.044922,0.8515624 c 0.197204,0.36946 -0.75371,0.345418 -1.242188,-0.03125 c -0.329234,-0.253871 -0.339785,-0.30074 -0.0957,-0.416016 c 0.115571,-0.05458 0.334984,0.0051 0.488281,0.134766 c 0.152655,0.128995 0.290452,0.19461 0.308594,0.144531 c 0.01795,-0.05008 -0.06993,-0.169221 -0.197266,-0.263671 C 31.755442,10.210211 31.610954,10.037982 31.5625,9.921875 C 31.55119,9.894767 31.5568,9.88371 31.57617,9.884766 Z M 12.96875,10.613281 c 0.05437,0.01758 -0.0028,0.135347 -0.189453,0.425781 c -0.256479,0.399311 -0.266191,0.448255 -0.06055,0.285157 c 0.253795,-0.201298 0.416481,-0.199629 0.439453,0.0039 c 0.0072,0.06331 -0.1546,0.334837 -0.359375,0.603516 c -0.317707,0.416768 -0.406282,0.466576 -0.601562,0.33789 C 11.989165,12.132372 12.00035,12.053056 12.318359,11.40625 c 0.205418,-0.417797 0.435306,-0.739419 0.558594,-0.779297 c 0.04231,-0.01368 0.07367,-0.01953 0.0918,-0.01367 z m 17.712891,0 c 0.01812,-0.0059 0.04949,-1e-5 0.0918,0.01367 c 0.123288,0.03988 0.355125,0.3615 0.560546,0.779297 c 0.31801,0.646806 0.327242,0.726122 0.119141,0.863281 c -0.195281,0.128686 -0.28194,0.07888 -0.599609,-0.33789 C 30.648741,11.662962 30.48696,11.391432 30.494141,11.328125 c 0.02297,-0.203535 0.185657,-0.205204 0.439453,-0.0039 c 0.205644,0.163098 0.193978,0.114154 -0.0625,-0.285157 c -0.186577,-0.290434 -0.243815,-0.408203 -0.189453,-0.425781 z m -13.716797,0.04297 c 0.113791,0.02092 0.143666,0.102381 0.0098,0.230469 c -0.121927,0.116636 -0.109899,0.150009 0.04688,0.132812 c 0.152504,-0.01663 0.12042,0.02693 -0.115234,0.166016 c -0.177109,0.104428 -0.363956,0.158901 -0.416016,0.119141 c -0.05204,-0.03976 -0.306609,0.07716 -0.566406,0.261718 c -0.569393,0.404429 -0.662775,0.305953 -0.1875,-0.199218 c 0.190299,-0.202281 0.512843,-0.46109 0.714844,-0.576172 c 0.202652,-0.115446 0.39988,-0.155681 0.513672,-0.134766 z m 9.720703,0 c 0.113792,-0.02092 0.312972,0.01932 0.515625,0.134766 c 0.202001,0.115082 0.522591,0.373891 0.71289,0.576172 c 0.475276,0.505171 0.383847,0.603647 -0.185546,0.199218 c -0.259798,-0.184555 -0.516316,-0.30148 -0.56836,-0.261719 c -0.05206,0.03976 -0.238907,-0.01471 -0.416015,-0.119141 C 26.508487,11.04646 26.478355,11.002901 26.630859,11.019531 c 0.156775,0.0172 0.16685,-0.01618 0.04492,-0.132812 c -0.133901,-0.128088 -0.104026,-0.209554 0.0098,-0.230469 z m -9.865235,0.373047 c -0.02488,-0.0081 -0.06889,-0.002 -0.128906,0.01953 c -0.109039,0.03908 -0.183061,0.108666 -0.166015,0.15625 c 0.01701,0.04762 0.08116,0.06887 0.142578,0.04688 c 0.06142,-0.02192 0.135477,-0.09158 0.166015,-0.15625 c 0.01682,-0.03564 0.01121,-0.0583 -0.01367,-0.06641 z m 10.009766,0 c -0.02488,0.0081 -0.03049,0.03077 -0.01367,0.06641 c 0.03054,0.06467 0.106552,0.134329 0.167969,0.15625 c 0.06145,0.022 0.12557,7.47e-4 0.142578,-0.04688 c 0.01705,-0.04758 -0.05893,-0.11717 -0.167969,-0.15625 c -0.06002,-0.02154 -0.104027,-0.02764 -0.128906,-0.01953 z m -12.998047,0.560547 c 0.09151,2.96e-4 0.07987,0.112544 -0.08984,0.335937 c -0.145739,0.191811 -0.374988,0.514523 -0.509766,0.71875 c -0.360265,0.5459 0.05323,0.248028 0.447266,-0.322265 c 0.187086,-0.270766 0.337014,-0.396307 0.36914,-0.306641 c 0.04592,0.128126 -0.52791,1.046124 -0.943359,1.507813 c -0.166715,0.185272 -0.326381,0.05619 -0.390625,-0.31836 c -0.07155,-0.41729 0.140638,-0.881425 0.583984,-1.28125 c 0.247423,-0.223141 0.441698,-0.33428 0.533203,-0.333984 z m 15.986328,0 c 0.09151,-2.96e-4 0.287734,0.110843 0.535157,0.333984 c 0.443346,0.399825 0.653577,0.86396 0.582031,1.28125 c -0.06424,0.374551 -0.221957,0.503632 -0.388672,0.31836 C 30.131426,13.06175 29.555641,12.143752 29.601562,12.015626 c 0.03213,-0.08967 0.182055,0.03588 0.369141,0.306641 c 0.394035,0.570293 0.809446,0.868165 0.449219,0.322265 c -0.134778,-0.204227 -0.36598,-0.526939 -0.511719,-0.71875 c -0.169714,-0.223393 -0.181349,-0.335641 -0.08984,-0.335937 z m -14.99414,0.554687 c 0.139578,0.06591 0.0844,0.153695 -0.394531,0.613281 c -0.533337,0.51182 -0.580073,0.40408 -0.08594,-0.197265 c 0.209386,-0.254816 0.425318,-0.44206 0.480469,-0.416016 z m 14.001953,0 c 0.05515,-0.02604 0.271045,0.1612 0.480469,0.416016 c 0.494135,0.601345 0.447399,0.709085 -0.08594,0.197265 C 28.741775,12.298227 28.686592,12.210447 28.82617,12.144532 Z"
     style="fill:#8c8c8c;fill-opacity:1;stroke-width:3.77952766"
     inkscape:connector-curvature="0" />
  </g>
 </g>
</svg>
