<?xml version="1.0" encoding="UTF-8" standalone="no"?>
<!-- Created with Inkscape (http://www.inkscape.org/) -->

<svg
  xmlns:dc="http://purl.org/dc/elements/1.1/"
  xmlns:cc="http://creativecommons.org/ns#"
  xmlns:rdf="http://www.w3.org/1999/02/22-rdf-syntax-ns#"
  xmlns:svg="http://www.w3.org/2000/svg"
  xmlns="http://www.w3.org/2000/svg"
  xmlns:sodipodi="http://sodipodi.sourceforge.net/DTD/sodipodi-0.dtd"
  xmlns:inkscape="http://www.inkscape.org/namespaces/inkscape"
  width="105"
  height="105"
  viewBox="0 0 105 105"
  version="1.1"
  id="svg8"
  inkscape:version="0.92.4 (5da689c313, 2019-01-14)"
  sodipodi:docname="05.svg">
 <defs
   id="defs2" />
 <sodipodi:namedview
   id="base"
   pagecolor="#ffffff"
   bordercolor="#666666"
   borderopacity="1.0"
   inkscape:pageopacity="0.0"
   inkscape:pageshadow="2"
   inkscape:zoom="2.6428571"
   inkscape:cx="-27.895334"
   inkscape:cy="44.912584"
   inkscape:document-units="px"
   inkscape:current-layer="layer1"
   showgrid="false"
   units="px"
   inkscape:window-width="1366"
   inkscape:window-height="705"
   inkscape:window-x="-8"
   inkscape:window-y="-8"
   inkscape:window-maximized="1"
   inkscape:snap-global="false" />
 <metadata
   id="metadata5">
  <rdf:RDF>
   <cc:Work
     rdf:about="">
    <dc:format>image/svg+xml</dc:format>
    <dc:type
      rdf:resource="http://purl.org/dc/dcmitype/StillImage" />
    <dc:title />
   </cc:Work>
  </rdf:RDF>
 </metadata>
 <g
   inkscape:label="Calque 1"
   inkscape:groupmode="layer"
   id="layer1"
   transform="translate(0,-1017.5197)">
  <path
    style="opacity:0.6;fill:#ffffff;fill-opacity:1;fill-rule:evenodd;stroke:none;stroke-width:0.49996281"
    d="M 27.4375 2.5 C 20.555406 2.483 14.677301 4.9297969 9.8066406 9.8417969 C 5.03949 14.616697 2.6130536 20.358041 2.5117188 27.056641 L 2.5 27.056641 C 2.50342 27.082641 2.5063456 27.114625 2.5097656 27.140625 C 2.5080456 27.281425 2.5016131 27.418947 2.5019531 27.560547 C 2.4961831 29.953147 2.7932289 32.2236 3.3769531 34.375 C 6.3856832 60.349 11.706239 102.74005 51.841797 102.49805 C 88.05215 102.27985 98.925333 52.100825 101.67188 34.015625 C 102.16697 32.081525 102.4293 30.052381 102.45898 27.925781 C 102.46198 27.896781 102.5 27.5625 102.5 27.5625 L 102.4668 27.5625 C 102.4437 20.6575 100.00088 14.759894 95.136719 9.8710938 C 90.266056 4.9591938 84.398673 2.5105438 77.533203 2.5273438 C 70.651109 2.5103437 64.773004 4.9591937 59.902344 9.8710938 C 55.650926 14.129494 53.264099 19.156512 52.724609 24.945312 C 53.434754 19.930713 55.650636 15.540397 59.386719 11.779297 C 64.001955 7.1014969 69.570608 4.7690562 76.091797 4.7851562 C 82.597232 4.7691563 88.158197 7.1014969 92.773438 11.779297 C 97.382677 16.435297 99.697024 22.050653 99.71875 28.626953 L 99.75 28.626953 C 99.75 28.626953 99.713408 28.94145 99.710938 28.96875 C 99.683037 30.99815 99.435525 32.93575 98.964844 34.78125 C 96.360003 52.01255 86.053284 99.784387 51.748047 99.992188 C 13.622486 100.22329 8.6597565 59.791266 5.8125 35.072266 C 5.2671999 33.036166 4.9906694 30.8875 4.9960938 28.625 C 4.9957756 28.492 5.0023362 28.362669 5.0039062 28.230469 C 5.0006062 28.204469 4.9974506 28.169531 4.9941406 28.144531 L 5.0058594 28.144531 C 5.1019654 21.765331 7.4028564 16.2973 11.919922 11.75 C 16.535159 7.0722 22.103812 4.7418125 28.625 4.7578125 C 35.130436 4.7418125 40.687496 7.0722 45.302734 11.75 C 49.861206 16.3546 52.172704 21.901666 52.244141 28.384766 L 52.470703 28.384766 C 52.473303 28.022466 52.485203 27.665094 52.501953 27.308594 L 52.365234 27.308594 C 52.289894 20.501194 49.851815 14.676897 45.041016 9.8417969 C 40.170355 4.9297969 34.30297 2.4833 27.4375 2.5 z M 31.123047 9.7714844 C 25.288299 9.7574844 20.305202 11.841944 16.175781 16.027344 C 12.135098 20.095244 10.086855 24.989312 10 30.695312 L 9.9804688 30.695312 C 9.9852587 30.732313 9.9912757 30.783013 9.9960938 30.820312 C 9.9950964 30.923513 9.9821729 31.023353 9.9824219 31.126953 C 9.9775319 33.151353 10.224974 35.070878 10.712891 36.892578 C 13.260426 59.009578 17.701841 95.187169 51.814453 94.980469 C 82.50261 94.794569 91.723746 52.067778 94.056641 36.642578 C 94.47201 35.016878 94.685608 33.306784 94.716797 31.521484 C 94.720797 31.481484 94.761719 31.128906 94.761719 31.128906 L 94.732422 31.128906 C 94.712772 25.245306 92.643359 20.218434 88.519531 16.052734 C 84.390107 11.867334 79.416357 9.782675 73.595703 9.796875 C 67.760953 9.782875 62.777859 11.867334 58.648438 16.052734 C 54.561895 20.166734 52.507313 25.122609 52.464844 30.912109 L 52.251953 30.912109 C 52.187613 25.112409 50.127009 20.146944 46.048828 16.027344 C 41.919405 11.841944 36.9437 9.7590375 31.123047 9.7734375 L 31.123047 9.7714844 z M 32.375 12.275391 L 32.375 12.277344 C 37.853262 12.264344 42.533407 14.224862 46.419922 18.164062 C 50.258459 22.041563 52.199441 26.714828 52.259766 32.173828 L 52.458984 32.173828 C 52.498624 26.724128 54.430845 22.057747 58.277344 18.185547 C 62.163858 14.246147 66.856128 12.284828 72.347656 12.298828 C 77.825917 12.285828 82.506061 14.246147 86.392578 18.185547 C 90.273959 22.106147 92.223804 26.8371 92.242188 32.375 L 92.269531 32.375 C 92.269531 32.375 92.231906 32.703134 92.228516 32.740234 C 92.200736 34.354434 91.994202 35.895594 91.632812 37.371094 C 89.491568 51.699494 80.876267 92.296756 51.847656 92.472656 C 19.688395 92.667556 15.548102 58.509025 13.152344 37.703125 C 12.70975 36.016325 12.472075 34.243747 12.476562 32.373047 C 12.476334 32.277047 12.487331 32.186044 12.488281 32.089844 C 12.483681 32.054844 12.479249 32.006103 12.474609 31.970703 L 12.494141 31.970703 C 12.575401 26.599403 14.501191 21.991209 18.304688 18.162109 C 22.191202 14.222909 26.883473 12.261291 32.375 12.275391 z M 36.123047 19.794922 C 31.661189 19.783922 27.851147 21.379278 24.693359 24.580078 C 21.602678 27.691378 20.028589 31.431975 19.962891 35.796875 L 19.955078 35.796875 C 19.957278 35.813875 19.958738 35.834562 19.960938 35.851562 C 19.959837 35.942562 19.956831 36.034653 19.957031 36.126953 C 19.953231 37.686453 20.144745 39.164206 20.523438 40.566406 C 22.47411 57.491406 25.924968 85.112778 51.945312 84.955078 C 75.414876 84.812778 82.464883 52.134897 84.248047 40.341797 C 84.570506 39.078797 84.742431 37.752281 84.761719 36.363281 C 84.763619 36.344281 84.787109 36.126953 84.787109 36.126953 L 84.765625 36.126953 C 84.750655 31.627653 83.167248 27.785209 80.013672 24.599609 C 76.855882 21.398909 73.052642 19.803553 68.601562 19.814453 C 64.139704 19.803453 60.32771 21.398909 57.169922 24.599609 C 54.044527 27.746009 52.469585 31.534791 52.4375 35.962891 L 52.285156 35.962891 C 52.236316 31.527091 50.654134 27.732631 47.535156 24.582031 C 44.377368 21.381331 40.574128 19.785975 36.123047 19.796875 L 36.123047 19.794922 z "
    transform="translate(0,1017.5197)"
    id="path855-4-5" />
 </g>
</svg>
