<?xml version="1.0" encoding="UTF-8" standalone="no"?>
<!-- Created with Inkscape (http://www.inkscape.org/) -->

<svg
  xmlns:dc="http://purl.org/dc/elements/1.1/"
  xmlns:cc="http://creativecommons.org/ns#"
  xmlns:rdf="http://www.w3.org/1999/02/22-rdf-syntax-ns#"
  xmlns:svg="http://www.w3.org/2000/svg"
  xmlns="http://www.w3.org/2000/svg"
  xmlns:sodipodi="http://sodipodi.sourceforge.net/DTD/sodipodi-0.dtd"
  xmlns:inkscape="http://www.inkscape.org/namespaces/inkscape"
  width="105"
  height="105"
  viewBox="0 0 105 105"
  version="1.1"
  id="svg8"
  inkscape:version="0.92.4 (5da689c313, 2019-01-14)"
  sodipodi:docname="09.svg">
 <defs
   id="defs2" />
 <sodipodi:namedview
   id="base"
   pagecolor="#ffffff"
   bordercolor="#666666"
   borderopacity="1.0"
   inkscape:pageopacity="0.0"
   inkscape:pageshadow="2"
   inkscape:zoom="5.2857143"
   inkscape:cx="52.5"
   inkscape:cy="52.5"
   inkscape:document-units="px"
   inkscape:current-layer="layer1"
   showgrid="false"
   units="px"
   inkscape:window-width="1366"
   inkscape:window-height="705"
   inkscape:window-x="-8"
   inkscape:window-y="-8"
   inkscape:window-maximized="1"
   inkscape:snap-global="false" />
 <metadata
   id="metadata5">
  <rdf:RDF>
   <cc:Work
     rdf:about="">
    <dc:format>image/svg+xml</dc:format>
    <dc:type
      rdf:resource="http://purl.org/dc/dcmitype/StillImage" />
    <dc:title></dc:title>
   </cc:Work>
  </rdf:RDF>
 </metadata>
 <g
   inkscape:label="Calque 1"
   inkscape:groupmode="layer"
   id="layer1"
   transform="translate(0,-1017.5197)">
  <path
    style="opacity:0.35;fill:#ffffff;fill-opacity:1;fill-rule:evenodd;stroke:none;stroke-width:0.12499022"
    d="m 46.234499,1057.5198 c -1.72053,-0.01 -3.190082,0.6074 -4.40775,1.8354 c -1.191501,1.1935 -1.795393,2.6297 -1.821004,4.3038 H 40 c 0.0014,0.011 0.0032,0.025 0.0045,0.037 c -2.95e-4,0.031 -0.0041,0.06 -0.004,0.089 c -0.0014,0.5939 0.07154,1.1573 0.215419,1.6916 c 0.751207,6.4891 2.060729,17.1035 12.119729,17.0428 c 9.049209,-0.054 11.768441,-12.5906 12.456356,-17.1162 c 0.122483,-0.4769 0.185542,-0.9785 0.194739,-1.5022 c 0.0012,-0.012 0.01322,-0.1154 0.01322,-0.1154 h -0.0086 c -0.0058,-1.7263 -0.615899,-3.2011 -1.831919,-4.4233 c -1.217669,-1.2279 -2.684482,-1.8395 -4.400856,-1.8354 c -1.720528,-0.01 -3.190079,0.6075 -4.407748,1.8354 c -1.205024,1.207 -1.810779,2.6615 -1.823301,4.36 h -0.06262 c -0.01898,-1.7015 -0.627062,-3.1587 -1.829621,-4.3675 c -1.217668,-1.2279 -2.684482,-1.8389 -4.400855,-1.8348 z m 0.368795,0.7353 v 0 c 1.615409,-0.01 2.995738,0.5716 4.141779,1.7274 c 1.131893,1.1375 1.70441,2.5085 1.722199,4.11 h 0.0586 c 0.01169,-1.5988 0.581639,-2.9677 1.71588,-4.1038 c 1.14604,-1.1557 2.529351,-1.7314 4.148672,-1.7273 c 1.615409,-0.01 2.995737,0.5716 4.141779,1.7273 c 1.144527,1.1504 1.719075,2.5382 1.724496,4.1631 h 0.008 c 0,0 -0.01107,0.096 -0.01207,0.1068 c -0.0082,0.4736 -0.06864,0.9257 -0.175207,1.3586 c -0.631402,4.2038 -3.172128,16.115 -11.731976,16.1666 c -9.483003,0.057 -10.703832,-9.9646 -11.410285,-16.069 c -0.13051,-0.4948 -0.200657,-1.0148 -0.199334,-1.5636 c -6.7e-5,-0.029 0.0032,-0.055 0.0034,-0.083 c -0.0014,-0.011 -0.0026,-0.024 -0.004,-0.035 h 0.0058 c 0.02396,-1.5759 0.592021,-2.9276 1.713581,-4.0509 c 1.146042,-1.1558 2.529352,-1.7316 4.148673,-1.7274 z"
    id="path855-4-5-6-3"
    inkscape:connector-curvature="0" />
 </g>
</svg>
