<?xml version="1.0" encoding="UTF-8" standalone="no"?>
<!-- Created with Inkscape (http://www.inkscape.org/) -->

<svg
   xmlns:dc="http://purl.org/dc/elements/1.1/"
   xmlns:cc="http://creativecommons.org/ns#"
   xmlns:rdf="http://www.w3.org/1999/02/22-rdf-syntax-ns#"
   xmlns:svg="http://www.w3.org/2000/svg"
   xmlns="http://www.w3.org/2000/svg"
   xmlns:sodipodi="http://sodipodi.sourceforge.net/DTD/sodipodi-0.dtd"
   xmlns:inkscape="http://www.inkscape.org/namespaces/inkscape"
   width="13.268626mm"
   height="38.416759mm"
   viewBox="0 0 13.268626 38.416759"
   version="1.1"
   id="svg8"
   inkscape:version="0.92.4 (5da689c313, 2019-01-14)"
   sodipodi:docname="adn.svg">
  <defs
     id="defs2" />
  <sodipodi:namedview
     id="base"
     pagecolor="#ffffff"
     bordercolor="#666666"
     borderopacity="1.0"
     inkscape:pageopacity="0.0"
     inkscape:pageshadow="2"
     inkscape:zoom="1.65"
     inkscape:cx="-98.088962"
     inkscape:cy="-84.887979"
     inkscape:document-units="mm"
     inkscape:current-layer="layer1"
     showgrid="false"
     inkscape:window-width="836"
     inkscape:window-height="919"
     inkscape:window-x="1032"
     inkscape:window-y="7"
     inkscape:window-maximized="0"
     fit-margin-top="0"
     fit-margin-left="0"
     fit-margin-right="0"
     fit-margin-bottom="0" />
  <metadata
     id="metadata5">
    <rdf:RDF>
      <cc:Work
         rdf:about="">
        <dc:format>image/svg+xml</dc:format>
        <dc:type
           rdf:resource="http://purl.org/dc/dcmitype/StillImage" />
        <dc:title></dc:title>
      </cc:Work>
    </rdf:RDF>
  </metadata>
  <g
     inkscape:label="Calque 1"
     inkscape:groupmode="layer"
     id="layer1"
     transform="translate(-28.591816,-181.02728)">
    <path
       style="fill:#000000;stroke-width:0.05291666"
       d="m 28.593537,216.82368 c -0.007,-2.3197 0.0052,-2.83447 0.07695,-3.25438 0.259522,-1.51819 1.070505,-2.95221 2.462007,-4.35342 0.34525,-0.34766 0.627714,-0.64653 0.627697,-0.66416 -1.6e-5,-0.0176 -0.152145,-0.16808 -0.338065,-0.33434 -0.481079,-0.43021 -1.259554,-1.34857 -1.655823,-1.95337 -0.392024,-0.59832 -0.646068,-1.12516 -0.857809,-1.77892 -0.294599,-0.9096 -0.296858,-0.9432 -0.296273,-4.40563 l 5.4e-4,-3.20146 0.141656,-0.51485 c 0.407447,-1.48088 1.025448,-2.49628 2.331859,-3.83134 l 0.680031,-0.69494 -0.624814,-0.63102 c -1.272515,-1.28515 -1.997028,-2.4685 -2.375131,-3.87931 l -0.148909,-0.55562 -0.01044,-2.93688 c -0.0057,-1.61528 0.0074,-2.84162 0.02929,-2.72521 l 0.03973,0.21167 0.01375,-0.21167 c 0.0096,-0.14855 0.03524,-0.0539 0.08582,0.3175 0.03964,0.29105 0.132462,0.74348 0.206267,1.00542 0.178954,0.63511 0.736546,1.74053 1.174453,2.32833 0.40655,0.54572 1.681459,1.84493 2.344728,2.38941 0.629732,0.51696 2.652502,2.02914 2.714278,2.02914 0.05318,0 1.827966,-1.30993 2.485228,-1.83428 0.871476,-0.69526 2.196362,-2.03067 2.642636,-2.66364 0.781362,-1.10823 1.193246,-2.1533 1.345184,-3.41313 0.03286,-0.27246 0.04328,-0.29498 0.07344,-0.15875 l 0.03515,0.15875 0.0291,-0.15875 c 0.016,-0.0873 0.02373,1.13904 0.01718,2.72521 -0.01308,3.16448 -0.0112,3.14264 -0.355596,4.11911 -0.40544,1.14952 -1.107192,2.18571 -2.252946,3.32662 -0.298318,0.29706 -0.54229,0.54709 -0.542158,0.55563 1.06e-4,0.009 0.281562,0.30127 0.6254,0.65052 1.302594,1.32309 2.047608,2.57642 2.403238,4.04296 0.103632,0.42735 0.111612,0.63634 0.13152,3.44475 0.01774,2.50275 0.0079,3.07852 -0.06042,3.53447 -0.241792,1.6136 -1.13306,3.15083 -2.710706,4.67532 l -0.418694,0.40459 0.742318,0.75958 c 0.408274,0.41777 0.903134,0.9858 1.09969,1.26229 0.389328,0.54766 0.864144,1.46712 1.038406,2.01083 0.284226,0.8868 0.284564,0.89122 0.301654,3.94229 0.0088,1.57163 -0.0027,2.79797 -0.02566,2.72521 l -0.04166,-0.13229 -0.02454,0.13229 c -0.01616,0.0871 -0.03807,0.0238 -0.06411,-0.18521 -0.307728,-2.46936 -1.700938,-4.35555 -5.08688,-6.88683 -1.023866,-0.76543 -1.347126,-0.98355 -1.416448,-0.95575 -0.134952,0.0541 -1.996406,1.44846 -2.634768,1.97361 -0.846349,0.69625 -2.042298,1.92086 -2.47606,2.5354 -0.425664,0.60307 -0.918219,1.60632 -1.091063,2.22232 -0.0735,0.26194 -0.166974,0.72628 -0.207724,1.03188 -0.06244,0.46826 -0.07626,0.51402 -0.08785,0.29104 l -0.01376,-0.26459 -0.03629,0.26459 c -0.01996,0.14552 -0.04003,-0.97543 -0.0446,-2.49099 z m 0.39223,0.71828 c 0.692053,-1.98039 2.649114,-4.02386 6.108206,-6.37791 0.706238,-0.48062 2.113492,-1.52786 2.725208,-2.02802 0.55764,-0.45595 1.757314,-1.63182 2.140504,-2.09803 0.861186,-1.04777 1.420232,-2.1693 1.675604,-3.36152 0.06916,-0.32286 0.08785,-0.84784 0.10169,-2.85619 0.01038,-1.50632 -8e-4,-2.34775 -0.02875,-2.16958 -0.10961,0.69791 -0.527508,1.74055 -0.979078,2.44277 -0.785814,1.222 -2.235664,2.63097 -4.04768,3.93356 -0.27649,0.19876 -0.597958,0.43736 -0.714374,0.53021 -0.116418,0.0929 -0.449792,0.33057 -0.740834,0.52825 -1.700334,1.15489 -2.984863,2.19677 -4.021666,3.26197 -0.904908,0.92969 -1.380197,1.5655 -1.794161,2.40011 -0.636627,1.28354 -0.720026,1.83298 -0.714862,4.70959 0.0036,1.99054 0.01,2.1412 0.0777,1.82562 0.04059,-0.18917 0.136213,-0.52255 0.212493,-0.74083 z m 12.757834,0.88635 c -0.01468,-0.0364 -0.02669,-0.007 -0.02669,0.0661 0,0.0728 0.01202,0.10253 0.02669,0.0661 0.01468,-0.0364 0.01468,-0.0959 0,-0.13229 z m 0.002,-2.57968 c -0.02596,-2.18021 -0.03666,-2.28238 -0.335448,-3.20146 -0.193516,-0.59528 -0.700144,-1.55541 -1.116892,-2.11667 -0.194494,-0.26194 -0.666416,-0.79444 -1.048718,-1.18335 l -0.695094,-0.70709 -0.603348,0.49543 c -0.575712,0.47274 -1.15987,0.91631 -2.176316,1.65256 l -0.461942,0.3346 0.250276,0.17697 c 1.409552,0.9967 2.758922,2.07509 3.587144,2.86675 1.182844,1.13064 2.090072,2.52146 2.42624,3.71955 0.198736,0.70827 0.205806,0.62554 0.174098,-2.03729 z m -9.331719,-7.76055 c 0.266228,-0.22282 0.97816,-0.77409 1.582071,-1.22503 0.60391,-0.45095 1.097116,-0.83419 1.096012,-0.85165 -0.0012,-0.0175 -0.132072,-0.12204 -0.291042,-0.23242 -0.462002,-0.32078 -0.413228,-0.36143 0.422294,-0.35196 l 0.711328,0.008 0.320548,-0.22486 c 0.1763,-0.12366 0.320546,-0.24521 0.320546,-0.2701 0,-0.0249 -0.672982,-0.0453 -1.495518,-0.0453 h -1.495516 l -0.56222,-0.43656 c -0.83932,-0.65173 -1.585673,-1.31943 -1.568442,-1.40315 0.0129,-0.0627 0.591774,-0.0731 3.772446,-0.0678 l 3.757208,0.006 0.26247,-0.26647 0.26247,-0.26648 -4.363636,-2e-5 -4.363635,-3e-5 -0.213922,-0.25133 c -0.494045,-0.58043 -1.135453,-1.51507 -1.135453,-1.65455 0,-0.0337 2.024363,-0.052 5.76069,-0.052 h 5.760688 l 0.14325,-0.31921 c 0.232616,-0.51833 0.393924,-1.03965 0.537822,-1.73813 0.123886,-0.60135 0.130582,-0.69919 0.07972,-1.16489 -0.129464,-1.18538 -0.598774,-2.36858 -1.345572,-3.39236 -0.359126,-0.49232 -1.082028,-1.30131 -1.470944,-1.64612 l -0.369968,-0.328 -0.12505,0.10071 c -0.06878,0.0554 -0.430156,0.34759 -0.80306,0.64933 -0.372906,0.30175 -1.040958,0.81234 -1.484558,1.13466 l -0.806546,0.58602 0.369054,0.26334 c 0.202982,0.14484 0.369056,0.29504 0.369056,0.33378 0,0.0556 -0.173436,0.0704 -0.825026,0.0704 h -0.825026 l -0.321517,0.22489 c -0.386832,0.27059 -0.524205,0.24458 1.391827,0.26346 l 1.457552,0.0144 0.553658,0.43361 c 0.794588,0.62231 1.647028,1.39048 1.623014,1.46256 -0.01532,0.046 -1.012506,0.0685 -3.905958,0.0882 l -3.885385,0.0265 -0.19397,0.21167 -0.193971,0.21167 4.40268,0.0265 4.402678,0.0265 0.187234,0.21167 c 0.472732,0.53442 1.106376,1.47337 1.106376,1.63946 0,0.0713 -0.648018,0.0803 -5.790362,0.0803 h -5.790361 l -0.21141,0.5424 c -0.53985,1.38504 -0.630306,2.3823 -0.322788,3.55864 0.257908,0.98657 0.814403,2.05614 1.500516,2.88396 0.204259,0.24645 1.465587,1.53458 1.502645,1.53458 0.01152,0 0.238775,-0.18231 0.505003,-0.40513 z m 3.081545,-2.35551 c 0.12845,-0.0922 0.233546,-0.17559 0.233546,-0.18521 0,-0.01 -0.244002,-0.0175 -0.542226,-0.0175 h -0.542228 l 0.2605,0.18521 c 0.143274,0.10187 0.282182,0.18521 0.30868,0.18521 0.0265,0 0.153276,-0.0755 0.281728,-0.16772 z m 1.248746,-0.9384 c 0.136396,-0.0532 1.337,-1.01 1.789384,-1.42601 l 0.29104,-0.26765 -3.62479,-0.001 -3.624791,-0.001 0.165481,0.1441 c 0.575845,0.50143 1.214128,1.02578 1.572121,1.29151 l 0.414687,0.3078 h 1.44718 c 0.79595,0 1.50231,-0.0215 1.569688,-0.0478 z m 3.180184,-2.8494 c 0.18788,-0.22556 0.476144,-0.61251 0.640586,-0.85989 l 0.298984,-0.44979 -5.618762,-0.0135 c -3.09032,-0.007 -5.629714,-0.003 -5.643097,0.0109 -0.06018,0.0602 1.017631,1.53512 1.229036,1.6819 0.0308,0.0214 2.012518,0.0392 4.403823,0.0397 l 4.34783,8e-4 0.3416,-0.4101 z m -10.991055,-0.98621 c 0.16898,-0.52441 0.759275,-1.64705 1.116103,-2.12264 0.815441,-1.08684 2.29852,-2.44808 3.889445,-3.56992 0.184204,-0.12989 0.442071,-0.32375 0.573039,-0.4308 0.13097,-0.10706 0.428626,-0.32105 0.66146,-0.47554 1.462996,-0.97072 2.899726,-2.12015 3.891902,-3.11366 1.398904,-1.40077 2.05117,-2.42366 2.46557,-3.86654 l 0.14438,-0.50271 0.01472,-2.38125 0.01472,-2.38125 -0.100144,0.34396 c -0.566398,1.94536 -2.000824,3.65338 -4.870328,5.79928 -1.218014,0.91087 -1.716112,1.24551 -1.618304,1.08725 0.01508,-0.0244 -0.346832,-0.31575 -0.80423,-0.64749 -2.135225,-1.54863 -3.476081,-2.76942 -4.28499,-3.90131 -0.617999,-0.86475 -1.073739,-1.82325 -1.249909,-2.62877 -0.07628,-0.3488 -0.08012,-0.22987 -0.06577,2.03729 0.01515,2.39339 0.01607,2.4111 0.154158,2.97884 0.231015,0.94977 0.693361,1.90634 1.337857,2.76794 0.171973,0.22991 0.624408,0.7374 1.005411,1.12776 l 0.692732,0.70976 0.498403,-0.41553 c 0.454396,-0.37884 2.469809,-1.93221 3.195125,-2.44461 0.572538,-0.40446 0.19652,0.006 -0.763472,0.72229 -1.23813,0.92413 -2.617974,1.93985 -3.430491,2.75118 -1.632669,1.63029 -2.36762,2.93574 -2.631396,4.674 -0.05997,0.39518 -0.07726,1.01928 -0.07403,2.67229 0.0038,1.9714 0.01051,2.12767 0.07753,1.81872 0.04033,-0.18588 0.112556,-0.45973 0.160507,-0.60854 z m 11.870767,-1.2892 c -0.230096,-0.38251 -0.681688,-1.00573 -0.924244,-1.27551 l -0.244826,-0.27231 h -4.410324 -4.410323 l -0.294723,0.34741 c -0.282756,0.33329 -0.540053,0.69193 -0.842241,1.17395 l -0.140991,0.22489 h 5.69352 5.693522 z m -2.085304,-2.479 c -0.45099,-0.3971 -1.075076,-0.91576 -1.447448,-1.20291 l -0.389114,-0.30007 H 35.221921 33.56164 l -0.649354,0.52189 c -0.357145,0.28704 -0.810563,0.66804 -1.007596,0.84666 l -0.358242,0.32478 3.691991,-0.002 3.691992,-0.002 -0.211666,-0.18638 z m -3.01625,-2.37349 c -0.08731,-0.071 -0.234092,-0.17047 -0.326174,-0.22098 l -0.167426,-0.0918 -0.295596,0.20358 c -0.162578,0.11197 -0.295596,0.21154 -0.295596,0.22125 0,0.01 0.279796,0.0175 0.62177,0.0174 l 0.621772,-2e-4 -0.15875,-0.12914 z m 6.041086,-13.00689 c -0.01468,-0.0364 -0.02669,-0.007 -0.02669,0.0661 0,0.0728 0.01202,0.10252 0.02669,0.0661 0.01468,-0.0364 0.01468,-0.0959 0,-0.13229 z"
       id="path25"
       inkscape:connector-curvature="0"
       sodipodi:nodetypes="cccccssscsscsscscccscssscccccccccccsscscccccccccccssscsccccccsccccsccssssccsscsscccccsccccsccccsccsscscccccccssscssscccccsccsscsscccsccccccsscsssscccssccsccccccccccscccccccccccccscccssccccsccscsccsccsssscscccccccscccccccccsccccccccccsccccsscs" />
    <rect
       style="fill:#000000;stroke-width:0.5;stroke-linejoin:round;stroke-miterlimit:4;stroke-dasharray:none"
       id="rect153"
       width="0.86654645"
       height="0.10476341"
       x="29.914719"
       y="202.3559" />
    <rect
       style="fill:#000000;stroke-width:0.5;stroke-linejoin:round;stroke-miterlimit:4;stroke-dasharray:none"
       id="rect962"
       width="1.8544114"
       height="0.084307864"
       x="29.940037"
       y="203.00577"
       ry="1.1368684e-14" />
    <rect
       style="fill:#000000;stroke-width:0.5;stroke-linejoin:round;stroke-miterlimit:4;stroke-dasharray:none"
       id="rect970"
       width="2.6824675"
       height="0.061600555"
       x="30.902138"
       y="204.83327"
       ry="1.136867e-14" />
    <rect
       style="fill:#000000;stroke-width:0.5;stroke-linejoin:round;stroke-miterlimit:4;stroke-dasharray:none"
       id="rect972"
       width="3.7198646"
       height="0.077372968"
       x="30.924656"
       y="205.45251"
       ry="1.136867e-14" />
    <path
       style="fill:#000000;stroke-width:0.5;stroke-linejoin:round;stroke-miterlimit:4;stroke-dasharray:none"
       id="path1006"
       d="m 29.927999,203.06083 c -0.02311,-0.0286 -0.03909,-0.061 -0.05377,-0.0944 -0.01319,-0.0203 -0.02237,-0.0417 -0.02694,-0.0654 -0.0013,-0.0204 -0.0041,-0.0403 -0.0083,-0.0603 -0.0035,-0.0206 -0.0046,-0.0412 -0.0087,-0.0617 -0.0049,-0.0223 -0.0067,-0.0451 -0.0078,-0.0678 -8.2e-4,-0.0226 -7.6e-4,-0.0452 -7.6e-4,-0.0678 2.3e-5,-0.0225 5.3e-5,-0.045 5.3e-5,-0.0676 -0.0014,-0.0215 7.6e-4,-0.0423 0.005,-0.0633 0.004,-0.017 0.01522,-0.0306 0.02172,-0.0465 0.0069,-0.0166 0.01464,-0.0322 0.02438,-0.0473 0.01284,-0.0166 0.02686,-0.0324 0.04105,-0.0479 0,0 0.0893,-4e-4 0.0893,-4e-4 v 0 c -0.01361,0.0155 -0.02761,0.0306 -0.04099,0.0464 -0.0092,0.0148 -0.01787,0.0292 -0.02438,0.0455 -0.0057,0.0161 -0.01615,0.029 -0.02185,0.045 -0.0042,0.0205 -0.0069,0.0405 -0.0052,0.0616 -1.6e-5,0.0225 -4.8e-5,0.045 -5.3e-5,0.0676 -3e-6,0.0225 -5.3e-5,0.045 7.4e-4,0.0674 0.001,0.0223 0.0028,0.0446 0.0077,0.0665 0.0041,0.0205 0.0053,0.0411 0.0088,0.0616 0.0042,0.02 0.0068,0.04 0.0082,0.0604 0.0046,0.023 0.01443,0.0434 0.02637,0.0635 0.01441,0.0331 0.03079,0.0649 0.05382,0.0931 0,0 -0.08835,0.0119 -0.08835,0.0119 z"
       inkscape:connector-curvature="0" />
    <path
       style="fill:#000000;stroke-width:0.5;stroke-linejoin:round;stroke-miterlimit:4;stroke-dasharray:none"
       id="path1012"
       d="m 30.973748,204.85429 c -0.01706,0.0327 -0.03749,0.0636 -0.05522,0.0959 -0.0087,0.0207 -0.01777,0.0417 -0.02345,0.0635 -0.0043,0.0204 -0.0045,0.0412 -0.0048,0.062 -1.59e-4,0.0224 -4.3e-5,0.0448 1.3e-5,0.0672 5.3e-5,0.0225 5.3e-5,0.0451 5.3e-5,0.0676 6e-6,0.0225 5e-6,0.045 4e-6,0.0676 8.8e-4,0.0218 -0.0018,0.0439 0.0013,0.0656 0.0016,0.0178 0.0093,0.0323 0.01849,0.047 0.01,0.0176 0.01894,0.0359 0.02922,0.0534 0.0083,0.0154 0.01884,0.0301 0.03154,0.0422 0.007,0.008 0.0033,0.005 0.0111,0.0115 0,0 -0.08836,0.0142 -0.08836,0.0142 v 0 c -0.0077,-0.008 -0.004,-0.004 -0.01114,-0.0119 -0.01228,-0.0135 -0.02339,-0.0282 -0.0317,-0.0445 -0.0098,-0.0177 -0.01933,-0.0355 -0.02934,-0.053 -0.0098,-0.0158 -0.01675,-0.0321 -0.01878,-0.0508 -0.0028,-0.0221 -7e-4,-0.0446 -0.0014,-0.0668 0,-0.0225 2e-6,-0.045 -4e-6,-0.0676 -8e-6,-0.0225 -2e-5,-0.0451 -5.3e-5,-0.0676 -5.3e-5,-0.0224 -1.59e-4,-0.0449 -4.3e-5,-0.0673 2.6e-4,-0.0214 4.8e-4,-0.0429 0.0046,-0.064 0.0055,-0.0227 0.01515,-0.0442 0.02376,-0.0658 0.01752,-0.0326 0.03922,-0.0628 0.055,-0.0965 0,0 0.08914,-0.002 0.08914,-0.002 z"
       inkscape:connector-curvature="0" />
    <path
       style="fill:#000000;stroke-width:0.5;stroke-linejoin:round;stroke-miterlimit:4;stroke-dasharray:none"
       id="path1028"
       d="m 29.417189,200.57918 c -0.03747,0.002 -0.07445,-0.001 -0.111585,-0.006 -0.02551,-0.004 -0.04385,-0.0217 -0.06075,-0.0401 -0.01408,-0.0112 -0.02785,-0.023 -0.0424,-0.0335 -0.01501,-0.0103 -0.02154,-0.0251 -0.03025,-0.0402 -0.0046,-0.008 -0.007,-0.0168 -0.0094,-0.0257 0,0 0.111145,-0.0118 0.111145,-0.0118 v 0 c 0.0024,0.008 0.0048,0.0159 0.0092,0.0231 0.0076,0.0143 0.01592,0.0262 0.02956,0.0357 0.01426,0.0116 0.02943,0.0222 0.04245,0.0352 0.01699,0.0166 0.03405,0.0307 0.05882,0.0327 0.03714,0.004 0.07427,0.006 0.111654,0.004 0,0 -0.108421,0.026 -0.108421,0.026 z"
       inkscape:connector-curvature="0" />
    <path
       style="fill:#cd212f;fill-opacity:1;stroke-width:0.05307855;stroke-linejoin:round;stroke-miterlimit:4;stroke-dasharray:none"
       d="m 30.922071,205.40865 -0.02497,-0.0435 -0.0016,-0.16942 c -0.0018,-0.18885 -3.2e-4,-0.19922 0.03929,-0.26817 l 0.01852,-0.0323 2.432369,0.002 c 1.603742,0.002 2.49839,0.005 2.626172,0.009 0.370766,0.0119 0.546242,0.0228 0.558438,0.0347 0.01008,0.01 -0.10404,0.11085 -0.232624,0.20589 -0.02935,0.0217 -0.131732,0.0944 -0.22751,0.16156 l -0.174142,0.12213 -0.536468,-0.004 c -0.550416,-0.004 -0.684828,-10e-4 -0.780008,0.0171 -0.03715,0.007 -0.288228,0.008 -1.857708,0.008 h -1.814757 z"
       id="path1057"
       inkscape:connector-curvature="0" />
    <path
       style="fill:#cd212f;fill-opacity:1;stroke-width:0.05307855;stroke-linejoin:round;stroke-miterlimit:4;stroke-dasharray:none"
       d="m 29.964233,202.9541 c -0.03391,-0.0724 -0.04879,-0.17177 -0.04902,-0.32751 -1.59e-4,-0.10915 4.8e-4,-0.1164 0.01258,-0.13903 l 0.01275,-0.0239 h 4.780813 4.780814 l -0.259384,0.26313 -0.259382,0.26313 -3.16071,-0.002 c -2.432437,-0.002 -3.239019,-8e-4 -3.500568,0.005 -0.186922,0.004 -0.788703,0.008 -1.337292,0.009 l -0.997435,0.002 z"
       id="path1059"
       inkscape:connector-curvature="0" />
    <path
       style="fill:#cd212f;fill-opacity:1;stroke-width:0.07022472;stroke-linejoin:round;stroke-miterlimit:4;stroke-dasharray:none"
       d="m 29.402525,200.54 c -0.03548,-0.0129 -0.100646,-0.0688 -0.117323,-0.1006 l -0.01324,-0.0253 0.0438,-0.11224 c 0.02409,-0.0617 0.06234,-0.15955 0.085,-0.21739 l 0.04119,-0.10515 5.110781,-0.004 c 3.156376,-0.002 5.271364,-0.007 5.530698,-0.0116 0.684096,-0.0127 0.92568,-0.0288 0.93842,-0.0623 0.0185,-0.0487 -0.118298,-0.30633 -0.338282,-0.63722 -0.259892,-0.39091 -0.52496,-0.73801 -0.817966,-1.07111 l -0.134802,-0.15325 -0.661656,-0.005 c -0.36391,-0.003 -1.22185,-0.008 -1.906534,-0.0121 -3.893225,-0.0227 -6.223813,-0.0376 -6.226072,-0.0398 -0.001,-0.001 0.08232,-0.0941 0.185254,-0.20672 l 0.187158,-0.20481 0.483522,-0.005 c 0.265937,-0.003 1.003584,-0.008 1.639216,-0.0121 4.315862,-0.0276 5.474262,-0.0461 5.642834,-0.0898 0.05683,-0.0147 0.03496,-0.0464 -0.179208,-0.25966 -0.36704,-0.36543 -0.861754,-0.78622 -1.654214,-1.40704 l -0.319128,-0.25001 -0.186256,-1e-5 c -0.102442,0 -0.691268,-0.005 -1.308506,-0.0111 -1.076726,-0.0106 -1.393589,-0.0178 -1.496646,-0.0341 -0.05258,-0.008 -0.09011,-0.0246 -0.09011,-0.0391 0,-0.0173 0.04639,-0.0539 0.215532,-0.17031 0.09197,-0.0633 0.205682,-0.14221 0.25269,-0.17536 l 0.08547,-0.0603 0.523964,-4e-4 c 0.547136,-4e-4 0.913512,-0.009 1.014484,-0.0225 0.07796,-0.0108 0.110704,-0.0265 0.11392,-0.0546 0.0021,-0.0185 -0.0076,-0.0312 -0.07459,-0.0966 -0.09459,-0.0924 -0.172936,-0.15372 -0.44488,-0.34803 l -0.211938,-0.15144 0.41977,-0.30444 c 0.920276,-0.66742 1.394106,-1.03056 2.29253,-1.75698 0.273298,-0.22097 0.498362,-0.40176 0.500142,-0.40176 0.0122,0 0.495136,0.44043 0.615724,0.56153 0.320024,0.32136 0.707582,0.75566 1.004438,1.12556 0.348118,0.43377 0.63555,0.8827 0.875386,1.36725 0.383366,0.77452 0.609564,1.5494 0.695406,2.38225 0.03756,0.36443 0.02929,0.4945 -0.06024,0.94759 -0.136862,0.69261 -0.281006,1.19549 -0.482514,1.68338 -0.03687,0.0893 -0.09967,0.23189 -0.200434,0.45522 l -0.02431,0.0539 -3.66118,1.6e-4 c -3.662251,1.6e-4 -6.08354,0.008 -7.005631,0.0221 -0.453692,0.007 -0.801835,0.0179 -0.839192,0.026 -0.0085,0.002 -0.02764,-0.001 -0.04248,-0.006 z"
       id="path1065"
       inkscape:connector-curvature="0" />
    <path
       style="fill:#fa6676;fill-opacity:1;stroke-width:0.16129033;stroke-linejoin:round;stroke-miterlimit:4;stroke-dasharray:none"
       d="m 28.722893,218.33656 c -0.02346,-0.0829 -0.01681,-3.44158 0.0076,-3.8578 0.07401,-1.25985 0.217983,-1.81118 0.735493,-2.81653 0.445461,-0.86538 0.903127,-1.45683 1.896136,-2.45038 1.070488,-1.07107 2.053973,-1.8662 3.798623,-3.0711 0.43115,-0.29776 0.878202,-0.62356 1.90985,-1.39183 1.612326,-1.20069 2.951478,-2.53586 3.66827,-3.65734 0.155196,-0.24281 0.396822,-0.70399 0.525372,-1.00273 0.183304,-0.42601 0.364734,-0.97611 0.427864,-1.29732 0.02232,-0.11356 0.02391,-0.0907 0.03202,0.46089 0.0122,0.83012 -0.01004,3.42428 -0.03256,3.79805 -0.0253,0.41979 -0.04227,0.5394 -0.121842,0.85871 -0.199374,0.8001 -0.538182,1.56691 -1.019652,2.30776 -0.168518,0.25929 -0.473252,0.66897 -0.660252,0.88763 -0.324602,0.37955 -1.185878,1.23544 -1.763976,1.75295 -0.538796,0.48233 -1.909006,1.51698 -3.127254,2.3614 -1.747954,1.21158 -2.872249,2.12186 -3.849759,3.11694 -1.309756,1.33331 -2.006619,2.46019 -2.345634,3.79306 -0.0575,0.22607 -0.06767,0.25236 -0.08034,0.20764 z"
       id="path1123"
       inkscape:connector-curvature="0" />
    <path
       style="fill:#e03b53;fill-opacity:1;stroke-width:0.09940358;stroke-linejoin:round;stroke-miterlimit:4;stroke-dasharray:none"
       d="m 31.522375,191.39374 c -0.901098,-0.92344 -1.227142,-1.29841 -1.560501,-1.79465 -0.556206,-0.82796 -0.92898,-1.67995 -1.130951,-2.58482 -0.07472,-0.33475 -0.08746,-0.5076 -0.101992,-1.38341 -0.01582,-0.95367 -0.01841,-3.5561 -0.0036,-3.58122 0.01449,-0.0245 0.0072,-0.0467 0.07231,0.22001 0.191464,0.78413 0.625157,1.68386 1.204359,2.49855 0.330916,0.46546 0.697426,0.88761 1.201068,1.38341 0.767702,0.75575 1.641359,1.47524 3.022953,2.48953 0.388194,0.285 0.563492,0.41884 0.744858,0.5687 0.09876,0.0816 0.102498,0.0862 0.08427,0.10334 -0.01048,0.01 -0.13506,0.10489 -0.27682,0.21116 -0.97764,0.73286 -2.094446,1.60265 -2.577451,2.00738 -0.107043,0.0897 -0.218295,0.18267 -0.247225,0.20661 l -0.0526,0.0435 z"
       id="path1136"
       inkscape:connector-curvature="0" />
    <path
       style="fill:#49b7c2;fill-opacity:1;stroke-width:0.18518519;stroke-linejoin:round;stroke-miterlimit:4;stroke-dasharray:none"
       d="m 28.719332,201.48901 c -0.02255,-0.29554 3.2e-4,-3.91594 0.02625,-4.15494 0.02945,-0.27139 0.107398,-0.69717 0.181141,-0.98941 0.34229,-1.35648 1.054443,-2.49602 2.40788,-3.85292 0.677205,-0.67893 1.23917,-1.13703 3.221593,-2.62614 0.708288,-0.53203 0.709174,-0.53268 1.276728,-0.93637 0.812196,-0.57769 1.865446,-1.39032 2.400848,-1.85236 0.645726,-0.55724 1.363432,-1.26381 1.755054,-1.72782 0.805696,-0.95464 1.290832,-1.8114 1.60895,-2.84144 l 0.1029,-0.33318 -0.0086,0.53896 c -0.0048,0.29643 -0.01306,1.3572 -0.01846,2.35725 l -0.0098,1.81829 -0.127606,0.43177 c -0.247056,0.83595 -0.47914,1.36552 -0.873446,1.99302 -0.641632,1.02109 -1.8519,2.27122 -3.386002,3.49752 -0.636482,0.50877 -1.138844,0.87745 -1.982724,1.45511 -0.296432,0.20291 -0.666848,0.4677 -0.823148,0.58842 -0.1563,0.12072 -0.416474,0.31496 -0.578164,0.43164 -1.07236,0.77383 -1.83875,1.4125 -2.633355,2.19449 -1.039023,1.02253 -1.450546,1.57738 -1.991559,2.68519 -0.252782,0.51762 -0.330833,0.72044 -0.439687,1.14259 l -0.09451,0.36652 z"
       id="path1149"
       inkscape:connector-curvature="0" />
    <path
       style="fill:#2e9194;fill-opacity:1;stroke-width:0.11415526;stroke-linejoin:round;stroke-miterlimit:4;stroke-dasharray:none"
       d="m 41.694991,218.23929 c -0.01652,-0.0208 -0.05136,-0.12476 -0.110548,-0.32973 -0.376344,-1.30334 -1.297514,-2.69069 -2.575038,-3.87818 -0.808636,-0.75165 -2.022202,-1.71945 -3.286148,-2.62065 -0.202666,-0.1445 -0.37529,-0.26928 -0.38361,-0.27729 -0.01194,-0.0115 0.02485,-0.0435 0.175182,-0.15249 1.320986,-0.95746 1.833576,-1.34722 2.58847,-1.96819 l 0.440972,-0.36275 0.386606,0.3894 c 0.572392,0.57653 0.969262,1.00851 1.260416,1.37191 0.371492,0.46368 0.856082,1.32152 1.116812,1.97702 0.13884,0.34907 0.288554,0.86562 0.3344,1.15378 0.06979,0.43865 0.09073,1.08595 0.104566,3.23178 0.0085,1.31076 6e-4,1.53181 -0.05208,1.46539 z"
       id="path1162"
       inkscape:connector-curvature="0" />
    <path
       style="fill:#1d7c82;fill-opacity:1;stroke-width:0.08650519;stroke-linejoin:round;stroke-miterlimit:4;stroke-dasharray:none"
       d="m 31.799117,208.38957 c -0.182618,-0.1693 -0.903267,-0.90613 -1.228428,-1.25601 -0.217564,-0.23411 -0.414783,-0.48873 -0.627556,-0.81023 -0.69494,-1.05005 -1.117578,-2.18166 -1.195662,-3.20137 -0.01442,-0.18833 -0.0066,-0.66334 0.01374,-0.83147 0.05137,-0.42521 0.143706,-0.82741 0.29321,-1.27714 0.06262,-0.18835 0.164844,-0.46972 0.173984,-0.47886 0.0022,-0.002 0.01691,0.007 0.03262,0.02 0.02785,0.0234 0.05513,0.0287 0.141589,0.0275 0.02539,-4e-4 0.02988,0.005 0.0595,0.069 0.129365,0.2803 0.63167,0.99547 1.064086,1.51502 l 0.153143,0.18401 -0.380258,0.002 -0.380258,0.002 -0.02228,0.0251 c -0.01225,0.0138 -0.03468,0.0494 -0.04983,0.0792 -0.02622,0.0515 -0.02755,0.0596 -0.02755,0.16714 0,0.16008 0.01989,0.28144 0.0588,0.3587 0.01716,0.0341 0.03774,0.0674 0.04571,0.074 0.008,0.007 0.0145,0.0177 0.0145,0.0247 0,0.0106 0.121084,0.007 0.763367,0.01 l 0.763366,0.003 0.02609,0.0343 c 0.162951,0.21445 0.837221,0.78749 1.720385,1.47198 l 0.298663,0.23148 -1.324878,-6e-4 c -1.095359,0.002 -1.285701,-0.005 -1.285701,0.006 0,0.007 -0.0058,0.0149 -0.01285,0.0177 -0.0071,0.003 -0.02973,0.0386 -0.05035,0.0799 l -0.0375,0.0749 v 0.17783 c 0,0.16355 0.0016,0.18091 0.01956,0.21617 0.03492,0.0684 0.0648,0.10741 0.08236,0.10741 0.0094,0 0.01709,0.004 0.01709,0.009 0,0.006 0.602566,0.009 1.789386,0.009 h 1.789385 l 0.06693,0.0664 c 0.03681,0.0365 0.116314,0.10113 0.176678,0.14363 0.134714,0.0948 0.318638,0.23375 0.334054,0.25233 0.0091,0.011 0.0089,0.0167 -0.0012,0.0289 -0.03047,0.0368 -0.471242,0.37951 -0.969277,0.75358 -0.895717,0.67278 -1.345005,1.02224 -1.891637,1.47134 -0.121454,0.0998 -0.239832,0.19503 -0.26306,0.21164 l -0.04223,0.0302 z"
       id="path1177"
       inkscape:connector-curvature="0"
       sodipodi:nodetypes="ccscssccccsccccsscsssccsccscccscsssccsccssccc" />
  </g>
</svg>
