<?xml version="1.0" encoding="UTF-8" standalone="no"?>
<!-- Created with Inkscape (http://www.inkscape.org/) -->

<svg
   xmlns:dc="http://purl.org/dc/elements/1.1/"
   xmlns:cc="http://creativecommons.org/ns#"
   xmlns:rdf="http://www.w3.org/1999/02/22-rdf-syntax-ns#"
   xmlns:svg="http://www.w3.org/2000/svg"
   xmlns="http://www.w3.org/2000/svg"
   xmlns:sodipodi="http://sodipodi.sourceforge.net/DTD/sodipodi-0.dtd"
   xmlns:inkscape="http://www.inkscape.org/namespaces/inkscape"
   width="63.323643mm"
   height="77.602829mm"
   viewBox="0 0 63.323644 77.602828"
   version="1.1"
   id="svg8"
   inkscape:version="0.92.4 (5da689c313, 2019-01-14)"
   sodipodi:docname="guichet.svg">
  <defs
     id="defs2" />
  <sodipodi:namedview
     id="base"
     pagecolor="#ffffff"
     bordercolor="#666666"
     borderopacity="1.0"
     inkscape:pageopacity="0.0"
     inkscape:pageshadow="2"
     inkscape:zoom="2.8"
     inkscape:cx="112.65859"
     inkscape:cy="131.28195"
     inkscape:document-units="mm"
     inkscape:current-layer="layer1"
     showgrid="false"
     fit-margin-top="0"
     fit-margin-left="0"
     fit-margin-right="0"
     fit-margin-bottom="0"
     inkscape:window-width="1920"
     inkscape:window-height="1017"
     inkscape:window-x="-8"
     inkscape:window-y="-8"
     inkscape:window-maximized="1" />
  <metadata
     id="metadata5">
    <rdf:RDF>
      <cc:Work
         rdf:about="">
        <dc:format>image/svg+xml</dc:format>
        <dc:type
           rdf:resource="http://purl.org/dc/dcmitype/StillImage" />
        <dc:title></dc:title>
      </cc:Work>
    </rdf:RDF>
  </metadata>
  <g
     inkscape:label="Calque 1"
     inkscape:groupmode="layer"
     id="layer1"
     transform="translate(-71.119316,-111.18501)">
    <rect
       style="fill:#a05a2c;fill-opacity:1;stroke:none;stroke-width:0.09044083;stroke-linecap:round;stroke-linejoin:bevel;stroke-miterlimit:4;stroke-dasharray:none;stroke-opacity:1"
       id="rect815"
       width="63.273216"
       height="19.906298"
       x="71.119316"
       y="168.88155" />
    <rect
       style="fill:#a05a2c;fill-opacity:1;stroke:none;stroke-width:0.12429977;stroke-linecap:round;stroke-linejoin:bevel;stroke-miterlimit:4;stroke-dasharray:none;stroke-opacity:1"
       id="rect817"
       width="14.092614"
       height="37.063332"
       x="71.119316"
       y="131.81822" />
    <rect
       style="fill:#a05a2c;fill-opacity:1;stroke:none;stroke-width:0.12429975;stroke-linecap:round;stroke-linejoin:bevel;stroke-miterlimit:4;stroke-dasharray:none;stroke-opacity:1"
       id="rect817-3"
       width="14.092614"
       height="37.063328"
       x="120.29991"
       y="131.81822" />
    <path
       style="fill:#a05a2c;stroke:none;stroke-width:0.12961882px;stroke-linecap:butt;stroke-linejoin:miter;stroke-opacity:1"
       d="m 71.119318,131.81823 v -20.63322 h 63.323642 l -0.0504,20.63322 h -14.09262 c -0.48087,-16.21344 -34.935317,-15.90044 -35.087963,0 H 71.119378"
       id="path836"
       inkscape:connector-curvature="0"
       sodipodi:nodetypes="ccccccc" />
    <rect
       style="fill:#d38d5f;fill-opacity:1;stroke:none;stroke-width:0.1195351;stroke-linecap:round;stroke-linejoin:bevel;stroke-miterlimit:4;stroke-dasharray:none;stroke-opacity:1"
       id="rect840"
       width="40.731888"
       height="3.8486831"
       x="82.485764"
       y="166.20796" />
    <rect
       style="fill:#784421;fill-opacity:1;stroke:none;stroke-width:0.12647471;stroke-linecap:round;stroke-linejoin:bevel;stroke-miterlimit:4;stroke-dasharray:none;stroke-opacity:1"
       id="rect842"
       width="8.8198929"
       height="58.434357"
       x="73.665901"
       y="113.32317"
       ry="0.83776861" />
    <rect
       style="fill:#784421;fill-opacity:1;stroke:none;stroke-width:0.1195351;stroke-linecap:round;stroke-linejoin:bevel;stroke-miterlimit:4;stroke-dasharray:none;stroke-opacity:1"
       id="rect844"
       width="3.6883197"
       height="0.85526246"
       x="76.873131"
       y="122.41033"
       ry="0.42763123" />
    <rect
       style="fill:#784421;fill-opacity:1;stroke:none;stroke-width:0.13916722;stroke-linecap:round;stroke-linejoin:bevel;stroke-miterlimit:4;stroke-dasharray:none;stroke-opacity:1"
       id="rect846"
       width="8.3387909"
       height="58.837154"
       x="123.21765"
       y="113.10937"
       ry="0.83879435" />
    <rect
       style="fill:none;fill-opacity:1;stroke:#cf7d4e;stroke-width:1.49124932;stroke-linecap:round;stroke-linejoin:bevel;stroke-miterlimit:4;stroke-dasharray:none;stroke-opacity:1"
       id="rect848"
       width="57.069557"
       height="11.837935"
       x="74.166191"
       y="174.71709"
       ry="0.4276312" />
    <path
       style="fill:#d38d5f;stroke:#cf7d4e;stroke-width:1.50153732;stroke-linecap:butt;stroke-linejoin:miter;stroke-miterlimit:4;stroke-dasharray:none;stroke-opacity:1"
       d="m 74.166191,174.71709 57.069529,11.83794"
       id="path850"
       inkscape:connector-curvature="0"
       sodipodi:nodetypes="cc" />
    <path
       style="fill:none;stroke:#cf7d4e;stroke-width:1.50153732;stroke-linecap:butt;stroke-linejoin:miter;stroke-miterlimit:4;stroke-dasharray:none;stroke-opacity:1"
       d="M 131.23575,174.71709 74.16619,186.55503"
       id="path852"
       inkscape:connector-curvature="0"
       sodipodi:nodetypes="cc" />
  </g>
</svg>
