{
  // Evite qu'on puisse se bloquer au-dessus d'un vortex latéral
  "canBeStuckOnTopOfLateralVortices": true,

  // Evite qu'une musique recommence si on met deux fois de suite un e_music avec le même ID
  "startAgainMusicIfSameID": true,

  // Bug de l'option Partage de vies en Multi
  "lifeSharingInMulti": true,

  // Bug de l'obscurité diminuée deux fois en Multi
  "reducedDarknessInMulti": true,

  // Bug des paliers de points consécutifs
  "consecutiveScoreLevels": true,

  // Bug des litchis carapacés qui cassent l'ordre
  "lycheesBreakOrder": true,
  
  // Bug du lag progressif dans les longues parties
  "progressiveLagInLongRuns": true,

  // Bug des fraises qui peuvent se rater en lançant la balle entre elles
  "strawberriesCanMissEachOther": true,

  // Bug des rayons qui ne fonctionnent pas au respawn
  "raysAtRespawn": false,

  // Bug des rayons (hors TP) qui ne fonctionnent pas en Y = 0
  "raysOnHighestLine": false,

  // Bug des TP qui ne fonctionnent pas en Y = 0
  "teleportersOnHighestLine": false,

  // Bug des fruits qui se coincent dans une case de 1 de large
  "fruitsStuckInColumns": false,

  // Corrige le point de spawn d'un vortex latéral placé tout en bas du niveau
  "respawnOfLateralVorticesOnLowestLine": false,

  // Empêche les fruits de sauter d'une plateforme à une autre si un obstacle les en empêche
  "fruitsCanJumpIntoAPlatform": false,

  // Bugs de déplacement des scies/blobs en haut du niveau
  "crawlingBadsOnHighestLine": false,

  // Affiche "Nouvelle contrée" au niveau 0 d'une super-dim
  "displayNewLandOnFirstLevel": true
}
