<?xml version="1.0" encoding="UTF-8" standalone="no"?>
<!-- Created with Inkscape (http://www.inkscape.org/) -->

<svg
  xmlns:dc="http://purl.org/dc/elements/1.1/"
  xmlns:cc="http://creativecommons.org/ns#"
  xmlns:rdf="http://www.w3.org/1999/02/22-rdf-syntax-ns#"
  xmlns:svg="http://www.w3.org/2000/svg"
  xmlns="http://www.w3.org/2000/svg"
  xmlns:sodipodi="http://sodipodi.sourceforge.net/DTD/sodipodi-0.dtd"
  xmlns:inkscape="http://www.inkscape.org/namespaces/inkscape"
  width="20"
  height="28.695467"
  viewBox="0 0 20 28.695467"
  version="1.1"
  id="svg8"
  inkscape:version="0.92.4 (5da689c313, 2019-01-14)"
  sodipodi:docname="combat.svg">
 <defs
   id="defs2" />
 <sodipodi:namedview
   id="base"
   pagecolor="#ffffff"
   bordercolor="#666666"
   borderopacity="1.0"
   inkscape:pageopacity="0.0"
   inkscape:pageshadow="2"
   inkscape:zoom="16"
   inkscape:cx="11.924755"
   inkscape:cy="10.993426"
   inkscape:document-units="px"
   inkscape:current-layer="layer1"
   showgrid="false"
   fit-margin-top="0"
   fit-margin-left="0"
   fit-margin-right="0"
   fit-margin-bottom="0"
   inkscape:snap-global="true"
   inkscape:window-width="1366"
   inkscape:window-height="705"
   inkscape:window-x="-8"
   inkscape:window-y="-8"
   inkscape:window-maximized="1"
   units="px" />
 <metadata
   id="metadata5">
  <rdf:RDF>
   <cc:Work
     rdf:about="">
    <dc:format>image/svg+xml</dc:format>
    <dc:type
      rdf:resource="http://purl.org/dc/dcmitype/StillImage" />
    <dc:title></dc:title>
   </cc:Work>
  </rdf:RDF>
 </metadata>
 <g
   inkscape:label="Calque 1"
   inkscape:groupmode="layer"
   id="layer1"
   transform="translate(-61.350262,-253.35906)">
  <g
    id="g1989"
    transform="matrix(17.745127,0,0,17.745127,-1027.318,-4723.0368)">
   <path
     style="fill:#000000;fill-rule:evenodd;stroke:none;stroke-width:0.07000434"
     inkscape:connector-curvature="0"
     id="path826-7-6"
     d="m 62.477331,280.62283 v 1.22157 q -0.007,0.20301 -0.185512,0.21001 l -0.672042,-0.007 q -0.122507,0.0105 -0.185511,-0.028 q -0.077,-0.042 -0.084,-0.14001 v -1.28458 l 0.0035,-0.0455 l 0.007,-0.021 q 0.0525,-0.0875 0.248516,-0.091 h 0.64754 q 0.210013,0.0245 0.220514,0.17852 v 0.007" />
   <path
     sodipodi:nodetypes="cccccccccsc"
     style="fill:#ffffff;fill-rule:evenodd;stroke:none;stroke-width:0.07000434"
     inkscape:connector-curvature="0"
     id="path828-2-1"
     d="m 62.249824,280.48331 c 0.112007,0.0117 0.171511,0.0572 0.178512,0.13651 v 1.22507 c -0.0023,0.10501 -0.05017,0.15984 -0.143509,0.16451 l -0.64754,-0.007 h -0.021 c -0.144675,0.014 -0.220513,-0.028 -0.227514,-0.12601 v -1.27758 l 0.007,-0.0455 c 0.03033,-0.0467 0.100338,-0.07 0.210013,-0.07 h 0.644039" />
   <path
     transform="matrix(0.80978229,0,0,0.80978229,13.6924,51.470568)"
     d="m 59.597656,283.1543 c -0.01882,0.002 -0.03567,0.0113 -0.05273,0.0195 c -0.01936,-0.007 -0.03798,-0.018 -0.05859,-0.0176 h -0.107422 c -0.06633,-5e-5 -0.116628,0.0491 -0.142578,0.10937 h -0.05469 c -0.08745,-6e-5 -0.166088,0.0786 -0.166016,0.16602 v 0.22656 c -2.59e-4,0.0328 0.01137,0.0624 0.0293,0.0898 c -0.01792,0.0274 -0.02955,0.0571 -0.0293,0.0898 a 0.06340865,0.06340865 0 0 0 0,0.002 c 0.0017,0.0673 0.0019,0.13656 0.0039,0.20899 c 0.0016,0.0864 0.07962,0.16219 0.166016,0.16211 h 0.09766 c 0.0058,0.0241 0.01752,0.0472 0.0332,0.0664 c 0.03211,0.0394 0.08397,0.0619 0.134766,0.0606 c 0.07884,-0.002 0.15892,-0.004 0.238281,-0.006 c 0.04952,-4.2e-4 0.09809,-0.0237 0.128906,-0.0625 a 0.06340865,0.06340865 0 0 0 0.002,0 c 0.0222,-0.0283 0.02192,-0.0418 0.0293,-0.0605 c 0.02682,0.002 0.05408,0.01 0.111329,-0.008 c 0.04918,-0.0156 0.09039,-0.0548 0.107421,-0.10351 c 0.01799,-0.0508 0.01995,-0.0964 0.01758,-0.12891 c -0.0012,-0.0163 -0.0041,-0.0281 -0.0059,-0.0371 c -3.65e-4,-0.002 -0.0017,-0.002 -0.002,-0.004 c 7.3e-5,-0.003 4.7e-5,-0.005 0,-0.008 c 4.31e-4,-0.002 -1.98e-4,-0.003 0,-0.004 c 0.0017,-0.008 0.0018,-0.0118 0.002,-0.0156 c 6.98e-4,-0.0155 -0.0011,-0.0313 -0.002,-0.0527 c -4.86e-4,-0.0121 -0.0065,-0.0471 -0.02344,-0.084 c 0.02546,-0.0303 0.04324,-0.0658 0.04297,-0.10547 v -0.22656 c 7.2e-5,-0.0874 -0.07857,-0.16608 -0.166015,-0.16602 h -0.06641 c -0.02551,-0.0611 -0.07563,-0.11138 -0.142578,-0.11132 h -0.105468 c -0.0052,-2.5e-4 -0.01233,-2.5e-4 -0.01758,0 a 0.06340865,0.06340865 0 0 0 -0.002,0 z m -0.02539,0.53906 l 0.0098,0.0391 h 0.002 l -0.002,0.002 l 0.01367,0.0488 h -0.01758 l -0.0098,-0.0234 l -0.01172,0.0234 l -0.03906,-0.002 l 0.0293,-0.0469 h 0.01172 l -0.0039,-0.0117 z"
     id="path898-1-2"
     style="opacity:1;fill:#000000;fill-opacity:1;fill-rule:evenodd;stroke:none;stroke-width:0.17239481px;stroke-linecap:butt;stroke-linejoin:miter;stroke-opacity:1"
     inkscape:original="M 59.603516 283.2168 A 0.10343544 0.10343544 0 0 0 59.550781 283.23828 A 0.10343544 0.10343544 0 0 0 59.488281 283.21875 L 59.378906 283.21875 A 0.10343544 0.10343544 0 0 0 59.275391 283.32227 L 59.275391 283.32812 L 59.181641 283.32812 A 0.10343544 0.10343544 0 0 0 59.078125 283.43164 L 59.078125 283.6582 A 0.10343544 0.10343544 0 0 0 59.128906 283.74805 A 0.10343544 0.10343544 0 0 0 59.078125 283.83789 C 59.079885 283.90613 59.080086 283.97545 59.082031 284.04688 A 0.10343544 0.10343544 0 0 0 59.185547 284.14844 L 59.335938 284.14844 A 0.10343544 0.10343544 0 0 0 59.345703 284.14844 A 0.10343544 0.10343544 0 0 0 59.449219 284.27539 C 59.528809 284.27338 59.609555 284.27154 59.689453 284.26953 A 0.10343544 0.10343544 0 0 0 59.769531 284.23047 C 59.798699 284.19335 59.804923 284.16531 59.810547 284.15039 C 59.837358 284.15152 59.874625 284.16107 59.941406 284.14062 A 0.10343544 0.10343544 0 0 0 60.007812 284.07617 C 60.037552 283.99212 60.014827 283.93812 60.015625 283.92578 A 0.10343544 0.10343544 0 0 0 60.011719 283.89453 C 60.017954 283.92013 60.017338 283.89202 60.015625 283.84961 C 60.014769 283.8284 60.014767 283.79043 59.976562 283.75391 C 59.97544 283.75283 59.97381 283.75492 59.972656 283.75391 A 0.10343544 0.10343544 0 0 0 60.035156 283.6582 L 60.035156 283.43164 A 0.10343544 0.10343544 0 0 0 59.931641 283.32812 L 59.826172 283.32812 L 59.826172 283.32031 A 0.10343544 0.10343544 0 0 0 59.722656 283.2168 L 59.613281 283.2168 A 0.10343544 0.10343544 0 0 0 59.603516 283.2168 z M 59.552734 283.73828 A 0.10343544 0.10343544 0 0 0 59.556641 283.74219 A 0.10343544 0.10343544 0 0 0 59.550781 283.74023 A 0.10343544 0.10343544 0 0 0 59.552734 283.73828 z M 59.570312 283.74805 A 0.10343544 0.10343544 0 0 0 59.601562 283.75781 A 0.10343544 0.10343544 0 0 0 59.595703 283.76562 C 59.594903 283.76682 59.59455 283.76833 59.59375 283.76953 A 0.10343544 0.10343544 0 0 0 59.570312 283.74805 z "
     inkscape:radius="0.06340231"
     sodipodi:type="inkscape:offset" />
   <g
     transform="matrix(0.8097823,0,0,0.8097823,13.692399,51.470565)"
     id="g4726">
    <path
      sodipodi:type="inkscape:offset"
      inkscape:radius="0.1034251"
      inkscape:original="M 59.613281 283.32031 L 59.613281 283.6543 L 59.722656 283.6543 L 59.722656 283.32031 L 59.613281 283.32031 z M 59.378906 283.32227 L 59.378906 283.6582 L 59.488281 283.6582 L 59.488281 283.32227 L 59.378906 283.32227 z M 59.181641 283.43164 L 59.181641 283.6582 L 59.289062 283.6582 L 59.289062 283.43164 L 59.181641 283.43164 z M 59.822266 283.43164 L 59.822266 283.6582 L 59.931641 283.6582 L 59.931641 283.43164 L 59.822266 283.43164 z M 59.681641 283.82227 C 59.603691 283.93911 59.525214 284.05503 59.447266 284.17188 C 59.527016 284.16987 59.607753 284.16802 59.6875 284.16602 C 59.71665 284.12892 59.716278 284.06692 59.767578 284.05078 C 59.814408 284.04378 59.864428 284.05502 59.910156 284.04102 C 59.922186 284.00702 59.909552 283.95947 59.912109 283.91992 C 59.903509 283.88462 59.93386 283.81103 59.875 283.82617 C 59.81085 283.82417 59.745339 283.82427 59.681641 283.82227 z M 59.181641 283.83594 C 59.183441 283.90574 59.183647 283.97516 59.185547 284.04492 L 59.335938 284.04492 C 59.394818 283.97512 59.45477 283.90571 59.513672 283.83594 L 59.181641 283.83594 z "
      style="opacity:1;fill:#e95910;fill-opacity:1;fill-rule:evenodd;stroke:none;stroke-width:0.17239481px;stroke-linecap:butt;stroke-linejoin:miter;stroke-opacity:1"
      id="path898-1"
      d="m 59.603516,283.2168 a 0.10343544,0.10343544 0 0 0 -0.05273,0.0215 a 0.10343544,0.10343544 0 0 0 -0.0625,-0.0195 h -0.109375 a 0.10343544,0.10343544 0 0 0 -0.103515,0.10352 v 0.006 h -0.09375 a 0.10343544,0.10343544 0 0 0 -0.103516,0.10352 v 0.22656 a 0.10343544,0.10343544 0 0 0 0.05078,0.0898 a 0.10343544,0.10343544 0 0 0 -0.05078,0.0898 c 0.0018,0.0682 0.002,0.13756 0.0039,0.20899 a 0.10343544,0.10343544 0 0 0 0.103516,0.10156 h 0.150391 a 0.10343544,0.10343544 0 0 0 0.0098,0 a 0.10343544,0.10343544 0 0 0 0.103516,0.12695 c 0.07959,-0.002 0.160336,-0.004 0.240234,-0.006 a 0.10343544,0.10343544 0 0 0 0.08008,-0.0391 c 0.02917,-0.0371 0.03539,-0.0652 0.04102,-0.0801 c 0.02681,0.001 0.06408,0.0107 0.130859,-0.01 a 0.10343544,0.10343544 0 0 0 0.06641,-0.0645 c 0.02974,-0.084 0.007,-0.13805 0.0078,-0.15039 a 0.10343544,0.10343544 0 0 0 -0.0039,-0.0312 c 0.0062,0.0256 0.0056,-0.003 0.0039,-0.0449 c -8.56e-4,-0.0212 -8.58e-4,-0.0592 -0.03906,-0.0957 c -0.0011,-0.001 -0.0028,0.001 -0.0039,0 a 0.10343544,0.10343544 0 0 0 0.0625,-0.0957 v -0.22656 a 0.10343544,0.10343544 0 0 0 -0.103515,-0.10352 h -0.105469 v -0.008 a 0.10343544,0.10343544 0 0 0 -0.103516,-0.10351 h -0.109375 a 0.10343544,0.10343544 0 0 0 -0.0098,0 z m -0.05078,0.52148 a 0.10343544,0.10343544 0 0 0 0.0039,0.004 a 0.10343544,0.10343544 0 0 0 -0.0059,-0.002 a 0.10343544,0.10343544 0 0 0 0.002,-0.002 z m 0.01758,0.01 a 0.10343544,0.10343544 0 0 0 0.03125,0.01 a 0.10343544,0.10343544 0 0 0 -0.0059,0.008 c -8e-4,0.001 -0.0012,0.003 -0.002,0.004 a 0.10343544,0.10343544 0 0 0 -0.02344,-0.0215 z" />
    <path
      style="fill:#000000;fill-rule:evenodd;stroke:none;stroke-width:0.1723948px;stroke-linecap:butt;stroke-linejoin:miter;stroke-opacity:1"
      d="m 59.613676,283.31938 c 0,0.11145 0,0.22289 0,0.33434 c 0.03635,0 0.07269,0 0.109037,0 c 0,-0.11145 0,-0.22289 0,-0.33434 c -0.03635,0 -0.07269,0 -0.109037,0 z m -0.234094,0.003 c 0,0.11162 0,0.22324 0,0.33486 c 0.03635,0 0.07269,0 0.109037,0 c 0,-0.11162 0,-0.22324 0,-0.33486 c -0.03635,0 -0.07269,0 -0.109037,0 z m 0.443384,0.10904 c 0,0.0753 0,0.15055 0,0.22582 c 0.03635,0 0.07269,0 0.109037,0 c 0,-0.0753 0,-0.15055 0,-0.22582 c -0.03635,0 -0.07269,0 -0.109037,0 z m -0.641822,10e-4 c 0,0.0753 0,0.15055 0,0.22583 c 0.03617,0 0.07235,0 0.108521,0 c 0,-0.0753 0,-0.15055 0,-0.22583 c -0.03617,0 -0.07235,0 -0.108521,0 z m 0.500745,0.38913 c -0.07795,0.11684 -0.156146,0.23352 -0.234094,0.35036 c 0.07975,-0.002 0.159515,-0.003 0.239262,-0.005 c 0.02915,-0.0371 0.03013,-0.0997 0.08143,-0.11584 c 0.04683,-0.007 0.09611,0.004 0.141838,-0.01 c 0.01203,-0.034 -2.57e-4,-0.0822 0.0023,-0.12175 c -0.0086,-0.0353 0.02081,-0.10844 -0.03805,-0.0933 c -0.06415,-0.002 -0.129031,-0.002 -0.192729,-0.004 z m -0.500745,0.0139 c 0.0018,0.0698 0.0033,0.13953 0.0052,0.20929 c 0.04995,0 0.09991,0 0.149862,0 c 0.05888,-0.0698 0.117831,-0.13952 0.176733,-0.20929 c -0.110598,0 -0.221197,0 -0.331795,0 z"
      id="path898"
      inkscape:connector-curvature="0" />
   </g>
   <path
     inkscape:connector-curvature="0"
     id="path898-1-5"
     d="m 61.958197,280.81434 a 0.08376019,0.08376019 0 0 0 -0.04268,0.0176 a 0.08376019,0.08376019 0 0 0 -0.05063,-0.0159 h -0.0883 a 0.08376019,0.08376019 0 0 0 -0.08411,0.0841 v 0.005 h -0.07575 a 0.08376019,0.08376019 0 0 0 -0.08411,0.0837 v 0.18371 a 0.08376019,0.08376019 0 0 0 0.04143,0.0724 a 0.08376019,0.08376019 0 0 0 -0.04143,0.0728 c 0.0015,0.0552 0.0018,0.11164 0.0033,0.16948 a 0.08376019,0.08376019 0 0 0 0.0611,0.0791 c 0.01907,-0.0597 0.03275,-0.12159 0.05398,-0.18036 c 0.08201,-0.15125 0.212797,-0.26787 0.331844,-0.38959 c 0.05747,-0.0754 0.159286,-0.0813 0.246058,-0.0912 a 0.08376019,0.08376019 0 0 0 -0.005,0 h -0.08537 v -0.006 a 0.08376019,0.08376019 0 0 0 -0.08369,-0.0841 h -0.08872 a 0.08376019,0.08376019 0 0 0 -0.0079,0 z"
     style="opacity:0.25;fill:#1085e9;fill-opacity:1;fill-rule:evenodd;stroke:none;stroke-width:0.13960226px;stroke-linecap:butt;stroke-linejoin:miter;stroke-opacity:1" />
   <path
     style="opacity:0.25;fill:#000000;fill-rule:evenodd;stroke:none;stroke-width:0.07000434"
     inkscape:connector-curvature="0"
     id="path830-5-3"
     d="m 62.30232,280.54932 l 0.042,0.12601 l 0.035,0.0245 q 0.028,0.43753 -0.0385,0.87155 l -0.0385,0.21002 l 0.035,-0.028 l 0.028,-0.004 l 0.028,0.042 v 0.028 q -0.360522,0.17151 -0.756046,0.11551 l -0.09801,-0.021 l -0.0175,-0.049 l 0.0105,-0.0175 l 0.682542,-0.042 q 0.08401,-0.40603 0.08751,-0.82605 l -0.0245,-0.41303 l 0.0245,-0.0175" />
  </g>
  <g
    id="g2283"
    transform="translate(1.4180013,0.09921875)" />
 </g>
</svg>
