<?xml version="1.0" encoding="UTF-8" standalone="no"?>
<!-- Created with Inkscape (http://www.inkscape.org/) -->

<svg
  xmlns:dc="http://purl.org/dc/elements/1.1/"
  xmlns:cc="http://creativecommons.org/ns#"
  xmlns:rdf="http://www.w3.org/1999/02/22-rdf-syntax-ns#"
  xmlns:svg="http://www.w3.org/2000/svg"
  xmlns="http://www.w3.org/2000/svg"
  xmlns:sodipodi="http://sodipodi.sourceforge.net/DTD/sodipodi-0.dtd"
  xmlns:inkscape="http://www.inkscape.org/namespaces/inkscape"
  width="90"
  height="90"
  viewBox="0 0 90 90.000004"
  version="1.1"
  id="svg8"
  inkscape:version="0.92.4 (5da689c313, 2019-01-14)"
  sodipodi:docname="07.svg">
 <defs
   id="defs2" />
 <sodipodi:namedview
   id="base"
   pagecolor="#ffffff"
   bordercolor="#666666"
   borderopacity="1.0"
   inkscape:pageopacity="0.0"
   inkscape:pageshadow="2"
   inkscape:zoom="1.979899"
   inkscape:cx="18.090821"
   inkscape:cy="101.54737"
   inkscape:document-units="px"
   inkscape:current-layer="layer1"
   showgrid="false"
   units="px"
   inkscape:snap-page="true"
   inkscape:snap-global="true"
   inkscape:window-width="1366"
   inkscape:window-height="705"
   inkscape:window-x="-8"
   inkscape:window-y="-8"
   inkscape:window-maximized="1" />
 <metadata
   id="metadata5">
  <rdf:RDF>
   <cc:Work
     rdf:about="">
    <dc:format>image/svg+xml</dc:format>
    <dc:type
      rdf:resource="http://purl.org/dc/dcmitype/StillImage" />
    <dc:title></dc:title>
   </cc:Work>
  </rdf:RDF>
 </metadata>
 <g
   inkscape:label="Calque 1"
   inkscape:groupmode="layer"
   id="layer1"
   transform="translate(0,-1032.5197)">
  <path
    style="color:#000000;font-style:normal;font-variant:normal;font-weight:normal;font-stretch:normal;font-size:medium;line-height:normal;font-family:sans-serif;font-variant-ligatures:normal;font-variant-position:normal;font-variant-caps:normal;font-variant-numeric:normal;font-variant-alternates:normal;font-feature-settings:normal;text-indent:0;text-align:start;text-decoration:none;text-decoration-line:none;text-decoration-style:solid;text-decoration-color:#000000;letter-spacing:normal;word-spacing:normal;text-transform:none;writing-mode:lr-tb;direction:ltr;text-orientation:mixed;dominant-baseline:auto;baseline-shift:baseline;text-anchor:start;white-space:normal;shape-padding:0;clip-rule:nonzero;display:inline;overflow:visible;visibility:visible;opacity:1;isolation:auto;mix-blend-mode:normal;color-interpolation:sRGB;color-interpolation-filters:linearRGB;solid-color:#000000;solid-opacity:1;vector-effect:none;fill:#ffffff;fill-opacity:1;fill-rule:evenodd;stroke:none;stroke-width:1px;stroke-linecap:butt;stroke-linejoin:miter;stroke-miterlimit:4;stroke-dasharray:none;stroke-dashoffset:0;stroke-opacity:1;color-rendering:auto;image-rendering:auto;shape-rendering:auto;text-rendering:auto;enable-background:accumulate"
    d="m 6.4539624,1040.2342 l 19.8930226,1.9792 l 60.056195,2.9486 l -7.767367,-1.3821 z m 67.4667966,12.8574 l -67.1425786,1.0704 l 17.1495016,0.7268 l 50.008701,-0.7972 l -0.01562,-1 z m -53.201172,12.5 l 7.817347,1.0852 l 25.028356,0.2723 l -7.815394,-1.0852 z m 45.28125,8.2188 l -37.5,5.3574 l 18.290827,-1.6028 z m -56.9687496,10.3633 l 16.5616706,4.5325 l 48.946141,10.3737 l -16.561671,-4.5325 z m 45.4589836,20.7265 l -39.285156,12.5 l 19.168718,-5.0533 l 20.116438,-7.4503 z"
    id="path1059"
    inkscape:connector-curvature="0"
    sodipodi:nodetypes="cccccccccccccccccccccccccccccc" />
  <path
    style="color:#000000;font-style:normal;font-variant:normal;font-weight:normal;font-stretch:normal;font-size:medium;line-height:normal;font-family:sans-serif;font-variant-ligatures:normal;font-variant-position:normal;font-variant-caps:normal;font-variant-numeric:normal;font-variant-alternates:normal;font-feature-settings:normal;text-indent:0;text-align:start;text-decoration:none;text-decoration-line:none;text-decoration-style:solid;text-decoration-color:#000000;letter-spacing:normal;word-spacing:normal;text-transform:none;writing-mode:lr-tb;direction:ltr;text-orientation:mixed;dominant-baseline:auto;baseline-shift:baseline;text-anchor:start;white-space:normal;shape-padding:0;clip-rule:nonzero;display:inline;overflow:visible;visibility:visible;opacity:0.25;isolation:auto;mix-blend-mode:normal;color-interpolation:sRGB;color-interpolation-filters:linearRGB;solid-color:#000000;solid-opacity:1;vector-effect:none;fill:#ffffff;fill-opacity:1;fill-rule:evenodd;stroke:none;stroke-width:1px;stroke-linecap:butt;stroke-linejoin:miter;stroke-miterlimit:4;stroke-dasharray:none;stroke-dashoffset:0;stroke-opacity:1;color-rendering:auto;image-rendering:auto;shape-rendering:auto;text-rendering:auto;enable-background:accumulate"
    d="m 2.2304688,1039.9219 c 7.675348,4.5504 17.3911512,2.9447 26.0171242,4.3871 c 19.654813,0.7298 39.431217,2.4047 59.010958,2.5509 c 8.400514,-1.8145 -5.050897,-4.998 -8.524176,-5.0787 c -24.348871,-0.9201 -48.878473,-2.9498 -73.1152027,-3.1814 c -1.1295678,0.4407 -2.2591357,0.8814 -3.3887035,1.3221 z m 71.6582032,11.1699 c -22.652854,0.6327 -45.550365,0.1853 -68.0517223,1.4868 c -7.7170356,3.4109 7.3320073,4.2458 10.8474483,4.0048 c 19.750074,0.6419 39.523155,-0.469 59.282399,-0.5229 c -0.725642,-1.674 1.62961,-6.454 -2.078125,-4.9687 z m -57.785156,14.1562 c 11.04938,5.9434 24.341251,2.5924 36.410697,3.6901 c 10.570371,-0.8393 -0.356542,-5.3371 -5.607743,-4.9328 c -9.289315,0.056 -18.93968,-1.1843 -28.049684,0.2593 c -0.917756,0.3278 -1.835513,0.6556 -2.75327,0.9834 z m 12.113281,11.9395 c -9.033531,4.3265 5.593198,4.2319 9.422645,3.1867 c 9.975217,-0.6176 20.061095,-2.5032 29.561375,-5.176 c 6.923781,-4.7571 -7.986737,-2.8408 -11.383505,-1.9538 c -9.200172,1.3143 -18.400343,2.6287 -27.600515,3.9431 z m -23.3378908,5.9785 c 6.6370648,5.5403 16.0859568,5.8938 24.2138688,8.3274 c 15.33738,2.9687 30.672579,7.059 46.011296,9.3402 c 8.279307,-1.6068 -6.203163,-5.7745 -9.682831,-6.3234 c -18.466769,-4.8884 -37.344962,-8.0815 -55.9759275,-12.2934 c -1.5221354,0.3164 -3.0442708,0.6328 -4.5664063,0.9492 z m 48.9199218,19.8535 c -13.240152,4.5133 -27.050111,8.0238 -39.945395,13.1404 c -6.3228444,5.523 8.261901,1.8991 11.53116,0.6254 c 10.747658,-2.2763 20.734569,-6.9426 31.105641,-10.4201 c -0.273152,-2.4918 1.262255,-5.834 -2.691406,-3.3457 z"
    id="path1059-5"
    inkscape:connector-curvature="0" />
 </g>
</svg>
