<?xml version="1.0" encoding="UTF-8" standalone="no"?>
<!-- Created with Inkscape (http://www.inkscape.org/) -->

<svg
  xmlns:dc="http://purl.org/dc/elements/1.1/"
  xmlns:cc="http://creativecommons.org/ns#"
  xmlns:rdf="http://www.w3.org/1999/02/22-rdf-syntax-ns#"
  xmlns:svg="http://www.w3.org/2000/svg"
  xmlns="http://www.w3.org/2000/svg"
  xmlns:sodipodi="http://sodipodi.sourceforge.net/DTD/sodipodi-0.dtd"
  xmlns:inkscape="http://www.inkscape.org/namespaces/inkscape"
  width="145.16827"
  height="17.300913"
  viewBox="0 0 145.16827 17.300914"
  version="1.1"
  id="svg8"
  inkscape:version="0.92.4 (5da689c313, 2019-01-14)"
  sodipodi:docname="03.svg">
 <defs
   id="defs2" />
 <sodipodi:namedview
   id="base"
   pagecolor="#ffffff"
   bordercolor="#666666"
   borderopacity="1.0"
   inkscape:pageopacity="0.0"
   inkscape:pageshadow="2"
   inkscape:zoom="3.959798"
   inkscape:cx="88.979905"
   inkscape:cy="1.9725758"
   inkscape:document-units="px"
   inkscape:current-layer="layer1"
   showgrid="false"
   inkscape:snap-global="false"
   units="px"
   fit-margin-top="0"
   fit-margin-left="0"
   fit-margin-right="0"
   fit-margin-bottom="0"
   inkscape:window-width="1366"
   inkscape:window-height="705"
   inkscape:window-x="-8"
   inkscape:window-y="-8"
   inkscape:window-maximized="1" />
 <metadata
   id="metadata5">
  <rdf:RDF>
   <cc:Work
     rdf:about="">
    <dc:format>image/svg+xml</dc:format>
    <dc:type
      rdf:resource="http://purl.org/dc/dcmitype/StillImage" />
    <dc:title></dc:title>
   </cc:Work>
  </rdf:RDF>
 </metadata>
 <g
   inkscape:label="Calque 1"
   inkscape:groupmode="layer"
   id="layer1"
   transform="translate(-0.39568482,-1.152269)">
  <path
    style="fill:#ffffff;fill-rule:evenodd;stroke:none;stroke-width:0.25163919px;stroke-linecap:butt;stroke-linejoin:miter;stroke-opacity:1;opacity:0.6"
    d="m 46.503004,1.1528385 c -0.385911,9.89e-4 -0.772114,0.0033 -1.158765,0.0071 c -4.186058,0.126693 -8.959453,0.198979 -12.046732,1.291372 c 14.094802,0.788694 28.189485,1.577542 42.284287,2.366235 c 2.80026,-0.0061 13.085868,-0.505501 5.999561,-1.438266 C 70.078536,2.4050495 58.466293,1.1213155 46.503004,1.1528385 Z m 61.645776,1.80309 c -4.32227,-0.01142 -8.262444,1.760553 -1.38576,1.996298 c 7.05488,0.715529 14.41652,0.961273 21.71473,1.140214 c 4.15019,0.711063 13.66723,-0.346646 8.34854,-2.063069 c -1.01726,-0.198471 -2.2883,-0.252664 -3.41423,-0.132404 c -7.61575,-0.239517 -15.18226,-1.328023 -22.88879,-0.72993 c -0.76039,-0.145512 -1.57407,-0.208995 -2.37449,-0.211109 z m -71.367328,2.705487 c -6.802458,-0.03812 -13.432873,1.104063 -20.272856,0.630485 c 0.731148,1.485594 2.380092,2.068312 7.12177,2.111655 c 11.261494,0.347531 22.465333,1.087904 33.829466,0.836479 c 11.947815,-0.273367 23.954735,-0.199685 35.876654,-0.588718 c 7.983784,-0.536998 16.234314,-0.361877 24.170834,-0.974851 c 7.1501,-0.580252 -1.31042,-1.6364 -4.32476,-0.949279 C 105.78949,6.5659025 98.385686,6.4679255 90.980696,6.3933345 C 73.86735,6.4653225 56.790749,6.0360155 39.707695,5.7583035 c -0.979917,-0.06176 -1.954463,-0.09144 -2.926243,-0.09689 z M 14.021035,9.2698685 C 10.024591,10.035548 -0.61199544,8.9123635 0.47292526,11.112168 C 7.2244321,12.015576 14.60127,12.170377 21.736215,12.458376 C 30.758513,12.31475 39.560301,10.785745 48.666654,11.5932 c 1.120473,0.03048 2.288082,-0.01826 3.285859,-0.20088 C 39.308646,10.684813 26.664897,9.9773795 14.021035,9.2698685 Z m 119.157235,0.296915 c -7.37415,-0.0076 -14.56588,0.6695385 -21.8465,0.9830905 c -4.32577,1.955662 6.80637,2.221674 10.70433,2.212236 c 7.38247,0.0165 14.77478,-0.375053 22.02758,-0.722257 c 5.30707,-1.635684 -4.96623,-1.488134 -7.60975,-2.2528685 l -0.88927,-0.113083 l -0.90882,-0.09604 c -0.49331,-0.0069 -0.98596,-0.01057 -1.47757,-0.01108 z M 75.6379,11.513928 c -5.731836,-0.04454 -6.147769,2.865234 0.237194,2.529042 c 7.121945,0.55118 14.475812,0.08015 21.548942,-0.223042 c 5.135484,-0.668841 -1.24339,-0.91466 -0.69968,-1.792578 C 89.813364,11.445669 82.572309,12.049684 75.6379,11.513928 Z m -46.722104,2.819423 c -7.80718,0.183249 -5.413168,4.058879 1.964713,3.324606 c 7.297914,0.437112 14.726797,1.166176 22.158504,0.570818 c 6.684031,-0.284199 13.411289,-0.436372 20.140231,-0.537574 c 4.540653,-1.328844 -6.133126,-1.252449 -8.743016,-1.434857 c -2.536476,-0.07233 -5.031902,-0.23884 -7.509445,-0.429036 C 47.581577,15.346408 38.31372,14.697349 28.915796,14.333351 Z m 87.616384,0.214803 c -0.17663,2.42e-4 -0.35404,0.0043 -0.53134,0.0125 c -7.28683,0.482203 -14.76921,0.681377 -22.037794,1.126291 c -5.285425,-0.209926 -9.265187,2.023973 -1.84824,2.111655 c 6.17915,0.605449 13.031824,0.483808 18.862444,-0.452903 c 3.84592,0.24653 13.5234,-0.956247 9.09329,-2.438405 c -1.08957,-0.180452 -2.30193,-0.360847 -3.53836,-0.35914 z"
    id="path10"
    inkscape:connector-curvature="0" />
 </g>
</svg>
