<?xml version="1.0" encoding="UTF-8" standalone="no"?>
<!-- Created with Inkscape (http://www.inkscape.org/) -->

<svg
  xmlns:dc="http://purl.org/dc/elements/1.1/"
  xmlns:cc="http://creativecommons.org/ns#"
  xmlns:rdf="http://www.w3.org/1999/02/22-rdf-syntax-ns#"
  xmlns:svg="http://www.w3.org/2000/svg"
  xmlns="http://www.w3.org/2000/svg"
  xmlns:sodipodi="http://sodipodi.sourceforge.net/DTD/sodipodi-0.dtd"
  xmlns:inkscape="http://www.inkscape.org/namespaces/inkscape"
  width="21.125"
  height="19.65"
  viewBox="0 0 21.125 19.65"
  version="1.1"
  id="svg8"
  inkscape:version="0.92.4 (5da689c313, 2019-01-14)"
  sodipodi:docname="perle.svg">
 <defs
   id="defs2" />
 <sodipodi:namedview
   id="base"
   pagecolor="#ffffff"
   bordercolor="#666666"
   borderopacity="1.0"
   inkscape:pageopacity="0.0"
   inkscape:pageshadow="2"
   inkscape:zoom="16"
   inkscape:cx="13.246992"
   inkscape:cy="10.645812"
   inkscape:document-units="px"
   inkscape:current-layer="use2"
   showgrid="false"
   units="px"
   fit-margin-top="0"
   fit-margin-left="0"
   fit-margin-right="0"
   fit-margin-bottom="0"
   inkscape:window-width="1366"
   inkscape:window-height="705"
   inkscape:window-x="-8"
   inkscape:window-y="-8"
   inkscape:window-maximized="1" />
 <metadata
   id="metadata5">
  <rdf:RDF>
   <cc:Work
     rdf:about="">
    <dc:format>image/svg+xml</dc:format>
    <dc:type
      rdf:resource="http://purl.org/dc/dcmitype/StillImage" />
    <dc:title></dc:title>
   </cc:Work>
  </rdf:RDF>
 </metadata>
 <g
   inkscape:label="Calque 1"
   inkscape:groupmode="layer"
   id="layer1"
   transform="translate(-259.4375,-451.69465)">
  <g
    transform="translate(270.0125,471.34465)"
    id="use2">
   <path
     style="fill:#000000;fill-rule:evenodd;stroke:none"
     inkscape:connector-curvature="0"
     id="path828"
     d="m 0.25,-19.65 l 0.4,0.05 H 0.6 q 5.3,0.9 8.35,5 v -0.05 l 1.05,1.9 l 0.05,0.15 l 0.45,1.65 l 0.05,2.8 Q 10.1,-5.05 7.1,-2.7 h 0.05 q -1.25,1 -2.3,1.65 V -1.1 l -0.3,0.15 v 0.05 q -5.1,1.8 -8.6,0 Q -5.2,-1.25 -7.8,-3.15 v 0.05 q -2.6,-1.75 -2.75,-5.05 q -0.1,-1.2 0.2,-2.6 v -0.2 q 0.9,-4.8 3.75,-6.5 h -0.05 q 3.1,-2.1 6.85,-2.2 h 0.05" />
   <path
     style="fill:#666666;fill-rule:evenodd;stroke:none;fill-opacity:1"
     inkscape:connector-curvature="0"
     id="path830"
     d="m 4.2,-1.85 q -4.7,1.7 -7.9,0 q -1.05,-0.3 -3.55,-2.1 q -3,-2.05 -2.15,-6.65 q 0.8,-4.45 3.3,-6 q 2.85,-1.95 6.3,-2.05 l 0.2,0.05 q 4.95,0.8 7.75,4.6 l 0.9,1.6 v 0.05 q 1.9,5.3 -2.55,8.9 l -2.15,1.5 l -0.15,0.1" />
   <path
     style="fill:#ffffff;fill-rule:evenodd;stroke:none"
     inkscape:connector-curvature="0"
     id="path832"
     d="m -5.45,-13.75 q 2.1,0.95 0.5,2.85 q -0.85,0.95 -1.75,0 q -1.25,-1.3 0.35,-2.45 l 0.9,-0.4 m 4.35,-2.55 q 0.9,0 1,0.85 v 0.05 q -1.1,1.55 -1.6,-0.15 q -0.2,-0.55 0.4,-0.7 l 0.2,-0.05" />
   <path
     style="fill:#333333;fill-rule:evenodd;stroke:none;fill-opacity:1"
     inkscape:connector-curvature="0"
     id="path834"
     d="m 7.2,-13.4 l 0.75,1.35 q 1.65,4.7 -2.25,7.8 l -2,1.45 q -4.35,1.55 -7.25,0 q -0.9,-0.25 -3.25,-1.95 q -2.5,-1.8 -1.75,-5.65 q 0.65,-3.95 2.85,-5.4 q 2.65,-1.75 5.8,-1.85 q 4.5,0.8 7.1,4.25 m -5.8,-1.8 q 0.1,-1 -1.3,-1.75 q -0.75,0 -1.4,0.45 l -1,1.15 l -2.1,0.75 L -5,-14.8 q -3.35,1.15 -3,4.6 q 0.05,0.7 0.55,1.1 l 0.15,0.8 l 0.5,-0.45 l 0.15,0.05 q 1.6,0.3 2.6,-0.4 q 1.9,0.65 1.45,2.65 q -0.25,1.3 -1.6,1.95 l 3.4,0.7 Q -1.7,-4.6 -1.85,-5.9 L -2,-7.1 q -0.1,-0.95 0.35,-1.75 q 0.85,-1.6 2.5,-2.15 q 3.1,0.2 4.5,3 q 0.5,-2.2 -0.2,-4.3 Q 4.8,-13.5 3.75,-14.15 Q 2.65,-14.9 1.4,-15.2 m 0.65,1.55 q 2.65,0.65 1,2.45 q -0.55,0.55 -1.25,0.25 q -2.4,-1 -0.35,-2.45 l 0.6,-0.25 m -4.9,2.65 l 1.05,-0.35 q 0.7,0.1 0.75,0.8 v 0.1 q -1,1.75 -2.3,0.55 l 0.5,-1.1" />
   <path
     style="fill:#000000;fill-rule:evenodd;stroke:none;fill-opacity:1"
     inkscape:connector-curvature="0"
     id="path836"
     d="m 1.4,-15.2 q 1.25,0.3 2.35,1.05 q 1.05,0.65 1.4,1.85 q 0.7,2.1 0.2,4.3 q -1.4,-2.8 -4.5,-3 q -1.65,0.55 -2.5,2.15 Q -2.1,-8.05 -2,-7.1 l 0.15,1.2 q 0.15,1.3 1.05,2.1 l -3.4,-0.7 q 1.35,-0.65 1.6,-1.95 q 0.45,-2 -1.45,-2.65 l 0.7,-0.8 q 1.3,1.2 2.3,-0.55 v -0.1 q -0.05,-0.7 -0.75,-0.8 L -2.85,-11 l 0.15,-0.55 q 0.5,-0.45 0.1,-0.9 q -0.05,-1.6 -1.8,-2.15 l 2.1,-0.75 q -0.25,0.75 0.65,1.45 l 1.15,0.55 Q 0,-13.3 0.45,-13.7 q 0.85,-0.85 0.95,-1.5 m -8.2,6.45 l -0.5,0.45 l -0.15,-0.8 l 0.65,0.35 m 8.85,-4.9 l -0.6,0.25 q -2.05,1.45 0.35,2.45 q 0.7,0.3 1.25,-0.25 q 1.65,-1.8 -1,-2.45" />
   <path
     style="fill:#b5b5b5;fill-rule:evenodd;stroke:none;fill-opacity:1"
     inkscape:connector-curvature="0"
     id="path838"
     d="m -2.3,-15.35 l 1,-1.15 q 0.65,-0.45 1.4,-0.45 q 1.4,0.75 1.3,1.75 q -0.1,0.65 -0.95,1.5 Q 0,-13.3 -0.5,-13.35 l -1.15,-0.55 q -0.9,-0.7 -0.65,-1.45 m -1.75,6.25 q -1,0.7 -2.6,0.4 L -6.8,-8.75 L -7.45,-9.1 Q -7.95,-9.5 -8,-10.2 q -0.35,-3.45 3,-4.6 l 0.6,0.2 q 1.75,0.55 1.8,2.15 q 0.4,0.45 -0.1,0.9 L -2.85,-11 l -0.5,1.1 l -0.7,0.8 m 2.95,-7.2 l -0.2,0.05 q -0.6,0.15 -0.4,0.7 q 0.5,1.7 1.6,0.15 v -0.05 q -0.1,-0.85 -1,-0.85 m -4.35,2.55 l -0.9,0.4 q -1.6,1.15 -0.35,2.45 q 0.9,0.95 1.75,0 q 1.6,-1.9 -0.5,-2.85" />
  </g>
 </g>
</svg>
