<?xml version="1.0" encoding="UTF-8" standalone="no"?>
<!-- Created with Inkscape (http://www.inkscape.org/) -->

<svg
  xmlns:dc="http://purl.org/dc/elements/1.1/"
  xmlns:cc="http://creativecommons.org/ns#"
  xmlns:rdf="http://www.w3.org/1999/02/22-rdf-syntax-ns#"
  xmlns:svg="http://www.w3.org/2000/svg"
  xmlns="http://www.w3.org/2000/svg"
  xmlns:sodipodi="http://sodipodi.sourceforge.net/DTD/sodipodi-0.dtd"
  xmlns:inkscape="http://www.inkscape.org/namespaces/inkscape"
  width="20"
  height="28.695467"
  viewBox="0 0 20 28.695467"
  version="1.1"
  id="svg8"
  inkscape:version="0.92.4 (5da689c313, 2019-01-14)"
  sodipodi:docname="psy.svg">
 <defs
   id="defs2" />
 <sodipodi:namedview
   id="base"
   pagecolor="#ffffff"
   bordercolor="#666666"
   borderopacity="1.0"
   inkscape:pageopacity="0.0"
   inkscape:pageshadow="2"
   inkscape:zoom="16"
   inkscape:cx="17.264838"
   inkscape:cy="11.87241"
   inkscape:document-units="px"
   inkscape:current-layer="layer1"
   showgrid="false"
   fit-margin-top="0"
   fit-margin-left="0"
   fit-margin-right="0"
   fit-margin-bottom="0"
   inkscape:snap-global="true"
   inkscape:window-width="1366"
   inkscape:window-height="705"
   inkscape:window-x="-8"
   inkscape:window-y="-8"
   inkscape:window-maximized="1"
   units="px" />
 <metadata
   id="metadata5">
  <rdf:RDF>
   <cc:Work
     rdf:about="">
    <dc:format>image/svg+xml</dc:format>
    <dc:type
      rdf:resource="http://purl.org/dc/dcmitype/StillImage" />
    <dc:title></dc:title>
   </cc:Work>
  </rdf:RDF>
 </metadata>
 <g
   inkscape:label="Calque 1"
   inkscape:groupmode="layer"
   id="layer1"
   transform="translate(-60.760179,-255.11304)">
  <g
    id="g2283"
    transform="translate(1.4180013,0.09921875)" />
  <g
    id="g2321"
    transform="matrix(17.745127,0,0,17.745127,-1159.9108,-4724.3891)">
   <path
     style="fill:#000000;fill-rule:evenodd;stroke:none;stroke-width:0.07000434"
     inkscape:connector-curvature="0"
     id="path826-7-6-1-5-04"
     d="m 69.916146,280.79788 v 1.22157 q -0.007,0.20301 -0.185512,0.21001 l -0.672042,-0.007 q -0.122507,0.0105 -0.185511,-0.028 q -0.077,-0.042 -0.084,-0.14001 v -1.28458 l 0.0035,-0.0455 l 0.007,-0.021 q 0.0525,-0.0875 0.248516,-0.091 h 0.64754 q 0.210013,0.0245 0.220514,0.17852 v 0.007" />
   <path
     sodipodi:nodetypes="cccccccccsc"
     style="fill:#ffffff;fill-rule:evenodd;stroke:none;stroke-width:0.07000434"
     inkscape:connector-curvature="0"
     id="path828-2-1-7-7-3"
     d="m 69.688639,280.65836 c 0.112007,0.0117 0.171511,0.0572 0.178512,0.13651 v 1.22507 c -0.0023,0.10501 -0.05017,0.15984 -0.143509,0.16451 l -0.64754,-0.007 h -0.021 c -0.144675,0.014 -0.220513,-0.028 -0.227514,-0.12601 v -1.27758 l 0.007,-0.0455 c 0.03033,-0.0467 0.100338,-0.07 0.210013,-0.07 h 0.644039" />
   <path
     sodipodi:type="inkscape:offset"
     inkscape:radius="0.030850286"
     inkscape:original="M 67.960938 281.0293 C 67.855605 281.0293 67.757775 281.07993 67.669922 281.16797 C 67.637934 281.2 67.613558 281.23068 67.574219 281.2832 L 67.544922 281.31836 A 0.068994693 0.068994693 0 0 0 67.544922 281.40234 L 67.5625 281.42578 A 0.068994693 0.068994693 0 0 0 67.5625 281.42773 C 67.671323 281.56863 67.785451 281.65141 67.914062 281.66602 A 0.068994693 0.068994693 0 0 0 67.916016 281.66602 C 67.946259 281.66898 67.97981 281.66964 68.015625 281.66211 C 68.084303 281.64887 68.150806 281.61414 68.214844 281.5625 C 68.26022 281.52576 68.317468 281.46724 68.353516 281.41992 A 0.068994693 0.068994693 0 0 0 68.355469 281.41797 L 68.367188 281.40039 A 0.068994693 0.068994693 0 0 0 68.373047 281.33008 L 68.365234 281.31445 A 0.068994693 0.068994693 0 0 0 68.363281 281.3125 C 68.346982 281.28198 68.321078 281.25003 68.296875 281.2207 C 68.197598 281.10055 68.084782 281.0293 67.960938 281.0293 z "
     style="opacity:1;vector-effect:none;fill:#000000;fill-opacity:1;stroke:none;stroke-width:0.00041341;stroke-linecap:square;stroke-linejoin:round;stroke-miterlimit:4;stroke-dasharray:none;stroke-dashoffset:0;stroke-opacity:1;paint-order:markers fill stroke"
     id="path2222-0-2"
     d="m 67.960938,280.99805 c -0.115219,0 -0.220736,0.0565 -0.3125,0.14843 c -0.03341,0.0335 -0.06006,0.0663 -0.09961,0.11914 l -0.02734,0.0332 a 0.03085337,0.03085337 0 0 0 -0.002,0 c -0.02651,0.0346 -0.02651,0.0885 0,0.12305 l 0.01367,0.0156 a 0.03085337,0.03085337 0 0 0 0.002,0.002 v 0.002 a 0.03085337,0.03085337 0 0 0 0,0.002 h 0.002 a 0.03085337,0.03085337 0 0 0 0,0.002 a 0.03085337,0.03085337 0 0 0 0,0.002 c 0.111629,0.14453 0.233484,0.23414 0.373047,0.25 a 0.03085337,0.03085337 0 0 0 0.002,0 c 0.032,0.003 0.06941,0.003 0.109375,-0.006 v 0.002 c 0.07489,-0.0144 0.14599,-0.0535 0.212891,-0.10742 c 0.04797,-0.0388 0.106372,-0.0964 0.144531,-0.14649 a 0.03085337,0.03085337 0 0 0 0,-0.002 a 0.03085337,0.03085337 0 0 0 0.002,-0.002 l 0.01172,-0.0176 c 0.02075,-0.0291 0.02347,-0.0695 0.0078,-0.10156 l -0.0078,-0.0156 a 0.03085337,0.03085337 0 0 0 -0.002,-0.002 l -0.002,-0.004 a 0.03085337,0.03085337 0 0 0 -0.002,-0.002 c 0,0 -0.002,-0.002 -0.002,-0.002 c -0.01819,-0.0315 -0.0421,-0.0628 -0.06445,-0.0899 c -0.102772,-0.12438 -0.223698,-0.20312 -0.359374,-0.20312 z"
     transform="matrix(1,0,0,1.1464385,1.4100877,-41.09768)" />
   <path
     sodipodi:type="inkscape:offset"
     inkscape:radius="0.068987794"
     inkscape:original="M 67.960938 281.09766 C 67.87707 281.09766 67.79858 281.1368 67.71875 281.2168 C 67.68927 281.24632 67.667556 281.27262 67.628906 281.32422 L 67.599609 281.36133 L 67.617188 281.38477 C 67.72 281.51788 67.817947 281.58586 67.921875 281.59766 C 67.942255 281.59966 67.978163 281.59875 68.001953 281.59375 C 68.057967 281.58295 68.114955 281.55567 68.171875 281.50977 C 68.210065 281.479 68.267978 281.41941 68.298828 281.37891 L 68.310547 281.36133 L 68.302734 281.3457 C 68.293174 281.3278 68.265761 281.28987 68.244141 281.26367 C 68.152383 281.15262 68.059008 281.09766 67.960938 281.09766 z "
     style="opacity:1;vector-effect:none;fill:#73388b;fill-opacity:1;stroke:none;stroke-width:0.00041341;stroke-linecap:square;stroke-linejoin:round;stroke-miterlimit:4;stroke-dasharray:none;stroke-dashoffset:0;stroke-opacity:1;paint-order:markers fill stroke"
     id="path2222-0"
     d="m 67.960938,281.0293 c -0.105332,0 -0.203163,0.0506 -0.291016,0.13867 c -0.03199,0.032 -0.05636,0.0627 -0.0957,0.11523 l -0.0293,0.0352 a 0.06899469,0.06899469 0 0 0 0,0.084 l 0.01758,0.0234 a 0.06899469,0.06899469 0 0 0 0,0.002 c 0.108823,0.1409 0.222951,0.22368 0.351562,0.23829 a 0.06899469,0.06899469 0 0 0 0.002,0 c 0.03024,0.003 0.06379,0.004 0.09961,-0.004 c 0.06868,-0.0132 0.135181,-0.048 0.199219,-0.0996 c 0.04538,-0.0367 0.102624,-0.0953 0.138672,-0.14258 a 0.06899469,0.06899469 0 0 0 0.002,-0.002 l 0.01172,-0.0176 a 0.06899469,0.06899469 0 0 0 0.0059,-0.0703 l -0.0078,-0.0156 a 0.06899469,0.06899469 0 0 0 -0.002,-0.002 c -0.0163,-0.0305 -0.0422,-0.0625 -0.06641,-0.0918 c -0.09928,-0.12015 -0.212093,-0.1914 -0.335937,-0.1914 z"
     transform="matrix(1,0,0,1.1464385,1.4100877,-41.09768)" />
   <path
     style="opacity:1;vector-effect:none;fill:#cf95bc;fill-opacity:1;stroke:none;stroke-width:0.00041341;stroke-linecap:square;stroke-linejoin:round;stroke-miterlimit:4;stroke-dasharray:none;stroke-dashoffset:0;stroke-opacity:1;paint-order:markers fill stroke"
     d="m 67.910515,281.60607 c -0.103928,-0.0118 -0.201019,-0.0799 -0.303832,-0.21301 l -0.01839,-0.0238 l 0.02862,-0.0382 c 0.03865,-0.0516 0.05994,-0.077 0.08942,-0.10652 c 0.07983,-0.08 0.159044,-0.11876 0.242911,-0.11876 c 0.09807,0 0.191974,0.0549 0.283732,0.16595 c 0.02162,0.0262 0.04795,0.0633 0.05751,0.0812 l 0.0089,0.0166 l -0.01252,0.0164 c -0.03085,0.0405 -0.0887,0.10023 -0.12689,0.131 c -0.05692,0.0459 -0.113332,0.0742 -0.169346,0.085 c -0.02379,0.005 -0.05974,0.006 -0.08012,0.004 z m 0.04234,-0.10493 c -0.0043,-4.4e-4 -0.01124,-4.4e-4 -0.0155,0 c -0.0043,4.5e-4 -7.67e-4,8.1e-4 0.0078,8.1e-4 c 0.0085,0 0.01201,-3.6e-4 0.0078,-8.1e-4 z m -0.159516,-0.0841 c -0.01209,-0.0237 -0.01609,-0.0404 -0.01726,-0.0722 l -9.79e-4,-0.0265 l -0.0061,0.006 c -0.01122,0.0107 -0.03471,0.0394 -0.03471,0.0424 c 0,0.003 0.06335,0.0678 0.06632,0.0678 c 8.99e-4,0 -0.0024,-0.008 -0.0072,-0.0174 z m 0.350884,-0.0372 l 0.01535,-0.0169 l -0.01538,-0.0185 c -0.0085,-0.0102 -0.01811,-0.0213 -0.02145,-0.0247 l -0.0061,-0.006 l -3.6e-5,0.0258 c -4.7e-5,0.0341 -0.003,0.0476 -0.01807,0.0826 c -0.0021,0.005 0.02875,-0.0236 0.04566,-0.0422 z m -0.166392,0.0121 c 0.03358,-0.01 0.04493,-0.0482 0.02681,-0.0903 c -0.0049,-0.0115 -0.0079,-0.0126 -0.0079,-0.003 c 0,0.004 -0.0014,0.0123 -0.0032,0.019 c -0.0097,0.037 -0.03707,0.0631 -0.07357,0.0699 c -0.01275,0.002 -0.0128,0.002 -0.0068,0.005 c 0.0089,0.004 0.05131,0.004 0.0646,-4.3e-4 z"
     id="path2222"
     inkscape:connector-curvature="0"
     transform="translate(1.4180014,0.099215)" />
   <path
     inkscape:connector-curvature="0"
     style="color:#000000;font-style:normal;font-variant:normal;font-weight:normal;font-stretch:normal;font-size:medium;line-height:normal;font-family:sans-serif;font-variant-ligatures:normal;font-variant-position:normal;font-variant-caps:normal;font-variant-numeric:normal;font-variant-alternates:normal;font-feature-settings:normal;text-indent:0;text-align:start;text-decoration:none;text-decoration-line:none;text-decoration-style:solid;text-decoration-color:#000000;letter-spacing:normal;word-spacing:normal;text-transform:none;writing-mode:lr-tb;direction:ltr;text-orientation:mixed;dominant-baseline:auto;baseline-shift:baseline;text-anchor:start;white-space:normal;shape-padding:0;clip-rule:nonzero;display:inline;overflow:visible;visibility:visible;opacity:1;isolation:auto;mix-blend-mode:normal;color-interpolation:sRGB;color-interpolation-filters:linearRGB;solid-color:#000000;solid-opacity:1;vector-effect:none;fill:#000000;fill-opacity:1;fill-rule:evenodd;stroke:none;stroke-width:0.2;stroke-linecap:butt;stroke-linejoin:miter;stroke-miterlimit:4;stroke-dasharray:none;stroke-dashoffset:0;stroke-opacity:1;color-rendering:auto;image-rendering:auto;shape-rendering:auto;text-rendering:auto;enable-background:accumulate"
     d="M 38.923828,3.0859375 C 38.508764,3.0972761 38.122397,3.3998856 37.75,3.9277344 l -0.04492,0.058594 L 37.75,4.0449219 c 0.43903,0.5698015 0.863924,0.7893048 1.269531,0.7382812 c 0.405608,-0.051024 0.759728,-0.3501504 1.091797,-0.7460937 l 0.04492,-0.058594 l -0.03711,-0.066406 C 39.738754,3.3612054 39.338896,3.075506 38.923828,3.0859375 Z m 0.296875,0.2773437 c 0.208281,0.1037115 0.423856,0.3090327 0.648438,0.6074219 C 39.579667,4.2938527 39.287702,4.5475119 38.998047,4.5839844 C 38.704113,4.6217797 38.375438,4.4201912 38.001953,3.9785156 c 0.197292,-0.2562438 0.391506,-0.446322 0.580078,-0.5644531 c -0.120683,0.1150886 -0.193393,0.2730073 -0.197265,0.4316406 c -0.0033,0.1371969 0.03202,0.2718823 0.125,0.3769531 c 0.09286,0.1054489 0.244207,0.1696685 0.421875,0.1621094 c 0.192529,8.315e-4 0.347265,-0.061827 0.441406,-0.1699218 c 0.09551,-0.1096063 0.123045,-0.2525967 0.111328,-0.390625 C 39.469214,3.6457131 39.371317,3.4716858 39.220703,3.3632812 Z m -0.289062,0.099609 c 0.200239,0.015118 0.337755,0.1898032 0.353515,0.375 c 0.0079,0.094488 -0.01281,0.1825344 -0.06641,0.2441406 c -0.05367,0.061606 -0.14238,0.1054054 -0.294922,0.1035157 c -0.127823,0.00378 -0.204332,-0.033719 -0.257812,-0.095703 c -0.05348,-0.06085 -0.08434,-0.1496525 -0.08203,-0.2441407 c 6.8e-5,-0.00277 0.0018,-0.00505 0.002,-0.00781 a 0.24081143,0.26756824 0 0 0 0.203124,0.125 A 0.24081143,0.26756824 0 0 0 39.03125,3.6953125 A 0.24081143,0.26756824 0 0 0 38.914062,3.4667969 c 0.0063,-9.269e-4 0.01107,-0.00323 0.01758,-0.00391 z"
     transform="matrix(0.26458333,0,0,0.26458333,59.062805,280.41568)"
     id="path2192" />
   <path
     id="path2222-0-3"
     d="m 67.953026,280.986 c -0.105332,0 -0.203602,0.0582 -0.291455,0.15916 c -0.03199,0.0367 -0.05626,0.0721 -0.0956,0.1323 l -0.02894,0.0403 a 0.06899469,0.07909817 0 0 0 0,0.0961 l 0.01757,0.0269 a 0.06899469,0.07909817 0 0 0 0,0.002 c 0.01618,0.024 0.03265,0.0436 0.04909,0.0646 c 0.05266,-0.0911 0.147448,-0.15253 0.227893,-0.21808 c 0.0571,-0.0366 0.109269,-0.0828 0.170532,-0.11214 c 0.0606,-0.0239 0.126318,-0.0256 0.189652,-0.0377 c 0.01032,-0.005 0.01599,-0.0148 0.02274,-0.0233 c -0.08014,-0.0828 -0.167562,-0.13023 -0.261484,-0.13023 z"
     style="opacity:0.25;vector-effect:none;fill:#398b38;fill-opacity:1;stroke:none;stroke-width:0.00044265;stroke-linecap:square;stroke-linejoin:round;stroke-miterlimit:4;stroke-dasharray:none;stroke-dashoffset:0;stroke-opacity:1;paint-order:markers fill stroke"
     inkscape:connector-curvature="0"
     transform="translate(1.4180014,0.099215)" />
   <path
     style="opacity:0.25;fill:#000000;fill-rule:evenodd;stroke:none;stroke-width:0.07000434"
     inkscape:connector-curvature="0"
     id="path830-5-3-7-5-55"
     d="m 69.741135,280.72437 l 0.042,0.12601 l 0.035,0.0245 q 0.028,0.43753 -0.0385,0.87155 l -0.0385,0.21002 l 0.035,-0.028 l 0.028,-0.004 l 0.028,0.042 v 0.028 q -0.360522,0.17151 -0.756046,0.11551 l -0.09801,-0.021 l -0.0175,-0.049 l 0.0105,-0.0175 l 0.682542,-0.042 q 0.08401,-0.40603 0.08751,-0.82605 l -0.0245,-0.41303 l 0.0245,-0.0175" />
  </g>
 </g>
</svg>
