<?xml version="1.0" encoding="UTF-8" standalone="no"?>
<!-- Created with Inkscape (http://www.inkscape.org/) -->

<svg
  xmlns:dc="http://purl.org/dc/elements/1.1/"
  xmlns:cc="http://creativecommons.org/ns#"
  xmlns:rdf="http://www.w3.org/1999/02/22-rdf-syntax-ns#"
  xmlns:svg="http://www.w3.org/2000/svg"
  xmlns="http://www.w3.org/2000/svg"
  xmlns:sodipodi="http://sodipodi.sourceforge.net/DTD/sodipodi-0.dtd"
  xmlns:inkscape="http://www.inkscape.org/namespaces/inkscape"
  width="90"
  height="90"
  viewBox="0 0 90 90.000004"
  version="1.1"
  id="svg8"
  inkscape:version="0.92.4 (5da689c313, 2019-01-14)"
  sodipodi:docname="06.svg">
 <defs
   id="defs2" />
 <sodipodi:namedview
   id="base"
   pagecolor="#ffffff"
   bordercolor="#666666"
   borderopacity="1.0"
   inkscape:pageopacity="0.0"
   inkscape:pageshadow="2"
   inkscape:zoom="2.8"
   inkscape:cx="65.18147"
   inkscape:cy="51.59052"
   inkscape:document-units="px"
   inkscape:current-layer="layer1"
   showgrid="false"
   units="px"
   inkscape:snap-page="true"
   inkscape:snap-global="true"
   inkscape:window-width="1366"
   inkscape:window-height="705"
   inkscape:window-x="-8"
   inkscape:window-y="-8"
   inkscape:window-maximized="1" />
 <metadata
   id="metadata5">
  <rdf:RDF>
   <cc:Work
     rdf:about="">
    <dc:format>image/svg+xml</dc:format>
    <dc:type
      rdf:resource="http://purl.org/dc/dcmitype/StillImage" />
    <dc:title></dc:title>
   </cc:Work>
  </rdf:RDF>
 </metadata>
 <g
   inkscape:label="Calque 1"
   inkscape:groupmode="layer"
   id="layer1"
   transform="translate(0,-1032.5197)">
  <path
    style="color:#000000;font-style:normal;font-variant:normal;font-weight:normal;font-stretch:normal;font-size:medium;line-height:normal;font-family:sans-serif;font-variant-ligatures:normal;font-variant-position:normal;font-variant-caps:normal;font-variant-numeric:normal;font-variant-alternates:normal;font-feature-settings:normal;text-indent:0;text-align:start;text-decoration:none;text-decoration-line:none;text-decoration-style:solid;text-decoration-color:#000000;letter-spacing:normal;word-spacing:normal;text-transform:none;writing-mode:lr-tb;direction:ltr;text-orientation:mixed;dominant-baseline:auto;baseline-shift:baseline;text-anchor:start;white-space:normal;shape-padding:0;clip-rule:nonzero;display:inline;overflow:visible;visibility:visible;opacity:1;isolation:auto;mix-blend-mode:normal;color-interpolation:sRGB;color-interpolation-filters:linearRGB;solid-color:#000000;solid-opacity:1;vector-effect:none;fill:#ffffff;fill-opacity:1;fill-rule:evenodd;stroke:none;stroke-width:1px;stroke-linecap:butt;stroke-linejoin:miter;stroke-miterlimit:4;stroke-dasharray:none;stroke-dashoffset:0;stroke-opacity:1;color-rendering:auto;image-rendering:auto;shape-rendering:auto;text-rendering:auto;enable-background:accumulate"
    d="M 44.320312 17.984375 L 32.099609 26.585938 L 19.339844 33.023438 L 19.091797 37.90625 L 28.205078 30.662109 L 41.804688 20.226562 L 42.474609 19.890625 L 60.630859 24.103516 L 70.5 31.224609 L 70.208984 30.666016 L 57.894531 21.871094 L 44.089844 19.650391 L 44.320312 17.984375 z M 70.5 31.224609 L 73.300781 36.615234 L 71.673828 32.072266 L 70.5 31.224609 z M 73.300781 36.615234 L 76.130859 44.523438 L 76.625 43.013672 L 73.300781 36.615234 z M 76.130859 44.523438 L 75.099609 47.677734 L 76.476562 45.488281 L 76.130859 44.523438 z M 75.099609 47.677734 L 68.068359 58.855469 L 62.359375 74.074219 L 47.509766 75.783203 L 40.763672 76.287109 L 56.699219 78.763672 L 67.210938 72.734375 L 72.09375 56.865234 L 75.099609 47.677734 z M 40.763672 76.287109 L 39.626953 76.109375 L 29.853516 71.314453 L 23.628906 68.953125 L 32.447266 76.90625 L 40.763672 76.287109 z M 23.628906 68.953125 L 20.191406 65.853516 L 19.451172 55.460938 L 18.597656 47.613281 L 18.529297 48.964844 L 16.455078 66.232422 L 23.628906 68.953125 z M 18.597656 47.613281 L 19.091797 37.90625 L 17.666016 39.039062 L 18.597656 47.613281 z M 45.564453 28.013672 L 39.234375 35.503906 L 28.171875 39.345703 L 28.427734 40.205078 L 39.724609 36.416016 L 45.857422 30.015625 L 50.853516 40.140625 L 45.929688 54.705078 L 40.5625 52.050781 L 31.589844 50.863281 L 32.205078 52.939453 L 41.464844 56.357422 L 47.845703 55.033203 L 51.628906 39.492188 L 48.15625 28.625 L 45.564453 28.013672 z M 31.589844 50.863281 L 28.427734 40.205078 L 27.957031 40.363281 L 31.189453 50.810547 L 31.589844 50.863281 z "
    transform="translate(0,1032.5197)"
    id="path1025" />
  <path
    style="color:#000000;font-style:normal;font-variant:normal;font-weight:normal;font-stretch:normal;font-size:medium;line-height:normal;font-family:sans-serif;font-variant-ligatures:normal;font-variant-position:normal;font-variant-caps:normal;font-variant-numeric:normal;font-variant-alternates:normal;font-feature-settings:normal;text-indent:0;text-align:start;text-decoration:none;text-decoration-line:none;text-decoration-style:solid;text-decoration-color:#000000;letter-spacing:normal;word-spacing:normal;text-transform:none;writing-mode:lr-tb;direction:ltr;text-orientation:mixed;dominant-baseline:auto;baseline-shift:baseline;text-anchor:start;white-space:normal;shape-padding:0;clip-rule:nonzero;display:inline;overflow:visible;visibility:visible;opacity:0.25;isolation:auto;mix-blend-mode:normal;color-interpolation:sRGB;color-interpolation-filters:linearRGB;solid-color:#000000;solid-opacity:1;vector-effect:none;fill:#ffffff;fill-opacity:1;fill-rule:evenodd;stroke:none;stroke-width:1px;stroke-linecap:butt;stroke-linejoin:miter;stroke-miterlimit:4;stroke-dasharray:none;stroke-dashoffset:0;stroke-opacity:1;color-rendering:auto;image-rendering:auto;shape-rendering:auto;text-rendering:auto;enable-background:accumulate"
    d="m 43.169922,1048.8691 c -7.977323,6.1575 -16.610289,11.2219 -25.767578,15.4121 c -0.593692,5.45 -2.726084,9.477 -0.860414,15.4474 c -0.376367,6.7938 -1.574162,13.5559 -2.258727,20.3378 c 7.207639,1.5327 12.339086,6.467 17.458985,11.418 c 8.7108,-1.9155 17.494454,1.4354 25.951171,1.5332 c 4.898763,-3.5065 12.708065,-4.6865 12.900117,-11.9547 c 2.276555,-7.9162 5.182777,-16.437 7.765899,-23.7289 c 0.337214,-4.8361 -4.078047,-9.6821 -5.515625,-14.3633 c -6.545508,-4.7425 -12.741519,-11.8195 -21.542019,-11.6664 c -10.775582,1.7697 1.271065,-9.648 -8.131809,-2.4352 z m 16.617187,9.6094 c 5.887995,3.7196 11.70744,7.8924 13.02589,15.2289 c 3.423015,7.4545 -6.356225,12.705 -7.671185,19.7734 c -2.519541,5.1054 -2.32395,13.686 -10.186529,11.9526 c -7.494121,0.8646 -15.444408,2.925 -21.904958,-2.258 c -4.839255,-2.508 -12.903367,-3.3465 -11.276934,-10.735 c -0.141751,-7.1211 -2.565874,-15.1256 0.05241,-21.6329 c 6.878357,-5.5553 13.926597,-10.8931 20.937869,-16.2782 c 5.674479,1.3164 11.348958,2.6328 17.023437,3.9492 z m -15.75,0.7637 c -3.413835,5.3984 -8.160939,8.8552 -14.478456,10.0248 c -7.796342,0.7406 -1.019998,8.8469 -0.555988,13.7608 c 0.644111,5.8824 8.287957,6.0536 12.868429,7.8081 c 7.239477,0.5798 9.301575,-4.1988 9.810177,-10.5835 c 2.602083,-5.91 1.707975,-11.6963 -0.887583,-17.423 c 0.316439,-3.4706 -4.605615,-5.6001 -6.756579,-3.5872 z m 4.65625,13.5605 c -2.467037,3.7117 -1.606944,14.9289 -7.86914,9.7852 c -6.250316,2.3432 -13.397523,-7.1263 -7.085462,-9.5342 c 5.610949,1.7458 10.767845,-10.2778 12.914869,-4.3849 c 0.679911,1.378 1.359822,2.756 2.039733,4.1339 z"
    id="path1025-3"
    inkscape:connector-curvature="0" />
 </g>
</svg>
