<?xml version="1.0" encoding="UTF-8" standalone="no"?>
<!-- Created with Inkscape (http://www.inkscape.org/) -->

<svg
  xmlns:dc="http://purl.org/dc/elements/1.1/"
  xmlns:cc="http://creativecommons.org/ns#"
  xmlns:rdf="http://www.w3.org/1999/02/22-rdf-syntax-ns#"
  xmlns:svg="http://www.w3.org/2000/svg"
  xmlns="http://www.w3.org/2000/svg"
  xmlns:sodipodi="http://sodipodi.sourceforge.net/DTD/sodipodi-0.dtd"
  xmlns:inkscape="http://www.inkscape.org/namespaces/inkscape"
  width="20"
  height="28.695467"
  viewBox="0 0 20 28.695467"
  version="1.1"
  id="svg8"
  inkscape:version="0.92.4 (5da689c313, 2019-01-14)"
  sodipodi:docname="plante.svg">
 <defs
   id="defs2" />
 <sodipodi:namedview
   id="base"
   pagecolor="#ffffff"
   bordercolor="#666666"
   borderopacity="1.0"
   inkscape:pageopacity="0.0"
   inkscape:pageshadow="2"
   inkscape:zoom="16"
   inkscape:cx="15.592397"
   inkscape:cy="15.565327"
   inkscape:document-units="px"
   inkscape:current-layer="layer1"
   showgrid="false"
   fit-margin-top="0"
   fit-margin-left="0"
   fit-margin-right="0"
   fit-margin-bottom="0"
   inkscape:snap-global="true"
   inkscape:window-width="1366"
   inkscape:window-height="705"
   inkscape:window-x="-8"
   inkscape:window-y="-8"
   inkscape:window-maximized="1"
   units="px" />
 <metadata
   id="metadata5">
  <rdf:RDF>
   <cc:Work
     rdf:about="">
    <dc:format>image/svg+xml</dc:format>
    <dc:type
      rdf:resource="http://purl.org/dc/dcmitype/StillImage" />
    <dc:title></dc:title>
   </cc:Work>
  </rdf:RDF>
 </metadata>
 <g
   inkscape:label="Calque 1"
   inkscape:groupmode="layer"
   id="layer1"
   transform="translate(-62.49512,-253.36846)">
  <g
    id="g1979"
    transform="matrix(17.745127,0,0,17.745127,-1046.4892,-4723.1958)">
   <path
     d="m 63.622212,280.63232 v 1.22157 q -0.007,0.20301 -0.185512,0.21001 l -0.672042,-0.007 q -0.122507,0.0105 -0.185511,-0.028 q -0.077,-0.042 -0.084,-0.14001 v -1.28458 l 0.0035,-0.0455 l 0.007,-0.021 q 0.0525,-0.0875 0.248516,-0.091 h 0.64754 q 0.210013,0.0245 0.220514,0.17852 v 0.007"
     id="path826-7-6-1-5-0"
     inkscape:connector-curvature="0"
     style="fill:#000000;fill-rule:evenodd;stroke:none;stroke-width:0.07000434" />
   <path
     d="m 63.394705,280.4928 c 0.112007,0.0117 0.171511,0.0572 0.178512,0.13651 v 1.22507 c -0.0023,0.10501 -0.05017,0.15984 -0.143509,0.16451 l -0.64754,-0.007 h -0.021 c -0.144675,0.014 -0.220513,-0.028 -0.227514,-0.12601 v -1.27758 l 0.007,-0.0455 c 0.03033,-0.0467 0.100338,-0.07 0.210013,-0.07 h 0.644039"
     id="path828-2-1-7-7-0"
     inkscape:connector-curvature="0"
     style="fill:#ffffff;fill-rule:evenodd;stroke:none;stroke-width:0.07000434"
     sodipodi:nodetypes="cccccccccsc" />
   <path
     sodipodi:type="inkscape:offset"
     inkscape:radius="0.054947842"
     inkscape:original="M 61.921875 281.87695 A 0.13458081 0.13458081 0 0 0 61.851562 281.90234 C 61.654863 282.04247 61.42128 282.18239 61.294922 282.38477 C 61.231743 282.48595 61.201742 282.62225 61.251953 282.74805 C 61.294381 282.85434 61.387864 282.94241 61.513672 283.02734 L 61.519531 283.16211 A 0.13458081 0.13458081 0 0 0 61.666016 283.29102 L 61.794922 283.2793 A 0.13458081 0.13458081 0 0 0 61.917969 283.14258 L 61.916016 283.04883 C 62.098015 282.99103 62.233943 282.92796 62.314453 282.83398 C 62.410995 282.72129 62.408173 282.5651 62.361328 282.45703 C 62.314483 282.34896 62.23937 282.26136 62.177734 282.17969 C 62.116099 282.09802 62.070009 282.0208 62.060547 281.98047 A 0.13458081 0.13458081 0 0 0 61.921875 281.87695 z "
     style="opacity:1;fill:#000000;fill-opacity:1;fill-rule:evenodd;stroke:none;stroke-width:0.26458332px;stroke-linecap:butt;stroke-linejoin:miter;stroke-opacity:1"
     id="path1624-6-4"
     d="m 61.917969,281.82227 c -0.03549,0.002 -0.07083,0.0143 -0.09961,0.0351 c -0.193821,0.13796 -0.434156,0.27998 -0.570312,0.49805 c -0.07078,0.11335 -0.104945,0.26662 -0.04688,0.41211 c 0.04579,0.1147 0.141238,0.20404 0.259766,0.28711 l 0.0039,0.10937 c 0.002,0.0512 0.02599,0.10092 0.06445,0.13477 c 0.03846,0.0338 0.09155,0.0514 0.142578,0.0469 l 0.126953,-0.0117 c 0.09472,-0.008 0.175688,-0.0983 0.173828,-0.19336 l -0.002,-0.0547 c 0.165693,-0.0554 0.299309,-0.11705 0.384766,-0.2168 c 0.113207,-0.13214 0.110849,-0.30854 0.05664,-0.43359 c -0.05106,-0.1178 -0.131319,-0.20945 -0.191406,-0.28907 c -0.05954,-0.0789 -0.10346,-0.16085 -0.107422,-0.17773 c -0.02022,-0.0859 -0.107223,-0.15151 -0.195312,-0.14648 z"
     transform="matrix(0.72296312,0,0,0.72296312,18.368992,76.9557)" />
   <path
     sodipodi:type="inkscape:offset"
     inkscape:radius="0.13456735"
     inkscape:original="M 61.929688 282.01172 C 61.529795 282.2966 61.034853 282.59563 61.646484 282.95898 L 61.654297 283.15625 L 61.783203 283.14453 L 61.779297 282.95508 C 62.72387 282.70186 62.005526 282.33496 61.929688 282.01172 z "
     style="opacity:1;fill:#00ff00;fill-opacity:1;fill-rule:evenodd;stroke:none;stroke-width:0.26458332px;stroke-linecap:butt;stroke-linejoin:miter;stroke-opacity:1"
     id="path1624-6"
     d="m 61.921875,281.87695 a 0.13458081,0.13458081 0 0 0 -0.07031,0.0254 c -0.1967,0.14013 -0.430282,0.28005 -0.55664,0.48243 c -0.06318,0.10118 -0.09318,0.23748 -0.04297,0.36328 c 0.04243,0.10629 0.135911,0.19436 0.261719,0.27929 l 0.0059,0.13477 a 0.13458081,0.13458081 0 0 0 0.146485,0.12891 l 0.128906,-0.0117 a 0.13458081,0.13458081 0 0 0 0.123047,-0.13672 l -0.002,-0.0938 c 0.181999,-0.0578 0.317927,-0.12087 0.398437,-0.21485 c 0.09654,-0.11269 0.09372,-0.26888 0.04688,-0.37695 c -0.04684,-0.10807 -0.121958,-0.19567 -0.183594,-0.27734 c -0.06164,-0.0817 -0.107725,-0.15889 -0.117187,-0.19922 a 0.13458081,0.13458081 0 0 0 -0.138672,-0.10352 z"
     transform="matrix(0.72296312,0,0,0.72296312,18.368992,76.9557)" />
   <path
     style="opacity:1;fill:#000000;fill-rule:evenodd;stroke:none;stroke-width:0.19128399px;stroke-linecap:butt;stroke-linejoin:miter;stroke-opacity:1"
     d="m 62.936799,281.52526 l 0.0061,0.1419 l 0.09356,-0.009 l -0.003,-0.13588 c 0.682891,-0.18307 0.163535,-0.44864 0.108707,-0.68233 c -0.289108,0.20596 -0.64749,0.42266 -0.205303,0.68535 z"
     id="path1624"
     inkscape:connector-curvature="0"
     sodipodi:nodetypes="cccccc" />
   <path
     d="m 63.447201,280.55881 l 0.042,0.12601 l 0.035,0.0245 q 0.028,0.43753 -0.0385,0.87155 l -0.0385,0.21002 l 0.035,-0.028 l 0.028,-0.004 l 0.028,0.042 v 0.028 q -0.360522,0.17151 -0.756046,0.11551 l -0.09801,-0.021 l -0.0175,-0.049 l 0.0105,-0.0175 l 0.682542,-0.042 q 0.08401,-0.40603 0.08751,-0.82605 l -0.0245,-0.41303 l 0.0245,-0.0175"
     id="path830-5-3-7-5-9"
     inkscape:connector-curvature="0"
     style="opacity:0.25;fill:#000000;fill-rule:evenodd;stroke:none;stroke-width:0.07000434" />
   <path
     style="fill:#00ff00;fill-opacity:1;fill-rule:evenodd;stroke:none;stroke-width:0.02148826;stroke-linecap:butt;stroke-linejoin:miter;stroke-miterlimit:4;stroke-dasharray:none;stroke-opacity:1"
     d="m 63.014014,281.45287 l 0.220794,-0.13769 l -0.187556,-0.0237 l 0.211298,-0.11636 l -0.182809,-0.005 l 0.135327,-0.11621 l -0.106837,0.01 l 0.03561,-0.0665 l -0.03561,-0.0166 l -0.06173,0.0878 l -0.109206,0.005 l 0.0641,0.10434 l -0.149572,-0.0262 l 0.130577,0.15198 l -0.14957,-0.0499 l 0.111584,0.1472 l 0.02374,0.0807 z"
     id="path1753"
     inkscape:connector-curvature="0" />
   <path
     inkscape:connector-curvature="0"
     style="opacity:0.25;fill:#ff00f4;fill-opacity:1;fill-rule:evenodd;stroke:none;stroke-width:0.19128399px;stroke-linecap:butt;stroke-linejoin:miter;stroke-opacity:1"
     d="m 63.136331,280.74234 a 0.09729696,0.09729696 0 0 0 -0.05116,0.0186 c -0.142207,0.10131 -0.311207,0.2025 -0.402559,0.34882 c -0.04568,0.0731 -0.06731,0.17156 -0.03101,0.26251 c 0.03012,0.0755 0.09654,0.13807 0.185002,0.19844 c 0.01913,-0.009 0.03779,-0.0202 0.05581,-0.0382 c 0.137653,-0.10308 0.10157,-0.27861 0.10387,-0.42478 c 0.043,-0.1136 0.148403,-0.19845 0.266133,-0.23409 c -0.01296,-0.0225 -0.02268,-0.0429 -0.02584,-0.0563 a 0.09729696,0.09729696 0 0 0 -0.100251,-0.0749 z"
     id="path1624-6-2" />
  </g>
  <g
    id="g2283"
    transform="translate(1.4180013,0.09921875)" />
 </g>
</svg>
