{
  // Ces modifs ne fonctionnent qu'en mode Aventure, donc elles
  // ne s'appliquent pas à notre mode de jeu custom.
  "levels": {
    //Liste des niveaux boss : donnez le n° du niveau du puits,
    //ou donnez une réf. de niveau (ex: "dim+5").
    "boss": [],

    "bat": 100,  //Niveau d'apparition de la chauve-souris (dans le puits)
    "tubz": 101, //Niveau d'apparition de Tuberculoz (dans le puits)
    "secret": 0 //Niveau auquel téléporte le secret du puits
  },

  "darknessAuto": false, //Si oui ou non l'éclairage doit être calculé automatiquement dans le puits

  //Réglages du joueur
  "player": {
    //Les valeurs des vies/bombes outrepassent l'effet des quêtes les modifiant.
    "lives": {
      "adventure": 7,
      "tutorial": 0,
      "timeAttack": 0
    },
    "maxBombs": 2,

    /* Liste des déguisements :
      -  1 : Chapeau d'Igor
      -  2 : Chapeau Chourou
      -  3 : Bonnet Péruvien
      -  4 : Tête de Piouz
      -  5 : Casquette Mario
      -  6 : Cape de Tuberculoz
      -  7 : Chapeau à fleurs
      -  8 : Bonnet d'âne d'Igor
      -  9 : Couronne d'Igor
      - 10 : Chapeau de Sandy
      - 11 : Bonnet d'âne de Sandy
      - 12 : Couronne de Sandy   */
    "head": 1,

    /* Couleur de peau :
      - 1 : Igor
      - 2 : Sandy    */
    "skin": 1
  },

  //Spawn en multi: coordonnées de la forme [x, y]
  //(si null, spawn par défaut en (5/14; -2) )
  "multispawn": {
      "igor": null,
      "sandy": null
  },

  //Liste des paliers de points
  "scoreBonus": [100000, 500000, 1000000, 2000000, 3000000, 4000000]
}
