<?xml version="1.0" encoding="UTF-8" standalone="no"?>
<!-- Created with Inkscape (http://www.inkscape.org/) -->

<svg
   xmlns:dc="http://purl.org/dc/elements/1.1/"
   xmlns:cc="http://creativecommons.org/ns#"
   xmlns:rdf="http://www.w3.org/1999/02/22-rdf-syntax-ns#"
   xmlns:svg="http://www.w3.org/2000/svg"
   xmlns="http://www.w3.org/2000/svg"
   xmlns:sodipodi="http://sodipodi.sourceforge.net/DTD/sodipodi-0.dtd"
   xmlns:inkscape="http://www.inkscape.org/namespaces/inkscape"
   version="1.1"
   id="svg10"
   width="29"
   height="55"
   viewBox="0 0 29 55"
   sodipodi:docname="igor statue.svg"
   inkscape:version="0.92.4 (5da689c313, 2019-01-14)">
  <metadata
     id="metadata16">
    <rdf:RDF>
      <cc:Work
         rdf:about="">
        <dc:format>image/svg+xml</dc:format>
        <dc:type
           rdf:resource="http://purl.org/dc/dcmitype/StillImage" />
        <dc:title></dc:title>
      </cc:Work>
    </rdf:RDF>
  </metadata>
  <defs
     id="defs14" />
  <sodipodi:namedview
     pagecolor="#ffffff"
     bordercolor="#666666"
     borderopacity="1"
     objecttolerance="10"
     gridtolerance="10"
     guidetolerance="10"
     inkscape:pageopacity="0"
     inkscape:pageshadow="2"
     inkscape:window-width="1920"
     inkscape:window-height="1001"
     id="namedview12"
     showgrid="false"
     inkscape:zoom="3.6727273"
     inkscape:cx="40.442623"
     inkscape:cy="62.402216"
     inkscape:window-x="-9"
     inkscape:window-y="-9"
     inkscape:window-maximized="1"
     inkscape:current-layer="svg10" />
  <g
     id="g52"
     transform="translate(-0.2552596,-0.01117787)">
    <path
       style="fill:#aaaaaa"
       d="m 1.1051664,50.25 c 0.4658257,-2.6125 1.1031192,-6.2125 1.4162078,-8 C 2.9317285,39.907186 3.6274852,39 5.0139283,39 c 1.3059553,0 1.7369746,-0.485562 1.3428112,-1.512735 -0.3192699,-0.832004 -0.025047,-2.182004 0.6538296,-3 C 7.8449045,33.481952 7.887332,33 7.1414967,33 6.5346308,33 5.7352432,31.7625 5.3650799,30.25 4.9949165,28.7375 4.206747,27.183798 3.6135919,26.79733 2.918254,26.344284 3.4347838,25.100904 5.0675751,23.29733 10.034513,17.810872 10.149114,17.514749 8.5167691,14.384755 7.6893229,12.79814 7.0095491,11.092476 7.0061607,10.594391 7.0027723,10.096306 5.875,8.2138307 4.5,6.4111128 3.125,4.6083949 2,2.878419 2,2.5667219 2,1.3846169 7.4459396,2.0778833 14.145659,4.1128605 c 8.138636,2.4720346 10.426739,4.9724409 9.541598,10.4269235 -0.334452,2.060984 0.02435,4.919075 0.8723,6.948514 1.865956,4.46586 1.835394,8.939032 -0.07189,10.521936 -1.142792,0.948433 -1.237631,1.586117 -0.388125,2.60971 0.618314,0.745022 0.862986,2.035317 0.543716,2.867321 C 24.303103,38.373701 24.617464,39 25.402554,39 c 0.857511,0 1.585234,1.850289 2.021658,5.140214 0.375031,2.827118 0.939254,6.427118 1.253831,8 L 29.25,55 H 14.754105 0.25821067 Z M 17,38.559017 C 17,37.503542 15.080887,37.060106 14.510081,37.983688 14.164618,38.54266 14.583524,39 15.440983,39 16.298442,39 17,38.801558 17,38.559017 Z"
       id="path66"
       inkscape:connector-curvature="0" />
    <path
       style="fill:#929292"
       d="m 1.1051664,50.25 c 0.4658257,-2.6125 1.1031192,-6.2125 1.4162078,-8 C 2.9317285,39.907186 3.6274852,39 5.0139283,39 c 1.3059553,0 1.7369746,-0.485562 1.3428112,-1.512735 -0.3192699,-0.832004 -0.025047,-2.182004 0.6538296,-3 C 7.8449045,33.481952 7.887332,33 7.1414967,33 6.5346308,33 5.7352432,31.7625 5.3650799,30.25 4.9949165,28.7375 4.206747,27.183798 3.6135919,26.79733 2.918254,26.344284 3.4347838,25.100904 5.0675751,23.29733 10.034513,17.810872 10.149114,17.514749 8.5167691,14.384755 7.6893229,12.79814 7.0095491,11.092476 7.0061607,10.594391 7.0027723,10.096306 5.875,8.2138307 4.5,6.4111128 3.125,4.6083949 2,2.878419 2,2.5667219 2,1.3846169 7.4459396,2.0778833 14.145659,4.1128605 c 8.138636,2.4720346 10.426739,4.9724409 9.541598,10.4269235 -0.334452,2.060984 0.02435,4.919075 0.8723,6.948514 1.865956,4.46586 1.835394,8.939032 -0.07189,10.521936 -1.142792,0.948433 -1.237631,1.586117 -0.388125,2.60971 0.618314,0.745022 0.862986,2.035317 0.543716,2.867321 C 24.303103,38.373701 24.617464,39 25.402554,39 c 0.857511,0 1.585234,1.850289 2.021658,5.140214 0.375031,2.827118 0.939254,6.427118 1.253831,8 L 29.25,55 H 14.754105 0.25821067 Z M 27.132391,51.94061 C 26.729823,50.362999 26.326435,47.476156 26.127623,44.75 26.05743,43.7875 25.325,43 24.5,43 c -1.801755,0 -2.038174,1.96601 -0.25,2.078947 1,0.06316 1,0.179825 0,0.583334 C 22.789642,46.251548 22.539322,51 23.968615,51 c 0.532739,0 0.69208,0.720641 0.354092,1.601424 -0.455557,1.187161 -0.124084,1.495152 1.281384,1.190609 1.045802,-0.226608 1.731077,-1.056769 1.5283,-1.851423 z M 25.5,41 C 25.160081,40.45 23.558524,40 21.940983,40 20.323442,40 19,40.45 19,41 c 0,0.55 1.601558,1 3.559017,1 2.118034,0 3.308786,-0.404882 2.940983,-1 z M 17,38.559017 C 17,37.503542 15.080887,37.060106 14.510081,37.983688 14.164618,38.54266 14.583524,39 15.440983,39 16.298442,39 17,38.801558 17,38.559017 Z"
       id="path64"
       inkscape:connector-curvature="0" />
    <path
       style="fill:#898989"
       d="m 1.1051664,50.25 c 0.4658257,-2.6125 1.1031192,-6.2125 1.4162078,-8 C 2.9317285,39.907186 3.6274852,39 5.0139283,39 c 1.3059553,0 1.7369746,-0.485562 1.3428112,-1.512735 -0.3192699,-0.832004 -0.025047,-2.182004 0.6538296,-3 C 7.8449045,33.481952 7.887332,33 7.1414967,33 6.5346308,33 5.7352432,31.7625 5.3650799,30.25 4.9949165,28.7375 4.206747,27.183798 3.6135919,26.79733 2.918254,26.344284 3.4347838,25.100904 5.0675751,23.29733 10.034513,17.810872 10.149114,17.514749 8.5167691,14.384755 7.6893229,12.79814 7.0095491,11.092476 7.0061607,10.594391 7.0027723,10.096306 5.875,8.2138307 4.5,6.4111128 3.125,4.6083949 2,2.878419 2,2.5667219 2,1.3846169 7.4459396,2.0778833 14.145659,4.1128605 c 8.138636,2.4720346 10.426739,4.9724409 9.541598,10.4269235 -0.334452,2.060984 0.02435,4.919075 0.8723,6.948514 2.151877,5.150165 1.791325,8.536023 -1.246648,11.706983 C 21.835009,34.737877 21.160009,36 21.812909,36 22.465809,36 23,35.523442 23,34.940983 c 0,-0.582459 0.489203,-0.756673 1.087118,-0.387141 0.597915,0.369532 0.865044,1.521089 0.59362,2.559017 C 24.387257,38.235133 24.705036,39 25.464789,39 c 0.782603,0 1.54172,1.991415 1.959423,5.140214 0.375031,2.827118 0.939254,6.427118 1.253831,8 L 29.25,55 H 14.754105 0.25821067 Z M 27.472786,50.876097 C 26.332867,45.68608 26.156252,44.594959 26.076511,42.25 26.004199,40.123468 25.588441,40 18.5,40 14.375,40 11,40.113932 11,40.253182 c 0,0.139251 -0.868237,3.289251 -1.9294165,7 L 7.141167,54 H 17.650039 28.158911 Z M 12,45.5 c 0,-1.375 0.444959,-2.5 0.988798,-2.5 0.54384,0 0.895691,1.125 0.781893,2.5 C 13.656892,46.875 13.211933,48 12.781892,48 12.351851,48 12,46.875 12,45.5 Z m 5.25,0.810674 c 0.9625,-0.251527 2.5375,-0.251527 3.5,0 0.9625,0.251528 0.175,0.457323 -1.75,0.457323 -1.925,0 -2.7125,-0.205795 -1.75,-0.457323 z m -0.488341,-4.017935 c 1.243913,-0.239193 3.043913,-0.230112 4,0.02018 C 21.717747,42.563212 20.7,42.758916 18.5,42.747817 16.3,42.736717 15.517747,42.531932 16.761659,42.292739 Z M 17,38.559017 C 17,37.503542 15.080887,37.060106 14.510081,37.983688 14.164618,38.54266 14.583524,39 15.440983,39 16.298442,39 17,38.801558 17,38.559017 Z M 12,36 C 13.164698,35.247314 12.872088,35.027203 10.690983,35.015313 9.0698973,35.006476 8.1433322,35.422899 8.5,36 c 0.7673704,1.241631 1.578712,1.241631 3.5,0 z m 8,-5 c 0,-1.466667 0.666667,-2 2.5,-2 1.960297,0 2.474957,-0.485733 2.383999,-2.25 -0.09179,-1.780335 -0.213758,-1.872789 -0.584318,-0.442914 -0.597557,2.305784 -3.906893,1.745704 -3.505844,-0.593338 0.16161,-0.942561 -0.28839,-1.729017 -1,-1.747679 -0.71161,-0.01866 -3.086686,-0.881552 -5.277946,-1.917533 l -3.98411,-1.883601 -1.7593013,2.667532 C 6.8674235,25.721 6.4266731,29 7.9434639,29 c 0.5189052,0 1.7409286,-1.35 2.7156071,-3 2.834847,-4.799013 4.349382,-3.782632 2.319434,1.556537 C 11.672001,30.992903 13.199942,33 17.122445,33 19.333333,33 20,32.536644 20,31 Z M 19.810445,11.49063 C 23.163171,10.531396 23.251947,10.394804 21.597773,8.7406305 19.602746,6.7456027 13.977976,6.4220237 12.2,8.2 c -2.6853117,2.685312 -0.216342,7.898033 2.61745,5.526206 0.80577,-0.674413 3.052618,-1.680422 4.992995,-2.235576 z"
       id="path62"
       inkscape:connector-curvature="0" />
    <path
       style="fill:#80777f"
       d="m 1.1051664,50.25 c 0.4658257,-2.6125 1.1031192,-6.2125 1.4162078,-8 C 2.9317285,39.907186 3.6274852,39 5.0139283,39 c 1.3059553,0 1.7369746,-0.485562 1.3428112,-1.512735 -0.3192699,-0.832004 -0.025047,-2.182004 0.6538296,-3 C 7.8449045,33.481952 7.887332,33 7.1414967,33 6.5346308,33 5.7352432,31.7625 5.3650799,30.25 4.9949165,28.7375 4.206747,27.183798 3.6135919,26.79733 2.918254,26.344284 3.4347838,25.100904 5.0675751,23.29733 10.034513,17.810872 10.149114,17.514749 8.5167691,14.384755 7.6893229,12.79814 7.0095491,11.092476 7.0061607,10.594391 7.0027723,10.096306 5.875,8.2138307 4.5,6.4111128 3.125,4.6083949 2,2.878419 2,2.5667219 2,0.34322308 20.010252,5.0377018 22.194367,7.8305033 23.315857,9.2645386 23.288444,9.3371339 22,8.3452273 21.175,7.7101024 18.833917,6.9284557 16.797593,6.6082347 13.730234,6.1258787 12.829739,6.4049941 11.547593,8.2355136 9.6973816,10.877061 9.5471202,14.14712 11.2,15.8 c 1.488385,1.488385 2.8,1.548612 2.8,0.128571 0,-1.866499 2.639248,-3.801372 5.620406,-4.120406 C 21.204183,11.638674 22.873345,11.05 23.329656,10.5 c 0.456311,-0.55 0.606806,0.948478 0.334433,3.329952 -0.295003,2.579339 0.07709,5.699702 0.920344,7.717881 1.843165,4.411317 1.801773,8.886755 -0.09676,10.462401 -1.142792,0.948433 -1.237631,1.586117 -0.388125,2.60971 0.618314,0.745022 0.862986,2.035317 0.543716,2.867321 C 24.287488,38.414393 24.631297,39 25.531385,39 c 0.968473,0 1.422238,0.936523 1.332433,2.75 -0.116762,2.357845 -0.197981,2.429146 -0.569551,0.5 C 25.889172,40.146797 25.353733,40 18.087414,40 H 10.31393 L 8.2719396,47 6.2299493,54 H 17.095844 27.961739 L 27.339992,49.25 C 26.998031,46.6375 26.948981,44.725 27.230991,45 c 0.282011,0.275 0.822979,2.6375 1.202151,5.25 L 29.122546,55 H 14.690378 0.25821067 Z M 5,53.031385 C 5,52.498646 4.325,52.321791 3.5,52.638374 2.675,52.954956 2,53.390833 2,53.606989 2,53.823145 2.675,54 3.5,54 4.325,54 5,53.564123 5,53.031385 Z M 6.6719228,44.591198 C 7.6214399,40.4418 7.572515,40.250021 5.8404,41.331745 4.82818,41.963887 3.9938554,42.935348 3.9863453,43.490547 3.9788352,44.045746 3.7013511,45.5125 3.369714,46.75 2.9475992,48.325116 3.2011088,49 4.2148915,49 5.1075629,49 6.0500307,47.308872 6.6719228,44.591198 Z M 23.851767,37.481566 c 0.217421,-0.21742 0.127028,-1.094441 -0.200872,-1.948936 -0.3279,-0.854494 -0.676337,-1.886401 -0.774304,-2.293128 -0.09797,-0.406726 -0.853449,-1.233313 -1.678847,-1.836859 -1.115724,-0.815837 -1.19408,-1.286874 -0.30543,-1.83609 0.657413,-0.406303 1.850584,-0.194892 2.651491,0.469802 C 24.764432,31.049385 25,30.753004 25,28.204232 c 0,-4.80311 -0.86747,-6.303946 -2.907319,-5.03004 -1.320771,0.824836 -2.872819,0.574304 -6.567838,-1.060178 -4.510701,-1.995297 -4.961885,-2.028472 -6.6620526,-0.489841 -1.0030213,0.907722 -2.1240818,3.251709 -2.4912456,5.20886 -0.5553593,2.96032 -0.3065134,3.79819 1.4804423,4.984684 C 10.346381,33.473933 10.657137,35 8.5,35 6.6889852,35 6.48982,37.638163 8.25,38.311524 9.6255394,38.837741 23.2187,38.114633 23.851767,37.481566 Z M 14,36.833333 C 14,36.375 14.675,36 15.5,36 c 0.825,0 1.5,0.375 1.5,0.833333 0,0.458334 -0.675,0.833334 -1.5,0.833334 -0.825,0 -1.5,-0.375 -1.5,-0.833334 z M 21.154497,26.562347 C 21.344523,25.644953 21.95,24.918127 22.5,24.947179 c 1.484289,0.0784 1.211605,2.315619 -0.345503,2.834655 -0.841121,0.280374 -1.215987,-0.17677 -1,-1.219487 z M 19.75,17.310674 c -0.9625,-0.251527 -2.5375,-0.251527 -3.5,0 -0.9625,0.251528 -0.175,0.457323 1.75,0.457323 1.925,0 2.7125,-0.205795 1.75,-0.457323 z m -0.9375,29.006212 c 0.721875,-0.288871 1.584375,-0.253344 1.916667,0.07895 0.332291,0.332292 -0.258334,0.568641 -1.3125,0.52522 -1.164943,-0.04798 -1.4019,-0.284941 -0.604167,-0.604167 z"
       id="path60"
       inkscape:connector-curvature="0" />
    <path
       style="fill:#787777"
       d="M 1.3955263,49.291781 C 2.4082206,40.675332 3.0075076,39 5.0770232,39 c 1.2496349,0 1.6696738,-0.496522 1.2797163,-1.512735 -0.3192699,-0.832004 -0.025047,-2.182004 0.6538296,-3 C 7.8449045,33.481952 7.887332,33 7.1414967,33 6.5346308,33 5.7352432,31.7625 5.3650799,30.25 4.9949165,28.7375 4.206747,27.183798 3.6135919,26.79733 2.918254,26.344284 3.4347838,25.100904 5.0675751,23.29733 10.034513,17.810872 10.149114,17.514749 8.5167691,14.384755 7.6893229,12.79814 7.0095491,11.092476 7.0061607,10.594391 7.0027723,10.096306 5.875,8.2138307 4.5,6.4111128 3.125,4.6083949 2,2.878419 2,2.5667219 2,0.37424595 19.965884,5.0147025 22.194367,7.7827792 23.327732,9.1905719 23.173773,9.1799502 21.027494,7.7022759 14.939212,3.510604 8.7687447,7.616778 10.590297,14.64777 c 0.895676,3.457208 1.000615,3.516713 6.805791,3.859149 3.46031,0.204117 6.242529,0.894205 6.734688,1.67044 0.980828,1.546966 1.159711,3.446462 0.237741,2.524491 -0.347316,-0.347315 -1.468251,-0.183658 -2.490969,0.363684 -1.315756,0.704171 -2.66625,0.584723 -4.618517,-0.408498 C 11.619718,19.788019 10.483519,19.821397 7.2073011,22.952327 5.490618,24.592881 4.5166957,26.201302 5.0430295,26.526594 5.5693633,26.851886 6,27.975644 6,29.023833 c 0,1.04819 0.9810994,2.430868 2.1802209,3.072618 1.9998021,1.070262 2.0411781,1.268489 0.5,2.395427 -2.0475421,1.497199 -2.1636715,3.108627 -0.2762229,3.832909 1.4806243,0.568169 14.756952,-0.152404 15.442701,-0.838152 0.220208,-0.220208 0.177079,-0.982286 -0.09584,-1.693507 -0.27292,-0.71122 -0.523548,-1.671608 -0.556949,-2.134194 -0.0334,-0.462587 -0.833865,-1.406397 -1.778809,-2.097357 -1.249983,-0.91401 -1.392418,-1.457561 -0.522785,-1.995024 0.657413,-0.406303 1.850584,-0.194892 2.651491,0.469802 1.229174,1.020124 1.481145,0.604819 1.616232,-2.66391 0.158165,-3.827148 0.164837,-3.833335 0.570335,-0.528905 0.266214,2.169392 -0.164031,3.978167 -1.22518,5.150723 -1.172416,1.295505 -1.309232,2.008813 -0.483217,2.519319 0.633744,0.391675 0.930187,1.561349 0.658763,2.599277 C 24.369835,38.301752 24.707604,39 25.59362,39 c 0.90058,0 1.357403,0.989028 1.270198,2.75 -0.116762,2.357845 -0.197981,2.429146 -0.569551,0.5 C 25.888687,40.144278 25.356918,40 18.001408,40 h -7.859491 l -1.5881126,5.462915 c -0.873462,3.004604 -1.8535382,6.154604 -2.1779473,7 C 5.8671975,53.788461 7.3045148,54 16.819687,54 c 9.667367,0 11.090295,-0.216702 11.490987,-1.75 0.344145,-1.31691 0.486031,-1.19317 0.573325,0.5 0.115109,2.232704 0.0073,2.25 -14.02168,2.25 H 0.72463718 Z M 5,53.031385 C 5,52.498646 4.325,52.321791 3.5,52.638374 2.675,52.954956 2,53.390833 2,53.606989 2,53.823145 2.675,54 3.5,54 4.325,54 5,53.564123 5,53.031385 Z m 1.4862437,-6.80975 C 6.8333085,44.371621 7.3269622,42.311525 7.5832519,41.643645 7.8452919,40.960779 7.1631401,40.36257 6.0246166,40.276807 4.9110775,40.192927 3.9425696,40.658831 3.8723768,41.312149 3.4772466,44.989818 3.1470772,46.674705 2.523755,48.1943 1.9980985,49.475796 2.3192781,49.851652 3.8419936,49.736949 5.2879871,49.628026 6.03301,48.637579 6.4862437,46.221635 Z M 8.4847701,3.1514368 C 7.7293299,2.3959966 6,4.2046253 6,5.7501466 6,7.1151107 6.2321412,7.0647873 7.418239,5.4427019 8.1982704,4.3759454 8.6782094,3.3448761 8.4847701,3.1514368 Z M 27.194949,47.5 c 0.02038,-1.65 0.244498,-2.203936 0.498042,-1.230968 0.253543,0.972967 0.236869,2.322967 -0.03705,3 C 27.382014,49.946064 27.174569,49.15 27.194949,47.5 Z M 14,36.833333 C 14,36.375 14.675,36 15.5,36 c 0.825,0 1.5,0.375 1.5,0.833333 0,0.458334 -0.675,0.833334 -1.5,0.833334 -0.825,0 -1.5,-0.375 -1.5,-0.833334 z m 7,-10.25 C 21,25.7125 21.7125,25 22.583333,25 24.34926,25 24.041723,27.152759 22.1875,27.770833 21.534375,27.988542 21,27.454167 21,26.583333 Z M 18.25,17.192502 C 15.9125,17.023378 14,16.428736 14,15.871074 14,14.057382 16.675473,12.123322 19.620406,11.808165 21.204183,11.638674 22.82472,11.05 23.2216,10.5 c 0.39688,-0.55 0.591945,0.679936 0.433477,2.73319 -0.158469,2.053255 -0.483189,3.853255 -0.721601,4 C 22.695064,17.379936 20.5875,17.361626 18.25,17.192502 Z"
       id="path58"
       inkscape:connector-curvature="0" />
    <path
       style="fill:#676767"
       d="m 1.2623417,54.404325 c 0.3276213,-0.327621 6.441882,-0.538376 13.5872463,-0.468343 11.682813,0.114504 13.038255,-0.05215 13.45499,-1.654325 0.358799,-1.379436 0.489607,-1.273704 0.579421,0.468343 0.11512,2.23291 0.0084,2.25 -14.050666,2.25 C 7.0416667,55 0.93472044,54.731946 1.2623417,54.404325 Z M 1.1160014,50.25 c 0.066847,-1.584722 0.305263,-2.031946 0.5626501,-1.055426 0.2925306,1.109854 1.0288763,1.476567 2.1339986,1.062769 1.4712056,-0.550872 1.511544,-0.415676 0.3149052,1.055426 C 2.1207724,53.779831 0.98402655,53.378676 1.1160014,50.25 Z M 6.563086,48.633337 c 0.2934687,-1.576665 0.7930797,-4.164165 1.1102467,-5.75 C 8.1979119,40.26044 7.9903127,39.987699 5.375,39.863818 3.1044444,39.756267 2.9614185,39.638047 4.6947065,39.301513 6.1175331,39.025258 6.6936626,38.365273 6.3328308,37.42496 6.0267107,36.627224 6.2953747,35.349022 6.9298621,34.584511 7.8104419,33.523477 7.777751,33.071823 6.7917378,32.676193 5.9702713,32.346587 6.1371067,32.129153 7.25,32.078947 c 1.9486963,-0.08791 2.4228544,2.530102 0.5700899,3.14769 -0.6587551,0.219585 -0.8934627,1.139773 -0.5313848,2.083333 0.7979055,2.079309 5.0241179,2.222954 6.6805579,0.227066 1.062055,-1.279698 1.520971,-1.261929 3.663408,0.141851 1.974552,1.293775 2.938205,1.382034 4.972,0.455376 1.483108,-0.67575 2.266115,-0.734207 1.900019,-0.141851 C 24.162192,38.546585 24.583524,39 25.440983,39 c 0.857459,0 1.552126,0.7875 1.543704,1.75 -0.01137,1.299269 -0.226903,1.416459 -0.836829,0.454998 -0.586656,-0.924777 -3.071575,-1.210664 -8.691964,-1 L 9.5854471,40.5 7.8074769,46 C 6.8295933,49.025 6.2696174,50.210001 6.563086,48.633337 Z M 17,38.559017 C 17,37.503542 15.080887,37.060106 14.510081,37.983688 14.164618,38.54266 14.583524,39 15.440983,39 16.298442,39 17,38.801558 17,38.559017 Z m -15,5.5 C 2,42.991476 2.3849944,41.880094 2.8555431,41.589279 3.3260919,41.298464 3.4986321,42.171907 3.238966,43.530262 2.6749499,46.480722 2,46.768771 2,44.059017 Z M 22.25,32.337719 C 20.800074,31.752662 20.545224,29 21.940983,29 c 0.517541,0 1.223635,0.45734 1.569098,1.016312 0.345464,0.558971 1.159521,0.69759 1.809017,0.308041 0.672738,-0.403488 0.590314,0.01981 -0.191543,0.983689 -0.754844,0.930577 -1.429844,1.656432 -1.5,1.613011 C 23.5574,32.877632 22.9375,32.615132 22.25,32.337719 Z M 5.0789474,29.416667 c 0.047984,-1.164943 0.2849403,-1.4019 0.6041666,-0.604167 0.2888706,0.721875 0.2533443,1.584375 -0.078947,1.916667 -0.3322917,0.332291 -0.5686404,-0.258334 -0.5252196,-1.3125 z M 21.63948,27.306147 C 20.513296,26.179963 20.95359,25 22.5,25 c 0.825,0 1.5,0.423442 1.5,0.940983 0,1.260978 -1.561589,2.164095 -2.36052,1.365164 z M 25.157895,26 c 0,-1.375 0.226973,-1.9375 0.504386,-1.25 0.277412,0.6875 0.277412,1.8125 0,2.5 -0.277413,0.6875 -0.504386,0.125 -0.504386,-1.25 z M 5.5,23 C 6.4954863,21.9 7.5349751,21 7.8099751,21 8.0849751,21 7.4954863,21.9 6.5,23 5.5045137,24.1 4.4650249,25 4.1900249,25 3.9150249,25 4.5045137,24.1 5.5,23 Z M 15,21.5 c -1.375,-0.786021 -1.910942,-1.445075 -1.190983,-1.464565 0.719959,-0.01949 1.047376,-0.45878 0.727592,-0.976201 -0.34668,-0.560939 0.941653,-0.705664 3.190983,-0.358458 4.964997,0.766394 5.40871,1.28067 1.189075,1.378171 L 15.5,20.157895 l 2.9128,1.058652 c 2.386088,0.86722 3.133216,0.757217 4.131733,-0.608337 1.111545,-1.520128 1.273403,-1.525045 1.8372,-0.05581 C 25.301586,22.949495 25.102213,23.705553 24,22 23.35375,21 23.025521,20.916667 23.015313,21.75 22.994704,23.432336 18.113966,23.280104 15,21.5 Z M 9.0119073,18.588093 c 0.6507903,-0.650791 1.3803517,-0.595834 2.1371737,0.160988 0.865441,0.865441 0.62154,1.109343 -0.988093,0.988093 C 8.7533758,19.631141 8.3611171,19.238883 9.0119073,18.588093 Z M 22,17.198051 c 0,-0.624405 -0.676006,-0.875873 -1.502236,-0.558819 -0.82623,0.317054 -2.624898,0.294692 -3.99704,-0.04969 C 14.290697,16.034856 14.148267,15.734973 15.25296,13.962388 15.938832,12.861842 17.175,12.07135 18,12.205739 c 0.825,0.134389 2.0625,-0.108482 2.75,-0.539714 0.6875,-0.431233 1.256891,-0.420001 1.265313,0.02496 0.0084,0.444959 0.428225,0.156319 0.932895,-0.641422 0.630544,-0.996712 0.824996,-0.283562 0.62161,2.279744 C 23.301642,16.709174 22,19.917012 22,17.198051 Z M 20.5,15 c 1.260639,-0.541715 1.445479,-0.859429 0.5,-0.859429 -0.825,0 -2.4,0.386743 -3.5,0.859429 -1.260639,0.541715 -1.445479,0.859429 -0.5,0.859429 0.825,0 2.4,-0.386743 3.5,-0.859429 z M 9.2448335,15.75 C 8.6948028,15.0625 7.9124729,13.375 7.5063226,12 7.1001723,10.625 5.6950974,8.0675249 4.3839338,6.3167219 1.5814202,2.5745122 1.4716321,2 3.559017,2 4.4164763,2 4.8399187,2.45 4.5,3 4.1600813,3.55 4.3585237,4 4.940983,4 5.5234424,4 5.9467105,4.3375 5.8815789,4.75 5.4556016,7.4478567 6.0861146,7.8659413 9.0319992,6.8390004 11.466774,5.9902334 11.836603,5.5080451 10.909555,4.3910199 9.4986643,2.6910011 9.4560485,2.6898866 15,4.4979929 19.295284,5.8988583 19.342978,5.9550333 16.048387,5.7328122 13.260343,5.5447579 12.341504,5.9806225 11.268965,8 c -0.730296,1.375 -1.17993,3.9625 -0.999188,5.75 0.371542,3.674476 0.349353,3.717774 -1.0249435,2 z M 20.872445,7.25 C 19.628574,5.6639444 19.663944,5.6285741 21.25,6.8724447 22.2125,7.6272893 23,8.4147893 23,8.6224447 23,9.4454789 22.178814,8.915748 20.872445,7.25 Z M 8,4.940983 C 8,4.3585237 8.45,4.1600813 9,4.5 9.55,4.8399187 10,5.3164763 10,5.559017 10,5.8015576 9.55,6 9,6 8.45,6 8,5.5234424 8,4.940983 Z M 6.8125,2.316886 C 7.534375,2.0280154 8.396875,2.0635417 8.7291667,2.3958333 9.0614583,2.728125 8.4708333,2.9644737 7.4166667,2.9210526 6.2517237,2.8730687 6.0147673,2.6361123 6.8125,2.316886 Z"
       id="path56"
       inkscape:connector-curvature="0" />
    <path
       style="fill:#585858"
       d="m 1.0789474,49.416667 c 0.047984,-1.164943 0.2849403,-1.4019 0.6041666,-0.604167 0.2888706,0.721875 0.2533443,1.584375 -0.078947,1.916667 -0.3322917,0.332291 -0.5686404,-0.258334 -0.5252196,-1.3125 z M 6.7917378,34.847246 c 1.0556503,-1.350685 1.0556503,-1.747482 0,-2.171053 C 5.9051211,32.320446 5.8735219,32.133135 6.690983,32.078947 8.7392461,31.943173 9.0562571,33.712019 7.2389895,35.136693 5.6876394,36.352897 5.6393803,36.321666 6.7917378,34.847246 Z M 21,31 c 0,-0.55 0.45,-1 1,-1 0.55,0 1,0.45 1,1 0,0.55 -0.45,1 -1,1 -0.55,0 -1,-0.45 -1,-1 z m 0,-5 c 0,-0.55 0.675,-1 1.5,-1 0.825,0 1.5,0.45 1.5,1 0,0.55 -0.675,1 -1.5,1 C 21.675,27 21,26.55 21,26 Z M 5.5,23 C 6.4954863,21.9 7.5349751,21 7.8099751,21 8.0849751,21 7.4954863,21.9 6.5,23 5.5045137,24.1 4.4650249,25 4.1900249,25 3.9150249,25 4.5045137,24.1 5.5,23 Z m 17.958881,-2.066531 c -0.362533,-0.586592 -0.444683,-1.281 -0.182555,-1.543128 0.262128,-0.262129 0.743066,0.21781 1.068751,1.066531 0.676184,1.762107 0.09985,2.072058 -0.886196,0.476597 z M 17.75,16.337719 c 0.6875,-0.277412 1.8125,-0.277412 2.5,0 0.6875,0.277413 0.125,0.504386 -1.25,0.504386 -1.375,0 -1.9375,-0.226973 -1.25,-0.504386 z M 7.9472708,13.361312 c -0.5517751,-1.451279 -0.8176663,-2.82425 -0.5908692,-3.051047 0.226797,-0.226797 0.8909785,0.960613 1.4759588,2.638688 1.3003966,3.730321 0.5154392,4.096028 -0.8850896,0.412359 z M 16,13.468615 c 0,-1.617389 1.562623,-1.985323 2.435239,-0.5734 0.304301,0.492369 -0.119142,1.153245 -0.940983,1.468615 C 16.586597,14.712132 16,14.360699 16,13.468615 Z M 20,13 c 0,-0.55 0.45,-1 1,-1 0.55,0 1,0.45 1,1 0,0.55 -0.45,1 -1,1 -0.55,0 -1,-0.45 -1,-1 z M 2.979944,4.475834 C 2.284224,3.6375427 1.9086586,2.758008 2.1453542,2.5213124 2.3820498,2.2846168 3.1249884,2.9704915 3.7963288,4.0454784 5.2481421,6.370201 4.7639571,6.6254382 2.979944,4.475834 Z"
       id="path54"
       inkscape:connector-curvature="0" />
  </g>
</svg>
