<?xml version="1.0" encoding="UTF-8" standalone="no"?>
<!-- Created with Inkscape (http://www.inkscape.org/) -->

<svg
   xmlns:dc="http://purl.org/dc/elements/1.1/"
   xmlns:cc="http://creativecommons.org/ns#"
   xmlns:rdf="http://www.w3.org/1999/02/22-rdf-syntax-ns#"
   xmlns:svg="http://www.w3.org/2000/svg"
   xmlns="http://www.w3.org/2000/svg"
   xmlns:sodipodi="http://sodipodi.sourceforge.net/DTD/sodipodi-0.dtd"
   xmlns:inkscape="http://www.inkscape.org/namespaces/inkscape"
   version="1.1"
   id="svg26"
   width="20"
   height="20"
   viewBox="0 0 20 20"
   sodipodi:docname="neige_bord.svg"
   inkscape:version="0.92.4 (5da689c313, 2019-01-14)">
  <metadata
     id="metadata32">
    <rdf:RDF>
      <cc:Work
         rdf:about="">
        <dc:format>image/svg+xml</dc:format>
        <dc:type
           rdf:resource="http://purl.org/dc/dcmitype/StillImage" />
        <dc:title></dc:title>
      </cc:Work>
    </rdf:RDF>
  </metadata>
  <defs
     id="defs30" />
  <sodipodi:namedview
     pagecolor="#ffffff"
     bordercolor="#666666"
     borderopacity="1"
     objecttolerance="10"
     gridtolerance="10"
     guidetolerance="10"
     inkscape:pageopacity="0"
     inkscape:pageshadow="2"
     inkscape:window-width="1920"
     inkscape:window-height="1001"
     id="namedview28"
     showgrid="false"
     inkscape:zoom="11.8"
     inkscape:cx="-0.33898305"
     inkscape:cy="10"
     inkscape:window-x="-9"
     inkscape:window-y="-9"
     inkscape:window-maximized="1"
     inkscape:current-layer="svg26" />
  <g
     id="g36">
    <path
       style="fill:#fefefe"
       d="M 4.5,17.609763 C 7.25,16.305879 11.278826,13.385275 13.452948,11.119532 19.027719,5.3098297 20,5.6633449 20,13.5 V 20 L 9.75,19.9902 -0.5,19.9804 l 5,-2.370699 z"
       id="path40"
       inkscape:connector-curvature="0" />
    <path
       style="fill:#dddddd"
       d="m 9,17.645914 c 1.925,-0.758859 3.6875,-1.214633 3.916667,-1.012829 0.797364,0.702156 -0.583896,1.349348 -3.9895837,1.869328 L 5.5,19.02566 Z m 5.321178,-3.356573 C 15.140118,12.964267 20,11.979536 20,13.138672 20,13.612402 19.361804,14 18.581787,14 c -0.780016,0 -2.203837,0.301472 -3.164044,0.669939 -1.098942,0.421703 -1.505257,0.280679 -1.096565,-0.380598 z"
       id="path38"
       inkscape:connector-curvature="0" />
  </g>
</svg>
