<?xml version="1.0" encoding="UTF-8" standalone="no"?>
<!-- Created with Inkscape (http://www.inkscape.org/) -->

<svg
   xmlns:dc="http://purl.org/dc/elements/1.1/"
   xmlns:cc="http://creativecommons.org/ns#"
   xmlns:rdf="http://www.w3.org/1999/02/22-rdf-syntax-ns#"
   xmlns:svg="http://www.w3.org/2000/svg"
   xmlns="http://www.w3.org/2000/svg"
   xmlns:sodipodi="http://sodipodi.sourceforge.net/DTD/sodipodi-0.dtd"
   xmlns:inkscape="http://www.inkscape.org/namespaces/inkscape"
   version="1.1"
   id="svg30"
   width="25"
   height="39"
   viewBox="0 0 25 39"
   sodipodi:docname="darkigor.svg"
   inkscape:version="0.92.4 (5da689c313, 2019-01-14)">
  <metadata
     id="metadata36">
    <rdf:RDF>
      <cc:Work
         rdf:about="">
        <dc:format>image/svg+xml</dc:format>
        <dc:type
           rdf:resource="http://purl.org/dc/dcmitype/StillImage" />
        <dc:title></dc:title>
      </cc:Work>
    </rdf:RDF>
  </metadata>
  <defs
     id="defs34" />
  <sodipodi:namedview
     pagecolor="#ffffff"
     bordercolor="#666666"
     borderopacity="1"
     objecttolerance="10"
     gridtolerance="10"
     guidetolerance="10"
     inkscape:pageopacity="0"
     inkscape:pageshadow="2"
     inkscape:window-width="1920"
     inkscape:window-height="1001"
     id="namedview32"
     showgrid="false"
     inkscape:zoom="12.102564"
     inkscape:cx="-0.33953062"
     inkscape:cy="18.408994"
     inkscape:window-x="-9"
     inkscape:window-y="-9"
     inkscape:window-maximized="1"
     inkscape:current-layer="svg30" />
  <g
     id="g40"
     transform="translate(0.08262666,0.0826271)">
    <path
       style="fill:#ec1b23"
       d="M 3.9101916,37.391787 C 2.7804312,36.030509 2.844622,35.586784 4.3282475,34.50193 5.9636653,33.306083 5.8746918,32.914592 2.9991693,28.653877 L -0.08266267,24.087468 3.8222697,20.063702 7.7272021,16.039936 5.2402706,10.769968 C 3.8724583,7.8714855 2.0897552,4.740856 1.2787082,3.8130133 -0.5225066,1.7524125 0.38044672,0 3.2434128,0 7.7378239,0 17.62654,3.4123117 20.33584,5.8981052 c 2.551629,2.3411295 2.776356,3.0577363 2.242307,7.1502448 -0.420264,3.220562 -0.16268,5.118089 0.882357,6.5 1.926122,2.547018 1.979979,9.841192 0.08428,11.414483 -1.171135,0.971956 -1.219939,1.593397 -0.25,3.183349 1.008155,1.652596 0.887828,2.210929 -0.735913,3.414722 C 20.19573,39.312866 16.822466,39.422466 15.2,37.8 c -0.933333,-0.933333 -1.466667,-0.933333 -2.4,0 -1.732,1.732 -7.3268053,1.475091 -8.8898084,-0.408213 z"
       id="path48"
       inkscape:connector-curvature="0" />
    <path
       style="fill:#910b11"
       d="M 3.9101916,37.391787 C 2.7804312,36.030509 2.844622,35.586784 4.3282475,34.50193 5.9636653,33.306083 5.8746918,32.914592 2.9991693,28.653877 L -0.08266267,24.087468 3.8222697,20.063702 7.7272021,16.039936 5.2402706,10.769968 C 3.8724583,7.8714855 2.0897552,4.740856 1.2787082,3.8130133 -0.5225066,1.7524125 0.38044672,0 3.2434128,0 7.7378239,0 17.62654,3.4123117 20.33584,5.8981052 c 2.551629,2.3411295 2.776356,3.0577363 2.242307,7.1502448 -0.420264,3.220562 -0.16268,5.118089 0.882357,6.5 1.926122,2.547018 1.979979,9.841192 0.08428,11.414483 -1.171135,0.971956 -1.219939,1.593397 -0.25,3.183349 1.008155,1.652596 0.887828,2.210929 -0.735913,3.414722 C 20.19573,39.312866 16.822466,39.422466 15.2,37.8 c -0.933333,-0.933333 -1.466667,-0.933333 -2.4,0 -1.732,1.732 -7.3268053,1.475091 -8.8898084,-0.408213 z M 14.447214,9.9145898 C 14.125238,9.3936223 13.435557,9.2308108 12.91459,9.5527864 12.393622,9.874762 12.230811,10.564443 12.552786,11.08541 c 0.321976,0.520968 1.011657,0.683779 1.532624,0.361804 0.520968,-0.321976 0.683779,-1.011657 0.361804,-1.5326242 z m 5,0 C 19.125238,9.3936223 18.435557,9.2308108 17.91459,9.5527864 17.393622,9.874762 17.230811,10.564443 17.552786,11.08541 c 0.321976,0.520968 1.011657,0.683779 1.532624,0.361804 0.520968,-0.321976 0.683779,-1.011657 0.361804,-1.5326242 z"
       id="path46"
       inkscape:connector-curvature="0" />
    <path
       style="fill:#280204"
       d="M 4.418619,36.868323 C 4.0339407,36.2459 4.4573831,35.32354 5.359602,34.818633 7.0871173,33.851866 7.639154,31 6.0987759,31 5.6031026,31 4.2893139,29.460652 3.1792454,27.579226 L 1.1609391,24.158451 5.0804696,19.912836 C 8.940446,15.731729 9.8352966,14 8.1358579,14 7.6605798,14 6.5118983,12.010446 5.5832325,9.5787695 4.6545666,7.1470927 3.2434306,4.6169926 2.4473746,3.9563248 0.3609124,2.224715 0.66623777,1 3.1843958,1 7.3143541,1 17.502789,4.3033477 19.840789,6.4004231 c 2.021089,1.8128209 2.25905,2.7207814 1.742307,6.6479269 -0.424478,3.225951 -0.169378,5.115777 0.877408,6.5 1.926122,2.547018 1.979979,9.841192 0.08428,11.414483 -1.170078,0.971079 -1.219064,1.588877 -0.25,3.152958 0.97604,1.57534 0.919986,2.126674 -0.294783,2.899409 -2.079568,1.322847 -5.365957,1.218843 -6.8,-0.2152 -0.933333,-0.933333 -1.466667,-0.933333 -2.4,0 -1.519973,1.519973 -7.4543141,1.568348 -8.381381,0.06832 z M 14.447214,9.9145898 C 14.125238,9.3936223 13.435557,9.2308108 12.91459,9.5527864 12.393622,9.874762 12.230811,10.564443 12.552786,11.08541 c 0.321976,0.520968 1.011657,0.683779 1.532624,0.361804 0.520968,-0.321976 0.683779,-1.011657 0.361804,-1.5326242 z m 5,0 C 19.125238,9.3936223 18.435557,9.2308108 17.91459,9.5527864 17.393622,9.874762 17.230811,10.564443 17.552786,11.08541 c 0.321976,0.520968 1.011657,0.683779 1.532624,0.361804 0.520968,-0.321976 0.683779,-1.011657 0.361804,-1.5326242 z"
       id="path44"
       inkscape:connector-curvature="0" />
    <path
       style="fill:#000000"
       d="M 4.418619,36.868323 C 4.0339407,36.2459 4.4573831,35.32354 5.359602,34.818633 7.4104467,33.670922 7.486693,31.400739 5.5,30.638374 3.4247932,29.842042 3.6246632,27.343376 6.0815595,23.368034 7.9442213,20.354184 8.6346773,20 12.647301,20 c 2.4663,0 5.391479,-0.485571 6.500398,-1.079046 1.61152,-0.86246 2.294462,-0.711919 3.402455,0.75 1.852845,2.4447 1.849369,9.752582 -0.0054,11.291879 -1.170078,0.971079 -1.219064,1.588877 -0.25,3.152958 0.97604,1.57534 0.919986,2.126674 -0.294783,2.899409 -2.079568,1.322847 -5.365957,1.218843 -6.8,-0.2152 -0.933333,-0.933333 -1.466667,-0.933333 -2.4,0 -1.519973,1.519973 -7.4543141,1.568348 -8.381381,0.06832 z M 10.750682,16.257281 C 8.4724466,15.731563 7.5145488,11.775591 8.9954602,9.0084827 9.6364976,7.8106933 11.753105,6.1654525 13.699033,5.352392 c 3.339954,-1.3955219 3.671389,-1.3530269 5.919509,0.7589721 2.580529,2.4242813 3.182384,7.0134599 1.131458,8.6274299 -1.487279,1.170409 -7.530646,2.088149 -9.999318,1.518487 z M 14.447214,9.9145898 C 14.125238,9.3936223 13.435557,9.2308108 12.91459,9.5527864 12.393622,9.874762 12.230811,10.564443 12.552786,11.08541 c 0.321976,0.520968 1.011657,0.683779 1.532624,0.361804 0.520968,-0.321976 0.683779,-1.011657 0.361804,-1.5326242 z m 5,0 C 19.125238,9.3936223 18.435557,9.2308108 17.91459,9.5527864 17.393622,9.874762 17.230811,10.564443 17.552786,11.08541 c 0.321976,0.520968 1.011657,0.683779 1.532624,0.361804 0.520968,-0.321976 0.683779,-1.011657 0.361804,-1.5326242 z"
       id="path42"
       inkscape:connector-curvature="0" />
  </g>
</svg>
