<?xml version="1.0" encoding="UTF-8" standalone="no"?>
<!-- Created with Inkscape (http://www.inkscape.org/) -->

<svg
   width="20mm"
   height="20mm"
   viewBox="0 0 20 20"
   version="1.1"
   id="svg5"
   inkscape:version="1.1.1 (3bf5ae0d25, 2021-09-20)"
   sodipodi:docname="curse.svg"
   xmlns:inkscape="http://www.inkscape.org/namespaces/inkscape"
   xmlns:sodipodi="http://sodipodi.sourceforge.net/DTD/sodipodi-0.dtd"
   xmlns="http://www.w3.org/2000/svg"
   xmlns:svg="http://www.w3.org/2000/svg">
  <sodipodi:namedview
     id="namedview7"
     pagecolor="#ffffff"
     bordercolor="#666666"
     borderopacity="1.0"
     inkscape:pageshadow="2"
     inkscape:pageopacity="0.0"
     inkscape:pagecheckerboard="0"
     inkscape:document-units="mm"
     showgrid="false"
     width="20mm"
     inkscape:zoom="5.1241863"
     inkscape:cx="34.639646"
     inkscape:cy="60.594987"
     inkscape:window-width="1680"
     inkscape:window-height="987"
     inkscape:window-x="-8"
     inkscape:window-y="-8"
     inkscape:window-maximized="1"
     inkscape:current-layer="layer1" />
  <defs
     id="defs2" />
  <g
     inkscape:label="Calque 1"
     inkscape:groupmode="layer"
     id="layer1">
    <g
       id="g21"
       transform="translate(-0.2581711,-0.20653676)">
      <path
         style="fill:#d7dbdd;stroke-width:0.264583"
         d="m 4.8396087,19.643841 -5.09035918,-3.09929 -0.00287,-0.281421 -0.00287,-0.281421 L 3.0318237,13.810335 6.3201384,11.638962 7.0185972,10.808891 7.7170562,9.9788198 8.8174929,7.8377271 9.9179297,5.6966344 10.05624,2.3921465 l 0.138311,-3.30448791 0.399289,-0.0760763 0.399289,-0.0760763 4.892378,2.8866788 4.892378,2.8866785 -0.08456,3.1397189 -0.08456,3.1397188 -0.368776,1.322917 -0.368776,1.322916 -0.871884,1.455209 -0.871885,1.455208 -3.701864,3.098632 -3.701865,3.098632 -0.396875,6.58e-4 -0.3968753,6.58e-4 z m 4.879544,-1.114915 -0.155272,-1.852083 h 0.8928183 0.892818 l 0.160367,0.505273 0.160368,0.505274 0.351524,0.291739 0.351524,0.291739 0.290507,-0.350039 0.290506,-0.350039 -0.694534,-0.97614 -0.694534,-0.976141 H 10.416877 9.2685094 L 9.2644578,15.023197 9.2604062,14.427884 9.0660203,14.133878 8.8716343,13.839872 7.6148635,13.654646 6.3580926,13.469419 v 0.408046 0.408046 l 0.7276042,0.159431 0.7276042,0.159432 0.3307292,0.101889 0.3307291,0.101888 v 0.405179 0.405179 h -2.778125 -2.778125 v 0.529167 0.529167 h 2.7730842 2.7730842 l 0.1228873,0.595312 0.1228873,0.595313 0.1629487,1.256771 0.1629486,1.25677 h 0.4190376 0.4190376 z"
         id="path35" />
      <path
         style="fill:#e38d90;stroke-width:0.264583"
         d="m 4.8396087,19.643841 -5.09035918,-3.09929 -0.00287,-0.281421 -0.00287,-0.281421 L 3.0318237,13.810335 6.3201384,11.638962 7.0185972,10.808891 7.7170562,9.9788198 8.8174929,7.8377271 9.9179297,5.6966344 10.05624,2.3921465 l 0.138311,-3.30448791 0.399289,-0.0760763 0.399289,-0.0760763 4.892378,2.8866788 4.892378,2.8866785 -0.08456,3.1397189 -0.08456,3.1397188 -0.368776,1.322917 -0.368776,1.322916 -0.871884,1.455209 -0.871885,1.455208 -3.701864,3.098632 -3.701865,3.098632 -0.396875,6.58e-4 -0.3968753,6.58e-4 z m 7.8684843,-0.02491 1.719791,-1.428555 0.07104,-0.176131 0.07104,-0.176131 -1.076061,-0.60478 -1.076061,-0.60478 -0.315392,-0.505023 -0.315393,-0.505024 H 11.115819 10.444585 L 9.8565474,15.206631 9.2685094,14.794753 V 14.307751 13.820748 L 7.570595,13.525069 5.8726806,13.22939 l -2.2633593,1.496716 -2.2633594,1.496715 4.4242946,2.698093 4.4242945,2.698094 0.396875,-0.285761 0.396875,-0.28576 z m 3.17769,-4.595736 0.874696,-0.595313 0.506726,-0.684364 0.506725,-0.684365 0.148041,-1.10372 0.14804,-1.103721 L 17.619001,9.670761 17.16799,8.4898081 16.38122,7.8277841 15.594449,7.16576 14.548146,6.8840201 13.501843,6.6022798 12.500367,6.8719493 11.49889,7.1416189 10.627334,8.0408366 9.7557779,8.9400543 9.5067783,10.048271 l -0.2489997,1.108216 0.2769074,1.028356 0.2769074,1.028356 0.7075286,0.840849 0.707528,0.84085 0.806867,0.35145 0.806867,0.351449 1.085352,0.01036 1.085352,0.01036 z m -3.007682,-0.465138 -0.756034,-0.231909 -0.537254,-0.478299 -0.537254,-0.4783 -0.360358,-0.851398 -0.360358,-0.851398 V 10.97064 10.274523 L 10.759395,9.3629863 11.191948,8.451449 11.936881,8.0662292 12.681814,7.6810094 h 1.1026 1.1026 l 0.987683,0.9921875 0.987683,0.9921875 0.186567,1.0069186 0.186568,1.006919 -0.477774,0.960381 -0.477773,0.960382 -0.661459,0.468155 -0.661458,0.468156 -0.661458,0.126836 -0.661459,0.126835 z"
         id="path33" />
      <path
         style="fill:#939391;stroke-width:0.264583"
         d="m 4.8396087,19.643841 -5.09035918,-3.09929 -0.00287,-0.281421 -0.00287,-0.281421 L 3.0318237,13.810335 6.3201384,11.638962 7.0185972,10.808891 7.7170562,9.9788198 8.8174929,7.8377271 9.9179297,5.6966344 10.05624,2.3921465 l 0.138311,-3.30448791 0.399289,-0.0760763 0.399289,-0.0760763 4.892378,2.8866788 4.892378,2.8866785 -0.08456,3.1397189 -0.08456,3.1397188 -0.368776,1.322917 -0.368776,1.322916 -0.871884,1.455209 -0.871885,1.455208 -3.701864,3.098632 -3.701865,3.098632 -0.396875,6.58e-4 -0.3968753,6.58e-4 z m 7.8684843,-0.02491 1.719791,-1.428555 0.07104,-0.176131 0.07104,-0.176131 -1.076061,-0.60478 -1.076061,-0.60478 -0.315392,-0.505023 -0.315393,-0.505024 H 11.115819 10.444585 L 9.8565474,15.206631 9.2685094,14.794753 V 14.307751 13.820748 L 7.570595,13.525069 5.8726806,13.22939 l -2.2633593,1.496716 -2.2633594,1.496715 4.4242946,2.698093 4.4242945,2.698094 0.396875,-0.285761 0.396875,-0.28576 z m 3.17769,-4.595736 0.874696,-0.595313 0.506726,-0.684364 0.506725,-0.684365 0.148041,-1.10372 0.14804,-1.103721 L 17.619001,9.670761 17.16799,8.4898081 16.38122,7.8277841 15.594449,7.16576 14.548146,6.8840201 13.501843,6.6022798 12.500367,6.8719493 11.49889,7.1416189 10.627334,8.0408366 9.7557779,8.9400543 9.5067783,10.048271 l -0.2489997,1.108216 0.2769074,1.028356 0.2769074,1.028356 0.7075286,0.840849 0.707528,0.84085 0.806867,0.35145 0.806867,0.351449 1.085352,0.01036 1.085352,0.01036 z m -3.007682,-0.465138 -0.756034,-0.231909 -0.537254,-0.478299 -0.537254,-0.4783 -0.360358,-0.851398 -0.360358,-0.851398 V 10.97064 10.274523 L 10.759395,9.3629863 11.191948,8.451449 11.936881,8.0662292 12.681814,7.6810094 h 1.1026 1.1026 l 0.987683,0.9921875 0.987683,0.9921875 0.186567,1.0069186 0.186568,1.006919 -0.477774,0.960381 -0.477773,0.960382 -0.661459,0.468155 -0.661458,0.468156 -0.661458,0.126836 -0.661459,0.126835 z m 2.248076,-1.585383 0.624624,-0.529167 -0.637667,-0.539728 -0.637668,-0.539729 -0.275145,0.275145 -0.275145,0.275146 h -0.338917 -0.338918 l -0.167767,-0.668438 -0.167767,-0.668437 -0.5042,-0.26984 -0.5042,-0.26984 -0.259116,0.160143 -0.259115,0.160142 v 0.798487 0.798488 l 0.773398,0.773397 0.773397,0.773398 h 0.784791 0.784791 z"
         id="path31" />
      <path
         style="fill:#82817e;stroke-width:0.264583"
         d="m 4.8396087,19.643841 -5.09035918,-3.09929 -0.00287,-0.281421 -0.00287,-0.281421 L 3.0318237,13.810335 6.3201384,11.638962 7.0185972,10.808891 7.7170562,9.9788198 8.8174929,7.8377271 9.9179297,5.6966344 10.05624,2.3921465 l 0.138311,-3.30448791 0.399289,-0.0760763 0.399289,-0.0760763 4.892378,2.8866788 4.892378,2.8866785 -0.08456,3.1397189 -0.08456,3.1397188 -0.368776,1.322917 -0.368776,1.322916 -0.871884,1.455209 -0.871885,1.455208 -3.701864,3.098632 -3.701865,3.098632 -0.396875,6.58e-4 -0.3968753,6.58e-4 z m 7.2599663,0.538731 1.820706,-1.521354 1.743947,-1.540769 1.743948,-1.540769 0.494229,-0.944129 0.494229,-0.94413 L 18.073636,13.57716 17.750637,13.462899 17.90841,12.31182 18.066183,11.160742 17.887629,10.208968 17.709076,9.2571953 16.866364,8.2973996 16.023652,7.3376037 15.16812,6.9801398 14.312589,6.622676 H 13.4998 12.687012 L 11.705365,7.1259966 10.723718,7.6293172 10.181819,8.2572023 9.6399211,8.8850874 8.783,10.382829 7.9260791,11.880571 4.610556,14.059685 l -3.3155235,2.179114 0.3487177,0.202795 0.3487174,0.202795 4.1010417,2.518885 4.1010417,2.518885 0.04216,0.01088 0.04216,0.01088 z m 1.668812,-9.073386 -2.771755,-1.5511008 -0.0754,-0.2261835 -0.07539,-0.2261836 0.640535,-0.6017514 0.640535,-0.6017511 1.04128,-0.1396651 1.041279,-0.1396648 0.848511,0.4387818 0.848511,0.4387821 0.516477,0.8470509 0.516477,0.8470505 9.79e-4,1.108864 9.99e-4,1.108865 -0.200642,0.124003 -0.200641,0.124003 z M 19.587259,8.1080829 V 7.476823 L 15.494652,5.0653745 11.402045,2.653926 h -0.158301 -0.1583 l 0.08372,0.6620717 0.08372,0.6620716 3.96875,2.3665312 3.96875,2.3665313 0.198438,0.014105 0.198437,0.014106 z M 19.80995,5.4603609 19.71955,5.3960679 15.569193,2.9666635 11.418835,0.53725907 h -0.149121 -0.149122 l 0.0037,0.46302083 0.0037,0.4630208 4.163468,2.4223901 4.163469,2.4223901 0.22269,-0.3917138 0.222691,-0.3917138 -0.0904,-0.064293 z"
         id="path29" />
      <path
         style="fill:#b45b5e;stroke-width:0.264583"
         d="m 4.8396087,19.643841 -5.09035918,-3.09929 -0.00287,-0.281421 -0.00287,-0.281421 L 3.0318237,13.810335 6.3201384,11.638962 7.0185972,10.808891 7.7170562,9.9788198 8.8174929,7.8377271 9.9179297,5.6966344 10.05624,2.3921465 l 0.138311,-3.30448791 0.399289,-0.0760763 0.399289,-0.0760763 4.892378,2.8866788 4.892378,2.8866785 -0.08456,3.1397189 -0.08456,3.1397188 -0.368776,1.322917 -0.368776,1.322916 -0.871884,1.455209 -0.871885,1.455208 -3.701864,3.098632 -3.701865,3.098632 -0.396875,6.58e-4 -0.3968753,6.58e-4 z m 8.8847053,-0.777688 3.349404,-2.837773 0.336094,-0.403373 0.336095,-0.403373 0.419089,-0.767798 0.419089,-0.767798 -0.436051,-0.244026 -0.436052,-0.244027 0.174522,-0.54987 0.174522,-0.549871 -0.01374,-0.995415 -0.01374,-0.995415 L 17.487934,9.0379181 16.942318,7.9684217 15.794147,7.2955488 14.645976,6.622676 h -0.977439 -0.97744 L 11.839699,6.9826456 10.988301,7.3426152 10.112265,8.3717081 9.2362286,9.400801 8.4745117,10.6417 l -0.7617169,1.240899 -3.2141706,2.153358 -3.2141705,2.153358 0.1307288,0.130729 0.1307287,0.130728 4.3243199,2.625644 4.3243199,2.625643 0.09018,9.34e-4 0.09018,9.33e-4 z m 1.625484,-6.94473 -0.921914,-0.522086 -1.795403,-0.97087 -1.795404,-0.9708697 0.09601,-0.2929813 0.09601,-0.2929816 0.878626,-0.5953125 0.878625,-0.5953125 h 0.648491 0.648491 l 0.931118,0.4418449 0.931119,0.4418446 0.496941,0.8149262 0.496941,0.8149259 9.79e-4,1.124479 9.99e-4,1.124479 H 16.60657 16.271713 Z m 4.060195,-4.7042819 -0.219609,-0.081107 -3.96875,-2.3670302 -3.96875,-2.3670305 -0.08732,0.8465238 -0.08732,0.8465238 0.219609,0.077145 0.219608,0.077145 3.96875,2.3622744 3.96875,2.3622746 0.08732,-0.837806 0.08732,-0.8378061 z m 0.44185,-1.3491898 V 5.3778101 L 16.08153,3.1784204 12.311218,0.97903072 11.69401,0.58107754 11.076803,0.18312442 l 0.08804,0.73196048 0.08804,0.7319603 3.96875,2.3417688 3.96875,2.3417689 0.33073,0.013756 0.330729,0.013754 z"
         id="path27" />
      <path
         style="fill:#5c5752;stroke-width:0.264583"
         d="m 4.8396087,19.643841 -5.09035918,-3.09929 -0.00287,-0.281421 -0.00287,-0.281421 L 3.0318237,13.810335 6.3201384,11.638962 7.0185972,10.808891 7.7170562,9.9788198 8.8174929,7.8377271 9.9179297,5.6966344 10.05624,2.3921465 l 0.138311,-3.30448791 0.399289,-0.0760763 0.399289,-0.0760763 4.892378,2.8866788 4.892378,2.8866785 -0.08456,3.1397189 -0.08456,3.1397188 -0.368776,1.322917 -0.368776,1.322916 -0.871884,1.455209 -0.871885,1.455208 -3.701864,3.098632 -3.701865,3.098632 -0.396875,6.58e-4 -0.3968753,6.58e-4 z m 8.8847053,-0.777688 3.349404,-2.837773 0.336094,-0.403373 0.336095,-0.403373 0.419089,-0.767798 0.419089,-0.767798 -0.436051,-0.244026 -0.436052,-0.244027 0.174522,-0.54987 0.174522,-0.549871 -0.01374,-0.995415 -0.01374,-0.995415 L 17.487934,9.0379181 16.942318,7.9684217 15.794147,7.2955488 14.645976,6.622676 h -0.977439 -0.97744 L 11.839699,6.9826456 10.988301,7.3426152 10.112265,8.3717081 9.2362286,9.400801 8.4745117,10.6417 l -0.7617169,1.240899 -3.2141706,2.153358 -3.2141705,2.153358 0.1307288,0.130729 0.1307287,0.130728 4.3243199,2.625644 4.3243199,2.625643 0.09018,9.34e-4 0.09018,9.33e-4 z m 2.335168,-6.599033 -0.176389,-0.176388 v -0.867191 -0.86719 L 15.255922,9.6272219 14.628752,8.8980927 h -0.94717 -0.94717 L 12.230349,9.3542635 11.726286,9.8104345 11.279966,9.639165 10.833644,9.4678957 10.93137,9.169765 11.029096,8.8716344 11.907722,8.2763219 12.786347,7.6810094 h 0.648491 0.648491 l 0.931118,0.4418449 0.931119,0.4418446 0.496941,0.8149262 0.496941,0.8149259 9.79e-4,1.124479 9.99e-4,1.124479 H 16.588648 16.23587 Z m -2.549977,-1.400776 -0.389212,-0.246146 0.179364,-0.179364 0.179364,-0.179364 0.408286,0.156674 0.408286,0.156674 v 0.272887 0.272888 l -0.198438,-0.0041 -0.198437,-0.0041 z m 5.900488,-3.6492029 -0.219609,-0.081107 -3.96875,-2.3670302 -3.96875,-2.3670305 -0.08732,0.8465238 -0.08732,0.8465238 0.219609,0.077145 0.219608,0.077145 3.96875,2.3622744 3.96875,2.3622746 0.08732,-0.837806 0.08732,-0.8378061 z m 0.44185,-1.3491898 V 5.3778101 L 16.08153,3.1784204 12.311218,0.97903072 11.69401,0.58107754 11.076803,0.18312442 l 0.08804,0.73196048 0.08804,0.7319603 3.96875,2.3417688 3.96875,2.3417689 0.33073,0.013756 0.330729,0.013754 z"
         id="path25" />
      <path
         style="fill:#1b1210;stroke-width:0.264583"
         d="m 4.8396087,19.643841 -5.09035918,-3.09929 -0.00287,-0.281421 -0.00287,-0.281421 L 3.0318237,13.810335 6.3201384,11.638962 7.0185972,10.808891 7.7170562,9.9788198 8.8174929,7.8377271 9.9179297,5.6966344 10.05624,2.3921465 l 0.138311,-3.30448791 0.399289,-0.0760763 0.399289,-0.0760763 4.892378,2.8866788 4.892378,2.8866785 -0.08456,3.1397189 -0.08456,3.1397188 -0.368776,1.322917 -0.368776,1.322916 -0.871884,1.455209 -0.871885,1.455208 -3.701864,3.098632 -3.701865,3.098632 -0.396875,6.58e-4 -0.3968753,6.58e-4 z m 9.1914003,-0.929261 3.571875,-2.985518 0.907227,-1.77758 0.907226,-1.77758 0.253214,-3.1525431 0.253214,-3.1525435 -0.13883,-0.3617846 -0.13883,-0.3617847 -4.155682,-2.4551642 -4.155683,-2.455164 -0.09056,0.0905637 -0.09056,0.0905637 -0.235334,3.0664242 -0.235334,3.066424 -1.4348213,2.5540756 -1.4348217,2.5540759 -1.984375,1.391593 -1.9843751,1.391594 -1.2562578,0.787576 -1.2562578,0.787576 0.072861,0.220122 0.072861,0.220121 4.2261052,2.606513 4.2261055,2.606512 0.264583,0.01572 0.264583,0.01572 3.571875,-2.985518 z"
         id="path23" />
    </g>
    <path
       style="fill:#ffffff;stroke-width:0.0516342"
       d="M 8.780428,19.995349 C 8.7650917,19.903053 8.6937528,19.36283 8.6218981,18.794854 8.5115026,17.922236 8.3674756,17.053163 8.2518042,16.561674 L 8.2244617,16.445497 H 5.4418121 2.659162 V 15.929155 15.412813 H 5.4494977 8.2398332 L 8.2248366,14.993774 8.20984,14.574735 7.9000346,14.47834 C 7.6481851,14.39998 6.2278262,14.070323 6.1420369,14.070323 c -0.012861,0 -0.023384,-0.174265 -0.023384,-0.387256 0,-0.212992 0.011525,-0.387257 0.025612,-0.387257 0.05292,0 2.1749167,0.312942 2.3124702,0.341032 0.098755,0.02017 0.1995775,0.112412 0.3227138,0.295259 0.1586058,0.235517 0.1791383,0.304391 0.1795357,0.602241 2.582e-4,0.184971 0.015049,0.457861 0.032895,0.606422 l 0.032446,0.270111 1.1359154,0.01388 1.135913,0.01388 0.684176,0.96259 0.684176,0.96259 -0.258265,0.315357 c -0.142045,0.173446 -0.276795,0.315356 -0.299443,0.315356 -0.02265,0 -0.181446,-0.117205 -0.352885,-0.260456 -0.299898,-0.250589 -0.318091,-0.27993 -0.480203,-0.774513 L 11.105213,16.445497 H 10.187765 9.2703167 l 0.026302,0.219445 c 0.033029,0.275567 0.2815278,3.282514 0.2815278,3.406608 0,0.07953 -0.050751,0.09161 -0.3849172,0.09161 H 8.8083129 Z"
       id="path209" />
    <path
       style="fill:#ffffff;stroke-width:0.0516342"
       d="M 8.7804378,19.995349 C 8.7651065,19.903053 8.6839334,19.304742 8.600053,18.665768 8.516173,18.026795 8.3966752,17.265836 8.3345029,16.974748 l -0.11304,-0.529251 H 5.4403124 2.659162 V 15.929155 15.412813 H 5.4494977 8.2398332 L 8.2248366,14.992386 8.20984,14.571959 7.9774861,14.500213 c -0.2111261,-0.06519 -1.7642676,-0.42989 -1.8307703,-0.42989 -0.015433,0 -0.028061,-0.174265 -0.028061,-0.387256 0,-0.22214 0.021878,-0.387257 0.051314,-0.387257 0.065066,0 2.0938553,0.303219 2.2877052,0.341916 0.1018222,0.02032 0.195658,0.107629 0.3173677,0.295271 0.1601435,0.246896 0.1750136,0.306128 0.2029968,0.808571 0.016608,0.298187 0.03063,0.571204 0.031163,0.606702 7.409e-4,0.04964 0.2625328,0.06454 1.1340915,0.06454 h 1.133123 l 0.58051,0.813239 c 0.31928,0.447281 0.633404,0.884053 0.698053,0.970604 l 0.117543,0.157366 -0.262273,0.320251 c -0.14425,0.176137 -0.281629,0.32025 -0.305286,0.32025 -0.02366,0 -0.181933,-0.11561 -0.351724,-0.256911 -0.297038,-0.247198 -0.315125,-0.276483 -0.478368,-0.774513 L 11.105213,16.445497 H 10.187765 9.270317 l 0.026408,0.219445 c 0.038287,0.31814 0.2814204,3.237103 0.2814204,3.378618 0,0.114349 -0.016902,0.1196 -0.3849172,0.1196 H 8.8083116 Z"
       id="path248" />
    <path
       style="fill:#ffffff;stroke-width:0.0516342"
       d="M 8.7831563,20.021166 C 8.7673819,19.94307 8.6954541,19.414464 8.6233184,18.846488 8.5511834,18.278512 8.4311441,17.505935 8.3565652,17.12965 L 8.220967,16.445497 H 5.4400645 2.659162 V 15.929155 15.412813 H 5.4474096 8.235657 V 15.003889 14.594965 L 7.9903946,14.51411 C 7.763998,14.439475 6.2454403,14.072327 6.15738,14.070935 6.136081,14.070592 6.118654,13.896058 6.118654,13.683067 c 0,-0.212992 0.02046,-0.387257 0.045465,-0.387257 0.066864,0 2.1241586,0.305706 2.2935549,0.340813 0.1010811,0.02095 0.1966169,0.110097 0.3176114,0.296374 0.1751152,0.269598 0.2288749,0.559607 0.2334553,1.259383 l 0.00143,0.218457 1.1443654,0.0139 1.144367,0.0139 0.483156,0.671245 c 0.265736,0.369184 0.574269,0.800796 0.68563,0.959136 l 0.202473,0.287892 -0.261093,0.31881 c -0.143601,0.175346 -0.280449,0.31881 -0.304106,0.31881 -0.02366,0 -0.181933,-0.11561 -0.351723,-0.256911 -0.29704,-0.247206 -0.315127,-0.276491 -0.47837,-0.774522 L 11.105212,16.445496 H 10.186166 9.26712 l 0.027534,0.193628 c 0.0333,0.23418 0.283492,3.240632 0.283492,3.406608 0,0.111597 -0.019024,0.117427 -0.3831537,0.117427 -0.3766103,0 -0.3836445,-0.0024 -0.4118366,-0.141994 z"
       id="path287" />
  </g>
</svg>
