<?xml version="1.0" encoding="UTF-8" standalone="no"?>
<!-- Created with Inkscape (http://www.inkscape.org/) -->

<svg
   version="1.1"
   id="svg9"
   width="20"
   height="20"
   viewBox="0 0 20 20"
   sodipodi:docname="detector.svg"
   inkscape:version="1.1.1 (3bf5ae0d25, 2021-09-20)"
   xmlns:inkscape="http://www.inkscape.org/namespaces/inkscape"
   xmlns:sodipodi="http://sodipodi.sourceforge.net/DTD/sodipodi-0.dtd"
   xmlns="http://www.w3.org/2000/svg"
   xmlns:svg="http://www.w3.org/2000/svg">
  <defs
     id="defs13" />
  <sodipodi:namedview
     id="namedview11"
     pagecolor="#ffffff"
     bordercolor="#666666"
     borderopacity="1.0"
     inkscape:pageshadow="2"
     inkscape:pageopacity="0.0"
     inkscape:pagecheckerboard="0"
     showgrid="false"
     inkscape:zoom="5.4285177"
     inkscape:cx="59.040058"
     inkscape:cy="21.829163"
     inkscape:window-width="1680"
     inkscape:window-height="987"
     inkscape:window-x="-8"
     inkscape:window-y="-8"
     inkscape:window-maximized="1"
     inkscape:current-layer="g15" />
  <g
     inkscape:groupmode="layer"
     inkscape:label="Image"
     id="g15">
    <g
       id="g99"
       transform="matrix(0.6752483,0,0,0.6752483,1.2511023,-1.8938797)">
      <path
         style="fill:#d7d7d7"
         d="m 8.275959,32.929578 -8.8454798,-2.99533 -1.7997717,-0.963208 -1.7997718,-0.963209 -1.2286044,-5.121398 -1.2286044,-5.121397 2.3469,-5.010729 2.3469,-5.0107302 5.4013861,-2.388749 5.401386,-2.388749 h 1.690357 1.690357 l 1.669034,-3.5 1.669034,-3.5 h 1.016178 1.016179 v 1.0496599 1.04966 l -1.460118,2.8235559 -1.460117,2.8235562 0.618108,0.618108 0.618108,0.618108 1.436313,-1.192033 1.436312,-1.1920338 1.794443,2.3789468 1.794443,2.378947 2.131578,-4.178238 2.131578,-4.178237 h 0.979676 0.979676 v 1.0496599 1.04966 l -1.632176,3.1562811 -1.632177,3.156281 1.232244,0.410748 1.232244,0.410748 2.390164,5.1333112 2.390163,5.133311 0.0098,1.783244 0.0097,1.783243 -2.391209,4.716757 -2.391209,4.716756 -4.635542,2.25 -4.635543,2.25 -0.723248,-0.02059 -0.723249,-0.02059 z"
         id="path123" />
      <path
         style="fill:#a7a7a7"
         d="m 8.275959,32.929578 -8.8454798,-2.99533 -1.7997717,-0.963208 -1.7997718,-0.963209 -1.2286044,-5.121398 -1.2286044,-5.121397 2.3469,-5.010729 2.3469,-5.0107302 5.4013861,-2.388749 5.401386,-2.388749 h 1.690357 1.690357 l 1.669034,-3.5 1.669034,-3.5 h 1.016178 1.016179 v 1.0496599 1.04966 l -1.460118,2.8235559 -1.460117,2.8235562 0.618108,0.618108 0.618108,0.618108 1.436313,-1.192033 1.436312,-1.1920338 1.794443,2.3789468 1.794443,2.378947 2.131578,-4.178238 2.131578,-4.178237 h 0.979676 0.979676 v 1.0496599 1.04966 l -1.632176,3.1562811 -1.632177,3.156281 1.232244,0.410748 1.232244,0.410748 2.390164,5.1333112 2.390163,5.133311 0.0098,1.783244 0.0097,1.783243 -2.391209,4.716757 -2.391209,4.716756 -4.635542,2.25 -4.635543,2.25 -0.723248,-0.02059 -0.723249,-0.02059 z m 12.563864,-12.464525 3.718385,-6.998974 0.03161,-1.212176 0.03162,-1.212176 L 16.470087,8.5384258 8.318736,6.0351248 7.447709,6.5734488 6.576682,7.1117738 3.59906,13.01041 0.621438,18.909046 v 1.914993 1.914994 l 6.75,2.570173 6.75,2.570174 1.5,-0.207677 1.5,-0.207677 z m -12.218385,3.323903 -5.5,-2.06705 L 2.29478,20.967335 1.468122,20.212763 4.559175,14.089421 7.650228,7.9660788 H 8.27802 8.905812 l 6.857813,2.0423452 6.857813,2.042345 -0.02812,0.707655 -0.02812,0.707655 -3.221884,5.938547 -3.221884,5.938548 -1,0.256416 -1,0.256416 z"
         id="path121" />
      <path
         style="fill:#f7e70f"
         d="m 8.275959,32.929578 -8.8454798,-2.99533 -1.7997717,-0.963208 -1.7997718,-0.963209 -1.2286044,-5.121398 -1.2286044,-5.121397 2.3469,-5.010729 2.3469,-5.0107302 L 3.481264,5.3493658 8.895,2.9551546 l 2.939243,0.2239622 2.939242,0.223963 0.513004,0.830058 0.513004,0.830058 1.505276,-1.249268 1.505275,-1.2492678 1.655697,2.0157248 1.655697,2.015724 1.416667,-0.065015 1.416666,-0.065015 0.409465,-1.5 0.409464,-1.5 -1.060818,1.5 -1.060818,1.5 -0.01531,-0.79966 -0.01531,-0.79966 1.52568,-2.9503399 1.52568,-2.9503401 h 0.97432 0.97432 v 1.0496599 1.04966 l -1.632176,3.1562811 -1.632177,3.156281 1.232244,0.410748 1.232244,0.410748 2.390164,5.1333112 2.390163,5.133311 0.0098,1.783244 0.0097,1.783243 -2.391209,4.716757 -2.391209,4.716756 -4.635542,2.25 -4.635543,2.25 -0.723248,-0.02059 -0.723249,-0.02059 z m 20.626296,-9.463499 2.697452,-5.5 H 30.627419 29.65513 l -2.516846,4.966756 -2.516846,4.966757 v 0.533243 0.533244 h 0.791682 0.791682 z m -8.062432,-3.001026 3.718385,-6.998974 0.03161,-1.212176 0.03162,-1.212176 L 16.470087,8.5384258 8.318736,6.0351248 7.447709,6.5734488 6.576682,7.1117738 3.59906,13.01041 0.621438,18.909046 v 1.914993 1.914994 l 6.75,2.570173 6.75,2.570174 1.5,-0.207677 1.5,-0.207677 z M 7.798782,23.298079 3.476125,21.750975 2.980638,20.459757 2.485152,19.168539 l 2.688443,-5.35123 2.688444,-5.3512302 0.176727,-0.213694 0.176727,-0.213694 6.702972,2.0109402 6.702973,2.01094 -0.02336,1.202754 -0.02336,1.202754 -2.726641,5 -2.726641,5 -2,0.189552 -2,0.189552 z M -0.878562,12.966079 1.65513,7.9660788 H 0.723778 -0.2075728 l -2.4805827,4.4382452 -2.4805827,4.438245 0.5617547,0.561755 0.5617548,0.561755 h 0.3164875 0.3164875 z m 13.515313,-10.2996601 -0.01531,-0.79966 1.52568,-2.95034 1.52568,-2.9503401 h 0.97432 0.97432 l -0.03543,1.25 -0.03544,1.25 -1.429129,2.5 -1.429129,2.5 -0.05075,-1.5 -0.05075,-1.5 -0.969374,1.5 -0.969374,1.5 z"
         id="path119" />
      <path
         style="fill:#6fbf8f"
         d="m 8.275959,32.929578 -8.8454798,-2.99533 -1.7997717,-0.963208 -1.7997718,-0.963209 -1.2286044,-5.121398 -1.2286044,-5.121397 2.3469,-5.010729 2.3469,-5.0107302 L 3.481264,5.3493658 8.895,2.9551546 l 2.939243,0.2239622 2.939242,0.223963 0.513004,0.830058 0.513004,0.830058 1.505276,-1.249268 1.505275,-1.2492678 1.655697,2.0157248 1.655697,2.015724 1.416667,-0.065015 1.416666,-0.065015 0.409465,-1.5 0.409464,-1.5 -1.060818,1.5 -1.060818,1.5 -0.01531,-0.79966 -0.01531,-0.79966 1.52568,-2.9503399 1.52568,-2.9503401 h 0.97432 0.97432 v 1.0496599 1.04966 l -1.632176,3.1562811 -1.632177,3.156281 1.232244,0.410748 1.232244,0.410748 2.390164,5.1333112 2.390163,5.133311 0.0098,1.783244 0.0097,1.783243 -2.391209,4.716757 -2.391209,4.716756 -4.635542,2.25 -4.635543,2.25 -0.723248,-0.02059 -0.723249,-0.02059 z m 20.626296,-9.463499 2.697452,-5.5 H 30.627419 29.65513 l -2.516846,4.966756 -2.516846,4.966757 v 0.533243 0.533244 h 0.791682 0.791682 z m -8.062432,-3.001026 3.718385,-6.998974 0.03161,-1.212176 0.03162,-1.212176 L 16.470087,8.5384258 8.318736,6.0351248 7.447709,6.5734488 6.576682,7.1117738 3.59906,13.01041 0.621438,18.909046 v 1.914993 1.914994 l 6.75,2.570173 6.75,2.570174 1.5,-0.207677 1.5,-0.207677 z M 7.798782,23.298079 3.476125,21.750975 2.980638,20.459757 2.485152,19.168539 l 2.688443,-5.35123 2.688444,-5.3512302 0.176727,-0.213694 0.176727,-0.213694 6.702972,2.0109402 6.702973,2.01094 -0.02336,1.202754 -0.02336,1.202754 -2.726641,5 -2.726641,5 -2,0.189552 -2,0.189552 z m 17.822656,-4.332 v -1 h -1 -1 v 1 1 h 1 1 z m -26.5,-6 L 1.65513,7.9660788 H 0.723778 -0.2075728 l -2.4805827,4.4382452 -2.4805827,4.438245 0.5617547,0.561755 0.5617548,0.561755 h 0.3164875 0.3164875 z M 27.590812,0.4660788 v -1 l -0.969374,1.5 -0.969374,1.5 v 1 1 l 0.969374,-1.5 0.969374,-1.5 z m -14.954061,2.2003401 -0.01531,-0.79966 1.52568,-2.95034 1.52568,-2.9503401 h 0.97432 0.97432 l -0.03543,1.25 -0.03544,1.25 -1.429129,2.5 -1.429129,2.5 -0.05075,-1.5 -0.05075,-1.5 -0.969374,1.5 -0.969374,1.5 z m 3.954061,-5.2003401 v -1 l -0.969374,1.5 -0.969374,1.5 v 1 1 l 0.969374,-1.5 0.969374,-1.5 z"
         id="path117" />
      <path
         style="fill:#5fbf87"
         d="m 8.275959,32.929578 -8.8454798,-2.99533 -1.7997717,-0.963208 -1.7997718,-0.963209 -1.2286044,-5.121398 -1.2286044,-5.121397 2.3469,-5.010729 2.3469,-5.0107302 L 3.481264,5.3493658 8.895,2.9551546 l 2.939243,0.2239622 2.939242,0.223963 0.513004,0.830058 0.513004,0.830058 1.505276,-1.249268 1.505275,-1.2492678 1.655697,2.0157248 1.655697,2.015724 1.416667,-0.065015 1.416666,-0.065015 0.409465,-1.5 0.409464,-1.5 -1.060818,1.5 -1.060818,1.5 -0.01531,-0.79966 -0.01531,-0.79966 1.52568,-2.9503399 1.52568,-2.9503401 h 0.97432 0.97432 v 1.0496599 1.04966 l -1.632176,3.1562811 -1.632177,3.156281 1.232244,0.410748 1.232244,0.410748 2.390164,5.1333112 2.390163,5.133311 0.0098,1.783244 0.0097,1.783243 -2.391209,4.716757 -2.391209,4.716756 -4.635542,2.25 -4.635543,2.25 -0.723248,-0.02059 -0.723249,-0.02059 z m 20.626296,-9.463499 2.697452,-5.5 H 30.627419 29.65513 l -2.516846,4.966756 -2.516846,4.966757 v 0.533243 0.533244 h 0.791682 0.791682 z M 21.285662,20.593899 24.933514,13.22172 24.37937,11.777642 23.825225,10.333565 16.309647,8.1498218 8.79407,5.9660788 H 7.720326 6.646581 l -3.628276,7.2047942 -3.6282757,7.204794 0.9263717,1.468604 0.926372,1.468605 5.939332,2.275006 5.939333,2.275007 2.258186,0.0516 2.258187,0.05159 z m -13.48688,2.70418 -4.322657,-1.547104 -0.495487,-1.291218 -0.495486,-1.291218 2.688443,-5.35123 2.688444,-5.3512302 0.176727,-0.213694 0.176727,-0.213694 6.702972,2.0109402 6.702973,2.01094 -0.02336,1.202754 -0.02336,1.202754 -2.726641,5 -2.726641,5 -2,0.189552 -2,0.189552 z m 17.822656,-4.332 v -1 h -1 -1 v 1 1 h 1 1 z m -26.5,-6 L 1.65513,7.9660788 H 0.723778 -0.2075728 l -2.4805827,4.4382452 -2.4805827,4.438245 0.5617547,0.561755 0.5617548,0.561755 h 0.3164875 0.3164875 z m 20.5,-8.0000002 v -1 h -1.059017 -1.059017 l 0.618034,1 0.618034,1 h 0.440983 0.440983 z m 7.969374,-4.5 v -1 l -0.969374,1.5 -0.969374,1.5 v 1 1 l 0.969374,-1.5 0.969374,-1.5 z m -14.954061,2.2003401 -0.01531,-0.79966 1.52568,-2.95034 1.52568,-2.9503401 h 0.97432 0.97432 l -0.03543,1.25 -0.03544,1.25 -1.429129,2.5 -1.429129,2.5 -0.05075,-1.5 -0.05075,-1.5 -0.969374,1.5 -0.969374,1.5 z m 3.954061,-5.2003401 v -1 l -0.969374,1.5 -0.969374,1.5 v 1 1 l 0.969374,-1.5 0.969374,-1.5 z"
         id="path115" />
      <path
         style="fill:#37af67"
         d="m 8.275959,32.929578 -8.8454798,-2.99533 -1.7997717,-0.963208 -1.7997718,-0.963209 -1.2286044,-5.121398 -1.2286044,-5.121397 2.3469,-5.010729 2.3469,-5.0107302 L 3.481264,5.3493658 8.895,2.9551546 l 2.939243,0.2239622 2.939242,0.223963 0.513004,0.830058 0.513004,0.830058 1.505276,-1.249268 1.505275,-1.2492678 1.655697,2.0157248 1.655697,2.015724 1.416667,-0.065015 1.416666,-0.065015 0.409465,-1.5 0.409464,-1.5 -1.060818,1.5 -1.060818,1.5 -0.01531,-0.79966 -0.01531,-0.79966 1.52568,-2.9503399 1.52568,-2.9503401 h 0.97432 0.97432 v 1.0496599 1.04966 l -1.632176,3.1562811 -1.632177,3.156281 1.232244,0.410748 1.232244,0.410748 2.390164,5.1333112 2.390163,5.133311 0.0098,1.783244 0.0097,1.783243 -2.391209,4.716757 -2.391209,4.716756 -4.635542,2.25 -4.635543,2.25 -0.723248,-0.02059 -0.723249,-0.02059 z m 13.345479,-2.568004 2.5,-1.533635 -2,0.682524 -2,0.682523 -1.534134,0.446728 -1.534134,0.446727 -9.869941,-3.572773 -9.869941,-3.572772 -0.3827394,0.382739 -0.3827393,0.382739 9.7868147,3.573116 9.786814,3.573115 1.5,0.0213 1.5,0.0213 2.5,-1.533634 z m 7.280817,-6.895495 2.697452,-5.5 H 30.627419 29.65513 l -2.516846,4.966756 -2.516846,4.966757 v 0.533243 0.533244 h 0.791682 0.791682 z M 21.285662,20.593899 24.933514,13.22172 24.37937,11.777642 23.825225,10.333565 16.309647,8.1498218 8.79407,5.9660788 H 7.720326 6.646581 l -3.628276,7.2047942 -3.6282757,7.204794 0.9263717,1.468604 0.926372,1.468605 5.939332,2.275006 5.939333,2.275007 2.258186,0.0516 2.258187,0.05159 z m -13.48688,2.70418 -4.322657,-1.547104 -0.495487,-1.291218 -0.495486,-1.291218 2.688443,-5.35123 2.688444,-5.3512302 0.176727,-0.213694 0.176727,-0.213694 6.702972,2.0109402 6.702973,2.01094 -0.02336,1.202754 -0.02336,1.202754 -2.726641,5 -2.726641,5 -2,0.189552 -2,0.189552 z m 17.822656,-4.332 v -1 h -1 -1 v 1 1 h 1 1 z m -26.5,-6 L 1.65513,7.9660788 H 0.723778 -0.2075728 l -2.4805827,4.4382452 -2.4805827,4.438245 0.5617547,0.561755 0.5617548,0.561755 h 0.3164875 0.3164875 z m 20.5,-8.0000002 v -1 h -1.059017 -1.059017 l 0.618034,1 0.618034,1 h 0.440983 0.440983 z m 7.969374,-4.5 v -1 l -0.969374,1.5 -0.969374,1.5 v 1 1 l 0.969374,-1.5 0.969374,-1.5 z m -14.954061,2.2003401 -0.01531,-0.79966 1.52568,-2.95034 1.52568,-2.9503401 h 0.97432 0.97432 l -0.03543,1.25 -0.03544,1.25 -1.429129,2.5 -1.429129,2.5 -0.05075,-1.5 -0.05075,-1.5 -0.969374,1.5 -0.969374,1.5 z m 3.954061,-5.2003401 v -1 l -0.969374,1.5 -0.969374,1.5 v 1 1 l 0.969374,-1.5 0.969374,-1.5 z"
         id="path113" />
      <path
         style="fill:#676767"
         d="m 8.275959,32.929578 -8.8454798,-2.99533 -1.7997717,-0.963208 -1.7997718,-0.963209 -1.2286044,-5.121398 -1.2286044,-5.121397 2.3469,-5.010729 2.3469,-5.0107302 L 3.481264,5.3493658 8.895,2.9551546 l 2.939243,0.2239622 2.939242,0.223963 0.513004,0.830058 0.513004,0.830058 1.505276,-1.249268 1.505275,-1.2492678 1.655697,2.0157248 1.655697,2.015724 1.416667,-0.065015 1.416666,-0.065015 0.409465,-1.5 0.409464,-1.5 -1.060818,1.5 -1.060818,1.5 -0.01531,-0.79966 -0.01531,-0.79966 1.52568,-2.9503399 1.52568,-2.9503401 h 0.97432 0.97432 v 1.0496599 1.04966 l -1.632176,3.1562811 -1.632177,3.156281 1.232244,0.410748 1.232244,0.410748 2.390164,5.1333112 2.390163,5.133311 0.0098,1.783244 0.0097,1.783243 -2.391209,4.716757 -2.391209,4.716756 -4.635542,2.25 -4.635543,2.25 -0.723248,-0.02059 -0.723249,-0.02059 z m 12.548426,-2.014739 2.297053,-1.051239 1.63045,-3.842716 1.630451,-3.842716 -2.375558,-1.082377 -2.375559,-1.082376 1.636976,-3.432774 1.636976,-3.432774 L 24.3652,11.740716 23.825225,10.333565 16.309647,8.1498218 8.79407,5.9660788 H 7.728078 6.662086 l -2.023931,3.967231 -2.02393,3.9672322 -1.406052,-0.539553 -1.4060518,-0.539553 -0.6558504,2.066402 -0.6558504,2.066401 -1.5354801,1.535481 -1.53548,1.53548 0.5897517,2.349758 0.5897518,2.349758 9.7612372,3.563944 9.761237,3.563945 1.202947,0.05674 1.202947,0.05674 z M 7.798782,23.298079 3.476125,21.750975 2.980638,20.459757 2.485152,19.168539 l 2.688443,-5.35123 2.688444,-5.3512302 0.176727,-0.213694 0.176727,-0.213694 6.702972,2.0109402 6.702973,2.01094 -0.02336,1.202754 -0.02336,1.202754 -2.726641,5 -2.726641,5 -2,0.189552 -2,0.189552 z m 21.103473,0.168 2.697452,-5.5 H 30.627419 29.65513 l -2.516846,4.966756 -2.516846,4.966757 v 0.533243 0.533244 h 0.791682 0.791682 z m -3.280817,-4.5 v -1 h -1 -1 v 1 1 h 1 1 z m -26.5,-6 L 1.65513,7.9660788 H 0.723778 -0.2075728 l -2.4805827,4.4382452 -2.4805827,4.438245 0.5617547,0.561755 0.5617548,0.561755 h 0.3164875 0.3164875 z m 20.5,-8.0000002 v -1 h -1.059017 -1.059017 l 0.618034,1 0.618034,1 h 0.440983 0.440983 z m 7.969374,-4.5 v -1 l -0.969374,1.5 -0.969374,1.5 v 1 1 l 0.969374,-1.5 0.969374,-1.5 z m -14.954061,2.2003401 -0.01531,-0.79966 1.52568,-2.95034 1.52568,-2.9503401 h 0.97432 0.97432 l -0.03543,1.25 -0.03544,1.25 -1.429129,2.5 -1.429129,2.5 -0.05075,-1.5 -0.05075,-1.5 -0.969374,1.5 -0.969374,1.5 z m 3.954061,-5.2003401 v -1 l -0.969374,1.5 -0.969374,1.5 v 1 1 l 0.969374,-1.5 0.969374,-1.5 z"
         id="path111" />
      <path
         style="fill:#3f7f5f"
         d="m 8.275959,32.929578 -8.8454798,-2.99533 -1.7997717,-0.963208 -1.7997718,-0.963209 -1.2286044,-5.121398 -1.2286044,-5.121397 2.3469,-5.010729 2.3469,-5.0107302 L 3.481264,5.3493658 8.895,2.9551546 l 2.939243,0.2239622 2.939242,0.223963 0.513004,0.830058 0.513004,0.830058 1.505276,-1.249268 1.505275,-1.2492678 1.655697,2.0157248 1.655697,2.015724 1.416667,-0.065015 1.416666,-0.065015 0.409465,-1.5 0.409464,-1.5 -1.060818,1.5 -1.060818,1.5 -0.01531,-0.79966 -0.01531,-0.79966 1.52568,-2.9503399 1.52568,-2.9503401 h 0.97432 0.97432 v 1.0496599 1.04966 l -1.632176,3.1562811 -1.632177,3.156281 1.232244,0.410748 1.232244,0.410748 2.390164,5.1333112 2.390163,5.133311 0.0098,1.783244 0.0097,1.783243 -2.391209,4.716757 -2.391209,4.716756 -4.635542,2.25 -4.635543,2.25 -0.723248,-0.02059 -0.723249,-0.02059 z m 12.548426,-2.014739 2.297053,-1.051239 1.63045,-3.842716 1.630451,-3.842716 -2.375558,-1.082377 -2.375559,-1.082376 1.636976,-3.432774 1.636976,-3.432774 L 24.3652,11.740716 23.825225,10.333565 16.309647,8.1498218 8.79407,5.9660788 H 7.728078 6.662086 l -2.023931,3.967231 -2.02393,3.9672322 -1.406052,-0.539553 -1.4060518,-0.539553 -0.6558504,2.066402 -0.6558504,2.066401 -1.5354801,1.535481 -1.53548,1.53548 0.5897517,2.349758 0.5897518,2.349758 9.7612372,3.563944 9.761237,3.563945 1.202947,0.05674 1.202947,0.05674 z M 11.196784,18.115697 7.621438,11.016007 V 9.9910428 8.9660788 h 1.306809 1.306808 l 3.388603,7.0045892 3.388603,7.004588 -1.120065,1.120065 -1.120065,1.120065 z m 4.57817,-2.770535 -2.245015,-4.620918 0.478748,-0.478747 0.478747,-0.4787472 3.567002,1.1772162 3.567002,1.177217 v 0.972108 0.972108 l -1.52568,2.95034 -1.52568,2.95034 h -0.275054 -0.275055 z m 15.801297,4.870917 0.04519,-2.25 H 30.638284 29.65513 l -2.541633,5.015671 -2.541633,5.015672 1.274787,1.389178 1.274787,1.389177 2.204813,-4.154849 2.204812,-4.154849 z m -5.954813,-1.25 v -1 h -1 -1 v 1 1 h 1 1 z m -26.5,-6 L 1.65513,7.9660788 H 0.3375496 -0.9800306 L -3.1792963,12.49283 -5.378562,17.019582 v 0.473248 0.473249 h 0.9831541 0.9831542 z m 20.5,-8.0000002 v -1 h -1.059017 -1.059017 l 0.618034,1 0.618034,1 h 0.440983 0.440983 z m 7.969374,-4.5 v -1 l -0.969374,1.5 -0.969374,1.5 v 1 1 l 0.969374,-1.5 0.969374,-1.5 z m -14.954061,2.2003401 -0.01531,-0.79966 1.52568,-2.95034 1.52568,-2.9503401 h 0.97432 0.97432 l -0.03543,1.25 -0.03544,1.25 -1.429129,2.5 -1.429129,2.5 -0.05075,-1.5 -0.05075,-1.5 -0.969374,1.5 -0.969374,1.5 z m 3.954061,-5.2003401 v -1 l -0.969374,1.5 -0.969374,1.5 v 1 1 l 0.969374,-1.5 0.969374,-1.5 z"
         id="path109" />
      <path
         style="fill:#378f57"
         d="m 8.275959,32.929578 -8.8454798,-2.99533 -1.7997717,-0.963208 -1.7997718,-0.963209 -1.2286044,-5.121398 -1.2286044,-5.121397 2.3469,-5.010729 2.3469,-5.0107302 L 3.481264,5.3493658 8.895,2.9551546 l 2.939243,0.2239622 2.939242,0.223963 0.513004,0.830058 0.513004,0.830058 1.505276,-1.249268 1.505275,-1.2492678 1.655697,2.0157248 1.655697,2.015724 1.416667,-0.065015 1.416666,-0.065015 0.409465,-1.5 0.409464,-1.5 -1.060818,1.5 -1.060818,1.5 -0.01531,-0.79966 -0.01531,-0.79966 1.52568,-2.9503399 1.52568,-2.9503401 h 0.97432 0.97432 v 1.0496599 1.04966 l -1.632176,3.1562811 -1.632177,3.156281 1.232244,0.410748 1.232244,0.410748 2.390164,5.1333112 2.390163,5.133311 0.0098,1.783244 0.0097,1.783243 -2.391209,4.716757 -2.391209,4.716756 -4.635542,2.25 -4.635543,2.25 -0.723248,-0.02059 -0.723249,-0.02059 z m 12.798426,-1.124014 2.547053,-1.160515 v -1.389145 -1.389145 l 1.453606,-2.810964 1.453606,-2.810963 -2.448714,-1.115709 -2.448714,-1.115708 1.636976,-3.432774 1.636976,-3.432774 L 24.3652,11.740716 23.825225,10.333565 16.309647,8.1498218 8.79407,5.9660788 H 7.728078 6.662086 l -2.023931,3.967231 -2.02393,3.9672322 -1.353474,-0.519377 -1.3534737,-0.519377 -1.26424,3.052146 -1.26424,3.052145 H -3.4998823 -4.378562 v 1.889216 1.889216 l 1.75,2.032613 1.75,2.032613 9,3.062615 9,3.062616 0.702947,0.01556 0.702947,0.01555 z M 11.196784,18.115697 7.621438,11.016007 V 9.9910428 8.9660788 h 1.306809 1.306808 l 3.388603,7.0045892 3.388603,7.004588 -1.120065,1.120065 -1.120065,1.120065 z m 4.57817,-2.770535 -2.245015,-4.620918 0.478748,-0.478747 0.478747,-0.4787472 3.567002,1.1772162 3.567002,1.177217 v 0.972108 0.972108 l -1.52568,2.95034 -1.52568,2.95034 h -0.275054 -0.275055 z m 15.801297,4.870917 0.04519,-2.25 H 30.638284 29.65513 l -2.541633,5.015671 -2.541633,5.015672 1.274787,1.389178 1.274787,1.389177 2.204813,-4.154849 2.204812,-4.154849 z m -5.954813,-1.25 v -1 h -1 -1 v 1 1 h 1 1 z m -26.5,-6 L 1.65513,7.9660788 H 0.3375496 -0.9800306 L -3.1792963,12.49283 -5.378562,17.019582 v 0.473248 0.473249 h 0.9831541 0.9831542 z m 20.5,-8.0000002 v -1 h -1.059017 -1.059017 l 0.618034,1 0.618034,1 h 0.440983 0.440983 z m 7.969374,-4.5 v -1 l -0.969374,1.5 -0.969374,1.5 v 1 1 l 0.969374,-1.5 0.969374,-1.5 z m -14.954061,2.2003401 -0.01531,-0.79966 1.52568,-2.95034 1.52568,-2.9503401 h 0.97432 0.97432 l -0.03543,1.25 -0.03544,1.25 -1.429129,2.5 -1.429129,2.5 -0.05075,-1.5 -0.05075,-1.5 -0.969374,1.5 -0.969374,1.5 z m 3.954061,-5.2003401 v -1 l -0.969374,1.5 -0.969374,1.5 v 1 1 l 0.969374,-1.5 0.969374,-1.5 z"
         id="path107" />
      <path
         style="fill:#474747"
         d="m 8.275959,32.929578 -8.8454798,-2.99533 -1.7997717,-0.963208 -1.7997718,-0.963209 -1.2286044,-5.121398 -1.2286044,-5.121397 2.3469,-5.010729 2.3469,-5.0107302 5.4013861,-2.388749 5.401386,-2.388749 h 1.690357 1.690357 l 1.669034,-3.5 1.669034,-3.5 h 1.016178 1.016179 v 1.0496599 1.04966 l -1.460118,2.8235559 -1.460117,2.8235562 0.618108,0.618108 0.618108,0.618108 1.436313,-1.192033 1.436312,-1.1920338 1.794443,2.3789468 1.794443,2.378947 2.131578,-4.178238 2.131578,-4.178237 h 0.979676 0.979676 v 1.0496599 1.04966 l -1.632176,3.1562811 -1.632177,3.156281 1.232244,0.410748 1.232244,0.410748 2.390164,5.1333112 2.390163,5.133311 0.0098,1.783244 0.0097,1.783243 -2.391209,4.716757 -2.391209,4.716756 -4.635542,2.25 -4.635543,2.25 -0.723248,-0.02059 -0.723249,-0.02059 z m 12.798426,-1.124014 2.547053,-1.160515 V 29.27232 27.899592 l 2.631145,-5.216757 2.631146,-5.216756 1.018449,-0.651472 1.01845,-0.651472 -1.908761,-3.26825 -1.908761,-3.2682502 -8.828228,-2.942743 -8.828229,-2.942743 -3.868596,1.744494 -3.868596,1.744494 0.205991,0.67016 0.20599,0.67016 -2.4209374,5.1978112 -2.4209373,5.197811 H -3.5494994 -4.378562 v 1.889216 1.889216 l 1.75,2.032613 1.75,2.032613 9,3.062615 9,3.062616 0.702947,0.01556 0.702947,0.01555 z M 11.196784,18.115697 7.621438,11.016007 V 9.9910428 8.9660788 h 1.306809 1.306808 l 3.388603,7.0045892 3.388603,7.004588 -1.120065,1.120065 -1.120065,1.120065 z m 11.870803,1.76325 -0.671884,-1.087133 1.112867,-1.112867 1.112868,-1.112868 1.112868,1.112868 1.112867,1.112867 -0.671884,1.087133 -0.671885,1.087132 h -0.881966 -0.881966 z m 2.553851,-0.912868 v -1 h -1 -1 v 1 1 h 1 1 z m -9.846484,-3.620917 -2.245015,-4.620918 0.478748,-0.478747 0.478747,-0.4787472 3.567002,1.1772162 3.567002,1.177217 v 0.972108 0.972108 l -1.52568,2.95034 -1.52568,2.95034 h -0.275054 -0.275055 z m 15.801297,4.870917 0.04519,-2.25 H 30.638284 29.65513 l -2.541633,5.015671 -2.541633,5.015672 1.274787,1.389178 1.274787,1.389177 2.204813,-4.154849 2.204812,-4.154849 z m -32.454813,-7.25 L 1.65513,7.9660788 H 0.3375496 -0.9800306 L -3.1792963,12.49283 -5.378562,17.019582 v 0.473248 0.473249 h 0.9831541 0.9831542 z M 26.169494,3.8731488 27.768911,0.7802181 27.374398,0.3857059 26.979886,-0.0088064 25.316841,3.4786358 23.653795,6.9660788 h 0.458141 0.458142 z m -6.548056,1.09293 v -1 h -1.059017 -1.059017 l 0.618034,1 0.618034,1 h 0.440983 0.440983 z m -4.451944,-4.0929304 1.599417,-3.0929303 -0.394513,-0.3945122 -0.394512,-0.3945123 -1.663045,3.4874426 -1.663046,3.4874426 h 0.458141 0.458142 z"
         id="path105" />
      <path
         style="fill:#275747"
         d="m 8.275959,32.929578 -8.8454798,-2.99533 -1.8319914,-0.980452 -1.8319914,-0.980452 -1.2003966,-5.363937 -1.2003967,-5.363938 1.1756167,-1.889695 1.1756167,-1.889695 -0.6151369,2.25 -0.6151369,2.25 h 1.0505418 1.0505418 l 2.3768451,-4.75 2.3768456,-4.7500002 -0.355893,-1 -0.355893,-1 4.521928,-1.859823 4.521928,-1.8598234 1.99525,0.5217694 1.99525,0.52177 1.93452,-3.6619466 1.934519,-3.6619464 0.0442,0.7996599 0.0442,0.79966 -1.460118,2.8235559 -1.460117,2.8235562 0.618108,0.618108 0.618108,0.618108 1.479156,-1.22759 1.479156,-1.2275908 1.484826,2.2362668 1.484817,2.236266 h 1.354138 1.354139 l 1.979693,-3.75 1.979694,-3.75 0.0442,0.7996599 0.0442,0.79966 -1.632176,3.1562811 -1.632177,3.156281 1.232244,0.410748 1.232244,0.410748 2.390164,5.1333112 2.390163,5.133311 0.0098,1.783244 0.0097,1.783243 -2.391209,4.716757 -2.391209,4.716756 -4.635542,2.25 -4.635543,2.25 -0.723248,-0.02059 -0.723249,-0.02059 z m 12.798426,-1.124014 2.547053,-1.160515 V 29.27232 27.899592 l 2.631145,-5.216757 2.631146,-5.216756 1.018449,-0.651472 1.01845,-0.651472 -1.908761,-3.26825 -1.908761,-3.2682502 -8.828228,-2.942743 -8.828229,-2.942743 -3.868596,1.744494 -3.868596,1.744494 0.205991,0.67016 0.20599,0.67016 -2.4209374,5.1978112 -2.4209373,5.197811 H -3.5494994 -4.378562 v 1.889216 1.889216 l 1.75,2.032613 1.75,2.032613 9,3.062615 9,3.062616 0.702947,0.01556 0.702947,0.01555 z m 1.993202,-11.926617 -0.671884,-1.087133 1.112867,-1.112867 1.112868,-1.112868 1.112868,1.112868 1.112867,1.112867 -0.671884,1.087133 -0.671885,1.087132 h -0.881966 -0.881966 z m 2.553851,-0.912868 v -1 h -1 -1 v 1 1 h 1 1 z m 5.954813,1.25 0.04519,-2.25 H 30.638284 29.65513 l -2.541633,5.015671 -2.541633,5.015672 1.274787,1.389178 1.274787,1.389177 2.204813,-4.154849 2.204812,-4.154849 z M 19.621438,4.9660788 v -1 h -1.059017 -1.059017 l 0.618034,1 0.618034,1 h 0.440983 0.440983 z"
         id="path103" />
      <path
         style="fill:#000000"
         d="m 8.275959,32.929578 -8.8454798,-2.99533 -1.8319914,-0.980452 -1.8319914,-0.980452 -1.2003966,-5.363937 -1.2003967,-5.363938 1.1756167,-1.889695 1.1756167,-1.889695 -0.6151369,2.25 -0.6151369,2.25 h 1.0505418 1.0505418 l 2.4719737,-4.878205 2.471974,-4.8782062 -0.705128,-0.78212 -0.705128,-0.78212 1.21945,0.700462 1.21945,0.700461 -2.6777678,5.4598642 -2.677768,5.459864 h -1.3590698 -1.3590697 l 0.5198999,1.75 0.5198999,1.75 0.6349536,2.66656 0.6349537,2.66656 6.7415332,2.49885 6.741533,2.49885 4.154643,1.118729 4.154643,1.11873 3.266358,-1.661316 3.266358,-1.661316 0.47104,-0.427196 0.471039,-0.427197 -1.422974,-0.879446 -1.422974,-0.879447 2.451934,-5.242167 2.451935,-5.242167 1.262109,-1.264694 1.262109,-1.264694 -1.658668,-3.478263 -1.658668,-3.4782632 -9.103441,-3.067456 -9.103441,-3.067455 2.271285,0.398345 2.271284,0.398346 1.93452,-3.6619466 1.934519,-3.6619464 0.0442,0.7996599 0.0442,0.79966 -1.460118,2.8235559 -1.460117,2.8235562 0.618108,0.618108 0.618108,0.618108 1.479156,-1.22759 1.479156,-1.2275908 1.484826,2.2362668 1.484817,2.236266 h 1.354138 1.354139 l 1.979693,-3.75 1.979694,-3.75 0.0442,0.7996599 0.0442,0.79966 -1.632176,3.1562811 -1.632177,3.156281 1.232244,0.410748 1.232244,0.410748 2.390164,5.1333112 2.390163,5.133311 0.0098,1.783244 0.0097,1.783243 -2.391209,4.716757 -2.391209,4.716756 -4.635542,2.25 -4.635543,2.25 -0.723248,-0.02059 -0.723249,-0.02059 z m 23.300292,-12.713499 0.04519,-2.25 H 30.638284 29.65513 l -2.541633,5.015671 -2.541633,5.015672 1.274787,1.389178 1.274787,1.389177 2.204813,-4.154849 2.204812,-4.154849 z M 19.621438,4.9660788 v -1 h -1.059017 -1.059017 l 0.618034,1 0.618034,1 h 0.440983 0.440983 z"
         id="path101" />
    </g>
  </g>
</svg>
