{
  // Evite qu'on puisse se bloquer au-dessus d'un vortex latéral
  "canBeStuckOnTopOfLateralVortices": true,

  // Evite qu'une musique recommence si on met deux fois de suite un e_music avec le même ID
  "startAgainMusicIfSameID": true,

  // Bug de l'option Partage de vies en Multi
  "lifeSharingInMulti": true,

  // Bug des paliers de points consécutifs
  "consecutiveScoreLevels": true,

  // Bug des rayons qui ne fonctionnent pas au respawn
  "raysAtRespawn": true,

  // Bug des rayons (hors TP) qui ne fonctionnent pas en Y = 0
  "raysOnHighestLine": true,

  // Bug des TP qui ne fonctionnent pas en Y = 0
  "teleportersOnHighestLine": true,

  // Bug des fruits qui se coincent dans une case de 1 de large
  "fruitsStuckInColumns": true,

  // Corrige le point de spawn d'un vortex latéral placé tout en bas du niveau
  "respawnOfLateralVorticesOnLowestLine": false,

  // Bug des litchis carapacés qui cassent l'ordre
  "lycheesBreakOrder": true,

  // Affiche "nouvelle contrée" au premier niveau du puits
  "displayNewLandOnFirstLevel": true,

  // Bug du costume en boucle
  "loopingAnimationsWhenChangingDisguises": true,

  "canDieWhileWarping": true,

  "playerPositionAfterWarp": true,

  "progressiveLagInLongRuns": true
}