<?xml version="1.0" encoding="UTF-8" standalone="no"?>
<svg xmlns:xlink="http://www.w3.org/1999/xlink" height="39.65px" width="115.3px" xmlns="http://www.w3.org/2000/svg">
  <g transform="matrix(1.0, 0.0, 0.0, 1.0, 57.65, 19.8)">
    <use height="39.65" transform="matrix(1.0, 0.0, 0.0, 1.0, -57.65, -19.8)" width="115.3" xlink:href="#shape0"/>
  </g>
  <defs>
    <g id="shape0" transform="matrix(1.0, 0.0, 0.0, 1.0, 57.65, 19.8)">
      <path d="M57.3 -8.5 L57.65 19.7 -49.45 19.85 -57.65 8.5 48.65 -15.9 57.3 -8.5" fill="#7e5433" fill-rule="evenodd" stroke="none"/>
      <path d="M47.1 -0.25 L50.3 8.7 -57.65 8.6 -54.7 -0.05 -28.25 0.9 -1.85 1.05 Q42.75 0.7 47.1 -0.25" fill="#999999" fill-rule="evenodd" stroke="none"/>
      <path d="M47.1 -19.8 L47.1 -0.25 Q42.75 0.7 -1.85 1.05 L-28.25 0.9 -54.7 -0.05 -54.7 -19.6 -2.15 -19.25 Q41.4 -19.25 47.1 -19.8" fill="#ffffff" fill-rule="evenodd" stroke="none"/>
      <path d="M47.1 -19.8 L49.1 -15.5 50.3 8.7 47.1 -0.25 47.1 -19.8 M-57.65 8.6 L-56.7 -15.3 -54.7 -19.6 -54.7 -0.05 -57.65 8.6" fill="#666666" fill-rule="evenodd" stroke="none"/>
    </g>
  </defs>
</svg>
