<?xml version="1.0" encoding="UTF-8" standalone="no"?>
<!-- Created with Inkscape (http://www.inkscape.org/) -->

<svg
   xmlns:dc="http://purl.org/dc/elements/1.1/"
   xmlns:cc="http://creativecommons.org/ns#"
   xmlns:rdf="http://www.w3.org/1999/02/22-rdf-syntax-ns#"
   xmlns:svg="http://www.w3.org/2000/svg"
   xmlns="http://www.w3.org/2000/svg"
   xmlns:sodipodi="http://sodipodi.sourceforge.net/DTD/sodipodi-0.dtd"
   xmlns:inkscape="http://www.inkscape.org/namespaces/inkscape"
   version="1.1"
   id="svg36"
   width="20"
   height="20"
   viewBox="0 0 20 20"
   sodipodi:docname="gemme.svg"
   inkscape:version="0.92.4 (5da689c313, 2019-01-14)">
  <metadata
     id="metadata42">
    <rdf:RDF>
      <cc:Work
         rdf:about="">
        <dc:format>image/svg+xml</dc:format>
        <dc:type
           rdf:resource="http://purl.org/dc/dcmitype/StillImage" />
        <dc:title></dc:title>
      </cc:Work>
    </rdf:RDF>
  </metadata>
  <defs
     id="defs40" />
  <sodipodi:namedview
     pagecolor="#ffffff"
     bordercolor="#666666"
     borderopacity="1"
     objecttolerance="10"
     gridtolerance="10"
     guidetolerance="10"
     inkscape:pageopacity="0"
     inkscape:pageshadow="2"
     inkscape:window-width="1920"
     inkscape:window-height="1001"
     id="namedview38"
     showgrid="false"
     inkscape:zoom="10.488889"
     inkscape:cx="0.80125635"
     inkscape:cy="20.501224"
     inkscape:window-x="-9"
     inkscape:window-y="-9"
     inkscape:window-maximized="1"
     inkscape:current-layer="svg36" />
  <g
     id="g46"
     transform="matrix(1.2462373,0,0,1.2462373,-19.132302,-17.175314)">
    <path
       style="fill:#dfa3ad"
       d="M 17.038955,28.811439 C 14.78319,26.390159 14.240874,19.126852 15.975249,14.5651 c 1.215523,-3.197068 5.373023,-3.448397 10.847107,-0.655727 7.394801,3.772546 7.756059,10.11614 0.84515,14.840627 -4.161258,2.844751 -8.014749,2.867026 -10.628551,0.06144 z M 27,16.975249 C 27,16.000426 22.922096,14 20.9349,14 c -1.82214,0 -0.901754,2.077771 1.3151,2.968838 3.062616,1.231021 4.75,1.233299 4.75,0.0064 z"
       id="path60"
       inkscape:connector-curvature="0" />
    <path
       style="fill:#f02e46"
       d="M 17.038955,28.811439 C 14.78319,26.390159 14.240874,19.126852 15.975249,14.5651 c 1.215523,-3.197068 5.373023,-3.448397 10.847107,-0.655727 7.394801,3.772546 7.756059,10.11614 0.84515,14.840627 -4.161258,2.844751 -8.014749,2.867026 -10.628551,0.06144 z M 27.906896,16.387817 c -1.264195,-1.523262 -8.618023,-4.010023 -9.436882,-3.191164 -1.300257,1.300257 1.020224,3.72437 4.355728,4.550253 4.614198,1.142492 6.695306,0.585845 5.081154,-1.359089 z"
       id="path58"
       inkscape:connector-curvature="0" />
    <path
       style="fill:#dc1429"
       d="M 17.038955,28.811439 C 14.78319,26.390159 14.240874,19.126852 15.975249,14.5651 c 1.215523,-3.197068 5.373023,-3.448397 10.847107,-0.655727 7.394801,3.772546 7.756059,10.11614 0.84515,14.840627 -4.161258,2.844751 -8.014749,2.867026 -10.628551,0.06144 z m 7.225477,-0.409205 C 25.383742,27.282925 23.7925,25 21.893011,25 20.666667,25 20,25.704345 20,27 c 0,1.906715 2.82954,2.837127 4.264432,1.402234 z M 30,19 C 28.592744,16.370518 25.158784,14.181757 21.197726,13.389545 18.636602,12.87732 18,13.077772 18,14.396439 c 0,0.905541 1.2375,2.126421 2.75,2.713067 1.5125,0.586645 3.875,1.660856 5.25,2.387135 3.891217,2.055352 5.273907,1.883676 4,-0.496641 z"
       id="path56"
       inkscape:connector-curvature="0" />
    <path
       style="fill:#ac0716"
       d="M 17.038955,28.811439 C 14.78319,26.390159 14.240874,19.126852 15.975249,14.5651 c 1.215523,-3.197068 5.373023,-3.448397 10.847107,-0.655727 7.394801,3.772546 7.756059,10.11614 0.84515,14.840627 -4.161258,2.844751 -8.014749,2.867026 -10.628551,0.06144 z m 8.109751,-0.891024 c 1.924129,-1.029763 1.936858,-1.168387 0.275821,-3.003812 -1.091357,-1.205935 -2.830503,-1.84124 -4.658988,-1.701915 -3.613228,0.275319 -4.194378,1.12577 -2.558869,3.744635 1.411739,2.260554 3.876394,2.601774 6.942036,0.961092 z m 4.408971,-9.472732 C 27.862076,15.859868 22.560469,13 19.458794,13 c -3.168071,0 -0.968727,3.487795 3.024333,4.796088 2.175693,0.712848 4.194546,1.657873 4.48634,2.100056 0.61823,0.936863 3.35283,1.983052 3.915991,1.49816 0.212002,-0.182538 -0.385499,-1.508518 -1.327781,-2.946621 z"
       id="path54"
       inkscape:connector-curvature="0" />
    <path
       style="fill:#8f0c16"
       d="M 17.038955,28.811439 C 14.78319,26.390159 14.240874,19.126852 15.975249,14.5651 c 1.215523,-3.197068 5.373023,-3.448397 10.847107,-0.655727 7.394801,3.772546 7.756059,10.11614 0.84515,14.840627 -4.161258,2.844751 -8.014749,2.867026 -10.628551,0.06144 z m 10.738184,-2.755068 c 4.008239,-3.660961 4.074039,-6.162365 0.246816,-9.382761 -2.936562,-2.470954 -8.631176,-4.399722 -9.733991,-3.296907 -0.311863,0.311863 0.16238,2.042185 1.053874,3.84516 1.537989,3.110459 1.5195,3.363061 -0.36147,4.93843 C 16.727607,24.048722 16.449983,26.049983 18.2,27.8 c 2.081334,2.081334 6.212891,1.329137 9.577139,-1.743629 z m -2.797195,-3.580537 c -0.69572,-0.838291 -0.954236,-1.834875 -0.574481,-2.21463 0.834088,-0.834088 3.820305,0.916099 4.368351,2.560239 0.569687,1.709059 -2.306064,1.447088 -3.79387,-0.345609 z"
       id="path52"
       inkscape:connector-curvature="0" />
    <path
       style="fill:#650911"
       d="M 17.038955,28.811439 C 14.78319,26.390159 14.240874,19.126852 15.975249,14.5651 c 1.215523,-3.197068 5.373023,-3.448397 10.847107,-0.655727 7.394801,3.772546 7.756059,10.11614 0.84515,14.840627 -4.161258,2.844751 -8.014749,2.867026 -10.628551,0.06144 z m 10.88432,-2.400333 c 3.649206,-3.070605 3.983254,-6.488636 0.91363,-9.348425 C 26.240129,14.643416 20.485153,12.599852 18.458759,13.377452 16.829856,14.002521 16.433132,18 18,18 c 0.55,0 1,0.9 1,2 0,1.111111 -0.666667,2 -1.5,2 -1.934888,0 -1.911537,1.967437 0.0567,4.777494 2.124719,3.033461 6.510287,2.878461 10.366571,-0.366388 z"
       id="path50"
       inkscape:connector-curvature="0" />
    <path
       style="fill:#130304"
       d="M 17.038955,28.811439 C 14.78319,26.390159 14.240874,19.126852 15.975249,14.5651 c 1.215523,-3.197068 5.373023,-3.448397 10.847107,-0.655727 7.394801,3.772546 7.756059,10.11614 0.84515,14.840627 -4.161258,2.844751 -8.014749,2.867026 -10.628551,0.06144 z m 9.665897,-0.938045 c 6.6506,-4.110296 6.370935,-9.263597 -0.69845,-12.870128 -5.306145,-2.706993 -8.607832,-2.620109 -9.376116,0.246734 -1.280833,4.779414 -0.656755,10.344466 1.408669,12.561439 2.551099,2.738283 4.315103,2.750894 8.665897,0.06196 z"
       id="path48"
       inkscape:connector-curvature="0" />
  </g>
  <path
     style="fill:#ffffff;fill-opacity:1;stroke-width:0.09181536"
     d="M 11.814873,4.8872234 C 10.754746,4.7791732 8.796186,4.1682008 7.523669,3.5485838 6.6860502,3.1407288 5.7576408,2.3019114 5.4413603,1.6672192 5.1773401,1.1373997 5.1561915,0.97396469 5.3084192,0.63986119 c 0.3503889,-0.76902 2.3551415,-0.5457436 4.9605258,0.55247131 1.912058,0.8059661 3.499136,1.9271803 3.616964,2.5552562 0.0677,0.3608768 -0.137534,0.8173441 -0.442264,0.9836513 -0.299572,0.1634922 -0.946881,0.2254833 -1.628772,0.1559834 z"
     id="path62"
     inkscape:connector-curvature="0" />
  <path
     style="fill:#ffffff;fill-opacity:1;stroke-width:0.00842686"
     d="M 12.686119,5.1107283 C 12.064158,5.0664654 11.272555,4.8960086 10.385588,4.6153525 10.053196,4.5101764 9.1017163,4.1934505 8.9277419,4.1300691 8.4033525,3.9390263 7.9188225,3.7371332 7.5415242,3.5524624 7.3352641,3.451507 7.20938,3.3793096 7.0064189,3.2455669 6.4014194,2.846898 5.8447515,2.3122086 5.5431155,1.840038 5.4424012,1.6823833 5.29036,1.3518475 5.2436041,1.1889038 c -0.0162,-0.056456 -0.019337,-0.087277 -0.0193,-0.1896042 4.88e-5,-0.13402097 0.00866,-0.17405567 0.067391,-0.31331273 0.1007379,-0.23885888 0.2968693,-0.37766094 0.6334513,-0.44829308 0.1735405,-0.036418 0.2588889,-0.043191 0.5377401,-0.042677 0.3344661,6.167e-4 0.5253529,0.01988 0.985942,0.0994984 0.092695,0.0160234 0.2348986,0.0392721 0.3160071,0.0516636 1.8774323,0.28682957 4.7243854,1.53898561 6.0704174,2.66991091 0.29423,0.2472089 0.51742,0.5048669 0.611173,0.7055552 0.05344,0.1143851 0.06402,0.1638491 0.063,0.294469 -0.0019,0.2395962 -0.06524,0.4531673 -0.183629,0.6188108 -0.04863,0.068034 -0.171828,0.1853096 -0.245307,0.2335056 -0.204863,0.1343746 -0.475787,0.2141975 -0.823913,0.2427514 -0.122665,0.010061 -0.426104,0.00982 -0.570461,-4.534e-4 z"
     id="path15"
     inkscape:connector-curvature="0" />
  <path
     style="fill:#ffffff;fill-opacity:1;stroke-width:0.00842686"
     d="m 12.732467,5.1149642 c -0.01854,-0.00178 -0.08301,-0.00724 -0.143257,-0.012131 C 12.003516,5.0552812 11.185271,4.8725574 10.330813,4.5985071 9.9575913,4.4788035 9.0630836,4.1802262 8.9024613,4.1217381 8.2384244,3.8799398 7.5656978,3.5850336 7.2381574,3.3921498 6.6668568,3.0557189 6.0989098,2.5686183 5.7205843,2.0906006 5.5334636,1.8541718 5.3570465,1.5303858 5.2628172,1.2504407 5.1919072,1.0397745 5.2069032,0.85903874 5.3134542,0.64015658 5.4310074,0.39867322 5.6777518,0.26313505 6.1047451,0.20549579 c 0.1072058,-0.014472 0.5854512,-0.014477 0.7204961,-8.9e-6 0.1936646,0.020749 0.3637668,0.0445274 0.581453,0.0812807 0.1205041,0.0203454 0.2835637,0.047043 0.3623548,0.0593278 1.5923159,0.24826883 3.882219,1.17272841 5.405828,2.18239321 0.678347,0.4495268 1.11104,0.8553373 1.271696,1.1926851 0.05317,0.1116424 0.06412,0.1629435 0.06297,0.2949399 -0.0038,0.4339495 -0.195729,0.7497202 -0.563605,0.9272393 -0.16089,0.077637 -0.336433,0.1265278 -0.560983,0.1562387 -0.0991,0.013112 -0.562366,0.024026 -0.652484,0.015372 z"
     id="path17"
     inkscape:connector-curvature="0" />
  <path
     style="fill:#ffffff;fill-opacity:1;stroke-width:0.00842686"
     d="m 12.719827,5.1150973 c -0.01622,-0.00182 -0.07689,-0.0073 -0.13483,-0.012164 C 12.029559,5.0562772 11.293294,4.897274 10.49935,4.6525181 10.332756,4.6011605 9.5340038,4.3390207 9.2353221,4.2376807 8.4196324,3.9609246 7.6025053,3.612154 7.1960232,3.367256 6.6129906,3.0159897 6.0358166,2.5096223 5.673085,2.0311487 5.5129888,1.8199683 5.3294374,1.4649225 5.2473631,1.2076696 5.2274121,1.145135 5.2252031,1.1251328 5.2248211,1.003513 5.2243983,0.86896315 5.2244635,0.86849163 5.2562351,0.77629961 5.2737461,0.72548851 5.3040251,0.65392614 5.3235211,0.61727203 5.4255172,0.42551131 5.6269762,0.29948042 5.936208,0.23398069 c 0.1629687,-0.034519 0.2299574,-0.039466 0.5266785,-0.03889 0.3516938,6.824e-4 0.5005071,0.015116 0.9522346,0.0923578 0.092695,0.0158502 0.2216263,0.0367904 0.2865131,0.0465339 0.9814685,0.14737806 2.2316433,0.54618604 3.4845048,1.11156301 0.235091,0.106089 0.772453,0.3714426 0.998582,0.4931075 1.313269,0.7065804 2.14908,1.3924852 2.306096,1.8924856 0.01712,0.05451 0.0196,0.078891 0.01887,0.1849751 -9.88e-4,0.143287 -0.01716,0.245794 -0.05805,0.3680134 -0.03466,0.1035765 -0.06484,0.1644147 -0.121154,0.2442051 -0.179234,0.2539457 -0.484034,0.40707 -0.937531,0.4709922 -0.09096,0.012821 -0.594458,0.024619 -0.673129,0.015773 z"
     id="path19"
     inkscape:connector-curvature="0" />
  <path
     style="fill:#ffffff;fill-opacity:1;stroke-width:0.00842686"
     d="M 12.652412,5.1113397 C 12.020713,5.0530176 11.370629,4.916518 10.568907,4.6738616 10.353858,4.6087732 9.6082143,4.365074 9.2038451,4.2277179 8.4776543,3.9810455 7.689132,3.6491833 7.2858052,3.4204802 6.9857191,3.2503189 6.6223964,2.9879296 6.3325575,2.7320505 6.1189657,2.5434849 5.8662145,2.2784967 5.7126695,2.0821505 5.5551981,1.8807832 5.3964279,1.6001527 5.2978885,1.3490141 5.2294456,1.1745795 5.2242875,1.1496113 5.224772,0.99508618 5.2251612,0.87092456 5.227012,0.85492246 5.248204,0.79284165 5.260859,0.75576345 5.289676,0.68738116 5.31224,0.6408809 5.4178707,0.4232034 5.6280947,0.2920873 5.9791652,0.22492139 6.221384,0.17858039 6.6394046,0.17850739 7.0064184,0.22474109 7.161727,0.24430579 7.8920139,0.36276783 8.0682022,0.39697627 9.016613,0.58111834 10.27589,1.0145677 11.396809,1.5426986 c 1.711785,0.8065226 2.908871,1.6903579 3.091703,2.282674 0.05856,0.1897139 0.0079,0.5202984 -0.112487,0.7338506 -0.03895,0.069106 -0.12708,0.1767842 -0.186195,0.2275029 -0.192193,0.1648957 -0.478473,0.2753393 -0.821136,0.3167851 -0.100527,0.012159 -0.609168,0.017718 -0.716283,0.00783 z"
     id="path21"
     inkscape:connector-curvature="0" />
  <path
     style="fill:#ffffff;fill-opacity:1;stroke-width:0.00842686"
     d="M 12.597637,5.107139 C 12.014052,5.051665 11.285556,4.8959427 10.549911,4.6694203 10.330822,4.6019572 9.3719087,4.2867398 9.125773,4.2012722 8.3807906,3.9425862 7.6404583,3.6265775 7.2507977,3.4009445 6.6426237,3.0487811 5.9825821,2.467903 5.6330701,1.9772423 5.4539526,1.7257892 5.2589767,1.3146973 5.2281244,1.1234455 c -0.00638,-0.039553 -0.00884,-0.1040784 -0.00626,-0.16417636 0.00492,-0.1145049 0.023895,-0.1812744 0.090578,-0.31876366 0.093057,-0.1918672 0.2728158,-0.31960541 0.5490819,-0.390182 0.1574275,-0.0402174 0.26914,-0.0530086 0.5044492,-0.0577601 0.2965331,-0.00599 0.5519341,0.012947 0.8721795,0.0646621 0.5673207,0.0916137 0.7081443,0.11556909 0.8721795,0.14836554 2.0281325,0.40549533 4.8446485,1.73463858 5.9357405,2.80113768 0.20745,0.2027741 0.322585,0.3511682 0.401975,0.5180927 0.05502,0.1156839 0.07068,0.1964523 0.06393,0.3296916 -0.03038,0.5996962 -0.3973,0.9451699 -1.109581,1.0447361 -0.138357,0.01934 -0.633263,0.024192 -0.804765,0.00789 z"
     id="path23"
     inkscape:connector-curvature="0" />
</svg>
