<?xml version="1.0" encoding="UTF-8" standalone="no"?>
<svg xmlns:xlink="http://www.w3.org/1999/xlink" height="15.15px" width="24.8px" xmlns="http://www.w3.org/2000/svg">
  <g transform="matrix(1.0, 0.0, 0.0, 1.0, 8.7, 35.75)">
    <path d="M-0.15 -24.65 Q4.65 -23.05 8.25 -25.45 11.65 -27.7 9.3 -30.4 8.5 -31.25 7.35 -31.75 5.65 -32.65 3.9 -33.5 L-1.8 -32.9 -1.3 -35.2 Q3.9 -36.3 9.05 -35.15 13.3 -32.15 11.25 -28.65 L12.8 -28.5 6.6 -22.7 1.6 -22.15 0.05 -22.45 -3.05 -21.8 Q-5.7 -22.9 -7.2 -24.65 -9.35 -27.05 -8.45 -29.75 -7.65 -32.1 -4.8 -33.8 L-5.0 -32.9 -2.6 -32.55 Q-5.05 -30.4 -4.65 -27.85 -4.4 -25.85 -1.75 -24.7 L-0.15 -24.65" fill="#999999" fill-rule="evenodd" stroke="none"/>
    <path d="M7.35 -31.75 Q3.05 -33.3 -0.3 -31.15 -3.4 -29.15 -1.8 -26.55 -1.2 -25.55 -0.15 -24.65 L-1.75 -24.7 Q-4.4 -25.85 -4.65 -27.85 -5.05 -30.4 -2.6 -32.55 L-1.8 -32.9 3.9 -33.5 Q5.65 -32.65 7.35 -31.75 M-3.05 -21.8 L0.05 -22.45 1.6 -22.15 6.6 -22.7 12.8 -28.5 11.25 -28.65 Q13.3 -32.15 9.05 -35.15 12.6 -33.9 14.6 -31.75 16.85 -29.25 15.7 -26.35 14.6 -23.5 10.5 -21.9 7.0 -20.55 2.95 -20.6 -0.3 -20.75 -3.05 -21.8" fill="#666666" fill-rule="evenodd" stroke="none"/>
    <path d="M-2.6 -32.55 L-5.0 -32.9 -4.8 -33.8 -1.3 -35.2 -1.8 -32.9 -2.6 -32.55" fill="#ffffff" fill-rule="evenodd" stroke="none"/>
  </g>
</svg>
