<?xml version="1.0" encoding="UTF-8" standalone="no"?>
<svg xmlns:xlink="http://www.w3.org/1999/xlink" height="6.8px" width="46.6px" xmlns="http://www.w3.org/2000/svg">
  <g transform="matrix(1.0, 0.0, 0.0, 1.0, 23.3, 3.4)">
    <path d="M-23.3 -3.4 L23.3 -3.4 23.3 3.4 -23.3 3.4 -23.3 -3.4" fill="#990000" fill-rule="evenodd" stroke="none"/>
  </g>
</svg>
