<?xml version="1.0" encoding="UTF-8" standalone="no"?>
<svg xmlns:xlink="http://www.w3.org/1999/xlink" height="72.05px" width="54.25px" xmlns="http://www.w3.org/2000/svg">
  <g transform="matrix(1.0, 0.0, 0.0, 1.0, 23.75, 31.05)">
    <use height="72.05" transform="matrix(1.0, 0.0, 0.0, 1.0, -23.75, -31.05)" width="54.25" xlink:href="#shape0"/>
    <use height="6.8" transform="matrix(1.0, 0.0, 0.0, 1.0, -2.45, 1.3)" width="13.8" xlink:href="#sprite0"/>
    <use height="14.5" transform="matrix(1.0, 0.0, 0.0, 1.0, 8.25, -9.45)" width="3.1" xlink:href="#shape2"/>
  </g>
  <defs>
    <g id="shape0" transform="matrix(1.0, 0.0, 0.0, 1.0, 23.75, 31.05)">
      <path d="M30.3 -12.05 L30.5 41.0 1.95 40.2 -11.2 30.15 22.65 -20.9 30.3 -12.05" fill="#7e5433" fill-rule="evenodd" stroke="none"/>
      <path d="M23.8 30.2 L-11.5 31.0 -8.6 20.7 Q5.45 23.9 19.45 20.7 L23.8 30.2 M-11.5 -6.05 L-23.75 -6.05 -19.4 -14.2 -8.6 -14.2 -11.5 -6.05" fill="#999999" fill-rule="evenodd" stroke="none"/>
      <path d="M-19.4 -31.05 Q0.8 -28.75 19.45 -31.05 L19.45 20.7 Q5.45 23.9 -8.6 20.7 L-8.6 -14.2 -19.4 -14.2 -19.4 -31.05" fill="#ffffff" fill-rule="evenodd" stroke="none"/>
      <path d="M19.45 -31.05 L23.4 -20.8 23.8 30.2 19.45 20.7 19.45 -31.05 M-11.5 31.0 L-11.5 -6.05 -8.6 -14.2 -8.6 20.7 -11.5 31.0 M-23.75 -6.05 L-23.75 -19.3 -19.4 -31.05 -19.4 -14.2 -23.75 -6.05" fill="#666666" fill-rule="evenodd" stroke="none"/>
    </g>
    <g id="sprite0" transform="matrix(1.0, 0.0, 0.0, 1.0, 6.9, 3.4)">
      <use height="6.8" transform="matrix(1.0, 0.0, 0.0, 1.0, -6.9, -3.4)" width="13.8" xlink:href="#shape1"/>
    </g>
    <g id="shape1" transform="matrix(1.0, 0.0, 0.0, 1.0, 6.9, 3.4)">
      <path d="M-3.5 -1.25 L6.9 -1.25 6.9 1.3 -3.5 1.3 -3.5 3.4 -6.9 0.0 -3.5 -3.4 -3.5 -1.25" fill="#666666" fill-rule="evenodd" stroke="none"/>
    </g>
    <g id="shape2" transform="matrix(1.0, 0.0, 0.0, 1.0, -8.25, 9.45)">
      <path d="M11.35 -9.45 L11.35 5.05 8.25 5.05 8.25 -9.45 11.35 -9.45" fill="#666666" fill-rule="evenodd" stroke="none"/>
    </g>
  </defs>
</svg>
