<?xml version="1.0" encoding="UTF-8" standalone="no"?>
<!-- Created with Inkscape (http://www.inkscape.org/) -->

<svg
   xmlns:dc="http://purl.org/dc/elements/1.1/"
   xmlns:cc="http://creativecommons.org/ns#"
   xmlns:rdf="http://www.w3.org/1999/02/22-rdf-syntax-ns#"
   xmlns:svg="http://www.w3.org/2000/svg"
   xmlns="http://www.w3.org/2000/svg"
   xmlns:sodipodi="http://sodipodi.sourceforge.net/DTD/sodipodi-0.dtd"
   xmlns:inkscape="http://www.inkscape.org/namespaces/inkscape"
   version="1.1"
   id="svg2"
   width="20"
   height="20"
   viewBox="0 0 20 20"
   sodipodi:docname="coffin dace hat.svg"
   inkscape:version="0.92.4 (5da689c313, 2019-01-14)">
  <metadata
     id="metadata8">
    <rdf:RDF>
      <cc:Work
         rdf:about="">
        <dc:format>image/svg+xml</dc:format>
        <dc:type
           rdf:resource="http://purl.org/dc/dcmitype/StillImage" />
        <dc:title></dc:title>
      </cc:Work>
    </rdf:RDF>
  </metadata>
  <defs
     id="defs6" />
  <sodipodi:namedview
     pagecolor="#ffffff"
     bordercolor="#666666"
     borderopacity="1"
     objecttolerance="10"
     gridtolerance="10"
     guidetolerance="10"
     inkscape:pageopacity="0"
     inkscape:pageshadow="2"
     inkscape:window-width="1920"
     inkscape:window-height="1001"
     id="namedview4"
     showgrid="false"
     inkscape:zoom="22.627417"
     inkscape:cx="20.444174"
     inkscape:cy="3.7623704"
     inkscape:window-x="1671"
     inkscape:window-y="-9"
     inkscape:window-maximized="1"
     inkscape:current-layer="svg2" />
  <g
     id="g3715"
     transform="matrix(0.11056779,0,0,0.11056779,-2.483688,-3.0645487)">
    <path
       style="fill:#ccced5"
       d="m 140.5,210.87716 c -6.05,-1.67454 -15.87378,-4.58193 -21.83062,-6.46089 C 112.71254,202.53732 107.30005,201 106.64164,201 104.81864,201 90.142407,196.09078 84.5,193.59358 81.75,192.3765 77.025,190.579 74,189.59914 70.975,188.61928 60.913685,184.82113 51.641522,181.15879 L 34.783045,174.5 l 0.52123,-5.10472 C 35.820167,164.34285 37.39334,155.60094 43.023607,126.5 46.264035,109.75133 52.581054,86.35392 60.200252,62.879957 l 5.069966,-15.620044 8.860936,-4.103894 C 79.004669,40.898877 86.481369,37.882487 90.746045,36.45293 95.01072,35.023373 102.325,32.035366 107,29.812914 c 18.73524,-8.906562 24.36744,-10.345129 28.67906,-7.325156 4.54392,3.182689 20.72649,32.05605 24.38717,43.512242 0.43936,1.375 2.42395,6.775 4.4102,12 4.03459,10.613355 14.47426,44.72235 16.98677,55.5 0.89752,3.85 2.70582,11.5 4.01843,17 2.46718,10.33769 4.96814,21.59605 6.05137,27.24092 1.20612,6.28524 -8.07397,21.17246 -16.88653,27.08957 -5.43905,3.65199 -15.8578,8.2008 -19.92019,8.69711 -1.77445,0.21679 -8.17628,-0.97591 -14.22628,-2.65044 z m -29,-10.59023 c -1.1,-0.26458 -2.4275,-0.88738 -2.95,-1.38399 C 108.0275,198.40632 106.59156,198 105.35902,198 c -1.23254,0 -2.48095,-0.38827 -2.77424,-0.86283 -0.29329,-0.47455 -2.56985,-1.43303 -5.059019,-2.12996 C 95.036592,194.31029 93,193.37888 93,192.93743 c 0,-0.44146 -0.857702,-1.07488 -1.906004,-1.4076 -2.098093,-0.66591 -2.179038,-3.66815 -0.117427,-4.35535 0.770019,-0.25668 1.016598,0.0276 0.60361,0.69579 C 91.196162,188.49162 91.096719,189 91.359196,189 c 0.262476,0 1.301533,0.26745 2.309017,0.59433 1.3983,0.45369 1.504711,0.36124 0.449659,-0.39067 -3.031876,-2.16075 2.847468,-2.21468 12.011728,-0.11018 5.15372,1.18351 10.42428,2.38201 11.71235,2.66333 1.74567,0.38127 2.00028,0.72805 1,1.36203 -0.94756,0.60057 -0.60721,0.85954 1.15805,0.88116 2.01367,0.0247 2.2082,0.22809 1,1.04569 -1.09546,0.74131 -0.69092,0.83408 1.5,0.34401 3.52597,-0.7887 4.4885,-1.3897 2.22568,-1.3897 -0.8842,0 -1.83751,-0.37192 -2.11845,-0.8265 -0.62241,-1.00708 7.1415,-0.70189 9.80681,0.38549 1.45766,0.59469 1.7166,0.4614 1.08596,-0.55899 -0.60515,-0.97915 -0.38009,-1.16796 0.83596,-0.70132 1.21087,0.46465 1.66404,0.0929 1.66404,-1.36525 0,-1.67122 0.32104,-1.83198 1.93426,-0.96861 2.45481,1.31377 4.0603,1.32921 2.06574,0.0199 -1.33333,-0.87528 -1.33333,-1.10308 0,-2.0502 1.16466,-0.8273 0.94109,-0.92443 -1,-0.43449 -1.75434,0.4428 -2.08666,0.34514 -1.11419,-0.32744 0.97827,-0.6766 1.36706,-3.10744 1.32207,-8.26591 -0.0351,-4.0191 0.36966,-8.11727 0.89937,-9.10705 0.81262,-1.51839 0.5567,-1.7996 -1.63781,-1.7996 -1.43051,0 -3.48834,0.47493 -4.57295,1.0554 C 131.6731,170.24532 128,169.43922 128,167.76135 c 0,-0.60713 0.69893,-1.87618 1.55318,-2.82011 0.85425,-0.94394 1.75393,-3.85788 1.9993,-6.47544 0.24537,-2.61756 0.96057,-5.37906 1.58933,-6.13667 0.62875,-0.7576 0.96657,-1.50393 0.75069,-1.6585 -0.30992,-0.22191 -37.68235,-9.32527 -46.3925,-11.30051 -1.564669,-0.35483 -1.455837,-0.12569 0.5,1.05273 2.010711,1.21148 2.145947,1.51321 0.690983,1.54171 -1.121971,0.022 -1.534406,0.47977 -1.085955,1.20538 0.470035,0.76053 0.199071,0.96886 -0.774316,0.59534 -0.86611,-0.33236 -1.497379,-0.0153 -1.497379,0.75201 0,1.89512 -5.547987,8.31121 -7.333333,8.4808 -1.033443,0.0982 -0.877923,0.39627 0.5,0.95844 1.669573,0.68115 1.421752,0.87605 -1.5,1.17971 -3.097304,0.32191 -2.349439,0.7391 6.5,3.62598 5.5,1.79422 17.65,5.11531 27,7.38021 9.35,2.2649 17.675,4.32077 18.5,4.56861 1.36528,0.41014 -11.80593,5.79232 -32.5,13.28056 -12.541948,4.53836 -15.832018,6.08042 -14.881596,6.97503 2.554689,2.40467 25.105126,9.80137 29.881596,9.80137 h 2 z m 18.63671,-6.07469 c -0.72144,-0.24048 -1.78716,0.0382 -2.36826,0.61931 -0.74207,0.74207 -0.35164,0.87221 1.31171,0.43724 1.3522,-0.35361 1.8055,-0.8069 1.05655,-1.05655 z"
       id="path3729"
       inkscape:connector-curvature="0" />
    <path
       style="fill:#9b999c"
       d="m 140.5,210.87716 c -6.05,-1.67454 -15.87378,-4.58193 -21.83062,-6.46089 C 112.71254,202.53732 107.30005,201 106.64164,201 104.81864,201 90.142407,196.09078 84.5,193.59358 81.75,192.3765 77.025,190.579 74,189.59914 70.975,188.61928 60.913685,184.82113 51.641522,181.15879 L 34.783045,174.5 l 0.52123,-5.10472 C 35.820167,164.34285 37.39334,155.60094 43.023607,126.5 46.264035,109.75133 52.581054,86.35392 60.200252,62.879957 l 5.069966,-15.620044 8.860936,-4.103894 C 79.004669,40.898877 86.481369,37.882487 90.746045,36.45293 95.01072,35.023373 102.325,32.035366 107,29.812914 c 18.73524,-8.906562 24.36744,-10.345129 28.67906,-7.325156 4.54392,3.182689 20.72649,32.05605 24.38717,43.512242 0.43936,1.375 2.42395,6.775 4.4102,12 4.03459,10.613355 14.47426,44.72235 16.98677,55.5 0.89752,3.85 2.70582,11.5 4.01843,17 2.46718,10.33769 4.96814,21.59605 6.05137,27.24092 1.20612,6.28524 -8.07397,21.17246 -16.88653,27.08957 -5.43905,3.65199 -15.8578,8.2008 -19.92019,8.69711 -1.77445,0.21679 -8.17628,-0.97591 -14.22628,-2.65044 z m -10,-15.86321 c 7.7,-2.86345 18.29724,-7.21343 23.54942,-9.66663 9.14377,-4.2709 9.55909,-4.6039 9.77696,-7.83907 0.13613,-2.02131 -0.32693,-3.70603 -1.15261,-4.19347 -1.76697,-1.04313 -2.71002,-8.22017 -1.68014,-12.78655 0.43766,-1.94053 0.54922,-3.52823 0.2479,-3.52823 -0.30131,0 -3.40512,1.35 -6.89736,3 -7.49646,3.54191 -8.34417,3.6435 -8.34417,1 0,-1.1 -0.45,-2 -1,-2 -0.55,0 -1,-0.48032 -1,-1.06739 0,-0.58706 0.7875,-0.82233 1.75,-0.52283 0.9625,0.29951 2.425,0.11173 3.25,-0.4173 1.15662,-0.74166 1.18935,-0.96536 0.14301,-0.97717 -0.78881,-0.009 -1.11762,-0.6391 -0.7853,-1.50512 0.37824,-0.98566 -0.17774,-1.64281 -1.64301,-1.94197 -16.03916,-3.27466 -30.29586,-6.50554 -44.7147,-10.13332 -9.625,-2.42166 -25.6,-5.7536 -35.5,-7.40431 -9.9,-1.65072 -19.204058,-3.21495 -20.675685,-3.47608 -2.505452,-0.44458 -2.744035,-0.15608 -3.75,4.53457 -1.98034,9.23401 -1.902368,9.39106 5.675685,11.43205 3.7125,0.99988 15.269441,4.67143 25.682092,8.159 10.41265,3.48757 27.038688,8.3748 36.946738,10.86052 9.90806,2.48572 18.1262,4.63104 18.26254,4.76738 0.13633,0.13634 -9.87024,4.02389 -22.23684,8.63901 -12.366596,4.61511 -23.254178,8.95604 -24.194625,9.6465 -1.513546,1.11122 -1.141729,1.49938 3.237806,3.38013 4.506528,1.93529 17.131519,6.16795 22.052289,7.39325 3.97283,0.98927 9.24471,-0.2377 23,-5.35297 z M 153,180 c 0,-0.55 0.45,-1 1,-1 0.55,0 1,0.45 1,1 0,0.55 -0.45,1 -1,1 -0.55,0 -1,-0.45 -1,-1 z"
       id="path3727"
       inkscape:connector-curvature="0" />
    <path
       style="fill:#676669"
       d="m 140.5,210.87716 c -6.05,-1.67454 -15.87378,-4.58193 -21.83062,-6.46089 C 112.71254,202.53732 107.30005,201 106.64164,201 104.81864,201 90.142407,196.09078 84.5,193.59358 81.75,192.3765 77.025,190.579 74,189.59914 70.975,188.61928 60.913685,184.82113 51.641522,181.15879 L 34.783045,174.5 l 0.52123,-5.10472 C 35.820167,164.34285 37.39334,155.60094 43.023607,126.5 46.264035,109.75133 52.581054,86.35392 60.200252,62.879957 l 5.069966,-15.620044 8.860936,-4.103894 C 79.004669,40.898877 86.481369,37.882487 90.746045,36.45293 95.01072,35.023373 102.325,32.035366 107,29.812914 c 18.73524,-8.906562 24.36744,-10.345129 28.67906,-7.325156 4.54392,3.182689 20.72649,32.05605 24.38717,43.512242 0.43936,1.375 2.42395,6.775 4.4102,12 4.03459,10.613355 14.47426,44.72235 16.98677,55.5 0.89752,3.85 2.70582,11.5 4.01843,17 2.46718,10.33769 4.96814,21.59605 6.05137,27.24092 1.20612,6.28524 -8.07397,21.17246 -16.88653,27.08957 -5.43905,3.65199 -15.8578,8.2008 -19.92019,8.69711 -1.77445,0.21679 -8.17628,-0.97591 -14.22628,-2.65044 z m -15.10031,-13.75793 c 19.26053,-6.71119 36.98643,-14.49268 40.96507,-17.98323 4.05612,-3.55852 4.39564,-9.44238 0.60212,-10.43441 C 165.47903,168.31251 165,167.3264 165,164.65264 c 0,-1.94403 0.46193,-3.8201 1.02652,-4.16903 0.56459,-0.34893 0.96127,-1.16299 0.88152,-1.80902 -0.33961,-2.75095 0.217,-3.67459 2.2144,-3.67459 1.71372,0 1.89694,0.27172 0.95145,1.41097 -0.85592,1.03132 -0.87037,1.59678 -0.0537,2.10151 0.65186,0.40287 1.00348,2.83532 0.84405,5.83903 -0.26378,4.9699 -0.034,5.34212 2.96257,4.79849 0.45474,-0.0825 0.61237,-1.61101 0.35029,-3.39669 -0.42676,-2.90772 -0.30659,-3.10567 1.15104,-1.89594 1.64977,1.36919 1.75804,3.41908 0.32444,6.14263 -0.43426,0.825 0.56498,-0.0265 2.22053,-1.89227 1.65555,-1.86575 4.00449,-5.8423 5.21986,-8.83678 l 2.20976,-5.44451 -1.88269,-7.90219 -1.88269,-7.90219 -2.01867,3.32237 c -1.11028,1.82731 -2.80618,4.10449 -3.76868,5.0604 -0.9625,0.95592 -1.75,2.09468 -1.75,2.5306 0,0.43591 -1.764,2.01502 -3.92,3.50913 -3.88065,2.68929 -3.99862,2.70489 -11.75,1.55365 -15.08356,-2.24022 -29.02974,-5.14735 -52.83,-11.0126 C 87.551758,138.56251 48.467673,131 43.556737,131 42.985741,131 41,140.69149 41,143.47826 c 0,2.0429 0.814065,2.60892 5.75,3.99798 3.1625,0.88999 15.2,4.72727 26.75,8.5273 11.55,3.80002 28.38613,8.72741 37.41362,10.94975 9.02749,2.22234 16.57576,4.20276 16.77394,4.40094 0.19818,0.19818 -2.46294,1.37653 -5.91361,2.61856 C 101.03838,181.4363 81,189.39708 81,190.17132 c 0,2.06535 23.95466,10.37524 30.88111,10.71268 1.30962,0.0638 7.39297,-1.63035 13.51858,-3.76477 z"
       id="path3725"
       inkscape:connector-curvature="0" />
    <path
       style="fill:#2b2d31"
       d="m 140.5,210.87716 c -6.05,-1.67454 -15.87378,-4.58193 -21.83062,-6.46089 C 112.71254,202.53732 107.30005,201 106.64164,201 104.81864,201 90.142407,196.09078 84.5,193.59358 81.75,192.3765 77.025,190.579 74,189.59914 70.975,188.61928 60.913685,184.82113 51.641522,181.15879 L 34.783045,174.5 l 0.52123,-5.10472 C 35.820167,164.34285 37.39334,155.60094 43.023607,126.5 46.264035,109.75133 52.581054,86.35392 60.200252,62.879957 l 5.069966,-15.620044 8.860936,-4.103894 C 79.004669,40.898877 86.481369,37.882487 90.746045,36.45293 95.01072,35.023373 102.325,32.035366 107,29.812914 c 18.73524,-8.906562 24.36744,-10.345129 28.67906,-7.325156 4.54392,3.182689 20.72649,32.05605 24.38717,43.512242 0.43936,1.375 2.42395,6.775 4.4102,12 4.03459,10.613355 14.47426,44.72235 16.98677,55.5 0.89752,3.85 2.70582,11.5 4.01843,17 2.46718,10.33769 4.96814,21.59605 6.05137,27.24092 1.20612,6.28524 -8.07397,21.17246 -16.88653,27.08957 -5.43905,3.65199 -15.8578,8.2008 -19.92019,8.69711 -1.77445,0.21679 -8.17628,-0.97591 -14.22628,-2.65044 z m 1.70636,-19.70603 c 14.74132,-5.92313 24.65966,-11.17423 26.80998,-14.19408 1.16592,-1.63738 2.67593,-2.97705 3.35559,-2.97705 3.62875,0 12.62973,-14.29634 12.59199,-20 -0.009,-1.375 -0.84195,-5.624 -1.85079,-9.44222 l -1.83425,-6.94222 -4.73999,6.44222 c -2.60699,3.54322 -6.25796,7.31144 -8.11326,8.37382 -3.16376,1.81162 -3.98046,1.85129 -13.14945,0.63866 C 142.6203,151.39648 121.94917,147.05017 100,141.44791 c -14.974336,-3.82202 -49.932861,-10.44004 -55.179102,-10.446 -1.230531,-0.001 -1.983912,1.46635 -2.820072,5.49411 -1.94102,9.34985 -1.946207,9.34341 10.499174,13.01932 6.05,1.78695 16.4,5.13665 23,7.44378 6.6,2.30712 21.116826,6.53797 32.25961,9.40189 l 20.25962,5.20711 -10.75962,3.87222 C 96.333275,182.97139 81,189.1786 81,190.11894 c 0,1.18745 7.058509,4.24711 16.947711,7.34633 14.422479,4.51993 14.385849,4.51941 26.258649,0.37433 5.88849,-2.05582 13.98849,-5.05663 18,-6.66847 z"
       id="path3723"
       inkscape:connector-curvature="0" />
    <path
       style="fill:#26272b"
       d="m 140.5,210.87716 c -6.05,-1.67454 -15.87378,-4.58193 -21.83062,-6.46089 C 112.71254,202.53732 107.30005,201 106.64164,201 104.81864,201 90.142407,196.09078 84.5,193.59358 81.75,192.3765 77.025,190.579 74,189.59914 70.975,188.61928 60.913685,184.82113 51.641522,181.15879 L 34.783045,174.5 l 0.52123,-5.10472 C 35.820167,164.34285 37.39334,155.60094 43.023607,126.5 46.264035,109.75133 52.581054,86.35392 60.200252,62.879957 l 5.069966,-15.620044 8.860936,-4.103894 C 79.004669,40.898877 86.481369,37.882487 90.746045,36.45293 95.01072,35.023373 102.325,32.035366 107,29.812914 c 18.73524,-8.906562 24.36744,-10.345129 28.67906,-7.325156 4.54392,3.182689 20.72649,32.05605 24.38717,43.512242 0.43936,1.375 2.42395,6.775 4.4102,12 4.03459,10.613355 14.47426,44.72235 16.98677,55.5 0.89752,3.85 2.70582,11.5 4.01843,17 2.46718,10.33769 4.96814,21.59605 6.05137,27.24092 1.20612,6.28524 -8.07397,21.17246 -16.88653,27.08957 -5.43905,3.65199 -15.8578,8.2008 -19.92019,8.69711 -1.77445,0.21679 -8.17628,-0.97591 -14.22628,-2.65044 z m 8.8483,-22.61417 c 7.06657,-3.07714 14.12378,-6.53264 15.68269,-7.67889 12.19968,-8.97031 13.92061,-10.69674 16.91336,-16.9675 1.68061,-3.5214 3.06204,-7.4632 3.06985,-8.75957 0.0174,-2.88831 -3.32054,-16.87046 -4.0142,-16.81491 -0.275,0.022 -2.64064,2.93663 -5.25698,6.4769 -6.68336,9.04349 -8.79292,9.95442 -19.61077,8.46811 -4.74774,-0.65231 -15.13737,-2.49127 -23.08806,-4.08658 -7.9507,-1.5953 -14.9257,-2.90744 -15.5,-2.91586 -0.57431,-0.008 -0.36919,-0.48573 0.45581,-1.06068 1.15346,-0.80385 0.80692,-0.95163 -1.5,-0.63967 -1.65,0.22314 -2.4375,0.21745 -1.75,-0.0126 0.6875,-0.23009 1.25,-0.78721 1.25,-1.23804 0,-1.18242 -2.9918,-2.15676 -4.24475,-1.3824 -0.64707,0.39991 -0.76911,0.18018 -0.31132,-0.56053 0.72605,-1.17478 -2.53733,-0.96968 -8.94393,0.5621 -1.67803,0.4012 -1.75852,0.29363 -0.5,-0.66821 1.21935,-0.9319 1.03225,-1.04688 -1,-0.61454 -3.31201,0.7046 -17.139648,-2.83879 -14.139582,-3.62333 C 88.606966,136.29002 89,135.43526 89,132.09362 89,129.25717 89.428693,128 90.395919,128 c 1.019219,0 1.587023,-2.15887 2.104081,-8 l 0.708162,-8 H 96.604081 100 v -8 c 0,-7.333333 0.16667,-8 2,-8 1.88889,0 2,-0.666667 2,-12 V 72 h 4 4 v 4 4 h 4 4 v -8 -8 h 4 4 l 0.19964,-12.25 c 0.1098,-6.7375 0.15595,-13.4875 0.10255,-15 -0.0534,-1.5125 0.19427,-2.732965 0.55036,-2.712144 0.3561,0.02082 2.17126,1.984506 4.0337,4.363746 3.30374,4.22047 3.43168,4.280471 5.25,2.462144 C 139.16131,39.838685 140.69473,39 141.54384,39 c 2.15645,0 1.43397,-3.112593 -1.22241,-5.266397 -1.19822,-0.971518 -3.14742,-3.334018 -4.33156,-5.25 C 134.5781,26.199325 133.07312,25 131.61844,25 c -1.22014,0 -2.67716,-0.458717 -3.23781,-1.019371 -0.6925,-0.692494 -2.33096,-0.556615 -5.10959,0.423743 -2.24962,0.793712 -4.35591,1.177429 -4.68063,0.852704 C 118.26568,24.932351 118,25.094592 118,25.617611 c 0,1.182703 -17.48499,9.351331 -20.151129,9.414192 -0.741879,0.01749 -2.222379,0.692492 -3.290001,1.5 C 93.491249,37.339312 91.870772,38 90.95781,38 c -0.912962,0 -3.779856,1.127175 -6.370875,2.504833 -2.591018,1.377658 -4.42204,2.037379 -4.068938,1.466047 0.353103,-0.571333 -0.824701,-0.146829 -2.617342,0.943341 -1.792642,1.090171 -3.628642,1.753892 -4.080002,1.474937 C 73.369294,44.110202 73,44.309663 73,44.832403 c 0,0.522741 -1.8,1.670655 -4,2.55092 -3.002908,1.201526 -4.003628,2.163365 -4.014553,3.85858 -0.01596,2.476369 -1.691814,7.633624 -4.903833,15.091002 C 58.936726,68.991003 58,72.034609 58,73.096474 58,74.158339 57.566017,75.808532 57.035593,76.763569 56.50517,77.718606 55.115895,82.55 53.948317,87.5 c -1.167579,4.95 -2.755951,10.920435 -3.529716,13.26763 -0.773765,2.3472 -1.338049,4.5972 -1.253964,5 0.08408,0.40281 -0.111649,1.40737 -0.434962,2.23237 -1.542817,3.93681 -3.412339,11.92191 -2.686157,11.4731 0.450057,-0.27815 1.143908,0.0211 1.541892,0.6651 0.452342,0.7319 0.290103,0.9029 -0.432774,0.45613 -1.533507,-0.94776 -3.212261,3.55811 -2.763055,7.41618 0.191441,1.64422 -0.011,2.98949 -0.449856,2.98949 -0.438861,0 -1.249793,2.3625 -1.802071,5.25 -3.441597,17.99386 -5.186011,27.89259 -5.727341,32.5 L 35.793484,174 h 3.519925 c 1.935958,0 3.67011,0.45056 3.85367,1.00124 0.183561,0.55068 2.667802,1.88811 5.520536,2.97206 4.921825,1.87015 5.169028,1.8786 4.839102,0.16543 -0.202509,-1.05154 0.241269,-1.8054 1.062798,-1.8054 0.775767,0 1.410485,0.42227 1.410485,0.93837 0,0.5161 1.796158,0.76708 3.991463,0.55772 2.195304,-0.20935 4.173634,0.0809 4.396287,0.64497 0.222654,0.56408 0.163539,-1.56189 -0.131365,-4.72439 L 63.720194,168 h 4.139903 C 70.137044,168 72,168.45 72,169 c 0,0.55 1.8,1 4,1 3.777778,0 4,0.16667 4,3 0,2.8805 0.175926,3 4.416667,3 2.555555,0 4.662473,0.52673 5,1.25 0.466666,1 0.7,1 1.166666,0 0.320834,-0.6875 1.259306,-1.25 2.085495,-1.25 1.189889,0 0.987955,0.92002 -0.971386,4.42566 -2.000773,3.57977 -2.160463,4.33635 -0.835494,3.95841 0.900928,-0.25698 -0.782158,0.67647 -3.740191,2.07434 C 84.163723,187.85629 81.324665,189 80.81274,189 c -0.511926,0 -0.629642,0.48724 -0.261592,1.08276 0.875505,1.4166 7.979153,4.43114 17.396563,7.38251 14.786899,4.63414 14.314469,4.62889 27.052289,0.30039 6.325,-2.14933 17.28174,-6.42553 24.3483,-9.50267 z M 93,183.48643 c 0,-0.28246 0.417151,-1.29496 0.927002,-2.25 0.509851,-0.95504 1.170728,-2.52393 1.468615,-3.48643 0.704795,-2.27725 8.103513,-2.49762 8.959543,-0.26686 0.33923,0.88403 1.22422,1.23176 2.19083,0.86084 1.29997,-0.49885 1.35708,-0.79005 0.28786,-1.46783 -1.03163,-0.65395 -0.95071,-0.84899 0.35713,-0.86084 3.77796,-0.0342 2.51566,1.95204 -2.42911,3.82227 -2.89403,1.09459 -6.04937,2.30206 -7.01187,2.68328 -1.062392,0.42078 -1.75,0.23497 -1.75,-0.47289 0,-0.6413 0.519529,-0.84492 1.154508,-0.45248 0.737862,0.45602 0.882089,0.27274 0.399648,-0.50786 -0.462519,-0.74838 -0.231899,-1.14961 0.595492,-1.03603 C 100.98268,180.44049 103,179.958 103,178.89159 c 0,-0.69736 -1.01982,-0.87152 -2.75,-0.46962 -2.040312,0.47393 -2.362898,0.37683 -1.25,-0.37628 1.32061,-0.89367 1.31303,-1.0169 -0.06335,-1.03038 -0.866043,-0.008 -2.17589,1.54581 -2.936646,3.48469 -1.153147,2.93893 -3,4.77743 -3,2.98643 z M 49.5,177 c -0.339919,-0.55 -0.168034,-1 0.381966,-1 0.55,0 1.278115,0.45 1.618034,1 0.339919,0.55 0.168034,1 -0.381966,1 -0.55,0 -1.278115,-0.45 -1.618034,-1 z m 9.25,-0.66228 c 0.6875,-0.27741 1.8125,-0.27741 2.5,0 0.6875,0.27741 0.125,0.50439 -1.25,0.50439 -1.375,0 -1.9375,-0.22698 -1.25,-0.50439 z M 112.5,176 c 1.34731,-0.57896 1.51049,-0.88736 0.5,-0.94503 -1.18958,-0.0679 -1.22794,-0.25812 -0.18535,-0.91925 0.72305,-0.45851 2.46481,-0.61379 3.87056,-0.34506 l 2.55593,0.48859 -3.23538,1.36038 c -1.77946,0.7482 -3.74622,1.32874 -4.37057,1.29008 C 111.01084,176.89106 111.4,176.47269 112.5,176 Z m 6.64647,-3.70276 c -0.80036,-1.43016 -1.20666,-1.49217 -2.53786,-0.38738 -1.34069,1.11267 -1.69111,1.02834 -2.27384,-0.54724 -0.37889,-1.02444 -1.17171,-2.19323 -1.76183,-2.59731 -0.607,-0.41564 -0.10948,-0.74133 1.14568,-0.75 1.56437,-0.0108 2.04887,0.42702 1.64301,1.48469 -0.31659,0.825 -0.0775,1.5 0.53138,1.5 0.60885,0 1.10699,-0.45 1.10699,-1 0,-0.55 0.70156,-1 1.55902,-1 0.85746,0 1.30332,0.41372 0.99081,0.91938 -0.31252,0.50566 0.14307,1.63066 1.01241,2.5 0.86934,0.86934 1.12083,1.58062 0.55888,1.58062 -0.56196,0 -1.45055,-0.76624 -1.97465,-1.70276 z m 3.10353,0.0405 c -0.6875,-0.27741 -1.25,-0.97199 -1.25,-1.5435 0,-0.69757 0.42795,-0.68394 1.30204,0.0415 0.71612,0.59433 2.40362,0.86519 3.75,0.60192 2.16763,-0.42385 2.21893,-0.36985 0.44796,0.47157 -2.29259,1.08926 -2.54858,1.11507 -4.25,0.42853 z M 96,169.5 c 0,-1.71949 0.546359,-2.49574 1.75,-2.48635 3.7539,0.0293 6.25,1.26855 6.25,3.10298 0,1.5306 -0.74924,1.88337 -4,1.88337 -3.6,0 -4,-0.25 -4,-2.5 z m -24,-5.90638 c 0,-3.91405 0.223462,-4.34794 2,-3.88337 1.566869,0.40975 2,1.36402 2,4.40638 0,3.2167 -0.343345,3.88337 -2,3.88337 -1.697408,0 -2,-0.66667 -2,-4.40638 z m 8,3.34736 c 0,-0.58246 0.45,-0.7809 1,-0.44098 0.55,0.33992 1,0.81648 1,1.05902 C 82,167.80156 81.55,168 81,168 c -0.55,0 -1,-0.47656 -1,-1.05902 z M 85,167 c -1.292687,-0.8354 -1.266292,-0.97149 0.190983,-0.98469 0.930041,-0.008 1.969098,0.43469 2.309017,0.98469 0.782182,1.2656 -0.541628,1.2656 -2.5,0 z m 4.371335,0.29533 c 0.387568,-0.38757 -0.774932,-1.52803 -2.583333,-2.53435 -2.325026,-1.29382 -2.592355,-1.64181 -0.912773,-1.1882 1.608158,0.43432 2.154255,0.28394 1.690983,-0.46565 C 87.189877,162.49821 86.008524,162 84.940983,162 83.873442,162 83,161.50186 83,160.89301 c 0,-0.60884 0.711804,-0.83384 1.581787,-0.5 0.869984,0.33385 2.194146,0.60699 2.942583,0.60699 0.822516,0 1.208438,0.79112 0.97563,2 -0.211841,1.1 0.151497,2.01431 0.807418,2.0318 0.65592,0.0175 2.06609,0.6925 3.133712,1.5 1.852624,1.40126 1.810829,1.4682 -0.916667,1.4682 -1.571788,0 -2.540696,-0.3171 -2.153128,-0.70467 z m 10.541138,-1.66698 c -2.523139,-0.68017 -5.110639,-1.06229 -5.75,-0.84917 C 93.523113,164.9923 93,164.62668 93,163.9667 c 0,-0.76591 0.813868,-0.97024 2.25,-0.56488 1.2375,0.3493 4.3875,1.11407 7,1.6995 2.6125,0.58542 4.75,1.25212 4.75,1.48154 0,0.6649 -2.15858,0.37419 -7.087527,-0.95451 z m -21.364631,-6.21703 c -2.071823,-1.51495 -1.245832,-1.73989 1.885782,-0.51354 1.063492,0.41647 1.50853,1.01994 0.988971,1.34104 -0.519559,0.32111 -1.813197,-0.0513 -2.874753,-0.8275 z M 59.5,159 c 0.339919,-0.55 0.816476,-1 1.059017,-1 C 60.801558,158 61,158.45 61,159 c 0,0.55 -0.476558,1 -1.059017,1 -0.582459,0 -0.780902,-0.45 -0.440983,-1 z m 5,0 c 1.857127,-0.79803 1.827361,-0.86445 -0.416667,-0.92971 -1.329166,-0.0387 -2.162649,-0.32431 -1.852183,-0.63477 0.310465,-0.31047 2.297965,-0.22887 4.416666,0.18132 3.575171,0.69218 3.672407,0.79751 1.352184,1.4648 -3.565397,1.02541 -5.946955,0.96985 -3.5,-0.0816 z m 3.787097,-2.98283 c -2.268416,-1.0156 -4.458147,-1.54743 -4.86607,-1.18186 -0.407923,0.36558 -0.417221,0.10097 -0.02066,-0.58801 0.561538,-0.97563 1.205253,-0.99252 2.910325,-0.0764 1.204122,0.647 3.536839,1.45366 5.183816,1.79258 1.646977,0.33892 2.527062,0.90512 1.955744,1.25821 -0.571317,0.3531 -2.894736,-0.18896 -5.163151,-1.20456 z m -19.72946,-6.92391 c -0.308218,-0.49871 0.340224,-0.67122 1.440983,-0.38337 2.334987,0.61061 2.630147,1.29011 0.560397,1.29011 -0.792541,0 -1.693162,-0.40803 -2.00138,-0.90674 z M 106.5,143 l -3,-0.76337 3,-0.103 c 1.65,-0.0567 3.675,0.33321 4.5,0.86637 1.33333,0.86167 1.33333,0.95793 0,0.86637 -0.825,-0.0566 -2.85,-0.44652 -4.5,-0.86637 z m -25.6875,-6.68311 c 0.721875,-0.28887 1.584375,-0.25335 1.916667,0.0789 0.332291,0.33229 -0.258334,0.56864 -1.3125,0.52522 -1.164943,-0.048 -1.4019,-0.28494 -0.604167,-0.60416 z m -5,-1 c 0.721875,-0.28887 1.584375,-0.25335 1.916667,0.0789 0.332291,0.33229 -0.258334,0.56864 -1.3125,0.52522 -1.164943,-0.048 -1.4019,-0.28494 -0.604167,-0.60416 z m -5.900391,-1.04387 c 1.916376,-0.36118 2.121894,-0.65711 1,-1.43995 -1.207819,-0.84278 -1.204146,-0.92911 0.02539,-0.5967 2.778512,0.75118 2.314813,2.76775 -0.604167,2.62745 -2.595267,-0.12474 -2.63066,-0.17438 -0.421223,-0.5908 z M 60.5,133.33256 c -1.1,-0.23949 -4.398187,-0.9016 -7.329305,-1.47136 -2.931118,-0.56976 -5.149772,-1.21546 -4.930343,-1.43488 0.475952,-0.47596 15.917918,2.39862 16.611601,3.0923 0.544031,0.54403 -1.375529,0.46196 -4.351953,-0.18606 z M 76.5,133 c -0.782182,-1.2656 0.541628,-1.2656 2.5,0 1.292687,0.8354 1.266292,0.97149 -0.190983,0.98469 C 77.878976,133.99311 76.839919,133.55 76.5,133 Z M 89.75,96.294267 c 1.2375,-0.238353 3.2625,-0.238353 4.5,0 1.2375,0.238353 0.225,0.433369 -2.25,0.433369 -2.475,0 -3.4875,-0.195016 -2.25,-0.433369 z M 92,84 c 0,-3.333333 0.333333,-4 2,-4 1.666667,0 2,0.666667 2,4 0,3.333333 -0.333333,4 -2,4 -1.666667,0 -2,-0.666667 -2,-4 z m 12,-23 c 0,-2.833333 0.22222,-3 4,-3 3.77778,0 4,0.166667 4,3 0,2.833333 -0.22222,3 -4,3 -3.77778,0 -4,-0.166667 -4,-3 z m 12,-1 c 0,-3.333333 0.33333,-4 2,-4 1.66667,0 2,0.666667 2,4 0,3.333333 -0.33333,4 -2,4 -1.66667,0 -2,-0.666667 -2,-4 z m 9,-35 c 0.825,-0.533156 1.95,-0.969374 2.5,-0.969374 0.55,0 0.325,0.436218 -0.5,0.969374 -0.825,0.533156 -1.95,0.969374 -2.5,0.969374 -0.55,0 -0.325,-0.436218 0.5,-0.969374 z m 11.39699,171.16667 c 0.28327,-0.45834 -0.12038,-0.83334 -0.89699,-0.83334 -0.77661,0 -1.18026,0.375 -0.89699,0.83334 C 134.88627,196.625 135.28992,197 135.5,197 c 0.21008,0 0.61373,-0.375 0.89699,-0.83333 z M 83.809936,185.75 c 0.185192,-0.9625 -0.194429,-1.75 -0.843601,-1.75 -0.649172,0 -0.921291,0.675 -0.604709,1.5 0.316583,0.825 0.187873,1.5 -0.286022,1.5 -0.473895,0 -1.131593,-0.70352 -1.461552,-1.56338 -0.32996,-0.85986 -1.033451,-1.29545 -1.563315,-0.96798 -0.529864,0.32748 -0.733919,1.1934 -0.453455,1.92428 0.740686,1.93019 4.814239,1.42777 5.212654,-0.64292 z m -11.376148,0.14287 c -0.456247,-0.73823 -0.0041,-0.89128 1.356826,-0.45933 1.12259,0.3563 2.273632,0.27153 2.557871,-0.18838 0.405566,-0.65622 -3.757732,-0.95821 -5.157502,-0.37411 -0.456507,0.1905 0.842854,2.12895 1.427051,2.12895 0.275,0 0.192089,-0.49821 -0.184246,-1.10713 z M 64.5,183.36466 c -1.65,-0.89266 -4.35,-2.00601 -6,-2.4741 -2.56935,-0.72891 -2.378057,-0.79422 1.332587,-0.4549 5.288387,0.48358 4.763482,-0.41235 -0.842143,-1.43741 -3.415373,-0.62454 -4.039307,-0.49049 -3.788113,0.81386 0.1654,0.85885 1.875039,1.9627 3.799198,2.453 1.924159,0.4903 3.925971,1.30623 4.448471,1.81317 0.5225,0.50695 1.6475,0.91895 2.5,0.91556 0.8525,-0.003 0.2,-0.73652 -1.45,-1.62918 z m 24.183114,-3.55216 c -0.319226,-0.79773 -0.556183,-0.56078 -0.604167,0.60417 -0.04342,1.05416 0.192928,1.64479 0.52522,1.3125 0.332291,-0.3323 0.367818,-1.1948 0.07895,-1.91667 z M 131.2551,145.8551 C 129.6259,144.2259 121,143.47965 121,144.96791 c 0,0.65475 0.76805,0.9248 1.75,0.61532 0.9625,-0.30335 3.1,-0.14735 4.75,0.34666 4.21193,1.26106 5.07378,1.24389 3.7551,-0.0748 z m -31.525933,-6.45927 c -0.332292,-0.33229 -1.194792,-0.36781 -1.916667,-0.0789 -0.797733,0.31922 -0.560776,0.55618 0.604167,0.60416 1.054166,0.0434 1.644793,-0.19293 1.3125,-0.52522 z m 7.670273,-0.79729 c -0.58201,-1.5167 -4.23116,-2.82058 -5.57298,-1.99129 -1.38876,0.8583 -0.9233,2.22079 0.92354,2.70342 3.60708,0.94263 5.19132,0.69998 4.64944,-0.71213 z M 97.270182,137.5932 c 1.630508,-1.23722 1.57133,-1.3432 -0.75,-1.3432 -1.3861,0 -2.520182,0.44885 -2.520182,0.99744 0,0.56345 -0.638032,0.46793 -1.466378,-0.21954 -0.806508,-0.66934 -2.044008,-1.00077 -2.75,-0.73651 -0.789407,0.29548 -0.321082,0.885 1.216378,1.53115 3.31605,1.39365 4.172544,1.36232 6.270182,-0.22934 z"
       id="path3721"
       inkscape:connector-curvature="0" />
    <path
       style="fill:#1c1d22"
       d="m 140.5,210.87716 c -6.05,-1.67454 -15.87378,-4.58193 -21.83062,-6.46089 C 112.71254,202.53732 107.30005,201 106.64164,201 104.81864,201 90.142407,196.09078 84.5,193.59358 81.75,192.3765 77.025,190.579 74,189.59914 70.975,188.61928 60.913685,184.82113 51.641522,181.15879 L 34.783045,174.5 l 0.52123,-5.10472 C 35.820167,164.34285 37.39334,155.60094 43.023607,126.5 46.264035,109.75133 52.581054,86.35392 60.200252,62.879957 l 5.069966,-15.620044 8.860936,-4.103894 C 79.004669,40.898877 86.481369,37.882487 90.746045,36.45293 95.01072,35.023373 102.325,32.035366 107,29.812914 c 18.73524,-8.906562 24.36744,-10.345129 28.67906,-7.325156 4.54392,3.182689 20.72649,32.05605 24.38717,43.512242 0.43936,1.375 2.42395,6.775 4.4102,12 4.03459,10.613355 14.47426,44.72235 16.98677,55.5 0.89752,3.85 2.70582,11.5 4.01843,17 2.46718,10.33769 4.96814,21.59605 6.05137,27.24092 1.20612,6.28524 -8.07397,21.17246 -16.88653,27.08957 -5.43905,3.65199 -15.8578,8.2008 -19.92019,8.69711 -1.77445,0.21679 -8.17628,-0.97591 -14.22628,-2.65044 z m -7.23097,-5.5331 c -0.67703,-0.27392 -2.02703,-0.29059 -3,-0.0371 -0.97297,0.25354 -0.41903,0.47766 1.23097,0.49804 1.65,0.0204 2.44606,-0.18706 1.76903,-0.46099 z m -9.74257,-2.15093 c -0.30789,-0.30789 -1.11479,-6.4e-4 -1.79313,0.68278 -0.98026,0.98762 -0.8654,1.10248 0.5598,0.5598 0.98622,-0.37553 1.54122,-0.93469 1.23333,-1.24258 z m -1.82946,-4.18321 c 2.38097,-0.87033 3.65722,-0.88093 5,-0.0415 1.55389,0.97137 1.45758,1.04237 -0.697,0.51384 -1.9292,-0.47323 -2.15752,-0.37347 -1,0.43694 1.27196,0.89054 1.20862,1.05252 -0.41667,1.06551 -1.05416,0.008 -1.63109,0.30088 -1.28206,0.64991 0.34903,0.34903 2.05485,0.0463 3.79072,-0.6727 2.9938,-1.24008 3.05974,-1.38089 1.28206,-2.73803 -1.77229,-1.35304 -1.75051,-1.39387 0.40107,-0.75194 1.61436,0.48165 2.19522,0.29387 2,-0.64657 -0.15502,-0.74677 0.59798,-1.33232 1.72488,-1.34131 1.1,-0.009 3.50432,-0.82945 5.34293,-1.82374 1.83861,-0.99428 3.53877,-1.61194 3.77814,-1.37258 0.23936,0.23937 -1.03996,1.20334 -2.84293,2.14217 l -3.27814,1.70695 2.99441,-0.64882 c 3.40091,-0.7369 5.71216,-2.34478 5.00808,-3.484 -0.68276,-1.10473 9.33554,-5.22217 10.6818,-4.39013 0.73772,0.45593 0.84307,0.23939 0.30617,-0.62933 -0.59931,-0.96971 -0.35895,-1.14808 0.89743,-0.66596 0.94379,0.36216 1.48389,0.28294 1.20021,-0.17606 -0.28368,-0.459 1.70499,-1.8747 4.41927,-3.146 2.71427,-1.2713 6.1855,-3.48833 7.71384,-4.92672 1.52833,-1.4384 4.52531,-3.91047 6.65994,-5.49347 4.03862,-2.99498 9.60479,-13.28273 9.63305,-17.8044 0.0206,-3.29632 -3.3955,-16.81438 -4.17491,-16.52081 -0.36339,0.13687 -2.73272,3.07189 -5.26517,6.52226 -7.19109,9.79762 -8.07785,10.01644 -27.68303,6.83126 -8.98773,-1.4602 -16.7171,-3.03068 -17.17638,-3.48996 -0.79288,-0.79288 7.45444,0.18166 11.08002,1.30927 2.40542,0.74812 4.97303,-0.91538 2.73718,-1.77336 -1.08677,-0.41703 -1.39548,-0.23889 -0.9198,0.53077 0.48489,0.78457 0.15249,0.94226 -1.02985,0.48855 -0.96021,-0.36847 -2.27153,-0.70157 -2.91405,-0.74023 -0.64251,-0.0386 -0.26821,-0.48712 0.83179,-0.99659 1.45418,-0.67351 0.90836,-0.77861 -2,-0.3851 -2.72724,0.369 -4.63638,0.0598 -6,-0.9716 -2.39021,-1.80797 -0.33043,-2.11198 2.46809,-0.36427 1.06752,0.66667 2.29892,0.83007 2.73643,0.36309 0.43751,-0.46698 0.23298,-1.04994 -0.45452,-1.29548 -0.71125,-0.25401 -1.25,-2.13452 -1.25,-4.36309 0,-3.25 -0.34043,-3.91667 -2,-3.91667 -1.66667,0 -2,-0.66667 -2,-4 0,-3.6 0.25,-4 2.5,-4 2.25,0 2.5,-0.4 2.5,-4 v -4 l -4.75,-0.0318 c -4.35941,-0.0292 -4.59296,-0.15065 -2.84016,-1.47713 C 135.76572,113.68112 137,111.97384 137,107.99229 137,105.40047 137.45222,104 138.28914,104 c 1.68843,0 1.24654,-48.532169 -0.49439,-54.298381 -1.62905,-5.395646 -0.19459,-8.935591 3.96566,-9.786454 C 143.76184,39.505829 145,39.650223 145,40.292966 c 0,0.572202 0.24329,0.797082 0.54064,0.499732 0.60431,-0.604311 -3.53233,-8.104376 -4.75766,-8.626031 C 140.35234,31.983333 140,31.199647 140,30.425141 c 0,-0.774506 -0.9,-1.970253 -2,-2.657214 -1.1,-0.686961 -2,-1.974033 -2,-2.86016 0,-1.347983 -1.14014,-1.576359 -6.98036,-1.398197 -3.8392,0.117118 -7.5931,0.721473 -8.34201,1.34301 -0.74891,0.621537 -1.65774,0.833972 -2.01964,0.472077 C 118.2961,24.962762 118,25.191667 118,25.833333 c 0,0.641667 -0.3375,1.076649 -0.75,0.966627 -0.4125,-0.110022 -3,0.949463 -5.75,2.354411 -2.75,1.404948 -7.25,3.372454 -10,4.372236 -2.75,0.999781 -5.45,2.143511 -6,2.541621 -0.55,0.39811 -2.575,1.187514 -4.5,1.754231 -7.077011,2.08346 -15.52031,5.502983 -16.234687,6.575022 C 74.338863,45.037439 74.017777,45.080451 74,44.5 c -0.01684,-0.55 -0.394308,-0.426958 -0.838808,0.273426 -0.4445,0.700384 -1.833522,1.470888 -3.086715,1.712231 -2.995644,0.576908 -5.071249,2.366511 -5.087855,4.386788 C 64.979264,51.7676 63.594491,56.325 61.909348,61 c -3.016691,8.369042 -11.535413,37.803985 -12.540169,43.33034 -0.283024,1.55669 -1.133823,4.58544 -1.890665,6.73056 -0.756841,2.14511 -2.529398,10.09646 -3.939015,17.66965 -1.409617,7.5732 -3.511504,18.71945 -4.670859,24.76945 -2.452277,12.797 -2.91955,20.95356 -1.201973,20.98121 0.641666,0.0103 1.504166,0.35629 1.916666,0.76879 0.4125,0.4125 1.537693,0.75 2.500428,0.75 0.962736,0 3.925236,0.97574 6.583334,2.16832 2.658098,1.19257 5.057905,2.24394 5.332905,2.33636 1.20302,0.40434 4.836901,1.82292 9.059706,3.53669 6.152654,2.49698 9.92476,3.11629 10.00368,1.64241 0.03486,-0.65108 0.470362,-0.17128 0.967776,1.06622 0.766836,1.90778 2.937593,2.90267 4.36385,2 0.217257,-0.1375 1.229757,0.50194 2.25,1.42098 2.097361,1.88931 9.956925,5.15209 18.854988,7.82735 13.20084,3.96893 14.00615,4.00563 22.197,1.01159 z M 81.863153,188.10574 c 1.15087,-0.72914 1.15087,-0.95892 0,-1.47546 -0.749734,-0.3365 -0.350653,-0.36065 0.886847,-0.0537 1.276646,0.3167 2.25,0.0964 2.25,-0.50923 C 85,185.48032 85.45,185 86,185 c 1.905758,0 0.988021,1.68443 -1.547053,2.83948 -2.971144,1.35375 -4.564897,1.5176 -2.589794,0.26626 z M 75.56607,185.1069 c -0.26032,-0.4212 0.396652,-0.70174 1.459939,-0.6234 2.658351,0.19584 3.322724,1.06462 0.950776,1.2433 -1.065573,0.0803 -2.150394,-0.19869 -2.410715,-0.6199 z M 98,181 c -0.901292,-0.58246 -1.024633,-0.97549 -0.309017,-0.98469 0.655041,-0.008 1.469098,0.43469 1.809017,0.98469 0.7673,1.24153 0.421123,1.24153 -1.5,0 z m 24.65645,-8.75 c -0.25387,-0.4125 0.95707,-0.82587 2.69098,-0.9186 2.55574,-0.13668 2.77394,-0.008 1.15257,0.67972 -2.60564,1.1052 -3.28442,1.14738 -3.84355,0.23888 z M 126.5,147 c 0.33992,-0.55 0.81648,-1 1.05902,-1 0.24254,0 0.44098,0.45 0.44098,1 0,0.55 -0.47656,1 -1.05902,1 -0.58246,0 -0.7809,-0.45 -0.44098,-1 z m -3.6875,-0.68311 c 0.72187,-0.28887 1.58437,-0.25335 1.91667,0.0789 0.33229,0.33229 -0.25834,0.56864 -1.3125,0.52522 -1.16495,-0.048 -1.4019,-0.28494 -0.60417,-0.60416 z M 117,145.60699 c 0,-0.21616 0.69837,-0.661 1.55194,-0.98855 0.88992,-0.34149 1.29132,-0.17385 0.94098,0.39301 C 118.90566,145.96166 117,146.4169 117,145.60699 Z M 107.5,143 c -1.26064,-0.54172 -1.44548,-0.85943 -0.5,-0.85943 0.825,0 2.4,0.38674 3.5,0.85943 1.26064,0.54172 1.44548,0.85943 0.5,0.85943 -0.825,0 -2.4,-0.38674 -3.5,-0.85943 z m -9.6875,-2.68311 c 0.721875,-0.28887 1.584375,-0.25335 1.916667,0.0789 0.332293,0.33229 -0.258334,0.56864 -1.3125,0.52522 -1.164943,-0.048 -1.4019,-0.28494 -0.604167,-0.60416 z m -28,-6 c 0.721875,-0.28887 1.584375,-0.25335 1.916667,0.0789 0.332291,0.33229 -0.258334,0.56864 -1.3125,0.52522 -1.164943,-0.048 -1.4019,-0.28494 -0.604167,-0.60416 z M 57.75,132.33772 c 0.6875,-0.27741 1.8125,-0.27741 2.5,0 0.6875,0.27741 0.125,0.50439 -1.25,0.50439 -1.375,0 -1.9375,-0.22698 -1.25,-0.50439 z m 79.75,66.63064 c -1.70561,-0.70594 -1.55842,-0.84039 1,-0.91339 6.06402,-0.17302 5.18435,-1.60493 -0.97088,-1.58036 -3.67196,0.0146 -6.29167,0.44823 -6.19559,1.02539 0.26692,1.60342 1.58058,2.19608 4.98228,2.24777 2.60392,0.0396 2.81972,-0.10247 1.18419,-0.77941 z m -4.5,-0.36137 c 0,-0.21616 0.69837,-0.661 1.55194,-0.98855 0.88992,-0.34149 1.29132,-0.17385 0.94098,0.39301 C 134.90566,198.96166 133,199.4169 133,198.60699 Z M 153.80687,60.473539 c -0.30789,-0.307888 -0.86705,0.247112 -1.24258,1.233333 -0.54268,1.425198 -0.42782,1.540062 0.5598,0.559795 0.68342,-0.678334 0.99067,-1.485241 0.68278,-1.793128 z"
       id="path3719"
       inkscape:connector-curvature="0" />
    <path
       style="fill:#111113"
       d="m 140.5,210.87716 c -6.05,-1.67454 -15.87378,-4.58193 -21.83062,-6.46089 C 112.71254,202.53732 107.30005,201 106.64164,201 104.81864,201 90.142407,196.09078 84.5,193.59358 81.75,192.3765 77.025,190.579 74,189.59914 70.975,188.61928 60.913685,184.82113 51.641522,181.15879 L 34.783045,174.5 l 0.52123,-5.10472 c 0.515892,-5.05243 2.089065,-13.79434 7.719332,-42.89528 2.494364,-12.89252 5.024936,-22.77315 13.65709,-53.324152 0.827383,-2.928283 1.670987,-5.157497 1.874676,-4.953809 0.203688,0.203689 -1.640089,7.549557 -4.097282,16.324152 C 48.109913,107.21542 44.368645,122.75342 42.068949,136 c -1.098064,6.325 -2.940109,16.59282 -4.093435,22.81738 -1.153326,6.22456 -1.957132,12.25593 -1.786235,13.40304 0.285412,1.91578 2.706049,3.12885 12.310721,6.16936 0.877702,0.27785 3.870442,1.51611 11,4.55131 1.1,0.46829 6.05,2.29754 11,4.06499 4.95,1.76745 11.25,4.24072 14,5.49616 9.120454,4.16368 28.95621,9.95187 30.60736,8.93141 0.41495,-0.25645 1.0371,-0.009 1.38256,0.55004 0.34546,0.55897 1.50156,1.01631 2.5691,1.01631 1.06754,0 1.94098,0.37352 1.94098,0.83004 0,0.45652 1.54138,0.77889 3.42528,0.71639 1.88391,-0.0625 3.25511,0.16169 3.04712,0.49822 -0.56183,0.90907 14.29127,4.21944 15.52123,3.45928 0.58034,-0.35867 2.50669,-0.33009 4.28077,0.0635 2.72616,0.60483 2.92156,0.82347 1.26195,1.41212 -1.51976,0.53906 -1.04567,0.84329 2.09734,1.34587 3.0136,0.4819 5.06752,0.14708 7.96364,-1.29818 2.14647,-1.07116 3.34017,-1.96549 2.65267,-1.9874 -0.6875,-0.0219 -1.25,-0.64914 -1.25,-1.39383 0,-1.85672 4.57397,-6.64602 6.34722,-6.64602 0.95292,0 1.57221,-1.35797 1.82417,-4 l 0.38146,-4 h -6.34217 c -6.92447,0 -11.51445,-1.5604 -9.09578,-3.09217 1.15239,-0.72983 1.13309,-0.8877 -0.1149,-0.93969 -1.55478,-0.0648 8.72976,-5.84924 10.5,-5.90565 0.55,-0.0175 0.325,0.40435 -0.5,0.93751 -1.14269,0.73847 -0.74569,0.97302 1.66667,0.98469 1.74166,0.008 3.39364,0.57781 3.67105,1.26531 0.32116,0.79592 0.53306,0.65877 0.58333,-0.37756 0.0434,-0.89515 -0.54201,-2.14291 -1.30097,-2.77278 -1.14317,-0.94875 -0.90277,-1.65603 1.40121,-4.12245 1.52962,-1.63746 3.22219,-2.97721 3.76126,-2.97721 3.44136,0 12.20238,-14.16569 12.23165,-19.77734 0.0166,-3.19351 -3.27252,-17.2201 -4.0384,-17.22162 -0.28831,-5.7e-4 -2.53487,2.76005 -4.99236,6.13471 -4.66095,6.40049 -8.22256,9.45253 -9.85405,8.44422 -0.52721,-0.32584 -1.1095,-0.17181 -1.29398,0.34228 -0.20063,0.55911 -2.54548,0.61175 -5.83541,0.13099 -3.025,-0.44205 -4.65525,-0.85987 -3.62277,-0.92848 1.65042,-0.10969 1.81656,-0.75617 1.37507,-5.35083 -0.36575,-3.80645 -0.0608,-5.90343 1.12277,-7.71968 l 1.62493,-2.49362 0.60809,3.96969 0.6081,3.96968 0.1419,-4.25 c 0.12349,-3.69837 -0.13119,-4.25 -1.96217,-4.25 -2.02245,0 -2.07661,-0.31038 -1.39592,-8 0.49545,-5.59704 0.37653,-8 -0.39592,-8 C 156.48541,120 156,118.26735 156,116.05902 c 0,-2.16754 -0.40415,-4.19076 -0.89811,-4.49605 -0.49396,-0.30528 -1.21574,-3.81934 -1.60395,-7.80902 -0.39043,-4.012516 -1.50762,-8.594502 -2.50014,-10.25395 -1.35696,-2.26877 -1.66623,-4.279653 -1.26883,-8.25 0.38512,-3.847661 0.18702,-5.25 -0.74164,-5.25 -0.93644,0 -1.12054,-1.420383 -0.70543,-5.442449 0.41542,-4.024945 0.1914,-5.749783 -0.86009,-6.622445 -1.98148,-1.644477 -1.77623,-4.609159 0.35772,-5.1672 C 150.2093,62.132505 152,64.309474 152,67.898777 c 0,1.640754 0.41189,3.237749 0.91531,3.548879 0.50341,0.311129 1.23463,3.973382 1.62492,8.138338 0.46776,4.991781 1.18018,7.753223 2.09033,8.102479 0.75939,0.291407 1.66069,2.280712 2.00288,4.420679 0.3422,2.139966 0.98637,3.890848 1.4315,3.890848 1.05553,0 -0.0996,-7.319181 -1.27757,-8.094857 -0.49684,-0.327171 -0.59987,-1.804034 -0.22894,-3.281917 0.60255,-2.400774 0.80468,-2.508898 1.89716,-1.014844 1.13087,1.546553 1.27646,1.532271 1.93738,-0.190058 0.60463,-1.57565 0.85789,-1.635721 1.64551,-0.390299 0.51199,0.809586 0.93089,1.021975 0.93089,0.471975 0,-0.55 -0.4189,-1.662389 -0.93089,-2.471975 -0.79411,-1.255696 -1.03052,-1.212341 -1.60897,0.295068 -0.62322,1.624099 -0.79904,1.594345 -2.17339,-0.367823 -1.15554,-1.649758 -1.24981,-2.673704 -0.41487,-4.506199 0.86249,-1.892964 0.59552,-3.708288 -1.32341,-8.998756 -1.32213,-3.645081 -3.10451,-7.696739 -3.96085,-9.003685 C 153.70064,57.139685 153,55.544221 153,54.901154 c 0,-0.643067 -1.77704,-4.656857 -3.94898,-8.919533 -2.17194,-4.262676 -3.67194,-8.027363 -3.33334,-8.365971 C 146.05629,37.277043 145.80105,37 145.15049,37 144.49992,37 143.18742,35.3125 142.23382,33.25 141.28022,31.1875 139.9375,29.140139 139.25,28.70031 138.5625,28.26048 138,27.30308 138,26.572755 138,25.842429 137.32827,24.6874 136.50726,24.006024 134.68877,22.496815 126.25119,21.784551 125.45487,23.07303 125.13977,23.582863 124.06797,24 123.07308,24 c -0.99489,0 -4.90584,1.602842 -8.69099,3.561871 C 107.78592,30.975762 100.85969,33.828384 81.75,41.001645 76.9375,42.808127 73,44.671773 73,45.143079 73,45.614386 72.149853,46 71.110784,46 c -3.383927,0 -5.692101,3.342452 -8.513908,12.328936 -1.524786,4.855915 -2.936095,8.665179 -3.136243,8.46503 -0.200148,-0.200148 1.00418,-4.667486 2.676284,-9.927417 l 3.040191,-9.563512 8.907491,-4.125456 C 78.983719,40.90858 86.481369,37.882487 90.746045,36.45293 95.01072,35.023373 102.325,32.035366 107,29.812914 c 18.73524,-8.906562 24.36744,-10.345129 28.67906,-7.325156 4.54392,3.182689 20.72649,32.05605 24.38717,43.512242 0.43936,1.375 2.42395,6.775 4.4102,12 4.03459,10.613355 14.47426,44.72235 16.98677,55.5 0.89752,3.85 2.70582,11.5 4.01843,17 2.46718,10.33769 4.96814,21.59605 6.05137,27.24092 1.20612,6.28524 -8.07397,21.17246 -16.88653,27.08957 -5.43905,3.65199 -15.8578,8.2008 -19.92019,8.69711 -1.77445,0.21679 -8.17628,-0.97591 -14.22628,-2.65044 z m 5.22917,-1.48133 c -0.3323,-0.33229 -1.1948,-0.36781 -1.91667,-0.0789 -0.79773,0.31922 -0.56078,0.55618 0.60417,0.60416 1.05416,0.0434 1.64479,-0.19293 1.3125,-0.52522 z m 35.9375,-14.85184 c 0,-0.80081 -0.38234,-1.21971 -0.84965,-0.9309 -0.4673,0.28881 -0.59075,0.94401 -0.27431,1.45601 0.80862,1.30838 1.12396,1.16106 1.12396,-0.52511 z M 160,190.11663 c 0,-0.48585 -0.94528,-1.13056 -2.10062,-1.43269 -1.15533,-0.30213 -1.80696,-1.02446 -1.44806,-1.60518 0.39394,-0.6374 0.05,-0.82464 -0.86776,-0.47245 -2.23561,0.85788 -1.4554,2.79974 1.41644,3.52538 1.375,0.34742 2.6125,0.68492 2.75,0.75 0.1375,0.0651 0.25,-0.27921 0.25,-0.76506 z m 26.64421,-3.60481 c -0.0793,-1.36851 -0.674,-2.69183 -1.32153,-2.94073 -0.87856,-0.3377 -0.91718,0.29369 -0.15217,2.48819 1.25293,3.59416 1.66309,3.72011 1.4737,0.45254 z M 160,187.05902 c 0,-0.51754 -0.375,-1.17275 -0.83333,-1.45601 -0.45834,-0.28327 -0.83334,0.14017 -0.83334,0.94098 0,0.8008 0.375,1.45601 0.83334,1.45601 C 159.625,188 160,187.57656 160,187.05902 Z m 29.98469,-9.34845 c 0.008,-0.43418 -0.61246,-0.20918 -1.37973,0.5 -0.76727,0.70919 -1.16102,1.67497 -0.875,2.14619 0.51874,0.85463 2.22568,-1.14866 2.25473,-2.64619 z m -5.30158,-3.89807 c -0.31922,-0.79773 -0.55618,-0.56078 -0.60416,0.60417 -0.0434,1.05416 0.19292,1.64479 0.52522,1.3125 0.33229,-0.3323 0.36781,-1.1948 0.0789,-1.91667 z m -1.26656,-1.45563 c 0.9187,-2.39409 0.20261,-2.57794 -1.21288,-0.31139 -0.67134,1.07499 -0.81495,1.95452 -0.31913,1.95452 0.49581,0 1.18522,-0.73941 1.53201,-1.64313 z m 3.26656,-1.54437 c -0.31922,-0.79773 -0.55618,-0.56078 -0.60416,0.60417 -0.0434,1.05416 0.19292,1.64479 0.52522,1.3125 0.33229,-0.3323 0.36781,-1.1948 0.0789,-1.91667 z m -16.6668,-22.30242 c 0.46502,0.2874 1.17112,-0.004 1.5691,-0.64828 0.45192,-0.73122 0.29014,-0.90292 -0.4309,-0.45729 -1.29405,0.79976 -1.55681,-0.48358 -0.40451,-1.97567 0.4125,-0.53413 -0.0375,-0.12428 -1,0.91079 -0.9625,1.03507 -1.71447,2.39459 -1.67105,3.02115 0.0506,0.72996 0.26089,0.68793 0.58541,-0.11701 0.27855,-0.69093 0.88693,-1.02109 1.35195,-0.73369 z m 9.77145,-13.64679 c -0.24965,-0.74895 -0.70294,-0.29565 -1.05655,1.05655 -0.43497,1.66335 -0.30483,2.05378 0.43724,1.31171 0.5811,-0.5811 0.85979,-1.64682 0.61931,-2.36826 z m -6.21983,-23.09789 c 0.33477,-0.33477 -0.55606,-0.48082 -1.97963,-0.32455 -1.42356,0.15627 -2.5883,-0.179 -2.5883,-0.74503 0,-0.56603 -0.27006,-0.75909 -0.60014,-0.42902 -0.33007,0.33008 -0.34912,1.00628 -0.0423,1.50267 0.60665,0.98158 4.22759,0.97875 5.21041,-0.004 z M 170,104.88197 c 0,-0.55 -0.45,-0.72189 -1,-0.38197 -0.55,0.33992 -1,1.06803 -1,1.61803 0,0.55 0.45,0.72189 1,0.38197 0.55,-0.33992 1,-1.06803 1,-1.61803 z m -1.72062,-9.921633 c -0.29336,-1.121815 -0.75683,-1.816223 -1.02992,-1.543128 C 166.70846,93.958202 167.66405,97 168.375,97 c 0.24077,0 0.19774,-0.917848 -0.0956,-2.039663 z M 165.66228,86.75 c -0.27741,-0.6875 -0.50439,-0.125 -0.50439,1.25 0,1.375 0.22698,1.9375 0.50439,1.25 0.27741,-0.6875 0.27741,-1.8125 0,-2.5 z m -3.4935,-10.412894 c -0.82501,-1.474209 -1.00817,-1.41849 -1.61424,0.491052 -0.89986,2.835212 0.38314,5.034581 1.63353,2.800258 0.55146,-0.985393 0.54384,-2.285054 -0.0193,-3.29131 z M 153,210 c 0,-0.55 0.70156,-1 1.55902,-1 0.85746,0 1.2809,0.45 0.94098,1 -0.33992,0.55 -1.04148,1 -1.55902,1 C 153.42344,211 153,210.55 153,210 Z m 4.8125,-1.68311 c 0.72187,-0.28887 1.58437,-0.25335 1.91667,0.0789 0.33229,0.33229 -0.25834,0.56864 -1.3125,0.52522 -1.16495,-0.048 -1.4019,-0.28494 -0.60417,-0.60416 z M 84,187 c 0.825,-0.53316 1.95,-0.96937 2.5,-0.96937 0.55,0 0.325,0.43621 -0.5,0.96937 -0.825,0.53316 -1.95,0.96937 -2.5,0.96937 -0.55,0 -0.325,-0.43621 0.5,-0.96937 z m 63.75,-35.66228 c 0.6875,-0.27741 1.8125,-0.27741 2.5,0 0.6875,0.27741 0.125,0.50439 -1.25,0.50439 -1.375,0 -1.9375,-0.22698 -1.25,-0.50439 z M 144,70.940983 c 0,-0.582459 0.45,-0.780902 1,-0.440983 0.55,0.339919 1,0.816476 1,1.059017 C 146,71.801558 145.55,72 145,72 c -0.55,0 -1,-0.476558 -1,-1.059017 z m 11.07895,-4.524316 c 0.048,-1.164943 0.28494,-1.4019 0.60416,-0.604167 0.28887,0.721875 0.25335,1.584375 -0.0789,1.916667 -0.3323,0.332291 -0.56864,-0.258334 -0.52522,-1.3125 z m -2.57406,-4.408747 c -0.33722,-0.545644 -0.1805,-1.765156 0.34828,-2.710027 0.78893,-1.409753 0.93319,-1.231904 0.80412,0.991374 -0.17461,3.007718 -0.26885,3.148259 -1.1524,1.718653 z"
       id="path3717"
       inkscape:connector-curvature="0" />
  </g>
  <path
     style="fill:#ffffff;fill-opacity:1;stroke-width:0.02106714"
     d="M 9.4904626,19.076839 C 8.9230833,18.954652 7.7627338,18.585066 7.155368,18.333083 6.9493743,18.247621 6.6261547,18.08776 6.5622548,18.039735 c -0.036083,-0.02712 -0.037577,-0.0356 -0.011746,-0.06673 0.077229,-0.09305 0.5264153,-0.280361 1.7279228,-0.720527 2.4904544,-0.912365 3.6484334,-1.392571 3.4947454,-1.449248 -0.01606,-0.0059 -0.550613,-0.138954 -1.187894,-0.295626 C 9.9480021,15.350937 9.2038054,15.165399 8.9315126,15.095303 7.2684122,14.667169 5.8662441,14.229395 5.8662441,14.138287 c 0,-0.01159 0.08133,-0.03176 0.1807342,-0.04484 0.3129983,-0.04117 0.3241817,-0.05449 0.1287042,-0.153334 l -0.1194281,-0.06039 0.080542,-0.02224 c 0.1552785,-0.04288 0.4135875,-0.283886 0.647919,-0.604531 0.088753,-0.121444 0.1385978,-0.220264 0.1803882,-0.357629 0.019933,-0.06552 0.051077,-0.07351 0.1967691,-0.05047 0.041949,0.0066 0.052175,-2.44e-4 0.050249,-0.0338 -0.00133,-0.02317 -0.00834,-0.05635 -0.015579,-0.07373 -0.022474,-0.05396 0.019318,-0.08841 0.1212118,-0.09989 0.05384,-0.0061 0.1021903,-0.01799 0.1074445,-0.02649 0.013349,-0.0216 -0.042267,-0.06839 -0.2119255,-0.178287 -0.080412,-0.05209 -0.1342521,-0.09491 -0.1196458,-0.09516 0.061765,-10e-4 1.476687,0.335732 3.7128603,0.883738 1.347993,0.330344 1.516834,0.374504 1.516834,0.396719 0,0.0076 -0.03265,0.06678 -0.07255,0.131429 -0.08978,0.145448 -0.149332,0.355624 -0.19079,0.67331 -0.05337,0.408932 -0.120839,0.602554 -0.296484,0.850803 -0.131428,0.185756 -0.122404,0.28776 0.03236,0.365824 0.135661,0.06843 0.357854,0.06612 0.527973,-0.0055 0.231107,-0.09727 0.521458,-0.141745 0.668367,-0.102375 0.05808,0.01556 0.05873,0.03869 0.0055,0.196653 -0.05745,0.170549 -0.08134,0.4194 -0.104234,1.085698 -0.01075,0.312847 -0.03018,0.604622 -0.04319,0.64839 -0.01301,0.04377 -0.05284,0.112818 -0.08851,0.153444 -0.03567,0.04063 -0.05997,0.07875 -0.054,0.08473 0.006,0.006 0.07418,-0.0038 0.15158,-0.02177 0.2119,-0.04914 0.22454,-0.04325 0.112744,0.05258 -0.115345,0.09887 -0.113492,0.12144 0.01736,0.211471 0.05075,0.03491 0.09227,0.07353 0.09227,0.08582 0,0.03151 -0.08657,0.0069 -0.276524,-0.07851 -0.234451,-0.10545 -0.233326,-0.105951 -0.257765,0.114977 -0.01524,0.137783 -0.04806,0.161061 -0.179575,0.127355 -0.05885,-0.01508 -0.113612,-0.02082 -0.121689,-0.01274 -0.0081,0.0081 0.0016,0.04892 0.02159,0.09076 0.01995,0.04184 0.03155,0.08081 0.02577,0.08659 -0.0058,0.0058 -0.09862,-0.01401 -0.206307,-0.04398 -0.375323,-0.104468 -1.027946,-0.125027 -1.027946,-0.03238 0,0.03749 0.138348,0.102641 0.221205,0.104175 0.04635,8.57e-4 0.103013,0.0089 0.125925,0.01783 0.03325,0.01299 0.01411,0.02536 -0.0948,0.06128 -0.165007,0.05442 -0.443857,0.114183 -0.459553,0.09849 -0.0062,-0.0062 0.02125,-0.0388 0.06107,-0.07237 0.09388,-0.07912 0.07069,-0.100226 -0.121324,-0.11039 -0.08338,-0.0044 -0.159225,-0.0157 -0.168537,-0.02509 -0.0093,-0.0094 0.0091,-0.0379 0.041,-0.06337 0.06759,-0.05402 0.07315,-0.08776 0.01923,-0.116622 -0.03946,-0.02112 -1.2418998,-0.299463 -1.6980647,-0.393074 -0.6716433,-0.137829 -1.149427,-0.150123 -1.149427,-0.02958 0,0.0212 0.035551,0.06888 0.079002,0.105971 0.043451,0.03709 0.063483,0.06219 0.044515,0.05578 -0.018968,-0.0064 -0.1066059,-0.02895 -0.1947507,-0.0501 -0.088145,-0.02114 -0.1599816,-0.04792 -0.1596372,-0.05951 3.445e-4,-0.01159 0.014175,-0.04477 0.030734,-0.07373 0.045694,-0.07993 0.038464,-0.105335 -0.02998,-0.105335 -0.078474,0 -0.1902644,0.107349 -0.1936508,0.185957 -0.00755,0.175349 0.034951,0.24164 0.208538,0.325242 0.083687,0.04031 0.1499299,0.08737 0.1621395,0.115194 0.028697,0.0654 0.2130623,0.157956 0.474434,0.238172 0.327006,0.100359 0.4842383,0.165618 0.5868426,0.243567 0.061256,0.04654 0.1242932,0.07369 0.1896043,0.08168 0.3142201,0.03843 0.3709196,0.05317 0.4919653,0.127885 0.068269,0.04214 0.1717949,0.0934 0.2300586,0.11392 0.074843,0.02636 0.095669,0.04124 0.070959,0.05073 -0.054066,0.02075 -0.1311775,0.01378 -0.3363316,-0.03041 z"
     id="path3731"
     inkscape:connector-curvature="0" />
  <path
     style="fill:#ffffff;fill-opacity:1;stroke-width:0.02106714"
     d="M 9.5424596,19.089091 C 9.0097212,18.981656 7.8497725,18.616072 7.2008647,18.351084 6.9651326,18.25482 6.6327335,18.092696 6.5617393,18.039358 c -0.040488,-0.03042 -0.040608,-0.03282 -0.00367,-0.07364 0.080062,-0.08847 0.5357147,-0.28224 1.4464882,-0.61514 2.0798585,-0.760215 3.4932535,-1.319353 3.7143315,-1.469386 0.06114,-0.04149 0.0731,-0.05846 0.0502,-0.07128 -0.01653,-0.0092 -0.166401,-0.0497 -0.333056,-0.0899 C 8.9841638,15.128613 7.4909976,14.729236 6.4960303,14.398709 5.9931219,14.231644 5.8325952,14.162497 5.8686982,14.128484 c 0.010237,-0.0096 0.1034466,-0.02858 0.2071321,-0.04208 0.2724766,-0.03547 0.284419,-0.05272 0.1011541,-0.14612 -0.099493,-0.05071 -0.1136082,-0.06414 -0.079002,-0.07518 0.2662127,-0.08492 0.7313302,-0.583756 0.842636,-0.903727 l 0.044965,-0.12926 0.1215966,0.0066 c 0.1313896,0.0072 0.1274464,0.01244 0.083624,-0.111961 -0.015342,-0.04355 0.03098,-0.07677 0.1266503,-0.09082 0.054361,-0.008 0.1003389,-0.024 0.102172,-0.03558 0.00183,-0.01159 -0.076221,-0.07558 -0.1734541,-0.142203 -0.097233,-0.06663 -0.1603942,-0.121136 -0.1403586,-0.121136 0.102927,0 5.1277724,1.221126 5.1936124,1.262139 0.02297,0.01431 0.01366,0.045 -0.04613,0.152109 -0.08952,0.160359 -0.147429,0.366225 -0.193573,0.688085 -0.05885,0.410511 -0.118031,0.582112 -0.280402,0.813107 -0.117484,0.167138 -0.132136,0.249858 -0.05797,0.327272 0.06703,0.06996 0.178391,0.106963 0.321928,0.106963 0.102792,0 0.162907,-0.01522 0.41698,-0.105548 0.142415,-0.05063 0.506215,-0.07956 0.557686,-0.04434 0.02686,0.01838 0.02716,0.03476 0.0023,0.12242 -0.07057,0.248369 -0.0872,0.386136 -0.106315,0.880688 -0.03443,0.89066 -0.04284,0.951264 -0.148819,1.071968 -0.03387,0.03857 -0.05671,0.07499 -0.05077,0.08093 0.0059,0.0059 0.06972,-0.0018 0.141723,-0.01729 0.212653,-0.04563 0.228404,-0.03983 0.125659,0.04632 -0.04924,0.04129 -0.08953,0.09164 -0.08953,0.111886 0,0.02025 0.04266,0.06745 0.0948,0.104897 0.05214,0.03745 0.0948,0.078 0.0948,0.09012 0,0.03081 -0.08302,0.0071 -0.289846,-0.08271 -0.203716,-0.08848 -0.214956,-0.08415 -0.238857,0.09198 -0.02256,0.166223 -0.04959,0.188782 -0.186771,0.155872 -0.05963,-0.01431 -0.114346,-0.02008 -0.121591,-0.01284 -0.0072,0.0072 0.0032,0.04741 0.02311,0.08925 0.01995,0.04184 0.032,0.08036 0.02676,0.0856 -0.0052,0.0052 -0.107555,-0.01491 -0.227375,-0.04478 -0.365677,-0.09114 -0.927327,-0.115364 -0.987711,-0.0426 -0.02815,0.03392 0.04551,0.08933 0.137117,0.103152 0.03516,0.0053 0.101833,0.0157 0.148162,0.02311 l 0.08424,0.01346 -0.05373,0.02815 c -0.09754,0.0511 -0.546619,0.152324 -0.546619,0.123203 0,-0.0084 0.03081,-0.04171 0.06847,-0.07408 0.0574,-0.04934 0.06336,-0.06231 0.03687,-0.08021 -0.01738,-0.01175 -0.08848,-0.02165 -0.158004,-0.022 -0.178359,-9.11e-4 -0.205273,-0.02301 -0.127225,-0.104478 0.0397,-0.04144 0.05439,-0.07159 0.04126,-0.08471 -0.03526,-0.03526 -1.5290942,-0.379253 -2.0207525,-0.465325 -0.3086757,-0.05404 -0.7647336,-0.06648 -0.818207,-0.02232 -0.050513,0.04171 -0.044364,0.06197 0.04399,0.144861 0.071143,0.06675 0.073763,0.07275 0.026334,0.06029 -0.028967,-0.0076 -0.1166251,-0.0302 -0.1947951,-0.05021 -0.07817,-0.02001 -0.1418254,-0.04586 -0.1414566,-0.05745 3.688e-4,-0.01159 0.014219,-0.04477 0.030778,-0.07373 0.044332,-0.07755 0.038219,-0.105335 -0.023174,-0.105335 -0.034203,0 -0.081676,0.0269 -0.1264028,0.07163 -0.060071,0.06007 -0.071628,0.08681 -0.071628,0.165696 0,0.121622 0.05251,0.188447 0.2109094,0.268407 0.067298,0.03397 0.1429749,0.09072 0.1681708,0.126103 0.060164,0.08449 0.1397219,0.122809 0.5043334,0.242894 0.3536268,0.116467 0.448343,0.156284 0.5485971,0.230618 0.084423,0.0626 0.1655028,0.08623 0.36266,0.105704 0.1127526,0.01114 0.185647,0.03676 0.364889,0.12825 0.1231939,0.06288 0.238102,0.114332 0.2553518,0.114332 0.01725,0 0.025504,0.0095 0.018343,0.02107 -0.017145,0.02774 -0.136102,0.02365 -0.3054736,-0.01051 z"
     id="path3733"
     inkscape:connector-curvature="0" />
  <path
     style="fill:#ffffff;fill-opacity:1;stroke-width:0.02106714"
     d="M 9.5424596,19.089091 C 9.0098095,18.981674 7.8497802,18.616075 7.2010838,18.351174 6.9364336,18.243101 6.5601631,18.057164 6.5399589,18.024473 6.4851565,17.9358 6.7965491,17.794593 8.141495,17.298225 c 2.54295,-0.938505 3.655446,-1.389405 3.628381,-1.4706 -0.004,-0.01214 -0.736767,-0.204038 -1.628266,-0.426436 C 8.0353724,14.875755 7.1888876,14.640911 6.3240616,14.342066 5.9540745,14.214216 5.8368793,14.158872 5.8692587,14.127291 c 0.00993,-0.0097 0.09689,-0.0283 0.193247,-0.04137 0.2801854,-0.038 0.2930473,-0.05245 0.1197454,-0.134501 -0.063728,-0.03017 -0.1158692,-0.05903 -0.1158692,-0.06412 0,-0.0051 0.05102,-0.03262 0.1133781,-0.06117 0.1386516,-0.06348 0.3931497,-0.300663 0.5570777,-0.519185 0.1068171,-0.14239 0.1532799,-0.227817 0.2335135,-0.429338 0.023093,-0.058 0.027171,-0.05939 0.1318194,-0.045 l 0.1079894,0.01485 -0.013656,-0.0854 c -0.015474,-0.09677 -0.00792,-0.104975 0.1161262,-0.126151 0.048512,-0.0083 0.091678,-0.02548 0.095924,-0.03822 0.00425,-0.01274 -0.068852,-0.07423 -0.1624407,-0.136636 -0.093589,-0.06241 -0.1564919,-0.116363 -0.1397852,-0.119892 0.035856,-0.0076 0.4667828,0.09195 1.9937212,0.460457 2.2132865,0.534149 3.1879565,0.778184 3.2146455,0.804872 0.0058,0.0058 -0.02683,0.08517 -0.07252,0.176371 -0.0905,0.18064 -0.127876,0.3218 -0.191718,0.724098 -0.04922,0.310156 -0.10297,0.479664 -0.20128,0.634756 -0.03944,0.06222 -0.09802,0.163321 -0.130171,0.224669 -0.05436,0.103722 -0.05626,0.115463 -0.02706,0.167482 0.04681,0.0834 0.153183,0.135475 0.30054,0.147132 0.111679,0.0088 0.164433,-10e-4 0.362442,-0.06789 0.23644,-0.07981 0.509333,-0.117067 0.632019,-0.08627 0.06453,0.01619 0.06466,0.04717 0.0011,0.265221 -0.03482,0.119519 -0.05974,0.431817 -0.09413,1.179759 -0.02099,0.456433 -0.0381,0.544157 -0.124273,0.637061 -0.02944,0.03174 -0.04734,0.06391 -0.03977,0.07148 0.0076,0.0076 0.06771,0.0029 0.133647,-0.01031 0.207338,-0.04164 0.220053,-0.03542 0.118116,0.05776 -0.04924,0.04501 -0.08953,0.09194 -0.08953,0.104287 0,0.01235 0.04266,0.05811 0.0948,0.101697 0.152693,0.127636 0.115594,0.148601 -0.100704,0.05691 -0.07207,-0.03055 -0.159975,-0.06782 -0.195346,-0.08281 -0.03537,-0.015 -0.07589,-0.02011 -0.09003,-0.01137 -0.01415,0.0087 -0.03478,0.07154 -0.04585,0.139555 -0.02761,0.169627 -0.0511,0.189305 -0.19034,0.159443 -0.06088,-0.01306 -0.114453,-0.01998 -0.119053,-0.01538 -0.0046,0.0046 0.008,0.0426 0.02792,0.08444 0.01995,0.04184 0.03025,0.08211 0.02288,0.08948 -0.0074,0.0074 -0.09202,-0.0065 -0.188113,-0.03091 -0.252342,-0.06401 -0.436803,-0.0864 -0.715468,-0.08688 -0.259662,-4.41e-4 -0.312464,0.0084 -0.312464,0.05222 0,0.03487 0.149395,0.09474 0.237431,0.09516 0.114885,5.46e-4 0.134762,0.03165 0.04341,0.06793 -0.120126,0.04771 -0.490724,0.12919 -0.508059,0.111702 -0.0083,-0.0084 0.01101,-0.03603 0.04288,-0.06149 0.103264,-0.08253 0.06792,-0.118229 -0.117592,-0.118779 -0.161103,-4.78e-4 -0.186013,-0.0245 -0.108879,-0.105013 0.05202,-0.05429 0.05724,-0.06845 0.03123,-0.08466 -0.07458,-0.04648 -1.7214057,-0.418656 -2.0947574,-0.473405 -0.4154401,-0.06092 -0.7700034,-0.04563 -0.7700034,0.0332 0,0.01177 0.035551,0.05514 0.079002,0.09638 0.088857,0.08433 0.1016641,0.08331 -0.1685371,0.01349 -0.078212,-0.02021 -0.1422031,-0.0446 -0.1422031,-0.05419 0,-0.0096 0.014608,-0.04569 0.032462,-0.08022 0.063083,-0.121988 -0.030149,-0.14276 -0.1468309,-0.03271 -0.1443777,0.136166 -0.086728,0.322508 0.1342947,0.434079 0.069678,0.03517 0.1425958,0.08823 0.1620399,0.117907 0.048966,0.07473 0.2141377,0.152042 0.6064443,0.283854 0.2013628,0.06766 0.3755135,0.140261 0.4356465,0.181625 0.1047414,0.07205 0.2014692,0.101708 0.4020924,0.123291 0.085762,0.0092 0.1845296,0.04546 0.3472731,0.127407 0.1250836,0.06298 0.239985,0.114514 0.2553366,0.114514 0.015352,0 0.022053,0.0095 0.014892,0.02107 -0.017145,0.02774 -0.136102,0.02365 -0.3054736,-0.01051 z"
     id="path3735"
     inkscape:connector-curvature="0" />
  <path
     style="fill:#ffffff;fill-opacity:1;stroke-width:0.02106714"
     d="M 9.4476575,19.069712 C 8.9222937,18.951652 7.8724677,18.61923 7.2882759,18.385953 6.8934653,18.2283 6.5403925,18.048032 6.5403925,18.004107 c 0,-0.09347 0.3216497,-0.2327 1.832841,-0.793349 2.2062965,-0.818532 3.2907165,-1.255251 3.3763825,-1.359742 0.02303,-0.02809 0.01432,-0.03586 -0.0632,-0.05641 -0.04945,-0.01311 -0.748784,-0.189362 -1.554075,-0.391673 C 8.1112485,14.89518 7.2603803,14.660419 6.4396237,14.384087 6.0495866,14.252769 5.8662441,14.174172 5.8662441,14.138287 c 0,-0.01159 0.094802,-0.03705 0.2106713,-0.05659 0.1158693,-0.01954 0.213601,-0.03613 0.2171815,-0.03687 0.024438,-0.005 -0.036217,-0.05248 -0.1238702,-0.0969 -0.057115,-0.02894 -0.1038448,-0.05609 -0.1038448,-0.06033 0,-0.0042 0.053152,-0.03371 0.1181158,-0.0655 0.1421457,-0.06955 0.4408318,-0.356934 0.5873244,-0.56511 0.055711,-0.07917 0.1271316,-0.207151 0.1587127,-0.284406 l 0.05742,-0.140463 0.1083353,0.0046 0.1083353,0.0046 -0.00558,-0.08784 c -0.006,-0.09446 8.43e-5,-0.09942 0.1629612,-0.133013 l 0.063201,-0.01304 -0.064381,-0.05621 c -0.035409,-0.03091 -0.1159912,-0.09168 -0.1790707,-0.135026 -0.071699,-0.04927 -0.1001744,-0.07889 -0.075966,-0.079 0.077247,-3.69e-4 1.8501272,0.420887 3.9850991,0.946904 0.985788,0.24288 1.232428,0.30886 1.232428,0.329692 0,0.0052 -0.03239,0.07369 -0.07198,0.152302 -0.09252,0.183716 -0.127795,0.309206 -0.181607,0.64603 -0.07304,0.457196 -0.110978,0.574151 -0.258322,0.796394 -0.122598,0.184918 -0.14841,0.257449 -0.115524,0.324614 0.07755,0.158387 0.359315,0.187383 0.690285,0.07104 0.205235,-0.07214 0.480595,-0.107531 0.601207,-0.07726 0.05288,0.01327 0.05648,0.02067 0.04487,0.09237 -0.0069,0.04287 -0.02724,0.130082 -0.0451,0.19381 -0.03064,0.109275 -0.04576,0.304552 -0.09383,1.21136 -0.02116,0.399248 -0.03962,0.488646 -0.121287,0.587259 -0.02759,0.03332 -0.04597,0.06478 -0.04083,0.06992 0.0051,0.0051 0.06415,-7.94e-4 0.131138,-0.01318 0.212484,-0.03928 0.219177,-0.03491 0.113182,0.0739 l -0.09392,0.09642 0.10024,0.08792 c 0.164782,0.144533 0.118552,0.15934 -0.142158,0.04553 -0.09258,-0.04041 -0.185243,-0.07348 -0.205926,-0.07348 -0.04227,0 -0.0787,0.07757 -0.0787,0.167575 0,0.03272 -0.01772,0.08139 -0.03939,0.108142 -0.0369,0.04557 -0.04588,0.04716 -0.142172,0.02512 -0.05653,-0.01294 -0.106984,-0.01932 -0.11212,-0.01418 -0.0051,0.0051 0.0028,0.04299 0.0177,0.08412 0.01487,0.04113 0.02233,0.07949 0.01658,0.08525 -0.0058,0.0058 -0.122758,-0.01535 -0.260007,-0.04689 -0.212959,-0.04895 -0.29945,-0.05766 -0.589967,-0.05944 -0.187234,-0.0011 -0.348397,0.0058 -0.358142,0.01553 -0.03084,0.03066 0.07504,0.09544 0.178062,0.108952 0.183743,0.0241 0.196299,0.04073 0.06714,0.08895 -0.136016,0.05077 -0.461104,0.119999 -0.47908,0.102022 -0.0069,-0.0069 0.01456,-0.04074 0.04763,-0.07526 0.03307,-0.03452 0.05335,-0.06955 0.04506,-0.07784 -0.0083,-0.0083 -0.0787,-0.01886 -0.156468,-0.0235 -0.171918,-0.01024 -0.196813,-0.0286 -0.13213,-0.09746 0.0268,-0.02853 0.04347,-0.0656 0.03703,-0.08238 -0.01298,-0.03382 -0.29385,-0.104565 -1.2681868,-0.319434 -0.7563931,-0.166807 -1.0175198,-0.205774 -1.3168937,-0.196515 -0.2885258,0.0089 -0.3139692,0.02726 -0.1999096,0.144066 0.045241,0.04633 0.074557,0.08424 0.065148,0.08424 -0.050093,0 -0.3706524,-0.09534 -0.3706524,-0.110241 0,-0.0096 0.013911,-0.05081 0.030912,-0.0915 0.038371,-0.09183 0.00649,-0.113622 -0.091856,-0.06277 -0.118349,0.0612 -0.1644331,0.224297 -0.09276,0.328288 0.047312,0.06865 0.081292,0.09541 0.2007257,0.158095 0.054829,0.02878 0.114241,0.07453 0.1320257,0.101674 0.047659,0.07274 0.1964827,0.145273 0.5204393,0.253663 0.2923832,0.09783 0.443371,0.162131 0.5961418,0.253891 0.055716,0.03347 0.1449438,0.05868 0.2633393,0.07442 0.1441603,0.01917 0.2289625,0.04719 0.4349885,0.143754 0.1407551,0.06597 0.251588,0.127057 0.2462957,0.135747 -0.017015,0.02794 -0.1805904,0.01345 -0.3968779,-0.03515 z"
     id="path3737"
     inkscape:connector-curvature="0" />
  <path
     style="fill:#ffffff;fill-opacity:1;stroke-width:0.02106714"
     d="M 9.4687247,19.076725 C 9.0158985,18.979278 7.8228025,18.602154 7.2826351,18.385728 6.9839006,18.266035 6.5623035,18.060627 6.5394394,18.023632 c -0.048129,-0.07787 0.282372,-0.236421 1.2279613,-0.589069 1.9630941,-0.732118 2.3266253,-0.869956 2.9021513,-1.100394 0.677306,-0.27119 1.048142,-0.436386 1.074178,-0.478513 0.0089,-0.0144 0.0051,-0.03305 -0.0085,-0.04145 -0.01359,-0.0084 -0.585989,-0.155519 -1.271994,-0.326931 C 8.2808503,14.941974 7.337459,14.684649 6.5087918,14.408651 6.0855275,14.267678 5.8674696,14.175088 5.8720604,14.138287 c 0.00231,-0.01854 0.056564,-0.03137 0.3581773,-0.08472 0.085818,-0.01518 0.072603,-0.03844 -0.060011,-0.105642 -0.057115,-0.02894 -0.1038448,-0.05636 -0.1038448,-0.06092 0,-0.0046 0.040291,-0.02787 0.089535,-0.05179 0.2510188,-0.12194 0.5769996,-0.475886 0.7367363,-0.799941 l 0.1075559,-0.218196 0.1039186,0.01378 0.1039186,0.01379 -0.014344,-0.0849 c -0.015725,-0.09307 -0.0076,-0.100423 0.1577742,-0.142755 l 0.073735,-0.01887 -0.1775352,-0.130536 C 7.1168037,12.371357 7.0825205,12.337052 7.11724,12.337052 c 0.1312958,0 5.148951,1.221643 5.19316,1.264373 0.01074,0.01038 -0.0174,0.09249 -0.06622,0.193193 -0.09633,0.198698 -0.108848,0.244933 -0.182944,0.675492 -0.0677,0.393397 -0.114071,0.530019 -0.255944,0.754088 -0.126112,0.199177 -0.143283,0.285757 -0.07101,0.358034 0.113256,0.113256 0.335755,0.120338 0.641707,0.02043 0.162171,-0.05296 0.260293,-0.07123 0.426217,-0.07938 0.261997,-0.01286 0.261463,-0.01351 0.198776,0.244148 -0.02919,0.120002 -0.05204,0.316299 -0.0666,0.572379 -0.06742,1.185646 -0.06226,1.145432 -0.164665,1.283189 l -0.05339,0.07183 0.0721,-0.01497 c 0.03966,-0.0082 0.119505,-0.02043 0.17744,-0.0271 l 0.105335,-0.01213 -0.0948,0.09909 -0.0948,0.09909 0.105034,0.09174 c 0.05777,0.05045 0.09746,0.09931 0.0882,0.108569 -0.0093,0.0093 -0.07548,-0.0054 -0.147169,-0.03265 -0.07168,-0.02721 -0.170332,-0.06477 -0.219217,-0.08345 -0.109205,-0.04173 -0.127745,-0.02712 -0.150827,0.118894 -0.02494,0.15777 -0.04871,0.17804 -0.188307,0.160599 -0.111126,-0.01389 -0.115058,-0.01271 -0.101858,0.03052 0.04437,0.145287 0.04589,0.135793 -0.01993,0.123989 -0.03363,-0.006 -0.151202,-0.03038 -0.261277,-0.05412 -0.350609,-0.0756 -0.922688,-0.08694 -0.90022,-0.01785 0.01195,0.03675 0.108426,0.07779 0.226878,0.09652 0.05797,0.0092 0.110595,0.02186 0.11695,0.02821 0.01887,0.01887 -0.20614,0.09522 -0.390948,0.132667 -0.09454,0.01916 -0.177704,0.02901 -0.184816,0.0219 -0.0071,-0.0071 0.01413,-0.04117 0.0472,-0.07569 0.03307,-0.03452 0.05405,-0.06884 0.04662,-0.07627 -0.0074,-0.0074 -0.08045,-0.0183 -0.162264,-0.02416 -0.08181,-0.0059 -0.153687,-0.01863 -0.15972,-0.02839 -0.006,-0.0098 0.01057,-0.04688 0.03689,-0.08248 0.04075,-0.05512 0.04324,-0.06761 0.01676,-0.08409 -0.06036,-0.03758 -1.4311922,-0.353323 -1.9166033,-0.441455 -0.2777533,-0.05043 -0.6623038,-0.07658 -0.8070039,-0.05488 -0.1195122,0.01792 -0.1294869,0.05931 -0.035901,0.148973 0.03464,0.03319 0.058727,0.0646 0.053526,0.0698 -0.0052,0.0052 -0.091076,-0.01307 -0.1908349,-0.04059 -0.1679386,-0.04634 -0.1804914,-0.05356 -0.1693955,-0.09746 0.038776,-0.153397 0.03877,-0.152743 0.00143,-0.152743 -0.020094,0 -0.074573,0.03804 -0.1210642,0.08453 -0.077661,0.07766 -0.083591,0.09152 -0.072983,0.170608 0.013166,0.09816 0.074025,0.173027 0.1882838,0.231621 0.043165,0.02214 0.1277432,0.084 0.187951,0.137471 0.1252693,0.111257 0.1393982,0.117848 0.5818273,0.27141 0.1802125,0.06255 0.3824018,0.147516 0.4493098,0.188814 0.073896,0.04561 0.169755,0.0835 0.2441921,0.09653 0.067398,0.01179 0.1652024,0.02989 0.2173436,0.04021 0.1097834,0.02173 0.5747598,0.240538 0.5544043,0.260893 -0.024228,0.02423 -0.1807843,0.01161 -0.3753336,-0.03026 z"
     id="path3739"
     inkscape:connector-curvature="0" />
  <path
     style="fill:#ffffff;fill-opacity:1;stroke-width:0.02106714"
     d="M 9.4775756,19.079563 C 9.0526655,18.98991 7.8318206,18.605847 7.2988095,18.394148 7.0190705,18.283043 6.5622318,18.060511 6.5399847,18.024514 c -0.022,-0.0356 0.051315,-0.103071 0.1858477,-0.17104 0.2028371,-0.102478 0.543147,-0.236053 1.657803,-0.650703 2.4625396,-0.91606 3.4332996,-1.313176 3.3684976,-1.377978 -0.0071,-0.0071 -0.703845,-0.187221 -1.548402,-0.400349 C 9.3591743,15.211316 8.4880494,14.988096 8.2678978,14.928399 6.7036743,14.504241 5.7637142,14.187097 5.8721595,14.120074 c 0.010172,-0.0063 0.084104,-0.02142 0.1642933,-0.03364 0.285302,-0.04346 0.2921535,-0.05033 0.1352648,-0.13572 -0.057935,-0.03153 -0.1053357,-0.06132 -0.1053357,-0.06619 0,-0.0049 0.045031,-0.03179 0.1000689,-0.05981 0.2673389,-0.136108 0.6118428,-0.527759 0.7655274,-0.870293 l 0.062185,-0.138598 0.1066406,0.01263 0.1066406,0.01263 -0.013835,-0.08189 c -0.015643,-0.09259 0.00357,-0.110914 0.1426536,-0.136027 0.043773,-0.0079 0.074145,-0.02318 0.067494,-0.03394 -0.00665,-0.01076 -0.083737,-0.06954 -0.1713007,-0.130605 -0.1013637,-0.07069 -0.1467748,-0.113543 -0.1249889,-0.117934 0.043159,-0.0087 0.2032172,0.02727 1.4869721,0.334181 2.1347915,0.510366 3.6853765,0.897165 3.7164105,0.927072 0.01134,0.01093 -0.0079,0.07344 -0.04736,0.153492 -0.102489,0.208186 -0.126498,0.291528 -0.194168,0.674022 -0.07724,0.436586 -0.116576,0.556063 -0.263086,0.79909 -0.06541,0.108494 -0.114927,0.215701 -0.114927,0.248802 0,0.0732 0.09825,0.160054 0.203377,0.179776 0.118497,0.02223 0.339115,-0.0061 0.523439,-0.06721 0.120608,-0.03999 0.229835,-0.05891 0.384083,-0.06655 0.256894,-0.01272 0.260523,-0.0092 0.209424,0.202503 -0.04739,0.196328 -0.07306,0.46221 -0.09893,1.024743 -0.02698,0.586398 -0.04746,0.732172 -0.117956,0.839352 -0.02928,0.04451 -0.05015,0.08398 -0.04639,0.08771 0.0038,0.0037 0.04951,-0.0015 0.101647,-0.01155 0.05214,-0.01008 0.122847,-0.01873 0.157123,-0.01924 l 0.06232,-9.18e-4 -0.09392,0.09586 -0.09392,0.09586 0.105336,0.09174 c 0.17124,0.149136 0.11423,0.148925 -0.269595,-9.97e-4 -0.115358,-0.04506 -0.131462,-0.03482 -0.152237,0.09675 -0.0064,0.04055 -0.02376,0.09744 -0.03858,0.126403 -0.02465,0.0482 -0.0373,0.05219 -0.14908,0.047 -0.105008,-0.0049 -0.120317,-9.06e-4 -0.109112,0.02829 0.0072,0.01868 0.01908,0.05806 0.02647,0.0875 0.01556,0.06199 0.03377,0.06276 -0.329624,-0.01398 -0.253152,-0.05346 -0.822172,-0.07242 -0.865745,-0.02885 -0.03338,0.03338 0.07401,0.08626 0.216945,0.106826 0.06137,0.0088 0.108926,0.02541 0.105673,0.03684 -0.01224,0.04301 -0.535026,0.182074 -0.566429,0.150671 -0.0078,-0.0078 0.0064,-0.03609 0.03154,-0.06287 0.02515,-0.02677 0.04573,-0.05867 0.04573,-0.0709 0,-0.02363 -0.113865,-0.04818 -0.225229,-0.04857 -0.08983,-3.1e-4 -0.102206,-0.02862 -0.04584,-0.104857 0.02578,-0.03487 0.04066,-0.0696 0.03307,-0.07719 C 10.665216,18.171819 9.476114,17.8937 8.8683112,17.77428 8.3513951,17.672718 7.8958849,17.659519 7.8630247,17.745151 c -0.00648,0.0169 0.019107,0.06158 0.058611,0.102341 0.082368,0.08498 0.068862,0.08731 -0.1532816,0.02643 -0.1561637,-0.0428 -0.1667051,-0.04923 -0.155271,-0.0948 0.042367,-0.168846 0.043047,-0.160072 -0.011164,-0.143894 -0.079133,0.02362 -0.1663334,0.121688 -0.1790615,0.201386 -0.015569,0.09749 0.053978,0.198391 0.1919583,0.27851 0.057935,0.03364 0.1385165,0.09252 0.1790707,0.130843 0.098218,0.09282 0.1839694,0.133328 0.5582792,0.263753 0.1738038,0.06056 0.3851466,0.147845 0.4696505,0.193966 0.1130574,0.06171 0.2020979,0.09204 0.3370742,0.114833 0.1363303,0.02302 0.2491442,0.06173 0.4393486,0.150761 0.1407551,0.06588 0.251588,0.126894 0.2462957,0.135585 -0.015921,0.02614 -0.1751821,0.01516 -0.3669598,-0.0253 z"
     id="path3741"
     inkscape:connector-curvature="0" />
  <path
     style="fill:#ffffff;fill-opacity:1;stroke-width:0.00390625"
     d="m 11.613643,18.547261 c -0.01551,-0.009 -0.004,-0.03471 0.03063,-0.06856 0.07165,-0.06995 0.199607,-0.09829 0.275036,-0.06091 0.01838,0.0091 0.02166,0.01239 0.02266,0.02276 0.0015,0.01581 -0.01756,0.03306 -0.0566,0.0511 -0.07742,0.03577 -0.246414,0.07036 -0.271726,0.05561 z"
     id="path3743"
     inkscape:connector-curvature="0" />
  <path
     style="fill:#ffffff;fill-opacity:1;stroke-width:0.00390625"
     d="m 11.611494,18.546793 c -0.01744,-0.01744 0.02231,-0.0698 0.07914,-0.104245 0.0453,-0.02745 0.125161,-0.04699 0.16945,-0.04146 0.02848,0.0036 0.05893,0.01295 0.07192,0.02219 0.02454,0.01746 0.0068,0.04371 -0.04582,0.06795 -0.08147,0.03751 -0.257196,0.07306 -0.274688,0.05557 z"
     id="path3745"
     inkscape:connector-curvature="0" />
  <path
     style="fill:#ffffff;fill-opacity:1;stroke-width:0.00390625"
     d="m 11.61169,18.547213 c -0.01908,-0.01996 0.02914,-0.07869 0.09222,-0.112309 0.07465,-0.03979 0.180155,-0.04511 0.228093,-0.01151 0.02313,0.01621 0.0081,0.04175 -0.03809,0.06472 -0.07509,0.03734 -0.265011,0.07711 -0.282226,0.0591 z"
     id="path3747"
     inkscape:connector-curvature="0" />
  <path
     style="fill:#ffffff;fill-opacity:1;stroke-width:0.00390625"
     d="m 11.61169,18.548894 c -0.0087,-0.0035 -0.0053,-0.02474 0.0068,-0.04223 0.02883,-0.04191 0.09266,-0.08249 0.154368,-0.09814 0.04015,-0.01019 0.102371,-0.0095 0.132395,0.0015 0.02805,0.01027 0.03753,0.01833 0.03753,0.0319 0,0.02785 -0.06431,0.06079 -0.171875,0.08805 -0.07116,0.01803 -0.140841,0.0263 -0.159179,0.0189 z"
     id="path3749"
     inkscape:connector-curvature="0" />
  <path
     style="fill:#ffffff;fill-opacity:1;stroke-width:0.00390625"
     d="m 11.61169,18.548894 c -0.0087,-0.0035 -0.0053,-0.02474 0.0068,-0.04223 0.02826,-0.04107 0.09188,-0.08206 0.152414,-0.0982 0.03454,-0.0092 0.100053,-0.0095 0.129268,-5.28e-4 0.0534,0.01635 0.05623,0.04439 0.0075,0.07381 -0.06119,0.03691 -0.25937,0.08189 -0.295898,0.06715 z"
     id="path3751"
     inkscape:connector-curvature="0" />
  <path
     style="fill:#ffffff;fill-opacity:1;stroke-width:0.00390625"
     d="m 11.609411,18.548876 c -0.0014,-0.0014 -0.0026,-0.0078 -0.0026,-0.01419 0,-0.03933 0.08695,-0.1064 0.164062,-0.126555 0.03537,-0.0092 0.104441,-0.0092 0.131615,1.53e-4 0.07834,0.02686 0.03929,0.07357 -0.09342,0.111762 -0.08374,0.02409 -0.189161,0.03932 -0.199651,0.02883 z"
     id="path3753"
     inkscape:connector-curvature="0" />
</svg>
