<?xml version="1.0" encoding="UTF-8" standalone="no"?>
<!-- Created with Inkscape (http://www.inkscape.org/) -->

<svg
   xmlns:dc="http://purl.org/dc/elements/1.1/"
   xmlns:cc="http://creativecommons.org/ns#"
   xmlns:rdf="http://www.w3.org/1999/02/22-rdf-syntax-ns#"
   xmlns:svg="http://www.w3.org/2000/svg"
   xmlns="http://www.w3.org/2000/svg"
   xmlns:sodipodi="http://sodipodi.sourceforge.net/DTD/sodipodi-0.dtd"
   xmlns:inkscape="http://www.inkscape.org/namespaces/inkscape"
   version="1.1"
   id="svg10"
   width="20"
   height="20"
   viewBox="0 0 20 20"
   sodipodi:docname="ciseaux.svg"
   inkscape:version="0.92.4 (5da689c313, 2019-01-14)">
  <metadata
     id="metadata16">
    <rdf:RDF>
      <cc:Work
         rdf:about="">
        <dc:format>image/svg+xml</dc:format>
        <dc:type
           rdf:resource="http://purl.org/dc/dcmitype/StillImage" />
        <dc:title></dc:title>
      </cc:Work>
    </rdf:RDF>
  </metadata>
  <defs
     id="defs14" />
  <sodipodi:namedview
     pagecolor="#ffffff"
     bordercolor="#666666"
     borderopacity="1"
     objecttolerance="10"
     gridtolerance="10"
     guidetolerance="10"
     inkscape:pageopacity="0"
     inkscape:pageshadow="2"
     inkscape:window-width="1920"
     inkscape:window-height="1001"
     id="namedview12"
     showgrid="false"
     inkscape:zoom="11.313709"
     inkscape:cx="-3.0009292"
     inkscape:cy="17.296669"
     inkscape:window-x="-9"
     inkscape:window-y="-9"
     inkscape:window-maximized="1"
     inkscape:current-layer="svg10" />
  <g
     id="g20"
     transform="matrix(0.40105822,0,0,0.40105822,-8.9317776,-12.513055)">
    <path
       style="fill:#cacbcb"
       d="m 29,81.948941 c 0,-0.578082 2.238698,-5.614384 4.974884,-11.191782 2.736186,-5.577398 4.808394,-10.307215 4.604905,-10.510703 -0.203488,-0.203488 -4.90901,1.907814 -10.456715,4.691783 C 17.49832,70.26999 15,70.949258 15,68.506272 c 0,-1.94756 5.885955,-6.153198 19.135689,-13.672853 13.477163,-7.648728 14.27932,-9.272434 14.332719,-29.011927 0.03121,-11.538114 0.0669,-11.715433 2.968683,-14.75 C 57.223072,5.0207464 67,8.0315652 67,15.864111 c 0,3.752087 -1.79066,7.534261 -6.468509,13.662577 -3.333351,4.366927 -7.260846,14.07729 -6.145058,15.193079 0.719278,0.719278 13.399124,-4.563774 14.247283,-5.936125 C 70.316295,36.061174 78.630495,32 82.521467,32 92.107815,32 94.379025,44.315907 85.698715,49.229011 84.265801,50.040049 78.972168,50.484025 70.5,50.503726 52.670269,50.545185 51.949879,50.950862 43.05154,65.960915 39.289177,72.307412 35.23077,78.7375 34.032859,80.25 31.865811,82.986147 29,83.953558 29,81.948941 Z m 52.445993,-36.56659 c 2.744888,-1.053313 3.760231,-4.03327 1.980596,-5.812905 -2.19558,-2.19558 -3.798432,-1.968885 -7.378521,1.043561 -2.455355,2.066045 -2.86443,2.903337 -1.95428,4 1.208806,1.456523 4.628834,1.814399 7.352205,0.769344 z M 59.258235,21.297542 c 1.468242,-2.513978 1.632322,-3.633522 0.768958,-5.246732 -1.34463,-2.512463 -3.22754,-2.620965 -5.220206,-0.30081 -2.314634,2.695038 -2.903779,5.200625 -1.735929,7.382773 1.459488,2.727079 3.954943,1.986881 6.187177,-1.835231 z"
       id="path32"
       inkscape:connector-curvature="0" />
    <path
       style="fill:#b5b5b5"
       d="m 29,81.948941 c 0,-0.578082 2.238698,-5.614384 4.974884,-11.191782 2.736186,-5.577398 4.808394,-10.307215 4.604905,-10.510703 -0.203488,-0.203488 -4.90901,1.907814 -10.456715,4.691783 C 17.49832,70.26999 15,70.949258 15,68.506272 c 0,-1.94756 5.885955,-6.153198 19.135689,-13.672853 13.477163,-7.648728 14.27932,-9.272434 14.332719,-29.011927 0.03121,-11.538114 0.0669,-11.715433 2.968683,-14.75 C 57.223072,5.0207464 67,8.0315652 67,15.864111 c 0,3.752087 -1.79066,7.534261 -6.468509,13.662577 -3.333351,4.366927 -7.260846,14.07729 -6.145058,15.193079 0.719278,0.719278 13.399124,-4.563774 14.247283,-5.936125 C 70.316295,36.061174 78.630495,32 82.521467,32 92.107815,32 94.379025,44.315907 85.698715,49.229011 84.265801,50.040049 78.972168,50.484025 70.5,50.503726 52.670269,50.545185 51.949879,50.950862 43.05154,65.960915 39.289177,72.307412 35.23077,78.7375 34.032859,80.25 31.865811,82.986147 29,83.953558 29,81.948941 Z M 41.845975,65.258539 c 4.328307,-7.26527 8.23078,-12.883097 8.672163,-12.48406 0.441382,0.399037 0.466578,0.143232 0.05599,-0.568455 -0.410587,-0.711687 -0.03273,-2.383354 0.839674,-3.714817 2.125187,-3.243445 2.12784,-6.913033 0.0044,-6.098196 C 50.548229,42.726855 49.472013,43 49.026621,43 c -0.445393,0 -1.089036,1.112545 -1.430318,2.472323 -0.341283,1.359777 -1.627567,3.450958 -2.858409,4.647067 -1.230841,1.19611 -1.642173,1.836475 -0.914069,1.423035 1.032253,-0.586147 1.096421,-0.343227 0.291346,1.102932 C 43.060908,54.53913 30.909749,79.685954 30.172361,81.5 c -0.223568,0.55 0.540864,0.09283 1.698738,-1.01594 1.157874,-1.108767 5.646568,-7.960252 9.974876,-15.225521 z M 46,51.5 c 0,-0.825 0.45,-1.5 1,-1.5 0.55,0 1,0.675 1,1.5 0,0.825 -0.45,1.5 -1,1.5 -0.55,0 -1,-0.675 -1,-1.5 z M 18,67.940983 c 0,-0.582459 0.375,-0.827254 0.833333,-0.543989 0.458334,0.283266 0.833334,-0.140176 0.833334,-0.940983 0,-1.84614 -0.0047,-1.844961 -2.166667,0.543989 -1.026428,1.13419 -1.309975,2 -0.654988,2 C 17.480256,69 18,68.523442 18,67.940983 Z M 81.445993,45.382351 c 2.744888,-1.053313 3.760231,-4.03327 1.980596,-5.812905 -2.19558,-2.19558 -3.798432,-1.968885 -7.378521,1.043561 -2.455355,2.066045 -2.86443,2.903337 -1.95428,4 1.208806,1.456523 4.628834,1.814399 7.352205,0.769344 z M 59.258235,21.297542 c 1.468242,-2.513978 1.632322,-3.633522 0.768958,-5.246732 -1.34463,-2.512463 -3.22754,-2.620965 -5.220206,-0.30081 -2.314634,2.695038 -2.903779,5.200625 -1.735929,7.382773 1.459488,2.727079 3.954943,1.986881 6.187177,-1.835231 z"
       id="path30"
       inkscape:connector-curvature="0" />
    <path
       style="fill:#f2963b"
       d="m 29,81.948941 c 0,-0.578082 2.238698,-5.614384 4.974884,-11.191782 2.736186,-5.577398 4.808394,-10.307215 4.604905,-10.510703 -0.203488,-0.203488 -4.90901,1.907814 -10.456715,4.691783 C 17.49832,70.26999 15,70.949258 15,68.506272 c 0,-1.94756 5.885955,-6.153198 19.135689,-13.672853 13.477163,-7.648728 14.27932,-9.272434 14.332719,-29.011927 0.03121,-11.538114 0.0669,-11.715433 2.968683,-14.75 C 57.223072,5.0207464 67,8.0315652 67,15.864111 c 0,3.752087 -1.79066,7.534261 -6.468509,13.662577 -3.333351,4.366927 -7.260846,14.07729 -6.145058,15.193079 0.719278,0.719278 13.399124,-4.563774 14.247283,-5.936125 C 70.316295,36.061174 78.630495,32 82.521467,32 92.107815,32 94.379025,44.315907 85.698715,49.229011 84.265801,50.040049 78.972168,50.484025 70.5,50.503726 52.670269,50.545185 51.949879,50.950862 43.05154,65.960915 39.289177,72.307412 35.23077,78.7375 34.032859,80.25 31.865811,82.986147 29,83.953558 29,81.948941 Z M 42.008134,65.055227 C 47.355766,56.018254 49.711641,52.947869 52.037049,51.984654 54.679405,50.890154 57,48.356359 57,46.565741 57,46.254584 56.048925,46 54.886501,46 c -1.753169,0 -2.042419,-0.484306 -1.696578,-2.84067 0.413464,-2.817111 0.39476,-2.82795 -2.255417,-1.306957 -1.469787,0.843541 -3.183945,2.948532 -3.80924,4.677756 -0.920066,2.544396 -3.194803,4.31197 -11.926797,9.26766 C 23.52511,62.4228 15.524286,67.857619 16.301104,68.634437 16.569027,68.90236 22.28353,66.366863 29,63 c 6.71647,-3.366863 12.363364,-5.969969 12.548654,-5.784679 0.18529,0.18529 -2.209605,5.500143 -5.321988,11.810785 -6.9444,14.080406 -6.961415,14.128308 -3.785333,10.657317 1.417498,-1.549118 5.722559,-8.131806 9.566801,-14.628196 z M 81.445993,45.382351 c 2.744888,-1.053313 3.760231,-4.03327 1.980596,-5.812905 -2.19558,-2.19558 -3.798432,-1.968885 -7.378521,1.043561 -2.455355,2.066045 -2.86443,2.903337 -1.95428,4 1.208806,1.456523 4.628834,1.814399 7.352205,0.769344 z M 59.258235,21.297542 c 1.468242,-2.513978 1.632322,-3.633522 0.768958,-5.246732 -1.34463,-2.512463 -3.22754,-2.620965 -5.220206,-0.30081 -2.314634,2.695038 -2.903779,5.200625 -1.735929,7.382773 1.459488,2.727079 3.954943,1.986881 6.187177,-1.835231 z"
       id="path28"
       inkscape:connector-curvature="0" />
    <path
       style="fill:#ee600e"
       d="m 29,81.948941 c 0,-0.578082 2.238698,-5.614384 4.974884,-11.191782 2.736186,-5.577398 4.808394,-10.307215 4.604905,-10.510703 -0.203488,-0.203488 -4.90901,1.907814 -10.456715,4.691783 C 17.49832,70.26999 15,70.949258 15,68.506272 c 0,-1.94756 5.885955,-6.153198 19.135689,-13.672853 13.477163,-7.648728 14.27932,-9.272434 14.332719,-29.011927 0.03121,-11.538114 0.0669,-11.715433 2.968683,-14.75 C 57.223072,5.0207464 67,8.0315652 67,15.864111 c 0,3.752087 -1.79066,7.534261 -6.468509,13.662577 -3.333351,4.366927 -7.260846,14.07729 -6.145058,15.193079 0.719278,0.719278 13.399124,-4.563774 14.247283,-5.936125 C 70.316295,36.061174 78.630495,32 82.521467,32 92.107815,32 94.379025,44.315907 85.698715,49.229011 84.265801,50.040049 78.972168,50.484025 70.5,50.503726 52.670269,50.545185 51.949879,50.950862 43.05154,65.960915 39.289177,72.307412 35.23077,78.7375 34.032859,80.25 31.865811,82.986147 29,83.953558 29,81.948941 Z M 42.008134,65.055227 c 5.252412,-8.87606 7.7233,-12.115556 9.94195,-13.034551 1.623831,-0.672613 3.65973,-2.302425 4.524221,-3.621804 C 57.996196,46.076172 57.962387,46 55.409554,46 c -2.340469,0 -2.588755,-0.325664 -2.21093,-2.899951 0.409092,-2.787321 0.339701,-2.843654 -1.786641,-1.450421 -1.77832,1.1652 -2.314442,1.194614 -2.733176,0.149951 -0.286502,-0.714768 -0.556439,-0.308253 -0.59986,0.903368 C 47.903166,47.607943 45.70377,49.835689 35.089935,55.859386 23.51349,62.429394 15.526583,67.859916 16.301104,68.634437 16.569027,68.90236 22.28353,66.366863 29,63 c 6.71647,-3.366863 12.363364,-5.969969 12.548654,-5.784679 0.18529,0.18529 -2.209605,5.500143 -5.321988,11.810785 -6.9444,14.080406 -6.961415,14.128308 -3.785333,10.657317 1.417498,-1.549118 5.722559,-8.131806 9.566801,-14.628196 z M 79.761659,49.31292 c -0.956087,-0.250293 -2.756087,-0.259374 -4,-0.02018 C 74.517747,49.531932 75.3,49.736717 77.5,49.747817 c 2.2,0.0111 3.217747,-0.184605 2.261659,-0.434897 z M 68.25,48.337719 c -0.6875,-0.277412 -1.8125,-0.277412 -2.5,0 -0.6875,0.277413 -0.125,0.504386 1.25,0.504386 1.375,0 1.9375,-0.226973 1.25,-0.504386 z m 10.479167,-0.941886 c -0.332292,-0.332291 -1.194792,-0.367818 -1.916667,-0.07895 -0.797733,0.319226 -0.560776,0.556183 0.604167,0.604167 1.054166,0.04342 1.644791,-0.192928 1.3125,-0.52522 z m 2.716826,-2.013482 c 2.744888,-1.053313 3.760231,-4.03327 1.980596,-5.812905 -2.19558,-2.19558 -3.798432,-1.968885 -7.378521,1.043561 -2.455355,2.066045 -2.86443,2.903337 -1.95428,4 1.208806,1.456523 4.628834,1.814399 7.352205,0.769344 z M 49.683114,24.8125 c -0.319226,-0.797733 -0.556183,-0.560776 -0.604167,0.604167 -0.04342,1.054166 0.192928,1.644791 0.52522,1.3125 0.332291,-0.332292 0.367818,-1.194792 0.07895,-1.916667 z m 9.575121,-3.514958 c 1.468242,-2.513978 1.632322,-3.633522 0.768958,-5.246732 -1.34463,-2.512463 -3.22754,-2.620965 -5.220206,-0.30081 -2.314634,2.695038 -2.903779,5.200625 -1.735929,7.382773 1.459488,2.727079 3.954943,1.986881 6.187177,-1.835231 z"
       id="path26"
       inkscape:connector-curvature="0" />
    <path
       style="fill:#e9181f"
       d="m 29,81.948941 c 0,-0.578082 2.238698,-5.614384 4.974884,-11.191782 2.736186,-5.577398 4.808394,-10.307215 4.604905,-10.510703 -0.203488,-0.203488 -4.90901,1.907814 -10.456715,4.691783 C 17.49832,70.26999 15,70.949258 15,68.506272 c 0,-1.94756 5.885955,-6.153198 19.135689,-13.672853 13.477163,-7.648728 14.27932,-9.272434 14.332719,-29.011927 0.03121,-11.538114 0.0669,-11.715433 2.968683,-14.75 C 57.223072,5.0207464 67,8.0315652 67,15.864111 c 0,3.752087 -1.79066,7.534261 -6.468509,13.662577 -3.333351,4.366927 -7.260846,14.07729 -6.145058,15.193079 0.719278,0.719278 13.399124,-4.563774 14.247283,-5.936125 C 70.316295,36.061174 78.630495,32 82.521467,32 92.107815,32 94.379025,44.315907 85.698715,49.229011 84.265801,50.040049 78.972168,50.484025 70.5,50.503726 52.670269,50.545185 51.949879,50.950862 43.05154,65.960915 39.289177,72.307412 35.23077,78.7375 34.032859,80.25 31.865811,82.986147 29,83.953558 29,81.948941 Z M 42.008134,65.055227 c 5.252412,-8.87606 7.7233,-12.115556 9.94195,-13.034551 1.623831,-0.672613 3.65973,-2.302425 4.524221,-3.621804 C 57.996196,46.076172 57.962387,46 55.409554,46 c -2.361013,0 -2.590511,-0.3137 -2.195998,-3.001692 0.432439,-2.946395 0.397138,-2.973245 -1.916227,-1.45747 -2.303076,1.509033 -2.345143,1.480587 -1.846042,-1.248307 C 49.780948,38.490066 49.577368,38.740893 48.877078,41 46.253432,49.463773 46.136298,49.590216 35.135689,55.833419 23.518394,62.426611 15.525612,67.858945 16.301104,68.634437 16.569027,68.90236 22.28353,66.366863 29,63 c 6.71647,-3.366863 12.363364,-5.969969 12.548654,-5.784679 0.18529,0.18529 -2.209605,5.500143 -5.321988,11.810785 -6.9444,14.080406 -6.961415,14.128308 -3.785333,10.657317 1.417498,-1.549118 5.722559,-8.131806 9.566801,-14.628196 z M 83.454338,48.583526 c 4.250703,-1.776058 6.822466,-5.578994 6.268153,-9.268891 L 89.299664,36.5 89.149832,39.603977 c -0.204125,4.228728 -4.049018,8.119858 -8.791202,8.896921 -6.464505,1.059286 -6.989887,1.26246 -3.576511,1.383101 1.805165,0.0638 4.807663,-0.521412 6.672219,-1.300473 z M 69.25,48.276604 c -1.7875,-0.221826 -4.7125,-0.221826 -6.5,0 -1.7875,0.221827 -0.325,0.403322 3.25,0.403322 3.575,0 5.0375,-0.181495 3.25,-0.403322 z m 9.479167,-0.880771 c -0.332292,-0.332291 -1.194792,-0.367818 -1.916667,-0.07895 -0.797733,0.319226 -0.560776,0.556183 0.604167,0.604167 1.054166,0.04342 1.644791,-0.192928 1.3125,-0.52522 z m 2.716826,-2.013482 c 2.744888,-1.053313 3.760231,-4.03327 1.980596,-5.812905 -2.19558,-2.19558 -3.798432,-1.968885 -7.378521,1.043561 -2.455355,2.066045 -2.86443,2.903337 -1.95428,4 1.208806,1.456523 4.628834,1.814399 7.352205,0.769344 z M 50.717581,30.26375 C 50.487727,28.743687 50.293522,29.75 50.286014,32.5 c -0.0075,2.75 0.180555,3.993687 0.417917,2.76375 0.237362,-1.229938 0.243505,-3.479938 0.01365,-5 z m 2.059948,-17.485723 c 1.137239,-1.137239 3.790029,-2.40078 5.895089,-2.8078682 L 62.5,9.2299981 58.937091,9.1149991 c -2.740855,-0.088466 -4.225831,0.5769426 -6.436116,2.8839839 -2.455287,2.562767 -2.908982,3.90822 -3.119155,9.25 L 49.135873,27.5 49.922847,21.172867 c 0.53408,-4.293906 1.451433,-6.991591 2.854682,-8.39484 z m 6.480706,8.519515 c 1.468242,-2.513978 1.632322,-3.633522 0.768958,-5.246732 -1.34463,-2.512463 -3.22754,-2.620965 -5.220206,-0.30081 -2.314634,2.695038 -2.903779,5.200625 -1.735929,7.382773 1.459488,2.727079 3.954943,1.986881 6.187177,-1.835231 z"
       id="path24"
       inkscape:connector-curvature="0" />
    <path
       style="fill:#000000"
       d="m 29,81.948941 c 0,-0.578082 2.238698,-5.614384 4.974884,-11.191782 2.736186,-5.577398 4.808394,-10.307215 4.604905,-10.510703 -0.203488,-0.203488 -4.90901,1.907814 -10.456715,4.691783 C 17.49832,70.26999 15,70.949258 15,68.506272 c 0,-1.94756 5.885955,-6.153198 19.135689,-13.672853 13.477163,-7.648728 14.27932,-9.272434 14.332719,-29.011927 0.03121,-11.538114 0.0669,-11.715433 2.968683,-14.75 C 57.223072,5.0207464 67,8.0315652 67,15.864111 c 0,3.752087 -1.79066,7.534261 -6.468509,13.662577 -3.333351,4.366927 -7.260846,14.07729 -6.145058,15.193079 0.719278,0.719278 13.399124,-4.563774 14.247283,-5.936125 C 70.316295,36.061174 78.630495,32 82.521467,32 92.107815,32 94.379025,44.315907 85.698715,49.229011 84.265801,50.040049 78.972168,50.484025 70.5,50.503726 52.670269,50.545185 51.949879,50.950862 43.05154,65.960915 39.289177,72.307412 35.23077,78.7375 34.032859,80.25 31.865811,82.986147 29,83.953558 29,81.948941 Z M 41.955402,65.144338 C 50.864614,50.088648 51.787134,49.541296 68.5,49.394851 c 16.040579,-0.140555 15.260164,-0.0012 18.576923,-3.317928 3.527924,-3.527924 3.804918,-7.509344 0.748763,-10.762472 -3.200948,-3.407252 -7.606688,-3.02533 -13.462672,1.167044 C 68.372509,40.770176 57.745805,46 55.021957,46 53.670301,46 53,45.340534 53,44.010727 c 0,-3.331707 3.765847,-12.135831 6.813419,-15.929004 6.435626,-8.010128 7.61378,-12.933636 4.012267,-16.767272 -3.178821,-3.3836999 -7.721822,-3.0791298 -11.388595,0.76351 -2.898831,3.037866 -2.933757,3.210468 -2.681155,13.25 0.238625,9.484002 -0.557558,15.426398 -2.920137,21.794755 -0.701226,1.890161 -3.9692,4.32316 -11.70011,8.710703 C 23.518394,62.426611 15.525612,67.858945 16.301104,68.634437 16.569027,68.90236 22.28353,66.366863 29,63 c 6.71647,-3.366863 12.363364,-5.969969 12.548654,-5.784679 0.18529,0.18529 -2.209605,5.500143 -5.321988,11.810785 -6.9444,14.080406 -6.961415,14.128308 -3.785333,10.657317 1.417498,-1.549118 5.698829,-8.091706 9.514069,-14.539085 z M 73.2,45.8 c -1.894829,-1.894829 -1.431832,-3.427139 1.876725,-6.211106 3.491568,-2.937961 7.044768,-3.324543 9.351846,-1.017465 C 86.535325,40.678182 86.407719,42.592281 84,45 c -2.263824,2.263824 -8.848428,2.751572 -10.8,0.8 z m 8.245993,-0.417649 c 2.744888,-1.053313 3.760231,-4.03327 1.980596,-5.812905 -2.19558,-2.19558 -3.798432,-1.968885 -7.378521,1.043561 -2.455355,2.066045 -2.86443,2.903337 -1.95428,4 1.208806,1.456523 4.628834,1.814399 7.352205,0.769344 z M 52.412816,24.507285 C 49.556895,20.148598 52.826774,13 57.676426,13 c 5.230473,0 5.204482,8.868726 -0.03675,12.539827 -2.809778,1.968045 -3.327859,1.8657 -5.22686,-1.032542 z m 6.845419,-3.209743 c 1.468242,-2.513978 1.632322,-3.633522 0.768958,-5.246732 -1.34463,-2.512463 -3.22754,-2.620965 -5.220206,-0.30081 -2.314634,2.695038 -2.903779,5.200625 -1.735929,7.382773 1.459488,2.727079 3.954943,1.986881 6.187177,-1.835231 z"
       id="path22"
       inkscape:connector-curvature="0" />
  </g>
  <path
     style="fill:#e9181f;fill-opacity:1;stroke-width:0.01990932"
     d="m 17.335976,6.9797113 c -0.02057,-0.03328 0.05883,-0.090599 0.178179,-0.1286423 0.154747,-0.049328 0.606622,-0.060745 0.767991,-0.019405 0.156154,0.040005 0.260337,0.088346 0.260337,0.1207972 0,0.03633 -0.199979,0.050075 -0.730493,0.050242 -0.329373,1.004e-4 -0.465814,-0.00643 -0.476014,-0.022998 z"
     id="path34"
     inkscape:connector-curvature="0" />
  <path
     style="fill:#e9181f;fill-opacity:1;stroke-width:0.01990932"
     d="m 16.372368,6.9825992 c -0.414046,-0.023499 -0.531529,-0.057758 -0.33375,-0.097332 0.175665,-0.035146 0.42508,-0.059724 0.821528,-0.080959 0.445454,-0.023859 0.985176,-0.023668 0.846145,2.994e-4 -0.04928,0.00849 -0.103032,0.019335 -0.119454,0.02409 -0.01642,0.00475 -0.05674,0.015784 -0.0896,0.024508 -0.105877,0.02812 -0.169229,0.06942 -0.169229,0.1103319 0,0.037772 -0.01377,0.039187 -0.353391,0.03624 -0.194365,-0.00167 -0.46538,-0.00939 -0.602256,-0.017181 z"
     id="path36"
     inkscape:connector-curvature="0" />
  <path
     style="fill:#e9181f;fill-opacity:1;stroke-width:0.01990932"
     d="m 18.516954,6.9189614 c -0.03241,-0.034656 -0.06753,-0.054594 -0.08462,-0.048035 -0.01607,0.00616 -0.02923,0.00158 -0.02923,-0.010205 0,-0.011775 -0.01344,-0.016258 -0.02987,-0.00996 -0.01642,0.00631 -0.02986,0.00341 -0.02986,-0.00643 0,-0.00985 -0.02015,-0.021783 -0.0448,-0.026528 -0.09102,-0.017532 0.0728,-0.014187 0.293663,0.006 0.380561,0.034779 0.57947,0.074081 0.545724,0.1078274 -0.02008,0.020076 -0.287282,0.050512 -0.426269,0.048556 -0.127716,-0.0018 -0.143997,-0.00695 -0.194758,-0.06122 z"
     id="path38"
     inkscape:connector-curvature="0" />
  <path
     style="fill:#e9181f;fill-opacity:1;stroke-width:0.01990932"
     d="m 12.826385,7.803805 c 0.140272,-0.097563 0.511472,-0.4397122 0.659159,-0.6075675 0.170135,-0.1933664 0.449867,-0.6095701 0.571557,-0.8503998 0.08324,-0.1647295 0.08901,-0.282329 0.01619,-0.3300401 -0.07265,-0.047601 -0.171461,-0.065591 -0.442664,-0.080593 l -0.24312,-0.013448 0.253075,-0.065314 c 1.268889,-0.3274719 3.950591,-1.6247787 6.01462,-2.9096474 0.340478,-0.2119496 0.566913,-0.3626243 1.540696,-1.0252161 0.901503,-0.6134105 1.752785,-0.99898486 2.503101,-1.13373955 0.326674,-0.0586702 0.808572,-0.0582854 1.08971,8.6804e-4 0.549024,0.11551946 0.977862,0.35677051 1.419127,0.79835731 0.24909,0.2492719 0.441229,0.4981994 0.582251,0.7543448 l 0.07482,0.1359108 -0.0296,0.5455835 c -0.0314,0.5788301 -0.05753,0.7768173 -0.140041,1.0615714 -0.365058,1.2597386 -1.521172,2.3472219 -2.913514,2.7405555 -0.116699,0.032965 -0.625032,0.131064 -1.129644,0.2179954 -0.504609,0.086933 -0.980569,0.1713302 -1.057688,0.1875533 -0.114576,0.024104 -0.512908,0.033177 -2.178426,0.04965 -2.124657,0.021016 -2.609745,0.029947 -3.372135,0.062069 -1.364966,0.057526 -2.286063,0.1874864 -3.023508,0.4266034 -0.242448,0.078619 -0.261829,0.082094 -0.19397,0.034902 z m 4.939634,-0.8018863 c -0.169727,-0.00759 -0.333232,-0.014903 -0.363345,-0.016344 -0.07287,-0.00347 -0.06916,-0.034258 0.0099,-0.08249 0.07632,-0.046534 0.05853,-0.052875 -0.02588,-0.00923 -0.0323,0.016706 -0.05874,0.043584 -0.05874,0.059728 0,0.016138 -0.009,0.029355 -0.01991,0.029355 -0.01094,0 -0.01991,0.00901 -0.01991,0.019909 0,0.012741 0.141969,0.018622 0.39321,0.016344 l 0.393209,-0.0036 z m -1.08008,-0.013577 c -0.04107,-0.00425 -0.108257,-0.00425 -0.149321,0 -0.04107,0.00425 -0.0075,0.00785 0.07466,0.00785 0.08212,0 0.115721,-0.00347 0.07465,-0.00785 z m 1.946136,-0.00541 c -0.0068,-0.010939 -0.02239,-0.019909 -0.03474,-0.019909 -0.01235,0 -0.04092,-0.017206 -0.06352,-0.038235 -0.09647,-0.089747 -0.243865,-0.1257892 -0.555535,-0.1358429 -0.191722,-0.00619 -0.302745,-0.00221 -0.316263,0.011299 -0.0145,0.014502 0.06921,0.020585 0.275522,0.020018 0.254036,-6.967e-4 0.314831,0.00543 0.425763,0.042921 0.134031,0.045295 0.188751,0.076999 0.168261,0.09749 -0.0066,0.00656 -0.0941,0.017245 -0.194597,0.023808 l -0.182712,0.011969 0.245064,0.00322 c 0.159093,0.00206 0.240748,-0.00373 0.23276,-0.016692 z m -2.384141,-0.013719 c -0.01916,-0.00502 -0.05053,-0.00502 -0.06969,0 -0.01916,0.00502 -0.0035,0.00914 0.03484,0.00914 0.03833,0 0.054,-0.00412 0.03484,-0.00914 z m -0.199508,-0.01821 c -0.0066,-0.00656 -0.02378,-0.00734 -0.03816,-0.00154 -0.01588,0.00631 -0.0112,0.011068 0.01197,0.011969 0.02099,8.635e-4 0.03275,-0.00386 0.02614,-0.010424 z m -0.07424,-0.016666 c 0,-0.00489 -0.009,-0.014311 -0.01991,-0.02108 -0.01094,-0.00677 -0.01991,-0.00283 -0.01991,0.00875 0,0.011583 0.009,0.02108 0.01991,0.02108 0.01094,0 0.01991,-0.00399 0.01991,-0.00875 z m 0.144342,-0.064133 c -0.01369,-0.00552 -0.03609,-0.00552 -0.04978,0 -0.01368,0.00552 -0.0024,0.010038 0.02489,0.010038 0.02737,0 0.03857,-0.00452 0.02489,-0.010038 z m 0.139745,-0.019783 c -0.01347,-0.00546 -0.04036,-0.00579 -0.05973,-7.386e-4 -0.01937,0.00504 -0.0084,0.00951 0.0245,0.00991 0.03286,4.062e-4 0.0487,-0.00372 0.03522,-0.00918 z m 0.198714,-0.020901 c -0.02463,-0.00475 -0.06495,-0.00475 -0.0896,0 -0.02463,0.00475 -0.0045,0.00862 0.0448,0.00862 0.04928,0 0.06943,-0.00389 0.0448,-0.00862 z m 1.154741,8.66e-4 c -0.01369,-0.00552 -0.03609,-0.00552 -0.04978,0 -0.01369,0.00552 -0.0024,0.010038 0.02489,0.010038 0.02737,0 0.03857,-0.00452 0.02489,-0.010038 z m -0.885609,-0.02095 c -0.02992,-0.00454 -0.08368,-0.00463 -0.119454,-2.03e-4 -0.03579,0.00443 -0.01133,0.00815 0.0544,0.00826 0.0657,1.194e-4 0.09498,-0.00351 0.06506,-0.00806 z m 0.408385,-0.020232 c -0.04621,-0.00417 -0.12684,-0.00422 -0.179184,-1.195e-4 -0.05234,0.00412 -0.01454,0.00753 0.08401,0.00759 0.09855,5.97e-5 0.141378,-0.00331 0.09517,-0.00748 z m 5.459531,-0.1352118 c 0.09512,-0.047034 0.109364,-0.095398 0.04753,-0.1612343 -0.143945,-0.1532227 -0.657657,-0.1323939 -0.898643,0.036436 -0.159579,0.1117977 0.02233,0.1752673 0.482801,0.1684512 0.241772,-0.00358 0.301627,-0.010669 0.368322,-0.043653 z M 22.922539,6.2968682 C 23.192366,6.2551472 23.581375,6.161528 23.808502,6.0836467 24.268877,5.9257861 24.552006,5.7503547 24.854852,5.435313 25.639687,4.6188713 25.733924,3.9412156 25.16408,3.2116636 24.839686,2.7963531 24.451743,2.5325496 23.987686,2.4117087 23.730448,2.3447237 23.333085,2.3365617 23.041994,2.3922837 22.303996,2.5335543 21.582726,2.9573057 20.74748,3.7403274 20.348487,4.1143745 20.081273,4.4862251 20.005402,4.772997 c -0.09261,0.3500336 0.04354,0.7152925 0.396456,1.0636644 0.261868,0.2584899 0.663424,0.4169823 1.240012,0.4894271 0.213692,0.026849 1.039935,0.00799 1.280667,-0.029224 z"
     id="path40"
     inkscape:connector-curvature="0" />
  <path
     style="fill:#e9181f;fill-opacity:1;stroke-width:1.28693855"
     id="path42"
     d="m 16.547257,6.839439 c 0.01132,-0.00165 0.02221,-0.00542 0.03347,-0.00763 0.0075,-0.0012 0.01515,-0.00143 0.02234,-0.00402 0.0028,-0.00103 0.0055,-0.00269 0.0082,-0.00394 0.01132,-0.00416 0.02279,-0.00784 0.03456,-0.010617 0.0121,-0.00273 0.02453,-0.0035 0.03692,-0.00386 0.0063,-0.00228 0.01322,-0.00205 0.01965,-0.00355 0.003,-6.974e-4 0.0058,-0.00202 0.0086,-0.00296 0.01094,-0.00254 0.02208,-0.00297 0.03323,-0.00331 0.01145,-2.79e-4 0.02279,-2.714e-4 0.03419,-2.697e-4 0.01017,9.4e-6 0.02037,2.05e-5 0.03056,2.62e-5 0.0112,5.52e-5 0.02247,6.19e-5 0.03372,4.49e-5 0.01055,-1.99e-5 0.02105,-3.02e-5 0.03158,-3.58e-5 0.01004,-4.2e-6 0.02013,-4.1e-6 0.0302,-4.2e-6 0.01004,1e-7 0.02009,3e-7 0.03014,4e-7 0.01004,0 0.0201,0 0.03017,0 0.01004,0 0.02012,0 0.03017,0 0.01004,0 0.02011,0 0.03017,0 0.01107,3.5e-6 0.02208,5.96e-5 0.03313,4.81e-5 0.01068,-1.86e-5 0.02144,-3.37e-5 0.03215,-4.17e-5 0.01042,-9.735e-4 0.02041,0.00104 0.03062,0.00278 0.01029,6.462e-4 0.02014,0.00301 0.0302,0.00495 0.0098,0.00175 0.01985,0.00207 0.0298,0.00228 0.01004,1.342e-4 0.02006,9.07e-5 0.03009,7.39e-5 0.01107,-1.78e-5 0.02208,3.32e-5 0.03313,1.75e-5 0.01068,-2.22e-5 0.02144,-3.72e-5 0.03216,-4.52e-5 0.01004,-6.2e-6 0.02018,-6.2e-6 0.03027,-6.4e-6 0.01004,0 0.02009,2e-7 0.03014,2e-7 0.01004,2e-7 0.0201,2e-7 0.03017,2e-7 0.01004,0 0.02012,0 0.03017,0 0.01145,9.15e-5 0.02283,4.91e-5 0.03423,3.03e-5 0.01042,-1.84e-5 0.02076,-2.47e-5 0.03113,-2.84e-5 0.01004,-2.6e-6 0.0201,-2.3e-6 0.03017,-2.2e-6 0.01004,1e-7 0.0201,1e-7 0.03014,3e-7 0.01107,3.4e-6 0.02208,5.95e-5 0.03313,4.81e-5 0.01068,-1.87e-5 0.02144,-3.37e-5 0.03215,-4.17e-5 0.0099,-0.00224 0.01994,-0.00363 0.03006,-0.0044 0.01132,-5.94e-4 0.02261,-5.792e-4 0.03392,-6.283e-4 0.0094,-1.539e-4 0.01836,-0.00306 0.02771,-0.00411 0.01017,-9.412e-4 0.02027,-8.738e-4 0.03041,-9.015e-4 0.0112,-2.81e-5 0.0223,-2.89e-5 0.03345,-2.98e-5 0.01017,10e-8 0.02037,9e-7 0.03056,1.4e-6 0.01004,4e-7 0.02009,4e-7 0.03014,4e-7 0.01004,0 0.0201,0 0.03015,0 0.01004,0 0.02012,0 0.03017,0 0.01004,0 0.02012,0 0.03017,0 0.01004,0 0.02012,0 0.03017,0 0.01145,9.15e-5 0.02283,4.91e-5 0.03423,3.04e-5 0.01042,-1.84e-5 0.02076,-2.47e-5 0.03113,-2.85e-5 0.01004,-2.6e-6 0.0201,-2.3e-6 0.03017,-2.2e-6 0.01004,2e-7 0.0201,2e-7 0.03014,3e-7 0.01004,0 0.02012,0 0.03017,0 0.01004,0 0.02012,0 0.03017,0 0.01145,-3.09e-4 0.02253,-9.91e-5 0.03376,0.00192 0.01043,0.00192 0.02093,0.00256 0.03147,0.00293 0.01042,-5.272e-4 0.02041,0.00228 0.03062,0.00369 0.0093,0.00183 0.01838,1.925e-4 0.02768,6.096e-4 0.0091,4.947e-4 0.01834,6.844e-4 0.0275,8.048e-4 0.0099,1.027e-4 0.01995,1.009e-4 0.02992,1.038e-4 0.01029,1.1e-5 0.02049,-3.67e-5 0.03073,3.25e-5 0.01132,0.00193 0.02275,0.00351 0.03424,0.00436 0.0097,8.741e-4 0.01893,0.00365 0.02863,0.00467 0.01055,9.189e-4 0.0212,9.749e-4 0.0318,0.00103 0.0093,-0.00121 0.01629,0.00495 0.02466,0.00766 0.01055,0.00347 0.02063,0.00793 0.03087,0.012097 0.0098,0.0042 0.02006,0.00735 0.02966,0.012033 0.01107,0.00407 0.02148,0.00965 0.03203,0.014953 0.01055,0.00384 0.02042,0.00928 0.03141,0.011634 0.01081,8.306e-4 0.02008,0.00593 0.0295,0.010759 0.01017,0.00342 0.01685,0.010913 0.0218,0.020099 0.0042,0.00952 0.0049,0.019922 0.0054,0.030179 5.79e-4,0.00952 2.96e-4,0.018776 -0.0037,0.027463 -0.0229,0.022303 -0.0523,0.042804 -0.08455,0.04687 -0.0099,8.905e-4 -0.01977,8.429e-4 -0.02965,7.709e-4 -0.01133,-5.8e-5 -0.02274,-6.44e-5 -0.03412,-6.83e-5 -0.01328,-1.158e-4 -0.02656,-1.274e-4 -0.03983,-1.209e-4 -0.017,5.032e-4 -0.03385,-0.00206 -0.05076,-0.00347 -0.01704,-0.0012 -0.03412,-0.00154 -0.05118,-0.00167 -0.01614,-1.261e-4 -0.03228,-5.53e-5 -0.04841,3.9e-6 -0.0062,9.52e-5 -0.01248,-5.02e-5 -0.01863,1.789e-4 -8.48e-4,3.09e-5 -0.0032,6.808e-4 -0.0026,1.711e-4 0.0621,-0.046574 0.03794,-0.042237 0.06867,-0.046742 0.01297,-0.00193 0.0261,-0.0018 0.03916,-0.00193 0.0032,1.16e-5 0.0064,2.741e-4 0.0095,3.48e-5 0.0079,-5.946e-4 0.01566,-0.00219 0.02352,-0.00296 0.01589,-0.00167 0.03176,-0.00296 0.04771,-0.00412 0.03637,-0.00245 0.07283,-0.00206 0.109261,-0.00232 0.0314,-3.41e-4 0.0628,-4.118e-4 0.0942,-5.173e-4 0.02169,7.039e-4 0.04319,-5.058e-4 0.06473,-0.00283 0.01511,-0.00154 0.03029,-0.00219 0.04548,-0.00257 0.03937,0.00541 -0.01934,0.027193 -0.05092,0.048132 -9.97e-4,6.602e-4 -0.0024,-4.967e-4 -0.0036,-3.204e-4 -0.0012,1.724e-4 -0.0022,8.931e-4 -0.0032,0.00129 -0.0013,3.797e-4 -0.0027,5.843e-4 -0.0039,0.00114 -0.0012,5.405e-4 -0.0022,0.00154 -0.0033,0.00206 -0.0064,0.00309 -0.01385,0.0036 -0.0206,0.00553 -0.01184,0.00257 -0.02362,0.00566 -0.03556,0.00785 -0.01458,0.0027 -0.02943,0.00232 -0.04419,0.00245 -0.01961,9.14e-5 -0.03921,1.48e-4 -0.05883,1.544e-4 -0.01583,5.02e-5 -0.03166,2.19e-5 -0.04749,8.24e-5 -0.0063,1.39e-4 -0.01248,-4.826e-4 -0.01857,9.845e-4 -0.0013,3.024e-4 -0.0026,6.242e-4 -0.0037,0.00129 -6.06e-4,3.706e-4 -0.0018,0.00206 -0.0013,0.00167 0.02108,-0.014143 0.04189,-0.028699 0.06284,-0.043048 0.01197,6.666e-4 0.02386,7.799e-4 0.03579,8.584e-4 0.01728,-0.00219 0.03484,-0.00232 0.05201,-0.00528 0.01274,-0.00489 0.02685,-0.00541 0.03894,-0.01184 -0.01371,0.00824 0.02836,-0.015032 0.01385,-0.00669 -0.130982,0.075196 -0.07109,0.045674 -0.05499,0.030333 0.0035,-0.00502 -0.0045,-0.010424 -0.0081,-0.012483 -0.01351,-0.00643 -0.02834,-0.010167 -0.04298,-0.013101 -0.01737,-0.00502 -0.03466,-0.010167 -0.05199,-0.015379 -0.01715,-0.00605 -0.03507,-0.00927 -0.05271,-0.0135 -0.01132,-0.00283 -0.02295,-0.00373 -0.03458,-0.00412 -0.02145,0.00605 -0.08046,0.043164 0.05396,-0.031584 9.1e-4,-5.054e-4 -0.0018,0.00115 -0.0024,0.00197 -0.0019,0.00248 -0.0014,0.00332 -0.0014,0.00628 0.0036,0.012252 0.0151,0.018677 0.0252,0.02507 0.01274,0.00721 0.02574,0.013448 0.04001,0.016923 0.01468,0.00399 0.0297,0.00605 0.04383,0.01184 0.01627,0.00682 0.03367,0.00991 0.05054,0.014645 0.01287,0.00219 0.02349,0.010167 0.03538,0.01489 0.0011,2.32e-5 0.0023,5.045e-4 0.0033,7.08e-5 7.28e-4,-3.127e-4 0.0019,-0.00245 0.0012,-0.00206 -0.02117,0.011711 -0.04204,0.023924 -0.06294,0.036086 -2.63e-4,1.518e-4 8.18e-4,2.818e-4 9.08e-4,-7.8e-6 4.06e-4,-0.00129 -7.41e-4,-0.00283 -0.0013,-0.00373 -0.0058,-0.00708 -0.01094,-0.014774 -0.01692,-0.021801 -0.0082,-0.00669 -0.01772,-0.011454 -0.02779,-0.014967 -0.01171,-0.0045 -0.02376,-0.00785 -0.03544,-0.012226 -0.01301,-0.0045 -0.02611,-0.00862 -0.03898,-0.013436 -0.01439,-0.00476 -0.0295,-0.00631 -0.04427,-0.00939 -0.01133,-0.00123 -0.02188,-0.0045 -0.03226,-0.00901 -0.0084,-0.00438 -0.0176,-0.00605 -0.02618,-0.00952 -0.0088,-0.00386 -0.01771,-0.00682 -0.02678,-0.00978 -0.0121,-0.00309 -0.02441,-0.00579 -0.03681,-0.0078 -0.01516,-0.00196 -0.03013,-0.00513 -0.04506,-0.00838 -0.01565,-0.00336 -0.03161,-0.00535 -0.04672,-0.010784 -0.01291,-0.00497 -0.0266,-0.0073 -0.04013,-0.00991 -0.01425,-0.00368 -0.02851,-0.00741 -0.04286,-0.010669 -0.01132,-0.00125 -0.02166,-0.00404 -0.03099,-0.010604 -0.0077,-0.00408 -0.01533,-0.00838 -0.02286,-0.012891 -0.0072,-0.00387 -0.01466,-0.00789 -0.02134,-0.012728 -0.0042,-0.00368 -0.01004,-0.00394 -0.01458,-0.00695 -0.0023,-0.00151 -0.0042,-0.00344 -0.0064,-0.00507 -0.0079,-0.00341 -0.01512,-0.00807 -0.02313,-0.011248 -0.01145,-0.00313 -0.02325,-0.00347 -0.03476,-0.00663 -0.01674,-0.00402 -0.03378,-0.007 -0.05082,-0.00951 -0.01498,-0.00381 -0.03022,-0.00605 -0.04561,-0.00726 -0.01548,-0.00314 -0.03122,-0.00436 -0.04696,-0.00519 -0.01384,-6.141e-4 -0.02767,-5.258e-4 -0.0415,-5.804e-4 -0.01171,8e-7 -0.02331,6.54e-5 -0.03495,9.91e-5 -0.01235,-2.81e-5 -0.02482,-8.53e-5 -0.03723,-5.41e-5 -0.0112,3.84e-5 -0.02235,6.45e-5 -0.03354,7.82e-5 -0.01004,10e-6 -0.02019,10e-6 -0.03029,1.02e-5 -0.02973,3.76e-4 -0.02732,0.00997 0.05783,-0.041264 0.0011,-6.659e-4 0.01399,0.00319 0.01564,0.0036 0.01327,0.00302 0.02691,0.00358 0.04046,0.00399 0.01574,-2.39e-5 0.03134,2.848e-4 0.04697,0.00203 0.01639,0.00207 0.03292,0.00265 0.04942,0.00301 0.01489,-1.194e-4 0.02962,-1.783e-4 0.04408,0.00372 0.0098,0.00399 0.02057,0.00394 0.03053,0.00696 0.0073,0.00167 0.01652,0.00775 0.01171,0.016116 -0.03728,0.023498 -0.05753,0.040613 -0.09585,0.044824 -0.01691,0.00152 -0.03389,0.00194 -0.05085,0.0021 -0.01912,-1.802e-4 -0.03825,-7.61e-5 -0.05737,-7.31e-5 -0.01389,3.85e-5 -0.02777,1.296e-4 -0.04167,1.799e-4 -0.02266,0.00692 -0.08706,0.051327 0.05666,-0.038644 0.0015,-9.513e-4 0.01068,0.00234 0.01223,0.00265 0.01387,0.00135 0.02753,0.00413 0.04135,0.00587 0.02031,0.00165 0.04055,0.00387 0.0609,0.00523 0.02365,7.058e-4 0.04715,0.00342 0.07076,0.00499 0.01609,-2.011e-4 0.03283,0.00354 0.04876,4.919e-4 9.78e-4,-4.539e-4 0.0039,-0.00196 0.003,-0.00136 -0.06117,0.03979 -0.04098,0.040889 -0.07751,0.040558 -0.01004,4.372e-4 -0.0203,-7.912e-4 -0.03021,0.00122 -0.01081,0.00233 -0.02189,0.00394 -0.03297,0.00282 -0.0121,-0.00175 -0.02425,-0.00273 -0.03643,-0.00329 -0.03136,-0.0012 -0.02314,0.00634 0.05668,-0.044204 8.34e-4,-5.281e-4 0.01664,1.941e-4 0.01838,1.987e-4 0.01894,-8.98e-4 0.03788,-0.00256 0.05687,-0.0034 0.02356,-8.841e-4 0.04715,-0.00114 0.07073,-0.00134 0.0081,-7.08e-5 0.0094,3.219e-4 0.01682,-0.00108 0.0015,-3.015e-4 0.0032,-4.957e-4 0.0048,-0.00127 6.63e-4,-3.597e-4 0.0018,-0.00234 0.0012,-0.00193 -0.06553,0.043758 -0.03759,0.045155 -0.06641,0.042994 -0.0091,1.717e-4 -0.01769,-0.00268 -0.0266,-0.00403 -0.01197,-0.00112 -0.02378,-0.00328 -0.03553,-0.00573 -0.0158,-0.00342 -0.03136,-0.00745 -0.04745,-0.00936 -0.01575,-0.00123 -0.03158,-0.00103 -0.04693,-0.00513 -0.01197,-0.00376 -0.02444,-0.00512 -0.03691,-0.00593 -0.01094,-5.629e-4 -0.02192,-4.473e-4 -0.03288,-5.027e-4 -0.01133,-6.9e-6 -0.02273,5.25e-5 -0.0341,8.32e-5 -0.0121,-0.00239 -0.02439,-0.00363 -0.0367,-0.0044 -0.01132,-6.057e-4 -0.0227,-6.343e-4 -0.03407,-6.495e-4 -0.0098,6.74e-5 -0.01952,-9.03e-5 -0.02929,1.18e-4 -0.02712,0.00128 -0.04186,0.022874 0.0607,-0.043881 6.17e-4,-4.014e-4 0.01292,1.48e-4 0.01418,1.54e-4 0.01612,1.279e-4 0.03225,2.474e-4 0.04838,3.117e-4 0.02464,5.77e-5 0.04929,2.062e-4 0.07393,2.474e-4 0.02845,1.276e-4 0.05684,0.00255 0.08527,0.00374 0.02141,7.324e-4 0.04283,9.917e-4 0.06426,0.00101 0.0067,9.535e-4 0.02654,0.00119 0.03035,0.00876 8.18e-4,0.00162 0.0011,0.00347 0.0017,0.00521 -0.06176,0.04036 -0.0471,0.039433 -0.09109,0.039428 -0.01497,-4.74e-5 -0.02995,-1.084e-4 -0.04491,-1.046e-4 -0.0157,-4.251e-4 -0.03125,-7.09e-5 -0.04685,0.00165 -0.02307,0.00188 -0.04626,0.00227 -0.0694,0.00283 -0.01625,4.649e-4 -0.03252,5.395e-4 -0.04879,6.084e-4 -0.01081,0.00215 -0.02181,0.0036 -0.03286,0.00444 -0.01029,6.426e-4 -0.02053,6.646e-4 -0.0308,6.933e-4 -0.0014,3.483e-4 -0.0028,4.613e-4 -0.0042,0.00104 -0.0023,0.00101 -0.004,0.00297 -0.0063,0.00412 -0.0045,0.00229 -0.0095,0.00242 -0.01434,0.0031 -0.01158,0.00144 -0.02319,0.00166 -0.0348,0.00179 -0.01145,1.03e-5 -0.02301,-4.23e-5 -0.03452,-4.54e-5 -0.01055,4e-7 -0.02104,5.1e-6 -0.03157,7.4e-6 -0.0091,-9.12e-5 -0.01785,-0.00295 -0.0269,-0.00403 -0.0057,1.03e-4 -0.01223,-0.00232 -0.01776,1.238e-4 -0.0011,4.937e-4 -0.0019,0.00143 -0.003,0.00214 -0.0013,5.573e-4 -0.0026,0.00111 -0.0037,0.00167 -0.0085,0.00313 -0.01582,0.00862 -0.02443,0.011737 -0.0015,4.104e-4 -0.0032,5.068e-4 -0.0048,0.00123 -0.0014,6.888e-4 -0.005,0.00367 -0.0036,0.00291 0.02,-0.011235 0.0397,-0.022985 0.05962,-0.034361 0.0012,-7.125e-4 -0.0024,0.00152 -0.0036,0.00237 -0.0051,0.00399 -0.0026,0.00208 -0.0077,0.00571 -0.0066,0.00638 -0.01344,0.012097 -0.02136,0.016786 -0.0085,0.00528 -0.01633,0.011776 -0.02315,0.019116 -0.0059,0.00954 -0.01248,0.018698 -0.01777,0.028598 -0.0049,0.011235 -0.01042,0.022176 -0.01526,0.033448 -0.0033,0.011325 -0.01145,0.019265 -0.01864,0.028094 -0.0066,0.00759 -0.0095,0.016576 -0.01094,0.026292 3.07e-4,0.00631 -0.0026,0.013873 -0.001,0.019613 -0.0039,-0.027064 5.77e-4,-0.00309 -0.06381,0.031478 -0.001,5.534e-4 0.0019,-0.00129 0.0028,-0.00219 0.0031,-0.00335 0.0058,-0.00759 0.0082,-0.011454 0.0072,-0.00965 0.01422,-0.018738 0.01909,-0.029857 0.0046,-0.012226 0.006,-0.025237 0.01132,-0.037283 0.005,-0.00785 0.008,-0.016421 0.01107,-0.025095 4.3e-4,-0.00193 4.16e-4,-0.00322 0.0012,5.444e-4 1.87e-4,9.6e-4 6.03e-4,0.00206 2.67e-4,0.00296 -2.54e-4,6.95e-4 -0.0024,0.00167 -0.0018,0.00129 0.05847,-0.032623 0.08243,-0.047568 0.05899,-0.033014 -0.0073,0.00609 -0.01555,0.010926 -0.02322,0.016573 -0.0112,0.00939 -0.02412,0.016563 -0.03575,0.02543 -0.0093,0.00862 -0.01975,0.015726 -0.02879,0.024529 -0.0073,0.00837 -0.01323,0.017489 -0.01746,0.027721 -0.0031,0.00669 -0.0053,0.00875 0.0024,0.01184 0.01055,0.00309 0.02153,5.096e-4 0.03154,-0.00335 0.01158,-0.00541 0.0227,-0.011454 0.03398,-0.017438 0.0018,-7.541e-4 0.0036,-0.00154 0.0053,-0.00232 0.0039,-0.00167 0.0079,-0.00283 0.01171,-0.0045 0.0018,-7.683e-4 0.0068,-0.0036 0.0051,-0.0027 -0.06221,0.035687 -0.07746,0.047089 -0.05566,0.031092 0.0057,-0.00695 0.01223,-0.012483 0.01955,-0.017657 0.0088,-0.00605 0.01261,-0.015443 0.01705,-0.024671 0.0031,-0.00824 0.0063,-0.016473 0.0088,-0.024902 1.5e-4,-0.00101 5.59e-4,-0.00206 4.48e-4,-0.00309 -6.4e-5,-6.01e-4 -0.01145,1.3e-6 -0.01261,3.616e-4 -0.0014,4.427e-4 -0.0028,0.00129 -0.0042,0.00193 -0.02089,0.014838 -0.05514,0.030809 0.05136,-0.028755 0.0015,-8.987e-4 -0.003,0.00219 -0.0044,0.00333 -0.0039,0.00305 -0.0045,0.00381 -0.0081,0.00713 -0.0086,0.00798 -0.01902,0.013294 -0.02767,0.021247 -0.0086,0.00772 -0.01493,0.017206 -0.02098,0.026884 -0.0033,0.00605 -0.01107,0.010295 -0.0121,0.017567 0.0024,-0.00399 0.0082,-0.00476 0.01274,-0.00682 -0.0059,0.00566 0.0206,-0.010939 0.01248,-0.00618 -0.01983,0.011454 -0.07952,0.045545 -0.05961,0.034194 0.07034,-0.040101 0.04251,-0.032804 0.07385,-0.040371 0.0018,-0.00103 0.0036,-0.00206 0.0053,-0.00309 0.01565,-0.00914 -0.0044,0.00219 0.01297,-0.00669 0.0022,-0.00112 0.0085,-0.00489 0.0063,-0.00373 -0.05818,0.033306 -0.07587,0.044322 -0.05145,0.029239 0.0112,-0.00631 0.02099,-0.014813 0.03125,-0.022573 0.01171,-0.00746 0.02063,-0.018056 0.03018,-0.027914 0.0071,-0.00734 0.01055,-0.016782 0.01362,-0.0263 0.0031,-0.0083 0.0059,-0.016483 0.0073,-0.025245 5.65e-4,-0.00851 -0.0037,-0.00942 -0.01055,-0.00628 -0.0058,0.00288 -0.01287,0.0025 -0.01852,0.00568 -0.0017,9.173e-4 -0.0062,0.0043 -0.0045,0.00338 0.01952,-0.010862 0.03879,-0.022159 0.0582,-0.033238 -0.0057,0.0038 -0.01081,0.00831 -0.01668,0.011763 -0.0231,0.013607 -0.04633,0.026988 -0.06955,0.040399 -0.0022,0.00126 -0.0089,0.00489 -0.0067,0.00363 0.01905,-0.010965 0.03815,-0.021834 0.05722,-0.032751 -0.02557,0.017002 -0.05319,0.030516 -0.07943,0.046501 -0.01905,0.011582 0.03863,-0.022292 0.05811,-0.033143 0.0035,-0.00196 -0.0066,0.00468 -0.0098,0.00707 -0.0077,0.00694 -0.01579,0.013388 -0.02361,0.020166 -0.0079,0.00807 -0.0161,0.01575 -0.02205,0.025327 -4.08e-4,4.195e-4 -0.0066,0.017721 -0.0022,0.011325 0.0028,-0.00142 0.0062,-7.233e-4 0.0091,-0.00154 0.0026,-6.615e-4 0.0044,-0.00219 0.0066,-0.00373 -0.01997,0.011454 -0.03993,0.022792 -0.05991,0.034181 0.0085,-0.00489 0.01611,-0.011068 0.02316,-0.017837 0.006,-0.00566 0.01197,-0.011582 0.01799,-0.017387 0.0053,-0.00579 0.0077,-0.013474 0.01223,-0.019909 0.04082,-0.041201 0.05599,-0.03811 0.09404,-0.047057 0.0058,-0.00184 0.0121,-0.00185 0.01799,-0.00322 0.0049,-0.00113 0.0086,-0.00302 0.01368,-0.00335 0.03736,0.015499 -0.05203,0.047923 -0.06015,0.050209 -0.0084,-0.0036 -0.0077,-0.012741 -0.0066,-0.020256 0.0013,-0.00915 0.0027,-0.018398 0.0022,-0.027654 -3.1e-4,-9.259e-4 -4.72e-4,-0.00192 -9.29e-4,-0.00278 -0.0014,-0.00265 -0.0042,0.00274 -0.0026,0.00184 0.08938,-0.047473 0.08379,-0.044746 0.06081,-0.03376 -0.005,0.0064 -0.0049,0.015295 -0.0053,0.023058 -8.3e-5,0.00901 0.005,0.016758 0.0097,0.024085 0.04473,0.076197 -0.06234,0.039496 -0.08073,0.032107 -0.0057,-0.00154 -0.01132,-0.00409 -0.0174,-0.00351 -0.0057,5.382e-4 -0.0093,0.00483 -0.0072,0.00373 0.02049,-0.011364 0.04071,-0.023191 0.06106,-0.034786 -0.0063,0.00591 -0.0058,0.015482 -0.006,0.023479 -0.0014,0.00952 0.0015,0.017401 0.0049,0.026067 0.0031,0.00914 0.0049,0.018673 0.0082,0.027721 0.0036,0.00939 0.0048,0.019471 0.0077,0.029123 0.0028,0.00914 0.0037,0.018571 0.0042,0.028029 8.54e-4,0.010038 -0.0046,0.017116 -0.0098,0.024954 -0.0121,0.01471 -0.05884,0.05687 -0.08325,0.037128 -0.0064,-0.00772 -0.01412,-0.014028 -0.02208,-0.020038 -0.0084,-0.00721 -0.01531,-0.015713 -0.01493,-0.027193 0.01107,-0.034336 0.05421,-0.043653 0.08594,-0.044348 0.0095,-0.00106 0.01849,0.00206 0.02776,0.0036 0.0077,0.00399 0.01632,0.0045 0.0244,0.00695 0.009,0.0018 0.01718,0.00592 0.02614,0.00785 0.0082,0.00193 0.01598,0.00476 0.02443,0.00592 0.0094,9.536e-4 0.01888,9.51e-4 0.02832,9.948e-4 0.01004,1.41e-5 0.02009,-1.93e-5 0.03013,-3.48e-5 0.01004,-1.41e-5 0.02013,-1.67e-5 0.03019,-1.93e-5 0.01004,-1.3e-6 0.02012,0 0.03017,0 0.01081,-2.83e-5 0.02158,5.28e-5 0.03237,5.41e-5 0.01068,-9.948e-4 0.02068,7.271e-4 0.03102,0.00283 0.0098,0.00142 0.01862,0.00605 0.02798,0.00888 0.0095,0.0027 0.0195,0.00309 0.02936,0.00335 0.01004,1.661e-4 0.02006,9.53e-5 0.03009,6.57e-5 0.0067,-5.933e-4 0.0135,7.168e-4 0.02011,-4.12e-5 0.003,-3.436e-4 0.0059,-0.00142 0.0089,-0.00193 0.01132,-0.00154 0.02238,-0.0045 0.03369,-0.00618 0.02776,-0.010424 0.0761,-0.040744 -0.04036,0.025867 9.88e-4,0.00154 0.0027,0.00373 0.0024,0.00553 -6.8e-5,6.628e-4 -0.01158,2.921e-4 -0.01287,2.78e-4 -0.01042,-2.06e-5 -0.02076,-2.58e-5 -0.03113,-2.96e-5 -0.01359,-6.7e-5 -0.02717,-5.54e-5 -0.04075,-5.2e-6 -0.01184,7.34e-5 -0.02361,7.98e-5 -0.03543,-5.1e-6 -0.01411,7.001e-4 -0.02799,-0.00193 -0.04198,-0.00335 -0.0121,-0.00114 -0.02416,-0.00142 -0.03625,-0.00154 -0.01017,-6.18e-5 -0.02037,-2.7e-5 -0.03055,-1.16e-5 -0.01004,1.42e-5 -0.02006,1.93e-5 -0.03009,2.19e-5 -0.0112,-4.543e-4 -0.02243,9.189e-4 -0.03345,-9.614e-4 -0.009,-0.00219 -0.01831,-0.00322 -0.0276,-0.00373 -0.0097,-2.19e-5 -0.01959,-0.00142 -0.02915,5.534e-4 -0.0033,6.705e-4 -0.01755,0.00386 -0.01996,3.114e-4 -0.0014,-0.00206 -0.0022,-0.00438 -0.0032,-0.00656 3.87e-4,-8.494e-4 5.2e-4,-0.00193 0.0012,-0.00257 6.23e-4,-6.615e-4 0.0017,-7.413e-4 0.0024,-0.00125 9.56e-4,-6.448e-4 0.0017,-0.00154 0.0027,-0.00219 0.02228,-0.013101 0.04448,-0.026331 0.06707,-0.038866 0.0014,-7.734e-4 0.0032,-4.594e-4 0.0046,-9.459e-4 0.0015,-4.774e-4 0.0028,-0.00129 0.0042,-0.00193 0.0093,-0.00438 0.01861,-0.00772 0.02875,-0.00939 0.0095,-1.789e-4 0.01831,-0.00373 0.02772,-0.00489 0.01274,-0.00122 0.02547,-0.00119 0.03821,-0.00129 0.0121,-1.429e-4 0.0241,-8.63e-5 0.03615,-5.92e-5 0.01132,4.182e-4 0.02278,-9.974e-4 0.03397,9.163e-4 0.01094,0.00232 0.02215,0.00322 0.03333,0.00373 0.01017,0.00257 0.02058,0.00399 0.03107,0.00476 0.0066,0.00167 0.0033,8.107e-4 0.0097,0.00245 0,0 -0.06121,0.042315 -0.06121,0.042315 v 0 c -0.0058,-0.00129 -0.0028,-7.503e-4 -0.0089,-0.00167 -0.01042,-0.00109 -0.02057,-0.00309 -0.03087,-0.00463 -0.01132,-8.056e-4 -0.0225,-0.00219 -0.03365,-0.00399 -0.01107,-5.882e-4 -0.02224,-1.635e-4 -0.03335,-3.385e-4 -0.01197,-1.3e-6 -0.02399,-1.16e-5 -0.03597,6.18e-5 -0.01261,1.853e-4 -0.02535,3.475e-4 -0.03785,0.00245 -0.0091,0.00193 -0.01822,0.00386 -0.0275,0.00515 -0.0097,0.00257 -0.01872,0.00669 -0.02802,0.010424 -0.02376,0.00849 -0.06076,0.034027 0.05188,-0.031646 9.26e-4,-5.392e-4 -0.0019,9.575e-4 -0.0027,0.00167 -7.36e-4,6.229e-4 -9.44e-4,0.00193 -0.0018,0.00219 -6.8e-4,2.806e-4 -0.0014,-4.028e-4 -0.0021,-6.036e-4 -0.0013,-0.00193 -0.0027,-0.00373 -0.0039,-0.00579 -2.06e-4,-3.964e-4 7.68e-4,4.12e-5 0.0033,-1.634e-4 0.0048,-3.732e-4 0.0094,-0.00167 0.01423,-0.00206 0.01004,-4.234e-4 0.02004,-9.4e-5 0.03004,5.495e-4 0.0094,8.288e-4 0.01852,0.00245 0.02775,0.00399 0.01094,6.692e-4 0.02197,1.055e-4 0.03295,2.355e-4 0.01004,-5.1e-6 0.02006,-1.41e-5 0.03009,-2.7e-5 0.01017,-6.4e-6 0.02039,-2.96e-5 0.03058,1.763e-4 0.0121,3.192e-4 0.02425,9.356e-4 0.0363,0.00232 0.01385,0.00154 0.02767,0.00335 0.04165,0.0027 0.01184,-8.37e-5 0.02363,-7.85e-5 0.03544,-9e-6 0.01362,4.11e-5 0.02723,4.11e-5 0.04083,-7.98e-5 0.01055,-5.28e-5 0.02099,-1.854e-4 0.03149,-4.38e-5 0.0088,2.136e-4 0.01817,-4.839e-4 0.01987,0.010553 -0.0235,0.013564 -0.05724,0.039084 -0.08866,0.045969 -0.01132,0.00206 -0.02248,0.00476 -0.03386,0.00643 -0.0098,0.00154 -0.01978,7.838e-4 -0.0297,9.652e-4 -0.01004,1.81e-5 -0.02019,8.11e-5 -0.03028,-3.358e-4 -0.0103,-5.907e-4 -0.02068,-0.00154 -0.03053,-0.00502 -0.009,-0.00322 -0.01797,-0.00682 -0.02757,-0.00811 -0.0099,-0.00193 -0.01983,-0.00206 -0.02993,-0.0018 -0.01081,1.3e-6 -0.02167,8.23e-5 -0.03251,5.4e-5 -0.01004,0 -0.02012,-1.3e-6 -0.03017,1.3e-6 -0.01004,3.9e-6 -0.02012,9e-6 -0.03018,2.7e-5 -0.01004,1.68e-5 -0.02013,5.79e-5 -0.03019,-2.44e-5 -0.0098,-1.364e-4 -0.01948,-2.677e-4 -0.0291,-0.0018 -0.0084,-0.00167 -0.01642,-0.00463 -0.02481,-0.00643 -0.0088,-0.00257 -0.01712,-0.00618 -0.0261,-0.00798 -0.0081,-0.0018 -0.01612,-0.00399 -0.02409,-0.00643 -0.0089,-0.00167 -0.01759,-0.00347 -0.02669,-0.00219 -0.0044,3.732e-4 -0.009,5.688e-4 -0.01308,0.00219 -0.0011,4.504e-4 -0.0042,0.00232 -0.0032,0.00167 0.06074,-0.036588 0.08342,-0.042083 0.05787,-0.035584 -0.0064,0.00618 0.0059,0.015971 0.01017,0.019613 0.0076,0.00605 0.01513,0.012355 0.02215,0.019111 0.0024,7.683e-4 0.0049,7.85e-4 0.0073,-1.351e-4 8.49e-4,-3.115e-4 0.0031,-0.0018 0.0023,-0.00129 -0.06572,0.038853 -0.08101,0.048144 -0.05787,0.034117 0.0051,-0.00528 2.86e-4,1.171e-4 0.0048,-0.00631 0.0032,-0.00463 0.0079,-0.00734 0.0076,-0.013835 -3.87e-4,-0.00888 -9.65e-4,-0.017863 -0.0035,-0.02646 -0.0027,-0.00952 -0.004,-0.019343 -0.0073,-0.02866 -0.0033,-0.00901 -0.0054,-0.018493 -0.0082,-0.027695 -0.0036,-0.00939 -0.0076,-0.018172 -0.006,-0.028621 8.8e-5,-0.00965 -2.8e-5,-0.01951 0.0033,-0.028669 0.05266,-0.031643 0.05198,-0.049572 0.09411,-0.035227 0.005,0.0018 0.01029,0.00336 0.01492,0.00611 0.0013,8.056e-4 0.005,0.00185 0.0039,0.00275 -0.06235,0.043935 -0.05464,0.062494 -0.06413,0.037806 -0.0049,-0.00888 -0.01081,-0.0176 -0.01145,-0.02801 2.59e-4,-0.00903 5.14e-4,-0.018173 0.003,-0.026928 0.0098,-0.029333 0.06535,-0.063544 0.07733,-0.029324 0.0012,0.00972 -2.27e-4,0.019533 -0.0013,0.029224 -1.39e-4,9.36e-4 -0.003,0.013053 -0.0011,0.00718 0.02484,-0.00919 -0.01314,0.00474 -0.06006,0.035483 -0.0018,0.00115 0.0036,0.00252 0.0045,0.00444 4.14e-4,9.608e-4 -0.0063,-0.00201 -0.0031,5.233e-4 -0.0103,0.0027 -0.02064,0.00438 -0.031,0.00656 -0.0057,0.00112 -0.01145,0.00206 -0.01678,0.00425 -0.0015,6.396e-4 -0.0062,0.00309 -0.0046,0.00219 0.05458,-0.032432 0.08006,-0.044836 0.05531,-0.032677 -0.0069,0.00447 -0.0086,0.012651 -0.01248,0.019576 -0.0053,0.00669 -0.0121,0.01184 -0.01775,0.018146 -0.0076,0.00631 -0.01389,0.014233 -0.02278,0.018918 -0.01374,0.00798 -0.05592,0.045866 -0.0866,0.040912 -0.0093,-0.00605 -0.0071,-0.014465 -0.004,-0.023808 0.005,-0.010939 0.01323,-0.018635 0.02099,-0.027605 0.0076,-0.00746 0.01646,-0.013037 0.02356,-0.020913 0.02449,-0.019227 0.04892,-0.029275 0.0781,-0.047771 0.01882,-0.01193 -0.0384,0.022597 -0.05772,0.033681 -0.0037,0.00211 0.0144,-0.00956 0.01068,-0.00695 0.02301,-0.013459 0.046,-0.026955 0.06902,-0.040376 0.0022,-0.00127 0.0088,-0.00498 0.0066,-0.00371 -0.01883,0.011042 -0.03759,0.022195 -0.05654,0.033011 -0.0075,0.00427 0.0069,-0.00468 0.01145,-0.0078 0.0017,-0.00119 0.0033,-0.00246 0.005,-0.00369 0.03153,-0.018767 0.05768,-0.042048 0.09335,-0.047686 0.0103,9.087e-4 0.0174,0.00713 0.01763,0.017958 -9.56e-4,0.00911 -0.0026,0.01809 -0.0069,0.026269 -0.0026,0.01036 -0.006,0.020932 -0.01248,0.029619 -0.01274,0.014146 0.0048,-0.00499 -0.0093,0.00939 -0.0066,0.00678 -0.01197,0.015035 -0.02044,0.019708 -0.01029,0.00772 -0.02015,0.01628 -0.03105,0.023306 -0.03306,0.019562 -0.0656,0.040603 -0.100664,0.056407 -0.0018,8.314e-4 -0.0071,0.00347 -0.0054,0.00245 0.0197,-0.011582 0.07943,-0.04539 0.05941,-0.034361 -0.02651,0.014594 -0.0519,0.034027 -0.08086,0.044464 -0.0079,0.00232 -0.01601,0.00541 -0.02024,-0.00412 -0.0023,-0.00952 0.003,-0.016885 0.01017,-0.022779 0.0069,-0.00939 0.01197,-0.020231 0.02048,-0.02848 0.0044,-0.00399 0.0081,-0.00862 0.01304,-0.011969 0.0032,-0.00219 0.0071,-0.0036 0.01029,-0.00579 0.0015,-0.00103 0.0027,-0.00245 0.0041,-0.0036 0.01418,-0.012097 -0.0063,0.00566 0.008,-0.00759 0.02292,-0.021183 0.05198,-0.036083 0.08096,-0.047375 0.01017,-0.00102 0.02485,4.891e-4 0.0245,0.013796 -0.0019,0.00907 -0.0059,0.017316 -0.0084,0.026223 -0.0044,0.00978 -0.008,0.020102 -0.01553,0.027914 -0.0072,0.00605 -0.01477,0.00862 -0.01991,0.016833 -0.02243,0.028917 -0.06148,0.037257 -0.09299,0.053305 -0.0112,0.00618 -0.02278,0.011711 -0.03473,0.016215 -0.01184,0.00296 -0.0243,0.0045 -0.0356,-0.0012 -0.0079,-0.00528 -0.01261,-0.012355 -0.0076,-0.021685 0.0024,-0.00463 0.0036,-0.00952 0.0062,-0.014028 0.0031,-0.00566 0.0031,-0.00463 0.0069,-0.010038 0.0014,-0.00193 0.0026,-0.00399 0.004,-0.00592 0.003,-0.00347 0.0062,-0.00785 0.0098,-0.010681 0.0015,-0.00123 0.0036,-0.0018 0.0051,-0.00309 0.0048,-0.00347 0.0085,-0.00837 0.01335,-0.011582 0.01081,-0.010038 0.02423,-0.016228 0.03552,-0.025675 0.0072,-0.00592 0.0148,-0.011325 0.02283,-0.016087 0.01947,-0.021772 0.004,-0.00502 0.0694,-0.040764 0.0039,-0.00214 0.0082,0.00414 0.0091,0.00687 2.33e-4,7.014e-4 -3.87e-4,0.00143 -5.81e-4,0.00214 -0.0022,0.00942 7.91e-4,-0.00219 -0.0027,0.00758 -0.0023,0.00655 -0.0037,0.013454 -0.0081,0.019128 -0.0072,0.011196 -0.008,0.024272 -0.01197,0.036742 -0.0042,0.011454 -0.0088,0.022251 -0.01817,0.030462 -0.0022,0.0045 -0.005,0.00798 -0.0076,0.012226 -7.37e-4,0.00123 -4.19e-4,0.00322 -0.0017,0.00399 -0.06615,0.039959 -0.04753,0.053833 -0.07051,0.034284 -0.0045,-0.00785 -7.63e-4,-0.016048 -8.83e-4,-0.024645 10e-4,-0.010682 0.003,-0.021157 0.0094,-0.03005 0.0023,-0.00283 0.0044,-0.00592 0.0067,-0.00862 0.0049,-0.00566 0.01094,-0.00965 0.01287,-0.017438 0.0044,-0.011711 0.01094,-0.022457 0.01513,-0.034258 0.0019,-0.00386 0.0036,-0.00785 0.0057,-0.011608 0.0036,-0.00619 0.0093,-0.010939 0.0112,-0.018096 0.0058,-0.00873 0.01409,-0.015026 0.02211,-0.021642 0.0077,-0.00463 0.01636,-0.00824 0.02165,-0.01594 0.0012,-0.00103 0.0024,-0.00207 0.0037,-0.0031 0.0014,-7.835e-4 0.0028,-0.00139 0.0041,-0.00236 0.0012,-9.5e-4 0.0019,-0.00252 0.0032,-0.00332 0.0306,-0.018408 0.0484,-0.032226 0.07646,-0.042771 0.0081,-0.00405 0.01591,-0.00883 0.02457,-0.01175 0.0086,-0.00338 0.0178,-0.00185 0.02682,-7.299e-4 0.0088,0.00139 0.0173,0.00384 0.02618,0.00327 0.01055,1.1e-5 0.02098,3.09e-5 0.03147,7.62e-5 0.01145,4.35e-5 0.02298,9.87e-5 0.03449,-9.31e-5 0.01132,-2.4e-4 0.02279,-5.889e-4 0.03397,-0.00279 0.0088,-0.0022 0.01638,-0.00772 0.02571,-0.00725 0.01017,-9.11e-5 0.0203,-2.225e-4 0.0304,-0.00116 0.01107,-0.00113 0.02193,-0.00333 0.033,-0.00373 0.01594,5.75e-5 0.0319,4.65e-5 0.04785,-1.14e-4 0.02324,-4.026e-4 0.04651,-0.00105 0.06961,-0.00371 0.01579,-0.00142 0.03158,-0.0013 0.04742,-0.00115 0.01502,4.93e-5 0.03005,9.56e-5 0.04507,-1.505e-4 0.04031,-0.0011 0.04679,-0.015921 -0.03732,0.034853 9.47e-4,0.00102 0.0019,0.00202 0.0028,0.00305 8.01e-4,8.83e-4 -0.0021,-0.00113 -0.0032,-0.00149 -0.0072,-0.00237 -0.01479,-0.00306 -0.02235,-0.00315 -0.02125,-2.443e-4 -0.04251,-5.194e-4 -0.06373,-0.00175 -0.02833,-0.00139 -0.05662,-0.00381 -0.08499,-0.00354 -0.02488,4.14e-5 -0.04974,1.898e-4 -0.07462,2.481e-4 -0.01641,6.51e-5 -0.03283,1.858e-4 -0.04924,3.118e-4 -0.0036,1.59e-5 -0.0067,2.13e-5 -0.0103,6.85e-5 -0.0014,1.89e-5 -0.0054,9.873e-4 -0.0042,7.71e-5 0.08256,-0.067998 0.03306,-0.045269 0.06011,-0.043904 0.0097,1.898e-4 0.01938,-2.4e-5 0.02907,1.076e-4 0.01132,1.151e-4 0.02278,3.33e-4 0.03413,0.00121 0.01223,0.00101 0.02436,0.00287 0.03659,0.00381 0.01133,3e-7 0.0227,1.7e-6 0.03405,-2.08e-5 0.01107,-2.6e-5 0.02214,9.65e-5 0.03316,0.00103 0.01274,0.00125 0.02524,0.00329 0.03749,0.00692 0.01524,0.00318 0.0308,0.00291 0.04623,0.00471 0.01609,0.00234 0.03168,0.00676 0.04767,0.00965 0.01197,0.00193 0.02401,0.00381 0.0361,0.0052 0.0089,0.00166 0.01776,0.00337 0.02682,0.00409 0.02757,0.00795 0.0071,8.173e-4 -0.05325,0.046603 -5.53e-4,4.193e-4 -0.0014,-2.565e-4 -0.0021,-2.405e-4 -0.004,9.14e-5 -0.0079,0.00113 -0.01184,6.271e-4 -0.0031,3.89e-5 -0.0063,-1.64e-5 -0.0094,-2.47e-5 -0.02342,6.19e-5 -0.04685,1.904e-4 -0.07024,0.00138 -0.01936,0.00109 -0.03863,0.00356 -0.05802,0.00381 -0.004,2.64e-5 -0.0093,3.4e-5 -0.01323,1.664e-4 -0.0018,6.15e-5 -0.0069,0.00148 -0.0055,2.774e-4 0.05337,-0.04498 0.03422,-0.045598 0.06379,-0.043145 0.0121,8.275e-4 0.02423,0.00224 0.03636,0.00322 0.01094,-2.366e-4 0.02159,-0.00223 0.03235,-0.00393 0.0103,-5.819e-4 0.02066,-4.805e-4 0.03096,-3.262e-4 0.04444,0.00247 -0.0022,0.020334 -0.04213,0.048351 -8.88e-4,6.225e-4 -0.0022,1.317e-4 -0.0032,1.976e-4 -0.01616,1.161e-4 -0.0323,-0.00116 -0.04841,-0.0023 -0.02353,-0.00192 -0.04705,-0.00393 -0.07063,-0.00504 -0.02073,-0.00152 -0.04147,-0.00313 -0.06217,-0.00493 -0.01396,-0.00212 -0.0279,-0.00435 -0.04188,-0.00628 -3.52e-4,-8.85e-5 -0.01726,-0.00416 -0.01529,-0.00579 0.04506,-0.037485 0.03748,-0.043654 0.06737,-0.044052 0.01369,6.14e-5 0.02739,1.762e-4 0.04108,2.537e-4 0.01916,5.31e-5 0.03834,2.631e-4 0.0575,-1.546e-4 0.01678,-2.691e-4 0.03363,-5.006e-4 0.05027,-0.00295 0.03158,-0.00618 0.08025,-0.03437 -0.03264,0.027201 8.05e-4,-1.06e-4 0.0017,-5.804e-4 0.0024,-3.181e-4 9.84e-4,3.362e-4 0.0015,0.00138 0.0024,0.00197 1.12e-4,7.81e-5 5.09e-4,1.088e-4 4.06e-4,2e-5 -0.0024,-0.00208 -0.0059,-0.00242 -0.0088,-0.00335 -0.01017,-0.00202 -0.02026,-0.00391 -0.03011,-0.00708 -0.01416,-0.00279 -0.02851,-0.00248 -0.04288,-0.00274 -0.01663,-5.89e-4 -0.03328,-0.00134 -0.04979,-0.00342 -0.01561,-0.00149 -0.03123,-0.00108 -0.0469,-0.00152 -0.0139,-7.141e-4 -0.02786,-0.00165 -0.0414,-0.00511 -0.004,-9.617e-4 -0.008,-0.00176 -0.01184,-0.00282 -0.0018,-4.687e-4 -0.0066,-4.314e-4 -0.0051,-0.00161 0.05388,-0.045568 0.03538,-0.04438 0.06467,-0.04367 0.01004,4e-7 0.02018,6e-7 0.03026,1.07e-5 0.01107,1.39e-5 0.02221,4.04e-5 0.03332,7.7e-5 0.01248,2.88e-5 0.02494,-3.1e-5 0.03741,-8.47e-5 0.01158,6.2e-6 0.0232,1.8e-5 0.03481,4.84e-5 0.0138,3.78e-5 0.02759,3.8e-4 0.04137,0.00118 0.01588,0.00103 0.03167,0.00281 0.04742,0.00519 0.01529,0.00172 0.03038,0.0045 0.04539,0.00793 0.01724,0.00278 0.03456,0.00557 0.05153,0.00974 0.01197,0.00239 0.0245,0.00263 0.03589,0.00743 0.0082,0.00382 0.01659,0.00781 0.02434,0.012586 0.0064,0.00485 0.01413,0.00709 0.02069,0.011788 0.0069,0.00439 0.01404,0.0084 0.02116,0.012406 0.0075,0.0047 0.01548,0.00834 0.02291,0.013071 0.009,0.00526 0.01902,0.0068 0.02919,0.0088 0.01414,0.00363 0.0283,0.00713 0.04249,0.010527 0.01378,0.00273 0.02763,0.00533 0.04071,0.010669 0.01511,0.00465 0.03078,0.00689 0.04623,0.010141 0.01483,0.00323 0.02978,0.00593 0.04481,0.00809 0.01274,0.00218 0.02544,0.00466 0.03782,0.00837 0.0093,0.00274 0.01803,0.00676 0.02716,0.00999 0.0089,0.00292 0.01775,0.00602 0.02633,0.00987 0.01004,0.00416 0.02049,0.00606 0.03109,0.00803 0.01497,0.0032 0.03031,0.00503 0.04476,0.010347 0.01301,0.00463 0.02615,0.00888 0.03921,0.013256 0.01184,0.00412 0.02372,0.00811 0.03553,0.012355 0.01094,0.0045 0.02144,0.00991 0.02997,0.018146 0.006,0.00746 0.01184,0.015173 0.01793,0.022586 0.01959,0.033293 -0.03736,0.062146 -0.06783,0.048157 -0.01107,-0.00566 -0.02194,-0.011582 -0.03416,-0.014349 -0.01708,-0.00463 -0.03445,-0.00849 -0.05096,-0.01507 -0.0143,-0.00463 -0.02901,-0.00746 -0.04351,-0.011325 -0.01458,-0.00438 -0.02826,-0.010939 -0.04131,-0.018764 -0.01197,-0.00785 -0.02404,-0.016305 -0.02902,-0.030333 -8.12e-4,-0.00412 -0.0017,-0.00669 -10e-4,-0.010939 2.31e-4,-0.00142 2.97e-4,-0.00335 0.0015,-0.00412 0.03111,-0.019711 0.04558,-0.040207 0.07559,-0.039649 0.01184,7.999e-4 0.02352,0.00243 0.03495,0.0056 0.01759,0.00448 0.03538,0.00817 0.05262,0.013962 0.0173,0.00502 0.03441,0.010707 0.05197,0.01476 0.01534,0.0036 0.03095,0.00746 0.0448,0.015263 0.0076,0.00553 0.01404,0.01184 0.01392,0.021981 -0.01042,0.031556 -0.05621,0.038068 -0.08525,0.052764 -0.01296,0.00438 -0.0265,0.00695 -0.03978,0.010038 -0.01748,0.00193 -0.03503,0.00335 -0.05257,0.00438 -0.01274,-7.7e-6 -0.02622,9.575e-4 -0.03858,-0.0027 0.05714,-0.04449 0.03879,-0.046253 0.08279,-0.045751 0.01573,7.46e-5 0.03144,7.08e-5 0.04717,1.634e-4 0.01952,4.77e-5 0.03906,1.905e-4 0.05858,-1.351e-4 0.01473,-3.938e-4 0.02955,-8.494e-4 0.04403,-0.00399 0.01184,-0.00257 0.02361,-0.00528 0.0353,-0.00837 0.0097,-0.00245 0.01867,-0.00618 0.02809,-0.00927 0.0013,-2.728e-4 0.0026,-3.654e-4 0.0037,-8.172e-4 9.28e-4,-3.461e-4 0.0033,-0.00219 0.0026,-0.00154 -0.06523,0.046935 -0.03597,0.043833 -0.06736,0.042482 -0.01494,3.667e-4 -0.02988,0.00112 -0.04476,0.0027 -0.02144,0.0018 -0.04289,0.00232 -0.06441,0.00167 -0.03095,-1.608e-4 -0.0619,-3.165e-4 -0.09286,-4.041e-4 -0.03657,2.394e-4 -0.07319,7.696e-4 -0.109699,0.00322 -0.02755,0.00219 -0.05491,0.00643 -0.08249,0.00772 -0.013,3.874e-4 -0.02612,6.409e-4 -0.03888,0.00347 -0.02723,0.00785 -0.0099,0.00347 0.05109,-0.042237 9.85e-4,-7.387e-4 0.0183,0.00119 0.02027,3.102e-4 0.0161,3.6e-5 0.0322,5.53e-5 0.0483,1.917e-4 0.0171,2.819e-4 0.03422,6.319e-4 0.05127,0.00219 0.01694,0.00142 0.03385,0.00335 0.05087,0.00257 0.01337,1.16e-5 0.02674,2.6e-6 0.04013,-6.82e-5 0.01132,4.38e-5 0.0227,1.313e-4 0.03405,5.28e-5 0.0097,-1.648e-4 0.0195,-9.66e-5 0.02902,-0.00206 0.0026,-7.323e-4 0.0099,-0.00399 0.0076,-0.0027 -0.110548,0.065068 -0.07422,0.040809 -0.05101,0.030166 0.0072,-0.00528 0.0064,-0.0148 0.0063,-0.022933 -2.37e-4,-0.00914 -3.7e-4,-0.018532 -0.0039,-0.027154 -0.0042,-0.00811 -0.01068,-0.01305 -0.01933,-0.016318 -0.009,-0.00463 -0.01847,-0.00785 -0.02857,-0.00939 -0.01107,-0.00335 -0.02143,-0.00862 -0.03208,-0.013011 -0.01055,-0.00513 -0.02105,-0.010373 -0.03199,-0.014681 -0.0098,-0.00409 -0.01981,-0.00759 -0.02953,-0.011827 -0.01017,-0.0043 -0.02053,-0.0082 -0.03105,-0.011634 -0.0076,-0.00318 -0.01427,-0.00691 -0.02296,-0.00571 -0.01081,-1.639e-4 -0.02157,-4.109e-4 -0.03226,-0.00171 -0.0095,-0.00133 -0.01882,-0.00405 -0.02847,-0.00448 -0.01132,-0.00115 -0.02247,-0.00331 -0.03382,-0.00386 -0.01029,7.16e-5 -0.02056,3.43e-5 -0.03085,3.93e-5 -0.01004,-1.12e-5 -0.02001,-2.23e-5 -0.03001,-1.722e-4 -0.0093,-1.65e-4 -0.01843,-4.876e-4 -0.02764,-7.399e-4 -0.0094,6.85e-5 -0.01878,3.95e-4 -0.02808,-0.00151 -0.01004,-0.00161 -0.01997,-0.00335 -0.03017,-0.00309 -0.01068,-6.24e-4 -0.02135,-0.00174 -0.0319,-0.00362 -0.01094,-0.00148 -0.02206,-9.674e-4 -0.03314,-9.399e-4 -0.01004,0 -0.02012,0 -0.03017,0 -0.01004,0 -0.02012,0 -0.03017,0 -0.01004,1e-7 -0.0201,1e-7 -0.03015,3e-7 -0.01004,1e-7 -0.0201,3e-7 -0.03015,-2.2e-6 -0.01029,-3.6e-6 -0.02071,-1.01e-5 -0.03105,-2.85e-5 -0.01145,-1.89e-5 -0.02288,-6.07e-5 -0.03432,3.04e-5 -0.01004,0 -0.02012,0 -0.03017,0 -0.01004,0 -0.02012,0 -0.03017,0 -0.01004,0 -0.02011,0 -0.03017,0 -0.01004,1e-7 -0.0201,3e-7 -0.03015,4e-7 -0.01004,1e-7 -0.02009,5e-7 -0.03014,-2.8e-6 -0.01017,-4.8e-6 -0.02035,-1.28e-5 -0.03053,-3.76e-5 -0.01107,-2.58e-5 -0.02221,-7.97e-5 -0.03332,2.86e-5 -0.01004,1.697e-4 -0.02013,3.845e-4 -0.03009,0.00181 -0.0093,0.00151 -0.01854,0.00386 -0.02808,0.00318 -0.0112,7.04e-5 -0.02246,1.238e-4 -0.03364,0.00124 -0.01017,0.00114 -0.02022,0.00338 -0.03046,0.00383 -0.01068,-7.9e-6 -0.02136,-2.3e-5 -0.03203,-4.17e-5 -0.01107,-1.15e-5 -0.02217,4.48e-5 -0.03325,4.82e-5 -0.01004,1e-7 -0.0201,1e-7 -0.03015,2e-7 -0.01004,2e-7 -0.0201,4e-7 -0.03015,-2.2e-6 -0.0103,-3.6e-6 -0.02071,-1e-5 -0.03105,-2.84e-5 -0.01145,-1.89e-5 -0.02288,-6.07e-5 -0.03432,3.04e-5 -0.01004,0 -0.02011,0 -0.03017,0 -0.01004,0 -0.0201,0 -0.03015,1e-7 -0.01004,0 -0.02009,3e-7 -0.03014,1e-7 -0.01004,-4e-7 -0.02017,-7e-7 -0.03024,-6.9e-6 -0.01068,-7.6e-6 -0.02136,-2.22e-5 -0.03203,-3.57e-5 -0.01107,-5e-6 -0.02217,6.25e-5 -0.03326,8.29e-5 -0.01004,6.4e-6 -0.02015,3.95e-5 -0.03023,-2.677e-4 -0.0103,-4.203e-4 -0.02048,-0.00114 -0.03051,-0.00329 -0.0099,-0.00206 -0.02,-0.00337 -0.03008,-0.00476 -0.0099,-0.00166 -0.01982,-0.0022 -0.0299,-0.00178 -0.01068,-8e-6 -0.02136,-2.3e-5 -0.03203,-4.17e-5 -0.01107,-1.16e-5 -0.02217,4.48e-5 -0.03325,4.82e-5 -0.01004,0 -0.02011,0 -0.03017,0 -0.01004,0 -0.02012,0 -0.03017,0 -0.01004,0 -0.0201,0 -0.03017,0 -0.01004,1e-7 -0.02009,2e-7 -0.03014,3e-7 -0.01004,-10e-8 -0.02013,2e-7 -0.03019,-3.9e-6 -0.01055,-5.3e-6 -0.02099,-1.52e-5 -0.03148,-3.54e-5 -0.01132,-1.81e-5 -0.02255,-1.1e-5 -0.03382,2.84e-5 -0.01017,-1.18e-5 -0.02035,-3.44e-5 -0.03051,-5.91e-5 -0.01132,-1.25e-5 -0.02259,-4.78e-5 -0.03386,4.286e-4 -0.01094,6.243e-4 -0.02192,0.00161 -0.03242,0.00498 -0.0095,0.00257 -0.01946,0.00391 -0.02925,0.00492 -0.01197,5.952e-4 -0.02402,0.00175 -0.03567,0.00489 -0.01171,0.00327 -0.02319,0.00716 -0.03439,0.011801 -0.01004,0.00382 -0.02069,0.00471 -0.0312,0.00669 -0.01145,0.00268 -0.02289,0.0064 -0.0348,0.00665 0,0 0.06037,-0.04386 0.06037,-0.04386 z"
     inkscape:connector-curvature="0" />
  <path
     style="fill:#e9181f;fill-opacity:1;stroke-width:1.28693855"
     id="path44"
     d="m 15.898508,6.9584588 c 0.03058,-0.021016 0.06233,-0.040732 0.09724,-0.05338 0.01055,-0.00719 0.02313,-0.00978 0.03404,-0.016116 0.02445,-0.012844 0.01671,-0.00884 -0.05397,0.031116 -0.0014,7.824e-4 0.0027,-0.0018 0.004,-0.00257 0.0035,-0.00232 0.0066,-0.00502 0.0099,-0.00746 0.02717,-0.018058 0.05327,-0.041595 0.0862,-0.044807 0.0075,-0.00394 0.01636,-0.00309 0.02404,-0.00614 0.0014,-3.661e-4 0.003,-5.615e-4 0.0044,-0.0011 0.0014,-5.181e-4 0.0026,-0.00136 0.0039,-0.00205 0.0014,-5.886e-4 0.0054,-0.00251 0.0041,-0.00176 -0.01884,0.0109 -0.07571,0.04298 -0.05682,0.032189 0.02251,-0.012844 0.04503,-0.025654 0.06754,-0.038481 0.0085,-0.00139 0.01642,-0.00426 0.02475,-0.00622 0.0094,-0.00111 0.0182,-0.00405 0.02749,-0.00551 0.0051,-0.00304 0.01132,-0.00324 0.01686,-0.00503 0.0026,-8.131e-4 0.0048,-0.00221 0.0073,-0.00317 0.0075,-0.00562 0.01718,-0.00538 0.02547,-0.00882 0.0099,-0.00296 0.02026,-0.00381 0.03054,-0.00436 0.0068,-8.661e-4 0.0138,4.283e-4 0.02058,-3.449e-4 4e-6,-3e-7 0.0082,-0.00203 0.0084,-0.00206 0.0089,-0.00207 0.01808,-0.00246 0.02719,-0.00275 0.0099,-2.335e-4 0.01992,-1.978e-4 0.02988,-1.884e-4 0.0098,2.252e-4 0.01907,-0.00268 0.02807,-0.00606 0.0089,-0.00297 0.01822,-0.00345 0.02748,-0.00382 0.0094,8.938e-4 0.01815,-0.00126 0.02727,-0.00311 0.0093,-0.0016 0.0186,-0.00181 0.02793,-0.00199 0.01004,-1.32e-4 0.02003,-9.57e-5 0.03002,-8.23e-5 0.0089,-2.82e-4 0.01741,-0.00308 0.02629,-0.00407 0.0079,-0.00364 0.01624,-0.00472 0.02471,-0.00542 0.01004,-4.272e-4 0.02021,-0.00128 0.03019,3.713e-4 0.01068,0.00431 0.02169,0.00674 0.03304,0.00813 0.0121,3.88e-5 0.02166,0.00176 0.03304,0.00578 0.01068,0.00375 0.02199,0.00452 0.03318,0.00508 0.01158,1.895e-4 0.02284,-1.083e-4 0.03417,0.00221 0.009,0.00198 0.01809,0.0025 0.02723,0.00283 0.01029,2.357e-4 0.02067,2.488e-4 0.031,2.7e-4 0.0112,-7.3e-6 0.02233,-4.74e-5 0.0335,-6.82e-5 0.01171,8.95e-5 0.02345,-7.3e-6 0.03517,4.82e-5 0.01287,6.08e-5 0.02571,3.38e-5 0.03858,-5.7e-6 0.01403,7.07e-5 0.02804,1.058e-4 0.04207,6.49e-5 0.01309,3.65e-5 0.02619,-4.02e-5 0.03928,-8.27e-5 0.0142,5.4e-5 0.02838,1.403e-4 0.04257,1.326e-4 0.01355,8.624e-4 0.02629,-0.0038 0.0393,-0.00668 0.01132,-0.00245 0.02295,-0.00314 0.03452,-0.00349 0.01017,0.00183 0.02041,0.00345 0.03074,0.00429 0.01145,9.859e-4 0.02275,0.00354 0.03423,0.00472 0.0089,0.00284 0.01782,0.00461 0.02705,0.00542 0.0097,6.501e-4 0.0193,6.246e-4 0.02896,6.401e-4 0.0035,-1.8e-6 0.0059,4.037e-4 0.0091,-0.00105 0.0012,-5.171e-4 0.0042,-0.00282 0.0031,-0.0022 -0.122259,0.068468 -0.07944,0.044251 -0.05871,0.033224 -0.0062,-0.00526 -0.01438,-0.00784 -0.02223,-0.00947 -0.01132,-0.00192 -0.02277,-0.00205 -0.03418,-0.00214 -0.01029,-1.58e-5 -0.02059,5.51e-5 -0.03089,8.93e-5 -0.01004,3.02e-5 -0.0201,3.49e-5 -0.03015,3.81e-5 -0.01081,3.06e-5 -0.02157,-5.11e-5 -0.03235,-5.32e-5 -0.01261,-5.1e-6 -0.02517,-4.78e-5 -0.03776,-4.91e-5 -0.01342,5.89e-5 -0.02686,-4.71e-5 -0.04028,-1.86e-5 -0.01197,2.57e-5 -0.02382,1.254e-4 -0.03574,6.66e-5 -2.83e-4,-6.309e-4 -0.0089,6.355e-4 -0.009,3.347e-4 -0.01822,-0.032949 0.03629,-0.045341 0.06799,-0.046763 0.01338,-0.00335 0.0269,-0.00611 0.04027,-0.00957 0.01584,-0.00474 0.03136,-0.00916 0.04786,-0.010823 0.02831,-1.345e-4 0.05651,-0.00288 0.08473,-0.0047 0.02764,-0.00113 0.05532,-0.00143 0.08299,-0.00183 0.01646,-1.559e-4 0.03293,-3.067e-4 0.04939,-3.852e-4 0.0019,-6.6e-6 0.0039,8e-7 0.0057,-1.98e-5 0.0014,-1.57e-5 0.0028,-4.66e-5 0.0044,-8.9e-5 0.0011,-3.15e-5 0.0041,-8.245e-4 0.0032,-2.093e-4 -0.06405,0.04477 -0.03786,0.044403 -0.0672,0.044043 -0.0036,0.00105 -0.0066,0.00197 -0.0095,0.00411 0,0 0.0585,-0.046323 0.0585,-0.046323 v 0 c 0.0037,-8.833e-4 0.0075,-0.00193 0.01145,-0.00165 0.02787,-3.622e-4 0.0051,-7.981e-4 -0.0541,0.044033 -6.79e-4,5.14e-4 -0.0017,-1.96e-4 -0.0026,-2.264e-4 -0.0014,-4.81e-5 -0.0027,-8.21e-5 -0.0041,-1.009e-4 -0.0019,-2.63e-5 -0.0037,-2.27e-5 -0.0057,-3.4e-5 -0.01613,-1.168e-4 -0.03226,-3.02e-4 -0.04839,-2.696e-4 -0.0275,-3e-7 -0.05503,2.223e-4 -0.08249,0.00196 -0.0284,0.0017 -0.05682,0.00338 -0.08518,0.00564 -0.01615,0.00257 -0.03161,0.00752 -0.04741,0.011608 -0.01368,0.00346 -0.02745,0.00652 -0.04122,0.00959 -0.0292,0.0092 0.01893,-0.00559 0.05726,-0.034984 0.01042,-0.00804 -0.01337,-0.00723 -0.0015,-0.00696 0.0015,3.67e-5 0.0031,4.61e-5 0.0048,6.92e-5 0.01184,-5.78e-5 0.02371,3.95e-5 0.03555,6.65e-5 0.01345,2.88e-5 0.0269,-7.76e-5 0.04033,-1.83e-5 0.01261,-1.3e-6 0.02526,-4.36e-5 0.03789,-4.81e-5 0.01081,-1.8e-6 0.02167,-8.17e-5 0.03249,-5.88e-5 0.01004,-7e-6 0.02009,-1.86e-5 0.03013,-5.13e-5 0.0103,-3.08e-5 0.0206,-9.99e-5 0.03091,8.81e-5 0.01171,3.26e-4 0.02359,8.51e-4 0.0351,0.00356 0.01017,0.00296 0.02085,0.00701 0.02704,0.016125 6.28e-4,0.00178 0.0017,0.00345 0.0019,0.00533 1.3e-4,0.00126 1.12e-4,0.00301 -9.6e-4,0.00369 -0.03872,0.024614 -0.04728,0.04071 -0.08046,0.040106 -0.0098,-7.51e-5 -0.0197,-1.343e-4 -0.0295,-0.00125 -0.0091,-0.00127 -0.0179,-0.00373 -0.0269,-0.00556 -0.01145,-0.00152 -0.0227,-0.00399 -0.03423,-0.00453 -0.01004,-0.00112 -0.02,-0.00332 -0.03012,-0.00349 -0.01132,5.944e-4 -0.0225,0.00171 -0.03347,0.00443 -0.01319,0.00317 -0.02636,0.00618 -0.04008,0.00516 -0.01431,-7.8e-6 -0.02862,7.92e-5 -0.04293,1.326e-4 -0.01301,-4.26e-5 -0.02603,-1.194e-4 -0.03905,-8.26e-5 -0.01408,-4.15e-5 -0.02817,-4.8e-6 -0.04225,6.46e-5 -0.01287,-4e-5 -0.02571,-6.68e-5 -0.03856,-5.6e-6 -0.01171,5.59e-5 -0.02355,-3.86e-5 -0.03533,6.26e-5 -0.0112,-5.8e-6 -0.02226,-1.74e-5 -0.0334,-1.2e-5 -0.01042,1.47e-5 -0.02094,9.9e-5 -0.03139,-4.276e-4 -0.0094,-5.739e-4 -0.01865,-0.00161 -0.02781,-0.0036 -0.01107,-0.0017 -0.02226,-8.26e-4 -0.03341,-0.00171 -0.01171,-8.812e-4 -0.02337,-0.00245 -0.03441,-0.00658 -0.01055,-0.00333 -0.02131,-0.00342 -0.03221,-0.00474 -0.0112,-0.00188 -0.0219,-0.0052 -0.03288,-0.00786 -0.0098,-3.521e-4 -0.01966,-4.85e-5 -0.02942,0.00109 -0.0084,0.00129 -0.01633,0.004 -0.02463,0.00555 -0.0089,0.00148 -0.01768,0.00387 -0.02681,0.00317 -0.0099,0 -0.01995,-2.53e-5 -0.02991,2.965e-4 -0.0091,3.983e-4 -0.01833,0.00103 -0.0273,0.00308 -0.0091,0.00184 -0.01843,0.00189 -0.02778,0.00223 -0.009,7.632e-4 -0.01788,0.00212 -0.02633,0.00546 -0.0095,0.00296 -0.0195,0.00429 -0.02945,0.00403 -0.0099,1.66e-5 -0.01982,8.8e-6 -0.02971,5.104e-4 -0.009,5.866e-4 -0.01788,0.00165 -0.02664,0.00369 -0.0097,0.00145 -0.01955,6.255e-4 -0.0293,0.00156 -0.01004,9.153e-4 -0.02005,0.00243 -0.0296,0.00588 -0.0089,0.0021 -0.01712,0.00526 -0.02531,0.00914 -0.0081,0.0029 -0.01651,0.00488 -0.02477,0.00704 -0.0091,0.00193 -0.01817,0.00414 -0.02727,0.0061 -0.008,0.00241 -0.01638,0.00353 -0.02383,0.0074 0.02006,-0.011608 0.04011,-0.023234 0.06019,-0.03483 0.0012,-6.885e-4 -0.0023,0.00143 -0.0036,0.00211 -0.02252,0.012877 -0.04498,0.02588 -0.0676,0.038572 -0.004,0.00225 -0.0088,0.00275 -0.0131,0.00422 -0.0082,0.0014 -0.01629,0.00369 -0.02449,0.00543 -0.0033,7.618e-4 -0.0048,9.266e-4 -0.008,0.00219 -0.0012,4.877e-4 -0.0045,0.00232 -0.0035,0.00167 0.111989,-0.065721 0.0737,-0.046035 0.05426,-0.030768 -0.0042,0.00207 -0.0066,0.00454 -0.01017,0.00741 -0.02314,0.018433 -0.05072,0.031228 -0.07706,0.044846 -0.01158,0.00502 -0.0231,0.010038 -0.03446,0.015469 -0.0033,0.00129 -0.009,0.0036 -0.01223,0.00502 -0.0021,9.086e-4 -0.0079,0.00399 -0.0059,0.00283 0.10432,-0.062311 0.06777,-0.043138 0.04886,-0.027064 0,0 -0.06964,0.026871 -0.06964,0.026871 z"
     inkscape:connector-curvature="0" />
  <path
     style="fill:#e9181f;fill-opacity:1;stroke-width:1.28693855"
     id="path46"
     d="m 15.993032,6.8792887 c -0.0041,0.010386 -0.0051,0.021304 -0.0023,0.032119 0.0037,0.00746 0.01292,0.00914 0.02002,0.012355 0.01017,0.00322 0.01994,0.00746 0.02983,0.011325 0.0099,0.00296 0.01972,0.00643 0.02995,0.00837 0.0098,0.00154 0.01983,0.00167 0.02977,0.00167 0.0017,5.1e-6 0.0033,2.7e-5 0.005,1.54e-5 0.0013,-9e-6 0.0026,-3.47e-5 0.0039,-7.46e-5 9.66e-4,-3.09e-5 0.0037,-8.43e-4 0.0028,-2.896e-4 -0.06421,0.044798 -0.0378,0.04449 -0.06709,0.044078 -0.01145,6.357e-4 -0.02263,-0.00154 -0.03392,-0.00283 -0.01776,-4.762e-4 -0.03464,-0.00605 -0.05207,-0.00901 -0.02011,-0.00373 -0.04026,-0.00746 -0.0605,-0.010424 -0.01893,-0.00154 -0.03769,-0.0045 -0.05659,-0.00643 -0.05332,-0.00463 -4.53e-4,-0.023242 0.04135,-0.050435 0.0089,0.00129 0.01763,-0.00127 0.02645,-0.00257 0.01468,-0.00188 0.02952,-0.0018 0.0443,-0.00202 0.01659,-0.00134 0.03275,0.00175 0.04892,0.0049 0.01685,0.00322 0.03396,0.00425 0.05106,0.00476 0.01524,-5.74e-4 0.03022,0.00129 0.04531,0.00296 0.01389,0.00123 0.02771,0.00154 0.04144,0.00399 0.01184,0.00232 0.02398,0.0027 0.03602,0.00309 0.01474,9.806e-4 0.02938,0.00322 0.04415,0.00425 0.0139,0.00117 0.02789,1.222e-4 0.04172,0.00193 0.01287,0.00232 0.02594,0.00219 0.03872,0.00463 0.01145,0.00232 0.0231,0.00347 0.03477,0.00412 0.01017,3.989e-4 0.02039,3.629e-4 0.03059,3.577e-4 0.01043,-9.819e-4 0.02031,0.00103 0.03048,0.0027 0.0089,0.00193 0.01817,0.00412 0.02683,0.00721 0.01029,0.00347 0.02113,0.00425 0.03185,0.00476 0.01042,0.00232 0.02095,0.00399 0.03159,0.00476 0.01029,-3.732e-4 0.02026,0.00167 0.03038,0.00335 0.01004,0.00193 0.01987,0.00489 0.0301,0.00618 0.0094,-3.22e-5 0.01813,0.00309 0.02727,0.00463 0.0097,0.00129 0.01943,0.00142 0.02918,0.00154 0.01248,1.647e-4 0.02494,6.82e-5 0.03742,1.67e-5 0.01055,0.0018 0.02107,0.00347 0.03174,0.00438 0.01132,6.769e-4 0.02268,6.782e-4 0.03403,6.924e-4 0.01042,-1.03e-5 0.02073,-3.87e-5 0.03109,-5.28e-5 0.01107,-1.03e-5 0.02208,4.63e-5 0.03313,3.34e-5 0.01068,-2.419e-4 0.0212,-0.00296 0.03188,-0.00399 0.01081,-0.00102 0.0218,-9.369e-4 0.03271,-10e-4 0.0112,-4.749e-4 0.02212,-1.467e-4 0.03314,0.00193 0.0099,0.00193 0.02004,0.00257 0.03014,0.00296 0.01004,2.599e-4 0.02003,2.252e-4 0.03004,2.175e-4 0.009,9.39e-5 0.01784,0.00296 0.02686,0.00399 0.01132,0.00219 0.02228,0.00579 0.03354,0.00811 0.0121,0.0018 0.02417,0.0027 0.03622,0.00476 0.01293,0.00257 0.02616,0.00219 0.03917,0.00399 0.01377,0.00245 0.02772,0.00335 0.04167,0.00399 0.0187,4.273e-4 0.03741,0.00219 0.05596,0.00476 0.02243,0.0027 0.04491,0.0045 0.06714,0.00875 0.0171,0.0036 0.03444,0.00566 0.05186,0.00656 0.01017,-4.401e-4 0.01992,0.00154 0.02986,0.00322 0,0 -0.06076,0.042649 -0.06076,0.042649 v 0 c -0.0097,-0.00154 -0.01933,-0.00257 -0.02914,-0.00283 -0.0174,-0.00154 -0.03462,-0.00412 -0.05174,-0.00772 -0.02212,-0.00386 -0.04444,-0.00592 -0.06671,-0.00849 -0.01879,-0.00206 -0.03763,-0.00335 -0.05654,-0.00373 -0.01402,-8.854e-4 -0.02799,-0.00219 -0.04186,-0.00438 -0.01318,-0.00122 -0.02647,-0.00142 -0.0395,-0.00412 -0.0121,-0.00193 -0.02449,-0.00232 -0.0365,-0.00515 -0.01107,-0.0027 -0.02212,-0.00579 -0.03347,-0.00734 -0.0088,-0.00142 -0.01728,-0.00386 -0.02616,-0.00322 -0.01004,-1.68e-5 -0.02017,-1.81e-5 -0.03024,-5.071e-4 -0.0103,-6.177e-4 -0.02048,-0.00167 -0.03058,-0.0036 -0.01068,-0.00142 -0.02151,-9.253e-4 -0.0323,-9.279e-4 -0.01081,1.467e-4 -0.02162,3.989e-4 -0.03235,0.0018 -0.01068,0.00142 -0.0214,0.00373 -0.03229,0.00322 -0.01107,-9.1e-6 -0.02216,5.01e-5 -0.03324,6.43e-5 -0.0103,7.7e-6 -0.02069,2.7e-5 -0.03105,-4.25e-5 -0.01145,-1.119e-4 -0.02301,-2.496e-4 -0.03448,-0.00117 -0.01042,-0.00113 -0.02073,-0.00335 -0.03122,-0.00386 -0.01248,-2.06e-5 -0.02499,-5.28e-5 -0.03749,-1.21e-4 -0.01004,-1.866e-4 -0.02022,-3.951e-4 -0.03015,-0.00232 -0.009,-0.00193 -0.01782,-0.00399 -0.02699,-0.0045 -0.01017,-0.0018 -0.02,-0.00476 -0.03019,-0.00631 -0.0099,-0.00167 -0.01995,-0.00245 -0.03004,-0.00296 -0.01055,-0.00117 -0.0209,-0.00335 -0.03141,-0.00463 -0.0112,-9.807e-4 -0.02235,-0.00245 -0.03301,-0.00605 -0.0088,-0.00232 -0.01724,-0.00528 -0.02618,-0.00643 -0.0099,-0.00167 -0.01974,-0.00219 -0.02977,-0.0018 -0.01029,-3.74e-5 -0.02055,-8.11e-5 -0.0308,-7.928e-4 -0.01171,-9.536e-4 -0.02338,-0.0027 -0.03498,-0.00476 -0.01274,-0.00142 -0.02558,-0.0027 -0.03834,-0.00438 -0.0138,-7.683e-4 -0.02764,-6.872e-4 -0.04141,-0.00193 -0.01479,-0.0012 -0.0295,-0.00322 -0.04432,-0.00373 -0.01235,-5.611e-4 -0.02462,-0.00129 -0.0367,-0.00386 -0.0135,-0.00219 -0.02722,-0.00219 -0.04078,-0.00386 -0.01502,-0.00154 -0.03,-0.00245 -0.04509,-0.00257 -0.01726,-9.729e-4 -0.03452,-0.00245 -0.05152,-0.00566 -0.01591,-0.00296 -0.03186,-0.00476 -0.04808,-0.0036 -0.01475,3.037e-4 -0.02955,7.322e-4 -0.04414,0.00309 -0.0085,0.00142 -0.018,0.00154 -0.02579,0.00489 0.02038,-0.01341 0.04128,-0.026086 0.06117,-0.040243 7.39e-4,-5.264e-4 -0.0015,-0.00118 -0.0018,-0.00206 -6.9e-5,-2.548e-4 6.56e-4,6.383e-4 0.005,0.00154 0.0044,9.099e-4 0.0085,0.00124 0.01293,0.0018 0.01879,0.00245 0.03755,0.00489 0.05637,0.00695 0.02028,0.00322 0.04047,0.00695 0.06069,0.010553 0.01739,0.00309 0.03448,0.00785 0.05225,0.00837 0.01132,0.00129 0.02265,0.00232 0.03409,0.00167 0.02785,-1.673e-4 0.0051,-7.618e-4 -0.05415,0.044142 -6.39e-4,4.839e-4 -0.0015,-2.406e-4 -0.0024,-2.715e-4 -0.0012,-4.89e-5 -0.0024,-8.11e-5 -0.0037,-1.068e-4 -0.0017,-3.35e-5 -0.0033,-4.64e-5 -0.005,-7.08e-5 -0.0103,-2.638e-4 -0.02054,-6.821e-4 -0.03058,-0.00296 -0.01042,-0.00257 -0.02057,-0.00579 -0.03062,-0.00939 -0.0099,-0.00412 -0.02006,-0.00759 -0.03002,-0.011454 -0.0095,-0.00399 -0.01915,-0.00772 -0.02341,-0.018017 -0.0035,-0.01184 -0.0035,-0.024014 7.5e-5,-0.035906 0,0 0.0675,-0.031702 0.0675,-0.031702 z"
     inkscape:connector-curvature="0" />
  <path
     style="fill:#e9181f;fill-opacity:1;stroke-width:0.0071094"
     d="m 21.993377,6.6914762 c -0.189175,-0.010437 -0.302149,-0.046394 -0.302149,-0.096165 0,-0.052552 0.179888,-0.1426106 0.364794,-0.1826285 0.06163,-0.013338 0.09418,-0.015653 0.218176,-0.015526 0.126094,1.307e-4 0.153079,0.00217 0.200159,0.015165 0.132207,0.036478 0.218133,0.1114489 0.197051,0.1719249 -0.01547,0.044359 -0.101295,0.086171 -0.203692,0.099228 -0.0772,0.00985 -0.355756,0.014542 -0.474339,0.008 z"
     id="path48"
     inkscape:connector-curvature="0" />
  <path
     style="fill:#e9181f;fill-opacity:1;stroke-width:1.28693855"
     id="path50"
     d="m 21.671611,6.6190863 c 0.01171,-0.010205 0.02274,-0.021219 0.0347,-0.031137 0.03195,-0.018429 0.06382,-0.036988 0.09585,-0.055286 0.0041,-0.00234 0.0084,-0.00453 0.01248,-0.00678 0.0022,-0.00119 0.0089,-0.00452 0.0067,-0.00326 -0.09972,0.057888 -0.110393,0.064703 -0.07835,0.044562 0.260069,-0.148993 0.0073,-0.00384 0.01081,-0.00604 0.03104,-0.019453 0.06324,-0.036969 0.09511,-0.05504 0.0017,-9.702e-4 0.0072,-0.00304 0.0055,-0.00205 -0.02842,0.016614 -0.113946,0.065974 -0.08576,0.048954 0.03126,-0.018885 0.06336,-0.036365 0.09503,-0.054548 0.01107,-0.00306 0.02077,-0.0082 0.0321,-0.010373 0.0349,-0.017775 0.0017,-9.376e-4 -0.08265,0.047063 -3.72e-4,2.112e-4 9.92e-4,-7.801e-4 0.0012,-4.139e-4 0.0024,0.00418 0.0075,0.010193 0.0044,0.013945 -8.75e-4,0.00105 -0.0026,8.621e-4 -0.0039,0.00129 -0.0017,4.012e-4 -0.0035,5.416e-4 -0.0051,0.0012 -0.0017,6.655e-4 -0.003,0.00201 -0.0046,0.00273 -0.0082,0.00359 -0.01754,0.00452 -0.02614,0.00663 -0.0085,-3.625e-4 -0.01447,-0.00752 -0.01317,-0.016326 1.94e-4,-0.00131 0.0053,-0.00802 0.0059,-0.00887 0.02709,-0.042087 0.07975,-0.056126 0.121551,-0.081098 -0.0279,0.01601 -0.05566,0.032265 -0.0837,0.048029 -0.0021,0.00112 0.0037,-0.00274 0.0055,-0.00408 0.0046,-0.00332 0.0063,-0.0045 0.01132,-0.00736 0.03201,-0.018404 0.06386,-0.037075 0.0961,-0.055068 0.0021,-0.00113 0.0044,-0.00151 0.0066,-0.00225 0.01004,-0.00821 0.02349,-0.00754 0.03482,-0.012329 0.05966,-0.020492 -0.04091,0.012889 -0.07163,0.060614 0.226111,-0.1295422 -0.0063,0.00461 -0.0098,0.00654 -0.0064,0.00365 -0.0066,0.00207 -0.01337,0.00498 -0.0041,0.00174 -0.0079,0.00411 -0.01184,0.00589 0.0284,-0.016199 0.05677,-0.032454 0.08521,-0.048595 0.0017,-9.486e-4 -0.0032,0.00206 -0.0049,0.00301 -0.03179,0.018188 -0.06332,0.03685 -0.09545,0.054409 -0.02889,0.015787 0.05711,-0.032786 0.08572,-0.049092 0.0015,-8.898e-4 -0.003,0.00196 -0.0046,0.00284 -0.03179,0.018056 -0.06365,0.035989 -0.09546,0.053983 -0.03623,0.019524 0.05361,-0.028852 0.08517,-0.049344 0.0044,-0.00282 -0.01426,-0.010694 3.12e-4,-0.013442 0.0088,-0.00768 0.02042,-0.00988 0.03067,-0.014815 0.01293,-0.00579 0.02726,-0.00855 0.03983,-0.01501 0.01184,-0.00587 0.02497,-0.00705 0.03795,-0.00785 0.01248,6.749e-4 0.02,-0.00813 0.03165,-0.011492 0.01107,-0.00718 0.02512,-0.00815 0.03795,-0.00932 0.01501,-2.339e-4 0.02854,-9.21e-5 0.04114,-0.00903 0.0072,-0.00618 0.01633,-0.00741 0.02481,-0.010501 0.0037,-0.00136 0.0072,-0.00344 0.01081,-0.0049 0.0079,-0.00347 0.01654,-0.00254 0.02464,-0.00421 0.0037,-7.741e-4 0.0072,-0.00246 0.01094,-0.00356 0.01158,-0.00669 0.02473,-0.00884 0.03785,-0.01027 0.0073,-0.00386 0.01588,-0.00386 0.02359,-0.00619 0.0036,-0.00107 0.0068,-0.00301 0.01029,-0.00431 0.0121,-0.00375 0.02497,-0.00417 0.03758,-0.00459 0.01371,-0.0017 0.02651,0.00105 0.03979,0.0038 0.01248,0.00364 0.02405,0.00929 0.03629,0.013421 0.01184,0.00461 0.02343,0.010231 0.03553,0.014328 0.01287,0.0021 0.02543,0.00529 0.03822,0.00784 0.01223,0.00315 0.02526,0.00552 0.03695,0.010373 0.01094,0.00481 0.02272,0.00583 0.03445,0.00655 0.01381,6.08e-4 0.02764,5.296e-4 0.04146,5.151e-4 0.01414,9.576e-4 0.02916,0.00261 0.04273,0.00704 0.01223,0.00504 0.02396,0.00999 0.03704,0.012329 0.01386,3.063e-4 0.02268,0.00891 0.03046,0.019357 0.008,0.00933 0.01526,0.019325 0.02112,0.030116 0.0059,0.014461 0.01489,0.027279 0.02158,0.041342 0.0063,0.014079 0.008,0.029313 0.0089,0.044513 5.93e-4,0.014306 4.47e-4,0.028629 3.92e-4,0.042943 7.14e-4,0.013907 -4.63e-4,0.027161 -0.0059,0.040006 -0.02149,0.033648 -0.07704,0.1003001 -0.110355,0.067844 -0.0071,-0.00907 -0.0037,-0.021057 -0.008,-0.031019 -5.27e-4,-0.00515 -0.01324,0.00291 -0.0098,9.866e-4 0.07103,-0.038768 0.118296,-0.065844 0.08454,-0.046529 -0.03409,0.023942 0.0021,-0.00124 -0.09934,0.056726 -0.0068,0.00393 -0.0121,0.0066 -0.02001,0.00835 -0.0044,0.00367 -0.01042,0.00399 -0.01538,0.0062 -0.0051,0.00225 -0.0091,0.00506 -0.01467,0.00682 -0.0306,0.019008 -0.07379,0.041448 0.07702,-0.044089 0.0015,-8.478e-4 -0.0027,0.0021 -0.0042,0.00297 -0.09487,0.055266 -0.05969,0.045362 -0.100381,0.056228 -0.01068,0.00753 -0.02383,0.00789 -0.03643,0.00888 -0.01409,0.00207 -0.02643,0.00897 -0.04023,0.012226 -0.01296,3.698e-4 -0.02394,0.00604 -0.03563,0.010759 -0.01314,0.00538 -0.02625,0.00963 -0.04036,0.011737 -0.01359,-1.076e-4 -0.02622,0.00318 -0.03935,0.00591 -0.01305,0.00229 -0.02633,0.00256 -0.03954,0.00281 -0.01416,1.686e-4 -0.0283,1.135e-4 -0.04246,9.19e-5 -0.01423,-2.44e-5 -0.02847,-3.4e-5 -0.04269,-3.96e-5 -0.0066,-0.00136 -0.02647,0.00314 -0.03098,-0.00178 -0.0017,-0.00179 -0.0023,-0.00426 -0.0035,-0.00638 -6.1e-5,-0.00226 -7.33e-4,-0.00461 -1.82e-4,-0.00681 5.29e-4,-0.00212 0.0014,-0.0045 0.0033,-0.00566 0.03132,-0.019516 0.06361,-0.037438 0.09556,-0.05593 0.0072,-0.0042 0.01548,-0.00668 0.02332,-0.00942 0.0184,-0.00745 0.0369,-0.015026 0.05594,-0.020672 0.01589,-0.00438 0.03241,-0.00454 0.04876,-0.00488 0.01479,-8.216e-4 0.02926,-0.00429 0.04412,-0.00569 0.01496,-0.00123 0.02996,-0.00136 0.04497,-0.00147 0.01158,0.00101 0.02165,0.0079 0.01601,0.02051 -0.03161,0.017876 -0.06288,0.036342 -0.09481,0.053627 -6.69e-4,3.623e-4 -0.01094,9.387e-4 -0.01133,0.00109 -0.0021,9.132e-4 -0.0072,0.00551 -0.0051,0.0044 0.02799,-0.015531 0.111552,-0.062876 0.08333,-0.047758 -0.03298,0.01767 -0.06509,0.036948 -0.09763,0.055422 -0.01714,0.00663 -0.03552,0.00837 -0.05339,0.0122 -0.01547,0.00333 -0.03126,0.00432 -0.04703,0.00483 -0.01623,1.622e-4 -0.03246,1.632e-4 -0.04868,1.611e-4 -0.01466,-7.4e-6 -0.02932,-1.54e-5 -0.04397,-1.94e-5 -0.01422,-3.3e-6 -0.02843,-3.5e-6 -0.04265,-3.7e-6 -0.01421,0 -0.02843,1e-7 -0.04264,1e-7 -0.01422,0 -0.02844,0 -0.04265,0 -0.01486,4.34e-5 -0.02971,-3.78e-5 -0.04458,-7.52e-5 -0.01579,-5.7e-6 -0.03157,3.34e-5 -0.04736,5.34e-5 -0.0144,1.7e-5 -0.0288,1.97e-5 -0.0432,2.17e-5 -0.01287,-1.475e-4 -0.0252,-0.00417 -0.03796,-0.00569 -0.01337,-0.00129 -0.02682,-0.00135 -0.04024,-0.00145 -0.01409,-0.00105 -0.02906,-0.00269 -0.04258,-0.0071 -0.01158,-0.00429 -0.0222,-0.011891 -0.03224,-0.019089 -0.01107,-0.010193 -0.0188,-0.023142 -0.02977,-0.033489 -0.0051,-0.00763 -0.01387,-0.010939 -0.02045,-0.016858 -0.003,-0.00263 -0.0055,-0.00564 -0.0084,-0.00831 -0.01055,-0.00882 -0.01856,-0.020201 -0.0295,-0.028521 -0.01094,-0.00788 -0.0188,-0.016154 -0.02362,-0.028835 -0.0036,-0.012663 -0.0051,-0.025614 -5.4e-5,-0.037983 0.0046,-0.011338 0.01287,-0.019868 0.023,-0.02646 0.0084,-0.00714 0.01718,-0.013841 0.02544,-0.021171 0.03817,-0.028042 0.07731,-0.058978 0.122902,-0.072646 0.0086,-0.00287 0.01797,-0.00156 0.02677,-0.00293 0.0039,-6.13e-4 0.0076,-0.00216 0.01145,-0.00318 0.01094,-0.00139 0.02368,-0.00593 0.03445,-0.00233 0.03316,0.035523 -0.07052,0.042138 -0.0858,0.066483 -0.01799,0.028652 0.117536,-0.067055 0.08814,-0.050323 -0.07893,0.044915 -0.166742,0.09541 -0.0076,0.00405 -0.03172,0.018314 -0.06343,0.03666 -0.09517,0.054941 -0.006,0.0035 -0.01248,0.00645 -0.01883,0.00952 -0.0023,0.00114 -0.0094,0.00444 -0.0071,0.00314 0.02779,-0.016208 0.05587,-0.031907 0.08381,-0.047861 -0.03198,0.018421 -0.06392,0.036931 -0.09595,0.055265 -0.0022,0.00128 -0.0091,0.00486 -0.0068,0.00358 0.02743,-0.01591 0.110137,-0.06288 0.08245,-0.047426 -0.03262,0.018206 -0.06475,0.037281 -0.09725,0.055687 -0.0055,0.00317 -0.01145,0.00584 -0.01701,0.00898 -0.01495,0.00865 -0.03174,0.013196 -0.04708,0.020785 -0.01235,0.00355 -0.02282,0.010823 -0.03432,0.016223 -0.0023,0.00107 -0.02706,0.00725 -0.02746,0.00705 -0.0015,-7.838e-4 -0.0023,-0.00275 -0.0035,-0.00412 0.088,-0.064247 0.155642,-0.099525 0.0089,-0.016075 -0.0037,0.0021 0.0071,-0.00466 0.01081,-0.0068 0.03193,-0.018586 0.06391,-0.037081 0.09586,-0.05562 0.0022,-8.622e-4 0.0044,-0.00183 0.0066,-0.00259 0.01629,-0.00547 -0.0018,0.00176 0.01261,-0.0049 0.0019,-8.796e-4 0.0076,-0.00345 0.0058,-0.00239 -0.02836,0.016453 -0.11289,0.066693 -0.08552,0.048621 0.03051,-0.020152 0.06333,-0.036581 0.09499,-0.054871 0.04255,-0.017962 -0.106751,0.063801 -0.08057,0.04702 0.03073,-0.019698 0.06303,-0.036823 0.0948,-0.054815 0.0015,-9.098e-4 0.0068,-0.00278 0.0053,-0.00185 -0.0285,0.016662 -0.11419,0.06634 -0.08604,0.049085 0.03111,-0.019069 0.06328,-0.036351 0.09491,-0.054526 0.03177,-0.013496 0.08684,-0.047209 -0.0767,0.044948 -0.003,0.00169 0.0048,-0.00502 0.0078,-0.00676 0.03153,-0.018456 0.06339,-0.036364 0.09508,-0.054546 0.01274,-0.00412 0.02287,-5.716e-4 0.03259,0.00795 0.0082,0.00591 0.01381,0.014436 0.01836,0.023359 0,0 -0.09146,0.052151 -0.09146,0.052151 v 0 c -0.0039,-0.00767 -0.009,-0.014308 -0.0162,-0.019146 -0.0088,-0.00532 -0.01692,-0.00329 -0.02571,0.00152 0.02852,-0.016622 0.05708,-0.033181 0.08555,-0.049866 0.0028,-0.00167 -0.0054,0.00386 -0.0082,0.0056 -0.03109,0.019007 -0.06235,0.037751 -0.0937,0.056342 -0.0031,0.0018 -0.0068,0.00229 -0.0095,0.00465 0.02857,-0.016505 0.115026,-0.064663 0.08571,-0.049515 -0.03242,0.016753 -0.06336,0.036229 -0.09504,0.054335 -0.0015,8.802e-4 -0.0062,0.00351 -0.0046,0.00263 0.177312,-0.1028006 0.04611,-0.026447 -0.01414,0.0078 0.172607,-0.099721 0.05185,-0.029736 -0.01017,0.00515 -0.0077,0.00432 -0.01697,0.00548 -0.02421,0.010797 0.02795,-0.016242 0.05581,-0.032638 0.08386,-0.04873 0.0036,-0.00207 -0.0069,0.00456 -0.01055,0.00665 -0.03166,0.018388 -0.06316,0.037032 -0.09494,0.055201 -0.0014,8.159e-4 -0.0059,0.0027 -0.0046,0.00172 0.02719,-0.020199 0.05493,-0.039658 0.08239,-0.059487 -8.02e-4,-0.00112 -0.0026,-0.00199 -0.0024,-0.00337 8.4e-5,-9.206e-4 0.0018,-2.23e-4 0.0027,-3.934e-4 0.0017,-3.022e-4 0.0032,-6.14e-4 0.0048,-0.00102 0.0062,-0.00161 0.01223,-0.00386 0.01793,-0.00695 0.0112,-0.00607 0.02275,-0.010887 0.03452,-0.015595 0.01582,-0.00598 0.03112,-0.013262 0.04607,-0.021171 0.003,-0.00156 0.0059,-0.00311 0.0089,-0.00467 0.0028,-0.00148 0.0112,-0.00605 0.0085,-0.00445 -0.02732,0.015988 -0.109802,0.0631 -0.0822,0.047599 0.03257,-0.018293 0.06472,-0.037346 0.09711,-0.055973 0.0023,-0.00131 0.0091,-0.00516 0.0069,-0.00385 -0.02794,0.016197 -0.05593,0.032319 -0.0839,0.048478 0.03213,-0.018388 0.06419,-0.036894 0.09639,-0.055165 0.0066,-0.00369 0.01349,-0.00665 0.0201,-0.010167 0.0019,-0.00105 0.0079,-0.0043 0.0059,-0.00317 -0.0284,0.016669 -0.05691,0.033182 -0.08536,0.049774 0.03138,-0.018299 0.06381,-0.034889 0.09411,-0.054897 0.02795,-0.018451 -0.116854,0.065467 -0.08704,0.050222 0.143439,-0.073325 0.10558,-0.070291 0.0063,7.639e-4 -0.0019,0.00136 0.0057,0.00378 0.0037,0.00595 -0.01055,0.00161 -0.02136,0.00211 -0.0317,0.00522 -0.01235,0.00245 -0.02546,0.00199 -0.03718,0.00739 -0.03403,0.017702 -0.01184,0.00629 0.07911,-0.046468 0.01132,-0.0066 -0.03165,0.020354 -0.02147,0.014865 -0.0048,0.00329 -0.0082,0.00775 -0.01287,0.011081 -0.0045,0.00328 -0.0097,0.0051 -0.01235,0.010566 -0.0086,0.00667 -0.02057,0.010836 -0.02492,0.021604 -0.0015,0.00266 -0.0039,0.00494 -0.005,0.00782 -0.0028,0.00707 2.81e-4,0.015531 0.0012,0.022639 0.0036,0.010952 0.01171,0.017025 0.02051,0.024068 0.01055,0.00919 0.01936,0.020114 0.03017,0.029022 0.0091,0.00896 0.01991,0.015946 0.02844,0.025591 0.01017,0.01027 0.01803,0.022435 0.02915,0.031683 0.0097,0.00622 0.01887,0.013577 0.0302,0.016233 0.01345,0.00286 0.02715,0.00524 0.04094,0.00498 0.01375,2.225e-4 0.02753,5.03e-4 0.04116,0.00245 0.01223,0.00196 0.02441,0.00542 0.03696,0.00461 0.01438,1.9e-6 0.02876,4.8e-6 0.04314,2.16e-5 0.01574,2.02e-5 0.03147,5.93e-5 0.04721,5.34e-5 0.01493,-3.72e-5 0.02986,-1.182e-4 0.04479,-7.51e-5 0.01422,0 0.02844,-2e-7 0.04265,-4e-7 0.01421,-10e-8 0.02843,-7e-7 0.04264,-5e-7 0.01422,6e-7 0.02843,1e-6 0.04264,1.59e-5 0.01462,1.87e-5 0.02925,5.34e-5 0.04387,1.009e-4 0.01616,3.3e-5 0.03234,1.56e-4 0.04849,-6.07e-4 0.01538,-8.71e-4 0.03068,-0.00252 0.04573,-0.00598 0.01758,-0.00363 0.03574,-0.00564 0.0518,-0.01433 -0.19976,0.1160549 -0.0091,0.00519 0.01453,-0.00794 0.0022,-0.00124 0.0049,-0.00134 0.0075,-0.00197 0.03578,-0.00901 0.07333,-0.039732 -0.07673,0.047368 0.0024,2.589e-4 0.01483,0.00393 0.0035,0.00278 -0.0019,-1.967e-4 -0.0039,-1.851e-4 -0.0058,-2.776e-4 -0.01478,2.132e-4 -0.02957,5.474e-4 -0.04426,0.00225 -0.01481,0.00189 -0.02946,0.00541 -0.04449,0.00493 -0.01588,6.718e-4 -0.0318,0.00194 -0.04695,0.00717 -0.01866,0.00642 -0.03712,0.013455 -0.05536,0.020989 -0.0082,0.00347 -0.0089,0.00353 -0.01631,0.00735 -0.0023,0.00116 -0.0089,0.00493 -0.0067,0.00363 0.02799,-0.016647 0.0561,-0.033117 0.08414,-0.049675 -0.0058,0.00147 -0.0032,0.0014 -0.0079,8.339e-4 -7.17e-4,-7.794e-4 -0.0021,-0.00128 -0.0022,-0.00234 -2.1e-5,-4.739e-4 0.02866,2.858e-4 0.02863,-6.21e-5 0.01423,9.2e-6 0.02847,2.64e-5 0.0427,4.33e-5 0.01411,4.6e-6 0.02821,4.82e-5 0.0423,-3.86e-4 0.01293,-5.458e-4 0.02591,-0.00139 0.03854,-0.00444 0.01301,-0.00287 0.0262,-0.00335 0.03932,-0.00559 0.01353,-0.00318 0.02632,-0.00835 0.0392,-0.013479 0.01171,-0.00483 0.02398,-0.00707 0.03634,-0.00981 0.01349,-0.00443 0.0267,-0.00978 0.04108,-0.010733 0.01248,-0.00183 0.02385,-0.00559 0.03513,-0.011299 0.03374,-0.017698 0.01094,-0.00582 -0.08085,0.047326 -0.0014,8.518e-4 0.0028,-0.00188 0.0042,-0.00274 0.02682,-0.015762 0.06787,-0.044621 0.104087,-0.059731 0.0099,-0.00466 0.02005,-0.00893 0.03046,-0.012393 0.0051,-0.00211 0.0097,-0.00476 0.01453,-0.00727 0.0015,-7.971e-4 0.0063,-0.00305 0.0048,-0.00216 -0.08,0.046854 -0.115837,0.064486 -0.08166,0.047565 0.0227,-0.018994 0.08655,-0.083176 0.115426,-0.045011 0.0032,0.0071 0.0054,0.018433 0.0046,0.024124 -0.01094,-0.035296 1.05e-4,-0.00282 -0.08881,0.049259 -0.0012,7.184e-4 0.0024,-0.00152 0.0035,-0.00252 0.004,-0.004 0.0079,-0.00848 0.01094,-0.013137 0.0084,-0.00997 0.009,-0.022442 0.0086,-0.035042 6.2e-5,-0.014145 2.1e-4,-0.028292 -1.27e-4,-0.042434 -5.55e-4,-0.013912 -0.0014,-0.027973 -0.0068,-0.041011 -0.0064,-0.013984 -0.01565,-0.026452 -0.02145,-0.040706 -0.0055,-0.01036 -0.01317,-0.019419 -0.02062,-0.028492 -0.0071,-0.00894 -0.01462,-0.012316 -0.02615,-0.01332 -0.01287,-0.00326 -0.02475,-0.00884 -0.0374,-0.012754 -0.01346,-0.00286 -0.02719,-0.00523 -0.041,-0.00484 -0.01403,-3.58e-5 -0.02808,-9.2e-6 -0.04208,-0.00117 -0.01248,-0.00135 -0.02459,-0.00372 -0.03615,-0.00867 -0.01184,-0.00344 -0.02372,-0.00718 -0.03589,-0.00936 -0.01313,-0.0029 -0.02652,-0.00477 -0.03929,-0.00902 -0.01184,-0.00481 -0.02356,-0.00977 -0.03549,-0.014284 -0.01158,-0.00461 -0.02315,-0.00941 -0.03539,-0.012097 -0.01261,-0.00252 -0.02522,-0.00291 -0.03811,-0.0017 -0.01223,9.325e-4 -0.02448,0.00245 -0.03594,0.00717 -0.01133,0.00382 -0.02323,0.00618 -0.03488,0.0087 -0.01292,0.00242 -0.02493,0.00705 -0.03726,0.011428 -0.01158,0.00288 -0.02385,0.00336 -0.03477,0.00875 -0.01184,0.00492 -0.02404,0.00888 -0.03489,0.015977 -0.01411,0.00497 -0.02866,0.00461 -0.0434,0.0061 -0.01291,0.00205 -0.02501,0.0057 -0.03674,0.011505 -0.01081,0.00508 -0.02067,0.00986 -0.03314,0.00914 -0.01261,0.00162 -0.02459,0.00474 -0.03601,0.010411 -0.0134,0.00454 -0.02667,0.0095 -0.0397,0.014984 -0.01107,0.0042 -0.02094,0.010797 -0.03223,0.014031 -5.21e-4,1.761e-4 -0.0055,0.00219 -0.0066,0.00144 -0.0054,-0.00384 -0.0088,-0.012715 -0.0084,-0.012999 0.05641,-0.038356 0.06109,-0.040254 0.09599,-0.055637 -0.02852,0.016475 -0.05706,0.032901 -0.08556,0.049426 -0.0015,8.95e-4 0.0032,-0.00165 0.0048,-0.00254 0.03167,-0.018232 0.06311,-0.036868 0.09494,-0.054829 0.02858,-0.016128 -0.05678,0.032898 -0.0852,0.049328 -0.0017,9.671e-4 0.0033,-0.00196 0.005,-0.00293 0.03181,-0.01829 0.06361,-0.03658 0.09543,-0.05487 0.0062,-0.00288 0.01248,-0.00521 0.01853,-0.00828 0.0021,-0.00105 0.0081,-0.00453 0.006,-0.00337 -0.09316,0.054067 -0.138575,0.079779 0.01107,-0.00574 0.04762,0.00269 -0.06218,0.062952 -0.09483,0.069339 -0.0121,0.00273 -0.0231,0.00731 -0.0341,0.012887 -0.03483,0.017304 -0.01042,0.00537 0.07795,-0.045707 0.0019,-0.00113 -0.0039,0.00242 -0.0058,0.00354 -0.01017,0.0058 -0.0015,-2.26e-5 -0.01145,0.00708 -0.03174,0.019069 -0.06367,0.037824 -0.09549,0.056737 -0.0326,0.018025 -0.03663,0.02033 0.07583,-0.044787 0.0021,-0.00117 -0.0039,0.00269 -0.0057,0.00402 -0.0054,0.00376 -0.01042,0.00737 -0.01355,0.013475 -2.4e-4,4.149e-4 -0.004,0.00782 -0.0057,0.00806 -0.0088,0.0012 -0.0028,-0.00673 2.25e-4,-0.0044 0.01223,-0.00277 0.02365,-0.00755 0.03544,-0.011724 0.0088,-0.00341 0.01158,0.00198 0.01511,0.010939 0.0011,0.00275 -0.06601,0.048205 -0.10114,0.056316 -0.01043,0.00347 -0.02076,0.00759 -0.03059,0.012445 0.02852,-0.016471 0.114782,-0.064597 0.08556,-0.049415 -0.03243,0.016849 -0.06345,0.03629 -0.09518,0.054417 -0.0017,9.364e-4 -0.0066,0.00372 -0.0049,0.00278 0.02833,-0.016446 0.113586,-0.065317 0.08504,-0.049267 -0.01717,0.00965 -0.221193,0.128053 -0.01094,0.00613 -0.0139,0.00817 -0.250895,0.144947 -0.037,0.020129 -0.01326,0.0078 -0.02278,0.02002 -0.03494,0.029279 0,0 -0.09755,0.040409 -0.09755,0.040409 z"
     inkscape:connector-curvature="0" />
</svg>
