<?xml version="1.0" encoding="UTF-8" standalone="no"?>
<!-- Created with Inkscape (http://www.inkscape.org/) -->

<svg
   width="20mm"
   height="20mm"
   viewBox="0 0 20 20"
   version="1.1"
   id="svg5"
   inkscape:version="1.1.1 (3bf5ae0d25, 2021-09-20)"
   sodipodi:docname="bell.svg"
   xmlns:inkscape="http://www.inkscape.org/namespaces/inkscape"
   xmlns:sodipodi="http://sodipodi.sourceforge.net/DTD/sodipodi-0.dtd"
   xmlns="http://www.w3.org/2000/svg"
   xmlns:svg="http://www.w3.org/2000/svg">
  <sodipodi:namedview
     id="namedview7"
     pagecolor="#ffffff"
     bordercolor="#666666"
     borderopacity="1.0"
     inkscape:pageshadow="2"
     inkscape:pageopacity="0.0"
     inkscape:pagecheckerboard="0"
     inkscape:document-units="mm"
     showgrid="false"
     inkscape:zoom="2.5620932"
     inkscape:cx="63.424704"
     inkscape:cy="70.45021"
     inkscape:window-width="1680"
     inkscape:window-height="987"
     inkscape:window-x="-8"
     inkscape:window-y="-8"
     inkscape:window-maximized="1"
     inkscape:current-layer="layer1" />
  <defs
     id="defs2" />
  <g
     inkscape:label="Calque 1"
     inkscape:groupmode="layer"
     id="layer1">
    <g
       id="g21"
       transform="matrix(0.39112842,0,0,0.39112842,-19.241081,-27.568961)">
      <path
         style="fill:#f6ea51;stroke-width:0.264583"
         d="m 82.78484,126.18738 -1.190625,-0.083 -2.778125,-0.27093 -2.778126,-0.27094 -2.645833,-0.52935 -2.645833,-0.52935 -1.852084,-0.54667 -1.852083,-0.54666 -2.513542,-0.93686 -2.513541,-0.93685 -2.577814,-1.28185 -2.577814,-1.28184 -1.465529,-0.93749 -1.46553,-0.93749 -1.660933,-1.70231 -1.660933,-1.70232 -0.737565,-1.35514 -0.737566,-1.35516 0.09591,-2.29823 0.09591,-2.29823 0.722922,-1.07043 0.722922,-1.07043 3.421834,-2.99181 3.421835,-2.991812 1.014931,-1.229426 1.014931,-1.229426 0.672271,-0.926042 0.67227,-0.926041 0.815677,-1.465922 0.815677,-1.465921 0.668963,-2.117643 0.668963,-2.117643 0.29818,-1.644364 0.298179,-1.644361 0.959893,-2.293057 0.959892,-2.293056 1.339472,-2.004018 1.339471,-2.004015 1.600424,-1.5875 1.600422,-1.5875 1.621351,-0.942993 1.621354,-0.942994 1.941261,-0.614018 1.941261,-0.614019 0.39551,-0.190754 0.395509,-0.190754 0.757439,-2.088692 0.757436,-2.088692 0.746022,-2.910417 0.746022,-2.910416 0.315507,-2.645834 0.315508,-2.645833 -0.17272,-5.423958 -0.172723,-5.423958 0.268902,-3.704167 0.268904,-3.704166 0.542858,-3.571875 0.542859,-3.571875 0.425868,-1.719792 0.425868,-1.719791 0.456505,-1.058334 0.456506,-1.058333 1.20809,-1.5875 1.208093,-1.5875 0.876853,-0.683922 0.876851,-0.683923 1.322916,-0.757637 1.322917,-0.757637 3.09096,-0.107134 3.090961,-0.107134 1.293449,1.209872 1.29345,1.209871 0.77497,1.529447 0.77496,1.529447 -0.0145,5.820833 -0.0145,5.820833 -0.8151,2.645834 -0.81509,2.645833 -2.31236,5.953125 -2.312355,5.953125 -0.611245,1.5875 -0.611246,1.5875 -0.973254,2.513541 -0.973251,2.513542 -0.648661,2.248958 -0.64866,2.248958 -0.478721,2.38125 -0.478719,2.38125 -0.182851,1.508371 -0.182851,1.508371 1.018175,1.137462 1.018178,1.137463 0.706498,1.058333 0.706501,1.058333 0.637463,1.455209 0.637464,1.455208 0.312959,1.719791 0.31296,1.719792 0.152448,3.96875 0.152445,3.96875 -0.435168,3.836458 -0.435168,3.836458 -0.313894,1.455209 -0.313891,1.455208 -0.0076,3.571874 -0.0076,3.57188 0.586322,1.86023 0.586319,1.86023 1.074219,1.71164 1.074216,1.71165 0.809058,1.65404 0.80906,1.65405 0.13009,1.52095 0.13008,1.52096 -0.63101,1.19062 -0.631,1.19063 -1.584187,1.07069 -1.584193,1.07069 -2.164112,0.71524 -2.164133,0.71525 -4.308713,-0.0462 -4.308715,-0.0462 z m 4.679344,-14.07431 1.372052,-0.47411 1.062458,-0.70311 1.062461,-0.7031 0.183378,-0.97748 0.183377,-0.97749 -0.80369,-0.7181 -0.803688,-0.71809 -2.211075,-0.71752 -2.211076,-0.71752 -2.38125,0.12115 -2.38125,0.12114 -2.083932,0.68219 -2.083933,0.68219 -0.760338,0.72845 -0.760339,0.72846 v 0.69474 0.69475 l 0.727605,0.69693 0.727604,0.69692 1.058333,0.44221 1.058334,0.44221 1.190625,0.20216 1.190625,0.20217 2.645833,0.0225 2.645833,0.0225 1.372053,-0.47412 z m 3.563993,-23.321663 0.7943,-0.794297 -0.182639,-0.859348 -0.182642,-0.859346 -0.421997,-0.478007 -0.422,-0.478009 -0.671552,0.16855 -0.671555,0.16855 -0.332211,0.275709 -0.332208,0.275709 v 1.275517 1.275516 l 0.588039,0.41188 0.588036,0.411877 h 0.226066 0.226065 z m -0.669862,-6.022771 0.297432,-0.194386 0.561475,-0.926042 0.561472,-0.926042 0.0011,-0.742518 0.0011,-0.742519 -0.859895,-0.7889 -0.859896,-0.7889 -1.031883,0.07621 -1.031883,0.07621 -0.549603,0.738952 -0.549606,0.738952 v 1.035889 1.035888 l 0.771094,0.804847 0.771091,0.804847 0.810395,-0.004 0.810395,-0.004 0.297434,-0.194384 z"
         id="path35" />
      <path
         style="fill:#e8c617;stroke-width:0.264583"
         d="m 82.78484,126.18738 -1.190625,-0.083 -2.778125,-0.27093 -2.778126,-0.27094 -2.645833,-0.52935 -2.645833,-0.52935 -1.852084,-0.54667 -1.852083,-0.54666 -2.513542,-0.93686 -2.513541,-0.93685 -2.577814,-1.28185 -2.577814,-1.28184 -1.465529,-0.93749 -1.46553,-0.93749 -1.660933,-1.70231 -1.660933,-1.70232 -0.737565,-1.35514 -0.737566,-1.35516 0.09591,-2.29823 0.09591,-2.29823 0.722922,-1.07043 0.722922,-1.07043 3.421834,-2.99181 3.421835,-2.991812 1.014931,-1.229426 1.014931,-1.229426 0.672271,-0.926042 0.67227,-0.926041 0.815677,-1.465922 0.815677,-1.465921 0.668963,-2.117643 0.668963,-2.117643 0.29818,-1.644364 0.298179,-1.644361 0.959893,-2.293057 0.959892,-2.293056 1.339472,-2.004018 1.339471,-2.004015 1.600424,-1.5875 1.600422,-1.5875 1.621351,-0.942993 1.621354,-0.942994 1.941261,-0.614018 1.941261,-0.614019 0.39551,-0.190754 0.395509,-0.190754 0.757439,-2.088692 0.757436,-2.088692 0.746022,-2.910417 0.746022,-2.910416 0.315507,-2.645834 0.315508,-2.645833 -0.17272,-5.423958 -0.172723,-5.423958 0.268902,-3.704167 0.268904,-3.704166 0.542858,-3.571875 0.542859,-3.571875 0.425868,-1.719792 0.425868,-1.719791 0.456505,-1.058334 0.456506,-1.058333 1.20809,-1.5875 1.208093,-1.5875 0.876853,-0.683922 0.876851,-0.683923 1.322916,-0.757637 1.322917,-0.757637 3.09096,-0.107134 3.090961,-0.107134 1.293449,1.209872 1.29345,1.209871 0.77497,1.529447 0.77496,1.529447 -0.0145,5.820833 -0.0145,5.820833 -0.8151,2.645834 -0.81509,2.645833 -2.31236,5.953125 -2.312355,5.953125 -0.611245,1.5875 -0.611246,1.5875 -0.973254,2.513541 -0.973251,2.513542 -0.648661,2.248958 -0.64866,2.248958 -0.478721,2.38125 -0.478719,2.38125 -0.182851,1.508371 -0.182851,1.508371 1.018175,1.137462 1.018178,1.137463 0.706498,1.058333 0.706501,1.058333 0.637463,1.455209 0.637464,1.455208 0.312959,1.719791 0.31296,1.719792 0.152448,3.96875 0.152445,3.96875 -0.435168,3.836458 -0.435168,3.836458 -0.313894,1.455209 -0.313891,1.455208 -0.0076,3.571874 -0.0076,3.57188 0.586322,1.86023 0.586319,1.86023 1.074219,1.71164 1.074216,1.71165 0.809058,1.65404 0.80906,1.65405 0.13009,1.52095 0.13008,1.52096 -0.63101,1.19062 -0.631,1.19063 -1.584187,1.07069 -1.584193,1.07069 -2.164112,0.71524 -2.164133,0.71525 -4.308713,-0.0462 -4.308715,-0.0462 z m 6.33599,-6.18886 3.056718,-0.27886 1.82032,-0.39359 1.820317,-0.39358 0.759371,-0.39269 0.759367,-0.39268 v -0.26629 -0.26629 l -0.395764,-0.94719 -0.395766,-0.9472 -0.993296,0.17605 -0.993299,0.17606 -0.426789,0.12451 -0.426789,0.12451 -0.646438,-0.86622 -0.646438,-0.86623 -0.734824,-1.57529 -0.734825,-1.57529 0.166963,-0.80596 0.16696,-0.80596 0.149098,-0.86346 0.1491,-0.86346 -0.997833,-0.91398 -0.997831,-0.91398 0.325223,-3.0439 0.325223,-3.04391 0.66244,-2.85157 0.662443,-2.851571 0.661148,-3.042708 0.661149,-3.042708 0.348583,-2.116667 0.348586,-2.116666 -0.214979,-1.540674 -0.214979,-1.540674 -0.908008,-1.89891 -0.90801,-1.898909 -0.544708,-0.661458 -0.544706,-0.661458 h -2.402499 -2.402496 l -0.0013,1.405897 -0.0013,1.405898 -0.667141,3.220154 -0.667145,3.220156 -0.636542,1.895232 -0.636545,1.895231 -0.548397,1.074947 -0.548396,1.074944 v 0.286152 0.286149 l -3.808005,7.728038 -3.808006,7.728035 -0.710498,2.11248 -0.710502,2.11248 -0.14614,1.74317 -0.146142,1.74317 0.320458,0.59878 0.320458,0.59878 -0.111469,0.11147 -0.111467,0.11147 -6.326358,-2.9326 -6.326115,-2.9326 -1.86804,-0.87115 -1.86804,-0.87115 -0.976231,-1.1405 -0.97623,-1.14051 v 0.31802 0.31802 l 0.756452,1.66832 0.756453,1.66832 1.161777,1.13553 1.161776,1.13553 1.322917,0.85944 1.322916,0.85944 1.322917,0.54762 1.322917,0.54762 3.042708,1.1104 3.042708,1.11041 2.116667,0.7789 2.116667,0.7789 0.82995,0.24814 0.829948,0.24814 1.948177,0.22609 1.948175,0.22609 3.293282,0.0343 3.293279,0.0343 z"
         id="path33" />
      <path
         style="fill:#b78a6c;stroke-width:0.264583"
         d="m 82.78484,126.18738 -1.190625,-0.083 -2.778125,-0.27093 -2.778126,-0.27094 -2.645833,-0.52935 -2.645833,-0.52935 -1.852084,-0.54667 -1.852083,-0.54666 -2.513542,-0.93686 -2.513541,-0.93685 -2.577814,-1.28185 -2.577814,-1.28184 -1.465529,-0.93749 -1.46553,-0.93749 -1.660933,-1.70231 -1.660933,-1.70232 -0.737565,-1.35514 -0.737566,-1.35516 0.09591,-2.29823 0.09591,-2.29823 0.722922,-1.07043 0.722922,-1.07043 3.421834,-2.99181 3.421835,-2.991812 1.014931,-1.229426 1.014931,-1.229426 0.672271,-0.926042 0.67227,-0.926041 0.815677,-1.465922 0.815677,-1.465921 0.668963,-2.117643 0.668963,-2.117643 0.29818,-1.644364 0.298179,-1.644361 0.959893,-2.293057 0.959892,-2.293056 1.339472,-2.004018 1.339471,-2.004015 1.600424,-1.5875 1.600422,-1.5875 1.621351,-0.942993 1.621354,-0.942994 1.941261,-0.614018 1.941261,-0.614019 0.39551,-0.190754 0.395509,-0.190754 0.757439,-2.088692 0.757436,-2.088692 0.746022,-2.910417 0.746022,-2.910416 0.315507,-2.645834 0.315508,-2.645833 -0.17272,-5.423958 -0.172723,-5.423958 0.268902,-3.704167 0.268904,-3.704166 0.542858,-3.571875 0.542859,-3.571875 0.425868,-1.719792 0.425868,-1.719791 0.456505,-1.058334 0.456506,-1.058333 1.20809,-1.5875 1.208093,-1.5875 0.876853,-0.683922 0.876851,-0.683923 1.322916,-0.757637 1.322917,-0.757637 3.09096,-0.107134 3.090961,-0.107134 1.293449,1.209872 1.29345,1.209871 0.77497,1.529447 0.77496,1.529447 -0.0145,5.820833 -0.0145,5.820833 -0.8151,2.645834 -0.81509,2.645833 -2.31236,5.953125 -2.312355,5.953125 -0.611245,1.5875 -0.611246,1.5875 -0.973254,2.513541 -0.973251,2.513542 -0.648661,2.248958 -0.64866,2.248958 -0.478721,2.38125 -0.478719,2.38125 -0.182851,1.508371 -0.182851,1.508371 1.018175,1.137462 1.018178,1.137463 0.706498,1.058333 0.706501,1.058333 0.637463,1.455209 0.637464,1.455208 0.312959,1.719791 0.31296,1.719792 0.152448,3.96875 0.152445,3.96875 -0.435168,3.836458 -0.435168,3.836458 -0.313894,1.455209 -0.313891,1.455208 -0.0076,3.571874 -0.0076,3.57188 0.586322,1.86023 0.586319,1.86023 1.074219,1.71164 1.074216,1.71165 0.809058,1.65404 0.80906,1.65405 0.13009,1.52095 0.13008,1.52096 -0.63101,1.19062 -0.631,1.19063 -1.584187,1.07069 -1.584193,1.07069 -2.164112,0.71524 -2.164133,0.71525 -4.308713,-0.0462 -4.308715,-0.0462 z m 12.766145,-4.83889 1.256771,-0.63575 v -0.19878 -0.19879 l 0.418264,-0.41826 0.418267,-0.41827 -0.283096,-1.32003 -0.283097,-1.32004 -0.768323,-1.4398 -0.768324,-1.43981 -0.203015,0.18264 -0.203014,0.18265 0.200194,-0.3467 0.200197,-0.3467 -0.31677,-0.84393 -0.31677,-0.84392 -0.20122,-0.52917 -0.201219,-0.52916 -0.284271,-0.92605 -0.284271,-0.92604 -0.314989,-1.6486 -0.314989,-1.6486 -0.169876,0.10499 -0.169875,0.10499 0.09881,-1.03608 0.09881,-1.03607 -0.226227,2.2e-4 -0.226229,2.3e-4 0.177411,-4.299707 0.177408,-4.299704 0.706528,-3.96875 0.706527,-3.968749 -0.0081,-3.647779 -0.0081,-3.647781 -0.412773,-1.379302 -0.412774,-1.379305 -0.913051,-1.235271 -0.913048,-1.235273 -0.34376,0.055 -0.34376,0.055 -0.781817,0.518818 -0.781815,0.518817 h -2.159783 -2.15978 l -0.150633,2.129734 -0.15063,2.129734 -0.690806,2.999632 -0.690808,2.999631 -1.013963,2.557965 -1.013965,2.557963 -1.552999,3.29085 -1.553001,3.29085 -1.25001,2.357987 -1.250011,2.35798 -1.445633,3.33259 -1.445633,3.33259 -0.444707,1.96346 -0.444706,1.96347 0.151321,1.27768 0.151323,1.27768 h -0.118306 -0.118306 l -4.301016,-2.06183 -4.300998,-2.06183 -3.805352,-1.70848 -3.805352,-1.70849 -0.648437,-0.97233 -0.648437,-0.97233 -0.367692,-0.14109 -0.367693,-0.1411 -0.800915,0.67393 -0.800914,0.67392 v 0.53397 0.53396 l 0.800132,1.67653 0.800131,1.67652 0.985806,1.02082 0.985806,1.02082 1.521184,0.82067 1.521185,0.82067 -0.177602,-0.30519 -0.177603,-0.30518 0.508502,0.43731 0.508501,0.43732 3.571875,1.76039 3.571875,1.76038 1.455208,0.36572 1.455208,0.36572 2.38125,0.68141 2.38125,0.68141 4.762501,0.28338 4.7625,0.28338 0.110479,0.11004 0.110479,0.11005 5.048896,-0.0728 5.048896,-0.0729 z m -25.595643,-7.9548 0.166317,-0.26911 0.393991,-3.75739 0.393988,-3.75738 0.219144,-0.27299 0.219144,-0.27299 0.184626,-1.11952 0.184626,-1.11952 0.877943,-2.05548 0.877944,-2.055477 0.943176,-1.719792 0.943178,-1.719792 0.643586,-1.190625 0.643586,-1.190625 1.349333,-1.846418 1.349332,-1.846416 V 89.008736 88.81731 l 1.158648,-1.666322 1.158647,-1.666322 0.844108,-1.682512 0.844106,-1.682509 -0.17608,-1.095615 -0.176078,-1.095614 -0.636916,-1.106924 -0.636915,-1.106924 -0.508881,-0.161512 -0.508879,-0.161512 -0.879319,0.394107 -0.879316,0.394108 -0.773411,0.477454 -0.773412,0.477453 -0.474358,0.45402 -0.474358,0.45402 -0.636141,1.001188 -0.63614,1.001189 -0.563486,0.504029 -0.563486,0.504028 v 0.381191 0.38119 l -0.368696,0.702281 -0.3687,0.702281 -0.79516,1.852083 -0.795163,1.852083 -0.353825,1.058334 -0.353827,1.058333 -0.02856,0.264583 -0.02856,0.264584 -0.305842,0.744828 -0.30584,0.744829 v 0.213177 0.213178 l -0.770327,1.820119 -0.770326,1.820119 -0.596196,1.984375 -0.596196,1.984372 -0.769833,1.6548 -0.769835,1.65479 -1.010189,1.27799 -1.01019,1.27799 -1.264441,0.83753 -1.26444,0.83753 h -0.46819 -0.468191 l -0.156674,0.2535 -0.156675,0.25351 2.853039,1.35434 2.853039,1.35434 1.719791,0.88878 1.719792,0.88877 0.182822,0.0169 0.182824,0.0169 z"
         id="path31" />
      <path
         style="fill:#dab70d;stroke-width:0.264583"
         d="m 82.78484,126.18738 -1.190625,-0.083 -2.778125,-0.27093 -2.778126,-0.27094 -2.645833,-0.52935 -2.645833,-0.52935 -1.852084,-0.54667 -1.852083,-0.54666 -2.513542,-0.93686 -2.513541,-0.93685 -2.577814,-1.28185 -2.577814,-1.28184 -1.465529,-0.93749 -1.46553,-0.93749 -1.660933,-1.70231 -1.660933,-1.70232 -0.737565,-1.35514 -0.737566,-1.35516 0.09591,-2.29823 0.09591,-2.29823 0.722922,-1.07043 0.722922,-1.07043 3.421834,-2.99181 3.421835,-2.991812 1.014931,-1.229426 1.014931,-1.229426 0.672271,-0.926042 0.67227,-0.926041 0.815677,-1.465922 0.815677,-1.465921 0.668963,-2.117643 0.668963,-2.117643 0.29818,-1.644364 0.298179,-1.644361 0.959893,-2.293057 0.959892,-2.293056 1.339472,-2.004018 1.339471,-2.004015 1.600424,-1.5875 1.600422,-1.5875 1.621351,-0.942993 1.621354,-0.942994 1.941261,-0.614018 1.941261,-0.614019 0.39551,-0.190754 0.395509,-0.190754 0.757439,-2.088692 0.757436,-2.088692 0.746022,-2.910417 0.746022,-2.910416 0.315507,-2.645834 0.315508,-2.645833 -0.17272,-5.423958 -0.172723,-5.423958 0.268902,-3.704167 0.268904,-3.704166 0.542858,-3.571875 0.542859,-3.571875 0.425868,-1.719792 0.425868,-1.719791 0.456505,-1.058334 0.456506,-1.058333 1.20809,-1.5875 1.208093,-1.5875 0.876853,-0.683922 0.876851,-0.683923 1.322916,-0.757637 1.322917,-0.757637 3.09096,-0.107134 3.090961,-0.107134 1.293449,1.209872 1.29345,1.209871 0.77497,1.529447 0.77496,1.529447 -0.0145,5.820833 -0.0145,5.820833 -0.8151,2.645834 -0.81509,2.645833 -2.31236,5.953125 -2.312355,5.953125 -0.611245,1.5875 -0.611246,1.5875 -0.973254,2.513541 -0.973251,2.513542 -0.648661,2.248958 -0.64866,2.248958 -0.478721,2.38125 -0.478719,2.38125 -0.182851,1.508371 -0.182851,1.508371 1.018175,1.137462 1.018178,1.137463 0.706498,1.058333 0.706501,1.058333 0.637463,1.455209 0.637464,1.455208 0.312959,1.719791 0.31296,1.719792 0.152448,3.96875 0.152445,3.96875 -0.435168,3.836458 -0.435168,3.836458 -0.313894,1.455209 -0.313891,1.455208 -0.0076,3.571874 -0.0076,3.57188 0.586322,1.86023 0.586319,1.86023 1.074219,1.71164 1.074216,1.71165 0.809058,1.65404 0.80906,1.65405 0.13009,1.52095 0.13008,1.52096 -0.63101,1.19062 -0.631,1.19063 -1.584187,1.07069 -1.584193,1.07069 -2.164112,0.71524 -2.164133,0.71525 -4.308713,-0.0462 -4.308715,-0.0462 z m 12.762645,-4.83714 1.253273,-0.634 0.15362,-0.48402 0.153622,-0.48401 h 0.262964 0.262967 l -0.182862,-1.25677 -0.182861,-1.25677 -0.862573,-1.63866 -0.862571,-1.63867 -0.203825,0.18346 -0.203821,0.18345 0.200194,-0.3467 0.200197,-0.3467 -0.31677,-0.84393 -0.31677,-0.84392 -0.20122,-0.52917 -0.201219,-0.52916 -0.284271,-0.92605 -0.284271,-0.92604 -0.314989,-1.6486 -0.314989,-1.6486 -0.169876,0.10499 -0.169875,0.10499 0.09881,-1.03608 0.09881,-1.03607 -0.226227,2.2e-4 -0.226229,2.3e-4 0.177411,-4.299707 0.177408,-4.299704 0.706528,-3.96875 0.706527,-3.968749 -0.0081,-3.647779 -0.0081,-3.647781 -0.412773,-1.379302 -0.412774,-1.379305 -0.913051,-1.235271 -0.913048,-1.235273 -0.383214,0.05625 -0.383215,0.05624 -0.360939,0.299553 -0.360939,0.299553 -1.267955,0.319276 -1.267958,0.319275 -1.270111,-0.150426 -1.270111,-0.150427 -0.153768,2.178902 -0.153768,2.178902 -0.690806,2.999632 -0.690808,2.999631 -1.013963,2.557965 -1.013965,2.557963 -1.552999,3.29085 -1.553001,3.29085 -1.25001,2.357982 -1.250011,2.35798 -1.445633,3.33259 -1.445633,3.33259 -0.444707,1.96346 -0.444706,1.96347 0.151321,1.27768 0.151323,1.27768 h -0.118306 -0.118306 l -4.301016,-2.06183 -4.300998,-2.06183 -3.805352,-1.70848 -3.805352,-1.70849 -0.648437,-0.97233 -0.648437,-0.97233 -0.367692,-0.14109 -0.367693,-0.1411 -0.800915,0.67393 -0.800914,0.67392 v 0.53397 0.53396 l 0.800132,1.67653 0.800131,1.67652 0.985806,1.02082 0.985806,1.02082 1.521184,0.82067 1.521185,0.82067 -0.177602,-0.30519 -0.177603,-0.30518 0.508502,0.43731 0.508501,0.43732 3.571875,1.75732 3.571875,1.75732 1.190625,0.27572 1.190625,0.27572 0.661458,0.21682 0.661458,0.21682 0.396875,0.12341 0.396875,0.1234 0.192532,0.0561 0.19253,0.0561 1.39497,0.37477 1.394968,0.37477 4.762501,0.28677 4.7625,0.28679 0.110479,0.11004 0.110479,0.11005 5.048896,-0.0728 5.048896,-0.0729 z m -25.592143,-7.95655 0.166317,-0.26911 0.393991,-3.75739 0.393988,-3.75738 0.219144,-0.27299 0.219144,-0.27299 0.184626,-1.11952 0.184626,-1.11952 0.877943,-2.05548 0.877944,-2.055477 0.943176,-1.719792 0.943178,-1.719792 0.643586,-1.190625 0.643586,-1.190625 1.349333,-1.846418 1.349332,-1.846416 V 89.008736 88.81731 l 1.158648,-1.666322 1.158647,-1.666322 0.844108,-1.682512 0.844106,-1.682509 -0.17608,-1.095615 -0.176078,-1.095614 -0.636916,-1.106924 -0.636915,-1.106924 -0.508881,-0.161512 -0.508879,-0.161512 -0.879319,0.394107 -0.879316,0.394108 -0.773411,0.477454 -0.773412,0.477453 -0.474358,0.45402 -0.474358,0.45402 -0.636141,1.001188 -0.63614,1.001189 -0.563486,0.504029 -0.563486,0.504028 v 0.381191 0.38119 l -0.368696,0.702281 -0.3687,0.702281 -0.79516,1.852083 -0.795163,1.852083 -0.353825,1.058334 -0.353827,1.058333 -0.02856,0.264583 -0.02856,0.264584 -0.305842,0.744828 -0.30584,0.744829 v 0.213177 0.213178 l -0.770327,1.820119 -0.770326,1.820119 -0.596196,1.984375 -0.596196,1.984372 -0.769833,1.6548 -0.769835,1.65479 -1.010189,1.27799 -1.01019,1.27799 -1.264441,0.83753 -1.26444,0.83753 h -0.46819 -0.468191 l -0.156674,0.2535 -0.156675,0.25351 2.853039,1.35434 2.853039,1.35434 1.719791,0.88878 1.719792,0.88877 0.182822,0.0169 0.182824,0.0169 z m 29.789316,-77.703631 0.272442,-0.272445 0.67137,-2.880015 0.67137,-2.880014 -0.11727,-3.836459 -0.11727,-3.836458 -0.46919,-0.926042 -0.46918,-0.926041 -0.697399,-0.751836 -0.6974,-0.751835 -0.981646,-0.504935 -0.981647,-0.504936 h -0.407416 -0.407416 l -0.495273,0.495273 -0.495271,0.495272 -0.555215,1.718574 -0.555212,1.718574 -0.311111,1.953341 -0.311113,1.953341 -0.01371,2.645833 -0.01371,2.645834 0.439549,1.462558 0.43955,1.462559 0.737304,0.68484 0.737306,0.68484 0.529167,0.30736 0.529166,0.30736 1.398374,-0.09605 1.398373,-0.09605 0.272447,-0.272445 z m -6.244193,-16.748099 0.16352,-0.264583 h -0.264583 -0.264584 l -0.16352,0.264583 -0.163521,0.264583 h 0.264584 0.264583 z"
         id="path29" />
      <path
         style="fill:#966a4c;stroke-width:0.264583"
         d="m 82.78484,126.18738 -1.190625,-0.083 -2.778125,-0.27093 -2.778126,-0.27094 -2.645833,-0.52935 -2.645833,-0.52935 -1.852084,-0.54667 -1.852083,-0.54666 -2.513542,-0.93686 -2.513541,-0.93685 -2.577814,-1.28185 -2.577814,-1.28184 -1.465529,-0.93749 -1.46553,-0.93749 -1.660933,-1.70231 -1.660933,-1.70232 -0.737565,-1.35514 -0.737566,-1.35516 0.09591,-2.29823 0.09591,-2.29823 0.722922,-1.07043 0.722922,-1.07043 3.421834,-2.99181 3.421835,-2.991812 1.014931,-1.229426 1.014931,-1.229426 0.672271,-0.926042 0.67227,-0.926041 0.815677,-1.465922 0.815677,-1.465921 0.668963,-2.117643 0.668963,-2.117643 0.29818,-1.644364 0.298179,-1.644361 0.959893,-2.293057 0.959892,-2.293056 1.339472,-2.004018 1.339471,-2.004015 1.600424,-1.5875 1.600422,-1.5875 1.621351,-0.942993 1.621354,-0.942994 1.941261,-0.614018 1.941261,-0.614019 0.39551,-0.190754 0.395509,-0.190754 0.757439,-2.088692 0.757436,-2.088692 0.746022,-2.910417 0.746022,-2.910416 0.315507,-2.645834 0.315508,-2.645833 -0.17272,-5.423958 -0.172723,-5.423958 0.268902,-3.704167 0.268904,-3.704166 0.542858,-3.571875 0.542859,-3.571875 0.425868,-1.719792 0.425868,-1.719791 0.456505,-1.058334 0.456506,-1.058333 1.20809,-1.5875 1.208093,-1.5875 0.876853,-0.683922 0.876851,-0.683923 1.322916,-0.757637 1.322917,-0.757637 3.09096,-0.107134 3.090961,-0.107134 1.293449,1.209872 1.29345,1.209871 0.77497,1.529447 0.77496,1.529447 -0.0145,5.820833 -0.0145,5.820833 -0.8151,2.645834 -0.81509,2.645833 -2.31236,5.953125 -2.312355,5.953125 -0.611245,1.5875 -0.611246,1.5875 -0.973254,2.513541 -0.973251,2.513542 -0.648661,2.248958 -0.64866,2.248958 -0.478721,2.38125 -0.478719,2.38125 -0.182851,1.508371 -0.182851,1.508371 1.018175,1.137462 1.018178,1.137463 0.706498,1.058333 0.706501,1.058333 0.637463,1.455209 0.637464,1.455208 0.312959,1.719791 0.31296,1.719792 0.152448,3.96875 0.152445,3.96875 -0.435168,3.836458 -0.435168,3.836458 -0.313894,1.455209 -0.313891,1.455208 -0.0076,3.571874 -0.0076,3.57188 0.586322,1.86023 0.586319,1.86023 1.074219,1.71164 1.074216,1.71165 0.809058,1.65404 0.80906,1.65405 0.13009,1.52095 0.13008,1.52096 -0.63101,1.19062 -0.631,1.19063 -1.584187,1.07069 -1.584193,1.07069 -2.164112,0.71524 -2.164133,0.71525 -4.308713,-0.0462 -4.308715,-0.0462 z m 9.707763,-4.04656 2.167139,-0.2492 1.070136,-0.54594 1.070139,-0.54595 0.433896,-0.6622 0.433898,-0.66221 -0.171786,-1.07429 -0.171786,-1.07429 -0.757,-1.50125 -0.756996,-1.50124 -0.944592,-2.77813 -0.944589,-2.77812 -0.572733,-3.30729 -0.572733,-3.30729 0.160023,-3.175004 0.160022,-3.175 0.795436,-4.894792 0.795438,-4.894791 0.0024,-2.796249 0.0024,-2.796249 -0.426712,-1.437084 -0.426712,-1.437085 -0.905512,-1.364326 -0.905516,-1.364329 -0.354219,-0.135925 -0.354218,-0.135927 -0.993429,0.706504 -0.993428,0.706504 -2.148771,-0.01296 -2.148774,-0.01297 -1.190625,-0.56656 -1.190625,-0.56656 -0.715957,-0.466868 -0.715958,-0.466868 -1.665293,0.775293 -1.665292,0.77529 -1.455209,0.972685 -1.455208,0.972685 -1.142079,1.14301 -1.142077,1.143014 -1.168995,2.388748 -1.168995,2.388748 -0.901314,3.175 -0.901317,3.175 -0.604007,2.248958 -0.604007,2.248958 -0.681521,1.605101 -0.681521,1.6051 -1.058334,1.809579 -1.058333,1.80957 -2.116667,2.17611 -2.116666,2.17611 -1.568322,0.99583 -1.568323,0.99583 -0.548344,-0.63866 -0.548345,-0.63866 -0.585486,-0.74562 -0.585486,-0.74563 -1.055151,0.88309 -1.05515,0.88308 0.151931,0.66146 0.15193,0.66146 0.758412,1.5875 0.758411,1.5875 0.933175,0.99315 0.933175,0.99315 5.221078,2.61197 5.221078,2.61197 2.513542,0.70809 2.513541,0.7081 1.984375,0.48454 1.984375,0.48454 5.953125,0.31449 5.953125,0.31449 0.529167,0.0772 0.529167,0.0773 1.058333,0.034 1.058333,0.034 2.167139,-0.2492 z m 7.252055,-86.450761 0.272442,-0.272445 0.67137,-2.880015 0.67137,-2.880014 -0.11727,-3.836459 -0.11727,-3.836458 -0.46919,-0.926042 -0.46918,-0.926041 -0.697399,-0.751836 -0.6974,-0.751835 -0.981646,-0.504935 -0.981647,-0.504936 h -0.407416 -0.407416 l -0.495273,0.495273 -0.495271,0.495272 -0.555215,1.718574 -0.555212,1.718574 -0.311111,1.953341 -0.311113,1.953341 -0.01371,2.645833 -0.01371,2.645834 0.439549,1.462558 0.43955,1.462559 0.737304,0.68484 0.737306,0.68484 0.529167,0.30736 0.529166,0.30736 1.398374,-0.09605 1.398373,-0.09605 0.272447,-0.272445 z m -6.244193,-16.748099 0.16352,-0.264583 h -0.264583 -0.264584 l -0.16352,0.264583 -0.163521,0.264583 h 0.264584 0.264583 z"
         id="path27" />
      <path
         style="fill:#b39103;stroke-width:0.264583"
         d="m 82.78484,126.18738 -1.190625,-0.083 -2.778125,-0.27093 -2.778126,-0.27094 -2.645833,-0.52935 -2.645833,-0.52935 -1.852084,-0.54667 -1.852083,-0.54666 -2.513542,-0.93686 -2.513541,-0.93685 -2.577814,-1.28185 -2.577814,-1.28184 -1.465529,-0.93749 -1.46553,-0.93749 -1.660933,-1.70231 -1.660933,-1.70232 -0.737565,-1.35514 -0.737566,-1.35516 0.09591,-2.29823 0.09591,-2.29823 0.722922,-1.07043 0.722922,-1.07043 3.421834,-2.99181 3.421835,-2.991812 1.014931,-1.229426 1.014931,-1.229426 0.672271,-0.926042 0.67227,-0.926041 0.815677,-1.465922 0.815677,-1.465921 0.668963,-2.117643 0.668963,-2.117643 0.29818,-1.644364 0.298179,-1.644361 0.959893,-2.293057 0.959892,-2.293056 1.339472,-2.004018 1.339471,-2.004015 1.600424,-1.5875 1.600422,-1.5875 1.621351,-0.942993 1.621354,-0.942994 1.941261,-0.614018 1.941261,-0.614019 0.39551,-0.190754 0.395509,-0.190754 0.757439,-2.088692 0.757436,-2.088692 0.746022,-2.910417 0.746022,-2.910416 0.315507,-2.645834 0.315508,-2.645833 -0.17272,-5.423958 -0.172723,-5.423958 0.268902,-3.704167 0.268904,-3.704166 0.542858,-3.571875 0.542859,-3.571875 0.425868,-1.719792 0.425868,-1.719791 0.456505,-1.058334 0.456506,-1.058333 1.20809,-1.5875 1.208093,-1.5875 0.876853,-0.683922 0.876851,-0.683923 1.322916,-0.757637 1.322917,-0.757637 3.09096,-0.107134 3.090961,-0.107134 1.293449,1.209872 1.29345,1.209871 0.77497,1.529447 0.77496,1.529447 -0.0145,5.820833 -0.0145,5.820833 -0.8151,2.645834 -0.81509,2.645833 -2.31236,5.953125 -2.312355,5.953125 -0.611245,1.5875 -0.611246,1.5875 -0.973254,2.513541 -0.973251,2.513542 -0.648661,2.248958 -0.64866,2.248958 -0.478721,2.38125 -0.478719,2.38125 -0.182851,1.508371 -0.182851,1.508371 1.018175,1.137462 1.018178,1.137463 0.706498,1.058333 0.706501,1.058333 0.637463,1.455209 0.637464,1.455208 0.312959,1.719791 0.31296,1.719792 0.152448,3.96875 0.152445,3.96875 -0.435168,3.836458 -0.435168,3.836458 -0.313894,1.455209 -0.313891,1.455208 -0.0076,3.571874 -0.0076,3.57188 0.586322,1.86023 0.586319,1.86023 1.074219,1.71164 1.074216,1.71165 0.809058,1.65404 0.80906,1.65405 0.13009,1.52095 0.13008,1.52096 -0.63101,1.19062 -0.631,1.19063 -1.584187,1.07069 -1.584193,1.07069 -2.164112,0.71524 -2.164133,0.71525 -4.308713,-0.0462 -4.308715,-0.0462 z m 9.525,-3.9653 1.190625,-0.10498 0.661458,-0.10407 0.661458,-0.10406 0.132292,-0.0534 0.132292,-0.0534 0.198437,0.0313 0.198438,0.0313 v -0.2802 -0.28019 l 0.264583,0.16352 0.264583,0.16352 v -0.29581 -0.29582 l 0.217387,0.13436 0.217387,0.13435 0.505492,-0.58176 0.505489,-0.58176 -0.06142,-0.19844 -0.06142,-0.19843 h 0.207174 0.207174 l -0.05339,-0.72761 -0.05339,-0.7276 h -0.04116 -0.04116 l -0.119237,-0.64949 -0.11924,-0.64949 -0.645589,-1.10161 -0.645588,-1.10162 0.167126,-0.16712 0.167127,-0.16713 h -0.324294 -0.324295 l 0.15222,-0.2463 0.152223,-0.2463 -0.273214,-0.16886 -0.273214,-0.16885 0.140922,-0.22802 0.140923,-0.22802 -0.273214,-0.16886 -0.273214,-0.16885 0.152222,-0.24631 0.15222,-0.2463 h -0.308504 -0.308507 l 0.152297,-0.39687 0.152294,-0.39688 h -0.284585 -0.284589 l 0.152297,-0.39687 0.152294,-0.39688 h -0.300376 -0.300376 l 0.174093,-0.17409 0.174093,-0.17409 -0.288256,-0.34733 -0.288255,-0.34733 -0.02647,-0.93378 -0.02647,-0.93379 h -0.240829 -0.240829 l 0.161946,-0.64524 0.161947,-0.64525 -0.283591,-0.17527 -0.283594,-0.17527 0.151188,-0.39399 0.151188,-0.39398 -0.194423,-0.30686 -0.194422,-0.30685 -0.11326,-0.79375 -0.11326,-0.79375 0.0113,-2.91042 0.0113,-2.910414 0.107635,-1.059783 0.107635,-1.059784 0.188751,-0.305403 0.188748,-0.305403 -0.16275,-0.424119 -0.162751,-0.424122 0.316043,-0.380809 0.316044,-0.380807 -0.176011,-0.554562 -0.176012,-0.554561 0.316045,-0.380807 0.316042,-0.380809 -0.136199,-0.354928 -0.136197,-0.354931 0.269232,-1.302086 0.269232,-1.302086 0.110183,-0.79375 0.110186,-0.79375 0.0056,-3.042708 0.0056,-3.042708 h -0.03409 -0.03409 l -0.112049,-0.463021 -0.112051,-0.463021 -0.08054,-0.389218 -0.08054,-0.389215 -0.165817,-0.165817 -0.165817,-0.165817 0.129268,-0.336865 0.129267,-0.336868 -0.42885,-0.164562 -0.42885,-0.164566 0.164674,-0.266454 0.164677,-0.266451 H 93.383789 93.10359 v -0.405178 -0.40518 l -0.395357,-0.151712 -0.395353,-0.151712 0.127857,-0.206881 0.12786,-0.20688 -0.393962,-0.326959 -0.393962,-0.326959 -0.0041,0.230836 -0.0041,0.230833 -0.256479,-0.396875 -0.25648,-0.396875 -0.004,0.330729 -0.0041,0.33073 H 90.94161 90.631714 l -0.511526,0.46302 -0.511525,0.463021 -2.485871,0.04831 -2.485869,0.04831 v -0.275052 -0.275053 l -0.396875,0.152296 -0.396875,0.152295 V 75.27429 75.002396 l -0.263414,0.162798 -0.263417,0.162798 -0.705903,-0.742495 -0.705903,-0.742497 0.203256,0.350261 0.203256,0.350263 -0.543254,-0.339267 -0.54325,-0.339265 -1.667248,0.776224 -1.667248,0.776227 -1.455209,0.972685 -1.455208,0.972685 -1.142079,1.14301 -1.142077,1.143014 -1.168995,2.388748 -1.168995,2.388748 -0.901314,3.175 -0.901317,3.175 -0.604007,2.248958 -0.604007,2.248958 -0.681521,1.6051 -0.681521,1.6051 -1.058334,1.809571 -1.058333,1.80958 -2.116667,2.17611 -2.116666,2.17611 -1.527305,0.96959 -1.527305,0.96959 -0.227326,-0.1405 -0.227326,-0.14049 -1.023182,-1.34169 -1.023183,-1.34168 -0.59216,0.74264 -0.59216,0.74264 -0.334194,1.8e-4 -0.334193,1.9e-4 -0.0088,0.87956 -0.0088,0.87956 0.211516,0.13072 0.211516,0.13073 -0.152222,0.2463 -0.152223,0.2463 h 0.308506 0.308506 l -0.152295,0.39687 -0.152296,0.39688 h 0.271895 0.271894 l -0.163521,0.26458 -0.163522,0.26458 h 0.280198 0.280199 v 0.39688 0.39687 h 0.264583 0.264583 l -0.06615,0.20757 -0.06614,0.20757 0.926041,0.87328 0.926042,0.87328 -0.371609,-0.19569 -0.37161,-0.19568 0.188787,0.30546 0.188787,0.30546 h 0.38126 0.38126 v 0.2802 0.2802 l 0.264583,-0.16352 0.264584,-0.16352 v 0.29581 0.29581 l 0.264583,-0.16352 0.264583,-0.16352 v 0.29581 0.29582 l 0.243253,-0.15034 0.243253,-0.15034 0.386707,0.38671 0.386708,0.3867 0.163789,-0.16379 0.163791,-0.16378 v 0.32429 0.3243 l 0.264583,-0.16352 0.264584,-0.16353 v 0.2802 0.2802 l 0.198437,-0.0524 0.198438,-0.0524 0.595312,0.20254 0.595313,0.20254 v 0.26237 0.26237 l 0.264583,-0.16352 0.264583,-0.16352 v 0.29581 0.29581 l 0.264584,-0.16352 0.264583,-0.16352 v 0.29581 0.29582 l 0.264583,-0.16352 0.264584,-0.16353 v 0.29582 0.29581 l 0.243252,-0.15034 0.243253,-0.15034 0.35836,0.33316 0.358359,0.33317 0.388071,0.0874 0.388072,0.0874 0.19689,0.30951 0.19689,0.30952 0.004,-0.20524 0.0041,-0.20523 0.859896,0.45873 0.859896,0.45872 0.176389,0.0111 0.176389,0.0111 0.180207,0.18021 0.180207,0.18021 0.371008,-0.14237 0.37101,-0.14236 v 0.31072 0.31072 l 0.529166,-0.16795 0.529167,-0.16795 v 0.31072 0.31072 l 0.388401,-0.14905 0.388403,-0.14904 0.159046,0.25735 0.159049,0.25734 0.218763,-0.1352 0.218762,-0.13521 0.721916,0.37454 0.721916,0.37453 0.363955,-0.13966 0.363956,-0.13967 v 0.31073 0.31072 l 0.529166,-0.16795 0.529167,-0.16796 v 0.21627 0.21627 l 0.595313,0.0451 0.595312,0.0451 2.38125,0.14997 2.38125,0.14998 1.984375,0.14976 1.984375,0.14975 2.089145,0.009 2.089145,0.009 0.556688,0.23854 0.556689,0.23854 1.058333,-0.16255 1.058334,-0.16254 1.190625,-0.10499 z m -36.777084,-17.68741 0.621408,-0.66146 h -0.132292 -0.132291 l -0.621408,0.66146 -0.621408,0.66145 h 0.132292 0.132291 z m 2.38125,-2.11667 0.621408,-0.66146 h -0.132292 -0.132291 l -0.621408,0.66146 -0.621408,0.66146 h 0.132292 0.132291 z m 2.513542,-2.24896 0.478889,-0.529166 h -0.132292 -0.132291 l -0.47889,0.529166 -0.478889,0.52917 h 0.132292 0.132292 z m 1.488957,-1.785937 0.363126,-0.46302 -0.463021,0.363124 -0.463021,0.363128 v 0.09989 0.0999 h 0.0999 0.09989 z m 9.260418,-21.166666 0.363125,-0.46302 -0.463021,0.363124 -0.463021,0.363128 v 0.09989 0.0999 h 0.0999 0.09989 z m 1.156875,-1.389062 0.47889,-0.529167 h -0.132291 -0.132292 l -0.478891,0.529167 -0.47889,0.529167 h 0.132292 0.132291 z m 1.322916,-1.322917 0.478891,-0.529166 h -0.132292 -0.132291 l -0.478891,0.529166 -0.47889,0.529167 h 0.132291 0.132292 z m 14.605215,-2.922468 0.793551,-0.276633 0.173874,-3.252382 0.173871,-3.252383 0.553188,-2.187564 0.553188,-2.187562 2.771431,-6.784983 2.771431,-6.784982 1.397223,-3.571875 1.397219,-3.571875 0.688086,-2.116667 0.688079,-2.116666 0.60745,-2.513542 0.60744,-2.513541 -0.0108,-3.836459 -0.0108,-3.836458 -0.33106,-1.127953 -0.33105,-1.127953 -0.824948,-0.93956 -0.824944,-0.93956 -1.304809,-0.661196 -1.304809,-0.661197 -1.32579,0.284332 -1.325792,0.284331 -1.113965,0.799989 -1.113965,0.799988 -0.950891,1.273683 -0.950894,1.273683 -0.653367,1.296748 -0.653368,1.296748 -0.677412,1.887281 -0.677413,1.88728 -0.279747,2.08147 -0.279749,2.081469 -0.216548,10.054167 -0.216551,10.054166 -0.05171,1.852083 -0.05171,1.852083 -0.280887,2.091973 -0.280884,2.091974 -0.897494,3.464276 -0.89749,3.464277 -0.266851,0.896424 -0.266851,0.896422 0.557835,0.783407 0.557834,0.783408 0.823235,0.501994 0.823235,0.501991 0.820415,0.0011 0.820412,0.0011 0.793554,-0.276636 z"
         id="path25" />
      <path
         style="fill:#100a05;stroke-width:0.264583"
         d="m 82.78484,126.18738 -1.190625,-0.083 -2.778125,-0.27093 -2.778126,-0.27094 -2.645833,-0.52935 -2.645833,-0.52935 -1.852084,-0.54667 -1.852083,-0.54666 -2.513542,-0.93686 -2.513541,-0.93685 -2.577814,-1.28185 -2.577814,-1.28184 -1.465529,-0.93749 -1.46553,-0.93749 -1.660933,-1.70231 -1.660933,-1.70232 -0.737565,-1.35514 -0.737566,-1.35516 0.09591,-2.29823 0.09591,-2.29823 0.722922,-1.07043 0.722922,-1.07043 3.421834,-2.99181 3.421835,-2.991812 1.014931,-1.229426 1.014931,-1.229426 0.672271,-0.926042 0.67227,-0.926041 0.815677,-1.465922 0.815677,-1.465921 0.668963,-2.117643 0.668963,-2.117643 0.29818,-1.644364 0.298179,-1.644361 0.959893,-2.293057 0.959892,-2.293056 1.339472,-2.004018 1.339471,-2.004015 1.600424,-1.5875 1.600422,-1.5875 1.621351,-0.942993 1.621354,-0.942994 1.941261,-0.614018 1.941261,-0.614019 0.39551,-0.190754 0.395509,-0.190754 0.757439,-2.088692 0.757436,-2.088692 0.746022,-2.910417 0.746022,-2.910416 0.315507,-2.645834 0.315508,-2.645833 -0.17272,-5.423958 -0.172723,-5.423958 0.268902,-3.704167 0.268904,-3.704166 0.542858,-3.571875 0.542859,-3.571875 0.425868,-1.719792 0.425868,-1.719791 0.456505,-1.058334 0.456506,-1.058333 1.20809,-1.5875 1.208093,-1.5875 0.876853,-0.683922 0.876851,-0.683923 1.322916,-0.757637 1.322917,-0.757637 3.09096,-0.107134 3.090961,-0.107134 1.293449,1.209872 1.29345,1.209871 0.77497,1.529447 0.77496,1.529447 -0.0145,5.820833 -0.0145,5.820833 -0.8151,2.645834 -0.81509,2.645833 -2.31236,5.953125 -2.312355,5.953125 -0.611245,1.5875 -0.611246,1.5875 -0.973254,2.513541 -0.973251,2.513542 -0.648661,2.248958 -0.64866,2.248958 -0.478721,2.38125 -0.478719,2.38125 -0.182851,1.508371 -0.182851,1.508371 1.018175,1.137462 1.018178,1.137463 0.706498,1.058333 0.706501,1.058333 0.637463,1.455209 0.637464,1.455208 0.312959,1.719791 0.31296,1.719792 0.152448,3.96875 0.152445,3.96875 -0.435168,3.836458 -0.435168,3.836458 -0.313894,1.455209 -0.313891,1.455208 -0.0076,3.571874 -0.0076,3.57188 0.586322,1.86023 0.586319,1.86023 1.074219,1.71164 1.074216,1.71165 0.809058,1.65404 0.80906,1.65405 0.13009,1.52095 0.13008,1.52096 -0.63101,1.19062 -0.631,1.19063 -1.584187,1.07069 -1.584193,1.07069 -2.164112,0.71524 -2.164133,0.71525 -4.308713,-0.0462 -4.308715,-0.0462 z m 9.179769,-3.79427 2.432894,-0.25633 1.073822,-0.42966 1.073819,-0.42966 0.660472,-0.78493 0.660474,-0.78492 -0.0063,-0.57502 -0.0063,-0.57501 -0.675653,-1.5875 -0.67565,-1.5875 -1.041139,-2.77812 -1.041138,-2.77813 -0.657156,-3.30729 -0.657156,-3.30729 -0.0011,-2.801 -0.0011,-2.801008 0.827852,-5.401079 0.827853,-5.40108 0.127471,-2.844639 0.127471,-2.844638 -0.473967,-1.78557 -0.473967,-1.78557 -1.003911,-1.497102 -1.003914,-1.497102 -0.337338,-0.12278 -0.337341,-0.122783 -0.877195,0.654354 -0.877191,0.654355 -1.577182,0.143015 -1.577183,0.143013 -1.681012,-0.455028 -1.681012,-0.455031 -1.316942,-1.235995 -1.31694,-1.235999 -0.280686,-0.523692 -0.280686,-0.523695 -1.278443,0.339212 -1.278445,0.339214 -1.40725,0.641188 -1.40725,0.641192 -1.671836,1.671838 -1.671839,1.671836 -1.184089,1.840204 -1.184089,1.840203 -0.532087,1.214938 -0.532088,1.21494 -1.468197,4.34826 -1.468197,4.348258 -0.946435,2.152581 -0.946385,2.152581 v 0.309173 0.309174 l -0.968958,1.459799 -0.968958,1.459799 -2.758536,2.490864 -2.758536,2.49086 -1.711285,1.38585 -1.711284,1.38584 0.124232,1.00931 0.124233,1.00932 0.694607,1.37286 0.694606,1.37287 1.024317,1.10933 1.024317,1.10932 5.383446,2.64379 5.383446,2.64378 3.040823,0.84094 3.040822,0.84094 0.926042,0.24542 0.926041,0.24542 7.276042,0.48001 7.276042,0.48 0.264583,0.0328 0.264584,0.0328 z m -3.70268,-50.81112 0.793551,-0.276633 0.173874,-3.252382 0.173871,-3.252383 0.553188,-2.187564 0.553188,-2.187562 2.771431,-6.784983 2.771431,-6.784982 1.397223,-3.571875 1.397219,-3.571875 0.688086,-2.116667 0.688079,-2.116666 0.60745,-2.513542 0.60744,-2.513541 -0.0108,-3.836459 -0.0108,-3.836458 -0.33106,-1.127953 -0.33105,-1.127953 -0.824948,-0.93956 -0.824944,-0.93956 -1.304809,-0.661196 -1.304809,-0.661197 -1.32579,0.284332 -1.325792,0.284331 -1.113965,0.799989 -1.113965,0.799988 -0.950891,1.273683 -0.950894,1.273683 -0.653367,1.296748 -0.653368,1.296748 -0.677412,1.887281 -0.677413,1.88728 -0.279747,2.08147 -0.279749,2.081469 -0.216548,10.054167 -0.216551,10.054166 -0.05171,1.852083 -0.05171,1.852083 -0.280887,2.091973 -0.280884,2.091974 -0.897494,3.464276 -0.89749,3.464277 -0.266851,0.896424 -0.266851,0.896422 0.557835,0.783407 0.557834,0.783408 0.823235,0.501994 0.823235,0.501991 0.820415,0.0011 0.820412,0.0011 0.793554,-0.276636 z"
         id="path23" />
    </g>
    <path
       style="fill:#ffffff;stroke-width:0.195153"
       d="m 44.982752,61.784089 c -2.490617,-0.453705 -4.373665,-1.283518 -5.838418,-2.572846 -1.156767,-1.018229 -1.187085,-1.069979 -1.186979,-2.026058 1.05e-4,-0.958181 0.02896,-1.006944 1.233266,-2.083894 1.166561,-1.043199 1.396862,-1.155758 4.264411,-2.084222 l 3.031254,-0.981467 3.492809,-0.136513 3.492809,-0.136513 3.091536,1.002484 c 3.34324,1.084105 3.351103,1.087998 4.690492,2.322603 l 0.904335,0.833588 -0.22798,1.380466 -0.227977,1.380465 -1.632267,1.052989 c -0.987378,0.636967 -2.408671,1.323239 -3.597418,1.737014 l -1.965153,0.684025 -3.835384,-0.0172 c -2.726664,-0.01223 -4.371317,-0.114826 -5.689336,-0.354924 z"
       id="path209"
       transform="scale(0.26458333)" />
    <path
       style="fill:#ffffff;stroke-width:0.195153"
       d="m 44.885175,61.779196 c -2.407763,-0.46287 -4.313467,-1.310589 -5.74468,-2.55542 -1.165436,-1.013664 -1.183249,-1.044517 -1.183249,-2.0494 0,-1.007574 0.01515,-1.033493 1.219706,-2.08732 1.128177,-0.987002 1.446697,-1.141986 4.244576,-2.065304 l 3.024871,-0.998226 3.512753,-0.13053 3.512752,-0.130531 3.202177,1.019299 c 3.017545,0.960529 3.265092,1.077171 4.293365,2.022994 0.600154,0.552032 1.122127,1.021188 1.159944,1.042568 0.03782,0.02138 -0.04437,0.671863 -0.182626,1.445516 l -0.251381,1.406641 -1.573752,1.025656 c -0.96943,0.631804 -2.349124,1.295496 -3.592955,1.728364 l -2.019204,0.702707 -3.93296,-0.01968 C 47.722745,62.12226 46.158714,62.024025 44.885175,61.7792 Z"
       id="path248"
       transform="scale(0.26458333)" />
    <path
       style="fill:#ffffff;stroke-width:0.195153"
       d="m 44.885175,61.779862 c -2.448511,-0.471325 -4.20883,-1.244376 -5.684725,-2.496468 -1.241312,-1.05308 -1.243204,-1.056274 -1.243204,-2.099303 0,-1.037954 0.0078,-1.051395 1.219706,-2.107191 1.125376,-0.980396 1.453643,-1.139726 4.244576,-2.060176 l 3.024871,-0.997603 3.527858,-0.131429 3.527857,-0.13143 3.162605,1.01192 c 2.94045,0.940838 3.240972,1.082019 4.27826,2.009851 0.61361,0.548862 1.146594,1.022734 1.184411,1.053049 0.03782,0.03031 -0.04437,0.688107 -0.182626,1.46176 l -0.251381,1.406641 -1.624496,1.0589 c -1.056597,0.688725 -2.319443,1.292935 -3.612413,1.728364 l -1.987917,0.669463 -3.913503,-0.01913 c -2.838289,-0.01387 -4.396057,-0.112016 -5.669879,-0.357221 z"
       id="path287"
       transform="scale(0.26458333)" />
    <path
       style="fill:#ffffff;stroke-width:0.195153"
       d="m 59.277704,27.594747 -0.8294,-0.58745 v -1.943706 -1.943705 l 0.617894,-0.375764 c 0.966368,-0.587683 2.057916,-0.705735 2.53482,-0.274143 0.546435,0.494517 0.760528,0.940505 1.057793,2.203546 l 0.255753,1.086663 -1.202939,1.219705 c -0.661617,0.670839 -1.293295,1.215791 -1.40373,1.211005 -0.110435,-0.0048 -0.574021,-0.273054 -1.030191,-0.596151 z"
       id="path326"
       transform="scale(0.26458333)" />
    <path
       style="fill:#ffffff;stroke-width:0.195153"
       d="m 59.267362,27.597258 -0.819058,-0.602342 v -1.937515 -1.937515 l 0.617894,-0.375764 c 0.966368,-0.587683 2.057916,-0.705735 2.53482,-0.274143 0.550813,0.498478 0.781021,0.974389 1.072347,2.216867 l 0.251668,1.073342 -1.208174,1.219705 c -0.664495,0.670839 -1.303184,1.219706 -1.419307,1.219706 -0.116123,0 -0.579709,-0.271054 -1.03019,-0.602341 z"
       id="path365"
       transform="scale(0.26458333)" />
    <path
       style="fill:#ffffff;stroke-width:0.195153"
       d="M 59.258196,27.612916 58.448304,27.026233 V 25.07306 23.119886 l 0.617894,-0.375764 c 0.966368,-0.587683 2.057916,-0.705735 2.53482,-0.274143 0.550813,0.498478 0.781021,0.974389 1.072347,2.216867 l 0.251668,1.073342 -1.208174,1.219705 c -0.664495,0.670839 -1.307308,1.219706 -1.428472,1.219706 -0.121164,0 -0.58475,-0.264007 -1.030191,-0.586683 z"
       id="path404"
       transform="scale(0.26458333)" />
    <path
       style="fill:#ffffff;stroke-width:0.195153"
       d="M 57.027337,17.314164 55.911316,16.186376 V 14.57365 c 0,-1.583063 0.01457,-1.632029 0.792314,-2.662139 l 0.792314,-1.049412 1.403157,-0.06757 1.403156,-0.06757 1.317282,1.145454 c 1.296073,1.127012 1.317283,1.161078 1.317283,2.115791 0,0.787956 -0.151395,1.225171 -0.805476,2.326154 -1.029257,1.732495 -1.574976,2.127596 -2.938665,2.127596 -1.019202,0 -1.081361,-0.03237 -2.165344,-1.127788 z"
       id="path443"
       transform="scale(0.26458333)" />
    <path
       style="fill:#ffffff;stroke-width:0.195153"
       d="M 57.027337,17.314164 55.911316,16.186376 V 14.57369 c 0,-1.571569 0.01963,-1.639263 0.770058,-2.655075 l 0.770059,-1.04239 1.425412,-0.08978 1.425412,-0.08978 1.268494,1.112714 c 1.219804,1.070003 1.270755,1.151145 1.327399,2.113909 0.05181,0.880518 -0.0394,1.166665 -0.756688,2.37404 -1.039505,1.749747 -1.582448,2.144625 -2.948781,2.144625 -1.019202,0 -1.081361,-0.03237 -2.165344,-1.127788 z"
       id="path482"
       transform="scale(0.26458333)" />
    <path
       style="fill:#ffffff;stroke-width:0.195153"
       d="m 57.027337,17.314164 -1.116021,-1.127788 v -1.635408 c 0,-1.601744 0.01585,-1.656397 0.769848,-2.655063 l 0.769847,-1.019656 1.425623,-0.08979 1.425623,-0.08979 1.268494,1.112714 c 1.219804,1.070003 1.270755,1.151145 1.327399,2.113909 0.05181,0.880518 -0.0394,1.166665 -0.756688,2.37404 -1.039505,1.749747 -1.582448,2.144625 -2.948781,2.144625 -1.019202,0 -1.081361,-0.03237 -2.165344,-1.127788 z"
       id="path521"
       transform="scale(0.26458333)" />
  </g>
</svg>
