<?xml version="1.0" encoding="UTF-8" standalone="no"?>
<!-- Created with Inkscape (http://www.inkscape.org/) -->

<svg
   xmlns:dc="http://purl.org/dc/elements/1.1/"
   xmlns:cc="http://creativecommons.org/ns#"
   xmlns:rdf="http://www.w3.org/1999/02/22-rdf-syntax-ns#"
   xmlns:svg="http://www.w3.org/2000/svg"
   xmlns="http://www.w3.org/2000/svg"
   xmlns:sodipodi="http://sodipodi.sourceforge.net/DTD/sodipodi-0.dtd"
   xmlns:inkscape="http://www.inkscape.org/namespaces/inkscape"
   version="1.1"
   id="svg2"
   width="20"
   height="20"
   viewBox="0 0 20 20"
   sodipodi:docname="xylophone.svg"
   inkscape:version="0.92.4 (5da689c313, 2019-01-14)">
  <metadata
     id="metadata8">
    <rdf:RDF>
      <cc:Work
         rdf:about="">
        <dc:format>image/svg+xml</dc:format>
        <dc:type
           rdf:resource="http://purl.org/dc/dcmitype/StillImage" />
        <dc:title></dc:title>
      </cc:Work>
    </rdf:RDF>
  </metadata>
  <defs
     id="defs6" />
  <sodipodi:namedview
     pagecolor="#ffffff"
     bordercolor="#666666"
     borderopacity="1"
     objecttolerance="10"
     gridtolerance="10"
     guidetolerance="10"
     inkscape:pageopacity="0"
     inkscape:pageshadow="2"
     inkscape:window-width="1920"
     inkscape:window-height="1001"
     id="namedview4"
     showgrid="false"
     inkscape:zoom="10.429825"
     inkscape:cx="-9.0837595"
     inkscape:cy="13.609884"
     inkscape:window-x="1671"
     inkscape:window-y="-9"
     inkscape:window-maximized="1"
     inkscape:current-layer="svg2" />
  <g
     id="g12"
     transform="matrix(0.61351474,-0.0958063,0.0958063,0.61351474,-76.992179,-221.39244)">
    <path
       style="fill:#fbc37b;stroke-width:0.1013482"
       d="m 57.516399,389.12698 v -17.12784 h 2.519588 2.519588 l 0.06391,0.53208 c 0.03515,0.29264 0.06431,0.99954 0.06479,1.57089 l 8.81e-4,1.03882 2.356346,0.0101 c 1.29599,0.006 2.744002,0.0397 3.217805,0.076 l 0.861459,0.066 0.03176,0.32938 0.03176,0.32938 2.349925,0.0101 c 1.292458,0.006 2.73758,0.0397 3.211383,0.076 l 0.86146,0.0659 0.03176,0.32938 0.03176,0.32938 2.349924,0.0101 c 1.292458,0.006 2.737581,0.0397 3.211384,0.076 l 0.86146,0.066 0.03176,0.32938 0.03176,0.32938 2.349925,0.0101 c 1.292458,0.006 2.737581,0.0397 3.211383,0.076 l 0.86146,0.0659 0.03176,0.32938 0.03176,0.32939 2.349924,0.01 c 1.292458,0.006 2.737581,0.0397 3.211384,0.076 l 0.86146,0.0659 0.03176,0.32938 0.03176,0.32938 h 2.98335 2.983352 l 10e-4,-0.53208 c 0.003,-1.05597 -0.12667,-0.98814 1.88538,-0.98814 h 1.76177 v 11.45234 11.45235 h -1.76177 c -2.01205,0 -1.88263,0.0678 -1.88538,-0.98814 l -10e-4,-0.53208 h -2.983347 -2.98335 l -0.03176,0.32938 -0.03176,0.32938 -0.86146,0.066 c -0.473803,0.0363 -1.918926,0.0705 -3.211384,0.076 l -2.349924,0.0101 -0.03176,0.32939 -0.03176,0.32938 -0.86146,0.066 c -0.473802,0.0363 -1.918925,0.0705 -3.211383,0.076 l -2.349925,0.0101 -0.03176,0.32938 -0.03176,0.32938 -0.86146,0.0659 c -0.473803,0.0363 -1.918926,0.0705 -3.211384,0.076 l -2.349924,0.01 -0.03176,0.32939 -0.03176,0.32938 -0.86146,0.0659 c -0.473803,0.0363 -1.918925,0.0705 -3.211383,0.076 l -2.349925,0.0101 -0.03176,0.32938 -0.03176,0.32938 -0.861459,0.066 c -0.473803,0.0363 -1.921815,0.0705 -3.217805,0.076 l -2.356346,0.0101 -8.82e-4,1.03881 c -4.86e-4,0.57136 -0.02964,1.27826 -0.06479,1.5709 l -0.06391,0.53201 h -2.519588 -2.519588 z m 8.67651,11.11367 c 0.378592,-0.32565 0.378592,-0.82126 0,-1.14691 -0.151751,-0.13053 -0.368091,-0.23733 -0.480754,-0.23733 -0.271196,0 -0.797338,0.53502 -0.797338,0.81079 0,0.27577 0.526142,0.81078 0.797338,0.81078 0.112663,0 0.329003,-0.1068 0.480754,-0.23733 z m 6.362079,-0.68795 c 0.358592,-0.16338 0.526538,-0.61357 0.369938,-0.99164 -0.318276,-0.76839 -1.523824,-0.5517 -1.523824,0.27389 0,0.63158 0.567815,0.98478 1.153886,0.71775 z m 6.486284,-0.81078 c 0.358592,-0.16339 0.526538,-0.61358 0.369938,-0.99164 -0.318276,-0.76839 -1.523824,-0.55171 -1.523824,0.27389 0,0.63158 0.567816,0.98478 1.153886,0.71775 z m 6.692154,-1.0011 c 0.414085,-0.40646 0.15035,-1.11852 -0.470407,-1.27005 -0.222617,-0.0543 -0.3356,-0.008 -0.582753,0.23919 -0.168627,0.16862 -0.306595,0.40482 -0.306595,0.52488 0,0.12006 0.137968,0.35626 0.306595,0.52488 0.247153,0.24716 0.360136,0.29353 0.582753,0.23919 0.151886,-0.0371 0.363569,-0.15322 0.470407,-0.25809 z m 6.486285,-0.81499 c 0.41563,-0.39899 0.149749,-1.11446 -0.470408,-1.26584 -0.222616,-0.0543 -0.335599,-0.008 -0.582752,0.23918 -0.345103,0.3451 -0.381337,0.57577 -0.143729,0.915 0.309706,0.44217 0.804512,0.48833 1.196889,0.11166 z m 6.280415,-0.61627 c 0.774263,-0.35278 0.426672,-1.50708 -0.453824,-1.50708 -0.312473,0 -0.700062,0.4489 -0.700062,0.81079 0,0.36189 0.387589,0.81078 0.700062,0.81078 0.111393,0 0.315614,-0.0515 0.453824,-0.11449 z m 0,-12.97257 c 0.774263,-0.35278 0.426672,-1.50708 -0.453824,-1.50708 -0.312473,0 -0.700062,0.4489 -0.700062,0.81079 0,0.36189 0.387589,0.81079 0.700062,0.81079 0.111393,0 0.315614,-0.0515 0.453824,-0.1145 z m -6.280415,-1.0053 c 0.41563,-0.39899 0.149749,-1.11446 -0.470408,-1.26584 -0.222616,-0.0543 -0.335599,-0.008 -0.582752,0.23918 -0.345103,0.3451 -0.381337,0.57577 -0.143729,0.915 0.309706,0.44217 0.804512,0.48833 1.196889,0.11166 z m -6.486285,-0.80658 c 0.414085,-0.40646 0.15035,-1.11852 -0.470407,-1.27005 -0.222617,-0.0543 -0.3356,-0.008 -0.582753,0.23919 -0.168627,0.16862 -0.306595,0.40482 -0.306595,0.52488 0,0.12006 0.137968,0.35626 0.306595,0.52488 0.247153,0.24716 0.360136,0.29353 0.582753,0.23919 0.151886,-0.0371 0.363569,-0.15322 0.470407,-0.25809 z m -6.692154,-0.62048 c 0.358592,-0.16338 0.526538,-0.61357 0.369938,-0.99164 -0.318276,-0.76838 -1.523824,-0.5517 -1.523824,0.27389 0,0.63159 0.567816,0.98479 1.153886,0.71775 z m -6.486284,-0.81078 c 0.358592,-0.16339 0.526538,-0.61358 0.369938,-0.99164 -0.318276,-0.76839 -1.523824,-0.55171 -1.523824,0.27389 0,0.63158 0.567815,0.98478 1.153886,0.71775 z m -6.362079,-0.93362 c 0.378592,-0.32565 0.378592,-0.82126 0,-1.14691 -0.151751,-0.13053 -0.368091,-0.23733 -0.480754,-0.23733 -0.271196,0 -0.797338,0.53501 -0.797338,0.81078 0,0.27577 0.526142,0.81079 0.797338,0.81079 0.112663,0 0.329003,-0.1068 0.480754,-0.23733 z"
       id="path26"
       inkscape:connector-curvature="0" />
    <path
       style="fill:#3dc4d4;stroke-width:0.1013482"
       d="m 57.516399,389.12698 v -17.12784 h 2.518303 2.518304 l 0.06608,1.07992 c 0.03634,0.59396 0.06608,1.30086 0.06608,1.5709 v 0.49097 h 1.047815 c 0.576298,0 2.012199,0.03 3.19089,0.0668 l 2.143075,0.0667 0.06353,0.33865 0.06353,0.33865 h 1.036535 c 0.570095,0 2.000921,0.03 3.179611,0.0667 l 2.143076,0.0667 0.06353,0.33865 0.06353,0.33865 h 1.036536 c 0.570095,0 2.00092,0.03 3.179611,0.0667 l 2.143075,0.0667 0.06353,0.33865 0.06353,0.33865 h 1.036535 c 0.570095,0 2.000921,0.03 3.179611,0.0667 l 2.143076,0.0667 0.06353,0.33866 0.06353,0.33865 h 1.036536 c 0.570095,0 2.00092,0.03 3.179611,0.0667 l 2.143076,0.0667 0.06353,0.33865 0.06353,0.33865 h 2.966585 2.96658 l 0.0712,-0.76011 0.0712,-0.76011 h 1.76495 1.76495 v 11.45234 11.45235 h -1.76495 -1.76495 l -0.0712,-0.76011 -0.0712,-0.76011 h -2.96658 -2.966585 l -0.06353,0.33865 -0.06353,0.33865 -2.143076,0.0667 c -1.178691,0.0367 -2.609516,0.0667 -3.179611,0.0667 h -1.036536 l -0.06353,0.33865 -0.06353,0.33866 -2.143076,0.0667 c -1.17869,0.0367 -2.609516,0.0667 -3.179611,0.0667 h -1.036536 l -0.06353,0.33865 -0.06353,0.33865 -2.143075,0.0667 c -1.178691,0.0367 -2.609516,0.0667 -3.179611,0.0667 h -1.036536 l -0.06353,0.33866 -0.06353,0.33865 -2.143076,0.0667 c -1.17869,0.0367 -2.609516,0.0667 -3.179611,0.0667 h -1.036535 l -0.06353,0.33865 -0.06353,0.33865 -2.143075,0.0667 c -1.178691,0.0367 -2.614592,0.0668 -3.19089,0.0668 h -1.047815 v 0.49097 c 0,0.27004 -0.02973,0.97694 -0.06608,1.5709 l -0.06608,1.08055 h -2.518304 -2.518303 z m 4.690556,15.17915 c 0.03658,-0.95177 0.100746,-1.55712 0.16741,-1.57935 0.152597,-0.0509 0.152597,-27.14873 0,-27.19959 -0.06666,-0.0222 -0.130831,-0.62758 -0.16741,-1.57935 l -0.05931,-1.54331 H 60.03472 57.921795 v 16.72245 16.72246 h 2.112925 2.112925 z m 4.080669,-4.07691 c 0.502708,-0.50271 0.146491,-1.37281 -0.562021,-1.37281 -0.416652,0 -0.810786,0.39413 -0.810786,0.81079 0,0.41665 0.394134,0.81078 0.810786,0.81078 0.197464,0 0.405212,-0.0919 0.562021,-0.24876 z m 38.051646,-11.10224 v -11.04695 h -1.35365 -1.35365 l -0.0906,0.73478 c -0.0498,0.40412 -0.0906,5.0446 -0.0906,10.31217 0,5.26758 0.0408,9.90806 0.0906,10.31218 l 0.0906,0.73478 h 1.35365 1.35365 z M 72.554988,399.5527 c 0.358592,-0.16338 0.526538,-0.61357 0.369938,-0.99164 -0.318276,-0.76839 -1.523824,-0.5517 -1.523824,0.27389 0,0.63158 0.567815,0.98478 1.153886,0.71775 z m 6.486284,-0.81078 c 0.358592,-0.16339 0.526538,-0.61358 0.369938,-0.99164 -0.318276,-0.76839 -1.523824,-0.55171 -1.523824,0.27389 0,0.63158 0.567816,0.98478 1.153886,0.71775 z m 6.705206,-0.94506 c 0.15681,-0.15681 0.248764,-0.36456 0.248764,-0.56202 0,-0.19746 -0.09195,-0.40521 -0.248764,-0.56202 -0.156809,-0.15681 -0.364558,-0.24877 -0.562022,-0.24877 -0.197463,0 -0.405212,0.092 -0.562021,0.24877 -0.15681,0.15681 -0.248764,0.36456 -0.248764,0.56202 0,0.19746 0.09195,0.40521 0.248764,0.56202 0.156809,0.15681 0.364558,0.24877 0.562021,0.24877 0.197464,0 0.405213,-0.092 0.562022,-0.24877 z m 6.486284,-0.81078 c 0.15681,-0.15681 0.248765,-0.36456 0.248765,-0.56203 0,-0.19746 -0.09195,-0.40521 -0.248765,-0.56202 -0.156809,-0.15681 -0.364557,-0.24876 -0.562021,-0.24876 -0.197464,0 -0.405212,0.092 -0.562021,0.24876 -0.15681,0.15681 -0.248765,0.36456 -0.248765,0.56202 0,0.19747 0.09195,0.40522 0.248765,0.56203 0.156809,0.15681 0.364557,0.24876 0.562021,0.24876 0.197464,0 0.405212,-0.0919 0.562021,-0.24876 z m 6.267364,-0.67652 c 0.774263,-0.35278 0.426672,-1.50708 -0.453824,-1.50708 -0.312473,0 -0.700062,0.4489 -0.700062,0.81079 0,0.36189 0.387589,0.81078 0.700062,0.81078 0.111393,0 0.315614,-0.0515 0.453824,-0.11449 z m 0,-12.97257 c 0.774263,-0.35278 0.426672,-1.50708 -0.453824,-1.50708 -0.312473,0 -0.700062,0.4489 -0.700062,0.81079 0,0.36189 0.387589,0.81079 0.700062,0.81079 0.111393,0 0.315614,-0.0515 0.453824,-0.1145 z m -6.267364,-0.94505 c 0.502708,-0.50271 0.146491,-1.37281 -0.562021,-1.37281 -0.416653,0 -0.810786,0.39413 -0.810786,0.81078 0,0.41666 0.394133,0.81079 0.810786,0.81079 0.197464,0 0.405212,-0.0919 0.562021,-0.24876 z m -6.486284,-0.81079 c 0.502707,-0.50271 0.146491,-1.37281 -0.562022,-1.37281 -0.416652,0 -0.810785,0.39414 -0.810785,0.81079 0,0.41665 0.394133,0.81078 0.810785,0.81078 0.197464,0 0.405213,-0.0919 0.562022,-0.24876 z m -6.705206,-0.67652 c 0.358592,-0.16338 0.526538,-0.61357 0.369938,-0.99164 -0.318276,-0.76838 -1.523824,-0.5517 -1.523824,0.27389 0,0.63159 0.567816,0.98479 1.153886,0.71775 z m -6.486284,-0.81078 c 0.358592,-0.16339 0.526538,-0.61358 0.369938,-0.99164 -0.318276,-0.76839 -1.523824,-0.55171 -1.523824,0.27389 0,0.63158 0.567815,0.98478 1.153886,0.71775 z m -6.267364,-0.94506 c 0.15681,-0.15681 0.248764,-0.36455 0.248764,-0.56202 0,-0.19746 -0.09195,-0.40521 -0.248764,-0.56202 -0.156809,-0.15681 -0.364557,-0.24876 -0.562021,-0.24876 -0.197464,0 -0.405213,0.0919 -0.562022,0.24876 -0.15681,0.15681 -0.248764,0.36456 -0.248764,0.56202 0,0.19747 0.09195,0.40521 0.248764,0.56202 0.156809,0.15681 0.364558,0.24877 0.562022,0.24877 0.197464,0 0.405212,-0.092 0.562021,-0.24877 z"
       id="path24"
       inkscape:connector-curvature="0" />
    <path
       style="fill:#fd9f08;stroke-width:0.1013482"
       d="m 57.516399,389.12698 v -17.12784 h 2.523034 2.523035 l 0.07362,1.5709 0.07362,1.57089 h 0.883477 c 0.485913,0 1.913267,0.03 3.171899,0.0666 l 2.288422,0.0666 0.06356,0.3388 0.06356,0.33879 h 0.891163 c 0.490139,0 1.920951,0.03 3.179583,0.0666 l 2.288422,0.0666 0.06356,0.33879 0.06356,0.33879 h 0.891163 c 0.490139,0 1.920952,0.03 3.179584,0.0666 l 2.288422,0.0666 0.06356,0.3388 0.06356,0.33879 h 0.891163 c 0.490139,0 1.920951,0.03 3.179583,0.0666 l 2.288422,0.0666 0.06356,0.33879 0.06356,0.3388 h 0.891163 c 0.490139,0 1.920952,0.03 3.179584,0.0666 l 2.288422,0.0666 0.06356,0.3388 0.06356,0.33879 h 2.973272 2.973268 l 0.0712,-0.76011 0.0712,-0.76011 h 1.76495 1.76494 v 11.45234 11.45235 h -1.76494 -1.76495 l -0.0712,-0.76011 -0.0712,-0.76011 H 98.099052 95.12578 l -0.06356,0.33879 -0.06356,0.33879 -2.288422,0.0666 c -1.258632,0.0366 -2.689445,0.0666 -3.179584,0.0666 h -0.891163 l -0.06356,0.3388 -0.06356,0.33879 -2.288422,0.0666 c -1.258632,0.0366 -2.689444,0.0666 -3.179583,0.0666 h -0.891163 l -0.06356,0.33879 -0.06356,0.3388 -2.288422,0.0666 c -1.258632,0.0366 -2.689445,0.0666 -3.179584,0.0666 h -0.891163 l -0.06356,0.3388 -0.06356,0.33879 -2.288422,0.0666 c -1.258632,0.0366 -2.689444,0.0666 -3.179583,0.0666 h -0.891163 l -0.06356,0.33879 -0.06356,0.3388 -2.288422,0.0666 c -1.258632,0.0366 -2.685986,0.0666 -3.171899,0.0666 h -0.883472 l -0.07362,1.57087 -0.07362,1.5709 h -2.523035 -2.523034 z m 4.690556,15.17915 c 0.03658,-0.95177 0.100746,-1.55712 0.16741,-1.57935 0.152597,-0.0509 0.152597,-27.14873 0,-27.19959 -0.06666,-0.0222 -0.130831,-0.62758 -0.16741,-1.57935 l -0.05931,-1.54331 H 60.03472 57.921795 v 16.72245 16.72246 h 2.112925 2.112925 z m 18.082859,-3.3211 1.33827,-3.1e-4 0.06655,-0.35471 c 0.0366,-0.1951 0.107076,-0.35472 0.156614,-0.35472 0.05198,0 0.09007,-4.71439 0.09007,-11.14831 0,-6.43391 -0.03809,-11.1483 -0.09007,-11.1483 -0.04954,0 -0.120014,-0.15962 -0.156614,-0.35472 l -0.06655,-0.35471 -1.034225,-2.7e-4 c -0.568825,-1.5e-4 -1.957763,-0.0302 -3.086528,-0.0668 l -2.052301,-0.0665 v 11.99112 11.99113 l 1.748256,-0.0663 c 0.961541,-0.0365 2.350479,-0.0665 3.086528,-0.0666 z m -14.00219,-0.75581 c 0.502708,-0.50271 0.146491,-1.37281 -0.562021,-1.37281 -0.416652,0 -0.810786,0.39413 -0.810786,0.81079 0,0.41665 0.394134,0.81078 0.810786,0.81078 0.197464,0 0.405212,-0.0919 0.562021,-0.24876 z m 38.051646,-11.10224 v -11.04695 h -1.36821 -1.3682 v 0.2899 c 0,0.15945 -0.029,0.5015 -0.0645,0.76011 l -0.0644,0.47021 h -3.280037 -3.280041 v 9.52673 9.52674 h 3.280041 3.280037 l 0.0644,0.47021 c 0.0354,0.25861 0.0645,0.60066 0.0645,0.76011 v 0.2899 h 1.3682 1.36821 z M 72.554988,399.5527 c 0.358592,-0.16338 0.526538,-0.61357 0.369938,-0.99164 -0.318276,-0.76839 -1.523824,-0.5517 -1.523824,0.27389 0,0.63158 0.567815,0.98478 1.153886,0.71775 z m 13.19149,-1.75584 c 0.15681,-0.15681 0.248764,-0.36456 0.248764,-0.56202 0,-0.19746 -0.09195,-0.40521 -0.248764,-0.56202 -0.156809,-0.15681 -0.364558,-0.24877 -0.562022,-0.24877 -0.197463,0 -0.405212,0.092 -0.562021,0.24877 -0.15681,0.15681 -0.248764,0.36456 -0.248764,0.56202 0,0.19746 0.09195,0.40521 0.248764,0.56202 0.156809,0.15681 0.364558,0.24877 0.562021,0.24877 0.197464,0 0.405213,-0.092 0.562022,-0.24877 z m 6.486284,-0.81078 c 0.15681,-0.15681 0.248765,-0.36456 0.248765,-0.56203 0,-0.19746 -0.09195,-0.40521 -0.248765,-0.56202 -0.156809,-0.15681 -0.364557,-0.24876 -0.562021,-0.24876 -0.197464,0 -0.405212,0.092 -0.562021,0.24876 -0.15681,0.15681 -0.248765,0.36456 -0.248765,0.56202 0,0.19747 0.09195,0.40522 0.248765,0.56203 0.156809,0.15681 0.364557,0.24876 0.562021,0.24876 0.197464,0 0.405212,-0.0919 0.562021,-0.24876 z m 0,-14.59414 c 0.502708,-0.50271 0.146491,-1.37281 -0.562021,-1.37281 -0.416653,0 -0.810786,0.39413 -0.810786,0.81078 0,0.41666 0.394133,0.81079 0.810786,0.81079 0.197464,0 0.405212,-0.0919 0.562021,-0.24876 z m -6.486284,-0.81079 c 0.502707,-0.50271 0.146491,-1.37281 -0.562022,-1.37281 -0.416652,0 -0.810785,0.39414 -0.810785,0.81079 0,0.41665 0.394133,0.81078 0.810785,0.81078 0.197464,0 0.405213,-0.0919 0.562022,-0.24876 z m -13.19149,-1.4873 c 0.358592,-0.16339 0.526538,-0.61358 0.369938,-0.99164 -0.318276,-0.76839 -1.523824,-0.55171 -1.523824,0.27389 0,0.63158 0.567815,0.98478 1.153886,0.71775 z m -6.267364,-0.94506 c 0.15681,-0.15681 0.248764,-0.36455 0.248764,-0.56202 0,-0.19746 -0.09195,-0.40521 -0.248764,-0.56202 -0.156809,-0.15681 -0.364557,-0.24876 -0.562021,-0.24876 -0.197464,0 -0.405213,0.0919 -0.562022,0.24876 -0.15681,0.15681 -0.248764,0.36456 -0.248764,0.56202 0,0.19747 0.09195,0.40521 0.248764,0.56202 0.156809,0.15681 0.364558,0.24877 0.562022,0.24877 0.197464,0 0.405212,-0.092 0.562021,-0.24877 z"
       id="path22"
       inkscape:connector-curvature="0" />
    <path
       style="fill:#8625e0;stroke-width:0.1013482"
       d="m 57.516399,389.12698 v -17.12784 h 2.523034 2.523035 l 0.07362,1.5709 0.07362,1.57089 h 0.883477 c 0.485913,0 1.913267,0.03 3.171899,0.0666 l 2.288422,0.0666 0.06356,0.3388 0.06356,0.33879 h 0.891163 c 0.490139,0 1.920951,0.03 3.179583,0.0666 l 2.288422,0.0666 0.06356,0.33879 0.06356,0.33879 h 0.891163 c 0.490139,0 1.920952,0.03 3.179584,0.0666 l 2.288422,0.0666 0.06356,0.3388 0.06356,0.33879 h 0.891163 c 0.490139,0 1.920951,0.03 3.179583,0.0666 l 2.288422,0.0666 0.06356,0.33879 0.06356,0.3388 h 0.891163 c 0.490139,0 1.920952,0.03 3.179584,0.0666 l 2.288422,0.0666 0.06356,0.3388 0.06356,0.33879 h 2.973272 2.973268 l 0.0712,-0.76011 0.0712,-0.76011 h 1.76495 1.76494 v 11.45234 11.45235 h -1.76494 -1.76495 l -0.0712,-0.76011 -0.0712,-0.76011 H 98.099052 95.12578 l -0.06356,0.33879 -0.06356,0.33879 -2.288422,0.0666 c -1.258632,0.0366 -2.689445,0.0666 -3.179584,0.0666 h -0.891163 l -0.06356,0.3388 -0.06356,0.33879 -2.288422,0.0666 c -1.258632,0.0366 -2.689444,0.0666 -3.179583,0.0666 h -0.891163 l -0.06356,0.33879 -0.06356,0.3388 -2.288422,0.0666 c -1.258632,0.0366 -2.689445,0.0666 -3.179584,0.0666 h -0.891163 l -0.06356,0.3388 -0.06356,0.33879 -2.288422,0.0666 c -1.258632,0.0366 -2.689444,0.0666 -3.179583,0.0666 h -0.891163 l -0.06356,0.33879 -0.06356,0.3388 -2.288422,0.0666 c -1.258632,0.0366 -2.685986,0.0666 -3.171899,0.0666 h -0.883472 l -0.07362,1.57087 -0.07362,1.5709 h -2.523035 -2.523034 z m 4.703356,15.1769 c 0.03927,-0.85006 0.114444,-1.56076 0.167053,-1.57935 0.129823,-0.0458 0.129823,-27.14924 0,-27.19509 -0.05261,-0.0186 -0.127783,-0.72929 -0.167053,-1.57935 l -0.0714,-1.54556 h -2.113282 -2.113282 v 16.72245 16.72246 h 2.113282 2.113282 z m 18.070059,-3.31885 1.33827,-3.1e-4 0.06425,-0.34245 0.06425,-0.34246 3.181076,-0.0745 3.181076,-0.0746 0.0614,-0.32728 0.0614,-0.32728 2.043989,-0.0662 c 1.124194,-0.0364 2.554998,-0.0663 3.179564,-0.0665 l 1.135575,-3e-4 0.06655,-0.35472 0.06654,-0.35472 h 3.37011 3.370106 l 0.0645,0.47021 c 0.0354,0.25862 0.0644,0.60067 0.0644,0.76011 v 0.2899 h 1.3682 1.36821 v -11.04695 -11.04696 h -1.36821 -1.3682 v 0.2899 c 0,0.15945 -0.029,0.5015 -0.0644,0.76011 l -0.0645,0.47025 h -3.370106 -3.37011 l -0.06421,-0.3423 -0.06422,-0.3423 -3.181077,-0.0745 -3.181076,-0.0745 -0.06137,-0.32714 -0.06137,-0.32714 -2.295145,-0.0668 c -1.262329,-0.0367 -2.693159,-0.0668 -3.179621,-0.0668 h -0.884476 l -0.06654,-0.35472 -0.06655,-0.35471 -1.034225,-2.7e-4 c -0.568825,-1.5e-4 -1.957763,-0.0302 -3.086528,-0.0668 l -2.052301,-0.0665 v 11.99112 11.99113 l 1.748256,-0.0663 c 0.961541,-0.0365 2.350479,-0.0665 3.086528,-0.0666 z m -14.00219,-0.75581 c 0.502708,-0.50271 0.146491,-1.37281 -0.562021,-1.37281 -0.416652,0 -0.810786,0.39413 -0.810786,0.81079 0,0.41665 0.394134,0.81078 0.810786,0.81078 0.197464,0 0.405212,-0.0919 0.562021,-0.24876 z m 6.267364,-0.67652 c 0.358592,-0.16338 0.526538,-0.61357 0.369938,-0.99164 -0.318276,-0.76839 -1.523824,-0.5517 -1.523824,0.27389 0,0.63158 0.567815,0.98478 1.153886,0.71775 z m 0,-19.45885 c 0.358592,-0.16339 0.526538,-0.61358 0.369938,-0.99164 -0.318276,-0.76839 -1.523824,-0.55171 -1.523824,0.27389 0,0.63158 0.567815,0.98478 1.153886,0.71775 z m -6.267364,-0.94506 c 0.15681,-0.15681 0.248764,-0.36455 0.248764,-0.56202 0,-0.19746 -0.09195,-0.40521 -0.248764,-0.56202 -0.156809,-0.15681 -0.364557,-0.24876 -0.562021,-0.24876 -0.197464,0 -0.405213,0.0919 -0.562022,0.24876 -0.15681,0.15681 -0.248764,0.36456 -0.248764,0.56202 0,0.19747 0.09195,0.40521 0.248764,0.56202 0.156809,0.15681 0.364558,0.24877 0.562022,0.24877 0.197464,0 0.405212,-0.092 0.562021,-0.24877 z"
       id="path20"
       inkscape:connector-curvature="0" />
    <path
       style="fill:#f62760;stroke-width:0.1013482"
       d="m 57.516399,389.12698 v -17.12784 h 2.523034 2.523035 l 0.07362,1.5709 0.07362,1.57089 h 0.883477 c 0.485913,0 1.913267,0.03 3.171899,0.0666 l 2.288422,0.0666 0.06356,0.3388 0.06356,0.33879 h 0.891163 c 0.490139,0 1.920951,0.03 3.179583,0.0666 l 2.288422,0.0666 0.06356,0.33879 0.06356,0.33879 h 0.891163 c 0.490139,0 1.920952,0.03 3.179584,0.0666 l 2.288422,0.0666 0.06356,0.3388 0.06356,0.33879 h 0.891163 c 0.490139,0 1.920951,0.03 3.179583,0.0666 l 2.288422,0.0666 0.06356,0.33879 0.06356,0.3388 h 0.891163 c 0.490139,0 1.920952,0.03 3.179584,0.0666 l 2.288422,0.0666 0.06356,0.3388 0.06356,0.33879 h 2.973272 2.973268 l 0.0712,-0.76011 0.0712,-0.76011 h 1.76495 1.76494 v 11.45234 11.45235 h -1.76494 -1.76495 l -0.0712,-0.76011 -0.0712,-0.76011 H 98.099052 95.12578 l -0.06356,0.33879 -0.06356,0.33879 -2.288422,0.0666 c -1.258632,0.0366 -2.689445,0.0666 -3.179584,0.0666 h -0.891163 l -0.06356,0.3388 -0.06356,0.33879 -2.288422,0.0666 c -1.258632,0.0366 -2.689444,0.0666 -3.179583,0.0666 h -0.891163 l -0.06356,0.33879 -0.06356,0.3388 -2.288422,0.0666 c -1.258632,0.0366 -2.689445,0.0666 -3.179584,0.0666 h -0.891163 l -0.06356,0.3388 -0.06356,0.33879 -2.288422,0.0666 c -1.258632,0.0366 -2.689444,0.0666 -3.179583,0.0666 h -0.891163 l -0.06356,0.33879 -0.06356,0.3388 -2.288422,0.0666 c -1.258632,0.0366 -2.685986,0.0666 -3.171899,0.0666 h -0.883472 l -0.07362,1.57087 -0.07362,1.5709 h -2.523035 -2.523034 z m 4.703356,15.1769 c 0.03927,-0.85006 0.114444,-1.56076 0.167053,-1.57935 0.129823,-0.0458 0.129823,-27.14924 0,-27.19509 -0.05261,-0.0186 -0.127783,-0.72929 -0.167053,-1.57935 l -0.0714,-1.54556 h -2.113282 -2.113282 v 16.72245 16.72246 h 2.113282 2.113282 z m 18.070059,-3.31885 1.33827,-3.1e-4 0.06425,-0.34245 0.06425,-0.34246 3.181076,-0.0745 3.181076,-0.0746 0.0614,-0.32728 0.0614,-0.32728 2.043989,-0.0662 c 1.124194,-0.0364 2.554998,-0.0663 3.179564,-0.0665 l 1.135575,-3e-4 0.06655,-0.35472 0.06654,-0.35472 h 3.37011 3.370106 l 0.0645,0.47021 c 0.0354,0.25862 0.0644,0.60067 0.0644,0.76011 v 0.2899 h 1.3682 1.36821 v -11.04695 -11.04696 h -1.36821 -1.3682 v 0.2899 c 0,0.15945 -0.029,0.5015 -0.0644,0.76011 l -0.0645,0.47025 h -3.370106 -3.37011 l -0.06421,-0.3423 -0.06422,-0.3423 -3.181077,-0.0745 -3.181076,-0.0745 -0.06137,-0.32714 -0.06137,-0.32714 -2.295145,-0.0668 c -1.262329,-0.0367 -2.693159,-0.0668 -3.179621,-0.0668 h -0.884476 l -0.06654,-0.35472 -0.06655,-0.35471 -1.034225,-2.7e-4 c -0.568825,-1.5e-4 -1.957763,-0.0302 -3.086528,-0.0668 l -2.052301,-0.0665 v 11.99112 11.99113 l 1.748256,-0.0663 c 0.961541,-0.0365 2.350479,-0.0665 3.086528,-0.0666 z m -14.00219,-0.75581 c 0.502708,-0.50271 0.146491,-1.37281 -0.562021,-1.37281 -0.416652,0 -0.810786,0.39413 -0.810786,0.81079 0,0.41665 0.394134,0.81078 0.810786,0.81078 0.197464,0 0.405212,-0.0919 0.562021,-0.24876 z m 6.797708,-0.0109 c 0.153745,-0.11493 0.373567,-0.33489 0.488494,-0.48881 0.207797,-0.2783 0.209106,-0.34377 0.235572,-11.77547 l 0.02661,-11.49561 h -1.963422 c -1.079881,0 -2.175017,-0.029 -2.433634,-0.0644 l -0.470212,-0.0645 v 12.08035 12.08036 l 1.918526,-0.0315 c 1.751864,-0.0288 1.942808,-0.0496 2.198061,-0.24044 z m -6.797708,-21.06956 c 0.15681,-0.15681 0.248764,-0.36455 0.248764,-0.56202 0,-0.19746 -0.09195,-0.40521 -0.248764,-0.56202 -0.156809,-0.15681 -0.364557,-0.24876 -0.562021,-0.24876 -0.197464,0 -0.405213,0.0919 -0.562022,0.24876 -0.15681,0.15681 -0.248764,0.36456 -0.248764,0.56202 0,0.19747 0.09195,0.40521 0.248764,0.56202 0.156809,0.15681 0.364558,0.24877 0.562022,0.24877 0.197464,0 0.405212,-0.092 0.562021,-0.24877 z"
       id="path18"
       inkscape:connector-curvature="0" />
    <path
       style="fill:#671bad;stroke-width:0.1013482"
       d="m 57.516399,389.12698 v -17.12784 h 2.523034 2.523035 l 0.07362,1.5709 0.07362,1.57089 h 0.883477 c 0.485913,0 1.913267,0.03 3.171899,0.0666 l 2.288422,0.0666 0.06356,0.3388 0.06356,0.33879 h 0.891163 c 0.490139,0 1.920951,0.03 3.179583,0.0666 l 2.288422,0.0666 0.06356,0.33879 0.06356,0.33879 h 0.891163 c 0.490139,0 1.920952,0.03 3.179584,0.0666 l 2.288422,0.0666 0.06356,0.3388 0.06356,0.33879 h 0.891163 c 0.490139,0 1.920951,0.03 3.179583,0.0666 l 2.288422,0.0666 0.06356,0.33879 0.06356,0.3388 h 0.891163 c 0.490139,0 1.920952,0.03 3.179584,0.0666 l 2.288422,0.0666 0.06356,0.3388 0.06356,0.33879 h 2.973272 2.973268 l 0.0712,-0.76011 0.0712,-0.76011 h 1.76495 1.76494 v 11.45234 11.45235 h -1.76494 -1.76495 l -0.0712,-0.76011 -0.0712,-0.76011 H 98.099052 95.12578 l -0.06356,0.33879 -0.06356,0.33879 -2.288422,0.0666 c -1.258632,0.0366 -2.689445,0.0666 -3.179584,0.0666 h -0.891163 l -0.06356,0.3388 -0.06356,0.33879 -2.288422,0.0666 c -1.258632,0.0366 -2.689444,0.0666 -3.179583,0.0666 h -0.891163 l -0.06356,0.33879 -0.06356,0.3388 -2.288422,0.0666 c -1.258632,0.0366 -2.689445,0.0666 -3.179584,0.0666 h -0.891163 l -0.06356,0.3388 -0.06356,0.33879 -2.288422,0.0666 c -1.258632,0.0366 -2.689444,0.0666 -3.179583,0.0666 h -0.891163 l -0.06356,0.33879 -0.06356,0.3388 -2.288422,0.0666 c -1.258632,0.0366 -2.685986,0.0666 -3.171899,0.0666 h -0.883472 l -0.07362,1.57087 -0.07362,1.5709 h -2.523035 -2.523034 z m 4.716112,15.20013 c 0.04038,-0.83728 0.103805,-1.54111 0.140955,-1.56407 0.03715,-0.023 1.467106,-0.0745 3.177679,-0.1146 l 3.110133,-0.0729 0.06366,-0.33936 c 0.03502,-0.18665 0.104196,-0.33936 0.153734,-0.33936 0.04954,0 0.09007,-0.31649 0.09007,-0.7033 v -0.70329 l 1.918526,-0.0315 c 2.099047,-0.0344 2.185232,-0.0578 2.686555,-0.72925 0.207797,-0.2783 0.209106,-0.34377 0.235572,-11.77547 l 0.02661,-11.49561 h -1.912026 c -1.051615,0 -2.188422,-0.0289 -2.52624,-0.0642 -0.594243,-0.0621 -0.61621,-0.0748 -0.675609,-0.39146 l -0.0614,-0.32726 -3.165153,-0.0899 -3.165152,-0.0899 -0.08768,-1.54556 -0.08767,-1.54556 h -2.116649 -2.116648 v 16.72245 16.72246 h 2.118655 2.118655 z m 18.057303,-3.34208 1.33827,-3e-4 0.06425,-0.34246 0.06425,-0.34246 3.181076,-0.0745 3.181076,-0.0746 0.06138,-0.32718 0.06138,-0.32717 2.288422,-0.0666 c 1.258632,-0.0366 2.689445,-0.0666 3.179584,-0.0666 h 0.891163 l 0.06655,-0.35472 0.06654,-0.35471 h 3.371978 3.371977 l 0.0708,0.75566 0.0708,0.75567 0.67587,0.0298 c 0.37173,0.0164 0.98258,0.0147 1.35745,-0.004 l 0.68158,-0.0336 0.0279,-5.51526 c 0.0153,-3.0334 0.0153,-8.00083 -1e-5,-11.03874 l -0.0279,-5.52348 h -1.35702 -1.35702 l -0.0712,0.76011 -0.0712,0.76011 H 98.105728 94.73375 l -0.06421,-0.3423 -0.06422,-0.3423 -3.181077,-0.0745 -3.181076,-0.0745 -0.06137,-0.32714 -0.06137,-0.32714 -2.295145,-0.0668 c -1.262329,-0.0367 -2.693159,-0.0668 -3.179621,-0.0668 h -0.884476 l -0.06654,-0.35472 -0.06655,-0.35471 -1.034225,-2.7e-4 c -0.568825,-1.5e-4 -1.957763,-0.0302 -3.086528,-0.0668 l -2.052301,-0.0665 v 11.99112 11.99113 l 1.748256,-0.0663 c 0.961541,-0.0365 2.350479,-0.0665 3.086528,-0.0666 z"
       id="path16"
       inkscape:connector-curvature="0" />
    <path
       style="fill:#0f0c0a;stroke-width:0.1013482"
       d="m 57.516399,389.12698 v -17.12784 h 2.518983 2.518982 l 0.05408,1.5258 c 0.02975,0.83919 0.07728,1.549 0.105641,1.57736 0.02836,0.0283 1.467702,0.0786 3.198543,0.1116 l 3.146984,0.06 0.03058,0.31355 0.03058,0.31355 1.064156,0.0636 c 0.585286,0.035 2.030409,0.0692 3.211384,0.076 l 2.147228,0.0124 0.03176,0.32938 0.03176,0.32938 1.064156,0.0636 c 0.585286,0.035 2.030409,0.0692 3.211384,0.076 l 2.147228,0.0124 0.03176,0.32938 0.03176,0.32939 1.064156,0.0636 c 0.585285,0.035 2.030408,0.0692 3.211383,0.076 l 2.147228,0.0124 0.03176,0.32938 0.03176,0.32938 1.064156,0.0636 c 0.585286,0.035 2.030409,0.0692 3.211384,0.076 l 2.147228,0.0124 0.03176,0.32939 0.03176,0.32938 1.266852,0.0809 c 0.696769,0.0445 2.048808,0.0512 3.004531,0.0149 l 1.737674,-0.0661 0.0613,-0.30625 c 0.0337,-0.16845 0.0613,-0.50579 0.0613,-0.74966 v -0.4434 h 1.7736 1.77359 v 11.45234 11.45235 h -1.77359 -1.7736 v -0.4434 c 0,-0.24387 -0.0276,-0.58121 -0.0613,-0.74966 l -0.0613,-0.30625 -1.737674,-0.0661 c -0.955723,-0.0363 -2.307762,-0.0296 -3.004531,0.0149 l -1.266852,0.0809 -0.03176,0.32938 -0.03176,0.32939 -2.147228,0.0124 c -1.180975,0.007 -2.626098,0.041 -3.211384,0.076 l -1.064156,0.0636 -0.03176,0.32938 -0.03176,0.32938 -2.147228,0.0124 c -1.180975,0.007 -2.626098,0.041 -3.211383,0.076 l -1.064156,0.0636 -0.03176,0.32938 -0.03176,0.32939 -2.147228,0.0124 c -1.180975,0.007 -2.626098,0.041 -3.211384,0.076 l -1.064156,0.0636 -0.03176,0.32938 -0.03176,0.32938 -2.147228,0.0124 c -1.180975,0.007 -2.626098,0.041 -3.211384,0.076 l -1.064156,0.0636 -0.03058,0.31355 -0.03058,0.31355 -3.146984,0.06 c -1.730841,0.033 -3.170186,0.0832 -3.198543,0.1116 -0.02836,0.0284 -0.0759,0.73817 -0.105641,1.57736 l -0.05408,1.52618 h -2.518982 -2.518983 z m 3.697841,16.72246 h 0.944862 l 0.07341,-1.52233 c 0.04038,-0.83728 0.10288,-1.54054 0.138899,-1.5628 0.03602,-0.0223 1.465939,-0.0736 3.177598,-0.11417 l 3.112108,-0.0737 0.06076,-0.32386 0.06076,-0.32387 2.288422,-0.0666 c 1.258632,-0.0366 2.689445,-0.0666 3.179584,-0.0666 h 0.891163 l 0.06358,-0.3389 0.06358,-0.3389 2.04399,-0.0662 c 1.124194,-0.0364 2.554998,-0.0663 3.179564,-0.0665 l 1.135574,-3e-4 0.06425,-0.34246 0.06425,-0.34246 3.181076,-0.0745 3.181076,-0.0745 0.06138,-0.32718 0.06138,-0.32718 2.288422,-0.0666 c 1.258632,-0.0366 2.689445,-0.0666 3.179584,-0.0666 h 0.891163 l 0.0668,-0.35607 0.0668,-0.35607 3.358294,0.0267 3.358291,0.0267 0.0847,0.7268 0.0847,0.7268 0.67541,0.0333 c 0.37147,0.0183 0.9814,0.0199 1.3554,0.003 l 0.68001,-0.0299 0.0294,-5.51894 c 0.0162,-3.03541 0.0162,-8.00069 1e-5,-11.03395 l -0.0294,-5.51501 -0.68002,-0.0338 c -0.374,-0.0186 -0.98409,-0.0175 -1.35575,0.002 l -0.67574,0.0363 -0.0844,0.72381 -0.0844,0.72381 -3.358299,0.0267 -3.358294,0.0267 -0.06447,-0.34365 -0.06447,-0.34366 -3.181077,-0.0745 -3.181076,-0.0745 -0.06137,-0.32714 -0.06137,-0.32714 -2.295145,-0.0668 c -1.262329,-0.0367 -2.693159,-0.0668 -3.179621,-0.0668 h -0.884476 l -0.06421,-0.3423 -0.06422,-0.3423 -3.181076,-0.0745 -3.181076,-0.0745 -0.0614,-0.32729 -0.0614,-0.32729 -1.898682,-0.0664 c -1.044275,-0.0365 -2.475092,-0.0665 -3.179593,-0.0666 l -1.28091,-2.9e-4 -0.06393,-0.34079 -0.06393,-0.34078 -3.165153,-0.0899 -3.165152,-0.0899 -0.08721,-1.53665 -0.08721,-1.53666 -1.052958,-0.0342 c -0.579126,-0.0188 -1.527622,-0.0188 -2.107767,5e-5 l -1.054811,0.0343 -0.03468,8.35226 c -0.01908,4.59375 -0.01907,12.11328 2e-5,16.71006 l 0.0347,8.35778 1.029453,0.0318 c 0.5662,0.0175 1.090192,0.019 1.164428,0.003 0.07424,-0.0156 0.560162,-0.0284 1.079836,-0.0284 z"
       id="path14"
       inkscape:connector-curvature="0" />
  </g>
  <path
     style="fill:#ffffff;fill-opacity:1;stroke-width:0.04793944"
     d="m -0.62249609,4.9498054 c -0.0810487,-0.051939 -0.1773371,-0.1504442 -0.21397415,-0.2189012 -0.0590533,-0.1103421 -0.0559311,-0.1439759 0.0275127,-0.2963747 0.051769,-0.094549 0.14923867,-0.2124751 0.21659915,-0.2620577 0.10233386,-0.075326 0.14569163,-0.081352 0.26366691,-0.036645 0.38048855,0.1441852 0.48199994,0.5046877 0.21679017,0.7698974 -0.16332877,0.1633289 -0.30537622,0.1755923 -0.51059478,0.044081 z"
     id="path28"
     inkscape:connector-curvature="0" />
  <path
     style="fill:#ffffff;fill-opacity:1;stroke-width:0.01694915"
     d="m -0.51672309,5.023517 c -0.208228,-0.1044391 -0.36811985,-0.2776 -0.36811985,-0.3986692 0,-0.1068026 0.0940812,-0.2785315 0.22361778,-0.4081755 0.15134928,-0.1514747 0.22337433,-0.1614562 0.43123075,-0.059762 0.31230521,0.1527967 0.38096253,0.4858171 0.15253112,0.7398478 -0.15091256,0.1678247 -0.28197595,0.205646 -0.4392598,0.1267589 z"
     id="path30"
     inkscape:connector-curvature="0" />
  <path
     style="fill:#ffffff;fill-opacity:1;stroke-width:0.01694915"
     d="M -0.5371201,5.0127857 C -0.65900405,4.9499252 -0.79538853,4.8344191 -0.84773458,4.7497214 -0.93048808,4.6158234 -0.86151948,4.4196466 -0.66033402,4.2166723 -0.53730653,4.0925509 -0.4803297,4.0702258 -0.36549732,4.1011469 0.04533007,4.2117713 0.18688749,4.6027831 -0.07746329,4.8967585 -0.23543461,5.072433 -0.36033548,5.1039606 -0.5371201,5.0127857 Z"
     id="path32"
     inkscape:connector-curvature="0" />
  <path
     style="fill:#ffffff;fill-opacity:1;stroke-width:0.01694915"
     d="M -0.53429295,5.0152894 C -0.65258592,4.9559134 -0.79473628,4.8354744 -0.84773458,4.7497214 -0.92795323,4.6199249 -0.86553133,4.4310022 -0.67519983,4.2275372 -0.55405495,4.098033 -0.48417458,4.0691905 -0.36760388,4.1005797 -0.10782582,4.1705307 0.05859185,4.3521684 0.05810639,4.5652242 0.05780656,4.696795 0.00761978,4.8110618 -0.09711205,4.91863 c -0.15320678,0.157356 -0.26639782,0.1823822 -0.4371809,0.096659 z"
     id="path34"
     inkscape:connector-curvature="0" />
  <path
     style="fill:#ffffff;fill-opacity:1;stroke-width:0.01694915"
     d="M 3.5322539,4.9294297 C 3.3917312,4.9012745 3.2626485,4.7876292 3.2022988,4.638935 3.1594189,4.533284 3.1609645,4.3504661 3.2055157,4.2584355 3.344739,3.9708385 3.7637812,3.8971383 3.9875382,4.1208953 4.1330702,4.2664273 4.1695552,4.4804336 4.0800303,4.663416 4.0264536,4.7729228 3.9607934,4.8345529 3.8401186,4.8886024 3.7386388,4.9340545 3.6283405,4.9486816 3.5322539,4.9294297 Z"
     id="path36"
     inkscape:connector-curvature="0" />
  <path
     style="fill:#ffffff;fill-opacity:1;stroke-width:0.01694915"
     d="M 3.529682,4.9289906 C 3.3865919,4.9004702 3.2465795,4.7739612 3.1969707,4.6283673 3.1587664,4.516244 3.1626774,4.3469275 3.2055157,4.2584355 3.2833353,4.0976817 3.4604667,3.9918741 3.6536779,3.9907305 3.9261905,3.9891175 4.1254727,4.1855035 4.1263842,4.4565669 4.126828,4.5885081 4.0666828,4.7306907 3.9790831,4.8047853 3.8584048,4.9068589 3.6741447,4.9577847 3.529682,4.9289906 Z"
     id="path38"
     inkscape:connector-curvature="0" />
  <path
     style="fill:#ffffff;fill-opacity:1;stroke-width:0.01694915"
     d="M 3.529682,4.9289906 C 3.3865919,4.9004702 3.2465795,4.7739612 3.1969707,4.6283673 3.1587664,4.516244 3.1626774,4.3469275 3.2055157,4.2584355 3.3183262,4.0254001 3.6322934,3.9205317 3.8690663,4.0368027 4.10055,4.1504763 4.1944837,4.4294816 4.0800303,4.663416 4.0264536,4.7729228 3.9607934,4.8345529 3.8401186,4.8886024 3.7378834,4.9343928 3.6283085,4.9486487 3.529682,4.9289906 Z"
     id="path40"
     inkscape:connector-curvature="0" />
  <path
     style="fill:#ffffff;fill-opacity:1;stroke-width:0.01694915"
     d="M 3.5065686,4.9237819 C 3.3683839,4.885696 3.2468965,4.7690002 3.1963833,4.6258305 3.1586224,4.5188048 3.1629065,4.3464543 3.2055157,4.2584355 3.3034431,4.0561446 3.5668952,3.9408684 3.7858282,4.0045139 4.072105,4.0877369 4.2102796,4.3971959 4.0800303,4.663416 4.026509,4.7728095 3.9609652,4.8343873 3.8401186,4.8888106 c -0.1099414,0.049512 -0.2337099,0.062489 -0.33355,0.034971 z"
     id="path42"
     inkscape:connector-curvature="0" />
  <path
     style="fill:#ffffff;fill-opacity:1;stroke-width:0.01694915"
     d="M 7.5132289,4.780746 C 7.285735,4.6907558 7.1579718,4.3804832 7.2552728,4.1543008 7.333978,3.9713456 7.5378362,3.8520027 7.7470334,3.8664137 7.8770143,3.8753677 7.949444,3.9083206 8.0479078,4.0033006 8.2315301,4.180426 8.2335643,4.4788193 8.0523845,4.6599991 7.9139981,4.7983855 7.686577,4.8493177 7.5132289,4.780746 Z"
     id="path44"
     inkscape:connector-curvature="0" />
  <path
     style="fill:#ffffff;fill-opacity:1;stroke-width:0.01694915"
     d="M 7.5240542,4.7877539 C 7.2894376,4.7039398 7.1532271,4.3791737 7.256704,4.1503118 7.3014502,4.0513458 7.3785977,3.9718772 7.4841864,3.9159853 7.5566074,3.8776503 7.5898842,3.8711214 7.7129999,3.871092 7.8787531,3.8710523 7.9511421,3.9003074 8.0543527,4.0090452 8.1400944,4.0993784 8.1737079,4.1739615 8.183466,4.2955273 8.1953142,4.4431315 8.1539122,4.5584714 8.0527774,4.6596062 7.9191105,4.7932732 7.6929469,4.8480889 7.5240542,4.7877539 Z"
     id="path46"
     inkscape:connector-curvature="0" />
  <path
     style="fill:#ffffff;fill-opacity:1;stroke-width:0.01694915"
     d="M 7.4994217,4.780053 C 7.3455356,4.7078726 7.240531,4.5472275 7.2255925,4.3611258 7.2103388,4.1710966 7.3032128,4.0106276 7.4831109,3.9161821 c 0.073329,-0.038498 0.1067915,-0.045061 0.229889,-0.04509 0.1657532,-3.97e-5 0.2381422,0.029215 0.3413528,0.1379532 0.085742,0.090333 0.1193552,0.1649163 0.1291133,0.2864821 0.015766,0.196411 -0.074259,0.3591241 -0.2523103,0.4560318 -0.1203123,0.065482 -0.3241895,0.078938 -0.431734,0.028494 z"
     id="path48"
     inkscape:connector-curvature="0" />
  <path
     style="fill:#ffffff;fill-opacity:1;stroke-width:0.01694915"
     d="M 7.4793337,4.7683904 C 7.2810342,4.6677941 7.1744133,4.4045414 7.241407,4.1809363 7.2683963,4.0908539 7.3766069,3.9720551 7.4820957,3.9166965 7.5565331,3.8776332 7.5895031,3.8711215 7.7129999,3.871092 7.8787531,3.8710524 7.9511421,3.9003074 8.0543527,4.0090452 8.1570811,4.1172748 8.17879,4.1743698 8.1789551,4.3367525 8.1790839,4.463295 8.1734721,4.4903966 8.1328239,4.5595424 8.03975,4.7178683 7.9026472,4.7970942 7.7045253,4.8070378 c -0.1211062,0.00608 -0.145166,0.00195 -0.2251916,-0.038647 z"
     id="path50"
     inkscape:connector-curvature="0" />
  <path
     style="fill:#ffffff;fill-opacity:1;stroke-width:0.01694915"
     d="m 11.653156,4.657994 c -0.190808,-0.092879 -0.364407,-0.28744 -0.364407,-0.4084098 0,-0.1269252 0.169629,-0.4089588 0.287375,-0.4778034 0.123622,-0.07228 0.350319,-0.022471 0.501378,0.1101602 0.143731,0.126198 0.195867,0.3604579 0.114591,0.5148954 -0.0732,0.1391008 -0.297546,0.2964776 -0.420293,0.2948379 -0.02797,-3.735e-4 -0.08136,-0.01553 -0.118644,-0.03368 z"
     id="path52"
     inkscape:connector-curvature="0" />
  <path
     style="fill:#ffffff;fill-opacity:1;stroke-width:0.01694915"
     d="m 11.653156,4.6589446 c -0.19522,-0.097078 -0.364407,-0.2873268 -0.364407,-0.4097729 0,-0.1287697 0.177636,-0.4225582 0.291799,-0.482601 0.08303,-0.043669 0.228287,-0.034941 0.353473,0.021239 0.252102,0.1131363 0.367829,0.3917216 0.254778,0.6133181 -0.06792,0.1331436 -0.293851,0.2910092 -0.416999,0.2913779 -0.02797,8.3e-5 -0.08136,-0.015019 -0.118644,-0.033561 z"
     id="path54"
     inkscape:connector-curvature="0" />
  <path
     style="fill:#ffffff;fill-opacity:1;stroke-width:0.01694915"
     d="M 11.630531,4.6460746 C 11.429415,4.5378754 11.288749,4.3717739 11.288749,4.2424911 c 0,-0.1623223 0.209268,-0.4603466 0.349315,-0.4974696 0.210645,-0.055836 0.508932,0.1222789 0.574492,0.3430455 0.04947,0.1665969 0.02265,0.2796068 -0.09759,0.4111669 -0.09162,0.1002439 -0.257135,0.1934508 -0.343532,0.1934508 -0.02985,0 -0.09326,-0.020975 -0.140907,-0.04661 z"
     id="path56"
     inkscape:connector-curvature="0" />
  <path
     style="fill:#ffffff;fill-opacity:1;stroke-width:0.01694915"
     d="M 11.635297,4.6507661 C 11.445371,4.555802 11.288749,4.3701945 11.288749,4.240083 c 0,-0.092218 0.09777,-0.2841786 0.199599,-0.3919032 0.09813,-0.1038044 0.183944,-0.133024 0.310793,-0.1058198 0.250585,0.053741 0.438761,0.2600731 0.438761,0.4810956 0,0.1532826 -0.128955,0.3276925 -0.308697,0.417511 -0.125423,0.062674 -0.184238,0.064635 -0.293908,0.0098 z"
     id="path58"
     inkscape:connector-curvature="0" />
  <path
     style="fill:#ffffff;fill-opacity:1;stroke-width:0.01694915"
     d="m 15.649225,4.5068377 c -0.176471,-0.080108 -0.324583,-0.2900974 -0.302412,-0.4287504 0.02346,-0.1467205 0.194619,-0.3885753 0.311613,-0.4403275 0.205228,-0.090782 0.539855,0.087412 0.611177,0.325461 0.04526,0.151051 0.01243,0.2887789 -0.09812,0.4117397 -0.140351,0.1561042 -0.351459,0.2094115 -0.522261,0.1318772 z"
     id="path60"
     inkscape:connector-curvature="0" />
  <path
     style="fill:#ffffff;fill-opacity:1;stroke-width:0.01694915"
     d="m 15.631639,4.4965418 c -0.179402,-0.089399 -0.313281,-0.2943147 -0.283223,-0.4334996 0.03159,-0.1462985 0.19965,-0.3764648 0.310761,-0.4256146 0.151728,-0.067116 0.401658,0.016243 0.528028,0.1761123 0.143429,0.1814521 0.138602,0.3897787 -0.01294,0.5583279 -0.151137,0.1681005 -0.359441,0.2159602 -0.542628,0.124674 z"
     id="path62"
     inkscape:connector-curvature="0" />
  <path
     style="fill:#ffffff;fill-opacity:1;stroke-width:0.01694915"
     d="m 15.631639,4.4965418 c -0.16001,-0.079736 -0.292013,-0.2593755 -0.291782,-0.3970774 1.89e-4,-0.1132168 0.192658,-0.4004044 0.307666,-0.4590771 0.0891,-0.045454 0.209175,-0.037313 0.341202,0.023131 0.190892,0.087393 0.300024,0.2412092 0.300024,0.4228694 0,0.1239176 -0.0285,0.1928949 -0.121589,0.2942826 -0.14643,0.1594836 -0.356703,0.2049807 -0.535521,0.1158715 z"
     id="path64"
     inkscape:connector-curvature="0" />
  <path
     style="fill:#ffffff;fill-opacity:1;stroke-width:0.01694915"
     d="m 15.636207,4.5000963 c -0.09545,-0.044732 -0.235408,-0.1852671 -0.272202,-0.2733276 -0.01342,-0.03213 -0.02441,-0.084334 -0.02441,-0.1160081 0,-0.084852 0.10566,-0.2813673 0.20925,-0.3891783 0.104565,-0.1088276 0.170118,-0.1299461 0.311382,-0.1003157 0.256821,0.053869 0.428521,0.2402333 0.428521,0.4651209 0,0.1247642 -0.03336,0.2052536 -0.123684,0.2984021 -0.152015,0.1567729 -0.348816,0.1996811 -0.528857,0.1153067 z"
     id="path66"
     inkscape:connector-curvature="0" />
  <path
     style="fill:#ffffff;fill-opacity:1;stroke-width:0.01694915"
     d="m 19.700264,4.4122092 c -0.108483,-0.05406 -0.215191,-0.1684169 -0.271097,-0.2905306 -0.03526,-0.077015 -0.04114,-0.1095113 -0.03269,-0.1807849 0.02454,-0.2071917 0.204881,-0.4379411 0.360513,-0.4612795 0.308542,-0.046269 0.598923,0.1947551 0.599394,0.4975132 3e-4,0.1929948 -0.08955,0.3207853 -0.295966,0.4209361 -0.147326,0.071481 -0.23795,0.07504 -0.36015,0.014146 z"
     id="path68"
     inkscape:connector-curvature="0" />
  <path
     style="fill:#ffffff;fill-opacity:1;stroke-width:0.01694915"
     d="m 19.699233,4.4116951 c -0.09584,-0.047757 -0.218237,-0.1724481 -0.268406,-0.2734283 -0.08061,-0.1622438 -0.0073,-0.4163767 0.164762,-0.57106 0.09551,-0.085876 0.156444,-0.1042676 0.297277,-0.089732 0.258613,0.026691 0.463121,0.2471445 0.463514,0.499653 3e-4,0.1929948 -0.08955,0.3207853 -0.295966,0.4209361 -0.147722,0.071674 -0.237878,0.075076 -0.361181,0.013631 z"
     id="path70"
     inkscape:connector-curvature="0" />
  <path
     style="fill:#ffffff;fill-opacity:1;stroke-width:0.01694915"
     d="M 19.699435,4.411796 C 19.511471,4.31813 19.374032,4.100838 19.396958,3.9335777 c 0.02336,-0.1704617 0.165739,-0.3825986 0.293789,-0.437744 0.03,-0.012918 0.09154,-0.023488 0.136754,-0.023488 0.287905,0 0.529045,0.2288246 0.529045,0.5020253 0,0.1960599 -0.08879,0.3230896 -0.296132,0.4236925 -0.147645,0.071636 -0.237892,0.075069 -0.360979,0.013732 z"
     id="path72"
     inkscape:connector-curvature="0" />
  <path
     style="fill:#ffffff;fill-opacity:1;stroke-width:0.01694915"
     d="M 19.699435,4.411796 C 19.510921,4.317855 19.374026,4.1008819 19.397093,3.9325924 c 0.02351,-0.1715118 0.165102,-0.382227 0.293654,-0.4370058 0.03,-0.012783 0.09154,-0.023241 0.136754,-0.023241 0.289998,0 0.529045,0.2273924 0.529045,0.5032516 0,0.1947667 -0.08925,0.3220872 -0.296132,0.4224662 -0.147645,0.071636 -0.237892,0.075069 -0.360979,0.013733 z"
     id="path74"
     inkscape:connector-curvature="0" />
  <path
     style="fill:#ffffff;fill-opacity:1;stroke-width:0.01694915"
     d="m 21.016573,12.406305 c -0.118961,-0.03851 -0.269807,-0.172055 -0.33121,-0.29323 -0.09882,-0.195016 -0.0011,-0.496792 0.204236,-0.630905 0.0549,-0.03585 0.08715,-0.04372 0.179184,-0.04372 0.06173,0 0.148184,0.01225 0.192125,0.02722 0.109479,0.0373 0.250579,0.169703 0.300277,0.28176 0.05315,0.119839 0.05468,0.281514 0.0036,0.378615 -0.09678,0.183933 -0.387163,0.332387 -0.5482,0.280261 z"
     id="path76"
     inkscape:connector-curvature="0" />
  <path
     style="fill:#ffffff;fill-opacity:1;stroke-width:0.01694915"
     d="m 20.971259,12.389142 c -0.09881,-0.04616 -0.237026,-0.179625 -0.285896,-0.276067 -0.04705,-0.09284 -0.05367,-0.235715 -0.01585,-0.341817 0.03725,-0.104504 0.129905,-0.228451 0.212452,-0.284215 0.07292,-0.04926 0.08265,-0.05124 0.221522,-0.04499 0.118912,0.0054 0.158866,0.01459 0.220339,0.05092 0.177841,0.105115 0.277353,0.268034 0.277272,0.453945 -5.7e-5,0.132679 -0.03935,0.218027 -0.143837,0.312425 -0.151848,0.137185 -0.354397,0.191279 -0.486006,0.129795 z"
     id="path78"
     inkscape:connector-curvature="0" />
  <path
     style="fill:#ffffff;fill-opacity:1;stroke-width:0.01694915"
     d="m 20.97069,12.388887 c -0.09851,-0.04601 -0.24806,-0.191021 -0.290831,-0.282011 -0.09478,-0.201638 0.0099,-0.509366 0.214044,-0.628979 0.06758,-0.0396 0.08722,-0.04292 0.213449,-0.03604 0.157638,0.0086 0.215684,0.0328 0.32892,0.137177 0.113302,0.104438 0.163545,0.214236 0.164465,0.359412 8.99e-4,0.141683 -0.03569,0.223528 -0.143472,0.3209 -0.152138,0.137447 -0.354363,0.191285 -0.486575,0.129541 z"
     id="path80"
     inkscape:connector-curvature="0" />
  <path
     style="fill:#ffffff;fill-opacity:1;stroke-width:0.01694915"
     d="m 20.97069,12.388887 c -0.09623,-0.04494 -0.248671,-0.191214 -0.291517,-0.279722 -0.09575,-0.197787 0.01111,-0.511941 0.21473,-0.631268 0.0676,-0.03962 0.08717,-0.04292 0.213449,-0.03599 0.16339,0.009 0.24068,0.04302 0.344879,0.151916 0.252031,0.263407 0.190481,0.599399 -0.13957,0.761883 -0.13861,0.06824 -0.244831,0.07854 -0.341971,0.03318 z"
     id="path82"
     inkscape:connector-curvature="0" />
  <path
     style="fill:#ffffff;fill-opacity:1;stroke-width:0.01694915"
     d="m 17.115738,13.483123 c -0.104294,-0.02892 -0.207153,-0.101404 -0.286881,-0.202177 -0.10819,-0.136748 -0.109682,-0.265386 -0.0051,-0.43759 0.140893,-0.231935 0.249776,-0.299828 0.428007,-0.26688 0.228759,0.04229 0.400717,0.206958 0.434865,0.416432 0.04652,0.28537 -0.284522,0.569618 -0.570918,0.490215 z"
     id="path84"
     inkscape:connector-curvature="0" />
  <path
     style="fill:#ffffff;fill-opacity:1;stroke-width:0.01694915"
     d="m 17.107803,13.482673 c -0.09885,-0.03206 -0.178134,-0.08416 -0.251266,-0.165111 -0.16104,-0.178252 -0.146963,-0.344427 0.05037,-0.594699 0.09658,-0.122483 0.158288,-0.155961 0.283489,-0.153794 0.179368,0.0031 0.365796,0.120268 0.450472,0.283107 0.05564,0.106998 0.06254,0.273943 0.01499,0.362708 -0.112773,0.210532 -0.356875,0.329804 -0.54806,0.267789 z"
     id="path86"
     inkscape:connector-curvature="0" />
  <path
     style="fill:#ffffff;fill-opacity:1;stroke-width:0.01694915"
     d="m 17.100313,13.483856 c -0.136479,-0.05102 -0.266974,-0.163692 -0.329395,-0.284402 -0.06781,-0.131123 0.0041,-0.342231 0.178848,-0.525385 0.09301,-0.09746 0.174914,-0.124715 0.302222,-0.100571 0.335347,0.0636 0.531875,0.391126 0.394446,0.657377 -0.100476,0.194659 -0.369178,0.319131 -0.546121,0.252981 z"
     id="path88"
     inkscape:connector-curvature="0" />
  <path
     style="fill:#ffffff;fill-opacity:1;stroke-width:0.01694915"
     d="m 17.119148,13.491395 c -0.128155,-0.04196 -0.250268,-0.137961 -0.324896,-0.255418 -0.09273,-0.145942 -0.04687,-0.336746 0.129065,-0.537033 0.134729,-0.153378 0.269081,-0.174418 0.479202,-0.07505 0.246202,0.116435 0.356037,0.389756 0.243915,0.606978 -0.04158,0.08055 -0.142311,0.177204 -0.233639,0.224178 -0.07748,0.03985 -0.226576,0.0583 -0.293647,0.03634 z"
     id="path90"
     inkscape:connector-curvature="0" />
  <path
     style="fill:#ffffff;fill-opacity:1;stroke-width:0.01694915"
     d="m 13.187504,14.59637 c -0.122226,-0.06292 -0.311109,-0.248472 -0.338582,-0.33262 -0.02773,-0.08494 0.0078,-0.197543 0.111636,-0.35403 0.129781,-0.195533 0.212842,-0.241625 0.386382,-0.214412 0.123017,0.01929 0.212493,0.06467 0.299945,0.152123 0.09379,0.09379 0.132561,0.185826 0.133017,0.315777 6.25e-4,0.178095 -0.08286,0.305086 -0.274312,0.417287 -0.117545,0.06889 -0.206479,0.07332 -0.318086,0.01587 z"
     id="path92"
     inkscape:connector-curvature="0" />
  <path
     style="fill:#ffffff;fill-opacity:1;stroke-width:0.01694915"
     d="m 13.187024,14.596275 c -0.119041,-0.05932 -0.310326,-0.24745 -0.338102,-0.332525 -0.01776,-0.05441 -0.01662,-0.07833 0.0073,-0.152542 0.06129,-0.190151 0.241249,-0.405998 0.352988,-0.423377 0.127314,-0.0198 0.311625,0.04142 0.425386,0.141306 0.138302,0.121431 0.188514,0.357578 0.110361,0.519023 -0.06372,0.131615 -0.292084,0.293677 -0.413835,0.293677 -0.02897,0 -0.09381,-0.0205 -0.144098,-0.04556 z"
     id="path94"
     inkscape:connector-curvature="0" />
  <path
     style="fill:#ffffff;fill-opacity:1;stroke-width:0.01694915"
     d="m 13.193082,14.599294 c -0.118753,-0.05918 -0.283675,-0.213223 -0.329399,-0.307676 -0.03456,-0.0714 -0.03621,-0.08615 -0.01745,-0.156315 0.04807,-0.179721 0.227793,-0.412184 0.342566,-0.44309 0.126391,-0.03403 0.318369,0.02504 0.446252,0.137328 0.138767,0.121839 0.18908,0.355056 0.111272,0.515785 -0.06636,0.13709 -0.289414,0.29594 -0.416116,0.296346 -0.02847,9.1e-5 -0.09018,-0.01898 -0.13713,-0.04238 z"
     id="path96"
     inkscape:connector-curvature="0" />
  <path
     style="fill:#ffffff;fill-opacity:1;stroke-width:0.01694915"
     d="m 13.194198,14.59985 c -0.110928,-0.05528 -0.267587,-0.196357 -0.322957,-0.290838 -0.03462,-0.05908 -0.04208,-0.08918 -0.03418,-0.137909 0.02824,-0.174001 0.228294,-0.445649 0.352916,-0.479206 0.124476,-0.03352 0.317153,0.02533 0.442082,0.135017 0.135196,0.118703 0.188684,0.340205 0.122248,0.506246 -0.05307,0.132621 -0.294284,0.308096 -0.424099,0.308512 -0.02847,9.1e-5 -0.08967,-0.01873 -0.136014,-0.04182 z"
     id="path98"
     inkscape:connector-curvature="0" />
  <path
     style="fill:#ffffff;fill-opacity:1;stroke-width:0.01694915"
     d="M 9.2716901,15.745661 C 9.1238282,15.697146 8.9980292,15.56935 8.9560758,15.425035 8.9160153,15.287232 8.9300024,15.1404 8.9928279,15.039226 c 0.057154,-0.09204 0.1810288,-0.184535 0.2846909,-0.212572 0.092431,-0.025 0.2933487,-0.01136 0.3626565,0.02461 0.2743505,0.142406 0.3382632,0.538953 0.121759,0.755457 -0.1125589,0.112559 -0.3583449,0.182217 -0.4902442,0.138939 z"
     id="path100"
     inkscape:connector-curvature="0" />
  <path
     style="fill:#ffffff;fill-opacity:1;stroke-width:0.01694915"
     d="M 9.2716901,15.745661 C 9.1278172,15.698455 8.9988055,15.569757 8.958162,15.432896 8.88396,15.18303 8.967892,14.977747 9.1935546,14.857176 c 0.057794,-0.03088 0.09741,-0.03729 0.2307876,-0.03733 0.1449657,-4.2e-5 0.1688777,0.0046 0.239872,0.04631 0.1325349,0.07791 0.2347043,0.256943 0.2347043,0.411272 0,0.08498 -0.045434,0.214774 -0.1022072,0.291973 -0.097603,0.132719 -0.3744507,0.225661 -0.5250212,0.176257 z"
     id="path102"
     inkscape:connector-curvature="0" />
  <path
     style="fill:#ffffff;fill-opacity:1;stroke-width:0.01694915"
     d="m 9.211832,15.720387 c -0.1043738,-0.0486 -0.2162729,-0.171636 -0.2523186,-0.277424 -0.041641,-0.122209 -0.034944,-0.269444 0.016994,-0.373671 0.051354,-0.103054 0.1171448,-0.16297 0.2419378,-0.220334 0.07913,-0.03637 0.1085476,-0.04076 0.2303748,-0.03437 0.1135494,0.006 0.1545554,0.01606 0.2193233,0.05401 0.215259,0.12615 0.2916912,0.419264 0.1673914,0.641937 C 9.7204152,15.716762 9.42065,15.817618 9.2118319,15.72038 Z"
     id="path104"
     inkscape:connector-curvature="0" />
  <path
     style="fill:#ffffff;fill-opacity:1;stroke-width:0.01694915"
     d="m 9.211832,15.721466 c -0.1046634,-0.05006 -0.2165667,-0.173577 -0.2523186,-0.278503 -0.1126495,-0.330608 0.108909,-0.631007 0.4657382,-0.631469 0.103835,-1.34e-4 0.1445959,0.0081 0.2157039,0.04353 0.1441445,0.07183 0.2383433,0.21273 0.2532534,0.378811 0.0251,0.279584 -0.1806031,0.502492 -0.4810084,0.521241 -0.097133,0.0061 -0.1298514,6.02e-4 -0.2013685,-0.03361 z"
     id="path106"
     inkscape:connector-curvature="0" />
  <path
     style="fill:#ffffff;fill-opacity:1;stroke-width:0.01694915"
     d="m 5.3708642,16.864306 c -0.1425374,-0.04677 -0.2655754,-0.168899 -0.3106001,-0.30831 -0.037572,-0.116336 -0.035694,-0.260581 0.00455,-0.349211 0.096236,-0.211955 0.3751403,-0.327664 0.6177558,-0.256288 0.1058912,0.03115 0.2543317,0.186345 0.2885953,0.301723 0.033832,0.113925 0.03388,0.173624 2.288e-4,0.286938 -0.034499,0.116172 -0.1466283,0.238116 -0.2662793,0.289588 -0.094142,0.0405 -0.2640891,0.05858 -0.3342473,0.03556 z"
     id="path108"
     inkscape:connector-curvature="0" />
  <path
     style="fill:#ffffff;fill-opacity:1;stroke-width:0.01694915"
     d="M 5.3708642,16.864306 C 5.2269913,16.817099 5.0979796,16.688401 5.0573361,16.55154 c -0.079093,-0.266335 0.029226,-0.494041 0.2804168,-0.589485 0.096479,-0.03666 0.2428182,-0.04157 0.3448139,-0.01156 0.1058912,0.03115 0.2543317,0.186345 0.2885953,0.301723 0.033832,0.113925 0.03388,0.173624 2.288e-4,0.286938 -0.034499,0.116172 -0.1466283,0.238116 -0.2662793,0.289588 -0.094142,0.0405 -0.2640891,0.05858 -0.3342473,0.03556 z"
     id="path110"
     inkscape:connector-curvature="0" />
  <path
     style="fill:#ffffff;fill-opacity:1;stroke-width:0.01694915"
     d="M 5.3708642,16.864306 C 5.2269913,16.817099 5.0979796,16.688401 5.0573361,16.55154 c -0.079093,-0.266335 0.029226,-0.494041 0.2804168,-0.589485 0.096479,-0.03666 0.2428182,-0.04157 0.3448139,-0.01156 0.1058912,0.03115 0.2543317,0.186345 0.2885953,0.301723 0.033832,0.113925 0.03388,0.173624 2.288e-4,0.286938 -0.034499,0.116172 -0.1466283,0.238116 -0.2662793,0.289588 -0.094142,0.0405 -0.2640891,0.05858 -0.3342473,0.03556 z"
     id="path112"
     inkscape:connector-curvature="0" />
  <path
     style="fill:#ffffff;fill-opacity:1;stroke-width:0.01694915"
     d="M 5.3110061,16.840111 C 5.2063427,16.790049 5.0944395,16.666533 5.0586875,16.561607 4.9513443,16.246572 5.1472467,15.955485 5.4811434,15.93389 c 0.1761574,-0.01139 0.2505348,0.01509 0.3656497,0.130207 0.1427403,0.14274 0.1805152,0.286767 0.1245978,0.475061 -0.075843,0.255393 -0.4239589,0.414037 -0.6603848,0.300953 z"
     id="path114"
     inkscape:connector-curvature="0" />
  <path
     style="fill:#ffffff;fill-opacity:1;stroke-width:0.01694915"
     d="M 1.4980926,17.953545 C 1.2860378,17.845068 1.1338769,17.678678 1.1337491,17.555132 c -1.458e-4,-0.141107 0.201102,-0.435696 0.3453464,-0.505524 0.065117,-0.03152 0.08431,-0.03369 0.1560068,-0.01762 0.2551963,0.05719 0.447736,0.261136 0.447736,0.474259 0,0.146582 -0.099868,0.316347 -0.2488618,0.42304 -0.1182142,0.08465 -0.2055072,0.09096 -0.3358839,0.02426 z"
     id="path116"
     inkscape:connector-curvature="0" />
  <path
     style="fill:#ffffff;fill-opacity:1;stroke-width:0.01694915"
     d="m 1.5150417,17.965876 c -0.196853,-0.09044 -0.3813559,-0.28852 -0.3813559,-0.409413 0,-0.150958 0.2177638,-0.461218 0.3625183,-0.5165 0.087864,-0.03356 0.1662828,-0.01789 0.3209734,0.0641 0.342229,0.181406 0.3529568,0.576621 0.022271,0.820465 -0.083867,0.06184 -0.1115596,0.07318 -0.1779661,0.07287 -0.043254,-2.04e-4 -0.1091523,-0.01439 -0.1464405,-0.03152 z"
     id="path118"
     inkscape:connector-curvature="0" />
  <path
     style="fill:#ffffff;fill-opacity:1;stroke-width:0.01694915"
     d="m 1.5150417,17.965796 c -0.2002151,-0.09222 -0.3813559,-0.286752 -0.3813559,-0.40954 0,-0.167168 0.2200811,-0.471363 0.3789605,-0.523798 0.077261,-0.0255 0.196692,0.006 0.3322102,0.08757 0.3230001,0.194461 0.3119984,0.594207 -0.022554,0.819508 -0.1013938,0.06828 -0.1980877,0.07655 -0.3072608,0.02626 z"
     id="path120"
     inkscape:connector-curvature="0" />
  <path
     style="fill:#ffffff;fill-opacity:1;stroke-width:0.01694915"
     d="M 1.4980926,17.957491 C 1.3003491,17.86428 1.1336858,17.678839 1.1336858,17.552028 c 0,-0.154599 0.2136094,-0.455196 0.3643894,-0.51278 0.073327,-0.028 0.079544,-0.02773 0.1916947,0.0083 0.1430338,0.04599 0.2655714,0.136377 0.3332106,0.245781 0.045529,0.07364 0.051338,0.09775 0.05099,0.211558 -4.315e-4,0.141092 -0.031029,0.220255 -0.1276745,0.330329 -0.1402709,0.159759 -0.2849239,0.199213 -0.4482038,0.122247 z"
     id="path122"
     inkscape:connector-curvature="0" />
  <path
     style="fill:#3bdabe;fill-opacity:1;stroke-width:0.03389831"
     d="M 7.7496299,17.441174 C 7.7358164,17.384836 5.4548263,2.7835684 5.4591462,2.7791341 c 0.00312,-0.0032 0.562374,-0.076642 1.2427877,-0.1632006 0.6804136,-0.086558 1.4940405,-0.1945315 1.8080599,-0.2399406 0.3140192,-0.045409 0.60465,-0.082562 0.6458459,-0.082562 0.059886,0 0.087331,0.035677 0.1369,0.1779661 0.034099,0.097881 0.08328,0.1951979 0.1092909,0.216259 0.070217,0.056855 0.6997744,3.8852532 1.5182954,9.232894 0.543219,3.549014 0.644211,4.300384 0.600156,4.465102 -0.02148,0.08032 -0.03906,0.206838 -0.03906,0.281147 0,0.115708 -0.01048,0.135107 -0.07298,0.135107 -0.158928,0 -3.1821266,0.534234 -3.5795589,0.632549 -0.041949,0.01038 -0.077612,0.0134 -0.07925,0.0067 z m 1.9284858,-1.747805 c 0.1613735,-0.120483 0.2270356,-0.241053 0.2270356,-0.416887 0,-0.378372 -0.4081719,-0.608689 -0.737679,-0.416247 -0.1433987,0.08375 -0.262321,0.263786 -0.262321,0.397128 0,0.162046 0.1346237,0.394284 0.2711864,0.467821 0.1450173,0.07809 0.37402,0.06357 0.501778,-0.03181 z M 7.8977655,4.7893251 C 8.0881475,4.7082044 8.1705515,4.5874983 8.184552,4.3692378 8.2065057,4.0269929 8.0085278,3.8315682 7.6684299,3.8597718 7.3826158,3.8834737 7.2101296,4.061503 7.2103627,4.3325594 7.2106746,4.6970581 7.5637303,4.9316556 7.8977655,4.7893251 Z"
     id="path124"
     inkscape:connector-curvature="0" />
  <path
     style="fill:#3bdabe;fill-opacity:1;stroke-width:0.03389831"
     d="M 7.7369807,17.373007 C 7.7134557,17.272245 5.4528884,2.7868595 5.4595465,2.7795407 5.4622563,2.7765621 5.960236,2.7108511 6.5661682,2.6335161 7.1721004,2.5561811 7.9882021,2.4480688 8.3797275,2.3932666 8.771253,2.3384644 9.1186719,2.2935823 9.1517699,2.2935286 c 0.1131556,-1.837e-4 0.2803292,0.448312 0.3945949,1.0586242 0.2666048,1.4239806 1.3596332,8.3498162 1.7962892,11.3819562 0.175232,1.216808 0.195983,1.462017 0.154973,1.831192 l -0.02455,0.221023 -0.800911,0.129435 c -0.7024161,0.113517 -2.6290788,0.464659 -2.8400753,0.517616 -0.060328,0.01514 -0.080461,0.0024 -0.095107,-0.06037 z M 9.5468913,15.751726 C 9.911597,15.647129 10.026806,15.183247 9.7531841,14.9211 9.615114,14.788821 9.3180458,14.762408 9.1506041,14.867523 c -0.2855725,0.179275 -0.320985,0.506347 -0.082279,0.759938 0.1458363,0.154931 0.2643444,0.185703 0.4785662,0.124265 z M 7.9214247,4.7764291 C 8.0895479,4.6919611 8.1933153,4.5217855 8.1931601,4.3307908 8.1927771,3.8592164 7.6482742,3.6787387 7.3119309,4.0387038 7.1981651,4.1604595 7.1903056,4.4754727 7.2973914,4.6214536 c 0.086334,0.1176913 0.2685708,0.2142448 0.40437,0.2142448 0.055932,0 0.1547807,-0.026671 0.2196633,-0.059269 z"
     id="path126"
     inkscape:connector-curvature="0" />
  <path
     style="fill:#ffcd01;fill-opacity:1;stroke-width:0.04793944"
     d="M 11.476146,15.409434 C 11.162707,13.184417 10.006259,5.7727105 9.6457801,3.6785674 9.5532471,3.1410118 9.484518,2.6942138 9.4930487,2.6856831 9.5452328,2.633499 13.255538,2.1590837 13.29589,2.1994357 c 0.04334,0.043338 0.367741,1.6978085 0.591827,3.0183426 0.251867,1.4842457 0.438077,2.7067676 0.991462,6.5092307 0.450365,3.094583 0.550077,3.931034 0.468614,3.931034 -0.04864,0 -3.504707,0.619834 -3.641813,0.653147 -0.09477,0.02303 -0.10548,-0.019 -0.229834,-0.901756 z m 2.129857,-0.830028 c 0.133081,-0.08529 0.236804,-0.281044 0.236804,-0.446916 0,-0.234963 -0.260847,-0.487903 -0.503154,-0.487903 -0.367931,0 -0.62445,0.355918 -0.489391,0.679026 0.136545,0.326663 0.46938,0.439317 0.755741,0.255793 z M 12.013199,4.6600311 c 0.403465,-0.2086398 0.309649,-0.865018 -0.13768,-0.9632679 -0.188413,-0.041382 -0.457194,0.085493 -0.546348,0.2578988 -0.144726,0.2798681 -0.08107,0.5207275 0.179648,0.6796955 0.181398,0.1106062 0.325914,0.1179623 0.50438,0.025674 z"
     id="path136"
     inkscape:connector-curvature="0" />
  <path
     style="fill:#ffcd01;fill-opacity:1;stroke-width:0.02396972"
     d="m 11.638882,16.289622 c -0.03627,-0.0437 -0.08274,-0.310851 -0.222188,-1.277231 C 11.124576,12.987955 10.161955,6.8127901 9.7147582,4.0945637 9.5965878,3.3762808 9.499903,2.7643595 9.499903,2.7347387 c 0,-0.036096 0.017785,-0.058057 0.053932,-0.066596 0.2976268,-0.070305 3.411265,-0.467568 3.664674,-0.467568 h 0.08829 l 0.0488,0.2119365 c 0.06994,0.3037831 0.293784,1.4613874 0.434095,2.24496 0.277435,1.5493412 0.732915,4.5433488 1.292692,8.4972668 0.22359,1.579297 0.267924,1.943618 0.273459,2.2472 l 0.0047,0.255775 -0.119849,0.01959 c -0.347379,0.05677 -3.321908,0.590616 -3.513737,0.630623 -0.03645,0.0076 -0.07281,4.8e-5 -0.08803,-0.0183 z m 1.956351,-1.70353 c 0.196625,-0.13012 0.299169,-0.436283 0.207142,-0.618456 -0.183905,-0.364046 -0.62318,-0.427444 -0.871801,-0.125823 -0.157135,0.190631 -0.150468,0.451431 0.01627,0.636364 0.178671,0.198172 0.445019,0.242502 0.648393,0.107915 z M 11.982465,4.6720255 c 0.385045,-0.1748837 0.381337,-0.7531284 -0.006,-0.9304417 -0.104527,-0.047854 -0.155004,-0.057641 -0.238363,-0.046215 -0.258248,0.035397 -0.437723,0.2111015 -0.478944,0.4688802 -0.0303,0.1894684 0.122456,0.4261685 0.334594,0.518473 0.105907,0.046082 0.273845,0.04146 0.388679,-0.010696 z"
     id="path138"
     inkscape:connector-curvature="0" />
  <path
     style="fill:#ffcd01;fill-opacity:1;stroke-width:0.02396972"
     d="M 11.63451,16.284354 C 11.59675,16.238854 11.54913,15.956131 11.345586,14.568951 10.998182,12.201362 10.316599,7.8283958 9.7985262,4.6431698 9.6342835,3.6333694 9.499903,2.7792761 9.499903,2.7451845 c 0,-0.038127 0.016145,-0.066962 0.041947,-0.074916 0.183486,-0.056565 3.022416,-0.4262959 3.545654,-0.4617725 l 0.219856,-0.014907 0.02496,0.093379 c 0.04613,0.172597 0.287456,1.4047932 0.431998,2.205767 0.256916,1.4236887 0.548723,3.3043842 1.042741,6.720454 0.488293,3.376489 0.544815,3.807506 0.550045,4.194425 l 0.0034,0.251407 -0.779016,0.138737 c -0.428459,0.07631 -1.254255,0.224743 -1.835102,0.32986 -0.580848,0.105117 -1.062218,0.191122 -1.069711,0.191122 -0.0075,0 -0.02646,-0.01547 -0.04216,-0.03439 z m 1.90886,-1.680242 c 0.195881,-0.09761 0.323835,-0.34163 0.285708,-0.544865 -0.0227,-0.120982 -0.148436,-0.277881 -0.278292,-0.347255 -0.08827,-0.04716 -0.134572,-0.05602 -0.25488,-0.04881 -0.464208,0.02784 -0.639884,0.581778 -0.279142,0.880178 0.161904,0.133925 0.338808,0.154333 0.526606,0.06075 z M 12.050221,4.6284257 c 0.17243,-0.121188 0.248057,-0.3246899 0.201791,-0.542988 C 12.219032,3.9298209 12.050918,3.7514059 11.89918,3.710984 11.709503,3.660455 11.467617,3.755222 11.35712,3.9233546 c -0.179495,0.27312 -0.08606,0.5948389 0.214465,0.738466 0.161175,0.077028 0.339196,0.064607 0.478636,-0.033395 z"
     id="path140"
     inkscape:connector-curvature="0" />
  <path
     style="fill:#ffcd01;fill-opacity:1;stroke-width:0.02396972"
     d="M 11.637368,16.287798 C 11.594918,16.23665 11.566025,16.071115 11.381285,14.820633 10.911759,11.642473 10.124706,6.6091037 9.6435681,3.7075656 9.5067178,2.8822794 9.4838542,2.6927172 9.5185761,2.6712579 9.5831706,2.6313363 12.604393,2.2370442 13.063525,2.2086156 l 0.243816,-0.015097 0.0248,0.093414 c 0.05128,0.193119 0.153392,0.6942718 0.302316,1.4836582 0.352993,1.8710784 0.632212,3.6581793 1.292045,8.2695542 0.443098,3.096673 0.499798,3.589988 0.416018,3.619502 -0.03264,0.0115 -3.629151,0.659093 -3.660371,0.659093 -0.01051,0 -0.03066,-0.01392 -0.04478,-0.03094 z m 1.824187,-1.648379 c 0.299828,-0.08326 0.465195,-0.492822 0.297041,-0.73567 -0.09601,-0.138659 -0.232601,-0.22649 -0.373237,-0.240004 -0.324092,-0.03114 -0.571927,0.205059 -0.548918,0.52315 0.01376,0.190247 0.103677,0.321926 0.281344,0.412018 0.141157,0.07158 0.204851,0.07908 0.34377,0.04051 z M 11.989657,4.6545252 c 0.168161,-0.083798 0.248558,-0.2050179 0.26234,-0.3955487 0.01351,-0.1867783 -0.04111,-0.3302426 -0.166652,-0.4376993 -0.239478,-0.2049839 -0.593538,-0.1333943 -0.748514,0.1513466 -0.126058,0.2316099 -0.0557,0.5127728 0.161973,0.6473042 0.182754,0.112948 0.314929,0.122264 0.490853,0.034597 z"
     id="path142"
     inkscape:connector-curvature="0" />
</svg>
