<?xml version="1.0" encoding="UTF-8" standalone="no"?>
<!-- Created with Inkscape (http://www.inkscape.org/) -->

<svg
   xmlns:dc="http://purl.org/dc/elements/1.1/"
   xmlns:cc="http://creativecommons.org/ns#"
   xmlns:rdf="http://www.w3.org/1999/02/22-rdf-syntax-ns#"
   xmlns:svg="http://www.w3.org/2000/svg"
   xmlns="http://www.w3.org/2000/svg"
   xmlns:sodipodi="http://sodipodi.sourceforge.net/DTD/sodipodi-0.dtd"
   xmlns:inkscape="http://www.inkscape.org/namespaces/inkscape"
   version="1.1"
   id="svg10"
   width="20"
   height="20"
   viewBox="0 0 20 20"
   sodipodi:docname="doritos.svg"
   inkscape:version="0.92.4 (5da689c313, 2019-01-14)">
  <metadata
     id="metadata16">
    <rdf:RDF>
      <cc:Work
         rdf:about="">
        <dc:format>image/svg+xml</dc:format>
        <dc:type
           rdf:resource="http://purl.org/dc/dcmitype/StillImage" />
        <dc:title></dc:title>
      </cc:Work>
    </rdf:RDF>
  </metadata>
  <defs
     id="defs14" />
  <sodipodi:namedview
     pagecolor="#ffffff"
     bordercolor="#666666"
     borderopacity="1"
     objecttolerance="10"
     gridtolerance="10"
     guidetolerance="10"
     inkscape:pageopacity="0"
     inkscape:pageshadow="2"
     inkscape:window-width="1920"
     inkscape:window-height="1001"
     id="namedview12"
     showgrid="false"
     inkscape:zoom="8.9272231"
     inkscape:cx="21.001559"
     inkscape:cy="22.149627"
     inkscape:window-x="-9"
     inkscape:window-y="-9"
     inkscape:window-maximized="1"
     inkscape:current-layer="svg10" />
  <g
     id="g20"
     transform="matrix(0.34576472,0,0,0.34576472,-11.109284,-14.887857)">
    <path
       style="fill:#ef9a16"
       d="m 28.007655,104.5 c 0.0044,-1.1 0.988755,-5.6 2.187515,-10 1.946441,-7.144333 2.21614,-11.000503 2.521535,-36.052997 C 33.057638,30.479137 33.051,30.373613 30.529338,23.674174 29.138202,19.978266 28,14.939615 28,12.477171 V 8 h 33.613544 33.613544 l -0.680025,4.75 c -0.374013,2.6125 -1.603006,7.9 -2.731095,11.75 -1.914042,6.532343 -2.011985,8.73701 -1.466035,33 0.401543,17.845232 1.035134,27.638375 2.020091,31.223662 2.394765,8.717044 2.943315,14.773158 1.449085,15.998228 -0.864583,0.70885 -12.431564,1.20151 -33.569257,1.4298 -31.701749,0.34239 -32.250013,0.3143 -32.242197,-1.65169 z M 59.075686,53.411835 61.5,50.823669 58.75,52.07235 C 57.2375,52.759124 56,53.923798 56,54.660515 c 0,1.839384 0.29549,1.719419 3.075686,-1.24868 z M 45.8,43.8 c 0.66,-0.66 1.2,-2.696138 1.2,-4.524751 0,-2.648769 -0.521531,-3.523036 -2.5651,-4.3 C 39.550551,33.118223 39,33.576576 39,39.5 c 0,5.357143 0.07273,5.5 2.8,5.5 1.54,0 3.34,-0.54 4,-1.2 z M 41,39.426676 c 0,-2.778893 0.365236,-3.501442 1.642817,-3.25 C 46.637036,36.962782 46.980838,43 43.031385,43 41.368529,43 41,42.351736 41,39.426676 Z m 9.850653,3.70579 c -1.362989,-2.182493 -0.415643,-5.487084 1.399873,-4.883126 0.687211,0.228611 1.516282,1.728532 1.842381,3.333158 0.514865,2.533485 0.700344,2.669267 1.409147,1.031579 1.714719,-3.961855 -4.368085,-7.781254 -6.250605,-3.924761 C 47.881994,41.494755 48.890707,45 51.067491,45 c 0.522201,0 0.424624,-0.84039 -0.216838,-1.867534 z M 59,41.583333 c 0,-1.879166 0.5625,-3.671231 1.25,-3.982366 0.6875,-0.311134 0.35,-0.457392 -0.75,-0.325016 -1.534168,0.184623 -2.072289,1.112181 -2.310365,3.982366 C 57.010058,43.423243 57.326111,45 57.939635,45 58.522836,45 59,43.4625 59,41.583333 Z m 5,-1.14235 C 64,38.548442 63.55,37 63,37 c -0.55,0 -1,1.826558 -1,4.059017 0,2.451367 0.396069,3.814233 1,3.440983 0.55,-0.339919 1,-2.166476 1,-4.059017 z m 3.271721,1.200101 c -0.253033,-1.323657 0.03577,-2.713089 0.64178,-3.087625 0.765811,-0.473297 0.663829,-1.118986 -0.334402,-2.117217 C 66.789166,35.646309 65.885714,35 65.571429,35 c -0.786828,0 -0.724572,8.513524 0.06805,9.306147 1.201197,1.201197 2.092978,-0.254871 1.632241,-2.665063 z m 9.144829,1.715788 C 77.392679,40.81312 76.378268,40.621732 74.083333,42.916667 72.106275,44.893725 72.096566,45 73.893011,45 c 1.041156,0 2.176749,-0.739408 2.523539,-1.643128 z m 6.277315,-0.0015 c 0.373828,-0.97418 -0.04662,-2.140163 -1.031385,-2.860242 -2.120065,-1.550229 -2.098721,-2.2345 0.08752,-2.805824 1.076662,-0.281362 0.691897,-0.501957 -1,-0.573325 -3.118607,-0.13155 -3.524308,1.370917 -1.095012,4.055258 C 81.194971,42.872922 81.194971,43 79.654988,43 78.744744,43 78,43.45 78,44 c 0,1.668825 4.017852,1.117055 4.693865,-0.644608 z M 71.313196,39.91034 c 0.432388,-1.653455 1.03078,-1.94311 2.866631,-1.387605 1.790964,0.541923 2.059288,0.426938 1.176393,-0.504121 C 73.687031,36.258369 70.852307,37.157082 69.89508,39.75 69.438233,40.9875 69.447463,42 69.91559,42 c 0.468129,0 1.097051,-0.940347 1.397603,-2.08966 z M 48.5,26 c -0.339919,-0.55 -1.068034,-1 -1.618034,-1 -0.55,0 -0.721885,0.45 -0.381966,1 0.339919,0.55 1.068034,1 1.618034,1 0.55,0 0.721885,-0.45 0.381966,-1 z"
       id="path34"
       inkscape:connector-curvature="0" />
    <path
       style="fill:#d76c16"
       d="m 28.007655,104.5 c 0.0044,-1.1 0.988755,-5.6 2.187515,-10 1.946441,-7.144333 2.21614,-11.000503 2.521535,-36.052997 C 33.057638,30.479137 33.051,30.373613 30.529338,23.674174 29.138202,19.978266 28,14.939615 28,12.477171 V 8 h 33.613544 33.613544 l -0.680025,4.75 c -0.374013,2.6125 -1.603006,7.9 -2.731095,11.75 -1.914042,6.532343 -2.011985,8.73701 -1.466035,33 0.401543,17.845232 1.035134,27.638375 2.020091,31.223662 2.394765,8.717044 2.943315,14.773158 1.449085,15.998228 -0.864583,0.70885 -12.431564,1.20151 -33.569257,1.4298 -31.701749,0.34239 -32.250013,0.3143 -32.242197,-1.65169 z M 60.61624,80.013863 c 2.080574,-4.392376 4.033588,-7.580453 4.340031,-7.084617 0.306444,0.495836 1.679146,0.245826 3.05045,-0.555578 L 70.5,70.91657 68.103595,71.57214 c -2.510965,0.686909 -2.587689,-0.0021 -0.553389,-4.969822 0.730791,-1.784566 0.405685,-1.85566 -5.454069,-1.192704 -7.851875,0.888338 -9.773059,1.545912 -7.929983,2.714237 C 54.899769,68.588889 55.95,68.969374 56.5,68.969374 57.05,68.969374 56.825,68.533156 56,68 54.718103,67.171574 54.754453,67.028399 56.25,67.015313 57.2125,67.006891 58,67.45 58,68 c 0,0.55 0.926558,1 2.059017,1 1.132459,0 1.784087,-0.444846 1.448062,-0.988546 -0.363944,-0.588874 0.08896,-0.719962 1.120217,-0.324232 1.423293,0.546168 1.165763,0.932086 -1.448062,2.169972 C 59.430655,70.685306 58,71.847965 58,72.44088 c 0,1.177559 -3.699254,3.827905 -5.841631,4.185261 -0.737898,0.123084 -1.601707,0.483863 -1.919576,0.801732 C 49.321575,78.345092 54.206353,88 55.587627,88 56.27279,88 58.535666,84.406238 60.61624,80.013863 Z M 60.333333,73.527778 C 60.333333,72.6875 60.970833,72 61.75,72 c 0.779167,0 1.238542,0.534375 1.020833,1.1875 -0.604366,1.8131 -2.4375,2.069007 -2.4375,0.340278 z m 12.640431,7.413298 c 2.823825,-3.882408 5.365608,-7.66189 5.648406,-8.398849 0.739417,-1.92689 -1.094592,-2.718206 -4.326181,-1.866611 L 71.5,71.412421 l 3,0.636696 c 2.689973,0.570899 2.793315,0.722644 1,1.468379 -1.1,0.457425 -2.381045,1.465971 -2.846767,2.241214 -0.541605,0.901558 -1.712855,1.192158 -3.25,0.806359 C 67.978727,76.207541 67,76.400944 67,77.039965 c 0,0.592938 0.422766,0.816785 0.939479,0.497439 0.516714,-0.319347 0.870952,0.329096 0.787196,1.440983 C 68.637019,80.168596 67.863665,81 66.846213,81 65.895714,81 64.863257,81.412238 64.551863,81.916084 63.805744,83.12333 65.68394,88 66.895017,88 c 0.519486,0 3.254922,-3.176516 6.078747,-7.058924 z M 54.5,74 c 0.339919,-0.55 0.168034,-1 -0.381966,-1 -0.55,0 -1.278115,0.45 -1.618034,1 -0.339919,0.55 -0.168034,1 0.381966,1 0.55,0 1.278115,-0.45 1.618034,-1 z M 51.651554,67.318221 C 50.967634,66.634301 43,69.193956 43,70.09759 c 0,0.429558 2.049389,0.08272 4.554198,-0.770757 2.504808,-0.853474 4.348619,-1.75735 4.097356,-2.008612 z M 63.628145,49.716846 c 3.559057,-3.357258 4.066646,-4.35043 3.682033,-7.20444 -0.245361,-1.820698 0.03793,-3.609512 0.629526,-3.975141 C 68.960739,37.906231 67.014954,35 65.571429,35 c -1.031891,0 -0.596694,8.574735 0.490369,9.661798 0.749063,0.749063 -0.468232,2.161014 -4.132971,4.793866 -4.051202,2.910499 -5.382263,3.436233 -6.046484,2.388203 -1.015617,-1.602474 -1.196942,0.172725 -0.26556,2.599869 0.719272,1.874393 1.504337,1.411187 8.011362,-4.72689 z M 45.8,43.8 c 0.66,-0.66 1.2,-2.696138 1.2,-4.524751 0,-2.648769 -0.521531,-3.523036 -2.5651,-4.3 C 39.550551,33.118223 39,33.576576 39,39.5 c 0,5.357143 0.07273,5.5 2.8,5.5 1.54,0 3.34,-0.54 4,-1.2 z M 41,39.426676 c 0,-2.778893 0.365236,-3.501442 1.642817,-3.25 C 46.637036,36.962782 46.980838,43 43.031385,43 41.368529,43 41,42.351736 41,39.426676 Z m 9.850653,3.70579 c -1.362989,-2.182493 -0.415643,-5.487084 1.399873,-4.883126 0.687211,0.228611 1.516282,1.728532 1.842381,3.333158 0.514865,2.533485 0.700344,2.669267 1.409147,1.031579 1.714719,-3.961855 -4.368085,-7.781254 -6.250605,-3.924761 C 47.881994,41.494755 48.890707,45 51.067491,45 c 0.522201,0 0.424624,-0.84039 -0.216838,-1.867534 z M 59,41.583333 c 0,-1.879166 0.5625,-3.671231 1.25,-3.982366 0.6875,-0.311134 0.35,-0.457392 -0.75,-0.325016 -1.534168,0.184623 -2.072289,1.112181 -2.310365,3.982366 C 57.010058,43.423243 57.326111,45 57.939635,45 58.522836,45 59,43.4625 59,41.583333 Z m 5,-1.14235 C 64,38.548442 63.55,37 63,37 c -0.55,0 -1,1.826558 -1,4.059017 0,2.451367 0.396069,3.814233 1,3.440983 0.55,-0.339919 1,-2.166476 1,-4.059017 z m 10.90109,1.126774 c 0.327671,0.327671 -0.277035,1.233973 -1.343792,2.014004 C 71.666024,44.964694 71.672287,45 73.80887,45 75.013992,45 76,44.811804 76,44.581787 c 0,-0.230016 0.250862,-1.071947 0.557471,-1.870957 0.750217,-1.955034 -2.421238,-3.068783 -4.299559,-1.509915 -1.242883,1.031501 -1.421522,0.910554 -1.082264,-0.732747 0.280973,-1.360973 1.105747,-1.891503 2.673432,-1.719665 1.303969,0.142932 2.004937,-0.175691 1.649995,-0.75 -1.136023,-1.838123 -4.544292,-1.049641 -5.409679,1.251497 -0.490821,1.305134 -0.459761,2.395823 0.07396,2.597246 0.506065,0.190985 0.338836,1.078964 -0.37162,1.973285 -0.710456,0.894322 0.01446,0.61926 1.610924,-0.61125 1.596465,-1.230509 3.170757,-1.969195 3.498428,-1.641524 z m 7.792775,1.787635 c 0.373828,-0.97418 -0.04662,-2.140163 -1.031385,-2.860242 -2.120065,-1.550229 -2.098721,-2.2345 0.08752,-2.805824 1.076662,-0.281362 0.691897,-0.501957 -1,-0.573325 -3.118607,-0.13155 -3.524308,1.370917 -1.095012,4.055258 C 81.194971,42.872922 81.194971,43 79.654988,43 78.744744,43 78,43.45 78,44 c 0,1.668825 4.017852,1.117055 4.693865,-0.644608 z M 50.505953,26.572257 c -2.196725,-1.329624 -4.119818,-2.291726 -4.273538,-2.138005 -0.679451,0.679451 1.068632,3.497725 1.86445,3.005882 0.488012,-0.301608 1.678359,-0.08771 2.645215,0.475335 0.966856,0.563043 2.20792,1.035092 2.75792,1.048999 0.55,0.01391 -0.797321,-1.062588 -2.994047,-2.392211 z"
       id="path32"
       inkscape:connector-curvature="0" />
    <path
       style="fill:#615858"
       d="m 28.007655,104.5 c 0.0044,-1.1 0.988755,-5.6 2.187515,-10 1.946441,-7.144333 2.21614,-11.000503 2.521535,-36.052997 C 33.057638,30.479137 33.051,30.373613 30.529338,23.674174 29.138202,19.978266 28,14.939615 28,12.477171 V 8 h 33.613544 33.613544 l -0.680025,4.75 c -0.374013,2.6125 -1.603006,7.9 -2.731095,11.75 -1.914042,6.532343 -2.011985,8.73701 -1.466035,33 0.401543,17.845232 1.035134,27.638375 2.020091,31.223662 2.394765,8.717044 2.943315,14.773158 1.449085,15.998228 -0.864583,0.70885 -12.431564,1.20151 -33.569257,1.4298 -31.701749,0.34239 -32.250013,0.3143 -32.242197,-1.65169 z m 65.675459,-3.6875 c -0.319226,-0.79773 -0.556183,-0.56078 -0.604167,0.60417 -0.04342,1.05416 0.192928,1.64479 0.52522,1.3125 0.332291,-0.3323 0.367818,-1.1948 0.07895,-1.91667 z M 70,85.619852 c 5.589637,-7.462393 9,-12.871607 9,-14.274999 0,-1.407149 -0.90482,-1.549569 -6.515839,-1.025604 -6.331519,0.591246 -6.484924,0.550694 -5.422996,-1.433536 1.917679,-3.583216 0.506287,-4.994011 -4.285867,-4.284055 -15.672855,2.321927 -21.982177,4.636553 -20.25524,7.430797 0.563763,0.912187 0.989072,0.809165 1.668015,-0.404039 C 45.345481,69.560242 47,69.519408 47,71.559017 c 0,0.857459 0.430347,1.293048 0.956326,0.967975 0.525979,-0.325073 0.72488,-1.194182 0.442001,-1.931353 -0.684319,-1.783304 3.834019,-2.63013 5.914883,-1.108565 1.389488,1.016019 1.191475,1.511293 -1.614759,4.038865 -1.759148,1.584463 -3.547558,2.785447 -3.974245,2.668853 -0.426686,-0.116593 0.631418,2.491881 2.351343,5.79661 C 52.795474,85.296131 54.8245,88 55.584497,88 c 0.759996,0 2.57787,-2.360308 4.039719,-5.245129 l 2.657908,-5.245128 1.258402,4.261945 C 65.951615,89.93754 66.514636,90.272954 70,85.619852 Z M 89.683114,67.8125 c -0.319226,-0.797733 -0.556183,-0.560776 -0.604167,0.604167 -0.04342,1.054166 0.192928,1.644791 0.52522,1.3125 0.332291,-0.332292 0.367818,-1.194792 0.07895,-1.916667 z M 72.719295,44.644395 c 3.508846,0.880665 5.951854,-2.789137 2.690001,-4.040828 -1.031364,-0.395771 -4.541282,1.667136 -9.981849,5.866699 l -8.391145,6.47711 -1.478113,-2.723688 c -1.759657,-3.242481 -1.938537,-2.133504 -0.494588,3.066224 l 1.052448,3.789913 7.053936,-6.530864 c 5.896949,-5.459672 7.463228,-6.428139 9.54931,-5.904566 z m 0.300761,-2.168561 c 0.69572,-0.838291 1.470881,-1.31823 1.72258,-1.066531 C 75.436134,42.1028 74.027093,44 72.818538,44 72.155445,44 72.231307,43.426218 73.020056,42.475834 Z M 45.8,43.8 c 0.66,-0.66 1.2,-2.696138 1.2,-4.524751 0,-2.648769 -0.521531,-3.523036 -2.5651,-4.3 C 39.550551,33.118223 39,33.576576 39,39.5 c 0,5.357143 0.07273,5.5 2.8,5.5 1.54,0 3.34,-0.54 4,-1.2 z M 41,39.426676 c 0,-2.778893 0.365236,-3.501442 1.642817,-3.25 C 46.637036,36.962782 46.980838,43 43.031385,43 41.368529,43 41,42.351736 41,39.426676 Z m 9.850653,3.70579 c -1.362989,-2.182493 -0.415643,-5.487084 1.399873,-4.883126 0.687211,0.228611 1.516282,1.728532 1.842381,3.333158 0.514865,2.533485 0.700344,2.669267 1.409147,1.031579 1.714719,-3.961855 -4.368085,-7.781254 -6.250605,-3.924761 C 47.881994,41.494755 48.890707,45 51.067491,45 c 0.522201,0 0.424624,-0.84039 -0.216838,-1.867534 z M 59,41.583333 c 0,-1.879166 0.5625,-3.671231 1.25,-3.982366 0.6875,-0.311134 0.35,-0.457392 -0.75,-0.325016 -1.534168,0.184623 -2.072289,1.112181 -2.310365,3.982366 C 57.010058,43.423243 57.326111,45 57.939635,45 58.522836,45 59,43.4625 59,41.583333 Z m 5,-1.14235 C 64,38.548442 63.55,37 63,37 c -0.55,0 -1,1.826558 -1,4.059017 0,2.451367 0.396069,3.814233 1,3.440983 0.55,-0.339919 1,-2.166476 1,-4.059017 z m 3.271721,1.200101 c -0.253033,-1.323657 0.03577,-2.713089 0.64178,-3.087625 0.765811,-0.473297 0.663829,-1.118986 -0.334402,-2.117217 C 66.789166,35.646309 65.885714,35 65.571429,35 c -0.786828,0 -0.724572,8.513524 0.06805,9.306147 1.201197,1.201197 2.092978,-0.254871 1.632241,-2.665063 z m 15.422144,1.714308 c 0.373828,-0.97418 -0.04662,-2.140163 -1.031385,-2.860242 -2.120065,-1.550229 -2.098721,-2.2345 0.08752,-2.805824 1.076662,-0.281362 0.691897,-0.501957 -1,-0.573325 -3.118607,-0.13155 -3.524308,1.370917 -1.095012,4.055258 C 81.194971,42.872922 81.194971,43 79.654988,43 78.744744,43 78,43.45 78,44 c 0,1.668825 4.017852,1.117055 4.693865,-0.644608 z M 71.313196,39.91034 c 0.432388,-1.653455 1.03078,-1.94311 2.866631,-1.387605 1.790964,0.541923 2.059288,0.426938 1.176393,-0.504121 C 73.687031,36.258369 70.852307,37.157082 69.89508,39.75 69.438233,40.9875 69.447463,42 69.91559,42 c 0.468129,0 1.097051,-0.940347 1.397603,-2.08966 z M 55,28.946007 c -2.711134,-1.849657 -9.187116,-5.092224 -9.515079,-4.764262 -0.176697,0.176698 0.300964,1.44559 1.06147,2.819762 0.760506,1.374171 1.398684,1.957716 1.418174,1.296767 0.02637,-0.894189 0.867153,-0.840227 3.285435,0.210858 3.813492,1.657501 5.894481,1.899937 3.75,0.436875 z"
       id="path30"
       inkscape:connector-curvature="0" />
    <path
       style="fill:#d0161b"
       d="m 28.007655,104.5 c 0.0044,-1.1 0.988755,-5.6 2.187515,-10 1.946441,-7.144333 2.21614,-11.000503 2.521535,-36.052997 C 33.057638,30.479137 33.051,30.373613 30.529338,23.674174 29.138202,19.978266 28,14.939615 28,12.477171 V 8 h 33.613544 33.613544 l -0.680025,4.75 c -0.374013,2.6125 -1.603006,7.9 -2.731095,11.75 -1.914042,6.532343 -2.011985,8.73701 -1.466035,33 0.401543,17.845232 1.035134,27.638375 2.020091,31.223662 2.394765,8.717044 2.943315,14.773158 1.449085,15.998228 -0.864583,0.70885 -12.431564,1.20151 -33.569257,1.4298 -31.701749,0.34239 -32.250013,0.3143 -32.242197,-1.65169 z m 65.675459,-3.6875 c -0.319226,-0.79773 -0.556183,-0.56078 -0.604167,0.60417 -0.04342,1.05416 0.192928,1.64479 0.52522,1.3125 0.332291,-0.3323 0.367818,-1.1948 0.07895,-1.91667 z M 70,85.619852 c 5.589637,-7.462393 9,-12.871607 9,-14.274999 0,-1.407149 -0.90482,-1.549569 -6.515839,-1.025604 -6.331519,0.591246 -6.484924,0.550694 -5.422996,-1.433536 1.917679,-3.583216 0.506287,-4.994011 -4.285867,-4.284055 -15.672855,2.321927 -21.982177,4.636553 -20.25524,7.430797 0.563763,0.912187 0.989072,0.809165 1.668015,-0.404039 C 45.345481,69.560242 47,69.519408 47,71.559017 c 0,0.857459 0.430347,1.293048 0.956326,0.967975 0.525979,-0.325073 0.72488,-1.194182 0.442001,-1.931353 -0.684319,-1.783304 3.834019,-2.63013 5.914883,-1.108565 1.389488,1.016019 1.191475,1.511293 -1.614759,4.038865 -1.759148,1.584463 -3.547558,2.785447 -3.974245,2.668853 -0.426686,-0.116593 0.631418,2.491881 2.351343,5.79661 C 52.795474,85.296131 54.8245,88 55.584497,88 c 0.759996,0 2.57787,-2.360308 4.039719,-5.245129 l 2.657908,-5.245128 1.258402,4.261945 C 65.951615,89.93754 66.514636,90.272954 70,85.619852 Z M 89.683114,67.8125 c -0.319226,-0.797733 -0.556183,-0.560776 -0.604167,0.604167 -0.04342,1.054166 0.192928,1.644791 0.52522,1.3125 0.332291,-0.332292 0.367818,-1.194792 0.07895,-1.916667 z M 70.803084,44.909252 C 71.785254,47.855762 77,45.136268 77,41.677555 c 0,-1.629995 0.237798,-1.72509 1.563188,-0.625114 1.417584,1.176491 1.417584,1.378815 0,2.172135 -2.472366,1.383606 -1.820667,2.939023 1.08595,2.591846 3.795189,-0.45331 5.441699,-3.49482 2.909732,-5.374991 C 81.491249,39.648644 81.153749,39 81.80887,39 82.463992,39 83,38.325 83,37.5 c 0,-1.769295 -4.635723,-2.09283 -5.21208,-0.36376 -0.269394,0.808182 -1.015261,0.738731 -2.583333,-0.240546 -1.747909,-1.091588 -2.604112,-1.12728 -4.133274,-0.172302 -1.32386,0.826764 -2.040549,0.868899 -2.285395,0.134361 -0.494147,-1.482439 -6.239027,-2.016179 -9.275404,-0.86175 C 57.392136,36.801408 57,37.592171 57,41.058582 c 0,2.849641 0.382917,3.97607 1.25,3.677134 0.6875,-0.237023 1.232261,-1.624523 1.210579,-3.083333 C 59.438898,40.193572 59.776398,39 60.210579,39 60.644761,39 61,40.35 61,42 c 0,4.317696 2.950046,4.083553 3.149832,-0.25 l 0.149832,-3.25 0.440401,2.99675 c 0.24222,1.648212 0.777931,3.223212 1.190468,3.5 0.412538,0.276787 -1.415346,2.1876 -4.061963,4.24625 L 57.056539,52.985999 55.568307,50.243 c -1.76909,-3.260658 -1.951125,-2.161712 -0.504706,3.046912 l 1.052448,3.789913 7.161726,-6.630661 C 67.216724,46.8023 70.603113,44.30934 70.803084,44.909252 Z M 68.194949,41.5 c 0.02038,-1.65 0.244498,-2.203936 0.498042,-1.230968 0.253543,0.972967 0.236869,2.322967 -0.03705,3 C 68.382014,43.946064 68.174569,43.15 68.194949,41.5 Z M 73,42.622445 c 0,-0.207656 0.685301,-0.946305 1.522892,-1.641444 1.273347,-1.056784 1.419678,-0.994917 0.893011,0.377555 C 74.878007,42.760293 73,43.742779 73,42.622445 Z M 72,40 c 0,-0.55 0.476558,-1 1.059017,-1 0.582459,0 0.780902,0.45 0.440983,1 -0.339919,0.55 -0.816476,1 -1.059017,1 C 72.198442,41 72,40.55 72,40 Z m -25.979062,4.474772 c 1.129903,-1.36145 1.465626,-1.344413 3.126507,0.158664 C 51.897021,47.121768 56,45.078829 56,41.221439 56,39.669647 55.46,37.86 54.8,37.2 53.257316,35.657316 49,35.638462 49,37.174314 c 0,0.645873 -1.041503,0.195873 -2.314451,-1 C 45.309195,34.881297 43.079925,34 41.185549,34 38.003011,34 38,34.005041 38,39.333333 c 0,2.933334 0.3,5.633334 0.666667,6 1.241009,1.24101 6.08069,0.67601 7.354271,-0.858561 z m 5.466687,-1.771342 c -0.803464,-3.087233 -0.01555,-4.631352 1.559526,-3.056279 0.648765,0.648765 0.681551,1.885029 0.09105,3.433333 L 52.215444,45.5 Z M 41,40 c 0,-2.45853 0.382695,-3.072948 1.75,-2.809629 1.103963,0.212604 1.75,1.249817 1.75,2.809629 0,1.559812 -0.646037,2.597025 -1.75,2.809629 C 41.382695,43.072948 41,42.45853 41,40 Z M 55,28.946007 c -2.711134,-1.849657 -9.187116,-5.092224 -9.515079,-4.764262 -0.176697,0.176698 0.300964,1.44559 1.06147,2.819762 0.760506,1.374171 1.398684,1.957716 1.418174,1.296767 0.02637,-0.894189 0.867153,-0.840227 3.285435,0.210858 3.813492,1.657501 5.894481,1.899937 3.75,0.436875 z"
       id="path28"
       inkscape:connector-curvature="0" />
    <path
       style="fill:#a11a19"
       d="m 28.007655,104.5 c 0.0044,-1.1 0.988755,-5.6 2.187515,-10 1.946441,-7.144333 2.21614,-11.000503 2.521535,-36.052997 C 33.057638,30.479137 33.051,30.373613 30.529338,23.674174 29.138202,19.978266 28,14.939615 28,12.477171 V 8 h 33.613544 33.613544 l -0.680025,4.75 c -0.374013,2.6125 -1.603006,7.9 -2.731095,11.75 -1.914042,6.532343 -2.011985,8.73701 -1.466035,33 0.401543,17.845232 1.035134,27.638375 2.020091,31.223662 2.394765,8.717044 2.943315,14.773158 1.449085,15.998228 -0.864583,0.70885 -12.431564,1.20151 -33.569257,1.4298 -31.701749,0.34239 -32.250013,0.3143 -32.242197,-1.65169 z M 35,103.97032 c 0,-1.9079 0.573167,-2.0211 9.55344,-1.88677 5.254392,0.0786 9.859379,-0.16304 10.233303,-0.53696 0.373925,-0.37392 -4.37604,-0.53738 -10.555478,-0.36323 -6.179437,0.17415 -11.234424,0.068 -11.233303,-0.23582 0.0059,-1.592513 10.251065,-3.956946 17.126311,-3.952486 4.205162,0.0027 9.514693,-0.662033 11.839718,-1.482349 3.729143,-1.315719 5.329871,-1.316141 13.875727,-0.0037 C 85.889953,97.052562 92,99.37002 92,101.63842 c 0,0.72791 -1.2375,1.59641 -2.75,1.93 -4.665184,1.02892 -4.912926,1.36128 -0.851277,1.14203 4.614445,-0.24908 7.267153,-3.15333 4.381299,-4.796748 -0.945988,-0.538714 -2.633488,-3.937081 -3.75,-7.551926 C 86.540195,84.300653 86.537683,83.852108 89,87 c 2.162732,2.764895 2.568171,1.624601 0.942584,-2.651016 -0.846548,-2.226589 -1.242331,-2.488845 -1.984687,-1.3151 -0.548574,0.867354 -0.933525,0.98695 -0.942584,0.292841 -0.0084,-0.645301 -1.209573,-2.592572 -2.669225,-4.32727 -2.486682,-2.955253 -2.585795,-3.448437 -1.572912,-7.826725 0.59455,-2.570002 1.643856,-6.02273 2.331791,-7.67273 1.20782,-2.896936 1.275185,-2.754757 1.960869,4.138582 0.390543,3.926219 1.133249,7.894745 1.650458,8.818946 0.605133,1.081313 0.912452,-7.345864 0.862043,-23.638581 C 89.535251,38.893526 89.839872,26.375 90.25527,25 90.98743,22.576497 90.975105,22.568847 89.852456,24.75 88.812126,26.771218 87,27.851421 87,26.45034 c 0,-1.595175 3.210982,-6.43798 3.961216,-5.97431 0.481822,0.297783 1.137658,-0.812504 1.457412,-2.467304 C 92.738383,16.353927 93.260755,13.65 93.579455,12 L 94.158911,9 H 61.579455 29 v 3.477171 c 0,1.912444 1.137832,6.500112 2.528515,10.194817 2.526619,6.712608 2.52826,6.739438 2.188312,35.772829 C 33.411258,84.542042 33.154637,88.314439 31.196115,95.5 28.393524,105.78233 28.410189,106 32,106 c 2.347955,0 3,-0.44115 3,-2.02968 z M 50.5,89.885668 c -1.1,-1.70972 -3.652763,-5.598632 -5.672806,-8.642028 l -3.672806,-5.533446 2.110865,-2.855097 C 45.612232,69.680638 47,69.199037 47,71.559017 c 0,0.857459 0.430347,1.293048 0.956326,0.967975 0.525979,-0.325073 0.72488,-1.194182 0.442001,-1.931353 -0.684319,-1.783304 3.834019,-2.63013 5.914883,-1.108565 1.389488,1.016019 1.191475,1.511293 -1.614759,4.038865 -1.759148,1.584463 -3.547558,2.785447 -3.974245,2.668853 -0.426686,-0.116593 0.631418,2.491881 2.351343,5.79661 3.139277,6.031926 4.512799,7.02025 6.707,4.826049 0.910064,-0.910064 0.956149,-0.393139 0.2,2.243399 C 57.442147,90.94512 57,92.602267 57,92.743398 c 0,0.141131 -1.0125,0.255308 -2.25,0.253727 -1.419962,-0.0018 -2.987811,-1.149649 -4.25,-3.111457 z M 62.96457,89.75 c -2.821941,-4.571863 -3.32715,-7.203995 -1.895998,-9.878128 1.18703,-2.217985 1.298247,-2.107294 2.669492,2.656859 2.238489,7.777243 2.591778,7.776084 8.76278,-0.02873 0.869733,-1.1 0.206365,0.8125 -1.474151,4.25 -1.726584,3.531732 -3.708,6.25 -4.555787,6.25 -0.825166,0 -2.403018,-1.4625 -3.506336,-3.250001 z M 52.905288,54.940249 C 52.165894,51.607387 50.930906,48.35762 50.160869,47.718546 49.33428,47.032539 46.200438,46.671578 42.510035,46.837311 35.246477,47.163512 35.156076,47.055049 35.561097,38.5 l 0.284058,-6 3.535087,-0.307841 c 1.944297,-0.169313 4.454137,0.18402 5.577422,0.785183 2.059273,1.10209 2.749899,0.230592 1.210355,-1.527342 -1.124171,-1.283639 -5.276797,-11.674555 -4.84013,-12.111223 0.463993,-0.463992 6.491249,2.504466 9.918994,4.885161 1.510785,1.049296 6.880689,3.961888 11.933119,6.472426 8.983604,4.463927 9.347634,4.552408 16.503117,4.01124 7.463225,-0.564443 8.992118,0.217159 6.093933,3.115344 -0.672621,0.672621 -1.090967,2.754847 -0.929657,4.627169 0.373201,4.331739 -2.009693,5.765736 -8.794985,5.29272 C 71.228634,47.406561 70.984343,47.531386 63.415369,54.199966 59.170372,57.939985 55.371493,61 54.973416,61 54.575339,61 53.644681,58.273112 52.905288,54.940249 Z M 71,44.877431 c 0,1.490428 3.285135,1.437434 4.8,-0.07743 0.66,-0.66 1.2,-2.0651 1.2,-3.122445 0,-1.629995 0.237798,-1.72509 1.563188,-0.625114 1.417584,1.176491 1.417584,1.378815 0,2.172135 -2.472366,1.383606 -1.820667,2.939023 1.08595,2.591846 3.795189,-0.45331 5.441699,-3.49482 2.909732,-5.374991 C 81.491249,39.648644 81.153749,39 81.80887,39 82.463992,39 83,38.325 83,37.5 c 0,-1.769295 -4.635723,-2.09283 -5.21208,-0.36376 -0.269394,0.808182 -1.015261,0.738731 -2.583333,-0.240546 -1.747909,-1.091588 -2.604112,-1.12728 -4.133274,-0.172302 -1.32386,0.826764 -2.040549,0.868899 -2.285395,0.134361 -0.494147,-1.482439 -6.239027,-2.016179 -9.275404,-0.86175 C 57.392136,36.801408 57,37.592171 57,41.058582 c 0,2.849641 0.382917,3.97607 1.25,3.677134 0.6875,-0.237023 1.232261,-1.624523 1.210579,-3.083333 C 59.438898,40.193572 59.776398,39 60.210579,39 60.644761,39 61,40.35 61,42 c 0,4.317696 2.950046,4.083553 3.149832,-0.25 l 0.149832,-3.25 0.440401,2.99675 c 0.24222,1.648212 0.777931,3.223212 1.190468,3.5 0.412538,0.276787 -1.415346,2.1876 -4.061963,4.24625 L 57.056539,52.985999 55.568307,50.243 c -1.768925,-3.260353 -1.951146,-2.161784 -0.505137,3.045351 l 1.052016,3.788351 7.442407,-6.66092 C 67.650917,46.752276 71,44.260018 71,44.877431 Z M 68.194949,41.5 c 0.02038,-1.65 0.244498,-2.203936 0.498042,-1.230968 0.253543,0.972967 0.236869,2.322967 -0.03705,3 C 68.382014,43.946064 68.174569,43.15 68.194949,41.5 Z M 73,42.622445 c 0,-0.207656 0.685301,-0.946305 1.522892,-1.641444 1.273347,-1.056784 1.419678,-0.994917 0.893011,0.377555 C 74.878007,42.760293 73,43.742779 73,42.622445 Z M 72,40 c 0,-0.55 0.476558,-1 1.059017,-1 0.582459,0 0.780902,0.45 0.440983,1 -0.339919,0.55 -0.816476,1 -1.059017,1 C 72.198442,41 72,40.55 72,40 Z m -25.979062,4.474772 c 1.129903,-1.36145 1.465626,-1.344413 3.126507,0.158664 C 51.897021,47.121768 56,45.078829 56,41.221439 56,39.669647 55.46,37.86 54.8,37.2 53.257316,35.657316 49,35.638462 49,37.174314 c 0,0.645873 -1.041503,0.195873 -2.314451,-1 C 45.309195,34.881297 43.079925,34 41.185549,34 38.003011,34 38,34.005041 38,39.333333 c 0,2.933334 0.3,5.633334 0.666667,6 1.241009,1.24101 6.08069,0.67601 7.354271,-0.858561 z m 5.466687,-1.771342 c -0.803464,-3.087233 -0.01555,-4.631352 1.559526,-3.056279 0.648765,0.648765 0.681551,1.885029 0.09105,3.433333 L 52.215444,45.5 Z M 41,40 c 0,-2.45853 0.382695,-3.072948 1.75,-2.809629 1.103963,0.212604 1.75,1.249817 1.75,2.809629 0,1.559812 -0.646037,2.597025 -1.75,2.809629 C 41.382695,43.072948 41,42.45853 41,40 Z M 55,28.946007 c -2.711134,-1.849657 -9.187116,-5.092224 -9.515079,-4.764262 -0.176697,0.176698 0.300964,1.44559 1.06147,2.819762 0.760506,1.374171 1.398684,1.957716 1.418174,1.296767 0.02637,-0.894189 0.867153,-0.840227 3.285435,0.210858 3.813492,1.657501 5.894481,1.899937 3.75,0.436875 z M 35.5,15.190151 c -1.1,-0.236815 -2.794249,-0.986074 -3.764998,-1.665018 -1.483596,-1.037631 -0.800755,-1.233912 4.282876,-1.231103 3.32633,0.0018 6.257546,0.342598 6.513811,0.757244 0.653132,1.05679 -4.614857,2.65919 -7.031689,2.138877 z M 47.165985,14.7 C 46.316573,13.676521 46.813039,13.4 49.5,13.4 c 2.686961,0 3.183427,0.276521 2.334015,1.3 C 51.240617,15.415 50.190311,16 49.5,16 48.809689,16 47.759383,15.415 47.165985,14.7 Z m 10.500682,0.633333 c -1.262236,-1.262235 -0.663936,-2.546262 0.905775,-1.943908 0.864843,0.331872 2.439843,0.139184 3.5,-0.428195 2.143125,-1.146966 2.58827,-0.02194 0.727558,1.83877 -1.307435,1.307435 -4.072004,1.594663 -5.133333,0.533333 z M 75.5,14.758363 C 74.4,14.108913 72.896266,13.481362 72.158369,13.363807 69.628873,12.960831 69.665874,12 72.210889,12 c 1.399322,0 3.10031,0.670045 3.779973,1.48899 0.679663,0.818944 1.634764,1.242386 2.122445,0.940983 C 78.600988,14.128569 79,14.358524 79,14.940983 c 0,1.351696 -0.98864,1.300111 -3.5,-0.18262 z m 5.066376,-1.656146 c -1.063492,-0.416466 -1.513492,-0.997106 -1,-1.290309 C 80.974448,11.007901 88,12.08877 88,13.109406 c 0,1.063723 -4.710566,1.059168 -7.433624,-0.0072 z m -7.041698,87.783653 c -3.385112,-0.493 -8.586925,-0.49364 -12,-10e-4 -5.397785,0.77836 -4.776029,0.86891 5.975322,0.87024 10.714647,0.001 11.359967,-0.0917 6.024678,-0.86876 z M 85.25,101.33772 c -0.6875,-0.27741 -1.8125,-0.27741 -2.5,0 -0.6875,0.27741 -0.125,0.50439 1.25,0.50439 1.375,0 1.9375,-0.22698 1.25,-0.50439 z"
       id="path26"
       inkscape:connector-curvature="0" />
    <path
       style="fill:#571213"
       d="m 28.007655,104.5 c 0.0044,-1.1 0.988755,-5.6 2.187515,-10 1.946441,-7.144333 2.21614,-11.000503 2.521535,-36.052997 C 33.057638,30.479137 33.051,30.373613 30.529338,23.674174 29.138202,19.978266 28,14.939615 28,12.477171 V 8 h 33.613544 33.613544 l -0.680025,4.75 c -0.374013,2.6125 -1.603006,7.9 -2.731095,11.75 -1.914042,6.532343 -2.011985,8.73701 -1.466035,33 0.401543,17.845232 1.035134,27.638375 2.020091,31.223662 2.394765,8.717044 2.943315,14.773158 1.449085,15.998228 -0.864583,0.70885 -12.431564,1.20151 -33.569257,1.4298 -31.701749,0.34239 -32.250013,0.3143 -32.242197,-1.65169 z m 7.265371,-0.18092 c -0.292073,-1.51963 9.708924,-2.82472 13.458845,-1.75633 L 51.5,103.35142 48,104.04407 c -2.663644,0.52713 -1.70781,0.72045 4,0.80898 4.426887,0.0687 6.953459,-0.23013 6.166154,-0.7292 -1.065498,-0.67542 -1.001307,-0.97313 0.319067,-1.4798 C 60.280719,101.95505 90,101.84415 90,102.52645 c 0,0.229 -1.4625,0.83865 -3.25,1.35477 l -3.25,0.9384 4.127555,0.0902 c 5.25779,0.11489 6.403394,-1.29787 5.622866,-6.934095 -0.507152,-3.662177 -0.728634,-4.030315 -1.218491,-2.025325 -0.51768,2.118867 -0.832639,1.725971 -2.327957,-2.904013 -2.015082,-6.239339 -1.699904,-7.498855 0.706798,-2.824514 L 92.098603,93.5 91.422807,90.035833 c -0.979193,-5.019402 -3.267821,-10.915012 -3.352345,-8.635795 -0.05218,1.406977 -0.85606,0.815553 -3.097804,-2.279085 l -3.027342,-4.179124 1.899958,-6.189133 c 2.103315,-6.851569 2.262465,-6.636363 3.695643,4.997304 1.407648,11.426437 2.147663,4.046555 2.055629,-20.5 -0.0531,-14.1625 0.26663,-27.1 0.710512,-28.75 l 0.807057,-3 -1.521622,2.5 c -1.129128,1.855139 -1.530763,2.063224 -1.557058,0.806704 -0.01949,-0.931313 0.86266,-2.322346 1.960331,-3.091185 C 91.572517,20.611119 94,13.122974 94,9.3635103 94,9.1635796 79.375,9 61.5,9 H 29 v 3.477171 c 0,1.912444 1.137832,6.500112 2.528515,10.194817 2.526619,6.712608 2.52826,6.739438 2.188312,35.772829 -0.305569,26.097225 -0.56219,29.869622 -2.520712,37.055183 -2.872163,10.53759 -2.856548,10.69039 1.053885,10.31336 1.829572,-0.17641 3.1508,-0.82949 3.023026,-1.49428 z M 52.8125,102.31689 c 0.721875,-0.28887 1.584375,-0.25335 1.916667,0.0789 0.332291,0.3323 -0.258334,0.56864 -1.3125,0.52522 -1.164943,-0.048 -1.4019,-0.28494 -0.604167,-0.60416 z M 37.535239,99.253492 c 2.21019,-0.793469 7.138871,-1.369833 11.137218,-1.302395 4.857182,0.08192 8.995365,-0.519728 12.819616,-1.863844 3.765471,-1.323456 6.373683,-1.709795 7.827542,-1.159446 1.199212,0.453954 5.379285,1.145189 9.289051,1.536079 3.909766,0.39089 8.248204,1.458926 9.640972,2.373412 2.393426,1.571512 0.963469,1.667552 -26.073427,1.751132 -25.868902,0.08 -28.226408,-0.0478 -24.640972,-1.334938 z m 15.858392,-7.25995 c -1.158503,-0.452556 -3.633503,-3.392191 -5.5,-6.532523 -1.866497,-3.140332 -4.056646,-6.753228 -4.866997,-8.028658 -0.810351,-1.27543 -1.181763,-2.610565 -0.82536,-2.966968 1.542156,-1.542156 4.618106,0.943714 7.776908,6.285013 4.922773,8.324042 5.055546,8.466492 6.654497,7.13948 C 57.680794,87.020028 58,87.089256 58,88.186426 c 0,2.738791 -2.356161,4.686134 -4.606369,3.807116 z m 8.7895,-4.553503 c -1.574469,-3.240732 -1.941986,-5.048525 -1.270333,-6.2487 0.779878,-1.393565 1.300856,-0.858715 2.980597,3.05996 C 65.012936,86.863085 66.357384,89 66.881056,89 c 0.523672,0 1.909865,-1.2375 3.08043,-2.75 l 2.128299,-2.75 -2.065217,4.25 c -2.740517,5.6397 -4.994148,5.550617 -7.841437,-0.309961 z M 54.09607,57.845743 C 53.493232,56.116439 53,53.848249 53,52.805322 53,51.762395 51.932879,49.84197 50.62862,48.53771 c -2.133003,-2.133003 -2.987446,-2.315517 -8.5,-1.815656 L 36,47.277777 v -7.022311 c 0,-6.798402 0.08431,-7.038428 2.644084,-7.52776 1.454246,-0.277997 3.929246,-0.136869 5.5,0.313617 C 45.714838,33.491809 47,33.744385 47,33.602603 47,33.46082 45.875,30.576174 44.5,27.192279 43.125,23.808383 42,20.815447 42,20.541309 c 0,-0.695586 4.806998,1.463783 9.081987,4.079752 1.970094,1.205548 7.312479,4.092684 11.871968,6.415859 6.76061,3.444701 9.273334,4.215118 13.620272,4.176057 2.93166,-0.02634 6.251775,-0.340364 7.378032,-0.697825 C 85.398111,34.056257 86,34.308578 86,35.373595 c 0,0.829604 -0.476346,1.802769 -1.058546,2.162588 -0.612037,0.37826 -0.785634,1.896778 -0.411548,3.599977 C 85.526871,45.675314 83.727534,47 76.564983,47 h -6.190128 l -7.591357,6.994966 -7.591357,6.994966 z M 65.153476,49.278864 C 68.508099,46.292878 70.393608,45.29017 71.908802,45.686402 74.498642,46.36366 77,44.432176 77,41.755111 c 0,-1.700327 0.234223,-1.805613 1.563188,-0.70267 1.417584,1.176491 1.417584,1.378815 0,2.172135 -2.472366,1.383606 -1.820667,2.939023 1.08595,2.591846 3.795189,-0.45331 5.441699,-3.49482 2.909732,-5.374991 C 81.491249,39.648644 81.153749,39 81.80887,39 82.463992,39 83,38.325 83,37.5 c 0,-1.769295 -4.635723,-2.09283 -5.21208,-0.36376 -0.269394,0.808182 -1.015261,0.738731 -2.583333,-0.240546 -1.747909,-1.091588 -2.604112,-1.12728 -4.133274,-0.172302 -1.32386,0.826764 -2.040549,0.868899 -2.285395,0.134361 -0.494147,-1.482439 -6.239027,-2.016179 -9.275404,-0.86175 C 57.392136,36.801408 57,37.592171 57,41.058582 c 0,2.849641 0.382917,3.97607 1.25,3.677134 0.6875,-0.237023 1.232261,-1.624523 1.210579,-3.083333 C 59.438898,40.193572 59.776398,39 60.210579,39 60.644761,39 61,40.35 61,42 c 0,4.225704 2.769755,4.009755 3.206499,-0.25 l 0.333216,-3.25 0.535917,3.806324 c 0.497453,3.533131 0.248624,4.017603 -3.46686,6.75 C 59.407245,50.675346 57.343303,52 57.022235,52 55.765105,52 54.019834,45.580166 55.008256,44.591744 56.380919,43.219081 56.252252,38.652252 54.8,37.2 53.257316,35.657316 49,35.638462 49,37.174314 c 0,0.645873 -1.041503,0.195873 -2.314451,-1 C 45.293772,34.866808 43.081258,34 41.135645,34 h -3.235453 l 0.299904,5.75 c 0.286329,5.48973 0.428384,5.764709 3.138338,6.074956 1.609275,0.184236 3.60413,-0.36799 4.606618,-1.275228 1.581535,-1.43127 1.901803,-1.439183 3.03401,-0.07496 C 49.675267,45.313647 50.847444,46 51.583901,46 c 0.737987,0 1.827329,1.907641 2.426927,4.25 0.598354,2.3375 1.302443,4.879908 1.564642,5.649797 0.514885,1.511844 0.184996,1.739884 9.578006,-6.620933 z M 51.69461,43.361277 C 50.66454,42.331206 50.852723,39 51.940983,39 c 0.517541,0 1.216896,0.446436 1.554122,0.99208 0.772598,1.25009 -0.861597,4.308095 -1.800495,3.369197 z M 68.194949,41.5 c 0.02038,-1.65 0.244498,-2.203936 0.498042,-1.230968 0.253543,0.972967 0.236869,2.322967 -0.03705,3 C 68.382014,43.946064 68.174569,43.15 68.194949,41.5 Z M 41,40 c 0,-2.45853 0.382695,-3.072948 1.75,-2.809629 1.103963,0.212604 1.75,1.249817 1.75,2.809629 0,1.559812 -0.646037,2.597025 -1.75,2.809629 C 41.382695,43.072948 41,42.45853 41,40 Z m 32.5,2 c 0.339919,-0.55 0.816476,-1 1.059017,-1 C 74.801558,41 75,41.45 75,42 75,42.55 74.523442,43 73.940983,43 73.358524,43 73.160081,42.55 73.5,42 Z M 48.710251,30 c -0.652721,-2.496007 -0.02693,-2.493318 5.848379,0.02513 2.598442,1.113822 4.877644,1.871928 5.064893,1.684679 0.364833,-0.364834 -13.961533,-8.613565 -14.36277,-8.269692 -0.131586,0.112773 0.499174,2.084881 1.40169,4.382461 1.702117,4.33317 2.961818,5.672601 2.047808,2.17742 z M 58.5,15 C 58.160081,14.45 58.718524,14 59.740983,14 60.763442,14 62.14,13.46 62.8,12.8 63.693059,11.906941 64,11.897941 64,12.76482 c 0,0.640649 -0.870416,1.630649 -1.934259,2.2 C 59.667032,16.248567 59.274053,16.252444 58.5,15 Z M 33.15805,14.118842 c -1.799455,-1.1405 2.407123,-1.952155 5.84195,-1.127198 2.183703,0.524469 2.268244,0.6895 0.668213,1.304396 -2.427856,0.93303 -4.86305,0.866747 -6.510163,-0.177198 z M 47.75,14.337719 c 0.6875,-0.277412 1.8125,-0.277412 2.5,0 0.6875,0.277413 0.125,0.504386 -1.25,0.504386 -1.375,0 -1.9375,-0.226973 -1.25,-0.504386 z m 34.416354,-1.213745 c -0.88527,-0.561174 -0.329965,-0.808178 1.651696,-0.734687 1.641938,0.06089 2.778021,0.448213 2.524629,0.860713 -0.605866,0.986296 -2.512359,0.928765 -4.176325,-0.126026 z"
       id="path24"
       inkscape:connector-curvature="0" />
    <path
       style="fill:#161112"
       d="m 28.007655,104.5 c 0.0044,-1.1 0.988755,-5.6 2.187515,-10 1.946441,-7.144333 2.21614,-11.000503 2.521535,-36.052997 C 33.057638,30.479137 33.051,30.373613 30.529338,23.674174 29.138202,19.978266 28,14.939615 28,12.477171 V 8 h 33.613544 33.613544 l -0.680025,4.75 c -0.374013,2.6125 -1.603006,7.9 -2.731095,11.75 -1.914042,6.532343 -2.011985,8.73701 -1.466035,33 0.401543,17.845232 1.035134,27.638375 2.020091,31.223662 2.394765,8.717044 2.943315,14.773158 1.449085,15.998228 -0.864583,0.70885 -12.431564,1.20151 -33.569257,1.4298 -31.701749,0.34239 -32.250013,0.3143 -32.242197,-1.65169 z m 64.761677,-0.72603 C 94.154785,102.62688 93.805797,99.258376 91.342307,90 90.311703,86.126748 89.719072,76.498248 89.338635,57.446254 88.838668,32.408287 88.947738,29.874942 90.80247,23.446254 91.9047,19.625814 93.095448,14.8125 93.448575,12.75 L 94.090626,9 H 61.545313 29 v 3.477171 c 0,1.912444 1.137832,6.500112 2.528515,10.194817 2.526619,6.712608 2.52826,6.739438 2.188312,35.772829 -0.305569,26.097225 -0.56219,29.869622 -2.520712,37.055183 -1.19928,4.4 -2.184253,8.45 -2.188829,9 -0.01163,1.39749 62.050786,0.69081 63.762046,-0.72603 z M 54.643618,58.30265 c -0.288517,-0.991458 -1.0055,-3.666108 -1.593295,-5.943667 -1.125222,-4.359952 -5.131736,-8.027522 -7.328569,-6.708585 -0.754403,0.45293 -0.688751,0.07665 0.171628,-0.983668 1.252536,-1.543608 1.563744,-1.563012 3.078741,-0.191958 C 49.89907,45.313647 51.134467,46 51.71745,46 c 0.582982,0 1.364453,1.623043 1.736601,3.606762 0.372148,1.983719 1.097016,4.712454 1.610817,6.063855 0.928116,2.44113 0.979886,2.416175 7.968926,-3.841268 l 7.034742,-6.298361 5.935684,0.196449 c 5.094452,0.168607 6.15253,-0.113141 7.465732,-1.988 1.734238,-2.475972 2.061035,-1.600112 0.494864,1.326304 C 83.109679,46.66358 81.834865,47 76.635229,47 c -6.177846,0 -6.404034,0.09741 -12.214816,5.26039 -9.156466,8.135679 -9.165905,8.141512 -9.776795,6.04226 z m 1.236711,-9.216093 c -1.416717,-4.063998 -1.201129,-4.640683 1.597759,-4.273907 2.033649,0.266497 2.446078,-0.176364 2.793844,-3 L 60.679926,38.5 l 0.160037,3.25 c 0.102633,2.084255 0.675347,3.25 1.596679,3.25 0.885807,0 1.564402,-1.246108 1.769857,-3.25 l 0.333216,-3.25 0.506898,3.557753 c 0.464708,3.261637 0.148237,3.828122 -3.802303,6.80615 L 56.935109,52.1123 Z M 40.269032,46.307009 c 0.972967,-0.253543 2.322967,-0.236869 3,0.03705 C 43.946064,46.617986 43.15,46.825431 41.5,46.805051 39.85,46.784672 39.296064,46.560553 40.269032,46.307009 Z M 36.262937,39.39362 36.5,32.78724 l 5.670734,0.504365 5.670733,0.504364 -2.016852,-4.647984 C 41.527552,19.245084 41.382831,19.681636 47.786997,23.228435 63.42505,31.889206 69.719204,34.945459 72,34.985545 l 2.5,0.04394 -2.5,1.275412 c -2.152129,1.097941 -2.776271,1.020238 -4.485442,-0.558417 -1.091992,-1.008607 -2.133566,-1.389456 -2.314607,-0.846332 -0.181042,0.543125 -0.897491,0.769412 -1.59211,0.502862 -0.694619,-0.26655 -2.465546,-0.02741 -3.935392,0.531426 -2.094757,0.796425 -2.701887,1.723952 -2.808631,4.290814 C 56.749661,42.970375 56.653299,43.095676 56.268,41 56.0152,39.625 55.346382,37.9375 54.781737,37.25 53.475785,35.659899 49,35.612338 49,37.188561 c 0,0.653709 -0.91753,0.203709 -2.038955,-1 C 45.622173,34.751451 43.733727,34 41.461045,34 H 38 v 6 c 0,3.3 -0.444178,6 -0.987063,6 -0.573733,0 -0.887793,-2.766405 -0.75,-6.60638 z m 13.231582,-8.418573 -0.664391,-3.024952 5.738652,2.537904 c 3.156258,1.395847 5.969479,2.307075 6.251602,2.024952 C 61.475154,31.858179 61.78539,32.074265 53.10275,27.137456 49.034263,24.82418 45.393976,23.059412 45.013224,23.21575 44.227245,23.538475 48.637917,34 49.55996,34 c 0.329423,0 0.299975,-1.361229 -0.06544,-3.024953 z M 41.363636,40 c 0,-2.255945 0.418305,-2.99606 1.568182,-2.774614 C 43.85182,37.402562 44.5,38.5494 44.5,40 c 0,1.4506 -0.64818,2.597438 -1.568182,2.774614 C 41.781941,42.99606 41.363636,42.255945 41.363636,40 Z m 26.794259,1 c 0,-1.375 0.226973,-1.9375 0.504386,-1.25 0.277412,0.6875 0.277412,1.8125 0,2.5 -0.277413,0.6875 -0.504386,0.125 -0.504386,-1.25 z M 77,42 c 0,-0.55 0.423442,-1 0.940983,-1 0.517541,0 1.219098,0.45 1.559017,1 0.339919,0.55 -0.08352,1 -0.940983,1 C 77.701558,43 77,42.55 77,42 Z M 51,40 c 0,-0.55 0.45,-1 1,-1 0.55,0 1,0.45 1,1 0,0.55 -0.45,1 -1,1 -0.55,0 -1,-0.45 -1,-1 z m 31.258929,0.340695 C 81.3436,39.97089 81.4563,39.401056 82.688311,38.169643 84.248802,36.60991 84.165929,36.458417 81.429382,35.868315 L 78.5,35.23663 81.856989,35.118315 c 2.828048,-0.09967 3.242582,0.157422 2.63089,1.631685 -0.399354,0.9625 -0.747499,2.3125 -0.773655,3 -0.02616,0.6875 -0.08506,1.214474 -0.130891,1.171053 -0.04583,-0.04342 -0.641815,-0.304582 -1.324404,-0.580358 z M 75.5,37 c -0.339919,-0.55 0.110081,-1 1,-1 0.889919,0 1.339919,0.45 1,1 -0.339919,0.55 -0.789919,1 -1,1 -0.210081,0 -0.660081,-0.45 -1,-1 z"
       id="path22"
       inkscape:connector-curvature="0" />
  </g>
  <path
     style="fill:#ffffff;fill-opacity:1;stroke-width:0.02562908"
     d="M 2.8188132,0.62805212 C 2.575397,0.56503354 2.4697619,0.3997881 2.4222262,0.0076689 c -0.047145,-0.3888945 -0.018263,-2.2848043 0.038598,-2.5336753 0.1483767,-0.6494268 0.4193736,-0.7266751 1.3942343,-0.3974294 0.991554,0.3348838 1.1927397,0.5408385 1.2596526,1.289513 0.041209,0.4610802 -0.014348,0.9599829 -0.1562254,1.4028938 -0.1547128,0.4829821 -0.3437731,0.6405866 -0.9717715,0.81008853 -0.1496004,0.0403787 -0.2916594,0.0538188 -0.640727,0.06062 -0.2466798,0.004806 -0.483908,-4.2542e-4 -0.527174,-0.0116274 z M 4.0885103,-0.0563833 C 4.6458963,-0.2219089 4.8886991,-0.8508327 4.6535295,-1.5199325 4.480478,-2.0122949 3.9639081,-2.3992836 3.4797322,-2.3992836 c -0.1229568,0 -0.1485709,0.00969 -0.2235151,0.084644 -0.1480233,0.1480235 -0.1727927,0.2811069 -0.1858186,0.9983872 -0.012244,0.6743817 0.00802,0.8970017 0.097677,1.0727375 0.053148,0.1041783 0.1037576,0.1404981 0.2676128,0.1920523 0.1460471,0.04595 0.4902554,0.043357 0.652822,-0.0049207 z"
     id="path36"
     inkscape:connector-curvature="0" />
  <path
     style="fill:#ffffff;fill-opacity:1;stroke-width:0.02562908"
     d="M 6.3224658,0.61779181 C 6.099819,0.54662347 5.8587827,0.2212049 5.7677569,-0.1311099 c -0.046359,-0.1794318 -0.053615,-0.6252434 -0.013556,-0.8329452 0.1346849,-0.6983433 0.489971,-1.0764214 1.0115305,-1.0764214 0.8555969,0 1.5910399,0.9314238 1.3571969,1.7188614 -0.04932,0.1660672 -0.194956,0.4623576 -0.249532,0.5076517 -0.06166,0.051176 -0.111909,-0.053204 -0.197692,-0.4106878 C 7.5417919,-0.7827043 7.4979689,-0.9204139 7.3708444,-1.1826357 7.1707406,-1.595394 6.9626402,-1.7514765 6.7049416,-1.6820854 c -0.3029115,0.081566 -0.4879104,0.4910714 -0.455393,1.0080386 0.017263,0.2744451 0.066891,0.430404 0.2441189,0.7671525 0.1375358,0.2613303 0.1867676,0.45405101 0.1326486,0.5192604 -0.036427,0.0438925 -0.1757272,0.0463801 -0.3038503,0.005423 z"
     id="path38"
     inkscape:connector-curvature="0" />
  <path
     style="fill:#ffffff;fill-opacity:1;stroke-width:0.02562908"
     d="M 8.7963149,0.49705881 C 8.7011509,0.3839626 8.6662599,0.1776496 8.6684099,-0.2592553 c 0.0028,-0.5694211 0.08702,-1.0971144 0.215296,-1.3489727 0.06562,-0.1288356 0.194936,-0.2520738 0.324783,-0.3095111 0.127268,-0.056297 0.465673,-0.1001588 0.565601,-0.07331 l 0.06887,0.018504 -0.102516,0.065226 c -0.136262,0.086697 -0.17754,0.1361374 -0.255091,0.3055299 -0.119546,0.2611249 -0.167626,0.5167936 -0.206682,1.0990571 -0.03566,0.5315829 -0.06961,0.7390673 -0.154023,0.9410864 -0.0474,0.11344626 -0.07582,0.13442416 -0.182834,0.13494264 -0.05878,2.8448e-4 -0.09871,-0.0206374 -0.145497,-0.0762386 z"
     id="path40"
     inkscape:connector-curvature="0" />
  <path
     style="fill:#ffffff;fill-opacity:1;stroke-width:0.02562908"
     d="m 10.505623,0.4306918 c -0.115138,-0.1757292 -0.175434,-0.6863841 -0.154085,-1.3050452 0.01686,-0.4888487 0.0772,-0.836018 0.182801,-1.0518492 0.105186,-0.2149777 0.194788,-0.2090597 0.304859,0.020134 0.268809,0.5597276 0.188665,1.9934852 -0.131809,2.3580204 -0.05789,0.0658549 -0.151122,0.0560314 -0.201766,-0.02126 z"
     id="path42"
     inkscape:connector-curvature="0" />
  <path
     style="fill:#ffffff;fill-opacity:1;stroke-width:0.02562908"
     d="M 11.760554,0.54421432 C 11.651473,0.48953792 11.540786,0.1272159 11.452474,-0.464288 c -0.07997,-0.53564 -0.05819,-2.0468238 0.03079,-2.1357992 0.02656,-0.026555 0.438267,0.052888 0.512539,0.098898 0.227034,0.1406429 0.43783,0.4526749 0.465897,0.689642 0.01456,0.1229102 0.01152,0.1306436 -0.09083,0.2319887 -0.237971,0.2356045 -0.285527,0.4621697 -0.235349,1.1212451 0.03937,0.5170473 0.03927,0.5925121 -9.85e-4,0.7414952 -0.05673,0.20994969 -0.231918,0.33223568 -0.373976,0.26103253 z"
     id="path44"
     inkscape:connector-curvature="0" />
  <path
     style="fill:#ffffff;fill-opacity:1;stroke-width:0.02562908"
     d="m 13.088198,-0.4917208 c -0.101018,-0.1284161 -0.09192,-0.4337792 0.02182,-0.7331395 0.165923,-0.4366719 0.618939,-0.7852962 1.053105,-0.8104297 0.254279,-0.01472 0.433493,0.037727 0.63447,0.1856774 0.181255,0.133432 0.229247,0.2031144 0.180415,0.2619533 -0.07181,0.086527 -0.147973,0.089816 -0.390959,0.016881 -0.182294,-0.054718 -0.287694,-0.070314 -0.481517,-0.071249 -0.24135,-0.00117 -0.250354,9.058e-4 -0.329118,0.075689 -0.104266,0.098992 -0.153221,0.1979381 -0.253635,0.5125816 -0.08665,0.2715241 -0.172042,0.441914 -0.27935,0.5574325 -0.08049,0.086653 -0.09047,0.086949 -0.155237,0.00461 z"
     id="path46"
     inkscape:connector-curvature="0" />
  <path
     style="fill:#ffffff;fill-opacity:1;stroke-width:0.02562908"
     d="m 14.089466,0.55191328 c -0.03255,-0.009163 -0.05854,-0.0281995 -0.05775,-0.0422967 0.0035,-0.0636314 0.113818,-0.16727718 0.238893,-0.22453688 0.07517,-0.034411 0.179152,-0.099872 0.231083,-0.1454677 0.120768,-0.106033 0.325955,-0.3782921 0.326668,-0.4334437 9.14e-4,-0.070635 0.321276,-0.2827321 0.430048,-0.2847135 0.06756,-0.00123 0.133245,0.1238913 0.133245,0.2538069 0,0.098594 -0.146207,0.5302855 -0.211212,0.6236231 -0.05713,0.08202 -0.256645,0.19023937 -0.44233,0.23991417 -0.130676,0.0349595 -0.541588,0.0432661 -0.648648,0.0131135 z"
     id="path48"
     inkscape:connector-curvature="0" />
  <path
     style="fill:#ffffff;fill-opacity:1;stroke-width:0.02562908"
     d="m 16.160527,0.6326249 c -0.20171,-0.0729601 -0.28192,-0.16130016 -0.28192,-0.3104968 0,-0.1906734 0.226782,-0.3084052 0.647551,-0.3361718 0.435966,-0.028769 0.433246,-0.0618 -0.05023,-0.6104001 -0.872069,-0.9895271 -0.744197,-1.4574046 0.385108,-1.4090971 0.334922,0.014326 0.509085,0.049964 0.463384,0.094818 -0.01281,0.012632 -0.132958,0.058167 -0.266871,0.1011949 -0.275091,0.088392 -0.388056,0.1497015 -0.44999,0.244224 -0.09803,0.1496042 0.02401,0.3376846 0.423653,0.6529305 0.250395,0.1975176 0.331243,0.2903255 0.412055,0.4730134 0.126877,0.2868297 0.08179,0.5748981 -0.121882,0.7785594 -0.12632,0.1263271 -0.403713,0.26596713 -0.617502,0.31085922 -0.13868,0.029121 -0.474029,0.0356429 -0.543356,0.0105612 z"
     id="path50"
     inkscape:connector-curvature="0" />
</svg>
