<?xml version="1.0" encoding="UTF-8" standalone="no"?>
<!-- Created with Inkscape (http://www.inkscape.org/) -->

<svg
   xmlns:dc="http://purl.org/dc/elements/1.1/"
   xmlns:cc="http://creativecommons.org/ns#"
   xmlns:rdf="http://www.w3.org/1999/02/22-rdf-syntax-ns#"
   xmlns:svg="http://www.w3.org/2000/svg"
   xmlns="http://www.w3.org/2000/svg"
   xmlns:sodipodi="http://sodipodi.sourceforge.net/DTD/sodipodi-0.dtd"
   xmlns:inkscape="http://www.inkscape.org/namespaces/inkscape"
   version="1.1"
   id="svg10"
   width="20"
   height="20"
   viewBox="0 0 20 20"
   sodipodi:docname="sablier.svg"
   inkscape:version="0.92.4 (5da689c313, 2019-01-14)">
  <metadata
     id="metadata16">
    <rdf:RDF>
      <cc:Work
         rdf:about="">
        <dc:format>image/svg+xml</dc:format>
        <dc:type
           rdf:resource="http://purl.org/dc/dcmitype/StillImage" />
        <dc:title></dc:title>
      </cc:Work>
    </rdf:RDF>
  </metadata>
  <defs
     id="defs14" />
  <sodipodi:namedview
     pagecolor="#ffffff"
     bordercolor="#666666"
     borderopacity="1"
     objecttolerance="10"
     gridtolerance="10"
     guidetolerance="10"
     inkscape:pageopacity="0"
     inkscape:pageshadow="2"
     inkscape:window-width="1920"
     inkscape:window-height="1001"
     id="namedview12"
     showgrid="false"
     inkscape:zoom="13.694915"
     inkscape:cx="-5.4944445"
     inkscape:cy="10.722475"
     inkscape:window-x="-9"
     inkscape:window-y="-9"
     inkscape:window-maximized="1"
     inkscape:current-layer="svg10" />
  <g
     id="g20"
     transform="matrix(0.26582718,0,0,0.26582718,-3.1925768,-10.11047)">
    <path
       style="fill:#46c6ce"
       d="M 32.5,115.88474 C 25.081474,114.80735 18.253591,112.53947 15.832895,110.34877 14.371108,109.02587 14,107.19575 14,101.30983 14,94.379606 15.392403,89.98689 18.240275,87.932718 18.672834,87.620713 18.520675,80.645099 17.902143,72.431354 17.094353,61.704376 17.075396,54.238385 17.83485,45.929107 18.864896,34.659247 18.82989,34.233801 16.477352,29.430471 14.574423,25.545136 14.055916,22.869215 14.031272,16.806704 14.003379,9.944761 14.24314,8.9425083 16.25,7.5319121 19.618548,5.1642034 24.165618,4.2447139 38.5,3.03261 59.677173,1.2418851 83.937861,4.4064343 87.234687,9.3895324 87.638765,10.00029 87.976265,13.7074 87.984687,17.627555 87.995709,22.757812 87.579667,25.103956 86.5,26 85.675,26.684689 85,28.288232 85,29.563428 c 0,1.275196 -0.416985,2.576249 -0.926633,2.891229 -0.547024,0.338079 -0.717342,8.862815 -0.41575,20.809017 C 83.938603,64.393653 83.736677,76.425 83.208892,80 c -0.934101,6.327216 -0.882033,6.598306 1.958746,10.198192 2.738958,3.470856 2.900345,4.177787 2.625359,11.499998 L 87.5,109.5 l -4.676248,2.32055 c -2.571936,1.2763 -8.196936,2.9481 -12.5,3.71511 -8.597084,1.53241 -28.416286,1.71532 -37.823752,0.34908 z M 60,92.440983 c 0,-0.857459 -0.45734,-1.276365 -1.016312,-0.930902 -0.558971,0.345464 -0.757414,1.047021 -0.440983,1.559017 C 59.399945,94.456142 60,94.197509 60,92.440983 Z M 32.574257,74.192465 c 1.498127,-2.030856 4.740307,-5.792334 7.204845,-8.35884 l 4.480979,-4.666374 -3.441282,-3.021486 C 36.509067,54.36177 28.892327,43.987429 27.291455,39.720915 26.193048,36.79353 26.147482,37.001229 26.791455,42 c 0.863468,6.702575 0.791416,32.432221 -0.112015,40 l -0.656582,5.5 1.913766,-4.807535 c 1.052572,-2.644144 3.139507,-6.469144 4.637633,-8.5 z M 74.756414,79.75 C 74.271275,75.7625 74.015115,64.85 74.187171,55.5 L 74.5,38.5 71.791053,44 c -1.489921,3.025 -5.416588,8.175193 -8.725927,11.444874 l -6.016979,5.944875 6.500327,6.73317 c 5.660662,5.863427 8.403307,10.218735 10.785346,17.127081 1.16575,3.380888 1.296327,1.681453 0.422594,-5.5 z m -7.587964,1.01845 c -0.742068,-0.742068 -0.872211,-0.351636 -0.437237,1.311709 0.353609,1.352204 0.806902,1.805497 1.05655,1.056551 0.240481,-0.721441 -0.03821,-1.787158 -0.619313,-2.36826 z M 57,49 c 0,-0.55 -0.45,-1 -1,-1 -0.55,0 -1,0.45 -1,1 0,0.55 0.45,1 1,1 0.55,0 1,-0.45 1,-1 z M 40.805694,45.879912 c -1.591733,-0.983745 -3.287506,0.531483 -2.329534,2.081514 0.518517,0.838978 1.082895,0.819489 2.160202,-0.0746 1.16706,-0.968574 1.200878,-1.369387 0.169332,-2.006918 z M 33.709743,35.001987 c -0.115359,-1.648907 -0.547243,-2.998907 -0.959743,-3 -0.897002,-0.0024 -0.921259,0.757057 -0.119714,3.748013 0.841769,3.14105 1.327968,2.804136 1.079457,-0.748013 z"
       id="path34"
       inkscape:connector-curvature="0" />
    <path
       style="fill:#fccc05"
       d="M 32.5,115.88474 C 25.081474,114.80735 18.253591,112.53947 15.832895,110.34877 14.371108,109.02587 14,107.19575 14,101.30983 14,94.379606 15.392403,89.98689 18.240275,87.932718 18.672834,87.620713 18.520675,80.645099 17.902143,72.431354 17.094353,61.704376 17.075396,54.238385 17.83485,45.929107 18.864896,34.659247 18.82989,34.233801 16.477352,29.430471 14.574423,25.545136 14.055916,22.869215 14.031272,16.806704 14.003379,9.944761 14.24314,8.9425083 16.25,7.5319121 19.618548,5.1642034 24.165618,4.2447139 38.5,3.03261 59.677173,1.2418851 83.937861,4.4064343 87.234687,9.3895324 87.638765,10.00029 87.976265,13.7074 87.984687,17.627555 87.995709,22.757812 87.579667,25.103956 86.5,26 85.675,26.684689 85,28.288232 85,29.563428 c 0,1.275196 -0.416985,2.576249 -0.926633,2.891229 -0.547024,0.338079 -0.717342,8.862815 -0.41575,20.809017 C 83.938603,64.393653 83.736677,76.425 83.208892,80 c -0.934101,6.327216 -0.882033,6.598306 1.958746,10.198192 2.738958,3.470856 2.900345,4.177787 2.625359,11.499998 L 87.5,109.5 l -4.676248,2.32055 c -2.571936,1.2763 -8.196936,2.9481 -12.5,3.71511 -8.597084,1.53241 -28.416286,1.71532 -37.823752,0.34908 z m 22.75,-14.59047 c -1.2375,-0.23836 -3.2625,-0.23836 -4.5,0 -1.2375,0.23835 -0.225,0.43337 2.25,0.43337 2.475,0 3.4875,-0.19502 2.25,-0.43337 z m 13.367391,-4.526638 c 3.350587,-1.093932 3.92613,-1.720773 4.200215,-4.574582 0.548689,-5.713009 -4.898946,-15.589658 -12.844152,-23.286655 -3.8354,-3.715581 -6.973204,-7.127031 -6.972898,-7.580999 3.06e-4,-0.453968 2.894301,-3.413143 6.431101,-6.575944 4.704274,-4.206821 7.388611,-7.665609 9.999444,-12.884357 C 71.393995,37.9415 73,33.879215 73,32.837794 73,31.08999 72.480641,31.00415 66.25,31.72215 c -8.54851,0.985105 -21.664082,0.9958 -30.952954,0.02524 l -7.202954,-0.75261 1.352081,4.492626 c 2.078692,6.906968 5.89983,12.691653 12.29465,18.612436 3.207882,2.970086 6.190341,5.979277 6.627687,6.68709 0.53684,0.868835 -1.434863,3.351606 -6.069032,7.642137 -7.479981,6.925316 -11.855381,13.87045 -13.16938,20.903943 -0.926451,4.959052 -0.603313,5.927734 2.369902,7.104341 6.640959,2.628063 29.457693,2.831091 37.117391,0.330279 z M 38.296539,96.015502 C 33.518652,94.997831 30,93.329931 30,92.082804 30,90.396836 37.649107,82.002399 44.239449,76.45586 l 6.73945,-5.672029 5.777027,5.004724 C 64.022561,82.083749 72,90.57171 72,92.008186 72,95.544575 48.951671,98.285004 38.296539,96.015502 Z M 60,92.440983 c 0,-0.857459 -0.45734,-1.276365 -1.016312,-0.930902 -0.558971,0.345464 -0.757414,1.047021 -0.440983,1.559017 C 59.399945,94.456142 60,94.197509 60,92.440983 Z M 45.105127,55.507608 c -4.225665,-4.159311 -5.220705,-5.710825 -4.591241,-7.158884 0.441997,-1.016798 0.73219,-2.186224 0.644873,-2.598724 -0.255637,-1.207668 15.802639,-1.478473 20.327515,-0.342801 3.453175,0.866692 2.416178,2.965283 -4.863714,9.842801 -3.347524,3.1625 -6.094542,5.708998 -6.104484,5.658884 -0.0099,-0.05011 -2.445769,-2.480688 -5.412949,-5.401276 z M 57,49 c 0,-0.55 -0.45,-1 -1,-1 -0.55,0 -1,0.45 -1,1 0,0.55 0.45,1 1,1 0.55,0 1,-0.45 1,-1 z M 32.574257,74.192465 c 1.498127,-2.030856 4.740307,-5.792334 7.204845,-8.35884 l 4.480979,-4.666374 -3.441282,-3.021486 C 36.509067,54.36177 28.892327,43.987429 27.291455,39.720915 26.193048,36.79353 26.147482,37.001229 26.791455,42 c 0.863468,6.702575 0.791416,32.432221 -0.112015,40 l -0.656582,5.5 1.913766,-4.807535 c 1.052572,-2.644144 3.139507,-6.469144 4.637633,-8.5 z M 74.756414,79.75 C 74.271275,75.7625 74.015115,64.85 74.187171,55.5 L 74.5,38.5 71.791053,44 c -1.489921,3.025 -5.416588,8.175193 -8.725927,11.444874 l -6.016979,5.944875 6.500327,6.73317 c 5.660662,5.863427 8.403307,10.218735 10.785346,17.127081 1.16575,3.380888 1.296327,1.681453 0.422594,-5.5 z"
       id="path32"
       inkscape:connector-curvature="0" />
    <path
       style="fill:#e29b08"
       d="M 32.5,115.88474 C 25.081474,114.80735 18.253591,112.53947 15.832895,110.34877 14.371108,109.02587 14,107.19575 14,101.30983 14,94.379606 15.392403,89.98689 18.240275,87.932718 18.672834,87.620713 18.520675,80.645099 17.902143,72.431354 17.094353,61.704376 17.075396,54.238385 17.83485,45.929107 18.864896,34.659247 18.82989,34.233801 16.477352,29.430471 14.574423,25.545136 14.055916,22.869215 14.031272,16.806704 14.003379,9.944761 14.24314,8.9425083 16.25,7.5319121 19.618548,5.1642034 24.165618,4.2447139 38.5,3.03261 59.677173,1.2418851 83.937861,4.4064343 87.234687,9.3895324 87.638765,10.00029 87.976265,13.7074 87.984687,17.627555 87.995709,22.757812 87.579667,25.103956 86.5,26 85.675,26.684689 85,28.288232 85,29.563428 c 0,1.275196 -0.416985,2.576249 -0.926633,2.891229 -0.547024,0.338079 -0.717342,8.862815 -0.41575,20.809017 C 83.938603,64.393653 83.736677,76.425 83.208892,80 c -0.934101,6.327216 -0.882033,6.598306 1.958746,10.198192 2.738958,3.470856 2.900345,4.177787 2.625359,11.499998 L 87.5,109.5 l -4.676248,2.32055 c -2.571936,1.2763 -8.196936,2.9481 -12.5,3.71511 -8.597084,1.53241 -28.416286,1.71532 -37.823752,0.34908 z m 8.153037,-15.04263 c -4.315829,-0.49296 -9.317529,-1.510739 -11.114889,-2.261724 -2.855076,-1.192927 -6.907372,-0.616277 -5.507383,0.783712 0.898083,0.898082 12.488432,2.394392 18.469235,2.384362 5.981696,-0.01 5.976062,-0.0128 -1.846963,-0.90635 z M 55.25,101.29427 c -1.2375,-0.23836 -3.2625,-0.23836 -4.5,0 -1.2375,0.23835 -0.225,0.43337 2.25,0.43337 2.475,0 3.4875,-0.19502 2.25,-0.43337 z m 14.807371,-0.44082 c 6.515609,-1.076031 8.525769,-2.15907 5.734319,-3.089553 -0.66457,-0.221524 -2.382144,0.182815 -3.81683,0.898531 -1.434686,0.715716 -5.053447,1.706852 -8.04169,2.202532 -2.988244,0.49568 -4.394853,0.95384 -3.125799,1.01814 1.269055,0.0643 5.431555,-0.39905 9.25,-1.02965 z m -1.43998,-4.085818 c 3.350587,-1.093932 3.92613,-1.720773 4.200215,-4.574582 0.548689,-5.713009 -4.898946,-15.589658 -12.844152,-23.286655 -3.8354,-3.715581 -6.973204,-7.127031 -6.972898,-7.580999 3.06e-4,-0.453968 2.894301,-3.413143 6.431101,-6.575944 4.704274,-4.206821 7.388611,-7.665609 9.999444,-12.884357 C 71.393995,37.9415 73,33.879215 73,32.837794 73,31.08999 72.480641,31.00415 66.25,31.72215 c -8.54851,0.985105 -21.664082,0.9958 -30.952954,0.02524 l -7.202954,-0.75261 1.352081,4.492626 c 2.078692,6.906968 5.89983,12.691653 12.29465,18.612436 3.207882,2.970086 6.190341,5.979277 6.627687,6.68709 0.53684,0.868835 -1.434863,3.351606 -6.069032,7.642137 -7.479981,6.925316 -11.855381,13.87045 -13.16938,20.903943 -0.926451,4.959052 -0.603313,5.927734 2.369902,7.104341 6.640959,2.628063 29.457693,2.831091 37.117391,0.330279 z M 39.304148,96.344828 c -2.431865,-0.352673 -3.048644,-0.847087 -2.580061,-2.068193 0.391691,-1.020732 0.215172,-1.357129 -0.48505,-0.924368 -0.605462,0.374196 -1.365551,0.252045 -1.689087,-0.271446 -0.876172,-1.417676 3.198987,-8.260038 8.006004,-13.442412 0.580775,-0.626125 1.333826,-1.872943 1.673448,-2.770706 0.339622,-0.897764 1.969488,-2.230748 3.621925,-2.962187 1.652436,-0.73144 2.785326,-1.684406 2.517534,-2.117703 C 50.101069,71.354516 50.313491,71 50.84091,71 52.339891,71 72.026923,90.342277 72.012692,91.801027 71.987192,94.414969 64.789674,96.255713 53.5,96.535595 47.45,96.68558 41.061867,96.599735 39.304148,96.344828 Z m 20.670878,-5.769802 c -1.345063,-1.345063 -2.345429,0.01734 -1.54477,2.103821 0.574498,1.497118 0.814669,1.542891 1.581898,0.301487 0.545624,-0.882838 0.530891,-1.837289 -0.03713,-2.405308 z M 45,86 c 0,-0.55 -0.45,-1 -1,-1 -0.55,0 -1,0.45 -1,1 0,0.55 0.45,1 1,1 0.55,0 1,-0.45 1,-1 z m 1.5,-9 C 46.839919,76.45 46.641476,76 46.059017,76 45.476558,76 45,76.45 45,77 c 0,0.55 0.198442,1 0.440983,1 0.242541,0 0.719098,-0.45 1.059017,-1 z m -10,6 c 0.995486,-1.1 2.034975,-2 2.309975,-2 0.275,0 -0.314489,0.9 -1.309975,2 -0.995486,1.1 -2.034975,2 -2.309975,2 -0.275,0 0.314489,-0.9 1.309975,-2 z M 45.363897,55.658884 C 42.539041,52.821498 40.401495,50.05 40.613796,49.5 c 0.238409,-0.61764 3.349332,-0.779391 8.136102,-0.423034 4.262556,0.317332 8.177602,0.204832 8.700102,-0.25 C 58.613863,47.813834 63,47.72557 63,48.715281 63,49.25457 50.607694,61.360624 50.518076,60.908884 c -0.0099,-0.05011 -2.329322,-2.412614 -5.154179,-5.25 z M 23,92 c 0,-1.1 -0.648442,-2 -1.440983,-2 -1.76659,0 -2.896057,1.64564 -2.059017,3 1.08749,1.759595 3.5,1.070306 3.5,-1 z m 56.5,0 c 0,-0.809935 -0.7875,-1.624269 -1.75,-1.809629 C 76.522151,89.953909 76,90.493851 76,92 c 0,1.506149 0.522151,2.046091 1.75,1.809629 C 78.7125,93.624269 79.5,92.809935 79.5,92 Z M 32.574257,74.192465 c 1.498127,-2.030856 4.740307,-5.792334 7.204845,-8.35884 l 4.480979,-4.666374 -3.441282,-3.021486 C 36.509067,54.36177 28.892327,43.987429 27.291455,39.720915 26.193048,36.79353 26.147482,37.001229 26.791455,42 c 0.863468,6.702575 0.791416,32.432221 -0.112015,40 l -0.656582,5.5 1.913766,-4.807535 c 1.052572,-2.644144 3.139507,-6.469144 4.637633,-8.5 z M 74.756414,79.75 C 74.271275,75.7625 74.015115,64.85 74.187171,55.5 L 74.5,38.5 71.791053,44 c -1.489921,3.025 -5.416588,8.175193 -8.725927,11.444874 l -6.016979,5.944875 6.500327,6.73317 c 5.660662,5.863427 8.403307,10.218735 10.785346,17.127081 1.16575,3.380888 1.296327,1.681453 0.422594,-5.5 z M 21.692991,75.269032 C 21.439447,74.296064 21.215328,74.85 21.194949,76.5 c -0.02038,1.65 0.187065,2.446064 0.460988,1.769032 0.273923,-0.677033 0.290597,-2.027033 0.03705,-3 z M 77.717581,69.26375 C 77.487727,67.743687 77.293522,68.75 77.286014,71.5 c -0.0075,2.75 0.180555,3.993687 0.417917,2.76375 0.237362,-1.229938 0.243505,-3.479938 0.01365,-5 z M 20.737242,54.75 c -0.202003,-2.8875 -0.367277,-0.525 -0.367277,5.25 0,5.775 0.165274,8.1375 0.367277,5.25 0.202002,-2.8875 0.202002,-7.6125 0,-10.5 z M 77.717581,45.26375 C 77.487727,43.743687 77.293522,44.75 77.286014,47.5 c -0.0075,2.75 0.180555,3.993687 0.417917,2.76375 0.237362,-1.229938 0.243505,-3.479938 0.01365,-5 z M 21.692991,41.269032 C 21.439447,40.296064 21.215328,40.85 21.194949,42.5 c -0.02038,1.65 0.187065,2.446064 0.460988,1.769032 0.273923,-0.677033 0.290597,-2.027033 0.03705,-3 z M 77.93367,15.401726 c 2.988518,-1.045949 5.615652,-2.470628 5.838075,-3.165952 C 85.147888,7.9337652 58.77115,4.7732676 37.182597,6.6533966 23.611501,7.835292 18,9.252744 18,11.498876 c 0,4.520448 11.545828,6.509743 35.5,6.116493 15.532144,-0.254987 19.991747,-0.659018 24.43367,-2.213643 z"
       id="path30"
       inkscape:connector-curvature="0" />
    <path
       style="fill:#c55700"
       d="M 32.5,115.88474 C 25.081474,114.80735 18.253591,112.53947 15.832895,110.34877 14.371108,109.02587 14,107.19575 14,101.30983 14,94.379606 15.392403,89.98689 18.240275,87.932718 18.672834,87.620713 18.520675,80.645099 17.902143,72.431354 17.094353,61.704376 17.075396,54.238385 17.83485,45.929107 18.864896,34.659247 18.82989,34.233801 16.477352,29.430471 14.574423,25.545136 14.055916,22.869215 14.031272,16.806704 14.003379,9.944761 14.24314,8.9425083 16.25,7.5319121 19.618548,5.1642034 24.165618,4.2447139 38.5,3.03261 59.677173,1.2418851 83.937861,4.4064343 87.234687,9.3895324 87.638765,10.00029 87.976265,13.7074 87.984687,17.627555 87.995709,22.757812 87.579667,25.103956 86.5,26 85.675,26.684689 85,28.288232 85,29.563428 c 0,1.275196 -0.416985,2.576249 -0.926633,2.891229 -0.547024,0.338079 -0.717342,8.862815 -0.41575,20.809017 C 83.938603,64.393653 83.736677,76.425 83.208892,80 c -0.934101,6.327216 -0.882033,6.598306 1.958746,10.198192 2.738958,3.470856 2.900345,4.177787 2.625359,11.499998 L 87.5,109.5 l -4.676248,2.32055 c -2.571936,1.2763 -8.196936,2.9481 -12.5,3.71511 -8.597084,1.53241 -28.416286,1.71532 -37.823752,0.34908 z m 24.850818,-9.35378 c 4.31795,-0.76959 8.125818,-1.67426 8.461928,-2.01037 0.33611,-0.33611 -4.096758,-0.31757 -9.850819,0.0412 -11.475336,0.7155 -27.222145,-0.68387 -33.796317,-3.00337 L 18,100.08872 v 3.39814 c 0,3.2711 0.158887,3.41246 4.25,3.78093 10.228796,0.9213 27.876091,0.55084 35.100818,-0.73683 z M 72,100.88626 c 7.987725,-1.458657 9.011036,-1.986066 5.698259,-2.936853 -1.940879,-0.557043 -3.938069,-0.288732 -6.5,0.873239 -5.147665,2.334734 -34.907826,2.340924 -40.231881,0.0084 -1.943492,-0.851477 -4.985113,-1.335106 -6.759159,-1.074731 -1.811707,0.265902 -3.8896,-0.07772 -4.740544,-0.783936 C 18.633421,96.28084 17.66845,95.998253 17.322294,96.344409 15.794631,97.872071 28.202715,101.0463 41,102.40163 c 5.343093,0.56587 24.815548,-0.38597 31,-1.51533 z m -3.382609,-4.118628 c 3.350587,-1.093932 3.92613,-1.720773 4.200215,-4.574582 0.548689,-5.713009 -4.898946,-15.589658 -12.844152,-23.286655 -3.8354,-3.715581 -6.973204,-7.127031 -6.972898,-7.580999 3.06e-4,-0.453968 2.894301,-3.413143 6.431101,-6.575944 4.704274,-4.206821 7.388611,-7.665609 9.999444,-12.884357 C 71.393995,37.9415 73,33.879215 73,32.837794 73,31.08999 72.480641,31.00415 66.25,31.72215 c -8.54851,0.985105 -21.664082,0.9958 -30.952954,0.02524 l -7.202954,-0.75261 1.352081,4.492626 c 2.078692,6.906968 5.89983,12.691653 12.29465,18.612436 3.207882,2.970086 6.190341,5.979277 6.627687,6.68709 0.53684,0.868835 -1.434863,3.351606 -6.069032,7.642137 -7.479981,6.925316 -11.855381,13.87045 -13.16938,20.903943 -0.926451,4.959052 -0.603313,5.927734 2.369902,7.104341 6.640959,2.628063 29.457693,2.831091 37.117391,0.330279 z M 24.668129,93.422459 c 0.332948,-0.867648 -0.131175,-2.314077 -1.031385,-3.214286 -1.515659,-1.515659 -1.757829,-1.515659 -3.273488,0 C 18.318774,92.252655 19.257185,95 22,95 c 1.134523,0 2.335181,-0.709894 2.668129,-1.577541 z M 80.5,92.083333 c 0,-2.896486 -1.440519,-3.57853 -3.844863,-1.820431 -2.368937,1.73221 -1.148506,4.949557 1.722141,4.53997 C 79.871778,94.589635 80.5,93.784785 80.5,92.083333 Z M 32.574257,74.192465 c 1.498127,-2.030856 4.740307,-5.792334 7.204845,-8.35884 l 4.480979,-4.666374 -3.441282,-3.021486 C 36.509067,54.36177 28.892327,43.987429 27.291455,39.720915 26.193048,36.79353 26.147482,37.001229 26.791455,42 c 0.863468,6.702575 0.791416,32.432221 -0.112015,40 l -0.656582,5.5 1.913766,-4.807535 c 1.052572,-2.644144 3.139507,-6.469144 4.637633,-8.5 z M 74.756414,79.75 C 74.271275,75.7625 74.015115,64.85 74.187171,55.5 L 74.5,38.5 71.791053,44 c -1.489921,3.025 -5.416588,8.175193 -8.725927,11.444874 l -6.016979,5.944875 6.500327,6.73317 c 5.660662,5.863427 8.403307,10.218735 10.785346,17.127081 1.16575,3.380888 1.296327,1.681453 0.422594,-5.5 z M 23,60.3 C 23,40.540191 22.74999,35.849938 21.75,36.849642 19.461917,39.13707 20.194435,85 22.519052,85 22.783573,85 23,73.885 23,60.3 Z M 78.914047,59.75 C 78.851899,41.492859 78.55133,35.330835 77.828745,37.5 75.882344,43.343004 76.534132,85 78.571956,85 78.80738,85 78.961321,73.6375 78.914047,59.75 Z M 22,29 c -1.958372,-1.265597 -3.282182,-1.265597 -2.5,0 0.339919,0.55 1.378976,0.993109 2.309017,0.984687 C 23.266292,29.971491 23.292687,29.835399 22,29 Z M 75.407781,16.277273 C 82.69265,14.402981 85.824867,11.801401 83,9.9712704 77.725567,6.5541541 55.507088,4.5888167 38.787767,6.0604737 24.63208,7.3064763 19.770338,8.3668728 17.904235,10.61539 13.893961,15.447474 31.893843,19.20471 55.5,18.463005 c 7.893054,-0.248 15.713666,-1.106647 19.907781,-2.185732 z"
       id="path28"
       inkscape:connector-curvature="0" />
    <path
       style="fill:#af4c09"
       d="M 32.5,115.88474 C 25.081474,114.80735 18.253591,112.53947 15.832895,110.34877 14.371108,109.02587 14,107.19575 14,101.30983 14,94.379606 15.392403,89.98689 18.240275,87.932718 18.672834,87.620713 18.520675,80.645099 17.902143,72.431354 17.094353,61.704376 17.075396,54.238385 17.83485,45.929107 18.864896,34.659247 18.82989,34.233801 16.477352,29.430471 14.574423,25.545136 14.055916,22.869215 14.031272,16.806704 14.003379,9.944761 14.24314,8.9425083 16.25,7.5319121 19.618548,5.1642034 24.165618,4.2447139 38.5,3.03261 59.677173,1.2418851 83.937861,4.4064343 87.234687,9.3895324 87.638765,10.00029 87.976265,13.7074 87.984687,17.627555 87.995709,22.757812 87.579667,25.103956 86.5,26 85.675,26.684689 85,28.288232 85,29.563428 c 0,1.275196 -0.416985,2.576249 -0.926633,2.891229 -0.547024,0.338079 -0.717342,8.862815 -0.41575,20.809017 C 83.938603,64.393653 83.736677,76.425 83.208892,80 c -0.934101,6.327216 -0.882033,6.598306 1.958746,10.198192 2.738958,3.470856 2.900345,4.177787 2.625359,11.499998 L 87.5,109.5 l -4.676248,2.32055 c -2.571936,1.2763 -8.196936,2.9481 -12.5,3.71511 -8.597084,1.53241 -28.416286,1.71532 -37.823752,0.34908 z m 42.046128,-5.15665 C 82.65524,108.41481 84,107.38796 84,103.50918 v -3.42046 l -4.25,1.69611 c -6.319785,2.52213 -50.163994,2.47048 -56.625727,-0.0667 C 17.252021,99.412392 17,99.48103 17,103.38606 c 0,2.89686 0.513703,3.62983 3.555714,5.07335 7.090977,3.36489 16.192949,4.49569 32.944286,4.09291 9.766595,-0.23484 17.96591,-0.94554 21.046128,-1.82423 z m -2.414354,-9.77941 c 7.968705,-1.604534 8.822754,-2.064704 5.566485,-2.999273 -1.940879,-0.557043 -3.938069,-0.288732 -6.5,0.873239 -5.312942,2.409694 -34.911468,2.336854 -40.490385,-0.09965 -2.288394,-0.999419 -4.964059,-1.421763 -6.747519,-1.065071 -1.753556,0.350711 -3.576218,0.07584 -4.48204,-0.675926 -0.839656,-0.696852 -1.809865,-0.983786 -2.156021,-0.63763 -1.524855,1.524854 9.471473,4.460061 22.677706,6.053271 5.553402,0.66997 26.241648,-0.26296 32.131774,-1.44896 z m -3.514383,-4.181048 c 3.350587,-1.093932 3.92613,-1.720773 4.200215,-4.574582 0.548689,-5.713009 -4.898946,-15.589658 -12.844152,-23.286655 -3.8354,-3.715581 -6.973204,-7.127031 -6.972898,-7.580999 3.06e-4,-0.453968 2.894301,-3.413143 6.431101,-6.575944 4.704274,-4.206821 7.388611,-7.665609 9.999444,-12.884357 C 71.393995,37.9415 73,33.879215 73,32.837794 73,31.08999 72.480641,31.00415 66.25,31.72215 c -8.54851,0.985105 -21.664082,0.9958 -30.952954,0.02524 l -7.202954,-0.75261 1.352081,4.492626 c 2.078692,6.906968 5.89983,12.691653 12.29465,18.612436 3.207882,2.970086 6.190341,5.979277 6.627687,6.68709 0.53684,0.868835 -1.434863,3.351606 -6.069032,7.642137 -7.479981,6.925316 -11.855381,13.87045 -13.16938,20.903943 -0.926451,4.959052 -0.603313,5.927734 2.369902,7.104341 6.640959,2.628063 29.457693,2.831091 37.117391,0.330279 z M 84.127555,96.25 C 85.371426,94.663944 85.336056,94.628574 83.75,95.872445 82.7875,96.627289 82,97.414789 82,97.622445 82,98.445479 82.821186,97.915748 84.127555,96.25 Z M 25.380922,93.768764 c 1.499874,-2.392824 -1.323485,-5.239157 -4.269415,-4.304155 -2.072459,0.657773 -2.95149,4.362075 -1.402658,5.910907 1.180303,1.180303 4.517678,0.23491 5.672073,-1.606752 z m 56.417335,-0.356269 c 0.164041,-1.148128 -0.392728,-2.660973 -1.237265,-3.361876 -3.048291,-2.529857 -7.04023,1.462082 -4.510373,4.510373 1.773447,2.136873 5.381235,1.415962 5.747638,-1.148497 z M 23.792569,60 c 0.01123,-18.056758 -0.910571,-27.618708 -2.361866,-24.5 -1.218528,2.618512 -1.209329,45.112004 0.01061,49 0.879166,2.801944 0.987534,2.603888 1.641466,-3 0.385086,-3.3 0.704493,-12.975 0.709793,-21.5 z m 8.781688,14.192465 c 1.498127,-2.030856 4.740307,-5.792334 7.204845,-8.35884 l 4.480979,-4.666374 -3.441282,-3.021486 C 36.509067,54.36177 28.892327,43.987429 27.291455,39.720915 26.193048,36.79353 26.147482,37.001229 26.791455,42 c 0.863468,6.702575 0.791416,32.432221 -0.112015,40 l -0.656582,5.5 1.913766,-4.807535 c 1.052572,-2.644144 3.139507,-6.469144 4.637633,-8.5 z M 74.756414,79.75 C 74.271275,75.7625 74.015115,64.85 74.187171,55.5 L 74.5,38.5 71.791053,44 c -1.489921,3.025 -5.416588,8.175193 -8.725927,11.444874 l -6.016979,5.944875 6.500327,6.73317 c 5.660662,5.863427 8.403307,10.218735 10.785346,17.127081 1.16575,3.380888 1.296327,1.681453 0.422594,-5.5 z M 80.164452,59.5 C 80.15501,49.05 79.73316,38.925 79.227009,37 l -0.920275,-3.5 -0.903367,5 c -1.172685,6.490634 -1.166664,35.268474 0.009,43 l 0.912364,6 0.928446,-4.5 c 0.510645,-2.475 0.92072,-13.05 0.911278,-23.5 z M 23.55887,29.468197 C 21.431202,27.858909 19,27.520342 19,28.833333 c 0,1.474659 1.27098,2.167435 3.916667,2.134864 2.487309,-0.03062 2.51118,-0.08638 0.642203,-1.5 z m 57.982249,0.465272 c 0.362533,-0.586592 0.481939,-1.243744 0.265346,-1.460337 C 81.119601,27.786268 77,29.194904 77,30.116631 c 0,1.251384 3.747949,1.100213 4.541119,-0.183162 z M 71.163774,27.552906 C 81.221587,25.421183 84,23.68361 84,19.525347 v -3.423294 l -3.347512,1.39868 C 69.593633,22.121418 31.448233,22.107491 19.75,17.478498 18.311943,16.909458 18,17.335743 18,19.869958 c 0,3.924769 2.68784,5.756946 11.134309,7.589749 8.573376,1.86034 33.431732,1.915463 42.029465,0.0932 z M 74.646181,16.525299 C 82.185936,14.796685 86.109738,12.116004 83.775228,10.288475 78.826576,6.4145097 56.480009,4.2909772 37.925619,5.9315133 21.227133,7.4079546 14.927655,9.7980513 17.994654,13.493558 19.158111,14.895439 29.909573,17.591555 37.5,18.384863 c 8.083343,0.844826 30.173848,-0.261041 37.146181,-1.859564 z"
       id="path26"
       inkscape:connector-curvature="0" />
    <path
       style="fill:#952c00"
       d="M 32.5,115.88474 C 25.081474,114.80735 18.253591,112.53947 15.832895,110.34877 14.371108,109.02587 14,107.19575 14,101.30983 14,94.379606 15.392403,89.98689 18.240275,87.932718 18.672834,87.620713 18.520675,80.645099 17.902143,72.431354 17.094353,61.704376 17.075396,54.238385 17.83485,45.929107 18.864896,34.659247 18.82989,34.233801 16.477352,29.430471 14.574423,25.545136 14.055916,22.869215 14.031272,16.806704 14.003379,9.944761 14.24314,8.9425083 16.25,7.5319121 19.618548,5.1642034 24.165618,4.2447139 38.5,3.03261 59.677173,1.2418851 83.937861,4.4064343 87.234687,9.3895324 87.638765,10.00029 87.976265,13.7074 87.984687,17.627555 87.995709,22.757812 87.579667,25.103956 86.5,26 85.675,26.684689 85,28.288232 85,29.563428 c 0,1.275196 -0.416985,2.576249 -0.926633,2.891229 -0.547024,0.338079 -0.717342,8.862815 -0.41575,20.809017 C 83.938603,64.393653 83.736677,76.425 83.208892,80 c -0.934101,6.327216 -0.882033,6.598306 1.958746,10.198192 2.738958,3.470856 2.900345,4.177787 2.625359,11.499998 L 87.5,109.5 l -4.676248,2.32055 c -2.571936,1.2763 -8.196936,2.9481 -12.5,3.71511 -8.597084,1.53241 -28.416286,1.71532 -37.823752,0.34908 z m 40.311499,-4.41006 C 81.352196,109.53214 85,106.99176 85,102.98644 85,100.08379 83.589775,98.236708 82.598371,99.840833 81.197903,102.10684 68.786647,103.5 50,103.5 30.889216,103.5 26.895833,102.97891 18.25,99.356985 17.369261,98.988025 17,100.03278 17,102.89361 c 0,3.11684 0.522808,4.39527 2.25,5.50194 8.241803,5.28081 36.690828,6.91628 53.561499,3.07913 z m -5.984088,-9.48786 c 4.030076,-0.52328 8.99398,-1.40018 11.030898,-1.94867 4.303395,-1.15878 7.949673,-3.563502 6.937738,-4.575437 -0.385445,-0.385444 -1.42938,0.02776 -2.319857,0.918239 -1.763989,1.76399 -4.230172,2.061548 -6.285071,0.758328 -0.792167,-0.502394 -2.895828,-0.04494 -5.328751,1.158778 -7.352962,3.637952 -36.40251,3.198712 -42.26015,-0.638994 -1.586264,-1.039261 -2.536426,-1.105081 -3.871371,-0.268179 -1.36148,0.853537 -2.456041,0.716573 -4.75,-0.594375 -3.439548,-1.965627 -4.110681,-0.542041 -0.730847,1.550249 6.17232,3.820981 31.349151,5.747221 47.577411,3.640061 z m 1.78998,-5.219188 c 3.350587,-1.093932 3.92613,-1.720773 4.200215,-4.574582 0.548689,-5.713009 -4.898946,-15.589658 -12.844152,-23.286655 -3.8354,-3.715581 -6.973204,-7.127031 -6.972898,-7.580999 3.06e-4,-0.453968 2.894301,-3.413143 6.431101,-6.575944 4.704274,-4.206821 7.388611,-7.665609 9.999444,-12.884357 C 71.393995,37.9415 73,33.695039 73,32.428514 73,30.312042 72.696614,30.181332 69.25,30.812871 64.928503,31.604718 37.207831,31.743976 32,31 c -3.256026,-0.465147 -3.47901,-0.325733 -3.198878,2 0.675219,5.60587 6.254026,14.822277 12.520365,20.684129 3.464141,3.240534 6.645784,6.453898 7.070318,7.140808 0.50626,0.819147 -1.590237,3.435887 -6.092327,7.604133 -7.479981,6.925316 -11.855381,13.87045 -13.16938,20.903943 -0.926451,4.959052 -0.603313,5.927734 2.369902,7.104341 6.640959,2.628063 29.457693,2.831091 37.117391,0.330278 z M 24.902401,95.6176 c 0.631009,-0.76032 1.047322,-2.694352 0.92514,-4.297849 -0.197354,-2.590041 -0.536411,-2.869325 -3.03774,-2.502208 -2.319987,0.340502 -2.700815,0.114139 -2.163533,-1.285997 0.451301,-1.17607 0.873634,-1.340722 1.37173,-0.534785 1.101021,1.781489 3.001845,-15.348068 3.003278,-27.064486 0.0015,-12.499469 -1.795447,-26.598942 -3.390032,-26.598942 -0.710394,0 -1.01321,1.521508 -0.812682,4.083334 0.183387,2.342826 -0.03203,3.580254 -0.505379,2.90308 -0.455535,-0.651688 -0.708589,2.259271 -0.565056,6.5 0.17938,5.299829 -0.02636,7.060371 -0.663804,5.680253 -0.662709,-1.434821 -0.943614,0.19007 -0.994038,5.75 -0.04594,5.066024 0.315115,7.75 1.042562,7.75 0.747619,0 0.984481,2.271742 0.721719,6.921987 -0.21512,3.807093 -0.0409,6.705535 0.387153,6.440983 1.361541,-0.841478 0.836186,6.175581 -0.610476,8.154009 -0.763816,1.04458 -1.137343,2.554409 -0.830061,3.355174 0.402446,1.048758 0.161584,1.21654 -0.861243,0.599933 -1.195569,-0.720742 -1.190674,-0.549146 0.03098,1.085956 C 19.69379,94.890761 22.123932,97 23.068685,97 c 0.377534,0 1.202706,-0.62208 1.833716,-1.3824 z m 56.52617,-0.189029 c 1.971678,-1.971677 2.000594,-3.827507 0.08441,-5.417794 C 79.398181,88.255645 75,89.563585 75,91.947623 75,93.898233 77.45569,97 79,97 c 0.471429,0 1.564286,-0.707143 2.428571,-1.571429 z M 32.574257,74.192465 c 1.498127,-2.030856 4.740307,-5.792334 7.204845,-8.35884 l 4.480979,-4.666374 -3.441282,-3.021486 C 36.509067,54.36177 28.892327,43.987429 27.291455,39.720915 26.193048,36.79353 26.147482,37.001229 26.791455,42 c 0.863468,6.702575 0.791416,32.432221 -0.112015,40 l -0.656582,5.5 1.913766,-4.807535 c 1.052572,-2.644144 3.139507,-6.469144 4.637633,-8.5 z M 74.756414,79.75 C 74.271275,75.7625 74.015115,64.85 74.187171,55.5 L 74.5,38.5 71.791053,44 c -1.489921,3.025 -5.416588,8.175193 -8.725927,11.444874 l -6.016979,5.944875 6.500327,6.73317 c 5.660662,5.863427 8.403307,10.218735 10.785346,17.127081 1.16575,3.380888 1.296327,1.681453 0.422594,-5.5 z m 5.786366,-3.5 C 81.47323,62.64584 80.52802,35.12802 79.080562,33.680562 78.306479,32.906479 77.995657,33.153077 77.984687,34.55 c -0.01139,1.450625 -0.231972,1.608206 -0.861342,0.615335 -0.495537,-0.781739 -0.666497,0.875381 -0.412668,4 0.238349,2.934066 0.06345,4.814587 -0.388658,4.178937 C 75.869909,42.708621 75.5,49.752822 75.5,58.99805 c 0,9.584328 0.383101,16.573052 0.891291,16.259389 0.500495,-0.308913 0.675893,1.691569 0.400031,4.562514 -0.270192,2.811948 -0.108773,4.876243 0.358709,4.587322 C 77.617514,84.118355 78,84.583524 78,85.440983 78,86.298442 78.406696,87 78.90377,87 c 0.497073,0 1.234628,-4.8375 1.63901,-10.75 z m 2.119501,-3.5 c -0.277413,-0.6875 -0.504386,-0.125 -0.504386,1.25 0,1.375 0.226973,1.9375 0.504386,1.25 0.277412,-0.6875 0.277412,-1.8125 0,-2.5 z M 26.707261,62.761659 C 26.468068,61.517747 26.263283,62.3 26.252183,64.5 c -0.0111,2.2 0.184605,3.217747 0.434897,2.261659 0.250293,-0.956087 0.259374,-2.756087 0.02018,-4 z M 26.689326,52.25 c -0.251528,-0.9625 -0.457323,-0.175 -0.457323,1.75 0,1.925 0.205795,2.7125 0.457323,1.75 0.251527,-0.9625 0.251527,-2.5375 0,-3.5 z m 55.993788,-6.4375 c -0.319226,-0.797733 -0.556183,-0.560776 -0.604167,0.604167 -0.04342,1.054166 0.192928,1.644791 0.52522,1.3125 0.332291,-0.332292 0.367818,-1.194792 0.07895,-1.916667 z M 24.676242,30.472676 C 24.864328,29.907647 23.664118,28.934236 22.009108,28.30954 19.693082,27.435337 19,27.453147 19,28.386864 c 0,2.948775 4.801639,4.713202 5.676242,2.085812 z m 56.752329,-0.0441 c 2.510065,-2.510064 1.830601,-3.411968 -1.678571,-2.228095 -4.202249,1.417694 -4.491184,1.71911 -2.72104,2.838584 2.022131,1.278835 2.588938,1.200185 4.399611,-0.610489 z M 68.458872,28.479211 C 76.976397,26.993879 82.75746,24.843272 84.234687,22.610468 84.961532,21.511853 85.31613,16 84.659963,16 c -0.187021,0 -3.899521,0.930494 -8.25,2.067765 C 69.783284,19.800064 65.498627,20.134547 50,20.12947 32.49201,20.123734 26.3129,19.39545 18.681694,16.438225 c -1.592694,-0.617197 -1.778812,-0.228873 -1.5,3.129672 0.25325,3.050639 0.941624,4.196873 3.368087,5.608317 7.518134,4.373207 32.066783,6.065664 47.909091,3.302997 z M 17.16845,25.76845 c -0.742068,-0.742068 -0.872211,-0.351636 -0.437237,1.311709 0.353609,1.352204 0.806902,1.805497 1.05655,1.056551 0.240481,-0.721441 -0.03821,-1.787158 -0.619313,-2.36826 z M 76.5,16.542046 C 79.8,15.642663 83.175,14.223743 84,13.38889 85.334822,12.038126 85.248793,11.664934 83.218763,9.9999004 79.236292,6.7334719 70.658084,5.5799663 50.5,5.6002316 31.213966,5.6196203 22.318935,6.7240885 18.522083,9.5708296 14.53046,12.563602 19.562226,15.841644 31.435291,17.98339 39.421959,19.42408 69.449113,18.463695 76.5,16.542046 Z"
       id="path24"
       inkscape:connector-curvature="0" />
    <path
       style="fill:#0c2425"
       d="M 32.5,115.88474 C 25.081474,114.80735 18.253591,112.53947 15.832895,110.34877 14.371108,109.02587 14,107.19575 14,101.30983 14,94.379606 15.392403,89.98689 18.240275,87.932718 18.672834,87.620713 18.520675,80.645099 17.902143,72.431354 17.094353,61.704376 17.075396,54.238385 17.83485,45.929107 18.864896,34.659247 18.82989,34.233801 16.477352,29.430471 14.574423,25.545136 14.055916,22.869215 14.031272,16.806704 14.003379,9.944761 14.24314,8.9425083 16.25,7.5319121 19.618548,5.1642034 24.165618,4.2447139 38.5,3.03261 59.677173,1.2418851 83.937861,4.4064343 87.234687,9.3895324 87.638765,10.00029 87.976265,13.7074 87.984687,17.627555 87.995709,22.757812 87.579667,25.103956 86.5,26 85.675,26.684689 85,28.288232 85,29.563428 c 0,1.275196 -0.416985,2.576249 -0.926633,2.891229 -0.547024,0.338079 -0.717342,8.862815 -0.41575,20.809017 C 83.938603,64.393653 83.736677,76.425 83.208892,80 c -0.934101,6.327216 -0.882033,6.598306 1.958746,10.198192 2.738958,3.470856 2.900345,4.177787 2.625359,11.499998 L 87.5,109.5 l -4.676248,2.32055 c -2.571936,1.2763 -8.196936,2.9481 -12.5,3.71511 -8.597084,1.53241 -28.416286,1.71532 -37.823752,0.34908 z m 36.823752,-1.34908 c 4.303064,-0.76701 9.928064,-2.43881 12.5,-3.71511 L 86.5,108.5 86.796762,101.70295 C 87.071353,95.413731 86.865194,94.617602 84.037467,91.047306 81.014532,87.23054 80.992134,87.114537 81.970896,80.344359 83.154849,72.154862 83.21745,50.258275 82.084809,40.5 81.458147,35.100989 81.584248,33.138922 82.63616,31.921259 83.386272,31.052952 84,29.420552 84,28.293704 84,27.166856 84.675,25.684689 85.5,25 87.569934,23.282107 87.580017,11.722874 85.513383,9.6562405 81.135254,5.2781115 57.443366,2.3742218 39.430139,4.0078661 24.211608,5.3880555 21.774522,5.85077 18.166204,8.0451194 c -3.059498,1.8605917 -3.16515,2.1534656 -3.134932,8.6901826 0.02374,5.135581 0.62663,7.968829 2.503418,11.764698 2.436014,4.926923 2.456268,5.178791 1.385807,17.233046 -0.792015,8.918719 -0.781011,16.152643 0.04061,26.700123 l 1.126951,14.467077 -2.54403,4.030005 c -3.270164,5.180275 -3.677637,15.733879 -0.711136,18.418519 6.298503,5.70007 34.164019,8.4536 52.490857,5.18689 z M 37.309714,99.99773 c -7.515381,-1.048276 -10.456473,-2.451708 -9.633312,-4.59683 0.331059,-0.862725 0.876801,-1.146071 1.212761,-0.629658 3.07583,4.727942 35.844596,5.254128 42.814166,0.687489 C 73.763526,94.108837 74,94.115967 74,95.527974 c 0,2.970248 -6.804763,4.785026 -19,5.067156 -6.325,0.14633 -14.285629,-0.1225 -17.690286,-0.5974 z M 28.109566,92.078741 C 28.049305,91.297048 27.328545,89.915532 26.507877,89.008704 25.220564,87.58624 25.167916,85.447891 26.124315,73.429964 26.979879,62.679109 26.941478,56.455109 25.956053,46.15814 24.884442,34.960594 24.898234,32.680929 26.041869,31.974123 27.807427,30.882949 29,31.659083 29,33.899295 c 0,4.080924 6.246868,14.102326 12.348936,19.810511 3.449044,3.226412 6.618335,6.428221 7.042869,7.115131 0.50626,0.819147 -1.590237,3.435887 -6.092327,7.604133 -7.359769,6.814018 -11.882459,13.918325 -13.237366,20.793447 -0.46364,2.352616 -0.892285,3.637916 -0.952546,2.856224 z m 4.464691,-17.886276 c 1.498127,-2.030856 4.740307,-5.792334 7.204845,-8.35884 l 4.480979,-4.666374 -3.441282,-3.021486 C 36.509067,54.36177 28.892327,43.987429 27.291455,39.720915 26.193048,36.79353 26.147482,37.001229 26.791455,42 c 0.863468,6.702575 0.791416,32.432221 -0.112015,40 l -0.656582,5.5 1.913766,-4.807535 c 1.052572,-2.644144 3.139507,-6.469144 4.637633,-8.5 z M 73.078158,90.5 C 72.880785,85.549353 66.776038,75.496466 59.953308,68.886879 56.128989,65.182032 53.00025,61.779364 53.000556,61.325396 53.000862,60.871428 55.894857,57.912253 59.431657,54.749452 66.137323,48.752876 73,37.40161 73,32.306626 c 0,-1.38774 0.434632,-2.156043 1.016312,-1.796545 0.558971,0.345464 0.750523,1.058171 0.42567,1.583794 -0.324853,0.525623 0.0053,0.832029 0.733688,0.680902 0.748638,-0.15533 1.158321,0.377279 0.94244,1.225223 -0.991702,3.895245 -1.185169,38.40834 -0.255055,45.5 0.831781,6.341912 0.781069,8.207261 -0.244674,9 -0.711658,0.55 -1.5564,1.675 -1.877205,2.5 -0.426087,1.095749 -0.60477,0.960999 -0.663018,-0.5 z M 74.756414,79.75 C 74.271275,75.7625 74.015115,64.85 74.187171,55.5 L 74.5,38.5 71.791053,44 c -1.489921,3.025 -5.416588,8.175193 -8.725927,11.444874 l -6.016979,5.944875 6.500327,6.73317 c 5.660662,5.863427 8.403307,10.218735 10.785346,17.127081 1.16575,3.380888 1.296327,1.681453 0.422594,-5.5 z"
       id="path22"
       inkscape:connector-curvature="0" />
  </g>
  <path
     style="fill:#ffffff;fill-opacity:1;stroke-width:0.01825495"
     d="m 12.484957,14.765901 c -0.05797,-0.05992 -0.150569,-0.244746 -0.150569,-0.300527 0,-0.01662 0.01722,-0.06579 0.03826,-0.109267 0.04762,-0.09837 0.169901,-0.177812 0.244769,-0.159021 0.09344,0.02345 0.155888,0.205758 0.12768,0.372718 -0.0132,0.07816 -0.137688,0.255426 -0.179369,0.255426 -0.01286,0 -0.0492,-0.0267 -0.08077,-0.05933 z"
     id="path36"
     inkscape:connector-curvature="0" />
  <path
     style="fill:#ffffff;fill-opacity:1;stroke-width:0.01825495"
     d="m 14.691911,12.044525 c -0.112317,-0.135334 -0.248407,-0.747238 -0.172115,-0.773885 0.04228,-0.01477 0.19929,0.155357 0.25245,0.273549 0.06447,0.143337 0.08219,0.352172 0.03871,0.456236 -0.02992,0.07161 -0.08062,0.0904 -0.119045,0.0441 z"
     id="path38"
     inkscape:connector-curvature="0" />
  <path
     style="fill:#ffffff;fill-opacity:1;stroke-width:0.01825495"
     d="m 10.374246,16.905101 c -0.369875,-0.03277 -0.154589,-0.100459 0.381089,-0.119812 0.407967,-0.01474 0.904496,0.03616 0.853198,0.08746 -0.04431,0.04431 -0.85849,0.06566 -1.234287,0.03236 z"
     id="path40"
     inkscape:connector-curvature="0" />
  <path
     style="fill:#ffffff;fill-opacity:1;stroke-width:0.01825495"
     d="M 7.1788852,2.7745121 C 7.1169178,2.7475465 7.0264669,2.6282853 6.9925802,2.5288657 6.9269422,2.3362909 7.0237491,2.1231766 7.2127217,2.0442382 c 0.037328,-0.015593 0.1167042,-0.028351 0.1763908,-0.028351 0.087358,0 0.1310814,0.011781 0.2242095,0.060413 l 0.1156884,0.060413 -0.00422,0.083608 c -0.00232,0.045984 -0.025091,0.149665 -0.050596,0.2304014 -0.042234,0.1336939 -0.054276,0.1525951 -0.1349396,0.2118079 -0.095375,0.070011 -0.2314338,0.1377122 -0.2757424,0.1372047 -0.01506,-1.716e-4 -0.053141,-0.011523 -0.084624,-0.025223 z"
     id="path42"
     inkscape:connector-curvature="0" />
  <path
     style="fill:#ffffff;fill-opacity:1;stroke-width:0.01825495"
     d="m 11.443893,2.8949193 c 0,-0.057067 0.01305,-0.089411 0.05568,-0.1379567 0.106804,-0.1216428 0.261712,-0.1303897 0.371145,-0.020957 0.05728,0.057282 0.09821,0.1483149 0.07645,0.1700675 -0.01377,0.013768 -0.15806,0.034845 -0.343544,0.050182 l -0.159731,0.013208 z"
     id="path44"
     inkscape:connector-curvature="0" />
  <path
     style="fill:#ffffff;fill-opacity:1;stroke-width:0.0365099"
     d="M 5.6387265,-0.18854585 C 5.5502825,-0.39159096 5.3853523,-1.0168561 5.3522844,-1.2744732 c -0.026924,-0.209756 0.014849,-0.3014489 0.1373333,-0.3014489 0.048147,0 0.092818,0.050222 0.14045,0.1579023 0.1140875,0.2579136 0.1870147,1.13275232 0.1100986,1.3207487 -0.026005,0.06356136 -0.039145,0.05173829 -0.1014398,-0.09127475 z"
     id="path46"
     inkscape:connector-curvature="0" />
  <path
     style="fill:#fccc05;fill-opacity:1;stroke-width:0.01825495"
     d="m 10.455603,16.904478 c -0.03514,-0.0041 -0.107954,-0.01235 -0.161808,-0.01824 -0.126466,-0.01383 -0.101875,-0.03646 0.07058,-0.06495 0.358671,-0.05925 1.495788,5.8e-5 1.177398,0.0614 -0.08084,0.01558 -0.984974,0.03371 -1.08617,0.02179 z"
     id="path48"
     inkscape:connector-curvature="0" />
</svg>
