<?xml version="1.0" encoding="UTF-8" standalone="no"?>
<!-- Created with Inkscape (http://www.inkscape.org/) -->

<svg
   xmlns:dc="http://purl.org/dc/elements/1.1/"
   xmlns:cc="http://creativecommons.org/ns#"
   xmlns:rdf="http://www.w3.org/1999/02/22-rdf-syntax-ns#"
   xmlns:svg="http://www.w3.org/2000/svg"
   xmlns="http://www.w3.org/2000/svg"
   xmlns:sodipodi="http://sodipodi.sourceforge.net/DTD/sodipodi-0.dtd"
   xmlns:inkscape="http://www.inkscape.org/namespaces/inkscape"
   version="1.1"
   id="svg10"
   width="20"
   height="20"
   viewBox="0 0 20 20"
   sodipodi:docname="djembe.svg"
   inkscape:version="0.92.4 (5da689c313, 2019-01-14)">
  <metadata
     id="metadata16">
    <rdf:RDF>
      <cc:Work
         rdf:about="">
        <dc:format>image/svg+xml</dc:format>
        <dc:type
           rdf:resource="http://purl.org/dc/dcmitype/StillImage" />
        <dc:title></dc:title>
      </cc:Work>
    </rdf:RDF>
  </metadata>
  <defs
     id="defs14" />
  <sodipodi:namedview
     pagecolor="#ffffff"
     bordercolor="#666666"
     borderopacity="1"
     objecttolerance="10"
     gridtolerance="10"
     guidetolerance="10"
     inkscape:pageopacity="0"
     inkscape:pageshadow="2"
     inkscape:window-width="1920"
     inkscape:window-height="1001"
     id="namedview12"
     showgrid="false"
     inkscape:zoom="16.68772"
     inkscape:cx="11.758942"
     inkscape:cy="18.671043"
     inkscape:window-x="-9"
     inkscape:window-y="-9"
     inkscape:window-maximized="1"
     inkscape:current-layer="svg10" />
  <g
     id="g20"
     transform="matrix(0.36204652,0,0,0.36204652,-2.4085895,-12.368512)">
    <path
       style="fill:#efd29f"
       d="M 21.96189,94.75 17.5,92.5 17.536333,87 c 0.01998,-3.025 0.841954,-9.1 1.826602,-13.5 0.984648,-4.4 1.958831,-10.537134 2.16485,-13.638075 C 21.885217,54.48197 21.700333,53.963671 17.48941,48.540833 14.021867,44.075323 12.200232,40.14154 8.9864694,30.178909 6.7369784,23.205509 4.6370025,15.403932 4.3198564,12.842071 3.7638805,8.3509782 3.8642325,8.1181643 7.1216135,6.3420714 10.08887,4.7241694 13.420661,4.4648637 34.5,4.2112736 68.752975,3.7992011 68.976675,3.9744404 62.43881,26.097599 58.218164,40.379635 57.22005,42.590924 51.766008,49.742843 l -3.998183,5.242842 1.17192,8.257158 c 0.644557,4.541436 1.850854,10.736878 2.680661,13.767649 0.829807,3.030771 1.367182,7.755771 1.194167,10.5 C 52.51205,92.308868 52.329079,92.58619 48.03811,94.75 44.445616,96.561589 41.90515,97 35,97 28.09485,97 25.554384,96.561589 21.96189,94.75 Z M 46,6.3930112 C 46,6.176855 41.6125,6.0838364 36.25,6.1863032 L 26.5,6.3726063 35,6.9363032 C 42.981342,7.465604 46,7.316512 46,6.3930112 Z"
       id="path34"
       inkscape:connector-curvature="0" />
    <path
       style="fill:#cd9c3b"
       d="M 21.96189,94.75 17.5,92.5 17.536333,87 c 0.01998,-3.025 0.817436,-9.016714 1.772118,-13.314921 0.954682,-4.298207 1.993097,-10.373207 2.307591,-13.5 0.56038,-5.57148 0.480774,-5.801395 -3.983892,-11.50617 -3.64606,-4.658793 -5.372345,-8.352692 -8.6456806,-18.5 C 6.7369784,23.205509 4.6370025,15.403932 4.3198564,12.842071 3.7638805,8.3509782 3.8642325,8.1181643 7.1216135,6.3420714 10.08887,4.7241694 13.420661,4.4648637 34.5,4.2112736 68.752975,3.7992011 68.976675,3.9744404 62.43881,26.097599 58.218164,40.379635 57.22005,42.590924 51.766008,49.742843 l -3.998183,5.242842 1.17192,8.257158 c 0.644557,4.541436 1.850854,10.736878 2.680661,13.767649 0.829807,3.030771 1.367182,7.755771 1.194167,10.5 C 52.51205,92.308868 52.329079,92.58619 48.03811,94.75 44.445616,96.561589 41.90515,97 35,97 28.09485,97 25.554384,96.561589 21.96189,94.75 Z M 60.43484,11.240657 C 64.608784,10.032213 64.628619,8.5261824 60.496418,6.5653243 57.381789,5.0873362 53.930283,4.9069812 34.038657,5.1828007 21.456933,5.3572603 10.826166,5.8375 10.414731,6.25 8.8079472,7.8609414 11.5138,8.4091368 23.113425,8.8227067 34.612092,9.232677 35.142932,9.3454261 34.639434,11.270803 c -0.51357,1.963895 -0.21239,2.002167 11.16638,1.418942 6.431802,-0.329665 13.014864,-0.981755 14.629026,-1.449088 z m -43.165808,0.103406 c -0.677033,-0.273923 -2.027033,-0.290597 -3,-0.03705 -0.972968,0.25354 -0.419032,0.477659 1.230968,0.498038 1.65,0.02038 2.446064,-0.187065 1.769032,-0.460988 z m -5.539865,-0.94823 c -0.332292,-0.332291 -1.194792,-0.367818 -1.916667,-0.07895 -0.7977327,0.319226 -0.5607763,0.556183 0.604167,0.604167 1.054166,0.04342 1.644791,-0.192928 1.3125,-0.52522 z"
       id="path32"
       inkscape:connector-curvature="0" />
    <path
       style="fill:#2c81ad"
       d="M 21.96189,94.75 17.5,92.5 17.536333,87 c 0.01998,-3.025 0.817436,-9.016714 1.772118,-13.314921 0.954682,-4.298207 1.993097,-10.373207 2.307591,-13.5 0.56038,-5.57148 0.480774,-5.801395 -3.983892,-11.50617 -3.64606,-4.658793 -5.372345,-8.352692 -8.6456806,-18.5 C 6.7369784,23.205509 4.6370025,15.403932 4.3198564,12.842071 3.7638805,8.3509782 3.8642325,8.1181643 7.1216135,6.3420714 10.08887,4.7241694 13.420661,4.4648637 34.5,4.2112736 68.752975,3.7992011 68.976675,3.9744404 62.43881,26.097599 58.218164,40.379635 57.22005,42.590924 51.766008,49.742843 l -3.998183,5.242842 1.17192,8.257158 c 0.644557,4.541436 1.850854,10.736878 2.680661,13.767649 0.829807,3.030771 1.367182,7.755771 1.194167,10.5 C 52.51205,92.308868 52.329079,92.58619 48.03811,94.75 44.445616,96.561589 41.90515,97 35,97 28.09485,97 25.554384,96.561589 21.96189,94.75 Z m 23.933709,-5.554384 c 5.163724,-1.991923 6.642177,-3.916811 5.74721,-7.482642 l -0.6517,-2.59658 -4.649637,2.056755 C 42.48317,82.87986 40.2079,83.158957 32.972707,82.813038 27.091652,82.531862 23.42261,81.8517 21.700675,80.723445 c -2.526173,-1.655213 -2.559972,-1.640546 -3.227953,1.40075 -0.835242,3.802832 -0.02098,4.649368 6.707231,6.973112 6.611772,2.283528 14.948277,2.32309 20.715646,0.09831 z M 43.25,58.947419 C 46.267863,58.109317 47,57.43191 47,55.477747 47,53.306509 46.737703,53.149227 44.521777,53.99172 41.096173,55.294133 33.426322,55.600949 27.75,54.66264 23.430581,53.94863 23,54.055301 23,55.839388 c 0,3.447951 12.253766,5.328696 20.25,3.108031 z m 18,-47.74693 C 64.87694,9.6824662 64.718868,8.5690083 60.598871,6.6139414 57.80551,5.2884047 53.472134,5.0009966 36.348871,5.0055769 16.834281,5.010797 10.644567,5.6344766 7.0083592,7.9619465 4.7085549,9.4340091 6.830692,10.825893 13.025987,11.908835 20.506573,13.216446 57.740075,12.669537 61.25,11.200489 Z"
       id="path30"
       inkscape:connector-curvature="0" />
    <path
       style="fill:#237cae"
       d="M 21.96189,94.75 17.5,92.5 17.536333,87 c 0.01998,-3.025 0.817436,-9.016714 1.772118,-13.314921 0.954682,-4.298207 1.993097,-10.373207 2.307591,-13.5 0.56038,-5.57148 0.480774,-5.801395 -3.983892,-11.50617 -3.64606,-4.658793 -5.372345,-8.352692 -8.6456806,-18.5 C 6.7369784,23.205509 4.6370025,15.403932 4.3198564,12.842071 3.7638805,8.3509782 3.8642325,8.1181643 7.1216135,6.3420714 10.08887,4.7241694 13.420661,4.4648637 34.5,4.2112736 68.752975,3.7992011 68.976675,3.9744404 62.43881,26.097599 58.218164,40.379635 57.22005,42.590924 51.766008,49.742843 l -3.998183,5.242842 1.17192,8.257158 c 0.644557,4.541436 1.850854,10.736878 2.680661,13.767649 0.829807,3.030771 1.367182,7.755771 1.194167,10.5 C 52.51205,92.308868 52.329079,92.58619 48.03811,94.75 44.445616,96.561589 41.90515,97 35,97 28.09485,97 25.554384,96.561589 21.96189,94.75 Z m 22.3175,-0.163537 c 1.577309,-1.196621 1.599802,-1.418844 0.198062,-1.956742 -0.86973,-0.333747 -1.34026,-0.216756 -1.045621,0.25998 0.618986,1.00154 -5.191378,2.376941 -6.534537,1.546823 C 36.403782,94.131517 36,94.358524 36,94.940983 c 0,1.514004 6.164352,1.250049 8.27939,-0.35452 z m 6.641663,-4.89548 c -0.06086,-0.918181 -0.190191,-0.91753 -0.564608,0.0028 -0.267113,0.656603 -1.244087,0.951653 -2.171053,0.655668 -1.39315,-0.444841 -1.433576,-0.359843 -0.233138,0.490194 1.651951,1.169755 3.08571,0.614999 2.968799,-1.148702 z m -5.66114,-0.263877 c 5.961146,-2.031167 7.134877,-3.509156 6.303996,-7.938134 -0.577172,-3.07659 -0.848979,-3.346759 -2.104207,-2.091531 -2.687406,2.687406 -8.490861,3.851727 -16.978187,3.406256 -5.393255,-0.283074 -9.148978,-1.011016 -10.801023,-2.093477 -2.500582,-1.638444 -2.541287,-1.620501 -3.20777,1.413975 -0.835242,3.802832 -0.02098,4.649368 6.707231,6.973112 6.581626,2.273117 14.018175,2.395256 20.07996,0.329799 z M 39.369328,79.372271 c 1.73381,-2.378939 1.742472,-2.539775 0.119479,-2.218576 -2.299472,0.455079 -5.374806,4.861011 -3.360779,4.81488 0.754585,-0.01728 2.213169,-1.185621 3.2413,-2.596304 z m 9.409576,-1.203904 c 0.703397,-0.896325 1.153397,-2.276096 1,-3.066158 -0.575716,-2.965188 -2.736486,-2.093391 -4.655394,1.878291 l -1.986049,4.110647 2.18127,-0.646549 c 1.199698,-0.355601 2.756776,-1.379905 3.460173,-2.276231 z M 38,75.559017 C 38,75.316476 37.55,74.839919 37,74.5 36.45,74.160081 36,74.358524 36,74.940983 36,75.523442 36.45,76 37,76 c 0.55,0 1,-0.198442 1,-0.440983 z M 48.969374,68.5 c 0,-0.55 -0.436218,-0.325 -0.969374,0.5 -0.533156,0.825 -0.969374,1.95 -0.969374,2.5 0,0.55 0.436218,0.325 0.969374,-0.5 0.533156,-0.825 0.969374,-1.95 0.969374,-2.5 z m -1.34366,-7.032989 C 47.020375,59.889521 43,59.402257 43,60.90638 c 0,0.49851 0.9,0.671025 2,0.383369 1.571257,-0.410893 2.016924,-0.01567 2.078947,1.84362 0.04342,1.301647 0.31087,1.789286 0.59433,1.083642 0.28346,-0.705644 0.262057,-1.943144 -0.04756,-2.75 z M 39,61.393011 C 39,61.176855 38.325,61 37.5,61 36.675,61 36,61.435877 36,61.968615 c 0,0.532739 0.675,0.709594 1.5,0.393011 0.825,-0.316582 1.5,-0.752459 1.5,-0.968615 z m 4.25,-2.445592 C 46.18621,58.131993 47,57.409834 47,55.619663 c 0,-1.257481 0.3375,-2.62383 0.75,-3.03633 0.4125,-0.4125 0.753286,-1.05 0.757303,-1.416666 0.0129,-1.177814 3.154388,-5.171643 3.665725,-4.660306 0.271501,0.271502 0.493639,-0.181361 0.493639,-1.006361 0,-0.825 -0.375,-1.5 -0.833334,-1.5 C 51.375,44 51,44.415474 51,44.923275 c 0,0.507801 -1.112452,2.245349 -2.472116,3.861217 -1.359664,1.615869 -2.197254,3.212805 -1.861312,3.548747 C 48.705477,54.372144 35.689095,55.974991 27.75,54.66264 23.430581,53.94863 23,54.055301 23,55.839388 c 0,3.447951 12.253766,5.328696 20.25,3.108031 z M 55.742929,39.762608 c 0.127086,-1.687103 -0.0503,-1.883309 -0.721213,-0.797746 -0.489362,0.791806 -0.667885,1.798632 -0.396716,2.237392 0.754375,1.220605 0.935067,0.987914 1.117929,-1.439646 z M 58.361626,33.5 C 58.045044,32.675 57.609167,32 57.393011,32 57.176855,32 57,32.675 57,33.5 c 0,0.825 0.435877,1.5 0.968615,1.5 0.532739,0 0.709594,-0.675 0.393011,-1.5 z m 3.607748,-13 c 0,-0.55 -0.436218,-0.325 -0.969374,0.5 -0.533156,0.825 -0.969374,1.95 -0.969374,2.5 0,0.55 0.436218,0.325 0.969374,-0.5 0.533156,-0.825 0.969374,-1.95 0.969374,-2.5 z m -8.207715,-4.18708 c -0.956087,-0.250293 -2.756087,-0.259374 -4,-0.02018 C 48.517747,16.531932 49.3,16.736717 51.5,16.747817 c 2.2,0.0111 3.217747,-0.184605 2.261659,-0.434897 z m 3.906428,-4.415575 C 64.872859,10.642688 65.751375,9.0589645 60.598871,6.6139414 57.80551,5.2884047 53.472134,5.0009966 36.348871,5.0055769 16.834281,5.010797 10.644567,5.6344766 7.0083592,7.9619465 4.6965471,9.441695 6.8486163,10.835419 13.025987,11.859084 c 7.89224,1.30784 37.207362,1.332965 44.6421,0.03826 z"
       id="path28"
       inkscape:connector-curvature="0" />
    <path
       style="fill:#236a92"
       d="M 21.96189,94.75 17.5,92.5 17.536333,87 c 0.01998,-3.025 0.817436,-9.016714 1.772118,-13.314921 0.954682,-4.298207 1.993097,-10.373207 2.307591,-13.5 0.56038,-5.57148 0.480774,-5.801395 -3.983892,-11.50617 -3.64606,-4.658793 -5.372345,-8.352692 -8.6456806,-18.5 C 6.7369784,23.205509 4.6370025,15.403932 4.3198564,12.842071 3.7638805,8.3509782 3.8642325,8.1181643 7.1216135,6.3420714 10.08887,4.7241694 13.420661,4.4648637 34.5,4.2112736 68.752975,3.7992011 68.976675,3.9744404 62.43881,26.097599 58.218164,40.379635 57.22005,42.590924 51.766008,49.742843 l -3.998183,5.242842 1.17192,8.257158 c 0.644557,4.541436 1.850854,10.736878 2.680661,13.767649 0.829807,3.030771 1.367182,7.755771 1.194167,10.5 C 52.51205,92.308868 52.329079,92.58619 48.03811,94.75 44.445616,96.561589 41.90515,97 35,97 28.09485,97 25.554384,96.561589 21.96189,94.75 Z m 24.508242,-0.865717 c 3.996343,-3.306242 5.663092,-5.084393 5.199965,-5.547519 -0.273113,-0.273113 -1.603696,0.228847 -2.95685,1.115468 -1.353154,0.886621 -4.780341,1.886815 -7.615971,2.222653 -5.31315,0.629264 -6.72149,1.506098 -5.525977,3.440479 0.905543,1.4652 8.704585,0.584257 10.898833,-1.231081 z m -1.210219,-4.457177 c 5.961146,-2.031167 7.134877,-3.509156 6.303996,-7.938134 -0.577172,-3.07659 -0.848979,-3.346759 -2.104207,-2.091531 -2.687406,2.687406 -8.490861,3.851727 -16.978187,3.406256 -5.393255,-0.283074 -9.148978,-1.011016 -10.801023,-2.093477 -2.500582,-1.638444 -2.541287,-1.620501 -3.20777,1.413975 -0.835242,3.802832 -0.02098,4.649368 6.707231,6.973112 6.581626,2.273117 14.018175,2.395256 20.07996,0.329799 z m -2.243529,-8.52404 c 5.723919,-1.227561 8.409365,-4.480218 6.04802,-7.325464 C 48.388101,72.762707 48.127266,71.174381 48.484769,70.047988 48.854739,68.882318 48.687804,68 48.097289,68 47.525955,68 47.158696,66.315093 47.279902,64.25 L 47.5,60.5 42,60.841524 c -3.025,0.187838 -5.725,0.562753 -6,0.833145 -0.275,0.270391 -0.558922,4.954206 -0.630937,10.408476 -0.146247,11.076446 -0.574018,10.583083 7.647321,8.819921 z M 43.25,58.947419 C 46.249034,58.114546 47,57.42658 47,55.512013 c 0,-1.316688 0.45734,-2.676631 1.016312,-3.022094 0.558971,-0.345464 0.800566,-0.9772 0.536876,-1.403859 -0.26369,-0.426659 1.016074,-2.408461 2.84392,-4.404003 1.827846,-1.995543 3.086252,-3.865364 2.796457,-4.155158 C 53.903771,42.237104 54.095905,42 54.620529,42 c 0.524624,0 1.02545,-0.950355 1.112947,-2.1119 0.0875,-1.161545 0.799539,-2.849045 1.582316,-3.75 0.782778,-0.900955 1.219452,-2.2006 0.970387,-2.8881 -0.249065,-0.6875 -0.02651,-1.25 0.494564,-1.25 0.521075,0 1.230555,-2.065778 1.576623,-4.590618 0.346068,-2.52484 1.49208,-6.541269 2.546694,-8.925398 l 1.917479,-4.33478 -2.160769,0.449108 C 61.472346,14.845322 54.875,15.473625 48,15.994541 c -6.875,0.520917 -12.6125,0.960247 -12.75,0.97629 -0.540318,0.06304 -0.190712,29.754693 0.391848,33.279169 0.704475,4.262061 2.133644,4.633169 8.755127,2.273417 3.408755,-1.214805 3.71486,-1.20668 2.443324,0.06486 -2.068782,2.068782 -11.515345,3.394004 -16.853482,2.36431 C 23.551073,53.711166 23,53.785944 23,55.900661 c 0,3.386843 12.339976,5.243481 20.25,3.046758 z M 57.668087,11.897345 C 64.872859,10.642688 65.751375,9.0589645 60.598871,6.6139414 57.80551,5.2884047 53.472134,5.0009966 36.348871,5.0055769 16.834281,5.010797 10.644567,5.6344766 7.0083592,7.9619465 4.6965471,9.441695 6.8486163,10.835419 13.025987,11.859084 c 7.89224,1.30784 37.207362,1.332965 44.6421,0.03826 z"
       id="path26"
       inkscape:connector-curvature="0" />
    <path
       style="fill:#1e566a"
       d="M 21.96189,94.75 17.5,92.5 17.536333,87 c 0.01998,-3.025 0.817436,-9.016714 1.772118,-13.314921 0.954682,-4.298207 1.993097,-10.373207 2.307591,-13.5 0.56038,-5.57148 0.480774,-5.801395 -3.983892,-11.50617 -3.64606,-4.658793 -5.372345,-8.352692 -8.6456806,-18.5 C 6.7369784,23.205509 4.6370025,15.403932 4.3198564,12.842071 3.7638805,8.3509782 3.8642325,8.1181643 7.1216135,6.3420714 10.08887,4.7241694 13.420661,4.4648637 34.5,4.2112736 68.752975,3.7992011 68.976675,3.9744404 62.43881,26.097599 58.218164,40.379635 57.22005,42.590924 51.766008,49.742843 l -3.998183,5.242842 1.17192,8.257158 c 0.644557,4.541436 1.850854,10.736878 2.680661,13.767649 0.829807,3.030771 1.367182,7.755771 1.194167,10.5 C 52.51205,92.308868 52.329079,92.58619 48.03811,94.75 44.445616,96.561589 41.90515,97 35,97 28.09485,97 25.554384,96.561589 21.96189,94.75 Z m 25.07622,-1 C 51.260862,91.62059 51.510263,91.25882 51.691484,87 51.7968,84.525 51.255471,80.352112 50.488529,77.726916 49.721587,75.101719 48.78648,70.234923 48.410513,66.911812 48.034546,63.588702 47.081233,60.22409 46.29204,59.434897 45.497827,58.640684 45.335537,58 45.928571,58 46.517857,58 47,57.029067 47,55.842371 c 0,-1.186695 1.743589,-4.449195 3.874643,-7.25 C 53.005696,45.791567 55.339752,42.375 56.061434,41 c 1.545659,-2.9449 8.976034,-27.295865 8.480254,-27.791645 -0.186892,-0.186893 -2.297728,0.216461 -4.690746,0.89634 -5.020437,1.426356 -39.20287,1.846648 -47.969202,0.589809 l -5.6182593,-0.805497 0.4141666,3.758348 c 0.2277915,2.067091 0.7748416,4.229564 1.2156668,4.805496 0.9137985,1.193865 4.1035429,10.862513 4.7533799,14.408288 0.238,1.298627 1.093993,3.022406 1.902208,3.83062 0.808214,0.808214 1.170816,1.952731 0.805781,2.543369 -0.377674,0.611089 -0.197183,0.785566 0.418812,0.40486 0.605614,-0.37429 1.393837,0.311867 1.789189,1.55751 0.388672,1.224597 1.775357,3.067165 3.081524,4.094596 1.306166,1.027431 2.178599,2.185593 1.938739,2.573695 -0.23986,0.388102 0.318352,0.774713 1.240472,0.859137 5.97416,0.546956 11.309822,1.681646 11.824645,2.514647 0.365772,0.591832 -0.526484,0.749465 -2.272959,0.401559 C 23.466291,53.667252 23,53.675273 23,55.819591 c 0,1.680442 1.107068,2.304478 6.25,3.523027 3.4375,0.81447 5.35,1.509838 4.25,1.545262 C 32.4,60.9233 29.850359,60.568951 27.83413,60.100429 24.587235,59.34593 24.090158,59.49152 23.484898,61.374285 23.109048,62.543428 22.730558,64.4 22.643808,65.5 c -0.08675,1.1 -0.521142,2.566527 -0.965315,3.258949 -0.444174,0.692421 -0.535237,2.117051 -0.202363,3.165843 0.332873,1.048792 0.179166,2.170213 -0.341573,2.492047 -1.673727,1.034421 -0.0266,4.385375 2.710662,5.514631 1.46013,0.602375 4.679781,1.527273 7.154781,2.055328 4.498743,0.959832 4.498372,0.959986 -1.327456,0.55091 -3.205101,-0.225055 -6.870479,-1.092605 -8.145283,-1.927889 -2.16579,-1.41908 -2.356597,-1.3741 -2.908889,0.685741 -0.325085,1.212442 -0.597207,2.755384 -0.604717,3.42876 -0.01852,1.660507 4.771745,4.016604 11.727732,5.768296 L 35.5,91.94278 30.398799,91.574017 c -2.805661,-0.20282 -6.495814,-1.089945 -8.20034,-1.97139 -3.781089,-1.955277 -3.865126,-1.958645 -3.865126,-0.154912 0,0.796244 1.275,1.975838 2.833334,2.621321 C 22.725,92.714518 24,93.664604 24,94.180337 c 0,0.515733 0.418906,0.678799 0.930902,0.362368 0.511996,-0.316431 1.213553,-0.117988 1.559017,0.440983 C 26.835382,95.54266 30.596126,96 34.847127,96 c 6.026648,0 8.71189,-0.495595 12.190983,-2.25 z M 52,12.537618 C 64.747705,11.63654 67.329362,9.8077687 60.457259,6.5467422 57.390337,5.0913923 53.864749,4.9100531 34.207259,5.1965693 17.289649,5.4431506 10.798835,5.8836644 8.75,6.9242836 c -3.8195556,1.9399821 -3.4330061,3.7174264 1,4.5982324 4.839681,0.961608 25.563587,2.193156 30.75,1.827361 2.2,-0.155164 7.375,-0.520681 11.5,-0.812259 z"
       id="path24"
       inkscape:connector-curvature="0" />
    <path
       style="fill:#000000"
       d="M 21.96189,94.75 17.5,92.5 17.536333,87 c 0.01998,-3.025 0.817436,-9.016714 1.772118,-13.314921 0.954682,-4.298207 1.993097,-10.373207 2.307591,-13.5 0.56038,-5.57148 0.480774,-5.801395 -3.983892,-11.50617 -3.64606,-4.658793 -5.372345,-8.352692 -8.6456806,-18.5 C 6.7369784,23.205509 4.6370025,15.403932 4.3198564,12.842071 3.7638805,8.3509782 3.8642325,8.1181643 7.1216135,6.3420714 10.08887,4.7241694 13.420661,4.4648637 34.5,4.2112736 68.752975,3.7992011 68.976675,3.9744404 62.43881,26.097599 58.218164,40.379635 57.22005,42.590924 51.766008,49.742843 l -3.998183,5.242842 1.17192,8.257158 c 0.644557,4.541436 1.850854,10.736878 2.680661,13.767649 0.829807,3.030771 1.367182,7.755771 1.194167,10.5 C 52.51205,92.308868 52.329079,92.58619 48.03811,94.75 44.445616,96.561589 41.90515,97 35,97 28.09485,97 25.554384,96.561589 21.96189,94.75 Z m 25.07622,-1 c 4.099871,-2.067445 4.486624,-2.590426 4.766738,-6.445762 C 51.972514,84.99657 51.447257,80.877806 50.63761,78.15143 49.827964,75.425054 48.603843,68.901201 47.917342,63.653979 l -1.248183,-9.540405 4.047517,-5.306787 C 52.94281,45.888054 55.441317,42.15 56.268914,40.5 58.567165,35.917924 65.140355,12.969799 64.80032,10.715412 64.635144,9.6203192 62.925,7.8684397 61,6.8223467 57.798815,5.0827428 55.536361,4.9451031 34.5,5.2101797 14.429668,5.4630836 11.071472,5.7337064 8.135746,7.3347632 5.0343932,9.0261479 4.8174263,9.4559481 5.3592982,12.834763 c 0.3232934,2.01588 2.4169097,9.370746 4.6524808,16.344146 3.268592,10.195695 4.958051,13.818991 8.62612,18.5 L 23.199345,53.5 l -0.599853,7 c -0.32992,3.85 -1.348192,10.15 -2.262829,14 -0.914636,3.85 -1.702054,9.25 -1.749819,12 -0.08588,4.944809 -0.03759,5.024836 4.375046,7.25 C 26.417818,95.492723 29.131887,96 35,96 c 5.868113,0 8.582182,-0.507277 12.03811,-2.25 z"
       id="path22"
       inkscape:connector-curvature="0" />
  </g>
  <path
     style="fill:#ffffff;fill-opacity:1;stroke-width:0.03125"
     d="m 11.941211,-9.7734348 c -0.103125,-0.00614 -0.588281,-0.033709 -1.078125,-0.061269 -0.489844,-0.02756 -1.4531249,-0.088499 -2.1406249,-0.1354188 l -1.25,-0.08531 1.375,-0.02927 c 1.6968409,-0.03613 4.9675629,-0.03838 5.2109379,-0.0036 0.09883,0.01413 0.179687,0.03819 0.179687,0.05347 0,0.069235 -0.152029,0.1564808 -0.355801,0.2041845 -0.168789,0.039514 -0.406682,0.054011 -0.987949,0.060206 -0.421094,0.00449 -0.85,0.00314 -0.953125,-0.003 z"
     id="path36"
     inkscape:connector-curvature="0" />
  <path
     style="fill:#ffffff;fill-opacity:1;stroke-width:0.03125"
     d="M 11.534961,-9.7897618 C 10.994856,-9.8177039 9.5460735,-9.9096303 8.2693361,-9.9969682 l -0.796875,-0.054512 0.671875,-0.01951 c 2.3977759,-0.06962 6.0071649,-0.06187 6.0820959,0.01306 0.04309,0.04309 -0.06496,0.1467371 -0.19961,0.1914593 -0.320867,0.106575 -1.320003,0.1373305 -2.491861,0.076705 z"
     id="path38"
     inkscape:connector-curvature="0" />
  <path
     style="fill:#ffffff;fill-opacity:1;stroke-width:0.03125"
     d="m 11.769336,-9.7731279 c -0.07734,-0.0063 -0.407812,-0.026263 -0.734375,-0.044356 -0.738372,-0.040909 -3.4151245,-0.2152351 -3.4999999,-0.2279411 -0.034375,-0.0051 0.3734375,-0.02196 0.90625,-0.03738 1.2216612,-0.03533 5.4501399,-0.0397 5.6484379,-0.0058 0.260617,0.04451 0.152021,0.1833222 -0.206914,0.2644821 -0.184074,0.041622 -1.761452,0.0797 -2.113399,0.051018 z"
     id="path40"
     inkscape:connector-curvature="0" />
  <path
     style="fill:#ffffff;fill-opacity:1;stroke-width:0.03125"
     d="m 11.644336,-9.7742887 c -0.09453,-0.00663 -0.966406,-0.062226 -1.9374998,-0.1235513 -2.4228728,-0.153006 -2.411865,-0.151508 -1.3593751,-0.185089 1.0945584,-0.03492 5.6151119,-0.03978 5.7734379,-0.0062 0.220222,0.04671 0.108563,0.1804 -0.219953,0.2633577 -0.131236,0.03314 -0.430799,0.047515 -1.13161,0.054301 -0.524219,0.00508 -1.030469,0.00381 -1.125,-0.00282 z"
     id="path42"
     inkscape:connector-curvature="0" />
  <path
     style="fill:#ffffff;fill-opacity:1;stroke-width:0.03125"
     d="m 11.097461,-9.8023188 c -0.360937,-0.023912 -1.2257811,-0.080213 -1.9218749,-0.1251128 -1.822942,-0.1175844 -1.8528167,-0.1226044 -0.921875,-0.1549024 0.9920955,-0.03442 5.7111599,-0.03988 5.8671879,-0.0068 0.220043,0.04667 0.108973,0.1798955 -0.219953,0.2638331 -0.258068,0.065855 -1.947282,0.079699 -2.803485,0.022975 z"
     id="path44"
     inkscape:connector-curvature="0" />
  <path
     style="fill:#cd9c3b;fill-opacity:1;stroke-width:0.00552427"
     d="m 3.057894,-8.0997975 c -0.2479812,-0.010326 -0.4229462,-0.037023 -0.4595104,-0.070113 -0.00553,-0.005 -0.010053,-0.014822 -0.010053,-0.021819 0,-0.038999 0.1827462,-0.095656 0.406034,-0.1258833 0.2048287,-0.027728 0.4627861,-0.025481 0.6491019,0.00565 0.14494,0.02422 0.2610645,0.068414 0.281858,0.1072673 0.023926,0.044707 -0.098929,0.080853 -0.3365958,0.099034 -0.1035883,0.00792 -0.4021382,0.011221 -0.530835,0.00586 z"
     id="path46"
     inkscape:connector-curvature="0" />
  <path
     style="fill:#cd9c3b;fill-opacity:1;stroke-width:0.00552427"
     d="m 3.0136999,-8.1032245 c -0.013673,-0.00112 -0.059662,-0.00469 -0.1021991,-0.00794 -0.1028682,-0.00785 -0.220207,-0.025028 -0.2645309,-0.038718 -0.041999,-0.012972 -0.062217,-0.032504 -0.052479,-0.0507 0.019096,-0.035682 0.2224395,-0.092557 0.4197102,-0.1173946 0.2126066,-0.026768 0.5139671,-0.018123 0.6888202,0.019761 0.1271552,0.027549 0.2221837,0.072449 0.2221837,0.104978 0,0.02266 -0.053703,0.045852 -0.1450254,0.062629 -0.1140339,0.020949 -0.2014056,0.026069 -0.473693,0.027756 -0.14736,9.129e-4 -0.2791139,7.449e-4 -0.2927864,-3.734e-4 z"
     id="path48"
     inkscape:connector-curvature="0" />
  <path
     style="fill:#cd9c3b;fill-opacity:1;stroke-width:0.00552427"
     d="M 8.1429862,-7.7943847 C 6.5285879,-7.8012976 4.6203153,-7.8535376 3.8368163,-7.9122685 3.0738914,-7.9694572 2.5838461,-8.0268299 2.0635251,-8.1198791 0.97805732,-8.3139936 0.2510405,-8.5495881 -0.04070249,-8.8017675 -0.09728977,-8.850681 -0.14313397,-8.9065636 -0.16647257,-8.9550774 l -0.019383,-0.040291 0.009239,-0.041526 c 0.0248174,-0.1115493 0.09393389,-0.2217318 0.21248248,-0.3387303 0.09743537,-0.096161 0.16484608,-0.1461522 0.30218108,-0.224094 C 0.5425258,-9.7157665 0.6690072,-9.7747368 0.88799397,-9.856124 1.0173913,-9.904215 1.2514575,-9.9812168 1.2514575,-9.9756942 c 0,8.904e-4 -0.00602,0.012497 -0.013371,0.025793 -0.058577,0.1059058 -0.031759,0.205289 0.076112,0.2820578 0.3111987,0.2214706 1.3121056,0.3499681 3.4976516,0.4490322 0.4243185,0.019233 0.7458154,0.031943 1.4749806,0.058312 1.4664113,0.05303 2.2695742,0.092998 2.7151796,0.1351149 0.047094,0.00445 0.1036491,0.00976 0.1256772,0.011802 l 0.040051,0.00371 v 0.6096388 0.6096387 l -0.3797937,-0.00133 c -0.2088866,-7.294e-4 -0.499118,-0.00184 -0.6449586,-0.00246 z M 3.6655639,-8.1078385 c 0.1598668,-0.018209 0.2549802,-0.046202 0.2627969,-0.077347 0.005,-0.019933 6.216e-4,-0.027975 -0.025582,-0.046956 -0.047721,-0.034569 -0.1650464,-0.070078 -0.294253,-0.089058 -0.1478484,-0.021718 -0.3717196,-0.026366 -0.5092,-0.010571 -0.028405,0.00326 -0.021806,0.00361 0.024859,0.00131 0.102757,-0.00507 0.3066534,-0.00307 0.3811747,0.00374 0.1794983,0.016416 0.3157133,0.049911 0.388127,0.095439 0.067314,0.042322 0.023477,0.077546 -0.1284862,0.1032408 -0.1133219,0.019161 -0.1916042,0.023901 -0.4640388,0.028096 l -0.2679272,0.00413 0.2762136,-0.00145 c 0.2130364,-0.00112 0.2945349,-0.00354 0.3563155,-0.010572 z m -0.7043446,0.00169 c -0.2177122,-0.015179 -0.3605934,-0.044659 -0.3688137,-0.076093 -0.00427,-0.016326 0.00564,-0.027365 0.040226,-0.044825 0.059222,-0.029895 0.2035977,-0.066044 0.3396365,-0.085039 0.092262,-0.012882 0.091356,-0.012711 0.071816,-0.013556 -0.024549,-0.00106 -0.156044,0.019447 -0.2290239,0.035718 -0.136339,0.030398 -0.2232281,0.06644 -0.230565,0.095641 -0.00913,0.036331 0.085128,0.067037 0.2551908,0.083134 0.033422,0.00316 0.069468,0.00658 0.080102,0.0076 0.010634,0.00102 0.039222,0.00189 0.063529,0.00194 0.037014,8.23e-5 0.033424,-6.525e-4 -0.022098,-0.00452 z M 1.6298698,-8.4210052 c 0.070192,-0.00846 0.1462738,-0.028848 0.1853607,-0.049681 0.070897,-0.037787 0.075588,-0.085343 0.013973,-0.141636 -0.1268673,-0.1159075 -0.4287814,-0.1244835 -0.6909935,-0.019628 -0.15954627,0.063801 -0.20469051,0.1230571 -0.1251046,0.1642126 0.088939,0.045992 0.4167435,0.07083 0.6167644,0.046732 z"
     id="path50"
     inkscape:connector-curvature="0" />
  <path
     style="fill:#cd9c3b;fill-opacity:1;stroke-width:0.00552427"
     d="M 7.8115299,-7.7964995 C 6.2082614,-7.8089412 4.5601165,-7.8569675 3.8340542,-7.9124016 2.9865456,-7.9771079 2.5337815,-8.0319904 1.9450335,-8.1413821 0.96903055,-8.3227273 0.30628682,-8.5364733 -4.893349e-4,-8.7688458 -0.08159886,-8.8302835 -0.14184616,-8.8991785 -0.17193406,-8.9648992 l -0.0139307,-0.030429 0.009384,-0.042177 c 0.0319978,-0.1438239 0.14566817,-0.2954541 0.33732359,-0.4499715 0.0480367,-0.038728 0.0917536,-0.06557 0.25092879,-0.1540654 0.11993691,-0.066681 0.21360884,-0.110606 0.37266809,-0.1747548 0.13084508,-0.05277 0.46701789,-0.1675287 0.46701789,-0.1594251 0,0.00104 -0.00928,0.021415 -0.020628,0.045277 -0.01844,0.038786 -0.020637,0.048072 -0.020716,0.087581 -7.57e-5,0.037639 0.00228,0.049009 0.015852,0.076659 0.1484959,0.3024275 1.2382417,0.4532398 4.1162144,0.5696516 0.1124189,0.00455 0.4430466,0.01698 0.7347281,0.027628 1.8209795,0.066478 2.5238011,0.1019402 3.028682,0.1528192 l 0.062148,0.00626 v 0.6096228 0.6096228 L 8.749275,-7.7915333 c -0.230155,-5.148e-4 -0.6521403,-0.00275 -0.9377451,-0.00497 z m -4.431847,-0.3020561 c -0.034182,-9.692e-4 -0.090115,-9.692e-4 -0.1242962,0 -0.034181,9.692e-4 -0.00621,0.00176 0.062148,0.00176 0.068363,0 0.09633,-7.93e-4 0.062148,-0.00176 z m -0.3976716,-0.00529 c -0.00679,-0.00131 -0.019224,-0.00135 -0.027621,-7.51e-5 -0.0084,0.00127 -0.00284,0.00234 0.012354,0.00238 0.015192,3.87e-5 0.022062,-9.975e-4 0.015268,-0.00231 z m 0.5882589,-1.719e-4 c -0.014432,-0.00114 -0.038048,-0.00114 -0.052481,0 -0.014432,0.00114 -0.00262,0.00207 0.02624,0.00207 0.028864,0 0.040672,-9.311e-4 0.026241,-0.00207 z m -0.6517651,-0.00541 c -0.0083,-0.00126 -0.023217,-0.00129 -0.033146,-5.64e-5 -0.00993,0.00123 -0.00314,0.00226 0.015093,0.00229 0.01823,3.32e-5 0.026354,-9.749e-4 0.018053,-0.00224 z m 0.7291049,-1.11e-5 c -0.00836,-0.00127 -0.022028,-0.00127 -0.030383,0 -0.00836,0.00127 -0.00152,0.0023 0.015192,0.0023 0.016711,0 0.023547,-0.00104 0.015191,-0.0023 z m -0.792657,-0.00546 c -0.00679,-0.00131 -0.019224,-0.00135 -0.027621,-7.51e-5 -0.0084,0.00127 -0.00284,0.00234 0.012354,0.00238 0.015192,3.87e-5 0.022062,-9.975e-4 0.015268,-0.00231 z m 0.8451376,-1.1e-5 c -0.00684,-0.00132 -0.018023,-0.00132 -0.024859,0 -0.00684,0.00132 -0.00124,0.00239 0.01243,0.00239 0.013673,0 0.019266,-0.00108 0.01243,-0.00239 z m -0.9128859,-0.00743 c -0.013673,-0.00243 -0.031074,-0.00428 -0.03867,-0.00411 -0.021086,4.851e-4 0.020355,0.00845 0.044194,0.00849 0.017441,3.31e-5 0.0169,-3.977e-4 -0.00552,-0.00439 z m 0.954318,0.002 c -0.00532,-0.00139 -0.014018,-0.00139 -0.019335,0 -0.00532,0.00139 -9.667e-4,0.00253 0.00967,0.00253 0.010634,0 0.014985,-0.00114 0.00967,-0.00253 z m 0.036013,-0.00534 c -0.00374,-0.00151 -0.011198,-0.00161 -0.016573,-2.049e-4 -0.00537,0.0014 -0.00231,0.00264 0.0068,0.00275 0.00911,1.127e-4 0.013513,-0.00103 0.00977,-0.00255 z m -1.087316,-0.012894 c -0.024478,-0.00553 -0.053687,-0.013898 -0.06491,-0.018587 -0.021885,-0.00914 -0.027669,-0.00784 -0.00916,0.00206 0.015815,0.00846 0.088186,0.026941 0.1047651,0.026746 0.0076,-8.89e-5 -0.00622,-0.00469 -0.030694,-0.010223 z m 1.1148322,0.00733 c -0.0038,-0.00153 -0.010013,-0.00153 -0.013811,0 -0.0038,0.00153 -6.905e-4,0.00279 0.00691,0.00279 0.0076,0 0.010703,-0.00125 0.00691,-0.00279 z m 0.024744,-0.0052 c -0.00184,-0.00184 -0.0066,-0.00203 -0.010588,-4.359e-4 -0.00441,0.00176 -0.0031,0.00307 0.00334,0.00334 0.00582,2.397e-4 0.00909,-0.00107 0.00725,-0.0029 z m 0.03188,-0.00771 c 0.00696,-0.00299 0.00799,-0.00475 0.00276,-0.00475 -0.00456,0 -0.013258,0.00214 -0.019335,0.00475 -0.00696,0.00299 -0.00799,0.00475 -0.00276,0.00475 0.00456,0 0.013258,-0.00214 0.019335,-0.00475 z m 0.041478,-0.017954 c 0.025765,-0.017546 0.031125,-0.027866 0.023344,-0.044944 -0.00599,-0.01314 -0.040294,-0.03887 -0.061099,-0.045823 -0.00509,-0.0017 0.00505,0.0061 0.02252,0.017335 0.047286,0.030404 0.048572,0.051664 0.00454,0.074944 -0.010851,0.00574 -0.016989,0.01054 -0.01364,0.010674 0.00335,1.342e-4 0.014302,-0.00535 0.024341,-0.012186 z m -1.3092982,-0.015192 c -0.0078,-0.014567 6.666e-4,-0.03035 0.022261,-0.041517 0.00903,-0.00467 0.016409,-0.00973 0.016409,-0.011248 0,-0.00528 -0.030472,0.013032 -0.040941,0.0246 -0.00877,0.00969 -0.00948,0.013943 -0.00425,0.025425 0.00346,0.00758 0.00767,0.013788 0.00936,0.013788 0.00169,0 4.144e-4,-0.00497 -0.00284,-0.011048 z m 0.060767,-0.060767 c 0.00456,-0.00295 0.0058,-0.00536 0.00276,-0.00536 -0.00304,0 -0.00925,0.00241 -0.013811,0.00536 -0.00456,0.00295 -0.0058,0.00536 -0.00276,0.00536 0.00304,0 0.00925,-0.00241 0.013811,-0.00536 z m 0.085626,-0.027314 c 0.030384,-0.00853 0.066429,-0.017511 0.080102,-0.019965 0.013673,-0.00245 0.02101,-0.00534 0.016305,-0.0064 -0.01076,-0.00244 -0.130448,0.028176 -0.1552572,0.039718 -0.010169,0.00473 -0.013517,0.00715 -0.00744,0.00538 0.00608,-0.00177 0.035908,-0.010201 0.066291,-0.018727 z m 1.1076165,0.00522 c -0.00456,-0.00295 -0.010772,-0.00535 -0.013811,-0.00535 -0.00304,0 -0.0018,0.00241 0.00276,0.00535 0.00456,0.00295 0.010772,0.00536 0.013811,0.00536 0.00304,0 0.0018,-0.00241 -0.00276,-0.00536 z m -0.035908,-0.01401 c -0.00911,-0.00417 -0.020302,-0.00751 -0.024859,-0.00742 -0.00456,9.39e-5 4.143e-4,0.00352 0.011048,0.00762 0.025222,0.00971 0.035146,0.00957 0.013811,-2e-4 z m -0.044194,-0.013611 c -0.00608,-0.00261 -0.014778,-0.00475 -0.019335,-0.00475 -0.00522,0 -0.0042,0.00176 0.00276,0.00475 0.00608,0.00261 0.014778,0.00475 0.019335,0.00475 0.00522,0 0.0042,-0.00176 -0.00276,-0.00475 z m -0.9018374,-0.00918 c -0.0038,-0.00153 -0.010013,-0.00153 -0.013811,0 -0.0038,0.00153 -6.905e-4,0.00279 0.00691,0.00279 0.0076,0 0.010703,-0.00125 0.00691,-0.00279 z m 0.8604053,-0.00187 c -0.0076,-0.00243 -0.018782,-0.00442 -0.024859,-0.00442 -0.00875,0 -0.00817,9.207e-4 0.00276,0.00442 0.0076,0.00243 0.018782,0.00442 0.024859,0.00442 0.00875,0 0.00817,-9.208e-4 -0.00276,-0.00442 z m -0.8093058,-0.00552 c 0.014783,-0.00376 0.015081,-0.00422 0.00276,-0.00422 -0.0076,0 -0.021268,0.0019 -0.030384,0.00422 -0.014783,0.00376 -0.015081,0.00422 -0.00276,0.00422 0.0076,0 0.021269,-0.0019 0.030384,-0.00422 z m 0.7664927,-0.00366 c -0.0038,-0.00153 -0.010013,-0.00153 -0.013811,0 -0.0038,0.00153 -6.905e-4,0.00279 0.00691,0.00279 0.0076,0 0.010703,-0.00125 0.00691,-0.00279 z m -0.7209175,-0.00567 c -0.00532,-0.00139 -0.014018,-0.00139 -0.019335,0 -0.00532,0.00139 -9.668e-4,0.00253 0.00967,0.00253 0.010634,0 0.014985,-0.00114 0.00967,-0.00253 z m 0.6934013,1.845e-4 c -0.00374,-0.00151 -0.011198,-0.00161 -0.016573,-2.049e-4 -0.00538,0.0014 -0.00231,0.00264 0.0068,0.00275 0.00911,1.127e-4 0.013513,-0.00103 0.00977,-0.00255 z m -0.6547314,-0.00571 c -0.00532,-0.00139 -0.014018,-0.00139 -0.019335,0 -0.00532,0.00139 -9.668e-4,0.00253 0.00967,0.00253 0.010634,0 0.014985,-0.00114 0.00967,-0.00253 z m 0.6187185,0 c -0.00532,-0.00139 -0.014018,-0.00139 -0.019335,0 -0.00532,0.00139 -9.667e-4,0.00253 0.00967,0.00253 0.010634,0 0.014985,-0.00114 0.00967,-0.00253 z m -0.5771813,-0.00534 c -0.00374,-0.00151 -0.011198,-0.00161 -0.016573,-2.049e-4 -0.00537,0.0014 -0.00231,0.00264 0.0068,0.00275 0.00912,1.127e-4 0.013513,-0.00103 0.00977,-0.00255 z m 0.5205575,-0.00215 c -0.015192,-0.00237 -0.040051,-0.0041 -0.055243,-0.00386 l -0.027621,4.447e-4 0.033146,0.00367 c 0.01823,0.00202 0.043089,0.00375 0.055243,0.00386 0.020731,1.79e-4 0.020389,-7.57e-5 -0.00552,-0.00411 z m -0.3464629,-0.00932 c -0.01433,-0.00113 -0.039189,-0.00115 -0.055243,-2.76e-5 -0.016053,0.00112 -0.00433,0.00205 0.026055,0.00206 0.030384,1.65e-5 0.043518,-9.015e-4 0.029188,-0.00204 z m 0.1973076,-0.00169 c -0.03646,-0.00209 -0.088665,-0.00367 -0.1160097,-0.0035 l -0.049718,3.082e-4 0.052481,0.00341 c 0.028864,0.00188 0.081069,0.00345 0.1160097,0.0035 l 0.063529,8.95e-5 -0.066291,-0.00381 z m -1.7926262,-0.083516 c 0.060379,-0.00658 0.1399886,-0.025648 0.1813221,-0.043429 0.063566,-0.027345 0.083631,-0.075088 0.050677,-0.1205793 -0.1082956,-0.1494978 -0.4867271,-0.159254 -0.7721525,-0.019906 -0.0990204,0.048343 -0.12693793,0.085498 -0.0904835,0.1204232 0.0212229,0.020333 0.0605541,0.034425 0.1318463,0.047241 0.1394229,0.025063 0.3538402,0.032049 0.4987906,0.01625 z"
     id="path52"
     inkscape:connector-curvature="0" />
  <path
     style="fill:#cd9c3b;fill-opacity:1;stroke-width:0.00749054"
     d="m 1.2159224,-8.4276782 c -0.1388868,-0.014575 -0.22970117,-0.045789 -0.23469638,-0.080668 -0.009437,-0.065893 0.23449298,-0.1680542 0.44817668,-0.1877032 0.1751019,-0.016101 0.3239158,0.018362 0.4018874,0.093072 0.027149,0.026014 0.032564,0.035897 0.032564,0.059443 0,0.054167 -0.066513,0.090497 -0.2076133,0.1134014 -0.072709,0.011802 -0.3371929,0.013277 -0.4403182,0.00246 z"
     id="path23"
     inkscape:connector-curvature="0" />
</svg>
