<?xml version="1.0" encoding="UTF-8" standalone="no"?>
<!-- Created with Inkscape (http://www.inkscape.org/) -->

<svg
   xmlns:dc="http://purl.org/dc/elements/1.1/"
   xmlns:cc="http://creativecommons.org/ns#"
   xmlns:rdf="http://www.w3.org/1999/02/22-rdf-syntax-ns#"
   xmlns:svg="http://www.w3.org/2000/svg"
   xmlns="http://www.w3.org/2000/svg"
   xmlns:sodipodi="http://sodipodi.sourceforge.net/DTD/sodipodi-0.dtd"
   xmlns:inkscape="http://www.inkscape.org/namespaces/inkscape"
   width="23.200001mm"
   height="36mm"
   viewBox="0 0 23.200004 36.000005"
   version="1.1"
   id="svg8"
   sodipodi:docname="roi_noir.svg"
   inkscape:version="0.92.4 (5da689c313, 2019-01-14)">
  <defs
     id="defs2" />
  <sodipodi:namedview
     id="base"
     pagecolor="#ffffff"
     bordercolor="#666666"
     borderopacity="1.0"
     inkscape:pageopacity="0.0"
     inkscape:pageshadow="2"
     inkscape:zoom="3.959798"
     inkscape:cx="-8.4332492"
     inkscape:cy="53.743168"
     inkscape:document-units="mm"
     inkscape:current-layer="layer1"
     showgrid="false"
     inkscape:window-width="1920"
     inkscape:window-height="1017"
     inkscape:window-x="-8"
     inkscape:window-y="-8"
     inkscape:window-maximized="1" />
  <metadata
     id="metadata5">
    <rdf:RDF>
      <cc:Work
         rdf:about="">
        <dc:format>image/svg+xml</dc:format>
        <dc:type
           rdf:resource="http://purl.org/dc/dcmitype/StillImage" />
        <dc:title></dc:title>
      </cc:Work>
    </rdf:RDF>
  </metadata>
  <g
     inkscape:label="Calque 1"
     inkscape:groupmode="layer"
     id="layer1"
     transform="translate(0,-260.99999)">
    <g
       id="g4933"
       transform="matrix(0.1984375,0,0,0.1984375,-17.162856,201.82545)">
      <g
         id="g4918"
         transform="translate(8.1157123,7.6084803)">
        <g
           id="g3923"
           style="stroke:none"
           transform="translate(4.4732237,-0.23543283)">
          <g
             id="g1148"
             transform="translate(17.31352,17.31352)">
            <path
               inkscape:connector-curvature="0"
               id="path1117"
               d="m 63.761266,452.07366 c -0.716948,-0.79222 -4.137256,-7.87014 -4.776666,-9.88473 -0.591296,-1.86302 0.784158,-2.47537 5.560076,-2.47537 h 4.354063 l 14.80008,-23.42557 14.800083,-23.42557 -0.13627,-8.00471 c -0.075,-4.4026 -0.34003,-16.26841 -0.58906,-26.36848 l -0.45278,-18.36376 -2.64346,-7.65157 -2.643462,-7.65156 h -6.063666 -6.063666 l -3.885548,-3.57791 c -4.44471,-4.09279 -5.591908,-5.61349 -5.145184,-6.82034 0.172087,-0.4649 1.755135,-2.65922 3.517886,-4.87626 l 3.205002,-4.03099 h 15.041042 15.041044 v -3.24114 c 0,-3.6422 -0.17182,-3.80262 -4.08644,-3.81541 -3.08048,-0.0101 -3.44741,-0.68478 -3.44741,-6.3391 0,-5.73438 0.1356,-5.9308 4.37446,-6.33637 l 2.92395,-0.27977 0.13481,-4.31204 c 0.0912,-2.91881 0.34145,-4.48353 0.77435,-4.8428 1.01273,-0.84049 10.6572,-0.4564 11.14461,0.44383 0.21033,0.38846 0.51605,2.55175 0.6794,4.8073 l 0.297,4.101 3.60853,0.13679 3.60853,0.13679 0.14035,2.94953 c 0.14981,3.14805 -0.5668,8.0243 -1.28474,8.74224 -0.23903,0.23903 -1.56255,0.68791 -2.94116,0.99751 l -2.50657,0.56291 -0.13923,3.14437 -0.13923,3.14436 h 14.33713 14.33714 l 4.04814,4.41006 c 2.2527,2.4541 4.04814,4.82603 4.04814,5.34795 0,0.61761 -1.72216,2.3678 -5.04289,5.12498 l -5.04289,4.18707 -6.80013,0.23544 -6.80013,0.23543 -2.7277,7.53385 -2.7277,7.53385 -0.0261,26.2344 -0.0261,26.2344 16.14295,23.2065 16.14296,23.20649 4.81051,0.13419 c 4.55348,0.12702 4.85208,0.19764 5.58869,1.32185 0.75759,1.15623 0.7046,1.33344 -2.00112,6.69337 l -2.77927,5.50569 -50.89634,0.11981 c -48.062961,0.11314 -50.938063,0.0737 -51.645948,-0.70851 z"
               style="opacity:1;fill:#000000;fill-opacity:1;fill-rule:nonzero;stroke:#000000;stroke-width:4;stroke-linecap:round;stroke-linejoin:round;stroke-miterlimit:4;stroke-dasharray:none;stroke-dashoffset:0;stroke-opacity:1" />
            <g
               transform="translate(-40.286891,-18.773134)"
               id="g267">
              <path
                 sodipodi:nodetypes="ccccccccccccccccccccccccccccccc"
                 inkscape:connector-curvature="0"
                 id="path3007"
                 d="m 204.89174,470.10642 h -99.99999 l -5.000005,-10 h 10.000005 l 30.30664,-48 -1.23377,-53 -5.71631,-17 h -12.74893 l -8.63638,-8 6.5801,-8 h 30.81236 l -0.0497,-10.15709 -7.53083,-0.29385 -0.1545,-9.11907 7.62807,-0.47356 -0.0546,-9.41831 8.9645,-0.30912 0.38461,9.95022 7.61837,0.13282 -0.3988,8.99278 -6.81068,1.45307 0.29414,9.24211 h 29.32527 l 7.34094,8 -9.58951,8 H 172.537 l -6.06592,17 v 53 l 33.42066,48 h 10 z"
                 style="fill:#343234;fill-opacity:1;fill-rule:nonzero;stroke:none;stroke-width:3.5;stroke-linecap:round;stroke-linejoin:round;stroke-miterlimit:4;stroke-dasharray:none;stroke-opacity:1" />
              <path
                 inkscape:connector-curvature="0"
                 style="opacity:0.12000002;fill:#ffffff;fill-opacity:1;fill-rule:nonzero;stroke:none;stroke-width:3.5;stroke-linecap:round;stroke-linejoin:round;stroke-miterlimit:4;stroke-dasharray:none;stroke-opacity:1"
                 d="m 117.78628,326.90525 -5.92382,7.20117 8.63671,8 h 12.75 l 5.71485,17 1.23437,53 -30.30664,48 h -10 l 5,10 h 14.38867 c 8.87571,-3.94392 16.97189,-12.2385 19.38672,-21.14062 4.50839,-16.61989 3.00795,-9.25705 4.03614,-13.35744 2.50548,-9.99175 2.41844,-50.22771 1.3405,-60.11825 -1.28267,-11.7691 0.0698,-22.37939 -4.65789,-33.46376 -4.76993,-11.18335 -12.58053,-10.9466 -21.59961,-15.1211 z"
                 id="path3007-41"
                 sodipodi:nodetypes="ccccccccccssssc" />
              <path
                 inkscape:connector-curvature="0"
                 style="opacity:0.25;fill:#000000;fill-opacity:1;fill-rule:nonzero;stroke:none;stroke-width:3.5;stroke-linecap:round;stroke-linejoin:round;stroke-miterlimit:4;stroke-dasharray:none;stroke-opacity:1"
                 d="m 177.59486,428.08298 c 2.17106,6.27047 3.6659,12.74586 2.56641,19.38868 -1.03531,5.15314 -4.88397,9.27231 -9.49219,11.5625 -7.41421,4.62851 -15.68815,7.79922 -24.20898,9.68164 -1.54908,0.76595 -4.13705,0.8782 -6.17774,1.39062 h 64.60938 l 5,-10 h -10 z"
                 id="path3007-0" />
              <path
                 inkscape:connector-curvature="0"
                 style="opacity:0.25;fill:#000000;fill-opacity:1;fill-rule:nonzero;stroke:none;stroke-width:3.5;stroke-linecap:round;stroke-linejoin:round;stroke-miterlimit:4;stroke-dasharray:none;stroke-opacity:1"
                 d="m 188.41805,326.10642 c -0.0218,1.51872 -0.29823,3.03109 -1.36719,4.17188 -1.35922,2.02299 -3.36985,3.52588 -5.59179,4.48437 -2.61165,1.41487 -5.34818,2.75624 -7.48047,4.86719 -0.58548,0.67151 -1.07276,1.56365 -1.23828,2.47656 h 13.48242 l 9.58984,-8 -7.33984,-8 z"
                 id="path3007-5" />
              <path
                 inkscape:connector-curvature="0"
                 style="opacity:0.12000002;fill:#ffffff;fill-opacity:1;fill-rule:nonzero;stroke:none;stroke-width:3.5;stroke-linecap:round;stroke-linejoin:round;stroke-miterlimit:4;stroke-dasharray:none;stroke-opacity:1"
                 d="m 114.68667,330.67282 -2.82422,3.4336 8.63672,8 h 12.74999 l 5.50781,16.38281 c 0.009,-0.0247 0.0245,-0.0453 0.0332,-0.0703 1.44858,-4.70406 1.18227,-9.98799 -0.89453,-14.4668 -1.17347,-2.23997 -2.28524,-4.90813 -4.7793,-5.94726 -2.54149,-0.72787 -5.23377,-0.25569 -7.83008,-0.61133 -2.47438,-0.18896 -4.6247,-1.59401 -6.31835,-3.32813 -1.30731,-1.20512 -2.65014,-2.62216 -4.28125,-3.39257 z"
                 id="path3007-3" />
              <path
                 inkscape:connector-curvature="0"
                 style="opacity:0.12000002;fill:#ffffff;fill-opacity:1;fill-rule:nonzero;stroke:none;stroke-width:3.5;stroke-linecap:round;stroke-linejoin:round;stroke-miterlimit:4;stroke-dasharray:none;stroke-opacity:1"
                 d="m 140.19839,412.10642 -30.27148,47.94336 c 1.20025,1.04585 2.79248,1.56348 4.39648,1.01172 4.1544,-2.41527 7.69778,-5.76352 10.71875,-9.47656 1.7901,-2.47198 3.32212,-5.13514 5,-7.68946 1.57827,-3.74808 2.73276,-7.67685 4.19141,-11.47851 0.84459,-4.01431 3.60877,-7.37582 4.12695,-11.48047 1.6295,-2.67538 0.78248,-5.98073 1.83789,-8.83008 z"
                 id="path3007-1" />
            </g>
          </g>
          <g
             style="stroke:none"
             id="g1148-7"
             transform="translate(-103.92996,18.229719)">
            <g
               id="g1202"
               transform="translate(-2.6636184,-2.6636184)" />
          </g>
        </g>
      </g>
    </g>
  </g>
</svg>
