<?xml version="1.0" encoding="UTF-8" standalone="no"?>
<svg
  xmlns:dc="http://purl.org/dc/elements/1.1/"
  xmlns:cc="http://creativecommons.org/ns#"
  xmlns:rdf="http://www.w3.org/1999/02/22-rdf-syntax-ns#"
  xmlns:svg="http://www.w3.org/2000/svg"
  xmlns="http://www.w3.org/2000/svg"
  xmlns:sodipodi="http://sodipodi.sourceforge.net/DTD/sodipodi-0.dtd"
  xmlns:inkscape="http://www.inkscape.org/namespaces/inkscape"
  height="28.55px"
  width="28.35px"
  version="1.1"
  id="svg20"
  sodipodi:docname="1240.svg"
  inkscape:version="0.92.4 (5da689c313, 2019-01-14)">
 <metadata
   id="metadata26">
  <rdf:RDF>
   <cc:Work
     rdf:about="">
    <dc:format>image/svg+xml</dc:format>
    <dc:type
      rdf:resource="http://purl.org/dc/dcmitype/StillImage" />
    <dc:title />
   </cc:Work>
  </rdf:RDF>
 </metadata>
 <defs
   id="defs24" />
 <sodipodi:namedview
   pagecolor="#ffffff"
   bordercolor="#666666"
   borderopacity="1"
   objecttolerance="10"
   gridtolerance="10"
   guidetolerance="10"
   inkscape:pageopacity="0"
   inkscape:pageshadow="2"
   inkscape:window-width="1366"
   inkscape:window-height="705"
   id="namedview22"
   showgrid="false"
   inkscape:zoom="16.5324"
   inkscape:cx="15.941917"
   inkscape:cy="17.285757"
   inkscape:window-x="-8"
   inkscape:window-y="-8"
   inkscape:window-maximized="1"
   inkscape:current-layer="g18" />
 <g
   transform="translate(15.875106,29.625106)"
   id="g18">
  <path
    d="m -2.6146186,-29.414619 l 0.35,0.25 l 0.15,-0.2 l 0.65,-0.2 q 3.35,0.05 6.15,1.45 l 0.4,0.4 l 0.2,-0.05 l 0.7,0.05 l 0.5,0.55 l 0.05,0.25 l 1.8,1.55 q 4.1999996,4.15 4.1999996,10.1 l -0.1,2 l -0.25,0.55 q -1.3,1.45 -0.95,3.0500004 l -0.1,0.7 l -0.3,0.5 q -0.9999996,1.75 -2.4999996,3.3 l -2.3,1.9 l -0.55,0.15 h -0.2 l -0.15,0.3 l -0.35,0.3 q -2.95,1.5 -6.5,1.5 h -0.05 l -0.55,-0.2 l -0.25,-0.25 l -0.5,0.2 h -0.1 l -0.2,0.1 l -0.45,0.05 q -3.8,-0.55 -6.8000004,-3 l -0.35,-0.5 v -0.05 l -0.6,-0.25 l -0.25,-0.2 l -0.05,-0.05 q -2.95,-3 -3.6,-6.9500004 l -0.05,-0.05 l -0.25,-0.4 l -0.05,-0.5 l 0.2,-0.95 l -0.05,0.1 q 0.2,-2.7 -0.05,-3.35 l -0.1,-0.65 l 0.3,-1.2 l -0.05,0.05 q 0.95,-3.55 3.7,-6.3 q 3.7500004,-3.7 8.8000004,-4.15 l 0.45,0.1"
    id="path2"
    inkscape:connector-curvature="0"
    style="fill:#000000;fill-rule:evenodd;stroke:none" />
  <path
    d="m 5.2353814,-26.414619 l -3.25,1.6 l -0.45,3.9 l -2.65,0.35 l -0.1,-0.05 q -0.75,-0.6 -1.15,-0.6 l -1.55,2.65 l -0.55,1.3 l 0.15,-0.2 l -2.9,-0.35 l -2.55,-0.3 q -0.4500004,0 -0.4500004,0.2 l 0.05,0.1 l -0.45,-0.1 l -0.3,-1.15 l -2.5,0.75 l -1.25,4.7 l 4,1.95 l 0.55,-1.9 h 0.9000004 l 0.65,-0.45 v 0.85 l -1.3,0.55 l -0.2000004,1.15 l -0.9,0.45 q -0.5,0 -1.4,-0.7 l -0.3,0.2 l 0.75,1.1 l 0.85,0.9500004 l 1.8500004,0.7 l 0.65,1 l -1.4500004,3.1 q 0.3000004,-0.8 -0.85,-0.75 l 1.1500004,-2.3 l -4.8000004,-4.7000004 l -0.3,-0.3 l 0.15,-0.9 q 0.25,-3.15 -0.15,-3.95 l 0.25,-1.05 l 0.2,-0.4 q 0.4,-0.45 0.95,-0.55 l 0.1,-0.1 l 0.1,0.1 l 2.5,-0.25 l 0.5,0.9 l 5.6500004,0.2 l 2.7,-5.7 l -1.45,-0.95 l 0.3,-2.95 l 1.5,-0.05 l -1.2,2.4 q 0.95,0.2 1.6,0.8 l 0.25,0.65 q 0,1.4 -0.7,2.7 h 2.3 l 0.35,-3.2 l 3.15,-2 q -0.05,0.6 0.85,0.5 l 0.45,-0.1 l -0.3,0.2 m -7,5.95 l -0.45,0.7 l 0.15,-0.2 l 0.1,-0.25 v 0.05 l 0.2,-0.3 m -3.3,4.95 l 5.1,2.3 l -0.35,0.6 v -0.05 l -2,-1 l -2.1,-1.05 l -0.4,0.1 l -1,-0.5 l -2.55,1 l 2.15,-1.45 l 0.1,-0.7 l 0.3,-0.6 l 0.6,0.3 l -0.05,0.1 l -0.15,0.2 l -0.1,0.4 q 0,0.35 0.4,0.35 h 0.05 m 4.65,3.05 l -0.25,0.45 q 1.45,0.8 3.25,1.05 q 3.55,-0.05 7.1,-1.05 l 1.7499996,-1.15 q -1.6999996,1.85 -1.2,3.9000004 l -0.2499996,0.55 l -1.1,-2.0500004 l -6.55,0.8500004 l -0.8,1.5 l 4,2.25 l -0.1,2.3 q -0.95,-0.6 -1.15,0.65 l 0.05,-2.6 l -2.35,-0.95 l 0.1,0.8 l -3.85,4.15 q -0.25,-0.85 -1.75,-0.2 l 1.05,-0.65 q 0.6,0 2.1,-1.7 l 2.1,-2 l -0.3,-0.85 l -0.55,-0.5 l 0.35,-0.85 l 0.7,-1.6000004 h 0.2 q 1.35,0 1.35,-0.35 l -0.05,-0.15 l -1.65,-0.05 l -0.55,-0.1 h -0.3 l -1.7,-1.25 l 0.05,-0.1 l 0.3,-0.3 m -7.9,-5 h 0.3 l 0.1,0.05 l -0.4,-0.05"
    id="path4"
    style="fill:#bebe00;fill-opacity:1;fill-rule:evenodd;stroke:none"
    inkscape:connector-curvature="0" />
  <path
    d="m 5.2353814,-26.414619 l 2.4,1.95 q 3.9499996,3.9 3.9499996,9.35 l -0.15,1.95 l -1.7499996,1.15 q -3.55,1 -7.1,1.05 q -1.8,-0.25 -3.25,-1.05 l 0.25,-0.45 l 0.1,-0.15 l 0.35,-0.6 l -5.1,-2.3 l -0.1,-0.05 l 0.9,-1.55 l 0.1,-0.55 l 0.6,-0.15 l 1.35,-1.95 l 0.45,-0.7 l 0.45,-0.05 l 0.2,-0.05 l 2.65,-0.35 l 0.45,-3.9 l 3.25,-1.6 m 4.75,17.7000004 l -2.35,3 q -1.05,1.05 -2.2,1.85 l 0.1,-2.3 l -4,-2.25 l 0.8,-1.5 l 6.55,-0.8500004 l 1.1,2.0500004 m -5.7,5.5 q -2.75,1.4 -6,1.4 h -0.05 l 3.85,-4.15 l -0.1,-0.8 l 2.35,0.95 l -0.05,2.6 m -7.8,1.2 l -0.2,0.1 q -3.5,-0.5 -6.3000004,-2.75 l 1.4500004,-3.1 l -0.65,-1 l -1.0000004,-1.5000004 l 0.15,-1.2 l 0.2000004,-1.15 l 1.3,-0.55 v -0.85 l -0.65,0.45 h -0.9000004 l -0.55,1.9 l -4,-1.95 l 1.25,-4.7 l 2.5,-0.75 l 0.3,1.15 l 0.45,0.1 l 1.7500004,0.35 h 0.1 l 0.4,0.05 h 0.05 l 2.1,0.4 l -0.05,0.15 l -0.3,0.6 l -0.1,0.7 l -2.15,1.45 l 2.55,-1 l 1,0.5 l 2.65,1.45 l 1.4,1.1 l 1.7,1.25 l 0.5,0.4 q -0.85,1.2000004 -0.95,2.5000004 v 0.9 l -0.05,0.55 q -0.55,1.85 -1.9,2.9 l -0.35,0.25 l -0.65,0.65 l -1.05,0.65 m -7.3500004,-3.4 l -0.3,-0.3 q -2.85,-2.85 -3.35,-6.7000004 l 4.8000004,4.7000004 l -1.1500004,2.3 m -3.7,-13.2000004 q 0.85,-3.3 3.4,-5.85 q 3.4500004,-3.45 8.1500004,-3.85 l -0.3,2.95 l 1.45,0.95 l -2.7,5.7 l -5.6500004,-0.2 l -0.5,-0.9 l -2.5,0.25 l -0.1,-0.1 l -0.1,0.1 q -0.55,0.1 -0.95,0.55 l -0.2,0.4 m 13.0500004,-9.75 q 3.1,0.05 5.75,1.35 l -3.15,2 l -0.35,3.2 h -2.3 q 0.7,-1.3 0.7,-2.7 l -0.25,-0.65 q -0.65,-0.6 -1.6,-0.8 l 1.2,-2.4"
    id="path6"
    style="fill:#e6e600;fill-opacity:1;fill-rule:evenodd;stroke:none"
    inkscape:connector-curvature="0" />
  <path
    d="m -1.1146186,-20.564619 l -0.2,0.05 l 0.1,-0.1 l 0.1,0.05 m -4.15,4.1 l -0.15,0.2 l 0.15,-0.2"
    id="path8"
    inkscape:connector-curvature="0"
    style="fill:#4f3317;fill-rule:evenodd;stroke:none" />
  <path
    d="m -1.3146186,-20.514619 l -0.45,0.05 l -0.2,0.3 v -0.05 l -0.1,0.25 l -0.15,0.2 l -1.35,1.95 l -0.6,0.15 l -0.1,0.55 l -0.9,1.55 l 0.1,0.05 h -0.05 q -0.4,0 -0.4,-0.35 l 0.1,-0.4 l 0.15,-0.2 l 0.05,-0.1 l -0.6,-0.3 l 0.05,-0.15 l -2.1,-0.4 h -0.05 l -0.1,-0.05 h -0.3 h -0.1 l -1.7500004,-0.35 l -0.05,-0.1 q 0,-0.2 0.4500004,-0.2 l 2.55,0.3 l 2.9,0.35 l -0.15,0.2 l 0.55,-1.3 l 1.55,-2.65 q 0.4,0 1.15,0.6 l -0.1,0.1 m 1,7.9 l -0.1,0.15 l -0.3,0.3 l -0.05,0.1 l -1.4,-1.1 l -2.65,-1.45 l 0.4,-0.1 l 2.1,1.05 l 2,1 v 0.05 m 1.25,1.8 h 0.3 l 0.55,0.1 l 1.65,0.05 l 0.05,0.15 q 0,0.35 -1.35,0.35 h -0.2 l -0.7,1.6000004 l -0.35,0.85 l 0.55,0.5 l 0.3,0.85 l -2.1,2 q -1.5,1.7 -2.1,1.7 l 0.65,-0.65 l 0.35,-0.25 q 1.35,-1.05 1.9,-2.9 l 0.05,-0.55 v -0.9 q 0.1,-1.3 0.95,-2.5000004 l -0.5,-0.4 m -11.0000004,-0.65 l -0.15,1.2 l 1.0000004,1.5000004 l -1.8500004,-0.7 l -0.85,-0.9500004 l -0.75,-1.1 l 0.3,-0.2 q 0.9,0.7 1.4,0.7 l 0.9,-0.45"
    id="path10"
    style="fill:#636300;fill-opacity:1;fill-rule:evenodd;stroke:none"
    inkscape:connector-curvature="0" />
  <path
    d="m -0.2646186,-25.564619 q -0.15,0.25 -0.65,0.25 q -0.7,0 -0.9,-1.05 q 0,-1.2 1,-1.2 l 0.65,0.15 q -0.65,0.15 -0.65,0.95 q -0.05,0.85 0.55,0.9 m 6.45,3.5 l -0.3,-0.25 h -0.1 l -0.1,-0.05 l -0.25,-0.05 l -0.35,-0.05 h -0.05 h -0.1 h -0.05 h -0.2 h -0.05 l -1.25,0.5 q -0.3,0.25 -0.3,0.75 l 0.1,0.5 q -0.15,0.15 -0.4,0.15 l -0.5,-0.65 q 0,-1.65 2.2,-1.65 q 1.65,0 1.7,0.8 m -4.3,5.05 l 0.15,0.8 q 0,1.05 -1.15,1.05 q -1.25,0 -1.2,-0.95 q 0,-0.6 0.3,-0.95 l -0.05,0.2 q 0,0.9 0.95,0.9 q 1,0 1,-0.95 v -0.1 m 4.1,1.95 l 0.2,-0.2 q 0.75,0 0.75,0.8 q 0,0.65 -0.75,0.65 l -0.4,-0.25 q 0.35,-0.1 0.35,-0.5 l -0.15,-0.5 m 0.55,7.4500004 h 0.05 q 0.7,0 0.7,-0.65 q 0,-0.65 -0.65,-0.65 h -0.25 l 0.55,-0.15 q 0.95,0 0.95,0.7 q 0,0.85 -0.95,0.85 l -0.4,-0.1 m -8.85,-3.1000004 l 0.55,0.2 q 0.5,0 0.5,-0.5 l 0.2,0.45 q 0,0.7000004 -0.75,0.7000004 q -0.6,0 -0.55,-0.5500004 l 0.05,-0.3 m 4.65,5.8000004 q 0.4,0 0.5,0.7 q 0,0.95 -0.9,0.95 l -0.65,-0.6 q 0,-1.05 1.05,-1.05 m -0.45,0.4 q -0.5,0 -0.5,0.5 l 0.5,0.5 q 0.45,0 0.45,-0.45 q 0.05,-0.55 -0.45,-0.55 m -6.9,-18.8000004 l 0.1,0.25 q 0,0.55 -0.65,0.55 q -0.35,0 -1.15,-0.8 q 0,-0.6 0.6,-0.65 l -0.15,0.35 q 0.05,0.6 0.55,0.6 q 0.55,0 0.7,-0.3 m -4.3,8.5 l 0.15,0.25 q 0,0.45 -0.5,0.45 q -2.3500004,0 -2.3500004,-1.4 l 0.25,-0.6 l 0.1,0.2 l 0.1,0.15 q 0.8,1.2 1.6500004,1.2 q 0.45,0 0.6,-0.25 m 4.75,6.7500004 l 0.3,0.4 q 0,0.3 -0.8,0.75 l -1.15,0.45 q -1.45,0 -1.45,-0.85 l 0.2,-0.4 q 0.45,0.45 1.2,0.45 q 1.3,0 1.7,-0.8"
    id="path12"
    style="fill:#636300;fill-opacity:1;fill-rule:evenodd;stroke:none"
    inkscape:connector-curvature="0" />
  <path
    d="m -0.1646186,-27.414619 l 0.3,-0.05 q 0.9,0 0.95,1 q 0,1.05 -0.7,1.05 l -0.6,-0.15 h -0.05 q -0.6,-0.05 -0.55,-0.9 q 0,-0.8 0.65,-0.95 m -0.25,0.75 q 0,0.55 0.65,0.55 q 0.55,0 0.55,-0.6 q -0.05,-0.55 -0.55,-0.55 l -0.25,0.05 q -0.4,0.1 -0.4,0.55 m 3.6,5.95 l -0.1,-0.5 q 0,-0.5 0.3,-0.75 l -0.3,0.6 l 0.25,0.25 l 0.15,0.2 q 2.45,0 2.95,-0.75 v 0.2 q 0,1.15 -2.3,1.15 q -0.7,0 -0.95,-0.4 m -3.2,3.65 q 0.25,-0.4 0.9,-0.4 l 0.75,0.2 l 0.25,0.25 v 0.1 q 0,0.95 -1,0.95 q -0.95,0 -0.95,-0.9 l 0.05,-0.2 m 5.8,3 l -0.25,0.05 q -0.7,0 -0.7,-0.6 q 0,-0.55 0.75,-0.55 l 0.4,0.1 l 0.15,0.5 q 0,0.4 -0.35,0.5 m 0.6,5.1500004 h 0.25 q 0.65,0 0.65,0.65 q 0,0.65 -0.7,0.65 h -0.05 q -0.6,-0.05 -0.6,-0.6 q 0,-0.55 0.45,-0.7 m -7.65,-2.1000004 q 0,0.5 -0.5,0.5 l -0.55,-0.2 l -0.05,-0.45 q -0.05,-0.45 0.45,-0.45 q 0.6,0 0.65,0.55 v 0.05 m 3.15,6.5000004 q 0.5,0 0.45,0.55 q 0,0.45 -0.45,0.45 l -0.5,-0.5 q 0,-0.5 0.5,-0.5 m -8,-19.4500004 l 0.6,-0.3 l 0.55,0.6 l -0.05,0.35 q -0.15,0.3 -0.7,0.3 q -0.5,0 -0.55,-0.6 l 0.15,-0.35 m 0.4,0.05 l -0.1,0.1 l 0.05,0.15 l 0.3,0.05 l 0.15,-0.05 l 0.05,-0.2 l -0.25,-0.25 l -0.2,0.2 m -4.9000004,7.2 l 0.55,0.5 l 0.8500004,0.95 l -0.1,0.45 q -0.15,0.25 -0.6,0.25 q -0.8500004,0 -1.6500004,-1.2 h 0.3 h 0.2 q 0.55,-0.1 0.55,-0.55 l -0.1,-0.4 m -1.15,0.6 l -0.35,-0.6 l 0.45,-0.45 l 0.7,0.2 l -0.65,-0.1 l -0.45,0.45 l 0.3,0.5 m 4.5500004,6.2500004 l 0.6,-0.05 h 0.5 q 1.45,0 1.7,1.1 q 0,0.45 -0.15,0.75 q -0.4,0.8 -1.7,0.8 q -0.75,0 -1.2,-0.45 q -0.5,-0.4 -0.7,-1.25 l 0.25,-0.6 l -0.1,0.35 q 0,0.85 1.65,0.85 q 1.3,0 1.3,-0.7 q 0,-0.8 -2.1,-0.8 h -0.05"
    id="path14"
    inkscape:connector-curvature="0"
    style="fill:#f19c1f;fill-rule:evenodd;stroke:none" />
  <path
    d="m -0.4146186,-26.664619 q 0,-0.45 0.4,-0.55 l 0.25,-0.05 q 0.5,0 0.55,0.55 q 0,0.6 -0.55,0.6 q -0.65,0 -0.65,-0.55 m 3.8,4.7 l 1.25,-0.5 h 0.05 h 0.2 h 0.05 h 0.1 h 0.05 l 0.35,0.05 l 0.25,0.05 l 0.1,0.05 h 0.1 l 0.3,0.25 l 0.15,0.2 l 0.1,0.2 q -0.5,0.75 -2.95,0.75 l -0.15,-0.2 l -0.25,-0.25 l 0.3,-0.6 m -9.1,-1.95 l 0.2,-0.2 l 0.25,0.25 l -0.05,0.2 l -0.15,0.05 l -0.3,-0.05 l -0.05,-0.15 l 0.1,-0.1 m -5.2500004,6.95 l 0.3,0.25 h 0.05 l 0.1,0.4 q 0,0.45 -0.55,0.55 h -0.2 h -0.3 l -0.1,-0.15 l -0.1,-0.2 l -0.3,-0.5 l 0.45,-0.45 l 0.65,0.1 m 3.0500004,7.4000004 l 0.7,-0.3 h 0.05 q 2.1,0 2.1,0.8 q 0,0.7 -1.3,0.7 q -1.65,0 -1.65,-0.85 l 0.1,-0.35"
    id="path16"
    inkscape:connector-curvature="0"
    style="fill:#f3de1d;fill-rule:evenodd;stroke:none" />
  <path
    style="opacity:0.2;fill:#000000;fill-opacity:1;fill-rule:evenodd;stroke:none"
    d="M 25.775391 8.0722656 C 25.71713 8.1136947 25.657943 8.153973 25.599609 8.1953125 A 15.953571 13.900565 0 0 1 26.603516 13.023438 A 15.953571 13.900565 0 0 1 25.755859 17.453125 C 26.011817 17.327193 26.25795 17.182423 26.486328 17.001953 C 26.75086 16.750733 27.274234 16.660659 27.330078 16.28125 C 27.698553 13.456281 27.242003 10.539997 25.775391 8.0722656 z M 24.931641 19.181641 A 15.953571 13.900565 0 0 1 21.263672 23.378906 L 21.410156 23.460938 L 21.310547 25.759766 C 23.230868 24.559749 24.47685 22.644194 25.861328 20.910156 L 24.931641 19.181641 z M 20.205078 24.138672 A 15.953571 13.900565 0 0 1 15.580078 26.226562 L 14.111328 27.810547 C 16.19907 27.824917 18.299396 27.365963 20.160156 26.410156 L 20.205078 24.138672 z M 13.724609 26.652344 A 15.953571 13.900565 0 0 1 10.650391 26.923828 A 15.953571 13.900565 0 0 1 8.9511719 26.841797 C 9.3480256 27.06829 9.8117826 27.208668 10.234375 27.261719 C 11.238526 27.669309 12.479256 27.932474 13.294922 27.007812 C 13.43686 26.892507 13.58092 26.770582 13.724609 26.652344 z "
    transform="translate(-15.875106,-29.625106)"
    id="path6-0" />
  <path
    inkscape:connector-curvature="0"
    style="fill:#ffffff;fill-opacity:1;fill-rule:evenodd;stroke:none;opacity:0.2"
    d="m -1.5138381,-28.365789 l -0.419922,0.839844 a 16.210592,15.575476 0 0 1 3.285156,-0.498047 c -0.92169299,-0.207445 -1.87461199,-0.325819 -2.865234,-0.341797 z m -1.5,0.05078 c -3.1333337,0.266667 -5.850391,1.54961 -8.1503909,3.84961 c -1.7,1.7 -2.833724,3.649609 -3.400391,5.849609 l 0.199219,-0.398438 c 0.266667,-0.3 0.584505,-0.484114 0.951172,-0.550781 l 0.09961,-0.09961 l 0.09961,0.09961 l 1.0625,-0.105469 a 16.210592,15.575476 0 0 1 9.0214859,-7.49414 z m -9.7148439,9.794922 l -0.685547,0.205078 l -1.25,4.699219 l 0.705078,0.34375 a 16.210592,15.575476 0 0 1 1.230469,-5.248047 z m -1.785156,6.105469 c 0.14406,1.109267 0.442221,2.151972 0.878906,3.136718 a 16.210592,15.575476 0 0 1 -0.34375,-2.613281 z"
    id="path6-6" />
 </g>
</svg>
