<?xml version="1.0" encoding="UTF-8" standalone="no"?>
<svg
  xmlns:dc="http://purl.org/dc/elements/1.1/"
  xmlns:cc="http://creativecommons.org/ns#"
  xmlns:rdf="http://www.w3.org/1999/02/22-rdf-syntax-ns#"
  xmlns:svg="http://www.w3.org/2000/svg"
  xmlns="http://www.w3.org/2000/svg"
  xmlns:xlink="http://www.w3.org/1999/xlink"
  xmlns:sodipodi="http://sodipodi.sourceforge.net/DTD/sodipodi-0.dtd"
  xmlns:inkscape="http://www.inkscape.org/namespaces/inkscape"
  height="20"
  width="20"
  version="1.1"
  id="svg41"
  sodipodi:docname="miniBlock01.svg"
  inkscape:version="0.92.4 (5da689c313, 2019-01-14)">
 <metadata
   id="metadata45">
  <rdf:RDF>
   <cc:Work
     rdf:about="">
    <dc:format>image/svg+xml</dc:format>
    <dc:type
      rdf:resource="http://purl.org/dc/dcmitype/StillImage" />
    <dc:title></dc:title>
   </cc:Work>
  </rdf:RDF>
 </metadata>
 <sodipodi:namedview
   pagecolor="#ffffff"
   bordercolor="#666666"
   borderopacity="1"
   objecttolerance="10"
   gridtolerance="10"
   guidetolerance="10"
   inkscape:pageopacity="0"
   inkscape:pageshadow="2"
   inkscape:window-width="1366"
   inkscape:window-height="705"
   id="namedview43"
   showgrid="false"
   fit-margin-top="0"
   fit-margin-left="0"
   fit-margin-right="0"
   fit-margin-bottom="0"
   inkscape:zoom="6.6187555"
   inkscape:cx="26.100225"
   inkscape:cy="0.90066128"
   inkscape:window-x="-8"
   inkscape:window-y="-8"
   inkscape:window-maximized="1"
   inkscape:current-layer="svg41" />
 <g
   transform="scale(0.625)"
   id="g4">
  <use
    height="32"
    width="32"
    xlink:href="#shape0"
    id="use2"
    x="0"
    y="0" />
 </g>
 <defs
   id="defs39">
  <g
    id="shape0">
   <path
     d="M 5.7,32 H 5.4 V 30.65 V 29.8 L 5.5,29.1 L 5.55,29.05 L 5.7,29.1 l 0.1,0.65 L 5.7,32 M 5,32 H 4.85 L 4.65,30.95 L 4.8,29.7 H 4.75 V 29.65 L 5,28.75 l 0.05,0.05 l 0.1,0.55 L 5.1,29.65 L 5,32 M 2.4,31.55 L 2,31.3 L 1.65,31.1 L 1.35,30.85 L 1.2,30.7 L 1.15,30.65 V 30.6 L 1.05,30.55 L 0.85,30.3 V 30.25 L 0.8,30.2 L 0.6,29.85 L 0.4,29.25 L 0.3,29.05 L 0.1,27.9 L 0,27 V 25.35 L 0.1,25.4 L 0.95,25.25 H 1 v 0.05 h 0.3 l -0.3,1 q 0,0.75 0.15,1.35 l 0.6,1.5 l 0.2,0.3 l 0.3,0.35 l 0.4,0.35 L 2.7,30.2 l 0.25,0.15 v 0.1 L 2.3,30.1 l 0.05,0.1 L 2.7,30.75 H 2.55 L 2.2,30.55 L 2.25,30.7 L 2.6,31.3 L 2.05,31.1 l 0.1,0.1 L 2.4,31.55 M 0,24.75 V 6.4 l 0.25,0.05 h 0.2 h 0.5 V 8 H 1 v 1.2 l -0.3,2.1 l -0.2,0.35 l -0.2,0.1 H 0.5 H 0.6 L 0.5,11.8 q -0.15,0 -0.15,0.15 l 0.15,0.2 l 0.45,-0.1 L 1,13.15 q 0.2,2.35 -0.1,4.7 l -0.05,0.2 q 0,0.95 -0.5,1.7 V 20 l 0.5,0.2 v 0.05 l -0.3,0.4 Q 0.9,21.2 0.9,22.15 L 1,22.4 l 0.15,0.65 L 1,23.3 L 0.8,24 H 1 v 0.7 H 0.65 L 0.3,24.65 L 0.1,24.7 L 0,24.75 M 0,5.55 V 5.3 L 0.15,5.25 H 0.3 L 1.55,5.3 h 0.8 L 2.45,5.25 L 2.6,5.2 L 3.1,5.1 L 3.2,5.05 L 3.4,5.3 H 3.05 L 2.65,5.4 L 2.35,5.5 L 2.25,5.55 L 2.2,5.6 V 5.65 L 0.2,5.6 L 0,5.55 M 0.05,4.5 Q 0.1,3.45 0.4,2.65 Q 0.7,1.85 1.25,1.3 L 1.7,0.9 L 2.45,0.45 l 0.6,-0.2 L 3.8,0.1 L 3.95,0.05 H 4.4 L 5.05,0 H 6.7 L 6.65,0.1 L 6.8,1 H 6 H 5.7 L 4.4,1.2 H 4.1 Q 2.6,1.6 1.85,2.7 L 1.6,3.3 L 1.3,3.8 L 1.15,4.2 L 1.1,4.4 L 0.3,4.35 L 0.05,4.5 M 7.05,0 H 7.1 L 7.05,0.05 V 0 m 0.3,0 H 24.4 l 0.1,0.9 V 0.95 V 1 H 23.9 L 23.85,0.95 L 23.15,1 L 21.2,0.9 H 20.45 L 19.05,0.85 L 16.6,1 l -1,-0.05 L 14.45,0.9 L 13.8,0.85 L 13.3,0.8 h -0.35 h -1.6 L 9.7,0.85 L 8.3,1 H 7.35 V 0.65 L 7.4,0.3 L 7.35,0 m 17.8,0 H 26.9 H 27 h 0.3 h 0.2 l 0.75,0.1 H 28.4 L 29,0.25 l 1.45,0.8 l 0.25,0.2 l 0.15,0.15 l -0.1,0.05 L 30.4,1.1 l 0.15,0.4 h -0.1 l -0.3,-0.2 l -0.1,-0.1 l 0.05,0.15 l 0.15,0.3 H 30.2 L 29.85,1.4 L 29.75,1.3 L 29.8,1.45 L 30.15,2 H 30.1 L 29.7,1.65 h -0.05 l 0.25,0.7 H 29.85 L 29.4,1.95 L 28.5,1.45 L 27.15,1.1 H 27.1 H 26.85 L 25.8,1.05 V 1 h -0.35 v 0.05 h -0.2 L 25.35,0.7 L 25.3,0.55 L 25.2,0.15 L 25.15,0.1 V 0 M 3.9,25.3 L 3.65,24.25 L 3.7,24 H 3.75 H 4.5 L 4.45,24.3 L 4.55,25 L 4.5,24.95 L 4.4,24.5 L 4.1,24.75 L 4.05,24.7 v 0.05 H 4 l -0.1,0.2 l 0.05,0.2 L 3.9,25.3 M 4.75,4.4 L 4.15,4.55 L 4.8,3.95 L 5.55,3.55 L 6.15,3.3 L 6.1,3.4 L 5.85,3.7 L 5,4.3 L 4.75,4.4 M 5.9,31.95 V 32 V 31.95 M 7.3,4.1 L 7.4,4.2 L 7.45,4.65 L 6.85,5.2 Q 5.65,6.7 4.7,6.4 L 5.05,5.75 Q 5.8,4.5 7.3,4.1 M 0.55,13.45 Q 0.35,13.5 0.35,14 q -0.05,0.45 0.2,0.45 H 0.6 q 0.3,-0.3 0.2,-0.5 L 0.55,13.45 M 0.05,25 H 0 h 0.05"
     id="path6"
     inkscape:connector-curvature="0"
     style="fill:#c6813e;fill-rule:evenodd;stroke:none" />
   <path
     d="m 30.85,1.4 l 0.05,0.1 l 0.4,0.55 l 0.25,0.55 l 0.35,1 L 32,5 v 22 v 0.6 Q 31.65,32 26.9,32 H 6.2 L 6.15,31.05 h 1.9 V 31 h 16.4 v -0.05 l 0.6,-0.05 l -0.5,0.15 l 1.6,-0.35 l 0.55,-0.2 l 0.6,-0.2 h 0.15 l 0.6,-0.2 h 0.05 q -0.25,0.55 -1.15,0.7 L 26.4,30.85 L 26.3,30.9 L 25.95,31 q 2.2,0 3.45,-0.9 l 0.9,-0.95 l 0.15,-0.3 l 0.15,-0.4 L 30.1,27.7 h 0.05 l 0.8,-0.35 V 27.3 L 31,26.35 V 26.1 l 0.15,-0.3 V 25.7 L 31,25.2 l -0.2,-0.6 l 0.1,-0.05 L 31,24.6 V 21.25 L 30.8,20 L 31,19.65 l -0.05,0.1 l 0.05,0.2 v -3.1 L 30.45,16.5 L 31,16.45 V 13.7 l -0.6,-0.15 h 0.05 L 31,13.3 V 13.15 Q 30.4,13.1 30.4,12.8 l 0.05,-0.1 L 31,12.55 V 6 L 30.95,5.05 Q 30.85,4 30.45,3.25 L 30.2,2.8 L 29.9,2.4 V 2.35 L 29.65,1.65 H 29.7 L 30.1,2 h 0.05 L 29.8,1.45 L 29.85,1.4 l 0.35,0.25 h 0.05 L 30.1,1.35 L 30.15,1.3 l 0.3,0.2 l 0.1,0.05 V 1.5 L 30.4,1.1 l 0.35,0.35 L 30.85,1.4 M 5.9,32 H 5.7 L 5.8,29.75 V 29.6 l 0.15,0.25 L 5.9,31.95 V 32 M 5.2,32 H 5 l 0.1,-2.35 l 0.05,-0.3 L 5.2,28.9 l 0.1,0.85 v 0.2 v 0.1 L 5.2,32 M 4.85,32 L 3.75,31.95 H 3.7 L 3.4,31.9 L 3.05,31.85 L 2.95,31.8 L 2.4,31.55 L 2.15,31.2 L 2.05,31.1 L 2.6,31.3 L 2.25,30.7 L 2.2,30.55 l 0.35,0.2 H 2.7 L 2.35,30.2 L 2.3,30.1 l 0.65,0.35 v -0.1 l 0.2,0.1 L 3.7,30.7 l 0.95,0.25 L 4.85,32 M 24.75,0 h 0.4 V 0.1 L 25.2,0.15 L 25.05,1 V 1.05 V 1.3 l -0.1,0.6 V 1.95 L 24.9,1.85 L 24.85,1.15 V 1.05 V 1 V 0.95 L 24.75,0 m -9.9,14.65 H 14.9 V 14.7 L 14.85,14.65 M 15.1,14.6 l 1.45,-0.25 l 0.9,0.05 l 0.05,0.25 l -0.15,0.05 v 0.05 L 17.1,14.8 l -0.4,0.1 l -0.75,0.15 L 15.65,15 h -0.2 Q 15.1,14.95 15.1,14.65 V 14.6"
     id="path8"
     inkscape:connector-curvature="0"
     style="fill:#6a4520;fill-rule:evenodd;stroke:none" />
   <path
     d="M 30.55,1.5 V 1.55 L 30.45,1.5 h 0.1 M 29.9,2.35 V 2.4 L 29.85,2.35 h 0.05"
     id="path10"
     inkscape:connector-curvature="0"
     style="fill:#a0a0a0;fill-rule:evenodd;stroke:none" />
   <path
     d="M 30.15,1.3 L 30.1,1.35 L 30.05,1.2 l 0.1,0.1 m -0.3,0.1 L 29.8,1.45 L 29.75,1.3 l 0.1,0.1"
     id="path12"
     inkscape:connector-curvature="0"
     style="fill:#787878;fill-rule:evenodd;stroke:none" />
   <path
     d="M 30.15,2 H 30.1 h 0.05"
     id="path14"
     inkscape:connector-curvature="0"
     style="fill:#cccccc;fill-rule:evenodd;stroke:none" />
   <path
     d="M 0,24.8 V 24.75 L 0.1,24.7 L 0.3,24.65 L 0.65,24.7 H 1 V 24 H 0.8 L 1,23.3 L 1.15,23.05 L 1,22.4 L 0.9,22.15 q 0,-0.95 -0.35,-1.5 l 0.3,-0.4 V 20.2 L 0.35,20 V 19.75 Q 0.85,19 0.85,18.05 L 0.9,17.85 Q 1.2,15.5 1,13.15 L 0.95,12.05 L 0.6,11.75 H 0.5 H 0.3 l 0.2,-0.1 L 0.7,11.3 L 1,9.2 V 8 H 0.95 V 6.45 H 1.6 L 2.1,6.5 L 2.05,7 V 8 H 2 v 0.9 l 0.05,0.2 l 0.2,2.3 l 0.9,0.2 L 1.5,12.3 l 1.85,0.2 L 3.3,12.55 l -0.5,0.2 l -0.4,0.2 l -0.2,0.2 l 0.25,2.6 l -0.6,1.2 Q 2.4,19.5 2.1,21.8 L 2,23.05 V 24 q -0.3,0.5 0,0.95 L 0.7,24.9 L 0.25,24.75 H 0.1 L 0,24.8 M 0,4.55 V 4.5 H 0.05 L 0.3,4.35 L 1.1,4.4 L 1.15,4.2 L 1.3,3.8 L 1.6,3.3 L 1.85,2.7 Q 2.6,1.6 4.1,1.2 H 4.4 L 5.7,1 H 6 H 6.8 L 6.65,0.1 L 6.7,0 h 0.25 h 0.1 V 0.05 L 6.95,0 Q 6.85,0 6.8,0.1 l 0.1,0.35 l -0.05,0.4 l 0.1,1.1 v 0.2 L 6.9,2.45 H 6.85 V 2 L 6.3,2.05 L 4.1,2.1 H 4.05 V 2.15 L 3.45,2.5 Q 2.9,2.75 2.4,3.65 Q 1.9,4.55 2.3,4.35 L 2.65,4.15 L 2.5,4.5 L 0,4.55 M 28.85,2.15 L 28.8,2.1 v 0.1 l 0.25,0.55 L 28.5,2.35 L 28.45,2.4 l 0.2,0.45 L 28.6,2.8 L 28,2.6 l 0.3,0.35 L 28.1,2.8 L 27.8,2.6 L 26.75,2.25 L 26.5,2.2 L 26.4,2.15 h 0.05 L 23.9,2 h -0.05 l -2.8,-0.15 h -2 L 17.4,1.6 L 14.8,1.65 L 11.45,2.2 Q 9.7,2.45 10.15,1.95 Q 12.1,1.4 8.05,2 H 7.95 H 7.3 V 1.55 L 7.35,1 H 8.3 L 9.7,0.85 L 11.35,0.8 h 1.6 h 0.35 l 0.5,0.05 l 0.65,0.05 l 1.15,0.05 l 1,0.05 l 2.45,-0.15 l 1.4,0.05 H 21.2 L 23.15,1 l 0.7,-0.05 L 23.9,1 h 0.6 l 0.4,0.85 l 0.05,0.1 V 1.9 l 0.1,-0.6 V 1.05 h 0.2 h 0.2 h 0.35 l 1.05,0.05 h 0.25 h 0.05 l 1.35,0.35 l 0.9,0.5 l 0.2,0.4 L 29.05,1.95 L 29.3,2.4 L 28.85,2.15 M 4.15,26.3 L 3.85,25.45 L 3.9,25.3 L 3.95,25.15 L 3.9,24.95 L 4,24.75 H 4.05 V 24.7 l 0.05,0.05 v 0.05 q 0,1.15 1.1,2.05 Q 6,27.3 6.45,27.35 Q 5.65,28.4 4.7,27.05 L 4.15,26.3 M 2.2,5.65 H 3.25 L 3.3,5.7 V 5.8 L 2.2,5.85 H 1.8 H 1.65 L 0.6,5.9 H 0.1 L 0.05,5.7 L 0.2,5.6 l 2,0.05 m 5.75,-1 V 4.35 L 8.05,4.3 L 8.6,4.25 q 1.6,0 1.6,0.5 L 10.05,4.9 H 10 L 9.85,4.85 L 9.8,4.8 L 8.05,4.65 h -0.1 m 3,21 h 0.4 l 1.3,-0.1 L 11.5,26 q 1.95,0.1 2.05,0.4 l -0.7,0.15 H 12.8 L 12.15,26.5 h 0.45 l 0.65,-0.1 L 9.05,26.25 H 8.7 H 8.55 L 8.05,26.3 L 7.95,26.25 L 7.45,25.9 V 25.85 L 7.1,25.65 H 7.15 L 7.2,25.5 l 0.75,0.2 l 0.1,0.05 v 0.15 l 0.3,-0.1 l 1.4,-0.1 l 1.2,-0.05 M 7.25,26.4 L 6.65,26.3 L 6.35,25.95 V 25.7 l 0.45,0.45 l 0.35,0.2 l 0.1,0.05 M 6.3,25.4 L 6.25,25.1 L 6.3,25.05 h 0.05 l 0.15,0.2 L 6.4,25.3 H 6.35 L 6.3,25.4 M 4.15,17.75 L 4.1,17.7 L 4.2,14.1 L 4.3,8.55 L 4.45,8 H 4.6 V 8.15 L 4.5,8.55 Q 4.75,10.7 4.6,14.5 Q 4.45,17.6 4.15,17.75 M 21.5,5.1 H 21.2 L 20.8,5.05 L 21.5,5.1 M 20.55,4.95 l 1.4,-0.4 l 1.8,-0.1 L 23.9,4.35 V 4.4 l 0.9,-0.1 l 0.55,0.2 l 0.45,0.7 l 0.3,0.95 V 6.2 L 25.9,5.85 L 25.4,5.35 L 25.25,5.2 l -1.1,-0.7 h -0.1 L 23.9,4.55 v 0.1 l -3.35,0.3 m 5.5,9.15 Q 25.15,11.85 25.4,9.6 L 25.6,8 h -0.05 l -0.1,-0.55 l 0.1,-0.2 L 25.5,6.9 L 25.25,6.45 q 0.1,-0.1 0.15,-0.1 h 0.05 l 0.1,0.25 l 0.2,0.6 l 0.1,0.35 L 26,8 h -0.1 v 1.75 l 0.15,4.35 m -0.45,6.35 q -0.7,-2.35 -0.15,-4.9 q 0.1,-0.4 0.35,0.05 l -0.1,0.9 l -0.1,3.95 M 26.1,18.1 L 26.15,18 l 0.25,0.1 l -0.1,1.7 q -0.15,2.15 0.05,4.2 l -0.25,0.4 l -1.25,1.95 l -0.35,0.1 l -0.65,-0.2 L 21.9,26.15 H 21.4 H 21.1 L 20.25,26.2 L 19,26.3 l -0.55,0.05 l -0.05,-0.1 l 4.4,-0.4 l 1.05,0.1 v 0.1 l 0.2,0.1 l 0.1,-0.05 l 0.75,-0.25 l 0.05,0.05 l 0.55,-1.2 l 0.3,-0.6 V 24 V 23.4 L 26,20.5 v -0.1 l 0.1,-2.3 m -1.05,8.25 l 0.15,0.1 l 0.1,0.3 l -0.2,0.1 L 25,26.65 l 0.05,-0.3 m 0.55,0.3 l 0.15,-0.1 l -0.25,0.2 l 0.1,-0.1 m -10.7,-12 h -0.05 l -0.3,0.1 L 14.4,14.5 q 0.45,-0.35 1,-0.5 l 0.9,-0.15 h 0.1 q 1,0 1.2,0.55 h -0.15 l -0.9,-0.05 L 15.1,14.6 l -0.2,0.05 M 1.8,25.3 q -0.05,0.9 0.15,1.05 L 2,26.85 q -0.1,0.4 0.1,0.75 l 0.5,0.55 L 2.95,28.4 H 3 l 0.25,0.3 l 0.15,0.15 l 0.1,0.1 l 0.15,0.2 L 3.5,29.05 v 0.05 q 0.2,0.1 0.2,0.5 L 3.2,29.4 v 0.05 l 0.15,0.4 L 2.95,29.7 v 0.05 l 0.25,0.5 H 3.15 L 2.7,29.95 l 0.25,0.4 L 2.7,30.2 L 2.65,30.15 L 2.25,29.8 l -0.3,-0.35 l -0.2,-0.3 l -0.6,-1.5 Q 1,27.05 1,26.3 l 0.3,-1 H 1.8 M 4.9,20.35 L 4.85,24 v 0.1 q 0,0.9 0.45,1.15 V 25.3 L 5.05,25.35 L 4.9,25.15 l -0.1,0.1 V 25.3 L 4.55,25 L 4.45,24.3 L 4.5,24 l 0.05,-1.05 l 0.05,-0.7 q 0.05,-1.65 0.3,-1.9 m -2.15,8.6 L 2.7,28.9 l 0.05,0.05"
     id="path16"
     inkscape:connector-curvature="0"
     style="fill:#d9aa7b;fill-rule:evenodd;stroke:none" />
   <path
     d="M 28.8,2.2 V 2.1 l 0.05,0.05 L 28.8,2.2"
     id="path18"
     inkscape:connector-curvature="0"
     style="fill:#8c8c8c;fill-rule:evenodd;stroke:none" />
   <path
     d="M 5.4,32 H 5.2 l 0.1,-1.95 l 0.05,0.1 l 0.05,0.5 V 32 m 19,-32 h 0.35 l 0.1,0.95 V 1 H 24.5 V 0.95 V 0.9 L 24.4,0 m 5.5,2.4 l 0.3,0.4 l 0.25,0.45 q 0.4,0.75 0.5,1.8 L 31,6 v 6.55 l -0.55,0.15 l -0.05,0.1 q 0,0.3 0.6,0.35 v 0.15 l -0.55,0.25 H 30.4 L 31,13.7 v 2.75 L 30.45,16.5 L 31,16.85 v 3.1 l -0.05,-0.2 L 31,19.65 L 30.8,20 l 0.2,1.25 v 3.35 l -0.1,-0.05 l -0.1,0.05 l 0.2,0.6 l 0.15,0.5 v 0.1 L 31,26.1 v 0.25 l -0.05,0.95 v 0.05 l -0.8,0.35 H 30.1 l 0.5,0.75 l -0.15,0.4 l -0.15,0.3 L 29.4,30.1 Q 28.15,31 25.95,31 l 0.35,-0.1 l 0.1,-0.05 l 0.55,-0.05 q 0.9,-0.15 1.15,-0.7 h -0.05 l 0.2,-0.3 L 27.8,30 l -0.3,0.1 l -0.15,-0.05 l -0.7,0.25 L 26,30.5 l -0.95,0.4 l -0.6,0.05 V 31 H 8.05 v 0.05 h -1.9 l -0.2,-1.2 l 2.1,0.1 V 30 h 16.2 L 24.7,29.75 L 25.15,30 q 2.8,-0.1 3.95,-1.75 L 29.25,28 l 0.45,-1.15 l -0.05,-0.8 l 0.25,-1.2 V 24 h 0.05 v -1.65 l 0.3,-1 l -0.1,-1.85 l -0.2,-0.9 V 17.45 Q 29.75,17 28.85,16.7 l 1.1,-0.2 v -0.05 h -0.1 l 0.1,-1.5 v -1.1 l -0.2,0.05 l -0.5,-0.05 H 29.2 L 29.95,12.9 V 8 H 29.9 V 7 V 6.55 L 30.1,6.1 L 29.75,4.75 L 29.6,4.9 L 29.45,4.5 L 29.35,4.2 L 28.65,3.25 L 28.3,2.95 L 28,2.6 l 0.6,0.2 l 0.05,0.05 L 28.45,2.4 L 28.5,2.35 l 0.55,0.4 L 28.8,2.2 L 28.85,2.15 L 29.3,2.4 L 29.05,1.95 l 0.55,0.4 l -0.2,-0.4 l 0.45,0.4 L 29.9,2.4 m -2.6,27.9 l -0.6,0.2 l 0.1,-0.05 l 0.5,-0.15 m -0.05,-5.8 l 0.35,0.25 l -0.05,0.1 L 27,25.95 l -1.25,0.6 l -0.15,0.1 l -0.3,0.1 l -0.1,-0.3 l -0.15,-0.1 h -0.2 L 26.1,24.4 L 26.35,24 q -0.2,-2.05 -0.05,-4.2 l 0.1,-1.7 q 0.75,-0.2 0.6,0.75 l -0.1,1.8 L 26.85,24 H 26.8 l -0.2,0.95 l 0.5,-0.55 l 0.15,0.1 M 12.8,26.55 v 0.1 l -1.05,0.1 l -2,0.1 L 8.05,26.8 V 26.75 V 26.3 l 0.5,-0.05 H 8.7 h 0.35 l 4.2,0.15 l -0.65,0.1 h -0.45 l 0.65,0.05 M 26.1,6.2 l 0.05,0.3 l 0.15,0.3 l 0.1,0.25 l 0.05,0.2 l 0.1,0.35 l 0.1,0.4 h -0.3 l 0.3,0.4 q -0.3,2.35 -0.45,4.8 l -0.15,0.9 L 25.9,9.75 V 8 H 26 L 25.85,7.55 L 25.75,7.2 L 25.55,6.6 L 25.45,6.35 L 25.4,6.3 L 24.9,5.85 V 5.7 L 24.15,5.2 L 23.9,5.1 V 4.65 V 4.55 L 24.05,4.5 h 0.1 l 1.1,0.7 l 0.15,0.15 l 0.5,0.5 l 0.2,0.35 m -0.3,9.4 l 0.3,2.5 L 26,20.4 v 0.1 h -0.2 l -0.2,-0.05 l 0.1,-3.95 l 0.1,-0.9 m -6.85,-1 L 18.9,14.65 Q 18,15.6 15.05,15.6 L 13.3,15.3 l -0.05,-0.5 q 0,-1.75 2.4,-1.75 l 1.3,0.1 q 1.65,0.3 2,1.45 m 3.8,4.3 l 0.3,0.15 l 0.4,0.1 l -0.55,0.4 q -1.05,0.7 -1.65,0.7 h -1.2 h -0.5 l 1,-0.35 h 0.1 l 1.3,-0.6 l 0.8,-0.4 m -8.7,-4.3 q 0,0.6 1.65,0.6 h 1.1 q 1.05,-0.05 1.05,-0.6 q 0,-0.9 -0.8,-0.9 L 16,13.6 q -1.95,0 -1.95,1 M 24.5,26.45 l -0.6,0.25 h -0.25 l -5.4,-0.2 V 26.4 L 19,26.3 l 1.25,-0.1 l 0.85,-0.05 h 0.3 h 0.5 l 1.95,0.1 l 0.65,0.2 M 13.2,25.1 l 0.05,0.1 l -0.5,0.1 h -1.2 L 11.5,25.25 l 1.2,-0.15 h 0.5 m 5.15,5.2 l -0.05,0.15 l 0.3,0.15 q 0.35,0 0.55,-0.2 L 19.1,30.3 H 18.85 L 18.6,30.4 L 18.35,30.3 M 16,30.55 l 0.5,0.05 v -0.1 l -0.2,-0.05 q -0.2,0 -0.3,0.1 M 15.1,30.3 h 0.4 V 30.2 L 15.35,30.15 L 15.1,30.3 M 28.7,25.15 V 25.1 l 0.2,-0.3 l -0.1,0.3 l 0.1,0.45 L 29,25.7 h -0.05 l 0.1,0.15 L 29.1,25.9 L 29,26.1 l -0.55,0.45 L 28,26.5 H 27.9 L 27.85,26.45 L 28,26.15 l 0.1,-0.3 l 0.15,-0.55 h 0.1 l 0.35,-0.15 m -25.05,4 l 0.05,0.1 L 4.75,29.7 H 4.8 L 4.65,30.95 L 3.7,30.7 L 3.15,30.45 l -0.2,-0.1 L 2.7,29.95 l 0.45,0.3 H 3.2 L 2.95,29.75 V 29.7 l 0.4,0.15 L 3.2,29.45 V 29.4 l 0.5,0.2 q 0,-0.4 -0.2,-0.5 v -0.05 l 0.15,0.1 m 1.65,0.6 l 0.1,0.05 v 0.05 l -0.1,0.1 v -0.2"
     id="path20"
     inkscape:connector-curvature="0"
     style="fill:#8f5c2c;fill-rule:evenodd;stroke:none" />
   <path
     d="M 0,6.4 V 6.2 H 0.1 V 6.1 L 2.6,6 L 3.3,6.2 H 3.35 L 3.3,6.3 L 3.35,6.35 L 3.4,6.2 Q 3.65,6.15 3.45,5.9 L 3.3,5.8 V 5.7 L 3.25,5.65 H 2.2 V 5.6 L 2.25,5.55 L 2.35,5.5 L 2.65,5.4 L 3.05,5.3 H 3.4 L 4.15,4.55 L 4.75,4.4 l -0.7,1.1 h 0.1 L 4.4,5.45 L 5.25,4.35 L 5.3,4.45 L 5.2,4.6 l -1,1.15 L 4.15,5.8 L 3.65,6.55 L 3.5,7.35 L 3.75,7.6 L 3.7,8 L 3.65,8.65 l 0.05,1.9 l -0.8,0.4 l 0.9,0.5 l -0.35,0.3 L 3.05,11.9 L 2.5,12 l 1.25,0.2 l -0.2,3.9 v 0.5 L 3.3,16.9 Q 3,17.05 3,17.35 q 0,0.55 0.55,0.75 v 0.05 L 3.2,18.5 q 0,0.3 0.35,0.7 L 3.6,23.05 L 3.75,24 H 3.7 L 3.65,24.25 L 3.9,25.3 l -0.05,0.15 l 0.3,0.85 l -0.1,0.15 L 3.9,26.5 L 3.7,26.3 L 3.25,25.85 L 3.2,26.05 L 2.75,24.7 l -0.3,1.2 L 2.9,26.95 L 3.35,26.7 L 3.7,27.1 H 3.15 l 0.3,0.65 l 0.7,0.55 l 1,0.35 l 2,0.3 L 6.4,28.3 L 7.8,28.1 L 7.25,27.65 l 0.7,-0.05 h 0.1 v 0.05 l 7.85,-0.4 l 7,0.2 l 1,0.05 v -0.1 h 0.05 L 24,27.45 v 0.1 l 0.15,0.35 l 0.15,0.2 L 24.7,28 l 0.65,-0.2 l 0.7,-0.3 l 0.55,-0.35 l 0.8,-0.95 l 0.2,-0.95 l -0.05,-0.4 l 0.05,-0.1 L 27.25,24.5 l 0.1,-0.5 l 0.15,-3.7 q -0.05,-2.2 0.2,-4.5 l 0.15,-0.55 q 0.1,0.45 0.3,0.45 q 0.45,0 0.65,-0.8 l 0.15,-0.8 q 0,-1.75 -0.7,-1.75 L 27.8,13.1 L 27.7,11.8 L 27.4,8 H 27.35 V 7.75 L 27.1,6.55 L 27.75,7.3 L 27.8,7.45 L 28.35,7.4 L 28.7,7.25 l 0.1,-0.4 V 6.5 Q 28.8,5.25 28,4.25 L 27.75,3.95 L 26.1,3.05 H 26.05 L 25.25,3.1 L 25,3.15 q -0.45,0.1 -0.65,0.5 L 24.4,3.7 L 24.15,3.65 L 23.9,3.6 V 3.5 L 12.4,3.95 L 9.1,3.7 L 8.05,3.8 H 7.95 V 3.65 L 6.25,3.9 L 6.9,3.45 L 6.25,3.35 L 6.1,3.4 L 6.15,3.3 Q 4.55,2.75 3.65,4.65 L 3.35,4.9 L 3.1,4.95 h -1 H 1.15 L 0.1,4.85 L 0,4.8 V 4.55 L 2.5,4.5 L 2.65,4.15 L 2.3,4.35 Q 1.9,4.55 2.4,3.65 Q 2.9,2.75 3.45,2.5 L 4.05,2.15 V 2.1 H 4.1 L 6.3,2.05 L 6.85,2 V 2.45 H 6.9 Q 6.85,3.15 7.2,3.2 L 7.3,2.05 V 2 h 0.65 h 0.1 Q 12.1,1.4 10.15,1.95 Q 9.7,2.45 11.45,2.2 L 14.8,1.65 L 17.4,1.6 l 1.65,0.25 h 2 L 23.85,2 h 0.05 l 2.55,0.15 H 26.4 l 0.1,0.05 l 0.25,0.05 L 27.8,2.6 l 0.3,0.2 l 0.2,0.15 l 0.35,0.3 l 0.7,0.95 l 0.1,0.3 L 29.6,4.9 L 29.75,4.75 L 30.1,6.1 L 29.9,6.55 V 7 v 1 h 0.05 v 4.9 l -0.75,0.95 h 0.05 l 0.5,0.05 l 0.2,-0.05 v 1.1 l -0.1,1.5 h 0.1 v 0.05 l -1.1,0.2 q 0.9,0.3 1.1,0.75 v 1.15 l 0.2,0.9 l 0.1,1.85 l -0.3,1 V 24 H 29.9 v 0.85 l -0.25,1.2 l 0.05,0.8 L 29.25,28 L 29.1,28.25 Q 27.95,29.9 25.15,30 L 24.7,29.75 L 24.25,30 H 8.05 v -0.05 l -2.1,-0.1 L 5.8,29.6 v 0.15 L 5.7,29.1 L 5.55,29.05 L 5.5,29.1 L 5.4,29.8 L 5.3,29.75 L 5.2,28.9 L 5.15,29.35 L 5.05,28.8 L 5,28.75 l -0.25,0.9 V 29.7 L 3.7,29.25 L 3.65,29.15 L 3.5,28.95 L 3.4,28.85 L 3.25,28.7 L 3,28.4 H 2.95 L 2.6,28.15 L 2.1,27.6 Q 1.9,27.25 2,26.85 L 1.95,26.35 Q 1.75,26.2 1.8,25.3 H 2 V 25.25 H 2.05 L 2.4,25.2 H 2.45 V 25.1 H 2.4 L 2.25,25.05 H 2.2 v -0.1 H 2 Q 1.7,24.5 2,24 V 23.05 L 2.1,21.8 Q 2.4,19.5 1.85,16.95 l 0.6,-1.2 L 2.2,13.15 l 0.2,-0.2 l 0.4,-0.2 l 0.5,-0.2 L 3.35,12.5 L 1.5,12.3 L 3.15,11.6 L 2.25,11.4 L 2.05,9.1 L 2,8.9 V 8 H 2.05 V 7 L 2.1,6.5 L 1.6,6.45 H 0.95 H 0.45 H 0.25 L 0,6.4 m 28.05,23.7 l -0.6,0.2 H 27.3 l -0.5,0.15 l -0.1,0.05 l -0.55,0.2 l -1.6,0.35 l 0.5,-0.15 L 26,30.5 l 0.65,-0.2 l 0.7,-0.25 L 27.5,30.1 L 27.8,30 l 0.45,-0.2 l -0.2,0.3 M 25.8,1.05 H 25.45 V 1 h 0.35 v 0.05 m -0.55,0 h -0.2 V 1 L 25.2,0.15 l 0.1,0.4 l 0.05,0.15 l -0.1,0.35 M 24.9,1.85 L 24.5,1 h 0.35 v 0.05 v 0.1 l 0.05,0.7 m -8.1,1.2 l 0.3,0.15 l 0.4,-0.25 l -0.05,-0.1 l -0.5,-0.1 l -0.3,0.2 l 0.15,0.1 M 5.6,8 H 5.65 Q 5.8,6 7.2,6 L 7.45,5.95 L 7,5.85 L 6.95,5.8 l 1,-0.2 V 5.65 H 9.2 l 2.35,0.25 l 6,-0.65 l 6.35,0.5 V 5.9 l 0.25,0.2 q 1.05,1 1.05,1.7 L 25.15,7.9 L 23.9,7.95 V 8.5 L 23.05,8 H 18.9 l -0.6,0.25 l -1.85,0.6 L 14.9,8.55 Q 14.55,8.2 13.95,8 h -1.5 Q 10.25,8.2 8.8,9.2 L 8.45,9.15 H 8.4 Q 8.45,8.75 9.25,8.2 L 9.55,8 H 9.1 L 8.05,8.6 L 8,8.65 v 7.55 l 0.05,0.1 l 0.8,0.95 l 1.5,1 q -0.6,0 -1.7,-0.6 L 8.4,17.9 L 8.05,18.2 L 8,18.25 v 1.4 l 0.05,0.1 q 0.65,0.95 1,1 l 0.85,0.3 L 9.4,21.1 H 9.2 L 8.25,20.9 V 21 v 1.05 L 8.05,22.4 H 8 v 1.15 h 0.05 l 0.5,0.1 h 0.3 L 8.4,23.3 L 8.35,23.2 l 2.1,0.75 l 0.2,0.05 h 9.65 l 0.4,-0.2 l 1.2,-0.15 l 2,-0.25 l -0.3,-0.3 q -0.55,0.05 -0.75,-0.35 V 22.7 l 0.75,-0.05 l 0.3,-0.7 v 2.1 l 0.25,0.05 l 0.6,0.15 v 0.1 l -0.6,0.35 H 23.9 h -0.3 l -0.9,-0.05 q -0.2,0.1 -0.65,0.3 l -2.2,0.3 q -1.75,0.1 -4.25,-0.6 l 0.3,-0.2 L 12.5,24.2 l -1.85,0.25 L 8.05,24.3 v 0.45 l -0.1,-0.1 L 7.8,24.45 H 7.85 L 7.65,24 h 0.1 Q 7.1,23.35 7.05,20.05 L 7,20.1 L 6.7,22.55 L 6.65,22.5 l -0.2,-0.55 l -0.05,0.7 q 0,0.8 0.45,1.35 H 6.7 l 0.15,0.4 H 6.6 l 0.2,0.15 l 0.25,0.2 l 0.6,0.35 l 0.3,0.15 h 0.1 l 2.9,0.4 l -1.2,0.05 l -1.4,0.1 l -0.3,0.1 V 25.75 L 7.95,25.7 L 7.2,25.5 L 7.15,25.65 H 7.1 L 7,25.6 L 6.85,25.45 l -0.3,-0.2 H 6.5 L 6.35,25.05 H 6.3 L 6.25,25.1 L 5.8,24 H 5.65 v -0.95 l 0.15,-2.2 l 0.3,0.5 l 0.05,-0.1 L 6.2,20.45 L 6.05,18.25 L 6,17.5 L 5.9,14.3 L 5.8,12.55 L 5.75,12.2 L 5.8,11.8 q 0.4,0 0.4,-0.2 L 5.75,11.05 q 0.5,-0.5 0.5,-1.15 q 0,-0.85 -0.7,-1.15 V 8.6 L 5.6,8 M 15.8,6.95 L 15.4,6.8 L 15.1,7 l 0.4,0.05 l 0.3,-0.1 m 2.3,-0.9 l -0.4,0.1 l -1.5,0.2 L 17.1,6.5 L 18.25,6.4 L 18.6,6.3 Q 18.35,6.05 18.1,6.05 M 12.45,8.8 h 0.2 q 1.9,0 2.05,0.55 l -0.95,0.3 l -1.5,0.7 q -1.8,0.6 -3,1.25 l -0.9,0.5 L 8.3,12 V 11.45 V 11.4 Q 8.5,9.85 10,9.25 Q 10.95,8.8 12.45,8.8 M 14.3,8.05 h 0.8 V 8 H 13.95 L 14.3,8.05 M 18.15,9.8 V 9.7 l 0.35,0.1 h 0.3 l 0.55,0.25 l 0.6,0.3 l 1.05,0.3 l 0.45,0.25 L 22,11.25 l 0.5,0.5 L 22.75,12 v 0.1 l 0.05,0.1 l 1.05,2 l 0.05,0.15 V 12.2 l -0.05,-0.25 l -0.2,-0.4 l -1.6,-1.1 L 22.1,10.4 L 21.55,10.1 Q 19.75,9.25 18.7,9.05 l 1.8,-0.6 l 1.1,0.2 l 0.35,0.05 l 1.15,0.5 l 0.2,0.2 l 0.25,0.4 l 0.35,0.6 v 0.7 l 0.2,0.6 L 24,12.55 l 0.2,3.5 l -0.25,2.7 L 23.9,19.9 v 1.85 l -0.95,0.8 L 22.9,22.6 l -0.1,0.1 l -0.1,0.1 l -0.2,0.1 l -2.15,0.5 l -5.3,0.35 q -3.4,0 -5,-0.6 Q 8.6,22.6 8.6,21.55 L 8.65,21.4 L 9.2,21.6 L 10,21.45 l 1.1,0.4 l 1.2,-0.15 v -0.05 l 0.1,-0.6 L 12.35,20.8 l -0.6,-0.2 L 11.2,20.9 L 10.45,20.8 L 10.2,20.75 Q 9.5,20.55 9.1,20.2 v 0.05 Q 8.65,19.75 8.55,19.05 V 19 L 8.5,18.35 L 8.6,18 q 0.05,-0.1 0.2,-0.1 l 0.6,0.4 h 0.05 l 0.3,0.2 q 0.8,0.55 2.45,1.1 l 0.45,0.15 l 0.4,0.2 l 2.05,0.4 l 0.8,0.25 v 0.25 L 15.2,21 l -0.7,0.05 l -1.9,-0.2 l 0.25,0.65 l 0.05,0.15 v 0.05 l 2.1,0.15 q 0.65,0.05 0.8,0.6 h 0.15 L 17,21.9 l 1.1,-0.05 h 2.05 l 1.25,-0.2 h 0.1 l 0.6,-0.25 l 0.6,-0.3 l 0.6,-0.7 l 0.6,-1.5 v -3.7 l -0.4,1.3 l -0.2,0.2 l -0.25,0.15 L 23.6,15.9 V 15.8 L 23.25,15.75 L 22.1,16.4 l -1.6,1.4 l 0.05,0.15 l -1.2,0.35 h -0.3 l -0.4,-0.15 V 18.1 h -0.1 L 18,18 l -0.6,-0.15 v -0.5 h 0.2 Q 17.65,17 17.95,16.7 Q 18.3,16.35 19,16.1 l 1.6,-0.85 l 0.35,-0.3 v -0.3 V 14.6 V 14.5 L 20.7,14.1 l -0.9,-0.9 l 0.3,-0.5 l -1.6,-0.55 l -0.8,-0.1 l -0.9,0.2 L 16.55,12.3 L 15,12.45 l -2.6,0.7 Q 11,14 11,14.5 l 0.15,0.75 l 0.3,0.5 h 0.1 l 0.75,0.1 L 12.1,15.4 v -0.2 l 0.15,-0.4 v -0.05 q 1.35,-2.35 3.6,-2.3 l 1.35,0.1 q 2.25,0.3 2.5,1.95 v 0.4 v 0.05 q -0.05,0.9 -1.95,1.3 H 17.7 l -0.95,0.15 l -1.65,0.1 h -0.65 q 1.6,0.55 1.6,1.05 l -0.1,0.55 l 0.15,0.05 v 0.15 l -0.55,0.25 L 14.2,18.8 l 0.05,0.25 L 13.6,19.3 l -0.75,-0.1 l -0.3,-0.05 L 11.05,18.3 L 10,17.55 L 9.5,17.1 L 9.35,16.95 l -0.6,-0.7 L 8.7,16.2 V 16.15 L 8.5,14.9 V 14.8 Q 8.55,13.1 9.8,12.35 H 9.85 L 9.9,12.3 L 9.95,12.25 L 10.4,11.9 h 0.05 l 0.45,-0.25 l 2.45,-1.45 q 0.3,-0.05 0.4,0.45 l -0.1,0.1 Q 13,11.1 12.45,11.5 l -1,0.7 l 0.65,-0.1 l 0.75,-0.05 L 12.95,12 l 0.5,-0.2 L 14.9,11.4 L 17.1,11 l 0.6,-0.15 q 1.4,-0.05 2.2,0.4 l 0.85,0.7 l 0.1,0.15 l 0.1,0.25 l 1.15,1.6 l 0.15,-0.05 l 0.05,-0.35 q 0,-0.7 -0.55,-1.25 v -0.05 h 0.1 L 21.65,12.1 L 21.55,12 H 21.5 L 20.55,11.3 L 20.5,11.25 L 19.4,10.5 L 18.15,9.8 M 19.1,3.05 L 19.35,3.1 L 19.4,3.05 L 19.35,2.9 q -0.1,0 -0.25,0.15 M 25.9,3.8 L 26,3.75 h 0.25 l 0.2,0.05 h 0.2 l 0.1,0.05 l 0.2,0.2 l 0.1,0.05 l 0.1,0.2 l 0.3,0.6 L 27.4,5 L 26.95,4.8 L 26.15,4.05 L 25.9,3.8 m 0.55,2.3 V 6.15 V 6.1 m -7.5,8.5 q -0.35,-1.15 -2,-1.45 l -1.3,-0.1 q -2.4,0 -2.4,1.75 l 0.05,0.5 l 1.75,0.3 q 2.95,0 3.85,-0.95 L 18.95,14.6 M 22,16.15 h -0.15 l -0.2,0.25 L 22,16.15 m -2.45,4.1 L 17.6,20.7 l -0.9,-0.2 l -0.05,-0.2 l 0.45,-0.2 h 0.4 l 0.9,-0.2 l 1.65,-0.45 L 20.4,19.3 l 1.5,-0.6 l 1.3,-0.65 l 0.1,-0.1 l 0.1,0.15 v 0.05 l -0.3,0.55 l -0.35,0.2 l -0.8,0.4 l -1.3,0.6 h -0.1 l -1,0.35 M 17.45,14.4 H 17.6 Q 17.4,13.85 16.4,13.85 H 16.3 L 15.4,14 q -0.55,0.15 -1,0.5 l 0.15,0.25 l 0.3,-0.1 l 0.05,0.05 l 0.2,0.2 l 0.3,0.15 L 15.65,15 l 0.3,0.05 L 16.7,14.9 l 0.4,-0.1 l 0.25,-0.05 V 14.7 L 17.5,14.65 L 17.45,14.4 m -3.4,0.2 q 0,-1 1.95,-1 l 1.05,0.1 q 0.8,0 0.8,0.9 q 0,0.55 -1.05,0.6 h -1.1 q -1.65,0 -1.65,-0.6 m -3.6,1.55 l 0.2,0.3 l -0.1,-0.3 h -0.1 m -0.65,0 l 0.2,0.1 L 9.95,16.15 H 9.8 m 4,1.2 h -0.1 l 0.1,0.05 V 17.35 M 16.65,28.1 H 16.4 l -0.3,0.05 v 0.05 h 0.55 v -0.1 m -0.8,1.15 L 16,29.05 L 15.55,28.9 L 15,28.95 L 14.95,29.1 L 15,29.25 h 0.85 M 28.7,25.15 L 28.55,25 l -0.2,0.2 v 0.1 h -0.1 l -0.15,0.55 l -0.1,0.3 l -0.15,0.3 L 27.9,26.5 H 28 l -0.2,0.45 l -0.3,0.55 l -0.2,0.25 l 0.05,0.05 q 0.55,0 1.05,-0.8 L 29,26.1 l 0.1,-0.2 L 29.05,25.85 L 28.95,25.7 H 29 L 28.9,25.55 L 28.8,25.1 l 0.1,-0.3 l -0.2,0.3 v 0.05 m -5.95,3.45 h -0.9 l -0.3,0.05 v 0.15 l 0.1,0.05 l 0.5,0.05 q 0.7,0 0.7,-0.25 L 22.75,28.6 M 0.6,11.75 l 0.35,0.3 L 0.5,12.15 L 0.35,11.95 Q 0.35,11.8 0.5,11.8 L 0.6,11.75 M 2.75,9.65 L 2.8,9.9 Q 3.1,8.55 2.75,9.65 M 7.2,6.25 L 7.05,6.45 L 7.2,6.4 V 6.25 M 6.5,7.45 L 6.85,7.2 L 6.8,7.15 L 6.15,7.25 L 6.2,7.4 l 0.3,0.05 m 0.6,7.6 l -0.15,1.8 l 0.1,1.1 Q 7.1,18.1 7.25,18.1 L 7.4,17.3 L 7.15,14.8 L 7.1,15.05 M 6.6,13.7 L 6.55,14.6 L 6.7,15.25 L 6.6,13.7 M 0.55,13.45 l 0.25,0.5 q 0.1,0.2 -0.2,0.5 H 0.55 Q 0.3,14.45 0.35,14 q 0,-0.5 0.2,-0.55 M 4.85,24 H 4.9 L 4.85,24.1 V 24 M 4.8,25.3 l 0.15,0.5 L 5,25.9 L 4.9,25.8 L 4.5,24.95 L 4.55,25 l 0.25,0.3"
     id="path22"
     inkscape:connector-curvature="0"
     style="fill:#b07335;fill-rule:evenodd;stroke:none" />
   <path
     d="M 0,25.35 V 25 H 0.05 H 0.1 l 0.15,0.1 H 2.2 V 25.05 H 2.25 L 2.4,25.1 h 0.05 v 0.1 H 2.4 L 2.05,25.25 H 2 V 25.3 H 1.8 H 1.3 H 1 V 25.25 H 0.95 L 0.1,25.4 L 0,25.35 M 0.05,4.95 H 0 V 4.8 L 0.1,4.85 L 0.05,4.95 M 7.3,0 H 7.35 L 7.4,0.3 L 7.35,0.65 V 1 L 7.3,1.55 L 7.25,0.6 V 0.4 L 7.3,0.25 V 0 M 6.1,3.4 L 6.25,3.35 L 6.9,3.45 L 6.25,3.9 L 7.95,3.65 V 3.8 h 0.1 L 9.1,3.7 l 3.3,0.25 L 23.9,3.5 v 0.1 l 0.25,0.05 L 24.4,3.7 L 24.35,3.65 Q 24.55,3.25 25,3.15 L 25.25,3.1 l 0.8,-0.05 h 0.05 l 1.65,0.9 L 28,4.25 q 0.8,1 0.8,2.25 v 0.35 l -0.1,0.4 L 28.35,7.4 L 27.8,7.45 L 27.75,7.3 L 27.1,6.55 l 0.25,1.2 V 8 h 0.05 l 0.3,3.8 l 0.1,1.3 l 0.45,-0.75 q 0.7,0 0.7,1.75 l -0.15,0.8 q -0.2,0.8 -0.65,0.8 q -0.2,0 -0.3,-0.45 L 27.7,15.8 q -0.25,2.3 -0.2,4.5 L 27.35,24 l -0.1,0.5 L 27.1,24.4 l -0.5,0.55 L 26.8,24 h 0.05 L 26.9,20.65 L 27,18.85 Q 27.15,17.9 26.4,18.1 L 26.15,18 l -0.05,0.1 l -0.3,-2.5 q -0.25,-0.45 -0.35,-0.05 q -0.55,2.55 0.15,4.9 l 0.2,0.05 H 26 l -0.2,2.9 V 24 v 0.1 l -0.3,0.6 l -0.55,1.2 L 24.9,25.85 l -0.75,0.25 l -0.1,0.05 l -0.2,-0.1 v -0.1 l -1.05,-0.1 l -4.4,0.4 l 0.05,0.1 L 19,26.3 l -0.75,0.1 v 0.1 l 5.4,0.2 h 0.25 l 0.6,-0.25 l 0.35,-0.1 h 0.2 L 25,26.65 l 0.1,0.2 l 0.2,-0.1 l 0.3,-0.1 l -0.1,0.1 l 0.25,-0.2 L 27,25.95 l 0.55,-1.1 l 0.05,0.4 l -0.2,0.95 l -0.8,0.95 l -0.55,0.35 l -0.7,0.3 L 24.7,28 l -0.4,0.1 L 24.15,27.9 L 24,27.55 v -0.1 L 23.95,27.4 H 23.9 v 0.1 l -1,-0.05 l -7,-0.2 l -7.85,0.4 V 27.6 h -0.1 l -0.7,0.05 L 7.8,28.1 l -1.4,0.2 l 0.75,0.65 l -2,-0.3 l -1,-0.35 L 3.45,27.75 L 3.15,27.1 H 3.7 L 3.35,26.7 L 2.9,26.95 L 2.45,25.9 l 0.3,-1.2 l 0.45,1.35 l 0.05,-0.2 L 3.7,26.3 l 0.2,0.2 l 0.15,-0.05 l 0.1,-0.15 l 0.55,0.75 q 0.95,1.35 1.75,0.3 l 0.3,-0.15 l -1.5,-1 L 5,25.9 L 4.95,25.8 L 4.8,25.3 v -0.05 l 0.1,-0.1 l 0.15,0.2 L 5.3,25.3 L 5.05,24 H 5.1 V 23 Q 5.45,21.85 5.15,20.8 L 4.9,20.35 q -0.25,0.25 -0.3,1.9 l -0.05,0.7 L 4.5,24 H 3.75 L 3.6,23.05 L 3.55,19.2 Q 3.2,18.8 3.2,18.5 L 3.55,18.15 V 18.1 Q 3,17.9 3,17.35 q 0,-0.3 0.3,-0.45 l 0.25,-0.3 v -0.5 l 0.2,-3.9 L 2.5,12 l 0.55,-0.1 l 0.4,-0.15 l 0.35,-0.3 l -0.9,-0.5 l 0.8,-0.4 L 3.65,8.65 L 3.7,8 L 3.75,7.6 L 3.5,7.35 L 3.65,6.55 L 4.15,5.8 L 4.2,5.75 L 5.2,4.6 L 4.75,5.15 l -0.5,1 l -0.1,0.7 L 4.6,6.35 L 4.7,6.4 Q 5.65,6.7 6.85,5.2 L 7.45,4.65 L 7.4,4.2 L 7.3,4.1 L 7.4,3.95 L 7.35,3.8 L 5.95,4.2 L 5.3,4.45 L 5.25,4.35 L 4.4,5.45 L 4.15,5.5 H 4.05 L 4.75,4.4 L 5,4.3 L 5.85,3.7 L 6.1,3.4 M 4.15,4.55 L 3.4,5.3 L 3.2,5.05 L 3.35,4.9 L 3.65,4.65 Q 4.55,2.75 6.15,3.3 L 5.55,3.55 L 4.8,3.95 L 4.15,4.55 M 3.4,6.2 L 3.35,6.35 L 3.3,6.3 L 3.35,6.2 H 3.3 H 3.4 M 16.8,3.05 l -0.15,-0.1 l 0.3,-0.2 l 0.5,0.1 l 0.05,0.1 L 17.1,3.2 L 16.8,3.05 M 10.05,4.9 L 10.2,4.75 q 0,-0.5 -1.6,-0.5 L 8.05,4.3 l -0.1,0.05 v 0.3 V 5.1 H 9.5 L 9.8,5 l 0.55,0.05 L 10.05,4.9 m 0.9,20.75 l -2.9,-0.4 H 7.95 L 7.65,25.1 L 7.05,24.75 L 6.8,24.55 L 6.6,24.4 H 6.85 L 6.7,24 H 6.85 Q 6.4,23.45 6.4,22.65 l 0.05,-0.7 l 0.2,0.55 L 6.7,22.55 L 7,20.1 l 0.05,-0.05 q 0.05,3.3 0.7,3.95 h -0.1 l 0.2,0.45 H 7.8 l 0.15,0.2 l 0.1,0.1 V 24.3 l 2.6,0.15 L 12.5,24.2 l 3.4,0.25 l -0.3,0.2 q 2.5,0.7 4.25,0.6 l 2.2,-0.3 q 0.45,-0.2 0.65,-0.3 l 0.9,0.05 h 0.3 h 0.25 l 0.6,-0.35 v -0.1 L 24.15,24.1 L 23.9,24.05 v -2.1 l -0.3,0.7 l -0.75,0.05 v 0.05 q 0.2,0.4 0.75,0.35 l 0.3,0.3 l -2,0.25 L 20.7,23.8 L 20.3,24 h -9.65 l -0.2,-0.05 L 8.35,23.2 l 0.05,0.1 l 0.45,0.35 h -0.3 l -0.5,-0.1 H 8 V 22.4 h 0.05 l 0.2,-0.35 V 21 v -0.1 l 0.95,0.2 h 0.2 l 0.5,-0.05 l -0.85,-0.3 q -0.35,-0.05 -1,-1 L 8,19.65 v -1.4 L 8.05,18.2 L 8.4,17.9 l 0.25,-0.25 q 1.1,0.6 1.7,0.6 l -1.5,-1 L 8.05,16.3 L 8,16.2 V 8.65 L 8.05,8.6 L 9.1,8 H 9.55 L 9.25,8.2 Q 8.45,8.75 8.4,9.15 H 8.45 L 8.8,9.2 q 1.45,-1 3.65,-1.2 h 1.5 q 0.6,0.2 0.95,0.55 l 1.55,0.3 L 18.3,8.25 L 18.9,8 h 4.15 L 23.9,8.5 V 7.95 L 25.15,7.9 L 25.2,7.8 q 0,-0.7 -1.05,-1.7 L 23.9,5.9 V 5.75 l -6.35,-0.5 l -6,0.65 L 9.2,5.65 H 7.95 V 5.6 l -1,0.2 L 7,5.85 l 0.45,0.1 L 7.2,6 Q 5.8,6 5.65,8 H 5.6 L 5.55,8.6 v 0.15 q 0.7,0.3 0.7,1.15 q 0,0.65 -0.5,1.15 L 6.2,11.6 q 0,0.2 -0.4,0.2 L 5.75,12.2 L 5.8,12.55 L 5.9,14.3 L 6,17.5 l 0.05,0.75 l 0.15,2.2 l -0.05,0.8 l -0.05,0.1 l -0.3,-0.5 l -0.15,2.2 V 24 H 5.8 l 0.45,1.1 l 0.05,0.3 l -0.05,0.1 l 0.1,0.2 v 0.25 l 0.3,0.35 l 0.6,0.1 l 0.8,0.35 v 0.05 l 1.7,0.05 l 2,-0.1 l 1.05,-0.1 v -0.1 h 0.05 l 0.7,-0.15 Q 13.45,26.1 11.5,26 l 1.15,-0.45 l -1.3,0.1 h -0.4 M 5.2,8.05 L 5.6,8 H 4.85 H 4.6 H 4.45 L 4.3,8.55 L 4.2,14.1 l -0.1,3.6 l 0.05,0.05 l 0.45,0.3 l 0.2,-2 L 5.15,15.8 Q 5.6,12.25 5.2,8.6 V 8.05 M 12.45,8.8 Q 10.95,8.8 10,9.25 Q 8.5,9.85 8.3,11.4 v 0.05 V 12 l 0.05,0.1 l 0.9,-0.5 q 1.2,-0.65 3,-1.25 l 1.5,-0.7 L 14.7,9.35 Q 14.55,8.8 12.65,8.8 h -0.2 M 18.1,6.05 q 0.25,0 0.5,0.25 L 18.25,6.4 L 17.1,6.5 L 16.2,6.35 l 1.5,-0.2 l 0.4,-0.1 m -2.3,0.9 l -0.3,0.1 L 15.1,7 l 0.3,-0.2 l 0.4,0.15 m -1.5,1.1 L 13.95,8 h 1.15 v 0.05 h -0.8 m 3.85,1.75 l 1.25,0.7 l 1.1,0.75 l 0.05,0.05 L 21.5,12 h 0.05 l 0.1,0.1 l 0.2,0.15 h -0.1 v 0.05 q 0.55,0.55 0.55,1.25 l -0.05,0.35 l -0.15,0.05 l -1.15,-1.6 l -0.1,-0.25 l -0.1,-0.15 L 19.9,11.25 Q 19.1,10.8 17.7,10.85 L 17.1,11 l -2.2,0.4 l -1.45,0.4 l -0.5,0.2 l -0.1,0.05 L 12.1,12.1 l -0.65,0.1 l 1,-0.7 q 0.55,-0.4 1.2,-0.75 l 0.1,-0.1 q -0.1,-0.5 -0.4,-0.45 L 10.9,11.65 L 10.45,11.9 H 10.4 L 9.95,12.25 L 9.9,12.3 L 9.85,12.35 H 9.8 Q 8.55,13.1 8.5,14.8 v 0.1 l 0.2,1.25 v 0.05 l 0.05,0.05 l 0.6,0.7 L 9.5,17.1 l 0.5,0.45 l 1.05,0.75 l 1.5,0.85 l 0.3,0.05 l 0.75,0.1 l 0.65,-0.25 L 14.2,18.8 l 1.35,-0.25 L 16.1,18.3 V 18.15 L 15.95,18.1 l 0.1,-0.55 q 0,-0.5 -1.6,-1.05 h 0.65 l 1.65,-0.1 l 0.95,-0.15 h 0.05 q 1.9,-0.4 1.95,-1.3 V 14.9 v -0.4 q -0.25,-1.65 -2.5,-1.95 l -1.35,-0.1 q -2.25,-0.05 -3.6,2.3 v 0.05 l -0.15,0.4 v 0.2 l 0.2,0.45 l -0.75,-0.1 h -0.1 l -0.3,-0.5 L 11,14.5 q 0,-0.5 1.4,-1.35 l 2.6,-0.7 l 1.55,-0.15 l 0.25,-0.05 l 0.9,-0.2 l 0.8,0.1 l 1.6,0.55 l -0.3,0.5 l 0.9,0.9 l 0.25,0.4 v 0.1 v 0.05 v 0.3 l -0.35,0.3 L 19,16.1 q -0.7,0.25 -1.05,0.6 q -0.3,0.3 -0.35,0.65 h -0.2 v 0.5 L 18,18 l 0.55,0.1 h 0.1 v 0.05 l 0.4,0.15 h 0.3 l 1.2,-0.35 L 20.5,17.8 l 1.6,-1.4 l 1.15,-0.65 l 0.35,0.05 v 0.1 l -0.55,0.95 L 23.3,16.7 l 0.2,-0.2 l 0.4,-1.3 v 3.7 l -0.6,1.5 l -0.6,0.7 l -0.6,0.3 l -0.6,0.25 h -0.1 l -1.25,0.2 H 18.1 L 17,21.9 l -1.05,0.55 H 15.8 Q 15.65,21.9 15,21.85 L 12.9,21.7 V 21.65 L 12.85,21.5 L 12.6,20.85 l 1.9,0.2 L 15.2,21 l 0.7,-0.15 V 20.6 l -0.8,-0.25 l -2.05,-0.4 l -0.4,-0.2 L 12.2,19.6 Q 10.55,19.05 9.75,18.5 L 9.45,18.3 H 9.4 L 8.8,17.9 Q 8.65,17.9 8.6,18 L 8.5,18.35 L 8.55,19 v 0.05 q 0.1,0.7 0.55,1.2 V 20.2 q 0.4,0.35 1.1,0.55 l 0.25,0.05 l 0.75,0.1 l 0.55,-0.3 l 0.6,0.2 l 0.05,0.25 l -0.1,0.6 v 0.05 l -1.2,0.15 L 10,21.45 L 9.2,21.6 L 8.65,21.4 L 8.6,21.55 q 0,1.05 1.45,1.6 q 1.6,0.6 5,0.6 l 5.3,-0.35 l 2.15,-0.5 l 0.2,-0.1 l 0.1,-0.1 l 0.1,-0.1 l 0.05,-0.05 l 0.95,-0.8 V 19.9 l 0.05,-1.15 l 0.25,-2.7 L 24,12.55 L 24.1,11.7 L 23.9,11.1 V 10.4 L 23.55,9.8 L 23.3,9.4 L 23.1,9.2 L 21.95,8.7 L 21.6,8.65 l -1.1,-0.2 l -1.8,0.6 q 1.05,0.2 2.85,1.05 l 0.55,0.3 l -0.05,0.05 l 1.6,1.1 l 0.2,0.4 l 0.05,0.25 v 2.15 L 23.85,14.2 l -1.05,-2 L 22.75,12.1 V 12 L 22.5,11.75 L 22,11.25 L 21.45,10.9 L 21,10.65 l -1.05,-0.3 l -0.6,-0.3 L 18.8,9.8 H 18.5 L 18.15,9.7 v 0.1 m 7.75,-6 l 0.25,0.25 l 0.8,0.75 L 27.4,5 l 0.05,-0.1 l -0.3,-0.6 l -0.1,-0.2 l -0.1,-0.05 l -0.2,-0.2 L 26.65,3.8 h -0.2 L 26.25,3.75 H 26 L 25.9,3.8 M 19.1,3.05 Q 19.25,2.9 19.35,2.9 L 19.4,3.05 L 19.35,3.1 L 19.1,3.05 m 1.7,2 l 0.4,0.05 h 0.3 l 2.4,0.1 V 5.1 l 0.25,0.1 l 0.75,0.5 v 0.15 l 0.5,0.45 l 0.05,0.05 H 25.4 q -0.05,0 -0.15,0.1 L 25.5,6.9 l 0.05,0.35 l -0.1,0.2 L 25.55,8 h 0.05 l -0.2,1.6 q -0.25,2.25 0.65,4.5 l 0.15,-0.9 q 0.15,-2.45 0.45,-4.8 L 26.35,8 h 0.3 L 26.55,7.6 L 26.45,7.25 L 26.4,7.05 L 26.3,6.8 L 26.15,6.5 L 26.1,6.2 V 6.15 L 25.8,5.2 L 25.35,4.5 L 24.8,4.3 L 23.9,4.4 V 4.35 l -0.15,0.1 l -1.8,0.1 l -1.4,0.4 L 19.65,5 L 20.8,5.05 M 26.45,6.1 V 6.15 V 6.1 M 22,16.15 l -0.35,0.25 l 0.2,-0.25 H 22 m 0.75,2.75 l 0.35,-0.2 l 0.3,-0.55 V 18.1 l -0.1,-0.15 l -0.1,0.1 l -1.3,0.65 l -1.5,0.6 l -0.35,0.15 L 18.4,19.9 l -0.9,0.2 h -0.4 l -0.45,0.2 l 0.05,0.2 l 0.9,0.2 l 1.95,-0.45 h 0.5 h 1.2 q 0.6,0 1.65,-0.7 l 0.55,-0.4 l -0.4,-0.1 L 22.75,18.9 M 14.9,14.65 l 0.2,-0.05 v 0.05 v 0.25 l -0.2,-0.2 v -0.05 m -1.1,2.7 v 0.05 l -0.1,-0.05 h 0.1 m -4,-1.2 h 0.15 l 0.05,0.1 l -0.2,-0.1 m 0.65,0 h 0.1 l 0.1,0.3 l -0.2,-0.3 m 6.2,11.95 v 0.1 H 16.1 v -0.05 l 0.3,-0.05 h 0.25 m -3.45,-3 h -0.5 l -1.2,0.15 l 0.05,0.05 h 1.2 l 0.5,-0.1 L 13.2,25.1 m 2.8,5.45 q 0.1,-0.1 0.3,-0.1 l 0.2,0.05 v 0.1 L 16,30.55 m 2.35,-0.25 l 0.25,0.1 l 0.25,-0.1 h 0.25 l 0.05,0.1 q -0.2,0.2 -0.55,0.2 l -0.3,-0.15 l 0.05,-0.15 m -2.5,-1.05 H 15 L 14.95,29.1 L 15,28.95 L 15.55,28.9 L 16,29.05 l -0.15,0.2 M 15.1,30.3 l 0.25,-0.15 l 0.15,0.05 v 0.1 h -0.4 m 13.25,-5 v -0.1 l 0.2,-0.2 l 0.15,0.15 L 28.35,25.3 M 29,26.1 L 28.4,27 q -0.5,0.8 -1.05,0.8 L 27.3,27.75 l 0.2,-0.25 l 0.3,-0.55 L 28,26.5 l 0.45,0.05 L 29,26.1 m -6.25,2.5 l 0.1,0.05 q 0,0.25 -0.7,0.25 l -0.5,-0.05 l -0.1,-0.05 v -0.15 l 0.3,-0.05 h 0.9 M 2.75,9.65 Q 3.1,8.55 2.8,9.9 L 2.75,9.65 M 7.2,6.25 V 6.4 L 7.05,6.45 L 7.2,6.25 M 6.5,7.45 L 6.2,7.4 L 6.15,7.25 L 6.8,7.15 L 6.85,7.2 L 6.5,7.45 m 0.1,6.25 l 0.1,1.55 L 6.55,14.6 L 6.6,13.7 m 0.5,1.35 L 7.15,14.8 l 0.25,2.5 l -0.15,0.8 q -0.15,0 -0.2,-0.15 l -0.1,-1.1 l 0.15,-1.8 m 0.35,10.8 L 7.4,25.9 v -0.05 h 0.05 m -2.15,4.1 l 0.1,-0.1 V 29.8 v 0.85 L 5.35,30.15 L 5.3,30.05 v -0.1"
     id="path24"
     inkscape:connector-curvature="0"
     style="fill:#bd7a39;fill-rule:evenodd;stroke:none" />
   <path
     d="M 0,25 V 24.8 L 0.1,24.75 H 0.25 L 0.7,24.9 L 2,24.95 h 0.2 v 0.1 V 25.1 H 0.25 L 0.1,25 H 0.05 H 0 M 0,6.2 V 6.1 L 0.05,6.05 H 0 V 5.55 L 0.2,5.6 L 0.05,5.7 L 0.1,5.9 H 0.6 L 1.65,5.85 H 1.8 H 2.2 L 3.3,5.8 L 3.45,5.9 Q 3.65,6.15 3.4,6.2 H 3.3 L 2.6,6 L 0.1,6.1 V 6.2 H 0 M 0.15,5.25 L 0.05,5.15 L 0,5.05 L 0.05,4.95 L 0.1,4.85 l 1.05,0.1 H 2.1 h 1 L 3.35,4.9 L 3.2,5.05 L 3.1,5.1 L 2.6,5.2 L 2.45,5.25 L 2.35,5.3 H 1.55 L 0.3,5.25 H 0.15 M 7.1,0 H 7.3 V 0.25 L 7.25,0.4 V 0.6 L 7.3,1.55 V 2 V 2.05 L 7.2,3.2 Q 6.85,3.15 6.9,2.45 L 6.95,2.15 V 1.95 L 6.85,0.85 L 6.9,0.45 L 6.8,0.1 Q 6.85,0 6.95,0 l 0.1,0.05 L 7.1,0 M 5.2,4.6 L 5.3,4.45 L 5.95,4.2 L 7.35,3.8 L 7.4,3.95 L 7.3,4.1 Q 5.8,4.5 5.05,5.75 L 4.7,6.4 L 4.6,6.35 l -0.45,0.5 l 0.1,-0.7 l 0.5,-1 L 5.2,4.6 m 4.85,0.3 l 0.3,0.15 L 9.8,5 L 9.5,5.1 H 7.95 V 4.65 h 0.1 L 9.8,4.8 L 9.85,4.85 L 10,4.9 h 0.05 m -2,21.85 L 7.25,26.4 L 7.15,26.35 L 6.8,26.15 L 6.35,25.7 L 6.25,25.5 L 6.3,25.4 L 6.35,25.3 H 6.4 l 0.1,-0.05 h 0.05 l 0.3,0.2 L 7,25.6 l 0.1,0.05 l 0.35,0.2 v 0.05 l 0.5,0.35 l 0.1,0.05 v 0.45 M 5.2,8.05 V 8.6 q 0.4,3.65 -0.05,7.2 L 4.8,16.05 l -0.2,2 L 4.15,17.75 Q 4.45,17.6 4.6,14.5 Q 4.75,10.7 4.5,8.55 L 4.6,8.15 V 8 L 4.85,8.05 V 8 L 4.9,8.05 h 0.3 m 15.6,-3 L 19.65,5 l 0.9,-0.05 L 23.9,4.65 V 5.1 V 5.2 L 21.5,5.1 L 20.8,5.05 m -5.7,9.6 q 0,0.3 0.35,0.35 h 0.2 L 15.4,15.05 L 15.1,14.9 V 14.65 M 4.9,20.35 L 5.15,20.8 Q 5.45,21.85 5.1,23 v 1 H 5.05 L 5.3,25.3 V 25.25 Q 4.85,25 4.85,24.1 L 4.9,24 H 4.85 L 4.9,20.35 M 5,25.9 l 0.25,0.3 l 1.5,1 l -0.3,0.15 Q 6,27.3 5.2,26.85 Q 4.1,25.95 4.1,24.8 V 24.75 L 4.4,24.5 l 0.1,0.45 L 4.9,25.8 L 5,25.9 M 7.45,25.85 H 7.4 v 0.05 l 0.05,-0.05"
     id="path26"
     inkscape:connector-curvature="0"
     style="fill:#96622e;fill-rule:evenodd;stroke:none" />
   <path
     d="M 2.75,28.95 L 2.7,28.9 l 0.05,0.05"
     id="path28"
     inkscape:connector-curvature="0"
     style="fill:#e0bb98;fill-rule:evenodd;stroke:none" />
   <path
     d="M 6.2,32 H 5.9 v -0.05 l 0.05,-2.1 l 0.2,1.2 L 6.2,32"
     id="path30"
     inkscape:connector-curvature="0"
     style="fill:#7c5025;fill-rule:evenodd;stroke:none" />
   <path
     d="m 17.5,17.1 q 1,-0.65 2.65,-1.4 L 21,15.15 l 0.65,0.2 q -0.55,0.3 -0.95,0.55 q -1.6,1.1 -3.2,1.2 m -6.7,5.1 l 3.5,-0.5 h 2.1 h 0.05 h 0.1 l 2.8,-0.15 q 1.55,0 2.7,0.75 l -2,-0.2 h -2.6 h -3.6 L 10.8,22.2 M 21.65,9.35 Q 22.1,9 22.55,9 l 0.75,0.05 l 0.05,0.2 L 23.15,9.6 L 21.65,9.35 M 19.25,9.9 L 16.5,9.85 L 16.6,9.8 l 2.95,-0.5 l 0.05,0.05 l -0.7,0.3 V 9.8 l 0.35,0.1 m 1.35,3.45 l 0.15,0.15 L 20.3,13.35 h -0.1 q -2.25,-0.8 -4.2,-0.7 q -1.85,0.05 -3.4,0.7 l -0.6,0.3 l 0.05,-0.3 q 0.35,-0.65 1.6,-1.1 Q 15.3,11.6 17.4,11.8 q 1.95,0.15 3.15,1.55 H 20.6 M 8.7,10.65 l -0.3,-0.1 l 1.05,-0.4 l 0.9,-0.45 q 2.6,0 2.6,0.55 l -0.3,0.4 h -0.1 l -1,-0.2 L 9.35,10.4 L 8.7,10.65 m 2.15,5.1 l 4.65,1.05 q 0.6,0.2 0.35,0.8 q -2.6,-0.6 -5,-1.85"
     id="path32"
     inkscape:connector-curvature="0"
     style="fill:#d9aa7b;fill-rule:evenodd;stroke:none" />
   <path
     d="m 17.5,17.1 q 1.6,-0.1 3.2,-1.2 q 0.4,-0.25 0.95,-0.55 q 0.4,0.3 0,0.65 q -1.75,1.35 -3.75,1.5 q -1,0.05 -0.4,-0.4 m 4.15,-7.75 l 1.5,0.25 l 0.15,0.15 l -2.25,0.4 h -0.4 h -0.9 L 19.25,9.9 L 18.9,9.8 V 9.65 l 0.7,-0.3 L 20.1,9.3 h 0.15 h 0.85 l 0.55,0.05 m -9.1,1.3 h 0.1 l 0.05,0.05 l -0.15,0.05 l -1.05,0.2 L 10.35,11 h -1 L 8.4,10.75 v -0.1 H 8.7 L 9.35,10.4 l 2.2,0.05 l 1,0.2 m 3.3,6.95 L 13.9,17.8 Q 12.35,17.45 11,16.3 q -0.8,-0.65 -0.15,-0.55 q 2.4,1.25 5,1.85"
     id="path34"
     inkscape:connector-curvature="0"
     style="fill:#8f5c2c;fill-rule:evenodd;stroke:none" />
   <path
     d="m 22.05,22.3 l 0.45,0.1 l -0.55,0.15 L 19.9,22.7 H 17.25 L 11.5,22.6 L 10.25,22.55 H 10.2 L 10.15,22.4 l 0.65,-0.2 l 3.05,-0.1 h 3.6 h 2.6 l 2,0.2"
     id="path36"
     inkscape:connector-curvature="0"
     style="fill:#96622e;fill-rule:evenodd;stroke:none" />
  </g>
 </defs>
</svg>
