<?xml version="1.0" encoding="UTF-8" standalone="no"?>
<!-- Created with Inkscape (http://www.inkscape.org/) -->

<svg
  xmlns:dc="http://purl.org/dc/elements/1.1/"
  xmlns:cc="http://creativecommons.org/ns#"
  xmlns:rdf="http://www.w3.org/1999/02/22-rdf-syntax-ns#"
  xmlns:svg="http://www.w3.org/2000/svg"
  xmlns="http://www.w3.org/2000/svg"
  xmlns:sodipodi="http://sodipodi.sourceforge.net/DTD/sodipodi-0.dtd"
  xmlns:inkscape="http://www.inkscape.org/namespaces/inkscape"
  width="22.820679"
  height="11.661188"
  viewBox="0 0 22.820679 11.661189"
  version="1.1"
  id="svg8"
  inkscape:version="0.92.4 (5da689c313, 2019-01-14)"
  sodipodi:docname="chapeau.svg">
 <defs
   id="defs2" />
 <sodipodi:namedview
   id="base"
   pagecolor="#ffffff"
   bordercolor="#666666"
   borderopacity="1.0"
   inkscape:pageopacity="0.0"
   inkscape:pageshadow="2"
   inkscape:zoom="7.9195959"
   inkscape:cx="26.724208"
   inkscape:cy="6.150058"
   inkscape:document-units="px"
   inkscape:current-layer="layer1"
   showgrid="false"
   inkscape:snap-global="false"
   units="px"
   fit-margin-top="0"
   fit-margin-left="0"
   fit-margin-right="0"
   fit-margin-bottom="0"
   inkscape:window-width="1366"
   inkscape:window-height="705"
   inkscape:window-x="-8"
   inkscape:window-y="-8"
   inkscape:window-maximized="1" />
 <metadata
   id="metadata5">
  <rdf:RDF>
   <cc:Work
     rdf:about="">
    <dc:format>image/svg+xml</dc:format>
    <dc:type
      rdf:resource="http://purl.org/dc/dcmitype/StillImage" />
    <dc:title></dc:title>
   </cc:Work>
  </rdf:RDF>
 </metadata>
 <g
   inkscape:label="Calque 1"
   inkscape:groupmode="layer"
   id="layer1"
   transform="translate(-7.713753,-26.207735)">
  <g
    id="g898"
    transform="translate(-11.515419,9.5243285)">
   <path
     sodipodi:nodetypes="cccc"
     inkscape:connector-curvature="0"
     id="path826"
     d="m 19.229539,22.778273 l 12.047992,-6.094866 l 10.77232,9.118676 c -2.182607,2.332665 -15.916898,5.455076 -22.820312,-3.02381 z"
     style="fill:#ffe269;fill-opacity:1;fill-rule:evenodd;stroke:none;stroke-width:0.26458332px;stroke-linecap:butt;stroke-linejoin:miter;stroke-opacity:1" />
   <path
     id="path826-8"
     d="m 31.277531,16.683407 l -6.272484,10.317199 c 2.800021,1.138505 5.834485,1.452621 8.572603,1.308447 c -1.808909,-3.37496 -2.872105,-7.107855 -2.300119,-11.625646 z"
     style="fill:#ffd02d;fill-opacity:1;fill-rule:evenodd;stroke:none;stroke-width:0.26458332px;stroke-linecap:butt;stroke-linejoin:miter;stroke-opacity:1"
     inkscape:connector-curvature="0" />
   <path
     id="path826-2"
     d="m 31.277532,16.683406 l -9.59838,8.44858 c 1.042448,0.781578 2.163607,1.396027 3.325895,1.86862 z"
     style="fill:#eaba24;fill-opacity:1;fill-rule:evenodd;stroke:none;stroke-width:0.26458332px;stroke-linecap:butt;stroke-linejoin:miter;stroke-opacity:1"
     inkscape:connector-curvature="0" />
   <path
     id="path826-9"
     d="m 31.277532,16.683406 l -12.04836,6.095235 c 0.744625,0.91456 1.569476,1.693185 2.44998,2.353345 z"
     style="fill:#99790f;fill-opacity:1;fill-rule:evenodd;stroke:none;stroke-width:0.26458332px;stroke-linecap:butt;stroke-linejoin:miter;stroke-opacity:1"
     inkscape:connector-curvature="0" />
   <path
     sodipodi:nodetypes="ccc"
     inkscape:connector-curvature="0"
     id="path891"
     d="m 31.277531,16.683407 c 6.438316,7.690546 7.811041,7.107292 10.772319,9.118676 z"
     style="opacity:0.2;fill:#ffffff;fill-rule:evenodd;stroke:none;stroke-width:0.26458332px;stroke-linecap:butt;stroke-linejoin:miter;stroke-opacity:1" />
  </g>
 </g>
</svg>
