<?xml version="1.0" encoding="UTF-8" standalone="no"?>
<svg
   xmlns:dc="http://purl.org/dc/elements/1.1/"
   xmlns:cc="http://creativecommons.org/ns#"
   xmlns:rdf="http://www.w3.org/1999/02/22-rdf-syntax-ns#"
   xmlns:svg="http://www.w3.org/2000/svg"
   xmlns="http://www.w3.org/2000/svg"
   xmlns:sodipodi="http://sodipodi.sourceforge.net/DTD/sodipodi-0.dtd"
   xmlns:inkscape="http://www.inkscape.org/namespaces/inkscape"
   width="26.377218"
   height="39.739029"
   version="1.1"
   id="svg2194"
   sodipodi:docname="trophee_or.svg"
   inkscape:version="0.92.4 (5da689c313, 2019-01-14)">
  <metadata
     id="metadata2200">
    <rdf:RDF>
      <cc:Work
         rdf:about="">
        <dc:format>image/svg+xml</dc:format>
        <dc:type
           rdf:resource="http://purl.org/dc/dcmitype/StillImage" />
        <dc:title></dc:title>
      </cc:Work>
    </rdf:RDF>
  </metadata>
  <defs
     id="defs2198" />
  <sodipodi:namedview
     pagecolor="#ffffff"
     bordercolor="#666666"
     borderopacity="1"
     objecttolerance="10"
     gridtolerance="10"
     guidetolerance="10"
     inkscape:pageopacity="0"
     inkscape:pageshadow="2"
     inkscape:window-width="1920"
     inkscape:window-height="1017"
     id="namedview2196"
     showgrid="false"
     fit-margin-top="0"
     fit-margin-left="0"
     fit-margin-right="0"
     fit-margin-bottom="0"
     inkscape:zoom="1.4849958"
     inkscape:cx="13.276236"
     inkscape:cy="19.89924"
     inkscape:window-x="-8"
     inkscape:window-y="-8"
     inkscape:window-maximized="1"
     inkscape:current-layer="svg2194" />
  <path
     d="m 2.5802654,25.523207 -2.14249998,13.83925 24.90999958,-0.08925 -2.1425,-13.75 z"
     id="path2150"
     inkscape:connector-curvature="0"
     style="fill:#fcb81b;stroke:#be5f07;stroke-width:0.75" />
  <path
     d="m 8.1160154,25.523207 -3.393,13.5715"
     id="path2152"
     inkscape:connector-curvature="0"
     style="fill:#666666;stroke:#be5f07;stroke-width:0.75" />
  <path
     d="m 15.473515,30.985707 4.9875,1.2625 v -1.19925 z"
     id="path2154"
     inkscape:connector-curvature="0"
     style="fill:#be5f07;stroke:#be5f07;stroke-width:0.25" />
  <path
     d="m 21.221515,38.277457 c 0.165,-0.525 0.1325,-2.8075 -0.0525,-3.655 -0.4745,-2.18 -1.32925,-3.75825 -2.63,-4.8555 -1.6175,-1.365 -2.82075,-1.913 -7.31825,-3.335 l -1.6919996,-0.5345 6.6289996,-0.0215 c 3.64575,-0.012 6.644,-0.007 6.6625,0.01075 0.05,0.0485 2.046,12.5335 2.009,12.56625 -0.0175,0.015 -0.85925,0.055 -1.87075,0.0885 l -1.83875,0.0605 0.10175,-0.325 z"
     id="path2156"
     inkscape:connector-curvature="0"
     style="fill:#fedc54;stroke-width:0.25" />
  <path
     d="m 2.4017654,36.059207 c -0.99625,0.1125 -2.05999998,1.67375 -0.62,2.03825 1.124,0.194 0.996,-1.08075 0.8205,-1.76675 0.49,-5e-4 1.383,0.069 1.504,-0.78125 0.51925,-1.16175 -1.207,-1.855 -1.52825,-0.5625 -0.146,0.3285 -0.2815,0.7125 -0.176,1.0725 z"
     id="path2158"
     inkscape:connector-curvature="0"
     style="fill:#be5f07;stroke:#be5f07;stroke-width:0.25" />
  <path
     d="m 2.9375154,32.219707 c 0,0.0985 -0.08,0.1785 -0.17875,0.1785 -0.09825,0 -0.17825,-0.08 -0.17825,-0.1785 0,-0.09875 0.08,-0.1785 0.1785,-0.1785 0.099,0 0.179,0.08 0.179,0.1785 z m -0.268,-1.473 c 0,0.1725 -0.14,0.3125 -0.3125,0.3125 -0.1725,0 -0.3125,-0.14 -0.3125,-0.3125 0,-0.1725 0.14,-0.3125 0.3125,-0.3125 0.1725,0 0.3125,0.14 0.3125,0.3125 z m 1.16075,-2.545 c 0,0.24675 -0.22,0.4465 -0.491,0.4465 -0.27125,0 -0.49125,-0.2 -0.49125,-0.4465 0,-0.2465 0.22,-0.44625 0.49125,-0.44625 0.27125,0 0.491,0.2 0.491,0.44625 z m 1.6965,-1.9195 c 0,0.1725 -0.18,0.3125 -0.40175,0.3125 -0.222,0 -0.402,-0.14 -0.402,-0.3125 0,-0.1725 0.18,-0.3125 0.402,-0.3125 0.22175,0 0.40175,0.14 0.40175,0.3125 z m 0.71425,1.83025 c 0,0.09875 -0.12,0.17875 -0.268,0.17875 -0.1475,0 -0.2675,-0.08 -0.2675,-0.17875 0,-0.0985 0.12,-0.1785 0.2675,-0.1785 0.148,0 0.268,0.08 0.268,0.17825 z"
     id="path2160"
     inkscape:connector-curvature="0"
     style="fill:#be5f07;stroke:#be5f07;stroke-width:0.75;stroke-linejoin:round" />
  <path
     d="m 11.748515,28.712957 -0.379,4.4825 c -0.057,-1.465 -0.88,-3.0725 -0.06575,-4.4495 0.12375,-0.098 0.30875,-0.11875 0.445,-0.033 z"
     id="path2162"
     inkscape:connector-curvature="0"
     style="fill:#be5f07;stroke:#be5f07;stroke-width:0.25" />
  <path
     d="m 12.781015,28.708207 -0.37875,4.4825 c -0.0575,-1.465 -0.8805,-3.0725 -0.066,-4.4495 0.12375,-0.098 0.30875,-0.1185 0.445,-0.033 z"
     id="path2164"
     inkscape:connector-curvature="0"
     style="fill:#fedc54;stroke:#fedc54;stroke-width:0.25" />
  <path
     d="m 13.447265,28.012707 8.2825,0.39"
     id="path2166"
     inkscape:connector-curvature="0"
     style="fill:#be5f07;stroke:#be5f07;stroke-width:0.36475" />
  <path
     d="m 21.281765,32.122207 -8.83875,-0.37875 -0.06325,0.63125 9.849,1.07325 z"
     id="path2168"
     inkscape:connector-curvature="0"
     style="fill:#fedc54;stroke:#fedc54;stroke-width:0.25" />
  <g
     id="g2174"
     transform="matrix(0.25,0,0,0.25,0.04101542,-0.00329309)"
     style="fill:#ffffff;stroke:#ffffff">
    <path
       d="m 90.77,141.13 c -0.04,5.456 -3.914,15.188 6.016,13.424 8.075,-3.98 -1.357,-9.118 -4.684,-12.38 l -0.636,-0.585 -0.695,-0.46 z m -5.303,8.838 c -5.158,2.38 3.74,5.04 0,0 z m -3.03,-9.598 c -1.65,4.193 6.764,1.478 0,0 z m 2.273,-4.04 c -2.007,6.332 10.647,1.073 3.254,0.45 -0.947,0.557 -2.9,1.126 -3.254,-0.45 z m 3.535,-10.353 c -6.307,1.35 -0.434,8.963 0.575,1.933 l -0.142,-1.007 z m 8.335,4.798 c -4.946,-2.98 -3.098,7.5 -1.155,0.68 l 0.43,-0.547 0.724,-0.133 z m -4.8,-9.091 c -2.407,6.64 9.798,-0.313 1.298,-0.222 l -1.297,0.222 z m -8.08,-4.799 c -0.61,5.958 10.88,1.494 2.97,0.005 -0.99,-0.057 -1.98,0.03 -2.97,-0.005 z m -11.87,-8.838 c -0.733,5.338 7.923,-0.446 0.87,0.156 z m 8.84,-2.527 c -5.836,7.062 11.33,11.085 8.082,1.82 -1.62,-2.677 -5.45,-2.695 -8.083,-1.82 z"
       id="path2170"
       inkscape:connector-curvature="0" />
    <path
       d="m 89.76,107.29 c -4.824,4.274 8.462,6.266 2.368,1.225 l -1.142,-0.693 -1.225,-0.533 z"
       id="path2172"
       inkscape:connector-curvature="0" />
  </g>
  <g
     id="g2192"
     transform="matrix(0.25,0,0,0.25,0.04101542,-0.00329309)">
    <path
       d="M 44.24,22.78 C 59.588,12.898 61.3,6.487 67.854,2.036 70.789,0.042 66.894,2.238 79.211,34.74 78.739,31.612 55.901,47.015 53.498,47.155 52.791,32.967 37.044,22.733 44.242,22.78 Z"
       id="path2176"
       inkscape:connector-curvature="0"
       style="fill:#fedc54;stroke:#be5f07;stroke-width:3" />
    <path
       d="M 82.578,40.163 C 92.46,55.51 98.871,57.223 103.322,63.776 105.316,66.71 103.12,62.814 70.618,75.133 73.746,74.66 58.343,51.821 58.203,49.419 72.391,48.712 82.625,32.965 82.578,40.162 Z M 65.786,78.617 C 50.44,88.5 48.726,94.91 42.174,99.36 c -2.935,1.995 0.96,-0.2 -11.358,-32.703 0.473,3.128 23.312,-12.275 25.714,-12.415 0.707,14.188 16.453,24.422 9.256,24.375 z"
       id="path2178"
       inkscape:connector-curvature="0"
       style="fill:#fcb81b;stroke:#be5f07;stroke-width:3" />
    <path
       d="M 27.332,62.54 C 17.452,47.192 11.04,45.48 6.588,38.926 4.594,35.991 6.79,39.888 39.292,27.569 36.165,28.041 51.567,50.881 51.708,53.282 37.518,53.989 27.285,69.736 27.332,62.538 Z"
       id="path2180"
       inkscape:connector-curvature="0"
       style="fill:#fedc54;stroke:#be5f07;stroke-width:3" />
    <path
       d="m 61.384,51.887 c 0,4.044 -3.118,7.32 -6.965,7.32 -3.847,0 -6.965,-3.276 -6.965,-7.32 0,-4.043 3.118,-7.32 6.964,-7.32 3.846,0 6.964,3.277 6.964,7.32 z"
       id="path2182"
       inkscape:connector-curvature="0"
       style="fill:#fcb81b;stroke:#be5f07;stroke-width:3" />
    <path
       d="m 38.308,40.35 c -1.76,-2.545 -3.374,-4.635 -3.586,-4.643 -0.21,-0.008 -5.192,1.747 -11.068,3.9 L 12.97,43.52 10.913,41.405 c -1.13,-1.163 -2.054,-2.24 -2.05,-2.396 0.003,-0.155 2.198,-0.816 4.878,-1.47 5.465,-1.33 13.626,-3.848 19.698,-6.077 2.225,-0.817 4.088,-1.485 4.14,-1.485 0.052,0 0.277,0.603 0.5,1.34 0.38,1.247 4.5,9.07 5.917,11.228 l 0.63,0.96 -1.44,0.737 c -0.794,0.404 -1.495,0.735 -1.56,0.735 -0.064,0 -1.557,-2.082 -3.317,-4.628 z M 70.84,20.544 C 68.534,13.456 66.52,7.522 66.363,7.357 66.207,7.193 61.781,11.823 56.528,17.647 l -9.55,10.59 -1.204,-1.692 c -0.662,-0.93 -1.193,-1.785 -1.18,-1.897 0.012,-0.113 1.418,-1.13 3.124,-2.258 4.66,-3.082 9.702,-7.482 15.004,-13.092 2.618,-2.77 4.878,-5.034 5.024,-5.034 0.146,0 0.552,1.245 0.902,2.768 1.105,4.813 3.363,12.373 5.754,19.264 1.27,3.666 2.312,6.7 2.312,6.74 0,0.04 -0.38,0.146 -0.84,0.234 -0.813,0.155 -0.985,-0.28 -5.034,-12.726 z"
       id="path2184"
       inkscape:connector-curvature="0"
       style="fill:#ffffff" />
    <path
       d="m 55.82,43.05 c -1.118,-0.323 -1.45,-0.604 -1.526,-1.296 -0.097,-0.882 1.147,-2.422 13.33,-16.505 l 3.318,-3.837 1.685,5.086 c 0.926,2.797 1.906,5.525 2.177,6.06 l 0.493,0.977 -3.493,1.753 c -2.908,1.46 -7.48,4.018 -13.483,7.543 -0.91,0.536 -1.284,0.568 -2.5,0.217 z"
       id="path2186"
       inkscape:connector-curvature="0"
       style="fill:#fcb81b" />
    <path
       d="m 88.993,55.283 -9.145,-9.146 -2.59,3.074 c -1.423,1.692 -2.735,3.075 -2.915,3.075 -0.18,0 -1.62,-0.865 -3.202,-1.923 l -2.872,-1.924 2.08,-1.17 c 1.143,-0.642 3.766,-2.32 5.828,-3.726 2.063,-1.406 3.943,-2.67 4.18,-2.81 0.274,-0.162 1.083,0.72 2.26,2.463 3.354,4.97 6.405,8.5 12.6,14.58 5.805,5.696 6.09,6.038 5.246,6.303 -2.007,0.628 -2.173,0.5 -11.47,-8.795 z"
       id="path2188"
       inkscape:connector-curvature="0"
       style="fill:#ffffff" />
    <path
       d="m 71.644,70.943 c -0.4,-0.934 -0.652,-1.774 -0.558,-1.868 0.093,-0.093 0.63,-0.01 1.192,0.188 0.965,0.336 1.5,0.006 9.49,-5.852 4.656,-3.413 8.573,-6.207 8.703,-6.207 0.132,0 1.616,1.337 3.298,2.97 1.682,1.634 3.45,3.238 3.93,3.564 0.48,0.326 0.8,0.65 0.715,0.72 -0.087,0.07 -2.222,0.663 -4.745,1.32 -2.523,0.655 -8.068,2.377 -12.322,3.826 -4.253,1.45 -8.012,2.725 -8.354,2.836 -0.477,0.154 -0.788,-0.19 -1.348,-1.497 z M 41.802,96.224 c -1.456,-6.546 -4.728,-17.398 -7.47,-24.77 -0.997,-2.683 -1.086,-3.168 -0.615,-3.35 0.303,-0.115 0.663,-0.084 0.8,0.07 0.138,0.153 1.964,5.422 4.06,11.707 2.094,6.287 3.947,11.652 4.115,11.924 0.39,0.63 -0.424,1.238 11.418,-8.53 5.358,-4.42 9.867,-8.082 10.02,-8.138 0.152,-0.056 0.532,0.29 0.846,0.767 0.557,0.85 0.536,0.89 -0.933,1.85 -5.1,3.336 -10,7.49 -15.012,12.73 -2.98,3.116 -5.775,5.904 -6.213,6.196 -0.752,0.5 -0.808,0.475 -1.015,-0.456 z"
       id="path2190"
       inkscape:connector-curvature="0"
       style="fill:#fedc54" />
  </g>
</svg>
