<?xml version="1.0" encoding="UTF-8" standalone="no"?>
<svg
   xmlns:dc="http://purl.org/dc/elements/1.1/"
   xmlns:cc="http://creativecommons.org/ns#"
   xmlns:rdf="http://www.w3.org/1999/02/22-rdf-syntax-ns#"
   xmlns:svg="http://www.w3.org/2000/svg"
   xmlns="http://www.w3.org/2000/svg"
   xmlns:sodipodi="http://sodipodi.sourceforge.net/DTD/sodipodi-0.dtd"
   xmlns:inkscape="http://www.inkscape.org/namespaces/inkscape"
   width="26.338469"
   height="39.728779"
   version="1.1"
   id="svg106"
   sodipodi:docname="trophee_platine.svg"
   inkscape:version="0.92.4 (5da689c313, 2019-01-14)">
  <metadata
     id="metadata112">
    <rdf:RDF>
      <cc:Work
         rdf:about="">
        <dc:format>image/svg+xml</dc:format>
        <dc:type
           rdf:resource="http://purl.org/dc/dcmitype/StillImage" />
        <dc:title></dc:title>
      </cc:Work>
    </rdf:RDF>
  </metadata>
  <defs
     id="defs110" />
  <sodipodi:namedview
     pagecolor="#ffffff"
     bordercolor="#666666"
     borderopacity="1"
     objecttolerance="10"
     gridtolerance="10"
     guidetolerance="10"
     inkscape:pageopacity="0"
     inkscape:pageshadow="2"
     inkscape:window-width="1920"
     inkscape:window-height="1017"
     id="namedview108"
     showgrid="false"
     inkscape:zoom="0.91067095"
     inkscape:cx="392.90257"
     inkscape:cy="-193.73922"
     inkscape:window-x="-8"
     inkscape:window-y="-8"
     inkscape:window-maximized="1"
     inkscape:current-layer="svg106"
     fit-margin-top="0"
     fit-margin-left="0"
     fit-margin-right="0"
     fit-margin-bottom="0" />
  <path
     d="m 2.5802654,25.512957 -2.14249998,13.83925 24.90999958,-0.08925 -2.1425,-13.75 z"
     id="path62"
     style="fill:#b4b4b4;fill-opacity:1;stroke:#8c8c8c;stroke-width:0.75;stroke-opacity:1"
     inkscape:connector-curvature="0" />
  <path
     d="m 8.1160154,25.512957 -3.393,13.57125"
     id="path64"
     style="fill:#8c8c8c;fill-opacity:1;stroke:#8c8c8c;stroke-width:0.75;stroke-opacity:1"
     inkscape:connector-curvature="0" />
  <path
     d="m 15.473265,30.975457 4.9875,1.2625 v -1.19925 z"
     id="path66"
     style="fill:#8c8c8c;fill-opacity:1;stroke:#8c8c8c;stroke-width:0.25;stroke-opacity:1"
     inkscape:connector-curvature="0" />
  <path
     d="m 21.221515,38.267207 c 0.165,-0.525 0.1325,-2.8075 -0.0525,-3.655 -0.4745,-2.18 -1.32925,-3.75825 -2.63,-4.8555 -1.6175,-1.365 -2.82075,-1.91325 -7.31825,-3.335 l -1.6917496,-0.535 6.6289996,-0.02125 c 3.64575,-0.012 6.644,-0.007 6.6625,0.01075 0.05,0.04875 2.046,12.53375 2.009,12.5665 -0.0175,0.015 -0.8595,0.055 -1.871,0.0885 l -1.839,0.06075 0.10175,-0.3245 z"
     id="path68"
     style="fill:#dcdcdc;fill-opacity:1;stroke-width:0.25"
     inkscape:connector-curvature="0" />
  <path
     d="m 2.4017654,36.048707 c -0.99625,0.1125 -2.05999998,1.674 -0.62,2.0385 1.124,0.194 0.996,-1.08075 0.8205,-1.76675 0.49,-5e-4 1.383,0.069 1.504,-0.78125 0.519,-1.162 -1.2075,-1.855 -1.5285,-0.5625 -0.146,0.32825 -0.2815,0.7125 -0.176,1.072 z"
     id="path70"
     style="fill:#8c8c8c;fill-opacity:1;stroke:#8c8c8c;stroke-width:0.25;stroke-opacity:1"
     inkscape:connector-curvature="0" />
  <path
     d="m 2.9372654,32.209207 c 0,0.09875 -0.08,0.17875 -0.1785,0.17875 -0.0985,0 -0.1785,-0.08 -0.1785,-0.1785 0,-0.0985 0.08,-0.17825 0.1785,-0.17825 0.09875,0 0.17875,0.08 0.17875,0.1785 z m -0.2675,-1.473 c 0,0.1725 -0.14,0.3125 -0.3125,0.3125 -0.1725,0 -0.3125,-0.14 -0.3125,-0.3125 0,-0.1725 0.14,-0.3125 0.3125,-0.3125 0.1725,0 0.3125,0.14 0.3125,0.3125 z m 1.1605,-2.5445 c 0,0.2465 -0.22,0.44625 -0.491,0.44625 -0.27125,0 -0.49125,-0.2 -0.49125,-0.4465 0,-0.24675 0.22,-0.4465 0.49125,-0.4465 0.27125,0 0.491,0.2 0.491,0.44625 z m 1.6965,-1.92 c 0,0.1725 -0.18,0.3125 -0.40175,0.3125 -0.22175,0 -0.40175,-0.14 -0.40175,-0.3125 0,-0.1725 0.18,-0.3125 0.402,-0.3125 0.222,0 0.402,0.14 0.402,0.3125 z m 0.71425,1.8305 c 0,0.09875 -0.12,0.17875 -0.268,0.17875 -0.1475,0 -0.2675,-0.08 -0.2675,-0.17875 0,-0.0985 0.12,-0.1785 0.2675,-0.1785 0.148,0 0.268,0.08 0.268,0.1785 z"
     id="path72"
     style="fill:#8c8c8c;fill-opacity:1;stroke:#8c8c8c;stroke-width:0.75;stroke-linejoin:round;stroke-opacity:1"
     inkscape:connector-curvature="0" />
  <path
     d="m 11.748515,28.702707 -0.379,4.4825 c -0.0575,-1.465 -0.8805,-3.0725 -0.066,-4.4495 0.1235,-0.098 0.3085,-0.11875 0.445,-0.033 z"
     id="path74"
     style="fill:#8c8c8c;fill-opacity:1;stroke:#8c8c8c;stroke-width:0.25;stroke-opacity:1"
     inkscape:connector-curvature="0" />
  <path
     d="m 13.447265,28.002457 8.2825,0.39"
     id="path78"
     style="fill:#8c8c8c;fill-opacity:1;stroke:#8c8c8c;stroke-width:0.36475;stroke-opacity:1"
     inkscape:connector-curvature="0" />
  <path
     sodipodi:nodetypes="ccccc"
     inkscape:connector-curvature="0"
     style="fill:#dcdcdc;fill-opacity:1;stroke:#8c8c8c;stroke-width:0.75;stroke-opacity:1"
     id="path88"
     d="m 11.062265,5.6917069 c 3.837,-2.4705 4.265,-4.07325 5.9035,-5.18599999 0.73375,-0.4985 -0.24,0.0505 2.83925,8.17599999 -0.118,-0.782 -5.8275,3.0687501 -6.42825,3.1037501 -0.800812,-3.2249041 -3.208071,-5.6325521 -2.3145,-6.0937501 z" />
  <path
     inkscape:connector-curvature="0"
     style="fill:#b4b4b4;fill-opacity:1;stroke:#8c8c8c;stroke-width:0.75;stroke-opacity:1"
     id="path90"
     d="m 20.646765,10.037457 c 2.4705,3.83675 4.07325,4.265 5.186,5.90325 0.4985,0.7335 -0.0505,-0.2405 -8.176,2.83925 0.782,-0.11825 -3.06875,-5.828 -3.10375,-6.4285 3.547,-0.17675 6.1055,-4.1135001 6.09375,-2.31425 z m -4.198,9.6135 c -3.8365,2.47075 -4.265,4.07325 -5.903,5.18575 -0.7337496,0.49875 0.24,-0.05 -2.8394996,-8.17575 0.11825,0.782 5.8279996,-3.06875 6.4284996,-3.10375 0.17675,3.547 4.11325,6.1055 2.314,6.09375 z" />
  <path
     sodipodi:nodetypes="ccccc"
     inkscape:connector-curvature="0"
     style="fill:#b4b4b4;fill-opacity:1;stroke:#8c8c8c;stroke-width:0.75;stroke-opacity:1"
     id="path92"
     d="m 6.9659584,15.814677 c -2.47,-3.837 -4.203693,-4.44797 -5.316693,-6.0864701 -0.4985,-0.73375 0.0505,0.2405 8.176,-2.83925 -0.78175,0.118 3.0687496,5.8280001 3.1039996,6.4282501 -3.5474996,0.17675 -5.9633066,2.49747 -5.9633066,2.49747 z" />
  <path
     inkscape:connector-curvature="0"
     style="fill:#999999;fill-opacity:1;stroke:#8c8c8c;stroke-width:0.75;stroke-opacity:1"
     id="path94"
     d="m 15.348265,12.968457 c 0,1.011 -0.7795,1.83 -1.74125,1.83 -0.96175,0 -1.74125,-0.819 -1.74125,-1.83 0,-1.01075 0.7795,-1.83 1.741,-1.83 0.9615,0 1.741,0.81925 1.741,1.83 z" />
  <path
     inkscape:connector-curvature="0"
     style="fill:#b4b4b4;fill-opacity:1;stroke-width:0.25"
     id="path98"
     d="m 13.957265,10.759207 c -0.2795,-0.08075 -0.3625,-0.151 -0.3815,-0.324 -0.02425,-0.2205 0.28675,-0.6055001 3.3325,-4.1262501 l 0.8295,-0.95925 0.42125,1.2715 c 0.2315,0.69925 0.4765,1.38125 0.54425,1.515 l 0.12325,0.24425 -0.87325,0.43825 c -0.727,0.365 -1.87,1.0045 -3.37075,1.8857501 -0.2275,0.134 -0.321,0.142 -0.625,0.05425 z" />
  <g
     id="g859"
     transform="matrix(0.25,0,0,0.25,0.00226542,-0.00329309)">
    <path
       style="fill:#ffffff;fill-opacity:1;stroke:none;stroke-opacity:1"
       id="path76"
       d="m 51.115,114.805 -1.515,17.93 c -0.23,-5.86 -3.522,-12.29 -0.264,-17.798 0.494,-0.392 1.234,-0.474 1.78,-0.132 z"
       inkscape:connector-curvature="0" />
    <path
       style="fill:#ffffff;fill-opacity:1;stroke:none;stroke-opacity:1"
       id="path80"
       d="m 85.118,128.46 -35.355,-1.514 -0.253,2.525 39.396,4.294 z"
       inkscape:connector-curvature="0" />
    <g
       style="fill:#ffffff;fill-opacity:1;stroke:none;stroke-opacity:1"
       id="g86">
      <path
         style="fill:#ffffff;fill-opacity:1;stroke:none;stroke-opacity:1"
         id="path82"
         d="m 90.926,141.088 c -0.04,5.457 -3.915,15.19 6.015,13.425 8.076,-3.98 -1.356,-9.118 -4.683,-12.38 l -0.636,-0.585 -0.694,-0.46 z m -5.304,8.839 c -5.158,2.38 3.74,5.04 0,0 z m -3.03,-9.597 c -1.65,4.192 6.764,1.477 0,0 z m 2.273,-4.04 c -2.007,6.33 10.647,1.072 3.254,0.45 -0.948,0.556 -2.9,1.125 -3.255,-0.45 z M 88.4,125.936 c -6.307,1.35 -0.434,8.963 0.575,1.933 l -0.142,-1.008 -0.433,-0.926 z m 8.334,4.798 c -4.945,-2.98 -3.097,7.5 -1.154,0.68 l 0.43,-0.547 z m -4.798,-9.091 c -2.408,6.64 9.797,-0.313 1.297,-0.222 l -1.297,0.223 z m -8.081,-4.799 c -0.61,5.958 10.88,1.494 2.97,0.005 -0.99,-0.058 -1.98,0.03 -2.97,-0.006 z m -11.87,-8.838 c -0.733,5.338 7.923,-0.446 0.87,0.156 z m 8.839,-2.526 c -5.835,7.06 11.33,11.084 8.083,1.82 -1.62,-2.678 -5.45,-2.696 -8.083,-1.82 z"
         inkscape:connector-curvature="0" />
      <path
         style="fill:#ffffff;fill-opacity:1;stroke:none;stroke-opacity:1"
         id="path84"
         d="m 89.916,107.248 c -4.825,4.275 8.46,6.267 2.367,1.226 l -1.142,-0.694 -1.224,-0.532 z"
         inkscape:connector-curvature="0" />
    </g>
    <path
       d="m 38.308,40.35 c -1.76,-2.545 -3.374,-4.635 -3.586,-4.643 -0.21,-0.008 -5.192,1.747 -11.068,3.9 L 12.97,43.52 10.913,41.405 c -1.13,-1.163 -2.054,-2.24 -2.05,-2.396 0.003,-0.155 2.198,-0.816 4.878,-1.47 5.465,-1.33 13.626,-3.848 19.698,-6.077 2.225,-0.817 4.088,-1.485 4.14,-1.485 0.052,0 0.277,0.603 0.5,1.34 0.38,1.247 4.5,9.07 5.917,11.228 l 0.63,0.96 -1.44,0.737 c -0.794,0.404 -1.495,0.735 -1.56,0.735 -0.064,0 -1.557,-2.082 -3.317,-4.628 z M 70.84,20.544 C 68.534,13.456 66.52,7.522 66.363,7.357 66.207,7.193 61.781,11.823 56.528,17.647 l -9.55,10.59 -1.204,-1.692 c -0.662,-0.93 -1.193,-1.785 -1.18,-1.897 0.012,-0.113 1.418,-1.13 3.124,-2.258 4.66,-3.082 9.702,-7.482 15.004,-13.092 2.618,-2.77 4.878,-5.034 5.024,-5.034 0.146,0 0.552,1.245 0.902,2.768 1.105,4.813 3.363,12.373 5.754,19.264 1.27,3.666 2.312,6.7 2.312,6.74 0,0.04 -0.38,0.146 -0.84,0.234 -0.813,0.155 -0.985,-0.28 -5.034,-12.726 z"
       id="path96"
       style="fill:#ffffff;fill-opacity:1;stroke:none"
       inkscape:connector-curvature="0" />
    <path
       d="m 88.993,55.283 -9.145,-9.146 -2.59,3.074 c -1.423,1.692 -2.735,3.075 -2.915,3.075 -0.18,0 -1.62,-0.865 -3.202,-1.923 l -2.872,-1.924 2.08,-1.17 c 1.143,-0.642 3.766,-2.32 5.828,-3.726 2.063,-1.406 3.943,-2.67 4.18,-2.81 0.274,-0.162 1.083,0.72 2.26,2.463 3.354,4.97 6.405,8.5 12.6,14.58 5.805,5.696 6.09,6.038 5.246,6.303 -2.007,0.628 -2.173,0.5 -11.47,-8.795 z"
       id="path100"
       style="fill:#ffffff;fill-opacity:1;stroke:none"
       inkscape:connector-curvature="0" />
  </g>
  <path
     inkscape:connector-curvature="0"
     style="fill:#dcdcdc;fill-opacity:1;stroke-width:0.25"
     id="path102"
     d="m 17.913265,17.732457 c -0.1,-0.2335 -0.163,-0.4435 -0.1395,-0.467 0.02325,-0.02325 0.1575,-0.0025 0.298,0.047 0.24125,0.084 0.375,0.0015 2.3725,-1.463 1.164,-0.85325 2.14325,-1.55175 2.17575,-1.55175 0.033,0 0.404,0.33425 0.8245,0.7425 0.4205,0.4085 0.8625,0.8095 0.9825,0.891 0.12,0.0815 0.2,0.1625 0.17875,0.18 -0.02175,0.0175 -0.5555,0.16575 -1.18625,0.33 -0.63075,0.16375 -2.017,0.59425 -3.0805,0.9565 -1.06325,0.3625 -2.003,0.68125 -2.0885,0.709 -0.11925,0.0385 -0.197,-0.0475 -0.337,-0.37425 z m -7.4605,6.32025 c -0.364,-1.6365 -1.1819996,-4.3495 -1.8674996,-6.1925 -0.24925,-0.67075 -0.2715,-0.792 -0.15375,-0.8375 0.07575,-0.02875 0.16575,-0.021 0.2,0.0175 0.0345,0.03825 0.491,1.3555 1.015,2.92675 0.5234996,1.57175 0.9867496,2.913 1.0287496,2.981 0.0975,0.1575 -0.106,0.3095 2.8545,-2.1325 1.3395,-1.105 2.46675,-2.0205 2.505,-2.0345 0.038,-0.014 0.133,0.0725 0.2115,0.19175 0.13925,0.2125 0.134,0.2225 -0.23325,0.4625 -1.275,0.834 -2.5,1.8725 -3.753,3.1825 -0.745,0.779 -1.44375,1.476 -1.55325,1.549 -0.188,0.125 -0.202,0.11875 -0.25375,-0.114 z" />
</svg>
